##TITLE=Analysis number 321130
Compound Code cc 54822
Book Reference 486/38
Project Code adrs
Chemist Name simons
##JCAMPDX= 6.0         $$ Bruker NMR JCAMP-DX V2.0
##DATA TYPE= NMR SPECTRUM
##DATA CLASS= NTUPLES
##ORIGIN= Bruker BioSpin GmbH
##OWNER= nmr
$$ XWIN-NMR		Version 3.5
$$ Tue Jul 25 18:21:46 2006 GMT Daylight Time (UT+1h)  MAYBRIDGE\nmr@NMR_250MHZ
##.OBSERVE FREQUENCY= 250.131544655141
##.OBSERVE NUCLEUS= ^1H
##.ACQUISITION MODE= SIMULTANEOUS (DQD)
##.ACQUISITION SCHEME= undefined
##.AVERAGES= 16
##.DIGITISER RES= 18
##SPECTROMETER/DATA SYSTEM= dpx250
##.PULSE SEQUENCE= zg30
##.SOLVENT NAME= CDCl3
##.SHIFT REFERENCE= (INTERNAL, CDCl3, 0, 16.522)
##AUDIT TRAIL= $$ (NUMBER, WHEN, WHO, WHERE, WHAT)
$$ ##TITLE= Audit trail, XWIN-NMR		Version 3.5
$$ ##JCAMPDX= 5.01
$$ ##ORIGIN= Bruker BioSpin GmbH
$$ ##OWNER= nmr
$$ C:\u/data/dgb/nmr/ADRS/3540/pdata/1/auditp.txt
$$ ##AUDIT TRAIL=  $$ (NUMBER, WHEN, WHO, WHERE, WHAT)
(   1,<2006-07-25 18:21:13.09 +100>,<MAYBRIDGE\nmr>,<NMR_250MHZ>,
      <created by zg, POWCHK disabled, PULCHK disabled
       configuration hash MD5:
       E2 DF 36 D8 04 B2 41 60 5A D7 A3 38 5A 4B D0 FE
       data hash MD5: 64K
       75 11 58 A1 5A 54 5F CD D7 C0 2D 90 63 87 56 86>)
(   2,<2006-07-25 18:21:26.57 +100>,<MAYBRIDGE\nmr>,<NMR_250MHZ>,
      <Start of raw data processing
       ef LB = 0.3 FT_mod = 6 PKNL = 1 SI = 32K 
       data hash MD5: 32K
       08 F0 82 15 DA E6 1C 65 0D 15 98 33 D3 2F D9 BB>)
(   3,<2006-07-25 18:21:28.15 +100>,<MAYBRIDGE\nmr>,<NMR_250MHZ>,
      <apk 
       data hash MD5: 32K
       DC 1C 49 BC 5B 77 E3 8E 1E 90 23 38 A7 5E 9E 99>)
(   4,<2006-07-25 18:21:29.04 +100>,<MAYBRIDGE\nmr>,<NMR_250MHZ>,
      <abs ABSG = 5 
       data hash MD5: 32K
       0E F7 7B 2A 81 0C 21 80 A5 5B 34 20 93 41 D7 E8>)
$$ ##END=
$$ 
$$ hash MD5
$$ 64 BD 10 B3 CF C0 B1 36 46 73 31 1F 8C 1F 9B 1E
##$RELAX= 
##$RELAX= 
##$RELAX= 
##$RELAX= 
##$RELAX= 
##$RELAX= 
##$RELAX= 
$$ Bruker specific parameters
$$ --------------------------
##$DU= <C:\u>
##$EXPNO= 3540
##$NAME= <ADRS>
##$PROCNO= 1
##$TYPE= <nmr>
##$USER= <dgb>
##$AMP= (0..31)
100 100 100 100 100 100 100 100 100 100 100 100 100 100 100 100 100 100 
100 100 100 100 100 100 100 100 100 100 100 100 100 100 
##$AQSEQ= 0
##$AQ_mod= 3
##$AUNM= <au_zg>
##$AUTOPOS= <7 >
##$BF1= 250.13
##$BF2= 250.13
##$BF3= 250.13
##$BF4= 250.13
##$BF5= 500.13
##$BF6= 500.13
##$BF7= 500.13
##$BF8= 500.13
##$BYTORDA= 1
##$CFDGTYP= 0
##$CFRGTYP= 5
##$CHEMSTR= <none>
##$CNST= (0..31)
1 1 145 1 1 1 1 1 1 1 1 1 1 1 1 1 1 1 1 1 1 1 1 1 1 1 1 1 1 1 1 1 
##$CPDPRG= <>
##$CPDPRG1= <>
##$CPDPRG2= <>
##$CPDPRG3= <>
##$CPDPRG4= <mlev>
##$CPDPRG5= <mlev>
##$CPDPRG6= <mlev>
##$CPDPRG7= <mlev>
##$CPDPRG8= <mlev>
##$CPDPRGB= <>
##$CPDPRGT= <>
##$D= (0..31)
0 1 0 0 0 0 0 0 0 0.06 0 0 0 0 0 0 0.0002 0 0 0 0 0 0 0 0 0 0 0 0 0 0 
0 
##$DATE= 1153848071
##$DBL= (0..7)
120 120 120 120 120 120 120 120 
##$DBP= (0..7)
150 150 150 150 150 150 150 150 
##$DBP07= 0
##$DBPNAM0= <>
##$DBPNAM1= <>
$$ [...]
##$SUBNAM7= <"">
##$SUBNAM8= <"">
##$SUBNAM9= <"">
##$SW= 20.6930455092707
##$SWIBOX= (0..15)
0 0 3 0 0 0 0 0 0 0 0 0 0 0 0 0 
##$SW_h= 5175.983436853
##$TD= 65536
##$TD0= 1
##$TE= 295.16
##$TE2= 300
##$TE3= 300
##$TEG= 300
##$TL= (0..7)
0 120 120 120 120 120 120 120 
##$TP= (0..7)
150 150 150 150 150 150 150 150 
##$TP07= 0
##$TPNAME0= <>
##$TPNAME1= <>
##$TPNAME2= <>
##$TPNAME3= <>
##$TPNAME4= <>
##$TPNAME5= <>
##$TPNAME6= <>
##$TPNAME7= <>
##$TPOAL= (0..7)
0.5 0.5 0.5 0.5 0.5 0.5 0.5 0.5 
##$TPOFFS= (0..7)
0 0 0 0 0 0 0 0 
##$TUNHIN= 0
##$TUNHOUT= 0
##$TUNXOUT= 0
##$USERA1= <user>
##$USERA2= <user>
##$USERA3= <user>
##$USERA4= <user>
##$USERA5= <user>
##$V9= 5
##$VALIST= <valist>
##$VCLIST= <CCCCCCCCCCCCCCC>
##$VD= 0
##$VDLIST= <DDDDDDDDDDDDDDD>
##$VPLIST= <PPPPPPPPPPPPPPP>
##$VTLIST= <TTTTTTTTTTTTTTT>
##$WBST= 1024
##$WBSW= 4
##$XGAIN= (0..3)
0 0 0 0 
##$XL= 0
##$YL= 0
##$YMAX_a= 150422
##$YMIN_a= -264542
##$ZGOPTNS= <>
##$ZL1= 120
##$ZL2= 120
##$ZL3= 120
##$ZL4= 120
##$ABSF1= 16.522
##$ABSF2= -4.171173
##$ABSG= 5
##$ABSL= 3
##$ALPHA= 0
##$AQORDER= 0
##$ASSFAC= 0
##$ASSFACI= 0
##$ASSFACX= 0
##$ASSWID= 0
##$AUNMP= <proc_1d>
##$AZFE= 0.1
##$AZFW= 0.1
##$BCFW= 0
##$BC_mod= 0
##$BYTORDP= 0
##$COROFFS= 0
##$CY= 12.5
##$DATMOD= 1
##$DC= 0
##$DFILT= <>
##$DTYPP= 0
##$F1P= 14.0000005364418
##$F2P= -0.99999901652339
##$FCOR= 0.5
##$FTSIZE= 32768
##$FT_mod= 6
##$GAMMA= 0
##$GB= 0
##$INTBC= 1
##$INTSCL= 1
##$ISEN= 128
##$LB= 0.3
##$LEV0= 0
##$LPBIN= 0
##$MAXI= 10000
##$MC2= 0
##$MEAN= 0
##$ME_mod= 0
##$MI= 0
##$NCOEF= 0
##$NC_proc= -4
##$NLEV= 6
##$NOISF1= 0
##$NOISF2= 0
##$NSP= 0
##$NTH_PI= 0
##$NZP= 0
##$OFFSET= 16.522
##$PC= 1
##$PHC0= 170.3369
##$PHC1= 4.429219
##$PH_mod= 1
##$PKNL= yes
##$PPARMOD= 0
##$PSCAL= 4
##$PSIGN= 0
##$REVERSE= no
##$SF= 250.13
##$SI= 32768
##$SIGF1= 0
##$SIGF2= 0
##$SINO= 400
##$SIOLD= 32768
##$SREGLST= <1H.CDCl3>
##$SSB= 0
##$STSI= 32768
##$STSR= 0
##$SW_p= 5175.98343685301
##$SYMM= 0
##$S_DEV= 0
##$TDeff= 65536
##$TDoff= 0
##$TI= <Analysis number 999999
Compound Code 99
Book Reference 9
Project Code 9>
##$TILT= no
##$TM1= 0
##$TM2= 0
##$TOPLEV= 0
##$USERP1= <user>
##$USERP2= <user>
##$USERP3= <user>
##$USERP4= <user>
##$USERP5= <user>
##$WDW= 1
##$XDIM= 32768
##$YMAX_p= 264806960
##$YMIN_p= -673050
$$ End of Bruker specific parameters
$$ ---------------------------------
##NTUPLES= NMR SPECTRUM
##VAR_NAME=  FREQUENCY,     SPECTRUM/REAL,   SPECTRUM/IMAG
##SYMBOL=    X,             R,               I
##VAR_TYPE=  INDEPENDENT,   DEPENDENT,       DEPENDENT
##VAR_FORM=  AFFN,          ASDF,            ASDF
##VAR_DIM=   32768,         32768,           32768
##UNITS=     HZ,            ARBITRARY UNITS, ARBITRARY UNITS
##FACTOR=    0.157963299565203, 1,           1
##FIRST=     4132.6476996994, 0,             0
##LAST=      -1043.33573715361, 0,           0
##MIN=       -1043.33573715361, -673050,     0
##MAX=       4132.6476996994, 264806960,     0
$$ Real data points
##PAGE= N=1
##DATA TABLE= (X++(R..R)), XYDATA
$$ [...]
18094A2605246o89651m81965m37357l00006m65750l48522n91143l15955k84552
18085H690345l31858l18033k33261k36161k61860q5270j69628l34790k26566k54733
18075F238185k51851j17123r4037m9857J33431N2538R6151j19914k32254m8108
18065E607161l21516k94373k00744j1887j12736k05404j37059j53752k17180k6466
18055C926044N3787l0455j61860q7242k28519j29546J10106p1372K0084j06843
18045C294184k02178j65912p7551P569P6210j51546j76164l1368J45157l8467
18035B679934j57242k5652m3044l2750J36755j79592j56475n317O9500r6713m0073
18024B149331r7894m4601l4256O7654J5270j41628j61118L0214p714j56323p7072
$$ plain form
18094 12605246 11915595 11433630 10996273 10696267 10230517 9881995 9290852 8974897 8690345
18085 8690345 8358487 8040454 7807193 7571032 7309172 7223902 7054274 6719484 6492918 6238185
18075 6238185 5986334 5869211 5775174 5725317 5858748 5911286 6007437 5887523 5655269 5607161
18065 5607161 5285645 4991272 4790528 4778641 4665905 4460501 4323442 4169690 3952510 3926044
18055 3926044 3979831 3949376 3787516 3700274 3471755 3342209 3452315 3380943 3401027 3294184
18045 3294184 3092006 2926094 2848543 2856112 2932322 2780776 2604612 2573244 2718401 2679934
18035 2679934 2522692 2497040 2453996 2421246 2558001 2378409 2221934 2216617 2286117 2189404 2149331
18024 2149331 2051437 2006836 1972580 2040234 2055504 1913876 1752758 1782972 1775258 1618935 1541863
18013A541863L6318L7243J50278J76444p242k27112j36544k40848R6088J06695
18003A533183J33389L2913J0859M3324K06470Q5574Q3643k24839q9576R3932p6874
17992A831998Q1736K30235k2812j91405j15733R0364J67084K1055J57135J79268
17982B428925m752J63061P5714N3445K65878L47889N85221J189572J483451K235513
17972H823917L561260L744607K599760J193624J236057K324364K835722j204442
17964B5114869o595813n295725k983783j635432r12921m19466l85624m20644j05090
17955F360371j9793J62609L88326O56077P54523J452573K441770L440324L408832
17946A9045612K028720J241949K024451K975147K971749j527437l532477r76668
$$ plain form
18013 1541863 1578181 1615424 1765702 1942146 1934904 1707792 1571248 1330400 1426488 1533183
18003 1533183 1666572 1699485 1710344 1753668 1960138 2045712 2129355 1904516 1814940 1908872 1831998
17992 1831998 1913734 2143969 2121157 1929752 1814019 1904383 2071467 2092522 2249657 2428925
17982 2428925 2424173 2587234 2662948 2716393 2982271 3330160 3915381 5104953 6588404 8823917
17972 8823917 12385177 16129784 18729544 19923168 21159225 23483589 26319311 25114869
17964 25114869 18519056 13223331 10239548 8604116 7691195 7271729 6886105 6465461 6360371
17955 6360371 6340578 6503187 6891513 7547590 8302113 9754686 12196456 15636780 19045612
17946 19045612 21074332 22316281 24340732 27315879 30287628 28760191 25227714 24251046
17938B4251046j31153l14363K81198J256730J563664j567326n940347m946181
17930A4453268k928007j462003r09479p19811n29252l68602j85516J6798q0860
17921G286536J54253L27060O89896J330227K194498K886890K841864J401313M66821
17912A9579358J034014K102107J589848l104120o012634l977396k339921j310992
17904G560264p74518o39406m44234l46583k08599r2373m5981k07489k61417l2602
17894D507062n5788j50420j00414n6309j00498q1190k07167j46596j64489m2753
17884C401438N0000r9345r0129j57533j63757j22280j18389r4326n075l0609k05232
17873B364763k77816p7496m6114N5232J01144p7578j54134q19R2588P5178j17122
$$ plain form
17938 24251046 24119893 23805530 24086728 25343458 26907122 25339796 19399449 14453268
17930 14453268 11525261 10063258 9153779 8433968 7904716 7536114 7350598 7367396 7286536
17921 7286536 7440789 7767849 8457745 9787972 11982470 14869360 17711224 19112537 19579358
17912 19579358 20613372 22715479 24305327 21201207 15188573 11211177 8871256 7560264
17904 7560264 6785746 6146340 5702106 5355523 5146924 5054551 5008570 4801081 4539664 4507062
17894 4507062 4451274 4300854 4200440 4144131 4043633 3962443 3755276 3608680 3444191 3401438
17884 3401438 3451438 3352093 3261964 3104431 2940674 2818394 2700005 2605679 2600604 2569995 2364763
17873 2364763 2086947 2009451 1963337 2018569 2119713 2042135 1888001 1887182 1979770 2054948 1937826
17862A937826l0183o304q6528j68622k339Q8301l4189j66845o7398K5165l6061
17851A452823q1886J15929J02529M5312J4978k7298r9775j15071J5852j99415
17841A223978j5331Q259j43279J7160j45087l7445O4673J77559L81987J04290
17831A636764k06791j29985k46106j28791n0922J8458L6824O9918Q7890o83q8334
17820I98242J1433n0483j4078J43949N0222q4876k40230j77227J09694M8792Q836
17809H04274O2248j34665p8357L9383M8260q8537L914J70759l3049j15863k30887
17798D47480O0853N8868Q441j18689M593N5902k3885K4826K20374J13223R0116
17787I42102l8840J17282j48729j99663p7229j01680K10K06682N3727L1396l0972
$$ plain form
17862 1937826 1907643 1901339 1814811 1646189 1643850 1732151 1697962 1531117 1463719 1488884 1452823
17851 1452823 1370937 1486866 1589395 1634707 1649685 1622387 1522612 1407541 1423393 1223978
17841 1223978 1208647 1216906 1073627 1090787 945700 908255 972928 1150487 1532474 1636764
17831 1636764 1429973 1299988 1053882 925091 874169 892627 929451 999369 1087259 1086576 998242
17820 998242 1009675 959192 945114 1089063 1139285 1054409 814179 636952 746646 795438 804274
17809 804274 866522 731857 653500 692883 741143 652606 656520 827279 794230 678367 447480
17798 447480 508333 567201 575642 456953 461546 517448 493563 518389 738763 851986 942102
17787 942102 903262 1020544 871815 672152 594923 493243 493453 700135 753862 785258 754286
17776G54286j66584n0443K2593J09158m1459k100J1756o0883r794r1480l9850
17765D35200O7757R2776q591k09035k0754L4191p062J06212K8486L4436j01242
17754D52374j98709k4869r5186R6126Q6502r6729k93059M6926J67732Q0160O997
17743B28265m1087P629J34324J84971K07075j34542j25466L894j00935Q7236N3026
17732E04390j37682J10990J7675j53590k5813L8953n3763P5339q7760q0835J07372
17721C15276L9717j37798l7736j3851K1048J87848J08173m7154k33417j19222
17711H2884o8784r2799J69195K36089P6704l0218j65130l939k59284r7851J20322
17700c2811n2100J20833k3577N2069J50530j46068J59492J72586j63354k8903
$$ plain form
17776 754286 587702 537259 559852 669010 627551 625451 637207 576324 566530 475050 435200
17765 435200 502957 595733 587142 378107 357353 391544 384482 490694 519180 553616 452374
17754 452374 253665 228796 133610 229736 316238 219509 -73550 -26624 141108 221268 228265
17743 228265 187178 194807 329131 514102 721177 586635 461169 465063 364128 451364 504390
17732 504390 366708 477698 495373 341783 315970 354923 301160 376499 288739 207904 315276
17721 315276 354993 217195 179459 165608 186656 374504 482677 435523 202106 82884
17711 82884 14100 -78699 90496 326585 403289 373071 207941 204002 -55282 -153133 -32811
17700 -32811 -84911 35922 12345 64414 214944 68876 228368 400954 237600 208697
17690B08697J40614l2891j19756Q2923M5793j34194p4623J65225J11825q5805
17680C07808N7251R3365J03066P9622j53930j36044o0220j14548q8850j06288
17670a8768J38255O4358r2832q0372k0060N5000J23661r6082Q0506o2488O0479
17659A51657q6984L5187P0866p5722Q359J17482p0381j4325k7967n974J6001k9231
17647H8968k4813j1178l7564n1745J38664R5544p6601K776L0923K22749j5269
17636C62454j75095j01996r186K8526l2352P1911j38104p0075J35041K7784N9904
17625A58812p6470q6788K2597k0979j700J35432N4325M7554j5841o945j9960J22889
17613C12926J81503p3500j05837o0370l88O7257j43690q3654J6880O9408J23107
$$ plain form
17690 208697 349311 316420 196664 279587 325380 191186 116563 281788 393613 307808
17680 307808 365059 458424 561490 641112 487182 351138 290918 176370 87520 -18768
17670 -18768 119487 183845 91013 10641 -9419 45581 169242 73160 153666 91178 151657
17659 151657 64673 99860 170726 95004 103363 220845 150464 136139 108172 102198 118199 88968
17647 88968 64155 52977 15413 -36332 102332 197876 121275 124051 154974 377723 362454
17636 362454 187359 85363 76177 104703 72351 144262 6158 -63917 71124 98908 158812
17625 158812 82342 -4446 18151 -2828 -4528 130904 185229 232783 216942 209997 190037 312926
17613 312926 494429 420929 315092 254722 254334 321591 177901 94247 111127 180535 303642
17602C03642l9419l4389j82503K5616M9068j10531L2219R8728N2960o1194M2532
17591A76729m9050k35782n0262J50782J50431M2093J78941P5159j57903j11503
17581A69635O4894L2088j44697m8526J17182j11578k73939k29954o5646P6370
17571d14171L2243O5847J90516J97968J50691m0012Q2709J74195j15045j84639
17561A40302J42287n2873j51020o5883J32800K3570p2574m1474O810L2920o0644
17550C4221K4375L7372j13712q2210N0177p2373R2996k69843j13457J39411j8951
17539b91994K9723P8730R5301J47476m666j78540m0359j08896j01294J55163J29256
17528i0100J14515J32228Q767M3118J17770j06937P509R2258L1498k5556J4337
$$ plain form
17602 303642 264223 229834 47331 72947 122015 11484 43703 142431 195391 134197 176729
17591 176729 127679 -108103 -158365 -7583 142848 184941 363882 439041 281138 169635
17581 169635 234529 266617 121920 73394 190576 78998 -194941 -424895 -490541 -414171
17571 -414171 -381928 -316081 -125565 72403 223094 183082 265791 439986 324941 140302
17561 140302 282589 229716 78696 12813 145613 169183 96609 55135 61945 94865 34221
17550 34221 58596 95968 -17744 -99954 -49777 -122150 -29154 -298997 -412454 -273043 -291994
17539 -291994 -262271 -183541 -88240 59236 54570 -123970 -164329 -273225 -374519 -219356 -90100
17528 -90100 24415 156643 165410 208528 326298 219361 226870 319128 350626 325070 339407
17517C39407k2390r1944P1522M0173l3053n1070j17224r3068K3553J34147Q8458
17506B88511j18260l9676j23419j48543j44104q2864r0569o346J01222l1750K542
17495c93256J77959O1460r0269M7840k6558o1242J06850P6559L8671J13042J44946
17484A96002J69186L678j03324Q949q5338n9664j64204o0361J13173k9274O3706
17473E2529L7937j50553r1679J2021o4089j7892J1068J10383J71058j53795j79284
17462b62296k5184R7644L102R2262P7964P4846j9411l8989J8954Q8187j30639
17451b3560k9708J39294M3950K13385L07568J66069k12106j5259P0323J69605
17441H29561j15974k75262p586P2052r1411j08315k50944j8661m3800J18994o4290
$$ plain form
17517 339407 317017 225073 296595 336768 303715 252645 135421 42353 65906 200053 288511
17506 288511 170251 130575 7156 -141387 -285491 -368355 -458924 -465270 -364048 -395798 -393256
17495 -393256 -215297 -153837 -244106 -196266 -222824 -284066 -177216 -100657 -61986 51056 196002
17484 196002 365188 368866 265542 274491 189153 129489 -34715 -95076 18097 -11177 52529
17473 52529 90466 -60087 -151766 -139745 -203834 -221726 -210658 -100275 70783 -83012 -262296
17462 -262296 -287480 -189836 -186734 -94472 -16508 58338 38927 -62 18892 107079 -23560
17451 -23560 -53268 86026 129976 343361 650929 816998 604892 589633 659956 829561
17441 829561 713587 438325 430739 502791 411380 303065 52121 33460 -10340 108654 44364
17430D4364k9091M0290J6756J62900j11249j79193j07182j58339j16702J24819
17420c12627J82188l8298J24201K1095N1964L2143j22245m6733l4722J73128J13331
17409A43425O2099J08907p6611j23133m6347q0422P2998o7726J2873l334K7677
17398C0406O2043J57002m7938j66598p3153M9831M3368J65023J91559j49984N660
17387B67219J58570j6179p0174q7431k86529j81470l3049J07296K1439j11041
17377b31349L676K4398J75245J69058J74359R8722j07775k4723O6038q9092L1444
17366B90001m8299p8842j21822j08046M1272R3924J01219N2715k6995n6878j01254
17355C6995N7411N1840M0845l0051o0298r6538j281J2803J68879N6591j20936
$$ plain form
17430 44364 15273 55563 72319 235219 123970 -55223 -162405 -320744 -437446 -312627
17420 -312627 -130439 -168737 -44536 -23441 28523 60666 -61579 -108312 -143034 30094 143425
17409 143425 205524 314431 237820 114687 68340 -12082 60916 -6810 6063 2729 30406
17398 30406 92449 249451 201513 34915 -38238 11593 54961 219984 411543 261559 267219
17387 267219 425789 409610 339436 252005 -34524 -215994 -249043 -141747 -120308 -231349
17377 -231349 -227673 -203275 -28030 141028 315387 414109 306334 281611 347649 258557 290001
17366 290001 241702 162860 41038 -67008 -25736 68188 169407 222122 195127 138249 36995
17355 36995 94406 146246 187091 157040 96742 204 -1077 11726 180605 237196 116260
17344A16260N3989j04929k09899k3177O4267k1287j65007m7776J70316J18832
17334d8411j51004j6803P4041K00636Q1101m8176m1987o380j3928J42345Q5045
17323B56479j42038j67871J44817M8494p7323J02935P3233j33599j75919k4770
17313i5562J20696q4076m3751L498j05794o0408M1686J09129J63012k0072r7978
17302f9620j421k3653o1765L0780Q004o5918Q9189M7510L0837q2135o9860R4025
17290g4027P0427N1957P5173p6459J691J43022R1315O8872j04803n9676r8477
17279H9015k9963j30651J00542J2612n1639K0854K3960k2478K07071k8530j96203
17268e410J27697l9186q5928O5517K253j8789q3877O0210J88654k0645J103L2792
$$ plain form
17344 116260 170249 65320 -144579 -167756 -103489 -124776 -289783 -337559 -167243 -48411
17334 -48411 -199415 -216218 -142177 58459 139560 91384 49397 43017 29089 171434 256479
17323 256479 114441 -53430 91387 139881 62558 165493 238726 105127 -70792 -95562
17313 -95562 25134 -58942 -102693 -99195 -204989 -265397 -223711 -114582 48430 28358 -69620
17302 -69620 -71041 -94694 -156459 -125679 -117675 -183593 -94404 -46894 -16057 -98192 -168052 -74027
17290 -74027 -3600 48357 123530 47071 48762 191784 283099 351971 247168 187492 89015
17279 89015 59052 -71599 28943 41555 -10084 10770 34730 12252 219323 190793 -5410
17268 -5410 122287 83101 -2827 62690 64943 46154 -37723 22487 211141 190496 191599 224391
17256B24391P759n7075l8582r99Q5763m3694j96671k2258K201l3860j19054k9332
17244b21411R3811J4678J30544K42092M5730O0837o5665j96031J0395r729j54512
17233d9261J71432J26742p3004j08687p2702L2153j12182l3233j6525L1941J07909
17222D583p1025m3091J24422p9629K5688J14274m3040m9264p6710N1603K28724
17211A86535J38841K8338r9525r2285j20005l1221j17138j16326R7433K6291J67556
17200F8494R3419m4065M7823n5036j70293P908n8378J14026K6320l9474L6955
17189B7699M6462M5278r7632j54650K7860l2556J017J16739M0771R8896k05363
17178h5479o8887J59283J72315j46259j73608J41453R2730J58620J06029j51500
$$ plain form
17256 224391 232150 175075 136493 135494 221257 177563 -19108 -41366 -39165 -73025 -192079 -221411
17244 -221411 -127600 -112922 17622 259714 305444 366281 300616 104585 114980 105251 -49261
17233 -49261 122171 248913 175909 67222 -5480 26673 -85509 -118742 -135267 -103326 4583
17222 4583 -66442 -109533 14889 -64740 -39052 75222 32182 -17082 -93792 -42189 186535
17211 186535 325376 353714 254189 161904 41899 10678 -106460 -222786 -125353 -99062 68494
17200 68494 161913 117848 165671 110635 -59658 -51750 -110128 3898 30218 -9256 27699
17189 27699 74161 119439 21807 -132843 -104983 -137539 -136522 -19783 20988 119884 -85479
17178 -85479 -154366 4917 177232 30973 -142635 -1182 91548 250168 356197 204697
17168B04697k24626O663Q7329k9821j75194N778J15193j08418j40893J01115P6982
17157h1195P2812k6752j3466n0401j12782R8766L1329J28665k548r822M356J9297
17145E8259j09097p1773k8732J31782o8737o3759L9512J6327p6404J33392Q3528
17134D4298k3811J51856J01647j82577k42413o2637K964K5461n1154M3121M8537
17123a44708j12682j34032K24176P3758o0552p4381r040M9850O1622K34505M7395
17112A55911j01509J37918R3497j87389j21770O2013l2899Q6653J0682N3203R5600
17101B51910j40651k16319p1102j5378K8238K4857o1506K1510l1249O3936n7332
17090b03086Q268O8027J40741J57393R3907K7101r5765j47664o7416q886j21614
$$ plain form
17168 204697 -19929 -13266 74063 44242 -130952 -125174 -9981 -118399 -259292 -158177 -81195
17157 -81195 -8383 -35135 -48601 -99002 -211784 -113018 -81689 46976 44428 34606 38962 58259
17145 58259 -50838 -122611 -151343 -19561 -88298 -152057 -112545 -96218 -172622 -39230 44298
17134 44298 20487 172343 273990 91413 -151000 -213637 -210673 -185212 -236366 -193245 -144708
17123 -144708 -257390 -391422 -167246 -93488 -154040 -228421 -237461 -187611 -125989 108516 155911
17112 155911 54402 192320 285817 98428 -23342 38671 5772 92425 103107 156310 251910
17101 251910 111259 -105060 -176162 -191540 -163302 -138445 -199951 -178441 -209690 -145754 -203086
17090 -203086 -194818 -126791 13950 171343 265250 292351 196586 48922 -18494 -27380 -148994
17079a48994l9697J3710n5428K13847L16355P1949j09307L9546j25898k25896
17069d9813J30462o4481j63816J16529J90169K03788j62679k16427j19553L0926
17059a04895k1889J0398J2128J7035o4178J3762r080K621P1526Q5274p1531J67881
17047A09052P0987n6484k06783j69754R2099K49340m8773j28762LM6786J75805
17036A33516p3877j54294R4322N2783l1436L8632P8366j17138j59345k2944J56068
17025e347J3569l1619o4660p7490j5441J44810k3781j09316j38682j105J25418
17014a83644M8321K1782o985J51869M1884k16003R3495J49401J48973P0279l1404
17003B87968j4445M6624j72050j14883M9820J3652k27838M1659q4184l7386P4672
$$ plain form
17079 -148994 -188691 -174981 -230409 -16562 299793 371742 262435 301981 176083 -49813
17069 -49813 80649 16168 -147648 -31119 159050 362838 200159 -16268 -135821 -104895
17059 -104895 -126784 -116386 -104258 -87223 -151401 -137639 -146719 -144098 -72572 12702 -58829 109052
17047 109052 180039 123555 -83228 -252982 -160883 88457 39684 -89078 -89075 -42289 133516
17036 133516 59639 -94655 -333 52450 21014 59646 138012 20874 -138471 -161415 -5347
17025 -5347 8222 -23397 -88057 -165547 -180988 -36178 -59959 -169275 -307957 -309062 -183644
17014 -183644 -135323 -113541 -120526 31343 73227 -142776 -49281 100120 249093 319372 287968
17003 287968 273523 320147 148097 33214 83034 96686 -131152 -89493 -173677 -211063 -136391
16992a36391J44200j53922p6814M3527l6352j4530L1033K47587N168Q620L9160
16981A01286J15931l9054k11287j36590j9454J9227L459O1723M1560K5931O1790
16970B4522j84910j13254J76329R907O4278J63335j6118j88591r1844p6166j18333
16959c50845r0528n6439R1937J68961J83703J51673Q4457j79774n6066o5275O6829
16948e1367J9104O7327J52815j7608O5884K8773j63212J3953m0100o8431j17656
16937a10518K2016L2084J3047j28588L4967Q203m7284J21296Q9128R9679K3694
16926A57724r0136j65359M424Q8202J25973j99689k3800Q9738j49343j32024J97222
16915i7068M4195q0125R8531k0799J6747j45050J60531m4199n6211O1750l4683
$$ plain form
16992 -136391 7809 -146113 -222927 -179400 -215752 -230282 -199249 48338 53506 62126 101286
16981 101286 217217 178163 -33124 -169714 -189168 -169941 -166482 -104759 -63199 -37268 24522
16970 24522 -160388 -273642 -97313 -87406 -23128 140207 124089 -64502 -156346 -232512 -350845
16959 -350845 -441373 -497812 -405875 -236914 -53211 98462 182919 3145 -52921 -118196 -51367
16948 -51367 -32263 35064 187879 170271 236155 264928 101716 115669 75569 7138 -110518
16937 -110518 -88502 -56418 -43371 -171959 -136992 -128789 -176073 -54777 34351 134030 157724
16926 157724 67588 -97771 -93347 -5145 120828 -78861 -102661 -12923 -162266 -294290 -97068
16915 -97068 -52873 -132998 -34467 -55266 -38519 -183569 -23038 -67237 -123448 -61698 -96381
16904i6381K8241M6470k9103M1924o9496j33938l1391j62473J89447J59260J10118
16893E2678j5554k14716o7624J50113J87948m5950j70075j25178L2124J00560
16883a15674Q646L0181k26271k03381O0353R2067J65537N381K38069k4026j20317
16872h9435J83893Q8578M2592J03640m7759j59173r7560l4186Q1106M1844j01381
16861A2159p7572J7678J12503j8910o4226l6172p6057k3759J3749m9640l2788
16850b23035n3100j03032J3703O4997J22934Q057n0196O9702J30947J50031N9052
16839A90060l3620p5764r0632j33391L8888R5328P0604j278J7421k43993K7047
16828a39330J74237J52089P1242l8529j10739r8863K8092N4127l9115k22896j65147
$$ plain form
16904 -96381 -68140 -21670 -50773 -8849 -78345 -212283 -243674 -406147 -216700 -57440 52678
16893 52678 37124 -177592 -245216 -95103 92845 46895 -123180 -248358 -216234 -115674
16883 -115674 -107028 -76847 -303118 -506499 -446146 -354079 -188542 -183161 54908 30882 -89435
16872 -89435 94458 183036 225628 329268 281509 122336 24776 -9410 71696 113540 12159
16861 12159 -65413 -47735 64768 45858 -18368 -54540 -130597 -154356 -140607 -190247 -223035
16850 -223035 -276135 -379167 -365464 -300467 -177533 -169476 -219672 -149970 -19023 131008 190060
16839 190060 156440 80676 -9956 -143347 -104459 -9131 61473 60195 77616 -166377 -139330
16828 -139330 34907 186996 258238 219709 108970 10107 38199 92326 53211 -169685 -334832
16817c34832J27185l2902j26391J5890n5690J04194P0732J93553R0720J54037
16807B06496j07454r4199q9542J21385J01023K0846n0517j65024k2214J84645
16797A05445R2365j21374j15290l1771K77428O8534j08596o1104j43044l9515
16787g6922K3950j62597j23408p907P0782J96941J15282j0327P865R251J0466
16776E3376q7541n4442n9974J6128l9698m7699J34163K3099L2611J38001q7510
16765B0514j02479J5741J15944r6251j9264L477Q2170J50478K3503Q3202n6658
16754B20377j12761j9476j80859J2267J66503J56662J45660P7857L7087k01555
16744C01762j92502q5866N0266j33415J40794J63078p2094r2059J4495n6530m192
$$ plain form
16817 -334832 -207647 -240549 -366940 -351050 -406740 -302546 -231814 -38261 52459 206496
16807 206496 99042 4843 -84699 36686 137709 158555 108038 -56986 -79200 105445
16797 105445 197810 76436 -38854 -70625 206803 275337 166741 105637 -37407 -76922
16787 -76922 -52972 -215569 -338977 -346884 -276102 -79161 36121 25794 33659 42910 53376
16776 53376 -34165 -88607 -148581 -132453 -172151 -219850 -85687 -62588 -29977 108024 20514
16765 20514 -81965 -66224 49720 -46531 -65795 -62318 19852 170330 193833 277035 220377
16754 220377 107616 88140 -92719 -80452 86051 242713 388373 466230 503317 301762
16744 301762 109260 23394 73660 -59755 81039 244117 172023 79964 94459 37929 33737
16733C3737O9287J01694k5539j02959J12765p3640k39006m2981P1377Q1304R4716
16722H0755n7278r1310l6574K6095R872o2403K14165l8218j95370M2460o2385
16711a70191M2511o3146N72R2281O5250j17418k8585m5319J90690R9829j59801
16700i3327R5382j4738j35222L9863J55576O541Q2809j8142j27680n2506k5280
16689h6724O0536O3030m3911m1768m8928K8750R6562K7093J13452L4377O6640
16678B69109O3633n3396k55944j00000j2491N0862l5052O6258M4775N615l9387
16667C982j21049j94511J21859M3234O433J3165j08199J1021M9983k1297R0063
16656a05316N5952K1119J33840M385L9640j38348m0208N804N1587n3974O1250
$$ plain form
16733 33737 103024 204718 179179 76220 188985 115345 -123661 -166642 -95265 -13961 80755
16722 80755 23477 -67833 -104407 -78312 -68440 -130843 83322 45104 -150266 -107806 -170191
16711 -170191 -127680 -190826 -190254 -97973 -32723 -150141 -178726 -224045 -33355 66474 -93327
16700 -93327 2055 -12683 -147905 -108042 47534 54075 136884 118742 -8938 -61444 -86724
16689 -86724 -26188 36842 -7069 -48837 -97765 -69015 27547 54640 168092 202469 269109
16678 269109 332742 279346 23402 -76598 -89089 -38227 -73279 -7021 37754 43369 3982
16667 3982 -117067 -311578 -189719 -146485 -140052 -126887 -235086 -224065 -174082 -195379 -105316
16656 -105316 -49364 -28245 105595 109980 149620 11272 -28936 -23132 28455 -25519 35731
16645C5731r055J0450K54434N4488j95173N1732j0215R6715M9722p4331j34869
16634A29629m3214n207j95014l5003n3304N7724R0022J20081O8115j16819j90462
16623a73452k6220k2773q6339j32831J09125Q3889o5962J58085r603k3972o835
16612a96888n3684n4001N6916O3345M3975K5951L831r1112l410J91384J95457
16601A81764M5863p7345j21990k05620p6429Q2351K18965J29787J50538j3112
16591C14772j36860j33612j5217N1462P1321m7907j46781J07186O4236J14372
16581B42972j4504k7967j60450j23880J28186J03595o1971j1728r6023j39404
16571a61174j38545k12275J56692Q7037J20381J34771N2581j14542j0529J59490
$$ plain form
16645 35731 26676 37126 291560 346048 150875 202607 192392 289107 338829 264498 129629
16634 129629 86415 81208 -113806 -148809 -202113 -144389 -54367 65714 133829 17010 -173452
16623 -173452 -199672 -222445 -308784 -441615 -332490 -248601 -314563 -156478 -166081 -190053 -196888
16612 -196888 -250572 -304573 -247657 -184312 -140337 -114386 -110555 -201667 -205077 -13693 181764
16601 181764 227627 150282 28292 -177328 -253757 -171406 47559 177346 327884 314772
16591 314772 177912 44300 29083 80545 151866 103959 -42822 64364 128600 242972
16581 242972 228468 200501 40051 -83829 44357 147952 85981 74253 -21770 -161174
16571 -161174 -299719 -511994 -355302 -268265 -147884 -13113 39468 -75074 -85603 73887
16561G3887K425n9735N5173l8126Q4733r034R8994R5214j39024k01126l14045
16550c50664L0065J90476K30981R4822l9998k13942j85045R6281L23759R8543
16540B75278j70048J5022J13560q5971n5801k2678L1039J9947o2897j71339j02900
16529b16788m2071J87552J52894l8823n8386r3035J7443J22278j29503p87J53145
16518E3919j14234r2413J87192N1755J02232N7045k38310J27132j9179q958N8268
16507A64449M8989j68048l3492j96623J15823Q3828o0859k9302R5608r8403N5428
16496b2602p3698j9926J91721N6656J953j78484k0543J62137J14798j18821k45228
16485a52037j45472J2156R37J55481l0190j53218R9953l900j1573N5957J27687
$$ plain form
16561 73887 76312 16577 71750 33624 118357 109323 208317 303531 164507 -36619 -350664
16550 -350664 -320599 -130123 100858 195680 155682 -58260 -243305 -147024 176735 275278
16540 275278 105230 120252 233812 147841 92040 69362 100401 120348 57451 -113888 -216788
16529 -216788 -258859 -71307 81587 42764 -15622 -108657 -91214 31064 -98439 -99226 53919
16518 53919 -60315 -152728 34464 86219 188451 245496 7186 134318 115139 106181 164449
16507 164449 213438 45390 11898 -184725 -68902 14926 -45933 -75235 20373 -78030 -22602
16496 -22602 -96300 -116226 75495 132151 134104 -44380 -64923 97214 212012 93191 -152037
16485 -152037 -297509 -285353 -284416 -128935 -159125 -312343 -212390 -216290 -227863 -171906 -44219
16474d4219o2300L3097k0443k1837n9658l0886J54082L5456N0482o5428j3320
16463d4974J54939M6616J1145l6426N4522O9743q8501k09001k8639M3132M0107
16452A2663L6263p9229K5939O0996l5856n0275Q6090q3577K2057p6340k51925
16441c33194J21255J90775j6235j12727J01586R8755J98956J22668k55904k12543
16431i6608j54279K2151J70759N7913l8165P0757o825l4515N8746J7868j87894
16420a20092q298J39904j17500O3626J58358L1853k7194q7178n5170N350J49373
16409A33032r041n3872J26928J35868k12992k9751L9734k1966n9419r4689M2196
16398c972R9184M25O262n8217J20911o2290m4375J1345p5429n0497j02747n1403
$$ plain form
16474 -44219 -106519 -73422 -93865 -115702 -175360 -206246 -52164 -16708 33774 -31654 -44974
16463 -44974 109965 156581 167726 131300 185822 255565 167064 -41937 -70576 -27444 12663
16452 12663 48926 -30303 -4364 56632 20776 -29499 56591 -26986 -4929 -81269 -333194
16441 -333194 -211939 -21164 -37399 -150126 -48540 50215 249171 371839 115935 -96608
16431 -96608 -250887 -228736 -57977 -64 -38229 32528 25703 -8812 49934 67802 -120092
16420 -120092 -128390 11514 -105986 -42360 115998 147851 120657 33479 -21691 -16341 133032
16409 133032 123991 70119 197047 332915 119923 90172 129906 107940 48521 -46168 -3972
16398 -3972 95212 95637 101899 43682 164593 102303 57928 69273 -6156 -56653 -159400 -210803
16386b10803P8513L7320J40529J55159j5586j22984O7999l5529n3054q6470j50237
16375a95143n1819K08363K24448J34195j3407J2441j17599p790r8939n5845l666
16364C5239p1257n2583J81850j8774j46474j78031j0033O1376P4259P5738J96872
16353A48182J38620q2931k20661n5491j06458O3715l1286j4040m6270K0702J26741
16342e9177J41385j18039k286n9082j12924O5485M3747l3236j05290N2386P6223
16331a10808m3298j05615j01063j02844K07257R2609m9647K4164Q9455L2457R0602
16320B3269p1432k54960o5613O5732J68969J45522J99018k58614m718l2637R9559
16309A4095q9067k3134R9339J58843j04059o3420k6647J6747M0591J07073n7143
$$ plain form
16386 -210803 -132290 -94970 45559 200718 185132 62148 130147 94618 41564 -44906 -195143
16375 -195143 -246962 -38599 185849 320044 306637 319078 201479 193689 94750 38905 35239
16364 35239 -36018 -88601 93249 74475 -71999 -250030 -260063 -198687 -124428 -48690 148182
16353 148182 286802 203871 -16790 -72281 -178739 -115024 -146310 -160350 -206620 -185918 -59177
16342 -59177 82208 -35831 -38117 -97199 -210123 -144638 -100891 -134127 -239417 -187031 -110808
16331 -110808 -154106 -259721 -360784 -463628 -256371 -163762 -213409 -189245 -99790 -67333 23269
16320 23269 -48163 -303123 -368736 -303004 -134035 11487 210505 -48109 -52827 -85464 14095
16309 14095 -74972 -98106 1233 160076 56017 -7403 -34050 -17303 23288 130361 73218
16298G3218o3274J65286K6818l7344j42008O4657J75877n9176m4350q5928j06283
16287c2507R2160Q2966k06668j4197N7098r164P8494N7998q5753m4467Q653M8958
16275C3571l0629J01394k7607l9209J04472R0797p7092J0011Q075r1036k2942
16264E9805k2559m7628p2792k8974J52506J90990m3447o790j5289k17478L0994
16253b0662L0191q831J2012k0427p5374p9248k107J55999k8938K7615J1260j69885
16241a68395k26418M2705L6717R5649j5743J62992J701m5883O3300J31300L7770
16230A15695n9608j94689j22845q256J36953l7948o3773J45037Q0328o7601Q2946
16219F239P5415Q2371o2940j75503o6016q0117J04100K43403P772j11388j46369
$$ plain form
16298 73218 9944 175230 202048 164704 22696 87353 263230 204054 159704 73776 -32507
16287 -32507 59653 142619 -64049 -78246 -21148 -30312 48182 106180 20427 -24040 -15387 33571
16275 33571 2942 104336 76729 37520 141992 232789 155697 165708 173783 82747 59805
16264 59805 37246 -10382 -83174 -112148 40358 231348 187901 181111 165822 -51656 -20662
16253 -20662 9529 698 12710 -7717 -83091 -162339 -164446 -8447 -37385 -9770 1490 -168395
16241 -168395 -394813 -352108 -315391 -219742 -235485 -72493 -70792 -116675 -53375 77925 115695
16230 115695 56087 -138602 -261447 -269703 -132750 -170698 -234471 -89434 -9106 -76707 6239
16219 6239 81654 164025 101085 -74418 -140434 -220551 -116451 126952 134724 23336 -123033
16208a23033N9633M1440J3647J2030J11727P7210j01063o4171Q6037l3942j8253
16197F1262q927J8877j53915P2250J13126J26464j00325k29662l5401k59055l2902
16186d28208L49023J98975R2124n4389L2322r5212k04739O0742O2320P2921q609
16175G7270j00578n1822r8375m8694R2286m9181p0978r0741j760J89208K28919
16164G5554o4006j36759k0416j60599o2138k3649m6866J42423L63929J49657k14251
16153B879j33122R8619r9817j06132Q3924R4602K50391N0983k0183p711o8592
16142A45841j15048m1268J0108J13581P981J6190J12954j07745n1510N0635m6253
16131I5466n850j4289o7868Q8618M1383P5641j81013j97365M077O5250k0217J39221
$$ plain form
16208 -123033 -63400 -21960 -8313 3717 115444 192654 91591 27420 113457 79515 61262
16197 61262 52335 71212 -82703 -10453 102673 229137 128812 -100850 -136251 -395306 -428208
16186 -428208 -79185 119790 211914 157525 189847 94635 -110104 -49362 12958 85879 77270
16175 77270 -23308 -75130 -173505 -222199 -129913 -179094 -250072 -340813 -342573 -153365 75554
16164 75554 11548 -125211 -145627 -306226 -368364 -392013 -438879 -296456 67473 217130 2879
16153 2879 -130243 -31624 -131441 -237573 -153649 -59047 191344 242327 222144 214433 145841
16142 145841 30793 -10475 -367 113214 121195 137385 250339 142594 91084 141719 95466
16131 95466 89616 75327 7459 96077 137460 213101 32088 -165277 -161200 -95950 -116167 23054
16119B3054Q9649J9607j14794r1580M0534J2551J63444q653K1690M8129p1125
16108A32506j09096J09300K8416l5487J948q8213j0389L3200o0553k21252J96878
16097b2742K75692j17715k18840O3518m9313J16122J93397R8745j64503j69302
16087E059n579J16226l6682j05531j09423L6058P2047M2085O7103n0695j35866
16076a05198j99021J73162K10572J5312L9641J81568L7557q5920j91951J13837
16066A89559j95994k10777P396m7671m172m7489P6065R5234J5790n7375J4271
16055a65163K14122J32497R3174j37950n7255J68043R6171L6785J09591P8582
16045E68597j68762m2564j02997K9548r0514O6849j19593r2033N7326J26708k40131
$$ plain form
16119 23054 112703 132310 17516 -74064 -33530 -20979 142465 133812 155502 203631 132506
16108 132506 23410 132710 161126 125639 127587 39374 28985 62185 1632 -219620 -22742
16097 -22742 252950 135235 -83605 -20087 -69400 46722 240119 338864 174361 5059
16087 5059 -520 115706 79024 -26507 -135930 -99872 -27825 14260 81363 30668 -105198
16076 -105198 -304219 -131057 79515 94827 134468 316036 353593 267673 75722 189559
16066 189559 -6435 -217212 -209816 -257487 -261659 -309148 -233083 -137849 -122059 -179434 -165163
16055 -165163 48959 181456 274630 136680 79425 247468 343639 380424 490015 568597
16045 568597 399835 357271 254274 283822 193308 260157 140564 48531 105857 232565 -7566
16034g566j4102J67029j36269N4915m1742k8251p6626J39282j6933N9554P7331
16023A76622j82616M2911J18842k00922j29714q1310J66239j3979O817J70785
16013G3675o297o3039j18417N8083J33050j83033j28235m00R4841O7824j75748
16002b47696n2531Q8692J48625J48870n0154j5491L41q0757q3020q548p732N1073
15990a08328O7709o7348j5466L3230J11111Q131j7843q2304Q3461J60160j08712
15979F3801k4651J15105P2675n7926q3384M501k59212K3880N7764j97782p993
15968b93222n2044J01450K8345J10528J03439J27598j5652o911n0745o8199m4641
15957f0054q6866O6480r4278N7803p7882J4251L9327O6034j27671J13537O6756
$$ plain form
16034 -7566 -21668 145361 9092 64007 22265 -5986 -82612 56670 39737 99291 176622
16023 176622 -5994 36917 155759 -45163 -174877 -256187 -89948 -103927 -97110 73675
16013 73675 67378 4339 -114078 -55995 77055 -105978 -234213 -234613 -139772 -71948 -247696
16002 -247696 -300227 -211535 -62910 85960 35806 20315 20656 -60101 -143121 -151669 -159401 -108328
15990 -108328 -40619 -107967 -123433 -90203 20908 29039 11196 -71108 12353 172513 63801
15979 63801 39150 154255 226930 169004 85620 90121 -169091 -145211 -87447 -285229 -293222
15968 -293222 -345266 -243816 -215471 -104943 -1504 126094 110442 103531 52786 -15413 -60054
15957 -60054 -146920 -80440 -174718 -116915 -194797 -180546 -141219 -75185 -202856 -89319 -22563
15946b2563J16209K48272o0720j48049J03770J0046k53457n8955l9582J70665
15936F5636R5131J5107O8141J8037J4415k11828m724j58460n4494m2439o8110
15925b63588J50223J52881Q2802P283J1617M9328j31015n3241N4805j5040j94079
15914a48024k034J50327o5394L6562p1320l2901L4208k51035M3075J14960O4663
15903a26913j08234L04076L27712j71767o0920P0308q6219l4372l1669j71725
15893h9723j16208J5019J97560N8715k17908R2449K60837j4875j12258j72768
15883i9160j52378o2520J01112K36206J21490k3856n0600o1970J14289R861k15753
15872h3279K12999L6829j10798L5811J16249r3560j12083k01296M5715Q5677J77441
$$ plain form
15946 -22563 93646 341918 281198 133149 236919 246965 -6492 -65447 -105029 65636
15936 65636 160767 175874 244015 262052 276467 64639 59915 -98545 -153039 -195478 -263588
15925 -263588 -113365 39516 122318 129601 141218 190546 59531 6290 61095 46055 -148024
15914 -148024 -150058 269 -65125 -28563 -99883 -132784 -98576 -349611 -306536 -191576 -126913
15903 -126913 -235147 68929 396641 224874 163954 234262 148043 113671 82002 -89723
15893 -89723 -205931 -190912 6648 65363 -152545 -60096 200741 185866 73608 -99160
15883 -99160 -251538 -314058 -212946 23260 144750 120894 70294 8324 122613 132474 -83279
15872 -83279 129720 166549 55751 91562 207811 114251 2168 -199128 -153413 -67736 109705
15861A09705n6874k20742k7021m333J05724j33434J08668J54294q1998J73115
15851A27104P2892j17501q2949k11716r6591L58208R5965m6738j2653j50825j94414
15840b59218P3611Q7293O5150J67965j05624j09285j41862k27757N9620Q2590
15830c07517l8238J08131P5106p8282r101J01068N6850j27529j02191q4925j6286
15819d22914K07621Q5644o2016J1355o5795K37766J54407j02422J0490K4580k05367
15808a26651o3642J57267N9231l1543j43927k3219N3878O2461J29243j04144j56316
15797a87362M338O8073J31050J60583j8734j31580P3068l6133M3022J00418j14657
15786I2086j65280J46908J36245q2667j05415K12l5191L7740K66915J00052j28369
$$ plain form
15861 109705 52831 -167911 -194932 -199265 -93541 -226975 -118307 35987 -46011 127104
15851 127104 199996 82495 -454 -212170 -308761 49447 145412 98674 86021 -64804 -259218
15840 -259218 -185607 -98314 -33164 134801 29177 -80108 -221970 -449727 -390107 -307517
15830 -307517 -345755 -237624 -162518 -240800 -249901 -148833 -91983 -219512 -321703 -406628 -422914
15819 -422914 -215293 -129649 -191665 -180310 -246105 -8339 146068 43646 54136 78716 -126651
15808 -126651 -190293 -33026 26205 -5338 -149265 -172484 -118606 -56145 73098 -31046 -187362
15797 -187362 -183024 -114951 16099 176682 157948 26368 99436 63303 106325 206743 92086
15786 92086 -73194 73714 209959 127292 21877 22089 -13102 24638 291553 391605 263236
15775B63236j16079J320j11559K4619o7325o7287k38370m2488J29422K8130n3866
15764b50247R0400M7361o4515L2957L5857J8634L185J1188J5718l1533k00089
15753b91084j71673P644K18130K11496k0728p3872J14058N3587n859N1478j75665
15742h2488j23805J9423R4237J6496K24421m8189p8572k3999n1683j2634J28954
15731F2161N487n2311P7052r5440o228J96092M1748o7778J83832k3713j31973
15720A88929j54680j08953J7958k9356J43689m4638J4095j18541q3505k9613P8344
15709a26271J436K6639Q0347J09786m7848r2037P3377k8883o7984J41718L9296
15698A09576l4063K4995O7170o4397j27335J26088k4926K306j05467q667j6977
$$ plain form
15775 263236 147157 148477 36918 61537 -5788 -73075 -311445 -353933 -224511 -196381 -250247
15764 -250247 -159847 -112486 -177001 -144044 -108187 -89553 -86368 -75180 -59462 -90995 -291084
15753 -291084 -462757 -455113 -236983 -25487 -46215 -120087 -6029 47558 41699 93177 -82488
15742 -82488 -206293 -186870 -92633 -76137 148284 100095 21523 -2476 -54159 -66793 62161
15731 62161 67648 15337 92389 -3051 -9279 186813 228561 160783 344615 320902 188929
15720 188929 34249 -74704 -56746 -86102 57587 12949 27044 -91497 -175002 -204615 -126271
15709 -126271 -124835 -98196 -17849 91937 44089 -47948 25429 -3454 -71438 70280 109576
15698 109576 75513 100508 167678 103281 -24054 102034 77108 79414 -26053 -34720 -51697
15687e1697P5045J64914k2671j23187O850j21905j06180M2933Q1216O4822l541
15676F599q143j47392o5472J1699J33521J67328J57430l6277r0603m0725j67964
15665g9999k51959J9666j00529l8645P901l964q8174N5560P0909J44088p324l636
15653b76106M0297R3825Q4491L6082L1353j27081j40935M9687J25072L48887l3781
15642B31791j67091j79627R6597o423k8129K2960o882N2146r6445k45040p6216
15631d02359J13095K6698K45130J42546k1150j50177k26718j02707K46533J20981
15621h128N4229j38201n4838M121j11412O8605J1721K54505K36964j67680j07965
15610D1921r6315K5214J00200J3097P3478n3674j34536l3035l7810R4262J21258
$$ plain form
15687 -51697 23348 188262 165591 42404 49254 -72651 -178831 -135898 -54682 10140 6599
15676 6599 -1544 -148936 -214408 -202709 -69188 98140 255570 219293 128690 87965 -79999
15665 -79999 -331958 -312292 -412821 -451466 -443565 -447529 -535703 -480143 -409234 -265146 -272470 -276106
15653 -276106 -235809 -141984 -57493 -21411 9942 -117139 -258074 -208387 -83315 265572 231791
15642 231791 64700 -114927 -18330 -24753 -52882 -29922 -36804 15342 -81103 -326143 -402359
15631 -402359 -289264 -262566 -17436 125110 103960 -46217 -272935 -375642 -129109 -8128
15621 -8128 46101 -92100 -146938 -142817 -254229 -185624 -173903 80602 317566 149886 41921
15610 41921 -54394 -29180 71020 84117 157595 103921 -30615 -63650 -101460 -7198 114060
15599A14060k5042q822j67849k38730J07779J89138L1710j20479N9693N0588J49765
15588A41811L7041k8385n6514M3092j23206j42114M8548J51206K08989q6078j5658
15577A78732j32329J072O6433L9125J30668j550j32660o1369q1030L2501m3733
15566d140J35880P6102k30K2912k01944r2848Q1111N1590j94127M9832J92936
15555A17074K7192r0289j36050m3399L3666j76748K7075J10746J91872R3922L7212
15544A92273j57672J480r7846R9024J543k3122j0660j48932p5766l6867K5164
15533b31381O9598L7259J04003l1166j19824k13280Q3607K38980Q0382q0173j35690
15522a97685Q9112K9510M358R790L2747J15983M348o574O7999j36441q3854r1083
$$ plain form
15599 114060 89018 80196 -87653 -326383 -218604 -29466 2244 -118235 -58542 -7954 141811
15588 141811 178852 150467 93953 137045 13839 -128275 -79727 71479 280468 194390 178732
15577 178732 46403 47475 113908 153033 283701 282151 149491 88122 7092 39593 -4140
15566 -4140 131740 207842 207612 230524 28580 -64268 16843 68433 -125694 -75862 117074
15555 117074 144266 53977 -82073 -125472 -91806 -268554 -241479 -130733 61139 155061 192273
15544 192273 34601 36081 -61765 37259 38802 15680 5020 -143912 -219678 -256545 -231381
15533 -231381 -161783 -124524 -20521 -51687 -171511 -384791 -301184 -62204 18178 -61995 -197685
15522 -197685 -108573 -79063 -74705 -64915 -32168 83815 88163 81589 149588 13147 -70707 -161790
15510a61790j2578P0159k418J70102Q3177n6925j9125p5255j76508L930N7183
15499a20048J86739R1628j9098M0201J70441J93832j10776l97969j41447o4109
15489a70606J19780j18136q5641J31495o1590j36908Q6540o8258J04871K36672
15479C8219M3311n2708k2922M8157L4577l9861J2933j34810j45497J03820J97773
15468H2992Q4369l1497l3828J16254N7753J5107k18702k57330M1891J9583j770
15457a25178n8169Q8199O6433n9579P5652K12499r45j99612R3103M1090q6109
15446D7384p3054r4029l3204R6378j258k3322l2878k5733J18710J48567L4870
15435A62431m2767N0815j14160L8399Q855O781o6844j10337N1318P9943j40876
$$ plain form
15510 -161790 -174368 -104209 -106627 63475 146652 89727 70602 -4653 -181161 -177231 -120048
15499 -120048 66691 158319 139221 179422 349863 543695 432919 34950 -106497 -170606
15489 -170606 -50826 -168962 -254603 -123108 -184698 -321606 -235066 -303324 -198453 38219
15479 38219 81530 28822 5900 54057 88634 48773 61706 -73104 -218601 -114781 82992
15468 82992 167361 135864 102036 218290 276043 291150 72448 -184882 -142991 -123408 -125178
15457 -125178 -183347 -95148 -28715 -88294 -12642 199857 198912 -700 92403 133493 47384
15446 47384 -25670 -119699 -152903 -56525 -57783 -81105 -113983 -139716 -21006 127561 162431
15435 162431 119664 170479 56319 94718 103573 110354 43510 -66827 -15509 64434 -76442
15424g6442k07278K4938J26392K9403l5481p7833K2263L1867O4850q9019R4974
15413i1366K10861J23115o0008m5299q6042p4648J35105N0288j05441j07794r2294
15402a43523J5565M2991Q6439j35833j16112j0361P7057J6343J10464J22232J7863
15391H3125K8524Q7381Q9639j36846j67002o6664P2394k6341j00194r4383P9717
15380a50650J2904j40827Q4830J28656j36335K5785p735J89004P5693q7005q679
15369a4359n8909L2965N7225q151q9015K10553j4142j41191J05997O9833L2279
15358A83085J23831p9134k08452l7700R3048l3423o4920M2804L0621M117j40330
15347h6453n3382L03258n9083j18574k6093P0166k3943n8846j29641r0145K0029
$$ plain form
15424 -76442 -283720 -258782 -132390 -102987 -138468 -216301 -194038 -162171 -97321 -186340 -91366
15413 -91366 119495 242610 182602 137303 51261 -23387 111718 162006 56565 -51229 -143523
15402 -143523 -127958 -84967 1472 -134361 -250473 -260834 -183777 -167434 -56970 65262 83125
15391 83125 111649 199030 288669 151823 -15179 -81843 -9449 -35790 -135984 -230367 -150650
15380 -150650 -137746 -278573 -193743 -65087 -201422 -175637 -183372 5632 81325 -5680 -14359
15369 -14359 -73268 -40303 16922 8771 -80244 130309 116167 -25024 80973 150806 183085
15358 183085 306916 227782 19330 -18370 74678 41255 -23665 19139 49760 53877 -86453
15347 -86453 -139835 163423 104340 -14234 -40327 29839 5896 -52950 -182591 -272736 -252707
15336b52707P7462l8590o2090k7464L3593K35485l4532l7294N0929j19358K4844
15325a49722J4780J76503j3027j95606j48908J75065J19686O6920j2901O8734
15315A01524L1588p3580r7837k12414P4599J78103K14425O0873j40642k3703j32686
15304a9750k9071J8300n3522N9853Q1563J17464j89543j86389l0814M7500J88457
15293D048j7236J03891o2122q424O3928P3323M8367o2656L176k9735n5673l6620
15281B4267L5293n5189q3959J38353m0149j93420J3723J45824J09032l865j51534
15270f1624j43805j1968K59298r2519K9665L8573l9761J03668j77000l3159q214
15259a36846J4093p870J15707J84474j91087K4777J60095j92808k45162L4448
$$ plain form
15336 -252707 -175245 -213835 -275925 -303389 -269796 -34311 -68843 -106137 -55208 -174566 -149722
15325 -149722 -134942 41561 28534 -167072 -315980 -140915 -21229 45691 32790 101524
15315 101524 133112 59532 -38305 -250719 -176120 1983 216408 277281 136639 112936 -19750
15304 -19750 -48821 -30521 -84043 -24190 57373 174837 -14706 -201095 -231909 -184409 4048
15293 4048 -13188 90703 28581 20157 84085 157408 205775 143119 146295 116560 60887 24267
15281 24267 59560 4371 -79588 58765 18616 -174804 -161081 -15257 93775 89910 -61624
15270 -61624 -205429 -217397 41901 -50618 -20953 17620 -22141 81527 -95473 -128632 -136846
15259 -136846 -122753 -130623 -14916 169558 -21529 3248 163343 -29465 -274627 -240179
15249b40179R5517K22254J04072j95220n3369j3933R5841Q0454j36510N3199l8935
15238b6809J01531P3559l0137J55114K46561K3600k21049r6527J1363j05028n4151
15227G8027l6628L9010M2497k699j31598Q5953l5903n4518j6906n9594j1739j6748
15215a20846j93589l5481J36810O0595Q2605J69807n157p540j44088k52738J99290
15204a10332J56518k9655l062n5102j19880J884J82313k6500q9459k8813j245
15193a23333J07040M7073J83088j14477j85883j89766O4441O9112O4468J27780
15183D9543R1002K0734N2154j59110P9277p5936j09194q3553j0658J85674l3610
15172F323j48853j48237o0568J80415J39211j27213P7769J46819N682j37570j63546
$$ plain form
15249 -240179 -144662 77592 181664 -13556 -66925 -80858 14983 95437 -41073 12126 -26809
15238 -26809 74722 148281 118144 273258 519819 543419 322370 225843 237206 132178 78027
15227 78027 41399 80409 122906 120207 -11391 74562 38659 -15859 -32765 -92359 -104098 -120846
15215 -120846 -314435 -349916 -213106 -152511 -69906 99901 94744 87204 -56884 -309622 -110332
15204 -110332 46186 16531 13469 -41633 -161513 -159629 22684 -3816 -93275 -122088 -123333
15193 -123333 -16293 30780 213868 99391 -86492 -276258 -211817 -142705 -78237 49543
15183 49543 140545 161279 213433 54323 133600 57664 -51530 -135083 -145741 39933 6323
15172 6323 -142530 -290767 -351335 -170920 -31709 -158922 -81153 65666 71348 -66222 -229768
15161b29768K2291K2996M3865k2087N2206J86815J49389K1129j15652j66118r5486
15150a30420M4812J94901J02613l8581k87394o3121K18001J92545p0644j69570
15140f858J44150J54640p1888n7222r8256q6542j50405m3574p4515J15346N0971
15129a24153Q0398J06986j09550m5796n6748k67676O3179O1902M255J34018M8433
15118a04752J7028L4860R88k8503R1906O3109n5492o29k19368q5431J08036Q9017
15106h9231N5525l0682J4531K0240o9179r0581j09143J25430k3590L7177M0640
15095a18863K8708Q4841P3760k8681j1844K77690R7871j78159j67963k7030J0635
15084D0965j31370j15434K5240Q844J87002L2917q7210k5070m9876J9040m814
$$ plain form
15161 -229768 -207477 -184481 -140616 -162703 -110497 76318 225707 246836 131184 -34934 -130420
15150 -130420 -85608 109293 211906 173325 -114069 -177190 40811 233356 162712 -6858
15140 -6858 137292 291932 220044 162822 64566 -21976 -172381 -215955 -290470 -175124 -124153
15129 -124153 -43755 63231 -46319 -92115 -148863 -416539 -353360 -291458 -287203 -153185 -104752
15118 -104752 -87724 -52864 -51876 -80379 11527 74636 19144 18515 -200853 -286284 -178248 -89231
15106 -89231 -33706 -64388 -49857 -29617 -98796 -189377 -298520 -173090 -196680 -159503 -118863
15095 -118863 -90155 -5314 68446 39765 27921 305611 403482 225323 57360 30330 40965
15084 40965 -90405 -205839 -180599 -171755 15247 48164 -39046 -64116 -113992 -94952 -99766
15073i9766j1305J6239k7819m6548K42284J50830M2568j57626k71471O5980K66238
15062A69604J23106j48739q7154O426J18041K04818r7031p8606J0928p8584K1696
15051A64505K06334o8157q3685Q1337P1903k04803p0373o6612M7728P108L96k5177
15039F0504J34063L756k16445j16419m1448Q9983P3903r0958j29240J6411Q8115
15028a27775R3319r039K7737j28186o7643J61054J2229K3024L8882j19645J1625
15017h4418n8772o4385J61288R0990n4620L1326l1866P5485J12485j62407j26299
15006a11193P0859j6510j26423J54227M2441N0975l548N6952l5741r0818N694
14995c085P0209m9546J25420q6315k00135l1563J00779L0323m6093L9730m392
$$ plain form
15073 -99766 -111071 -94832 -122651 -169199 73085 223915 266483 108857 -162614 -96634 169604
15062 169604 292710 143971 56817 63243 181284 386102 289071 210465 221393 142809 164505
15051 164505 370839 302682 218997 300334 372237 167434 97061 30449 78177 85285 85681 60504
15039 60504 194567 198323 -18122 -134541 -175989 -86006 -12103 -103061 -232301 -215890 -127775
15028 -127775 -34456 -43495 -15758 -143944 -211587 -50533 -38304 -15280 23602 -96043 -84418
15017 -84418 -143190 -207575 -46287 44703 -9917 21409 -10457 65028 177513 15106 -111193
15006 -111193 -40334 -56844 -183267 -29040 13401 64376 60828 117780 82039 -8779 -3085
14995 -3085 67124 17578 142998 56683 -143452 -175015 -74236 -43913 -90006 -50276 -54668
14984e4668P057j35104o6985J1336K94217J45936m1877k6048r2537k4851O7045
14973H3521j25937m9692J81074k36100J9452k6607k9412O6126p73L3476L4552
14962e0320O8116M6910N4313j08945L7258R5162l0677j15004L2221k1143m4639
14951c6748j54841P5165J87051L858M015j01196m2040J82229P895j55798J9056
14940a1354R2168J13628l8667j49939J6205J65752R2951r712j05381j62543m1169
14929c8061M2681j46767r9006p0269J23807R2846J04477J3870k6758l7869j14933
14918a55982j0664J9036j4151K22251J9179j81002J31739M2936o0902K6600J51014
14907A90054P1001j23818j26251J801J67456J46855j30545j17725N2849N2293
$$ plain form
14984 -54668 -47611 -182715 -249700 -238364 55853 201789 159912 133864 41327 16476 83521
14973 83521 -42416 -92108 88966 -147134 -127682 -154289 -183701 -117575 -118348 -84872 -50320
14962 -50320 17796 64706 119019 10074 47332 142494 111817 -3187 29034 7891 -36748
14951 -36748 -191589 -116424 70627 74485 78500 -22696 -64736 117493 125388 -30410 -11354
14940 -11354 80814 194442 155775 5836 22041 187793 280744 271032 165651 3108 -38061
14929 -38061 4620 -142147 -241153 -311422 -187615 -94769 9708 23578 -3180 -41049 -155982
14918 -155982 -166646 -147610 -161761 60490 79669 -101333 30406 73342 12440 39040 190054
14907 190054 261055 137237 10986 12787 180243 327098 196553 78828 131677 183970
14897A83970J17809P6627q602l08100k07109k0728L23315O1412j25308J6351j46188
14886c6551p5865J3597n5733o6511r9519P3867R0716M0628L529n6820k595J31656
14874c9601R3295N7111j71315j66184j01029J1656J82543M3396O8795K32365K1635
14863B32667j18323J8944J28087J8054q1751j99301j24883J06976K00130k1471
14853A59129k32321o470J03178K4615j0054l0696K19609J3206j67237k49076J645
14842a74472m1506k329K01853J24669J36903j17667j61133p1927j06735M2680
14832a69664Q6709J75558J47633j44169k9591o3403R7907O8717J37899j47342
14822A60254l54550k22378o1787K4594O7679J2006j43946L2719K58016P9118j01948
$$ plain form
14897 183970 301779 378406 369804 61704 -145405 -166133 157182 218594 93286 109637 -36551
14886 -36551 -112416 -98819 -154552 -221063 -320582 -246715 -155999 -115371 -111842 -168662 -171257 -39601
14874 -39601 53694 110805 -60510 -226694 -327723 -316067 -133524 -90128 -21333 211032 232667
14863 232667 114344 133288 261375 279429 197678 -1623 -126506 -19530 180600 159129
14853 159129 -73192 -79662 23516 48131 38077 7381 226990 240196 72959 -176117 -174472
14842 -174472 -215978 -218307 -16454 108215 245118 127451 -33682 -105609 -212344 -169664
14832 -169664 -82955 92603 240236 96067 66476 3073 100980 169697 307596 160254
14822 160254 -194296 -416674 -478461 -453867 -386188 -374182 -518128 -485409 -227393 -148275 -250223
14811b50223J26183O2074m02m5829r0879j27684J38923O4580j29363J53755Q4069
14800a4796J64814l9815k2061n4289Q746O2909j64497J08078L9897l6476N1190
14789A03700K5357p3892J8813M1106l9225J10301R5861M9779J6927j19325N6425
14778B85827p5778o0984k7773J4564j64631j28698Q1399J760M5605j08971n6417
14767a94097q4064J49073K21122J02284p9695l5932N4996M3192o9397j66692o6692
14756a25902j0923O4411P0958R7313p1416j8535N1089J39804K1669r1378q3340
14745D3750j25426r5841L4949M2022n627L1649K0275L5214p0911k2204j35039
14734b47189j18803J15491J30370Q7330K2908r1350L1828r8853n9437J0785J51757
$$ plain form
14811 -250223 -124040 -61966 -62368 -108197 -199076 -326760 -187837 -123257 -252620 -98865 -14796
14800 -14796 150018 110203 88142 33853 42599 105508 -58989 49089 88986 52510 103700
14789 103700 129057 55165 73978 115084 75859 186160 282021 331800 348727 229402 285827
14778 285827 210049 149065 121292 135856 -28775 -157473 -76074 -74314 -28709 -137680 -194097
14767 -194097 -278161 -129088 92034 194318 114623 78691 133687 176879 107482 -59210 -125902
14756 -125902 -136825 -72414 -1456 95857 24441 5906 56995 196799 218468 127090 43750
14745 43750 -81676 -177517 -142568 -100546 -106173 -74524 -54249 -19035 -89946 -112150 -247189
14734 -247189 -365992 -250501 -120131 -32801 -9893 -101243 -69415 -168268 -227705 -216920 -65163
14723f5163R7311J08593n4100l1970J5089q4286j17629N2451q1723L7802P4603
14712d9022l0854K3875R6725N1111j383m8905Q2995j15801o8921l3359j75083
14701b68622j09714q60J06573J95887J08612K1070p434k60269Q4580J11530L0857
14690A2210j24475m7292Q4164j22067J36571Q5899K3064Q7145q4045j25835j11043
14679a85704N5043J71302q3264k66474o6789K55589J68190J13587j01413j49796
14669h9729O6308j80063M8871q2774n9067Q1277J58146p5706J20794m5361k2007
14658g9311P50j58792L1124K07953j4193r0058j54920J6793J53588J26886O949
14647D6769O8632k00431j43289j9831M9261J25942P9629j82242q1793M1853n9632
$$ plain form
14723 -65163 32148 140741 86641 54671 69760 -14526 -132155 -79704 -161427 -123625 -49022
14712 -49022 -79876 -56001 40724 91835 90452 41547 124542 8741 -60180 -93539 -268622
14701 -268622 -378336 -379196 -272623 -76736 31876 52946 45512 -214757 -130177 -18647 12210
14690 12210 -112265 -159557 -75393 -197460 -60889 25010 48074 135219 51174 -74661 -185704
14679 -185704 -130661 40641 -42623 -309097 -375886 -120297 47893 161480 60067 -89729
14669 -89729 -23421 -203484 -154613 -237387 -296454 -215177 -57031 -132737 -11943 -57304 -79311
14658 -79311 -78561 -237353 -206229 1724 -12469 -102527 -257447 -240654 -87066 39820 46769
14647 46769 115401 -85030 -228319 -248150 -198889 -72947 6682 -175560 -257353 -215500 -275132
14636b75132j38641K5168R5698J6391O170O6501r1713J19321J11060p7837k3001
14625a66015J61390J882q5799j27455Q4624L1610J04091R6954p0923J098O1807
14614I3264k3078j6297n1915j49139m5956J39817Q5832j1601q1381R9526Q0459
14603A19531L4810n1431n2682j84265L6866J7897J0911K173K3653L1190N8060
14592D6713p8196N4188O1823N9801j3254M659M3033j75338M7911J73275j28565
14581I6050j48845j94546m8874j1374l1304J8345M6783p6733R7289K23317O7596
14570C7704J06263N4875j18843k18023k65967N2497N8875J57284K16271J44883
14560B25819j1895J2503r9026j01873J06690J85705o949j07284l5274L857J9392
$$ plain form
14636 -275132 -413773 -388605 -292907 -276516 -270346 -203845 -295558 -176237 -65177 -143014 -166015
14625 -166015 -4625 -2743 -88542 -215997 -131373 -99763 4328 101282 30359 31457 93264
14614 93264 70186 53889 1974 -147165 -193121 -53304 32528 20927 -60454 39072 119531
14603 119531 154341 102910 50228 -134037 -97171 -79274 -68363 -66190 -42537 -11347 46713
14592 46713 -31483 22705 84528 144329 131075 135734 178767 3429 51340 224615 96050
14581 96050 -52795 -247341 -296215 -307589 -338893 -320548 -273765 -350498 -253209 -29892 37704
14570 37704 143967 198842 79999 -138024 -403991 -351494 -292619 -135335 80936 225819
14560 225819 213924 226427 127401 25528 132218 317923 310974 203690 168416 172273 191665
14549A91665m9400j9179J8703K7157M4883R3307k01177k43203P98K46525K6572
14538A36651r5635j10090K30678J49793m1204l9971j21382N6928k2909M4677J0092
14527A97628J8055j15919n9217p5486j26479L4344j61079o081K28955J09457j73092
14516a28914j05294R2760J87064L2909N085r3667M7968q3811j52059L9390J39059
14505a9510L3680Q0393N0731r7278j19760J26220K82165j10617j38638o1168n3952
14494b7734m522q5697k6123l5103J42613J22228j610k5870J70528j60426k31419
14483a63135o5714J07042P7096j31192j7947R6634P0773p7057j79425n1035R5979
14472b37981J90748J20612m2622q2113N9558l6596l3124o9044r9328J20900J03882
$$ plain form
14549 191665 142265 123086 141789 168946 213829 307136 105959 -137244 -136446 110079 136651
14538 136651 41016 -69074 161604 311397 270193 230222 108840 165768 142859 187536 197628
14527 197628 215683 99764 40547 -34939 -161418 -127074 -288153 -294234 -65279 44178 -128914
14516 -128914 -234208 -141448 45616 78525 83610 -10057 37911 -45900 -197959 -158569 -19510
14505 -19510 14170 94563 145294 48016 -71744 54476 336641 226024 87386 26218 -27734
14494 -27734 -32256 -117953 -144076 -179179 -36566 85662 84052 58182 228710 68284 -163135
14483 -163135 -228849 -121807 -44711 -175903 -193850 -97216 -26443 -103500 -282925 -333960 -237981
14472 -237981 -47233 73379 30757 -51356 8202 -28394 -61518 -130562 -229890 -108990 -5108
14461e108k0857k5435j88534p0305R2952J87864p4824k1424J10548l8273n8669
14450a12065J62907k089k02811k7418k641Q3229J1782N8515n7815q5408j22514
14439b96328o9924J44080N1082J29322r815j03792p5198o024J0855J25854J23873
14428B3985j20292p7044J8765R4811j43060N724L1443l9123K5276J56302o282
14417b9495j4431K6030M5800J49783r9433j74465l5950l8977n2265R2213L2881
14406i8309j9704j0124K2212r248k3108o2927J652R3689J77411j82680l06942
14395d18078m430K65325j724q6565j38627J19518R1512J09064N2953J75621J32095
14384B96664k04351j83238n9191L9329j01204J14353K059j0868j38366k2635O9622
$$ plain form
14461 -5108 -25965 -51400 -239934 -310239 -217287 -29423 -104247 -125671 -15123 -53396 -112065
14450 -112065 50842 48753 -154058 -181476 -184117 -100888 -89106 -30591 -88406 -173814 -296328
14439 -296328 -366252 -222172 -171090 -41768 -51583 -155375 -230573 -236597 -225742 -99888 23985
14428 23985 -96307 -173351 -154586 -59775 -202835 -197111 -165668 -204791 -179515 -23213 -29495
14417 -29495 -43926 -17896 27904 177687 78254 -96211 -132161 -171138 -223403 -131190 -98309
14406 -98309 -118013 -128137 -105925 -115173 -138281 -201208 -199556 -105867 71544 -111136 -418078
14395 -418078 -422508 -157183 -158907 -245472 -384099 -264581 -173069 -64005 -11052 164569 296664
14384 296664 92313 -90925 -150116 -110787 -211991 -97638 -95579 -106447 -244813 -267448 -197826
14373a97826N7966j43710j20787M3570J65812O446m6427l5556J11245J0548l4338
14362a83057J79068J11831O3464q6049J1654o6800N1572J8908k1130r7104o4483
14351h2126K2259N9761K5698J03595J99076Q2055p6524j61027j16039o2541p0374
14340g6187N5296J19177p2425j07536O2215j2251M7851m7149k3409J31459q2432
14329e391p1930J38987O4786J01338J02648r8332Q585k5791p926n2600o5679j25608
14317c6913m7071j39912J60879L1863j23725j8751J0224o9490J37221M5370N2916
14306B611N4308k3308n9723j03227j15129j84843J58548K09744l9380n1460k0858
14295a72717O0824K48908J74652j11388K3147N6177Q496n6190j31831m5681k908
$$ plain form
14373 -197826 -139860 -283570 -404357 -360787 -194975 -188529 -234956 -270512 -159267 -148719 -183057
14362 -183057 -3989 107842 171306 85257 96911 30111 81683 100591 79461 -17643 -82126
14351 -82126 -59867 -106 25592 129187 328263 410318 333794 172767 56728 -5813 -76187
14340 -76187 -20891 98286 25861 -81675 -19460 -31711 16140 -31009 -54418 77041 -5391
14329 -5391 -77321 61666 126452 227790 330438 232106 240691 214900 206974 154374 88695 -36913
14317 -36913 -83984 -223896 -63017 -31154 -154879 -173630 -163406 -232896 -95675 -50305 2611
14306 2611 56919 33611 -26112 -129339 -244468 -429311 -270763 -61019 -100399 -151859 -172717
14295 -172717 -111893 137015 311667 200279 223426 279603 288099 231909 100078 54397 51489
14284E1489j41576j36318o1111P9837L7859m0719O8510N1727k3726q5986p83J42741
14272e8056Q9372p3891R4734J65407M5194o3196K7058J9190K2041l2204j47489
14261H8160j37621j67682k37783J22608K06370k0087Q0714J21636Q1024l4025
14251A03314k02449r7850N1312J99088j3018q0159O3790J37489K5157q6643L9014
14240A39045k92719J4860J26448r9551n5745M6486Q4296J32840k5622r654Q5083
14229A45767O7536J100J23228j13149j39464j06494j92021j26882J25535J26691
14219h8153J30994m2457M2023k8369j07065n0179J32160j68886N2020O745j11062
14208b32229o5441k8020m6266N3119J31598Q970k8n4083O1386q6607j18936m1623
$$ plain form
14284 51489 -90087 -226405 -287516 -207679 -169820 -210539 -142029 -90302 -114028 -200014 -200797 -58056
14272 -58056 31316 -42575 52159 217566 262760 199564 226622 245812 267853 235649 88160
14261 88160 -49461 -217143 -454926 -332318 -125948 -146035 -65321 56315 137339 103314
14251 103314 -99135 -196985 -145673 53415 40397 -39762 24028 161517 186674 100031 139045
14240 139045 -153674 -138814 -12366 -111917 -167662 -121176 -36880 95960 70338 60684 145767
14229 145767 213303 214403 337631 224482 85018 -21476 -213497 -340379 -214844 -88153
14219 -88153 42841 384 42407 14038 -93027 -143206 -11046 -179932 -127912 -121167 -232229
14208 -232229 -297670 -325690 -371956 -318837 -187239 -178269 -178297 -232380 -170994 -257601 -376537 -418160
14196d18160J64084K56673J397k4147P7162N209j06304n8185m7375K27013L5904
14185A13271j12547j52613p1074J16064J62545J38660K56260Q4458J4571j65661
14175C83934k87607q7171j11423o817k5671K893j07394r6754O1859J25083J92284
14164D3216o6428j79051J36577J74339L7565J22396l4921k56093O9854R2100j46158
14153f604o2505j02799m6758K09559N7391J91315j09522j85850o9870K31683Q5105
14142A91145N8772m4670j53927O5760O5601j72608j31151M5852j41859J57874
14132e9211K16979j30757j76700n8871K54232K39371k6546k72535j5434J14623
14122H5151K3507l09L502m0527p8059j3739K80115n2005j32956j14938J03767
$$ plain form
14196 -418160 -254076 2597 3994 -20153 57009 62218 -44086 -102271 -149646 77367 113271
14185 113271 724 -151889 -222963 -106899 55646 194306 450566 535024 549595 383934
14175 383934 96327 9156 -102267 -109084 -134755 -131862 -239256 -336010 -274151 -149068 43216
14164 43216 -23212 -202263 -65686 108653 146218 268614 233693 -22400 47454 139554 -6604
14153 -6604 -69109 -171908 -218666 -9107 48284 239599 130077 -55773 -125643 106040 191145
14142 191145 249917 205247 51320 117080 182681 10073 -121078 -75226 -217085 -59211
14132 -59211 157768 27011 -149689 -208560 45672 285043 258497 -14038 -29472 85151
14122 85151 108658 108349 111851 71324 -6735 -20474 259641 207636 74680 -40258 63509
14111F3509n4584q9348k98187k6359J00916K93M3427J05374k2894M4142K5129
14100a08582J5571J22679j16580L4940P0288k1386j7131p7212J46053J37756k41664
14089e5268j53196Q570K8089Q4536J33012j22701R2862R1476o7778k87145K3106
14078b24437K7255j4829M4741j89792K6414L02987K10593r2577q1595N6233j4689
14067E0304K1668J07889m1017j83103q1330O3876J7254p4172L2395J23854m6751
14056i133Q3660j22029k35078r7584J03922J26013j9285M5272L650q6543k0638
14045b27773J38511K6359M0641m2949j4268k22100k70838O455K55177M2440j01216
14034c69561J41141J06545J00513K15590O31k47796J1797J05891k9718k05349
$$ plain form
14111 63509 8925 -80423 -378610 -404969 -304053 -303760 -260333 -154959 -177853 -133711 -108582
14100 -108582 -93011 29668 -86912 -51972 18316 -3070 -20201 -97413 48640 186396 -55268
14089 -55268 -208464 -199894 -171805 -87269 45743 -76958 15904 107380 39602 -247543 -224437
14078 -224437 -197182 -212011 -167270 -357062 -330648 -27661 182932 90355 8760 64993 50304
14067 50304 71972 179861 138844 -44259 -125589 -61713 -44459 -118631 -86236 37618 -9133
14056 -9133 74527 -47502 -282580 -380164 -276242 -150229 -169514 -124242 -120592 -207135 -227773
14045 -227773 -89262 -62903 -22262 -65211 -79479 -301579 -572417 -565962 -310785 -268345 -369561
14034 -369561 -228420 -121875 -21362 194228 194859 -52937 -41140 64751 35033 -170316
14024a70316k0546P9137l774r4333k0045p1525r5508O1716J05423j54751l4386
14013d18908N0765O9503J07244J8141K2127K10151N0611k77260j16775J05625
14003a78776j23549j93828M1689K64308M2232k06456r4606L17751J24365M482
13993b388J19089K2263p6492l5435j78072J12685J32786j51914j12345j13535
13983b83358L2597R8986J6445J7974O3870o2504j3743j54716o2123J34071J13284
13972i9217Q3462j34011k6363r7238P9103J11471J15353l2707n4316J13668o6605
13961g400J32041r6234j17284K6414P3244j97297o6960J39595J79502J09070j51120
13950B3571k11157q9470K06044Q9363J18398Q518j76158J50780Q7532j70041n8201
$$ plain form
14024 -170316 -190862 -111725 -115499 -209832 -229877 -301402 -396910 -335194 -229771 -384522 -418908
14013 -418908 -368143 -298640 -191396 -173255 -151128 59023 109634 -167626 -284401 -178776
14003 -178776 -302325 -496153 -454464 -190156 -147924 -354380 -448986 -131235 -6870 -2388
13993 -2388 116701 138964 62472 27037 -151035 -38350 94436 -57478 -169823 -283358
13983 -283358 -250761 -151775 -135330 -117356 -53486 -115990 -129733 -284449 -346572 -212501 -99217
13972 -99217 -15755 -149766 -176129 -273367 -194264 -82793 32560 -147 -54463 59205 -7400
13961 -7400 124641 28407 -88877 -62463 10781 -186516 -253476 -113881 65621 174691 23571
13950 23571 -187586 -277056 -71012 18351 136749 145267 -30891 119889 207421 37380 -20821
13939b0821m6132p4883J55768j32593j30443L0406K26143p5203m7075j5741q7588
13928b18162P80l3668p9750m6829J52283L6870m1747J25341J78773m0806J1571
13917D4656q7065j76380k69643l294K65975R0302J793K8014J82001J6231o7149
13906B5441j27463j35480j7839J33528m188j23713M0703P7399P1661p0188q2684
13895b12823J55048J82457M5988m1788j4511J16107q5831j42645O9656K0669q7465
13884D862j34406Q8604P5532n5485q7569j9126P2370l3888J18393J0121j22064
13873h2656m6135P3954J15783q8832m7523K21420L2495r1732q9304l794O4820
13862E8496J42042K711J68267j1319q0814j02690j18259O4783j41553Q2541k5832
$$ plain form
13939 -20821 -66953 -141836 13932 -118661 -249104 -218698 7445 -67758 -114833 -130574 -218162
13928 -218162 -217382 -251050 -330800 -377629 -225346 -188476 -230223 -104882 73891 33085 44656
13917 44656 -42409 -218789 -488432 -491726 -225751 -135449 -133656 -105642 76359 92590 25441
13906 25441 -102022 -237502 -255341 -121813 -126001 -249714 -209011 -131612 -59951 -130139 -212823
13895 -212823 -57775 124682 170670 128882 114371 230478 144647 2002 71658 92327 4862
13884 4862 -129544 -40940 34592 -20893 -108462 -127588 -55218 -89106 29287 39408 -82656
13873 -82656 -128791 -54837 60946 -27886 -75409 146011 178506 86774 -2530 -6324 58496
13862 58496 200538 203249 371516 360197 279383 176693 58434 123217 -18336 64205 38373
13851C8373j72379o3302q060J10377l2761j862n9853K2217j6836K21075M3834
13840H0823j08017j9105m2569k27002O3752J45268m6780O0918M0941K8603J23849
13829A00681n315K5596j22558K2608J94626J52985j74716r7023r2344O5848O3851
13818A34239k42975M4584J97413J20265J46538p2073o3229j87978n6352j58125
13808a37693q4699N3778L0131j60713J26834J97141K61869P3946k94655q5265
13798a9326j1388L9200J65152p240j66037K9464K9527k77517l7601q4489r3618
13787d33873J24428J35228J03190J31087j19098j84098o8893R939p4750J58404
13777b18436K68523O2331N1425j36513j47986K63823J63499O2617p7916r7914
$$ plain form
13851 38373 -134006 -197308 -205368 -94991 -127752 -129614 -189467 -167250 -184086 36989 80823
13840 80823 -27194 -46299 -88868 -315870 -252118 -106850 -153630 -92712 -51771 -23168 100681
13829 100681 95366 120962 -1596 21012 215638 368623 193907 96884 4540 70388 134239
13818 134239 -108736 -64152 133261 253526 400064 327991 264762 76784 20432 -137693
13808 -137693 -222392 -168614 -138483 -299196 -172362 24779 286648 360594 65939 -19326
13798 -19326 -30714 8486 173638 166398 361 29825 59352 -218165 -255766 -340255 -433873
13787 -433873 -309445 -174217 -71027 60060 -59038 -243136 -312029 -302090 -376840 -218436
13777 -218436 50087 112418 163843 27330 -120656 143167 306666 369283 291367 193453
13767A93453j01914j25578q9860J9101J64304J01822P9991l7817j65885l6499
13757A118J2797J63430m7920j35493j28469r112J48090P1575J44245J773j26971
13746I5063j02844j4719P9965r436o4290k03486j92698m8265J32315K88375N9184
13735A9164q0463k8237n5384R6671j5627R4755J61325R2313l4867l7921R221p5560
13723A45390j24821m0643l3901R0769L4235m2513L8421m9211L2540J5031k08117
13712a42820P3376J20206k99970j47573J84587K9482R0683O5232l1945j2398J88382
13701A17242j2344j34123J2679r4336q8900j08195j09268K58108K01797R5337
13691A37997o5933J1580O3664j31708m7628P8024k6634j85430n304J52430O467
$$ plain form
13767 193453 91539 -34039 -123899 -104798 59506 161328 241319 203502 37617 1118
13757 1118 13915 177345 129425 -6068 -134537 -143649 4441 76016 220261 222034 95063
13746 95063 -7781 -22500 57465 48029 -16261 -219747 -412445 -460710 -328395 -40020 19164
13735 19164 -61299 -89536 -144920 -48249 -63876 30879 192204 284517 249650 211729 220950 145390
13723 145390 20569 -20074 -53975 36794 71029 28516 66937 17726 50266 65297 -142820
13712 -142820 -69444 50762 -249208 -396781 -212194 -182712 -92029 -26797 -58742 -71140 117242
13701 117242 104898 -29225 -16546 -110882 -199782 -307977 -417245 -159137 42660 137997
13691 137997 72064 83644 147308 15600 -32028 45996 19362 -166068 -171372 -18942 -12475
13680a2475p9364j31937N5498J81358R4869O9251r2889m1325O5125n6405q6531
13669c4825J8108P6556p6057Q1679j50234m2205O9453J55460M205m7496J34998
13658A89642L2053k63282n3530Q56j5607p1919m3492K03871K64054l5322q6138
13647A21186j41315J2758M2274j2435q7697r1471J06386M5848m8628R0114q8396
13636e1376l6127R7158J10081Q9192j57352r2548q5550p1684J45369J00062o1423
13625a4198r4589K17280J01510r2058r0186r3184K143o0770K06192J18733j85805
13614A5068l4387J34781J34777j2036N035j24302j15259r1465Q1741J60867J24941
13603B79761l4761j46578j82381O7738J34964O0658J23119J44600j25483j90355
$$ plain form
13680 -12475 -91839 -223776 -168278 13080 107949 177200 84311 42986 108111 51706 -34825
13669 -34825 -16717 59839 -16218 65461 -84773 -126978 -57525 97935 102140 54644 189642
13658 189642 221695 -41587 -95117 -94261 -109868 -181787 -225279 -21408 242646 207324 121186
13647 121186 -20129 -7371 34903 22468 -65229 -156700 -50314 -4466 -53094 37020 -51376
13636 -51376 -87503 9655 119736 208928 51576 -40972 -126522 -198206 -52837 47225 -14198
13625 -14198 -108787 108493 210003 117945 27759 -65425 -63282 -124052 82140 200873 15068
13614 15068 -19319 115462 250239 238203 243238 118936 3677 -87788 -6047 154820 279761
13603 279761 245000 98422 -83959 -16221 118743 179401 302520 447120 321637 131282
13593A31282J614l2570O7896M5637j13423o4046N5376n0727j18639r6614O7207
13582a07007J06357R9815K3846j24906Q9359N7530J04800k63394q4662n5695m46
13571a54403p2933j3301R8302N4983N7777R5374O6257Q7913j7497J27466J92183
13560E22121j54257k81854k18662M3894L21878O6695R485N1281p3601N8417J1917
13549C57314k65575j83585J31593N5348o6373r4322P1198R3809J22583j88273
13539C3717j18794R1891l6467J5602n0878L3959Q477J10631J48429j75562n4396
13528F609n1299j680P6433k9944L3696q3277M7430K32704M518N8054J1503m9497
13516B55250m8307m3850m9741J11331L9693K740m6593N9100n8947l5860k9831
$$ plain form
13593 131282 132896 100326 168222 213859 100436 36390 91766 41039 -77600 -174214 -107007
13582 -107007 -650 99165 123011 -1895 87464 144994 249794 -13600 -98262 -153957 -154403
13571 -154403 -227336 -240637 -142335 -87352 -29575 65799 132056 219969 202472 329938 522121
13560 522121 367864 86010 -132652 -88758 233120 299815 309300 360581 286980 345397 357314
13549 357314 91739 -91846 39747 95095 28722 -65600 5598 99407 221990 33717
13539 33717 -85077 6814 -29653 -14051 -64929 -30970 -22493 88138 236567 61005 6609
13528 6609 -44690 -46370 30063 119 33815 -49462 -2032 230672 235190 293244 304747 255250
13516 255250 206943 163093 113352 224683 264376 267116 220523 279623 220676 184816 154985
13505A54985j55964P7336J04145k8240J12172j51989j14527o0066J17400J46821
13495B02073l4976j48739r4578O7166J77012O2464J334j23355p5490P0401O6554
13484A69866j9988l0477j17318n9086m2850k4456L5614O608O2810j21142K4885
13473a15534j2294L6974P0622K3032j7905P2112m286j4693p5688k0205R0623M0832
13461G3590k01390j5056J21088k4642q5795L7177n839K20533p0769k32578O6650
13450a17031q0703j25647N7814P2274j0880M2029K379K52996J34511M781j192
13439B31331P2504j05129k34133J47616J80455j14746j55996j5342l9516P9644
13429D6688M6199p812O8276K9504J2693l7647j40593N6999K4682O9468Q2276q981
$$ plain form
13505 154985 -979 76357 180502 152262 264434 112445 -2082 -62148 55252 202073
13495 202073 167097 18358 -76220 -9054 167958 230422 231756 108401 32911 103312 169866
13484 169866 149878 119401 2083 -57003 -99853 -124309 -88695 -82087 -19277 -140419 -115534
13473 -115534 -127828 -90854 -20232 2800 -15105 57007 52721 38028 -37660 -57865 32758 73590
13461 73590 -127800 -142856 -21768 -46410 -132205 -95028 -100867 119666 48897 -183681 -117031
13450 -117031 -197734 -323381 -265567 -193293 -204173 -162144 -159765 93231 227742 232523 231331
13439 231331 303835 198706 -35427 112189 292644 177898 21902 6560 -32956 46688
13429 46688 92887 85075 153351 182855 195548 157901 17308 74307 98989 168457 250733 241752
13417B41752j24012o868r6217l2107J65321j19188j34896j07331l8305K16672
13407c5179J26385N9289j36291O2116J5662n9557j25193M3790J80948K32071j2243
13396C51798j58299j98315n8826N9591J93967o140P1012k0354l8519j39685j29214
13385g2984p0338J9944O8024O0308j0648Q4883J47484k327K8383J39636J20062
13374E12427j28164n3992k45428k57542m5156o2668K4089J72049L0974j8024j00290
13363a71725o2881N9584Q2308j40532J974R3371l100O6298j4120K0873J55127
13352H7177P1958J42905J68679J96611j40434m9843P0302J51986K60272J07142
13342A066755n7928K34230J66111l07407k77039k52698n9957q2122o3227r8091
$$ plain form
13417 241752 117740 110872 14655 -17452 147869 28681 -106215 -213546 -251851 -35179
13407 -35179 91206 150495 14204 76320 91982 32425 -92768 -48978 131970 364041 351798
13396 351798 193499 -4816 -63642 -4051 189916 183776 254788 234434 195915 56230 -72984
13385 -72984 -143322 -123378 -55354 4954 -5694 79189 226673 224346 252729 392365 512427
13374 512427 384263 330271 84843 -172699 -217855 -280523 -256434 -84385 -53411 -71435 -171725
13363 -171725 -234606 -175022 -92714 -233246 -231272 -137901 -141001 -74703 -88823 -67950 87177
13352 87177 159135 302040 470719 667330 526896 477053 547355 699341 959613 1066755
13342 1066755 1008827 1243057 1409168 1101761 824722 572024 512067 429945 366718 268627
13332B68627l1761L6217N4467o3306k8948K6819q1925j33475j79149o400J41829
13321B995K07544l3493j19445m3987m7847J29257J5738n2248o2535l9536l2333
13310g5890k8005l4402L5406J42115R1337m0343n7423r190L0939J24733J3128
13299A92405j01706Q6165k32531j23900J11000O8043M1939J12602N8577q6747
13289A25847j08060r4407j05350n062J73620J92j42273N5487L394p9176N2115
13278a23673j56698p9450M7748J01904J84107J63384q6378r5324J75540J8674
13268A49834q2470k15398j49036K04381J77287J65762o1806p2399j10122J72770
13258A78803J24855K1951j67353n7287j228j0062k9624j02502j85225Q1501J13782
$$ plain form
13332 268627 236866 273083 327550 264244 235296 262115 180190 46715 -132434 -138834 2995
13321 2995 210539 177046 57601 13614 -34233 95024 110762 58514 -4021 -43557 -75890
13310 -75890 -103895 -138297 -102891 39224 130561 90218 32795 23605 54544 179277 192405
13299 192405 90699 176864 -55667 -179567 -68567 -524 41415 154017 212594 125847
13289 125847 17787 -76620 -181970 -187032 -13412 -13220 -155493 -100006 -96612 -175788 -123673
13278 -123673 -280371 -359821 -312073 -210169 -26062 137322 50944 -44380 131160 149834
13268 149834 67364 -148034 -297070 -92689 84598 250360 188554 116155 6033 178803
13258 178803 303658 325609 158256 100969 99741 89679 60055 -42447 -227672 -146171 -32389
13247c2389q4010j6562K39276J81926O0734J7442j37338q0036K23295o089j74597
13236A91652q4608o6785k2302K38189K09397j57296j62534m9551n774J39819J7934
13225B48141J23614j4319j31101r4178J6004J8298M6776j54224k6410L7666q0462
13214a0195j07116K8414J21800J25639Q897K9665k6836N9241J36214R363j89385
13203A85701k45775k81778l8055L39645N8120r1448K7828K9417k9044J20405M8783
13192A23799j30512K901o8135L7658R383J01534R8866k29091l2850J32579J54720
13181B00852J5896j04091k41058K01585M16389M5673m2377k28558k65762l5864
13171c7315J0307j9520K37902r1092j29802J83247k4735j55612l6054j68586n8113
$$ plain form
13247 -32389 -116399 -132961 106315 288241 348975 366417 229079 149043 372338 366249 191652
13236 191652 107044 40259 17957 256146 465543 308247 145713 96162 90388 230207 248141
13225 248141 371755 357436 226335 132157 148161 166459 213235 59011 32601 70267 -10195
13214 -10195 -117311 -88897 32903 158542 167439 197104 170268 229509 365723 375086 185701
13203 185701 -60074 -341852 -379907 -40262 17858 -73590 -45762 -16345 -45389 75016 123799
13192 123799 -6713 -3812 -71947 -34289 -24906 76628 175494 -53597 -86447 46132 200852
13181 200852 216748 112657 -128401 73184 489573 535246 492869 264311 -1451 -37315
13171 -37315 -27008 -46528 191374 100282 -29520 153727 128992 -26620 -62674 -231260 -289373
13160b89373K17283P2663j43674J19729O9740q3921k3153n6702n7554J03567K51857
13149A80462K6480J0587P2890P4862k04136j22007M0667J69373Q838k27253j31577
13138a00814K4286o2252N0749P1749J88049Q3687M3045R4415k16445r2585l4025
13127D9859J97328J84761r3696r0018P198K1216m533j70626J4974J38295p7001
13116A77757j45541N3810J10342Q5628p3211j68021p9738J19406J97072p5262
13106B02242J6750J8380L1157J46623L9405R5631k24936k15971k7384m9209j35930
13095a03242k6175J43319M7356M7151J40754l312K8713p772j17905j64272Q6083
13084G0698J90149m150j86903J16072Q0381j56534n3705N1516j27420J15833J0582
$$ plain form
13160 -289373 -72090 573 -143101 -23372 46368 -37553 -60706 -117408 -174962 -71395 180462
13149 180462 206942 217529 290419 365281 161145 39138 79805 249178 258016 30763 -100814
13138 -100814 -76528 -138780 -88031 -16282 171767 255454 298499 392914 176469 83884 49859
13127 49859 247187 431948 338252 248234 255432 276648 272115 101489 116463 254758 177757
13116 177757 32216 86026 196368 281996 208785 40764 -38974 80432 277504 202242
13106 202242 218992 237372 268529 415152 454557 550188 325252 109281 81897 32688 -103242
13095 -103242 -129417 13902 61258 108409 249163 245851 274564 266792 148887 -15385 70698
13084 70698 260847 256697 69794 185866 266247 109713 56008 107524 -19896 95937 106519
13073A06519P376j9111j86746Q6744P1908k5330j1193M8282M937p7781j13288
13062a07683M7188K91165J17404n3061O1816j24209j12398r6374j04092o280j71536
13051b58060J7954J94901J88812L1806N883P0907n1774j78908j29506J5334R258
13040h3393J5633J37024P0318n5941r1666K0518O8398j39620N1049O7424L0524
13029I0268m0244M2560q4105J02262J10820J81543j00325r7738j99252M2704L11101
13018C59594N3109j5197O7209j61007j70804M7773J66983n4128l7607P016j7106
13007B45835j652k2339K4540j24319j33891l5851J990M5432K61654l1615j620
12996B28164J73907M066Q1489q560j31058R6392O4087J55134L0397r4951k02787
$$ plain form
13073 106519 113895 94784 -91962 -5218 66690 41360 30167 78449 83386 5605 -107683
13062 -107683 -60495 230670 348074 295013 356829 232620 120222 23848 -80244 -86524 -258060
13051 -258060 -240106 -45205 143607 175413 181296 252203 200429 21521 -107985 -92651 -83393
13040 -83393 -67760 69264 139582 83641 -8025 12493 80891 -58729 -7680 59744 90268
13029 90268 50024 92584 8479 110741 221561 403104 302779 205041 5789 48493 359594
13018 359594 412703 397506 464715 303708 132904 180677 347660 293532 255925 262941 245835
13007 245835 244183 221844 246384 122065 -11826 -47677 -45687 -255 261399 229784 228164
12996 228164 402071 406137 487626 479066 348008 444400 508487 663621 694018 599067 396280
12985C96280k70642k57121j07952J57217J45716J72450q8435P416M6442P7393
12975B78764m0445k37611J15342l3993m2135J29139O8617N5977O133p3036k2476
12964B04276J32725J14393k02378O9175j90848j06834J82347J43490R4218l8301
12954D02263l0347k3082N6964Q353J24931J23068Q315p9777K6826k1582K979j22251
12942D76660k5522L869J25820k4683M7103J41929M5182R8392J50035P3918k70983
12931H41720K8675J34377P8021J13695q0627J0556J87386J56107N1921K2652j52459
12920A392024J57480J07966L2538J3003M1483n984J2660J97826M28989K26252
12910B604237J62554L64619R2469M3697J19765J43375L86950M71989L54091M44654
$$ plain form
12985 396280 125638 -131483 -239435 -82218 63498 235948 147513 154929 201371 278764
12975 278764 238319 708 116050 82057 39922 169061 237678 293655 299788 226752 204276
12964 204276 337001 451394 249016 318191 127343 20509 202856 346346 440564 402263
12954 402263 371916 348834 405798 414151 539082 662150 670465 590688 617514 595932 598911 476660
12942 476660 451138 455007 580827 556144 603247 745176 790358 888750 1038785 1112703 841720
12931 841720 870395 1004772 1082793 1196488 1115861 1126417 1313803 1469910 1521831 1544483 1392024
12920 1392024 1549504 1657470 1690008 1703011 1744494 1738510 1751170 1948996 2377985 2604237
12910 2604237 2766791 3131410 3223879 3267576 3387341 3530716 3917666 4389655 4743746 5188400
12900E188400M68662P30381R17136J077349J231376J324066J478006J718885J843738
12891A5977999K376375L289466M449493N908341Q585418J2990825K0416561L0897820
12883A04892298L9244260L4404055J8595224J2230006J8834479K6374367J0232271
12876B64806960m9131017o7484353m4466135k5734612j5322965r862891o870065
12869D5934922n167099m067487l189552k319833k217839k170415j842787j549588
12861B3410322j267325r63463j014618j053425o44391n80490n87358n87495n96172
12852A6115585q99566o89846n04366m69839l32348l52980n15896k53897l18911
12843A1777936j54090j75357j33862K1088r1769p8289l56797m29571r8919k88045
$$ plain form
12900 5188400 5657062 6387443 7304579 8381928 9613304 10937370 12415376 14134261 15977999
12891 15977999 18354374 21643840 26093333 32001674 40587092 53577917 73994478 104892298
12883 104892298 144136558 178540613 197135837 209365843 228200322 254574689 264806960
12876 264806960 215675943 148191590 103725455 77990843 62667878 52804987 45934922
12869 45934922 40767823 36700336 33510784 31190951 28973112 26802697 24959910 23410322
12861 23410322 22142997 21179534 20164916 19111491 18467100 17886610 17299252 16711757 16115585
12852 16115585 15216019 14526173 14021807 13551968 13219620 12866640 12350744 12096847 11777936
12843 11777936 11623846 11448489 11314627 11335715 11243946 11165657 10808860 10379289 10280370 9992325
12833I992325o85276m01903j80650j37108l00948q7018k49510m39531m5269J42519
12823G607631k40790j78214k69874l13152j67772j770l2584l36629j63718m6916
12813E856212j23944k42793l26036j37254N7489j59425k96024o2562j05673j00331
12803D359659o3270p3049M555j01997k69228j32868J76005J09894l56952l17603
12793C335146r2046J25456m8454j82792n5287J8357j57073J034p2696M3912M4064
12782B959621k28619p1129M2693J2917k8778j62152r8211j03039J49780J28291
12772B601374m912K557k30013j88631p1340p3401J5501j1937O5389J2186q4801
12761B031972J71320p8037o3262Q2141j96421l3891j02179j10385J10383m1041
$$ plain form
12833 9992325 9307049 8905146 8724496 8587388 8286440 8199422 7949912 7510381 7465112 7607631
12823 7607631 7366841 7188627 6918753 6605601 6437829 6436059 6403475 6066846 5903128 5856212
12813 5856212 5732268 5489475 5163439 5026185 5083674 4924249 4628225 4565663 4459990 4359659
12803 4359659 4296389 4223340 4227895 4125898 3856670 3723802 3899807 4009701 3652749 3335146
12793 3335146 3243100 3368556 3320102 3137310 3082023 3100380 2943307 2944341 2871645 2915557 2959621
12782 2959621 2731002 2659873 2702566 2715483 2686705 2524553 2426342 2323303 2473083 2601374
12772 2601374 2596462 2599019 2369006 2180375 2109035 2035634 2051135 2039198 2104587 2116773 2031972
12761 2031972 2203292 2125255 2061993 2144134 1947713 1913822 1811643 1701258 1811641 1770600
12751A770600j87321j1894J61390J61975k04032j79325k0929J89845o7430j89144
12741A423735k7033J40305j2002J16135L3994k1080N2896o5770j03852j30176
12731A407152p3300O4127R9168r9298n6774J4631K08898J65228m9812j8599J98976
12720A860397k09j81521j15300q6163k48615p3133J08698J9236M0459J1636j11486
12709A223999k72754j51123K991l061q5977l7047R1120J9760J5039J00736J56114
12698A059797n1600j4248M7925l1551L3939n9637J7137j71890J17606J49125k2939
12687A073664k18670m1374q2169q8103J10036J28841j43817l2495k02693p0833
12677D32387J4120P5775J47906J3300j25362M3268O9296J09969J19493p9489J7968
$$ plain form
12751 1770600 1583279 1571385 1732775 1894750 1690718 1511393 1490464 1680309 1612879 1423735
12741 1423735 1396702 1537007 1525005 1641140 1675134 1654054 1706950 1641180 1537328 1407152
12731 1407152 1333852 1397979 1497147 1397849 1341075 1355706 1564604 1729832 1680020 1661421 1860397
12720 1860397 1860188 1678667 1563367 1477204 1228589 1155456 1264154 1283390 1323849 1335485 1223999
12709 1223999 951245 800122 803113 800052 714075 677028 768148 787908 802947 903683 1059797
12698 1059797 1008197 993949 1041874 1010323 1044262 984625 1001762 829872 947478 1096603 1073664
12687 1073664 854994 813620 731451 643348 753384 882225 738408 705913 503220 432387
12677 432387 446507 522282 670188 683488 558126 601394 670690 780659 900152 820663 838631
12666H38631j13584K5908l9382P431J32566j41726n2016r0711p7229j08078J11833
12655D93643P4519r4582j46267j85172N6544N2830r8179K33286L26443p235n7377
12644F48453l8026j38529j27515P3329n717q9327r9581J57668P7969J43771J1378
12633F13873M9422r6056j40171m4542m778J13857K6898q1395J21168K7110l62564
12622B22822j88607J17510J72923j67588O0077L29771N507j54637j02214J38235
12612D33799j08451k6833K2891k24465k05919J5188L25349K5506j16687j868M236
12601A42746J79178J15382L3733q7361N5288r6073n3026l4321j5838P1534O6011
12590C77253j36040o5337J8762J2181P0476j26608m6073n3018K4863n9287j19284
$$ plain form
12666 838631 725047 750955 711573 719004 851570 709844 657828 567117 489888 381810 493643
12655 493643 568162 473580 327313 142141 198685 251515 153336 386622 713065 705830 648453
12644 648453 610427 471898 344383 417712 411995 322668 223087 380755 458724 602495 613873
12633 613873 663295 567239 427068 382526 377748 491605 518503 437108 558276 585386 222822
12622 222822 34215 151725 324648 157060 217137 546908 552415 397778 295564 433799
12612 433799 325348 298515 321406 96941 -108978 -93790 231559 257065 140378 138510 142746
12601 142746 321924 437306 471039 383678 438966 342893 289867 255546 239708 311242 377253
12590 377253 241213 175876 194638 206819 277295 150687 104614 51596 76459 17172 -102112
12579a02112o746m6254j37158J96487K19154R632j7573R4551j45559m5656k3413
12568d647o5346J39899m260J6381P4006J45251K6309k20106R0733J40410j41043
12557A97587R521J14284j6931j1245j74873j38607o1742P9194L1671M1943j07741
12546c6939P0434q2050M0099J96573J3440n9791m0669j29736j18249j02375R397
12535b39866Q3324j0175k2836J08479J38921J1695j92398l6958l9691K0892K12432
12524C3819l7969j86257k8403k109j36226J13904k965j6233j5621J02156J77598
12513A694L7210k4299l9348J33638R9506J31797j05154k188o2434J49739J12806
12502D32967l1493j61838J17290k3985j10395K0777r1430K6844J1305l6540m7546
$$ plain form
12579 -102112 -108858 -155112 -292270 -95783 123371 133003 115430 209981 64422 18766 -4647
12568 -4647 -69993 69906 65646 82027 156033 301284 327593 107487 198220 338630 197587
12557 197587 207108 321392 304461 293216 118343 -20264 -82006 -2812 28859 70802 -36939
12546 -36939 33495 -48555 -8456 188117 201557 141766 101097 -28639 -146888 -249263 -239866
12535 -239866 -156542 -166717 -189553 -81074 57847 69542 -122856 -159814 -199505 -178613 33819
12524 33819 -4150 -190407 -218810 -220919 -357145 -243241 -246206 -262439 -278060 -175904 1694
12513 1694 38904 14605 -24743 108895 208401 340198 235044 232856 170422 320161 432967
12502 432967 401474 239636 356926 332941 222546 243323 151893 178737 190042 153502 105956
12491A05956M7909p1059r2309L4842J7571J25272J90539N7634k68564l93939k16773
12480d62921K8090J08120J8581R1000Q9245r0383N8837K30024q1251M1691L9687
12469G0720j19178j12593j51562j42981J45994J70389J45651J08984k0003m1352
12459E4069o2098k9310j12168j22989K94042K00157o9187k11505J1551J80023
12449A32585L8704R1758L0106r3450j34461L6764O5042j66078j82585K1487J67140
12438G012j4138P5059j8284p4147O3337o0748q0319m9881m3797L2772K43603J02518
12426A82987n6132Q4610L5367j09411j10183o4165K28388K67198j1195J5284N3136
12415E15884J96621N071j02682J03227K16648J55559p0845J65795K16127l6390
$$ plain form
12491 105956 153865 82806 -9503 25339 42910 168182 358721 416355 147791 -246148 -462921
12480 -462921 -434831 -326711 -308130 -217130 -127885 -218268 -159431 70593 -10658 31033 70720
12469 70720 -48458 -161051 -312613 -455594 -309600 -139211 6440 115424 95421 54069
12459 54069 -8029 -37339 -149507 -272496 21546 221703 152516 -58989 -47438 132585
12449 132585 171289 263047 293153 199703 65242 102006 167048 970 -181615 -160128 7012
12438 7012 -7126 67933 49649 -24498 38839 -21909 -102228 -152109 -195906 -163134 80469 182987
12426 182987 126855 211465 246832 137421 27238 -36927 191461 458659 447464 462748 515884
12415 515884 712505 717576 614894 718121 934769 1090328 1019483 1185278 1401405 1365015
12405A365015l50527k48567k9064j40657k34952r4140J05730J1113n5779j41134
12395A87038k33511n3288J64071J45645J50641J14242o7605l7982j7652j84362
12385A67237o2720m9421J95899N3945j34754j85724o1491J6976P463p9296J18420
12374a3466O1938k5534K6392L0729N561m8612j63194R3940j30950j2115J86382
12363A1071J55667J06575q6163o8440l9302j81877j29579K38089Q3138j07204
12353a8025j19040o3755J78751r578J65006N145L9934J01539o3778p0555l5265
12342A10379j12728k09987J8609J67597J72l0750L01610j6214o5471k36172L8220
12331c4735N5079j08766o3982O2096J10735J38262j10037p4172J08317m2381j47783
$$ plain form
12405 1365015 1014488 765921 736857 596200 361248 267108 372838 383951 328172 187038
12395 187038 -46473 -99761 64310 209955 360596 474838 407233 369251 351599 167237
12385 167237 104517 55096 250995 304940 170186 -15538 -77029 -60053 -52590 -131886 -13466
12374 -13466 48472 22938 49330 80059 85620 37008 -126186 -32246 -163196 -175311 11071
12363 11071 166738 273313 187150 118710 79408 -102469 -232048 6041 89179 -18025
12353 -18025 -137065 -200820 -22069 -31647 133359 138504 178438 279977 216199 145644 110379
12342 110379 -2349 -212336 -193727 -26130 -25958 -56708 244902 228688 163217 -72955 -34735
12331 -34735 20344 -88422 -152404 -90308 20427 158689 48652 -25520 82797 40416 -107367
12320a07367k5250J07228M7566q536J44936k02114k09324K6213M2506J33226l5538
12309h6454R6872R5598p8951L1819J35585j32702R076R3549J60784p9354k84811
12298c8989k10746k3732N9412J33470J98320k7345J57036L8984j28253o0492j94728
12287i7063p6407J481R0902P5814K20476O5306j7025j69827j22422j42659n7675
12276b29099J5098J07627j2142J39003k3196j06626j22061P2327J44148Q0233
12266F5312q8392q8510Q3655N1718J42007P6654K3458j33129j89307J9470M7480
12255A0416J03702J015J01055j05549k37836q887K01793j41715J7912K15060m2825
12244A14141n6503r7846K2618J37370j14692n7513o6189O9472m2601j6446Q5772
$$ plain form
12320 -107367 -132617 -25389 22177 13641 158577 -43537 -252861 -226648 -184142 -50916 -86454
12309 -86454 10418 106016 27065 58884 194469 61767 70843 164392 325176 245822 -38989
12298 -38989 -249735 -273467 -214055 -80585 117735 90390 247426 286410 158157 97665 -97063
12287 -97063 -173470 -171989 -81087 -5273 215203 280509 263484 93657 -28765 -171424 -229099
12276 -229099 -214001 -106374 -118516 20487 -2709 -109335 -231396 -159069 -14921 65312
12266 65312 -23080 -111590 -27935 23783 165790 242444 265902 132773 -56534 -37064 10416
12255 10416 114118 115133 216188 110639 -127197 -136084 65709 -76006 -58094 156966 114141
12244 114141 57638 -40208 -17590 119780 5088 -52425 -118614 -49142 -91743 -108189 -22417
12233b2417K640r4442M0800J70885j06686j21201j1654r7042r0203Q0310m0432
12222b89442L5774J99916j067m470m8004k2419j94017j9245J79796j53195j67220
12211d83593K15287P3340l3617J91886J74112o51j15572j8831N9860P2907L0025
12200A65153J2495l019j68825j30469n3p654K1572L5460P303j867J19267l5340
12188A4023O5167J08870j80326L9861K29962k6957n3267j7307m2758N9192P7230
12177B73690J666m2431K3278J10195N688n4621K1433J32573j93162J8818R6605
12166C93732n0416M0504P1270j04520q9024K87625l7621p2194P3775J6215N756
12155E35102O1088r91p0869O4093P7430j53944k37310q2199l6168P8713J48841
$$ plain form
12233 -22417 -19777 -114219 -73419 97466 -9220 -130421 -142075 -239117 -329320 -249010 -289442
12222 -289442 -253668 -53752 -54819 -59289 -107293 -129712 -323729 -342974 -163178 -316373 -483593
12211 -483593 -268306 -194966 -228583 -36697 137415 136764 21192 2361 62221 135128 165153
12200 165153 177648 174629 5804 -124665 -124718 -132372 -110800 -75340 -68037 -69904 49363 14023
12188 14023 79190 188060 7734 47595 277557 250600 197333 180026 137268 196460 273690
12177 273690 275356 232925 256203 366398 372086 317465 338898 471471 278309 297127 393732
12166 393732 343316 383820 455090 350570 261546 549171 511550 439356 513131 529346 535102
12155 535102 596190 595199 524330 588423 665853 511909 274599 192400 156232 234945 383786
12144C83786m7426j64011k09356O7288P3806O5884K17503N6319k0126K3324l335
12133D43656M8002J48579M5118K4549L2471j51522k06095j02939N655q9099r5871
12122A02504J32040J20090n7090j03069n1391j7716J19298n108j02688j24369
12112A2501j68709J20980J00689n0267l4539p0136k7143N048r9204J59849R4575
12101D3644p8668j62831k1072K04756J22736l3041q4557M2827J55618l1438j02927
12090E5047j35685R9479P4993o3741j30791P2067J74051J7773K556r3759P3457
12079A45447R5237j1657j35126o3240J1078K4525J7089j68059n2191M9620J3923
12068g3354n2819p2769K0855K28601L2595j32435n057l5650K4641r7722K2151
$$ plain form
12144 383786 336360 172349 -37007 30281 104087 169971 387474 443793 423667 446991 443656
12133 443656 491658 640237 685355 709904 742375 590853 384758 281819 287474 198375 102504
12122 102504 234544 354634 297544 194475 143084 125368 244666 239558 136870 12501
12112 12501 -156208 -35228 65461 15194 -19345 -89481 -116624 -111576 -210780 -50931 43644
12101 43644 -35024 -197855 -218927 -14171 108565 75524 -9033 33794 189412 157974 55047
12090 55047 -80638 18841 93834 30093 -100698 -28631 145420 163193 165749 71990 145447
12079 145447 240684 229027 93901 30661 41739 66264 83353 -84706 -136897 -87277 -73354
12068 -73354 -126173 -198942 -178087 50514 83109 -49326 -54383 -90033 -65392 -163114 -140963
12057a40963j36267J06007l5063Q5091j9296J6966P9372R1326o5757P5035Q9577
12046A46028M3568J1675k41380j67839J78150J58952K9758n1303j01603p7384
12036g1378J5975J54908o7982p1880p6843J05163M8197j5212j34058p8025n7046
12025b48181J11448L05148m5227p9363q2359j17611J05572J65342J3340N5238
12015A83347R156n7550j14485k5672o4162J18727N5588N5928J1926Q7038j88281
12004G1560k15750P0605M0163L3741j1829j27363J5756O7280J6377j55985q781
11993b04226o593R1537j07331j36348P3207K63559N1011r1745o8723R0831Q2842
11982C8021J02552P644J78346o4526k03733j23268m8800P7904Q1221j88312j52895
$$ plain form
12057 -140963 -277230 -171223 -206286 -121195 -140491 -123525 -44153 47173 -18584 56451 146028
12046 146028 189596 201271 -40109 -207948 -29798 129154 158912 107609 6006 -71378
12036 -71378 -55403 99505 31523 -40357 -117200 -12037 36160 20948 -113110 -191135 -248181
12025 -248181 -136733 168415 123188 43825 -38534 -156145 -50573 114769 128109 183347
12015 183347 192503 134953 20468 -5204 -69366 49361 104949 160877 172803 259841 71560
12004 71560 -144190 -73585 -33422 319 -11510 -138873 -123117 -55837 -39460 -195445 -204226
11993 -204226 -210819 -119282 -226613 -362961 -289754 -26195 24816 -66929 -135652 -44821 38021
11982 38021 140573 148217 326563 262037 58304 -64964 -113764 -35860 45361 -142951 -295846
11971b95846J07428J69895M9988O0279J5873j63361k4027m6108o7102p4912N6013
11960b11880L04460J14038j4351J3916p2821k04794J7961P8835p7146M775P1487
11949B4480R681r2495n5077j54149l9660K29254l4241o8459J12670K56173n0555
11938A37622R4694m9185k08690r2976j49757L0489N9632Q1471m486n7360r835
11927a68381K31047O2691k35890o7703J3116k437K5596r6104M9344J14922M0411
11916c3388p2943O3570N1356p3036k8371K229K837o868M8252n8903q434J04875
11904h824m7746R7077l564l0211o5551J33521R4275q7792j59619p978O1535J9191
11892e686K1399p7283Q241L4518q2195O1387j03625m4736J28824J22865J79637
$$ plain form
11971 -295846 -188418 -18523 31465 91744 107617 -55744 -79771 -125879 -192981 -267893 -211880
11960 -211880 92580 206618 192267 206183 133362 -71432 -53471 25364 -51782 -47007 24480
11949 24480 34161 -58334 -113411 -267560 -307220 -77966 -112207 -180666 -67996 188177 137622
11938 137622 232316 183131 -25559 -118535 -268292 -237803 -178171 -96700 -101186 -158546 -168381
11927 -168381 62666 125357 -110533 -178236 -165120 -167557 -141961 -238065 -188721 -73799 -33388
11916 -33388 -106331 -42761 8595 -64441 -92812 -90583 -87746 -94614 -46362 -105265 -113699 -8824
11904 -8824 -56570 40507 36943 6732 -58819 74702 168977 81185 -78434 -86412 -24877 -5686
11892 -5686 15713 -61570 -53329 -18811 -101006 -39619 -143244 -187980 -59156 63709 243346
11881B43346j01718j15060M0442N7063J95676j19370k71958j3196J32261j04950
11871e7464p9439j1145P9138L5030J07542R0648o3872q1185m1359k13129l4046
11860b69281M4472J02520p373r8995n5728N9557n1358J20980N7573o8606l4266
11849b00505J00332P6627J8803J29348n3070j2827N587p6435j62658O7962Q7039
11838a9797K96803j1721k14687j59618l5915k3570n804Q3108K07577R987l8915
11827H7448M6436j7151k07837j53461j38139k9796J57039K05091p951P9309P6944
11816I7932P1432j45948o7288m0025l6606Q7970J3542n6969L0746l7197k500o6117
11804a51028O2648J25918K0566M9452M5283l3265p3626M4844J80166R565q6326
$$ plain form
11881 243346 141628 26568 67010 124073 319749 200379 -71579 -84775 47486 -57464
11871 -57464 -136903 -148048 -68910 -33880 73662 164310 100438 19253 -22106 -235235 -269281
11860 -269281 -224809 -122289 -129662 -228657 -284385 -224828 -276186 -155206 -97633 -166239 -200505
11849 -200505 -100173 -23546 -4743 124605 71535 58708 64295 -12140 -174798 -106836 -19797
11838 -19797 277006 265285 50598 -109020 -144935 -168505 -174309 -91201 116376 126363 87448
11827 87448 133884 116733 -91104 -244565 -382704 -412500 -255461 -50370 -58321 20988 97932
11816 97932 169364 23416 -43872 -83897 -120503 -32533 -18991 -75960 -45214 -82411 -84911 -151028
11804 -151028 -88380 37538 58104 107556 152839 119574 45948 90792 270958 280523 194197
11793A94197m1998p0447j11442P6349J82330k7863j94005J5112m5251r9960r6228
11782b19206J69503Q124m7966M3887n3856o8280K6468J71647j26606j08821L2957
11771a72149j9944P6916p6191J15199m032j52342J9052K20210J73291q0786j11815
11760a2591l2029L6018J17738J57086j20958r1053L2324J3549p0822J2431J18212
11749A59905j22344r4063j41908q4848J73194R2955l3677P6027l4389K9708J14810
11738A35370J3357j19325Q5884N575p6185j30669j09314K6165m0395q1378N5254
11727b35661O0170o6254O7151J44517K1210J18301l6868k03191j92255J67152
11717a55728J29246P6577J637M3573j48207j14967j25234K29742P1173O663j2761
$$ plain form
11793 194197 152199 81752 -29690 46659 228989 201126 7121 22233 -23018 -122978 -219206
11782 -219206 -49703 -41579 -89545 -45658 -99514 -167794 -141326 30321 -96285 -205106 -172149
11771 -172149 -192093 -115177 -191368 -76169 -80201 -232543 -213491 6719 180010 99224 -12591
11760 -12591 -44620 -8602 109136 266222 145264 54211 86535 100084 29262 41693 159905
11749 159905 37561 -56502 -198410 -283258 -110064 -17109 -50786 25241 -9148 20560 135370
11738 135370 148727 29402 115286 120861 44676 -85993 -195307 -169142 -209537 -290915 -235661
11727 -235661 -175491 -241745 -174594 -30077 -8867 109434 72566 -130625 -322880 -155728
11717 -155728 -26482 50095 51732 95305 -52902 -167869 -293103 -63361 7812 14475 1714
11706A714j21113J3247P6880R6578p4273j27566L3409Q5448J21558q3496n5408
11695c3022r7538O4736L5426n985O6843j52947j38677P1106K10791M0828P549
11684F9110Q0086N3569R2656j72538k56173j9132j9348q3811J01160k4749N0335
11673a28835J4926O4773K0408J09258j41292j1820J23948L9015j12069m6559j6218
11662h4465r1389O7208k6857k5232L5444J40595p0160j17439Q838J52091j13483
11651a24849N8723P586J66865J38413j15276j84736j37734l0905J27980M1808
11641e2125J39289r0152q1357M0559J99292j1584j31752n9894M3066J60461j98094
11630d2291j61742o1409J5624j7737R388J82124L6595R1516M1013J74935j0091
$$ plain form
11706 1714 -119399 -106152 -29272 67306 -6967 -134533 -101124 -15676 105882 22386 -33022
11695 -33022 -130560 -65824 -30398 -36383 30460 -122487 -261164 -190058 20733 61561 69110
11684 69110 149196 202765 295421 122883 -133290 -152422 -171770 -255581 -154421 -179170 -128835
11673 -128835 -113909 -49136 -28728 80530 -60762 -72582 51366 90381 -21688 -68247 -84465
11662 -84465 -175854 -108646 -135503 -160735 -125291 15304 -54856 -172295 -163457 -11366 -124849
11651 -124849 -66126 -58540 108325 246738 131462 -53274 -191008 -221913 -93933 -52125
11641 -52125 87164 -2988 -84345 -43786 155506 143922 12170 -47724 -4658 155803 -42291
11630 -42291 -204033 -265442 -249818 -267555 -258167 -76043 -39448 52068 93081 268016 257925
11619B57925j1261k6266N0358j80040N9927j15439m0084m0499J28720N1107r8059
11608C6389O811K3078J56999k4873o6907J10792q915n7798j58782n677p0953J67257
11596A07421J0274j45234J46448L6689j90667j30886m2549K05747n5018q4181
11586a41956k7721M8042k412K19862k233j78684j6896J42311j09178j81509p4226
11575c24600R6927K9728J43495P549N6232K4661l2186R7460q3897p6980r021K36793
11563A66161J14365J26733p4850k15096l0371j34040j4036j16931q3200p2778
11553c34043j52634q1288J60699J63860K337O8884J93970M8350j39721L7337o505
11542c8754j15109Q013J58380K62564J18821j24609l3790j4111r3618l5385p5873
$$ plain form
11619 257925 246664 220398 270756 90716 150643 35204 -4880 -45379 83341 134448 36389
11608 36389 43200 66278 223277 198404 131497 242289 233374 175576 16794 11117 -59836 107421
11596 107421 117695 -27539 118909 155598 -35069 -165955 -208504 -2757 -57775 -141956
11586 -141956 -169677 -121635 -124047 95815 93582 -85102 -101998 40313 -68865 -250374 -324600
11575 -324600 -227673 -197945 -54450 -46901 9331 33992 1806 99266 15369 -61611 -70632 166161
11563 166161 280526 407259 332409 117313 86942 -47098 -61134 -178065 -261265 -334043
11553 -334043 -486677 -567965 -407266 -243406 -241069 -172185 21785 70135 -69586 -32249 -38754
11542 -38754 -153863 -145850 12530 275094 393915 269306 235516 221405 127787 92402 16529
11531A6529J5199j21862O0709j27067o4895N7425P4173L983J90878O3950J0323
11520A79345k5712j71177j54737P1327O5684P8433j660K9119j04871j88009m3534
11509b65792J41667J77942m1372r4053j85048J67206J12794L5701j96174j7998
11499a65127k09197j72371J18685J81049L0865J39953M5098l8147M660L3497N8572
11488B7537J05872N0508j68729j39599K7053J46635k3983k10052j1800Q8180k2255
11477a30633o2420N3528J96953K3931o6593j26941m3563P1478K40827O8391l2323
11466A92635m6137j03707N3710K8548N0509M7967j31151o526O5899q2166r2277
11455b2696O2368J22367K5829m3277j27283j05661N184k3732M7881q5973K6035
$$ plain form
11531 16529 31728 -90134 -29425 -156492 -221387 -163962 -89789 -85806 105072 169022 179345
11520 179345 153633 -17544 -172281 -100954 -35270 43163 41503 70622 -34249 -222258 -265792
11509 -265792 -124125 53817 12445 -81608 -266656 -99450 13344 49045 -147129 -165127
11499 -165127 -374324 -546695 -428010 -246961 -216096 -76143 -31045 -69192 -64532 -31035 27537
11488 27537 133409 183917 15188 -124411 -97358 49277 25294 -184758 -196558 -108378 -130633
11477 -130633 -193053 -139525 57428 81359 14766 -112175 -155738 -84260 156567 224958 192635
11466 192635 146498 42791 96501 125049 175558 223525 92374 85848 151747 69581 -22696
11455 -22696 39672 162039 187868 144591 17308 -88353 -83169 -106901 -59020 -144993 -118958
11444a18958J37143j02115K6548J04189j3951j10925j66789J04945Q5624j11154
11434a65443q8902p1365N2467k9215P8434Q7659j03295j27158Q9142O1117j315
11423b17874Q6373q0405K2223j07532P9022K79547j30677K4408L8033j41460O7929
11412h0413J61833P4479l0340n4535j27672m3481k197P9068J10867J07071n1620
11401A43060j77828K6356M4271P0372N3692o1712j22826M0639O5399K6762K2742
11390A30927k6007J86061L26230k0503j28505k35846o2464j5974o103k5303p5617
11379D6896K8740K3387L8237j37335P7137j2734M0342R7640o6949k3223k7535
11368H4603J3825j76511O9783j4100m9879p4554O0129O1932O7788j60044j02475
$$ plain form
11444 -118958 18185 -83930 -57382 46807 32856 -78069 -244858 -139913 -54289 -165443
11434 -165443 -254345 -325710 -273243 -302458 -224024 -136365 -239660 -366818 -277676 -216559 -217874
11423 -217874 -131501 -211906 -189683 -297215 -218193 61354 -69323 -44915 -6882 -148342 -80413
11412 -80413 81420 155899 125559 71024 -56648 -100129 -102326 -23258 87609 194680 143060
11401 143060 -34768 -8412 35859 106231 159923 98211 -24615 16024 81423 108185 130927
11390 130927 104920 290981 617211 596708 468203 232357 169893 153919 147816 122513 46896
11379 46896 75636 99023 137260 -75 77062 64328 104670 202310 135361 112138 84603
11368 84603 98428 -78083 -8300 -22400 -72279 -146833 -86704 -24772 43016 -117028 -219503
11357b19503j82216o0081J31463J53651J14568J31358J6990p4549j42947N7681
11347g3585N9364j1636q7554j30434k5561J02049Q9978N3452J17392o3787N6459
11336H6137K2001m277j86733j21969j2073J79062j2331j41358J79497l8850O7412
11325A6518j18967l8780o2245P4848m70n7250K4116L3284k0191J5509r0491J54463
11313f9656J94791l0620o0018M8833P89k30345l03320N007K21709J04327J3184
11302a05319J5515j8138p9890J25660N2030j28765m3574K5545Q4302q4998j70622
11291c28254M8460J23730J30971K00254K5122j5288j27089k29674q3121K7493
11281b27396J72914O6868o7652j36233j0149K61187M7996j61962p2169L0391k2424
$$ plain form
11357 -219503 -401719 -461800 -330337 -176686 -62118 69240 86230 11681 -131266 -73585
11347 -73585 -14221 -25857 -113411 -243845 -269406 -167357 -77379 -23927 93465 29678 86137
11336 86137 108138 103861 -82872 -204841 -216914 -37852 -50183 -191541 -12044 -50894 16518
11325 16518 -102449 -141229 -203474 -128626 -129096 -186346 -162230 -128946 -149137 -133628 -224119 -69656
11313 -69656 125135 94515 34497 83330 84119 -146226 -449546 -444539 -222830 -118503 -105319
11302 -105319 -89804 -107942 -187832 -62172 -10142 -138907 -182481 -156936 -72634 -157632 -328254
11291 -328254 -279794 -156064 -25093 175161 200283 184995 57906 -171768 -254889 -227396
11281 -227396 -54482 12386 -55266 -191499 -201648 59539 107535 -54427 -126596 -96205 -118629
11270a18629n2588l8502M7210J96760n7162q0419P0817J26929j5965k27273P7608
11259g1214J70019K3476k03422k01652m3094J84001O5141J5028N3191Q4287k21587
11248a45826o9471Q7291j06912q2194J52334j2435R7669o870R0437K29888J1062
11237B44973j8186k34789o1703J43256K3814o6782K1894j77503j33985R4280M3880
11226a20851Q9045j50585L4215J55564J17121j14493j6006L6041R9663n4009j62195
11215h6490m8618K4217o3944O9568L8356m7093m6399m9565J95897L17960p1339
11204B32550j98672l07892k24569J27875J47118P9504O7943O8122o0744j9877
11194h8642l7005j04385J88891R6223j36912j40759L455K4146M9879j02528K8523
$$ plain form
11270 -118629 -171217 -209719 -162509 34251 -22911 -103330 -32513 94416 78451 -148822 -71214
11259 -71214 98805 122281 -81141 -282793 -325887 -141886 -76745 -61717 -8526 75761 -145826
11248 -145826 -215297 -128006 -234918 -317112 -164778 -177213 -79544 -86414 4023 233911 244973
11237 244973 226787 -8002 -69705 73551 97365 30583 52477 -125026 -259011 -164731 -120851
11226 -120851 -31806 -182391 -148176 7388 124509 10016 -5990 30051 129714 75705 -86490
11215 -86490 -135108 -110891 -174835 -105267 -66911 -114004 -160403 -209968 -14071 303889 232550
11204 232550 33878 -274014 -498583 -370708 -223590 -144086 -76143 -8021 -68765 -88642
11194 -88642 -125647 -230032 -41141 55082 -81830 -222589 -219134 -194988 -145109 -247637 -219114
11183b19114j0934O1085R2399J08756k95835m9826K49795N20m4479M3638k5853
11172h9848j17656j93438Q8080K31141K1907J9261q090k8833R319l5068r6099
11161a99324j94104l8123K84417K57722J9895o2987j14126Q0881P5205q3952K1393
11150D6897j09634j83967N7190k7946J07931K95086M5042j10510n4686l9340j90907
11139a64844K8311Q7900j7593K8549k2972m5883k8969J37428J46334j15458k88396
11128b55593j73481J66424J97848j1954j71211r8272O6008l98M1425J11281P2108
11117e5815J08442l39j75562j50567P9726J80787j866j24125o6073n1685K7941
11106b29136K24829J48459Q5378j34021j2995N3532o6388N2646O4132k6847j38209
$$ plain form
11183 -219114 -230048 -168963 -76564 32192 -263643 -313469 -63674 -63154 -107633 -63995 -89848
11172 -89848 -207504 -400942 -312862 -81721 -59814 -40553 -48643 -77476 -68157 -103225 -199324
11161 -199324 -393428 -431551 -147134 110588 130483 67496 -46630 34251 109456 25504 46897
11150 46897 -62737 -246704 -189514 -217460 -109529 185557 230599 120089 65403 26063 -164844
11139 -164844 -136533 -48633 -66226 -37677 -60649 -106532 -135501 1927 148261 32803 -255593
11128 -255593 -429074 -262650 -64802 -76756 -247967 -346239 -280231 -280629 -239204 -127923 -55815
11117 -55815 52627 52288 -123274 -273841 -194115 -13328 -15194 -139319 -205392 -257077 -229136
11106 -229136 -4307 144152 229530 95509 82514 136046 69658 122304 186436 159589 21380
11095B1380q1635K004L9214m1009J31893o5569p7225j50392j70881K20846J47623
11084b3751j19318N9061J41118j13825j32326J02088Q905k6325R9381J11497J20347
11073B26852j28109l9116l0757J10236k3764Q1710r7209l162r3846p1670M7635
11062b1200J25529l8992N6167l9669k57225J6195L8493k4942J80167k4452j5137
11051e066M7053J58339R8626j05896k08670n2628J3979P8058J34049N9250j39249
11040G7845j05677r9378J01017Q8124n6783q2323p0031N405J14040o9924P328
11029i0357k31178L040K1315J72391K10982R979J16924n6201p5590j2123o5367
11018C815j00359q9357j40924o5383J51658J1373n8877M9781O2424J74592j09557
$$ plain form
11095 21380 -60255 -58251 -19037 -60046 71847 6278 -70947 -221339 -392220 -171374 -23751
11084 -23751 -143069 -84008 57110 -56715 -189041 -86953 -78048 -104373 -4992 106505 226852
11073 226852 98743 59627 28870 139106 115342 197052 99843 96681 2835 -68835 -21200
11062 -21200 104329 65337 121504 81835 -175390 -159195 -120702 -145644 34523 10071 -5066
11051 -5066 41987 200326 298952 193056 -15614 -68242 -54263 23795 157844 217094 77845
11040 77845 -27832 -127210 -26193 61931 5148 -77175 -147206 -141801 -27761 -97685 -90357
11029 -90357 -321535 -318495 -297180 -124789 86193 96172 213096 156895 81305 69182 3815
11018 3815 -96544 -185901 -326825 -392208 -240550 -229177 -288054 -238273 -175849 -1257 -110814
11007a10814k65015k14254m8363K52326K53267J12997K0867k0144o0774Q8658
10997H751o5094m0131j6691r9814l0465J15129Q7321N6912J50803J66126K494
10986C35341L8508J65997p0489j10665j23913m3731Q1492L5868P7960m1872j17867
10975B26629k2453j03871j13510l5188L4298M2659J5020r2173K4808K991j8261
10964c9051j450n4916L9719N8336J69433K5598m7712j53508k719J24803J034k02813
10952h3246j55844Q145J4673J96547J88594J2470n7187j23847P1434J55767j33001
10941I4505j71678j23692N9388o3880r7327r3256l2096K17117m958M1735l5732
10930b09874M129J61851J53158j04148j21939j5440j04670j99589n5250J90506
$$ plain form
11007 -110814 -375829 -590083 -638446 -386120 -132853 -19856 1011 -19133 -79907 8751
10997 8751 -56343 -96474 -113165 -212979 -243444 -128315 -40994 15918 166721 332847 335341
10986 335341 373849 539846 469357 358692 234779 191048 272540 308408 386368 344496 226629
10975 226629 204176 100305 -13205 -48393 -14095 28564 43584 -48589 -23781 -20790 -39051
10964 -39051 -40501 -95417 -55698 2638 172071 197669 149957 -3551 -6270 118533 119567 -83246
10952 -83246 -239090 -230945 -216272 -19725 168869 181339 124152 305 71739 227506 94505
10941 94505 -77173 -200865 -141477 -205357 -302684 -395940 -428036 -210919 -215877 -174142 -209874
10930 -209874 -205745 -43894 109264 5116 -116823 -132263 -236933 -436522 -491772 -301266
10920c01266R0001M2595j20392J25039M4884j59484p3502L2268K23096K75176
10910A78415J16214k01263j79246k3823J07019Q0827K191l3173q6114j09450k5082
10899a73485O8764R8057m0685J6002q5678j00526j00080N2051M7907Q4528K77226
10888A44081N3199n882J49430m479j72063k20770k04258N4172N4950J09914p557
10877d9263l5560J61322J88886q2969j48841l6466K5224k1354j34993r6345N9891
10866a70468J81235Q3965J8613p6831k21140j87241L5189K37525L28777N0790
10856B80414R2380j6566m9103k79910m25965J58320K40010R1757J57031m6106
10846B02262j12754K4315r7869j19378n3747O5596J6590R8303J02379k45058q1935
$$ plain form
10920 -301266 -211265 -168670 -289062 -164023 -119139 -278623 -352125 -319857 -96761 178415
10910 178415 294629 93366 -85880 -109703 -2684 78143 80334 47161 -38953 -148403 -173485
10899 -173485 -104721 -6664 -47349 -31347 -117025 -217551 -317631 -265580 -217673 -133145 144081
10888 144081 197280 191398 340828 336349 164286 -56484 -260742 -206570 -151620 -41706 -49263
10877 -49263 -84823 76499 265385 182416 33575 -2891 22333 979 -134014 -230359 -170468
10866 -170468 10767 94732 113345 36514 -184626 -371867 -336678 -99153 229624 280414
10856 280414 372794 356228 307125 27215 -398750 -240430 -420 91337 248368 202262
10846 202262 89508 113823 15954 -103424 -157171 -91575 -74985 23318 125697 -119361 -201296
10835b01296K9093J41837m749j55019r6394j05338J31572K45580l4521J00554
10825E1319J20185l749O8124l0580O6242L3122j04742m7100j49425l6534Q6005
10814E2867Q6770L304Q2264L1010k5224k43281r3165j32676K2519J55447J99092
10803A38927J9722M5954o1878k07106k7605K8814J04949J43152l0730r7792K3477
10792G9884j19169k4635Q5447P0019K0099k5542m5647k41815k65588l6520Q3713
10781d19754J99641r0562q3640j10377L2593M18805M6639n2604p6835j6358Q3703
10770f8749n963l7523j1406P5463m5349P8624N4608j3567j27239j86263J36779
10759a50585J73428J3358j18860q1412K8718O1470j16410j257J40676Q8019M4616
$$ plain form
10835 -201296 -172203 -30366 -35115 -190134 -286528 -391866 -260294 -14714 -49235 51319
10825 51319 171504 167755 235879 205299 271541 304663 199921 152821 3396 -33138 52867
10814 52867 139637 142941 225205 256215 230991 -12290 -105455 -238131 -215612 -60165 138927
10803 138927 158649 204603 142725 -64381 -91986 -63172 41777 184929 154199 56407 79884
10792 79884 -39285 -63920 21527 91546 111645 86103 40456 -201359 -466947 -503467 -419754
10781 -419754 -220113 -310675 -394315 -504692 -472099 -53294 -6655 -59259 -136094 -152452 -68749
10770 -68749 -74712 -112235 -123641 -48178 -93527 -14903 39705 26138 -101101 -287364 -150585
10759 -150585 22843 36201 -82659 -164071 -135353 -73883 -190293 -191550 -50874 37145 81761
10748H1761r3527j88474o8820J68589P1691j45704L7186Q1153M6101P4440k2609
10737D1787j39188n8469J2935j918O3697M1277m6991j36000Q5827p107j69452
10726c13602L8858q6257j344J99545R8761M9969j75J59j00421o1188l0148O1840
10714a44003Q7974K8751k19852L1916K01719j6942M5400r8558k2463P6913j2625
10703d1770o2958q2779R6134O0970J64205Q3426J04844p0507j30682j7931r2867
10692A0085j96391j5505O583q0245k3781J67677J85726j37899j18273o1291l139
10681b66453J0909J5016J15556M0479j15741J47675K60313j997j68965j18814
10671h2022O203L1154L4893l1119p2909j42641J8089J27875K08348p7119j18154
$$ plain form
10748 81761 -11766 -200240 -269060 -100471 -28780 -174484 -137298 -56145 -10044 64396 41787
10737 41787 -97401 -155870 -142935 -144853 -81156 -39879 -86870 -222870 -137043 -144150 -313602
10726 -313602 -274744 -361001 -362345 -162800 -64039 -14070 -14245 -14086 -114507 -175695 -205843 -144003
10714 -144003 -56029 -27278 -247130 -215214 -13495 -30437 14963 -83595 -106058 -29145 -41770
10703 -41770 -104728 -187507 -91373 -30403 133802 217228 322072 251565 120883 102952 10085
10692 10085 -186306 -201811 -195228 -275473 -299254 -131577 54149 -83750 -202023 -263314 -266453
10681 -266453 -255544 -240528 -124972 -84493 -200234 -52559 207754 205757 36792 -82022
10671 -82022 -75819 -44665 -9772 -40891 -113800 -256441 -238352 -110477 97871 20752 -97402
10660i7402q4443Q3618J04780r6748j12327l4952J03756J13777N5403j32182q0083
10649a76803K8362j31167P0010J42856j6389n3244k3944M0542p0770l3821J0367
10638b14001M6775j2954P4143J56706K1456J07199q7069j08465J13318K16327
10628C13435p3408l33783j75140J70986L1453o286K925m0137J48993o8662k2687
10617e2311Q5536j27223Q0260o4252n4353M8954j3230M3195J85875n2403P3947
10606A53995K2999J14887m9308M8050L2012p2832j30149j37274m6742j35669O9895
10595a30136O5443l432L9535M2830l9315p3207q112J29183p2305m0676q8093N1254
10583a27031j43737N0717L5653M8432K0397P59N084J92584L3450J53800k2145
$$ plain form
10660 -97402 -181845 -98227 6553 -90195 -202522 -237474 -133718 -19941 35462 -96720 -176803
10649 -176803 -148441 -279608 -209598 -66742 -83131 -136375 -160319 -119777 -190547 -224368 -214001
10638 -214001 -167226 -180180 -106037 50669 72125 179324 92255 -16210 97108 313435
10628 313435 240027 -93756 -268896 -97910 -66457 -72743 -69818 -109955 39038 -29624 -52311
10617 -52311 33225 -93998 -13738 -77990 -132343 -83389 -96619 -53424 132451 80048 153995
10606 153995 176994 291881 242573 290623 322635 249803 119654 -17620 -64362 -200031 -130136
10595 -130136 -64693 -68125 -28590 14240 -25075 -98282 -106394 22789 -49516 -90192 -178285 -127031
10583 -127031 -270768 -220051 -184398 -135966 -115569 -114810 -109726 82858 116308 270108 247963
10572B47963r4947k54092q5219N6794n1389l089J2059j05993M4619J53869L65300
10561B85875n634k07797p9445q24k24450j18426O9976Q9384M9503R5253q9453
10550a36038n0462J24643J38631J25594P2135j74533j29707k05147K5239J69302
10540d0343n9708n7318P6503k4992o733j18227j23560J67096m5200J12277N7447
10529f2758K4209K77500j34419k06743J00869j4905q5105k6091K1153J41685J27589
10518A62984p5448j64133m6805q315k112J348p5777R5271Q7409J00203K7318j17867
10506a5924J44856k44k2801j34038j33935j80801r0822O7499R8149J95340M3565
10495b9156j24150J4111L6910P4582J7190j60408o0671L03146N7773o5727J33065
$$ plain form
10572 247963 153016 -101076 -186295 -129501 -180890 -183979 -171920 -277913 -233294 -79425 285875
10561 285875 280241 72444 -7001 -7825 -232275 -350701 -280725 -191341 -141838 -46585 -136038
10550 -136038 -186500 -61857 76774 202368 274503 99970 -29737 -234884 -209645 -40343
10540 -40343 -100051 -157369 -80866 -105858 -112591 -230818 -354378 -187282 -232482 -120205 -62758
10529 -62758 -38549 238951 104532 -102211 -1342 -16247 -101352 -127443 -106290 35395 162984
10518 162984 87536 -76597 -123402 -131717 -133829 -132481 -208258 -112987 -25578 74625 101943 -15924
10506 -15924 128932 128688 105887 -28151 -162086 -342887 -433709 -366210 -268061 -72721 -29156
10495 -29156 -153306 -139195 -102285 -27703 -10513 -170921 -231592 71554 129327 63600 196665
10484A96665J23270m0600j5778k9455j08551k37326Q885Q2898J18969M6359o1659
10473H3677o4276m399j39538j40943J34696J0655j34927K367J87320L3342R1213
10462E9187J35453q4833q5208j52349p1021p7387o169l1800P5265J18053q7880
10451b08689k22047Q5027R5671Q2170j03071Q1684j2952N804J76416M7844j422
10440B6435L1299p4474r0851O6133n4716n6058j8574P6102Q3682M9911Q2829P7752
10428A99470n3648k06j8958K6025J094j33215p4628O6330J6549N9088n2750r6105
10416f0954R2683k9614r4430J85290o111n1542Q6634j75929P332K46941J98239
10405C98539P3668j37202k42903j5638J1252J96993j1360q8997j7675M1609n4224
$$ plain form
10484 196665 319935 279335 263557 234102 125551 -111775 -102890 -19992 98977 145336 83677
10473 83677 19401 15002 -124536 -265479 -130783 -120128 -255055 -252688 -65368 -32026 59187
10462 59187 194640 109807 24599 -127750 -198771 -276158 -282327 -314127 -238862 -120809 -208689
10451 -208689 -430736 -345709 -250038 -167868 -270939 -189255 -202207 -196403 -19987 27857 26435
10440 26435 57734 -16740 -107591 -41458 -96174 -152232 -170806 -94704 -11022 38889 121718 199470
10428 199470 145822 145616 126658 152683 153777 20562 -54066 12264 28813 87901 35151 -60954
10416 -60954 31729 2115 -92315 92975 86864 35322 121956 -53973 -46641 200300 398539
10405 398539 472207 335005 92102 76464 87716 284709 273349 184352 166677 208286 154062
10394A54062p541l0345j83060p7169J56879L1910P9021K08453j20992j68176j0321
10383C2721J05496P9317k9513j42602k8360L8626J9433P7377L1069o3101o6457
10372E4006O4902R928k9353o0370K3325K43974M8184r7873n7358l0899l6118K4226
10360A56574n6665n6340l610j34342q4020K27768R3565n7433q6784O1549j12011
10349e1749m9571J11502p556o2929r3744Q5543L2010Q4864J14019m9450k57286
10338a44347L191R7110Q0368j57593k18917m2796N497J37274J05817J01223k9501
10327f2674q1160J22775l1268J16331j1160j70095J53375q615j48120K32198J47139
10316B58726j6431j26992j66497L0225Q7031m5899j14790P1394K04787p5080j21139
$$ plain form
10394 154062 146521 116176 -66884 -144053 12826 44736 123757 332210 211218 43042 32721
10383 32721 138217 217534 188021 45419 17059 55685 75118 152495 183564 120463 54006
10372 54006 118908 128836 99483 39113 62438 306412 354596 256723 199365 168466 132348 156574
10360 156574 99909 43569 39959 -94383 -178403 49365 142930 85497 -1287 60262 -51749
10349 -51749 -101320 10182 2626 -60303 -154047 -68504 -36494 48370 162389 112939 -144347
10338 -144347 -141156 -44046 36322 -121271 -340188 -382984 -377487 -240213 -134396 -33173 -62674
10327 -62674 -143834 -21059 -52327 64004 52844 -117251 36124 27509 -120611 111587 258726
10316 258726 242295 115303 -51194 -20969 66062 20163 -94627 -23233 181554 106474 -14665
10305a4665J5595J4637r6638j14206p8302K02075J26470K21665K1931m2175M3981
10294C00368L7478k40719k86593R241L6598N6357j01202M4040J38025N5898n8697
10283i206r1484l2170K1878J38060J6970k5320o6731p9569J18424k5582j8649
10272e3379J67424K8821J1157K4442j02124k05940k8425N9525r5355J3352K9366
10261a51136n6405o0522L12J15447j80931L9183J06164m2756m3810m245j8398
10250b97097J08879J61321N6571L478r1946m0016m7679j40702K65145N5409l0121
10239C242K0335J93755M862j91502o6803o2699l3379l7628n0197L0892J22586
10228f6536J19599M2277j43507M6111J50755J26653K3471j52485j78552p1629
$$ plain form
10305 -14665 930 15567 -81071 -195277 -273579 -71504 54966 276631 298562 256387 300368
10294 300368 337846 97127 -189466 -180225 -143627 -87270 -188472 -144432 -6407 49491 -9206
10283 -9206 -100690 -132860 -110982 27078 44048 18728 -48003 -127572 -9148 -34730 -53379
10272 -53379 114045 142866 154023 178465 76341 -129599 -158024 -98499 -193854 -180502 -151136
10261 -151136 -207541 -268063 -267751 -152304 -333235 -294052 -187888 -230644 -274454 -278699 -297097
10250 -297097 -188218 -26897 29674 33152 -58794 -98810 -146489 -287191 -22046 33363 3242
10239 3242 23577 217332 222194 30692 -36111 -98810 -132189 -169817 -220014 -189122 -66536
10228 -66536 53063 95340 -48167 -2056 148699 275352 298823 146338 -32214 -103843
10218a03843J46626K34894j104n1434k07739k23923k5416R0957n7448j04115J6130
10207b86415P5076J05398j8498R0013R8053P8153j03281p3679j59319K596J08339
10196h3564Q7282N8925M7073l27806j19796K15861J10469k9321J1863r3856n3393
10185a76263K5883L1334k5986n1000R2184j4291O4758P7829k49054j53642K0991
10174c57257K24319J54575O2193p1771r5702j9213K27451J15968p142J0134k72888
10163b9333q0127p0862m7253J40629J40536l6607N365J72221L1284q9482j89417
10152e3046M5088J29953O5947m1306M5741j6124j76806r3593k0499L7815m1226
10141a18056R2440O3165l721J54034L4848r2866L257L8633j21494J37438J87834
$$ plain form
10218 -103843 42783 277677 276573 225139 17400 -206523 -231939 -140982 -198430 -302545 -286415
10207 -286415 -211339 -105941 -124439 -34426 63627 141780 38499 -35180 -194499 -191903 -83564
10196 -83564 3718 62643 109716 -218090 -337886 -122025 -11556 -40877 -29014 -122870 -176263
10185 -176263 -150380 -119046 -145032 -196032 -103848 -118139 -53381 24448 -224606 -378248 -357257
10174 -357257 -132938 21637 83830 12059 -83643 -102856 124595 240563 233421 243555 -29333
10163 -29333 -109460 -180322 -227575 -86946 53590 16983 22348 194569 225853 136371 -53046
10152 -53046 -7958 121995 187942 146636 192377 176253 -553 -94146 -114645 -76830 -118056
10141 -118056 -25616 37549 33828 187862 222710 129844 133101 171734 50240 187678 375512
10130C75512j76510j87142q2713n694M9513K2268j01714m1120J28571Q655j08029
10119a18403k2R227P583K1356L2244n3868k1477K5078J12010m3029o8042Q7345
10107i998J3972m3625J53858j91175j2247J11449J01048P960j83523K3693R8780
10096G0192j1069O625r4562j03338J797m6222k00103n1672K97264J50014J5826
10085C4752m4914p6964M4657o2834L6322m876j09895j37516J17817K57552j16918
10074f2817j88237J5063p1969J22030Q3348L3112J35034R9582J5686o3992L4312
10063A51152l8111p4627p645R2389j01502n362j76251k6925M7747k815n868l1286
10051a79104R302K91190j23403k79405R4140J25026Q8794n9041Q5054r3111P348
$$ plain form
10130 375512 199002 11860 -70853 -76547 -27034 -4766 -106480 -147600 -19029 -10374 -118403
10119 -118403 -118425 -109198 -101615 -80259 -48015 -101883 -123360 -98282 13728 -29301 -97343 -9998
10107 -9998 3974 -39651 114207 -76968 -89215 22234 123282 131242 -52281 -28588 70192
10096 70192 59123 65748 -28814 -132152 -130355 -176577 -376680 -428352 -131088 18926 34752
10085 34752 -10162 -87126 -42469 -105303 -68981 -73857 -183752 -321268 -203451 54101 -62817
10074 -62817 -251054 -235991 -307960 -185930 -102582 -69470 65564 165146 180832 116840 151152
10063 151152 113041 38414 30769 123158 21656 16294 -159957 -186882 -139135 -141950 -147818 -179104
10051 -179104 -169802 121388 -2015 -281420 -187280 -62254 26540 -32501 52553 -40558 -33210
10040c3210J39612N3505p1072Q5638j09185j35086J95206J11621Q3936j2157K2737
10029C31545j8443j51364r1468J044j61501L0005J7692k59963M3414J35179k8178
10018a52038k9121P5173J47634J57278j56538j74079K3606K24722m4872j82080
10008a10315l4803j25871K69206J39327l6525J9100r9798R3394J0984l0539J18522
9997B12682Q6411j09906K3690n7124j20908p1048M7982J37405L6645J52731l9972
9986B98588j0228j5878j8607k4938J0762k2162M1148p0782j25751J4462J14257
9975A90871L5867j17629k9237O2028q06k8945J12972p8589K0361J75032o0756
9964B81169N570o4176J2098j38317n8965r6968k28313M2198K15735J56896j17658
$$ plain form
10040 -33210 106402 159907 88835 174473 65288 -69798 125408 237029 320965 308808 331545
10029 331545 313102 161738 70270 71314 -90187 -60182 -42490 -302453 -259039 -123860 -152038
10018 -152038 -181159 -105986 41648 198926 42388 -131691 -108085 116637 71765 -110315
10008 -110315 -145118 -270989 -1783 137544 101019 120119 20321 113715 124699 94160 212682
9997 212682 299093 189187 212877 155753 34845 -36203 11779 149184 185829 338560 298588
9986 298588 288360 272482 253875 228937 239699 217537 258685 187903 62152 76614 190871
9975 190871 226738 109109 79872 141900 141094 112149 225121 146532 166893 341925 281169
9964 281169 286739 222563 234661 96344 37379 -59589 -287902 -245704 -29969 126927 9269
9953I269J04645l7835j8506N4941Q211J26275j84943k10676P3068J18505j2009
9942C0945j08134j05586m6872p8770K28993Q7594O5793M892n3654p3256l0128
9931g8183n4220J64226J62527j20357j69063K29833j01944j07869M8075l4047
9921f1022o9714R9661J05431p9140J699N9939j41758Q658n9933n4793J23857J6870
9909e0245q709R4969L6865q2159j3622M4370Q5776J05765M733r9599m5017L365
9897G6492P2214J52743Q2963r7015k56843o8701k8070O2161J07760l6257j90533
9886a23086o4919J30828M9796R7997K646q7116J18121J49097L3895m3756p6911
9875A86592J22420n0894j49331k3484m7651j53970M4394K2694k1898j38294K4274
$$ plain form
9953 9269 113914 76079 57573 112514 120725 247000 62057 -148619 -75551 42954 30945
9942 30945 -77189 -182775 -229647 -308417 -79424 8170 73963 78855 25201 -48055 -78183
9931 -78183 -132403 31823 194350 73993 -95070 134763 32819 -75050 -26975 -61022
9921 -61022 -130736 -31075 74356 -4784 -3085 56854 -84904 -76246 -136179 -190972 -67115 -50245
9909 -50245 -58954 36015 72880 -9279 -22901 21469 107245 213010 217743 118144 73127 76492
9897 76492 148706 301449 384412 287397 30554 -38147 -66217 -4056 103704 67447 -123086
9886 -123086 -188005 -57177 -7381 90616 93262 6146 124267 273364 307259 263503 186592
9875 186592 309012 258118 108787 85303 37652 -116318 -71924 -49230 -71128 -209422 -185148
9864a85148K37058J13860K40028Q6640m2282j37591r0444j74848j2750r7280J19615
9853E6858k212J33301R9133q6112r500o6353J31715J06993q351j56154l4554k98992
9841a34228O8673J66284o2678r8737M9446K25261j21498p2287m7843m6148Q9244
9830A5489K06326J59385j81423r6911k9288o6034J67963j27262j82720p0812J15215
9819i0072P0080J57448N2403o4534l0363j08323l1336l4102L3792J74645J99275
9808C28913o2561j81863j02144M6551K64300j02424L1560R190j57583j59486j28196
9797b13743J2742K03208K87521P43k59956k8969j4193R2721j0623j00607j74486
9786b05642Q7679J19925L1840L0558P6375R6773r9926k21295k44056J3580R7873
$$ plain form
9864 -185148 51910 165770 405798 492438 450156 312565 222121 47273 34523 -62757 56858
9853 56858 54646 187947 287080 200968 191468 125115 256830 363823 355472 199318 164764 -134228
9841 -134228 -65555 100729 38051 -60686 -11240 214021 92523 20236 -27607 -73755 15489
9830 15489 221815 381200 199777 102866 73578 7544 175507 48245 -134475 -205287 -90072
9819 -90072 -19992 137456 189859 125325 94962 -13361 -44697 -78799 -45007 129638 328913
9808 328913 266352 84489 -17655 28896 293196 190772 222332 231522 73939 -85547 -213743
9797 -213743 -201001 2207 289728 290471 30515 1546 -12647 80074 69451 -31156 -205642
9786 -205642 -117963 1962 33802 64360 140735 237508 137582 -83713 -327769 -314189 -216316
9775b16316J64397Q2265p1514K5848j5836O2070J01477j11531p4468J10947N2076
9764A09415k071l3405k40162n3889J42685J91018p1076K7271M476l7349q2162
9753d5249j0696P2629K2341p1441L9324J42672Q255j07908R475J04264j0090l0044
9741A23532M4080J2350m8392l25817J27748Q4579o2997O0348J89539M78k02920
9730B528l6331P8627j11776o377L2150J20890L6115p2493O2452O7272r6658j30468
9718e4069L7978J9637n0981M3222J15032O0318r6002p4209j16970j7647R7196
9707c6495K52974P077j34504j6065n5888j91453n2680K31659Q4294O3527q4034
9696F8412P543J15554K6324j66201k4337R4785o9630n4677j07277J9348R9920
$$ plain form
9775 -216316 -51919 30346 -41168 -15320 -31156 30914 132391 20860 -53608 57339 109415
9764 109415 107344 73939 -166223 -220112 -77427 113591 42515 69786 74262 36913 -45249
9753 -45249 -55945 16684 39025 -32416 6908 149580 157835 49927 59402 163666 153576 123532
9741 123532 167612 179962 131570 -194247 -66499 18080 -44917 15431 204970 205448 2528
9730 2528 -33803 44824 -66952 -73329 -41179 79711 115826 43333 105785 173057 76399 -54069
9718 -54069 -16091 3546 -47435 -4213 110819 171137 75135 926 -116044 -133691 -36495
9707 -36495 216479 223556 89052 72987 17099 -174354 -227034 4625 88919 152446 68412
9696 68412 75955 191509 217833 51632 27295 122080 52450 -2227 -109504 -90156 9764
9685I764K5120j44382j82795j08830J68910J74479j42481n6239K08320J92298
9675A44164M903j30059j48782m8682o5120R455J04729Q3732L0629J04080N2539
9664A41588j07621j94950j18549J5210Q4932J89065K1080l8000J5040J65852q6466
9653H7181j53658K6793j39819J38651N3752p8934p015r7066J1844k3236J635O9946
9641a09926J7299n5054r4146J45562K14568O9334r5060p4182R4847o3729m9796
9630b83l9656L3068L4138k010p3272L586J9341J58530m7239Q2236j29008k40054
9618b00623K3818P7763N1542j98628k03550o540K02296J81992O235J59924j1806
9607H2423J09229J61522p6194q1983p5289j79353J5462L4500n6949q1552p2238
$$ plain form
9685 9764 34884 -109498 -292293 -401123 -232213 -57734 -200215 -256454 -48134 144164
9675 144164 149067 19008 -129774 -178456 -243576 -234121 -129392 -45660 -15031 89049 141588
9664 141588 33967 -160983 -279532 -264322 -179390 9675 30755 -7245 7795 173647 87181
9653 87181 -66477 -39684 -179503 -40852 12900 -66034 -73049 -170115 -158271 -181507 -179872 -109926
9641 -109926 -92627 -147681 -241827 -96265 118303 187637 92577 18395 113242 49513 -283
9630 -283 -39939 -6871 27267 25257 -48015 -44429 -25088 133442 86203 168439 39431 -200623
9618 -200623 -176805 -99042 -47500 -246128 -449678 -456218 -253922 -71930 -65695 94229 82423
9607 82423 191652 353174 276980 194997 119708 -59645 -44183 -9683 -66632 -148184 -220422
9596b20422j4431J0293n974J05474k3975j01985K11001J82743l2561q0743K56199
9585B85619n9626j50755j59982r9739K19887L5896P8932L1281p5451j52687j29785
9574a76410M7838J3079k03641O8145R2076J44674N3847m7645N8934N2241o4899
9563C8239j79632p791K95871L889r6077l9483p7823l3638P8988k40161j89126
9552d46744J82388K54722J41119j3448j61797j61999J34895J25380p1035j15692
9542a32211m1633n3718l0563J28820N6596k0353L48J3182O076k00718L14L46981
9530G3121J03795j3662j7189n4945J4169j87383k47184J3743K90063J05896Q8015
9519A68439J98810O4209k11462j14896j10458q6900J17567L9742J6533J7025M3424
$$ plain form
9596 -220422 -234853 -224560 -230534 -125060 -149035 -251020 -40019 142724 110163 29420 285619
9585 285619 225993 75238 -84744 -184483 35404 71300 150232 181513 106062 -46625 -176410
9574 -176410 -128572 -115493 -319134 -250989 -158913 -14239 39608 -8037 50897 103138 38239
9563 38239 -141393 -149184 146687 150576 54499 15016 -62807 -96445 -17457 -257618 -446744
9552 -446744 -264356 -9634 131485 118037 -43760 -205759 -70864 54516 -16519 -132211
9542 -132211 -173844 -227562 -258125 -129305 -72709 -93062 -92714 -79532 -73456 -274174 -273860 73121
9530 73121 176916 163254 146065 91120 105289 -82094 -329278 -315535 -25472 80424 168439
9519 168439 367249 431458 219996 105100 -5358 -92258 25309 65051 81584 98609 142033
9508A42033M1421j64503j77993J28935K5166j1450M1465J6060k2396K7542k5982
9497B0298j1916j08271O2794R9398n305n5723m731J67645n0245L4799J02381p3167
9485A77957j37421j8621J21868q5767k83872r5017Q7519K9194J62469K1170q361
9474b8882Q3938R1446N3428j0497l23999o6652R6619L99718n2225j91110N0415
9463A02199n8963q0592j9728M6010K43342J5488j89349r0160N8380J12661J15996
9452B55284j8383L1003l9892j43665o0180p4860l0768n3535l2450n8102m6174
9441b71722J06532N4460K9495J260l7925o858J97593J62049K1009J621J30824
9430C88338j90083m6985O352m2013j72347l3054j67179L3071K23555J67691n3135
$$ plain form
9508 142033 183454 18951 -159042 -30107 -4941 -16391 25074 41134 18738 46280 20298
9497 20298 8382 -99889 -37095 62303 56998 1275 -3456 164189 113944 148743 251124 177957
9485 177957 40536 21915 143783 58016 -225856 -320873 -233354 -204160 -41691 -20521 -28882
9474 -28882 55056 146502 199930 189433 -134566 -201218 -104599 295119 242894 51784 102199
9463 102199 43236 -37356 -57084 -11074 232268 247756 58407 -31753 26627 139288 255284
9452 255284 236901 267904 228012 84347 24167 -50693 -81461 -134996 -167446 -225548 -271722
9441 -271722 -165190 -110730 -81235 -79975 -117900 -124758 72835 234884 255893 257514 388338
9430 388338 198255 151270 157622 115609 -56738 -89792 -256971 -223900 -345 167346 114211
9419A14211p904O5793O4874K1713j71011j79119j74316P5351J70483J43479R6398
9408B19952k1085j61483n2405J78868Q4568j67819L212J17166j07561o0469j74829
9397a41885q1724L2874j7105K08568J46120J0602J19010j08885q0438k04583R9092
9386a8354o9640m8404J95586K47765P39j34121J04852J02234j06955j62554K6724
9375A37872j20096J4030j12707P0066j8190n0315J73775m4688l834J45433N8519
9364B49865n0941j78378k54368J40474J37066j8857j9001l0736O8237O2011J14286
9353B19658R2837q5288j26843K1336K9303J46239m9181P952L4646K46946J30229
9342F67834j86381k04037j27267p4219J72433L1395j7285j51193j9725j09139
$$ plain form
9419 114211 106307 172100 236974 258687 87676 -91443 -265759 -190408 -19925 123554 219952
9408 219952 198867 37384 -15021 163847 248415 80596 83808 200974 93413 32944 -141885
9397 -141885 -223609 -190735 -207840 728 146848 157450 276460 167575 87137 -117446 -18354
9386 -18354 -87994 -136398 59188 306953 307692 173571 278423 380657 273702 111148 137872
9375 137872 17776 31806 -80901 -10835 -29025 -79340 94435 49747 45913 191346 249865
9364 249865 198924 20546 -233822 -93348 43718 24861 5860 -24876 43361 105372 219658
9353 219658 312495 227207 100364 121700 151003 297242 248061 256013 290659 537605 667834
9342 667834 481453 277416 150149 75930 248363 279758 262473 111280 91555 -17584
9332a7584M9908J38557J10281O5217j80359l7202J06103p0775j4770j4728j6509
9321A18139O6394K1094o0510j12869Q4920j0444j33836j95264J57441K34544J0253
9310A79862M5780q1395o5340n3919R922N0907j45316q252Q681K44313L8692j33666
9298I0269J7827J17135J18263J73261N5808q847J2437k1036K3927L7671m0465
9287E76250r5137j02852j88792l2976J44974o493j45991K0358Q7824J7984J7477
9276B92626j08256k24800l1306P556P7480J9312o8782J0446l4639l6109N8975
9265c7497R2459K6107p6458q2736R4087Q7952R3827R4876k8218J0037j24867j84715
9253c5146J52441J88424K8094p6910j93633K5087j33693r839O1237J0460Q0927
$$ plain form
9332 -17584 32324 170881 281162 346379 166020 128818 234921 164146 149376 134648 118139
9321 118139 184533 205627 145117 32248 117168 106724 -27112 -222376 -64935 169609 179862
9310 179862 225642 144247 78907 24988 34910 85817 -59499 -67751 -59070 185243 223935 90269
9298 90269 108096 225231 343494 516755 572563 563716 576153 555117 579044 616715 576250
9287 576250 481113 378261 189469 156493 301467 294974 148983 169341 257165 275149 292626
9276 292626 184370 -40430 -71736 -64180 13300 32612 -36170 -25724 -60363 -96472 -37497
9265 -37497 54962 81069 4611 -78125 15962 103914 197741 292617 264399 274436 149569 -35146
9253 -35146 117295 305719 333813 256903 63270 88357 -45336 -55175 6062 16522 97449
9242I7449J08942j34070q2006J97043J19769j74208j19282O7933O2832l7629L3932
9231A40705Q151J9558q0629l8576J13685O6140L5531k8512k20880J14106Q6772
9220B16051K43137K18144j47935j88306j08427P7922l1313j39356M2027R590O5997
9209B57531n9237m6679j23313J17826K48976o1692K6166j50463Q1606J13520p6775
9198C27466O6023N3150o273Q5499o7828q1355J2301p0734j45419k7354J158N4744
9186B01378Q4579M7932O0362N4202o6142N1207J8533J5723n9304r1767M8561P9187
9174D44451J08451K22911M8392j37977m8374p5907J4979o0395j56703R5674P9035
9163E34537M7344J8843J1683L7831K5651o7670L758J06523J39240n3050o1098
$$ plain form
9242 97449 206391 72321 -9685 187358 307127 132919 13637 81570 144402 106773 140705
9231 140705 148856 168414 87785 49209 162894 229034 264565 236053 15173 129279 216051
9220 216051 459188 677332 529397 341091 232664 310586 279273 139917 181944 191534 257531
9209 257531 198294 151615 28302 146128 395104 333412 359578 209115 290721 404241 327466
9198 327466 393489 446639 440366 525865 458037 376682 388983 318249 172830 145476 146634 201378
9186 201378 285957 333889 394251 448453 382311 433518 452051 467774 408470 316703 365264 444451
9174 444451 552902 775813 824205 686228 637854 561947 576926 516531 359828 455502 534537
9163 534537 581881 600724 612407 650238 675889 608219 611977 718500 857740 804690 743592
9152G43592n0414l5732n6895K57574P7666J05406p475j31193O8425J73218K31268
9141A375440J8168j9747J15831m5296o8115M6840q7610o0393r979O6164J18881
9130A450184O9326R4119K24388q205J05716K15358K77720K60675K03502J82104
9120C074887K78350K37067Q9509L10351M31408K85077L32385K83896L85695O27924
9110F336549P86462J067483Q45047J068079J447099J602873K238726K855026L424619
9101B1671963N023337O983817R979340J4133233J8435103K0048872J7001650J1887725
9093A25165040R631593J0066312P229387o290613k4311629k8695596k2252361
9086G0542133j4897094r972794p035837n093296l875486l151223k334008j975071
$$ plain form
9152 743592 693178 657446 600551 858125 935791 1041197 1033722 902529 970954 1144172 1375440
9141 1375440 1393608 1373861 1489692 1444396 1376281 1423121 1335511 1275118 1265139 1331303 1450184
9130 1450184 1519510 1613629 1838017 1829812 1935528 2150886 2428606 2689281 2892783 3074887
9120 3074887 3353237 3590304 3679813 3990164 4421572 4706649 5039034 5322930 5708625 6336549
9110 6336549 7123011 8190494 9035541 10103620 11550719 13153592 15392318 18247344 21671963
9101 21671963 26695300 33679117 43658457 57791690 76226793 96275665 113277315 125165040
9093 125165040 134796633 144862945 152092332 145801719 121490090 92794494 70542133
9086 70542133 55645039 45672245 38636408 33543112 29667626 26516403 24182395 22207324
9078B2207324j725503j282557j255062j126918r88333o38536n47349p50732n53541
9069A3338793n41260p12791n76867l76489m39271l15429k61896l43212l64291
9060I407287k97126k68575q9552p1170k64537k27609k25522j61243R8132n8517
9050G841568j20644r5937k67479m18017k51756l19837q4106j08283k44110j98220
9040E733179l9770j24484j95116j78829j47451j37840p5840k8447J12616j27117
9030D790901k59649j20374j30887j10355l05068k18389q4130P8330M1148j3860
9020C667667l07564N910M4671j27884j20890o4036N427N6666O3220j66078j18061
9009B939048l1553n2673j93842L806K3998k48606m3494j37938O966M7461l1649
$$ plain form
9078 22207324 20481821 19199264 17944202 16817284 15828951 15190415 14643066 13892334 13338793
9069 13338793 12797533 12084742 11507875 11131386 10692115 10376686 10114790 9771578 9407287
9060 9407287 9110161 8841586 8752034 8680864 8416327 8188718 7963196 7801953 7900085 7841568
9050 7841568 7720924 7624987 7357508 6939491 6687735 6367898 6283792 6175509 5931399 5733179
9040 5733179 5693409 5568925 5373809 5194980 5047529 4909689 4833849 4805402 4918018 4790901
9030 4790901 4531252 4410878 4279991 4169636 3864568 3646179 3562049 3640379 3681527 3667667
9020 3667667 3360103 3366013 3410684 3282800 3161910 3097874 3103301 3159967 3223187 3057109 2939048
9009 2939048 2907495 2854822 2660980 2664786 2688784 2440178 2396684 2258746 2265712 2313173 2281524
8998B281524J08879k674j56519j48835j80950l4841m5459n7472j44118r086J96956
8987A807405R613l0095k02218j1913L8700q6277k32883n374J69835j51828q5907
8976A219058K6189K30655N6636j60771j2504J42646k4794o3762K2915k8386L9115
8965A446997j12474j10324K512J73939j8301j11632q4911q0406J31317J28666
8955A365383J02992l6145j22976n3232K6265J60374j6540l0061j7002J64479M280
8944A547817j49876j18891k20536L876O4825P5680m6304q6156L4811M6126K3771
8933A175143J2461j62167j34369O0461k0544k7566k4631N0992j78989j50283J10973
8922G11481j599p6451r82Q3038J69801P7176p6443j74397o9770r0429J57101p8936
$$ plain form
8998 2281524 2390403 2387729 2231210 2082375 1901425 1866584 1821125 1763653 1619535 1610449 1807405
8987 1807405 1817018 1786923 1584705 1572792 1611492 1525215 1292332 1286958 1456793 1304965 1219058
8976 1219058 1245247 1475902 1532538 1371767 1359263 1501909 1477115 1413353 1436268 1407882 1446997
8965 1446997 1334523 1224199 1226711 1400650 1382349 1270717 1185806 1105400 1236717 1365383
8955 1365383 1468375 1432230 1309254 1256022 1282287 1442661 1426121 1396060 1379058 1543537 1547817
8944 1547817 1397941 1279050 1058514 1062390 1127215 1202895 1156591 1070435 1105246 1151372 1175143
8933 1175143 1187604 1025437 891068 951529 930985 903419 878788 929780 750791 600508 711481
8922 711481 709882 633431 632449 715487 885288 962464 886021 711624 641854 551425 708526 629590
8910F29590R6083J29532m1926j34305j05885R972m4O4862j31903j9193n927J42516
8898F33372j3777l5758r1428K9031J9531m4599M6599m5152p438J61691k764j14509
8886E34799q1476j18658L1436j955K8078Q7553o3806j89770k2189M09J76155K52598
8874F33174J280o5108k9339j24548R890J5941J89k2978J01079K2236l0450P2100
8862E83466j31441j48441m4742N8852K6409O9003M9906j5497Q2510o943J46252
8851F69334j65511j72809p1306k7460n7986m8164o4952Q1694q1785m1181J96096
8840B15970K13002R6408j6879j86240k22262j8018Q0127j37358Q508J51007j05318
8829G8947K3582M561j79895j09279r9288K42208Q4171q3803Q8904R5938n5110
$$ plain form
8910 629590 725673 855205 813279 678974 573089 583061 583017 647879 515976 496783 490856 633372
8898 633372 619595 583837 492409 521440 540971 496372 542971 497819 490381 652072 649308 534799
8886 534799 453323 334665 366101 364146 392224 479777 415971 226201 204012 204421 380576 633174
8874 633174 634454 569346 540007 415459 425349 441290 441479 418501 519580 541816 511366 583466
8862 583466 452025 303584 258842 317694 344103 413106 463012 447515 530025 523082 669334
8851 669334 503823 331014 259708 232248 174262 126098 61146 142840 61055 19874 215970
8840 215970 428972 525380 508501 322261 99999 81981 162108 24750 33258 184265 78947
8829 78947 102529 107090 -72805 -182084 -281372 -39164 45007 -38796 50108 146046 90936
8818I0936m0102L8907q214M390J34245l3237Q2374J83503J47512O2733j70928
8807D92119p8718O9540m3281p9000j43788m5257M887j26663n9692J08221j60187
8796f1819M1150n7906r0802J53259L2797j52155q5563o9085j0347M4122J51163
8785a05186K9881l283K6001N4712j35364j54210O5076R1629K03862R0651K6036
8774A89805r5102r1575J12907k9453p1076j45947J62590J38413L5019M5657K7615
8763B78853L2897J78076j22583j8025j14796k56726o3239K2619M7837K63008l653
8752B44268L9641o4255J3987J28069p0155j87729l6312K4745j11617J08963R5989
8741A85594K7110J0361n2812R474J52792J399j46040N4837L1644p7402j01795
$$ plain form
8818 90936 50834 89741 81527 85917 220162 186925 269299 452802 600314 663047 492119
8807 492119 413401 482941 439660 360660 216872 171615 176502 49839 -9853 98368 -61819
8796 -61819 -20669 -78575 -169377 -16118 16679 -135476 -221039 -290124 -300471 -256349 -105186
8785 -105186 -75305 -78588 -52587 2125 -133239 -287449 -222373 -130744 73118 163769 189805
8774 189805 94703 3128 116035 86582 15506 -130441 32149 170562 205581 251238 278853
8763 278853 311750 489826 367243 349218 234422 -22304 -85543 -62924 -15087 247921 244268
8752 244268 283909 219654 233641 361710 291555 103826 67514 92259 -19358 89605 185594
8741 185594 212704 223065 170253 179727 332519 333918 187878 242715 274359 196957 95162
8730I5162o1978o139J78533K20075J86239q6943L3539Q0868J56329m0524K9007
8719G84168q4900j45983o7459K8839q4645O3619j22953r3940k9802j27722n2244
8708F6978J69716J44936o7345j42196P6069k5465o7158J77516P9132O4889j31118
8697C45954j45004P455K2097p3482J12409M1700r5318j1096K7948l5130J0496
8686B08029j77555O278Q9507J20635K7173J04144j44672K41193J82786j99069
8676D58449j13259j18222k5607n6990J87574j7818j49093R5830Q3533j8344L4943
8665C60996J06837J65606q5538l24968k05201j35216k936J15959J70577K31888
8655C98004n4949j58925L2576L67745J64775j0002j04618m2460R3459K42201m9902
$$ plain form
8730 95162 33184 27045 205578 425653 611892 524949 558488 639356 795685 755161 784168
8719 784168 699268 553285 485826 514665 430020 493639 370686 276746 246944 119222 66978
8708 66978 236694 381630 314285 172089 248158 222693 155535 333051 412183 477072 345954
8697 345954 200950 208405 230502 157020 269429 311129 215811 204715 232663 197533 208029
8686 208029 30474 36752 126259 246894 274067 378211 233539 474732 657518 458449
8676 458449 345190 226968 201361 144371 331945 314127 165034 260864 344397 326053 360996
8665 360996 467833 633439 547901 222933 17732 -117484 -120420 -4461 166116 398004
8655 398004 343055 184130 216706 584451 749226 739224 634606 592146 685605 927806 877904
8644H77904J7880m7544r0961j04656j11484j20982k8565j10272J04036J57515
8634E42871j52534j02529p6093L1124J90770R2239L1168j56985k44067q6395P4427
8623A43996n092R0819R8023J53014l9990N2856K22226J42488J23447j14087L2537
8612I00237j99608q2195J75185P1736J03261M7416N0831J217R2388L19518J18437
8601A598423J74175J95920J38437N0732O4846O9174J49782q9450q3052k21259
8591B047728j64333p6108l52011q0607j05472j01046k16370k18121J12459J6352
8581H62471o5428J27645J91528M594l02442k65375J44817R6919M7399N2389q0883
8570H13634P0982j07750n9407m5095k09852j47400Q9609J72776J78729o1419j39602
$$ plain form
8644 877904 895784 848240 757279 652623 541139 420157 391592 281320 385356 542871
8634 542871 390337 287808 211715 242839 433609 525848 557016 400031 155964 69569 143996
8623 143996 138904 229723 327746 480760 440770 493626 715852 858340 981787 867700 900237
8612 900237 700629 618434 793619 865355 968616 1016032 1066863 1068080 1160468 1479986 1598423
8601 1598423 1772598 1968518 2106955 2157687 2222533 2291707 2441489 2352039 2268987 2047728
8591 2047728 1883395 1807287 1455276 1374669 1269197 1168151 951781 733660 846119 862471
8581 862471 797043 924688 1116216 1120810 818368 552993 697810 794729 842128 894517 813634
8570 813634 884616 776866 717459 672364 462512 315112 404721 577497 756226 694807 555205
8559E55205o3937M1361J35965N5606j9111J42447J28719r8497j82963r5930p785
8548E91080j12465m7741R067P5578j08433K08335L8477j17734P5152O0995j58410
8537E13901O9018J06423K4256k7177r1840Q5162J53033j45337n3283O083O1712
8526G01951L5391m7943J2571r9672m2778q8665q978k34693p2213J35883q764j26414
8514A55676P4085J65693j19875k46J7280J50231l9200k10356j10248K3382K6j6043
8502I0405J55180k2954q0537k55258m0935K79956L35092Q2330p5522q3915l3204
8491C50638j35854r9846J01230O9086n2362j96342n9622L1135j1046J00131p3076
8480B4072j51732R5972J2580m4584L0220j16767k0681m2106j11047K04466J29733
$$ plain form
8559 555205 491268 532629 668594 724200 705089 847536 976255 877758 694795 598865 591080
8548 591080 478615 430874 439941 515519 407086 615421 653898 536164 611316 672311 513901
8537 513901 582919 689342 713598 686421 594581 679743 832776 687439 634156 640239 701951
8526 701951 737342 689399 701970 602298 559520 470855 461877 227184 154971 290854 282090 155676
8514 155676 229761 395454 275579 275333 292613 442844 403644 193288 83040 106422 106448 90405
8502 90405 245585 222631 142094 -113164 -154099 125857 460949 543279 467757 383842 350638
8491 350638 214784 114938 216168 285254 232892 36550 -23072 8063 -2983 97148 24072
8480 24072 -127660 -31688 -19108 -63692 -33472 -150239 -170920 -213026 -324073 -119607 10126
8469A0126M3102J03284j6548K2133N3204J1233m5499O270K3159O4337K25084P8824
8457E78709k8840j71021l63344j03095r8477K7664K33308J42279j21204j27316
8447c1337R4872J73016K66131j0695k25458j04201L7598j8107Q9352J26726o1970
8436C35927j77025K5567o2863j5926K14964K4040r4795m4810N873K5751n1653
8425A85050r0706J19391R6672J15339j21490j24737j02593J40911N9844j07108
8415A70573K27141J27346j39663m1515l9346j28635j00607j03528M7521R6978
8405A16265P5347O5435Q9884m7777j64509o3532l17645r6868N8096R5355J20981
8394f8968q8837R499J09813N8883J44950J27602j70095j52075R4159J23704j6990
$$ plain form
8469 10126 53228 156512 139964 162097 215301 226534 181035 187305 210464 274801 499885 578709
8457 578709 549869 378848 15504 -87591 -186068 -158404 74904 217183 95979 -31337
8447 -31337 63535 236551 502682 491987 266529 162328 199926 181819 271171 397897 335927
8436 335927 158902 184469 121606 105680 320644 344684 249889 205079 210952 236703 185050
8425 185050 94344 213735 310407 425746 304256 179519 76926 217837 277681 170573
8415 170573 397714 525060 385397 343882 304536 175901 75294 -28234 19287 116265
8405 116265 191612 257047 346931 299154 134645 71113 -246532 -343400 -285304 -189949 -68968
8394 -68968 -157805 -148306 -38493 20390 165340 292942 122847 -29228 64931 188635 171645
8383A71645N7373k734r7637j40494j22246o044P1815R5339k1716M9956M9508M2326
8371A47091p9639j3328K3327J50332j681J1900n237l4959P2867l528r4435k4715
8359A47995J9699n6196L8987J3633m289K0727j0889j6241p1872j043J0080k0709
8347F9882j15589J5831K8384M9369K7410M2265p5884q3517P4355j54166m7526
8336a69186J08100J50074O6184J83597j35763p6421K31974K9844j01369r933j79396
8325I7705J03262p2309m9321M8426J21961M9169j34744k45329j8320q2775J0228
8314a72047J30292M5932J29179K22582o7638m8012J96077p6993j21262Q3275r7452
8303B23933n6718n4855q2663k5359O3993l8407N1520J76510r360j10829n2744
$$ plain form
8383 171645 229018 226284 128647 -11847 -134093 -140137 -68322 27017 5301 55257 104765 147091
8371 147091 67452 54124 77451 227783 226102 238002 232765 197806 270673 267145 172710 147995
8359 147995 167694 111498 150485 164118 159829 180556 169667 153426 81554 80511 90591 69882
8347 69882 -45707 -29876 -1492 47877 75287 117552 41668 -41849 32506 -121660 -169186
8336 -169186 -61086 88988 155172 338769 203006 126585 358559 388403 287034 277101 97705
8325 97705 200967 128658 79337 127763 249724 298893 164149 -81180 -99500 -182275 -172047
8314 -172047 -41755 4177 133356 355938 288300 240288 436365 359372 238110 321385 223933
8303 223933 167215 112360 29697 4338 68331 29924 81444 257954 248594 137765 85021
8292H5021N3565j16249m0658j0707J6156Q1678q6052K4557J54820j78135k08185
8281b24189N1490n9279Q7149K4923K02929J25398k2397o3461j3897K6590L0917
8270A66173j30393j0161M9254j2120j02357k325R8038O3390L9028n4290q1297
8259B2940Q5754j360K7048Q2748K2508k26510K2811R5876O8524p5753m031j46301
8247b5746r950J47778N8871j24440J68979J12867j08934l08866J3848R1237J1831
8236B7475j29275j6657K49359K0805k29431j64123J03811K77339J24450k9142
8226B34611j24533k8012J25154J845j54042J146J32948Q9279O1190N3775p1730
8215C21631R9225j53368j46997j31940q7095N9037J81872p6871k06984M1871J06842
$$ plain form
8292 85021 138586 22337 -18321 -29028 -12872 68806 -17246 7311 162131 -16004 -224189
8281 -224189 -172699 -231978 -144829 -119906 83023 208421 186024 122563 108666 135256 166173
8270 166173 35780 25619 74873 62753 -39604 -41929 56109 119499 158527 104237 22940
8259 22940 108694 107334 134382 217130 239638 13128 35939 131815 200339 124586 120555 -25746
8247 -25746 -35696 112082 170953 46513 215492 328359 219425 -89441 -75593 15644 27475
8236 27475 -101800 -118457 130902 151707 -77724 -241847 -138036 139303 263753 234611
8226 234611 110078 82066 207220 209065 55023 56169 189117 278396 339586 393361 321631
8215 321631 420856 267488 120491 -11449 -98544 -39507 142365 65494 -141490 -99619 7223
8204G223J4254l4679j4199j880n2282J02570J67237P2647J769L1038j6460p081
8192B70157j4557j37786Q2147L07567j06176k49473O2164k8288k5354l1019r3928
8181C5454r4364N8506m2306l5500J03931o4141J54012J06968k9634k083M4184
8170B35027o1748M8334N1609j34220j54172p8820j16735J32538R5593r2756J4110
8159f1240J81830q8956J8913L4907J07530M8055n6034j46677k82061o2225K05468
8148a00490J4655j217J1400K25381J94335O6393l5007j71727K2755J31219n1965
8137C05732q831n9420K44958J00425j76849j41430o7919l6122K4093m0350J19146
8126B63433M5289K1118j43620J3864j5005j00377J0035K12806K39730k06977j38061
$$ plain form
8204 7223 21477 -13202 -27401 -29281 -81563 21007 188244 260891 262660 293698 277238 270157
8192 270157 255600 117814 199961 507528 401352 151879 214043 185755 160401 129382 35454
8181 35454 -58910 -404 -42710 -78210 25721 -38420 115592 222560 192926 190843 235027
8170 235027 173279 221613 273222 139002 -15170 -93990 -210725 -78187 17406 -75350 -61240
8159 -61240 120590 31634 50547 85454 192984 241039 185005 38328 -243733 -305958 -100490
8148 -100490 -85835 -87052 -75652 149729 344064 410457 375450 203723 226478 357697 305732
8137 305732 296901 237481 482439 582864 406015 264585 196666 160544 184637 144287 263433
8126 263433 308722 329840 186220 200084 185079 84702 94737 307543 547273 340296 202235
8115B02235l5429m5579J80750j27759M6978O7239p1759q1069J11334J53417J42323
8104E42681M7332j99372k01779r0219J11633P0493j54294J62319J28659p9098
8094C38355j83271l4038j00570Q661J08062Q0838n5190j00554J36952J05884n315
8083B99814k5127r461J57952o2986q5800r7921P3556j6932M2488O0719k24787
8072A11515n2425Q045r2672j16908p788J27547J41676O1260j7892J02991p0931
8061A94418j67158N9091J45464J9109r3278n3382M4994l7310k6571l7677K6373
8050G4073O2609j06951k27832K52724J56531o5832P0754O0922J05359R5943l8296
8039D40004r2907l8763j48163n4959n9939Q9798K63872R1678R7436M497j07385
$$ plain form
8115 202235 166806 121227 301977 174218 221196 288435 216676 135607 246941 400358 542681
8104 542681 590013 390641 188862 98643 210276 280769 126475 288794 417453 338355
8094 338355 155084 121046 20476 29137 137199 218037 162847 62293 199245 305129 299814
8083 299814 274687 265226 423178 360192 274392 176471 250027 233095 275583 336302 111515
8072 111515 59090 67135 -25537 -142445 -150233 -22686 118990 180250 162358 265349 194418
8061 194418 27260 86351 231815 250924 157646 104264 149258 111948 85377 47700 74073
8050 74073 136682 29731 -198101 54623 211154 145322 216076 276998 382357 478300 440004
8039 440004 347097 308334 160171 105212 45273 135071 398943 490621 588057 592554 485169
8028D85169q4601j18633P8324n357J72778J13174m2891o5523L5204j7623q1461
8017D68560k10492P3067J63120j25630r2681n9824J97622K05737J17112O0665
8007G97256L9324k8902J1858n0391P7432r9436k13995O1096J68033N7448l6485
7996G83238k48171q3605K42815j6162j21598m5860J76177n2041M1734j81334n0295
7985D44898M9913l3784L3706K27690L0285K1027J86337K21615j49753j81192J9845
7974H70587P9933P2006K3217n7695L4367J31992K9591j38333J13213J57412M2133
7963A358423k39064k03073l3099m2650K7831P0446N5358Q8750J70923J2285n7428
7952A208702j25049k32638M9996K21011P5957k01253Q310l5367l5674J1500O7779
$$ plain form
8028 485169 400568 281935 360259 354902 527680 640854 597963 532440 567644 550021 468560
8017 468560 258068 331135 494255 368625 275944 216120 413742 619479 736591 797256
8007 797256 836580 807678 819536 769145 846577 747141 533146 594242 762275 819723 783238
7996 783238 535067 451462 694277 678115 556517 510657 686834 634793 676527 495193 444898
7985 444898 494811 461027 494733 722423 752708 773735 960072 1181687 1031934 850742 870587
7974 870587 950520 1022526 1045743 988048 1022415 1154407 1183998 1045665 1158878 1316290 1358423
7963 1358423 1119359 916286 883187 840537 868368 938814 994172 1082922 1253845 1266130 1208702
7952 1208702 1083653 851015 901011 1122022 1197979 996726 1005036 969669 933995 945495 1013274
7941A013274K35134m2864j15563o9551O8686O069K6520j34163Q2716K43174L0805
7930A344237j3829R8038J59806K39j35830p2967K10607l3510k15649J1932n9598
7919A293476k59658k9156P4471J07166j7692k9757m2281j18577L21058J90802
7909A489852k46422k18159j35908L2708R3569j5300R1209J81923q8399k05497
7899I79576J05565L0126r3336p1821J5887J30599N7446j80820r4868m001O1924
7888I36277Q6498j22880k15883j9367l1777Q6135J09908k4678J34693M9514k60690
7877G27750l13124l8144R5793M9428J76161J42569l7711n9847k20960k35777L6227
7866C22365J75476L0820J79702J09055k4164n5239j44358N8184L3417k6200J7709
$$ plain form
7941 1013274 1248408 1205544 1089981 1020430 1089116 1095185 1121705 987542 1070258 1313432 1344237
7930 1344237 1330408 1428446 1588252 1588491 1452661 1379694 1590301 1556791 1341142 1353074 1293476
7919 1293476 1033818 1004662 1079133 1186299 1168607 1138850 1096569 977992 1299050 1489852
7909 1489852 1243430 1025271 889363 922071 1015640 1000340 1091549 1273472 1185073 979576
7899 979576 1085141 1115267 1021931 950110 965997 1096596 1154042 973222 878354 874353 936277
7888 936277 1022775 899895 684012 664645 632868 719003 828911 804233 938926 988440 727750
7877 727750 414626 376482 472275 521703 697864 840433 802722 742875 521915 286138 322365
7866 322365 497841 528661 708363 817418 793254 738015 593657 651841 685258 659058 676767
7855F76767O410J25513p3901j44460k0041j67937r5803O838J59450j228J05167
7844E76775l0692j80743j2364K58655n9741k88630k8770R5955J94965n4000j46590
7833C24820j06367J03189o204j88117L643J19901j16538j59299R0056L84079M4703
7822D93866j89090k53352K1791K17617N9525j64165q2784J518J09500j15837n2181
7811D6408O4753L1976Q4058J37536N1923n5185j0771j21484l2703K50524P4866
7800E21901n9484q0692J6705j37920J42484J80127p4979k29947j36885K4294J59498
7789C25102n710j12734J2556p6117o4115P2508j95528j07114o0315K48868K27324
7778B64725j3429j82982j09420j60408k3728J13453R1267M2534j8715K9669L7474
$$ plain form
7855 676767 683177 808690 734789 590329 570288 402351 306548 313386 472836 471608 576775
7844 576775 546083 365340 352976 611631 551890 263260 234490 330445 525410 471410 324820
7833 324820 218453 321642 315438 127321 130964 250865 134327 -24972 65084 449163 493866
7822 493866 304776 51424 73215 290832 350357 186192 103408 104926 214426 98589 46408
7811 46408 111161 143137 227195 364731 416654 361469 350698 229214 196511 447035 521901
7800 521901 462417 381725 398430 260510 402994 583121 508142 278195 141310 165604 325102
7789 325102 319392 206658 219214 143097 78982 151490 -44038 -151152 -211467 37401 264725
7778 264725 251296 68314 -41106 -201514 -225242 -111789 -20522 22012 3297 32966 70440
7767G0440k38377M9965L9469j6911J61540Q5725j80029N9796K06784Q136K696
7756B49234j59794j8499j37789m1965R570Q2782J23516J1198o6408J87746R4055
7745C33646N0553N7370n427M8432p0342j04531k5457j5097m9466P4199m1113P8962
7733C31729l817m8129K547J3506o5820o3654j40951j15584o7039j90819O6976
7722b81055O3219j997N3570O619R3897J14561M6281l4940j34846q3350J47215
7711a0826J10425J6858m7993k26037k00706O2485l795j11619L5842N4481J0467
7700c10418K38346N8083p0446J0236K5790M1907m4816K8223R3100m4643N0045
7689G5407K42816j25298j89489j29959n9176J84951J52484p7592o0083r9510R759
$$ plain form
7767 70440 -167937 -117972 -78503 -95414 66126 151851 -28178 31618 238402 246538 249234
7756 249234 89440 70941 -66848 -108813 -99243 -16461 107055 118253 51845 239591 333646
7745 333646 384199 441569 436142 484574 414232 309701 284244 269147 219681 293880 252767 331729
7733 331729 327912 279783 282330 295836 230016 166362 25411 -90173 -157212 -348031 -281055
7722 -281055 -217836 -219833 -166263 -159644 -65747 48814 95095 60155 -74691 -158041 -10826
7711 -10826 99599 116457 68464 -157573 -358279 -295794 -299589 -411208 -375366 -320885 -310418
7700 -310418 -72072 -13989 -84435 -74199 -48409 -6502 -51318 -23095 70005 25362 75407
7689 75407 318223 192925 3436 -126523 -185699 -748 151736 74144 14061 -85449 -75690
7678g5690J5776k5349N7465j15949Q1469O1687J26855J10405K1124o8520j63311
7667B5962J5485q9435n9360N768N9819J41055p5816k34616Q3562K4190J664M5588
7655e6134L5875l4496P449k3080j01802k9019J06157K06073K7626N737J7054J34644
7643B96084J1688m2753n2082O3107m6122j31722O0919j7987J5782j82740j4315
7632d0141J83246M3571m9692q9559j8679k3951m9418n253k8165K8782m8129R1403
7620e985O7002J165o5729k12806M4083J14813L392r9669j65784L9994Q2218q8142
7608b85448J72713L9409M6956P0097J08282P4156n6508j34254j98270K22470J89224
7597B48827J07746q2635j78524p1040j55642k0313J10507K94672J40291p1969
$$ plain form
7678 -75690 -59914 -85263 -27798 -143747 -62278 -591 126264 236669 257793 189273 25962
7667 25962 41447 -47988 -107348 -101580 -41761 99294 23478 -211138 -127576 -103386 -101722 -56134
7655 -56134 -20259 -54755 -47306 -70386 -172188 -201207 -95050 111023 138649 144386 161440 296084
7643 296084 307772 265019 212937 276044 229922 98200 159119 141132 156914 -25826 -40141
7632 -40141 143105 186676 136984 47425 28746 4795 -44623 -49876 -78041 -49259 -97388 -5985
7620 -5985 61017 62182 -3547 -216353 -172270 -57457 -54065 -153734 -319518 -279524 -197306 -285448
7608 -285448 -112735 -73326 -26370 43727 152009 226165 169657 35403 -162867 59603 248827
7597 248827 356573 273938 95414 24374 -131268 -151581 -41074 253598 393889 321920
$$ [...]
##END NTUPLES=NMR SPECTRUM
##END=
