##TITLE=Analysis number 321007
Compound Code cc 55604
Book Reference 423/76/7
Project Code adrs
Chemist Name bruced
##JCAMPDX= 6.0         $$ Bruker NMR JCAMP-DX V2.0
##DATA TYPE= NMR SPECTRUM
##DATA CLASS= NTUPLES
##ORIGIN= Bruker BioSpin GmbH
##OWNER= nmr
$$ XWIN-NMR		Version 3.5
$$ Thu Jul 20 10:36:17 2006 GMT Daylight Time (UT+1h)  MAYBRIDGE\nmr@NMR_250MHZ
##.OBSERVE FREQUENCY= 250.131544655141
##.OBSERVE NUCLEUS= ^1H
##.ACQUISITION MODE= SIMULTANEOUS (DQD)
##.ACQUISITION SCHEME= undefined
##.AVERAGES= 16
##.DIGITISER RES= 18
##SPECTROMETER/DATA SYSTEM= dpx250
##.PULSE SEQUENCE= zg30
##.SOLVENT NAME= CDCl3
##.SHIFT REFERENCE= (INTERNAL, CDCl3, 0, 16.522)
##AUDIT TRAIL= $$ (NUMBER, WHEN, WHO, WHERE, WHAT)
$$ ##TITLE= Audit trail, XWIN-NMR		Version 3.5
$$ ##JCAMPDX= 5.01
$$ ##ORIGIN= Bruker BioSpin GmbH
$$ ##OWNER= nmr
$$ C:\u/data/dgb/nmr/ADRS/3130/pdata/1/auditp.txt
$$ ##AUDIT TRAIL=  $$ (NUMBER, WHEN, WHO, WHERE, WHAT)
(   1,<2006-07-20 10:35:52.19 +100>,<MAYBRIDGE\nmr>,<NMR_250MHZ>,
      <created by zg, POWCHK disabled, PULCHK disabled
       configuration hash MD5:
       E2 DF 36 D8 04 B2 41 60 5A D7 A3 38 5A 4B D0 FE
       data hash MD5: 64K
       5D F1 B7 C6 A2 7A 2E 91 CA 1C F8 7E 50 D0 15 89>)
(   2,<2006-07-20 10:36:08.64 +100>,<MAYBRIDGE\nmr>,<NMR_250MHZ>,
      <Start of raw data processing
       ef LB = 0.3 FT_mod = 6 PKNL = 1 SI = 32K 
       data hash MD5: 32K
       F7 E1 71 A4 9A D5 5F 75 C2 FD 85 1E 8B EB 7C 1F>)
(   3,<2006-07-20 10:36:10.44 +100>,<MAYBRIDGE\nmr>,<NMR_250MHZ>,
      <apk 
       data hash MD5: 32K
       93 74 58 58 B2 B9 46 4C 62 E2 73 BE B0 B9 CB BB>)
(   4,<2006-07-20 10:36:11.25 +100>,<MAYBRIDGE\nmr>,<NMR_250MHZ>,
      <abs ABSG = 5 
       data hash MD5: 32K
       28 F1 14 5A 92 31 23 7F C7 BD 68 AE FC DF F2 5D>)
$$ ##END=
$$ 
$$ hash MD5
$$ CC 13 E8 CD 11 44 B2 31 C0 5A ED B6 BF 28 E6 D4
##$RELAX= 
##$RELAX= 
##$RELAX= 
##$RELAX= 
##$RELAX= 
##$RELAX= 
##$RELAX= 
$$ Bruker specific parameters
$$ --------------------------
##$DU= <C:\u>
##$EXPNO= 3130
##$NAME= <ADRS>
##$PROCNO= 1
##$TYPE= <nmr>
##$USER= <dgb>
##$AMP= (0..31)
100 100 100 100 100 100 100 100 100 100 100 100 100 100 100 100 100 100 
100 100 100 100 100 100 100 100 100 100 100 100 100 100 
##$AQSEQ= 0
##$AQ_mod= 3
##$AUNM= <au_zg>
##$AUTOPOS= <24 >
##$BF1= 250.13
##$BF2= 250.13
##$BF3= 250.13
##$BF4= 250.13
##$BF5= 500.13
##$BF6= 500.13
##$BF7= 500.13
##$BF8= 500.13
##$BYTORDA= 1
##$CFDGTYP= 0
##$CFRGTYP= 5
##$CHEMSTR= <none>
##$CNST= (0..31)
1 1 145 1 1 1 1 1 1 1 1 1 1 1 1 1 1 1 1 1 1 1 1 1 1 1 1 1 1 1 1 1 
##$CPDPRG= <>
##$CPDPRG1= <>
##$CPDPRG2= <>
##$CPDPRG3= <>
##$CPDPRG4= <mlev>
##$CPDPRG5= <mlev>
##$CPDPRG6= <mlev>
##$CPDPRG7= <mlev>
##$CPDPRG8= <mlev>
##$CPDPRGB= <>
##$CPDPRGT= <>
##$D= (0..31)
0 1 0 0 0 0 0 0 0 0.06 0 0 0 0 0 0 0.0002 0 0 0 0 0 0 0 0 0 0 0 0 0 0 
0 
##$DATE= 1153388150
##$DBL= (0..7)
120 120 120 120 120 120 120 120 
##$DBP= (0..7)
150 150 150 150 150 150 150 150 
##$DBP07= 0
##$DBPNAM0= <>
##$DBPNAM1= <>
$$ [...]
##$SUBNAM7= <"">
##$SUBNAM8= <"">
##$SUBNAM9= <"">
##$SW= 20.6930455092707
##$SWIBOX= (0..15)
0 0 3 0 0 0 0 0 0 0 0 0 0 0 0 0 
##$SW_h= 5175.983436853
##$TD= 65536
##$TD0= 1
##$TE= 295.16
##$TE2= 300
##$TE3= 300
##$TEG= 300
##$TL= (0..7)
0 120 120 120 120 120 120 120 
##$TP= (0..7)
150 150 150 150 150 150 150 150 
##$TP07= 0
##$TPNAME0= <>
##$TPNAME1= <>
##$TPNAME2= <>
##$TPNAME3= <>
##$TPNAME4= <>
##$TPNAME5= <>
##$TPNAME6= <>
##$TPNAME7= <>
##$TPOAL= (0..7)
0.5 0.5 0.5 0.5 0.5 0.5 0.5 0.5 
##$TPOFFS= (0..7)
0 0 0 0 0 0 0 0 
##$TUNHIN= 0
##$TUNHOUT= 0
##$TUNXOUT= 0
##$USERA1= <user>
##$USERA2= <user>
##$USERA3= <user>
##$USERA4= <user>
##$USERA5= <user>
##$V9= 5
##$VALIST= <valist>
##$VCLIST= <CCCCCCCCCCCCCCC>
##$VD= 0
##$VDLIST= <DDDDDDDDDDDDDDD>
##$VPLIST= <PPPPPPPPPPPPPPP>
##$VTLIST= <TTTTTTTTTTTTTTT>
##$WBST= 1024
##$WBSW= 4
##$XGAIN= (0..3)
0 0 0 0 
##$XL= 0
##$YL= 0
##$YMAX_a= 566231
##$YMIN_a= -477717
##$ZGOPTNS= <>
##$ZL1= 120
##$ZL2= 120
##$ZL3= 120
##$ZL4= 120
##$ABSF1= 16.522
##$ABSF2= -4.171173
##$ABSG= 5
##$ABSL= 3
##$ALPHA= 0
##$AQORDER= 0
##$ASSFAC= 0
##$ASSFACI= 0
##$ASSFACX= 0
##$ASSWID= 0
##$AUNMP= <proc_1d>
##$AZFE= 0.1
##$AZFW= 0.1
##$BCFW= 0
##$BC_mod= 0
##$BYTORDP= 0
##$COROFFS= 0
##$CY= 12.5
##$DATMOD= 1
##$DC= 0
##$DFILT= <>
##$DTYPP= 0
##$F1P= 14.0000005364418
##$F2P= -0.99999901652339
##$FCOR= 0.5
##$FTSIZE= 32768
##$FT_mod= 6
##$GAMMA= 0
##$GB= 0
##$INTBC= 1
##$INTSCL= 1
##$ISEN= 128
##$LB= 0.3
##$LEV0= 0
##$LPBIN= 0
##$MAXI= 10000
##$MC2= 0
##$MEAN= 0
##$ME_mod= 0
##$MI= 0
##$NCOEF= 0
##$NC_proc= -4
##$NLEV= 6
##$NOISF1= 0
##$NOISF2= 0
##$NSP= 0
##$NTH_PI= 0
##$NZP= 0
##$OFFSET= 16.522
##$PC= 1
##$PHC0= 12.34894
##$PHC1= 7.011105
##$PH_mod= 1
##$PKNL= yes
##$PPARMOD= 0
##$PSCAL= 4
##$PSIGN= 0
##$REVERSE= no
##$SF= 250.13
##$SI= 32768
##$SIGF1= 0
##$SIGF2= 0
##$SINO= 400
##$SIOLD= 32768
##$SREGLST= <1H.CDCl3>
##$SSB= 0
##$STSI= 32768
##$STSR= 0
##$SW_p= 5175.98343685301
##$SYMM= 0
##$S_DEV= 0
##$TDeff= 65536
##$TDoff= 0
##$TI= <Analysis number 999999
Compound Code 99
Book Reference 9
Project Code 9>
##$TILT= no
##$TM1= 0
##$TM2= 0
##$TOPLEV= 0
##$USERP1= <user>
##$USERP2= <user>
##$USERP3= <user>
##$USERP4= <user>
##$USERP5= <user>
##$WDW= 1
##$XDIM= 32768
##$YMAX_p= 313102035
##$YMIN_p= -73417
$$ End of Bruker specific parameters
$$ ---------------------------------
##NTUPLES= NMR SPECTRUM
##VAR_NAME=  FREQUENCY,     SPECTRUM/REAL,   SPECTRUM/IMAG
##SYMBOL=    X,             R,               I
##VAR_TYPE=  INDEPENDENT,   DEPENDENT,       DEPENDENT
##VAR_FORM=  AFFN,          ASDF,            ASDF
##VAR_DIM=   32768,         32768,           32768
##UNITS=     HZ,            ARBITRARY UNITS, ARBITRARY UNITS
##FACTOR=    0.157963299565203, 1,           1
##FIRST=     4132.6476996994, 0,             0
##LAST=      -1043.33573715361, 0,           0
##MIN=       -1043.33573715361, -73417,      0
##MAX=       4132.6476996994, 313102035,     0
$$ Real data points
##PAGE= N=1
##DATA TABLE= (X++(R..R)), XYDATA
$$ [...]
18530A065055M1165M0954M2105L3677O0579N8408N7606O2850O4525P6524Q9633
$$ 1065055 1106220 1147174 1189279 1222956 1283535 1341943 1399549 1462399 1526924 1603448 1693081
18519A693081J05866J21681J35190J49747J59741J99573K43750K68535K86202
$$ 1693081 1798947 1920628 2055818 2205565 2365306 2564879 2808629 3077164 3363366
18510C363366L01195L42176L97326M50257N23830O51419Q18195J010651J238750
$$ 3363366 3664561 4006737 4404063 4854320 5378150 6029569 6847764 7858415 9097165
18501I097165J557112J952395K326543K615327K898468L465383M256804N006527
$$ 9097165 10654277 12606672 14933215 17548542 20447010 23912393 28169197 33175724
18493C3175724N639200O805533Q679244J0529402J1977501J2515380J2481134
$$ 33175724 38814924 45620457 54299701 64829103 76806604 89321984 101803118
18486A01803118J2801976J1755366P622861K803266J072709k088768q452693j0659423
$$ 101803118 114605094 126360460 133983321 136786587 137859296 135770528 127317835 116658412
18478A16658412r052221r188701j0291867q841569o327261m850967m416984m395349
$$ 116658412 107606191 98417490 88125623 79284054 72956793 68105826 63688842 59293493
18470E9293493m182077l892620m352095m681327m203767l564202l158070k642443
$$ 59293493 55111416 51218796 46866701 42185374 37981607 34417405 31259335 28616892
18462B8616892j930226j392887j121564r18574o85713m73467j80070R4618L30385
$$ 28616892 26686666 25293779 24172215 23253641 22567928 22094461 21914391 22009009 22339394
18453B2339394N54138Q30001J249202J844536K569116L186317L419958L457046
$$ 22339394 22893532 23723533 24972735 26817271 29386387 32572704 35992662 39449708
18445C9449708L789435M298513M399535M289581M947138O037738O150474O231504
$$ 39449708 43239143 47537656 51937191 56226772 61173910 67211648 73362122 79593626
18437G9593626P535251R024154Q555528O016869M127723L638849P05990m585241
$$ 79593626 87128877 96153031 104708559 110725428 114853151 118492000 119197990 114612749
18429A14612749p397170p287870r738547j1795022j0354032q159794p316420o362727
$$ 114612749 107215579 99927709 90189162 78394140 68040108 59880314 52563894 46201167
18421D6201167m766844l658268l030971k503396k401682k473054k258748j931809
$$ 46201167 41434323 37776055 34745084 32241688 29840006 27366952 25108204 23176395
18413B3176395j744005j571954j316796j074773r02219q02360p54581o97469o39695
$$ 23176395 21432390 19860436 18543640 17468867 16566648 15764288 15009707 14312238 13672543
18404A3672543o10507n90940n50341n02412m80034m51131l86853l49664l01924
$$ 13672543 13062036 12471096 11920755 11418343 10938309 10487178 10100325 9750661 9448737
18395I448737l09096k99206k80720k54271k04647k06960k05148j81288j81197
$$ 9448737 9139641 8840435 8559715 8305444 8100797 7893837 7688689 7507401 7326204
18386G326204j78157k27928k42973k17927k05737k27637k29710k01021j73338
$$ 7326204 7148047 6920119 6677146 6459219 6253482 6025845 5796135 5595114 5421776
18377E421776j74105j51858j38003j36886j28710j35963j39961j11617j04381
$$ 5421776 5247671 5095813 4957810 4820924 4692214 4556251 4416290 4304673 4200292
18368D200292j02348j12540j24394j12626r6008q8578q6745p7659n6871n4799
$$ 4200292 4097944 3985404 3861010 3748384 3652376 3563798 3477053 3399394 3342523 3287724
18358C287724q4682q0762n8468o7114n5508m2946o0579n9555n2218l5018m1823
$$ 3287724 3203042 3122280 3063812 2996698 2941190 2898244 2837665 2778110 2725892 2690874 2649051
18347B649051m1380k9768l1813m6291m1594l6393k7593k4389k6628k9735k0015
$$ 2649051 2607671 2577903 2546090 2499799 2458205 2421812 2394219 2369830 2343202 2313467 2293452
18336B293452p689l9597m7214m7550l6229n9328p6061o6726n5962n4935o0457
$$ 2293452 2285763 2246166 2198952 2151402 2115173 2055845 1979784 1913058 1857096 1802161 1741704
18325A741704o7321n7769l0005k9979l6355l7284k1780l9296l8227m4578k5198
$$ 1741704 1674383 1616614 1586609 1556630 1520275 1482991 1461211 1421915 1383688 1339110 1313912
18314A313912k3973k5464k7420k7896k1447k6690j4310k8450k3200j5686j2765
$$ 1313912 1289939 1264475 1237055 1209159 1187712 1161022 1146712 1118262 1095062 1079376 1066611
18303A066611k0492j2914j8002j6475l2133j0698j691m188P500l335k300j5515
$$ 1066611 1046119 1033205 1015203 998728 966595 955897 954206 950018 957518 954183 951883 936368
18291I36368N022L1611K7473P399J4673J1045P709j1611l3245l4025j9788k2295
$$ 936368 941390 973001 1000474 1007873 1022546 1033591 1041300 1029689 996444 962419 942631 920336
18279I20336l6982m0273j9843k7438j2747j1057M990k2223l1726j0911o008j0166
$$ 920336 883354 843081 823238 795800 783053 771996 776986 754763 723037 712126 706118 695952
18267F95952j2045k4628l1103j8503j0448j1519J317k128j3338p250l838j2997
$$ 695952 683907 659279 628176 609673 599225 587706 589023 586895 573557 566307 562469 549472
18255E49472j2010L200j2369j7072O275J4411R199J2567m539J1597P711J185k208
$$ 549472 537462 540662 528293 511221 517496 531907 541106 553673 549134 560731 568442 569627 567419
18242E67419K923r882O250P268J0328L628L4047K0868L336Mj1170Q22j6870m6984
$$ 567419 570342 560460 566710 573978 584306 587934 621981 642849 646185 646189 635019 635841 618971 571987
18228E71987k6470k7602k7009j2972q357m060j795N610L045r87J8759P385m832
$$ 571987 545517 517915 490906 477934 469577 465517 463722 469332 472377 471390 490149 497534 492702
18215D92702q656k1317j1365j2342m225j5483j0951J2699j5104k7584r426J1231
$$ 492702 484046 462729 451364 439022 434797 419314 408363 421062 405958 378374 368948 380179
18203C80179J2554K969k086n611N674O43j4968k6772n217J0469J0971q617j6840
$$ 380179 392733 395702 393616 388005 393679 394322 379354 352582 347365 357834 368805 360188 343348
18190C43348j0255j4028j9493N319J5670m866o440p545o819K089L763n584j5138
$$ 343348 333093 319065 299572 304891 320561 315695 309255 301710 294891 296980 300743 295159 280021
18177B80021P539J5049K750j2965l166m390R087Q094o443j945L233J4119N967
$$ 280021 287560 302609 305359 292394 289228 284838 293925 302019 295576 293631 296864 310983 316950
18164C16950K657K0775J5577J3210R768J8272M3204M1980J3983K0992K3124l909
$$ 316950 319607 340382 355959 369169 378937 397209 440413 482393 496376 517368 540492 536583
18152E36583P193J6898J6000J5022J1564N81n344j9194k2201k4571j3661Q58O654
$$ 536583 543776 560674 576674 591696 603260 603841 598497 579303 557102 532531 518870 519728 526382
18139E26382J0360K070mQ456K2339P893k3140j5496j6772j9579r880J673K1365
$$ 526382 536742 538812 538808 547264 569603 577496 554356 538860 522088 502509 492629 494302 515667
18126E15667R678L759J2057K9170N0842P3654R6778J33989K10382K95755M86527
$$ 515667 525345 529104 541161 570331 621173 694827 791605 925594 1135976 1431731 1918258
18115A918258Q69315J516941K163746J845007J267310J756738J939913M12526
$$ 1918258 2787573 4304514 6468260 8313267 9580577 11337315 13277228 13689754
18107A3689754l503467l515019j933408j145770p16131m44653l24571k43775j97924
$$ 13689754 10186287 6671268 4737860 3592090 2875959 2431306 2106735 1862960 1665036
18098A665036j53186j12507q6469o3041n7750p4407n4780m0828j6026p05L027
$$ 1665036 1511850 1399343 1312874 1249833 1192083 1117676 1062896 1022068 1006042 1005337 1008364
18087A008364J1813r762q904Q310q383m3311q1477q8241o1740l5339l2367k9924
$$ 1008364 1020177 1010415 1001511 1009821 1001438 958127 876650 788409 726669 691330 658963 629039
18075F29039m478j3183j8010k0969l46p813l0670k7295q563j8405j1337J57n796
$$ 629039 624561 611378 593368 572399 572053 564240 533570 506275 497712 479307 467970 468127 462331
18062D62331p051q069k5232k0332m286m729j2062j5681m982j6648j4163p616J716
$$ 462331 455280 447211 421979 401647 397361 392632 380570 364889 359907 343259 329096 321480 323196
18049C23196j6495j6043n606l217o112J0692L54j8170j9295j7745q281J848N089
$$ 323196 306701 290658 285052 281835 275723 286415 286769 268599 249304 231559 223278 225126 230215
18036B30215J81k025j733q139q256j1621n138l358j010L292K750R478j975q893
$$ 230215 230396 228371 226638 218499 210243 198622 193484 190126 189116 192408 195158 204636 202661 193768
18022A93768m595J1302J78o79J0921p701L94Q434N261o908Q36O624k284k1637
$$ 193768 189173 200475 200653 199974 210895 203194 203588 212022 217283 210375 211211 217835 215551 193914
18008A93914r025L583M465m955j8946p742P41p460M202Q237n945M151q117J3213
$$ 193914 184889 188472 192937 187982 169036 161294 162035 154575 158777 167014 161069 165220 157103 170316
17994A70316K1912L877p518L239K3457J6477K5007L2172L1720K6890J8208K7799
$$ 170316 192228 196105 188587 191826 215283 231760 256767 288939 320659 347549 365757 393556
17982C93556L5000M1566M6179K3595L4554M6076K4847J6598L1322L5944K1691
$$ 393556 428556 470122 516301 539896 574450 620526 645373 661971 693293 729237 750928
17971G50928L307k8261k4104l4151l6812m2843m1682m8617m4755l4396m7340l5814
$$ 750928 754235 725974 701870 667719 630907 588064 546382 497765 453010 418614 371274 335460
17959C35460j8477l993r622k0998k516N45j5294j1865k651j7312j7933q93p335
$$ 335460 316983 312990 303368 282370 279854 280399 265105 253240 250589 233277 215344 214451 207116
17946B07116n271r247l161J3377J7747j562K0258L0766R599L689L2288M4852N0715
$$ 207116 201845 192598 189437 202814 220561 218999 239257 270023 279622 283311 315599 360451 411166
17933D11166M7098L6804K3941J8547J2310Q314N007j2778k6171j9642k656J425
$$ 411166 458264 495068 519009 537556 549866 558180 563187 550409 524238 504596 501940 503365
17921E03365K1P774J0715Q671K41J3855M527j9986l8008l8425m7224n6908l9703
$$ 503365 503386 511160 521875 530546 530787 544642 549169 529183 491175 452750 405526 348618 308915
17908C08915m1876l3123k9219j5974l281p463p18k059L089m645p244o322o641
$$ 308915 267039 233916 204697 188723 185442 177979 177261 175202 178291 173646 166402 160080 153439
17895A53439N030M220j0732k551j0538j2152j4651j4478K173l194N013L976L021
$$ 153439 158469 162689 151957 149406 138868 126716 112065 97587 99760 96566 101579 105555 108576
17882A08576N337q363n051K519o81j3164k0479M068m309M811J5113N803p255l049
$$ 108576 113913 105550 100499 103018 102337 89173 68694 72762 68453 73264 88377 94180 86925 83876
17868H3876n613K760P886k915r737r266k802k911Q850J6578J3573J1971l812q06
$$ 83876 78263 81023 88909 85994 76257 66991 64189 61278 70128 86706 100279 112250 108438 107632
17854A07632K228o023N48J986l16j0532j0846r942Q350k956j4731j312J7907R801
$$ 107632 109860 103837 104385 106371 106055 95523 84677 74735 83085 80129 65398 64086 81993 91794
17840I1794J733q791l553J0166o689j4049j0150m387K3180M555O166M427o898
$$ 91794 93527 84736 81183 91349 84660 70611 60461 56074 79254 83809 89975 94402 87504
17827H7504k1498j131J613q439k113P843J46l511N209N551O817L328O06j299L864
$$ 87504 66006 64875 66488 58049 55936 63779 63925 60414 65623 71174 77991 81319 81925 80626 84490
17812H4490o583j1814m315Q556j1345q682K819J4074p914j5031J1911P120K514
$$ 84490 77907 66093 61778 70334 58989 50307 53126 67200 59286 44255 56166 63286 65800
17799F5800o244j9795j4451M659N445O718M614k396K57p553J4297J9471R591J008
$$ 65800 59556 39761 25310 29969 35414 42132 46746 44350 44607 37054 51351 70822 80413 81421
17785H1421l019j3139j1159Q189o189j6519o563J1815K318j2617m412J1010j295
$$ 81421 78402 65263 54104 62293 56104 39585 33022 44837 47155 34538 30126 41136 39841
17772C9841o7Q080j319j4534o230Q930P484L979n356j2938J298r11M691l956n906
$$ 39841 39774 47854 46535 32001 25771 34701 42185 46164 40808 27870 29168 28257 32948 28992 23086
17757B3086L29J0668O46p199m69J4723Q704q040j2697j524N130O926J2031O075
$$ 23086 23415 34083 34729 27530 27061 41784 50488 42448 29751 28227 33357 40283 52314 58389
17743E8389j0499j375r601j2412J411j070o147K314O628N102O439k205j244j22
$$ 58389 47890 46515 36914 24502 25913 24843 18696 21010 27638 32740 39179 36974 35730 35608
17729C5608J1163R890M512O420q818j0795R91j2541p119j3773Q96J4072L810L85
$$ 35608 46771 56661 61173 67593 58775 47980 48971 36430 29311 15538 16434 30506 34316 34701
17715C4701L883K0040N057P41l529q952j739m544N057L306K809N06J719M630N716
$$ 34701 38584 58624 63681 64422 60893 51941 50202 45658 50715 54021 56830 57336 59055 63685 69401
17700F9401k045m570r324l579q258o293J8528N276j5945j2733K626L252L094r22
$$ 69401 67356 62786 53462 49883 41625 35332 53860 59136 43191 30458 33084 36336 39430 38508
17686C8508j0936M439J8965K761k911q360J17J0270R341O159j7895p389q52o681
$$ 38508 27572 32011 50976 53737 50826 42466 42583 52853 62194 68353 50458 43069 42217 35536
17672C5536m368j1072J5006J9636P135r720j6547k687K79o560N986R033M114k169
$$ 35536 31168 20096 35102 54738 61873 52153 35606 32919 33198 26638 32624 41657 45771 43602
17658D3602K925j8026r697R908N371n607M11k530J1004n593n540N137N885m422
$$ 43602 46527 28501 18804 28712 34083 28476 28887 26357 37361 31768 26228 31365 37250 32828
17644C2828p771O771R783R67L525N632r142p455m305K090M0n189J0906o868r305
$$ 32828 25057 31828 41611 42578 46103 51735 42593 35138 30833 32923 32963 27774 38680 31812 22507
17629B2507k688P020n308q898R527M086J1615P641j2342r297M317N866j7373n171
$$ 22507 19819 26839 21531 12633 22160 26246 37861 45502 33160 23863 28180 34046 16673 11502
17615A1502J2637M832j1972P236J3060m834l866M586j6965K063N800O654k830
$$ 11502 24139 28971 16999 24235 37295 32461 28595 33181 16216 18279 24079 30733 27903
17602B7903j308J0993K2551P50L797P412p259j3450O71k3736m188j53j2099m7
$$ 27903 26595 37588 60139 60889 64686 72098 64839 51389 52060 28324 24136 23983 11884 11837
17588A1837M126n041n371K421J6164J5034k753p263j5419L441K328R720k789p072
$$ 11837 15963 10922 5551 7972 24136 39170 36417 29154 13735 17176 19504 29224 26435 19363
17574A9363n620K008Q47n851L788J2957R004m400r724L961J9004N425j9494o468
$$ 19363 13743 15751 16598 10747 14535 27492 36496 32096 22372 26333 45337 50762 31268 24800
17560B4800m303j1418m09J9399N872j5229o031R738O480Q24j797p667r276M205
$$ 24800 20497 9079 8670 28069 33941 18712 12681 22419 28899 29723 27926 20259 10983 15188
17546A5188J1322O299p905j6519r03p014l299M226R953K967l685O012o396K938
$$ 15188 26510 32809 24904 8385 7482 468 -2831 1395 11348 14315 10630 16642 10246 13184
17532A3184j1478q785O52J4935J3574n419r920k997j669n902J1330J2181J2408
$$ 13184 1706 -7079 -6427 8508 22082 16663 6743 3746 2077 -3825 7505 19686 32094
17519C2094R099K3p6n968r826l919j312k688M756q94Q143L158O733j2001j5429
$$ 32094 41193 41216 41140 35172 25346 21427 20115 17427 22183 21289 29432 32590 39323 27322 11893
17504A1893k820K0803J0528l035k243J491j1307J080R114r579J4905J1513p049
$$ 11893 9073 29876 40404 37369 35126 36617 25310 26390 35504 25925 40830 52343 45294
17491D5294O972p1L043m230n613q478j1303o558P401l521J833N179L767j834q980
$$ 45294 52266 52195 55238 51008 45395 36917 25614 19056 26457 22936 24769 29948 33715 31881 22901
17476B2901o79L076N376O66p787m924j363Q256M494l122n008j0951L595p246q52
$$ 22901 22222 25298 30674 31340 23553 18629 17266 25522 30016 26894 21886 10935 14530 7284 6432
17461F432O594J0317N592j7704J53K509O146J193J309J0179K811j2173R403J0125
$$ 6432 13026 23343 28935 11231 11384 13893 20039 21232 22541 32720 35531 23358 32761 42886
17447D2886M395Q429J3878J6504J5680J2613m399j3416k8070k4800j1255M338
$$ 42886 47281 55710 69588 86092 101772 114385 109986 96570 68500 43700 32445 36783
17435C6783R9N824L218r542o681K044k576j416n466o710k2638O318J9914N034
$$ 36783 36882 42706 45924 36382 29701 31745 29169 27753 22287 15577 -7061 -743 19171 24205
17421B4205J1362P384k863j1437K888O099j2252j0285K298l637n613O300J046
$$ 24205 35567 42951 40088 28651 31539 37638 25386 15101 17399 13762 8149 14449 15495
17408A5495j123N94R30m318q005l224L292L239M065j318l580J1268J62j263R501
$$ 15495 14372 14966 15896 11578 3573 349 3641 6880 10945 9627 6047 17315 17477 16214 25715
17393B5715M058j3733M308P668p492l462P749k425r009J205J2493Q132m584N342
$$ 25715 29773 16040 20348 28016 20524 17062 24811 22386 13377 14582 27075 35207 30623 35965
17379C5965k843n30o72j1403n022k176L834j990j361n203R390R090j1656j2915
$$ 35965 33122 32592 31920 20517 15495 13319 17153 15163 13802 8599 17989 27079 15423 2508
17365B508K262J278K193M886K424N937J438O986r722p865M544J4812J994j8088
$$ 2508 4770 6048 8241 13127 15551 21488 22926 29912 20190 12325 16869 31681 33675 15587
17351A5587Q89Q019j773j0867O567P498j482M237m900J501l981J1544q589R028
$$ 15587 16476 24495 22722 11855 18422 25920 24438 28675 23775 25276 21295 32839 24250 33278
17337C3278J4957m77k303j6724q186J6097R085j4537j5917m963k25R550J0612
$$ 33278 48235 47758 45455 28731 20545 36642 45727 31190 15273 10310 10085 19635 30247
17324C0247O594K303J149J4616j5971n302Q846j1323j0718p581j0407o975J6557
$$ 30247 36841 39144 40293 54909 38938 33636 42482 31159 20441 12860 2453 -4522 12035
17311A2035K3054N460j7310k4723N895J3513J5608Q820j7472j0492l970M622J4280
$$ 12035 35089 40549 23239 -1484 4411 17924 33532 42352 24880 14388 10418 15040 29320
17298B9320k2018j0138J4482R192M426K866q424n285J85l541J150q225K844j893
$$ 29320 7302 -2836 11646 20838 25264 28130 19706 14421 14606 11065 12215 3990 6834 4941
17284D941M69P676L71j9206j247K391J4976J1886p412j721K702J95J441N890J923
$$ 4941 5410 13086 13457 -5749 -6996 -4605 10371 22257 14845 13124 15826 16021 17462 23352 25275
17269B5275M996k393O867j976J926Q288j8667k2102m495n265J0611J2782P375
$$ 25275 30271 27878 34745 32769 34695 42983 24316 2214 -2281 -7546 3065 15847 23222
17256B3222n09m931l758L892O921l80N079j1288j1593L009J4384j583j9051j0812
$$ 23222 22713 17782 14024 17916 24837 24457 29536 18248 6655 9664 24048 22465 3414 -7398
17242g398Q339K3863K270Q214o312j4911J3215J2976j593l000R583l575o857N769
$$ -7398 941 24804 27074 35288 28976 14065 27280 40256 38663 35663 45246 41671 34814 40583
17228D0583k553n627L39p892l728m345j457J159J2630J181l4883k1800J0777J0555
$$ 40583 38030 32403 32742 24850 21122 16777 15320 16479 29109 30290 -4593 -26393 -15616 -5061
17214e061J379P069R771J890q675r235n674R354M525r846k840N340p299J151l255
$$ -5061 -3682 3387 13158 15048 6373 -2862 -8536 818 5343 -4503 -7343 -2003 -9302 -8151 -11406
17199a1406K0992P418j5270k108j532J540J741J0192L314p900L61O007K882m79
$$ -11406 9586 17004 1734 -374 -1906 -366 1375 11567 14881 6981 7342 13349 16231 15752
17185A5752N366j56K146q812K347n006q968n428J3866k217j349P449p21J281O566
$$ 15752 21118 20962 23108 14296 16643 11637 2669 -2759 11107 8890 7541 14990 14269 15550 22116
17170B2116L78j5415k660L445o347M595J3681J8821q446k4368q153k504Q949l254
$$ 22116 22494 7079 4419 7864 1517 6112 19793 38614 30168 5800 -2353 -4857 4092 838
17156H38L007p404K239n329J565J0684O487K048K151J0509P046L939r561o661
$$ 838 3845 -3559 -1320 -6649 -5084 5600 12087 14135 16286 26795 33841 37780 28219 21558
17142B1558j1154N550N623J3613P659n547K255N638r891k394O452Q516J3176M440
$$ 21558 10404 15954 21577 35190 42849 37302 39557 45195 35304 32910 39362 47878 61054 65494
17128F5494q438k9288j2288Q644O941j21j96k299p480j0139O801J5394n462j0589
$$ 65494 57056 27768 15480 24124 31065 30944 30748 28449 20969 10830 17631 33025 27563 16974
17114A6974J252J1938Q928m574J4L52J195L983n076j2297M293K0318Q427j0529
$$ 16974 18226 30164 39092 34518 34532 34884 36079 40062 34986 22689 26982 47300 55727 45198
17100D5198j9688k1928Q000L116N593R03M191P045m496q83m895J0565L778l936
$$ 45198 25510 3582 11582 14698 20291 21194 25385 32430 27934 27051 22156 32721 36499 32563
17086C2563J1893j294r764J617M559K995N740k283j6468j6247p654J7828O692
$$ 32563 44456 43162 33398 35015 39574 42569 48309 46026 29558 13311 5657 23485 30177
17073C0177o293q092j1996m982P177J3068j929j645j1252P500P372j2381m026
$$ 30177 23884 15792 3796 -1186 5991 19059 17130 15485 4233 11733 19105 6724 2698
17060B698M595j1017j0290K44k357n268J3094J0144M887M281J3083R963o195M303
$$ 2698 7293 -3724 -14014 -13770 -16127 -21395 -8301 1843 6730 11011 24094 34057 27862 32165
17046C2165j3299j2316L127J3727J3949k751m766l488m377M906M658j5108o726
$$ 32165 18866 6550 9677 23404 37353 34602 29836 26348 21971 26877 31535 16427 9701
17033I701j023m168p291O256m197K414J347j3598N40l760n907P343o260O374J5260
$$ 9701 8678 4510 -2781 3475 -722 1692 3039 -10559 -10019 -13779 -19686 -12343 -18603 -12229 3031
17018C031q529L161j121J136Q273J535m451J2077K520o222O419m966j7921K969
$$ 3031 -5498 -2337 -3458 -2322 5951 7486 3035 15112 17632 11410 17829 12863 -5058 -2089
17004b089J5891J867N166k64Q315L151r1q811J374j1518J425J719k1641j3118
$$ -2089 13802 15669 20835 20571 28886 32037 31946 23135 24509 12991 14416 16135 -5506 -18624
16990a8624o88L542J8137J4402j37j220J5815n552r502l751o05O645N0O075j2747
$$ -18624 -19312 -15770 2367 16769 16632 15412 31227 25675 16173 12422 11817 18462 18512 24587 11840
16975A1840j6478J407k297K360j942Q479r296j1977N591K685m195J7601L594K883
$$ 11840 -4638 -3231 -5528 -3168 -5110 3369 -5927 -17904 -12313 -9628 -13823 3778 7372 10255
16961A0255Q879p984n427K501k648K909j1070M208R001M53n890n900q359j915
$$ 10255 19134 11150 5723 8224 5576 8485 -2585 1623 10624 11077 5187 -713 -9072 -10987
16947a0987N867o424n137K4310N281j4067j9491q360J8225K55Q676J2833j984
$$ -10987 -5120 -11544 -16681 7629 12910 -1157 -20648 -29008 -10783 -10528 -1852 10981 8997
16934H997j0674L71M969j709O99O09o689P196L697q169j6218P107Q245N408j774
$$ 8997 -1677 -1306 3663 1954 2653 3262 -3427 3769 7466 -703 -16921 -9814 -1569 3839 2065
16919B065q82J3743o217j2518Q258m607k052J2747O172J042J980r135P740L976
$$ 2065 1183 14926 8709 -3809 4449 -158 -2210 10537 16709 17751 19731 10596 18336 22312
16905B2312M292j7487o041J9412N354l308Q448q500j2519n203N181j405n765j084
$$ 22312 26604 9117 3076 22488 27842 24534 32982 24482 11963 6760 11941 10536 4771 3687
16891C687O262N843l165l284q009j1053n794K25O972j0224Q194N37M168M026N124
$$ 3687 9949 15792 12627 9343 1334 -9719 -15513 -15288 -8316 -18540 -10346 -9809 -5641 -1615 3509
16876C509J0212k655l545R285p94J1602J135j4444j6795l120n008J652M818l352
$$ 3509 13721 11066 7521 16806 16012 27614 28749 14305 -2490 -5610 -10618 -8966 -4148 -7500
16862g500Q087P935M07k956N96R92j310L241M50r319J182L057m43J865l289P17
$$ -7500 587 8522 8929 5973 6569 7561 6251 9492 9942 623 1805 4862 4419 6284 2995 3712
16846C712l388Q635J620j811j398k035O034R582N204j2842J340J7836k604p248
$$ 3712 324 8959 10579 8768 7370 5335 11369 20951 26155 13313 14653 32489 29885 22637
16832B2637O131Q730k656m742o567j6606r910J7128j107j1458j0609M495R801
$$ 22637 28768 37498 34842 30100 23533 6927 -2983 14145 13038 1580 -9029 -4534 5267
16819E267N371J917j6830Q73Q119j0355J828J778J2087N294j9557j1083J3805
$$ 5267 10638 12555 -4275 -3402 4717 -5638 -3810 -2032 10055 15349 -4208 -15291 -1486
16806a486J3585k320q742J3986n829j4705j011N565N963M55R407j474O030J760
$$ -1486 12099 9779 1037 15023 9194 -5511 -6522 -957 5006 5461 14868 13394 19424 21184
16792B1184o031k206k824M191J3039l691j1138J0949j716j0814m220r857p759
$$ 21184 15153 12947 10123 14314 27353 23662 12524 23473 21757 10943 6723 -3134 -10893
16779a0893n8O5Q325J1716r629j8545j850l440N529N228j292J0340O650l77J7434
$$ -10893 -10951 -10886 -2561 9155 -474 -19019 -20869 -24309 -18780 -13552 -14844 -4504 2146 1769 19203
16764A9203j138j2381J591O923k3j3008j4270l104L707l338k659M377J0491J8026
$$ 19203 18065 5684 7275 14198 14175 1167 -13103 -16207 -12500 -15838 -18497 -14120 -3629 14397
16750A4397k033p669o323N339J027l274n680k999k417J062n322M468N909j1994
$$ 14397 12364 4695 -1628 3711 4738 1464 -4216 -7215 -9632 -8570 -13892 -9424 -3515 -15509
16736a5509o405J9088K626j4969n268Q652K1749m750m247o76j0095k723M074j426
$$ -15509 -21914 -2826 -200 -15169 -20437 -11785 9964 5214 967 291 -9804 -12527 -8453 -9879
16722i879N813O997m739N13K649o216M072l437j3458L200J2104J0262j945r796
$$ -9879 -4066 2931 -1808 -1295 1354 -4862 -790 -4227 -17685 -14485 -2381 7881 5936 -3860
16708c860L080R655K436J557L297k49j344q04k341P245M687j2910j2236j513Q750
$$ -3860 -780 8875 11311 12868 16165 15916 14572 13768 11427 18672 23359 10449 -1787 -3300 5450
16693E450J03q382l754j012l623L523J1308l311L220O27j7935k890J863J4175
$$ 5450 5553 -2829 -6583 -7595 -11218 -7695 3613 302 3522 4149 -13786 -16676 -14813 -638
16679f38J5058k854k1121q08m356l20L244J72M346l600M089Q202m331m2o486M09
$$ -638 14420 11566 -9555 -10363 -14719 -15039 -11795 -11623 -7277 -10877 -6788 1414 -2917 -2959 -9445 -9036
16663i036K707n009j1647Q314L166j2692j2998k901K7408J7278M793R708j374
$$ -9036 -6329 -11338 -22985 -14671 -11505 -24197 -37195 -40096 -12688 4590 9383 19091 17717
16650A7717k0901j368J0133r924n190J301L025q41N121R446J6889j7162q593j189
$$ 17717 -3184 -4552 5581 -4343 -9533 -8232 -5207 -6048 -927 8519 25408 8246 -347 -1536
16636a536l602M326j0813m667N106m599O689J8554J895k76m897n306n211j5413
$$ -1536 -5138 -812 -11625 -16292 -11186 -15785 -9096 9458 11353 11077 6180 874 -4337 -19750
16622a9750O815L080p102K149J533n969R806J3548J6974o687l314k893J4192O731
$$ -19750 -12935 -9855 -16957 -14808 -13275 -19244 -9438 4110 21084 14397 11083 8190 22382 29113
16608B9113j4242j1406q035m777L398L839j029K060K2535Q321k1747j4473l222
$$ 29113 14871 3465 -4570 -9347 -5949 -2110 -3139 -1079 21456 29777 8030 -6443 -9665
16595i665r87N299J427P000N41o013q639Q263M597J7437P47L17k524n81J1223
$$ -9665 -10652 -5353 -3926 3074 3615 -2398 -11037 -2774 1823 19260 20007 20324 17800 17219 28442
16580B8442m971n598p918N420J7206L16J332k0660m264K5430n797L161p925r356
$$ 28442 23471 17873 9955 15375 32581 32897 34229 13569 9305 34735 28938 32099 24174 14818
16566A4818p493r239q798M659o191o314j168K593J5569M236j091N937j873q042
$$ 14818 7325 -1914 -10712 -6053 -12244 -18558 -19726 -17133 -1564 2672 1581 7518 5645 -2397
16552b397l264J0061p68o641j0638k644J2976J2061J0121J2544j925m277j0272
$$ -2397 -5661 4400 3632 -3009 -13647 -16291 -3315 8746 18867 31411 29486 25209 14937
16539A4937j0392J1088M395k924J1474j1252j8866q78o77L167k826M450j1879
$$ 14937 4545 15633 20028 17104 28578 17326 -1540 -2418 -3095 72 -2754 1696 -10183
16526a0183l612M262k710O567k428M819l555r091J4734J651m712m970K030K862
$$ -10183 -13795 -9533 -12243 -5676 -8104 -3285 -6840 -15931 -1197 454 -4258 -9228 -7198 -4336
16512d336k717o617j636o435O553J0036j2288j5592K537O389J4287N247K578N510
$$ -4336 -7053 -13670 -15306 -21741 -15188 -5152 -17440 -33032 -30495 -24106 -9819 -4572 -1994 3516
16498C516l266K864n041R122Q687R014p677j1663J117o548j367q143J158n879
$$ 3516 250 3114 -1927 7195 15882 24896 17219 5556 6673 125 -1242 -9385 -8227 -14106
16484a4106m451O101J1938o833m173P877Q792o54O605k772J2068n599j8637k685
$$ -14106 -18557 -12456 -518 -7351 -11524 -3647 5145 4491 11096 8324 20392 14793 -3844 -6529
16470f529j18m380L642j1295q186J1284J2442J2304l522l303J6427M017J552k0340
$$ -6529 -6647 -11027 -7385 -18680 -26866 -15582 -3140 9164 5642 2339 18766 22783 24335 3995
16456C995j236K771P916J679q421k171N366j607n111n730k973Q841O933l645O805
$$ 3995 2759 5530 13446 15125 6704 4533 9899 8292 3181 -2549 -5522 3319 10252 6607 13412
16441A3412N025j1850o073m613k162J9476O928n051r265j3944k093J2130J197
$$ 13412 18437 6587 514 -4099 -6261 13215 20143 15092 5827 -8117 -10210 1920 3117
16428C117m034J616j0127l0K1327Q576p971M599q531j2835j0944o43M531K4387
$$ 3117 -917 699 -9428 -9458 11869 20445 12474 17073 8542 -4293 -15237 -15880 -11349 13038
16414A3038n632r237J725O13q896j696r08L677J1520j2918k4257P696J6218K1898
$$ 13038 7406 -1831 -106 507 -8389 -10085 -10993 -7316 4204 -8714 -32971 -25275 -9057 12841
16400A2841m506o24j4830J778N082K3759J206o839j764j1351Q469Q184M891n869
$$ 12841 8335 7711 -7119 -5341 -259 23500 24706 17867 16103 4752 13221 21405 26296 20427
16386B0427j5539q881J2515j448o082j4820j2646J050J0596Q777r612n659J8003
$$ 20427 4888 -3993 8522 7074 992 -13828 -26474 -25424 -14828 -6051 -15663 -21322 -3319
16373c319Q636j1468j1531J7696K568l975M090J2228J7859o954j4983J2056J1965
$$ -3319 5317 -6151 -17682 14 2582 -1393 2697 14925 32784 25830 10847 22903 34868
16360C4868j0319j2144N80q297k9560m620P798j0462j955O635Q256J2402J840
$$ 34868 24549 12405 12985 4688 -24872 -29492 -21694 -32156 -34111 -27476 -19220 -6818 -4978
16347d978P106R498r573m446j1558q280J8842O163p524p065m088o059M990J3389
$$ -4978 2128 11626 2053 -2393 -13951 -22231 -3389 2774 -4750 -11815 -15903 -21962 -16972 -3583
16333c583l182P219J394Q41L437q82Q60M846p890j754j606j39O167J0326l568
$$ -3583 -6765 454 1848 2689 6126 5244 6104 10950 3060 1306 -300 -439 5728 16054 12486
16318A2486j9744N796K0102Q513J818L684r74j610L738l057k5026k1667M852O812
$$ 12486 -7258 -1462 18640 27153 28971 32655 31681 30071 33809 30752 5726 -15941 -11089 -4277
16304d277q306O15R213M610J209K800J7396Q382k4777j4097Q869P529k91M847
$$ -4277 -12583 -11968 -2755 1855 3064 5864 23260 31642 6865 -7232 1637 9166 8875 13722
16290A3722j0148p348M035O783N450O517o735J393n483q000l727r499M538O08
$$ 13722 3574 -3774 261 7044 12494 19011 12276 13669 8186 186 -3541 -13040 -8502 -7894
16276g894J2511P951o048j9091j5714p857O647k485J3743J689L799j545l508j971
$$ -7894 4617 12568 6520 -12571 -28285 -36142 -29495 -31980 -18237 -16548 -12749 -14294 -17802 -19773
16262a9773P747O333p469M902R940o642n691Q403l658R253p562q053M691P422
$$ -19773 -12026 -5693 -13162 -8260 1680 -4962 -10653 -2250 -5908 3345 -4217 -12270 -7579 -157
16248a57O829mj0395n031J341k129q60n74m223N825K1667P021j0083J339j2825
$$ -157 6672 6668 -3727 -8758 -7417 -9546 -10406 -10980 -15203 -9378 12289 19310 9227 10566 -2259
16233b259j6652k993R897N485J1585P766J796M432j6961j5101P542L670N289M774
$$ -2259 -18911 -21904 -12007 -6522 5063 12829 14625 19057 2096 -13005 -5463 -1793 3496 8270
16219H270k545P365m992r332o534J671J0672k974J6649O704j0832j224j1146m398
$$ 8270 5725 13090 8098 -1234 -7768 -6097 4575 1601 18250 24954 14122 12898 1752 -2646
16205b646l415q540k797n713J8970J7942l302p246l190M22o821o858J8623J1180
$$ -2646 -6061 -14601 -17398 -23111 -4141 13801 10499 3253 63 485 -6336 -13194 5429 16609
16191A6609j022j7536j4478R916P535N283j793J0798K186j5449j6084L764j0386
$$ 16609 15587 -1949 -16427 -6511 1024 6307 4514 15312 17498 2049 -14035 -10271 -20657
16178b0657j767o852n704Q917R070R985L286k036j3253k0862M130Q419m500q283
$$ -20657 -22424 -29276 -34980 -26063 -16993 -7008 -3722 -5758 -19011 -39873 -35743 -27324 -31824 -40107
16164d0107O995J0032O440J2263J2998r942j8880J0799o064K294P313J0106M798
$$ -40107 -33112 -23080 -16640 -4377 8621 -1321 -20201 -9402 -15466 -13172 -5859 4247 9045
16151I045j4787j6852P2j152J7264J639p938L819J772J449P579L389n025p00N911
$$ 9045 -5742 -22594 -22522 -23674 -6410 -4771 -12709 -8890 -7118 -5669 1910 5299 274 -426 5485
16136E485m146L066J103j567m26P730k0556j0604K311j563m552p95J0513j6278
$$ 5485 1339 4405 5508 3941 3515 11245 -9311 -19915 -17604 -19167 -23719 -24514 -14001 -30279
16122c0279r532N397n790M492J2991K556j3133N023J0732n920m113M322K815Q112
$$ -30279 -39811 -34414 -40204 -35712 -22721 -20165 -33298 -28275 -17543 -23463 -27576 -23254 -20439 -12327
16108a2327q078o325l567K0081J8047j0748j2166m902m186j810p482K798N712
$$ -12327 -20405 -26730 -30297 -10216 7831 -2917 -15083 -19985 -24171 -25981 -33463 -30665 -24953
16095b4953J523Q457J20j1384J2950o19j212n20m048j130L412L925P828P704Q27
$$ -24953 -23430 -14973 -14853 -26237 -13287 -13906 -15118 -15638 -19686 -20816 -17404 -13479 -5651 2053 2880
16080B880m248n094j6367O179Q892O089L457k442N853p97Q517r705k696q285O470
$$ 2880 -1368 -6462 -22829 -16650 -7758 -1669 1788 -654 5199 4402 12919 3214 518 -7767 -1297
16065a297J2945j6325j814N996R346L277k3107j3122k08L294O659J2538J946j3989
$$ -1297 11648 -4677 -6491 -495 8851 12128 -10979 -24101 -24309 -21015 -14356 -1818 128 -13861
16051a3861q17J3160O629j382R655J01M465P918j104j4833j6014k977O367p192
$$ -13861 -14678 -1518 5111 3729 13384 13485 17950 25868 24764 9931 -6083 -9060 -2693 -9885
16037i885m09P755q500o729k67J0148o030l889l562P558L808J983N187O464P169
$$ -9885 -10294 -2539 -11039 -17768 -18035 -7887 -13917 -17806 -21368 -13810 -10002 -8019 -2832 3632 10801
16022A0801N373l379j3736M130K016j9885j3907J0530J213j1780r940j2506M528
$$ 10801 16174 12795 -941 3189 5205 -14680 -28587 -18057 -16844 -28624 -38564 -51070 -46542
16009d6542K682J3907K5785l44O44M407Q249L209K407J0877j9495j5635m64n250
$$ -46542 -43860 -29953 -4168 -4512 -3868 539 8788 11997 14404 25281 5786 -9849 -10313 -15563
15995a5563n236j582O580J1831L678o378k378J274N46O014p214q507k0246m554
$$ -15563 -20799 -22381 -15801 -3970 -292 -6670 -9048 -7774 -7228 -1214 -8428 -16935 -37181 -41735
15981d1735J0392J1460L770j087P690J674M292L962L897n922j9599k356M548L160
$$ -41735 -31343 -19883 -16113 -17200 -9510 -7836 -3544 418 4315 -1607 -21206 -23562 -19014 -15854
15967a5854J818l3n003J1657L085p844r554m451R25K5395J1847j2323L328p397
$$ -15854 -14036 -14069 -19072 -7415 -4330 -12174 -21728 -26179 -25254 141 11988 -335 2993 -4404
15953d404R441O017n596l4m488P730j502o802k942n48J3537q277j178j3007J475
$$ -4404 5037 11054 5458 5424 936 8666 7164 362 -2580 -3128 10409 2132 954 -12053 -10578
15938a0578J697Q026p291L104k605L82J108O782Q26M328J257j5630r707o50J6694
$$ -10578 -8881 -855 -8146 -5042 -7647 -7265 -6157 625 1451 5779 7036 -8594 -18301 -18951 -2257
15923b257P804N135M2n806n718k984q326O223k023J125l109k249q035o608J4719
$$ -2257 5547 10682 10724 4918 -800 -3784 -12110 -5887 -7910 -6785 -9894 -12143 -20178 -26786 -12067
15908a2067Q103j1865R327J3162n524k0072j3466J1952K296m877O42Q273l614
$$ -12067 -3964 -15829 -6502 6660 1136 -18936 -32402 -20450 -18154 -23031 -22389 -14116 -17730
15895a7730j1016K733K0279R607L796L322M835J601n580r101m432l206L076J4322
$$ -17730 -28746 -26013 -5734 3873 7669 10991 15826 17427 11847 2746 -1686 -4892 -1816 12506
15881A2506q99j1113j3448J184K192q827P011P170j0184M762J3888L487L382l737
$$ 12506 11607 494 -12954 -11770 -9578 -18405 -11394 -4224 -14408 -9646 4242 7729 11111 7374
15867G374p633m196m95p869j0113J4949O171m350j0939q33K256J252R816L849
$$ 7374 -259 -4455 -4950 -12819 -22932 -7983 -1812 -6162 -17101 -17934 -15678 -14426 -4610 -761
15853g61J3003K0829P183p002q897J665j3185q917P349j450K451m92k858p36O026
$$ -761 12242 33071 40254 33252 24355 26020 12835 3918 11267 9817 12268 11776 8918 8182 14208
15838A4208P833M416R363m781q178j5986j1429j8448J5090L129j672k528j3069
$$ 14208 22041 26457 35820 31039 22861 6875 -4554 -23002 -7912 -4783 -6455 -8983 -22052
15825b2052j3651O168J3508M689J1632R170M103p072r664j0432J8150J948j9427
$$ -22052 -35703 -29535 -16027 -11338 294 9464 13567 6495 -3169 -13601 4549 6497 -12930
15812a2930R03M110N43j0336J942J6710M042l519J2413J1379J772J214l184o514
$$ -12930 -12027 -7917 -7374 -17710 -15768 942 4984 1465 13878 25257 27029 28243 25059 18545
15798A8545j741R847o202N51n013o027j4115j0308N212n049L325K1320j3854j8194
$$ 18545 16804 26651 20449 21000 15987 9960 -4155 -14463 -9251 -14300 -10975 10345 -3509 -21703
15784b1703O000J0414p44n142O792O211J4548K615p31k940p304j0116j375J1988
$$ -21703 -15703 -5289 -6033 -11175 -4383 1828 16376 18991 18260 15320 8016 -2100 -3475 8513
15770H513J076k330k3230r514K221R392N517l048j1694Q828M990j1175q888J1534
$$ 8513 9589 7259 -15971 -25485 -23264 -13872 -8355 -11403 -23097 -14269 -9279 -20454 -29342 -17808
15756a7808j32j8223m74J6383R007L600m716q996o693m79R762M406P45k899m465
$$ -17808 -17940 -36163 -36637 -20254 -11247 -7647 -12363 -21359 -28052 -28531 -18769 -14363 -13618 -16517 -20982
15741b0982q574M16N26j0337r266J5885J6375O550o914m550n459q859k876J2418
$$ -20982 -29556 -29140 -28614 -38951 -48217 -32332 -15957 -9407 -16321 -20871 -26330 -35189 -38065 -25647
15727b5647J9315O000o826J148k608M549l767o865j3226q603J559k162o115J341
$$ -25647 -6332 -332 -7158 -6010 -8618 -4069 -7836 -14701 -27927 -36530 -34971 -37133 -43248 -41907
15713d1907M647O876k138P10N280N44L623J7456J6856j4400o908k466n956k05
$$ -41907 -37260 -30384 -32522 -31812 -26532 -25988 -22365 -4909 11947 -2453 -9361 -11827 -17783 -17988
15699a7988Q944J241l977j1983L258P15P891M71r81j1660J4815L3601N823j8485
$$ -17988 -9044 -7803 -11780 -23763 -20505 -19790 -11899 -11428 -12409 -24069 -9254 24347 30170 11685
15685A1685r158j1050o558q201j9015J3999M470Q378J9958l278l860p453j2562
$$ 11685 2527 -8523 -15081 -23282 -42297 -28298 -23828 -15450 4508 1230 -2630 -10083 -22645
15672b2645j0973J4587M066R995J4395k282j2390K170n353q498J4563P57j3409
$$ -22645 -33618 -19031 -14965 -4970 9425 7143 -5247 -3077 -8430 -16928 -2365 -1608 -15017
15659a5017k265m574L906k996k664J3130M14J583Q90j2266J1539R722m907j1235
$$ -15017 -17282 -21856 -17950 -20946 -23610 -10480 -10066 -8483 -7593 -19859 -8320 1402 -3505 -14740
15645a4740l214K893J6180j202j2669l271n967N001n979l71j1147J646O89R290
$$ -14740 -17954 -15061 1119 -83 -12752 -16023 -21990 -16989 -22968 -23339 -34486 -32840 -32151 -22861
15631b2861N947n462L003N46j394O883J375j4370l944J5287J180l374j665L309
$$ -22861 -16914 -22376 -19373 -18827 -20221 -13338 -11963 -26333 -30277 -14990 -13810 -17184 -18849 -15540
15617a5540q546j7246N089J0889Q413K397j40K144R962k192K908P55p829o494
$$ -15540 -24086 -41332 -36243 -25354 -16941 -14544 -14684 -12540 -2578 -4770 -1862 -1107 -8936 -15430
15603a5430o916M114P576K241k072K322k153K213J3493q163j4304k816M381L166
$$ -15430 -22346 -18232 -10656 -8415 -10487 -8165 -10318 -8105 5388 -2775 -17079 -19895 -15514 -12348
15589a2348N667j0328J1883O729R385J1966o685j2127N433N694j3091r906N36
$$ -12348 -6681 -17009 -5126 1603 10988 22954 16269 4142 9575 15269 2178 -7728 -7192
15576g192J7458o880j9696q946L281J827m453J1153O606j8715n965J0744n333
$$ -7192 10266 3386 -16310 -25256 -21975 -20148 -24601 -13448 -6842 -25557 -31522 -20778 -26111
15563b6111l564l13J0905J828Q576J3579j0700j27N503m49j2098j8089M911J3288
$$ -26111 -29675 -29988 -19083 -17255 -8679 4900 -5800 -5927 -424 -873 -12971 -31060 -26149 -12861
15549a2861k450j302M714q675q450o703r832k54Q777J4398N34k752P262J2582
$$ -12861 -15311 -16613 -11899 -20574 -29024 -35727 -45559 -45813 -37036 -22638 -22104 -24856 -17594 -5012
15535e012L990L938J626l304p845J1446J012q086q453k039r276J533j89qQ724
$$ -5012 -1022 2916 4542 1238 -6607 4839 5851 -2235 -10688 -12727 -22003 -20470 -20659 -20667 -11943
15520a1943r557j8205n886R749J1014M766O304P069J3670N79j5203j1127J94P993
$$ -11943 -21500 -39705 -45591 -35842 -24828 -20062 -13758 -6689 6981 7560 -7643 -18770 -18576 -10583
15506a0583O808j661L957j533m072k90N987J1499J348k687j3546J844J225q379
$$ -10583 -3775 -5436 -1479 -3012 -7084 -7374 -1387 10112 11460 8773 -4773 -2929 -1704 -10083
15492a0083O384q66P532P066N082m160Q132P203q48o425q756r063l645n502o31
$$ -10083 -3699 -4565 2967 10033 15115 10955 19087 26290 25442 19017 10261 1198 -2447 -7949 -8580
15477h580P772N30j194m991j0629Q9N655J9297L37r653J426N66j5494m254p439
$$ -8580 -808 -278 -1472 -6463 -17092 -17003 -11348 7949 8286 -1367 59 625 -14869 -19123 -26562
15462b6562n086O798J0935O749P578j2096j57q615j3355j456R452J3131J6537
$$ -26562 -31648 -24850 -13915 -7166 412 -11684 -11841 -20456 -33811 -35267 -25815 -12684 3853
15449C853M342p136n398J2110J398l678r591o657J4511J84l113l003j4517j4025
$$ 3853 8195 1059 -4339 7771 9169 5491 -4100 -10757 3754 3938 825 -2178 -16695 -30720
15435c0720N24J1015J6194j1460l476Q674M456o959j538K147m773q023j667P518
$$ -30720 -30196 -19181 -2987 -14447 -17923 -9249 -4793 -11752 -13290 -11143 -15916 -23939 -25606 -18088
15421a8088J1784Q290k65j5464J314j34L11K0575L731N53j0231m1L475O48m251
$$ -18088 -6304 1986 1721 -13743 -12429 -12563 -12252 8323 12054 12607 2376 2335 5810 6458 2207
15406B207j313J0833J3554J1092q101q725r090N210k221j5484n098n688l424p765
$$ 2207 894 11727 25281 36373 28272 19547 10457 15667 13446 -2038 -7136 -12824 -16248 -24013
15392b4013k485J2908J6509m226k285p254p359L970k661l954k523q584M733J1211
$$ -24013 -26498 -13590 2919 -1307 -3592 -10846 -18205 -14235 -16896 -20850 -23373 -31957 -27224 -16013
15378a6013J1048l614j6293q72K668O500J4726J849L612o128j2133K212j0406
$$ -16013 -4965 -8579 -24872 -25744 -23076 -16576 -1850 -1 3611 -2517 -14650 -12438 -22844
15365b2844j0167Q915J3566j1058j425J8945j2424k0794q650J6395J6652l371
$$ -22844 -33011 -24096 -10530 -21588 -23013 -4068 -16492 -37286 -45936 -29541 -12889 -16260
15353a6260q183m888m405L98m569q666R745M618J2465J056l536N296j430M861
$$ -16260 -24443 -29331 -33736 -33338 -37907 -46573 -36828 -32210 -19745 -18689 -22225 -16929 -18359 -13498
15339a3498r046M416J6540l227j1049j0141Q04J0941Q491o056L591q026K297J4516
$$ -13498 -22544 -18128 -1588 -4815 -15864 -26005 -25201 -14260 -5769 -11825 -8234 -16260 -13963 553
15325E53K795o043j6261J224J6168o313m435m250n97Q697q631j4446j288J8567
$$ 553 3348 -2695 -18956 -17732 -1564 -7877 -12312 -16562 -17159 -8462 -17093 -31539 -32827 -14260
15311a4260N178q591L371O950r503o429n282k084K36J3636p869n004N477M799
$$ -14260 -9082 -17673 -14302 -7352 -16855 -23284 -28566 -30650 -30414 -16778 -24647 -29651 -24174 -19375
15297a9375j741o332K44l443L154K062L19Q158p57j081n870j850q217p51Q300
$$ -19375 -21116 -27448 -27204 -30647 -27493 -25431 -25112 -16954 -17711 -18792 -24662 -26512 -34729 -35480 -27180
15282b7180J3836j3963l822p43J4857Q360l216K767j0100p177J3427J0754L3O05
$$ -27180 -13344 -27307 -31129 -31872 -17015 -8655 -11871 -9104 -19204 -26381 -12954 -2200 -2167 -1562
15268a562l006r14r896l160q40Q101O872j757l002r936m996j0996J6591K1351
$$ -1562 -4568 -5482 -15378 -18538 -19378 -11277 -4405 -6162 -9164 -19100 -24096 -35092 -18501 2850
15254B850m95p268L880Q023N427o172j0492m537L919Q0r613O905M687j6672l265
$$ 2850 2355 -4913 -1033 6990 12417 6245 -4247 -8784 -4865 -4785 -14398 -7493 -2806 -19478 -22743
15239b2743j413R182N562m22q763l772Q524J4245k314o469M798q702m106j731
$$ -22743 -24156 -14974 -9412 -9834 -18597 -22369 -13845 400 -1914 -8383 -3585 -12287 -16393 -18124
15225a8124J4388l262K444j320j1943J142R393O423M841r303p490o394M703M840
$$ -18124 -3736 -6998 -4554 -5874 -17817 -16675 -7282 -859 3982 -5321 -12811 -19205 -14502 -9662
15211i662O844p889j0478r21M576J6242N831j5432m161J8649k356q184Q730J2984
$$ -9662 -2818 -10707 -21185 -22106 -17530 -1288 4543 -10889 -15050 3599 1243 -6941 1789 14773
15197A4773k680j6403j3589M20k905L618P554K408o232j5332m418J7127J1274
$$ 14773 12093 -4310 -17899 -17479 -20384 -16766 -9212 -6804 -13036 -28368 -32786 -15659 -4385
15184d385O558j0108r732Q870N363j982J2317K960j0525j2395J982r070n451P690
$$ -4385 2173 -7935 -17667 -8797 -3434 -5416 6901 9861 -664 -13059 -11077 -20147 -25598 -17908
15170a7908N819q945K607L128o555N100L357j5274k183n844j0378J3985J3791
$$ -17908 -12089 -21034 -18427 -15299 -21854 -16754 -13397 -28671 -30854 -36698 -47076 -33091 -19300
15157a9300l104q002j0399O442P207k315O054J623K718R69m21J0937j5162m400
$$ -19300 -22404 -30406 -40805 -34363 -27156 -29471 -23417 -21794 -19076 -18107 -18528 -7591 -22753 -27153
15143b7153J2807J5717K280J009j0135n019P076j745r046j701m873P47j1900K104
$$ -27153 -14346 1371 3651 4660 -5475 -10494 -3418 -5163 -14209 -15910 -20783 -20036 -31936 -29832
15129b9832J8411p910j0958P444L461l619Q380o30k542J4450j234o685r07O882
$$ -29832 -11421 -19331 -30289 -22845 -19384 -23003 -14623 -15253 -17795 -3345 -4579 -11264 -12171 -5289
15115e289K709m799j967l136k092k415m109j0919m867n565j0238K1318J2184K99
$$ -5289 -2580 -7379 -9346 -12482 -14574 -16989 -21098 -32017 -36884 -42449 -52687 -31369 -19185 -18886
15101a8886J1149M451n197p215n191j4473M426J2136o316J5045m940M649q059
$$ -18886 -7737 -3286 -8483 -15698 -20889 -35362 -30936 -18800 -25116 -10071 -15011 -10362 -18421
15088a8421r540K1256l694O013L595k751p590p816j5404J2336N010o921j9075
$$ -18421 -27961 -6705 -10399 -4386 -791 -3542 -11132 -18948 -34352 -22016 -17006 -23927 -43002
15075d3002o37M577P499P248N381k769n771j4482J385J678n941j0058K820J1787
$$ -43002 -43639 -39062 -31563 -24315 -18934 -21703 -27474 -41956 -40571 -38893 -44834 -54892 -52072 -40285
15061d0285j33l253l754Q875L915p434L597R091P448q923R64Q870r331R836O167
$$ -40285 -40418 -43671 -47425 -38550 -34635 -42069 -38472 -29381 -21933 -30856 -29892 -21022 -30353 -20517 -14350
15046a4350J192n27J2758K737j0203J0893n590j786R153K882o133N20n560j3065
$$ -14350 -13158 -13685 -927 1810 -8393 2500 -3090 -4876 4277 7159 1026 1546 -4014 -17079
15032a7079r167j3989q94J5208k274j0058J834J5633O857K886Q620l4L295m148
$$ -17079 -26246 -40235 -41129 -25921 -28195 -38253 -36419 -20786 -13929 -11043 -2423 -2457 838 -3310
15018c310o01J055J530q251p498Q492J0504j492k773J5263Q904P96q210q03K360
$$ -3310 -3911 -2856 -1326 -9577 -17075 -8583 1921 429 -2344 12919 21823 22619 14409 13606 15966
15003A5966m247l744R560Q591J4394J7965L129O671J4878K278J6770M4691K2966
$$ 15966 11719 7975 17535 26126 40520 58485 61614 68285 83163 85441 102211 146902 169868
14990A69868K6870K2089J4245q62j6203j5636j0405j6339k6768j1862j6632j7312
$$ 169868 196738 218827 233072 232210 216007 200371 189966 173627 146859 134997 118365 101053
14978A01053j0754j005q059r895l962j6333k242j0115j7692j4736P215N056J430
$$ 101053 90299 89294 81235 71340 67378 51045 48803 38688 20996 6260 13475 18531 19961
14965A9961q841M072J0946k951L586o498n865J147k850J431J4460J8254J4328
$$ 19961 11120 15192 26138 23187 26773 20275 14410 15557 12707 14138 28598 46852 61180
14952F1180N482j6038l86j0518j0916j4951j622L925J593j233p969L393Q832j0866
$$ 61180 66662 50624 50238 39720 28804 13853 12231 16156 17749 16516 8547 11940 20772 9906
14938I906p092M676P159j3570j3975m448L686O622K803K2152n936j9376M911J039
$$ 9906 2814 7490 14649 1079 -12896 -17344 -13658 -7036 -4233 17919 11983 -7393 -2482 -1443
14924a443M961O188M167j0932q935O318m423P81M293m059M733N130L170p166j2989
$$ -1443 3518 9706 13873 2941 -5994 324 -4099 -3318 975 -3084 1649 6779 9949 2783 -10206
14909a0206K502j603r26m482k152o653o314m563K099Q428R994j844J382J145j0231
$$ -10206 -7704 -9307 -10233 -14715 -16867 -23520 -29834 -34397 -32298 -23870 -13876 -15720 -14338 -13193 -23424
14894b3424N054O868j0206k151Q672o357K004K96J2446R858k1460p049J5218O611
$$ -23424 -18370 -11502 -21708 -23859 -15187 -21544 -19540 -19244 -6798 3060 -18400 -25449 -10231 -3620
14880c620K428N762j1920J2545K0143J133j0668L421r411j8390r165P10J1211
$$ -3620 -1192 4570 -7350 5195 25338 26471 15803 19224 9813 -8577 -17742 -17032 -5821
14867e821n13N853j0527q577J2374J901j6458o590n593q45Q991J3494J2831j808
$$ -5821 -6334 -481 -11008 -19585 -7211 -5310 -21768 -28358 -33951 -34796 -25805 -12311 520 -1288
14853a288o082j101O35Q1r929L698p840k99L040q410p559K136K2754Q928P2N572
$$ -1288 -7370 -8471 -7836 -7755 -17684 -13986 -21826 -22125 -19085 -27495 -35054 -32918 -10164 -1236 -1164 4408
14837D408q993j2788o132q346J3028O298p909r799n058K233k38J0782J1952m026
$$ 4408 -4585 -17373 -23505 -31851 -18823 -12525 -20434 -30233 -35291 -33058 -33296 -22514 -10562 -14588
14823a4588L398K948M209J0909j6275j462k229k427j5080l882j4747J8288P541
$$ -14588 -11190 -8242 -4033 6876 -9399 -10861 -13090 -15517 -30597 -34479 -49226 -30938 -23397
14810b3397k010k293J18L602J23O961n201J115J5623Q265k778J1721l780l0596
$$ -23397 -25407 -27700 -27582 -23980 -23857 -16896 -22097 -20982 -5359 2906 128 11849 8069 -22527
14796b2527l571J930J4245J2215K307r497j2301l435P059q366l401o821r203R551
$$ -22527 -26098 -24168 -9923 2292 4599 -4898 -17199 -20634 -13575 -21941 -25342 -32163 -41366 -31815
14782c1815M127L434K699L43P377L98L328m033r612m59k993O036o443l764M017
$$ -31815 -27688 -24254 -21555 -21212 -13835 -13437 -10109 -14142 -23754 -24213 -27206 -21170 -27613 -31377 -27360
14767b7360N128m980r4J0291k868j433j951J492M031K713Q422j3340N82R494K961
$$ -27360 -22232 -27212 -27306 -17015 -19883 -21316 -23267 -21775 -17744 -15031 -6609 -19949 -19367 -9873 -6912
14752f912P435j000j1730j4262j9919l889Q678M148N802l504J2126K0266k677
$$ -6912 523 -477 -12207 -26469 -46388 -50277 -41599 -37451 -31649 -35153 -23027 -2761 -5438
14739e438m312M703o942o246j964j896K843q50l997J0931N772J3441m439j1959
$$ -5438 -9750 -5047 -11989 -18235 -20199 -22095 -19252 -20102 -24099 -13168 -7396 6045 1606 -10353
14725a0353k679r52k385L419R572K676J729J5707J5737L672p055r97j0934j5546
$$ -10353 -13032 -13984 -16369 -12950 -3378 -702 1027 16734 32471 36143 29088 28091 17157 1611
14711A611j4095M645k033j6618p936N385J0177J2166n91p61m13j852m12n970M135
$$ 1611 -12484 -7839 -9872 -26490 -34426 -29041 -18864 -6698 -7289 -8050 -8463 -10315 -10727 -16697 -12562
14696a2562M533j568j753m341n110j0878Q617R421O690K266j3904M956p24P657
$$ -12562 -8029 -9597 -11350 -15691 -20801 -31679 -23062 -13641 -6951 -4685 -18589 -13633 -14357 -6700
14682f700q092j3561J4545R44M53m681O518J235m806J2790K239k6757p451J2164
$$ -6700 -14792 -28353 -13808 -12864 -12411 -17092 -10574 -9339 -14145 -1355 884 -25873 -33324 -21160
14668b1160m007o387J6369j092j0356O48M083K523n714o763n34K4750J1175p786
$$ -21160 -25167 -31554 -15185 -16277 -26633 -25985 -21902 -19379 -25093 -31856 -32390 -7640 3535 -4251
14654d251j3946j1J838j0241Q888M181l013j2728K083P493J1734r447Q30o070
$$ -4251 -18197 -18208 -16370 -26611 -17723 -13542 -16555 -29283 -27200 -19707 -7973 -17420 -16590 -22660
14640b2660J748R96p957j485n392K616J1755J4558O309Q18m489o049k620J077
$$ -22660 -20912 -19916 -27873 -29358 -34750 -32134 -20379 -5821 488 1306 -3183 -9232 -11852 -10775
14626a0775O28J110n71P068l037q527k991P820J45p066q374M420J3088J0384p377
$$ -10775 -10147 -9037 -9608 -2540 -5577 -14104 -17095 -9275 -9130 -16196 -24570 -20150 -7062 3322 -4055
14611d055J1308J8266N479j8924p169J1017J6007m837j2042k314o269J389K0050
$$ -4055 7253 25519 30998 12074 4905 15922 31929 27092 15050 12736 6467 7856 27906
14598B7906R789o649j7089m741R62k1766j3265j863M054J2K0J5201J7490K4398
$$ 27906 37695 31046 13957 9216 10178 -11588 -24853 -26716 -22662 -22650 -22630 -7429 10061 34459
14584C4459P90o709m0j8974j8251k270K0652J9478m673n796m307L581M791M78
$$ 34459 35249 28540 28500 9526 -8725 -10995 9657 29135 24462 18666 14359 17940 22731 23209
14570B3209r871r973j0258J975L338j030j2408o710Q883K45m937J6381j0593j691
$$ 23209 13338 3365 -6893 -4918 -1580 -2610 -15018 -21728 -12845 -12600 -17537 -1156 -11749 -13440
14556a3440N934J1363J710j2184m369m128j6370n377L797j2442K134R570J5973
$$ -13440 -7506 3857 5567 -6617 -10986 -15114 -31484 -36861 -33064 -45506 -43372 -33802 -17829
14543a7829O513j953m816k192J325J2883O269j2270j2339p174O330J6783R864
$$ -17829 -11316 -13269 -18085 -20277 -18952 -6069 200 -12070 -24409 -31583 -25253 -8470 1394
14530A394m052J614n146m191j1092j1344M568J1296j3559j0185o458J1026P012
$$ 1394 -2658 -1044 -6190 -10381 -21473 -32817 -28249 -16953 -30512 -40697 -47155 -36129 -29117
14517b9117k466M430j1632M45K1151q965o973P047n244P495j347j106k677l035
$$ -29117 -31583 -27153 -38785 -38340 -17189 -26154 -33127 -26080 -31324 -23829 -25176 -26282 -28959 -31994
14503c1994j76M695J1927m730N228J334r268k155N52P623J0589r463k2555n216
$$ -31994 -32170 -27475 -15548 -20278 -15050 -13716 -22984 -25139 -24587 -16964 -6375 -15838 -38393 -43609
14489d3609R889j286n452j2052P01N286O237q746M269Q100J3440j0878l496n02
$$ -43609 -33720 -35006 -40458 -52510 -51809 -46523 -40286 -49032 -44763 -36663 -23223 -34101 -37597 -38099
14475c8099J4832M895K349n82q254Q396p753l3727k616J8102K3205O580l028L347
$$ -38099 -23267 -18372 -16023 -16605 -24859 -16463 -24216 -57943 -60559 -42457 -19252 -12672 -15700 -12353
14461a2353q682M97J0953J2396M860m840j4475o116Q138m72J89Q866k895k480
$$ -12353 -21035 -20538 -9585 2811 7671 2831 -11644 -17760 -9622 -10094 -9905 -1039 -3934 -6414
14447f414j2567l310k555j3736j0881K0521K0499n327o700m103J2137O987m88
$$ -6414 -18981 -22291 -24846 -38582 -49463 -28942 -8443 -13770 -20470 -24573 -12436 -5449 -5937
14434e937N424j0262j3183J5164o611j2619L068J7321n70L281m548j1966m49q632
$$ -5937 -513 -10775 -23958 -8794 -15405 -28024 -24956 -7635 -8205 -4924 -9472 -21438 -21887 -30519
14420c0519K118J3547J8092K476j3115j9420q375j2642l692K644O125p911j1618
$$ -30519 -28401 -14854 3238 5714 -7401 -26821 -35196 -47838 -51530 -48886 -42761 -50672 -62290
14407f2290J5406R283p445L721m934k01J6126K5162j3434j3355k739O491j48L965
$$ -62290 -46884 -37601 -45046 -41325 -46259 -46460 -30334 -5172 -18606 -31961 -34700 -28209 -28357 -24392
14393b4392M881l614j378j0799k758O69N023J5663L755o697q842l224pQ599L27
$$ -24392 -19511 -23125 -24503 -35302 -38060 -37391 -32368 -16705 -12950 -19647 -28489 -31713 -31720 -23121 -22794
14378b2794P081k118K114j3057q308j0565M659J1034O171J3183L616O332j1864
$$ -22794 -15713 -17831 -15717 -28774 -37082 -47647 -42988 -31954 -25783 -12600 -8984 -2652 -14516
14365a4516j2719n378R985J1266K884m851m327o225k32O172J1403R354j9148j4905
$$ -14516 -27235 -32613 -22628 -11362 -8478 -13329 -17656 -23881 -24113 -17941 -6538 2816 -16332 -31237
14351c1237o990k713l234k595m056J3428M118M50P068M601K319K527J1007o176
$$ -31237 -38227 -40940 -44174 -46769 -50825 -37397 -33279 -32829 -25761 -21160 -18841 -16314 -5307 -11483
14337a1483j937K56n059l245P1J2003k61J1704j6753j390P89M194p311l257J740
$$ -11483 -13420 -13164 -18223 -21468 -21397 -9394 -9655 2049 -14704 -16094 -15305 -11111 -18422 -21679 -19939
14322a9939O581q188j1912p93k109k202K62J4601q314p893k046J5144o063o649
$$ -19939 -13358 -21546 -33458 -34251 -36360 -38562 -38300 -23699 -32013 -39906 -41952 -26808 -32871 -39520
14308c9520N314J3512l361K672J720j6112m86r175J906K531p555J9334L271k67
$$ -39520 -34206 -20694 -24055 -21383 -19663 -35775 -36261 -45436 -43530 -40999 -48554 -29220 -25949 -26216
14294b6216k381J917R451J692k446k852k804O705R112L717m080n879m715J329
$$ -26216 -28597 -26680 -17229 -15537 -17983 -20835 -23639 -16934 -7822 -4105 -8185 -14064 -18779 -17450
14280a7450N191K069r277k413k67q262J443M978J560Q501o653p905J871k1265
$$ -17450 -12259 -10190 -19467 -21880 -22147 -30409 -28966 -23988 -22428 -13927 -20580 -28485 -26614 -47879
14266d7879j9628J427J9359L981J141J2720J2359m955o215m536o529M564j041
$$ -47879 -67507 -66080 -46721 -42740 -41599 -28879 -16520 -21475 -27690 -32226 -38755 -34191 -35232
14253c5232l425R542M663K702N017p8L32m003q290O443L037K055l353j502J217
$$ -35232 -38657 -29115 -24452 -21750 -16733 -16811 -16479 -20482 -28772 -22329 -19292 -17237 -20590 -22092 -20875
14238b0875N32n476j0252K498P323O869J2314J364j0517j3032n462k1130MP422
$$ -20875 -20343 -25819 -36071 -33573 -26250 -19381 -7067 -5703 -16220 -29252 -34714 -55844 -55840 -48418
14224d8418K421R837P027K719n172J0877J1872l44o762q189J650k819l056n043
$$ -48418 -45997 -36160 -29133 -26414 -31586 -20709 -8837 -9181 -15943 -24132 -22482 -25301 -28357 -33400
14210c3400J2022q84j1441P377r433L899k16N281q006k761N306J6738J465O20
$$ -33400 -21378 -22262 -33703 -26326 -35759 -31860 -32076 -26795 -34801 -37562 -32256 -15518 -14053 -13433
14196a3433l911j9303q809r120K433P223J2228J6019l019q004n993K832k079n952
$$ -13433 -17344 -36647 -45456 -54576 -52143 -44920 -32692 -16673 -19692 -27696 -33689 -30857 -32936 -38888
14182c8888J75J055k384J15k612J304J4255J643j356k425o17J667L866j300j607
$$ -38888 -38713 -37658 -40042 -39927 -42539 -41235 -26980 -25337 -26693 -29118 -29735 -28068 -24202 -25502 -27109
14167b7109Q322K676o243Q985n784l576Q507m583k6773o664J1170J0354Q15L011
$$ -27109 -18787 -16111 -22354 -13369 -19153 -22729 -14222 -18805 -45578 -52242 -41072 -30718 -29903 -26892
14153b6892k458j2913r668J0590L591m544j2387J0868K663J2815k558k846q156
$$ -26892 -29350 -42263 -51931 -41341 -37750 -42294 -54681 -43813 -41150 -28335 -30893 -33739 -41895
14140d1895k494J1368Q55n598O02J2116J3737l129j8512j746Q052M288o936L8
$$ -41895 -44389 -33021 -32166 -37764 -37162 -25046 -11309 -14438 -32950 -34696 -26644 -22356 -29292 -29254
14126b9254r133r011r797J2675J2408L407L39j7217j957R254R913j5458p825K866
$$ -29254 -38387 -47398 -57195 -44520 -32112 -28705 -28366 -45583 -47540 -38286 -28373 -43831 -51656 -48790
14112d8790O121O440K807Q065N030n246m00J077j2740j490R810p064p92q436L460
$$ -48790 -42669 -36229 -33422 -25357 -20327 -25573 -25973 -24896 -37636 -39126 -29316 -36380 -37172 -45608 -42148
14097d2148L795J4274n115R010J3830o390m999L162j021J0176j365j1549n173
$$ -42148 -38353 -24079 -29194 -20184 -6354 -12744 -17743 -14581 -15602 -5426 -6791 -18340 -23513
14084b3513R409O231n227l758j0133p166P875R142N601o002j2116J426J003n672
$$ -23513 -14104 -7873 -13100 -16858 -26991 -34157 -26282 -17140 -11539 -17541 -29657 -28231 -27228 -32900
14070c2900K919j401n852J7824o728r994j413m482J6368J2772Jj625o537r165
$$ -32900 -29981 -31382 -37234 -19410 -26138 -36132 -37545 -42027 -25659 -12887 -12886 -14511 -21048 -30213
14056c0213O760o685m825O619k458J0527J5195r175J6201J0833L601l469r479
$$ -30213 -23453 -30138 -34963 -28344 -30802 -20275 -5080 -14255 1946 12779 16380 12911 3432
14043C432j9012r532j2563r922J213K694N552q331j561O918L948M607O807Q759
$$ 3432 -15580 -25112 -37675 -47597 -46384 -43690 -38138 -46469 -48030 -41112 -37164 -32557 -25750 -16991
14029a6991J0104j4881j3922o848l200K913J1306p289r067Q354L645J699P232
$$ -16991 -6887 -21768 -35690 -42538 -45738 -42825 -31519 -38808 -47875 -39521 -35876 -34177 -26945
14016b6945M49m88K24m361J2903r255r722K0757J6043q766q988n826l391N773
$$ -26945 -26496 -26984 -26760 -31121 -18218 -27473 -37195 -16438 -395 -9161 -18149 -23975 -27366 -21593
14002b1593J885K701j533M58l155q266k438R747o014p679q24j072O590l72O576
$$ -21593 -19708 -17007 -18540 -18082 -21237 -29503 -31941 -22194 -28208 -35887 -36711 -37783 -31193 -31565 -24989
13987b4989R14n394K801o954k324M629j639O298J5906j421j0682j3794q05Q71
$$ -24989 -24075 -29469 -26668 -33622 -35946 -31317 -32956 -26658 -10752 -12173 -22855 -36649 -37454 -36583
13973c6583l835J296L587k866M506J1216J861m68L876j2224o763P680O675q756
$$ -36583 -40418 -39122 -35535 -38401 -33895 -22679 -20818 -21286 -17410 -29634 -36397 -28717 -22042 -30798
13959c0798J873M027N282O104Q928J0476j2221m967L637m773P972m970p132j1930
$$ -30798 -28925 -24898 -19616 -13512 -4584 5892 -6329 -11296 -7659 -12432 -4460 -9430 -16562 -28492
13945b8492l491J0837j1236N65O019k833m382M159J4200N680J0877P113l173J4617
$$ -28492 -31983 -21146 -32382 -31817 -25798 -28631 -33013 -28854 -14654 -8974 1903 9016 5843 20460
13931B0460k586k1045j0200K029N06l852N384J3638k052j1618j5925m547j272
$$ 20460 17874 -3171 -13371 -11342 -10836 -14688 -9304 4334 2282 -9336 -25261 -29808 -31080
13918c1080j414L478J0040J1366p87j965P55n144Q825J765J779J1508M135Q162
$$ -31080 -32494 -29016 -18976 -7610 -8397 -10362 -9607 -14751 -5926 -4161 -2382 9126 13261 21423
13904B1423M968J7257P977r368o790j0933p83l756q37j5336n091O422N475R025
$$ 21423 26391 43648 51625 42257 35467 24534 23751 19995 19158 3822 -1269 5153 10628 19653
13890A9653J2596J45l39j1221J081Q101J5295J8704J1683J1041j377J742j1066
$$ 19653 32249 32394 32055 20834 21915 30016 45311 64015 75698 86739 85362 87104 76038
13877G6038p150r092j0822q716j4057R42l891j1231j529l478k644j4692m152J907
$$ 76038 68888 59796 48974 40258 26201 27143 23252 12021 10492 7014 4370 -10322 -14474 -12567
13863a2567J3008l221N693m145j7012q645J3628J0778p488j0788k043k876J602
$$ -12567 441 -2780 2913 -1232 -18244 -26889 -13261 -2483 -9971 -20759 -22802 -25678 -24076
13850b4076Q044O628P846L305L164j5945r494r929L352J9718j6592r362K748N908
$$ -24076 -16032 -9404 -1558 1747 4911 -11034 -20528 -30457 -27105 -7387 -23979 -33341 -30593 -24685
13836b4685o576l501l784J0936J0583m656Q380r83r872n091m865j356o011j779
$$ -24685 -31261 -34762 -38546 -27610 -17027 -21683 -13303 -14286 -24158 -29249 -34114 -35470 -41481 -43260
13822d3260L074R062J0207P291j3211M071l830m664P202J7368J838J4860L478
$$ -43260 -40186 -31124 -20917 -13626 -26837 -22766 -26596 -31260 -24058 -6690 -4852 10008 13486
13809A3486j0067j2736r583j2404j870n679J9162J275j0465K875J2293P955j779
$$ 13486 3419 -9317 -18900 -31304 -33174 -38853 -19691 -18416 -28881 -26006 -13713 -5758 -7537
13796g537n813j4924o154l574j5836j1465J1303J7991n2R87J154k006J2637J4760
$$ -7537 -13350 -28274 -34428 -38002 -53838 -65303 -54000 -36009 -36061 -35074 -33920 -35926 -23289 -8529
13782h529k818l536l607P200k791o531M038l69j3590o540q21l446m528K977R773
$$ -8529 -11347 -14883 -18490 -11290 -14081 -20612 -16574 -16943 -30533 -37073 -37894 -41340 -45868 -42891 -33118
13767c3118Q606J07j9P745L406k486p615N361J2906O186q973j0225J4421J7499
$$ -33118 -24512 -24405 -24424 -16679 -13273 -15759 -23374 -18013 -5107 1079 -7894 -18119 -3698 13801
13753A3801J1389J333K682r13K0076J8367l36o13O22j5101K045J0001J420j3842
$$ 13801 25190 26523 29205 28292 48368 66735 66399 65786 66408 51307 53352 63353 64773 50931
13739E0931j2386L684j152j7635k6879k2523J496R791k942r553Q186Q976N438
$$ 50931 38545 42229 41077 23442 -3437 -25960 -24464 -14673 -17615 -27168 -18982 -10006 -4568
13726d568j5277Q00j0844K338J545L728J2527r275r587j5306J2276J1059p337
$$ -4568 -19845 -19045 -29889 -27551 -26006 -22278 -9751 -19026 -28613 -43919 -31643 -20584 -27921
13713b7921n937N131o759N622j10n013j2952K77O174Q129p200j787Q018m24O596
$$ -27921 -33858 -28727 -35486 -29864 -29974 -34987 -47939 -47662 -41488 -33359 -40559 -42346 -34328 -34752 -28156
13698b8156N507N370j8818j786l705J3279K461j0276m257Q430Q010J151K144N680
$$ -28156 -22649 -17279 -36097 -37883 -41588 -28309 -25848 -36124 -40381 -31951 -23941 -22790 -20646 -14966
13684a4966M099O110m944J292j4587k2023M093J6257R968K297j6427j3887P772
$$ -14966 -10867 -4757 -9701 -8409 -22996 -45019 -40926 -24669 -14701 -12404 -28831 -42718 -34946
13671c4946N880j448o518k101K508M05J794N829r264o990K4392J7032l718o013
$$ -34946 -29066 -30514 -37032 -39133 -36625 -36220 -34426 -28597 -37861 -44851 -20459 -3427 -7145 -13158
13657a3158l099N990L955k739m266J6367Q850M757J348M409K16m942n328l812
$$ -13158 -16257 -10267 -6312 -9051 -13317 3050 11900 16657 18005 22414 22630 17688 12360 8548
13643H548k7J633m42n355n622k1211r065J8269Q528N50P124j1887k524L164J0298
$$ 8548 8521 10154 9712 4357 -1265 -22476 -31541 -13272 -4744 -4194 2930 -8957 -11481 -8317 1981
13628A981O392j967N61n762n215N660R484m018j0516r026J530r72j368j481l463
$$ 1981 8373 6406 6967 1205 -4010 1650 11134 7116 -3400 -12426 -10896 -11868 -13236 -14717 -18180
13613a8180j523j9911N838J7573j3165L528M127J295R72j4445k021Q56Q55n889
$$ -18180 -19703 -39614 -33776 -16203 -29368 -25840 -21713 -20418 -19446 -33891 -35912 -35056 -34201 -40090
13599d0090L898M800M29p172p014J1268P519p69L548j240n022J783J157J0198
$$ -40090 -36192 -31392 -30963 -38135 -45149 -33881 -26362 -27131 -23583 -24823 -29845 -28062 -26905 -16707
13585a6707j924J903O358k029m817O61O702P933L211J608j520j4304J793J7051
$$ -16707 -18631 -16728 -10370 -12399 -17216 -16555 -9853 -1920 1291 2899 1379 -12925 -11132 5919
13571E919J4925j2660j2012J0180J2707O591n891r21M859J5090r234N536K917
$$ 5919 20844 8184 -3828 6352 19059 25650 19759 18838 23697 38787 29553 35089 38006
13558C8006L885n905l149K460J737N010l276K306l327r345o985j233J43j1436
$$ 38006 41891 35986 32837 35297 37034 42044 38768 41074 37747 28402 21417 20184 20327 8891
13544H891j5253L110j324N087Q19j0858J632J212Q753n619k346n024j3006N757
$$ 8891 -6362 -3252 -4576 511 1330 -9528 -7896 -6684 2069 -3550 -5896 -10920 -23926 -18169
13530a8169J77r422j591N618J1126o463j4030n376m331O793J1941O82j042n338
$$ -18169 -17992 -27414 -29005 -23387 -12261 -18724 -32754 -38130 -42461 -35668 -23727 -23045 -24087 -29425
13516b9425q191L037M078J3982n04l444n397j0699r3J523M964J509M090j2288
$$ -29425 -37616 -34579 -30501 -16519 -17023 -20467 -25864 -36563 -36656 -35133 -30169 -28660 -24570 -36858
13502c6858j0273L641n7j081P945N68R65p84q598n10J944j204j3074j1831K232
$$ -36858 -47131 -43490 -43547 -44628 -36683 -36115 -35150 -35934 -44532 -45042 -43098 -44302 -57376 -69207 -66975
13487f6975J8243L683R486q66q383k482j4303N429N511K13M537Q312M835n440
$$ -66975 -48732 -45049 -35563 -36429 -44812 -47294 -61597 -56168 -50657 -50444 -45907 -37595 -32760 -38200
13473c8200q275M535K062N305j1370m922O877P274N271N182J6124k682n747p985
$$ -38200 -46475 -41940 -39878 -34573 -45943 -50865 -43988 -36714 -31443 -26261 -10137 -12819 -18566 -26551
13459b6551o591J455K020J387j0917j8381R516M299P190O902J86j106J6219Q536
$$ -26551 -33142 -31687 -29667 -28280 -39197 -57578 -48062 -43763 -36573 -29671 -29485 -30591 -14372 -5836
13445e836j9840k700O292q02j5881o303k635j762Q666J3557j592j979K316K904
$$ -5836 -25676 -28376 -22084 -22886 -38767 -45070 -47705 -49467 -40801 -27244 -28836 -30815 -28499 -25595
13431b5595R637k789k400l153K358k930j5071j2155k373j0811L786J6386P770
$$ -25595 -15958 -18747 -21147 -24300 -21942 -24872 -39943 -52098 -54471 -65282 -61496 -45110 -37340
13418c7340M035n611J1014n565o73P797Q24R350K125j0847k461o403j1146j3760
$$ -37340 -33305 -38916 -27902 -33467 -34140 -26343 -25519 -16169 -14044 -24891 -27352 -33755 -44901 -58661
13404e8661j3632J092J3510J4477J231o421n134N939K028q6M557l409N797O193
$$ -58661 -72293 -71201 -57691 -43214 -41983 -48404 -53538 -47599 -45571 -45657 -41100 -44509 -38712 -32519
13390c2519M238M672o006j2772n829O515J3206K291q968m745J625J904J198N503
$$ -32519 -28281 -23609 -29615 -42387 -48216 -41701 -28495 -26204 -35172 -39917 -38292 -36388 -35190 -29687
13376b9687l793J0822J0176l004K386L674r745n916k277m51J268O822N524M96
$$ -29687 -33480 -22658 -12482 -15486 -13100 -9426 -19171 -25087 -27364 -27815 -26547 -19725 -14201 -13705
13362a3705r966j0233m849J56q900J3112P226K174K112p003k0111r23J0328j779
$$ -13705 -23671 -33904 -38753 -38597 -47497 -34385 -27159 -24985 -22873 -29876 -49987 -50910 -40582 -42361
13348d2361m685N656J1355k937r834M116N69k39L626n832k779k083o999Q227R292
$$ -42361 -47046 -41390 -30035 -32972 -42806 -38690 -38121 -38360 -34734 -40566 -43345 -45428 -52427 -44200 -34908
13333c4908R42n665R040m181r184p533m149J2587M091K086K36o429J5612J2944
$$ -34908 -33966 -39631 -30591 -34772 -43956 -51489 -55638 -43051 -38960 -36874 -36638 -43067 -27455 -14511
13319a4511j0078j0865k037N193j1488k295M691J3340L785K605q589r418J462
$$ -14511 -24589 -35454 -37491 -32298 -43786 -46081 -41390 -28050 -24265 -21660 -30249 -39667 -38205
13306c8205j1996m183o15O93J2468J2603j797J2477L652j9045l651M647n079P736
$$ -38205 -50201 -54384 -54999 -54306 -41838 -29235 -31032 -18555 -14903 -33948 -37599 -32952 -38031 -30295
13292c0295J5012J936o547l03r849m023O141N343o485m669J726O133J2425J125
$$ -30295 -15283 -13347 -19894 -20197 -30046 -34069 -27928 -22585 -29070 -33739 -32013 -25880 -13455 -12330
13278a2330n367j0360o973R555K322p161p493j404J2170J5825o800m759l457k817
$$ -12330 -17697 -28057 -35030 -25475 -23153 -30314 -37807 -39211 -27041 -11216 -18016 -22775 -26232 -29049
13264b9049q94r030j8740J1147J5420J00J0647J4329j5805j4676m042j672K918
$$ -29049 -29943 -38973 -57713 -46566 -31146 -31046 -20399 -6070 -21875 -36551 -40593 -42265 -39347
13251c9347M890K834j464k1378p093J0220J0517P030K943j1162o145L497p222
$$ -39347 -34457 -31623 -33087 -54465 -61558 -51338 -40821 -33791 -30848 -42010 -48155 -44658 -51880
13238e1880J62J527J0287K942o356Q115Q278n134l460p124J214L484N680k729
$$ -51880 -51718 -50191 -39904 -36962 -43318 -35203 -26925 -32059 -35519 -42643 -41429 -37945 -32265 -34994
13224c4994o58K010n440P844R847j939j9289l439J8150J4386N110j3686j412j0052
$$ -34994 -35652 -33642 -39082 -31238 -21391 -23330 -42619 -46058 -27908 -13522 -8412 -22098 -23510 -33562
13210c3562l217k017J3615J0762k75k904j3067r198j063l285o676j1251k671Q636
$$ -33562 -36779 -38796 -25181 -14419 -14694 -17598 -30665 -39863 -40926 -44211 -50887 -62138 -64809 -56173
13196e6173o075j1169J7950K4211Q26k486L696Q979k644j6318m599P024L061p96
$$ -56173 -62248 -73417 -55467 -31256 -30430 -32916 -29220 -20241 -22885 -39203 -43802 -36778 -33717 -34513
13182c4513l337l521m390m137j243j390O964n91M586L529J3632K652o63q113P988
$$ -34513 -37850 -41371 -45761 -49898 -51141 -52531 -45567 -46158 -41572 -38043 -24411 -21759 -22422 -30535 -22547
13167b2547P744j0296j6927m325J0090k931k240j486j5273l885J3667J438r211
$$ -22547 -14803 -25099 -42026 -46351 -36261 -39192 -41432 -42918 -58191 -62076 -48409 -46971 -56182
13154e6182j0924J2309K1615P968l247p980k457K743J2314k671m298p090K896
$$ -56182 -67106 -54797 -33182 -25214 -28461 -36441 -38898 -36155 -23841 -26512 -30810 -37900 -35004
13141c5004N398J193r243j4993L396L202k97J072n275J6462J1642n24k123l210
$$ -35004 -29606 -28413 -37656 -52649 -49253 -46051 -46348 -45276 -50551 -34089 -22447 -22971 -25094 -28304
13127b8304P001N455O837n026o268j8499q764J896j085P202j251K365J484k217
$$ -28304 -21303 -15848 -9011 -14037 -20305 -38804 -47568 -45672 -46757 -39555 -40806 -38441 -36957 -39174
13113c9174j884j2475J203J7288J3290J0181p835L693l852j687j315m803M522
$$ -39174 -41058 -53533 -52330 -35042 -21752 -11571 -19406 -15713 -19565 -21252 -22567 -27370 -22848
13100b2848j0207j7169P972j7619p734N146p322J4514R111J2059N561P402l500
$$ -22848 -33055 -50224 -42252 -59871 -67605 -62459 -69781 -55267 -46156 -34097 -28536 -21134 -24634
13087b4634P395n996k2253r904P326k94R824J884K415m52p271J3944O134n369
$$ -24634 -17239 -23235 -45488 -55392 -48066 -48360 -38536 -36652 -34237 -34689 -41960 -28016 -21882 -27251
13073b7251j0518L810J5571j1782m556J914m443O691J2785J808j0778q811l484
$$ -27251 -37769 -33959 -18388 -30170 -34726 -32812 -37255 -30564 -17779 -15971 -26749 -35560 -39044
13060c9044P584J415j105P354m148K605q911l533N482L997P674P185q085p946
$$ -39044 -31460 -30045 -31150 -23796 -27944 -25339 -34250 -37783 -32301 -28304 -20630 -13445 -21530 -29476
13046b9476K429m870k607K745L161J2390l136j0612L55L233R860j312j5869m195
$$ -29476 -27047 -31917 -34524 -31779 -28618 -16228 -19364 -29976 -29621 -26388 -16528 -17840 -33709 -37904
13032c7904M091Q714J060N82m817k274l882J9703P120r754p793p15N662J1609
$$ -37904 -33813 -25099 -24039 -23457 -28274 -30548 -34430 -14727 -7607 -17361 -25154 -25869 -20207 -8598
13018h598l728k403j1695j8038q916O488R599n375J0019J7381o009j139m900q806
$$ -8598 -12326 -14729 -26424 -44462 -53378 -46890 -37291 -42666 -32647 -15266 -21275 -22414 -27314 -36120
13004c6120k170j0709k74R178P158p815n30L309J0271j983m824K922N740J0770
$$ -36120 -38290 -48999 -49273 -40095 -32937 -40752 -41282 -37973 -27702 -29685 -34509 -31587 -25847 -15077
12990a5077Q7p224j567o45O057j5216k0560m41J5883M367P534K387L372N689j0500
$$ -15077 -14990 -22214 -23781 -24426 -18369 -33585 -54145 -54586 -38703 -34336 -26802 -24415 -21043 -15354 -25854
12975b5854j5822L985o065J0008K625J1686K588M350m759n968j092p129j459J421
$$ -25854 -41676 -37691 -43756 -33748 -31123 -19437 -16849 -12499 -17258 -23226 -24318 -31447 -32906 -31485
12961c1485j7003j1684Q618M487m663J1020K907p844L023o871J548R92q187K564
$$ -31485 -48488 -60172 -51554 -47067 -51730 -40710 -37803 -45647 -42624 -49495 -47947 -46955 -55142 -52578
12947e2578j561O180K32P106j643n622M57m146p031l584N733P427o905J371J9257
$$ -52578 -54139 -47959 -47727 -40621 -42264 -47886 -47429 -51575 -58606 -62190 -56457 -49030 -55935 -54564 -35307
12932c5307J2665m728R146l343j743J507N627r57r351l353J5069J4422O823j8712
$$ -35307 -22642 -27370 -18224 -21567 -23310 -21803 -16176 -17133 -26484 -29837 -14768 -346 6477 -12235
12918a2235j1722O704L260r050o892R919M582k095j3704j2907O118J8428k499
$$ -12235 -23957 -17253 -13993 -23043 -29935 -20016 -15434 -17529 -31233 -44140 -38022 -19594 -22093
12905b2093N90R0O302o767j4803L149k457q698N70l772L189l74J1533M534m094
$$ -22093 -21503 -21413 -15111 -21878 -36681 -33532 -35989 -44687 -44117 -47889 -44700 -45074 -33541 -29007 -33101
12890c3101m85J0868j507J482k2207o167L891k958M234M282R804n722J0355J1050
$$ -33101 -33586 -22718 -24225 -22743 -44950 -51117 -47226 -50184 -45950 -41668 -31864 -37586 -27231 -16181
12876a6181o693j6658j0503j0097J0470J6261J0842k46l874p673P392J9611N264
$$ -16181 -22874 -39532 -50035 -60132 -49662 -33401 -22559 -22805 -26679 -34352 -26960 -7349 -2085
12863b085P789L261j1972j9736O432K52P407M525r561M87P156J7043J0270j75
$$ -2085 5704 8965 -3007 -22743 -16311 -16059 -8652 -4127 -13688 -13201 -6045 10998 21268 21093
12849B1093j384r126N296j5834m967K1736J9237K5580J3448J9058K4565J7141
$$ 21093 19709 10583 15879 45 -4922 16814 36051 61631 75079 94137 118702 135843
12837A35843J8768K1997K5293L7624M0615M6966Q8897R9228J27893J62129J72883
$$ 135843 154611 176608 201901 239525 280140 327106 416003 515231 643124 805253 978136
12826I78136J72353J61180J30999J04664O5123J8540n2619j14466j49326j72494
$$ 978136 1150489 1311669 1442668 1547332 1612455 1630995 1578376 1463910 1314584 1142090
12816A142090j83227j54411j43662j11243r2323p7111o2493k6810k1458j7949
$$ 1142090 958863 804452 660790 549547 457224 380113 317620 290810 269352 251403
12806B51403r848k0422n680k6555n173j946j2540q384Q41p991j2398k6581j9148
$$ 251403 241555 221133 215453 188898 183725 181779 169239 160855 161696 153705 141307 114726 95578
12793I5578R805k235j576j1097l051l247n428j5909q154m509q023j2211M429l284
$$ 95578 105383 103148 101572 90475 87424 84177 78749 62840 54686 50177 42154 29943 34372 31088
12779C1088q748R253M629N100r664k797J844R873k096j3322m240j577n604j0645
$$ 31088 22340 31593 36222 41322 31658 28861 30705 40578 38482 25160 20920 19343 13739 3094
12765C094r235Q940L36j2105n362J2324J2448j0188n491J1732l173j5502q55Q638
$$ 3094 -6141 2799 3135 -8970 -14332 -2008 10440 252 -5239 6493 3320 -12182 -13037 -4399
12751d399n522M864J843p720r878J2695J2991j064j5262j1377L964M110j9744
$$ -4399 -9921 -5057 -3214 -10934 -20812 -8117 4874 3810 -11452 -22829 -18865 -14755 -34499
12738c4499j564J0435J3940J5335J502j0721j2404N561J6376Q788l621m973n551
$$ -34499 -36063 -25628 -11688 3647 5149 -5572 -17976 -12415 3961 12749 9128 4155 -1396
12725a396M762p119n148p573o440m640p342m378P696P106N438L453j269R543R449
$$ -1396 3366 -3753 -8901 -16474 -22914 -27554 -34896 -39274 -31578 -24472 -19034 -15581 -16850 -7307 2142
12710B142L764J697n239P229O444j4927j0518k846j240R25R587J2429r148r105
$$ 2142 5906 7603 2364 9593 16037 1110 -9408 -12254 -13494 -12569 -2982 9447 299 -8806
12696h806J6544Q853P150K3160k1927j3299k1372j5589o617J5609O659R666J6362
$$ -8806 7738 16591 23741 46901 24974 11675 -9697 -25286 -31903 -16294 -9635 31 16393
12683A6393P611J0768l863o517m936J0397J2255m718m173J2054k906j6454L016
$$ 16393 24004 34772 30909 24392 19456 29853 42108 37390 33217 45271 42365 25911 28927
12670B8927P93R611J4368J5306J7745K4865M5786K4609J2814J9072J1808J474
$$ 28927 29720 39331 53699 69005 86750 111615 157401 182010 194824 213896 225704 227178
12658B27178n473k124R096P526j0781k0556j0528k3366p045j0416k2024j8199
$$ 227178 221705 219581 228677 236203 225422 204866 194338 170972 163927 153511 131487 113288
12646A13288r649j5278j5387n849j5272j9517l127k758o621K549k727j7447j715
$$ 113288 103639 88361 72974 67125 51853 32336 29209 26451 19830 22379 19652 2205 490
12633D90j059k400J0427O826j3223p447K3396J8315j0715j8399n12N760P996L731
$$ 490 -569 -2969 7458 14284 1061 -6386 17010 35325 24610 6211 5699 11459 19455 23186
12619B3186L223J934Q738R71J2027J5204K0611R824j5462p243L465j4410j1976
$$ 23186 26409 28343 37081 38052 50079 65283 85894 95718 80256 73013 76478 62068 50092
12606E0092K269P145O12r571r133K208J118j2479L810M437K670P039K637k742
$$ 50092 52361 59506 60118 50547 41414 43622 44740 32261 36071 40508 43178 50217 52854 50112
12592E0112L921J4675J7196K356m89j7242k8180j6629m488N953n733k619m643
$$ 50112 54033 68708 85904 88260 87771 70529 42349 25720 21232 27185 21452 18833 14190
12579A4190n012L260J4177Q866q675j3979p798R821m539n123J6252J8854r218
$$ 14190 9178 12438 26615 35481 26806 12827 5029 14850 10311 5188 21440 40294 31076
12566C1076k5112M64R502r244q381K2356J3307K2535J5961J9215J2919L5148J4572
$$ 31076 5964 6428 15930 6686 -1695 20661 33968 56503 72464 91679 104598 139746 154318
12553A54318q181J0328R445N809N726N065o926o709p125J2732P590K0777J3108
$$ 154318 146137 156465 165910 171719 177445 182510 175584 168875 161750 174482 182072 202849 215957
12540B15957J7378P970J3372L3531J8865J4316J3026R323J1915j2426k121J254
$$ 215957 233335 241305 254677 288208 307073 321389 334415 343738 355653 343227 341106 342360
12528C42360k2250l0178j8951j6250l0102k8735r330j4079N947L935M194P41K3254
$$ 342360 320110 289932 270981 254731 224629 195894 186564 172485 178432 182367 186561 187302 210556
12515B10556K4556K0585J7288K2937J1750P437K5594k891o89P104N240j3982o613
$$ 210556 235112 255697 272985 295922 307672 315109 340703 337812 337123 344227 349467 335485 328872
12502C28872K472Q644J4507q847o191L549J4007J6179K5053K6897J9604j672Q660
$$ 328872 331344 339988 354495 345648 339457 343006 357013 373192 398245 425142 444746 443074 451734
12489D51734N726Q125K1848N1923L3152K0724R307O288J6600L3205K9115L9589
$$ 451734 457460 465585 487433 539356 572508 593232 602539 608827 625427 658632 687747 727336
12477G27336K7424R564P310K1471J1607O574k073J9295K8924J6317J4907K1525
$$ 727336 754760 764324 771634 793105 804712 811286 809213 828508 857432 873749 888656 910181
12465I10181L7356L7210M0086M7436M8374M8654N0704M0388N3854P0384N8436
$$ 910181 947537 984747 1024833 1072269 1120643 1169297 1220001 1260389 1314243 1384627 1443063
12454A443063P4795P7536Q0329P8330Q8088R0188R2595R7593R6950R4415J10911
$$ 1443063 1517858 1595394 1675723 1754053 1842141 1932329 2024924 2122517 2219467 2313882 2424793
12443B424793J27747J49752J62595J65933J72665J99182K14412K20871K49764
$$ 2424793 2552540 2702292 2864887 3030820 3203485 3402667 3617079 3837950 4087714
12434D087714K91458L28262M13906N53268P02290R03271J153965J422734J690042
$$ 4087714 4379172 4707434 5121340 5674608 6376898 7280169 8434134 9856868 11546910
12425A1546910J989386K297248K681134L068094L530168M252856N497000P578851
$$ 11546910 13536296 15833544 18514678 21582772 25112940 29365796 34862796 42441647
12417D2441647J0554551J4119557J8014727K2308188K7077221L1831425L4727241
$$ 42441647 52996198 67115755 85130482 107438670 134515891 166347316 201074557
12410B01074557L4058983L0038848K3763736J6486941P678970k811287j4588922
$$ 201074557 235133540 265172388 288936124 305423065 313102035 310290748 295701826
12403B95701826k4353501l0057597l2058925l1685529k9977396k6631348k1712714
$$ 295701826 271348325 241290728 209231803 177546274 147568878 120937530 99224816
12396I9224816j5820906j0886734p610366n605565m426655l740615l350016l112192
$$ 99224816 83403910 72517176 64906810 59301245 54874590 51133975 47783959 44671767
12388D4671767k919057k715114k528769k339332k122415j900879j673041j482792
$$ 44671767 41752710 39037596 36508827 34169495 32047080 30146201 28473160 26990368
12380B6990368j328719j208276j078441j009679r38880q82147q30600p93405p55712
$$ 26990368 25661649 24453373 23374932 22365253 21426373 20544226 19713626 18920221 18164509
12371A8164509o95610o79593o51373o09876n71891n11145m75405m35823l80148
$$ 18164509 17468899 16789306 16137933 15528057 14956166 14445021 13969616 13533793 13153645
12362A3153645l41238k88859k58477k60502k60600k57531l04421l28950l48045
$$ 13153645 12812407 12523548 12265071 12004569 11743969 11486438 11182017 10853067 10505022
12353A0505022l70865m13325m02280l71901l65641l15133l01760k80884k61045
$$ 10505022 10134157 9720832 9318552 8946651 8581010 8265877 7964117 7683233 7422188
12344G422188k39358k18635k03385j92113j90031k00279j80427j51399j69980
$$ 7422188 7182830 6964195 6760810 6568697 6378666 6178387 5997960 5846561 5676581
12335E676581j55011j54820j39474j24743j17230j05939j18369j14084q4643p4517
$$ 5676581 5521570 5366750 5227276 5102533 4985303 4879364 4760995 4646911 4562268 4487751
12325D487751q1865q3129p8804q3054p0665o8510p7546q3549j00095q7882q8614
$$ 4487751 4405886 4322757 4243953 4160899 4090234 4021724 3944178 3860629 3760534 3672652 3584038
12314C584038q8063r3516j04926j02410r8385r6654q1495r0204q9470o5818n1441
$$ 3584038 3495975 3402459 3297533 3195123 3096738 3000084 2918589 2828385 2738915 2673097 2621656
12303B621656m8076n5887n3751l8133l3683l1979k5556j7735k9621k0181k0182
$$ 2621656 2573580 2517693 2463942 2425809 2392126 2360147 2334591 2316856 2287235 2267054 2246872
12292B246872l0647l6034m1045l7296l7109m5045l7767l3193j9021j8053j8883
$$ 2246872 2216225 2180191 2139146 2101850 2064741 2019696 1981929 1948736 1929715 1911662 1892779
12281A892779j5590j6852j6754r610k818k4173r062P776P203Q900J0827j7393
$$ 1892779 1877189 1860337 1843583 1833973 1831155 1806982 1797920 1805696 1812899 1821799 1832626 1815233
12269A815233l3868m2049n5395m7159o0137m7808m9691l7143m9178n5248n3913
$$ 1815233 1781365 1739316 1683921 1636762 1576625 1528817 1479126 1441983 1392805 1337557 1283644
12258A283644m5508l8250m4554m7744m5443k0060q650j8677l1590k4176j6234
$$ 1283644 1238136 1199886 1155332 1107588 1062145 1042085 1033435 1014758 983168 958992 942758
12247I42758j9319l4932l4480k2283j6657j8321k4206j8154j7490j3403k3304
$$ 942758 923439 888507 854027 831744 815087 796766 772560 754406 736916 723513 700209
12236G00209n410j0807j3320k2683l5796p735R371j7860l0637j7853j8207j9179
$$ 700209 694799 683992 670672 647989 612193 604458 613829 595969 565332 547479 529272 510093
12224E10093j6351j9223p663N479J1342k487L706J0061r671j6526k0839k0096
$$ 510093 493742 474519 466856 472335 483677 481190 484896 494957 485286 468760 447921 427825
12212D27825N438N714j2035j2288j2726n664N422m597k192n728q754j0423J868
$$ 427825 433263 438977 426942 414654 401928 396264 401686 397089 394897 389169 380415 369992 371860
12199C71860j5547J339j841L534K912K1806N457p587O793P763o979K893j0060
$$ 371860 356313 357652 355811 359345 362257 384063 389520 381933 388726 396489 389510 392403 382343
12186C82343l789J836N36J6802m265j7706K311o485l294J6738M317m689n918j311
$$ 382343 378554 380390 380926 397728 393463 375757 378068 371583 368289 385027 389344 384655 378737 377426
12172C77426o227k0830j8870j0582r265m673l699j8872j4329q815o98q239Q013
$$ 377426 371199 350369 331499 320917 311652 306979 303280 284408 270079 261264 260566 252327 260340
12159B60340j5552j3423O684J8031m306j0461J1050j803J4259N339j572K910n390
$$ 260340 244788 231365 238049 256080 251774 241313 252363 250560 264819 270158 268586 271496 266106
12146B66106j239p458K907J7939J3654J0564L476o818P9J5975q056j2781l866
$$ 266106 264867 257409 260316 278255 291909 302473 305949 299131 299210 315185 307129 294348 290482
12133B90482O586j0708J4235N237r171n623j937O713j1419j767J2036J0864M964
$$ 290482 297068 286360 300595 305832 296661 291038 289101 295814 284395 282628 294664 305528 310492
12120C10492j6573o798o12l999m658r345J419o852n774N901j1841k1904Q210l600
$$ 310492 293919 287121 286509 282510 277852 268507 269926 263074 257300 263201 251360 229456 237666 234066
12106B34066r435o205k425Q35P13k760P954L2592K3784J2374J3061J3338j0433
$$ 234066 224631 218426 216001 216836 217549 214789 222743 255335 279119 291493 304554 317892 307459
12093C07459j3863q181o265j2610k1958j3987n132Q49R893j0797j1251j10K044
$$ 307459 293596 285415 279150 266540 244582 230595 225463 226312 236205 225408 214157 214047 216091
12080B16091J1188o932r332M767j7291j6230o008M679k607k795j0378k164n725
$$ 216091 227279 220347 211015 215782 198491 182261 176253 180932 178325 175530 165152 162988 157263
12067A57263j728J060j005k33l140j3752q3Q121J3010R553M402J1307R216K684
$$ 157263 155535 156595 155590 155357 152217 138465 138382 146503 159513 169066 173468 184775 193991 196675
12053A96675Q751j0586m591N359j2484j4612j4810k6568J484J895n979J0453L389
$$ 196675 205426 194840 190249 195608 183124 168512 153702 127134 128618 130513 124534 134987 138376
12040A38376K77O272J0220P800J624Q973o548j3587J3754K3201K320j1797N936
$$ 138376 138653 144925 155145 162945 164569 173542 166994 153407 167161 190362 192682 180885 186821
12027A86821l027r490k551k0100n406o71m01L553q62o33O163j590J869J5125O813
$$ 186821 183794 174304 171753 151653 146247 145576 145175 148728 147866 147233 153396 151806 153675 168800 175613
12012A75613q220L533Q172j569J1599J6106J0685J889r61P461J9032K4084K7201
$$ 175613 167393 170926 179098 177529 189128 205234 215919 217808 216847 224308 243340 267424 294625
11999B94625K4589L6186J7421M6116O7413P8613R5035J21831J50386J74229J93174
$$ 294625 319214 355400 372821 418937 486350 564963 659998 781829 932215 1106444 1299618
11988A299618J85948J54043J13439Q9593L4413j8260r1523j25141j67694j68853
$$ 1299618 1485566 1639609 1753048 1842641 1877054 1858794 1767271 1642130 1474436 1305583
11978A305583j78659j73149j45444j00098p8098n6153n9326m6295k0575j4783
$$ 1305583 1126924 953775 808331 708233 630135 573982 514656 468361 447786 433003
11968D33003k3710k3704k0218k3032k789l779k9310k7400j0180j1850l724R687
$$ 433003 409293 385589 365371 342339 339550 335771 306461 279061 268881 257031 253307 262994
11956B62994P210n581j2928j1554l46o705J260J5715Q766O931m950K926j547j535
$$ 262994 270204 264623 251695 240141 239795 233090 234350 250065 258831 265762 260812 263738 262191 260656
11942B60656L038p13k568n506P25L161j3975J083M015K369m123k1945j6365j7794
$$ 260656 263694 262981 260413 254907 255632 258793 244818 245901 249916 252285 248162 226217 209852 192058
11928A92058k3172j3165q162O078k02n100K183j5777j5918k286L197O052J63l897
$$ 192058 168886 155721 147559 153637 153435 148335 150518 134741 118823 116537 119734 125786 125949 122052
11914A22052q24J1252n255j1049J0476M461P673o857K526j1073n929M840j645
$$ 122052 121228 132480 127225 116176 126652 131113 138786 131929 134455 123382 117453 122293 120648
11901A20648O517n983J610O970j2584j889o330l171J01M747K396P748k489j2261
$$ 120648 127165 121182 122792 129762 117178 115289 108959 105788 105889 110636 113032 120780 118291 106030
11887A06030m468m843J4684o754j4450R68P004N725j0126j4336k0548K691J3929
$$ 106030 101562 96719 111403 104649 90199 91167 98171 103896 93770 79434 58886 61577 75506
11874G5506K728m896M510J9922q322j2525R228J1318R876j7664k3006l108J9365
$$ 75506 78234 73338 77848 97770 89448 76923 86151 97469 107345 89681 66675 63567 82932
11861H2932K3426J50n036l511O492n0m854p304r197J5241j531j8615j0J0815N801
$$ 82932 106358 106508 101472 97961 104453 104403 99549 92245 83048 98289 96758 78143 78133 88948 94749
11846I4749J2988l03j992J645j1501j0034j639L288j343j0298k681J2784M498
$$ 94749 107737 107434 105442 107087 95586 85552 83913 87201 85858 75560 72879 85663 90161
11833I0161J596k02K813J5518J4107O815l431p334o579n188p216r6K113l662m348
$$ 90161 91757 91555 94368 109886 123993 130808 127377 120043 113464 108276 101060 100964 103077 99415 95067
11818I5067j3352j0342K616K8044J9667m737q230j6547j7154k638J1377R259j2778
$$ 95067 81715 71373 73989 102033 121700 116963 108733 92186 75032 72394 83771 93030 80252
11805H0252p803R42P012j0126n189j2073p100J7184r305m71J7755L57o719J5655
$$ 80252 72449 73391 80403 70277 65088 53015 45915 63099 53794 53323 71078 71435 64716 80371
11791H0371J6086K357M443R772R938n785k0030Q95J7127P595r300r413M784J051
$$ 80371 96457 98814 103257 113029 122967 117182 97152 98047 115174 122769 113469 104056 108840 109891
11777A09891j6051j1721J7120Q281j3182j2604j424o05L13k624P135n46k4052
$$ 109891 93840 82119 99239 107520 94338 81734 80310 79705 80018 77394 84529 83983 59931
11764E9931j0385J7067J2541n203J0724J8060j676r35M007L673j2267N158K589
$$ 59931 49546 66613 79154 73951 84675 102735 101059 100124 104131 107804 95537 100695 103284
11751A03284q854J1547M720n999n623J0619N967N01J946j993n304q32J1857J0150
$$ 103284 94430 105977 110697 104698 99075 109694 115661 116162 118108 116115 110811 109979 121836 131986
11737A31986p54o719l218O235j0323k52K132j0676K586N705p974J384l954R863
$$ 131986 131232 124513 121295 127530 117207 116955 119087 108411 110997 116702 108728 110112 106158 116021
11723A16021J4126R653q506j1415n360j9198n044K2474K46Q961J9393n35m256
$$ 116021 130147 139800 131294 119879 114519 95321 90277 112751 112997 121958 141351 140816 136560
11710A36560m346j7569O551J2457j779N15R854J1558l215L590k418p828P501j6538
$$ 136560 132214 114645 121196 133653 131874 132389 142243 153801 150586 154176 151758 143930 151431 134893
11696A34893R098J4051r883q406q031L103R236m343L907J0766J7944Q762O077
$$ 134893 143991 158042 148159 139753 131722 134825 144061 139718 143625 154391 172335 181097 187174
11683A87174L874q705l539P419n203l69j81Q853R129j5944L234k820J3648P059
$$ 187174 191048 182343 178804 186223 181020 180651 180470 189323 198452 182508 185742 182922 196570 203629
11669B03629M496J0872j7Q78j231N599P382L653J3016R727q715j4401r854l805
$$ 203629 208125 218997 218980 219858 218627 224226 231608 235261 248277 258004 249289 234888 225034 221229
11655B21229R779J1457j812l505k452J7970J8149j416J947J3524J5389J484o114
$$ 221229 231008 242465 240653 237148 234696 252666 270815 269399 271346 284870 300259 301743 295629
11642B95629j368j182n243O829J719J1169j107n507p502J3495N008k0455K051
$$ 295629 294261 293079 287836 294665 296384 307553 306446 300939 293437 306932 311940 291485 293536
11629B93536n044N337R208J3774K1351K780k575j516k648m052J5491K6549R273
$$ 293536 288492 293829 303037 316811 338162 340942 338367 336851 334203 330151 345642 372191 381464
11616C81464o693K601J250n215l590p159l557J2029p40R444j1216j0631N69J8735
$$ 381464 374771 377372 378622 373407 369817 362658 359101 371130 370390 379834 368618 357987 358556 377291
11602C77291J9458P458j2247o185K1472q765Q162K1769M914o139j0659J816L388
$$ 377291 396749 404207 391960 385775 407247 398482 406644 428413 433327 427188 416529 418345 421733
11589D21733M039L354K1110M390P050R664K62L710K2499l955j231J6662L78J2900
$$ 421733 425772 429126 450236 454626 461676 471340 471602 475312 497811 493856 492625 509287 509665 522565
11575E22565O682K2936O412j6086O201m167k061J2464P266J3380n952k446j701
$$ 522565 529247 552183 558595 542509 548710 544543 542482 554946 562212 575592 569640 567194 565493
11562E65493l442J1819k066M1K6977R369R126L281Q39P101J4746j0251M621O823
$$ 565493 562051 573870 571804 571845 598822 608191 617317 620598 621437 628538 643284 633033 637654 644477
11548F44477Q991J1437j704r876N155j792p498m096N6R439J3981N987k62J4854
$$ 644477 653468 664905 663201 653325 658480 656688 649190 645094 645150 654589 668570 674557 674295 689149
11534F89149P223K037q577j1349q176J1334Q420J0045O320J1270K970J353N253
$$ 689149 696372 698409 689832 678483 670307 681641 690061 700106 706426 717696 720666 722019 727272
11521G27272j7321q462L258J0139M769n358O932N572O517k984j2266r732N385
$$ 727272 709951 701489 704747 714886 719655 714297 721229 726801 733318 730334 718068 708336 713721
11508G13721k896j2649k030q180q687J3122M253j2221k715n652N991n430j2247
$$ 713721 710825 698176 696146 687966 679279 692401 696654 684433 681718 676066 682057 676627 664380
11495F64380k442q201p039J8061R125N62m120j2261j1913R895J0403m931j0126
$$ 664380 661938 653737 646698 664759 673884 674446 670326 658065 646152 656047 666450 661519 651393
11482F51393p956m832J932L557p576p843N428m622r019q860L517l063j083p844
$$ 651393 643437 638605 640537 644094 636518 628675 634103 629481 620462 611602 615119 612056 610973 603129
11468F03129L818o020j2510J1231k961m829m488n571K055M64n333L185j082j4395
$$ 603129 606947 600927 588417 599648 596687 591858 587370 581799 583854 584318 578985 582170 581088 566693
11454E66693n604q26j5169j7727K709J0108N040m824j0281n354q754P569o859
$$ 566693 561089 560263 545094 527367 530076 540184 545224 540400 530119 524765 516011 523580 516721
11441E16721k7666o163J0521N80J2703l800j5571q081O671L426j9846j1822k412
$$ 516721 489055 482892 493413 493993 506696 502896 487325 479244 485915 489341 469495 457673 455261
11428D55261j7745j2320q67j2044m267K344m712K005J520M426o857J130J0965
$$ 455261 437516 425196 424329 412285 408018 410362 405650 407655 409175 413601 406744 407874 418839
11415D18839k3206p948q510M70M262Q560l026m143m440R19j5750q756O304J2595
$$ 418839 395633 387685 379175 379645 383907 392467 389441 385298 380858 381777 366027 357271 363575 376170
11401C76170J697o262j9120q329q429j2062L266Q619L474J0955Q083m612P01j3379
$$ 376170 377867 371605 352485 344156 335727 323665 326931 335550 339024 349979 358062 353450 354151 340772
11387C40772j2368m629J950j115j1269j0617o751P57r57m699j1177k745K845m779
$$ 340772 328404 323775 325725 324610 313341 302724 295973 296730 295773 291074 279897 277152 279997 275218
11373B75218k2552m567K597k162R749J1216k174j5263j3074p013M453L506K762
$$ 275218 252666 248099 250696 248534 258283 269499 267325 252062 238988 231975 236428 239934 242696
11360B42696Q973m537l064j67k2534j6328o640J6242J8246N188M798l832R716
$$ 242696 251669 247132 244068 243901 221367 205039 198399 214641 232887 238075 242873 239041 248757
11347B48757l382r311O951m215K0348M451n434m684q485j184j2623j5297q045
$$ 248757 245375 236064 243015 238800 259148 263599 258165 253481 244996 243812 231189 215892 207847
11334B07847P708L414q704J876o009j3173j3676r373j1777q069k360r305K1048
$$ 207847 215555 218969 210265 212141 206132 192959 179283 169910 158133 150064 147704 138399 159447
11321A59447L052K231j3641p720M411K717p740N35P359q215r437L749P555j846
$$ 159447 162499 164730 151089 143369 147780 150497 142757 143292 150651 142436 132999 136748 144303 142457
11307A42457k186J6925N138p469Q409J3670L664M092k880Q023Q607k485k2558
$$ 142457 140271 157196 162334 154865 163274 176944 180608 184700 181820 189843 198450 195965 173407
11294A73407J867J158J50q570n197j159m077o015l102q867Q476K323o330J835
$$ 173407 175274 176432 176582 168012 162815 161656 157579 151564 148462 139595 148071 150394 144064 145899
11280A45899P132m083K059J830K792r671J0072L128R512j508Q63R589j3827j5209
$$ 145899 153031 148948 151007 152837 155629 145958 156030 159158 168670 167162 168025 177614 163787 148578
11266A48578q488k208J8414j178j5243k914J2701m816q144k093J0113m2N678l576
$$ 148578 140090 137882 156296 155118 139875 136961 149662 144846 136702 134609 144722 144680 150358 146782
11252A46782n476m440o77o066J3757j8151j5589l05J0890L604N275N012r479o670
$$ 146782 141306 136866 136189 130123 143880 125729 110140 109835 120725 124329 129604 134616 125137 118467
11238A18467m873J883j3763j106k560k819J6151L36o553R665L622p293j0434O251
$$ 118467 113594 115477 101714 100608 98048 95229 111380 111716 105163 114828 118450 111157 100723 106974
11224A06974J1254p241q135N618r359j0598M288p50m599j7845q633M888L370M745
$$ 106974 118228 110987 102852 108470 99111 88513 92801 92051 87452 69607 60974 65862 69232 73977
11210G3977N056m278J03Q435q735m614j133Q734J6487o911p666l576P467O426
$$ 73977 79033 74755 74858 83293 74558 69944 68811 77545 94032 87121 79455 75879 83346 89772
11196H9772o175p128j3507k230K5786P913j238k5290j1000J1423M447R2J163j2419
$$ 89772 83597 76469 62962 60732 86518 94431 93193 67903 56903 68326 72773 72865 74028 61609
11182F1609m836l246J663M42l383k5j37j438J070r555J460J8644L321j9037q794
$$ 61609 56773 53527 55190 55632 52249 52224 52087 50649 51719 42164 43624 62268 65589 46552 37758
11167C7758L181P568R812m718p767J28J370J0517J5053j6871l753j167J483k758
$$ 37758 40939 48507 58319 53601 45834 45962 47332 57849 72902 56031 52278 51111 52594 49836
11153D9836L102N115m637N976o082p810k757L505o834m772j974k323J1150J0692
$$ 49836 52938 58053 53416 59392 53310 45500 42743 46248 39414 34642 32668 30345 41495 52187
11139E2187K693J176o593P25j5031N689M213j4834P950q64j7240q338M877J3734
$$ 52187 54880 56056 49463 50188 35157 40846 45059 30225 38175 37311 20071 11733 16610 30344
11125C0344J3423j1248j3272N344M233J835j335Q08j717K661l945J589r974O163
$$ 30344 43767 32519 19247 24591 28824 30659 29324 30132 28415 31076 27131 28720 18746 24909
11111B4909J0660o993o81k022j2318j662K0920P323l045k899o146j3026m449O045
$$ 24909 35569 28576 27895 25873 13555 11893 32813 40136 37091 34192 28046 15020 10571 16616
11097A6616J1003J1506K0070r059l2396L368r779n994J4159J1697R515j1298O344
$$ 16616 27619 39125 59195 50136 17740 21108 11329 5335 19494 31191 40706 29408 35752
11084C5752k65j561J1202J5537Q374o937r958k1756n276J860Q351L335j973M139
$$ 35752 35487 33926 45128 60665 69039 62102 52144 30388 25112 26972 35323 38658 36685 40824
11070D0824J7050R257n396j5318r101K419R736j778P35J630O311l652j2743j6582
$$ 40824 57874 67131 61735 46417 37316 39735 49471 47693 48428 50058 56369 52717 39974 23392
11056B3392L732K488J4809J8727K778m802J1051K162K259J638K936J4167O063
$$ 23392 27124 29612 44421 63148 65926 61124 72175 74337 76596 78234 81170 95337 101400
11043A01400m590l723n82L320l356P268m185j2415p582J0342J5894J0370O032
$$ 101400 96810 93087 92505 95825 92469 99737 95552 83137 75555 85897 101791 112161 118193
11030A18193K8313L6188M6919M9295L7245L9988M3612K6383O088r566q936q524
$$ 118193 146506 182694 229613 278908 316153 356141 399753 426136 432224 422658 413722 405198
11018D05198o017m719l680n384O820J0395o6o749N369R001J1586j387j301m593
$$ 405198 399181 394462 390782 385398 392218 402613 402547 395798 401167 410168 421754 420367 419066 414473
11004D14473O258J2843J1967O017K4168M652K1101J8930p950r118o09k954m661
$$ 414473 420731 433574 445541 451558 475726 480378 501479 520409 512459 503341 502732 499778 495117
10991D95117N662K5338M1649O3216P0452Q7548P1955Q5777P6894O1796L7433J1605
$$ 495117 500779 526117 567766 630982 701434 788982 860937 946714 1023608 1085404 1122837 1134442
10979A134442l5934o0678p1873p5378o6311m9447l3299j5318k739j3912j7676
$$ 1134442 1098508 1037830 965957 890579 824268 774821 741522 726204 723465 709553 691877
10968F91877k732J0172K510k3454k6924j2553n929q265j7104l8213k8202k6158
$$ 691877 689145 699317 701827 678373 651449 638896 632967 624702 607598 569385 541183 515025
10956E15025k8558l5406m617J750J758J0394J5078n494j0542m932J7796J1109
$$ 515025 486467 451061 446444 448194 449952 460346 475424 469930 459388 454456 472252 483361
10944D83361J0762P625J9322O863O900l590j9156k9759m1114n9741n6288m0273
$$ 483361 494123 501748 521070 527933 534833 531243 512087 482328 441214 381473 325185 284912
10932B84912l1691k0254l7687j6350j3206j3921Q48M91J9929K960l455j2023J3206
$$ 284912 253221 232967 195280 178930 165724 151803 152651 153142 173071 176031 172576 160553 173759
10919A73759J0402j4178l2004j1954M893o629k4276j8655J8909j2960r826Q198
$$ 173759 184161 169983 137979 126025 130918 124289 100013 81358 100267 87307 77481 85679
10907H5679M639l770J0588M01j613M231L406j4316r018m817q528k1512n074J37
$$ 85679 90318 86548 97136 97537 95924 100155 103561 89245 80227 75410 66882 45370 40296 40433
10893D0433N32K07r73J0423J2865r435r038L720m514r753p676j0833q007n141
$$ 40433 40965 41172 40199 50622 63487 54052 45014 48734 44220 34467 26791 15958 7951 2810
10879B810J8339J4713R96j694n378J817L179O351O023O155Q972n904j7109j6583
$$ 2810 21149 35862 36858 35164 29786 31603 34782 41133 47156 53311 62283 56379 39270 22687
10865B2687m38J1692O097J0681l10J3507p78Q196J5021j2319j8596J899N774p019
$$ 22687 22249 33941 40038 50719 50409 63916 63138 71334 86355 74036 55440 57339 63113 56094
10851E6094L322J6645J8540N11p386j1749k513j1576j8R358J4921p29j0497J065
$$ 56094 59416 76061 94601 95112 87726 75977 73464 61888 61870 71228 86149 85420 74923 75988
10837G5988M669K597J394L401J3946l167r737j3402J2204k085N693K794m461P217
$$ 75988 80657 83254 84648 88049 101995 98828 89091 75689 87893 85808 91501 94295 89834 97051
10823I7051J5262J3749K343L470j0621q532N590N819l409q227O659J9874J5111
$$ 97051 112313 126062 128405 131875 121254 112722 118312 124131 120722 112495 119154 139028 154139
10810A54139M945j9576O002J2687K951N032q147L572M784q125l717Nk6603l376
$$ 154139 159084 139508 145510 158197 161148 166180 158033 161605 166389 158264 154547 154552 127949 124573
10796A24573Q596p89k382j587k429r068O11l580p044R626J151r6m094k083p956
$$ 124573 133169 132380 129998 128411 125982 116914 117525 113945 106901 116527 117678 117582 113488 111405 103449
10781A03449r26j6303j2888J45j000M61M565m320m028Q91R297N342R955k040j6691
$$ 103449 102523 86220 73332 73477 72477 72938 77503 73183 69155 70046 79343 84685 94640 92600 75909
10766G5909Q913N462R0M193m253n930j6679n452J973O359rr991J012K2632k866
$$ 75909 84822 90284 90374 94567 90314 84384 67705 62253 64226 70585 70576 60585 61597 84229 81363
10751H1363j7620o161l282P199O136n401L937J5737j363L396J4451M693j4031
$$ 81363 63743 57582 54300 61499 67635 62234 66171 81908 80545 83941 98392 103085 89054
10738H9054J140J6940O9O568R042J7158J1573l61R547K0405R396Q396J2846J2174
$$ 89054 90194 107134 107203 113771 122813 139971 151544 151183 160730 181135 190531 198927 211773 223947
10724B23947m308m766k156n277J4310L755o759O843J7472j883q406J5778J5493
$$ 223947 219639 214873 212717 207440 221750 225505 218746 225589 243061 241178 232772 248550 264043
10711B64043J389P482K1735L9569L0913K8578L0949K3075K9243K2294K9693L7111
$$ 264043 265432 272914 294649 334218 365131 393709 424658 447733 476976 499270 528963 566074
10699E66074L7182J6325K2563K4286K7644K3779L2609K8859L9652N3227N2448
$$ 566074 603256 619581 642144 666430 694074 717853 750462 779321 818973 872200 924648
10688I24648N8521R2658J09083J18487J31311J25090R8184O7623K3970j7422l8153
$$ 924648 983169 1075827 1184910 1303397 1434708 1559798 1657982 1725605 1749575 1732153 1694000
10677A694000m0566j7937j3446m153O253L1006M0727M8097K7378J5922R791K1134
$$ 1694000 1653434 1635497 1622051 1617898 1624151 1655157 1695884 1743981 1771359 1787281 1797072 1818206
10665A818206M5271Q2260Q4351P9646M2616P49l221l938M865j4467j9698N50J7785
$$ 1818206 1863477 1945737 2030088 2109734 2152350 2153099 2149878 2145940 2150805 2136338 2116640 2117190 2134975
10652B134975J9717L8232P0211J05038J24389J49813J76506J95211K19911K47885
$$ 2134975 2154692 2192924 2263135 2368173 2492562 2642375 2818881 3014092 3234003 3481888
10642C481888K59108K72989K60735J99630J68747J49311J40984J75771K82152
$$ 3481888 3740996 4013985 4274720 4474350 4643097 4792408 4933392 5109163 5391315
10633E391315L76811M11701M34419N04100O17058P27852P83279P17377N67222
$$ 5391315 5768126 6179827 6614246 7118346 7735404 8463256 9246535 9963912 10531134
10624A0531134M60732L92164L54071L58893L07457K09774J25126N9732M9931J9716
$$ 10531134 10991866 11384030 11738101 12096994 12404451 12614225 12739351 12799083 12849014 12868730
10614A2868730j02378k62933k59574P982L59504P19472J133168J686899K463067
$$ 12868730 12766352 12503419 12243845 12251827 12611331 13330803 14463971 16150870 18613937
10605A8613937L487229M749145N931641O570440O693707O818225P232266P073040
$$ 18613937 22101166 26850311 32781952 39352392 46046099 52864324 60096590 67169630
10597F7169630M888914J112773k058810l176193k236325l63746J348181K338794
$$ 67169630 72058544 73171317 71112507 67936314 65699989 65336243 66684424 69023218
10589F9023218K488677J935461J011485k55023j384938j341316K1017J564782
$$ 69023218 71511895 73447356 74458841 74203818 72818880 71477564 71498581 73063363
10581G3063363K123481J490761Q13514J216882K365029L326506L776139L961849
$$ 73063363 75186844 76677605 77491119 78708001 81073030 84399536 88175675 92137524
10573I2137524L969023L514517K315218P05907k04073K31175J532850K893970
$$ 92137524 96106547 99621064 101936282 102642189 102438116 102669291 104202141 107096111
10565A07096111L934931M588620N311090O394068P235387P789523Q402924Q874548
$$ 107096111 111031042 115619662 120930752 127324820 134560207 142349730 150752654 159627202
10557A59627202Q806140Q737894Q405403N393649k435157j0795060j3004133j0194238
$$ 159627202 168433342 177171236 185576639 190970288 188535131 177740071 164735938 154541700
10549A54541700o660938m465120l424378k592479j609272j090375j499412k308232
$$ 154541700 147880762 143415642 139991264 137398785 135789513 134699138 133199726 130891494
10541A30891494k440895j599553j026749j992031m078552n244162n017181m181313
$$ 130891494 128450599 126851046 125824297 123832266 119753714 114509552 109492371 105311058
10533A05311058l342938k908985k526723j588354k55482O09775K76832q78868
$$ 105311058 101968120 99059135 96532412 94944058 94688576 95298351 95575183 94696315
10525I4696315j375666o13072O21658J385090J325067Q35717L47718j98336m68722
$$ 94696315 93320649 92707577 93329235 94714325 96039392 96875109 97222827 97024491 96555769
10516I6555769k22474N4115N16588J547478J942991q84753o983831j1921915j2506808
$$ 96555769 96333295 96387410 96903998 98451476 100394467 99509714 92525883 80603968 68097160
10507F8097160j0140219p320528n159593l694599k709949k049981j560590j148581
$$ 68097160 57956941 50636413 45476820 41782221 39072272 37022291 35461701 34313120
10499C4313120q37231o26096m60793k70231r8462n2406j88584l35396m42500n69895
$$ 34313120 33475889 32849793 32389000 32118769 32020307 31967901 31779317 31443921 31001421 30431526
10489C0431526o44750o48333p39938r33472j037279r71402r04188r74183j091111
$$ 30431526 29786776 29138443 28398505 27465033 26427754 25456352 24552164 23577981 22486870
10480B2486870j124097j042739q53786p10145o75142o74447o23229n32342m67784
$$ 22486870 21362773 20320034 19466248 18756103 18080961 17406514 16783285 16250943 15783159
10471A5783159m57098n08770n55063n87717n90350n58179m96015m07877l56595
$$ 15783159 15326061 14817291 14262228 13674511 13084161 12525982 12029967 11622090 11265495
10462A1265495l36840l27690l00466k74457k50528k03668j76964j82793j79781
$$ 11265495 10928655 10600965 10300499 10026042 9775514 9571846 9394882 9212089 9032308
10453I032308j25599j19037j15676j34250j63480j54831j44163j48452j60332
$$ 9032308 8906709 8787672 8671996 8537746 8374266 8219435 8075272 7926820 7766488
10444G766488j55940j64264j66629j31074j02699q7497r7807j19201j18633r4790
$$ 7766488 7610548 7446284 7279655 7148581 7045882 6958385 6860578 6741377 6622744 6527954
10434F527954m3060j117J7074r493m3649o6298j04442j63001k43124k97424k98670
$$ 6527954 6484894 6483777 6500851 6491358 6447709 6381411 6276969 6113968 5870844 5573420 5274750
10423E274750k63705k17618j58303j49549j28428j23757j13929j01600j11178
$$ 5274750 5011045 4793427 4635124 4485575 4357147 4233390 4119461 4017861 3906683
10414C906683r4435p5001o2213n7631o5015q7055j04926j08004j20654j01577
$$ 3906683 3812248 3737247 3675034 3617403 3552388 3465333 3360407 3252403 3131749 3030172
10404C030172q2036o2316o8334m9354l7051n2507n8715o2296n6429n8502m3745
$$ 3030172 2948136 2885820 2817486 2768132 2731081 2678574 2619859 2557563 2501134 2442632 2398887
10393B398887n2889m8015m6983m1749l5757m5033m3442m1741m7535l8696m2015
$$ 2398887 2345998 2297983 2251000 2209251 2173494 2128461 2085019 2043278 1995743 1957047 1915032
10382A915032l9159l6758l4541l8429m2038n7092m7461l9323l3685l4417j4590
$$ 1915032 1875873 1839115 1804574 1766145 1724107 1667015 1619554 1580231 1546546 1512129 1497539
10371A497539j9330m0675k5972j5354j9649k0347k5943l6964k8341k1539k1045
$$ 1497539 1478209 1437534 1411562 1396208 1376559 1356212 1330269 1293305 1264964 1243425 1222380
10360A222380k5511k1147j8535l1313j9006k6081j5357J0946m559j6865l4144
$$ 1222380 1196869 1175722 1157187 1125874 1106868 1080787 1065430 1076376 1071817 1054952 1020808
10349A020808k3280p951j8653l1004j1676N853j0515l694o321n883L02N748M938
$$ 1020808 997528 989577 970924 939920 928244 934097 923582 919888 913567 907684 907986 913734 918672
10336I18672P432K4788K5888J9187R077J8633M186l8648n4309m6642l9472k8548
$$ 918672 926104 950892 976780 995967 1005044 1023677 1027863 989215 934906 888264 848792 820244
10324H20244j2411l2997k7146O349j0870k6167k2036l984l159j1930j0894k4820
$$ 820244 807833 774836 747690 754039 743169 717002 694966 690982 687823 675893 664999 640179
10312F40179n703Q904Q8j2560n272n915M066j1547p324o64o127k0528j7983N029
$$ 640179 634476 643380 643468 630908 625636 619721 623787 612240 604916 604252 598125 577597 559614 564643
10298E64643K266j3134o85r876r21j3838o145M731O170m706j3328k243m464r826
$$ 564643 566909 553775 553090 543214 542293 528455 522310 527041 533211 528505 515177 512934 508470 498644
10284D98644j5214j0576j1323k888J0691k818L356j2112n168j7572n815P907J008
$$ 498644 483430 472854 461531 458643 469334 466516 469872 457760 452592 435020 429205 437112 438120
10271D38120j8596p760K95p457m967k660k518j0985q226j150L329K171O775m276
$$ 438120 419524 411764 412059 404602 399635 396975 394457 383472 375246 374096 377425 379596 386371 382095
10257C82095j2088q879j534L183N140J611O96k797j520o076R269o364j8189p784
$$ 382095 370007 361128 359594 362777 367917 369528 370224 367427 365907 359831 369100 362736 344547 336763
10243C36763j0391n161o497r263N449k109j0476k195o078m012j197k3572j2916
$$ 336763 326372 321211 314714 305451 310900 308791 298315 296120 290042 286030 284833 261261 248345
10230B48345J9891J1645k25k686n987r95q740l531J9609Q778r977r031m611p899
$$ 248345 268236 279881 279656 276970 270983 269988 261248 257717 277326 286104 276127 267096 262485 254586
10216B54586m740J3836Q409J8302N507j7048j6662p582R889R046l64r233j3856
$$ 254586 249846 263682 272091 290393 295900 278852 262190 254608 264497 273543 273179 263946 250090
10203B50090j2526K496l549Q474P753p586k2516j3734J342J0606J576J9014J5155
$$ 250090 237564 240060 236511 244985 252738 245152 222636 208902 210244 220850 222426 241440 256595
10190B56595M520k373J470J6398L216j0436k162k922p330J751J4089Q52j1294
$$ 256595 261115 258742 260212 276610 279826 269390 267228 264306 256976 258727 272816 273668 262374
10177B62374q753j13K305K607K4972K2588K4728L7125L6686K6829L1151L9099
$$ 262374 253621 253508 255813 258420 283392 305980 330708 367833 404519 431348 462499 501598
10165E01598K8582J1295J4629J2316j1918k1373j5771j1086p683j2964r602o778
$$ 501598 530180 541475 556104 568420 556502 535129 519358 508272 500589 487625 478023 471245
10153D71245L182p63J9749J5916J2033K077J3651K6238K5729J5561j516J4265
$$ 471245 474427 473664 493413 509329 521362 523439 537090 563328 589057 604618 603102 617367
10141F17367J9079K7473K8981K0222K6004K2596J624k1882o512q028q78K1551
$$ 617367 636446 663919 692900 713122 739126 761722 763346 741464 734952 726924 726046 747597
10129G47597K7404M7817N3557O1645P4971O8758O6132L8852J8343j5178l7939
$$ 747597 775001 822818 876375 938020 1012991 1081749 1147881 1186733 1205076 1189898 1151959
10118A151959m4451n2020o7950p8112o8835m5845j5590j4264j7904j3930j0488
$$ 1151959 1107508 1055488 987538 909426 840591 794746 779156 764892 746988 733058 722570
10107G22570m893Q459L41N256p08j0201j6677k1120j5691j6863Q020Q789Q678
$$ 722570 717677 726136 726477 731733 731025 720824 704147 683027 667336 650473 658493 667282 675960
10094F75960l358r906P474k062j5824j9909q857j742P334K4633J1195J7783K4869
$$ 675960 672602 662696 670170 668108 652284 632375 623518 621776 629110 653743 664938 682721 707590
10081G07590J2849l157L291j8504l8411m2536m4753m3429k4503k4149l2229k1184
$$ 707590 720439 717282 720573 702069 663658 621122 576369 532940 508437 484288 452059 430875
10069D30875l219o546j9073o836m293j4930r332r467J863L84o217m721r694m532
$$ 430875 427656 421110 402037 395201 390908 375978 366646 357179 359042 359426 353209 348488 338794 334262
10055C34262j2068k0301l496J3528K826o635p400k4247J3257K1343N529j4201
$$ 334262 322194 301893 298397 311925 314751 308116 300716 276469 289726 311069 316598 302397
10043C02397m705P025P143P821Q015j2176j6539o363k934q433R964n934j2848
$$ 302397 297692 304717 311860 319681 327696 315520 298981 292618 289684 281251 291215 285281 272433
10030B72433n430n481o656L627M167J0494R473n637q675j6997j1808J0886J2170
$$ 272433 267003 261522 254866 258493 262660 273154 282627 276990 268315 251318 239510 250396 262566
10017B62566j4156j2975J7324n726k5149l053L849O041Q806j5902O941J4753J0853
$$ 262566 248410 235435 252759 247033 221884 218831 222680 228721 237527 221625 228566 243319 254172
10004B54172L175R405p293j538J0699K3656K3432k4930m2571k9625j363n899q03
$$ 254172 257347 266752 259459 257921 268620 292276 315708 290778 248207 218582 217219 211320 210517
9991B10517L950M13M305j1706j4705L85J0823j0418p248M86p291k0792N447n291
$$ 210517 214467 214880 219185 207479 192774 193159 203982 193564 186316 186802 179511 158719 164166 158875
9977A58875p232Q336n982j0094o939N262M857J4324N516l785j650K189J65M096
$$ 158875 151643 159979 153997 143903 136964 142226 147083 161407 166923 163138 161488 163677 163842 167938
9963A67938K3014R789p156k5399j4170j0646Q832L228j618j6197q078R919N805
$$ 167938 190952 200741 193585 168186 154016 143370 152202 155430 153812 137615 129537 139456 145261
9950A45261R770j187j4460N440J007q730j585L059j6570j6696j3262N002J1480
$$ 145261 155031 153844 139384 144824 145831 137101 135516 138575 122005 105309 92047 97049 108529
9937A08529J2807N01o977K138J5240p217K067J1043J5556J7113K5151J8672L0261
$$ 108529 121336 121837 114860 116998 132238 125021 127088 138131 153687 170800 195951 214623 244884
9924B44884J6929P881K8132K9065K4j0248l647r928k1296k0088k9064l3932k1714
$$ 244884 261813 269694 297826 326891 326915 316667 313020 303092 281796 261708 232644 198712 176998
9911A76998o555Q046j244j0303o423j0803j1913J952L205k880p226P875L392R902
$$ 176998 170443 178489 177245 166942 160519 149716 137803 139755 142960 140080 132854 140729 144121 154023
9897A54023K873L382O494K5551J2092J9222J0513K156R889K0640M2522M5129N0146
$$ 154023 156896 160278 166772 192323 204415 223637 234150 236306 246195 266835 309357 354486 404632
9884D04632K3858J2813K6591L2423J9902Q20J2514J8545J6161K6693K3035J793
$$ 404632 428490 441303 467894 500317 520219 521039 533553 552098 568259 594952 617987 619780
9872F19780j4953j5116j1551j2393n3867p1512n8254k7850j7205j5428q091j8492
$$ 619780 604827 589711 578160 565767 511900 440388 382134 354284 337079 321651 313560 295068
9860B95068n338L676K0397K9214J2079R16J049K099J7099M499M311j289q638j4381
$$ 295068 289730 293406 313803 343017 355096 356012 357061 359160 376259 380758 385069 383780 375142 360761
9846C60761k947J8874L2186M0531K2463M0440N1294L2633K9346K9761K7354L485
$$ 360761 357814 376688 408874 449405 471868 512308 563602 596235 625581 655342 682696 686181
9834F86181j3451j3833n602L849J1075K5312K5427J3826J4948K3040J9752l069
$$ 686181 672730 658897 653295 657144 668219 693531 718958 732784 747732 770772 790524 787455
9822G87455k9074m1609l5256k6173k1523k4826k7099j7515k0999j4037q053O350
$$ 787455 758381 716772 681516 655343 633820 608994 581895 564380 543381 529344 521291 527641
9810E27641j1575q709N825K327k3259k7309l2328k4855j0278N163L488J1537J0378
$$ 527641 516066 507357 513182 515509 492250 464941 432613 407758 397480 402643 406131 417668 428046
9797D28046j566Q50M463K383L253j985j3334L76n12J63j255L674L2313M0988N5416
$$ 428046 426480 427330 431793 434176 437429 435444 422110 422486 421974 422137 420882 424556 456869 497857 553273
9782E53273N7932O1647N6429M0439K2264J3130l760l4424o1266q0804o5749o0625
$$ 553273 611205 672852 729281 769720 791984 805114 801354 766930 705664 624860 559111 498486
9770D98486o3491l3319n654k0172k0757l229J2430P047k4911k3345k5978j3187
$$ 498486 434995 401676 396022 375850 355093 351864 364294 371341 346430 323085 297107 283920
9758B83920J2518R771j0684q542j867k2535k1548p135L006p486j9556j6585k804
$$ 283920 296438 306209 295525 286983 285116 262581 241033 233898 236904 229418 209862 193277 190473
9745A90473j994N701J3403J6094O475K7542K4084K3553K2697L1456L4521K2578
$$ 190473 188479 194180 207583 223677 230152 257694 281778 305331 328028 359484 394005 416583
9733D16583K2724J4399j6908l1835l6683l6216m1925k3105j4591j9519j1102j0435
$$ 416583 439307 453706 436798 404963 368280 332064 290139 267034 252443 232924 221822 211387
9721B11387r832k6124N120M52q58l912K4464J0863l570j9611L054J4677N415J996
$$ 211387 201555 175431 180551 181003 180145 176233 200697 211560 207990 188379 191433 206110 211525 213521
9707B13521P490P438J2169J846j5762j5546R791K202j4264j85n075L376k185j1827
$$ 213521 221011 228449 240618 242464 226702 211156 220947 223149 208885 208700 203625 207001 204816 192989
9693A92989O051L059j922j443q939J0521J7854j655O269M334p086l727l46M673
$$ 192989 199040 202099 200177 198734 189795 200316 218170 216515 222784 227118 220032 216305 215959 220632
9679B20632j186j0322o464P762L584N569J940J0336M513M634K0262J9202J7034
$$ 220632 219446 209124 202660 210422 214006 219575 221515 231851 236364 240998 261260 280462 297496
9666B97496N28j0971j3794q776P290M821j105Q57j0013m333j1199L953p32O500
$$ 297496 298024 287053 273259 264483 271773 276594 275489 276346 266333 262000 250801 254754 254022 260522
9652B60522j5235K902K092j5285j733J052N599J0885R578l169J1555J130j0770
$$ 260522 245287 248189 250281 234996 233263 234315 239914 250799 260377 257208 268763 269893 259123
9639B59123p093j3083k2980j0240J0137J0979q310k387k648R583p021l881M562
$$ 259123 252030 238947 215967 205727 215864 226843 218533 216146 213498 223081 216060 212179 216741
9626B16741j663N439K5590l6Q317K262r673l259K901L205J1160R55N813O80m62
$$ 216741 215078 220517 246107 246071 254388 256650 246977 243718 246619 249824 260984 261939 267752 268432 267970
9611B67970M738m558m320K7923J4831P361j25O970K634P390J5817j4792l8785
$$ 267970 272708 268150 263830 291753 306584 313945 313820 320790 323424 330814 346631 331839 293054
9598B93054j812J4386K965M69n561q826j5911m13K3031J2022n762j151K1999K9830
$$ 293054 291242 305628 308593 309062 303501 294675 278764 278351 301382 313404 307642 306491 328490 358320
9584C58320K9204O167J381J9038j652Q679J521l447j7969l018J270n113n483J3115
$$ 358320 387524 393691 395072 414110 412458 421137 422658 419211 401242 398224 399494 394381 388898 402013
9570D02013K0222J6132K1988J4138K7362L4390K5999J9991L0846M4115L8746L1112
$$ 402013 422235 438367 460355 474493 501855 536245 562244 582235 613081 657196 695942 727054
9558G27054K9396J4243n843j2296P083L2140K5132K5369M0262M3244M5284O4952
$$ 727054 756450 770693 764850 752554 759637 791777 816909 842278 882540 925784 971068 1036020
9546A036020R5364J15919J07223J25054J35283J10323J00576J12107J36318J85387
$$ 1036020 1131384 1247303 1354526 1479580 1614863 1725186 1825762 1937869 2074187 2259574
9536B259574J98886K02051J76994J98352J87601J50343J30274J24880L6149j06314
$$ 2259574 2458460 2660511 2837505 3035857 3223458 3373801 3504075 3628955 3665104 3558790
9526C558790k38843k20584j68360j25372q9446o5215l3219n225J4378L8956O0060
$$ 3558790 3319947 3099363 2931003 2805631 2716185 2650970 2617751 2612526 2626904 2665860 2725920
9515B725920Q5651J37865J90251K71020L99846N20797O22383O61095P20911Q03655
$$ 2725920 2811571 2949436 3139687 3410707 3810553 4331350 4953733 5614828 6335739 7139394
9505G139394Q43066P24329M30051R5262j42785k97285m27661n17794m79373m10453
$$ 7139394 7982460 8706789 9136840 9232102 9089317 8792032 8364371 7846577 7367204 6956751
9495F956751l69075l20732k55208j81549j12330m2645j3125M0480J47971K31214
$$ 6956751 6587676 6266944 6011736 5830187 5717857 5675212 5662087 5702567 5850538 6081752
9485F081752K97378L65235M71457O28323P92345Q77451Q75886Q74661R10763R48504
$$ 6081752 6379130 6744365 7215822 7844145 8636490 9513941 10389827 11264488 12175251 13123755
9475A3123755Q23844M93313j3152m51064n77582n14044k75885L7065L25929O85523
$$ 13123755 13947599 14440912 14427760 13976696 13399114 12885070 12609185 12646250 12972179 13657702
9465A3657702J216101J880750K739850L715098M878993O231853P443845P850878
$$ 13657702 14873803 16754553 19494403 23209501 28088494 34320347 41764192 49615070
9457D9615070P374150O856518O926836O427618L332859j840868n583688n799894
$$ 49615070 56989220 63845738 70772574 77200192 80533051 78692183 73108495 67308601
9449F7308601l923946j992197n79589P13784K227197L534848L860028L381270
$$ 67308601 63384655 61392458 60812869 61526653 63753850 67288698 71148726 74529996
9441G4529996L372343M459938N586096N712765N264263N124360N153536M117624
$$ 74529996 77902339 82362277 87948373 93661138 98925401 104049761 109203297 113320921
9433A13320921J141216k190100l600620l067941k295046k244702k351353j940749
$$ 113320921 114462137 112272037 108671417 105603476 103308430 101063728 98712375 96771626
9425I6771626j058004K21400J837432L637684N105447N927799O816595Q644205
$$ 96771626 95713622 95935022 97772454 101410138 106515585 112443384 119259979 127904184
9417A27904184J1548811J4576720J5396925J3415614J1837353J2435520J1335005
$$ 127904184 139452995 154029715 169426640 182842254 194679607 207115127 218450132
9410B18450132L326758j0392643k0466818k2017366j9143876j5350539j1293780
$$ 218450132 221776890 211384247 190917429 168900063 149756187 134405648 123111868
9403A23111868p328530m030821j713008n78246r19301j908992j884267m97276
$$ 123111868 115783338 111752517 110039509 109461263 108541962 106632970 104748703 104251427
9395A04251427J656104L708202M753814M450298L314561K196468J262804J42442
$$ 104251427 105907531 109615733 114369547 118819845 122134406 124330874 125593678 125736120
9387A25736120j882307m788372p167874q032496p804121o940773n521377l721549
$$ 125736120 123853813 119065441 111897567 103865071 96060950 89120177 83598800 79877251
9379G9877251j999879r73542q42815r40985m74258P96987K097880K588347K315838
$$ 79877251 77877372 76903830 76061015 75120030 74645772 75442759 77540639 80128986 82444824
9370H2444824K021954J887581Q82123k299136o784991r601317r465507p819830
$$ 82444824 84466778 86354359 87236482 84937346 78152355 68551038 59085531 51265701
9362E1265701o042239m588228l510377k738481k133293j605664j186086q34112
$$ 51265701 45223462 40635234 37124857 34386376 32253083 30647419 29461333 28627221
9354B8627221n48192l39399k61490k37783j93754k76591m49414o49268q98910
$$ 28627221 28079029 27739630 27478140 27240357 27046603 26770012 26320598 25671330 24772420
9345B4772420j177309j343623j315790j113862q78241p46158p22720o70007n95710
$$ 24772420 23595111 22251488 20935698 19821836 18943595 18197437 17474717 16804710 16209000
9336A6209000n33441m47302l76757l11631k47466j89639j51346r5035l814Q7500
$$ 16209000 15675559 15228257 14851500 14539869 14292403 14102764 13951418 13856383 13852569 13940069
9326A3940069J57582J81889J19397O4178K5640q267j14632l25749n84566q38604
$$ 13940069 14097651 14279540 14398937 14463115 14488755 14480488 14365856 14040107 13455541 12616937
9316A2616937r33218q77720p26753n66555m53482l67559k90811k43297k25132
$$ 12616937 11683719 10805999 10079246 9512691 9059209 8691650 8400839 8157542 7932410
9307G932410j83507j87153j63939j46343j39166j18148r2949o5232j9926J6740
$$ 7932410 7748903 7561750 7397811 7251468 7112302 6994154 6901205 6835973 6816047 6832787
9297F832787K2828K1017L607l0219l8514m5936j08268k02682k54170k51861k36226
$$ 6832787 6855615 6876632 6880239 6850020 6811506 6765570 6657302 6454620 6200450 5948589 5712363
9286E712363k09420j80942j64025j33428j21691j37091j48624j48363j25196j26711
$$ 5712363 5502943 5322001 5157976 5024548 4902857 4765766 4617142 4468779 4343583 4216872
9276D216872j55142j57135j41853j18821j06200j09821q6609o8834p4176p5875
$$ 4216872 4061730 3904595 3762742 3643921 3537721 3427900 3341291 3272457 3198281 3122406
9266C122406o8207p3802o0884o6279o3950n0685o6860o2941n5873l9733o1649
$$ 3122406 3054199 2980397 2919513 2853234 2789284 2738599 2671739 2608798 2552925 2513192 2451543
9255B451543n8157m2039n4724n2684o7153m1236l9891m5181m2349l2928l3682
$$ 2451543 2393386 2351347 2296623 2243939 2176786 2135550 2095659 2050478 2008129 1975201 1941519
9244A941519m6313l2429r950k2283m0851n4024m3882l3179l5389k5763l0950l4174
$$ 1941519 1895206 1862777 1852827 1830544 1789693 1735669 1691787 1658608 1623219 1597456 1566506 1532332
9232A532332k4788j9888j8768j9228k4286l4745k3271q077k0516l9184k1678j2146
$$ 1532332 1507544 1487656 1468888 1449660 1425374 1390629 1367358 1359281 1338765 1299581 1277903 1265757
9220A265757j5532k7037j5367j6442k2033j8455j0692j8873m974J141p084j9436
$$ 1265757 1250225 1223188 1207821 1191379 1169346 1150891 1140199 1121326 1116352 1117493 1110409 1090973
9208A090973k3592j0767m447j3993k9763j5404j6211r582j8538j0017p836o415
$$ 1090973 1067381 1056614 1052167 1038174 1008411 993007 976796 967214 948676 938659 930823 924408
9196I24408M536K264j3176j5726j6877R404P690j3470j1262j9240k1159r920J4101
$$ 924408 928944 931208 918032 902306 885429 894833 902523 889053 877791 858551 837392 827472 841573
9183H41573M978j7440j5960j5200j2041r628j354k710l468j0051q094j1844k5141
$$ 841573 846551 829111 813151 797951 785910 776282 774928 772218 768750 758699 750605 738761 713620
9170G13620J757K077K630k1897j1627m176J80r226J664o641j1797j0514l935K579
$$ 713620 715377 717454 720084 698187 686560 682384 682564 673338 675002 668361 656564 646050 642115 644694
9156F44694j4390j3086J02K82o528j5267K409j560r62q669j4942J291k660k969
$$ 644694 630304 617218 617320 617602 611074 595807 598216 596656 595694 587025 572083 573374 570714 567745
9142E67745K489O010j0494k3220N572m469n646r023N76q429m10m15k0547j5126
$$ 567745 570234 576244 565750 542530 548102 543633 537987 528964 529540 521111 520701 520286 499739 484613
9128D84613N03M565p765m235k99l222j3801j2761P613J601P827N357k0561r760
$$ 484613 485116 489681 481916 477681 477382 474160 460359 447598 455211 456812 464639 469996 449435 439675
9114D39675J0282J566n282m550p516j0070J1189k762k092k707L465l799o291q253
$$ 439675 449957 451523 446241 441691 434175 424105 435294 432532 430440 427733 431198 427399 421108 412855
9100D12855p146n777j9029O306O629M365J7904K6660K3693R744J5610L2278K5450
$$ 412855 405709 399932 380903 387209 393838 398203 416107 442767 466460 476204 491814 524092 549542
9087E49542J0404K8843J4754J0479k773k030j1051j3026j8681k8517l5838l3929
$$ 549542 559946 588789 603543 614022 611249 609219 598168 585142 566461 537944 502106 468177
9075D68177k5295k2640j2633j4477j2978o736N893J398J3587j130o198j0851L502
$$ 468177 442882 420242 407609 393132 380154 373418 379311 380709 394296 393166 386968 376117 379619
9062C79619o303J3796J8762O305J0274O847J9527K6360Q544O262J4365l459M543
$$ 379619 373316 387112 405874 412179 422453 429300 448827 475187 483731 489993 504358 500899 505442
9049E05442J3350J4803J7001J5809M6080O7465O7745N5324P5298N8624K0125r171
$$ 505442 518792 533595 550596 566405 612485 679950 747695 803019 878317 936941 957066 947895
9037I47895l8651m6893n9355m1733k3020k0533j6596k7065j5688j8456k5396j4358
$$ 947895 909244 862351 802996 761263 738243 717710 701114 674049 658361 639905 614509 600151
9025F00151k479j5942l0575k608K537j1913p553n893J06m294l917j2538J687J8304
$$ 600151 597672 581730 551155 548547 551084 539171 531618 525725 525831 521537 517620 505082 506769 525073
9011E25073N985Q871J3055R266R022l162M474o127o74J5959J2365J6372M4872
$$ 525073 531058 539929 552984 562250 571272 568110 572584 566457 565783 581742 594107 610479 655351
8998F55351M2403L3263L9027L5725N400N704J2286P296j4077Rr251j5318o745
$$ 655351 697754 731017 770044 805769 811169 816873 829159 836455 822378 822387 813136 797818 791073
8985G91073K2203O067J248r54o658m2211l3078l1943l3705l0318m5437l1271k7397
$$ 791073 813276 819343 820591 819637 812979 770768 737690 705747 672042 641724 596287 565016 537619
8972E37619l8022l4364j5694l974L19J6017K1743O581P398o414r185j4024j8313
$$ 537619 499597 465233 449539 445565 445884 461901 483644 490225 497623 491209 482024 468000 449687
8959D49687k0487l0596j7564j1708j9333L548K1715K3927L0278L4987L6516L4847
$$ 449687 429200 398604 381040 369332 349999 353547 375262 399189 429467 464454 500970 535817
8947E35817L7884L6172J4492J2519J7323j175j501K831q343p914r281j3217N862
$$ 535817 573701 609873 624365 636884 654207 653032 651531 654362 646019 638105 628824 615607 621469
8934F21469j1698l0860m7677l9898l3986k9861k4117l0832l5522n326k1536r323
$$ 621469 609771 578911 531234 491336 457350 427489 403372 372540 337018 331692 310156 300833
8922C00833q615k830L241L617k010m394q186j3798q384M234J4896o689q017O690
$$ 300833 292218 289388 292629 296246 294236 289842 281656 267858 259474 263708 278604 271915 263898 270588
8908B70588Q145j891k236P152J6657P061L476m930O794K3390J9562J5514j021
$$ 270588 278733 276842 274606 281758 298415 305476 308952 304022 310816 334206 353768 369282 368261
8895C68261j1548j6793j014L702L96j7620k8114l1341j1762L20j4557k198p050
$$ 368261 356713 339920 338906 342608 343004 325384 297270 265929 254167 254487 239930 237732 230682
8882B30682q357r416p448M52k035N124k504O166O018P681q952k168N893j949l022
$$ 230682 222325 212909 205461 205913 203878 209002 206498 212664 218682 226363 217411 215243 221136 219187 216165
8867B16165j3438j6750m644K066N97K377q111j1681L588J7165J2283k2621q63
$$ 216165 202727 185977 181333 183399 183996 186373 178262 166581 170169 187334 199617 176996 176133
8854A76133R747J868n911p052K530j802l783j030j344j2439M305J3073Q963r734
$$ 176133 185880 187748 181837 174785 177315 175513 171730 170700 169356 156917 161222 174295 183258 173524
8840A73524K89J0410R912N510J1749K3240K6150K6381j1038k1126k8417j1207
$$ 173524 173813 184223 194135 199645 211394 234634 260784 287165 276127 255001 226584 215377
8828B15377j5309q344j0319k237Q719k621L017J7092m013k3474m943K502j607
$$ 215377 200068 191724 181405 179168 187887 185266 188283 205375 201362 177888 172945 175447 173840
8815A73840P49q593j6694j377Q852N58o363O418P017J3284Q953J3335o746k006
$$ 173840 174589 165996 149302 147925 156777 157335 150972 157390 164407 177691 186644 199979 193233 191227
8801A91227j4415l627L976j610j2422o586l797M77J1608p882K705l209k611M968
$$ 191227 176812 173185 177161 175551 163129 156543 152746 153223 164831 156949 159654 156445 153834 158802
8787A58802j7591j5273J2758J0514q374J7520P271R394Q843q799n227P410L605
$$ 158802 141211 125938 138696 149210 140836 158356 165627 175021 183864 175065 169838 177248 180853
8774A80853j2499j3158j525K982J960p64N22j168Q83O681l917q142p430j815j1481
$$ 180853 168354 155196 153671 156653 158613 157849 158371 157203 158086 164767 160850 152708 145278 143463 131982
8759A31982r328p781J918J2419J0711O703l239n038N775j5338p876M655R602L803
$$ 131982 122654 114873 116791 129210 139921 146624 143385 138347 144122 128784 120908 125563 135165 138968
8745A38968R429Q577m021j6283L509J331r286r51J275l612Q343K2421J2o192k7929
$$ 138968 148397 156974 152953 136670 140179 141510 132224 131273 132548 128936 137279 159700 159712 153520 125591
8730A25591m911o27m893L356k979k156N072l12M859O998J1368J6955J069p002
$$ 125591 120680 120053 115160 118516 115537 113381 118453 118141 123000 129998 141366 158321 159390 152388
8716A52388M869r541M305l204o923p493k389k139L211n515j1717O75N965J1549
$$ 152388 157257 147716 152021 148817 141894 134401 132012 129873 133084 127569 115852 116527 122492 134041
8702A34041k847Q692j386K37j638k231K84J7708M831n736j6407P872J714j9750
$$ 134041 131194 139886 138500 138737 137099 134868 135152 152860 157691 151955 135548 143420 145134 125384
8688A25384j008J1446k097j963j2215m217O028J6846K054l009j1602q587J0404
$$ 125384 124376 135822 133725 131762 119547 115330 121358 138204 140258 137249 125647 117060 127464
8675A27464J1171j1159o66p554m267m0J012J460L609n324l82O969J375q60m557
$$ 127464 138635 127476 126810 119256 114989 114949 115961 117421 121030 115706 115324 122293 123668 122808 118251
8660A18251j1410j3850J7778J876K897Q243q08j2214J446L198Q33Q151O117L22
$$ 118251 106841 92991 110769 112645 115542 123785 122977 110763 112209 115407 116240 124391 130508 130830
8646A30830r84m482N264P954l331J910m185L154J288J5349J0130K2713J5987J3860
$$ 130830 129846 125364 130628 138582 135251 137161 132976 136130 137418 152767 162897 185610 201597 215457
8632B15457J6810P520K8779K8731r629l9286k6264k1407j0735q160j0889k780
$$ 215457 232267 239787 268566 297297 287668 248382 222118 200711 189976 181816 170927 168147
8620A68147O794j4016j3997J9350J1673j4125j4169k435J0511K662j1917n860
$$ 168147 174941 160925 146928 166278 177951 163826 149657 147222 157733 160395 148478 142618
8608A42618j468m138j4491j064l728O002J3725K473O401M147j0990k419J4305
$$ 142618 141150 137012 122521 121457 117729 123731 137456 139929 146330 150477 139487 137068 151373
8595A51373j3522j5391N291n806K779J588J577k85J098m478L843j69J999J73k525
$$ 151373 137851 122460 127751 121945 124724 126312 127889 127604 128702 124224 128067 127898 129897 130070 127545
8580A27545j2583j222N899J0417J218O937j385P068J15j3764r313O907N700K963
$$ 127545 114962 113740 119639 130056 131274 138211 136826 143894 144009 130245 120932 127839 133539 136502
8566A36502K504M984j922R630M470L579J6454J1712K01K668r826j462L891M851
$$ 136502 139006 143990 142068 151698 156168 159747 176201 187913 188114 190782 180956 179494 183385 188236
8552A88236q32o006j9336j3738o32J039N733j1432r159m801n587L21J067j3176
$$ 188236 187404 181398 162062 148324 147692 148731 154464 143032 133873 129072 123485 123806 124873 111697
8538A11697p085J4035N533Q285O337K865K039R25j0571j3004L466n047j7833N181
$$ 111697 104612 118647 124180 132465 138802 141667 143706 144631 134060 121056 124522 119475 101642 106823
8524A06823p275N825p64q613N099J1840q442j5186l972P736M208J5406P34k185
$$ 106823 99548 105373 104609 95996 101095 112935 104493 89307 85335 93071 97279 112685 113419 111234
8510A11234m794j002P491J443k06Q957K0012l908j295l699m809K170P019j7422
$$ 111234 106440 105438 112929 114372 114166 123123 143135 139227 137932 134233 129424 131594 138613 121191
8496A21191j5138j0949N93j0808J4506L0737j3866j246N165n566j0598j2703M991
$$ 121191 106053 95104 95697 84889 99395 130132 116266 115020 120185 114619 104021 91318 96309
8483I6309n207p244P70K1700J806j7460j4393J1284j0344j1452l44m030J0320
$$ 96309 91102 83858 84628 106328 108134 90674 76281 87565 77221 65769 65425 61395 71715
8470G1715J2636P207j0357o203r30J919M158O89J0058J6140j0106m291M681J1399
$$ 71715 84351 91558 81201 74998 74068 75987 80145 80834 90892 107032 96926 92635 97316 108715
8456A08715L396O225m856L277K282k1504j0704N242J7238Q757l360j609l890n734
$$ 108715 112111 118336 113480 116757 119039 97535 86831 92073 109311 118068 114708 113099 109209 103475
8442A03475r421Jn650r355O274k090K758l646N253r478m095Q509p81k3232j1195
$$ 103475 94054 94055 88405 79050 85324 83234 85992 82346 87599 78121 74026 82535 81754 58522 47327
8427D7327Q594J9948k237J807k177p100J8780J0307k950j3538k4207N474J3890
$$ 47327 55921 75869 73632 75439 73262 66162 84942 95249 92299 78761 54554 60028 73918
8414G3918M371J5255L212M040n494J328M847j3900M294q278q301N304J0222p147
$$ 73918 78289 93544 96756 100796 95302 96630 101477 87577 91871 83593 75292 80596 90818 83671
8400H3671j2372q393k703J6200l02j5594K124P001J2649N070k854N591j07L604
$$ 83671 71299 62906 60203 76403 76101 60507 62631 69632 82281 87351 84497 90088 89981 93585
8386I3585K077M666j0901M521J1465j3696o505Q071n022l452Q171n3m560O402
$$ 93585 95662 100328 89427 93948 105413 91717 85212 93283 88261 84809 92980 92927 88367 94769
8372I4769J685M654j0135p387j347r36q376l688N23j509R58O343K213M229n906
$$ 94769 96454 101108 90973 83586 82239 81303 72927 69239 69762 68253 69211 75554 77767 81996 76090
8357G6090j311J2335l95j0213j950J187P654M971P5p829K056q605j914J4389j1133
$$ 76090 74779 87114 86719 76506 74556 75743 83397 88368 88443 80614 82670 74065 72151 86540 75407
8342G5407k9514j5814K519O836N061Q889p844k836Q5J3873M838N685k381r40M99
$$ 75407 45893 30079 32598 39434 44495 53384 45540 42704 42789 56662 61500 67185 64804 63864 64363
8327F4363j1239Q23L777K870J6164m240j7164j3362J1464J0549J4801j145J0461
$$ 64363 53124 53947 57724 60594 76758 72518 55354 41992 53456 64005 78806 77661 88122
8314H8122N251k1505j9700j3463N79J2654L2086J502j3593m258m223r423l841
$$ 88122 93373 71868 52168 38705 39284 51938 84024 85526 71933 67675 63452 54029 50188
8301E0188P28J4974N392N99j585m138p129l807P633J4682j220n094Q642k410n881
$$ 50188 50916 65890 71282 71881 70296 66158 59029 55222 62855 77537 76317 71223 79865 77455 71574
8286G1574m768k520N78l825Q670R992k793M645k040O376q630k928m213L190J2298
$$ 71574 66806 64286 64864 61039 69709 79701 76908 81553 79513 85889 77259 74331 70118 73308 85606
8271H5606J0957l474l441o338r445j6211l985q21p68J7116p88j1030k988J1248
$$ 85606 96563 93089 89648 83310 73865 57654 53669 52848 52080 69196 68408 57378 54390 65638
8257F5638K037m379q032O105J6659o394p10r02K230N180j6114j6390m321J977
$$ 65638 67675 63296 55264 61369 78028 71634 70924 70022 72252 77432 61318 44928 40607 42584
8243D2584Q838m371Q030m390N004J187j016k281J257L102J2766J0798R511m647
$$ 42584 51422 47051 55081 50691 55695 56882 55866 53585 54842 57944 70710 81508 91019 86372
8229H6372k171j291j4023j9064r448j550J2284J6820L967p566k488l668J490L163
$$ 86372 84201 82910 68887 49823 40375 38825 51109 67929 71896 64330 61842 58174 59664 62827
8215F2827J195j1150n216K888L951n391j445n275O701K997p44j538J681m378N580
$$ 62827 64022 52872 47656 50544 54495 49104 47659 42384 49085 52082 51338 49800 51481 47103 52683
8200E2683n146O584n429j4487j8385J0789J1712J9549J0783J2078O679j8911k1830
$$ 52683 47537 54121 48692 34205 15820 26609 38321 57870 68653 80731 87410 68499 46669
8187D6669L616N353P044m736P037K809q503R80J0243l205L504J951j1917M384
$$ 46669 50285 55638 62682 57946 64983 67792 59289 60269 70512 67307 70811 72762 60845 65229
8173F5229L031o488q63j0353K938O608q834N022J1554j40j909O524l72j212p313
$$ 65229 68260 61772 60909 50556 53494 60102 51268 56290 67844 67704 65795 72319 71947 70735 63422
8158F3422o7K886o720P959J4036o358o805n366p552P053n607j0187j8317p06J6049
$$ 63422 63355 66241 59521 67480 81516 75158 68353 62987 55435 62488 56881 46694 28377 27671 43720
8143D3720J488k569n177n071Q863N664M319j392k236R86m585N304Q098R028R287
$$ 43720 45208 42639 37462 32391 41254 46918 51237 49845 47609 48595 44010 49314 57412 66440 75727
8128G5727L938N781j748l210m040r991k084j1691N310M535j6184m33P85R763J4047
$$ 75727 79665 85446 83698 80488 76448 66457 64373 52682 57992 62527 46343 45910 46695 56458 70505
8113G0505L565q938j0665N000N935j685L712J4682q425l577j3556j5098k069J3582
$$ 70505 74070 65132 54467 59467 65402 63717 67429 82111 73686 70109 56553 41455 39386 52968
8099E2968J8731J1765Q707j9469j9173j8426j0026J149J01R038J0834O723J4874
$$ 52968 71699 83464 92171 72702 53529 35103 25077 26226 26327 35365 46199 52922 67796
8086F7796k760j0737Q841p639q651k336k414O990o792p361j53j913l492k176O094
$$ 67796 65036 54299 63140 55501 46850 44514 42100 49090 42298 34937 34784 32871 29379 27203 33297
8071C3297l31J4538Q289J2528N1q733j4149P835P406m297j2397j553m313m598
$$ 33297 32966 47504 55793 68321 68372 59639 45490 53325 60731 56434 44037 42484 38171 33573
8057C3573P144R919j868l419N600Q908K562P961m900q036j3286n584Q809l729
$$ 33573 40717 50636 48768 45349 50949 59857 62419 70380 65480 57444 44158 38574 47383 43654
8043D3654J2239N248n887l288j420n079k223Q525J762k3366j3177K61J0965J4905
$$ 43654 55893 61141 55254 51966 50546 45467 43244 51769 53531 30165 16988 17249 28214 43119
8029D3119J6020q498j5207o396J6379N620m319J5040l786r225j415q407R471k121
$$ 43119 59139 50641 35434 29038 45417 51037 46718 61758 57972 48747 47332 38925 48396 46275
8015D6275O411l267Q167m641M36L161q71J167J77Q611J3913Q765m015j2426j1274
$$ 46275 52686 49419 57586 52945 53381 56542 55671 56838 57015 65626 79539 88304 84289 71863 60589
8000F0589O785J4159k87M392j7860q197j0028n327J414P693J3677l619k888L172
$$ 60589 67374 81533 81246 85638 67778 59581 49553 44226 45640 53333 67010 63391 60503 63675
7986F3675R441n310m354j0601j2938r084P286J7395J0944K283J3789j791l138
$$ 63675 73116 67806 63452 52851 39913 30829 38115 55510 66454 68737 82526 80735 77597
7973G7597R975l314j0956Q025J2238L026L018j2958n855M680j8245l03P307J5639
$$ 77597 87572 84258 73302 81327 93565 96591 99609 86651 80796 85476 67231 66928 74235 89874
7959H9874N920j4892k5863M721J6107J5133J6833r40J48r499o390n66M025j3151
$$ 89874 95794 80902 55039 59760 75867 91000 107833 106893 107041 97542 91152 90586 94611 81460
7945H1460j4333M64K1817R495J466l380k7014O560K66j0072J247J438j971o06
$$ 81460 67127 67591 89408 98903 100369 96989 69975 76535 76801 66729 67976 69414 67443 66837
7931F6837J0706J8555k222l767j3588m176J1196J4345J8071k417r305n810j531
$$ 66837 77543 96098 93876 90109 76521 72345 83541 97886 115957 113540 104235 98425 96894
7918I6894n561J8405m455qM159q81j3549k825j4920Q478J5803N348R536q752j3005
$$ 96894 91333 109738 105283 105275 109434 108553 95004 92179 77259 85737 101540 106888 116424 107672 94667
7903I4667j2670q316m119L433L026N182K1727j218n850l941j070J1490K668O33
$$ 94667 81997 73681 69562 72995 76021 81203 102930 101712 95862 91921 90851 102341 105009 105642
7889A05642l060P561k428P042j8412M662Q429j33J952Q875m352j0163n186k623
$$ 105642 102582 110143 107715 114757 96345 101007 109436 109303 111255 120130 115778 105615 100429 97806
7875I7806J0155J5981L341j0230k2409q986l628L473J860L541o44l086j948j965
$$ 97806 107961 123942 127283 117053 94644 85658 82030 85503 87363 90904 90260 87174 85226 83261
7861H3261J012m577n830q532M922O099N356K971r040p301m833m552L871J0226
$$ 83261 84273 79696 73866 65334 70256 76355 81711 84682 75642 68341 63508 58956 62827 73053
7847G3053R452l009j20M632j0436j8230o849k291J960j3J1455M233p466j3097
$$ 73053 82505 79496 79376 84008 73572 55342 48493 46202 48162 48149 59604 63837 56371 43274
7833D3274J807M515l308R796l652j0197m468L962m185J5820R724P62j6758J708
$$ 43274 45081 49596 46288 56084 52432 42235 37767 41729 37544 53364 63088 63850 47092 48800
7819D8800k825l387m896m757p663j024O758J555K474O161K274o892M327Q832q823
$$ 48800 45975 42588 37692 32935 25272 24248 31006 32561 35035 41196 43470 36578 40905 49737 40914
7804D0914k2389M217L382Q40M437j862o050J0248m87k829l240j791k5150n560
$$ 40914 18525 22742 26124 26964 31401 29539 23489 33737 33250 30421 27181 25390 240 -5320
7790e320J4412J9339J6447J222m73j206o241m835P663l175j5580j0423P645J981
$$ -5320 9092 28431 44878 46100 45627 44421 38180 33345 41008 37833 22253 11830 19475 21456
7776B1456J3887J1287p13r347p480o603N811R473o504M759l866M095J357o374
$$ 21456 35343 46630 45917 36570 29090 22487 28298 37771 31267 36026 32160 36255 37612 31238
7762C1238P446K188p30p73m960J938m474p771j5870J2184R107m911k670J4983
$$ 31238 38684 40872 40142 39369 34409 36347 31873 24102 8232 20416 29523 24612 21942 36925
7748C6925J1036j2648N54K749J1556j988k0977q475K724n770o247R81P92J2261
$$ 36925 47961 35313 35867 38616 50172 48184 27207 18732 21456 15686 9439 10420 11212 23473
7734B3473J8700R253j0766j2997P955J0838l407q89j396j0812k320K508m151o720
$$ 23473 42173 51426 40660 27663 35618 46456 43049 42160 40764 29952 27632 30140 25989 19269
7720A9269P513R072M031J904j2540n153J2525K559q249j014j004J9761l271n597
$$ 19269 26782 35854 39885 41789 29249 24096 36621 39180 30931 29917 28913 48674 45403 39806
7706C9806n446R45n381k4o199o93p097j2519N905N931J9774J862j1353L970K145
$$ 39806 34360 35305 29924 29900 23701 23008 15911 3392 9297 15228 35002 36864 25511 29481 31626
7691C1626p122k5504q230O996K0138l748o166J959J2194J6313K0237P117j3453
$$ 31626 24504 -1000 -9230 -2234 17904 14156 7990 9949 22143 38456 58693 65810 52357
7678E2357r833j2331N269r531M27R537R047J71J452Q316m69j9020j4722n338j802
$$ 52357 42524 30193 35462 25931 26358 35895 44942 45113 46565 54881 54412 35392 20670 15332 13530
7663A3530M08O296M973R524l826j1996O59N701n779J648k574o27q535n558M462
$$ 13530 13938 20234 25207 34731 30905 18909 19568 25269 19490 21138 18564 17937 9402 3844 8306
7648H306R254o829r634n079J0983O802P283J1835p289N807K460O2q617J0207k116
$$ 8306 17560 10731 1097 -3982 7001 13803 21086 32921 25632 31439 33899 33961 25344 35551 33435
7633C3435j0716o311J646J555N246o934N459J3196l137k873m671J1919l214j240
$$ 33435 22719 16408 18054 19609 24855 17921 23380 36576 33439 30566 25895 37814 34600 33360
7619C3360J0368J959N732l920o498O46j2077l44o340M006l668n204m724J1441
$$ 33360 43728 45687 51419 47499 41001 41647 29570 29226 22886 26892 23224 18020 13296 24737
7605B4737R756P000M469Q37k998l310j0738n917j623M327j0062J444J1466L31
$$ 24737 34493 41493 45962 46799 43801 40491 29753 23836 22213 26540 16478 17922 29388 29719
7591B9719q932j8505O80J3098J770P194N265j661J533m835j2282O595M783k009
$$ 29719 20787 2282 2962 16060 17830 25024 30289 28628 30161 25326 13044 19639 24422 22413
7577B2413r497q918J409l383J2884Q633R034J198j7180J542O027M33m791j1334
$$ 22413 12916 3998 5407 2024 14908 23541 32575 33773 16593 18135 24162 24595 19804 8470
7563H470k446J838J2003J1917M659n033N215J1384J462l557M636k933q84m299
$$ 8470 6024 7862 19865 31782 36441 31408 36623 48007 49469 45912 50548 47615 46731 42432
7549D2432q034j1397Q126P044J335K114K09j4597M951q52l259J1466J1866N344
$$ 42432 34398 23001 31127 38171 39506 41620 41829 27232 32183 31331 28072 39538 51404 56748
7535E6748j7202m225J553j2088K840n076n572J3714O751l705m754j8814l05K492
$$ 56748 39546 35321 36874 24786 27626 22550 16978 30692 37443 33738 28984 10170 9865 12357
7521A2357N990Q666O227L783j4973j6166j2196L902J2288J0164o440k9937q300
$$ 12357 18347 27013 33240 37023 22050 5884 -6312 -2410 9878 20042 13602 -16335 -24635
7508b4635L721J2800q243K0051L307j1760O859J7368R454Q992j0035l000j1274
$$ -24635 -20914 -8114 -16357 3694 7001 -4759 2100 19468 28922 37914 27879 24879 13605
7495A3605j70Q404k435j8710o712L182m27j1695j584K6737L549J7166J2264m686
$$ 13605 13435 21839 19404 694 -6018 -2836 -3263 -14958 -16542 10195 13744 30910 43174 38488
7481C8488m302p172n768j5766J2330J8319M01j0364j922R811N082j6126j4894
$$ 38488 34186 27014 21246 5480 17810 36129 36530 26166 24244 34055 39137 23011 8117
7468H117P685M437M616q503J808M120l170j1872M642J4144O994J2007K1101p467
$$ 8117 15802 20239 24855 16352 18160 22280 19110 7238 11880 26024 33018 45025 66126 58659
7454E8659o582q775j724j3315r20l83J2024l548P421J3290j725j8893j0125p370
$$ 58659 52077 43302 41578 28263 27343 26960 38984 35436 42857 56147 54422 35529 25404 18034
7440A8034j186j416k642m994o082K428R418j241R548R437J6263r96j4386j1747
$$ 18034 16848 15432 12790 7796 1714 4142 13560 12319 21867 31304 47567 46571 32185 20438
7426B0438o093p341J0697J1561k88j6379J562L445k315N439J2184J824j8013m016
$$ 20438 14345 7004 17701 29262 28974 12595 14157 17602 15287 20726 32910 34734 16721 12705
7412A2705p054M84N37O711q008m682O631O666m104P512p801J177J3077M730L652
$$ 12705 5651 6135 6672 13383 5375 693 7324 13990 9886 17398 9597 10774 23851 28581 32233
7397C2233J4102J1770k6165M092j0238k52o972n370q707K538N205j44P607k232
$$ 32233 46335 58105 31940 36032 25794 25542 18570 13200 4493 7031 12236 12092 19699 17467
7383A7467M253L982m949k643L94l046m980R293M542K292L289p951M861l869o16
$$ 17467 21720 25702 20753 18110 18504 15458 10478 19771 24313 26605 29894 21943 26804 22935 22319
7368B2319q783J629j2717j6536O718O533M827o947o193Q62J0672K0986j0506k063
$$ 22319 13536 15165 2448 -14088 -7370 -837 3990 -2957 -9150 -8288 2384 23370 12864 10801
7354A0801l3m524K219J0578P360k036R741J8025M39k4112N815n055j1709n081
$$ 10801 10768 6244 8463 19041 26401 24365 34106 52131 52570 28458 34273 29218 17509 12428
7340A2428m35J1818N609K339k502o729N216K848r793p43K088j1519m668j3227
$$ 12428 11993 23811 29420 31759 29257 22528 27744 30592 20799 20056 22144 10625 5957 -7270
7326g270k94K236j1868M179J729j490Q988J4038J125n360L395K60r228N069N922
$$ -7270 -7564 -5328 -17196 -13017 -11288 -12778 -3790 10248 11373 6013 9408 9668 440 5509 11431
7311A1431L91N080P974J0598Q87k297j4657r8P311M856j6974n516J0555l913J1470
$$ 11431 11822 16902 24876 35474 36361 34064 19407 19309 26620 31476 14502 8986 19541 15628 27098
7296B7098K151l371K980N207N056j0636p715p015M508R658N833O656n571m398
$$ 27098 29249 25878 28858 34065 39121 28485 20770 13755 18263 27921 33754 40410 34839 30441
7282C0441m122K273m576o943J853R150P038J0928n545j3078o808p387n106L364
$$ 30441 26319 28592 24016 17073 18926 28076 35114 46042 40497 27419 20611 13224 8118 11482
7268A1482M402Q216N783P090j1367r514m161p201j2423J4923P550K121j0535j2262
$$ 11482 15884 24100 29883 36973 25606 16092 11931 4730 -7693 7230 14780 16901 6366 -5896
7254e896P445R931J1292Q959N7q864o787q052P009K004J513j4344K539j98J237
$$ -5896 1549 11480 22772 31731 31788 22924 16137 8085 15094 17098 18611 4267 6806 6608 7845
7239G845O31K998n029o078k035J184j57M934N591K418Q757J1516L966M847n277
$$ 7845 8476 11474 6445 367 -1668 -484 -641 4293 9884 12302 21059 32575 36541 41388 36111
7224C6111L638J1469r177o541N34j583j725j0423j0795j0591n503J0425J3061
$$ 36111 39749 51218 42041 35500 36034 34451 32726 22303 11508 917 -4586 5839 18900
7211A8900j811O81j305J273j2261m536N012L530J988j0010j0274J5277M388N044
$$ 18900 17089 17770 16465 17738 5477 941 5953 9483 11471 1461 -8813 6464 10852 15896
7197A5896m990M07O62m689j654R437j1997M46M740m801L995R108r567N197m249
$$ 15896 10906 11313 11975 7286 5632 15069 3072 3518 8258 3457 7452 16560 6993 12190 7941
7182G941j64J0209o413j676M900J0411K908j6738m352n271l685p372o377J7943
$$ 7941 7777 17986 11573 9897 14797 25208 28116 11378 7026 1755 -1930 -9302 -15679 2264
7168B264K1724l50n782j0371K273Q007k257o228R072J0167Q454M831n935n112
$$ 2264 23988 23638 17856 7485 9758 17765 15508 9280 18352 28519 36973 41804 35869 30757
7154C0757n592m380M177J892L30L871n311j9272k696k590j6780j263J3654R87
$$ 30757 25165 20785 24962 26854 27184 31055 25744 6472 3776 1186 -15594 -16857 -3203 -2216
7140b216j301O259j24l079P800K454p142k431J5020l648j306n507M841J0300j4883
$$ -2216 -3517 2742 2618 -461 7339 9793 2651 220 15240 11592 10286 4779 9620 19920 5037
7125E037j3355Q625M634j580M289q329p64J2786N472J474P802R062n259j2557
$$ 5037 -8318 307 4941 3361 7650 -679 -1443 11343 16815 18289 26091 35153 29894 17337
7111A7337J213K922n304n459m642L666P703p32p728j2153K6665J86m697o320M309
$$ 17337 18550 21472 16168 10709 6067 9733 17436 16704 8976 -3177 23488 23674 18977 12657 16966
7096A6966R030j2828n038p33R851P740k358n673l529m698k313Q718n866p94J0032
$$ 16966 25996 13168 8130 7397 17248 24988 22630 16957 13428 8730 6417 15135 9269 8475 18507
7081A8507J849o621j9552P433M692o65l403P486K361L961j4736p712J0728n83
$$ 18507 20356 13735 -5817 1616 6308 5643 2240 9726 12087 16048 1312 -6400 4328 3745
7067C745N585J2309J2696r445n819j3176m359n600n927J7284J6365J321l213k750
$$ 3745 9330 21639 34335 24890 19071 5895 1536 -4064 -9991 7293 23658 24979 21766 19016
7053A9016j0960k870r05o804P885m13m265M984l947n324n002r061J1693N118L178
$$ 19016 8056 5186 4281 -2523 5362 4949 684 5668 1721 -3603 -8605 -17666 -5973 -855 2323
7038B323L599j331k862N965P699P151n325p646L424N353L960j591m959N941j179
$$ 2323 5922 4591 1729 7694 15393 22544 17219 9573 12997 18350 22310 20719 15760 21701 20522
7023B0522OJ736j2347K406O219J1388L857j5101j7584P68k786k487R97J2783K133
$$ 20522 20528 22264 9917 12323 18542 29930 33787 18686 1102 1870 -916 -3403 -2406 10377 12510
7008A2510k1898r606O114J0007J2404m812j3287L783P608K319o430J655Q804K144
$$ 12510 -9388 -18994 -12880 -2873 9531 4719 -8568 -4785 2823 5142 -1288 367 9171 11315
6994A1315j4079l202J0413k492r610m068o295O222R581p36J993k393J0162J198
$$ 11315 -2764 -5966 4447 1955 -7655 -11723 -18018 -11796 -2215 -2951 -958 -3351 6811 8009
6980H009k0453p447P008N001J3658r89q993q495k827n478J1674J6298o700j070
$$ 8009 -12444 -19891 -12883 -7882 5776 4787 -4206 -12701 -15528 -21006 -9332 6966 266 -804
6966h04N259J078O596J864j4357j5798L790J0051K139R488N511L590k263k957
$$ -804 4455 5533 12129 13993 -364 -16162 -12372 -2321 -182 9306 14817 18407 16144 13187
6952A3187p333o359J7331J532j1156k906P086l866o079o6j703M779J1609L921
$$ 13187 5854 -505 16826 18358 7202 4296 11382 7516 1437 1371 -332 4447 16056 19977
6938A9977m193q545Q85q105r1K793Q946M802J1761l221n476k2568j5963N336R162
$$ 19977 15784 7239 8124 19 -72 2721 11667 16469 28230 25009 19533 -3035 -18998 -13662 -4500
6923d500P24k549l82M885j482L205Q136P244L552j1686l259M940L895j3491k0695
$$ -4500 -3776 -6325 -6707 -1822 -3304 -99 8037 15281 18833 7147 3888 8828 12723 -768 -21463
6908b1463M910K5098R612p782p766l715K609P58o705p71M441R026Q685J3920M719
$$ -21463 -16553 8545 18157 10375 2609 -1106 1503 2261 -4444 -5215 -774 8252 16937 30857 35576
6893C5576k1580j1977k755p468N091n451n334K848K736P300J0171P624m67K624
$$ 35576 13996 2019 -736 -8204 -3113 -8564 -13898 -11050 -8314 -1014 9157 16781 16314 18938
6879A8938L893o34l230j5787k233J0404N927O4j384j2416K641J1885L300k183
$$ 18938 22831 22197 18967 3180 947 11351 17278 17342 15958 3542 6183 18068 21368 19185
6865A9185j3087k803k890J2936K914l153m596o93K808l236j4183k662J1817M578
$$ 19185 6098 3295 405 13341 16255 13102 8506 7813 10621 7385 -6798 -9460 2357 6935
6851F935Q567k701j3951o118J4567R400l012J679K275j47r026j6050K825N164
$$ 6935 15502 12801 -1150 -7268 7299 16699 13687 15366 17641 17494 8468 -7582 -4757 407
6837D07L212J3735J153m770q291j464k842j2905J743j167O598J5264m056N811
$$ 407 3619 17354 18507 13737 5446 3982 1140 -11765 -10022 -11189 -4591 10673 6617 12428
6823A2428j132M576j82o323m381k766O69o40J0513n100j982j3859l042O485o187
$$ 12428 11296 15872 15690 9367 4986 2220 2889 2249 12762 7662 5680 -8179 -11221 -4736 -10923
6808a0923Q082L690j1555J1988R735M944J978M83M936J2659o038p152o960j2077
$$ -10923 -2841 849 -10706 1282 11017 15961 17939 18422 23358 36017 29979 22827 15867 3790
6794C790k0946o817m048q109J2877K2585n278o278k011l639J4867N84r88r562
$$ 3790 -17156 -23973 -28021 -36130 -23253 -668 -5946 -12224 -14235 -17874 -3007 -2423 -3411 -12973
6780a2973k686J0267q908M506J5857J4636j175l632j2012k239j5334M958Q497
$$ -12973 -15659 -5392 -14300 -9794 6063 20699 19524 15892 3880 1641 -13693 -8735 -238
6767b38Q452J6698n058n957j720M646m007n166k763m973L867n411L912Q908m727
$$ -238 8214 24912 19854 13897 12177 16823 12816 7650 4887 -86 3781 -1630 2282 11190 6463
6752F463P258J4426n06j5334M08N326L409O759o914P471l793p585l244r376N136
$$ 6463 13721 28147 27641 12307 12715 18041 21450 28209 21295 28766 24973 17388 14144 4768 9904
6737I904J0267M97k475m61J6075Q615k961n980p731n856m09J2423J1321j1732
$$ 9904 20171 20668 18193 17732 33807 42422 39461 33481 25750 19894 19485 31908 43229 31497
6723C1497k0652n809J309N972R665L572r850p746O215N419j6930M791L88k976
$$ 31497 10845 5036 6345 12317 21982 25554 15704 7958 14173 19592 2662 7453 7841 4865
6709D865j0709J1762m686L995Q298Q005J2628r030j0729M334k517j515L606q32
$$ 4865 -5844 5918 1232 5227 13525 21530 34158 25128 14399 18733 16216 14701 18307 17475
6695A7475p017n22N888R253m734r359k198j7186j0029P952n92O964K022J2099
$$ 17475 10458 9936 15824 25077 20343 10984 8786 -8400 -18429 -10477 -11069 -4105 -2083 10016
6681A0016Q936j8850L968l426j5097M011P260Q502O515l655L708M138o476j5617
$$ 10016 18952 102 4070 644 -14453 -10442 -3182 5320 11835 8180 11888 16026 9550 -6067
6667f067P315L293J3372l000o989j0637p877J405J7708P234J163k010o430o970
$$ -6067 1248 4541 17913 14913 7924 -2713 -10590 -9185 8523 15757 16920 14910 8480 1510
6653A510J2033M463Q106q934q37J319j0618Q831R751P301n019j1964r675N484
$$ 1510 13543 18006 26112 17178 16341 17660 7042 15873 25624 32925 27906 15942 6267 11751
6639A1751n442m508M710m069K766L797q096K911J1267Q823r167j2083j1268N683
$$ 11751 6309 1801 6511 2442 5208 9005 909 3820 15087 23910 14743 2660 -8608 -2925
6625b925M928j1447j5799M377O456K4749J6786K049j1244o689N090N290J045j0232
$$ -2925 2003 -9444 -25243 -20866 -14410 10339 27125 29174 17930 11241 16331 21621 22666 12434
6611A2434L896M133N564j2866j062k0759M143J3785l844j0474N547l860j972J0979
$$ 12434 16330 20463 26027 13161 12099 -8660 -4517 9268 5424 -5050 497 -3363 -5335 5644
6597E644J8138K85j3545q137P679K193M031J4246q806j0657j1539Q55J682Q963
$$ 5644 23782 24067 10522 2385 10064 12257 16288 30534 21728 11071 -468 387 2069 11032
6583A1032N096M315K435r621Q374O917m209j7j6314m687L015N509m617k595r6
$$ 11032 16128 20443 22878 13257 21631 28548 24339 24322 8008 3321 6336 11845 7228 4633 4537
6568D537k364N832j345N492J3912L264j4832R439j5386o732n260J939r205q034
$$ 4537 2173 8005 6660 12152 26064 29328 14496 23935 8549 1817 -3443 -1504 -10709 -18743
6554a8743K873J2741J7923J328L477Q371p479k503M488j268o900O557J4655j433
$$ -18743 -15870 -3129 14794 16122 19599 27970 20491 17988 22476 21208 14308 20865 35520 34087
$$ [...]
##END NTUPLES=NMR SPECTRUM
##END=
