##TITLE=Analysis number 318190
Compound Code mo 07780
Project Code adrs
Chemist Name fudan
##JCAMPDX= 6.0         $$ Bruker NMR JCAMP-DX V2.0
##DATA TYPE= NMR SPECTRUM
##DATA CLASS= NTUPLES
##ORIGIN= Bruker BioSpin GmbH
##OWNER= nmr
$$ XWIN-NMR		Version 3.5
$$ Mon Mar 20 09:20:29 2006 GMT Standard Time (UT+0h)  MAYBRIDGE\nmr@NMR_250MHZ
##.OBSERVE FREQUENCY= 250.131544655141
##.OBSERVE NUCLEUS= ^1H
##.ACQUISITION MODE= SIMULTANEOUS (DQD)
##.ACQUISITION SCHEME= undefined
##.AVERAGES= 16
##.DIGITISER RES= 18
##SPECTROMETER/DATA SYSTEM= dpx250
##.PULSE SEQUENCE= zg30
##.SOLVENT NAME= DMSO
##.SHIFT REFERENCE= (INTERNAL, DMSO, 0, 16.522)
##AUDIT TRAIL= $$ (NUMBER, WHEN, WHO, WHERE, WHAT)
$$ ##TITLE= Audit trail, XWIN-NMR		Version 3.5
$$ ##JCAMPDX= 5.01
$$ ##ORIGIN= Bruker BioSpin GmbH
$$ ##OWNER= nmr
$$ C:\u/data/dgb/nmr/ADRS/990/pdata/1/auditp.txt
$$ ##AUDIT TRAIL=  $$ (NUMBER, WHEN, WHO, WHERE, WHAT)
(   1,<2006-03-20 09:20:05.12 +000>,<MAYBRIDGE\nmr>,<NMR_250MHZ>,
      <created by zg, POWCHK disabled, PULCHK disabled
       configuration hash MD5:
       84 BC 41 DB A1 6E 1D 46 DA 25 12 A5 C1 ED C5 3A
       data hash MD5: 64K
       02 89 50 E7 88 1F 59 0F 55 9C 57 1B F4 2F 76 9F>)
(   2,<2006-03-20 09:20:18.93 +000>,<MAYBRIDGE\nmr>,<NMR_250MHZ>,
      <Start of raw data processing
       ef LB = 0.3 FT_mod = 6 PKNL = 1 SI = 32K 
       data hash MD5: 32K
       DC 54 9E FA 34 84 B8 2C 54 CA DE 66 D2 C9 43 40>)
(   3,<2006-03-20 09:20:20.57 +000>,<MAYBRIDGE\nmr>,<NMR_250MHZ>,
      <apk 
       data hash MD5: 32K
       3C 31 7B AC E9 43 8F ED 1F 76 97 FA 44 35 8F BC>)
(   4,<2006-03-20 09:20:21.40 +000>,<MAYBRIDGE\nmr>,<NMR_250MHZ>,
      <abs ABSG = 5 
       data hash MD5: 32K
       BC BE BE D3 B1 22 C3 70 58 92 18 24 AB 3F CA AF>)
$$ ##END=
$$ 
$$ hash MD5
$$ 2A A0 3B 48 23 11 EB 8B 1C AC 3D 45 06 19 35 D3
##$RELAX= 
##$RELAX= 
##$RELAX= 
##$RELAX= 
##$RELAX= 
##$RELAX= 
##$RELAX= 
$$ Bruker specific parameters
$$ --------------------------
##$DU= <C:\u>
##$EXPNO= 990
##$NAME= <ADRS>
##$PROCNO= 1
##$TYPE= <nmr>
##$USER= <dgb>
##$AMP= (0..31)
100 100 100 100 100 100 100 100 100 100 100 100 100 100 100 100 100 100 
100 100 100 100 100 100 100 100 100 100 100 100 100 100 
##$AQSEQ= 0
##$AQ_mod= 3
##$AUNM= <au_zg>
##$AUTOPOS= <7 >
##$BF1= 250.13
##$BF2= 250.13
##$BF3= 250.13
##$BF4= 250.13
##$BF5= 500.13
##$BF6= 500.13
##$BF7= 500.13
##$BF8= 500.13
##$BYTORDA= 1
##$CFDGTYP= 0
##$CFRGTYP= 5
##$CHEMSTR= <none>
##$CNST= (0..31)
1 1 145 1 1 1 1 1 1 1 1 1 1 1 1 1 1 1 1 1 1 1 1 1 1 1 1 1 1 1 1 1 
##$CPDPRG= <>
##$CPDPRG1= <>
##$CPDPRG2= <>
##$CPDPRG3= <>
##$CPDPRG4= <mlev>
##$CPDPRG5= <mlev>
##$CPDPRG6= <mlev>
##$CPDPRG7= <mlev>
##$CPDPRG8= <mlev>
##$CPDPRGB= <>
##$CPDPRGT= <>
##$D= (0..31)
0 1 0 0 0 0 0 0 0 0.06 0 0 0 0 0 0 0.0002 0 0 0 0 0 0 0 0 0 0 0 0 0 0 
0 
##$DATE= 1142846401
##$DBL= (0..7)
120 120 120 120 120 120 120 120 
##$DBP= (0..7)
150 150 150 150 150 150 150 150 
##$DBP07= 0
##$DBPNAM0= <>
##$DBPNAM1= <>
##$DBPNAM2= <>
##$DBPNAM3= <>
$$ [...]
##$SUBNAM7= <"">
##$SUBNAM8= <"">
##$SUBNAM9= <"">
##$SW= 20.6930455092707
##$SWIBOX= (0..15)
0 0 3 0 0 0 0 0 0 0 0 0 0 0 0 0 
##$SW_h= 5175.983436853
##$TD= 65536
##$TD0= 1
##$TE= 294.16
##$TE2= 300
##$TE3= 300
##$TEG= 300
##$TL= (0..7)
0 120 120 120 120 120 120 120 
##$TP= (0..7)
150 150 150 150 150 150 150 150 
##$TP07= 0
##$TPNAME0= <>
##$TPNAME1= <>
##$TPNAME2= <>
##$TPNAME3= <>
##$TPNAME4= <>
##$TPNAME5= <>
##$TPNAME6= <>
##$TPNAME7= <>
##$TPOAL= (0..7)
0.5 0.5 0.5 0.5 0.5 0.5 0.5 0.5 
##$TPOFFS= (0..7)
0 0 0 0 0 0 0 0 
##$TUNHIN= 0
##$TUNHOUT= 0
##$TUNXOUT= 0
##$USERA1= <user>
##$USERA2= <user>
##$USERA3= <user>
##$USERA4= <user>
##$USERA5= <user>
##$V9= 5
##$VALIST= <valist>
##$VCLIST= <CCCCCCCCCCCCCCC>
##$VD= 0
##$VDLIST= <DDDDDDDDDDDDDDD>
##$VPLIST= <PPPPPPPPPPPPPPP>
##$VTLIST= <TTTTTTTTTTTTTTT>
##$WBST= 1024
##$WBSW= 4
##$XGAIN= (0..3)
0 0 0 0 
##$XL= 0
##$YL= 0
##$YMAX_a= 313624
##$YMIN_a= -558839
##$ZGOPTNS= <>
##$ZL1= 120
##$ZL2= 120
##$ZL3= 120
##$ZL4= 120
##$ABSF1= 16.522
##$ABSF2= -4.171173
##$ABSG= 5
##$ABSL= 3
##$ALPHA= 0
##$AQORDER= 0
##$ASSFAC= 0
##$ASSFACI= 0
##$ASSFACX= 0
##$ASSWID= 0
##$AUNMP= <proc_1d>
##$AZFE= 0.1
##$AZFW= 0.1
##$BCFW= 0
##$BC_mod= 0
##$BYTORDP= 0
##$COROFFS= 0
##$CY= 12.5
##$DATMOD= 1
##$DC= 0
##$DFILT= <>
##$DTYPP= 0
##$F1P= 14.0000005364418
##$F2P= -0.99999901652339
##$FCOR= 0.5
##$FTSIZE= 32768
##$FT_mod= 6
##$GAMMA= 0
##$GB= 0
##$INTBC= 1
##$INTSCL= 1
##$ISEN= 128
##$LB= 0.3
##$LEV0= 0
##$LPBIN= 0
##$MAXI= 10000
##$MC2= 0
##$MEAN= 0
##$ME_mod= 0
##$MI= 0
##$NCOEF= 0
##$NC_proc= -5
##$NLEV= 6
##$NOISF1= 0
##$NOISF2= 0
##$NSP= 0
##$NTH_PI= 0
##$NZP= 0
##$OFFSET= 16.522
##$PC= 1
##$PHC0= 162.8892
##$PHC1= 8.497725
##$PH_mod= 1
##$PKNL= yes
##$PPARMOD= 0
##$PSCAL= 4
##$PSIGN= 0
##$REVERSE= no
##$SF= 250.13
##$SI= 32768
##$SIGF1= 0
##$SIGF2= 0
##$SINO= 400
##$SIOLD= 32768
##$SREGLST= <1H.DMSO>
##$SSB= 0
##$STSI= 32768
##$STSR= 0
##$SW_p= 5175.98343685301
##$SYMM= 0
##$S_DEV= 0
##$TDeff= 65536
##$TDoff= 0
##$TI= <Analysis number 999999
Compound Code 99
Book Reference 9
Project Code 9>
##$TILT= no
##$TM1= 0
##$TM2= 0
##$TOPLEV= 0
##$USERP1= <user>
##$USERP2= <user>
##$USERP3= <user>
##$USERP4= <user>
##$USERP5= <user>
##$WDW= 1
##$XDIM= 32768
##$YMAX_p= 360182616
##$YMIN_p= -499145
$$ End of Bruker specific parameters
$$ ---------------------------------
##NTUPLES= NMR SPECTRUM
##VAR_NAME=  FREQUENCY,     SPECTRUM/REAL,   SPECTRUM/IMAG
##SYMBOL=    X,             R,               I
##VAR_TYPE=  INDEPENDENT,   DEPENDENT,       DEPENDENT
##VAR_FORM=  AFFN,          ASDF,            ASDF
##VAR_DIM=   32768,         32768,           32768
##UNITS=     HZ,            ARBITRARY UNITS, ARBITRARY UNITS
##FACTOR=    0.157963299565203, 1,           1
##FIRST=     4132.6476996994, 0,             0
##LAST=      -1043.33573715361, 0,           0
##MIN=       -1043.33573715361, -499145,     0
##MAX=       4132.6476996994, 360182616,     0
$$ Real data points
##PAGE= N=1
##DATA TABLE= (X++(R..R)), XYDATA
$$ [...]
13779A4760140J62935J77254J81167J40724J03484J92281J98611J63842J01344
13770A6181782J18320K30968J61084K18086J98386P2582J37754J17493j5493P8762
13760A7499724K20973J84480J26951J84823J34922P5201O3402J18911J05794P8070
13750A8793251M876J46803R8948J376Q7925K5387J66284P3951L5256J64445P6829
13739A9675331k7487m198l2979r4517j95j9024o2792J1737r2326j40578j55419
13728A9057553k2802r7705o8195j09788n8851j39111n5219j46384j00033n6578
13718A8202887j01302m8949o9591k40126j06748k06007k09801k01250j40712k28452
13708A6649949j93443q9176n3930j42236k69232j59190q4098j66369r9364j26432
$$ y = [14760140, 14923075, 15100329, 15281496, 15422220, 15525704, 15717985, 15916596, 16080438, 16181782, 16300102, 16531070, 16692154, 16910240, 17108626, 17181208, 17318962, 17436455, 17420962, 17499724, 17720697, 17905177, 18032128, 18216951, 18351873, 18427074, 18490476, 18609387, 18715181, 18793251, 18798127, 18944930, 19043878, 19045254, 19133179, 19158566, 19324850, 19398801, 19434057, 19598502, 19675331, 19647844, 19643646, 19610667, 19516150, 19515955, 19496931, 19434139, 19445876, 19353550, 19212972, 19057553, 19034751, 18937046, 18868851, 18759063, 18700212, 18561101, 18505882, 18359498, 18259465, 18202887, 18101585, 18052636, 17983045, 17742919, 17636171, 17430164, 17220363, 17019113, 16878401, 16649949, 16456506, 16367330, 16313400, 16171164, 15901932, 15742742, 15658644, 15492275, 15392911, 15266479]
13698A5266479j36845k31340k10595j97410j91111j84951k13229j32329o3217
13689A3705452j22406r6468j91945j94715j01063j87698p1250j91068j84007r2178
13679A2272654K0390r7023j40398j1295q7242j58857n2094q0460k8188j12618
13669A1524869n1636p2188J7009J56974j59768k32813j75878q6357m5654l3587
13659A0840971p8389j56381j75581J0575N4097M7213q0653k00849J4809K123o2978
13648A0214957j3561j24685j65321j07285q3127n8246j03904j03475K8275Q1093
13638I564721K6584K8001M2090j06604j26630j04918j20062o1285j21217R5063
13628I115743P2997p6643j38122l1843M4299r0618j3697q1759l0798M0314L318
$$ y = [15266479, 15129634, 14898294, 14687699, 14490289, 14299178, 14114227, 13900998, 13768669, 13705452, 13583046, 13486578, 13294633, 13099918, 12998855, 12811157, 12739907, 12548839, 12364832, 12272654, 12293044, 12196021, 12055623, 12044328, 11957086, 11798229, 11746135, 11665675, 11637487, 11524869, 11473233, 11401045, 11418054, 11575028, 11415260, 11182447, 11006569, 10920212, 10874558, 10840971, 10762582, 10606201, 10430620, 10441195, 10495292, 10542505, 10461852, 10261003, 10275812, 10277935, 10214957, 10201396, 10076711, 9911390, 9804105, 9720978, 9662732, 9558828, 9455353, 9483628, 9564721, 9591305, 9619306, 9661396, 9554792, 9428162, 9323244, 9203182, 9141897, 9020680, 9115743, 9188740, 9112097, 8973975, 8942132, 8986431, 8895813, 8882116, 8800357, 8769559, 8809873, 8813191]
13617H813191k41360j74396K8007J16471N5419K9583k8490j6720m994j7164m4287
13606H515260n3335k2877l5660o7438O9764p204j65674j48354l0350K0062P8820
13595H153014L3167p6059j28593l122M1873j28516o81R3750j34104j49336L1854
13584G733247N7069K7815q2399m3142m192K927p3260o6767M7573l6601k6952K0324
13572G555642o903k7675l9875j03207o9396P1294k6905j35298K5557r4619j05875
13561G042740J4914R6417O1851o1331r1023j09292o2977R7254n3517k5100l6234
13550F873702K2895n2577p1780o8259p6245Q148J1719j33743n9814P6240j06551
13539F423735j42796r4167N7096J8365R9630o1047j7540p6198j30682j71250j4950
$$ y = [8813191, 8571831, 8397435, 8425442, 8541913, 8597332, 8626915, 8598425, 8581705, 8576711, 8559547, 8515260, 8461925, 8439048, 8403388, 8335950, 8405714, 8398510, 8232836, 8084482, 8054132, 8074194, 8153014, 8186181, 8110122, 7981529, 7978407, 8020280, 7891764, 7891083, 7984833, 7850729, 7701393, 7733247, 7790316, 7818131, 7735732, 7692590, 7688398, 7691325, 7618065, 7551298, 7598871, 7562270, 7535318, 7555642, 7548739, 7521064, 7481189, 7377982, 7308586, 7379880, 7352975, 7217677, 7243234, 7148615, 7042740, 7057654, 7154071, 7215922, 7154591, 7063568, 6954276, 6891299, 6988553, 6935036, 6909936, 6873702, 6896597, 6844020, 6772240, 6703981, 6627736, 6635884, 6647603, 6513860, 6454046, 6530286, 6423735, 6280939, 6186772, 6243868, 6262233, 6361863, 6300816, 6283276, 6207078, 6076396, 5905146, 5890196]
13528E890196J76949P0873n7044r0714K7345K5183J15496O9485j63825o3368K7902
13517F028478R4203J23441l6700P4469L8455k1117K3186L1450j31982k5483L4636
13506F233036R6406j52673k00522n9423R280J0209m9765k8071N8834O279J05386
13495F028976M6566P762L1403L1982O9585J540q0931K7865k0792P6428K8954K160
13483F251498P0870j9914l3732M4231p394N3207M6762q8707m3429M4466p6693
13472F241165k5813L6534O0941N7051M0379J4862J72573J30890L7234q1510j713
13461F682593J7776J22953R9025J11367O467P1973J51500K9573L8430K1010M3318
13450G395985J80539P9104J38135L29050K69712N1288l1134J89406R0391K9212
$$ y = [5890196, 6067145, 6138018, 6080974, 5990260, 6017605, 6042788, 6158284, 6227769, 6063944, 6000576, 6028478, 6122681, 6246122, 6209422, 6283891, 6322346, 6301229, 6324415, 6355865, 6223883, 6198400, 6233036, 6329442, 6176769, 5976247, 5916824, 5926104, 5936313, 5886548, 5858477, 5917311, 5923590, 6028976, 6075542, 6083304, 6114707, 6146689, 6216274, 6217814, 6136883, 6164748, 6143956, 6220384, 6249338, 6251498, 6322368, 6302454, 6268722, 6312953, 6305559, 6358766, 6405528, 6316821, 6273392, 6317858, 6241165, 6215352, 6251886, 6312827, 6369878, 6410257, 6425119, 6597692, 6728582, 6765816, 6684306, 6682593, 6700369, 6823322, 6922347, 7033714, 7040181, 7112154, 7263654, 7293227, 7331657, 7352667, 7395985, 7576524, 7655628, 7793763, 8122813, 8392525, 8443813, 8412679, 8602085, 8692476, 8721688]
13440H721688J07005J20340J82947J18593Q8515K50143K75867J12296N9825K08781
13430A0246000K71522J78588Q4665J68504J53469J73413J98991K35617K71503
13421A1982272L21834J63374K72987M10455L26485L68223L36813L77935M55842
13412A5016220M85746M65331N73263M81471N25932O54358P69332P33599P64242
13403B0469494O90464O70779P92901R09997R11803J020322J115272J205097J056939
13394B8843068J106687J232999J477000J536787J671663J609326J723990J918407
13386D1119927K187373K172575K311265K318695K420838K540380K765830K843471
13378F0680354K992065L047798L298085L346327L386466L483369L802604L920615
$$ y = [8721688, 8828693, 8949033, 9131980, 9250573, 9339088, 9589231, 9865098, 9977394, 10037219, 10246000, 10517522, 10696110, 10780775, 10949279, 11102748, 11276161, 11475152, 11710769, 11982272, 12304106, 12467480, 12740467, 13150922, 13477407, 13845630, 14182443, 14560378, 15016220, 15501966, 15967297, 16540560, 17022031, 17547963, 18202321, 18971653, 19705252, 20469494, 21159958, 21830737, 22623638, 23533635, 24445438, 25465760, 26581032, 27786129, 28843068, 29949755, 31182754, 32659754, 34196541, 35868204, 37477530, 39201520, 41119927, 43307300, 45479875, 47791140, 50109835, 52530673, 55071053, 57836883, 60680354, 63672419, 66720217, 70018302, 73364629, 76751095, 80234464, 84037068, 87957683]
13370H7957683L856858L949034L962605L894210L868850L611333L521031L473881
13362A18095485L163376K757520K366737J941073J468261R39599K44919j87124
13354A30789846q78304j498338k102222k527304l263646l603618l981599m323058
13346A08611757m278715m357066m508746m640883m461402m283678m254084l983349
13338G3843834l745953l605804l383273l162900k939340k730214k577111k391645
13330D9307594k258321k185510k058252j947852j652953j681970j808376j491368
13322C4222992j490193j456556j240577j149959j332560j146462r92925j000638
13314B4413122q83993r72438q32401p99967p52497p08504o41881p68433o55578
$$ y = [87957683, 91814541, 95763575, 99726180, 103620390, 107489240, 111100573, 114621604, 118095485, 121258861, 124016381, 126383118, 128324191, 129792452, 130732051, 130976970, 130789846, 129911542, 128413204, 126310982, 123783678, 120520032, 116916414, 112934815, 108611757, 104333042, 99975976, 95467230, 90826347, 86364945, 82081267, 77827183, 73843834, 70097881, 66492077, 63108804, 59945904, 57006564, 54276350, 51699239, 49307594, 47049273, 44863763, 42805511, 40857659, 39204706, 37522736, 35714360, 34222992, 32732799, 31276243, 30035666, 28885707, 27553147, 26406685, 25413760, 24413122, 23529129, 22556691, 21724290, 20924323, 20171826, 19463322, 18821441, 18053008, 17397430]
13305A7397430o00004n22392o60115n88109l74257n09094l65069m82179o45557
13296A2650654l16930k26669m00703l58536l34106m28868l72910m37618l47141
13287I427173l47764l18303q5930j69383j44243k88315l65084l02470k21096j92572
13277F992013k01193q4876k25644k33853o5935j17875j08090m8172j58854k03675
13267E543846j01631j21217j95864j67219j44958j11884r401j09123j44006j9088
13257D419455m1199j36270j20501r2757j05768o6618n910j11059j34345m7728
13247C557300q256o9648k4856K6780N4920K0173j57751m871j38603k54490m7716
13236B952982J04749n3613j12524k6827p3431k4684j4772j9530j22049n5102o7448
$$ y = [17397430, 16797426, 16275034, 15614919, 15026810, 14652553, 14143459, 13778390, 13296211, 12650654, 12333724, 12107055, 11706352, 11347816, 11013710, 10584842, 10211932, 9774314, 9427173, 9079409, 8761106, 8675176, 8505793, 8361550, 8073235, 7708151, 7405681, 7184585, 6992013, 6790820, 6705944, 6480300, 6246447, 6180512, 6062637, 5954547, 5906375, 5747521, 5543846, 5442215, 5320998, 5125134, 4957915, 4812957, 4701073, 4691672, 4582549, 4438543, 4419455, 4378256, 4241986, 4121485, 4028728, 3922960, 3856342, 3850432, 3739373, 3605028, 3557300, 3549044, 3479396, 3454540, 3481320, 3536240, 3556413, 3398662, 3393791, 3255188, 3000698, 2952982, 3057731, 3004118, 2891594, 2864767, 2791336, 2766652, 2751880, 2732350, 2610301, 2555199, 2487751]
13225B487751p0030J5312p5306j3371n921r3123K3252J6074j72637k5853M4034
13214B130182n5921p5199l9485K0531j5023M9630k4890m7281N8706N4077p994
13203B047333j5104j87951j02211n4863k4449M0671Q1070q5103j8353l1055L2918
13192A682903j33483k06313M0034r6153k021R8686N0910M8467Q120p6732R5863
13181A510281J2446j04438k03258Q688O3566L8168L1654J0142N5962q574j84958
13170A229679k0177P729k6616l1560K7518J48649m2024q2090j01206o3018k5648
13159A021236j3201k6524p2562J3890J36929P3987j9162j93232q1307J04N4545
13148H94703K4224R4225N9341q0907j7780O5756K4705j24345j26194o3326L6608
$$ y = [2487751, 2417721, 2433033, 2357727, 2344356, 2338435, 2245312, 2268564, 2284638, 2112001, 2086148, 2130182, 2074261, 1999062, 1959577, 1980108, 1965085, 2014715, 1989825, 1942544, 2001250, 2055327, 2047333, 2032229, 1844278, 1742067, 1687204, 1662755, 1703426, 1784496, 1699393, 1681040, 1649985, 1682903, 1549420, 1343107, 1383141, 1286988, 1284967, 1383653, 1434563, 1483030, 1491150, 1414418, 1510281, 1522727, 1418289, 1215031, 1223719, 1287285, 1325453, 1357107, 1367249, 1423211, 1414637, 1229679, 1209502, 1217231, 1190615, 1159055, 1186573, 1335222, 1293198, 1211108, 1109902, 1046884, 1021236, 1008035, 981511, 908949, 922839, 1059768, 1133755, 1114593, 921361, 840054, 840158, 894703, 918927, 1013152, 1072493, 991586, 973806, 1039562, 1064267, 939922, 813728, 750402, 787010]
13137G87010R8090J38660r0057J3549k6991o2770K2843J00317R3278Q761j39430
13126I43260j0844j7234j0269n6768o7024j15395l3756M0010M1199Q2290P209
13115H02678j2373r7430n8167M5729R3966L6840q0988n9911N7418r0434n7367
13104E79961J20213p884N5839l6418n2886O6865K8112M3302J6453N46j54706P3762
13092G33159O0353p0270M6260Q6179J9887k1264o7321n6631n4150R4959M1896
13081H13057l4884n3905K1668Q2870J56614L78190K69791K44019N126r4740o9021
13070A718785k49401k82038j47147l5203j70398j85635k226N7293K5908n027r6372
13059F28539j1732R129M9472M2019l0307m4304l9255j43289n0126M5201K3495
$$ y = [787010, 885100, 1023760, 933703, 947252, 920261, 857491, 880334, 980651, 1073929, 1082690, 943260, 932416, 915182, 904913, 848145, 781121, 665726, 631970, 671980, 713179, 795469, 802678, 790305, 692875, 634708, 680437, 774403, 811243, 730255, 670344, 727762, 637328, 579961, 700174, 692290, 748129, 711711, 658825, 725690, 753802, 797104, 813557, 814103, 659397, 733159, 793512, 723242, 769502, 855681, 875568, 854304, 786983, 730352, 676202, 771161, 813057, 778173, 724268, 745936, 828806, 985420, 1363610, 1633401, 1877420, 1882546, 1787806, 1718785, 1469384, 1187346, 1040199, 1004996, 834598, 648963, 646737, 704030, 729938, 724911, 628539, 616807, 625936, 675408, 717427, 687120, 642816, 603561, 460272, 410146, 455347, 478842]
13048D78842J53788J56n382P3087j4077l4609P4998P6706J8566j9116M2690J85818
13036A031467J03045J15954J43638L49998M55853O78494Q16115O60460K50855
13027D605879j28279m22425o94547q55309n89041l77969k03754q8178p9203o2255
13017A104919j66513j40494q1710m7912O4122J42797j12641j55498N895N8381
13007F71346J41261J49703L1537J2321n7881k0492M3116K5492m2506M8196q8211
12996I13882r9802N3249L0788J12657N6559J20216O7325J47998L10704O38518
12986B352094Q00313Q37085O67161J67418k06793l73553n74275p24119n99788
12977B345543l93216k21424j23657j23059q6901l3854K7841q0545j0725l4582
$$ y = [478842, 632630, 632786, 627404, 700491, 686414, 651805, 726803, 803509, 822075, 802959, 845649, 1031467, 1134512, 1250466, 1394104, 1744102, 2199955, 2878449, 3694564, 4355024, 4605879, 4477600, 4055175, 3360628, 2505319, 1916278, 1538309, 1334555, 1246377, 1167174, 1104919, 938406, 797912, 716202, 668290, 732412, 875209, 762568, 607070, 612965, 671346, 812607, 962310, 993847, 1006168, 948287, 927795, 970911, 996403, 953897, 1002093, 913882, 814080, 867329, 898117, 1010774, 1067333, 1187549, 1254874, 1402872, 1713576, 2352094, 3152407, 3989492, 4656653, 4824071, 4617278, 4243725, 3669450, 2945331, 2345543, 1952327, 1730903, 1607246, 1484187, 1397286, 1363432, 1391273, 1310728, 1300003, 1265421]
12967A265421n8613L4659o5363q6720q7189l294J3257J4093J51659j7339o6654
12956A093917j930q4449L4987P2589R2715O2646J6714J01245L5408O5294m6999
12945A442137K3232k7977J5676K80388K82565K28601J92257J64692q1505j54531
12935B365535k75705j97997k24112j73117J16215P8510M8115j21739j69381j74572
12925A271752r206J28579P3041K8379q6701r7561J4386P4391J766p779o5194p2180
12913A253673N3363J27048L0579O935j2570K1627J25066j4035k9486o6718M4467
12902A539949J72328j3471K6699P8513j44050K8213O4295N3743j13659j03501
12892A589059K4427J15452J42240j6035R5756K0055K0125N4903J83918Q3430j2095
$$ y = [1265421, 1206808, 1241467, 1176104, 1089384, 1002195, 998901, 1012158, 1026251, 1177910, 1160571, 1093917, 1091987, 1007538, 1042525, 1115114, 1207829, 1270475, 1287189, 1388434, 1423842, 1489136, 1442137, 1465369, 1437392, 1453068, 1733456, 2016021, 2244622, 2436879, 2601571, 2520066, 2365535, 2089830, 1891833, 1667721, 1494604, 1610819, 1689329, 1737444, 1615705, 1446324, 1271752, 1262546, 1391125, 1464166, 1492545, 1405844, 1308283, 1322669, 1397060, 1398826, 1391047, 1325853, 1253673, 1307036, 1434084, 1464663, 1471598, 1459028, 1480655, 1605721, 1591686, 1562200, 1495482, 1539949, 1712277, 1698806, 1725505, 1804018, 1659968, 1688181, 1752476, 1806219, 1692560, 1589059, 1613486, 1728938, 1871178, 1855143, 1950899, 1970954, 1991079, 2045982, 2229900, 2313330, 2301235]
12881B301235j8625M2667N1385P6044N3220K9041L3668M2154q136j7567O5218
12870B650304J2197J14034K54830J02968l9883O7693N4005J10972N9673J50828
12860C537621j1332L5939N8616Q9147N8974J72997P2695r563J04249K44816K24784
12849D578943P7389J13016R6760K1373K7402O9339J68807J64820J96151J91401
12839E705401J27234Q0544P0846J91310J56481K14654K53771J62529J53975K93772
12829G410517J17637J27948m6558K22855J79790J47017L25289K24521J00306J98699
12819I008021K53655K25789J35508J89422K68596J87061K40112N6514m6390R6430
12809A0614718K68477L51132J65704R4608K00748J32322K48243J05206K183R2354
$$ y = [2301235, 2282610, 2325277, 2376662, 2452706, 2505926, 2534967, 2568635, 2610789, 2602653, 2585086, 2650304, 2662501, 2776535, 3031365, 3134333, 3094450, 3162143, 3216148, 3327120, 3386793, 3537621, 3526289, 3562228, 3620844, 3709991, 3768965, 3941962, 4014657, 4005094, 4109343, 4354159, 4578943, 4656332, 4769348, 4866108, 4887481, 4914883, 4984222, 5153029, 5317849, 5514000, 5705401, 5832635, 5913179, 5984025, 6175335, 6331816, 6546470, 6800241, 6962770, 7116745, 7410517, 7528154, 7656102, 7609544, 7832399, 8012189, 8159206, 8484495, 8709016, 8809322, 9008021, 9261676, 9487465, 9622973, 9812395, 10080991, 10268052, 10508164, 10564678, 10518288, 10614718, 10883195, 11234327, 11400031, 11494639, 11695387, 11827709, 12075952, 12181158, 12183341, 12275695]
12799A2275695J53776P2328L1317J92491J6615O5185J97821K10385L9022n3939
12789A3200696Q2545P5607Q4656Q1007j1431P2040o5237k8298O5543J03549K7445
12778A3688122k7780N5943L4045j24479J0529J19206O8457j25403K5929j0829
12768A3713740o7669L8522R7212O7803N6798M1634J12394j3415J6035j02432k7665
12757A3932957J008N3588J03099j65M1305J27088J55634J15887p7553K6289m5507
12746A4433630L423M1499J46676o7695J1043J65953K5934P3238N3016j5278O7384
12735A4938823J16605O4405Q0190j1105l9641j62680o933J7668j6942J15700J1795
12724A5107885n3443m7250O739N042m0106j00816l7149k8303l7374k4483o3330
$$ y = [12275695, 12429471, 12501799, 12533116, 12725607, 12742222, 12807407, 13005228, 13215613, 13254635, 13200696, 13283241, 13358848, 13443504, 13524511, 13513080, 13585120, 13519883, 13491585, 13557128, 13660677, 13688122, 13660342, 13716285, 13750330, 13625851, 13636380, 13755586, 13824043, 13698640, 13724569, 13713740, 13646071, 13684593, 13781805, 13849608, 13906406, 13948040, 14060434, 14047019, 14063054, 13960622, 13932957, 13933965, 13987553, 14090652, 14090487, 14131792, 14258880, 14414514, 14530401, 14452848, 14479137, 14433630, 14437053, 14478552, 14625228, 14557533, 14568576, 14734529, 14760463, 14833701, 14886717, 14871439, 14938823, 15055428, 15119833, 15200023, 15188918, 15149277, 14986597, 14979664, 14997332, 14980390, 15096090, 15107885, 15054442, 15007192, 15013931, 15018973, 14978867, 14878051, 14840902, 14812599, 14775225, 14750742, 14687412]
12713A4687412j92237q4307O5101o2022j0236k3645o2487j71151q8234o6374j82033
12702A3809787q9347j25176L9449l2959j55886j78851j03352j95579j17417j57034
12692A2693635j18578o9097p3814j85263k96179k25863j38390j45525j51558j07457
12682A1181911j03433j30931r7035k12496p7629j65615k84014k15665j14943j28727
12672I651423k08670k02575l5906j31584j90060k33379j73181k1910j32188n8906
12662H263064j09058k82563k38136j25637q9680j4631j05649j04395p9163R315
12652G123467r0281l7710k2360j83981j88536K5662L4944L0965P4660j4710r9288
12641F652832m8183j8897N8558L2992l8927M5568J27156K1072J8054M1046R2299
$$ y = [14687412, 14495175, 14410868, 14475969, 14413947, 14403711, 14380066, 14317579, 14146428, 14058194, 13991820, 13809787, 13720440, 13595264, 13634713, 13601754, 13445868, 13267017, 13163665, 12968086, 12850669, 12693635, 12575057, 12505960, 12432146, 12246883, 11950704, 11724841, 11586451, 11440926, 11289368, 11181911, 11078478, 10947547, 10850512, 10638016, 10560387, 10394772, 10110758, 9895093, 9780150, 9651423, 9442753, 9240178, 9204272, 9072688, 8882628, 8649249, 8476068, 8454158, 8321970, 8263064, 8154006, 7871443, 7633307, 7507670, 7417990, 7403359, 7297710, 7193315, 7114152, 7123467, 7033186, 6995476, 6973116, 6789135, 6600599, 6626261, 6661205, 6692170, 6766830, 6752120, 6652832, 6604649, 6585752, 6644310, 6677302, 6638375, 6683943, 6811099, 6832171, 6850225, 6891271, 6983570]
12630F983570J21638J61877J51447J46042J91023M3331K2047J05420K27300K68754
12620H422449K16306K15301L73347L58637K81862M01804L31536K94412K47152
12611A1142806L15137J71909J56563K79191L19731L55364M30329M74016K75772
12602A3920818J78303K69646J08263J42452L30764L48259J20360K46700L21010
12593A5986575K04066J80660L77537K11499J18777J49914J50264J03496K18832
12584A7701620R3454J6788M1241j0410j43177j45645j67650j11841m8321j53188
12574A7072871j07070j99473l23105k86816k33488k41237k63137k43474j94923
12565A4980148k81362j48643j63015k28148l57199l51579l56044l27871j80550
$$ y = [6983570, 7105208, 7267085, 7418532, 7564574, 7755597, 7798928, 7820975, 7926395, 8153695, 8422449, 8638755, 8854056, 9227403, 9586040, 9867902, 10269706, 10601242, 10895654, 11142806, 11457943, 11629852, 11786415, 12065606, 12385337, 12740701, 13171030, 13645046, 13920818, 14099121, 14368767, 14477030, 14619482, 14950246, 15298505, 15418865, 15665565, 15986575, 16190641, 16371301, 16748838, 16960337, 17079114, 17229028, 17379292, 17482788, 17701620, 17795074, 17811862, 17853103, 17842693, 17699516, 17553871, 17386221, 17274380, 17226059, 17072871, 16965801, 16766328, 16443223, 16156407, 15922919, 15681682, 15418545, 15175071, 14980148, 14698786, 14550143, 14387128, 14158980, 13801781, 13450202, 13094158, 12766287, 12585737]
12556A2585737j07683l03141j57029j29052l84139j42202n1282o1456j71674J2066
12546A1090145O2301N8640j22155l6037K6400L8525R2302J85471K03917J43735
12536A1743244J11817K64940M04342L67159K47201K72246K59517L20646L76073
12527A4367185L56827M18845M62181L79367K52437L12440M26920N62156M74198
12518A8012556L43108J20359K83970L15297K87831K60491K69965K90607J95543
12509B0379727K48128K08468J92617J83520P2986o2487L073j5546l7027k39416
12499B0934043j24390j69797l13352l39422l13410l41449n20775m35530l39731
12490A8036187l46232l81478m70606n54275n64604m27245m14497m67054n55830
$$ y = [12585737, 12478054, 12174913, 12017884, 11888832, 11504693, 11362491, 11311209, 11249753, 11078079, 11090145, 11152446, 11211086, 11088931, 11052894, 11079294, 11117819, 11210121, 11395592, 11599509, 11743244, 11855061, 12120001, 12524343, 12891502, 13138703, 13410949, 13670466, 13991112, 14367185, 14724012, 15142857, 15605038, 15984405, 16236842, 16549282, 16976202, 17538358, 18012556, 18355664, 18476023, 18759993, 19075290, 19363121, 19623612, 19893577, 20184184, 20379727, 20627855, 20836323, 21028940, 21212460, 21285446, 21222959, 21226032, 21210486, 21173459, 20934043, 20809653, 20639856, 20326504, 19987082, 19673672, 19332223, 18811448, 18375918, 18036187, 17689955, 17308477, 16837871, 16283596, 15718992, 15291747, 14877250, 14410196, 13854366]
12481A3854366n34219l86941l96931m06995n32442m10909m08292n39293m97777
12472I740567l65098l22622k55425l62079l41073l14607l43764j98187k57044
12463F980668m28646m14125m02821k71343m4842j73117k30074k15067j96559p6350
12453D527724p8776j09884j12417j20858n5823k13243j77866k7958q4784j72318
12443C373797M749o0957j39454j04962J6563Q3310p5862q5404l6193m9972q6271
12432B839344m0010j66160j30971L7241n4763q3921j9439l4757p1618q5514j17969
12421B071463J0268J4865J2988m7437j02037J5776N5686J1475j1732r9117n7428
12410A874770k2746L6340n3135j10271r7247K6805k9072j35108p8006Q1867l9515
$$ y = [13854366, 13320147, 12933206, 12536275, 12129280, 11596838, 11185929, 10777637, 10238344, 9740567, 9375469, 9052847, 8797422, 8435343, 8094270, 7779663, 7435899, 7237712, 6980668, 6552022, 6137897, 5735076, 5463733, 5418891, 5245774, 5015700, 4800633, 4604074, 4527724, 4448948, 4339064, 4226647, 4105789, 4049966, 3836723, 3658857, 3630899, 3546115, 3373797, 3378546, 3317589, 3178135, 3073173, 3089736, 3173046, 3097184, 3011780, 2975587, 2925615, 2839344, 2799334, 2633174, 2502203, 2539444, 2484681, 2400760, 2381321, 2346564, 2274946, 2189432, 2071463, 2081731, 2096596, 2109584, 2062147, 1960110, 1975886, 2031572, 2043047, 2031315, 1932198, 1874770, 1852024, 1888364, 1835229, 1724958, 1627711, 1654516, 1625444, 1490336, 1412330, 1494197, 1454682]
12399A454682n84J25066N7380M894K3648m6448j13071m4599N1310o9198M0521
12388A483601J17600J40867j40840J60063J47687j90211m6944l0554r6983r8359
12378A445927q0956l2203o3239J8075J04424J83474p4543p4566N3201R2772K6612
12367A598978q2583O8677J47510k1919j87695r6107m517J17922p4504j72993M837
12356A297606j5095J9968M927j6874j2494l7858K7890K2089L0388J16015j25710
12345A310852k65581O6462K56464p2596k21389J6807Q7022J02178O112M1057p7345
12334A250043j00324l9028R1527Q4616K1498j18594j3886Q6444r0382j5113j38503
12323A018298j06232J16750J18647P7346j4887o4255l9975J7078N4535L8810J5144
$$ y = [1454682, 1454098, 1579164, 1636544, 1641438, 1665086, 1618638, 1505567, 1460968, 1512278, 1443080, 1483601, 1601201, 1742068, 1601228, 1761291, 1908978, 1718767, 1671823, 1641269, 1544286, 1445927, 1364971, 1332768, 1269529, 1287604, 1392028, 1575502, 1500959, 1426393, 1479594, 1572366, 1598978, 1516395, 1585072, 1732582, 1710663, 1522968, 1426861, 1422344, 1540266, 1465762, 1292769, 1297606, 1282511, 1302479, 1307406, 1290532, 1278038, 1240180, 1268070, 1290159, 1320547, 1436562, 1310852, 1045271, 1111733, 1368197, 1295601, 1074212, 1091019, 1178041, 1280219, 1286331, 1327388, 1250043, 1149719, 1110691, 1202218, 1286834, 1308332, 1189738, 1175852, 1262296, 1171914, 1156801, 1018298, 912066, 1028816, 1147463, 1224809, 1209922, 1145667, 1105692, 1122770, 1177305, 1216115, 1231259]
12312A231259l0428p5556J5604N8704R882J4591r2554q8074j2037J13793P1709
12301A216893J16815l5270m4353j28582n4313J19076L7633J27679P1922k2873
12291A404627R406j7656K8003m6069n5013M8872R4803p8506p5729P717j1016l0308
12279A279131m1349K8957N9617L7894P8967L9216r7755k2799Q664O8375P4993
12268A513911m7558Q6222J7296q1204j14193p2865n301R7404o2462j04958j70043
12257A056249J6778J63494J14013N5561j00151q4428R183J12267J0006j0046o4585
12246A278341o5333k2341J20661O4465m4298j15304J21822l1195o3998J08302
12236A351122J55426p4363M8981l1095J9361q3211m5261l4789j14998J5580R9590
$$ y = [1231259, 1200831, 1125275, 1140879, 1199583, 1209465, 1224056, 1131502, 1043428, 1031391, 1145184, 1216893, 1333708, 1298438, 1254085, 1125503, 1071190, 1190266, 1227899, 1355578, 1427500, 1404627, 1414033, 1396377, 1424380, 1378311, 1323298, 1372170, 1466973, 1388467, 1312738, 1320455, 1309439, 1279131, 1237782, 1266739, 1326356, 1364250, 1443217, 1482433, 1384678, 1361879, 1370543, 1438918, 1513911, 1466353, 1552575, 1569871, 1488667, 1374474, 1301609, 1296308, 1393712, 1331250, 1226292, 1056249, 1073027, 1236521, 1350534, 1406095, 1305944, 1221516, 1230699, 1342966, 1352972, 1342926, 1278341, 1213008, 1190667, 1311328, 1375793, 1331495, 1216191, 1338013, 1306818, 1242820, 1351122, 1506548, 1432185, 1481166, 1450071, 1469432, 1386221, 1340960, 1306171, 1191173, 1206753, 1306343]
12225A306343P7319J09580N2287l4743Q4918m2690j03897K4778J42156O9232r5684
12214A589599p7222j20988m7082Q0427J47626P8105L0843N8470J4203m666L2496
12203A781811M4210j3110L275j13813j22399J11660j7002o6250K7321J00604K9339
12192A765646j68940o9281J24184M1513J22133p8884o4415M9808N0358K4122K43045
12181B039289J8202j18737r94j3066M6080j4681N4327m1467j44396q5870m2311
12170A696376l0611J03501J51226J34609K9439p3411o9428m809O4371q5367r2489
12159A823407N811J98134J38651m8611N2600K4379j0595R8044O914r1681N5336
12148B252389j39851j06138N3084r4352P765J32335L0818J35958J0672j60680
$$ y = [1306343, 1383662, 1493242, 1545529, 1510786, 1595704, 1553014, 1449117, 1473895, 1616051, 1685283, 1589599, 1512377, 1391389, 1344307, 1424734, 1572360, 1650465, 1681308, 1739778, 1753981, 1749315, 1781811, 1826021, 1812911, 1816186, 1702373, 1579974, 1691634, 1674632, 1608382, 1635703, 1736307, 1765646, 1596706, 1527425, 1651609, 1693122, 1815255, 1736371, 1671956, 1721764, 1772122, 1796244, 2039289, 2057491, 1938754, 1937760, 1924694, 1970774, 1956093, 2010420, 1968953, 1824557, 1738687, 1696376, 1665765, 1769266, 1920492, 2055101, 2084540, 2011129, 1941701, 1936892, 2001263, 1915896, 1823407, 1829218, 2027352, 2166003, 2117392, 2169992, 2194371, 2183776, 2281820, 2288734, 2197053, 2252389, 2112538, 2006400, 2059484, 1965132, 1972897, 2105232, 2136050, 2272008, 2282680, 2122000]
12138B122000r9779m9660J8118J00832Q3825L303O0459M7791m4619r2168J03316
12127B253418O9287l6966J1030j6474j01940R192l1478L3372P3638N1634J43544
12116B458257Q6413r2718o0605L9003M3836R8415O438K453r9079O0469P0055j6041
12104B596896j09152j35205N3044J85521L7845L4269m979j4182J09084j9962j98415
12093B534764O0247O9300o4345J23824L9622n5646k1770o3012J4910K0229O3860
12082B721983R4801r4861k734K8811j01400P1920J05272j08902m8803J05201J33269
12071B904557M3312K4715M1114j06350N7540J23905R8962L4005l6052O587m2453
12060C149842j01922k3309N5818J01382P5439r0039Q9327N3510k6411n9865L9222
$$ y = [2122000, 2022221, 1972561, 1990679, 2091511, 2175336, 2178639, 2239098, 2286889, 2242270, 2150102, 2253418, 2322705, 2285739, 2296769, 2280295, 2178355, 2187547, 2156069, 2189441, 2263079, 2314713, 2458257, 2544670, 2451952, 2391347, 2430350, 2474186, 2572601, 2579039, 2581492, 2482413, 2542882, 2612937, 2596896, 2487744, 2352539, 2405583, 2591104, 2628949, 2663218, 2658239, 2644057, 2753141, 2733179, 2534764, 2595011, 2664311, 2599966, 2723790, 2763412, 2707766, 2685996, 2622984, 2637894, 2658123, 2721983, 2816784, 2721923, 2719189, 2748000, 2646600, 2718520, 2823792, 2714890, 2666087, 2771288, 2904557, 2947869, 2972584, 3013698, 2907348, 2964888, 3088793, 3187755, 3221760, 3185708, 3192295, 3149842, 3047920, 3024611, 3080429, 3181811, 3257250, 3167211, 3256538, 3310048, 3283637, 3223772, 3262994]
12049C262994N7114J21214m3384j39740j20067K1529P2911o2637P563L5679J31961
12038C345137R7901p3437m7922K092K0496J17094J15085N9116N7694j48173o9786
12027C475297m232J9640J47975J16925m4412j6692q0368l6617P4409j4235o1631
12016C576059j9456O6199K3222j00483P1539J15902J40888R4193p735M4460l0618
12005C974170q3592N3336R5751J6082o8963j10678J127j0513N2909j9210n8811
11994C841608K4263R3839Q3468L1607P69j6141j15232J07373J9273j5846J19332
11983D174313j2689p0185J31880J64387J50202o5399k36120N3303Q6245j27493
11973D248444j1713N0384J26622j1382p708p6443K6706K6981L4955M28J50670
$$ y = [3262994, 3320108, 3441322, 3397938, 3258198, 3138131, 3159660, 3232571, 3169934, 3177497, 3213176, 3345137, 3443038, 3369601, 3321679, 3323771, 3344267, 3461361, 3576446, 3635562, 3693256, 3545083, 3475297, 3471065, 3490705, 3638680, 3755605, 3711193, 3694501, 3614133, 3577516, 3651925, 3637690, 3576059, 3556603, 3622802, 3646024, 3545541, 3617080, 3732982, 3873870, 3968063, 3960328, 4004788, 3974170, 3890578, 3943914, 4039665, 4055747, 3986784, 3876106, 3877233, 3866720, 3919629, 3900419, 3841608, 3865871, 3959710, 4043178, 4074785, 4075554, 4059413, 3944181, 4051554, 4070827, 4054981, 4174313, 4161624, 4091439, 4223319, 4387706, 4537908, 4472509, 4236389, 4289692, 4375937, 4248444, 4236731, 4287115, 4413737, 4402355, 4394647, 4318204, 4344910, 4371891, 4406846, 4407274, 4557944]
11962D557944O3884j64885k032R4759J54403N925j00042j88501n5258J24828J26009
11951D617034o4945l0656n0902k8483K7743N7053j2036N7205P3877J22994o4907
11940D703977L877k5877q3485O9498J268j040m0325j697p4432R4885J47938K3549
11928D818136k3917m7489o2791j02418K8875M1463j28832Q6300J37945J0599O0841
11917D818712l2703r7802J6770J56P3795R0379M9970M6914L8318K6090M599J9217
11905E054415j30908R7032L9664j5662L3469p4080k4512m5644J979p212j6713
11894D911828P0374M5758m2474m6778R3619P2307j5260m704K2328O6309J08914
11883E282221j06410N0317l6572n7292M3938n6886Q068L6583j2815K6681N0901
$$ y = [4557944, 4621828, 4456943, 4454911, 4549670, 4704073, 4709998, 4609956, 4421455, 4366197, 4491025, 4617034, 4552089, 4521433, 4470531, 4442048, 4469791, 4526844, 4514808, 4572013, 4645890, 4768884, 4703977, 4707854, 4681977, 4598492, 4667990, 4669258, 4668218, 4627893, 4626196, 4551764, 4646649, 4794587, 4818136, 4794219, 4746730, 4683939, 4581521, 4610396, 4651859, 4523027, 4609327, 4747272, 4757871, 4818712, 4786009, 4688207, 4704977, 4705133, 4778928, 4869307, 4919277, 4966191, 5004509, 5030599, 5035198, 5054415, 4923507, 5020539, 5060203, 5044541, 5078010, 5003930, 4979418, 4933774, 4935753, 4928541, 4911828, 4982202, 5027960, 4985486, 4938708, 5032327, 5104634, 5089374, 5084670, 5106998, 5173307, 5282221, 5175811, 5226128, 5189556, 5132264, 5176202, 5119316, 5127384, 5163967, 5151152, 5177833, 5228734]
11872E228734N8780L1111J37008N5335J21624L2938N9945j6900o2575l5178K5514
11861E636336K63k7399j3963K3718j24762R6770J09708M3111J9208k995J07745
11850E867740j2958M6636R4032P8135O394P8391j6743q0573J7031J55074J32067
11839F365226J70381r9904P201O7952l2139K942M8601o172k1536J5658p36R5629
11827F613103Q3803O9040k9039J49089J48719j812R0066n1905J04075j5683J3234
11816G172690J1690J00510L6729R872J17013J30178P1831L2807J9474l3960l6869
11805G631965J05746K3471O9327M2356j6225L3255L1043m3711J9146J14399k6258
11794G984514R9571p760N5319J59812Q2450J6440o9462P8133J18355J46811q8230
$$ y = [5228734, 5287514, 5318625, 5455633, 5510968, 5632592, 5665530, 5725475, 5708575, 5646000, 5610822, 5636336, 5636599, 5609200, 5595237, 5618955, 5494193, 5590963, 5700671, 5743782, 5762990, 5759995, 5867740, 5854782, 5901418, 5995450, 6073585, 6079979, 6158370, 6141627, 6061054, 6078085, 6233159, 6365226, 6535607, 6435703, 6442904, 6510856, 6478717, 6481659, 6530260, 6524088, 6502552, 6518210, 6517474, 6613103, 6696906, 6765946, 6736907, 6885996, 7034715, 7032903, 7122969, 7071064, 7175139, 7159456, 7172690, 7184380, 7284890, 7321619, 7331491, 7448504, 7578682, 7650513, 7683320, 7702794, 7668834, 7631965, 7737711, 7761182, 7830509, 7872865, 7856640, 7889895, 7920938, 7877227, 7896373, 8010772, 7984514, 8084085, 8076325, 8131644, 8291456, 8373906, 8390346, 8320884, 8399017, 8517372, 8664183, 8575953]
11783H575953J3498J14729O1790O5282M911N0384j04224k7836N6588J91526K13875
11772I216476K9685j22467n0208J19458J23276N265j13394r4396J2686J23962
11762I250343k3253J45137R6190q912P2999J23519O0496m5179R3705M5468j4322
11751I796191N5985O6151L0747N1334Q2832J3126L397O8550Q7164P1673J5079
11740A0342229L6271J30107M0831P2373L3997N0851J34650K11343K4095K4918
11730A1101665N1864Q3050R2800J48114O2656J25042K26640O0099K2421J30943
11720A2105294J04685K29663K08171O2696K50949J85935N6118J45721J03874O8527
11710A3521633R3100P2183O3856J05384N1361N8765O7941N7893M3513o2905J28716
$$ y = [8575953, 8589451, 8704180, 8765970, 8831252, 8836163, 8886547, 8782323, 8754487, 8811075, 9002601, 9216476, 9246161, 9123694, 9073486, 9192944, 9316220, 9321485, 9208091, 9113695, 9126381, 9250343, 9227090, 9372227, 9468417, 9459505, 9532504, 9656023, 9716519, 9671340, 9765045, 9810513, 9796191, 9852176, 9918327, 9949074, 10000408, 10083240, 10096366, 10099763, 10168313, 10255477, 10327150, 10342229, 10378500, 10508607, 10549438, 10621811, 10655808, 10706659, 10841309, 11052652, 11076747, 11101665, 11153529, 11236579, 11329379, 11477493, 11540149, 11665191, 11891831, 11951930, 11974351, 12105294, 12209979, 12439642, 12647813, 12710509, 12961458, 13147393, 13203511, 13349232, 13453106, 13521633, 13614733, 13686916, 13750772, 13856156, 13907517, 13966282, 14034223, 14092116, 14135629, 14072724, 14201440]
11699A4201440J59767M3708j01685k3178J24220p047K8579L4014M8258J75155
11689A4683231J47808M8264K0071n3652j08508n8631m0194j11059l21703l04331
11679A3901296k11920r5962N1854j57428p6282m9894j32792p393k7444j40957
11669A3053078j08507j8126j04372o0825R7543n0619m6576Q0193K0406j32272
11659A2729923r3575J2167j5969R3596O613J36441J30278J39585J57708K18346
11649A3515113J92484J04423K70859P1564R6120K33969J81045J54712K45520K72938
11639A5338747K36983K86865L29325Q5101K9486K83999K87365J69583J3512o399
11629A7054567J2488J08492O4487K4579N369l8818j41939O0402J39021j19208
$$ y = [14201440, 14361207, 14404915, 14303230, 14280052, 14404272, 14397225, 14425804, 14459818, 14508076, 14683231, 14831039, 14879303, 14899374, 14845722, 14737214, 14678583, 14638389, 14527330, 14205627, 13901296, 13689376, 13593414, 13645268, 13487840, 13411558, 13361664, 13228872, 13221479, 13194035, 13053078, 12944571, 12926445, 12822073, 12761248, 12858791, 12808172, 12761596, 12841789, 12862195, 12729923, 12636348, 12648515, 12632546, 12726142, 12732755, 12869196, 12999474, 13139059, 13296767, 13515113, 13707597, 13812020, 14082879, 14154443, 14250563, 14484532, 14665577, 14820289, 15065809, 15338747, 15575730, 15862595, 16191920, 16277021, 16306507, 16590506, 16877871, 17047454, 17060966, 17054567, 17067055, 17175547, 17240034, 17264613, 17269982, 17231164, 17089225, 17149627, 17288648, 17169440]
11619A7169440r4423J2831N7722M3613K2845N5527m8609o0498J3970L9348n3426
11608A7158340j49777m29385k99300q916j55933l75664l61354j92558j92984k89591
11598A4702878m90670k96396k05489j72603j33177k63655l79584k89104j66041
11589A2306159j66793k48666j17672j41078L813r4487j18501j42651j28297l5434
11579A1116393r0886j24961O6236L8460N0020J3218P2348p6085k8543n7691Q4544
11568A1063053J94593R3687J99554M3687l3110R6107K74584M01536K88235K77287
11558A2899213L7883J17625L08445J95827J66331K25758J53993K04544O8737K10694
11548A4589050K48338k3981o2672L1426R4283Q9544l0136j02950n8090p3805p5886
$$ y = [17169440, 17075017, 17087848, 17145570, 17189183, 17212028, 17267555, 17218946, 17158448, 17172418, 17211766, 17158340, 17008563, 16579178, 16279878, 16270962, 16115029, 15739365, 15378011, 15185453, 14992469, 14702878, 14212208, 13915812, 13710323, 13537720, 13404543, 13140888, 12761304, 12472200, 12306159, 12139366, 11890700, 11773028, 11631950, 11635763, 11541276, 11422775, 11280124, 11151827, 11116393, 11025507, 10900546, 10966782, 11005242, 11055262, 11068480, 11140828, 11064743, 11036200, 10978509, 11063053, 11257646, 11351333, 11550887, 11594574, 11561464, 11657571, 11932155, 12333691, 12621926, 12899213, 12937096, 13054721, 13363166, 13558993, 13725324, 13951082, 14105075, 14309619, 14378356, 14589050, 14837388, 14813407, 14750735, 14782161, 14876444, 14965988, 14935852, 14832902, 14774812, 14701007, 14625121]
11537A4625121r6391j5706r252j4106j34825k07493m4436R4544J39065j1859k61771
11526A4062891k76273l7316j12508l23410j89141j55659k71856k04666l22960
11517A2169102l70007j93515j43015k22241j27296j57401k43868j93774j74493
11508A0343492k22457j37376l5914o0295j37286j57697j03454o3167k26377k01216
11498H998253n4209N5714P2244n8257q0122j01583k4752O5477J14788J44597J70266
11487I302416N1445N7332J58264M8337J28208J88734K90568K79109K09898J56602
11477A0870913J81373K80850K38669M6664J79712K72501J43683J22930J06296
11468A2443591L7385J04349J08428L850J19283k045O3358L0564j00514m3107k3363
$$ y = [14625121, 14528730, 14513024, 14503772, 14489666, 14354841, 14147348, 14102912, 14197456, 14336521, 14324662, 14062891, 13786618, 13749302, 13636794, 13313384, 13124243, 12968584, 12696728, 12492062, 12169102, 11799095, 11605580, 11462565, 11240324, 11113028, 10955627, 10711759, 10517985, 10343492, 10121035, 9983659, 9947745, 9887450, 9750164, 9592467, 9489013, 9425846, 9199469, 8998253, 8944044, 8999758, 9072002, 9013745, 8933623, 8832040, 8807288, 8872765, 8987553, 9132150, 9302416, 9353861, 9411193, 9569457, 9617794, 9746002, 9934736, 10225304, 10504413, 10714311, 10870913, 11052286, 11333136, 11571805, 11618469, 11798181, 12070682, 12214365, 12337295, 12443591, 12480976, 12585325, 12693753, 12697603, 12816886, 12814841, 12878199, 12908763, 12808249, 12765142, 12741779]
11457A2741779r497j07841J44522j9010j07081q0997j20871o0981l7637n5647
11447A2286739j22106k58683j91353j32660m9419j27858j53374j66690k20520
11438A0864076l13768k71117k71281j48166q8392k43444l25912k80076j44588
11429H777332o8533n44j09861p3203j36835j55949k17878j56711L3255n5091K2285
11418G858267K15928o6863j56857j43462K7552P8897J39865J10014J660M8537
11408H113538Q1992J95307K06147K9268L1505K13855K68077K23423J16161K24179
11398I703452J44955J72693J90659J44195K46152K57932J61247J17328K09655
11389A1348268K22285J45819J71756J87857J15271j52019j03858Q864M5343j3762
$$ y = [12741779, 12732282, 12624441, 12768963, 12749953, 12642872, 12561875, 12441004, 12380023, 12342386, 12286739, 12164633, 11905950, 11714597, 11581937, 11532518, 11404660, 11251286, 11084596, 10864076, 10550308, 10279191, 10007910, 9859744, 9771352, 9527908, 9201996, 8921920, 8777332, 8708799, 8708255, 8598394, 8525191, 8388356, 8232407, 8014529, 7857818, 7891073, 7835982, 7858267, 8074195, 8007332, 7850475, 7707013, 7734565, 7813462, 7953327, 8063341, 8065001, 8113538, 8195530, 8390837, 8596984, 8626252, 8657757, 8871612, 9139689, 9363112, 9479273, 9703452, 9848407, 10021100, 10211759, 10355954, 10602106, 10860038, 11021285, 11138613, 11348268, 11570553, 11716372, 11888128, 12075985, 12191256, 12039237, 11935379, 11944243, 11989586, 11975824]
11379A1975824r0475q5152k9501M0973j28822j04110j89411j59436j50688k0808
11369A1058394l3005j3941j14542j30220k34472j94965J7280j59736l28829k45764
11359I620200j24932k5241j4285l4404k8761p5961j25564p1307l8573n1656j12361
11348H917155j6317j26961j00694q0056j34021j21520j45067R5992k4831n8487
11338H205193P4919k4678Q8624M2729j22270n0912J01917M6070q349O2778O1242
11327H477263L3695R8153K6124J37706J54006q2709j05503M7011N2968k148j21281
11316H715285j2455K24082R9029L2009M9565k2139q8299J72449K96216R8324J4204
11305I578270L9004N0363l2548o9403R2751Q0362Q4983J70546J45780j8665K7120
$$ y = [11975824, 11885349, 11800197, 11770696, 11811669, 11682847, 11578737, 11389326, 11229890, 11079202, 11058394, 11025389, 11011448, 10896906, 10766686, 10532214, 10337249, 10354529, 10194793, 9865964, 9620200, 9495268, 9470027, 9455742, 9421338, 9392577, 9316616, 9191052, 9119745, 9081172, 9029516, 8917155, 8900838, 8773877, 8673183, 8593127, 8459106, 8337586, 8192519, 8288511, 8263680, 8205193, 8280112, 8255434, 8344058, 8386787, 8264517, 8213605, 8315522, 8361592, 8353243, 8416021, 8477263, 8510958, 8609111, 8635235, 8772941, 8926947, 8844238, 8738735, 8785746, 8838714, 8836566, 8715285, 8702830, 8926912, 9025941, 9057950, 9107515, 9085376, 8997077, 9169526, 9465742, 9564066, 9578270, 9617274, 9667637, 9635089, 9565686, 9658437, 9738799, 9823782, 9994328, 10140108, 10121443, 10148563]
11294A0148563Q0645P0773j89512o6889M7479J06577R4511K02057J43463n7627
11284A0580040L2724j969o5788R6000M5086M0977J21781n5072o5539r0745J0348
11273A0647843R4329L7787J48755Q1677L4485R4855k0159q8821j16826o9744J06276
11262A0950457L97M7172L8953j7955K3104m5458j28557o400l7625Q6392J40327
11251A1050807J23610k5691P2342K5991j9784J02407N941j67008j29642O5448
11241A1104421J60447K4594j40755j916J3693m3389n2731k4224N7151p8175J7160
11230A1036276O5242J09246J78903j4826m0879r244p6969j4873M279k0815j08105
11219A1108235j216J16191m9517L5028O8896p0759M0006P9664l7374q3260j9513
$$ y = [10148563, 10229208, 10299981, 10110469, 10043580, 10091059, 10197636, 10292147, 10494204, 10637667, 10580040, 10612764, 10610795, 10545007, 10641007, 10686093, 10727070, 10848851, 10793779, 10728240, 10637495, 10647843, 10742172, 10779959, 10928714, 11010391, 11044876, 11139731, 11119572, 11030751, 10913925, 10844181, 10950457, 10950854, 10998026, 11036979, 11019024, 11042128, 10996670, 10868113, 10861713, 10824088, 10910480, 11050807, 11174417, 11148726, 11221068, 11247059, 11227275, 11329682, 11335623, 11168615, 11038973, 11104421, 11264868, 11289462, 11148707, 11146791, 11160484, 11117095, 11064364, 11040140, 11097291, 11019116, 11036276, 11101518, 11210764, 11389667, 11374841, 11333962, 11324718, 11247749, 11232876, 11237155, 11216340, 11108235, 11107019, 11223210, 11173693, 11208721, 11277617, 11206858, 11246864, 11326528, 11289154, 11205894, 11186381]
11208A1186381j07183M6517J9344j00757n9916l5536j40967o5261M7219r4488
11198A0695353j10451M0175m8851l8480j25420l7686o1248j90302n1291R3510
11188A0165309o0929j18482K7014k5044l4004k03068j31990j23243R51j15401
11178I381113j55846j04439m9351N1545q3245j53383k9562j20655j25547j05146
11168H505484j23753q2676k13174J9564k8529m0097j19100j08581p1154q2142
11158G655842o5048k0067j45730j17424r7454j74240n8704o9663L2840L2396N0920
11147G023668r0556j13017j46721j05707l755n3258l1745j4125r8732j50664p9278
11136F136110j7278j26284j6426O2899r7075j61415j45754q3674m8812J8514o5002
$$ y = [11186381, 11079198, 11125715, 11145059, 11044302, 10984386, 10948850, 10807883, 10742622, 10789841, 10695353, 10584902, 10625077, 10576226, 10537746, 10412326, 10374640, 10313392, 10123090, 10071799, 10165309, 10104380, 9985898, 10012912, 9987868, 9953864, 9750796, 9618806, 9495563, 9496514, 9381113, 9225267, 9120828, 9071477, 9123022, 9039777, 8886394, 8856832, 8736177, 8610630, 8505484, 8381731, 8299055, 8085881, 8105445, 8076916, 8036819, 7917719, 7809138, 7737984, 7655842, 7590794, 7570727, 7424997, 7307573, 7210119, 7035879, 6977175, 6907512, 6940352, 6972748, 7023668, 6933112, 6820095, 6673374, 6567667, 6563912, 6510654, 6478909, 6464784, 6366052, 6215388, 6136110, 6118832, 5992548, 5976122, 6039021, 5941946, 5780531, 5634777, 5551103, 5502291, 5520805, 5455803]
11125E455803j68993j63381J6612M3295l5288q1304j30956n9740K0778k3o8567
11114D828236j11080p5135q5670J25168r2842j21447q1758q1926j77245p0922
11104D055379M6257n672j01072o3038k7018j51064n7857l8354r6944p2013j07587
11093C381017N8085M5632j54305j00742L1270O21p6617j43371r3458o6246j106
11082B880780j30000O438m9795j00351n3080k572j16157J5779O8950q5642j52597
11071B281753m4928n7073o773k507R2909l5389l0362q1933k90238r6685Q1816
11060A810590k44N0247Q845l5237M7520R734L2236P5575J2793K5730n1122j09754
11048A876913j01733k4216R3670J2906L9919J18542K8466k2021j20313Q635L9362
$$ y = [5455803, 5286810, 5123429, 5140041, 5183336, 5148048, 5066744, 4935788, 4876048, 4896826, 4896803, 4828236, 4717156, 4642021, 4556351, 4681519, 4588677, 4467230, 4385472, 4303546, 4126301, 4055379, 4101636, 4095964, 3994892, 3931854, 3904836, 3753772, 3695915, 3657561, 3560617, 3488604, 3381017, 3439102, 3484734, 3330429, 3229687, 3260957, 3261578, 3184961, 3041590, 2948132, 2881886, 2880780, 2750780, 2757218, 2707423, 2607072, 2553992, 2551420, 2435263, 2451042, 2519992, 2434350, 2281753, 2236825, 2179752, 2172979, 2170472, 2263381, 2227992, 2197630, 2115697, 1825459, 1728774, 1810590, 1810346, 1860593, 1869438, 1834201, 1881721, 1891455, 1923691, 1999266, 2012059, 2037789, 1986667, 1876913, 1775180, 1750964, 1844634, 1857540, 1897459, 2016001, 2044467, 2022446, 1902133, 1910768, 1950130]
11037A950130N9952J91374J49730O9712m2451J6470O9714l0958j41920p3693m05
11026B217655K5836J23842P7593J00869J74385L3996m6438j52665j28190j52435
11016B274448j07528k05619n7192n053K08480R6485m3932j23313n3413q8109o7339
11005A827915q0163j11101j67359p2792Q0008O119R476j1642o5863k47746p6136
10994A090716k0186q7579k9184l4342J00638j42700k00761o5556J07080m299O6590
10983G80417J1237j21782q1783N5782L7134J5183o418k5884q3598m1196M4410
10972E83502J67315M5425j33335n3042R3976J5239l6416n925k6950o2235O787
10961E94341L2274J02557j7971p6492j6659l4497o8132k6518J95947J02297M0241
$$ y = [1950130, 2010082, 2201456, 2351186, 2420898, 2378447, 2394917, 2464631, 2433673, 2291753, 2218060, 2217655, 2243491, 2367333, 2444926, 2545795, 2720180, 2754176, 2707738, 2555073, 2426883, 2274448, 2166920, 1961301, 1904109, 1899056, 2107536, 2204021, 2160089, 2036776, 1983363, 1895254, 1827915, 1747752, 1636651, 1469292, 1396500, 1476508, 1482627, 1492103, 1480461, 1414598, 1166852, 1090716, 1070530, 982951, 953767, 919425, 1020063, 877363, 676602, 611046, 718126, 713827, 780417, 791654, 669872, 588089, 643871, 681005, 696188, 689770, 663886, 580288, 539092, 583502, 750817, 796242, 662907, 609865, 703841, 719080, 682664, 676739, 649789, 587554, 594341, 626615, 729172, 711201, 634709, 618050, 583553, 515421, 488903, 684850, 787147, 827388]
10950H27388r8077n0645j01507j61338m4229m7062M2347j9726O7777J23603m5328
10939D93203Q1548Q3001M9495P5402j11619p8295j6810q3986O8421r830K9032
10928E79562l8402r3090J51423j0662j15626k4203N2650m0306R2196m4816p5594
10917D33132M3933N4334Q025J48998J9601j11043j43662J00203j414p6726j16504
10906C58877L8857J16641o087m1987l9972j5516L8606j0814J2510L3478k8743
10895D55850P177Q9174j8800m6443p2714k5035R9619n8691r558o5533R9271k0429
10883D33888j01522q5294J7308J16902N4476r688j49131k7373N0618l2626M7460
10872C15018J59402R1152l072j00911j10030M5860n1071m0319k4933n84L0372
$$ y = [827388, 729311, 678666, 577159, 415821, 371592, 324530, 366877, 347151, 414928, 538531, 493203, 574751, 657752, 707247, 782649, 671030, 592735, 575925, 491939, 560360, 550530, 579562, 541160, 448070, 599493, 588831, 473205, 449002, 501652, 461346, 553542, 508726, 433132, 477065, 531399, 539424, 688422, 708023, 596980, 453318, 553521, 552107, 475381, 358877, 397734, 514375, 508288, 466301, 426329, 410813, 449419, 438605, 451115, 484593, 455850, 463027, 552201, 533401, 486958, 414244, 389209, 488828, 430137, 420579, 355046, 454317, 433888, 332366, 247072, 264380, 381282, 435758, 426070, 276939, 249566, 300184, 267558, 315018, 474420, 565572, 562500, 461589, 351559, 397419, 346348, 306029, 281096, 280512, 310884]
10861C10884P8253K9827P5072K7662L7096l6631K4826K8223p3900r3478R968j01479
10849C16323J9242R2795Q7279R0841N071p9115n5277L5122P9251K6480p9525j25492
10837D12995j09730M5825K153Q2646R8196o0503J2048J4023o6960k43274L603
10826A91022J57365N0632o4873k7112J15202O0375q0521K8317j2979k7446k5117
10815C64865n2892J0172Q749K1218L7723P428L4100J02415P7654Q2657l071j96739
10803D94279j71062n6698k9786R1357o2560j4761J50318j6249o6809l1491K1136
10792C07674M7281K698j10562r4655K7156k9697o5438K9928J22745N8584o9922
10781B25792L6020k4641n4071N638K5571M2901J00982j6654K224Q7745n7327m7018
$$ y = [310884, 389137, 418964, 494036, 521698, 558794, 522163, 546989, 575212, 501312, 407834, 417802, 316323, 335565, 428360, 515639, 606480, 611551, 532436, 477159, 512281, 591532, 618012, 538487, 412995, 303265, 349090, 351243, 433889, 532085, 471582, 483630, 497653, 430693, 187419, 191022, 348387, 399019, 334146, 307034, 422236, 482611, 402090, 430407, 417428, 389982, 364865, 311973, 322145, 330894, 352112, 389835, 397263, 431363, 533778, 611432, 694089, 691018, 494279, 323217, 266519, 236733, 328090, 265530, 250769, 401087, 384838, 318029, 286538, 307674, 354955, 357653, 247091, 152436, 179592, 149895, 84457, 114385, 237130, 295714, 225792, 261812, 237171, 183100, 188738, 214309, 257210, 358192, 341538, 343762, 431507, 374180, 327162]
10769C27162o5663k2247N3937r968J188n4446m4347j7365j8425J472O9662L9645
10757B60605m6904j38575r9139o6052J14393P9645Q4835M4862O4437K8694P7964
10746D04765p0230o3176k1096o3986p3037j14023R8364J64813J07508M4057j6042
10735C97917q0790l7817J26556J13857p2633R5757m831q7782J85666n1468j00830
10724D83602K8800n298j0143l2326J0479o2155M1822J05969m9303j13572L6362
10713D34237r3662q0645m9491O1967M3153j36487n2303R9455l2991r240j8107
10702A65886r9388L796L0342J21444n8246j19705j2775P0571J56351O7542m0420
10691B85398l509n511J1628O7441m5767j7927K6720l3873j09347J14957o7860
$$ y = [327162, 261499, 239252, 293189, 283221, 284409, 229963, 185616, 168251, 149826, 151298, 220960, 260605, 213701, 75126, -24013, -90065, 24328, 103973, 188808, 233670, 298107, 326801, 404765, 334535, 271359, 250263, 186277, 113240, -783, 97581, 262394, 369902, 413959, 397917, 317127, 279310, 405866, 519723, 447090, 542847, 538016, 450234, 635900, 584432, 483602, 512402, 507104, 496961, 464635, 475114, 412959, 454781, 560750, 511447, 397875, 434237, 340575, 259930, 210439, 272406, 315559, 179072, 126769, 226224, 193233, 183993, 165886, 66498, 70294, 100636, 222080, 163834, 44129, 31354, 101925, 258276, 325818, 285398, 281889, 276378, 288006, 355447, 309680, 291753, 318473, 284600, 175253, 290210, 222350]
10680B22350Q3893L2731Q0238L0497l2518L3300J15692J2651q4800k4497k4799
10669D44738q6818m929M1404R7935J39387O6658Q6544P9961n9595M6560R7516
10658I49361Q428R1070K05643L15373J85079K11813J32407K05506L02243q9405
10648B517518j22743o1908j45192k89281q8759P4990L6082M3996L81344K00023
10638B546070M33927N94769N74339N90836J043043J072129P92495N69610N43349
10629H760567J51638J85072O07644R38149J507363K388195L293472M590346O020013
10620B8442459P833255J0109245J2421063J3294802J1436197Q141094M378017
10613I6056132O86011j956811k305825m0650M388999J0358686J7793328K4368292
$$ y = [222350, 306243, 338974, 419212, 449709, 417191, 450491, 566183, 578834, 494034, 469537, 444738, 357920, 352991, 394395, 492330, 631717, 698375, 784919, 864880, 805285, 851845, 949361, 957789, 1048859, 1254502, 1569875, 1754954, 1966767, 2099174, 2304680, 2606923, 2517518, 2394775, 2332867, 2187675, 1898394, 1809635, 1884625, 1920707, 1964703, 2346047, 2546070, 2979997, 3574766, 4149105, 4739941, 5782984, 6855113, 7647608, 8217218, 8760567, 8912205, 9097277, 9704921, 10643070, 12150433, 14538628, 17832100, 22422446, 28442459, 36275714, 46384959, 58806022, 72100824, 83537021, 91678115, 96056132, 96742143, 94785332, 92479507, 92438857, 96827856, 107186542, 124979870, 149348162]
10605A49348162K6230232K1232629J1644387J945478o946460j3610876j4519609
10598A75323943q988804J47865J1143334K2582151L1608563L2653471K2912553
10591B87383076P433865p016886j9729739k9072396l0244654k3053500j2297037
10584A73402729j477971Q341345J5043375J5315930Q135269k276261j1682701
10577B04801715j9615336k4885761k4220402j8460595j1360873m974800j93090
10570A01090858K552703K608438l86881m755622q655624j1676156j3299626j2685922
10562E4792168j0733742q259480o194073m594430l466145k597018k034320j610785
10554A5302175j363181j276922j116057r62450q10501o98906p54382p35554m85306
$$ y = [149348162, 175578394, 196811023, 208455410, 210400888, 203454428, 189843552, 175323943, 166335139, 166483004, 177626338, 200208489, 231817052, 264470523, 287383076, 294816941, 287800055, 268070316, 238997920, 208753266, 185699766, 173402729, 171924758, 180266103, 195309478, 210625408, 218760677, 216484416, 204801715, 185186379, 160300618, 136080216, 117619621, 106258748, 101283948, 101090858, 103643561, 106251999, 105865118, 101109496, 92453872, 80777716, 67478090, 54792168, 44058426, 35798946, 29604873, 25010443, 21544298, 18947280, 16912960, 15302175, 13938994, 12662072, 11546015, 10583565, 9773064, 9074158, 8319776, 7584222, 7098916]
10545G098916n05316m69221l44738l69662k00670k99353k94570k24928k86427
10536D104031r6331j31133j63530j90260j39368j13707o128j75689k10695j85601
10526B691589j67599p0309q0036m1602k578j30260j88028j43222j20806N2266
10516A799415K3162O809n7312j08403j82570k03157Q7186K02908q5053j15079
10506A367906k1729j4799p9041j60647L7076m3052K6577J3082m3500n4958l7364
10495I89551q989j6536m702l5028j23533j37330j27025l0428L0400k810R7117
10484F30687O3613P8522n3883J4990k3032r5252j08497o2792j035k900N0921p6032
10472D15310K1137o1971P0310l5794O7609k0432j19703k9840J27140J13566j37921
$$ y = [7098916, 6593600, 6124379, 5779641, 5409979, 5209309, 4909956, 4615386, 4390458, 4104031, 4007700, 3876567, 3713037, 3522777, 3383409, 3269702, 3263574, 3087885, 2877190, 2691589, 2523990, 2453681, 2373645, 2332043, 2329465, 2199205, 2011177, 1867955, 1747149, 1799415, 1822577, 1829386, 1772074, 1663671, 1481101, 1277944, 1365130, 1568038, 1482985, 1367906, 1346177, 1331378, 1252337, 1091690, 1128766, 1085714, 1112291, 1125373, 1081873, 1026915, 989551, 980562, 964026, 959324, 924296, 800763, 663433, 536408, 505980, 536380, 533570, 630687, 694300, 772822, 718939, 733929, 710897, 615645, 507148, 444356, 443321, 440421, 491342, 415310, 436447, 374476, 444786, 408992, 476601, 456169, 336466, 306626, 433766, 547332, 409411]
10461D09411m4833J65530o276N0311q114p8435j2505k3323o2143O2903N4219j4054
10449D92691J4413J4935Q3443l4519J3859J4750r4111j08094j12599o3713j6604
10438B04451k5434k3053J34462J4153O0010R2322O6140m592j84722j04013J9602
10427B49326N3138J82588P4j22475Q656m5084o1065j1730M0027K3246J63475J12402
10415E92578l5636q9350r52K4639l9359r8487j1875r1636J4201R1471k0606l8253
10403B96735p4989j9514K9903J1713j50148K3866o4572N8462R750j16200K5379
10392C0385L4504N3560P0600q591l2027j26955Q256J49321p960r3936L8709O2125
10380A77991j21295Q794M0448l1094J13823o7402L6775P1026L2521L0166R510
$$ y = [409411, 364578, 530108, 523832, 574143, 566029, 487594, 475089, 451766, 389623, 452526, 506745, 492691, 507104, 522039, 605482, 570963, 584822, 599572, 505461, 397367, 284768, 221055, 204451, 179017, 155964, 290426, 304579, 364589, 456911, 523051, 518459, 333737, 229724, 249326, 302464, 485052, 485126, 362651, 371307, 326223, 265158, 253428, 293455, 316701, 480176, 592578, 556942, 467592, 466640, 491279, 451920, 353433, 341558, 249922, 264123, 355594, 334988, 296735, 221746, 202232, 232135, 243848, 93700, 117566, 52994, 111456, 121206, 5006, 30385, 64889, 118449, 189049, 180458, 148431, 21476, 29732, 179053, 171093, 77157, 115866, 177991, 56696, 65490, 105938, 74844, 188667, 121265, 158040, 229066, 261587, 291753, 301263]
10369C01263p5326K1023M9638k4236o9617P437k7819K3645o8762K0395P2238K7677
10357B57556J21519O7937p4851M1578n5259j1760k6590j6814R2481O6441j20381
10346C41857j23851M5646P1556j12482O133P3097p3172n757N4943p6584k496M2064
10334B40954j16432M0778J0933j03435r3725l8009R3215M683K7707J05472n8473
10323A13668j45254J0568L0449Q9960Q9998n9884j26116q8865J5044J17970M6955
10312I4493L3948L5427j00116J0237R3994j17123o5192J3052Q8543l8710J0380
10301E8933Q285n5356N6461N4028K0363n9914r9705R0240J62988k511P631l4306
10289B07137j2868k1L407l3446j5218O4409O7457o60J9602J53695M9894j05631
$$ y = [301263, 225937, 246960, 296598, 272362, 202745, 210182, 182363, 206008, 137246, 157641, 229879, 257556, 379075, 447012, 372161, 413739, 358480, 346720, 320130, 303316, 395797, 462238, 341857, 218006, 263652, 335208, 222726, 228859, 301956, 228784, 223027, 277970, 201386, 198890, 240954, 124522, 165300, 176233, 72798, -20927, -58936, 34279, 38962, 66669, 172141, 113668, -31586, -21018, 9431, 99391, 189389, 129505, 3389, -85476, -70432, 47538, 94493, 128441, 163868, 63752, 73989, 167983, 50860, -14332, -1280, 87263, 48553, 58933, 67218, 11862, 68323, 122351, 142714, 82800, -16905, 73335, 236323, 233812, 241443, 207137, 194269, 194248, 197655, 164209, 148991, 213400, 280857, 280197, 299799, 453494, 503388, 397757]
10277C97757n9095l4814k1751m8213M8696r6084k17854n6262P1798M2002M5653
10266G1833J1113k6146l9483L174Q2528q9696J16103R2073q3938j88066j8390
10255f8895N1927Q8644M1869o8068O8472L5524q6604j01360J18888J62660M6255
10244B89312o0170k2882m7912Q3231j01958n0194J32108L6042j35593J667L7603
10233A61254j3028m6362J8676q8517L1198K4457n3222j1787J58163P4219j8430
10222B36621q246q1271n0766r6494N434Q2953Q5361K4772l7242N8258o5893m1812
10210A11675N8481j31067p7105J27508J70442j74191j04443J36153J8772k6772
10200A09453r0491L288Q0000J07176N491p8571k7283o2079n9637J06909R4653
$$ y = [397757, 338662, 303848, 282097, 233884, 282580, 186496, -31358, -87620, -15822, 26180, 71833, 82946, 56800, 17317, 20491, 103019, 13323, 129426, 221499, 137561, -50505, -68895, -16968, 71676, 113545, 45477, 113949, 149473, 62869, -38491, 80397, 243057, 289312, 229142, 206260, 158348, 241579, 139621, 89427, 221535, 257577, 121984, 123651, 161254, 148226, 101864, 120540, 32023, 63221, 87678, 34456, 22669, 180832, 255051, 236621, 228375, 147104, 96338, -156, 5278, 88231, 173592, 198364, 161122, 219380, 153487, 111675, 170156, 39089, -38016, 89492, 259934, 85743, -18700, 117453, 136225, 109453, 18962, 22250, 102250, 209426, 214917, 136346, 109063, 46984, -12653, 94256, 188909]
10189A88909J37229L7538m9790Q7239R5690j1579Q6127N057o2324j08072N6362
10178D62386J06422J57872R55p6775o4713r8351R2168J27881K95017K16231M6526
10167A265619j4835R3289N618j09566l8436j07692j11289J44997N4950O3304K09317
10156A455276K12391J38035j16494l859l510j95459j16547k46698j52344L6350
10146A007141J33826P5900O3214l1345j10543q697p4141l13422j39247l4611J32662
10135G00737J5059j6033M404k4644j03437j24194K5987N6414N9699m6315l9802
10124E07875n3986n2961n4764k5562r1887j85094n2443M1519L6854o1848J3701
10113B1404O2112J51751n250o5942j45793j00222M2196N6890Q9379J18452K9377
$$ y = [188909, 326138, 363676, 313886, 401125, 496815, 485236, 571363, 576420, 514096, 406024, 462386, 568808, 726680, 727635, 650860, 586147, 487796, 579964, 707845, 1002862, 1219093, 1265619, 1250784, 1344073, 1349691, 1240125, 1201689, 1093997, 982708, 1127705, 1182655, 1245959, 1455276, 1667667, 1805702, 1689208, 1685349, 1681839, 1486380, 1369833, 1123135, 970791, 1007141, 1140967, 1216867, 1280081, 1248736, 1138193, 1129496, 1055355, 741933, 602686, 568075, 700737, 715796, 699763, 704167, 679523, 576086, 451892, 477879, 534293, 593992, 547677, 507875, 453889, 400928, 346164, 320602, 228715, 43621, -8822, 32697, 69551, 7703, 21404, 83516, 235267, 230017, 164075, 18282, -81940, -39744, 17146, 106525, 224977, 254354]
10102B54354j02829k3584l9265r8203j4300p6001J16178N361q1534M5616M133
10091a0074J18560J12520j16198j57968J10808P0457K6872p2900K6425Q5384q4069
10080A09817N8472m6348l273K6000M7908Q6133j02792m6076j1082L094k8971K5505
10068A18387J7773Q7272j25786L389k8833J0667l5149Q614l816R1523K11760j80269
10056A75532j66515L5640K4293M6531K327j57555j5762k7578J57106K3996p9273
10045A8742p3415m665J8246L9255o3057k7850J11960O654N5049n2859K8086k6193
10033B9953R4454j6459r218o2166o7207J32323K5187m7382J0632r820j0254n620
10021F4423p362p5752k9289L5596n1651n9410J0026j9081n8500j9798O1910O1069
$$ y = [254354, 151525, 127941, 88676, -9527, -23827, -99828, 16350, 21711, -59823, -14207, -10074, 108486, 221006, 104808, -53160, 57648, 128105, 154977, 82077, 108502, 193886, 109817, 168289, 121941, 118668, 144668, 192576, 278709, 175917, 129841, 118759, 121853, 92882, 118387, 136160, 223432, 97646, 101035, 72202, 82869, 47720, 56334, 52518, 144041, 355801, 175532, 9017, 44657, 68950, 115481, 117808, -39747, -55509, -83087, 74019, 98015, 18742, -54673, -59338, -41092, -1837, -64894, -92744, 19216, 25870, 80919, 28060, 56146, 29953, 124407, 107948, 98730, 36564, -30643, 101680, 126867, 79485, 90117, 80297, 70043, 64423, 57061, -18691, -47980, -12384, -64035, -123445, -113419, -132500, -191000, -210798, -148888, -87819]
10009h7819N8713L9721q6174K9990J53140P99J479o1944j6250j6736m6641n4874
9997h6596J3782o279j9190M7483j3793k9584N5913k7508r1386m3827R9247R4539
9985g199M6977N8358q1523L3644k7745p3272L0579P3761r4265P9992P0614Q298
9973A18219p6045m8337J9996M8896n1021k7921r0141M2448N4834n5957R3218M0867
9961F9056n1642m109p05p9142n5496Q2514O0783O3682J28797l3697j24946o3269
9949h174q3064n1566J9259j09324P3891K528p7723R391R3459P4502N8123J18044
9937A19346q350m2909Q7120J63230R863j8452N5088p3530q3790j73750j42364
9926a08498J235J30533r6831R0074J14915j54334K7302L2530l2482k3883J01541
$$ y = [-87819, -29106, 10615, -75559, -45569, 107571, 108370, 109849, 47905, 31655, 14919, -31722, -86596, -72814, -79093, -98283, -50800, -64593, -94177, -38264, -65772, -157158, -200985, -101738, -7199, 39778, 98136, 16613, 50257, 22512, -50760, -20181, 53580, -40685, 39307, 109921, 118219, 42174, -6163, 13833, 62729, 11708, -16213, -106354, -63906, -9072, -65029, 28189, 69056, 17414, 13305, 12600, -66542, -122038, -39524, 21259, 84941, 213738, 180041, 55095, -8174, -91238, -142804, -123545, -232869, -158978, -156450, -234173, -224782, -131323, -56821, 1302, 119346, 110996, 68087, 155207, 318437, 328300, 309848, 364936, 291406, 207616, 33866, -108498, -107263, 23270, -73561, 16513, 131428, -22906, 4396, 36926, 4444, -19439, 82102]
9915H2102k7209j5925j7008j02944O2242m4088o3228Q468J4650J24496Q1902K0839
9903A24297O0871j9016j05111l3737Q9321L6247q305q1476K1321P6634L2637q9693
9891A03990K3477L5006O9867M8520L321j3253k7813j03131l2625J1648M3203J1310
9879A73520j61072l5406n2854p3371J2909p3790J96213Q4591M3513K872l5719
9868H1406l4080m3911J7331j6248m8223J97007J93661q2803j28197n7700j02089
9857b3846O2577N973m3635R3258l6375k0775J6935j29808r105n062m36M851Q1513
9844c935L2778J78503Q8590n7349M2758J32006o3632j44229o736l2670p969p2120
9832H5995n5711Q3977O421l4366n3026O6624M2472j44245o2130r477K4902Q818
$$ y = [82102, 54893, 38968, 21960, -80984, -18742, -62830, -126058, -117590, -102940, 21556, 103458, 124297, 185168, 166152, 61041, 27304, 116625, 152872, 144567, 63091, 84412, 161046, 193683, 103990, 127467, 162473, 232340, 280860, 284181, 270928, 243115, 139984, 107359, 119007, 162210, 173520, 12448, -22958, -75812, -149183, -136274, -210064, -13851, 70740, 114253, 117125, 81406, 47326, 3415, 20746, 4498, -43725, 153282, 346943, 264140, 135943, 78243, -23846, 38731, 44704, 1069, 94327, 57952, 37177, 54112, -75696, -84801, -89863, -90299, -85448, -3935, 28843, 207346, 295936, 238587, 281345, 413351, 349719, 205490, 198754, 166084, 158115, 85995, 30284, 114261, 120682, 86316, 33290, 99914, 142386, -1859, -63989, -73466, -48564, -39746]
9820c9746J0214r2059p3142J1745L7555j3545J7210N7319J18289P9529P1882k0984
9808A64267p3068L4043k5238j25722n4814L1794J54900J04206P8201N0512L1870
9797C70951P350q2990j15500J11103Q6221m8003K1788l8735P3631J20611J32096
9786F38523J98030N04068P92278J259377K437062L869453M384479K672958N57640
9777A7313868r59013k133488l635682l772663k551945j332039p69850n29290l43223
9768A286675k38280j87667j47138j0112m7769r3961l7580o5633o8535J39682P3204
9757F02886j12099o3933j03942j25167l5019l7617J8070L9879m3199p9956J4155
9746G4058K7534l0639P237J82392K8644p3870m78P1775n0959J04026J5914p2536
$$ y = [-39746, -29532, -121591, -194733, -182988, -145433, -158978, -141768, -84449, 33840, 113369, 185251, 164267, 91199, 125242, 100004, -25718, -80532, -48738, 106162, 210368, 288569, 339081, 370951, 378301, 295311, 179811, 290914, 377135, 329132, 350920, 312185, 385816, 506427, 638523, 836553, 1340621, 2132899, 3392276, 5829338, 9698791, 14083270, 16756228, 17313868, 16354855, 14221367, 10585685, 6813022, 4261077, 2929038, 2159188, 1629898, 1286675, 1048395, 860728, 713590, 703478, 655709, 561748, 524168, 458535, 390000, 529682, 602886, 490787, 426854, 322912, 197745, 162726, 125109, 143179, 183058, 139859, 59903, 74058, 101592, 70953, 78190, 260582, 289226, 215356, 214878, 286653, 235694, 339720, 355634, 283098]
9734B83098j08844l8228k2164N1761J4057p083j07112j38060N2926O69j06156
9723a25136J9585Q4102O7834M1051M8861n7492J9724O4456L9978j504J49693k9308
9711C21844l1591j5754j28406q1569n3049m7233n669q408q3812l0999R1301L8154
9699c5191J14843O4607N7443K9558r1814j5830M488P0593o8141R576k6326N2268
9687A66074J27026j06146o4376k2626N389l1506k1486O884J23085J6763k2739
9676A76342n4481J778k2404m1959m9843l4626q1029N378Q6393J93909J16739j92590
9664A03607r1507l039k1025k8423J889J61745J39728N0442j6443J01176L42468
9653G40618N79387P31896K68524n3687l4780k61804n44021l79100k90592j04292
$$ y = [283098, 174254, 136026, 113862, 165623, 179680, 172597, 65485, -72575, -19649, -18980, -125136, -105551, -21449, 46385, 87436, 136297, 78805, 98529, 162985, 202963, 201459, 351152, 321844, 290253, 274499, 146093, 64524, 11475, -35758, -41427, -49835, -133647, -164646, -73345, -35191, 79652, 144259, 201702, 231260, 139446, 123616, 128104, 198697, 130556, 140132, 113806, 166074, 293100, 186954, 122578, 99952, 105341, 73835, 52349, 59233, 182318, 199081, 176342, 121861, 123639, 101235, 59276, 9433, -25193, -106222, -100844, -14451, 179458, 296197, 103607, 12100, 9061, -11964, -40387, -38498, 123247, 262975, 313417, 296974, 398150, 740618, 1320005, 2051901, 2320425, 2266738, 2231958, 1970154, 1426133, 1047033, 756441, 652149]
9643F52149l3775r3533j49904m3746p2622k3084p2783j18450k0626J14387M5362
9632A83375N4513o5781j29303J5530n4504q3492k7400K7647K52438Q9865L4083
9621B96971m5620m6455j02900l6955l4240O1939J06627K8872o4287p6707J42489
9610B29734J7319j00043o1476O6552k3385r9636m3033K7169P1737k0015L1396
9599I6319O1162m3273M0382L2974k6236j29045p7975O7282K9468n8178r076J6497
9587C01M122m9813K2142J2596P4048K2406M14r8496r6170P2398O332q0693l9736
9574a50149R7999R189K5654n8051R0143J13349j7827l55j28115j04433P0615Q3003
9562C1022p2509p3863J39935K0816m9318o5872k531O1696l2063L1491p1471r8003
$$ y = [652149, 618374, 524841, 374937, 331191, 258569, 235485, 162702, 44252, 23626, 138013, 183375, 237888, 172107, 42804, 58334, 3830, -79662, -107062, -79415, 173023, 262888, 296971, 251351, 204896, 101996, 65041, 30801, 92740, 199367, 228239, 163952, 87245, 229734, 247053, 147010, 85534, 152086, 128701, 29065, -13968, 13201, 84938, 64923, 96319, 157481, 114208, 154590, 187564, 161328, 32283, -45692, 21590, 51058, -7120, -16196, 301, 4423, -45390, -23248, -10652, 63396, 85802, 86216, -12280, -108450, -36052, -29720, -110413, -150149, -52150, -42961, -17307, -75358, 14785, 128134, 110307, 109952, -18163, -122596, -51981, 31022, -41487, -115350, 24585, 45401, -3917, -69789, -72320, -10624, -42687, -11196, -82667, -180670]
9550a80670L5753L6674J29324j699Q0359J68447j3066k2459l0127l1694P622L2505
9538B10969n7156p1497k5795N6326j00032j17681J10521O8507Q65L8071r1736
9527B1362n7798q607k610p1942J41753R4263j76394l9330J13311O4394l7862m2347
9515a807j24476J6382L9239R8375O3321l0448N3557L811j09114O0272r3956j68388
9503a93232j17402L4039Q3388R644R9745J26112r0824k80769k0858K04721K5918
9492a19518L8381l2834N5198R4364M6906N2521O5852r088j40501m5904P709o4611
9480e1525L6109O0633J9504j01783M5591J72164Q0665o9622M6798j9641q7236
9469A31657j30586J0223J09299J3536r6957j3512J16359p2382j26628q9931L0330
$$ y = [-180670, -144917, -108243, 21081, 19382, 99741, 268188, 255122, 232663, 202536, 170842, 178464, 210969, 153813, 82316, 56521, 112847, 12815, -104866, 5655, 74162, 75027, 113098, 21362, -36436, -45043, -47653, -119595, 22158, 116421, -59973, -99303, 14008, 78402, 40540, -1807, -126283, -109901, -70662, 27713, 91034, 60586, 114143, 117954, 8840, 69112, -24844, -193232, -310634, -276595, -193207, -183563, -83818, 42294, -48530, -329299, -350157, -145436, -119518, -81137, -113971, -58773, 35591, 82497, 135018, 200870, 191782, 51281, 5377, 13086, -51525, -15416, 45217, 64721, -37062, 8529, 180693, 261358, 191736, 238534, 218893, 131657, 1071, 11294, 120593, 134129, 37172, 23660, 140019, 67637, -58991, -148922, -118592]
9458a18592M9049J12339J30928M2630p2506p8869J9138P8280k5612p7975j25637
9447f6827P8636J4729j59845M1285r9301l0257J10123N1137J1208K5877J89996
9436A66761O8395j46028p7770m0157M9583J40970J23614j6718p9001j14916N7429
9425A32162J8304m2028p4844p134l893p5242K6253K9736j09444k2338r806r8212
9413b36486P6732R3904k7394N6742N138M7866O6268o62p4100p1478N411O3000
9401D941l8119q9097J32930m6017m8669J1139Q361r922j7046M2514l0303r0919
9389a70207j02146J59185J01392l1877M9702J24192n8737J09375L8684k2987N0717
9378B47293l7670m8047J03037j02223p346j47901J34068J52847k2322R229P8658
$$ y = [-118592, -69543, 42796, 173724, 216354, 143848, 64979, 84117, 162397, 136785, 58810, -66827, 11809, 26538, -133307, -92022, -191323, -221580, -111457, -60320, -49112, -23235, 166761, 235156, 89128, 11358, -28799, 20784, 161754, 285368, 268650, 189649, 74733, 132162, 150466, 108438, 33594, 26460, 22567, -52675, -26422, 3314, -106130, -128468, -138274, -236486, -159754, -65850, -93244, -36502, -31364, 16502, 82770, 82108, 8008, -63470, -58059, 4941, -33178, -122275, 10655, -35362, -84031, -72892, -64531, -74453, -91499, -48985, -79288, -170207, -272353, -113168, -11776, -43653, 6049, 130241, 71504, 180879, 219563, 196576, 247293, 209623, 161576, 264613, 162390, 155044, 7143, 141211, 294058, 271736, 280965, 359623]
9367C59623o0921p0104l8410n7174o7378j8542m6588j8226J24082k7195j0772
9356F8395o3098O7905L4378N6915j9619j23914q3463l5056J22737J64917k1684
9345A68413n7285M5196O2090m7893q6045k701M0285k496J00959Q3912o8166q9411
9333A46858K7588K3011L6838L127L608J03836n923m83j19446j20919n7213O88
9321D1570M9597k8770m2001M9933J25738O5369j44885R6063J65472J5780k0348
9310C73518j03418o0708R7083K9924o8902j5117L1420O4972J34469k0247N093
9299D68087J01950J17504J0167r0698j45545k4772J09326K02123Q9031R5734J33244
9288A066151J08288n1143r8633l2358J16722K18091K45643O6643J4483M260q525
$$ y = [359623, 298702, 228598, 190188, 133014, 65636, 47094, 506, -17720, 106362, 79167, 68395, 5297, 73202, 107580, 164495, 144876, 20962, -62501, -97557, 25180, 190097, 168413, 111128, 156324, 218414, 170521, 84476, 81775, 122060, 119564, 220523, 304435, 236269, 146858, 174446, 197457, 234295, 237422, 241030, 344866, 338943, 338460, 219014, 98095, 40882, 41570, 91167, 62397, 20396, 70329, 196067, 261436, 116551, 212614, 378086, 393866, 373518, 270100, 209392, 306475, 336399, 267497, 252380, 283800, 348772, 483241, 462994, 468087, 570037, 687541, 697708, 607010, 461465, 436693, 546019, 748142, 837173, 932907, 1066151, 1174439, 1123296, 1024663, 992305, 1109027, 1327118, 1572761, 1639404, 1653887, 1658147, 1649622]
9277A649622j232N066j61134n5537P4363J20315l6204l9331j03923m5280n6745
9266A349980r4147k9387n8734J8886j21518L5086M5907n1188p8571q7632o6332
9255H62350j44546n5350O6153l2582J12893L8171j6305j04635k9468L7035n0337
9244F83379j26869N0918m4601L5647J62289q423M4954p3364j38249m138m1317
9233E40226J27453J44517o0180J181K6800J75418K6736j6392J9466P6654J16298
9222A178177R551J3252Q9718Q5720Q3446L2134J13842J43801J4689j24938P300
9211A646692P3332Q0824M0531l6147r1617O3769r4772k9348n7163J3594j06685
9200A503010j87490j3913j13907j95968n5897P2544Q8250j09511j1931n7144j13755
$$ y = [1649622, 1648390, 1653456, 1492322, 1436785, 1511148, 1631463, 1595259, 1555928, 1452005, 1406725, 1349980, 1255833, 1226446, 1167712, 1186598, 1065080, 1100166, 1146073, 1094885, 1016314, 928682, 862350, 717804, 662454, 728607, 696025, 808918, 847089, 830784, 726149, 696681, 733716, 683379, 556510, 607428, 562827, 598474, 760763, 752340, 797294, 723930, 585681, 581543, 540226, 667679, 812196, 752016, 753197, 779997, 955415, 982151, 965759, 985225, 1061879, 1178177, 1187728, 1200980, 1290698, 1376418, 1459864, 1491998, 1605840, 1749641, 1764330, 1639392, 1646692, 1720024, 1800848, 1841379, 1805232, 1713615, 1777384, 1682612, 1653264, 1596101, 1609695, 1503010, 1315520, 1301607, 1187700, 991732, 935835, 1008379, 1096629, 987118, 975187, 918043, 804288]
9189H04288J2428m2385K7174K2601l2880j17177o2787K5408j578r586j6080p3281
9177E36145N2825O8155k5347K2837k3402o2189j3109J4958P4550J9459j25556
9166E39326n8474j7321m5647j9292o0950j5258J24215P4918l3950m3377O035J3185
9154D63410K0186k5087J12827l3582j01512m9263M6955O3421O2774J4445o3133
9143E11441o2758J38914K4069p9332r0864R0930O7992k9798m685j697k8609R3720
9131F29323K1713k5120m0129p0586l5810J6048K4757o8194r4592K0733m9072L2430
9119C61501Q1370O225J0310J20014M355P320k432p6571P0477Q9642O9145j1510
9107G29846k8582p2219q8109j19580J37032R9451m781p6282M5271J7523J392p2037
$$ y = [804288, 816716, 774331, 801505, 824106, 791226, 674049, 611262, 636670, 635092, 625506, 609426, 536145, 588970, 657125, 631778, 654615, 631213, 569024, 555915, 570873, 645423, 664882, 539326, 480852, 463531, 417884, 398592, 337642, 322384, 446599, 521517, 487567, 444190, 450225, 463410, 483596, 458509, 571336, 537754, 436242, 386979, 433934, 497355, 560129, 574574, 511441, 448683, 587597, 611666, 532334, 441470, 532400, 600392, 570594, 565909, 564212, 535603, 629323, 651036, 625916, 585787, 515201, 479391, 495439, 520196, 452002, 357410, 378143, 329071, 361501, 442871, 449096, 459406, 579420, 583775, 591095, 588663, 512092, 582569, 672211, 741356, 729846, 701264, 629045, 540936, 421356, 558388, 657839, 653058, 576776, 622047, 639570, 640962, 568925]
9095E68925p847J08977K9327Q2140m875P43M9536O953j58313n8844L1492M742
9083F52956O0943O5742K9547l4272O0549P5594R6194j06482j9476L7223o079k8960
9071H83479n7627o404k4546J50303O6591n8188K1585m0982q1051K3463Q4913R4616
9059A056152o4406J8119m6850j46211o0894O7879R1880m4116p3699k0038L30k8543
9047G49603L9547M8961m696L4505L1569j00183Q1840P6572r6662K0271J30379
9036A011706J15457J2376M982p0097j9298m103L0970O3816M6631K5673J7779r5918
9024A139974k4845l5599p979P1688J33141L6782J6375K992j31445P1032J15540
9013A387656o4809R4122N3304o3071O9042J36606J84q8909J58335K1663j92898
$$ y = [568925, 561078, 670055, 699382, 781522, 776647, 777390, 826926, 833879, 675566, 616722, 648214, 652956, 713899, 779641, 809188, 774916, 835465, 911059, 1007253, 900771, 881295, 918518, 912439, 883479, 825852, 819448, 794902, 945205, 1011796, 953608, 975193, 934211, 853160, 876623, 961536, 1056152, 991746, 1009865, 963015, 816804, 755910, 823789, 915669, 871553, 797854, 777816, 778146, 749603, 789150, 838111, 833415, 867920, 899489, 799306, 881146, 957718, 861056, 881327, 1011706, 1127163, 1139539, 1144521, 1074424, 1055126, 1051023, 1081993, 1145809, 1192440, 1218113, 1235892, 1139974, 1115129, 1079530, 1071551, 1143239, 1276380, 1313162, 1329537, 1332529, 1201084, 1272116, 1387656, 1322847, 1416969, 1470273, 1407202, 1476244, 1612850, 1613034, 1524125, 1682460, 1704123, 1511225]
9002A511225L4727J55317l2774l3678j00346j5266J05012m4906j1487o699M6059
8991A607184R9949K6993Q11J31817r540j5252k9545j7747J47225k3752j9999M0511
8979A938655J19209J20943L6485J4494l2650M9696J47880J78956K32451j9663
8969B786456M1936L4828k9290N3534M2719M4464Q3943M7951J62319P7415J70975
8958C517250K54895J30177J55887R2338J81633P2411K0698K19125Q7083J75686
8948D907183K29850J16359l8664N3031L19221K95351K26571L43203K12472J31294
8938F795871K53393L85461K19469J58170M05634M69360L63037L16633L19607L32006
8928A0018641M57271M92826L73920M02864M72985O00615P08790P98124Q40790
$$ y = [1511225, 1545952, 1701269, 1668495, 1634817, 1534471, 1519205, 1624217, 1579311, 1567824, 1561125, 1607184, 1707133, 1734126, 1734937, 1866754, 1857214, 1841962, 1812417, 1794670, 1941895, 1918143, 1898144, 1938655, 2057864, 2178807, 2215292, 2229786, 2197136, 2246832, 2394712, 2573668, 2806119, 2786456, 2828392, 2863220, 2833930, 2887464, 2930183, 2974647, 3058590, 3106541, 3268860, 3346275, 3517250, 3772145, 3902322, 4058209, 4150547, 4332180, 4404591, 4425289, 4644414, 4731497, 4907183, 5137033, 5253392, 5214728, 5267759, 5586980, 5882331, 6108902, 6452105, 6664577, 6795871, 7049264, 7434725, 7654194, 7812364, 8217998, 8687358, 9050395, 9367028, 9686635, 10018641, 10475912, 10968738, 11342658, 11745522, 12218507, 12819122, 13527912, 14326036, 15166826]
8919A5166826P25037R04675J022230J088523J134409J213059J333204J371352
8911B3959315J574073J762426J874959K177360K236564K406649K797533L196722
8903D1985601L609884M053740M445818M934775N483534O028465O731987P550230
8895H4824034Q493158R490115J0638930J1824997J3079988J4416139J5731025
8888A68498386J6968462J7872036J8445654J8254077J7583764J5818272J3192215
8881B86632866R722505N838027J746435k328160n858380q771765j0990935j2503119
8873B63487474j3330230j3488381j3174450j2823169j2105733j1188896j0429587
8866A76947028r658188q716961p828768p263194o553173n948291n393464m836869
$$ y = [15166826, 15891863, 16796538, 17818768, 18907291, 20041700, 21254759, 22587963, 23959315, 25533388, 27295814, 29170773, 31348133, 33584697, 35991346, 38788879, 41985601, 45595485, 49649225, 54095043, 59029818, 64513352, 70541817, 77273804, 84824034, 93317192, 102807307, 113446237, 125271234, 138351222, 152767361, 168498386, 185466848, 203338884, 221784538, 240038615, 257622379, 273440651, 286632866, 296355371, 302193398, 303939833, 301611673, 295753293, 286981528, 275990593, 263487474, 250157244, 236668863, 223494413, 210671244, 198565511, 187376615, 176947028, 167288840, 158571879, 150743111, 143479917, 136926744, 130978453, 125584989, 120748120]
8858A20748120m415853l872578l361451l017051k654860k189007j784051j583554
8850I7869715j337850r53413q43922l92706j54029j29897K97224N57042O25724
8841I5537888R64475J287416J567534J961436K233658K730831L136537L585108
8833A13004883M089351M642736N085211N736156O564311P192778P848312Q795122
8825A62958860R897267J1106137J2101498J3201437J4319784J5443957J6479314
8818B55508254J7278598J7628813J7242257J6058717J4223527J1399966P593723
8811C56933855L248761j480754o361684j0742802j4473965j7088049j8901891
8804B91133471j9700941j9594495j9032704j8027092j6673725j5158088j3587254
$$ y = [120748120, 116332267, 112459689, 109098238, 106081187, 103426327, 101237320, 99453269, 97869715, 96531865, 95578452, 94734530, 94341824, 94187795, 94057898, 94355122, 94912164, 95537888, 96502363, 97789779, 99357313, 101318749, 103552407, 106283238, 109419775, 113004883, 117094234, 121736970, 126822181, 132558337, 139122648, 146315426, 154163738, 162958860, 172856127, 183962264, 196063762, 209265199, 223584983, 239028940, 255508254, 272786852, 290415665, 307657922, 323716639, 337940166, 349340132, 356933855, 360182616, 358701862, 352340178, 341597376, 327123411, 310035362, 291133471, 271432530, 251838035, 232805331, 214778239, 198104514, 182946426, 169359172]
8797A69359172j2179118j1282037j0617817j0114532r518985q918599q414820
8790I8313264p582204o837574o093961n331289m918878m398378l904248l394333
8782E5852399l066479k935792k721672k348238k264929k241873k039626j969168
8774C6264622j894944j695291j596249j639728j540147j307197j192897j166950
8766B4231219j062372r52737r05470j047748j007335r32798r02189p48977o31920
8757A6039673n21141n39251o17046n09613m68660m03013n11082o02132n05578
8748A1362157l48310k85935l56757l30919k87985m39596k45039k96487m75884
8739H295245k60461j68045j37413p6508k18322k66018j82066j21483j77911j75060
$$ y = [169359172, 157180054, 145898017, 135280200, 125165668, 115646683, 106728084, 98313264, 90731060, 83893486, 77799525, 72468236, 67549358, 63150980, 59246732, 55852399, 52785920, 49850128, 47128456, 44780218, 42515289, 40273416, 38233790, 36264622, 34369678, 32674387, 31078138, 29438410, 27898263, 26591066, 25398169, 24231219, 23168847, 22216110, 21310640, 20262892, 19255557, 18322759, 17420570, 16671593, 16039673, 15518532, 14979281, 14362235, 13852622, 13383962, 12980949, 12469867, 11867735, 11362157, 11013847, 10727912, 10371155, 10040236, 9752251, 9312655, 9067616, 8771129, 8295245, 8034784, 7866739, 7729326, 7652818, 7434496, 7168478, 6986412, 6864929, 6687018, 6511958]
8729F511958k74006k81430k8755j22625k19416k08167k5670j52938o4657q2752
8719E051542j79392j37559p4265r8281j07938m4348l4583n7497j11515r3715j02457
8708D009992l8273L3398M6723j25806j45474o8188j01756n104M5999j9453r8243
8697C533815j16193l9539q2679o9448j88134j36746L8116j927m4996j17064j72155
8686B603050r2814O8468Q0682j36697n6027P364J533r3109m6142k9786q2640n3105
8674B170777p3061M0228m0475j12494k6156k6065q9890j08342j9225K4983J64840
8663A905120J42314j40680o1123k5092k7147r7783j3289P0080O1204l8776m4266
8652A730562m2931j0035O8998L0848n9621P8947J65618l1368r3793k08756L6257
$$ y = [6511958, 6237952, 5956522, 5927767, 5805142, 5585726, 5377559, 5351889, 5198951, 5134294, 5051542, 4872150, 4734591, 4660326, 4562045, 4454107, 4409759, 4375176, 4317679, 4206164, 4112449, 4009992, 3971719, 4005117, 4051840, 3926034, 3780560, 3712372, 3610616, 3605512, 3651511, 3632058, 3533815, 3417622, 3378083, 3295404, 3225956, 3037822, 2901076, 2939192, 2937265, 2892269, 2775205, 2603050, 2510236, 2578704, 2659386, 2522689, 2466662, 2474026, 2475559, 2382450, 2336308, 2306522, 2223882, 2170777, 2097716, 2137944, 2097469, 1984975, 1958819, 1932754, 1842864, 1734522, 1715297, 1740280, 1905120, 2047434, 1906754, 1845631, 1820539, 1793392, 1695609, 1682320, 1752400, 1813604, 1774828, 1730562, 1687631, 1677596, 1746594, 1777442, 1717821, 1796768, 1962386, 1931018, 1837225, 1628469, 1664726]
8641A664726n5075j30916j82487j1919R8031L5552N7274K1523k282j02536m6313
8630A345578j8442m0174m1368J29358N844q9802p5581J2564J14774O8605l1726
8619A379630j6479j0099O5761o0444j12727K0493j53130j16082K297l0984j15684
8608H52552k4374O9672J04834R483n1518p2554P5616N941M9056j1830M9193m3543
8596A012528j037j1611L2595o2946o0150o9157J33091R0065O1597O7535j8278
8585A174232J380j39808o953k4619J05515M8243J47301q085M13Q4510k9945j21922
8573A230262n9491j9487m2657L3664J4501M1427q1126k4786r7829m2288J919P5275
8561A029384m4594K6216L4420K9890n1337r8373m7685n4223j7780p6201l3173
$$ y = [1664726, 1609651, 1478735, 1296248, 1284329, 1382360, 1417912, 1475186, 1496709, 1494427, 1391891, 1345578, 1327136, 1286962, 1245594, 1374952, 1380796, 1290994, 1215413, 1227977, 1342751, 1411356, 1379630, 1363151, 1353052, 1418813, 1358369, 1245642, 1266135, 1113005, 996923, 999220, 968236, 852552, 828178, 897850, 1002684, 1012167, 960649, 888095, 963711, 969652, 1018708, 1006878, 1056071, 1012528, 1011491, 999880, 1032475, 969529, 909379, 840222, 973313, 1063378, 1124975, 1192510, 1174232, 1175612, 1035804, 1028851, 1004232, 1109747, 1157990, 1305291, 1297206, 1297619, 1382129, 1352184, 1230262, 1170771, 1151284, 1108627, 1142291, 1156792, 1198219, 1117093, 1092307, 994478, 952190, 954109, 1029384, 984790, 1011006, 1045426, 1075316, 1023979, 925606, 877921, 823698, 805918, 729717, 696544]
8550F96544N4652J14047Q9140j83O727l4984j0913J1405J4103j5140l0290L2546
8538I27654K14175J81287K80361N06561Q40040J202548Q68943J16351k41433k16928
8528D679559q32722j112538o54111k77148j82648k09492j07186j88169j11759
8519A003786J5605L3793q3738j47356J8667K003M9242r172m451M4039J9289m4009
8507H97698L4714M9458j09084k1953N0343J11342L1701J00438J0378j8079J1028
8496A147984R7460J04643O2946J25779K73616N84497P78786J835288K743118K009959
8486I764076K84210k30392m08421j682329k064276j318776p30728m33214j76612
8477C003538j68926j12252k03341k03433n5440P736j49842j23809m4218J8450
$$ y = [696544, 751196, 865243, 954383, 954200, 960927, 925943, 915030, 926435, 940538, 925398, 895108, 927654, 1141829, 1323116, 1603477, 2110038, 2950078, 4152626, 5021569, 5137920, 4896487, 4679559, 3846837, 2734299, 2080188, 1803040, 1620392, 1410900, 1303714, 1115545, 1003786, 1019391, 1053184, 969446, 822090, 840757, 842760, 892002, 882830, 878379, 922418, 941707, 897698, 932412, 981870, 872786, 850833, 901176, 1012518, 1044219, 1144657, 1155035, 1136956, 1147984, 1245444, 1350087, 1413033, 1538812, 1812428, 2396925, 3175711, 5010999, 7754117, 9764076, 10048286, 9817894, 9409473, 7727144, 5662868, 4344092, 3613364, 3180150, 3003538, 2834612, 2722360, 2519019, 2315586, 2260146, 2267882, 2118040, 1994231, 1950013, 1968463]
8467A968463L3108R5793j62102l08169j48384j5978k302m0063J11207j7490p1969
8456A442114l4410n5411q1567L6485J53671R111o0777L7928J15795J20327K11443
8445A894709M27603O59106J042628J078563K59532n3130l24029q36586j067826
8436C080570o46862l20564k63013k71310j31575j73505J3253N8214L2888L1345
8426A409441L2175j2235K9154J24509O3056m1515j21361J03678J19797N5314j8410
8415A743603M7047O8724n8868J12253R0860J89014O0137o6978K0459k4864l3575
8404B147812k5917M8471k6733j19166K5428O7599j45504k05384j22723n26K6755
8393A670112K913o5690K34260M10845J098101J412836O57716j18227j46660m35940
$$ y = [1968463, 2001571, 2097364, 1935262, 1627093, 1478709, 1462731, 1460429, 1420366, 1531573, 1514083, 1442114, 1407704, 1352293, 1270726, 1307211, 1460882, 1469993, 1409216, 1447144, 1562939, 1683266, 1894709, 2322312, 2981418, 4024046, 5102609, 5362141, 5309011, 4984982, 4148396, 3080570, 2433708, 2113144, 1850131, 1578821, 1447246, 1273741, 1286994, 1345208, 1378096, 1409441, 1441616, 1429381, 1458535, 1583044, 1646100, 1604585, 1483224, 1586902, 1706699, 1762013, 1743603, 1790650, 1859374, 1800506, 1912759, 2003619, 2192633, 2252770, 2185792, 2206251, 2181387, 2147812, 2121895, 2170366, 2143633, 2024467, 2049895, 2117494, 1971990, 1766606, 1643883, 1643357, 1670112, 1673025, 1607335, 1841595, 2252440, 3350541, 4763377, 5421093, 5302866, 5156206, 4720266]
8383D720266j298527j131154o71875k64838j61651n5408m439j36472j47147j2229
8373H36526q0431q9617N0199K8007M8743j38177k05531L068R8428N123j4177L5602
8361E77763Q0008J8236r193l9696j02730p0185J30454J72606J33660M139q5778
8350H09284p1242p5554o7015L398j05870j62845l1760K2403J59034M8448j50844
8339C77437q6098J4146L2556k1623o6508N330o9591o5689N2336k6487P9630J47053
8327C72492k1989o9649M811L510O1875n5809p3346j41357r9919L1083Q1131K4145
8315A16978j05331Q1564J00197J90472J19589L0341N9352n5956j39826j82999
8305B14381J7680P6360K0250p1827K8425O4304l5402j73184o1599M5502J78184
$$ y = [4720266, 3421739, 2290585, 1618710, 1353872, 1192221, 1136813, 1132374, 995902, 848755, 836526, 756095, 666478, 716677, 744684, 793427, 655250, 449719, 452787, 551215, 556338, 542161, 577763, 657771, 676007, 666814, 627118, 524388, 454203, 584657, 757263, 890923, 895062, 809284, 738042, 662488, 595473, 598871, 493001, 330156, 298396, 320799, 479833, 528281, 377437, 291339, 305485, 338041, 316418, 249910, 255240, 185649, 119960, 172296, 145809, 225439, 372492, 350503, 280854, 285665, 289175, 351050, 295241, 221895, 80538, -19381, 11702, 92833, 116978, 11647, 93211, 193408, 383880, 503469, 533810, 593162, 537206, 397380, 214381, 232061, 308421, 328671, 256844, 285269, 349573, 314171, 140987, 79388, 124890, 303074]
8294C03074J75660j60421j93606n9603L0648J6359R5926j7924p1429q2074L6489
8283G3099K5378l2185q788m1152m0118Q1337M1187O4040p44L7427J6675j8510
8271A97646J20452r7597j1299P5095P9317O5209m3641p7757m3724j80376l3825
8260D9500J4357R6081j7618M781K0347o86K5897p3944j11414P7757N4376O9524
8248B08958o2349L6312Q2517j9779p8285o2204L0775O0742l0127k8096o1841N8150
8236A34773J7120J95303n0848q1030L6331N2367k4448j2055p852K0002P0432r6024
8224B54071p6444m3770K5305J08202k7923L2396k8255K9764N9166r3584j58576
8213H0352Q6435L9792M0685P7920M2252m9295O6093j1958l9090o2348K2124j39078
$$ y = [303074, 478734, 318313, 124707, 65104, 95752, 112111, 208037, 190113, 118684, 36610, 73099, 98477, 66292, 57504, 16352, -23766, 57571, 98758, 162798, 162054, 199481, 216156, 197646, 318098, 220501, 209202, 284297, 363614, 428823, 385182, 307425, 263701, 83325, 49500, 63857, 159938, 142320, 147101, 167448, 166762, 192659, 118715, 7301, 85058, 139434, 208958, 146609, 182921, 265438, 245659, 167374, 105170, 135945, 196687, 166560, 138464, 76623, 134773, 151893, 347196, 296348, 215318, 251649, 304016, 279568, 267513, 259661, 279663, 350095, 254071, 177627, 133857, 159162, 267364, 239441, 271837, 243582, 273346, 332512, 238928, 80352, 166787, 206579, 247264, 325184, 367436, 318141, 384234, 372276, 333186, 270838, 292962, 153884]
8201A53884m3853P0379P3951N5317l3397j1090K0229q7576N6437k546L8120n9280
8189B30575J3931k11172l2820J12209P2054M3527O1224Q5033R182p699p2387p2734
8177B30923j5981j61276q2166o8761L0633J13275P9370N4824L7186q0572k2158
8166A15297M5274q5923k2226m184m6457J58291k019l8061R0783K3269r0221l7372
8154A06451M7479L9446L3586j06612l8047J39609p5873M547Q3269k9209o3699
8143A40947J7135q311p5244k4852J00470m6510M6415O8715j7164j22966o0268
8132A8367J59714o4910o1992o0205l5508M2520m4519J2114L9362Q132J42311J82526
8120C37912l5465k2285q237R467j54724l6363K5264M3252q189j7212J9030j30993
$$ y = [153884, 110031, 180410, 254361, 309678, 276281, 265191, 285420, 197844, 254281, 251735, 289855, 230575, 244506, 33334, 514, 112723, 184777, 228304, 289528, 374561, 383743, 376044, 303657, 230923, 214942, 53666, -28500, -97261, -66628, 46647, 126017, 180841, 218027, 137455, 115297, 160571, 74648, 52422, 48238, 1781, 160072, 158053, 119992, 210775, 234044, 143823, 106451, 153930, 193376, 226962, 120350, 82303, 221912, 146039, 150586, 233855, 204646, 140947, 158082, 149771, 74527, 49675, 150145, 103635, 150050, 218765, 201601, 78635, 18367, 178081, 113171, 51179, -9026, -44534, -2014, -46533, -34419, 4943, 13075, 155386, 337912, 302447, 280162, 271925, 281392, 126668, 90305, 115569, 158821, 150632, 133420, 152450, 21457]
8108B1457j0032J12577Q2226K1117J54135J9544k29385j22601J28357l695k3382
8097A50318O3634R801j42177j9775R749L2429j02756l9426P9887p7828p0548J47242
8085D0550P3414N6172J7609p3191m028K1398o001p4265O1505O5948M9295r7887
8073A30519p7748N1482j4052K207m8329J44425J53504j03805N0102j02234r6042
8062I0029q9475N5014K0602O4974J25084m5302R716l0435j58406k988J21552O5553
8050B25918R3546M9881J9221r0361j05388q6716j4128N1657O1708m4944q8670
8039G1724n0240o8893j15997J44521O4215J29476q7357k0643O9012N3450O3087
8028B52355M8391R060j00361j30336p4560q1384n2902J03754O4330M687Q127N6976
$$ y = [21457, 11425, 124002, 206228, 227345, 381480, 401024, 171639, 49038, 177395, 173700, 150318, 213952, 223753, 81576, 61801, 71550, 103979, 1223, -38203, 41684, -36144, -106692, 40550, 113964, 170136, 187745, 114554, 110526, 131924, 125923, 51658, 113163, 179111, 228406, 130519, 52771, 104253, 90201, 92408, 44079, 188504, 342008, 238203, 288305, 186071, 90029, 554, 55568, 76170, 141144, 266228, 220926, 230642, 200207, 41801, 38813, 160365, 225918, 319464, 369345, 388566, 298205, 192817, 106101, 91973, 143630, 205338, 160394, 71724, 21484, -47409, -163406, -18885, 45330, 174806, 87449, 66806, 135818, 189268, 252355, 300746, 309806, 209445, 79109, 4549, -76835, -129737, -25983, 38347, 43034, 51161, 108137]
8016A08137o2992m5171j4362j6603J25600J09892l770k7744L9407R4011R6587
8005D02992o4552q1092j27657J6843L6277j04856o3796O264R1071J33001N5481
7994B99976K2322N5468N720p2395J4372Q1946O5560P20l3871q6084k3271N4298
7982C84761J2755L2709q6054j6929N8314o7064k5592j4221r4616K7586M9572p536
7970B53685J0151P6718o2973k5670p3160j51807n2132J17182R4550N1311O510
7959B44365L1931p837q9914k1776o8518j06876o2194K6760O8301K8964l2656J06980
7947A17530k1015O8121M3502p4423o2295k7107M6445m2356n7609l2232l4870q4372
7935a60681P6236L6486J3668Q495L7758j0231p4148Q400Q5580R0639q3262k5544
$$ y = [108137, 45145, -26, -14388, -30991, 94609, 204501, 200731, 172987, 212394, 306405, 402992, 338440, 257348, 129691, 146534, 182811, 77955, 14159, 20423, 111494, 244495, 299976, 322298, 377766, 383486, 311091, 325463, 407409, 472969, 473689, 439818, 353734, 330463, 384761, 397516, 430225, 344171, 327242, 385556, 318492, 292900, 278679, 184063, 211649, 261221, 253685, 263836, 340554, 277581, 251911, 178751, 26944, -25188, 91994, 186544, 237855, 244365, 276296, 268459, 178545, 156769, 88251, -18625, -80819, -54059, 14242, 43206, 10550, 117530, 96515, 164636, 208138, 133715, 71420, 44313, 90758, 48402, -9207, -41439, -76309, -160681, -84445, -47959, -34291, -25796, 11962, 1731, -72417, -64017, 21563, 112202, 28940, 3396]
7923C396j2883j73827J2869J81038O0709R171J06856L6625m2402k5155K3260m9598
7911A30059n7771N1416J39883J0481l2761k9235J15450M6547o46p0043q0222q0438
7899A42720j12526M074J05899L2643N794M7454q7563q2743L2940j6090J5351J08906
7887A96859K7437p8639n2278J00159j70661j15778k4081L8237P9609j2500m6480
7876e8116M4642M7563O5475J4056P936n9005K0679m5776j91712P2238J96523N448
7864A19951q8953l5321N7421k0463M6871p9634l9123l0221M6004R1485J06733
7853A74750L0579m9142P3372m5850q6039N910L1039M05l9980j7427m0355L6454
7841G3716P945p1184l4119O5863k3451j07572K2459J15176M6958j11994j5225
$$ y = [3396, -9487, -183314, -170445, 10593, 71302, 80473, 187329, 223954, 181552, 156397, 179657, 130059, 72288, 123704, 263587, 274068, 241307, 212072, 327522, 374069, 373423, 303380, 223158, 142720, 30194, 34268, 140167, 172810, 178604, 226058, 138495, 55752, 88692, 72602, 87953, 196859, 224296, 145657, 93379, 193538, 22877, -92901, -116982, -78745, 864, -11636, -58116, -13474, 34089, 99564, 113620, 121556, 62551, 83230, 37454, -154258, -82020, 114503, 119951, 30998, -4323, 53098, 32635, 79506, -128, -39251, -69472, -23468, 68017, 174750, 205329, 156187, 229559, 183709, 97670, 103580, 134619, 135024, 95044, 77617, 37262, 73716, 81661, 10477, -23642, 42221, 18770, -88802, -66343, 48833, 95791, -16203, -31428]
7830c1428Q6839R1586N6787k2932Q5889O226o772j10593J8500k474l7190o7866
7818F6572m5988p8725j07710m5691Q7375J19724o457J8934O622k3446J37504p5513
7806E3201r0673J00776m4389l5845j3666m518m3966L8954M2710O3003m1457M4674
7794F8804N5044j45918k6538K0865J54098O8527K3768q8945M7232j17983k9508
7783B9446O309n8493o768R5924N8768j4326j8378J21806L0781q6097n029r3178
7771F0765j007m6010L4697j00222N5256j8633J51389K47978l4090j38522n2519
7760A59082O8222M6489L5264k9060r7832o7632q9763M555K5967l4468O7277N0815
7748A38916j43032m2786J00484R1003o0345r6127r869j09757J30094R7746m9817
$$ y = [-31428, 55411, 146997, 203784, 180852, 266741, 272967, 266195, 155602, 174102, 171628, 134438, 66572, 20584, -58141, -165851, -211542, -124167, -4443, -10900, 8034, 14656, -8790, 128714, 53201, -37472, 63304, 18915, -16930, -30596, -35114, -79080, -40126, 2584, 65587, 24130, 68804, 123848, -22070, -48608, -27743, 126355, 194882, 218650, 129705, 176937, 58954, 29446, 35755, -22738, -29506, 66418, 125186, 110860, 92482, 214288, 245069, 158972, 153943, 60765, 59758, 13748, 48445, -51777, 3479, -15154, 136235, 384213, 350123, 211601, 159082, 227304, 273793, 309057, 279997, 182165, 114533, 24770, 29325, 55292, 20824, 88101, 138916, -4116, -46902, 53582, 144585, 84240, -11887, -21756, -131513, -1419, 96327, 46510]
7737D6510r0041l6119R9691J40924Q9212O9782p372o5890N1534L6844j00109N4679
7725B89645J00402j21529p9967J076o4285k2733p0672k3142r9583o1472M3155
7714a09105Q5117J41062K9205o2211k0679P2130N3498o5562p5141k4531K6267
7703E0050J5877r256L5290j72811l9267M3279L3272Q0534K6449j33024k2390K5306
7691f6691k0617M3372P1210K8097M2760J0377N354N3950J45300j2384j2676m7260
7679B40792j53867j02248K080K3744M9472M1972M5121J2676M4562j7267L2098
7668B19135M9782J3331n5665r8548l8892q4784p4063M827J53024M751j14479J1879
7656i702J44345M7703k8156L0738n8907l1850P1156n7858J1512j37872k6931L56
$$ y = [46510, -43531, -79650, 20041, 160965, 250177, 319959, 312587, 246697, 298231, 335075, 234966, 289645, 390047, 268518, 188551, 189627, 125342, 102609, 31937, 8795, -90788, -152260, -109105, -23988, 117074, 146279, 84068, 63389, 135519, 189017, 123455, 48314, 23783, 50050, 65927, 56671, 91961, -80850, -120117, -76838, -43566, 36968, 63417, -69607, -91997, -66691, -87308, -43936, 27274, 55371, 98131, 108508, 113862, 167812, 313112, 300728, 288052, 240792, 86925, -15323, -13243, 10501, 59973, 101945, 147066, 159742, 204304, 187037, 219135, 268917, 282248, 226583, 128035, 89143, 4359, -69704, -64877, 88147, 92898, -21581, -9702, 134643, 182346, 154190, 184928, 126021, 94171, 165327, 107469, 118981, -18891, -45822, -45466]
7644d5466p2119J36205R7465j9337r9850Q4935j5585M1070L3794m3473M0734p3649
7632F4724q8222n7089J2481q425k137m0549N7172J0956P6674L5823o7608l8946
7620d5146l0461L8364m4942o872J33933J45676q6629j85947q4294P6615J16231
7609B6528l3556m7210k5632L8514k9241k1702J99183O9058o4164j62888p0410
7598a21520J6490O1385J2548K1241J21256m6121k7491J47803N0704j7209j07350
7587A11736j67282j7913j683R0327J93012K8512j6312n240k3856p9554p6660j8053
7575A7034n0274L0536j153L555R4815m8195j76279r9503O09J30369J28565J46108
7563A76187l8857j12955m2653K392m6096l0241J08567J60619O9202k01497J0941
$$ y = [-45466, -117585, 18620, 116085, 96748, -3102, 81833, 66248, 107318, 141112, 97639, 138373, 64724, -23498, -80587, -68106, -76531, -78668, -119217, -62045, -51089, 25585, 61408, -6200, -45146, -75607, -37243, -82185, -89057, 44876, 190552, 103923, -82024, -166318, -89703, 26528, -7028, -54238, -79870, -41356, -70597, -92299, 106884, 175942, 111778, -51110, -121520, -105030, -43645, -31097, -9856, 111400, 65279, 37788, 185591, 236295, 219086, 111736, -55546, -73459, -75142, 15185, 208197, 236709, 220397, 215157, 191301, 111747, 35087, 17034, -33240, -2704, -3857, -302, 94513, 46318, -129961, -229464, -228855, -98486, 30079, 176187, 137330, 24375, -18278, -15886, -61982, -92223, 16344, 176963, 246165, 44668, 55609]
7552E5609j333k6119o0314R6159K8025n6305j38885k3813o935k3742J54895M9037
7540D6279k2512l006n268q7393j24626R704Q8014N6247j20421L0953P5844m7479
7528a03664J7712m7698o6198k8631P1350J4732L3872Q0962K8045p267q7108k5057
7516a18950N0652q220J7950l7553l0351L6573K4992J48671J1282p9425o3390N3432
7504E663J00259k1667o7908p5414q7690n9989k4261q741J09426L4212j01076k3202
7492b20388Q8679Q0871k8812N2716j139K7134m0150k6182J9478P8397L0670q0463
7480a9189L3382J20530r0762p4784K619J2076L5269O5038P5777P3136N3614j27672
7468A59034L2777l5653q6198J37040J2559q0025j20631j0673J24329O4503L0680
$$ y = [55609, 54276, 28157, -32157, 64002, 92027, 35722, -103163, -126976, -133911, -157653, -2758, 46279, 23767, 20761, 15493, -71900, -196526, -186822, -98808, -42561, -162982, -132029, -56185, -103664, -85952, -133650, -199848, -228479, -157129, -142397, -108525, -27563, 482, -6785, -93893, -118950, -68298, -76518, -58568, -96121, -126472, -89899, -64907, 83764, 95046, 15621, -47769, 5663, 105922, 84255, 16347, -59067, -146757, -206746, -231007, -239748, -130322, -96110, -197186, -220388, -131709, -50838, -79650, -26934, -28073, -939, -41089, -67271, -47793, 30604, 61274, -19189, 14193, 134723, 43961, -30823, -28204, -16128, 19141, 84179, 159956, 233092, 286706, 159034, 191811, 156158, 69960, 207000, 219559, 139534, 18903, 8230, 132559, 197062, 227742]
7457B27742l7236o1426O328p0456n1074J7920L0911p6933K7719J3925K5566k996
7445D9990j2427j42694l0890N0715K9148Q2611k9783j1010L1079Q2039L4307K8738
7433A61823K2003O0703N8153j04685r6177j4272k3116j15192j55129N5730J07192
7422d2967O7778M0593j3125q7713o170p1691o6897n0510J8572J21794N5215J47629
7410A12508O5424q1608j5037J0888O7309n0650K868J2941R1778n6191j62247j11911
7398a13928R8973R994l056O3912N7179j0825k3335j669k0394N2173p1970n0213
7386a3159m4019q7476M6812k9285k3684o4839J99214J45839N282j18514J416R8731
7374A16318N3795j14494k7218k1295J9077q317l6366j75168p718P2209j142Q8697
$$ y = [227742, 190506, 129080, 135408, 64952, 13878, 31798, 62709, -14224, 13495, 27420, 52986, 49990, 37563, -105131, -136021, -85306, -56158, 26453, -3330, -14340, 16739, 98778, 133085, 161823, 183826, 244529, 302682, 197997, 101820, 87548, 64432, -50760, -205889, -150159, -42967, 24811, 65404, 52279, -35434, -41604, -113295, -180192, -230702, -212130, -90336, -35121, 112508, 177932, 96324, 81287, 92175, 159484, 108834, 111702, 124643, 216421, 160230, -2017, -113928, -14955, -4961, -8017, 55895, 113074, 102249, 78914, 77245, 56851, 109024, 37054, -13159, -57178, -144654, -97842, -127127, -150811, -215650, -16436, 129403, 134685, 16171, 17587, 116318, 170113, 55619, 28401, 7106, 26183, 17866, -18500, -193668, -201386, -129177, -130319, -41622]
7362d1622J16782O720j07079n8697j2752k5542N994N3075K1395P890l0700R847
7350e4689J24480k878l2568l300J04321P4428l6766m1344P7707O7617j29307J484
7338A49185J1812j33389q2401L2295J27804M4018p1559j10525K9634Q0384L8891
7327A16149K4292l1748k831Q650q7393j77060O1212J07096K7601m9841r8115n1397
7315a53385J06455K08768J53074k0212j68947o2600K5774Q9526j32095j10167
7305f3809o6692L1927J32785K5462k0848n1989N2843j9822r375K9601M8690k6592
7293F2181l6713k8980j10842p865m1511j9109M8637N4749L6417J36400P1732P817
7281A72913o3092k0076K2185j9639p6713m1123J67492J2728o0415m3417N9065
$$ y = [-41622, 75160, 81880, -25199, -83896, -96648, -122190, -116196, -63121, -41726, -33836, -64536, -54689, 69791, 66913, 34345, 31045, 135366, 209794, 173028, 131684, 209391, 277008, 147701, 149185, 160997, 27608, -54793, -22498, 105306, 149324, 77765, -32760, -3126, 77258, 116149, 140441, 108693, 105862, 114512, 27119, -149941, -88729, 18367, 45968, -3873, -101988, -153385, -46930, 161838, 314912, 294700, 125753, 63153, 88927, 178453, 46358, -63809, -130501, -98574, 34211, 59673, 38825, -13164, 39679, 19857, 10482, 40083, 88773, 62181, 25468, -3512, -114354, -122219, -163730, -182839, -134202, -79453, -43036, 93364, 165096, 172913, 109821, 89745, 111930, 92291, 15578, -25545, 141947, 154675, 94260, 50843, 109908]
7270A09908K2646M3446m4437q1149p5957j5796k1253m3213O1506O1310j5380N6931
7258E8562k0011M9470p3633K3386R8878P0867r7340j22559N891P0798q6416p4993
7246i7100m1251M0632k1971o1313J999N0634p2418M7248J00138n654L2549J17555
7234I1048o2391J4359o209l2310n9671K3559O4429M0055O4600q2711j34034n497
7222h4773J4806o0177o8067r9175J95141R5968J1932r6445p4645M1181N0871P4854
7210A471o3964r8548J44544P7668K1267j28997j9326Q887n259r6177j88519l4730
7198c81683M0206J2980Q797k2197N2127J11089Q1377m2280j7389L6123j00939
7187b21789J05759O6779j56721j16956M963M6105M8226P585k7255N550L8482K27173
$$ y = [109908, 132554, 176000, 131563, 50414, -25543, -41339, -62592, -105805, -44299, 17011, 1631, 58562, 38551, 88021, 14388, 37774, 136652, 207519, 110179, -12380, -6489, 64309, -22107, -97100, -138351, -97719, -119690, -181003, -179004, -128370, -200788, -153540, -53402, -59056, -26507, 91048, 28657, 43016, 36807, 4497, -55174, -31615, 32814, 72869, 137469, 54758, -79276, -84773, -69967, -130144, -198211, -297386, -102245, -6277, 5655, -90790, -165435, -124254, -73383, 1471, -62493, -161041, -16497, 61171, 82438, -46559, -65885, -56998, -62257, -158434, -346953, -381683, -341477, -328497, -319700, -341897, -289770, -178681, -97304, -139584, -156973, -120850, -221789, -116030, -49251, -205972, -322928, -317965, -271860, -223634, -216049, -243304, -237754, -199272, 27901]
7175B7901K6452m2547j25168j33587O0978P5293M0242q2884r2343J00372l0666
7164a75957P3403J21037l1495P407Q3368l7136r2951P6098p9545j14666O0971
7153a09466K2189J79121j270j12116j01996l2043r8658n891R4060J10415J22798
7142F7143k6195N960l9767p3345p647R5243O2585j06999Q766q9488L0640k199
7130g5303M3420j2269P9442N4058j11178j07756K4674J26201M39j23640q3905
7119a85817p4812Q135J10556J07018L5103Q2061K3523q1567n5217M5189R2285
7108A06457n4268m8984L8552J4720j17136M4626P0484l5380l7391J8041N7344
7097E7065k884O4631m6591R771m9450J7804L948N0716l7375K4055k1032K4111
$$ y = [27901, 54353, 11806, -113362, -246949, -185971, -110678, -70436, -153320, -245663, -145291, -175957, -102554, 18483, -13012, -5605, 77763, 40627, -52324, 23774, -55771, -170437, -109466, -87277, 91844, 90574, -21542, -123538, -155581, -254239, -260130, -166070, -55655, 67143, 40948, 46908, 7141, -66204, -73851, 21392, 83977, -23022, -14256, -103744, -73104, -75303, -31883, -44152, 35290, 89348, -21830, -129586, -104912, 21289, 21728, -101912, -185817, -260629, -252494, -141938, -34920, 183, 82244, 105767, 24200, -31017, 14172, 106457, 52189, 3205, 41757, 56477, -60659, -16033, 54451, 19071, -18320, -279, 57065, 54181, 118812, 72221, 81992, 32542, 50346, 54294, 105010, 67635, 91690, 70658, 94769]
7085I4769n5176o3937r5104o5076R881P219P4626J59057K2783N8928m2906p1061
7073C4003M9463J20123j2718q4641l3447j2414J14159N9524j59049r3270p2942
7062i1209o1180q356l658P2147m6812R6280J1843J28105m3694n7961P2470K7621
7050I5596k6670J858j51535J9265R6656n6900M1841J8639p304Q0383P5386k1408
7038A65807j77696j3062L4730l0934M9440P1994j44106j1979j8150O511n4656
7027a22101O6980O4342j1738P182J03779r1184M7296m2055j96962m8412j4249
7016b37122m483J37325Q0255j1029L7283m2403j4129m0999j28124O3474R2247
7005f7705N0366P2913L4495J2413n462l4186Q978R834j56023l7435n9228l9622
$$ y = [94769, 39593, -24344, -119448, -184524, -174643, -167424, -92798, 66259, 89042, 147970, 105064, 34003, 83466, 203589, 190871, 106230, 72783, 60369, 174528, 234052, 75003, -18267, -91209, -152389, -160745, -164403, -92256, -139068, -42788, -30945, 97160, 53466, -4495, 67975, 95596, 68926, 70784, -80751, -61486, 35170, -21730, 20111, 38750, 31446, 111829, 187215, 165807, -11889, -24951, 9779, -21155, 28285, 100279, -43827, -55806, -73956, -67445, -122101, -55121, 9221, -2517, 4665, 108444, 17260, 64556, 22501, -174461, -222873, -237122, -241605, -104280, -24025, -35054, 2229, -40174, -54303, -95302, -223426, -159952, -67705, -17339, 55574, 90069, 102482, 97020, 62834, 71812, 81646, -74377, -111812, -171040, -210662]
6993b10662P3993J08652k0894j5653n9754R621q2022K7833J23654N3623M3844
6982E2235J09124Q152k9732j64543j59055o4311J9013N2598J76076J0969p6027
6971f5501R2104j8698j08867r2127P3415O2102M605L5486J8605j06293j1195M6119
6959g0245r0451R2085R865P2504J1999Q6024M0446n9296j22818o9122k7070L3789
6947i2290L1232N9203P5855o0789j56318J02900k7493J15546M6395j8311m7809
6936B8121n5082o0606J38170K7878q7511o8963j04012k0847J44776N244k9443
6925h2275m0371L2141k7715K2075J0128P937Q918j4132J61023M2537Q712m8743
6913H0235m2759m5169j35730l4404N8008R6117K6327N0806M6068p5618p3478J91091
$$ y = [-210662, -136669, -28017, -48911, -64564, -124318, -114697, -196719, -168886, -45232, 8391, 52235, 161359, 169511, 139779, -24764, -183819, -248130, -229117, -176519, -443, 10526, -65501, 26603, 7905, -100962, -193089, -119674, -57572, -52967, -17481, 1124, -105169, -116364, -70245, -160696, -68611, -58746, 13758, 25757, 111781, 152227, 92931, -29887, -99009, -126079, -92290, -61058, -1855, 74000, 13211, -143107, -40207, -67700, 47846, 94241, 75930, 28121, -26961, -87567, 50603, 78481, -9030, -77993, -182005, -202852, -58076, -52832, -82275, -122646, -90505, -118220, -96145, -86017, -78080, -69162, -83294, 77729, 120266, 128978, 80235, 37476, -7693, -143423, -177827, -119819, -23702, 2625, 53431, 99499, 23881, -49597, 141494]
6901A41494k5560m1782j58880r6555m6966M7457Q3704P5324j906O010M726l049
6889a5983j30836j249J42868N5162r0213o693j5870J528R8211J1519K1153n8044
6877A1553O4952M087r2958k7010J7355O3548k7592j6942k3871l2698o1439j3940
6865a34955N3581M4628o4747m305o2083m1607M8809J22540J8470r137k5025J30858
6853G7027J04280j78251r5581l8208N9337K2752j57592o5114J21893R6803o58
6842e3312Q6970J79552K9953j11398p7526K4728K4212j35725r5183j9257N3432
6831i3554K225q0443N7572R1071O600n6081n3207q779J61124L8451m4880l7211
6819a7112l7174m417K4491j03432J5804O0417J808R5118K4936j4994l0127l4285
$$ y = [141494, 115934, 74152, -84728, -181283, -228249, -180792, -97088, -21764, -23670, -17660, -12934, -15983, -146819, -148068, -5200, 49962, -40251, -46944, -62814, -61286, 36925, 48444, 69597, 11553, 76505, 80592, -12366, -39376, -22021, 41527, 13935, -3007, -26878, -59576, -121015, -134955, -81374, -36746, -101493, -105798, -167881, -209488, -160679, -38139, -19669, -28806, -53831, 77027, 181307, 3056, -92525, -130733, -71396, -48644, -206236, -271350, -149457, -52654, -53312, 33658, 213210, 243163, 131765, 54239, 78967, 103179, -32546, -127729, -146986, -93554, -91329, -171772, -114200, -23129, -16529, -72610, -125817, -134596, 26528, 64979, 20099, -17112, -54286, -58703, -34212, -137644, -121840, -61423, -59615, 35503, 60439, 45445, 15318, -18967]
6807a8967m6050m4867J9090Q8300P4336o0140R949o5901j51120j1946J58485R2660
6795D3829j476j43839m4987Q2818J6391k562j59302o9399k0797J12271J22186
6784f4867J52692N6588j38319r1193n5115p3926L5591N7761M6638N967m4394j78810
6772b91387n2094R2955J05602m9309M2424O3335q639j12992j1346n229O838j0822
6760b30664p3550J3239O0776N0510K2410R2825L2209m4841p2764K8569l1742n7162
6748b10185J14459K9723J47827M8745n5234q4509K5007m3418R6633K489L6505
6737A08042O1961J2116M4782r6491o7000j15581j80029p6864J20528J48576m626
6726d4586j66180l6646Q4197P8692K7292L2711j8114J8258q1924o0564R6414m0164
$$ y = [-18967, -65017, -109884, -90794, -2494, 71842, 11702, 21651, -44250, -195370, -207316, -48831, 43829, 42353, -101486, -146473, -63655, -47264, -49826, -209128, -278527, -299324, -187053, -64867, 87825, 144413, 6094, -85099, -140214, -214140, -178549, -120788, -74150, -68183, -112577, -291387, -343481, -250526, -144924, -194233, -151809, -88474, -97113, -210105, -221451, -226680, -219842, -230664, -304214, -290975, -230199, -179689, -157279, -64454, -32245, -77086, -149850, -121281, -153023, -210185, -95726, -66003, 81824, 130569, 75335, -9174, 15833, -27585, 69048, 71537, 108042, 170003, 182119, 226901, 130410, 63410, -52171, -232200, -309064, -188536, -39960, -44586, -210766, -247412, -163215, -84523, -57231, -24520, -42634, -24376, -106300, -166864, -70450, -110614]
6714a10614n653O8074J60551n4704p5073P7093J40296l4416j09922l5266l7127
6703a6761P8022J01473L7862j60020j74544j2579k7461O4274O1K5971K8962K4584
6691c0156L3192m379P0808j7982p6230m5511j44939L9291P1205J30237M5890m5581
6679B5845q0997R1146J23571l0811m8983M5592L3476j7697k05827j38967J20421
6668h3231J06136P5347L6851k470j42896j51390J7333L5419J70856J23882J3349
6657A99186j54329j07757p0157O5856J22346o784L7192J10721r2583m7759O5865
6646A21797J9049K02P6776p2919r4217M8482j31414k0059j4316K7064N6613N9031
6634G6089j9228O7435J01972o9423j65337j10785N239n9113J3427k8145k9069
$$ y = [-110614, -116267, -48193, 112358, 57654, -17419, 59674, 199970, 165554, 55632, 20366, -16761, 61261, 162734, 200596, 40576, -133968, -146547, -174008, -109734, -109673, -83702, -54740, -30156, 3036, -1343, 69465, 51483, -24747, -70258, -215197, -175906, -104701, 25536, 71426, 25845, -55152, 35994, 159565, 128754, 79771, 125363, 158839, 141142, -64685, -203652, -83231, 22905, 98252, 135103, 132633, -10263, -161653, -144320, -108901, 61955, 185837, 199186, 44857, -62900, -133057, -67201, 55145, 48361, 85553, 196274, 103691, 55932, 121797, 140846, 141048, 217824, 144905, 50688, 99170, -32244, -52303, -66619, -39555, 17058, 76089, 56861, 124296, 226268, 156845, -8492, -119277, -114038, -173151, -159724, -187869, -216938]
6623b16938j3169Q9796O2938N8727K7378Q2090J0801k4646q7513l0669k3422J5692
6611d8935j1047J71627M4643j95581j15723L1728K44291P2212j41241k7851p8215
6600e4092N7692K298j09811j8032l8448P9153J24744n3154J5028O8624R487l7171
6588D6318Q4487J36078o3295j36272m0420j0539p1512r0532p6376K7854Q1892
6577a12317j5902J57199K9436j2144J6541j6591J1284M293O6070n4407O0674J21215
6565B55351r3414n0329o7191p6643m458r568L341L0350k3071p8428M2706j0357
6553h1711R4198N7139j18950p0108J0283m4448J10425J92333k5937j46641j3668
6542c7085j7777l3991l2734k2763Q3624J53830O5608k5954j5077j36631j4977
$$ y = [-216938, -230107, -140311, -77373, -18646, 8732, 90822, 101623, 76977, -10536, -41205, -64627, -48935, -59982, 111645, 156288, -39293, -155016, -123288, 121003, 193215, 51974, 24123, -54092, 3600, 5898, -103913, -121945, -160393, -81240, 43504, -9650, 5378, 74002, 83489, 46318, 130805, 266883, 203588, 67316, 26896, 16357, -55155, -145687, -222063, -194209, -112317, -128219, 28980, 58416, 46272, 62813, 46222, 57506, 61799, 127869, 73462, 134136, 255351, 161937, 111608, 44417, -32226, -36684, -46252, -42911, -12561, -35632, -114060, -71354, -81711, 12487, 69626, -49324, -119432, -109149, -153597, -43172, 149161, 123224, -23417, -37085, -54862, -88853, -121587, -144350, -60726, 93104, 158712, 132758, 117681, -18950, -33927]
6531c3927K13362J29356J2454p5368K7620J38428j34235j84339K5685M0238J5439
6520A74713l6878p5321l7658j12517m3874j16653r168J62849N8380J00087K5644
6509H9604r8816o8602m58J06682l768m2840m5313o0656Q7526J01354j13393N455
6497d3225n063j4319M9440K2403P6175m222k2182R7314K7260l8589L8261N6752
6485B40005o8479m5519m125o3665O4500Q4967r2719l2836K0527K6712K3081o3784
6473H8665p92L9083Q2540j28168q0647j5571K7118o1787p0486P1581k1623j62657
6461b32744J14566J39354M2652l5147k2993N5841l4670j41478m999L61K4656J26214
6449C1613L0982J9202n25r3249j36553l7037O4591R8599R9579O7812n6842q2345
$$ y = [-33927, 179435, 308791, 321245, 245877, 273497, 411925, 277690, 93351, 119036, 159274, 174713, 137835, 62514, 24856, -87661, -131535, -248188, -257356, -94507, -36127, 63960, 89604, -9212, -77814, -78272, 28410, 24642, -18198, -63511, -124167, -36641, 64713, -48680, -43225, -48288, -62607, -13167, 9236, 85411, 81189, 59007, 156321, 183581, 144992, 183253, 240005, 171526, 126007, 121882, 58217, 122717, 207684, 114965, 82129, 102656, 129368, 152449, 88665, 87873, 126956, 209496, 81328, 681, -14890, 12228, -49559, -120045, -48464, -70087, -232744, -118178, 21176, 63828, 28681, 5688, 61529, 26859, -114619, -119618, -119257, -94601, 31613, 62595, 81797, 81272, -11977, -148530, -185567, -120976, -22377, 77202, 145014, 88172, 5827]
6437E827J15124j0506j3628K9106j09367j53017J45024J27586n5069R3154j09417
6426F4817L3929k6431n0415Q503k4508J00249J9392m8760k1871j4320q0374J44233
6414A04444J76327q7710q0418m3688k0520K4750M1477k0198O0785m4618q4774
6403B5857K3834R3705K9952j11532o2463M8983P1814r5968R757o1524m7664Q6546
6391A1297O7311J20679K8747K5024j01774j60572o0173J0984O2519J08810M539
6380A17391j32563J2690j3341p7582J34571N2448j37344n8256M8875M2467j63832
6369a74476J6596J32476k0370m2305k2790m3185o3558j12410P4484l8784P9918
6358b14404m7836j06074P5609J30983J3237Q2218K3257j57592j6839J04745L4748
$$ y = [5827, 120951, 110445, 96817, 125923, 16556, -136461, 8563, 136149, 81080, 174234, 64817, 98746, 72315, 21900, 30403, 5895, 106144, 125536, 76776, 54905, 40585, -39789, 104444, 280771, 193061, 112643, 68955, 48435, 73185, 114662, 94464, 155249, 110631, 25857, 49691, 143396, 173348, 61816, -647, 48336, 120150, 24182, 33939, -27585, -75249, 11297, 78608, 199287, 228034, 253058, 151284, -9288, -69461, -58477, 4042, 112852, 117391, -15172, -2482, -15823, -93405, 41166, 93614, -43730, -101986, -53111, -10644, -174476, -157880, -25404, -45774, -88079, -110869, -154054, -217612, -330022, -255538, -294322, -214404, -262240, -368314, -292705, -161722, -148485, -66267, -43010, -200602, -217441, -112696, -77948]
6347g7948O7631P5052m7007j2278J49354n5354m9958l4892n1166q551j60187j0405
6335b15709k096l4427J06836P049Q5666Q4441J5529p1670j85161j04373M5733
6324b68182L5055L369R6906K6228R1945k140j658J3159j00367M1116K3476j17054
6312a58147L4502J0868m5144n8541n0883J44073L5992k4162J57378M9627n8005
6301C7558o3753M467J0737N5266J75971l3400l5279r8846n5393J49906j1133j33632
6289B469q5827j5520J18646P7007o4449L87K3347q692K2782O7318n0174j47870
6277f0576K7427m3873K3751L4907L7865J8608N7360m061j03727n1748J5083O2068
6265A3084j8514k1512J0763R4187n1916j43733P5420j5210n0834K1487o3624m2218
$$ y = [-77948, -10317, 64735, 17728, 5450, 154804, 99450, 49492, 14600, -36566, -45117, -205304, -215709, -217805, -252232, -145396, -138347, -52681, 31760, 47289, -24381, -209542, -313915, -268182, -233127, -229758, -132852, -106624, -14679, -16819, -18477, -5318, -105685, -64569, -41093, -158147, -123645, -112777, -157921, -216462, -267345, -123272, -87280, -111442, 45936, 95563, 37558, -26195, -21728, -10991, 44275, 220246, 186846, 151567, 52721, -2672, 147234, 136101, 2469, -83358, -98878, 19768, 96775, 32326, 32713, 56060, 47368, 70150, 137468, 87294, -60576, -33149, -77022, -53271, -18364, 19501, 38109, 95469, 91408, -12319, -64067, -48984, 13084, -5430, -26942, -16179, 78008, 26092, -117641, -42221, -57431, -108265, -86778, -150402, -192620]
6253a92620J80646J30269J6974n5986j1383j7769k0982P1174O7668L4830j61586
6242D1235j34424P4120o2147m7043R9476M6892K5180o7812j03970J551J18898
6231h044J1789K0113m2495o9825O0201m8068m5930o7723J94055J50748l8132J5621
6219A32310m3845n4146m6180R445J1427j72574n0191M5008r0848J6998J15678
6208a26918j42657J16174J63823J03008O9112P3909j62528l4375o2777j03876
6198a07105J9749o3162N5196L1133P4134K6882p2812j3644p3158j3522J4665J50303
6186B8659L8490J14163l9183q8142j1785j43806o8035N2242j8575j888K3370P3532
6174d0958j19474k8289J29349J5183q4632l8939K3789L9778P0256M0856l1445
$$ y = [-192620, -11974, 118295, 135269, 79283, 67900, 50131, 29149, 100323, 167991, 202821, 41235, -93189, -19069, -81216, -128259, -28783, 18109, 43289, -24523, -128493, -126942, -8044, 3745, 23858, -18637, -88462, -28261, -76329, -122259, -189982, 4073, 154821, 116689, 132310, 88465, 34319, -11861, -2416, 9011, -163563, -213754, -168746, -259594, -242596, -126918, -269575, -153401, 10422, 113430, 182542, 256451, 93923, 59548, -3229, -107105, -87356, -150518, -95322, -64189, 9945, 36827, -35985, -49629, -122787, -136309, -121644, 28659, 67149, 181312, 142129, 53987, 42202, -101604, -169639, -117397, -135972, -137860, -114490, -40958, -160432, -188721, -59372, -44189, -128821, -167760, -143971, -104193, -33937, 6919, -24526]
6163b4526M8526k6017j05132P865M9686P8126R8735k3417o8491n1904j42144k4843
6151a83536P0189P4871k5371M107J11994L4074q2692j02164J19327n257L2980
6140D8522J06200n4829j22921k6567q9373P3707o5600o4141O1172N3311Q2169
6129A650M0512O5036M1027J8571l0133q6973j39407L800N8451r320m2176j2170
6117i1132O3055L6597M24j2382Q9558J31907j4818q1155l309j72372K6502J16985
6105H9860j1507k8149m812j5992O399J8882k9898q1732O9819O996j6894o6092
6093f3120l7541k3116R6672J36848j69780j74494J5660J38377M7694k5196R1974
6082C3978m3458k7688L0315l4552n5821K7818M2819L0581k7258m7531j10717J58086
$$ y = [-24526, 24000, -2017, -107149, -99284, -49598, 28528, 127263, 103846, 35355, -16549, -158693, -183536, -113347, -38476, -63847, -59740, 52254, 86328, 3636, -98528, 20799, 15542, 48522, 154722, 99893, -23028, -49595, -138968, -65261, -130861, -195002, -133830, -80519, 1650, 42162, 107198, 148225, 166796, 136663, 49690, -89717, -85917, -27466, -36786, -78962, -91132, -28077, 8520, 8944, -3438, 86120, 218027, 203209, 122054, 118745, -53627, -27125, 89860, 78353, 50204, 45392, 29400, 35799, 54681, 24783, -56949, 12870, 19866, 2972, -63120, -100661, -123777, -27105, 109743, -60037, -234531, -218871, -80494, -32800, -57996, 33978, -9480, -37168, -6853, -41405, -97226, -69408, -26589, 3992, -23266, -70797, -181514, -23428]
6070b3428J30728p1697O85M8536p5081p2363N7524l8655N6218O8630j00722j17642
6058a37267O6158J20019L6770N0954o2273p6159J47422j11268k8452N2050J45654
6047B03608J22079o0598j31941j39178j8453K9894q2083k9178j3986q9104K2829
6036a86111J20858R6677j2538p3129j04722L1747l9556m663k4335J52929m8578
6025i1421J3654O7411M6445K8016j3038o4792j2112N0129P6285N4863n1781J11478
6013B15137P7327l0409j84410r9982l9487j0241n8918P5214P9818J01741l0810
6002I4980l2213P3000l7769k8029N4160K9493n1304J1520r4562n0916p6155P6275
5990c1520L7495L2293n820m7824r5884P7236N682k2199n1805m6631J8194L0919
$$ y = [-23428, 107300, 35603, 36288, 84824, 9743, -62620, -5096, -43751, 12467, 81097, -19625, -137267, -71109, 48910, 85680, 136634, 74361, -1798, 145624, 34356, 5904, 57954, 203608, 325687, 265089, 133148, -6030, -24483, 5411, -76672, -105850, -119836, -208940, -186111, -65253, 31424, 18886, -54243, -158965, -127218, -166774, -171437, -195772, -42843, -91421, -77767, -10356, 36089, 64105, 51067, -13725, -25837, 24292, 100577, 155440, 103659, 215137, 292464, 262055, 77645, -22337, -61824, -72065, -130983, -55769, 24049, 125790, 94980, 62767, 135767, 97998, 69969, 124129, 153622, 102318, 113838, 19276, -31640, -107795, -31520, 5975, 38268, 32448, -15376, -111260, -34024, -28342, -50541, -102346, -148977, -130783, -99864]
5978i9864Q336L3773N0416O3202j34163r1502L633J22118K7977J3283L8091J1068
5966D6368o5181P943J3105N3025r0967p3460Q7899J77816q606j03458k7659l8943
5954b2118j6414n2228J16859P3844N7880k2636l3159j55762K996k8961o8011L7342
5942a10368j2619j1586m9196n335O5260N8421J54182l5192j22437m464L3009m6773
5930h7098J31339m4285p1205P6406L9499j51n3048l5810R484r5003m4861O0574
5918a14159J33005L7512j6524r4548j34917k0187J5542O6527J91977J6412l7220
5907D3420l6358M7762r1315p4182k9416Q9146Q3160M8995K7892j19975j17340
5896a28211P7618M6137K6074J3373l089k5455m5659n8999Q7378Q4223m010p2885
$$ y = [-99864, -91528, -57755, -7339, 55863, -78300, -169802, -166169, -44051, -16074, -2791, 35300, 46368, -18813, -10870, 2235, 55260, -35707, -109167, -21268, 156548, 147942, 44484, 16825, -22118, -38532, -90760, 26099, 99943, 157823, 135187, 102028, -53734, -50738, -79699, -147710, -110368, -122987, -134573, -183769, -189104, -123844, -65423, 88759, 53567, -68870, -73334, -40325, -87098, 44241, -44, -71249, 5157, 44656, 44505, -8543, -44353, -34869, -129872, -174733, -114159, 18846, 56358, 39834, -54714, -189631, -209818, -194276, -127749, 64228, 80640, 43420, 7062, 54824, -36491, -110673, -140089, -50943, 32217, 81212, 109104, -10871, -128211, -50593, -4456, 21618, 34991, 31902, 6447, -39212, -98211, -10833, 73390, 69380, -3505]
5884c505n6489j2443P0686j10253n1975J26342M0486j32069p4501M0378j4232
5873a77575M5798l1609J2670J33137R0776R1660K8335n2650l0806k6063r2479
5862h806K4691n7322N9395K6793K5647p5551j80507q4777P8087J83758j51911
5851a60503n9586J64369R5972k019m9355p2841n9675o3227M3686J97203J45239
5840A79263p8914M106J26743j00378k06511L3665P0088p0294P2627o3610o4180
5829i7395M6183K1884o9059m1642J464J01052O5680N9998P276j47933j1912K28012
5817A63608n6683o5286N3227j6734q5678j37235M1136J10156n6054q2232k3730
5806a55505p8967p830P6137R2563m8228n932L6659n2501M8483J002q7398N8930
$$ y = [-3505, -59994, -72437, -1751, -112004, -163979, -37637, 2849, -129220, -203721, -163343, -177575, -131777, -163386, -150716, -17579, 73197, 164857, 193192, 140542, 109736, 83673, -8806, 15885, -41437, 17958, 44751, 70398, -5153, -185660, -270437, -192350, -8592, -160503, -220089, -55720, 40252, 38233, -11122, -83963, -143638, -206865, -163179, 34024, 179263, 100349, 104455, 231198, 130820, -75691, -42026, 28062, -42232, 30395, -33215, -97395, -51212, -29328, -98387, -140029, -138565, -37513, 28167, 88165, 95441, -52492, -64404, 163608, 106925, 41639, 94866, 78132, -7546, -144781, -103645, 6511, -49543, -131775, -155505, -234472, -242302, -166165, -73602, -121830, -127762, -91103, -143604, -95121, -94119, -181517, -122587]
5794a22587k9351K4025J25252M1974m7537p4701j6131j4003m7376R006L6336o5378
5782a80471J16865J06988J04725j13090j23243r9437N8500O8949O6333K0886l2778
5771e773l4718k1244O4759M9216m948K5930m3831q9170n9055N0706j9359q0731
5759a68218Q4019L6621N684k4154J3839J15158L680q4837j2102j8637n64J9102
5747c0409J6101l0883j2922Q280n391p9188l6815K4454J29369L1922o2869n9393
5735a07744P0261J13364P4711o2603r5872P530Q4208J59907L5163j47847p6337
5724E4741j28577J1063J26761K1456o4744m803j01829j46272J33461Q3894p6828
5713i1677p0415N1172L4532J5016m556Q2039O4169j19072j45881l9314Q2445J12154
$$ y = [-122587, -151938, -127913, -2661, 39313, -8224, -82925, -99056, -113059, -160435, -151429, -115093, -180471, -63606, 43382, 148107, 35017, -88226, -187663, -129163, -60214, 6119, 27005, -5773, -40491, -61735, 3024, 52240, 47292, 73222, 29391, -59779, -118834, -68128, -87487, -168218, -84199, -47578, -41894, -66048, -52209, 62949, 66629, -18208, -30310, -48947, -49511, -30409, -14308, -45191, -58113, -49833, -55224, -134412, -171227, -146773, -17404, 14518, -48351, -107744, -37483, 75881, 150592, 87989, -7883, -353, 83855, 243762, 278925, 131078, 54741, -73836, -62773, 63988, 85444, 20700, 15897, -85932, -232204, -98743, -14849, -91677, -162092, -110920, -76388, -61372, -65928, 16111, 80280, -38792, -184673, -223987, -141542, -29388]
5701b9388j1298O0332J9760K8477N5693j29223p5653J02743k6363q1121l1903
5690a17944J1802p2600r2752M8004Q1540J12057N4574Q3798j02389o1515M3380
5679a2045J2941j0799Q388m5933J2908R5454q2349M9286R8041Q5728o2091n8397
5667I1132m3808l0597J7784q9074l1325J16555N3371q3305j80505L5997Q0978
5656f2797p396K945J15334K7285Q2269J0103J0783L5847N5006j75718p3566J3237
5644C3332r8323n4327Q2165K5463Q530O4722l1255O9310J05133L1503r8925k0921
5632A16407n2311l5879J5100K3285j44353j01995J6432M7534J1608J01447J64996
5621A62271P289l8640j91153J9844J22230R6184K5382m5905l0994n9526l4474
$$ y = [-29388, -40686, 19646, 39406, 67883, 123576, -5647, -81300, 21443, -4920, -86041, -117944, -106142, -178742, -271494, -223490, -141950, -29893, 24681, 108479, 6090, -55425, -12045, 896, -9903, -1515, -47448, -34540, 60914, -21435, 27851, 125892, 211620, 149529, 91132, 47324, 16727, 34511, -54563, -85888, 30667, 84038, 733, -179772, -143775, -62797, -70193, -67248, 48086, 75371, 157640, 167743, 178526, 214373, 269379, 93661, 20095, 33332, -64991, -119318, -37153, -11690, -3160, 61562, 30307, 99617, 204750, 236253, 137328, 116407, 64096, 28217, 43317, 66602, -77751, -179746, -163314, -115780, -104172, -2725, 162271, 169560, 130920, -60233, -40389, 81841, 178025, 203407, 157502, 126508, 66982, 32508]
5610C2508L1109p2688J828K5208k3682J9859M2817n4887j23872l6420N9632J53657
5598E5069L0194L5293j16462p5980j9990q1140n8875J83173j9493p7542N2789
5587i2964r616J1138N9038J25285o932n2907M7673j3084k08452L2735P0521R4519
5575E6954j2825j30089m6414N7370M3388j08893o1248n5317J06341L4210j2051
5564a28574j724O1693q2296l3984o292J34030n7912j47357Q8451J54808R7341
5553G8184q0023P3824O5014N3358J10777j00511k39675r3015O4654p6098j12936
5542b56447M5216P5841q5067p0108N3380Q2329J9490K1307M3790P8556j3404k8702
5530c3819j6470k06859R526N1197J54579j98J02918K0905K4794j24167j5109K2775
$$ y = [32508, 63617, -9071, -7243, 17965, -5717, 14142, 56959, 2072, -121800, -158220, -98588, 55069, 85263, 120556, 4094, -71886, -91876, -173016, -231891, -48718, -68211, -145753, -92964, -102580, -91442, -32404, 92881, 85949, 33042, 80715, 67631, -140821, -108086, -37565, 56954, 44129, -85960, -132374, -75004, -31616, -140509, -201757, -257074, -150733, -116523, -128574, -130298, -68605, -150901, -184885, -191177, -57147, -115059, -262416, -173965, -19157, 78184, -1839, 71985, 136999, 190357, 301134, 200623, -39052, -132067, -67413, -143511, -256447, -211231, -135390, -220457, -290565, -237185, -154856, -135366, -114059, -70269, 8287, -5117, -33819, -50289, -257148, -247622, -196425, -41846, -42044, 60874, 81779, 106573, -17594, -32703, -9928]
5518i928o481J0638M5981O7834j2089k9729K7571n4312O1963J7833L13m2046n2088
5505B5460j54694j9769m7821O5548J02002N1089O7028k4845j42719o3213n0909
5494a92843J750N3303K5830N3492o9501l0374P4719k5749o644J25509j1430r067
5482a1005j37335o3481J27267N4807j31391r4627J33461P5856o4868J6838J24284
5471B9806J2291L0862k1148q0734j11450j4882n2292N861L3660M0269k6951O2997
5459i1711P1675q3549J7191Q3349K06550K5350n0236j28850j24871K4145L2203
5448a8754Q0842l7429k9221L6009N6490J9035P9600j19868j35695K9094P8155
5437C8258k1338K7801k1994n9664M0539P1923J0234O8923j7647J8059m4991j17590
$$ y = [-9928, -16409, -5771, 40210, 108044, 95955, 66226, 93797, 39485, 101448, 119281, 119594, 77548, 25460, -129234, -149003, -196824, -131276, -29274, 21815, 88843, 63998, -78721, -141934, -192843, -191093, -137790, -111960, -58468, -127969, -158343, -83624, -109373, -116017, 9492, -1938, -11005, -148340, -211821, -84554, -29747, -161138, -255765, -122304, -46448, -111316, -94478, 29806, 42097, 72959, 51811, -28923, -140373, -155255, -207547, -201686, -168026, -127757, -154708, -91711, -20036, -103585, -86394, -3045, 203505, 228855, 178619, 49769, -75102, -50957, -18754, 62088, 24659, -4562, 31447, 87937, 106972, 186572, 66704, -68991, -39897, 38258, 16920, 44721, 22727, -36937, 3602, 75525, 85759, 154682, 137035, 155094, 110103, -7487]
5425g487J4345q5658j40921L2243r8216K1011Q3445J84918Q6017m662J84057M0481
5413C09573q4461r3646n8893l0445P130j02219j31641J1483K0862J08695n2379
5402i5941j0410l2302M8447J1977j5819n8681O0304J34072j3896K5971J5167m6542
5390B2347k3186K1012k4008R8832J71119L6623q0061j17621m8835k0739K9371
5379F4854N2050O0771o2989q0176L1105R8043o5506j98511p5354L0884J68799
5368B3970J71669n7605P1101m8534r1020j89466n7146J11110k9115Q5158M4024
5357C4146r3345L355p737n953K6399m8413J8952k4142j34162o1132R2595R6739
5345a02698L5213k0685j5283j0951O3094J62397L5100p3153j16306k3257l9467
$$ y = [-7487, 6858, -78800, -219721, -187478, -285694, -264683, -181238, 3680, 89697, 85035, 269092, 309573, 225112, 131466, 72573, 42128, 49258, -52961, -184602, -173119, -152257, -43562, -95941, -106351, -138653, -90206, -78229, -94048, -152729, -92425, 41647, 27751, 53722, 68889, 22347, -839, 20173, -3835, 94997, 266116, 302739, 222678, 105057, 56222, 35483, 64854, 116904, 177675, 114686, 34510, 65615, 163658, 98152, -100359, -175713, -144829, 23970, 195639, 138034, 209135, 160601, 69581, -119885, -177031, -65921, -95036, -9878, 34146, -59199, -55844, -63581, -69534, -43135, -91548, -72596, -96738, -230900, -292032, -199437, -102698, -67485, -88170, -103453, -114404, -51310, 111087, 146187, 73034, -43272, -66529, -105996]
5334a05996j15434M7207M1007K5400J9993O2425p7010j01896J951K8706o9907
5323b43554o4228J87821M1281k0543n1642j7474n7896O8277l423J8457J4987M3595
5311h4342J65575m965j32673L4348J29428k4277n3492n5351l6397N5996p5708
5300h1858l0687J05506l4021n1692j560N9211J03328M4298j91765P1335P4761
5289F6856m9219j13920o805O1082o3532m9230k3965J30961K8664m2630k133Q5725
5277B1854m6663j3777j04077j8034M7849m682N4418Q2387n3147K9701r2952m1903
5265a39026q5609j6346P4056n2840J42605J40890j62737p8261O2709o804J223
5254a20140J1800P2759j6502P755k7354j01119o6490j9945Q7638O6001P6037N5491
$$ y = [-105996, -221430, -174223, -133216, -107816, -87823, -25398, -102408, -204304, -202353, -173647, -243554, -307782, -119961, -78680, -99223, -150865, -168339, -226235, -157958, -161381, -142924, -127937, -84342, 81233, 76268, -56405, -22057, 107371, 83094, 29602, -25749, -62146, -6150, -81858, -112545, -7039, -41060, -92752, -94312, -35101, 68227, 112525, -79240, -7905, 66856, 17637, -96283, -103088, -42006, -105538, -154768, -178733, -47772, -19108, -61738, -63871, 21854, -24809, -38586, -142663, -160697, -112848, -117530, -63112, 19275, -33872, -4171, -97123, -139026, -224635, -240981, -166925, -219765, -77160, 63730, -99007, -177268, -114559, -121363, -120140, -108340, -35581, -52083, -44328, -71682, -172801, -239291, -259236, -171598, -105597, -29560, 25931]
5242B5931q4806j60863q6986P2748K78870J9083r8713m113m7165n4122q8412J49513
5230g9035L8384M0792N3006J00765m0442j56502n2754Q8917N5870p4653n9545
5219h5197L212N5081n8050K7908P6395J3503o2145R089j9975M8076L5159j4187
5207B8869n4264n2974L7013J57441J18290m8931k30757m0058n5819K0308J07686
5196a3196J07097O7266o5022M5688j6635l8601r4682j3607J15344j00548K9475
5185B2579L8278j28467k6723K7403K6516k3415O5869M9022o1704p1181n222M9570
5173c7475K4206k9257Q0621q8386n3951N7889O1050K063j22027J28704K14222
5162B37659n7232r4714p0768P2677R8804J2022j05200m4531j55788q5524k5109
$$ y = [25931, -58875, -219738, -306724, -233976, 44894, 63977, -34736, -38849, -86014, -140136, -228548, -79035, -40651, 141, 53147, 153912, 113470, -43032, -95786, -6869, 49001, -25652, -85197, -81985, -26904, -84954, -57046, 19349, 32852, -29293, -20204, -40179, 7897, 43056, 28869, -25395, -78369, -41356, 116085, 234375, 185444, -45313, -85371, -141190, -120882, -13196, 93901, 161167, 96145, 141833, 125198, 86597, -8085, -21692, 93652, -6896, 22579, 60857, -67610, -94333, -66930, -40414, -63829, 2040, 51062, -10642, -81823, -87045, -37475, -13269, -42526, 38095, -50291, -104242, -46353, 14697, 16760, -105267, 23437, 237659, 180427, 85713, 14945, 87622, 186426, 198448, 93248, 48717, -107071, -192595, -217704]
5151b17704j0761J64327J67816O3342r5640j39170P5379m8894j01799j51900L7577
5140b57427J71022J02350k4373j37121k1203K7159p9410Q6351J26389K6536k9011
5129h738p0686n2554L6912O579R2596Q5974j37472p207L202p7949j26357p198
5117b62898K065P4757O8572J03050O4043l3056m0724o1867j0393R9677M5772j284
5105D7714q8493j03736l6985J2185L5004o7499L829O3228K5799j56447j36555
5094d01956L8753J76541J34272k8021k3546P8494R707o2949l8156O1704M6623
5083h534L9606P2973j05337p0777J26811N0444j67065p2508R9283M4835j1950
5072b219R0385l9300p0363l4991J926J7951q0789J1196m6368K4929M7787J16088
$$ y = [-217704, -228465, -64138, 103678, 167020, 71380, -67790, 7589, -41305, -143104, -295004, -257427, -86405, 15945, -8428, -145549, -166752, -139593, -219003, -132652, -6263, 20273, -8738, -79424, -131978, -95066, -88487, 4109, 90083, -47389, -54596, -51394, -129343, -255700, -262898, -260833, -186076, -117504, -14454, 49589, 16533, -24191, -86058, -96451, 3226, 48998, 47714, -40779, -144515, -181500, -169315, -134311, -201810, -197981, -134753, -108954, -265401, -401956, -363203, -186662, -52390, -80411, -103957, -25463, -15756, -78705, -116861, -55157, -8534, 31072, 104045, -1292, -72069, 54742, 105186, -61879, -134387, -35104, 9731, -2219, 88166, 48866, -21497, -56488, -54562, -36611, -117400, -106204, -152572, -127643, -79856, 36232]
5060C6232N5646j63583o7942L4318L9412N248O5578N2515j03668l6575P9824L8468
5048C5473o334R9158P8783o7398j5343L6582L0418o6455p7447R277J3400p4457
5036d343j0640K4678m3980P8877J14483r5143r5714P671j32572q0139P8354J91328
5024C2860n3992k335l6603o2286R0355N7373M1633K2459j00837j36186o0436J23045
5012h4950J39697l8346j47700N2885O4548l2367J9599m619l5645p8678J27514
5001a8062O9590K747J05949J8528p3784j05466K8908J9117r5194N0541R8419j10810
4989i517k8643L7722o2023o8597K4872P0185j2499j5417R5788M4239n7665p8022
4977e9577k1741K9441R0257M4743k4804M6963j13744k3075m8890O3623K6362O3232
$$ y = [36232, 91878, -71705, -139647, -105329, -65917, -60669, 4909, 57424, -46244, -82819, -2995, 35473, 29139, 128297, 207080, 139682, 124339, 160921, 191339, 124884, 47437, 56714, 70114, -4343, -14983, 9695, -34285, 44592, 159075, 63932, -31782, -24111, -156683, -236822, -158468, 32860, -21132, -23467, -60070, -122356, -32001, 25372, 67005, 89464, -11373, -147559, -207995, -84950, 54747, 16401, -131299, -78414, -13866, -46233, -26634, -31253, -66898, -145576, -18062, 51528, 54275, 160224, 178752, 104968, -498, 28410, 47527, -47667, 2874, 101293, -9517, -38160, -438, -62461, -131058, -106186, -36001, -48500, -63917, 31871, 76110, 18445, -59577, -81318, -51877, 38380, 83123, 58319, 105282, -8462, -31537, -80427, -16804, 9558, 72790]
4965G2790r8849l0397J2555k7820k9115l2076j9464J69769R2572q5787j04036
4954g9858q163j4173K439M0251O0207l0268p0858P93L2134O6247k7478l4631Q4554
4941B1196o249R8780q3739K0487n2886o1709l4228P5510p552j06006N8320k4716
4929a02792o1735J8308P1362O2807K6486p5740R180k2975k7416P2142K2985m2273
4917d9661M2885j62977J1567K10183J64963l0999j69735p5125J55474P6650k2248
4906A50977J4912l443M1378L4131l0464j68004p3315j28017K3621J12241m3254
4895f9237n4102l6073J6839J03697M7020N7276J515k936l8045j14442n9268J35999
4883a1757J16378q9498k55230K582R9351L0736P0284N0251l5799n2605j6488n414
$$ y = [72790, -26059, -56456, -43901, -71721, -100836, -132912, -152376, 17393, 109965, 24178, -79858, -88021, -102194, -99755, -59504, 703, -29565, -100423, -99630, -67496, -1249, -28727, -63358, 21196, 14947, 113727, 29988, 50475, -2411, -64120, -98348, -22838, -30390, -136396, -78076, -102792, -164527, -146219, -74857, -12050, 14436, -61304, -52124, -75099, -102515, -30373, -7388, -49661, -6776, -169753, -158186, 51997, 216960, 185961, 16226, -58899, 96575, 173225, 150977, 165889, 162446, 203824, 237955, 207491, 39487, -33828, -161845, -138224, -25983, -69237, -123339, -159412, -142573, -38876, 8144, 65420, 66935, 63999, 25954, -88488, -147756, -11757, 104621, 15123, -240107, -237525, -138174, -107438, -37154, 13097, -22702, -75307, -91795, -97209]
4871i7209P639l9590m1378L2474J67785Q1165l8349j18478q4469k00944j7197
4860c48551R4585N2701N794R9729o919l3616L125k3941K5523O9688k0439k1422
4848a03743o8431J2990k5228K408L542L9743Q2585J71870O2880K6079q2147p4285
4836D8263q3012M9738R7397m8038o450k0488O2158M9235j44755n0800K2695M729
4824a9328L8001N3099j9635L7498R895r9620r0131n8595j8110J0951m3406j3431
4812b12812Q0242J27852J33548n2118j09451r1870n433j313J8274J62195O784
4801E5898o938j42699J2004P9326o6433J7236k7722k6943J63420l7747q8786j32754
4789b02138l7998n575J87961k5523L8546K4770R776M1025o3972k1978n7258m4120
$$ y = [-97209, -89570, -129160, -170538, -138064, 29721, 110886, 72537, -45941, -130410, -331354, -348551, -253966, -201265, -195471, -95742, -102661, -136277, -133152, -157093, -131570, -61882, -82321, -103743, -172174, -159184, -184412, -182004, -178462, -138719, -56134, 115736, 178616, 204695, 122548, 48263, -34749, 14989, 112386, 64348, 57898, 37410, 99568, 148803, 4048, -46752, -24057, -19328, 18673, 71772, 52137, 89635, 99530, -90, -90221, -148816, -166926, -155975, -199381, -212812, -132570, -4718, 128830, 76712, -32739, -124609, -130042, -131355, -113081, 49114, 55898, 48960, -93739, -81735, -2409, -68842, -51606, -79328, -106271, 57149, 19402, -69384, -202138, -240136, -245711, -57750, -83273, -44727, -19957, -10181, 30844, -33128, -55106, -112364, -156484]
4777a56484r695O4020P3483N1235J35796N6484j17185k4411o0733o2099q3357
4766a32946K6445O4671M3923m1283p2971J19494k5903j37183M7065p6331q0494
4755b65513P0255K0446P1058m3240p469J15620K2605J8902N4621J31798j78317
4744A0766j56894j21531J0329M6486j4048o6369J19768N4251k2812J1814j08514
4733b36754k2478O0757Q3425R1303P7704n366R6262o508m0655j7929J00017j33712
4721D6066j45434m8867R6683K467L3643l41O5039J3377n6266o0107N40K090r0375
4708a41485j463K29185P0256k8587Q0156M9681J6516K604J574j18472j8503m6665
4696I4797L7013O2277j36165j25796l6642K8123M7132O0151J6762l458L8059Q4554
$$ y = [-156484, -166179, -102159, -28676, 22559, 158355, 214839, 97654, 73243, 12510, -49589, -132946, -106501, -41830, 2093, -39190, -112161, 7333, -18570, -155753, -108688, -185019, -265513, -195258, -174812, -103754, -146994, -154463, -38843, -16238, 2664, 57285, 189083, 10766, -146128, -267659, -257330, -210844, -224892, -291261, -171493, -117242, -140054, -128240, -236754, -259232, -198475, -115050, -23747, 53957, 48591, 144853, 138345, 97690, 79761, 179778, 46066, -99368, -148235, -51552, -49085, -15442, -15783, 49256, 62633, 6367, -53740, -53200, -51110, -141485, -142948, 86237, 156493, 127906, 208062, 257743, 274259, 276863, 278437, 159965, 141462, 94797, 131810, 194087, 57922, -67874, -104516, -76393, -29261, 30890, 47652, 44194, 82253, 166807]
4684A66807p1032p5023p8429q039Q2744P5046j57679k34714N3185M8712J24451
4673g3971J11349n3392Q0329r9709j47202p0946R376J35726J23240J5557n4769
4662b4412j48804M8057J24497Q5555l1077O2951j1992j29388P520J2919q6516
4651i0690l0361m517N5563J06876k2166J66274P1953j54098j50920q9319L9222
4640a02183k5639J25861L1092l8283m6846O2036J53759j6801m3428k4778M6418
4629A21208O1826o1427j23154r4474j5720m6940J09170J26450q4698o0626n9853
4618a28238l1178j97030K7950J22160Q2235J01525L4558L5120q0985j05414K7584
4607a11713O1908k9990p8120K9959J18693o134O2516n0604q5589O4818p0936p6127
$$ y = [166807, 95775, 20752, -57677, -65716, 17028, 92074, -65605, -300319, -247134, -198422, -73971, 37378, -16014, 64315, -35394, -182596, -253542, -244166, -108440, 14800, 30357, -24412, -173216, -125159, -662, 84893, 53816, 116767, 104775, -24613, -17093, -4174, -90690, -121051, -125568, -70005, 36871, 14705, 180979, 252932, 98834, -52086, -141405, -102183, -127822, -1961, 29131, -9152, -55998, 6038, 159797, 142996, 99568, 74790, 121208, 183034, 121607, -1547, -96021, -111741, -158681, -49511, 76939, -7759, -68385, -128238, -159416, -356446, -328496, -206336, -124101, -22576, 11982, 47102, -33883, -139297, -111713, -49805, -79795, -157915, -127956, -9263, -15397, 47119, -3485, -89074, -24256, -95192, -171319]
4595a71319j66855M4437Q2695R3953J11031N8469O1146N7652Q288O4190k7988
4584B15699l9183n0186M4782O8741N734j06808j85991n6107P8838o3853q11O8106
4572b1039n4487J7996M4723j28810j27217M1800J14265J70354L859J9199J22140
4561B02783M4404r7300q5683j0108M161M5196M7510K0672N306O1553q0344q2630
4549G5520J8399l921o010j53721j5575R7897j2887J3856Q7839o3164L9881L9884
4537A17998j51020n8557k943Q2665Q7884j32646K556J10113J51038p6747j48972
4526a8631n538j0153k6689p8020n8711R346K4782J0550J52710L6833j5884r176
4514A1419j69732q7366l6579J42148P7940j46731J304R7171N0261N5026m1233
$$ y = [-171319, -338174, -293737, -211042, -117089, -6058, 52411, 113557, 171209, 179497, 243687, 215699, 176516, 126330, 171112, 239853, 245587, 138779, -47212, -103319, -24481, -88334, -89145, -21039, -75526, -57530, -12807, -141617, -268834, -227034, -112769, 57585, 61444, 80643, 202783, 247187, 149887, 64204, 54096, 58257, 103453, 150963, 171635, 176941, 238494, 158150, 75520, 93919, 89998, 83988, -69733, -85308, 12589, -298, 13558, 101397, 38233, 78114, 117998, -33022, -91579, -94522, -11857, 76027, -56619, -54063, 56050, 207088, 130341, -18631, -24169, -34322, -61011, -139031, -197742, -188396, -163614, -153064, -354, 36479, 20595, 11419, -158313, -245679, -282258, -140110, -62170, -208901, -207597, -110426, -60165, -5139, -46372]
4503d6372j4714r8873l3900K6307M7525K9311O02P7383N1639r9393n7610L9509
4491g8586N3254J33640J39572r2254p7362o2725J4623M7860N4373n188o8352j27380
4479f8525m8610J53501m3860P015j06395j16288J15675K6548l7641L5022l3128
4468a16686n3623r3438J30163J39459J9613j5585L1837k2621M5123l6486m5844
4457a8088K1368P9593J7176j44582p0908K259k3736o112n7671L0694O9976L842
4445i6189L8085J8201P7558N9235p9561K6027L2749R2273M1525m2264l6498m919
4433A26222M4471m006r1080j21445j45912L8437J57437L3548k2421O2055L7795
4422A15101p1348K4628Q974m5177L6031l1270j27629J833O8370L1495L6211O7229
$$ y = [-46372, -61086, -159959, -193859, -167552, -120027, -90716, -90114, -12731, 38908, -60485, -118095, -78586, -25332, 108308, 247880, 155626, 78264, 15539, 30162, 78022, 132395, 127207, 58855, -68525, -117135, 36366, -7494, -479, -106874, -223162, -107487, -80939, -118580, -83558, -116686, -170309, -263747, -133584, 5875, 25488, 9903, 41740, 19119, 64242, 27756, -18088, 3280, 82873, 100049, -44533, -115441, -113182, -136918, -143030, -200701, -170007, -100031, -96189, -58104, -39903, 37655, 96890, 17329, 43356, 76105, 168378, 209903, 167639, 131141, 126222, 170693, 166687, 75607, -45838, -191750, -153313, 4124, 37672, 15251, 77306, 115101, 43753, 68381, 77355, 32178, 68209, 36939, -90690, -88857, -20487, 11008, 47219, 114448]
4410A14448o9903n0252P8093J66290J16079j26126j52555L301k4197j28905r5912
4399a69639n4350J27522K9336p0809m5050L5001K05820j8968K1751q4633j04822
4388a28841m3182P2283J52680J01636j67842j95705K5953Q4118m8920J0860p956
4377a44916Q5341Q9601O4135J54962O9278N373m541j86743o9309J4443l838o1289
4365A2497r1990j4692o2669m052K285J0909J70646N8885L6211m908j11074r6817
4353i4769m759j24453M1324O3179J12933J2756O8980j9862R46j17765j2981J1920
4341f2551l4239R4190N0446N7371J2530n4019j13435j424N0931J20946k9695k22447
4329a31396J56413P5551k3932k2670q3973l5741Q9962L2323R5836j4313j40869
$$ y = [114448, 44545, -5707, 72386, 238676, 354755, 228629, 76074, 79375, 55178, -73727, -169639, -223989, -96467, -67131, -137940, -182990, -147989, 57831, 38863, 60614, -24019, -128841, -172023, -99740, 52940, 154576, -13266, -208971, -183018, -98900, -147820, -136960, -144916, -59575, 30026, 94161, 249123, 318401, 323774, 319233, 132490, 63181, 77624, 73786, 12497, -79493, -94185, -156854, -160906, -158621, -147712, 22934, 81819, 118030, 113122, 2048, -94769, -99528, -223981, -182657, -119478, -6545, 6211, 75191, 55329, 56275, -61490, -74471, -62551, -96790, -2600, 47846, 105217, 117747, 63728, -49707, -51131, -200, 120746, 91051, -131396, 25017, 100568, 76636, 53966, -30007, -65748, 24214, 56537, 152373, 138060, -2809]
4318b809q3752j62957R114K4760Q8982P3j7772P0719j0635m5774J7103K6463O5338
4305b1147P654M7135l9591q9413p3573J33896J48616k5582J9131o3000q404L7543
4293G3265j11334m9519Q7703J3262j05090o0001L7229J05150J80617M8854j48015
4282G2121j36820N3039K1352j6490L8308O6681j05789o0568j9819l9628Q171O5679
4270e3763M5484j26590n6923N7180J64393M1357l8637p5967q0690L8229P1884
4259a4043j555K6998K1295J2371p424r7041p4857l1611N6458K1637l0364L6797
4247h1339r7555r1453o707J43055P9815j615J9453N821O2239j7207j01190m0579
4235a27262L8363N4208P2201R357q1781l8024P5443K3089N8670p4735k2623L1931
$$ y = [-2809, -86561, -249518, -240404, -215644, -126662, -126589, -144361, -73642, -84277, -130051, -112948, -86485, -21147, -13493, 33642, -5949, -95362, -168935, -35039, 113577, 87995, 107126, 44126, 35722, 73265, -38069, -87588, 115, 13377, -91713, -151714, -114485, -9335, 171282, 220136, 72121, -64699, -11660, 9692, -6798, 31510, 98191, -7598, -68166, -87985, -127613, -119442, -53763, -8279, -134869, -191792, -134612, 29781, 71138, 32501, -43466, -124156, -85927, -14043, -15598, 11400, 32695, 45066, 37642, -59399, -134256, -165867, -109409, -87772, -118136, -81339, -178894, -270347, -277054, -133999, -54184, -55799, -36346, -30525, 31714, 14507, -86683, -127262, -88899, -34691, 37510, 46867, -34914, -72938, 2505, 25594, 84264, 9529, -13094, 18837]
4223A8837n6725j3456J25j01315m1833M4897m4823N0861P0759P7835K5362K4412
4211E4936q8181M2314N5156n6030k10R9872J07497o9490j76459m1466M5923Q1560
4199E5422M9155j19647Q8384K2517L4726k6224r3668o412k2974o4546L0421M6495
4187f351o9750N5426k0947o6268O2244J4652p2397P6829K2343j6992j07368n3939
4175a82518M6734J15950l2959M2074K9613k5482q1930J6626j04274J29126L7030
4164a0010j5513m3674p826N0092L2384o0174N7753P9651J6962j34988o9111N2671
4152e1783O9380l6207r1397r0840l3701J6826O1832j6401r1192n1848k3400M8475
4140b90256O5081J61240J22848j14023J0173J06297K8849J9649M316n6162l0794
$$ y = [18837, -37888, -51344, -51219, -152534, -194367, -149470, -194293, -143432, -72673, 5162, 30524, 54936, -33245, 9069, 64225, 8195, 7985, 107857, 215354, 145864, -30595, -72061, -26138, 55422, 104577, -15070, 73314, 95831, 130557, 104333, 10665, 4253, -18721, -83267, -52846, -6351, -76101, -20675, -41622, -107890, -45646, -30994, -103391, -26562, -4219, -21211, -128579, -182518, -135784, -19834, -52793, -10719, 18894, -6588, -88518, -71892, -176166, -47040, -10010, -25523, -69197, -77023, -26931, 5453, -54721, 3032, 82683, 99645, -35343, -104454, -51783, 17597, -18610, -110007, -200847, -234548, -217722, -155890, -172291, -263483, -315331, -338731, -290256, -225175, -63935, 58913, -55110, -44937, 61360, 90209, 109858, 114174, 58012, 27218]
4129B7218o637J4889j6575o0976M5961j18277J9180O1451P5747M71m4339j28272
4117a30159Q3303Q8727n7828q4229J45443M4207M4004L0326q1275Q784q7027j40175
4105a35899J07009L3245L4869R6132O825r2739r0239n0752j34600M6578R8373
4094h1198J19059P400N5100p3562j31507k5256R9358M4003j20636j8605J31216
4083E372K0234q7081p2601o906Q6474P7025k4446K2354m4150J00998p259j61241
4071i1227j68806L8530J03782J38938o1126j87100M8498M1230Q3485l1763l1284
4060a16843j6936J7749R5930n0335P158L4838j21967M7447j8335K2677L4247J22353
4048E7983m0520j3172P605m4845M8053L7153Q426n9943l0022O9917q5488K3056
$$ y = [27218, 20581, 35470, 18895, -42081, 3880, -114397, -95217, -33766, 41981, 42452, -1887, -130159, -46856, 41871, -15957, -100186, 45257, 89464, 133468, 163794, 82519, 91303, 4276, -135899, -28890, 4355, 39224, 135356, 142181, 49442, -40797, -91549, -226149, -179571, -81198, 37861, 45261, 100361, 26799, -104708, -129964, -30606, 13397, -107239, -125844, 5372, 25606, -61475, -134076, -140982, -54508, 22517, -1929, 20425, -23725, 77273, 70014, -91227, -260033, -221503, -117721, 21217, -39909, -227009, -178511, -137281, -53796, -85559, -116843, -133779, -116030, -20100, -70435, -63277, -28439, -150406, -102959, -121294, -98617, -64370, 57983, 17463, 4291, 11896, -32949, 15104, 52257, 60683, 740, -29282, 40635, -44853, -21797]
4036b1797K9625o1091k2058J34402j13473j62519P5017J84571j6690j75500n1927
4025b01440q2008m0809K4199M8931j5460J35759J91208J30500K7322j15356o3453
4014C9393O1084J5399n9949n691N9279N2241r340L4395j18190n4855n7481k7265
4002g0980L8443l7829J2957J06394j09487j3648p3960j6509l9309L0281R9654
3991g3993R3478N6531O5130m0467L9427L2815j25044r4759k1599L3102K500K8488
3979d391l5629k5267K11196O9826j02926N8279m6946q6947P567N5075O7755q3478
3967H4114j20871o665J5137j53230Q174P5423o8886L0893J65721m4187N97k189
3955a5969l1615N7869J34538m7311j76325q7443M7029O0052p3696o2767L0171
$$ y = [-21797, 7828, -53263, -75321, 59081, -54392, -216911, -141894, 42677, 25987, -149513, -201440, -283448, -324257, -300058, -251127, -266587, -130828, 60380, 190880, 218202, 102846, 39393, 100477, 115876, 55927, 50236, 109515, 161756, 152416, 186811, 68621, 13766, -43715, -70980, -32537, -70366, -57409, 48985, -60502, -74150, -148110, -164619, -203928, -173647, -73993, 19485, 76016, 141146, 100679, 140106, 172921, 47877, -46882, -68481, -35379, -32879, -4391, -40020, -65287, 145909, 215735, 112809, 171088, 124142, 37195, 44762, 99837, 167592, 84114, -36757, -43422, -28285, -181515, -173341, -97918, -166804, -135911, 29810, -14377, -13780, -15969, -47584, 10285, 144823, 97512, -78813, -166256, -119227, -59175, -132871, -195638, -165467]
3944a65467J40791p535Q336N6671r6520L1469l0375R1839P4756q9744j05913J06504
3932A4812J8486j58184J06923R950o9486m479N1507J23051l47K4755R8712l7291
3920A78409l1317k2004m7148O3990N7380n8312J2498M0395r7093j6430R7655J827
3908A79850j5072j7444R547O6789l5695m4244j07178j08359P0748J8285j30217
3897a12990n4326O1999Q83j3294O1388J4775L6249L5311j1074Q452L630n6859
3885b5856J5528J3742k3471R7095Q8074p0250k0763J0038k8097P3792k0044o8419
3873D1369J15950o256n4099p8745m3716p6684J6124K3327k1279Q8615n1298O5927
3861A9235J12303O7588r4241j09580M5403K4780m1826N235l4663N3608J09559
$$ y = [-165467, -24676, -32211, -23875, 32796, -63724, -32255, -62630, 29209, 103965, 14221, -91692, 14812, 33298, -124886, -17963, -8013, -77499, -81978, -30471, 92580, 92233, 116988, 215700, 178409, 147092, 125088, 77940, 141930, 199310, 140998, 153496, 193891, 96798, 80368, 178023, 179850, 164778, 147334, 156881, 223670, 187975, 143731, 36553, -71806, -1058, 17227, -112990, -167316, -105317, -104434, -117728, -56340, -41565, -5316, 29995, 18921, 27373, 31003, -25856, -10328, 3414, -20057, 77038, 165112, 94862, 74099, 84137, 56040, 129832, 109788, 41369, 157319, 151063, 96964, 18219, -25497, -102181, -86057, -62730, -84009, 4606, -46692, 19235, 131538, 199126, 104885, -4695, 40708, 65488, 23662, 28897, -5766, 47842, 157401]
3850A57401q3980r2467j9848J4652l9177q3005l2432k3290o3689O1793J29231
3839g4811R9654k91q1172R74J00344q7799r1799J36830J36355l4947j71367m0465
3827a08494J82816q8674o2559r8751j8097N0384P0564J9983O4793j4213q7832
3816i0080O6275j6887M46P5274K03734j9178j85077p7812j1054n3811k1077o1654
3804a90901k5624J86929J77629j13j20802o4764O001k8402n0081J15412Q557j18264
3792a04423p8689P2K8758J8667J66711N0187p2434M7080Q6552L6458J26086j03390
3780B01635j39630j29919l1804K2346o5244Q0746R1852J34382L1383r9299q7110
3769I338K592l7595l6618L0411k1088M1405J93K0701J1962o2065q1491R737R24
$$ y = [157401, 73421, -19046, -38894, -24242, -63419, -146424, -178856, -202146, -265835, -204042, -74811, 24843, 24552, -56620, -55646, 44698, -43101, -134900, 1930, 138285, 103338, -68029, -108494, 74322, -14352, -76911, -175662, -193759, -143375, -72811, -52828, 11965, -2248, -90080, -23805, -40692, -40246, 35028, 238762, 219584, 34507, -43305, -54359, -108170, -129247, -190901, -216525, -29596, 148033, 147920, 27118, -37646, -31645, -60047, -110128, 5284, 13841, -104423, -183112, -183040, -154282, -135615, 31096, 81283, 8849, 55929, 142481, 178939, 305025, 201635, 62005, -67914, -99718, -77372, -142616, -61870, 29982, 164364, 195747, 96448, 9338, 11930, -25665, -62283, -31872, -52960, -11555, -11362, 9339, 21301, -40764, -122255, -112518, -111594]
3756a11594n875N3384o432N8858Q9409k3780K6413l3680r0196j30242j15448j0506
3744b99689R3135k9283l0083J27408l0246O6945M9787q3473R6346p6785m9681
3733a65619J19989M2603l4515m283K5138Q3123N6619o3529o1445n0110r6748R2141
3721e6636M8343J72125J54750l2856j12968k5745j51406r5375N8986J27155M2006
3710A28379Q70j52936j65756J4486J29295m7122o003M7339m4076K9691N76J05933
3698D0676J37265j00435j31990l5006j6955m078l8391J06079O1483P0265n3752
3687C5161J425k5419j38411o1736j7544J94735J76976l6137p0437j6027j87110
3676a44524j24831K26331j9067K0073l132j27075o7228r1603o0701J08314J32784
$$ y = [-111594, -117469, -64085, -70517, -11659, 77750, 53970, 80383, 46703, -43493, -173735, -289183, -299689, -206554, -235837, -265920, -138512, -168758, -101813, -52026, -135499, -39153, -115938, -165619, -45630, -3027, -37542, -41825, -16687, 66436, 123055, 59526, -1919, -52029, -148777, -56636, -8293, 163832, 318582, 285726, 172758, 147013, -4393, -99768, -40782, 86373, 128379, 129249, -23687, -189443, -174957, -45662, -92784, -98787, -51448, -95524, -65833, -65257, 40676, 177941, 77506, -54484, -89490, -106445, -110523, -148914, -42835, 18648, 88913, 35161, 36586, 11167, -127244, -188980, -206524, -11789, 165187, 129050, 58613, 42586, -144524, -269355, -43024, -62091, -42018, -45150, -172225, -239453, -331056, -391757, -283443, -150659]
3665a50659L5628K815J09049M370j74439m4739k0625M4563P7358o085J36364P8594
3653I2194m8727o90K8363J1799p0679K3402m911j13475j9471m199M322M4139l941
3640f1874m3665Q819K968Q452Q5486k2332J03062p5293m7819r4115j06980J155
3628b42136K8544M6974N7640j04465p631J53778R607K5046n885l7334k6742N9729
3616d2875N4732L0750o7371K677l0108j74593K5254J2837k3776L5559M0071M9164
3604h7679R3016q3486n9699p588M967P3758K9353n3002l0639N9131Q139l1185
3592h4914j29864p0329l447R7764q426P2435M1634j9074J61661J5798o8730n7978
3580e3470l8439M2565J25652j15742m6761P4151p4116m7025P5172J25349M4599
$$ y = [-150659, -115031, -112216, -3167, 1203, -173236, -217975, -238600, -194037, -116679, -122764, 13600, 92194, 43467, 42777, 71140, 82939, 12260, 35662, 30751, -82724, -102195, -106394, -102072, -57933, -61874, -105539, -96720, -93752, -85300, 186, -22146, 80916, 5623, -42196, -136311, -243291, -242136, -213592, -166618, -108978, -213443, -221074, -67296, -57689, -32643, -38528, -75862, -102604, -42875, 11857, 42607, -24764, -22087, -52195, -226788, -201534, -188697, -212473, -176914, -136843, -87679, 5337, -78149, -137848, -145436, -140469, -66711, -37358, -90360, -120999, -61868, -53729, -84914, -214778, -285107, -288554, -190790, -199216, -126781, -85147, -104221, 57440, 73238, 4508, -53470, -91909, -49344, 76308, -39434, -86195, -12044, -86160, -133185, -58013, 67336, 111935]
3569A11935j46547J3750L414l2198l1508q4142J4361l3005O3813J35868J32010
3558A47751N785q4104j10686q0437N9884Q0759R249n1492k9843m9117K3206M3217
3546c5828N5297k7381J8896J26654O3253r0274l4886O3046P0594n6057l1156j3714
3534A08444K2810j60854M37M1200j7141l3225k7871m5689M718n374j7923J13093
3522a7375l2664p9698K9323J1404j5941J6609m3731R27J37225m7105j09589m1190
3510a91805M6312J41997N1009o9538p9475l5483j9870r6612J22761J24563M0555
3499C4414K6946Q8045J0871q7690j09145M2303K2630O1127q397o9483j63234n9191
3487b10804N6421n5345o5849K66526Q4415J7224O0279o506q8242m5084q0946m1698
$$ y = [111935, -34612, -20862, -17448, -49646, -81154, -165296, -150935, -183940, -120127, 15741, 147751, 153536, 69432, -41254, -121691, -61807, 18952, 28201, -23291, -53134, -102251, -79045, -35828, 19469, -7912, 10984, 137638, 200891, 110617, 75731, 138777, 209371, 153314, 122158, 108444, 131254, -29600, -29163, 12037, -5104, -38329, -66200, -111889, -107171, -112545, -130468, -17375, -50039, -129737, -100414, -89010, -104951, -88342, -132073, -131146, 6079, -41026, -150615, -191805, -145493, -3496, 47513, -22025, -101500, -136983, -156853, -253465, -130704, -6141, 34414, 61360, 149405, 160276, 72586, -36559, 5744, 28374, 89501, 81104, 11621, -151613, -210804, -154383, -209728, -275577, -9051, 75364, 92588, 152867, 146361, 58119, 13035, -67911, -109609]
3475a09609O0259j6464j19476J6438O8631O0447J7698j991m2958J00624R507r7399
3463e4293o8427P7012J21278j7348j34006k0868O9755O0059L5655J0457n2539
3452B6735r0855M9654J04881J18361j3901q7136j15139k6722k6053O3157J49333
3441A52315Q6366n9875m7850j84962m0073M5138J01584J50501j9990j03833m782
3430G4539r2492q0806J27779M2639j17858j17775Q0488j40470P8009K9279k1574
3419a38242l2522N252l6241k6021k2512j7419M7482K4200J42463M6373r4193k053
$$ y = [-109609, -49350, -65814, -185290, -168852, -100221, -39774, -22076, -24067, -67025, 33599, 43106, -54293, -122720, -45708, 75570, 58222, -75784, -96652, -26897, 33162, 68817, 79274, 26735, -64120, -14466, 90415, 208776, 194875, 107739, -7400, -34122, -60175, 2982, 152315, 238681, 178806, 130956, -54006, -94079, -48941, 52643, 203144, 183154, 79321, 74539, -17953, -98759, 29020, 71659, -46199, -163974, -83486, -223956, -145947, -116668, -138242, -170764, -165512, -201753, -227774, -250286, -267705, -220223, -196023, -53560, -7187, -101380, -103433]
$$ [...]
##END NTUPLES=NMR SPECTRUM
##END=
