##TITLE=Analysis number 319120
Compound Code mo 07781
Project Code adrs
Chemist Name fudan
##JCAMPDX= 6.0         $$ Bruker NMR JCAMP-DX V2.0
##DATA TYPE= NMR SPECTRUM
##DATA CLASS= NTUPLES
##ORIGIN= Bruker BioSpin GmbH
##OWNER= nmr
$$ XWIN-NMR		Version 3.5
$$ Wed May  3 10:06:28 2006 GMT Daylight Time (UT+1h)  MAYBRIDGE\nmr@NMR_250MHZ
##.OBSERVE FREQUENCY= 250.131544655141
##.OBSERVE NUCLEUS= ^1H
##.ACQUISITION MODE= SIMULTANEOUS (DQD)
##.ACQUISITION SCHEME= undefined
##.AVERAGES= 16
##.DIGITISER RES= 18
##SPECTROMETER/DATA SYSTEM= dpx250
##.PULSE SEQUENCE= zg30
##.SOLVENT NAME= DMSO
##.SHIFT REFERENCE= (INTERNAL, DMSO, 0, 16.522)
##AUDIT TRAIL= $$ (NUMBER, WHEN, WHO, WHERE, WHAT)
$$ ##TITLE= Audit trail, XWIN-NMR		Version 3.5
$$ ##JCAMPDX= 5.01
$$ ##ORIGIN= Bruker BioSpin GmbH
$$ ##OWNER= nmr
$$ C:\u/data/dgb/nmr/ADRS/3540/pdata/1/auditp.txt
$$ ##AUDIT TRAIL=  $$ (NUMBER, WHEN, WHO, WHERE, WHAT)
(   1,<2006-05-03 10:05:58.58 +100>,<MAYBRIDGE\nmr>,<NMR_250MHZ>,
      <created by zg, POWCHK disabled, PULCHK disabled
       configuration hash MD5:
       84 BC 41 DB A1 6E 1D 46 DA 25 12 A5 C1 ED C5 3A
       data hash MD5: 64K
       DD 42 77 F4 43 CC DC 68 17 CC AA 5C FE 3C 0B 3E>)
(   2,<2006-05-03 10:06:14.69 +100>,<MAYBRIDGE\nmr>,<NMR_250MHZ>,
      <Start of raw data processing
       ef LB = 0.3 FT_mod = 6 PKNL = 1 SI = 32K 
       data hash MD5: 32K
       94 CB 0F 0F 87 FC E4 7A E6 2F 84 21 C1 CA 85 3B>)
(   3,<2006-05-03 10:06:16.41 +100>,<MAYBRIDGE\nmr>,<NMR_250MHZ>,
      <apk 
       data hash MD5: 32K
       67 61 B0 E6 A6 19 F8 27 DB 3E 6D CC E6 C9 E6 00>)
(   4,<2006-05-03 10:06:17.30 +100>,<MAYBRIDGE\nmr>,<NMR_250MHZ>,
      <abs ABSG = 5 
       data hash MD5: 32K
       7A 69 E7 6D 17 47 CC 1B EE E2 49 61 D2 3F E2 49>)
$$ ##END=
$$ 
$$ hash MD5
$$ 64 92 F2 D2 42 4D 5C F3 EE 63 CF 15 5E B0 83 5A
##$RELAX= 
##$RELAX= 
##$RELAX= 
##$RELAX= 
##$RELAX= 
##$RELAX= 
##$RELAX= 
$$ Bruker specific parameters
$$ --------------------------
##$DU= <C:\u>
##$EXPNO= 3540
##$NAME= <ADRS>
##$PROCNO= 1
##$TYPE= <nmr>
##$USER= <dgb>
##$AMP= (0..31)
100 100 100 100 100 100 100 100 100 100 100 100 100 100 100 100 100 100 
100 100 100 100 100 100 100 100 100 100 100 100 100 100 
##$AQSEQ= 0
##$AQ_mod= 3
##$AUNM= <au_zg>
##$AUTOPOS= <6 >
##$BF1= 250.13
##$BF2= 250.13
##$BF3= 250.13
##$BF4= 250.13
##$BF5= 500.13
##$BF6= 500.13
##$BF7= 500.13
##$BF8= 500.13
##$BYTORDA= 1
##$CFDGTYP= 0
##$CFRGTYP= 5
##$CHEMSTR= <none>
##$CNST= (0..31)
1 1 145 1 1 1 1 1 1 1 1 1 1 1 1 1 1 1 1 1 1 1 1 1 1 1 1 1 1 1 1 1 
##$CPDPRG= <>
##$CPDPRG1= <>
##$CPDPRG2= <>
##$CPDPRG3= <>
##$CPDPRG4= <mlev>
##$CPDPRG5= <mlev>
##$CPDPRG6= <mlev>
##$CPDPRG7= <mlev>
##$CPDPRG8= <mlev>
##$CPDPRGB= <>
##$CPDPRGT= <>
##$D= (0..31)
0 1 0 0 0 0 0 0 0 0.06 0 0 0 0 0 0 0.0002 0 0 0 0 0 0 0 0 0 0 0 0 0 0 
0 
##$DATE= 1146647157
##$DBL= (0..7)
120 120 120 120 120 120 120 120 
##$DBP= (0..7)
150 150 150 150 150 150 150 150 
##$DBP07= 0
##$DBPNAM0= <>
##$DBPNAM1= <>
##$DBPNAM2= <>
##$DBPNAM3= <>
$$ [...]
##$SUBNAM6= <"">
##$SUBNAM7= <"">
##$SUBNAM8= <"">
##$SUBNAM9= <"">
##$SW= 20.6930455092707
##$SWIBOX= (0..15)
0 0 3 0 0 0 0 0 0 0 0 0 0 0 0 0 
##$SW_h= 5175.983436853
##$TD= 65536
##$TD0= 1
##$TE= 294.16
##$TE2= 300
##$TE3= 300
##$TEG= 300
##$TL= (0..7)
0 120 120 120 120 120 120 120 
##$TP= (0..7)
150 150 150 150 150 150 150 150 
##$TP07= 0
##$TPNAME0= <>
##$TPNAME1= <>
##$TPNAME2= <>
##$TPNAME3= <>
##$TPNAME4= <>
##$TPNAME5= <>
##$TPNAME6= <>
##$TPNAME7= <>
##$TPOAL= (0..7)
0.5 0.5 0.5 0.5 0.5 0.5 0.5 0.5 
##$TPOFFS= (0..7)
0 0 0 0 0 0 0 0 
##$TUNHIN= 0
##$TUNHOUT= 0
##$TUNXOUT= 0
##$USERA1= <user>
##$USERA2= <user>
##$USERA3= <user>
##$USERA4= <user>
##$USERA5= <user>
##$V9= 5
##$VALIST= <valist>
##$VCLIST= <CCCCCCCCCCCCCCC>
##$VD= 0
##$VDLIST= <DDDDDDDDDDDDDDD>
##$VPLIST= <PPPPPPPPPPPPPPP>
##$VTLIST= <TTTTTTTTTTTTTTT>
##$WBST= 1024
##$WBSW= 4
##$XGAIN= (0..3)
0 0 0 0 
##$XL= 0
##$YL= 0
##$YMAX_a= 244361
##$YMIN_a= -453530
##$ZGOPTNS= <>
##$ZL1= 120
##$ZL2= 120
##$ZL3= 120
##$ZL4= 120
##$ABSF1= 16.522
##$ABSF2= -4.171173
##$ABSG= 5
##$ABSL= 3
##$ALPHA= 0
##$AQORDER= 0
##$ASSFAC= 0
##$ASSFACI= 0
##$ASSFACX= 0
##$ASSWID= 0
##$AUNMP= <proc_1d>
##$AZFE= 0.1
##$AZFW= 0.1
##$BCFW= 0
##$BC_mod= 0
##$BYTORDP= 0
##$COROFFS= 0
##$CY= 12.5
##$DATMOD= 1
##$DC= 0
##$DFILT= <>
##$DTYPP= 0
##$F1P= 14.0000005364418
##$F2P= -0.99999901652339
##$FCOR= 0.5
##$FTSIZE= 32768
##$FT_mod= 6
##$GAMMA= 0
##$GB= 0
##$INTBC= 1
##$INTSCL= 1
##$ISEN= 128
##$LB= 0.3
##$LEV0= 0
##$LPBIN= 0
##$MAXI= 10000
##$MC2= 0
##$MEAN= 0
##$ME_mod= 0
##$MI= 0
##$NCOEF= 0
##$NC_proc= -4
##$NLEV= 6
##$NOISF1= 0
##$NOISF2= 0
##$NSP= 0
##$NTH_PI= 0
##$NZP= 0
##$OFFSET= 16.522
##$PC= 1
##$PHC0= 158.905
##$PHC1= 11.002
##$PH_mod= 1
##$PKNL= yes
##$PPARMOD= 0
##$PSCAL= 4
##$PSIGN= 0
##$REVERSE= no
##$SF= 250.13
##$SI= 32768
##$SIGF1= 0
##$SIGF2= 0
##$SINO= 400
##$SIOLD= 32768
##$SREGLST= <1H.DMSO>
##$SSB= 0
##$STSI= 32768
##$STSR= 0
##$SW_p= 5175.98343685301
##$SYMM= 0
##$S_DEV= 0
##$TDeff= 65536
##$TDoff= 0
##$TI= <Analysis number 999999
Compound Code 99
Book Reference 9
Project Code 9>
##$TILT= no
##$TM1= 0
##$TM2= 0
##$TOPLEV= 0
##$USERP1= <user>
##$USERP2= <user>
##$USERP3= <user>
##$USERP4= <user>
##$USERP5= <user>
##$WDW= 1
##$XDIM= 32768
##$YMAX_p= 358275770
##$YMIN_p= -312266
$$ End of Bruker specific parameters
$$ ---------------------------------
##NTUPLES= NMR SPECTRUM
##VAR_NAME=  FREQUENCY,     SPECTRUM/REAL,   SPECTRUM/IMAG
##SYMBOL=    X,             R,               I
##VAR_TYPE=  INDEPENDENT,   DEPENDENT,       DEPENDENT
##VAR_FORM=  AFFN,          ASDF,            ASDF
##VAR_DIM=   32768,         32768,           32768
##UNITS=     HZ,            ARBITRARY UNITS, ARBITRARY UNITS
##FACTOR=    0.157963299565203, 1,           1
##FIRST=     4132.6476996994, 0,             0
##LAST=      -1043.33573715361, 0,           0
##MIN=       -1043.33573715361, -312266,     0
##MAX=       4132.6476996994, 358275770,     0
$$ Real data points
##PAGE= N=1
##DATA TABLE= (X++(R..R)), XYDATA
$$ [...]
14146i5157m80r648m9852K6203J15819P9253m4445k8860m467l40N8791Q890m4464
$$ -95157 -95637 -105285 -155137 -128934 -13115 66138 21693 -7167 -11634 -11974 46817 55707 11243
14133A1243l8060J5959N4135j8013n5327J1461j5544m7475n8390k8462O3470L5415
$$ 11243 -26817 -10858 43277 25264 -30063 -18602 -34146 -81621 -140011 -168473 -105003 -69588
14121f9588j5766K4716j8916J4371N4195N183m3480m2325l7105O8385Q2197K6784
$$ -69588 -85354 -60638 -79554 -65183 -10988 -5805 -49285 -91610 -128715 -60330 21867 48651
14109D8651m4567N455N974J7415O0133n9171j03225m5678K1252M8464P872J7422
$$ 48651 4084 9539 15513 32928 93061 33890 -69335 -115013 -93761 -45297 -37425 -20003
14097b0003Q6259Q1979k4704m5592K5868K1816j0491n9135k2546j7601k8358J5071
$$ -20003 66256 148235 123531 77939 103807 125623 115132 55997 33451 15850 -12508 2563
14085B563L0026j5333K877j5779J4968M4594p2142n6659j4780N3957K855J9831
$$ 2563 32589 17256 20133 4354 19322 63916 -8226 -64885 -79665 -25708 -22853 -3022
14073c022R819L1936M4232K7684n89m4995p909J2618K8095L835m1825L4945m1581
$$ -3022 6797 38733 82965 110649 110060 65065 57156 69774 97869 101704 59879 94824 53243
14060E3243m2563Q495L7971N685k1850k3626O4881N2503r9455K6245K4006K0510
$$ 53243 10680 19175 57146 62831 40981 17355 82236 134739 35284 61529 85535 106045
14048A06045k6105J1763N6564j2935m86l4340k2949o901K276J2646K7855L1339
$$ 106045 79940 91703 148267 135332 134846 100506 77557 70656 72932 85578 113433 144772
14036A44772N0709K6820n8533l6386n046j6942J5442L7113l4766o3457M779k8620
$$ 144772 195481 222301 163768 127382 122336 105394 120836 157949 123183 59726 64505 35885
14024C5885l5690N740j3470p736M8483L0255L3629m5331p1352k0647l8030n042
$$ 35885 195 5935 -7535 -15271 33212 63467 97096 51765 -19587 -40234 -78264 -83306
14012h3306M5739J05066Q6928P984K4379j6662l8417m3457m7455j5359J1591O681
$$ -83306 -37567 67499 154427 162411 186790 170128 131711 88254 40799 25440 37031 43712
14000D3712Q4313k7035o2911O3562K4910k1346r161j8445L2125L0781l3380q950
$$ 43712 128025 100990 38079 101641 126551 105205 96044 77599 109724 140505 107125 98175
13988I8175J2526J9161K1963n5792l4704N0831P0344K3841m7979k7879M238K5254
$$ 98175 110701 129862 151825 96033 61329 112160 182504 206345 158366 130487 134725 159979
13976A59979k5936M2728L9988k8362m7343j6577P612K945j7022k2549J8959N2614
$$ 159979 134043 176771 216759 188397 141054 124477 132089 135034 118012 95463 114422 167036
13964A67036N4823L2134J7684j14856r6178J7223O7408J73783R342l1131j4830
$$ 167036 221859 253993 271677 156821 60643 77866 145274 319057 328399 297268 282438
13953B82438m6921M0883N9869J1590l0209l5954J9413j7651o9686l3035n2346
$$ 282438 235517 276400 336269 347859 317650 281696 301109 283458 213772 180737 128391
13942A28391L8179P2748K9843k271j9039q4758L928M4881N8601K694j6824K7376
$$ 128391 166570 239318 269161 266890 247851 163093 167021 211902 270503 273197 256373 283749
13930B83749L0604M60p0181k5277k7477K693P5313K8029N235M6815K6762j4669
$$ 283749 314353 314813 244632 219355 191878 194571 269884 297913 303148 349963 376725 362056
13918C62056j4977k3116j973o162M697Q717j2222J0441J4505l7057l2196k0806
$$ 362056 347079 323963 321990 315828 320525 329242 317020 327461 341966 304909 272713 251907
13906B51907j4076L318L7705p8451L8157N7755K9557M9250Q4216L585o835l4940
$$ 251907 237831 241149 278854 200403 238560 296315 325872 375122 459338 462923 456088 421148
13894D21148m8578M3844K1874r919M4625l1914n3448J1044Q2357L5996j9688K537
$$ 421148 372570 416414 438288 428369 472994 441080 387632 398676 481033 517029 497341 499878
13882D99878J862j075K3087P0514j830J5073M6620L8203J3665J0578M1769J5929
$$ 499878 501740 500665 523752 594266 592436 607509 654129 692332 705997 716575 758344 774273
13870G74273J6486N7489j2516K3984Q9083O9589J6683K3672R8747M7729N865j8720
$$ 774273 790759 848248 835732 859716 948799 1018388 1035071 1058743 1157490 1205219 1211084 1192364
13858A192364M2061P6939m640Q0601J84024J43464J47651R8120J71241J46872
$$ 1192364 1234425 1311364 1306724 1387325 1571349 1714813 1862464 1960584 2131825 2278697
13848B278697J63715P2799N3577J86344J39545Q3951K28173K53392J84924K03676
$$ 2278697 2442412 2515211 2568788 2755132 2894677 2978628 3206801 3460193 3645117 3848793
13838C848793K32116L33236L10739K67976L16394L11920L71823L46236L56596
$$ 3848793 4080909 4414145 4724884 4992860 5309254 5621174 5992997 6339233 6695829
13829F695829L39146M05849L90181M09997M02312M06607L85564L00615L63931
$$ 6695829 7034975 7440824 7831005 8241002 8643314 9049921 9435485 9736100 10100031
13820A0100031L61661L13227K49290L11678L11574J78882J85294J05968J08541
$$ 10100031 10461692 10774919 11024209 11335887 11647461 11826343 12011637 12117605 12226146
13811A2226146J63884P1824m2462n3912K1356m1031r4254j17436j28687K0233
$$ 12226146 12390030 12461854 12419392 12365480 12386836 12345805 12251551 12134115 12005428 12025661
13801A2025661K2929j5174K4904N7157N9922l5490P4892J19416J5320r922J8786
$$ 12025661 12048590 12033416 12058320 12115477 12175399 12139909 12214801 12334217 12349537 12339615 12358401
13790A2358401k4173m6606q4871j98629j40162k30689k54556k70267k47873l26172
$$ 12358401 12334228 12287622 12202751 12004122 11863960 11633271 11378715 11108448 10860575 10534403
13780A0534403m18429l85825l62662l51746l32438l94052m28909m19371m76652
$$ 10534403 10115974 9730149 9367487 9015741 8683303 8289251 7860342 7440971 6964319
13771F964319k67309l21667l37569l34758l21662l14241k42381k03487k14956
$$ 6964319 6697010 6375343 6037774 5703016 5381354 5067113 4824732 4621245 4406289
13762D406289k32055k21848k06775j76238j33257j18363r1752j42153n6751r0563
$$ 4406289 4174234 3952386 3745611 3569373 3436116 3317753 3226001 3083848 3027097 2936534
13752B936534m6575j01049j10756r5039o6215j6142j5905j11859p2818n573m9108
$$ 2936534 2889959 2788910 2678154 2583115 2516900 2500758 2484853 2372994 2300176 2294603 2245495
13741B245495j13354r2904j7920q1723n7740o0422M884p8543j1748K5390j01866
$$ 2245495 2132141 2039237 2021317 1939594 1881854 1821432 1826316 1747773 1736025 1761415 1659549
13730A659549l0508J8440k7768n0811j00514l4123M66o156o3658l6373Q54k2877
$$ 1659549 1629041 1647481 1619713 1568902 1468388 1434265 1434731 1428575 1364917 1328544 1329398 1306521
13718A306521o446l6147q7792M7136N3484J987n2030l9926O1083K2602n7409p3610
$$ 1306521 1300075 1263928 1176136 1223272 1276756 1278743 1226713 1186787 1247870 1270472 1213063 1139453
13706A139453m7578J5005o099k9226l8527k3808j59679k5398l3373K1199J3033
$$ 1139453 1091875 1106880 1100781 1071555 1033028 1009220 849541 824143 790770 811969 825002
13695H25002J1351K3105j6832l2055K9445j022l4922m61m5491j4569L9186N677
$$ 825002 836353 859458 842626 810571 840016 838994 804072 803611 758120 743551 782737 788414
13683G88414k7492J3591J466l799R41m0951l4720j3901K7139j6495n9311l3483
$$ 788414 760922 774513 775979 772180 773121 732170 697450 683549 710688 694193 634882 601399
13671F01399R2998M7219j05913K4801j4563L3879k8348k6938q4571l2562J2984
$$ 601399 694397 741616 635703 660504 645941 679820 651472 624534 539963 507401 520385
13660E20385N9351O0175M9984k9805K9979J1330L4985j0093m9901L1192N454j0713
$$ 520385 579736 639911 689895 660090 690069 701399 736384 726291 676390 707582 713036 702323
13648G02323m1854j3155K6990J4721m0470J5124J5681J1289J4732n200j3012k9687
$$ 702323 660469 647314 674304 689025 648555 663679 679360 690649 705381 700181 687169 657482
13636F57482R761M1051K6949M6345J09996m8808l0215M6132N7151O0227J4459
$$ 657482 667243 708294 735243 781588 891584 842776 812561 858693 915844 976071 990530
13625I90530n5343P0599K8213K8528O4636M6258N1331J0213M0224J08817Q7661
$$ 990530 935187 1005786 1033999 1062527 1127163 1173421 1224752 1234965 1275189 1384006 1471667
13614A471667K9726Q7263J92458J55943J30542J90332J79041J90521K56887K78213
$$ 1471667 1501393 1588656 1781114 1937057 2067599 2257931 2436972 2627493 2884380 3162593
13604C162593K82541K48032K44044L99140K89079K91679L84337L67377L00278
$$ 3162593 3445134 3693166 3937210 4336350 4625429 4917108 5301445 5668822 5969100
13595E969100M59291M29463L51287L45457L83281L61070L59742L15104L10298
$$ 5969100 6428391 6857854 7209141 7554598 7937879 8298949 8658691 8973795 9284093
13586I284093L41906L23659L66503K34754J99896J91158J48416J53560R362r4566
$$ 9284093 9625999 9949658 10316161 10550915 10750811 10941969 11090385 11243945 11253307 11158741
13576A1158741q0193j78763k37111k40151k28215l09655k46161k84486l51018
$$ 11158741 11078548 10899785 10662674 10422523 10194308 9884653 9638492 9354006 9002988
13567I002988k94019l10995l60149l31498k90817l11895k53323j76636k11653
$$ 9002988 8708969 8397974 8037825 7706327 7415510 7103615 6850292 6673656 6462003
13558F462003j25822n4261m0356J2830R132n0352J08751J63530J74165K12705
$$ 6462003 6336181 6281920 6241564 6254394 6263526 6213174 6321925 6485455 6659620 6872325
13548F872325K67270K59515L64606L73263M01508M15175M87636N46758N02218
$$ 6872325 7139595 7399110 7763716 8136979 8538487 8953662 9441298 9988056 10490274
13539A0490274M58455L58761J90678Q0189o4206j55074k03515j98301k08201j53656
$$ 10490274 10948729 11307490 11498168 11578357 11514151 11359077 11155562 10957261 10749060 10595404
13529A0595404l6100K9215J66543J29088J59519L07841K97504L32141M04211N71229
$$ 10595404 10559304 10588519 10755062 10884150 11043669 11351510 11649014 11981155 12385366 12956595
13519A2956595M69359M53367M89128M11030L29868L46346L91284M34084L26877
$$ 12956595 13425954 13879321 14368449 14779479 15109347 15455693 15846977 16281061 16607938
13510A6607938K54763K75738L46654L41359K16264K27494K92311L26274L05720
$$ 16607938 16862701 17138439 17485093 17826452 18042716 18270210 18562521 18888795 19194515
13501A9194515L60251L65718L08270L28163L26342K77296K51026K62631K18180
$$ 19194515 19554766 19920484 20228754 20556917 20883259 21160555 21411581 21674212 21892392
13492B1892392J90829K16357L55729M33434N79328O09516O38110Q15538Q16599
$$ 21892392 22083221 22299578 22655307 23088741 23668069 24277585 24915695 25731233 26547832
13483B6547832P63018P22140N68353L43080N7178j96393m96521q10043r92209
$$ 26547832 27310850 28032990 28601343 28944423 29001601 28805208 28308687 27498644 26506435
13474B6506435j065021j155632j139206j018258q33848o36506n77274m18113k51500
$$ 26506435 25441414 24285782 23146576 22128318 21294470 20657964 20080690 19662577 19411077
13465A9411077k74496k28838j37167p0632k04211k29556k11396l83390m06079
$$ 19411077 19136581 18907743 18770576 18699944 18495733 18266177 18054781 17671391 17265312
13456A7265312m53592n67501n96386n37206n17576m41172l68615k47479j37311
$$ 17265312 16811720 16244219 15647833 15110627 14593051 14151879 13783264 13535785 13398474
13447A3398474m5776P9429J52186Q8474J28004J00648K8698m4312j54591j68361
$$ 13398474 13352698 13432127 13584313 13672787 13800791 13901439 13930137 13885825 13731234 13562873
13437A3562873r3345j23635j49399m7352p2502k15355k58983j97284k13778k93566
$$ 13562873 13469528 13345893 13196494 13149142 13076640 12861285 12602302 12405018 12191240 11897674
13427A1897674l40389m08032m43843m70274m65800m61692m88095l79623l28803
$$ 11897674 11557285 11149253 10705410 10235136 9769336 9307644 8819549 8439926 8111123
13418H111123l51781l03794k54439j81705o4729j57968j04060m681O111O0768
$$ 8111123 7759342 7455548 7201109 7019404 6954675 6796707 6692647 6687966 6694077 6754845
13408F754845N9199M1033J4484J9527n1787j26805k1450M2289q2260o3575q8298
$$ 6754845 6814044 6855077 6869561 6889088 6837301 6710496 6689046 6731335 6649075 6585500 6497202
13397F497202j04548l8184p6085j04627p0525m3864K1762Q7989J21144J17321
$$ 6497202 6392654 6354470 6278385 6173758 6103233 6059369 6081131 6169120 6290264 6407585
13387F407585R8492J63457K54460K18085K99334J79213J12406J20564O8779Q7579
$$ 6407585 6506077 6669534 6923994 7142079 7441413 7620626 7733032 7853596 7922375 8009954
13377H009954J8849L3624m4973l0883n2367j69243j70678k17964k39295j80008
$$ 8009954 8028803 8062427 8017454 7986571 7934204 7764961 7594283 7376319 7137024 6957016
13367F957016j94836k83112j86712j91080j74471j72611j36840q3360m1992N054
$$ 6957016 6762180 6479068 6292356 6101276 5926805 5754194 5617354 5533994 5492002 5497056
13357E497056K5651m5875l0402P9210J20096J86722J63057K90387L20683M16756
$$ 5497056 5522707 5476832 5446430 5525640 5645736 5832458 5995515 6285902 6606585 7023341
13347G023341M69523N09138N95030O74471O84844P22598Q64789Q35954P51833
$$ 7023341 7492864 8002002 8597032 9271503 9956347 10678945 11543734 12379688 13131521
13338A3131521O79876M39814L68345J33594m9833q8075j80715l35675m03080m42399
$$ 13131521 13811397 14251211 14619556 14753150 14703317 14615242 14434527 14098852 13695772 13253373
13328A3253373l80273l80100l70481l51851l04059k62560j70892j53564p9596
$$ 13253373 12873100 12493000 12122519 11770668 11466609 11204049 11033157 10879593 10799997
13319A0799997K8500M4835l8879j19045j17255j03268j05991k28635j41254k03444
$$ 10799997 10828497 10873332 10834453 10715408 10598153 10494885 10388894 10160259 10019005 9815561
13309I815561k27134k04347j65208p8983Q839o3568j9762j5314n4504j91279j14533
$$ 9815561 9588427 9384080 9218872 9139889 9148728 9085160 9065398 9050084 8995580 8804301 8689768
13298H689768j38901k79424m08167m04293m68948n00183m23143l80114l11287
$$ 8689768 8550867 8271443 7863276 7458983 6990035 6489852 6066709 5686595 5375308
13289E375308l70957k42436k74390k32775q0059j69608j30385p0272j11432r4750
$$ 5375308 5004351 4761915 4487525 4254750 4174691 4005083 3874698 3804426 3692994 3598244
13279C598244n7208q3576n8718j02049p5645k3314K1778j7963j46331j32055r6323
$$ 3598244 3541036 3457460 3398742 3296693 3221048 3197734 3219512 3201549 3055218 2923163 2826840
13268B826840n2865M3530M4095J6763m8104O641P050l6250J1895k221L9932O2965
$$ 2826840 2773975 2817505 2861600 2878363 2830259 2836900 2843950 2807700 2819595 2817374 2857306 2920271
13256B920271L7801k2997j18107p9653j10518j64288j47907m4456q0485q7518
$$ 2920271 2958072 2935075 2816968 2737315 2626797 2462509 2314602 2270146 2189661 2102143
13246B102143n5293n1342r4147q8057j31126r6131K9857R882j4675o6036L61j3312
$$ 2102143 2046850 1995508 1901361 1813304 1682178 1586047 1615904 1625786 1611111 1545075 1545436 1532124
13234A532124q2991p9145k5212Q395o7747p2995k3205n164l922k0806r3684m8393
$$ 1532124 1449133 1369988 1344776 1353171 1285424 1212429 1189224 1184060 1180138 1159332 1065648 1017255
13222A017255j7514J8231p5355k7928M6642o587J8497R534n3432m1269l916N5193
$$ 1017255 999741 1017972 942617 914689 961331 954744 973241 982775 929343 888074 884158 939351
13210I39351k477j00514j04177j7960M0977K185j7635N662K7849n7602o7927J7740
$$ 939351 936874 836360 732183 714223 755200 757385 739750 745412 773261 715659 647732 665472
13198F65472K2779P8588k7599j50631l1007L8679K9418k0491M7585R781J0916
$$ 665472 688251 766839 739240 588609 557602 596281 625699 605208 652793 662574 673490
13187F73490j4784o4209l4964j4789L870j5060p9779q705J09765J05298o8296
$$ 673490 658706 594497 559533 544744 548614 533554 453775 445070 554835 660133 591837
13176E91837o0899k8966n3696K4091K7822N1766N2526r0975q1234o2791n5903
$$ 591837 530938 501972 448276 472367 500189 551955 604481 513506 432272 369481 313578
13165C13578O2825J1162k6717p639j9735K8645J2547j5603Q97O4736j4579k6250
$$ 313578 376403 387565 360848 353209 333474 362119 374666 359063 359960 424696 410117 383867
13153C83867n0418k9551r5n2994m5731N1953J31900j9620l197q233p6820o8796
$$ 383867 333449 303898 303803 250809 205078 257031 388931 369311 366114 357881 281061 212265
13141B12265O3007J6746m1670l308L2499M5195J6754p883J24m5167m132K1720
$$ 212265 275272 292018 250348 247040 279539 324734 341488 333605 333729 288562 284430 306150
13129C06150o2524l8117O1663q166l697K2961J0578J7862l2351r750L0102r385
$$ 306150 243626 205509 267172 259006 255309 278270 288848 306710 274359 264609 294711 285326
13117B85326J7906l6565m4199K417j5100L1808j834Q947J2028j7004L3958n391
$$ 285326 303232 266667 222468 224885 209785 241593 239759 248706 260734 243730 277688 272297
13105B72297o5541j5792J13532K7450q421m3769P770J457j8563r0355J604k9883
$$ 272297 206756 190964 304496 331946 323525 279756 287526 288983 270420 180065 181669 151786
13093A51786M3553K3766L231j6995j9031q2327m3068J01806P8059M0405K1060
$$ 151786 195339 219105 222336 205341 186310 103983 60915 162721 240780 281185 302245
13082C02245k2240p26o0079r062M3956o631K2111l5740k4626M8547L7582L3921
$$ 302245 280005 279279 219200 210138 254094 247463 269574 233834 209208 257755 295337 329258
13070C29258N7701M7673j4822J1716j5922m0685N8165L003p2583j45229n9204
$$ 329258 386959 434632 419810 431526 415604 374919 433084 436087 363504 218275 159071
13059A59071R0346M3873n7093k0984N4429K6515j1643k2700l7370K0845J7028
$$ 159071 249417 293290 236197 215213 269642 296157 284514 261814 224444 245289 262317
13048B62317L3085p920P2427l0251l4265M1708R1738j266m9000m3034r3325L1285
$$ 262317 295402 287482 359909 329658 295393 337101 428839 427573 378573 335539 242214 273499
13036B73499L1153M1028L6324N0808r037n2357p3672l2437L5777J08669J15734
$$ 273499 304652 345680 382004 432812 423775 371418 297746 265309 301086 409755 525489
13025E25489J42143R9049j5952M1948P1655M6199N2483m6097j67622j98561q6862
$$ 525489 667632 766681 750729 792677 864332 910531 963014 916917 749295 550734 463872
13014D63872k5020J0320j8032m0053o7170j1853j0155O5699j6533j08148K7629
$$ 463872 438852 449172 431140 391087 323917 312064 301909 367608 351075 242927 270556
13003B70556K779k7427Q0354L3214j6076L7460O366o3009P5903Q6234K3992q1505
$$ 270556 273335 245908 326262 359476 343400 380860 387226 324217 400120 486354 510346 428841
12991D28841n0361l4624l2034k5628j6832l8464J1697J11616J44181k6744P4494
$$ 428841 378480 343856 311822 286194 269362 230898 242595 354211 498392 471648 546142
12980E46142J23969J50694J07953M9956N6679l9377r1116j26696n0248q8093r0692
$$ 546142 670111 820805 928758 978714 1035393 996016 904900 778204 727956 639863 549171
12969E49171n4455k7041j9377m2559o8184m0897J7647N9388j150O6568o644n198
$$ 549171 494716 467675 448298 405739 337555 296658 314305 373693 372543 439111 432467 427269
12957D27269N533o7079P035n6803n616j1505N0233O4671j8458n0684M4949j8164
$$ 427269 432802 365723 372758 315955 310339 298834 349067 413738 395280 344596 389545 371381
12945C71381l8827O81j8089O529M0216k4289q4179k3262J1167N6916N3842J26674
$$ 371381 332554 333235 315146 321675 361891 337602 253423 230161 241328 298244 352086 478760
12933D78760R4137n3180J2705K8315K9251J3228J6994m3072o0358N1331L4924
$$ 478760 572897 519717 532422 560737 589988 603216 620210 577138 516780 568111 603035
12922F03035m8590o6458j09872K2577P7137k0092L9276l1294p0773l0953N748
$$ 603035 554445 487987 378115 400692 477829 457737 497013 465719 394946 363993 369741
12911C69741M2814N8051J1275j6538M0084Q0092O4043n236m8659o371N0892L1008
$$ 369741 412555 470606 481881 465343 505427 585519 649562 644326 595667 589296 640188 671196
12899F71196m6225j7057J6672j411O6152N5530o6291j0408R625M2668j1825N9406
$$ 671196 624971 607914 624586 623175 689327 744857 678566 668158 677783 720451 708626 768032
12887G68032K2138r053J9261r694k5460j2245L7348Q0993M3292L4208j547l1688
$$ 768032 790170 781117 800378 790684 765224 752979 790327 871320 914612 948820 947273 915585
12875I15585q299M0869O3554P4501k6293K0991L8002O5139L6852Q9234O0634M814
$$ 915585 907286 948155 1011709 1086210 1059917 1080908 1118910 1184049 1220901 1310135 1370769 1375583
12863A375583L8493j5389O5057N3538o563l654L2798q686K3773L9764j2225O0732
$$ 1375583 1414076 1398687 1463744 1517282 1510719 1507065 1539863 1531177 1554950 1594714 1582489 1643221
12851A643221J25542J16913M4939N1761Q8936L8156K5587J7838O0768O7850K2912
$$ 1643221 1768763 1885676 1930615 1982376 2071312 2109468 2135055 2152893 2213661 2281511 2304423
12840B304423O8412L6211P7093J06981J09303J11601J18941P3863M2425L7221
$$ 2304423 2372835 2409046 2486139 2593120 2702423 2814024 2932965 3006828 3049253 3086474
12830C086474O5854M1884J15018Q9150O9151R8321K5631j934l459P7916O8807
$$ 3086474 3152328 3194212 3309230 3398380 3467531 3565852 3591483 3589549 3586090 3664006 3732813
12819C732813K5893Q0979J15157M1046M3402Q5105Q5136J0225O9800N8272N5312
$$ 3732813 3758706 3839685 3954842 3995888 4039290 4124395 4209531 4219756 4289556 4347828 4403140
12808D403140N727M339L0254K8150J854J6912J5733J8959N0131K9482L3194J0329
$$ 4403140 4408867 4413206 4443460 4471610 4473464 4490376 4506109 4525068 4575199 4604681 4637875 4648204
12796D648204P3769k110N762j3068p7255l2687r464L8983M5066O6013K9544L822
$$ 4648204 4721973 4719863 4725625 4712557 4635302 4602615 4593151 4632134 4677200 4743213 4772757 4776579
12784D776579L2815p8231j18399q3535K166J2108P5060R462o1530J6670L1930
$$ 4776579 4809394 4731163 4612764 4529229 4531395 4543503 4618563 4628025 4566495 4583165 4615095
12773D615095p9757k7495L1226K1346L9615k8390k4786l4228l7784K2247L0909
$$ 4615095 4535338 4507843 4539069 4560415 4600030 4571640 4546854 4512626 4474842 4497089 4527998
12762D527998O7538n674r507L8896r407j6664P9343N7710K2514r406K2637N1170
$$ 4527998 4595536 4589862 4580355 4619251 4609844 4593180 4672523 4730233 4752747 4743341 4765978 4817148
12750D817148N2008n3760j0356O287J4048J04007J5674j1154o1510R5498Q2800
$$ 4817148 4869156 4815396 4805040 4811327 4825375 4929382 4945056 4933902 4872392 4967890 5050690
12739E050690R6712J3349k1274J5581m0031L7356K4596j2494J7115N3720M6764
$$ 5050690 5147402 5160751 5139477 5155058 5115027 5152383 5176979 5164485 5181600 5235320 5282084
12728E282084L0903N4883p238j1291l3474l162M3595p881l8415p0976J6641j921
$$ 5282084 5312987 5367870 5360632 5349341 5315867 5312705 5356300 5348419 5310004 5239028 5255669 5253748
12716E253748K5118m0624j1248q4448r324l4405L5794k1376k5861o7828n7272
$$ 5253748 5278866 5238242 5226994 5142546 5133222 5098817 5134611 5113235 5087374 5019546 4962274
12705D962274n1851k2839p4134j14161o8892N551K8468k8916j63060j49785k149
$$ 4962274 4910423 4887584 4813450 4699289 4630397 4635948 4664416 4635500 4472440 4322655 4320506
12694D320506o084o4119j8260j0715J1377l3171m7540q7420o8962l1569j05609
$$ 4320506 4314422 4250303 4232043 4221328 4232705 4199534 4151994 4064574 3995612 3964043 3858434
12683C858434j29951o6594Q470K8041K3609o695m976l807j2129M3796J2025J04686
$$ 3858434 3728483 3661889 3670359 3698400 3722009 3715314 3710338 3706531 3694402 3738198 3750223 3854909
12671C854909L1335L6112R7575K4436K0047M2245J09779R7570M9139N426M6379
$$ 3854909 3886244 3922356 4019931 4044367 4064414 4106659 4216438 4314008 4363147 4368573 4414952
12660D414952M9259Q8637M0882o5282Q51O3534J3843J26656J54312Q3962N2082
$$ 4414952 4464211 4552848 4593730 4528448 4529299 4592833 4606676 4733332 4887644 4971606 5023688
12649E023688O0417O9978N4626L3268k1956N5611K4964P1648N0682j07406j33891
$$ 5023688 5084105 5154083 5208709 5241977 5220021 5275632 5300596 5372244 5422926 5315520 5181629
12638E181629j61595K9239O5489l6747r9761j06187n0578j03532N862l2583n8794
$$ 5181629 5020034 5049273 5114762 5078015 4978254 4872067 4821489 4717957 4723819 4691236 4632442
12627D632442j1870k6284n0262J1517M444K368j8764m4082q7334o0897q289L4623
$$ 4632442 4620572 4594288 4544026 4555543 4559987 4562355 4543591 4499509 4412175 4351278 4342989 4377612
12615D377612L5268O76l578J21828Q9205J3778l1065j1060K2505O4521k805J8276
$$ 4377612 4412880 4413556 4409978 4531806 4621011 4634789 4603724 4592664 4615169 4679690 4676885 4695161
12603D695161P5806P2512M8689J26405J16942O8450L8205R8700J65880J06904
$$ 4695161 4770967 4843479 4892168 5018573 5135515 5203965 5242170 5340870 5506750 5613654
12593E613654J27503J13314J35642Q8959R4506P5514J03082P6028J02448N9866
$$ 5613654 5741157 5854471 5990113 6079072 6173578 6249092 6352174 6428202 6530650 6590516
12583F590516M3077P0010M4633M1936l354m4574J2022Q8505P8349L8074n65k9033
$$ 6590516 6633593 6703603 6748236 6790172 6786818 6742244 6754266 6842771 6921120 6959194 6958629 6929596
12571F929596m303R620N3480n4855j53701o1897k1464N2178J0603n3968j38298
$$ 6929596 6925293 6934913 6988393 6933538 6779837 6717940 6696476 6748654 6759257 6705289 6566991
12560F566991p3327j06932m4278j00893o4948q6508j63442j36103r3305q7205
$$ 6566991 6493664 6386732 6342454 6241561 6176613 6090105 5926663 5790560 5697255 5610050
12550E610050j03955j42492p0804p3558p4675m8657p0388j9930o3536K5821J8944
$$ 5610050 5506095 5363603 5292799 5219241 5144566 5095909 5025521 5005591 4942055 4967876 4986820
12539D986820M2496l3147j46532j14556j4219J31006J05404k592P5095N371L5972
$$ 4986820 5029316 4996169 4849637 4735081 4720862 4851868 4957272 4954680 5029775 5035146 5071118
12528E071118N1316L7291L6806L81R118K439M719N315P115M2135Q2611K0185j287
$$ 5071118 5122434 5159725 5196531 5196912 5206030 5208469 5213188 5218503 5225618 5267753 5350364 5370549 5369262
12515E369262M2610N7020N4458L11p9941j0614K4502j745n4539k2935m300n6684
$$ 5369262 5411872 5468892 5523350 5523661 5443720 5433106 5457608 5455863 5401324 5378389 5374089 5317405
12503E317405j29574j55586j66663p0864l8555q3067q2984r0736j08055j11832
$$ 5317405 5187831 5032245 4865582 4794718 4756163 4673096 4590112 4499376 4391321 4279489
12493D279489r3591p5704j04552j25464j07897j02215j68728k05350j86732j19631
$$ 4279489 4185898 4110194 4005642 3880178 3772281 3670066 3501338 3295988 3109256 2989625
12483B989625j62257j09596m4748o6743j57850j36972j24570p0851j04290o3951
$$ 2989625 2827368 2717772 2673024 2606281 2448431 2311459 2186889 2116038 2011748 1947797
12473A947797J3822q7406r2474r1084j11276j14915p1347o2572j07512N1176J2396
$$ 1947797 1961619 1874213 1781739 1690655 1579379 1464464 1393117 1330545 1223033 1274209 1286605
12462A286605k0362Q318l8548l2630r646n2776p0913m0771j4011L9379K5910n5208
$$ 1286605 1266243 1274561 1236013 1203383 1193737 1140961 1070048 1029277 1015266 1054645 1080555 1025347
12450A025347n4910L6830P4631k2528r8038q6114o823o525m3122K6842M403p4968
$$ 1025347 970437 1007267 1081898 1059370 961332 875218 868395 861870 818748 845590 849993 775025
12438G75025j7196K5805L4929L3487n8388o246m0030n1470l021k6916n61n6113
$$ 775025 757829 783634 818563 852050 793662 787416 747386 695916 692895 665979 665418 609305
12426F09305k6877O739r199M1242o6436r6015n9161o580P870L1090M2889M0138
$$ 609305 582428 589167 579968 621210 554774 458759 399598 393018 400888 431978 474867 515005
12414E15005j0499l1794j6639K3974k9874m7617L2001J3730m304p5718r382k1662
$$ 515005 504506 472712 456073 480047 450173 402556 434557 448287 443983 368265 358883 337221
12402C37221j5780J6646n2439m3884J07143M4132k5217j1010k3045M0662N9933
$$ 337221 321441 338087 285648 241764 348907 393039 367822 356812 333767 374429 434362
12391D34362K972J3694q2118M266L1763j9732p902J5977l8984M369K8083n3441
$$ 434362 437334 451028 368910 373176 404939 385207 377305 393282 354298 358667 386750 333309
12379C33309n2492j2981P6512J3892l8617n9586k0806L3110m325n4020O2971J0317
$$ 333309 280817 267836 344348 358240 319623 260037 239231 272341 268016 213996 276967 287284
12367B87284j3413J0884O2667K6590k0809m1650m1258M5092l288J0403m3744k4091
$$ 287284 273871 284755 347422 374012 353203 311553 270295 315387 312099 322502 278758 254667
12355B54667K5873l7165Q878o0311J1079O6999m0594J0776L2008q383p8526q031
$$ 254667 280540 243375 252253 191942 203021 270020 229426 240202 272210 263827 185301 177270
12343A77270J1866J8245l4050N4559K7325p0762l7961M8838O0718n8871m6123
$$ 177270 189136 207381 173331 227890 255215 184453 146492 195330 256048 197177 151054
12332A51054o568P0567O4504K5081q9569o8332k4048P0971N0714m3013j7127K2982
$$ 151054 144486 215053 279557 304638 215069 146737 122689 193660 244374 201361 184234 207216
12320B07216j5304L9364L0145O230j42382q71J20386N0379k9201j559J8784l4982
$$ 207216 191912 231276 261421 267651 125269 124398 244784 295163 265962 264403 283187 248205
12308B48205n9643p0928l6553J9624J26815k7176r7278p0796N0693J29228R219
$$ 248205 188562 117634 81081 100705 227520 200344 103066 32270 82963 212191 221410
12297B21410j12893m3965O32L7892P8889j0735q8475q2244j7744R2654L7258o3537
$$ 221410 108517 64552 65184 103076 181965 171230 82755 511 -17233 75421 112679 49142
12285D9142k7882O8471Q33m322k0913J0775J0329K3916J8277O1441M5526N72n3167
$$ 49142 21260 89731 90564 86242 65329 76104 86433 110349 128626 190067 235593 236165 182998
12272A82998o4606l2011P57k0956L6263m1019L0858L5208K3455p1429n4877k1988
$$ 182998 118392 86381 87138 66182 102445 61426 92284 127492 150947 79518 24641 2653
12260B653J0533J6925L4666K5663O2565O0299m4902o8778J4042j1225j2928N1049
$$ 2653 13186 30111 64777 90440 153005 213304 168402 99624 113666 102441 89513 140562
12248A40562j6009m6436q053J0004P3238p484m1003l8222j3453r160J9402j6886
$$ 140562 124553 78117 70064 80068 153306 145822 104819 66597 53144 43984 63386 46500
12236D6500L627L3709k5876J3695k719N781k4999K1214L1288M9054K5154j6889
$$ 46500 50127 83836 57960 71655 68936 74717 49718 70932 102220 151274 176428 159539
12224A59539n1270n6847k4702k7323J5224j4542L2704K3065Q3973J0276p0142
$$ 159539 108269 51422 26720 -603 14621 79 32783 55848 139821 150097 79955
12213G9955o9570p6770p428J24574P1344J8951k2166J5335n9896m300o5917r817
$$ 79955 10385 -66385 -73813 50761 122105 141056 118890 134225 74329 70029 4112 -5705
12201e705K3252k2066M8601N7335K4925K8819j1797k0538j6784J1729J7596p8132
$$ -5705 17547 -4519 44082 101417 126342 155161 143364 122826 106042 117771 135367 57235
12189E7235m0876L3965M0546N802m0773o800J2248M6249Q4479m1485q1711j2886
$$ 57235 16359 50324 90870 96672 55899 49099 61347 107596 192075 150590 68879 55993
12177E5993K1020Q5003j769j07045j12035O932J03549M6160k9399k9227J6914
$$ 55993 77013 162016 160247 53202 -58833 -51901 51648 97808 68409 39182 56096
12166E6096O7009M4161m811j6559k4407l8333m3497k0403J3502l3140m155M7796
$$ 56096 123105 167266 162455 145896 121489 83156 39659 19256 32758 -382 -4537 43259
12154D3259N6584R60l8821j3349L5410L28J8935o9894k7667K0472N6770J2190
$$ 43259 99843 100803 61982 48633 84043 84371 103306 33412 5745 26217 82987 95177
12142I5177j8173k0676l6700O5692k895L0531P2557l4299p1361q2090J1628O7587
$$ 95177 77004 56328 19628 85320 82425 112956 185513 151214 79853 -2237 9391 76978
12130G6978J6030m0961O228j0405j4850M6197M0975K0795J3585m4435l2926P047
$$ 76978 93008 52047 58275 47870 33020 79217 120192 140987 154572 110137 77211 84258
12118H4258L7758j4634k7934J3088L8015M600R350O4684L1948J7315l1707q4325
$$ 84258 122016 107382 79448 92536 130551 135151 144501 209185 241133 258448 226741 142416
12106A42416j3167J4306K5678J8993J0811r8347p9559J5826N3233L7699J1671
$$ 142416 129249 143555 169233 188226 199037 100690 21131 36957 90190 127889 139560
12095A39560m9467N134l3418l5167N8462P1899J2319n3543L1023J1874p989p358
$$ 139560 90093 95227 61809 26642 85104 157003 169322 115779 146802 158676 150687 143329
12083A43329P9148n318p9316p6144J1107J2183K2469m950j8814N7253O2415q5078
$$ 143329 222477 217159 137843 61699 72806 84989 107458 102508 83694 140947 203362 118284
12071A18284j06908m704M4077K7672O6484m681n3605N934n176K6397o0833j2975
$$ 118284 11376 6672 50749 78421 144905 140224 86619 92553 87377 113774 52941 39966
12059C9966K2532M2052N2622j4504l3810K6275L0740K596K8467j8896j2439K4631
$$ 39966 62498 104550 157172 142668 108858 135133 165873 168469 196936 178040 165601 190232
12047A90232j4972M7670l824J8848l7647k5865k0997J0043M4469j1557k4438J0478
$$ 190232 175260 222930 219106 237954 200307 174442 153445 163488 207957 196400 171962 182440
12035A82440Q1270J297m7234Q575J9294N3464K4749l3241k7001m0579L4729M0267
$$ 182440 263710 265007 217773 226348 245642 299106 323855 290614 263613 223034 257763 298030
12023B98030J5413m4722o8605K2328J124j13666Q371M6375L068m8752j1325Q1988
$$ 298030 313443 268721 200116 222444 223568 109902 118273 164648 167716 118964 107639 189627
12011A89627J04767k1820p3680L7119M0436J4550m4591L5474N6301l688l5087
$$ 189627 294394 272574 198894 236013 276449 290999 246408 281882 338183 334495 299408
12000B99408L3915j7128L5834R8214q817j11048l2411N5661P4981L1916K0788
$$ 299408 333323 316195 352029 450243 441426 330378 297967 353628 428609 460525 481313
11989D81313m4729o2981P932Q6710M6514j1658O1665k7715J3882M7989J8132J21
$$ 481313 436584 373603 381535 468245 514759 503101 564766 537051 550933 598922 617054 617175
11977F17175p909L9781P4659l8486p4425j9734P1365J06166J9300k9026K7281
$$ 617175 609266 649047 723706 685220 610795 591061 662426 768592 787892 758866 786147
11966G86147K4207J9030Q7011M0863L8731N9627K5854J9946m4036L6275Q67L7137
$$ 786147 810354 829384 916395 957258 995989 1055616 1081470 1101416 1057380 1093655 1094522 1131659
11954A131659Q9443J02692P0334L2338J60285J03713P1328O012O6050J13611J85631
$$ 1131659 1221102 1323794 1394128 1426466 1586751 1690464 1761792 1767804 1833854 1947465 2133096
11943B133096J46322J16482J60827J58316J63212K29715J17852K65438L31845
$$ 2133096 2279418 2395900 2556727 2715043 2878255 3107970 3225822 3491260 3823105
11934C823105K72558L68297M80865M32813M89044O03871P25340Q54634R68037
$$ 3823105 4095663 4463960 4944825 5377638 5866682 6470553 7195893 8050527 9018564
11925I018564J098279J206756J399401J643336J984252K198871K513506K840407
$$ 9018564 10116843 11323599 12723000 14366336 16350588 18549459 21062965 23903372
11917B3903372L033022L111406L054041K762055K246231J594746P62123l07292
$$ 23903372 26936394 30047800 33101841 35863896 38110127 39704873 40466996 40159704
11909D0159704j144416j883043k384184k651014k734468k618780k419342k128608
$$ 40159704 39015288 37132245 34748061 32097047 29362579 26743799 24324457 22195849
11901B2195849j916889j681812j501812j373460j112716r41060q85811q22707
$$ 22195849 20278960 18597148 17095336 15721876 14609160 13668100 12782289 11959582
11893A1959582p46699o48370n39159m94947n14666m05177l46492m03829l50557
$$ 11959582 11212883 10564513 10025354 9530407 9015741 8610564 8264072 7860243 7509686
11884G509686l03068k60844k09691k74912k07230j88992j96553k49504j86585
$$ 7509686 7206618 6945774 6736083 6461171 6253941 6064949 5868396 5618892 5432307
11875E432307j56659j84236q7218j36411o7871j16818k15672j74576j14357j51042
$$ 5432307 5275648 5091412 5004194 4867783 4799912 4683094 4467422 4292846 4178489 4027447
11865D027447j64266j13893p2221q0247n3978q5536j15599j90408j16478k5276
$$ 4027447 3863181 3749288 3677067 3596820 3542842 3457306 3341707 3151299 3034821 3009545
11855C009545k5486j0135p7282r3996l3541m3833l1519m1048n4486p6391o7311
$$ 3009545 2984059 2973924 2896642 2802646 2769105 2725272 2693753 2652705 2598219 2521828 2454517
11844B454517p6030l6804l3442m2690l3545l0140q8169o4658k0390o6763n6067
$$ 2454517 2378487 2341683 2308241 2265551 2232006 2201866 2113697 2049039 2028649 1961886 1905819
11833A905819m5635r1620l1248J6624N4633m1578o8919l6704J7223j8132m4029
$$ 1905819 1860184 1768564 1737316 1753940 1808573 1766995 1698076 1661372 1678595 1660463 1616434
11822A616434l7915k7201j2787M6647l634p0830K8715K022m3965n2286P9728P2375
$$ 1616434 1578519 1551318 1538531 1585178 1581544 1510714 1539429 1541451 1497486 1445200 1524928 1597303
11810A597303p290o4390L8671Q860n1921n3206r826j8412l2631O757Q079J4085
$$ 1597303 1590013 1525623 1564294 1573154 1521233 1468027 1458201 1439789 1407158 1413915 1421994 1436079
11798A436079O232J23893J05058m4216k9262K4853R2044R0310P4691L6733k5923
$$ 1436079 1442311 1566204 1671262 1627046 1597784 1622637 1714681 1804991 1879682 1916415 1890492
11787A890492M3173N5964L391J01875Q3582J1497K4714P557l439R8106J3298N3059
$$ 1890492 1933665 1989629 1993020 2094895 2178477 2189974 2214688 2222245 2218806 2316912 2330210 2383269
11775B383269k6482j4523j1290J6511j9593L2404L015k9799j7289Q323L9498N7309
$$ 2383269 2356787 2342264 2330974 2347485 2327892 2360296 2363311 2333512 2316223 2324546 2364044 2421353
11763B421353J0265P7514P2259K2227j0672R4556p321n5481q647j5703o1128l6318
$$ 2421353 2431618 2509132 2581391 2603618 2592946 2687502 2680181 2624700 2616053 2600350 2539222 2502904
11751B502904l4054l9927l5080j68374l4971M2143N6389K3153j03735p6897m7140
$$ 2502904 2468850 2428923 2393843 2225469 2190498 2232641 2289030 2312183 2208448 2131551 2084411
11740B084411j3721j09729j133p9764n1521L0148r4K3637J7213k4899M1540j9891
$$ 2084411 2070690 1960961 1959828 1880064 1828543 1858691 1858597 1882234 1899447 1874548 1916088 1896197
11728A896197m1284j2409P3592M1751K851L655l3505L7935Q0739k8633q439N5437
$$ 1896197 1854913 1842504 1916096 1957847 1960698 1964353 1930848 1968783 2049522 2020889 2012450 2067887
11716B067887J31165J44863J70661J31217R9016R8525R0694O5659R7869J82910
$$ 2067887 2199052 2343915 2514576 2645793 2744809 2843334 2934028 2999687 3097556 3280466
11706C280466J91590J06763L5540O7560J03707J16494N6534L4352P4209J17727
$$ 3280466 3472056 3578819 3614359 3681919 3785626 3902120 3958654 3993006 4067215 4184942
11696D184942m0490p3205M3456J06891M8367o551k0397N3451M8660J2889l3663
$$ 4184942 4144452 4071247 4114703 4221594 4269961 4263410 4243013 4296464 4345124 4358013 4324350
11685D324350l371J2603L3849J8641j999R2254R3653Q208n6056L0558N4816p2593
$$ 4324350 4320979 4333582 4367431 4386072 4384073 4476327 4569980 4578188 4522132 4552690 4607506 4534913
11673D534913o2728n6738r6618n6927j00698j41980l8132n4847p7556j04412j23530
$$ 4534913 4472185 4415447 4318829 4261902 4161204 4019224 3981092 3926245 3848689 3744277 3620747
11662C620747o0158M091J2647j6960m1594q077l3565K060o8877r112J4583m3744
$$ 3620747 3560589 3564680 3577327 3560367 3518773 3510696 3477131 3479191 3410314 3401202 3415785 3372041
11650C372041o8194m3151O2756q887N188L577j7130R0725O5863L4971R7332N5461
$$ 3372041 3303847 3260696 3323452 3314565 3319753 3323330 3306200 3396925 3462788 3497759 3595091 3650552
11638C650552J9572O7766J13557R4963L6698R5992J19471J59251N8524N0595J15242
$$ 3650552 3670124 3737890 3851447 3946410 3983108 4079100 4198571 4357822 4416346 4466941 4582183
11627D582183K6021J57700K28361J55827J26244J13882Q0092J78824J43308R3185
$$ 4582183 4608204 4765904 4994265 5150092 5276336 5390218 5470310 5649134 5792442 5885627
11617E885627M3807n652O1835J5000N6045R811J1118L4008R949L9119O1132L2986
$$ 5885627 5929434 5923782 5985617 6000617 6056662 6066473 6077591 6111599 6121548 6160667 6221799 6254785
11605F254785M2302M5985J37399M5828N9873L7472K7366M0024J2641O5986K1360
$$ 6254785 6297087 6343072 6480471 6526299 6586172 6623644 6651010 6691034 6703675 6769661 6791021
11594F791021J2630P5385M0257K3489j13713r1813n1343q20K2452m4158k7803
$$ 6791021 6803651 6879036 6919293 6942782 6829069 6737256 6685913 6685093 6707545 6663387 6635584
11583F635584J3842n9897M5266m0914M9745j2137j7577o8537m7041K6550L1998
$$ 6635584 6649426 6589529 6634795 6593881 6643626 6631489 6613912 6545375 6498334 6524884 6556882
11572F556882N1022n3393k5910J0399L2312L5296R877j0367m7708l2220l2330
$$ 6556882 6607904 6554511 6528601 6539000 6571312 6606608 6616485 6606118 6558410 6526190 6493860
11561F493860p5463J0248m7299j34934p4261J0339O7286M2626N1627p3266K4403
$$ 6493860 6418397 6428645 6381346 6246412 6172151 6182490 6249776 6292402 6344029 6270763 6295166
11550F295166q252R254n2507p2046m3876j059k1438j3806J492L9359O0217N8429
$$ 6295166 6286914 6296168 6243661 6171615 6127739 6126680 6105242 6091436 6092928 6132287 6192504 6250933
11538F250933J6294q5120j2658n742P513P1408J6785m2884l2571K3850j7251l3899
$$ 6250933 6267227 6182107 6169449 6163707 6171220 6242628 6259413 6216529 6183958 6207808 6190557 6156658
11526F156658P9590M1749j2232J3290N3501J8680m1532M605J9855M9870P0272
$$ 6156658 6236248 6277997 6265765 6279055 6332556 6351236 6309704 6314309 6334164 6384034 6454306
11515F454306l6013L0845K0346L01L5483J04335O7829P9080m6359l751M5047O2449
$$ 6454306 6418293 6449138 6469484 6469785 6505268 6609603 6677432 6756512 6710153 6706402 6751449 6813898
11503F813898j4376R4597M6923M1564j2369K8552Q0169N8464L4461J9596j2004
$$ 6813898 6799522 6894119 6941042 6982606 6970237 6998789 7078958 7137422 7171883 7191479 7179475
11492G179475K5368N2843M6375j1486p5964J7042k4104o8950o5755j393j2806
$$ 7179475 7204843 7257686 7304061 7292575 7216611 7233653 7209549 7140599 7074844 7073451 7060645
11481G060645k0956m8181j04030o4001n9905n4532k2464j05364q3554l3307n1740
$$ 7060645 7039689 6991508 6887478 6823477 6763572 6709040 6686576 6581212 6497658 6464351 6412611
11470F412611p3625l9127j45952p6262r1577p9936p2442j55044j21724r5080p3714
$$ 6412611 6338986 6299859 6153907 6077645 5986068 5906132 5833690 5678646 5556922 5461842 5388128
11459E388128r5751o8861q7469q7654j31343j74655j23843k9671j7543j26876
$$ 5388128 5292377 5223516 5136047 5048393 4917050 4742395 4618552 4588881 4571338 4444462
11449D444462r2153n8290p5755q1391r0824o6449j05596j25075j5242k3855l4641
$$ 4444462 4352309 4294019 4218264 4136873 4046049 3979600 3874004 3748929 3733687 3709832 3675191
11438C675191n1417p8690j07371o2814L0533o5995o3787K7733o7030k2296P812
$$ 3675191 3623774 3545084 3437713 3374899 3405432 3339437 3275650 3303383 3236353 3214057 3221869
11427C221869j9632L1176j1123n940k8928k2477k4415j3888K0946o711M7660j0299
$$ 3221869 3202237 3233413 3222290 3216350 3187422 3164945 3140530 3126642 3147588 3140877 3188537 3178238
11415C178238J6434K4182L8233R081j8235L0456J7824l4258j9069M9367j32j26700
$$ 3178238 3194672 3218854 3257087 3266168 3247933 3278389 3296213 3261955 3242886 3292253 3292121 3165421
11403C165421o0556o1973l8306L7554L850P304k3921l2807o0996j16472r735k6464
$$ 3165421 3104865 3042892 3004586 3042140 3045990 3053294 3029373 2996566 2935570 2819098 2809363 2782899
11391B782899J9186j3216K709n0158j1567o1878p3370l4462p1647n3653k330l8066
$$ 2782899 2802085 2788869 2791578 2741420 2729853 2667975 2594605 2560143 2488496 2434843 2432513 2394447
11379B394447p9180m5646L6439L0787m2194j09098o0870m9808p6103q5265k1374
$$ 2394447 2315267 2269621 2306060 2336847 2294653 2185555 2124685 2074877 1998774 1913509 1892135
11368A892135r7866l1238m4614k5676r7851r5685P5697L8604j32649n6196l0533
$$ 1892135 1794269 1763031 1718417 1692741 1594890 1499205 1574902 1613506 1480857 1424661 1394128
11357A394128p6627j0333N5358N7399r960n1781j7256o4637l3115l8727k5068
$$ 1394128 1317501 1307168 1362526 1419925 1409965 1358184 1340928 1276291 1243176 1204449 1179381
11346A179381M7516O343n2580k92k0820l3067j5218k418L6669J2864p5285o5172
$$ 1179381 1226897 1233240 1180660 1180368 1159548 1126481 1111263 1108845 1145514 1158378 1083093 1017921
11334A017921m6792n6459K2245K0705q05P6776j3298l8857j3112k6745J993j0881
$$ 1017921 971129 914670 936915 957620 956815 1033591 1020293 981436 968324 941579 943572 932691
11322I32691q3752k2593j5218L1614p683o8885M4654P1132r894q0162m3091J9939
$$ 932691 848939 826346 811128 842742 835059 766174 810828 881960 872066 791904 748813 768752
11310G68752L0650k7460k8146M4560j1968J5056J0497l1421N588l0962K0330n991
$$ 768752 799402 771942 743796 788356 776388 791444 801941 770520 776108 745146 765476 759485
11298G59485m6354l5687J14N6434K9714L9513r385n3950J4038l6356j7158M1833
$$ 759485 713131 677444 677558 733992 763706 803219 793834 739884 753922 717566 700408 742241
11286G42241L8657q4881l8089P7488M5684k4227j2296N4999j6353k7936O003l1642
$$ 742241 780898 696017 657928 735416 781100 756873 744577 799576 783223 755287 761290 729648
11274G29648l6217j0247m8111K388K1775l9298m7148M8531K7319L151K2425O5551
$$ 729648 693431 683184 635073 637461 659236 619938 572790 621321 648640 651791 674216 739767
11262G39767K4918r0413M0369O6348P991k9838O9676N1330j10164j34269K1714
$$ 739767 764685 674272 714641 780989 788980 759142 828818 880148 769984 635715 657429
11251F57429N8930L0169R806m5682o6818K4999R5480L0407n1047j1456J8666P7403
$$ 657429 716359 746528 756334 710652 643834 668833 764313 794720 743673 732217 750883 828286
11239H28286L0995l9674j6041J501J3285P0427k1904P858m4489k2382J40N7261
$$ 828286 859281 819607 803566 805067 818352 888779 866875 874733 830244 807862 808002 865263
11227H65263J14613K5548m1383m3883o5649o779J9208j843M2620O5738Q2754O9611
$$ 865263 979876 1005424 964041 920158 854509 847730 866938 865095 907715 973453 1056207 1125818
11215A125818k3766q5572l8383M7604J0988M44M6158P3424M0535j9325o401m4859
$$ 1125818 1102052 1016480 978097 1025701 1036689 1037133 1083291 1156715 1197250 1177925 1171524 1126665
11203A126665J4692K2922k0588j8282M925M8666N7397J7593k2163k632J12449
$$ 1126665 1141357 1164279 1143691 1125409 1130334 1179000 1236397 1253990 1231827 1229195 1341644
11192A341644O0030K1462N382J1615K2250M9103j5752M1593k0926P0518J62308
$$ 1341644 1401674 1423136 1428518 1440133 1462383 1511486 1495734 1537327 1516401 1586919 1749227
11181A749227Q2081j2591k1109N2297P4804L7272J901K6996N4023K9033J8309
$$ 1749227 1831308 1818717 1797608 1849905 1924709 1961981 1963882 1990878 2044901 2073934 2092243
11170B092243O2621L3894K5447r011j4851N8267P0064J8464l0951N1588L2368
$$ 2092243 2154864 2188758 2214205 2205194 2190343 2248610 2318674 2337138 2306187 2357775 2390143
11159B390143R6670P5138O8986M6233L5889J4186K672R5106L2965m9481K391K7756
$$ 2390143 2486813 2561951 2630937 2677170 2713059 2727245 2729917 2825023 2857988 2808507 2810898 2838654
11147B838654J09719J05610j3226k5494R404O1154J6360M2435k0199o0628m9873
$$ 2838654 2948373 3053983 3040757 3015263 3024667 3085821 3102181 3144616 3124417 3063789 3013916
11136C013916L6236Q3479R0413N0749k8604R860O8305J02241m8528n1162L7330
$$ 3013916 3050152 3133631 3224044 3274793 3246189 3256049 3324354 3426595 3378067 3326905 3364235
11125C364235k605M8470j2036L4963N0767p666J6156l5021j1146O8524l3872j8914
$$ 3364235 3361630 3410100 3398064 3433027 3483794 3476128 3492284 3457263 3446117 3514641 3480769 3461855
11113C461855Q691j3448L2413O7600L809M6172k7242o8309j1821P2295l2679J8439
$$ 3461855 3470546 3457098 3489511 3557111 3560920 3607092 3579850 3511541 3499720 3572015 3539336 3557775
11101C557775K8691k7901J7390M0201L2319Q4136k2380J8147Q2300L5566K8382
$$ 3557775 3586466 3558565 3575955 3616156 3648475 3732611 3710231 3728378 3810678 3846244 3874626
11090C874626O3797O5139J3172Q3805J1036J3343J3342J6289J0153M2119O8362
$$ 3874626 3938423 4003562 4016734 4100539 4111575 4124918 4138260 4154549 4164702 4206821 4275183
11079D275183N8920j7232j12511M3371p972L2801R5785O2427L1658k2350j1659
$$ 4275183 4334103 4316871 4204360 4247731 4239759 4272560 4368345 4430772 4462430 4440080 4428421
11068D428421M4166n5588K3495m1659N9579K2564l2287k1280O5939K9653j7372
$$ 4428421 4472587 4416999 4440494 4398835 4458414 4480978 4448691 4427411 4493350 4523003 4505631
11057D505631J5615k2258l1478o268m6889J6774R9521k292j9734M312Q545k8437
$$ 4505631 4521246 4498988 4467510 4461242 4414353 4431127 4530648 4528356 4508622 4512934 4521479 4493042
11045D493042r7443j0212M7486N884q826l742k5206l2209p7488n0731M5406j1486
$$ 4493042 4395599 4385387 4432873 4438757 4429931 4426189 4400983 4368774 4291286 4240555 4285961 4274475
11033D274475k7155J3461J0793m9960o9667j2732N1951N5071M1751k4398r0474
$$ 4274475 4247320 4260781 4271574 4221614 4151947 4139215 4191166 4246237 4287988 4263590 4173116
11022D173116n0797m6654o4310m6013m6268L2299n270J9151M9324j8826K5239
$$ 4173116 4122319 4075665 4011355 3965342 3919074 3951373 3946103 3965254 4014578 3995752 4020991
11011D020991l3333k0718n8641j17057q4041L8835P263m732O1903k3137m7608
$$ 4020991 3987658 3966940 3908299 3791242 3707201 3746036 3753299 3748567 3810470 3787333 3739725
11000C739725m96p2778q8210l35J3356l7487q7722q2966n9753p1378n0811J4752
$$ 3739725 3739229 3666451 3578241 3577906 3591262 3553775 3466053 3383087 3323334 3251956 3201145 3215897
10988C215897K6821m1768o2511j12938r5837o2159L0689k5495k0208R939m9231
$$ 3215897 3242718 3200950 3138439 3025501 2929664 2867505 2898194 2872699 2852491 2862430 2813199
10977B813199o3597O3100J8391q6705j5898k5154q3259m0415j9997p9244l0178
$$ 2813199 2749602 2812702 2831093 2744388 2728490 2703336 2620077 2579662 2559665 2480421 2450243
10966B450243l9040p8482n0188j9991l6930m2053j1554l8175o898m830q0892p0503
$$ 2450243 2411203 2332721 2282533 2262542 2225612 2183559 2172005 2133830 2126932 2122102 2041210 1970707
10954A970707M5100k8926p92R35l5769l6615P5504p4787j53085l8964M5212J4172
$$ 1970707 2015807 1986881 1986089 1987024 1951255 1914640 1990144 1915357 1762272 1723308 1768520 1782692
10942A782692l4673q53p8592p5194K9455o8751q0584O793K5153p3433r4551l5488
$$ 1782692 1748019 1747166 1668574 1593380 1622835 1554084 1473500 1480293 1505446 1432013 1337462 1301974
10930A301974K4895j3478k5515n9863j4856K1343l0956l8932o0867m2262L1112
$$ 1301974 1326869 1313391 1287876 1228013 1213157 1234500 1203544 1164612 1103745 1061483 1092595
10919A092595k3555J7776N0831j8498q7974l1323P559l4670N5290M5983J1960
$$ 1092595 1069040 1086816 1137647 1119149 1031175 999852 1007411 972741 1028031 1074014 1085974
10908A085974j2113j26806r4723p611j00392q2053J02891J35175K4146k9718K2988
$$ 1085974 1073861 947055 852332 844721 744329 662276 765167 900342 924488 894770 917758
10897I17758l5314j19342k9200K8709Q2974n4546p8724J2673m1920q8401n9378
$$ 917758 882444 763102 733902 762611 845585 791039 712315 724988 683068 594667 535289
10886E35289K0481N7963M5407n498l0942K5390l7091m2405k9610m1341j2959j0014
$$ 535289 555770 613733 659140 653642 622700 648090 610999 568594 538984 497643 484684 474670
10874D74670L229o5164r8168k7185M5311J03481P1778o026M937o5962m5271N2797
$$ 474670 477899 412735 314567 287382 332693 436174 507952 501926 506863 440901 395630 448427
10862D48427N1731j0321n2520m9497j14823J1609M2879O975K6318K6160P030M9291
$$ 448427 500158 489837 437317 387820 272997 284606 327485 334460 360778 386938 393968 443259
10850D43259J8206p55l9793j8231K8030J03796L106q5560K2518R943j4965n3017
$$ 443259 461465 460710 420917 402686 430716 534512 537618 452058 474576 484519 469554 416537
10838D16537q3791k9718J7791M54k1450J7939J0337O780N8127q615K2355k7509
$$ 416537 332746 303028 320819 321273 299823 317762 328099 334879 393006 384391 406746 379237
10826C79237j9836q1938n583K8877l5950m4915L1545L9358M3109l205O366k8444
$$ 379237 359401 277463 271880 300757 264807 219892 251437 290795 333904 330699 337065 308621
10814C08621Q168l4195n6964m6613K8512n8365r6455K5001l330j5768J579p718
$$ 308621 316789 282594 225630 179017 207529 149164 52709 77710 74380 58612 60191 52473
10802E2473j0937n491k2420J081M0458M7601Q110J0060k4094L1853N2868k438
$$ 52473 41536 36045 13625 14706 55164 102765 110875 120935 96841 128694 181562 179124
10790A79124l2076L6455L0081k197l4848m7333l5269N8771K4671m8937k7653p456
$$ 179124 147048 183503 213584 211387 176539 129206 93937 152708 177379 128442 100789 93333
10778I3333K8511j125L7247L6289L8017k2130m2421m5648j112l4608Q428Q4751
$$ 93333 121844 120719 157966 194255 232272 210142 167721 122073 120961 86353 94781 179532
10766A79532m7308m0066J6204M9478K5728j5429N9446J8586K218m1187p1352k7311
$$ 179532 132224 92158 108362 157840 183568 168139 227585 246171 248389 207202 135850 108539
10754A08539k0565k5065l4293k1689m282j1164k2396K0054O7053k6888m8592K6844
$$ 108539 87974 62909 28616 6927 2645 -8519 -30915 -10861 56192 29304 -19288 7556
10742G556K3802K0704k260N4451M047r4095r7571L2441N4284R2891J0812k6099
$$ 7556 31358 52062 49802 104253 108300 14205 -83366 -50925 3359 96250 107062 80963
10730H0963j7155p393J980M2538K0077j381N3495M5746l5034q7731j0327K6093
$$ 80963 63808 56415 58395 100933 121010 119629 173124 218870 183836 96105 85778 111871
10718A11871j4354M599j9327N0500P8291j5982p3048j0431n2965J0724j5152o76
$$ 111871 97517 102116 82789 133289 211580 195598 122550 112119 59154 69878 54726 54050
10706E4050M5939k9989L2522Q663l6596o9264o33K6659M3576K2059m0714j05740
$$ 54050 99989 70000 102522 111185 74589 5325 4692 31351 74927 96986 56272 -49468
10694d9468O7948J64594O1549p2789k6757j6013m4902l4542k5984N6136K4800
$$ -49468 18480 183074 244623 171834 145077 129064 84162 49620 23636 79772 104572
10683A04572p5892Q434q914j8048j7953l966K5101O3670j1455k4747K9830L5316
$$ 104572 28680 37114 28200 10152 -7801 -11767 13334 77004 65549 40802 70632 105948
10671A05948l2493m2352M1555k2863k9850O5169N5844k1032j1232K4598k4750
$$ 105948 73455 31103 72658 49795 19945 85114 140958 119926 108694 133292 108542
10660A08542l0022o0641N1109J16660J5045J649J2168N3261j4870J8982j6341
$$ 108542 78520 17879 68988 185648 200693 202342 214510 267771 252901 271883 255542
10649B55542M2654N7986M8276R1387Q9123J00028O8859j5413m5272O4416L3144
$$ 255542 298196 356182 404458 495845 584968 684996 753855 738442 693170 757586 790730
10638G90730j5602q4547m5348k9425K6771M0705J65139J29789J42593K11661K79917
$$ 790730 775128 690581 645233 615808 642579 683284 848423 978212 1120805 1332466 1612383
10627A612383L25860L61801L00449K48266L44029L46550K14957K48837M00035
$$ 1612383 1938243 2300044 2600493 2848759 3192788 3539338 3754295 4003132 4403167
10618D403167N48128P63731J127341J476111J944282K517955L251271M065647
$$ 4403167 4951295 5715026 6842367 8318478 10262760 12780715 16031986 20097633
10610B0097633M522611M262511L680795L337140K891167K076579Q29183J86818
$$ 20097633 24620244 28882755 32563550 35900690 38791857 40868436 41697619 41884437
10602D1884437O86001K279610M540923O719262P721411P203510O140909N290908
$$ 41884437 42570438 44850048 49390971 56110233 63831644 71035154 77176063 82466971
10594H2466971M126187J527203k010430l860173k773333M97547M407408P794610
$$ 82466971 86593158 88120361 86109931 82249758 79476425 79973972 84381380 92175990
10586I2175990R070873Q143859O272420M699376K504001j909642p414344j0330893
$$ 92175990 101246863 109390722 115663142 120362518 122866519 120956877 113542533 103211640
10578A03211640r100818n395954j402195J646365L043452K653345J642943P01160
$$ 103211640 94110822 88714868 87312673 88959038 92002490 94655835 96298778 96999938
10570I6999938r32861m099394p664592r075442p955347n452878k970832j275539
$$ 96999938 96067077 91967683 84303091 75227649 67272302 61819424 58848592 57573053
10562E7573053m69699m35729q45560j317100k190487l445853m660560n215759
$$ 57573053 57103354 56667625 55822065 54504965 52314478 48868625 44208065 38992306
10554C8992306m881078l988214l085859k354943j741340j400926j172952j009874
$$ 38992306 34111228 30123014 27037155 24682212 22940872 21539946 20366994 19357120
10546A9357120q58136p28422o76460p05367o73634o08149n50899m95907m17473
$$ 19357120 18498984 17770562 17094102 16388735 15715101 15106952 14556053 14060146 13642673
10537A3642673l62183m04364l83346l82153l89985l25591k99060l13379k84004
$$ 13642673 13280490 12876126 12492780 12110627 11720642 11395051 11095991 10782612 10498608
10528A0498608j82947k12946k29866k17658k29216k45721l27397j89190j77875
$$ 10498608 10315661 10102715 9872849 9655191 9425975 9180254 8852857 8663667 8485792
10519H485792j43644k49589k37394j64844j51971j37291j65673j94126j71964
$$ 8485792 8342148 8092559 7855165 7690321 7538350 7401059 7235386 7041260 6869296
10510F869296j14360j20473j62181j52393j11080j26535r8612j32222j43014j78693
$$ 6869296 6754936 6634463 6472282 6319889 6208809 6082274 5983662 5851440 5708426 5529733
10500E529733j11727q1925r9720r9254j20393j16059o2846o0948j56786m5930
$$ 5529733 5418006 5336081 5236361 5137107 5016714 4900655 4837809 4776861 4620075 4574145
10490D574145n3801o8559q4007n0341j10267q4701j05438o0398j19382r4804q6520
$$ 4574145 4520344 4451785 4367778 4317437 4207170 4122469 4017031 3956633 3837251 3742447 3655927
10479C655927L947j10756n3398j7029o0059q8149l4489j18743r4328J238k7530
$$ 3655927 3659874 3549118 3495720 3478691 3418632 3330483 3295994 3177251 3082923 3084161 3056631
10468C056631r7553o7585P292K287m1279m8052j00705r9922r4411l6325Q04j2089
$$ 3056631 2959078 2891493 2898785 2901072 2859793 2811741 2711036 2611114 2516703 2480378 2481182 2469093
10456B469093j4044k1053k4716k1496q8436n9725O4113m3379r4338o6058n7398
$$ 2469093 2455049 2433996 2409280 2387784 2299348 2239623 2303736 2260357 2166019 2099961 2042563
10445B042563l5689k2476o487N167o4257q4081j33369k459J6863l031j3065m841
$$ 2042563 2006874 1984398 1977911 1983078 1918821 1834740 1701371 1698912 1715775 1712744 1699679 1694838
10433A694838m630L0126k083l0346q5103p6401n6911m7566j9648m3934j1957n2059
$$ 1694838 1690208 1720334 1718251 1687905 1602802 1526401 1469490 1421924 1402276 1358342 1346385 1294326
10421A294326q3534L5787P6667o4661J4149l9156j5121L6180k0607l2814p2206
$$ 1294326 1210792 1246579 1323246 1258585 1272734 1233578 1218457 1254637 1234030 1201216 1129010
10410A129010q0720N8575Q1962p3802n5131j07248o9670L6899M7661j7560M367
$$ 1129010 1048290 1106865 1188827 1115025 1059894 952646 882976 919875 967536 949976 954343
10399I54343J0409l6095j7606l010k6004J4683J7054J9172Q071l5822l5408k2606
$$ 954343 964752 928657 911051 908041 882037 896720 913774 932946 941017 905195 869787 847181
10387H47181O4429J250p1065j6482J3747O74j4343l822l1562p0473k383L0618
$$ 847181 911610 912860 841795 825313 839060 839734 825391 821569 790007 719534 717151 747769
10375G47769j1294j4227L6996j7318J2888k9952q6452m5033o0503O6919Q1701
$$ 747769 736475 722248 759244 741926 754814 724862 638410 593377 532874 599793 681494
10364F81494n4393k09J4779l5083n2212k0941l3420q087k1283k0839P0313O1072
$$ 681494 627101 626892 641671 606588 554376 533435 500015 491928 470645 449806 520119 581191
10352E81191K1972m1700K2595M2007K8503m4808k0536n3212J4349M7327P343k9704
$$ 581191 603163 561463 584058 626065 654568 609760 589224 536012 550361 597688 605031 575327
10340E75327k8820o1504j3641j13009n1079L9371N3712m4349Q3396M5747N4234
$$ 575327 546507 485003 471362 358353 307274 346645 400357 356008 439404 485151 539385
10329E39385m544r4969n568j8597M3871J0864l3367q4827M4711J17628J1900o3773
$$ 539385 534841 439872 434304 415707 459578 470442 437075 352248 396959 514587 526487 462714
10317D62714r7325m7969n1682J9054N1846M2032r1717k9040o8203M8485R4903
$$ 462714 365389 317420 265738 284792 336638 378670 286953 257913 189710 238195 333098
10306C33098L1409l7314p050J9787l8410L6715L5778l9110o3814l0246j3163J3210
$$ 333098 364507 327193 320143 339930 301520 338235 374013 334903 271089 240843 227680 240890
10294B40890N1638N7829P304j2263m06m2791k2360J4406J9825q662k8343n481
$$ 240890 292528 350357 357661 345398 344992 302201 279841 294247 314072 305410 277067 271586
10282B71586l8390J5494P1963J5481R510J5550m121m4410n232j1210L9356o6821
$$ 271586 233196 248690 320653 336134 345644 361194 357073 312663 307431 296221 335577 268756
10270B68756m4773j6509k8258L2703l8938k3083L547M2413L5932K7693p876j04313
$$ 268756 223983 207474 179216 211919 172981 149898 153445 195858 231790 259483 251607 147294
10258A47294L6137l7959n8390L540Q5406P0233O203l2093k3884J9058m6240o6410
$$ 147294 183431 145472 87082 90622 176028 246261 252464 220371 196487 215545 169305 102895
10246A02895m8056j5285j6129K8131O4514N3835k6898k6017R7028N8582o249r1054
$$ 102895 54839 39554 23425 51556 116070 169905 143007 116990 214018 272600 266351 175297
10234A75297k1962P0016p31k6350m4936O7827l5924L75J7779n0957m0048j743
$$ 175297 153335 223351 222620 196270 151334 219161 183237 183612 201391 150434 110386 108643
10222A08643K360J5052Q5659m1537O115K7051L0686J3571P607m719p8633q9964
$$ 108643 111003 126055 211714 170177 176292 203343 234029 247600 255207 250488 171855 81891
10210H1891r3217L9861N6048k9285L6547M7357l6685R850P6032L9970n2228l8776
$$ 81891 -11326 28535 84583 55298 91845 139202 102517 112367 188399 228369 176141 137365
10198A37365m5568K737R698O826j9721M5878M6147M9638j7425p1471j3275J5663
$$ 137365 91797 94534 104232 111058 91337 137215 183362 233000 215575 144104 130829 146492
10186A46492N2311j2972n2400q3513L781J08815L2992j7673j0678N6304J8854
$$ 146492 198803 185831 133431 49918 53699 162514 195506 177833 167155 223459 242313
10175B42313Q783k6384k78Q487K8587j360n619N6008L0276N484Q325P7714L4378
$$ 242313 251096 224712 224434 232921 261508 260148 254529 310537 340813 346297 354622 432336 466714
10162D66714m593l2801K370M622L7488R0658O6972K2115o6989j888L5357M0768
$$ 466714 462121 429320 431690 436312 473800 564458 631430 653545 586556 584668 620025 660793
10150F60793O9763J6906K5793r774J5075m7047K1837m1531m8965r8704m6267K7921
$$ 660793 730556 747462 773255 763481 778556 731509 753346 711815 662850 564146 517879 545800
10138E45800o498O289j6470J6148N8587q133l7670p5649j2877m4197n8253J8542
$$ 545800 539302 545591 529121 545269 603856 595723 558053 482404 469527 425330 367077 385619
10126C85619k500o6850O3780N7501j8065p6759n3658l2408j8855j4126l3310K4178
$$ 385619 383119 316269 380049 437550 419485 342726 289068 256660 237805 223679 190369 214547
10114B14547Q1041l1570p9050l1004j9398K2449j0804K3196M2789J9097J6934
$$ 214547 295588 264018 184968 153964 134566 157015 146211 169407 212196 231293 248227
10103B48227p68l9432l3926J4957m3940N0228m3269L001k479j0780m4577O96N198
$$ 248227 247459 208027 174101 189058 145118 195346 152077 155078 152599 141819 97242 97938 103136
10090A03136N8525K3934K8060n7625o3628p4046M4076N4884j0406P465L1748l9348
$$ 103136 161661 185595 213655 156030 92402 18356 62432 117316 106910 114375 146123 106775
10078A06775K4528p602o8540m2445J6515n0047j6901j0987M0375M7592M565j8623
$$ 106775 131303 123701 55161 12716 29231 -20816 -37717 -48704 -8329 39263 43828 25205
10066B5205L2371M7190m4683Q433R243R4045N2507k4152o5674j5316j787m8899
$$ 25205 57576 104766 60083 68516 77759 171804 224311 200159 134485 119169 117382 68483
10054F8483j2461O3276o830l4000L7188l1082m1910k0656M4357O4230m6093k7104
$$ 68483 56022 119298 112468 78468 115656 84574 42664 22008 66365 130595 84502 57398
10042E7398n6032M296K496M6570J2396l9510K0246l7259m3008Q072K9585M5421
$$ 57398 1366 5662 8158 54728 67124 27614 47860 10601 -32407 -24335 5250 50671
10030E0671L5604J1006P2345k5482k2969k3054m2488L6759j3100o2899M1124L2139
$$ 50671 86275 97281 169626 144144 121175 98121 55633 92392 79292 16393 57517 89656
10018H9656M620o7667n5809o690M4282L1893N2804m162l9290M601J5190L0783
$$ 89656 94276 26609 -29200 -35890 8392 40285 93089 88927 49637 54238 69428 100211
10006A00211o7861p837N6599K3844l1357J9704K360m9460m1602K9445Q9594k4726
$$ 100211 32350 24513 81112 104956 73599 93303 95663 46203 4601 34046 123640 98914
9994I8914j9635J5477O93n1415l6431m7718K3824n429p265Q334l5394Q164K7837
$$ 98914 79279 94756 95449 44034 7603 -40115 -16291 -21720 -28985 -20651 -56045 -47881 -20044
9981b0044O2764J048l2833P8437R2541p5703p0677K2634J7492m7721k6682q101
$$ -20044 42720 43768 10935 89372 181913 106210 35533 58167 75659 27938 1256 -6845
9969f845j1292j6522R12M9820j0908q840q2199K131P6280J0584m1204l019M3460
$$ -6845 -18137 -34659 -33747 16073 5165 -3675 -85874 -83743 -7463 3121 -38083 -41102 2358
9956B358J3209j3423k1391l5206l3968K8867L6552j0548M1710L266k3516l1945
$$ 2358 15567 2144 -19247 -54453 -88421 -59554 -23002 -33550 8160 11426 -12090 -44035
9944d4035j9369K3704L2238K9319M2228J6493m9417l4632m9985P5010N1550k2428
$$ -44035 -63404 -39700 -7462 21857 64085 80578 31161 -3471 -53456 21554 73104 50676
9932E0676o0673j2842O25l384k1901l464O2559N955K1192m2223L2496R512l8206
$$ 50676 -9997 -22839 -22214 -25598 -47499 -50963 11596 17551 38743 -3480 29016 38528 322
9919C22j9913J9005n221q3367J2493N2185p146R224k8526l2752j4959J5568R9397
$$ 322 -19591 -586 -5807 -89174 -76681 -24496 -31642 -22418 -50944 -83696 -98655 -83087 16310
9906A6310K7809n8264j8816Pp4648L4597J09704j2086q2956m6670K6878O8562
$$ 16310 44119 -14145 -32961 -32954 -107602 -73005 36699 24613 -58343 -105013 -78135 -9573
9894i573L7424n7723j8263P8465N7795k614M3382J5411k8104m770K880K825k3175
$$ -9573 27851 -29872 -48135 30330 88125 85511 128893 144304 116200 111430 114310 117135 93960
9881I3960l5332l5898l8973k3014J2490P2863k1630l0721j6149M5897J27701L3788
$$ 93960 58628 22730 -16243 -39257 -26767 46096 24466 -6255 -22404 23493 151194 184982
9869A84982j66515q2105K5004J3818P3222M7114P308q154j4271q6534r2028j2934
$$ 184982 18467 -63638 -38634 -24816 48406 95520 102828 94674 80403 -6131 -98159 -111093
9857a11093J5379K3500M5305k7234L2314j1957n3275l0656q485l5022l91O6235
$$ -111093 -95714 -72214 -26909 -54143 -21829 -33786 -87061 -117717 -126202 -161224 -161615 -95380
9845i5380J05722O2192K0990k8140n1005R3548P3383j22553r5265J2670K7749
$$ -95380 10342 72534 93524 65384 14379 107927 181310 58757 -36508 -23838 3911
9834C911m9276M1400M4413l6302j1451k2775L3798O7447j6882n6666R205O6764
$$ 3911 -45365 -3965 40448 4146 -7305 -30080 3718 71165 54283 -2383 6822 73586
9822G3586J4295m6320p1373l5093P034M1235Q1914J9045p4994J4463o900M7335
$$ 73586 87881 41561 -29812 -64905 -57871 -16636 65278 84323 9329 23792 16892 64227
9810F4227n058r9566K486j1986r2805n985M8518j9793o045Q7799P4416K1784k0692
$$ 64227 59169 -40397 -37911 -49897 -142702 -148687 -100169 -119962 -126007 -38208 36208 57992 37300
9797C7300j8313P0M6475J3958o154N5958m158m4167l0226Q6763M6823m8517l5268
$$ 37300 18987 19057 65532 79490 73336 129294 125136 80969 50743 137506 184329 135812 100544
9784A00544m3127M4296K2581o444O4436O288R4842K17115K36610L12393N18621
$$ 100544 57417 101713 124294 117850 182286 188574 283416 500531 737141 1049534 1568155
9773A568155M12556K69627K09043K98809J92571k23123n99113n90079n10997l51740
$$ 1568155 1980711 2250338 2459381 2758190 2950761 2727638 2128525 1538446 1027449 675709
9763F75709j33494j33140n5380K5599k4270m7879m3129l922j6398q455Q1201O5848
$$ 675709 542215 409075 353695 379294 355024 307145 264016 260094 243696 235241 316442 382290
9751C82290m0881n2251j7243l3381m5002L8836j5184n5889k0743J4511k7602k2438
$$ 382290 341409 289158 271915 238534 193532 232368 217184 161295 140552 155063 127461 105023
9739A05023L2274M9516k3954J5429p4693j7181j108l4679m7635K4327J0552k2868
$$ 105023 137297 186813 162859 178288 103595 86414 85306 50627 2992 27319 37871 15003
9727A5003m1153Q3020O2909l8082m8140j1179k5544K6202k1542n2665j6444O4670
$$ 15003 -26150 56870 119779 81697 33557 22378 -3166 23036 1494 -51171 -67615 -2945
9715b945M7777J0702m044o5148l3463N1664J2561p4790O5791k4922p1892Q2329
$$ -2945 44832 55534 51490 -13658 -47121 4543 17104 -57686 8105 -16817 -88709 -6380
9703f380r859k5812o035N003m9061J625K1003k0088K7722L0326L7547J0206j8910
$$ -6380 -16239 -42051 -48086 -43083 -92144 -90519 -69516 -89604 -61882 -31556 5991 16197 -2713
9690b713j10058J7552J00603N7705l7083K9517j0499j11576m6197L0865O9420
$$ -2713 -112771 -95219 5384 63089 26006 55523 45024 -66552 -112749 -81884 -12464
9679a2464l844K3722N210k3315p9311K5299K0055j8392J662m1030q3293L1740
$$ -12464 -16308 7414 12624 -10691 -90002 -64703 -44648 -63040 -61378 -102408 -185701 -153961
9667a53961J03994N8224l7699k1138N3523K0478q6124m5584L5136L2873p6964
$$ -153961 -49967 8257 -29442 -50580 2943 23421 -62703 -108287 -73151 -40278 -117242
9656a17242J6157J8445J1981L9064L3546N0036k10O6555N1246j201N0399M9418
$$ -117242 -101085 -82640 -70659 -31595 1951 51987 51777 118332 169578 168377 218776 268194
9644B68194N8248l5398j05647l6455J7220n6390l8775j4206R951o1428j6127j3150
$$ 268194 326442 291044 185397 148942 166162 109772 70997 56791 66742 5314 -10813 -23963
9632b3963M2929K0769m3892M533K5763n9113l472O9063L0201J7361L5895J881
$$ -23963 18966 39735 -4157 376 26139 -32974 -36446 32617 62818 80179 116074 117955
9620A17955o7631j16489k1144J1287j1521n288M7572p718j1182K0117K7296k3096
$$ 117955 50324 -66165 -87309 -76022 -87543 -92831 -45259 -52977 -64159 -44042 -16746 -39842
9608c9842j6971K2953J00059N2013L5202r4150j15281j625J598k6292l1379O536
$$ -39842 -56813 -33860 66199 118212 153414 59264 -56017 -57642 -56044 -82336 -113715 -107179
9596a07179j7589j275J20816K0204n1908k355k9568J32K9895j3001M4184J6339
$$ -107179 -124768 -126043 -5227 14977 -36931 -39286 -68854 -68722 -38827 -51828 -7644 8695
9584H695L2314R3311l7780j00378P222L0182k2001n7165l71N2961K8187l9537
$$ 8695 41009 134320 96540 -3838 3384 33566 11565 -45600 -45971 6990 35177 -4360
9572d360o8605l2314L2974k0607k1O805N0924o2658J1686N1810P3696P3844k6933
$$ -4360 -72965 -105279 -72305 -92912 -92933 -86128 -35204 -97862 -86176 -34366 39330 113174 86241
9559H6241m8013l61K6504K1893j0107K1291O021J594M654q571M908l554J2604
$$ 86241 38228 37867 64371 86264 76157 97448 103469 105063 109717 101146 106054 102500 115104
9546A15104n4728n8640m3348M9875M0812J5091j9639p5431l2575k0399l4686L2710
$$ 115104 60376 1736 -41612 8263 49075 64166 44527 -30904 -63479 -83878 -118564 -85854
9534h5854L715k0176J520J2874L046M141J9108R511K8640m4829k660P112L4121
$$ -85854 -82139 -102315 -100795 -87921 -84875 -80734 -61626 -52115 -23475 -68304 -70964 -63852 -29731
9521b9731K2879j8147l3450p02K5754N8936N9657l2258j5683l1973n6460M639
$$ -29731 -6852 -24999 -58449 -59151 -33397 25539 85196 52938 37255 5282 -51178 -46539
9509d6539R7134J8042K01J275L9492J1748p6513j3125k4489K933o3133j0490O3958
$$ -46539 50595 68637 68838 70113 109605 121353 44840 31715 7226 10159 -52974 -63464 494
9496D94O92j1682o539N3830m1731l1335M9595K3317l1599j8223j0910M735o18
$$ 494 1186 -10496 -17035 36795 -4936 -36271 13324 36641 5042 -13181 -24091 -19356 -19974
9483a9974J97l3372J9441K7659M1039P239p980k285k2361N9792L0593l998m5915
$$ -19974 -19777 -53149 -33708 -6049 34990 42229 34249 31964 9603 69395 99988 95990 50075
9470E0075J5990k2645R5333M2531o7151j02647r467l7620K8877j0243o5485R850
$$ 50075 66065 43420 138753 181284 114133 11486 2019 -35601 -6724 -16967 -82452 -72602
9458g2602m1532j2586N6689k6341M717K9508M7812l0177m1809J3540K7817J5794
$$ -72602 -114134 -126720 -70031 -96372 -91655 -62147 -14335 -44512 -86321 -72781 -44964 -29170
9446b9170l9557K6280K5743N6153M3633n2266r407n6053K0547L7135q792m7559
$$ -29170 -68727 -42447 -16704 39449 83082 30816 21409 -34644 -14097 23038 14246 -33313
9434c3313j2455k381j1217j1834l183K0434M5137J3999k035O4732K0008k1404
$$ -33313 -45768 -48149 -59366 -71200 -74383 -53949 -8812 5187 3152 67884 87892 66488
9422F6488p9778l1981j9035L2229O236m4594j9429k1450k4544J8369R7523j7499
$$ 66488 -13290 -45271 -64306 -32077 -25841 -70435 -89864 -111314 -135858 -117489 -19966 -37465
9410c7465p8061J2941K5120J5765K7060O498J5112M9693N8197j22660q0595j2879
$$ -37465 -115526 -102585 -77465 -61700 -34640 -28142 -13030 36663 94860 -27800 -108395 -121274
9398a21274P6589j1845o896N0532K0405k4J3382j7268k8730P22j6508k6911j0018
$$ -121274 -44685 -56530 -63426 -12894 7511 7487 20869 3601 -25129 -24407 -40915 -67826 -77844
9385g7844O569j5759O7709j4938N8085j2061k909m3779l8190J3789l9671o8523
$$ -77844 -71275 -87034 -19325 -34263 23822 11761 8852 -34927 -73117 -59328 -98999 -167522
9373a67522K2894J03116O1510n9583n2761O6929L7829L1998l852j414k7997m9404
$$ -167522 -144628 -41512 19998 -39585 -92346 -25417 12412 44410 40558 39144 11147 -38257
9361c8257N0025O5364j1264r364l1764K0376k376L070j5861l0357o1464K4678
$$ -38257 11768 77132 65868 56504 24740 45116 42740 45810 29949 -408 -61872 -37194
9349c7194K5965L6684J838l5008K8228L0352q587p9757j263L0205o848l4357N7415
$$ -37194 -11229 25455 27293 -7715 20513 50865 42278 -37479 -38742 -8537 -15385 -49742 7673
9336G673J828R001J1945l9924m4537K3505K31m4929O0357m7670L7401N3063N5805
$$ 7673 9501 18502 30447 -9477 -54014 -30509 -30278 -75207 -14850 -62520 -25119 27944 83749
9323H3749m8777m7041n9427k1509k1734M9129P1843o0064j3920K7476l2734n266
$$ 83749 34972 -12069 -71496 -93005 -114739 -65610 6233 -53831 -67751 -40275 -73009 -78275
9311g8275M2864m6313O2098J21004J6761m7060m1803q9487l5822P9357Q0973j049
$$ -78275 -35411 -81724 -19626 101378 118139 71079 29276 -60211 -96033 -16676 64297 63248
9299F3248J8936p9845J8776j8829M5839J2090n6200M0884j924n0523K5514P4620
$$ 63248 82184 2339 21115 2286 48125 60215 4015 44899 42975 -7548 17966 92586
9287I2586o684n241L7270j7033r6338P426N4677o4756q3514j5978K9516k0848
$$ 92586 85902 80661 117931 100898 4560 11986 66663 1907 -81607 -97585 -68069 -88917
9275h8917K2226o47M6202n236L3661o2170m5582o0899O4320J26428J608m0753
$$ -88917 -66691 -67338 -21136 -26372 7289 -54881 -100463 -161362 -97042 29386 30994 -9759
9263i759m7579K5056J7457M0799k2370K683Q557j3856o3337K7532J2675M1479
$$ -9759 -57338 -32282 -14825 25974 3604 6287 14844 988 -62349 -34817 -22142 19337
9251A9337P4250Q2621n6928m3831n1593l8019O3748M2731J2456n5833k8591O2276
$$ 19337 93587 176208 119280 75449 23856 -14163 49585 92316 104772 48939 20348 82624
9239H2624K3563R519N0857L3519J3629l3019J5387K8361K2099Q694j9869L4227
$$ 82624 106187 115706 166563 200082 213711 180692 196079 224440 246539 255233 235364 269591
9227B69591M4870K7869P3808P4147J59698J45795P8782R9170J9891J48966J09774
$$ 269591 314461 342330 416138 490285 649983 795778 874560 973730 993621 1142587 1252361
9216A252361j6033P7405L6594J7108j8790j406O977l5859k9865o1143j11310j73761
$$ 1252361 1236328 1313733 1350327 1367435 1348645 1347239 1354216 1318357 1288492 1227349 1116039 942278
9204I42278r4074o7777r5616q5636L837K8921k4177r6431l7603q5726q7984n8933
$$ 942278 848204 780427 684811 599175 603012 631933 607756 511325 473722 387996 300012 241079
9192B41079K591K0602r196K3027K2032k3914m4381K8418j1006k6705j4377n8874
$$ 241079 243670 264272 255076 278103 300135 276221 231840 260258 249252 222547 208170 149296
9180A49296l4186K1272R097m1577k5273J9401M4843q305K9596P285l0453r2097
$$ 149296 115110 136382 145479 103902 78629 98030 142873 134568 164164 171449 140996 48899
9168D8899q2878l6532L1894P0648J953M8250M9114M2167j1685N6342n6239n9498
$$ 48899 -33979 -70511 -38617 32031 33984 82234 131348 173515 161830 218172 161933 102435
9156A02435N629J4785k7344q3463J0119M7052M7750J2274j08396r7359R3063Q926
$$ 102435 108064 122849 95505 12042 22161 69213 116963 129237 20841 -76518 16545 25471
9144B5471k3633k873J2199r06M3099j3081J2030O0770J5836k1121m2533J4788
$$ 25471 1838 -1035 11164 10258 53357 40276 52306 113076 128912 107791 65258 80046
9132H0046k4126m1916p3136n5410O8520j2905M3346N6586p1540m3898q718J2315
$$ 80046 55920 14004 -59132 -114542 -46022 -58927 -15581 41005 -30535 -74433 -83151 -70836
9120g0836N6079R9289K4128K82n1039K4043p317p2936K8681J320K5418Q391J9432
$$ -70836 -14757 84532 108660 108942 57903 81946 74629 1693 30374 31694 57112 65503 84935
9107H4935N351m7982J5254N5275q837p4078m7378P733j4458j7153n1506p9174
$$ 84935 90286 42304 57558 112833 103996 29918 -17460 -9727 -24185 -41338 -92844 -172018
9095a72018L3985n1303L6393O6726j8720J5749K8086j0012j8299L7057K3325M8808
$$ -172018 -138033 -189336 -152943 -86217 -104937 -89188 -61102 -71114 -89413 -52356 -29031 19777
9083A9777M9766l7026m0034l4696L2887N3612O6431N5136L5715K64K2576K6428
$$ 19777 69543 32517 -7517 -42213 -9326 44286 110717 165853 201568 201832 224408 250836
9071B50836L2725o33l7877m3464K1959L2118L9657j14537r9533k1317j6076o478
$$ 250836 283561 282928 245051 201587 223546 255664 295321 180784 81251 59934 43858 37380
9059C7380M9453k0410n8853K2974K4268L6557R278M3765L648p2466j7317k770
$$ 37380 86833 66423 7570 30544 54812 91369 100647 144412 148060 75594 58277 55507
9047E5507J9251n0672j2676N5259j3648P964R304n2800L6173P8561J7781l256
$$ 55507 74758 24086 11410 66669 53021 60985 70289 17489 53662 132223 150004 146748
9035A46748j863j9944j6018j09426l0256L7920J781J0598R20K0859j1005l6884
$$ 146748 144885 124941 108923 -503 -30759 7161 8942 19540 20460 41319 30314 -6570
9023f570o324P9751q072M6112q1744l906K1228j949O1596J2767K1895l043N6950
$$ -6570 -12894 66857 58785 104897 23153 19247 40475 38526 100122 112889 134784 131741 188691
9010A88691J3319q1772M1913J07067N6109j6224M7309J0120r637o010k6214M9685
$$ 188691 202010 120238 162151 269218 325327 309103 356412 366532 356895 350885 324671 374356
8998C74356J0361o4475J620J3997l3608j9446L760j3660l3364J9107q301k3423
$$ 374356 384717 320242 321862 335859 302251 282805 286565 272905 239541 258648 250347 226924
8986B26924k2489n0906j3072o279j1158J6414M4131L0776k8859k7624K1178M556
$$ 226924 204435 153529 140457 134178 123020 139434 183565 214341 185482 157858 179036 183592
8974A83592j8997M035n5518k0977J6424L2326j6239N3465M7479o7055j2975J7998
$$ 183592 164595 168630 113112 92135 108559 140885 124646 178111 225590 158535 145560 163558
8962A63558j0726M0989P2935j8661j55K1555N78K2338J1614j8437L4477O4804
$$ 163558 152832 193821 266756 248095 247940 269495 270073 292411 304025 285588 320065 384869
8950C84869o6889j1611O8437K0780l6713Q2285L6902j6404J9672k3826k2757m685
$$ 384869 317980 306369 374806 395586 358873 441158 478060 461656 481328 457502 434745 430060
8938D30060L627k8739L962L6806P416L9334K9135O0284J6895P713o6580r3329
$$ 430060 433687 404948 408910 445716 453132 492466 521601 581885 598780 606493 539913 446584
8926D46584L9771N9303J00616L5729m8207K188J0513l1825R404m8988J3363J8036
$$ 446584 486355 545658 646274 682003 633796 635984 646497 614672 624076 575088 588451 606487
8914F06487P1431L76k0266M1621K5566P5402k905L8907l2458M8413M5612J0880
$$ 606487 677918 678294 658028 699649 725215 800617 797712 836619 804161 852574 898186 909066
8902I09066L6730K6650O6110p80n1846J6956K3590N8557P2897J46934L7133n4195
$$ 909066 945796 972446 1038556 1037776 985930 1002886 1026476 1085033 1157930 1304864 1341997 1287802
8890A287802O6690Q1852M6372M7792P4352P6316n419J5636k8164M6222Q0831P8411
$$ 1287802 1354492 1436344 1482716 1530508 1604860 1681176 1675757 1691393 1663229 1709451 1790282 1868693
8878A868693J12741Q1147R2233Q1327J26302N6614K2545Q2184J37665J18111J09131
$$ 1868693 1981434 2062581 2154814 2236141 2362443 2419057 2441602 2523786 2661451 2779562 2888693
8867B888693J36104J42566J75625J55221J40926J53600K04586L00543L49793K41404
$$ 2888693 3024797 3167363 3342988 3498209 3639135 3792735 3997321 4297864 4647657 4889061
8857D889061K88204K65545K81581L54598M06624M78618M56742M48597N22194N59179
$$ 4889061 5177265 5442810 5724391 6078989 6485613 6964231 7420973 7869570 8391764 8950943
8847H950943O58098P26784P95725Q84138R43495J055066J225557J480748J633795
$$ 8950943 9609041 10335825 11131550 12015688 12959183 14014249 15239806 16720554 18354349
8838A8354349J791699K073778K380604K769707L276401L800054M483239N367576
$$ 18354349 20146048 22219826 24600430 27370137 30646538 34446592 38929831 44297407
8830D4297407O238695P368040Q912970J0847978J3464519J6651532K0539353K5017250
$$ 44297407 50536102 57904142 66817112 77665090 91129609 107781141 128320494 153337744
8822A53337744K9722696L3631759L5673771L4592102L0381419K3503422J4251083
$$ 153337744 183060440 216692199 252365970 286958072 317339491 340842913 355093996
8815C55093996L181774r071366k0557651k9008429l2844596l2557983k9480753
$$ 355093996 358275770 349204404 328646753 299638324 266793728 234235745 204754992
8808B04754992k5356550k1117882j7394537j4285005j1834415r805987q367430
$$ 204754992 179398442 158280560 140886023 126601018 114766603 104960616 96593186
8801I6593186p147879o272116n567282m942638m365487l986405l568364l195095
$$ 96593186 89445307 83173191 77605909 72663271 68297784 64311379 60743015 57547920
8793E7547920k864224k560277k388061k271433k197178k037797j814025j698764
$$ 57547920 54683696 52123419 49735358 47463925 45266747 43228950 41414925 39716161
8785C9716161j564736j374750j341978j219211j108952j085928j015034r50097
$$ 39716161 38151425 36776675 35434697 34215486 33106534 32020606 31005572 30055475
8777C0055475q84699r35732r42057q71401p60643p14113p15433p48329o70484
$$ 30055475 29170776 28235044 27292987 26421586 25660943 24946830 24231397 23483068 22812584
8768B2812584o40571n97554n36290n27089n44220n65899m70682m38081m45616
$$ 22812584 22172013 21574459 21038169 20511080 19966860 19400961 18930279 18492198 18046582
8759A8046582m26825m20558l90906m14149l73792l22432l68093l71763l40134
$$ 18046582 17619757 17199199 16808293 16394144 16020352 15697920 15329827 14958064 14617930
8750A4617930l35887l69767l22748k71878k75660k98575k59994l00190k38757
$$ 14617930 14282043 13912276 13589528 13317650 13041990 12743415 12483421 12183231 11944474
8741A1944474k16929k34026k71349k65976j90342j98423l29942k02829j21144
$$ 11944474 11727545 11493519 11222170 10956194 10765852 10567429 10237487 10034658 9913514
8732I913514j15723k10371k87290k46378j74164j23222k06189j34795j72449k02552
$$ 9913514 9797791 9587420 9300130 9053752 8879588 8756366 8550177 8415382 8242933 8040381
8722H040381j97731j35341j16905j09210j18289p5194j55968j59579j22994j46520
$$ 8040381 7842650 7707309 7590404 7481194 7362905 7287711 7131743 6972164 6849170 6702650
8712F702650o0041n1473j36815r3164j07777k14077j29673q1404j57085j53671
$$ 6702650 6642609 6591136 6454321 6361157 6253380 6039303 5909630 5828226 5671141 5517470
8702E517470n7722o6390m9744q6501m5983j3302J0702m0276n1751q6474j25858
$$ 5517470 5459748 5393358 5343614 5257113 5211130 5197828 5208530 5168254 5116503 5030029 4904171
8691D904171j08929r5304j18460r6704j36844j20419l5457o2444j84203j63944
$$ 4904171 4795242 4699938 4581478 4484774 4347930 4227511 4192054 4129610 3945407 3781463
8681C781463l2168j7377k0847n0760p8947l1093m3234n804j42332p1344M7780
$$ 3781463 3749295 3731918 3711071 3660311 3581364 3550271 3507037 3501233 3358901 3287557 3335337
8670C335337m4241m7720m7171p4396m6223o4202n7624J6152p0680l5242p96p395
$$ 3335337 3291096 3243376 3196205 3121809 3075586 3011384 2953760 2969912 2899232 2863990 2863194 2855799
8658B855799M5552q4660l6459o0478m7547q2947o5951m5565l4116o0815p7052
$$ 2855799 2901351 2816691 2780232 2719754 2672207 2589260 2523309 2477744 2443628 2382813 2305761
8647B305761m002m9261m4930j5130j3089r6913j05348m8100J9549J9782l0867
$$ 2305761 2301759 2252498 2207568 2192438 2179349 2082436 1977088 1928988 1948537 1968319 1937452
8636A937452k4429o7511p2886P268J6397l3892j25779k0484J8448k8091O220Q974
$$ 1937452 1913023 1845512 1772626 1779894 1796291 1762399 1636620 1616136 1634584 1606493 1612713 1621687
8624A621687j8652n5474J6510M898m1413K0503o2660m7150J099l5544O2736J8653
$$ 1621687 1603035 1547561 1564071 1568969 1527556 1548059 1485399 1438249 1439348 1403804 1466540 1485193
8612A485193k654j12672o2675J8700J0311m539J9172j172j3169k288O4118N8715
$$ 1485193 1482539 1369867 1307192 1325892 1336203 1331664 1350836 1349664 1336495 1334207 1398325 1457040
8600A457040K5747P513o4498p0898n9297J7549j3364o5669j08104p0678J11889
$$ 1457040 1482787 1490300 1425802 1354904 1295607 1313156 1299792 1234123 1126019 1055341 1167230
8589A167230J11715L2366j9875m6625l6004J3443J5885K3885J5763j9937l1712
$$ 1167230 1278945 1311311 1291436 1244811 1208807 1222250 1238135 1262020 1277783 1257846 1226134
8578A226134j14361p9095J627K8425K8892O8047l5761J6642j4712n6712J2288
$$ 1226134 1111773 1032678 1034305 1062730 1091622 1159669 1123908 1140550 1125838 1069126 1081414
8567A081414K0678M0035l8996m3197o402R217k4392J2042k1054n3066n3528J9334
$$ 1081414 1102092 1142127 1103131 1059934 1053532 1062749 1038357 1050399 1029345 976279 922751 942085
8555I42085J2711K9545N6119R660q1435r8874n2453l2052J8884M6865J8392k7070
$$ 942085 954796 984341 1040460 1050120 968685 869811 817358 785306 804190 851055 869447 842377
8543H42377p1588K3228J9168o6571N029K9419L7028k6875L194j2917m7490N4442
$$ 842377 770789 794017 813185 746614 751643 781062 818090 791215 794409 781492 734002 788444
8531G88444O9396K0114l0022J5156J14099K01173O6480l2717L4359P0737m5610
$$ 788444 857840 877954 847932 863088 977187 1178360 1244840 1212123 1246482 1317219 1271609
8520A271609j78261j18592j94909q6157K5471J0964N3849m8381q9273m3031o610
$$ 1271609 1093348 974756 779847 693690 719161 730125 783974 735593 646320 603289 596679
8509E96679K9075L638Q418J6880K6652k4522M525M337o6342J8511R364Q129Q361
$$ 596679 625754 629392 637810 654690 681342 656820 661345 665682 599340 617851 627215 635344 643705
8496F43705k2303p2866j6421Q2666L6470p5163l2497P51j9787Q8295M3636M8992
$$ 643705 621402 548536 532115 614781 651251 576088 543591 544342 524555 612850 656486 705478
8484G05478Q3342K55192L63467K12109K2391L9690J56687J22521j66230l42035
$$ 705478 788820 1044012 1407479 1619588 1641979 1681669 1838356 1960877 1794647 1452612
8474A452612k26118j61424j81861r5735o1940n7578q0102m6227n675L385k9523
$$ 1452612 1226494 1065070 883209 787474 725534 667956 587854 541627 535952 539337 509814
8463E09814M7874K9411k1837q1689q69N569M7409r369K4374m2181m4783J0028
$$ 509814 557688 587099 565262 483573 482704 488273 535682 526313 550687 508506 463723 473751
8451D73751p5073p9121P6717L5763K8772m115M9886P0412l4624j8727k761J1995
$$ 473751 398678 319557 396274 432037 460809 456694 506580 576992 542368 523641 520880 532875
8439E32875J40903J16751J44372J21758n006j5593J39209J48448n4826j98448
$$ 532875 673778 790529 934901 1056659 1051653 1036060 1175269 1323717 1268891 1070443
8429A070443j37487p9791Q03J7994J3784k6317J06907J87252R3434n644J12351
$$ 1070443 932956 853165 853968 871962 885746 859429 966336 1153588 1247022 1241378 1353729
8418A353729J31646N3372O1310J19259N5078O6890N3492o8308m4214o1925m6528
$$ 1353729 1485375 1538747 1600057 1719316 1774394 1841284 1894776 1826468 1782254 1720329 1673801
8407A673801r6927r0314p3242j21527q6233k3361l1076j08094n1414q6558n3922
$$ 1673801 1576874 1486560 1413318 1291791 1205558 1182197 1151121 1043027 991613 905055 851133
8396H51133p8740r0133l0023l2735J5644J3106m1591j4115j1261j6886p3538j26642
$$ 851133 772393 682260 652237 619502 635146 648252 606661 592546 581285 564399 490861 364219
8384C64219L2827K8361j4987j8693k625r739M3072J7695m6052l6506m5953J0575
$$ 364219 397046 425407 410420 391727 389102 379363 422435 440130 394078 357572 311619 322194
8372C22194L4758L9967j586M9022R4915M4635p6661j20140n7562N8864q188j2816
$$ 322194 356952 396919 395333 444355 539270 583905 507244 387104 329542 388406 380218 367402
8360C67402l5620l4674l5406M2160j5040J2241R0528r451L5570m4909r9835l5894
$$ 367402 331782 297108 261702 303862 288822 301063 391591 382140 417710 372801 272966 237072
8348B37072Q4415l4017l146J0148l4924J482m6974j1860N6570R7392k2692k4570
$$ 237072 321487 287470 284324 294472 259548 261030 214056 202196 258766 356158 333466 308896
8336C08896M4291o9134J3353J05509l2521n2435o7014k3031M0557J7295N8693
$$ 308896 353187 284053 297406 402915 370394 317959 250945 227914 268471 285766 344459
8325C44459j1245m7260N2217K5909j8520p4242L328K9613k6777K854m9431k3835
$$ 344459 333214 285954 338171 364080 345560 271318 274646 304259 277482 280336 230905 207070
8313B07070O2671N9195n2909l4364l0596L4914O942n620J8573m6362k2160l3434
$$ 207070 269741 328936 276027 241663 211067 245981 252923 247303 265876 219514 197354 163920
8301A63920m5226J451J3564O4317N1128j6596J1012l9529Q682j3557l3931K090
$$ 163920 118694 120145 133709 198026 249154 232558 243570 204041 212723 199166 165235 167325
8289A67325M876J6697P8446j1849m8123l764j8682J5522J6545J6667M6213o1227
$$ 167325 172201 188898 267344 255495 207372 203608 184926 200448 216993 233660 279873 218646
8277B18646m5846j17774p2089O1993M6885j2774K6119K7934m8998k5089K2486
$$ 218646 172800 55026 -17063 44930 91815 79041 105160 133094 84096 59007 81493
8266H1493K2681N5078N1106L7746J6917l0181k2112m357J7996O6853P3053m7985
$$ 81493 104174 159252 210358 248104 265021 234840 212728 208371 226367 293220 366273 318288
8254C18288o6116n3346j2456n2741l1873L5759M8080L8767j8219j150O664J1846
$$ 318288 252172 198826 186370 133629 101756 137515 185595 224362 206143 204993 211657 223503
8242B23503J7773q307J5017p2325K1960J2805L4157n1225l0547p554N211p6864
$$ 223503 241276 232969 247986 175661 197621 210426 244583 193358 162811 155257 160468 83604
8230H3604n1688K6603K7753K3948R66k4204K6518J352j4682l4800J0321M481J795
$$ 83604 31916 58519 86272 110220 111186 86982 113500 114852 100170 65370 75691 80172 81967
8217H1967J3803K3560O6064N5137N7965M7818p8950r5831J6800j4064K269J0249
$$ 81967 95770 119330 185394 240531 298496 346314 267364 171533 188333 174269 176538 186787
8205A86787q9036j6356R9141J1633n4537q254N4936j8565N946L6171L0990J3505
$$ 186787 97751 81395 180536 192169 137632 129378 184314 165749 171695 207866 238856 252361
8193B52361j1517o4407k5876J1005R691k3655n2599k4352k1519K3529K7265l4989
$$ 252361 240844 176437 150561 161566 171257 147602 95003 70651 49132 72661 99926 64937
8181F4937j7557J6507R0778K669m7786p923N1335N4596L6320n1033j7003J2561
$$ 64937 47380 63887 154665 157334 109548 101625 152960 207556 243876 192843 175840 188401
8169A88401k7357L177j0573q9751l4829j760N9282K8175N6539l1346j3590j39
$$ 188401 161044 164221 153648 63897 29068 27308 86590 114765 171304 139958 126368 126229
8157A26229j2349l4335N6420K3195M7440k2890j4783J8878J8924K5297Q922J8308
$$ 126229 113880 79545 135965 159160 206600 183710 168927 187805 206729 232026 240948 259256
8145B59256k5966m2216n0677o713O421Q8007J2377q5121q0140M0250K6863k9650
$$ 259256 233290 191074 140397 133684 140105 228112 240489 155368 75228 115478 142341 112691
8133A12691J6479K4290j04330k4274K1188J9265Q481L402L2809m0147l2746M2366
$$ 112691 129170 153460 49130 24856 46044 65309 73790 77192 110001 69854 37108 79474
8121G9474q251L0835O0885k865R810o5836O756m829l2616k9744J3763k6385j4882
$$ 79474 71223 102058 162943 160078 169888 104052 110808 105979 73363 43619 57382 30997 16115
8108A6115l5546M6617O2149K5921K9032N024j01249j6416M2704J9852K358n617
$$ 16115 -19431 27186 89335 115256 144288 149312 48063 31647 74351 94203 96561 90944
8096I0944M8521J0064m3349p129K9167M2705M0948k6006p732K9674o6577K5633
$$ 90944 139465 149529 106180 99051 128218 170923 211871 185865 178133 207807 141230 166863
8084A66863m7306k3646M2404k3167k915j8557K4441N9206k7433q5362k9093M4351
$$ 166863 119557 95911 138315 115148 112233 93676 118117 177323 149890 64528 35435 79786
8072G9786J44237o641q7124m4213o4545l2909L4736O9137P5819O639L8582N0382
$$ 79786 224023 217382 130258 86045 21500 -11409 23327 92464 168283 174922 213504 263886
8060B63886k1443l2973m3888l941q1747p9025L6605P8745L6416K606p4869k5564
$$ 263886 242443 209470 165582 161641 79894 869 37474 116219 152635 155241 80372 54808
8048E4808K0388n8002R23O4924q068m198k736p396N4850l4833J2772o7691J8509
$$ 54808 75196 17194 18117 83041 74973 70775 68039 60643 115493 80660 93432 25741 44250
8035D4250P5724J324o2821q513M6869L7460N3690l429N239l1149j7757k6814L1770
$$ 44250 119974 121298 58477 49964 96833 134293 187983 184554 189793 158644 140887 114073 145843
8022A45843K4761J4959o8466J0017J9350n860l8845k0412Q523l1442P862q8103
$$ 145843 170604 185563 117097 127114 146464 140604 101759 81347 89870 58428 66290 -21813
8010b1813J2307O5176Q1021l1048j5051k97o4651K5148O2263j7880j7791P4127
$$ -21813 -9506 55670 136691 105643 90592 90295 25644 50792 113055 95175 77384 151511
7998A51511L6322M7928j973l0252m9685p854l7436k0930m3635l0580M9882O5241
$$ 151511 187833 235761 233788 203536 153851 145997 108561 87631 43996 13416 63298 128539
7986A28539m9093L3671N4327N5704l5532j9706j828K3181J7823p8156r6162M171
$$ 128539 79446 113117 167444 223148 187616 167910 166082 189263 207086 128930 32768 36939
7974C6939M5581M7365j5001n768M3935l4700Q891J1160O7606Q379p8223r93J8057
$$ 36939 82520 129885 114884 109116 153051 118351 127242 138402 206008 214387 136164 135171 153228
7961A53228N911r745N5514m1813n1279N0048n4991n190M6552J3018o2190k1050
$$ 153228 159139 149394 204908 163095 111816 161864 106873 101683 148235 161253 99063 78013
7949G8013M8100N9949J9462L0779L0737K5539m5889j5328M321J7389K0412J5144
$$ 78013 126113 186062 205524 236303 267040 292579 246690 231362 235683 253072 273484 288628
7937B88628J67O8553K6622o925r5417q4424n3J4250l0843k5139J9644o3481M2833
$$ 288628 288795 357348 383970 377045 281628 197204 197151 211401 180558 155419 175063 111582 154415
7924A54415L8341m5961o7499j2102J0169N6213J3779l3858j8367k9240K6754K3055
$$ 154415 192756 146795 79296 67194 77363 133576 147355 113497 95130 65890 92644 115699
7912A15699J8312M6737K0491j9586k6889P338p598k2977o0553L5903O5632K8360
$$ 115699 134011 180748 201239 181653 154764 162102 154504 131527 70974 106877 172509 200869
7900B00869m3150k9855K3575p486l3414l266L1273k5536M369O4769L6290j6343
$$ 200869 157719 127864 151439 143953 110539 107273 138546 113010 117379 182148 218438 202095
7888B02095L2649l489n4498r2788n5551L0868J2429J6072m075j2969q75k5K8134
$$ 202095 234744 231255 176757 83969 28418 59286 71715 87787 83712 70743 69868 69843 97977
7875I7977K3540l6019O051K1827k2301M7985L0947J6273O1255m371p3525k3255
$$ 97977 121517 85498 91549 113376 91075 139060 170007 186280 247535 243164 169639 146384
7863A46384L957L8378R469o4695l0434k0170O0210q395p1387m0345j5055Q6184
$$ 146384 150341 188719 198188 133493 103059 82889 143099 134704 63317 22972 7917 94101
7851I4101J03212n2197p6527q1206p662K1679K7055K5717K4095m8216l46N2493
$$ 94101 197313 145116 68589 -12617 -20279 1400 28455 54172 78267 30051 29705 82198
7839H2198o0897j02663k5804r057J08666R2157j9504P2581l167n3547k8190J4126
$$ 82198 21301 -81362 -107166 -116223 -7557 84600 65096 137677 134510 80963 52773 66899
7827F6899J7940J2108Q6393l5069o3354r73K578k5795P846M6617O0460J0278J6596
$$ 66899 84839 96947 183340 148271 84917 83944 86522 60727 68573 115190 175650 185928 202524
7814B02524q2315l7327p316n3040k919J7537M1810k220k5153O0923K0570l291
$$ 202524 120209 82882 75566 22526 19607 37144 78954 76734 51581 112504 133074 129783
7802A29783N1458l1067n3029L7445J6092n1089l3735j2982k241K7852o3774L0881
$$ 129783 181241 150174 97145 134590 150682 99593 65858 52876 50635 78487 14713 45594
7790D5594O1675J8743o292p1649j7394Q2248N8157P498k3257l0882k4893k5584
$$ 45594 107269 126012 119720 48071 30677 112925 171082 178580 155323 124441 99548 73964
7778G3964o4341n5181K4680M0311K3455L712r7864j9381M8305O745L5468J9928
$$ 73964 9623 -45558 -20878 19433 42888 46600 -51264 -70645 -22340 -15595 19873 39801
7766C9801Q547J4548J883K641L6454o286q7574L1858L7874n7042p8376n7976J4254
$$ 39801 48348 62896 64779 67420 103874 97588 10014 41872 79746 22704 -55672 -113648 -99394
7753i9394R0201M8589L1435q847J4219o1122O946J0500J9014K5562J2992k3417
$$ -99394 -9193 39396 70831 61984 76203 15081 22027 32527 51541 77103 90095 66678
7741F6678k7742J8353q182M8012n5449m5471J0663M9141m3037j1985J0493L6674
$$ 66678 38936 57289 49107 97119 41670 -3801 6862 56003 12966 981 11474 48148
7729D8148j9302o0111J4709K5435L8682l2035L648J1115j71J5151m886l911j6719
$$ 48148 28846 -31265 -16556 8879 47561 15526 19174 30289 30118 45269 40383 36472 19753
7716A9753M9924J0524k4091R585q574P6246l7349l3709r156l3933K6591N2892
$$ 19753 69677 80201 56110 65695 57121 133367 96018 62309 53153 19220 45811 98703
7704I8703q951l2660K8887k8067l8672L0882N6374j998J1582K7350k6518n4646
$$ 98703 89752 57092 85979 57912 19240 50122 106496 104498 116080 143430 116912 62266
7692F2266j8028J2674M6826J7426K545k1981n2112p9115k0428L6391j278l0545
$$ 62266 44238 56912 103738 121164 123709 101728 49616 -29499 -49927 -13536 -14814 -45359
7680d5359M4000R3032N2406L1723m9733m9449q235r386J3562L0972k9688L0734
$$ -45359 -1359 91673 144079 175802 126069 76620 68385 58999 72561 103533 73845 104579
7668A04579k508l2659K027L6327j9546L0389K1367k1897k6426J1840o2770n4545
$$ 104579 102071 69412 71439 107766 88220 118609 139976 118079 91653 103493 40723 -13822
7656a3822L4129n169j0124l8040J0526Q7957N1742p7709r9273N4746Q9989N654
$$ -13822 20307 15138 5014 -33026 -22500 65457 117199 39490 -59783 -5037 84952 90606
7644I0606m32J7832q3143m8195K9722m990k8602J8398J4464k8563J3411J2463
$$ 90606 90174 108006 24863 -23332 6390 1400 -27202 -8804 5660 -22903 -9492 2971
7632B971M2241O452o639L9979j5105R504o0152l5743L5203N190l8787P2420l7862
$$ 2971 45212 51664 45025 85004 69899 79403 19251 -16492 18711 23901 -14886 57534 19672
7619A9672k066M2304K8485k621p9142N6870k0743n8545L507j0453j1620N8919
$$ 19672 17606 59910 88395 85774 6632 63502 42759 -15786 -12279 -22732 -34352 24567
7607B4567M9381L2619q4657j5384K2997M189j9366m8052M8248N2477L8284j4219
$$ 24567 73948 106567 21910 6526 29523 33712 14346 -33706 14542 67019 105303 91084
7595I1084o5527p3435Q1282L9171K5237K8364o403n3926k9863m0301L3909N5862
$$ 91084 25557 -47878 33404 72575 97812 126176 119773 65847 35984 -4317 29592 85454
7583H5454l3847r953m4726L8021j8693Q802N096j7204l7947K5335j8726m9468
$$ 85454 51607 41654 -3072 34949 16256 25058 30154 12950 -24997 338 -18388 -67856
7571f7856o838L4213P8622K8707k6419J223l3854Q8768L4886P3630q507q3603
$$ -67856 -74694 -40481 38141 66848 40429 41652 7798 96566 131452 205082 196575 112972
7559A12972K8169l5839O129j4446K0311m9821j6672K2019M5378P922p0767l4771
$$ 112972 141141 105302 111431 96985 117296 67475 50803 72822 118200 126122 55355 20584
7547B0584p205N4695Q3305m365j0468j109q5811p5709m7095k6341O4105L8488
$$ 20584 13379 68074 151379 147014 136546 135437 49626 -26083 -73178 -99519 -35414 3074
7535C074O2075J4738p9463j39322K0868K5693K0355R2092L3568n2613m4691L745
$$ 3074 65149 79887 424 -138898 -118030 -92337 -71982 20110 53678 1065 -43626 -39881
7523c9881J5964P1070k2434j6146J0382k9983k9228Q5549o139q7151k5286L1685
$$ -39881 -23917 47153 24719 8573 18955 -11028 -40256 45293 39154 -47997 -73283 -41598
7511d1598L9892N3980j5031n6617l3547O6258L7190O757o8539m216q858J2554
$$ -41598 -1706 52274 37243 -19374 -52921 13337 50527 57284 -11255 -15471 -24329 -11775
7499a1775Q3385R609k0182P1323j6717j39107o7583L4702J8289q708n8863K3664
$$ -11775 71610 81219 61037 132360 115643 -23464 -91047 -56345 -38056 -46764 -105627 -81963
7487h1963M8787L0288L8474M9527N7404L4903o3900p820r095R181p58L756j11472
$$ -81963 -33176 -2888 35586 85113 142517 177420 113520 105700 96605 105786 105028 108784 -2688
7474b688J3O4733M5389k9620j7607J4821k9892J7667m036J6252K2800K038J304
$$ -2688 -2675 62058 107447 77827 60220 75041 45149 62816 58780 75032 97832 99870 101174
7461A01174n6416m2223L304q723j7475N7608O6329p53k3778p4028L9557n259l0517
$$ 101174 44758 2535 5839 -2884 -20359 37249 103578 102825 79047 5019 44576 39317 8800
7448H800o9461q561M0343O9918O646N6875m464j7527l0997l5665Q108N46M3833
$$ 8800 -60661 -69222 -28879 41039 47685 104560 100096 82569 51572 15907 24015 24561 68394
7435F8394N9118j6950j7922n9453o1202m3379Q1171P6284k9071P219n932m7089
$$ 68394 127512 110562 92640 33187 -28015 -71394 9777 86061 56990 64209 58277 11188
7423A1188j9107K6423L1119n4009Q283M2251r526k0845l7946l1035l442N8726
$$ 11188 -7919 18504 49623 -4386 3897 46148 36622 15777 -22169 -53204 -56646 2080
7411B080N4641k6420k0533k7970k5952L1283R2350J356k0512k8800j4946J7834
$$ 2080 56721 30301 9768 -18202 -44154 -12871 79479 80835 60323 31523 16577 34411
7399C4411K087M1181J2356m4871m2200M1378L1823l3351L9608m523l4192j8340
$$ 34411 36498 77679 90035 45164 2964 44342 76165 42814 82422 77899 43707 25367
7387B5367M614Q507M2700K950l0128O0862J8680Q349k5825L605M3469J0919J8061
$$ 25367 29981 38488 81188 84138 54010 114872 133552 141901 116076 119681 163150 174069 192130
7374A92130K1299r0668r3300k8428r197L8882K9876k9044L012m1737J333p215
$$ 192130 213429 122761 29461 1033 -8164 30718 60594 31550 34562 -7175 -5842 -13057
7362a3057K3581l626K455K7130J8135L4947N2354K5146q2173k9946k0020K004
$$ -13057 10524 6898 9353 36483 54618 89565 141919 167065 84892 54946 34926 36930
7350C6930Q9518L8318o9581j32184J1858P6324k0353k8290l7068l8652N4992k888
$$ 36930 126448 164766 95185 -36999 -25141 51183 30830 2540 -34528 -73180 -18188 -21076
7338b1076m2853J964J2581L4097O718k5973O3931L4306r736K1550K0274k4866
$$ -21076 -63929 -61965 -49384 -15287 -8569 -34542 29389 63695 53959 75509 95783 70917
7326G0917k516J9846m0682j9522J3101J3987J6468L030K7214j0289r9344J8276
$$ 70917 68401 88247 47565 28043 41144 55131 71599 74629 101843 91554 -7790 10486
7314A0486J4650j2347n617L1722K6102N7341P992n8864p503j6080n0098M5595
$$ 10486 25136 12789 7172 38894 64996 122337 130329 71465 63962 47882 -2216 43379
7302D3379J0309K5953o0440n8738l6188J4542L2474o9628O7765O3682p822J3090
$$ 43379 53688 79641 19201 -39537 -75725 -61183 -28709 -98337 -30572 33110 25288 38378
7290C8378R404Q0839M7144p2899p0881K0804j7923n3661q674N7410m0315k2976
$$ 38378 47782 128621 175765 102866 31985 52789 34866 -18795 -27469 29941 -10374 -33350
7278c3350J4285J3867J0388Q1609N1875L547K6555k6427n0565m6082K1184q0689
$$ -33350 -19065 -5198 5190 86799 138674 142221 168776 142349 91784 45702 66886 -13803
7266a3803k9440L268P4339R5410J5587m5084l6930L913m2966k237K6154o0921
$$ -13803 -43243 -39975 34364 129774 145361 100277 63347 67260 24294 22057 48211 -12710
7254a2710k1280k0989O5971J2145L0415L5353m2988K3234M4642P34L8862j8812
$$ -12710 -33990 -54979 10992 23137 53552 88905 45917 69151 113793 114527 153389 134577
7242A34577o9264j2180J7466J1038J2292n4393n641m9982q3105q531J9485L2036
$$ 134577 65313 53133 70599 81637 93929 39536 33895 -16087 -99192 -107723 -88238 -56202
7230e6202L0062L305L224j0708j2600l2309R661K6345j741o091q918m89N8892
$$ -56202 -26140 -22835 -19611 -30319 -42919 -75228 -65567 -39222 -40963 -47054 -55972 -56461 2431
7217B431m7751J0843N2166j111l4926k4984P501Q7101O1949p4587P090J8594J6979
$$ 2431 -45320 -34477 17689 16578 -18348 -43332 -35831 51270 113219 38632 45722 64316 81295
7204H1295j0624J53k038K3944o9194m5571j9279O0375k980n4409r2718L4170O6647
$$ 81295 70671 70824 68786 92730 23536 -22035 -41314 19061 16081 -38328 -131046 -96876 -30229
7191c0229N4555m265K4418k2924p4002m1895L0088K6545j741q122J7619N5059
$$ -30229 24326 20061 44479 21555 -52447 -94342 -64254 -37709 -39450 -47572 -29953 25106
7179B5106J7864k0913m9535M6527L9595m5599m6313j0274r05j0312J02947o8467
$$ 25106 42970 22057 -27478 19049 58644 13045 -33268 -43542 -44447 -54759 48188 -20279
7167b0279m4224P5609Q390l9615m0009o828K0816Q7494O751j0346n7904Q3749
$$ -20279 -64503 11106 19496 -20119 -60128 -66956 -46140 41354 48105 37759 -20145 63604
7155F3604J0720j8922Q445l7000k659L1520O245o5608k0868M1297m1053j6645
$$ 63604 74324 55402 63847 26847 24188 55708 61953 -3655 -24523 16774 -24279 -40924
7143d0924O382J0754n2678k7214J01167J02967O907p6043l579l067n4799m111
$$ -40924 -34542 -23788 -76466 -103680 -2513 100454 107361 31318 27739 24672 -30127 -34238
7131c4238o4869k2469O6295J0959K130o469l0204j915Q8047J0771N9845j5443
$$ -34238 -99107 -121576 -55281 -44322 -42192 -48661 -78865 -80780 7267 18038 77883 62440
7119F2440p1915j9364m3717k0528O781J1212n082q3328L8401K5042m2523m3731
$$ 62440 -9475 -28839 -72556 -93084 -86303 -75091 -80173 -163501 -125100 -100058 -142581 -186312
7107a86312K8573M4389Q8844k7986J1339P4788J1190m5614l1807j0398j4425k0606
$$ -186312 -157739 -113350 -24506 -52492 -41153 33635 44825 -789 -32596 -42994 -57419 -78025
7095g8025M659l9725j9361J4730j3479K3847R2932J7809k438k6893n8030P3213
$$ -78025 -73366 -113091 -132452 -117722 -131201 -107354 -14422 3387 949 -25944 -83974 -10761
7083a0761Q761q6905l6506N7881J02778M7744K3690j11857p482K4465M5473J9241
$$ -10761 -2000 -88905 -125411 -67530 35248 82992 106682 -5175 -12657 11808 57281 76522
7071G6522O764K4519j8855k3445J4098j9483m8700l7891L3297l868J892M3398
$$ 76522 83286 107805 88950 65505 79603 60120 11420 -26471 6826 2958 4850 48248
7059D8248K584K9782M357O527K7819l6647k3906L6180o6774j1244j3567n7908
$$ 48248 50832 80614 84971 91498 119317 82670 58764 94944 28170 16926 3359 -54549
7047e4549K6727j7448J2067Q7537M3292R445p977k333L4961J9007l892M4210K9145
$$ -54549 -27822 -45270 -33203 54334 97626 107071 99094 96761 131722 150729 146837 191047 220192
7034B20192m1678m0761l7656J7184o4176o1550l7826L1259O3701M4349j2347k2699
$$ 220192 178514 137753 100097 117281 53105 -8445 -46271 -15012 48689 93038 80691 57992
7022E7992n6299K7716J996p2624k3313M6541M261l096P8030J46n7976m9418k5612
$$ 57992 1693 29409 31405 -41219 -64532 -17991 -13730 -16826 61204 61350 3374 -46044 -71656
7009g1656O1346m2359k5687M0645L8023m1648n1520Q829j4688J1749j5419N11
$$ -71656 -10310 -52669 -78356 -37711 312 -41336 -92856 -84027 -98715 -86966 -102385 -101874
6997a01874M5967L0590j7276n7373M0585R5256N2778L6381N834q5880J425J1491
$$ -101874 -55907 -25317 -42593 -99966 -59381 35875 88653 125034 130868 44988 46413 57904
6985E7904n5028l6900m4669L780R0651N7493m1896k749m024k7346m4639L3229
$$ 57904 2876 -34024 -78693 -74913 15738 73231 31335 28586 24562 -2784 -47423 -14194
6973a4194M2524m93m8469J764J6916L049k921j8087o0870P9728J8036n7541M0768
$$ -14194 28330 27837 -20632 -18868 -1952 1097 -1824 -19911 -80781 -1053 16983 -40558 210
6960B10j7917l365q052j9761L1393L0266n6764L7716L461l1679J4698L7363l9437
$$ 210 -17707 -21072 -29124 -48885 -17492 12774 -43990 -6274 -2813 -34492 -19794 17569 -21868
6947b1868j5480L5222n70k4555o922l3630K5922N2982N3793O1278L8510n5080
$$ -21868 -37348 -2126 -2696 -27251 -34173 -67803 -41881 11101 64894 126172 164682 109602
6935A09602R211j3573m0190m8901l5990K6345L2473j0130J3777J2903k4106o7990
$$ 109602 118813 105240 65050 16149 -19841 6504 38977 28847 42624 55527 31421 -36569
6923c6569K2301J7081K2203K8054j4804j2779k1347M7723o701o257m524j7374
$$ -36569 -14268 2813 25016 53070 38266 25487 4140 51863 45162 38905 34381 17007
6911A7007l0428K2251J0615M88l2582k2593p856K4029J3045l9265j9938k6197
$$ 17007 -13421 8830 19445 19933 -12649 -35242 -43098 -19069 -6024 -45289 -65227 -91424
6899i1424L5208P5015M7321n3649j8091J7918M74k7969m0909L024K0761L4955
$$ -91424 -56216 18799 66120 12471 -5620 12298 12772 -15197 -56106 -53082 -32321 2634
6887B634M7887p499p199J9845j3179k1239m3894j5884k5221n4792M4660m6290
$$ 2634 50521 43022 35823 55668 42489 21250 -22644 -38528 -63749 -118541 -73881 -120171
6875a20171n8981M9884M8675R3188K5972P797k9157J0072L3598n35o1811k8789
$$ -120171 -179152 -129268 -80593 12595 38567 46364 17207 27279 60877 60342 -1469 -30258
6863c0258N2533p761M0933J9431k2760L9246m6973r1765J8626K772L4301L3833
$$ -30258 22275 14514 55447 74878 52118 91364 44391 -47374 -28748 -25976 8325 42158
6851D2158k9176K8990R245q4634N566N0739l7994p1213n7875L3342L9118k4282
$$ 42158 12982 41972 51217 -33417 -27851 22888 -15106 -86319 -144194 -110852 -71734 -96016
6839i6016o5299M57P4664n328K7590K7143L8344K8505k2772J7233P8072j4355
$$ -96016 -161315 -160858 -86194 -91522 -63932 -36789 1555 30060 7288 24521 102593 88238
6827H8238k8393P152Q7303P411m6941m2189k3679l8889M141K1186m4001K3342
$$ 88238 59845 66997 154300 161711 114770 72581 48902 10013 14154 35340 -8661 14681
6815A4681K9520Q85L8835p9967J408L8816k7435K645K0619k6864k95n554j9540
$$ 14681 44201 45086 83921 3954 5362 44178 16743 19388 40007 13143 12848 7294 -12246
6802a2246J40J2072m532q263M5291M2216J7204l5825l6347k9515j7307o327K1322
$$ -12246 -12106 -34 -4566 -12829 32462 74678 91882 56057 19710 -9805 -27112 -33439 -12117
6789a2117M1757m1954m4786j4495J5780M4491N9542j05923k2760L4709m9203n185
$$ -12117 29640 -12314 -57100 -71595 -55815 -11324 48218 -57705 -80465 -45756 -94959 -100144
6777a00144l938p530K7757K1056O0616J7777q587K5217j717m557L2470n6837J3573
$$ -100144 -104082 -111612 -83855 -62799 -2183 15594 7007 32224 30507 25950 58420 1583 15156
6764A5156J6993n4044p4714O8746M1802M0475k4674n2243J3103N1531M2433J4194
$$ 15156 32149 -21895 -96609 -27863 13939 54414 29740 -22503 -9400 42131 84564 98758
6752I8758o760J1858O956o5254l4605p924J8306k3348m3061q625j1170M575K1836
$$ 98758 91998 103856 110812 45558 10953 3029 21335 -2013 -45074 -53699 -64869 -60294 -38458
6739c8458P6104N8667L0193q5228q3686M0842N8956J1250O1387j8812o5679l0078
$$ -38458 37646 96313 126506 41278 -42408 -1566 57390 68640 130027 111215 45536 15458
6727A5458j0831l9067k6171m1719q4371N2427J17293N1339K0674o906K1473n6154
$$ 15458 4627 -34440 -60611 -102330 -186701 -134274 -16981 34358 55032 48126 69599 13445
6715A3445k7417k9761M6137P6528L3183j6201q1158o3525O2751O4505N0574O431
$$ 13445 -13972 -43733 2404 78932 112115 95914 14756 -48769 13982 78487 129061 135492
6703A35492l5549o7739o571k6742p9431k6297N0902k1693j0242q102K656J7469
$$ 135492 99943 32204 25633 -1109 -80540 -106837 -55935 -77628 -87870 -95972 -93316 -75847
6691g5847k590M3309J8365j7226m6858k554O7372K1008R7924p7021r0016p1950
$$ -75847 -78437 -35128 -16763 -33989 -80847 -83401 -16029 4979 102903 25882 -64134 -136084
6679a36084J3180M8952Q6637o406k3508m694Q438j8697k3035K0674J1960j1197
$$ -136084 -122904 -73952 12685 6279 -17229 -21923 -13485 -32182 -55217 -34543 -22583 -33780
6667c3780L1835L7380l2474n2395L8616Q3945n3597j7531j4411J9880Q554o714
$$ -33780 -1945 35435 2961 -49434 -10818 73127 19530 1999 -12412 7468 16022 9308
6655I308N916L9008L1518o5584k7115J3804M7726k6547j13078o7980J563J08305
$$ 9308 15224 54232 85750 20166 -6949 6855 54581 28034 -85044 -153024 -151461 -43156
6643d3156O4004l1251J3659P6645j2265n2239l8168N9386l932J9449J8465m7909
$$ -43156 20848 -10403 3256 79901 67636 15397 -22771 36615 32683 52132 70597 22688
6631B2688n1163n8006K297q232j285R4948l243m4837j6123j7534j023Q7076N6608
$$ 22688 -28475 -86481 -84184 -92416 -93701 1247 -1996 -46833 -62956 -80490 -81513 5563 62171
6618F2171k0837n4635j8905j5312J00696M0513m3746m9382r75P2980O0189n0926
$$ 62171 41334 -13301 -32206 -47518 53178 93691 49945 563 -412 72568 132757 81831
6606H1831j0731L8197K7122o7744j13416k7072M8454M9108n926k7598j735m8701
$$ 81831 71100 109297 136419 68675 -44741 -71813 -23359 25749 19823 -7775 -9510 -58211
6594e8211j195L5479p867k6665M1489J0464k5817Q5949N613j6139n5349L0558
$$ -58211 -59406 -23927 -31794 -58459 -16970 -6506 -32323 53626 59239 43100 -12249 18309
6582A8309k3769j3321n0726l002N9502K0777N8867J3248m8690K0650L3627j7557
$$ 18309 -5460 -18781 -69507 -72509 -13007 7770 66637 79885 31195 51845 85472 67915
6570F7915k3019l4263k9886p7156m4951J30J6514R0697R337L1031L9289K7093
$$ 67915 44896 10633 -19253 -96409 -141360 -141230 -124716 -34019 -24682 6349 45638 72731
6558G2731J946o1673k8112p2350k64l547K5908M2298J2227R6067O9108K379L0540
$$ 72731 74677 13004 -15108 -87458 -87722 -91269 -65361 -23063 -10836 85231 154339 156718 187258
6545A87258m7049n4990m6741l9817L3964M6116q095j16737j01684L2487M899k9707
$$ 187258 140209 85219 38478 -1339 32625 78741 70646 -46091 -147775 -115288 -110389 -140096
6533a40096O1646P7580N0795m6273l6336m09K2558K843n9060j7385Q3062m4900
$$ -140096 -78450 -870 49925 3652 -32684 -33093 -10535 -7692 -66752 -84137 -1075 -45975
6521d5975k853M9850j7608R969O8507l3771m2923L6941Q5650k3696k9770p8971
$$ -45975 -48828 1022 -16586 -6617 61890 28119 -14804 22137 107787 84091 54321 -24650
6509b4650j8008j9692n6132R8364P3919j9578l2091k8091J1978K2784m7511k6487
$$ -24650 -42658 -62350 -118482 -20118 53801 34223 2132 -25959 -13981 8803 -38708 -65195
6497f5195J7901O1914O3216L7497k9716r1965o188L9301M7055n4327k1781m586
$$ -65195 -47294 14620 77836 115333 85617 -6348 -12536 26765 73820 19493 -2288 -6874
6485f874l7666M5503k4372p8017R459P4069m601l1781K8933Q5238Q522p04o1142
$$ -6874 -44540 963 -23409 -101426 -91967 -17898 -22499 -54280 -25347 59891 68413 67709 6567
6472F567k4964J8651Q1885j388p8131j2285M1665n7992r9582l386k5601M2566
$$ 6567 -18397 254 82139 80751 2620 -9665 32000 -25992 -125574 -128960 -154561 -111995
6460a11995N9289N0523j1650K8630j439p260k9888P4675K3109l5267Q365L5657
$$ -111995 -52706 -2183 -13833 14797 13358 6098 -23790 50885 73994 38727 47092 82749
6448H2749M4680o3267o1505k387n1487l7819k2547R15P8330m7140p1453N127J04525
$$ 82749 127429 64162 2657 270 -51217 -89036 -111583 -110668 -32338 -79478 -150931 -145804 -41279
6435d1279M827j1067M4549Q6641o5180q9357O1056R64j052j0242l8891o5024O8773
$$ -41279 -36452 -47519 -2970 83671 18491 -70866 -9810 -8846 -9898 -20140 -59031 -124055 -55282
6422e5282M8084j1697j4478J1608L2022o6M801p750J2378L5095p6588n4910n728
$$ -55282 -7198 -18895 -33373 -21765 10257 10191 14992 7242 19620 54715 -21873 -76783 -82511
6409h2511P0285M6369n5824l6113l8503k0778J8864k3523J7303K2735J1869M5871
$$ -82511 -12226 34143 -21681 -57794 -96297 -117075 -98211 -121734 -104431 -81696 -69827 -23956
6397b3956K6371k8306N1261J0624l5424k1747L2985N4542l5063K9283O4829k4511
$$ -23956 2415 -25891 25370 35994 570 -21177 11808 66350 31287 60570 125399 100888
6385A00888o8681o5950l8822l540K3235m0954k6638O4039M6831o0454K0231L6282
$$ 100888 32207 -33743 -72565 -76105 -52870 -93824 -120462 -56423 -9592 -70046 -49815 -13533
6373a3533k2764M0958J4026m7370P110l6744N6482J0712J7258L4227j0872r6802
$$ -13533 -36297 4661 18687 -28683 -21573 -58317 -1835 8877 26135 60362 49490 -47312
6361d7312O9762M2389m5322l6698K3974J5218k4978l815k6886l8098m035j1332
$$ -47312 22450 64839 19517 -17181 6793 22011 -2967 -6782 -33668 -71766 -75801 -87133
6349h7133K1816N5994J7883J0542n6163k8546q655J3016R740P0484L3658k2338
$$ -87133 -65317 -9323 8560 19102 -37061 -65607 -74262 -61246 -51506 18978 52636 30298
6337C0298L3661K8063l885J3066k4738k6324k4709L5038M7669k8865j5598n9891
$$ 30298 63959 92022 88137 101203 76465 50141 25432 60470 108139 79274 63676 3785
6325C785L1009p975K3867J9102k9465Q193l9111L2125J4136l2936j8503K2862
$$ 3785 34794 26819 50686 69788 40323 48516 9405 41530 55666 22730 4227 27089
6313B7089k8391k3234n0355j00811R373L899J6908R6618M1899Q442J7773l7391
$$ 27089 -1302 -24536 -74891 -175702 -166329 -162430 -145522 -48904 -7005 1437 19210 -18181
6301a8181q0765o0541K4120M3394K8792p682j5886L8947M2913K9985p263p5269
$$ -18181 -98946 -159487 -135367 -91973 -63181 -70863 -86749 -47802 -4889 25096 17833 -57436
6289e7436J6979J2367M2040m7485J7490O6508l3043o432j0538j6301K0245N8088
$$ -57436 -40457 -28090 13950 -33535 -16045 50463 17420 10988 450 -15851 4394 62482
6277F2482m3670q0001j7812L8296m5977R3366l759m8501o4832k0441J4648m118
$$ 62482 18812 -61189 -79001 -40705 -86682 6684 2925 -45576 -110408 -130849 -116201 -120319
6265a20319M9600N9601J3457p9189J0345J6803K9111L0277K0276K7367m4730p1307
$$ -120319 -70719 -11118 2339 -76850 -66505 -49702 -20591 9686 29962 57329 12599 -58708
6253e8708o1179J53124P2485P277p953j1777J9060l2596j0673l6204r8566r188
$$ -58708 -119887 33237 105722 112999 105046 93269 112329 79733 69060 32856 -65710 -74898
6241g4898J5853M6672j4305m7574n914N0608J3020k7995j8878L9212N8904j0535
$$ -74898 -59045 -12373 -26678 -74252 -80166 -29558 -16538 -44533 -63411 -24199 34705 24170
6229B4170n102l818l1617O482p969l6581l9793L3237m491M7288o1583L5841N2525
$$ 24170 19068 15250 -16367 -9885 -17854 -54435 -94228 -60991 -65482 -18194 -79777 -43936 8589
6216H589k0678J5756M8985N8311m6725m344j1218j33049J7695J5168O7112J8032
$$ 8589 -12089 3667 52652 110963 64238 59894 48676 -84373 -66678 -51510 15602 33634
6204C3634j7804K2619L7215j7145l8182j8316k0121N920J0627j7731M5235J35774
$$ 33634 15830 38449 75664 58519 20337 2021 -18100 -12180 -1553 -19284 25951 161725
6192A61725k5185n1010Q49n80k1821m1300p1527k8150k136M155m9496k5977O2171
$$ 161725 136540 85530 86379 85799 63978 22678 -48849 -76999 -79135 -74980 -124476 -150453 -88282
6179h8282N4140J0690M4782k1482r177O890l2243O5932N2460N139n3227q9178
$$ -88282 -34142 -23452 21330 -152 -9329 -2439 -34682 31250 83710 88849 35622 -53556
6167e3556o685N139J8347l0637J7420L9864j4852m269M3006K0030l2880K3206
$$ -53556 -60241 -55102 -36755 -67392 -49972 -10108 -24960 -29229 13777 33807 927 24133
6155B4133K858K2422Q140p277o4910J7679L0948J7827j9929o0365j9855N2034
$$ 24133 26991 49413 57553 50276 -14634 3045 33993 51820 31891 -28474 -48329 3705
6143C705j8652j284J7774k0650M356k0479J43862R4162n7223j7564m8342k0295
$$ 3705 -14947 -16231 1543 -19107 -14751 -35230 108632 202794 145571 128007 79665 59370
6131E9370o0167n7485L774Q1562K9342J9005o071O0559k4887K4488n4957K7331
$$ 59370 -797 -58282 -54508 27054 56396 75401 69330 129889 105002 129490 74533 101864
6119A01864k9294l6573p2653j7562N6901M4522M0404J7575l477j8772l4614m4663
$$ 101864 72570 35997 -36656 -54218 2683 47205 87609 105184 101707 82935 48321 3658
6107C658K3026o906k1265k8166J6078M1677l9874j5843N019N830j3770m1387N6917
$$ 3658 26684 19778 -1487 -29653 -13575 28102 -11772 -27615 -22596 -16766 -30536 -71923 -15006
6094a5006j5610O3993L4919n2710j02788l0009M3780k0953k9048L4217L6787J9753
$$ -15006 -30616 33377 68296 15586 -87202 -117211 -73431 -94384 -123432 -89215 -52428 -32675
6082c2675o4001j2237N6079L3720K4050q7851j5781K6177P56j3139j1575M4949
$$ -32675 -96676 -108913 -52834 -19114 4936 -82915 -98696 -72519 -71763 -84902 -96477 -51528
6070e1528Q3600K2012M3948k5479m2007J1911k8842p5965l8043l8112O659M5634
$$ -51528 32072 54084 98032 72553 30546 42457 13615 -62350 -100393 -138505 -131846 -86212
6058h6212J7431o358j7182K126M5770p964J4740L681K2579K0050k2314L1568r680
$$ -86212 -68781 -75139 -92321 -90195 -44425 -52389 -37649 -33968 -11389 8661 -13653 17915 8235
6045H235k0533k167k6033o4774K635n8776N6271O1565M3992L5586k2474n6635
$$ 8235 -12298 -14465 -40498 -105272 -102637 -161413 -105142 -43577 415 36001 13527 -43108
6033d3108l9751N0507L9540o3475j5863L6261L7313O9676L4582m1928p2063o7031
$$ -43108 -82859 -32352 7188 -56287 -72150 -35889 1424 71100 105682 63754 -8309 -75340
6021g5340J9851K133J1602L0466J4267n4918L2272K5322N1506P9555m1722o7753
$$ -75340 -55489 -53356 -41754 -11288 2979 -51939 -19667 5655 57161 136716 94994 27241
6009B7241K7094m7429j5652O4443j0726J0456p3143j4917N084L7237l6225J648
$$ 27241 54335 6906 -8746 55697 44971 55427 -17716 -32633 -27549 9688 -26537 -24889
5997b4889J8041k3341m286j0034l392L6210N378K3138j2156k3083j1811K5732
$$ -24889 -6848 -30189 -34475 -44509 -47901 -11691 -6313 16825 4669 -18414 -30225 -4493
5985d493l5192M1929L5410p7352r9911p1265j9658J39776Q4678L6741J1877n0670
$$ -4493 -39685 2244 37654 -39698 -139609 -210874 -230532 -90756 -6078 30663 42540 -8130
5973h130m0026M0176R819l086M3310J4554k7246L2304m6813j4855j8262p275n1315
$$ -8130 -48156 -7980 1839 -1247 42063 56617 29371 61675 14862 7 -18255 -25530 -76845
5960g6845j9072L1670P6671k2364M7637L3271j22206j16452j9642M8228O3626
$$ -76845 -95917 -64247 12424 -9940 37697 70968 -51238 -167690 -187332 -139104 -75478
5949g5478M9086m142o9223J857J7370J01M831J3864q372o370J1900O1194p595
$$ -75478 -26392 -30534 -99757 -97900 -80530 -80429 -75598 -61734 -70106 -76476 -64576 -3382 -10977
5936a0977R687k0516n109M3559N802m134n8598R437J9848j2586n887q601l8777
$$ -10977 -1290 -21806 -26915 16644 22446 18312 -40286 -30849 -11001 -23587 -29474 -38075 -76852
5923g6852L8421J7744K0055l0771K3492q085P3340l628r8065n1728L1972M4319
$$ -76852 -38431 -20687 -632 -31403 -7911 -15996 57344 53716 -44349 -96077 -64105 -19786
5911a9786N9093o603M0836L7470J2799J1632N1516j5769r3966m7900k1388p8297
$$ -19786 39307 32704 73540 111010 123809 135441 186957 171188 77222 29322 7934 -70363
5899g0363K5752L6002k0717J4440Q684N180m4535q04o685M022L2661L9751K744
$$ -70363 -44611 -8609 -29326 -14886 -6202 -1022 -45557 -46361 -53046 -49024 -16363 23388 26132
5886B6132r508j7342q308J0865J9864K4282N1192O2539p6443l131L7183m6651
$$ 26132 16624 -718 -9026 1839 21703 45985 97177 159716 83273 80142 117325 70674
5874G0674r9016K716O8700k5684J681l4515l8594l7972K3777K2803m340R3251
$$ 70674 -28342 -25626 43074 17390 19071 -15444 -54038 -92010 -68233 -45430 -49770 43481
5862D3481K306j1797k8662M9366m568k483m8555n9215j6938L6847Q914l5851L0005
$$ 43481 45787 33990 5328 54694 50126 47643 -912 -60127 -77065 -40218 -31304 -67155 -37150
5849c7150J675j963N2989N7635k1740M273J9446k8891j800j9490o161L7931j2429
$$ -37150 -35475 -37438 15551 73186 51446 55719 75165 46274 44474 24984 18823 56754 44325
5836D4325p0940J8063K9655R514O863K6031L042K0269l3950l7229L5576L838o0457
$$ 44325 -26615 -8552 21103 30617 37480 63511 66553 86822 52872 15643 51219 55057 -5400
5823e400j9619L289k6733k4116M2207n0440o1597k0474m4499L7220P3290j6119
$$ -5400 -25019 -21730 -48463 -72579 -30372 -80812 -142409 -162883 -207382 -170162 -96872 -112991
5811a12991K9988N122j6078L9930j427j030N4177M8121j9354o1708m944L8219
$$ -112991 -83003 -77881 -93959 -54029 -55456 -56486 -2309 45812 26458 -35250 -40194 -1975
5799a975O6144L0401j6648L2075j7643j05021J434O2115J4319j5775N0454m6529
$$ -1975 64169 94570 77922 109997 92354 -12667 -11233 50882 65201 49426 99880 53351
5787E3351M31L6891m7289l5094L5368L332n7910m5422j8164K4804K6148K1687
$$ 53351 53782 90673 43384 8290 43658 46990 -10920 -56342 -74506 -49702 -23554 -1867
5775a867k3061k5036J3869j0726K9683Q079P04R253n1568M2242K9767K8226J11245
$$ -1867 -24928 -49964 -36095 -46821 -17138 -9059 -8355 898 -50670 -8428 21339 49565 160810
5762A60810j0891r697L251j9127l4162p9593K2534R193L990K8456J4359k6618
$$ 160810 149919 140222 143473 124346 90184 10591 33125 42318 46308 74764 89123 62505
5750F2505o2886p3281K174M5909O6351J9377r5202o0132J0474N2163K733L1768
$$ 62505 -381 -73662 -71488 -25579 40772 60149 -35053 -95185 -84711 -32548 -29815 1953
5738A953L1760m516k586o1063k5830j4173l5717N1196o826O799K4304K7561M2292
$$ 1953 33713 29197 26611 -34452 -60282 -74455 -110172 -58976 -65802 -59003 -34699 -7138 35154
5725C5154J4782Q564l7469k4559J588l5509o29J7966N9322M3811p5638K0352N4173
$$ 35154 49936 58500 21031 -3528 -1940 -37449 -38078 -20112 39210 83021 7383 27735 81908
5712H1908L659l6585m2608j22841K2364M6816O2087P2006K0869j19989n5752j4261
$$ 81908 85567 48982 6374 -116467 -94103 -47287 14800 86806 107675 -12314 -68066 -82327
5700h2327J11529R5449j391j5785r7479j43158J4930O7561K2860p4098J6724N4519
$$ -82327 29202 124651 123260 107475 9996 -133162 -118232 -50671 -27811 -101909 -85185 -30666
5688c0666m385n7986M731O9402Q181j706J0605J04529J4656r819K2833k4031j20768
$$ -30666 -35051 -93037 -88306 -18904 -10723 -12429 -1824 102705 117361 107542 130375 106344 -14424
5675a4424n3617M5056P592J6898M3004M5323j510m9284j8208J4922K293l3604
$$ -14424 -68041 -22985 -15393 1505 44509 89832 88322 39038 20830 35752 38045 4441
5663D441q726M3676m8348k7350j4766L4646k7353m5188p633r557m7992M544O1477
$$ 4441 -4285 39391 -8957 -36307 -51073 -16427 -43780 -88968 -96601 -106158 -154150 -149606 -88129
5650h8129L3904o7953K4567k2422k4007q839P4016M5751J0789l1042m2388K0518
$$ -88129 -54225 -122178 -97611 -120033 -144040 -152879 -78863 -33112 -22323 -53365 -95753 -75235
5638g5235j6263n5819o2641M2557Q6328R0097N6185m086k80L4183m9165n2138
$$ -75235 -91498 -147317 -209958 -167401 -81073 9024 65209 61123 60843 95026 45861 -6277
5626f277P479n3510M82Q2783L3653m6593p7520J2950O8381L0112m204p7822J092
$$ -6277 1202 -52308 -51826 30957 64610 18017 -59503 -46553 21828 51940 47736 -30086 -28994
5613b8994m3126R933k6868L4587j4795K468Q961J760r303r452o722j9736K467
$$ -28994 -72120 -62187 -89055 -54468 -69263 -66795 -57834 -56074 -65377 -74829 -81551 -101287 -98820
5600i8820J4397n870O505P8773N6634m4819l9253l3708J83m0993K5745m0412L137
$$ -98820 -84423 -90293 -83788 -5015 51619 6800 -32453 -66161 -65978 -106971 -81226 -121638 -118501
5587a18501P7902O0494O7160j4383L583j0242L598p9846J9111P1584j14002J5406
$$ -118501 -40599 19895 87055 72672 76255 66013 69611 -10235 8876 80460 -33542 -18136
5575a8136L8523j6599m8400R524J5696j9502n4324l0733j7663J8329M209M5079
$$ -18136 20387 3788 -44612 -35088 -19392 -38894 -93218 -123951 -141614 -123285 -119076 -73997
5563g3997K2353R728J1308L5388J8557m8636K2806N0047k317k4895L3875P0183
$$ -73997 -51644 -41916 -30608 4780 23337 -25299 -2493 47554 45237 20342 54217 124400
5551A24400j8560q9388l3407N0046K0784o9819l8516m953O5180J9435p6760K7777
$$ 124400 105840 16452 -16955 33091 53875 -15944 -54460 -59413 5767 25202 -51558 -23781
5539b3781O2150J6862m0023j7959M522j8238J7490N7399l205l3512n9337l3696
$$ -23781 38369 55231 15208 -2751 1771 -16467 1023 58422 55217 21705 -37632 -71328
5527g1328M1135N9917J1630K1175N160m638p6165l5457j1780l2440J2251l9824
$$ -71328 -30193 29724 41354 62529 67689 63051 -13114 -48571 -60351 -92791 -80540 -120364
5515a20364l4087R5314O3185j0888l3655o2498o0562L1197Q4344L9622K6446N1179
$$ -120364 -154451 -59137 4048 -6840 -40495 -102993 -163555 -132358 -48014 -8392 18054 69233
5503F9233N362j4726q800J396o431L731o42j7540q7326m649Q3692M368o8632p9166
$$ 69233 74595 59869 51069 52465 46034 49765 49123 31583 -55743 -60392 23300 27668 -40964 -120130
5489a20130K955J02799L9751n6650L6678k9776o083q216n270M014O1374m3752
$$ -120130 -117175 -14376 25375 -31275 5403 -24373 -30456 -38672 -43942 -39928 21446 -22306
5477b2306N335k6155M3547K2846N338J1522j4826J7282l2022m8648p7691Q1679
$$ -22306 -16971 -43126 421 23267 28605 40127 25301 42583 10561 -38087 -115778 -34099
5465c4099Q2713O0734L6761o4591r6464o3537P2756P2864J5178L6811m763j8972
$$ -34099 48614 109348 146109 81518 -14946 -78483 -5727 67137 82315 119126 114363 95391
5453I5391l6833o9757J1991N8080p617J3301M2091J2540j7026k3020L3753O1471
$$ 95391 58558 -11199 792 58872 51255 64556 106647 119187 102161 79141 112894 174365
5441A74365k1676o6308k3440n27n306j6953K3827J7621k6986m048K9268k5716
$$ 174365 152689 86381 62941 62414 57108 40155 63982 81603 54617 50569 79837 54121
5429E4121j00326k0144p632P5200q21l4090o2007j2383J9417K5137k0362J05024
$$ 54121 -46205 -66349 -73981 1219 398 -33692 -95699 -108082 -88665 -63528 -83890 21134
5417B1134J10691o5259o5543k8252k5336O780M4718M1891j1241J7689m2895p6476
$$ 21134 131825 66566 1023 -27229 -52565 -45785 -1067 40824 29583 47272 4377 -72099
5405g2099m4880L7595L836K6233r151l3447j1770J8712J1645m6885j7613k5342
$$ -72099 -116979 -79384 -75548 -49315 -58466 -91913 -103683 -84971 -73326 -120211 -137824 -163166
5393a63166q028K2441K2894N5245J06955j8544Q199r799n1304n018k014l2691
$$ -163166 -171194 -148753 -125859 -70614 36341 17797 25996 16197 -35107 -40125 -42139 -74830
5381g4830k9275L8685j8264n9211l039M3427j1596k2240L7146P5087R9342K1915
$$ -74830 -104105 -65420 -83684 -142895 -145934 -102507 -114103 -136343 -99197 -24110 75232 97147
5369I7147l3806j32612m6646Q2375J7767O7055M3123o2354q6591n5351L4062k3005
$$ 97147 63341 -69271 -115917 -33542 -15775 51280 94403 32049 -54542 -109893 -75831 -98836
5357i8836J4506R1423N7613L1132J9738M765r1328m5317M28n9790R878J8764j0505
$$ -98836 -84330 7093 64706 95838 115576 120341 29013 -16304 -15876 -75666 -65788 -47024 -57529
5344e7529N2381n4300K136M8532L3234J9750m7288j3816j757q3387q8259K8565
$$ -57529 -5148 -59448 -57312 -8780 24454 44204 -3084 -16900 -18657 -102044 -190303 -161738
5332a61738J8558J7270l0967J4294R7991N4656P2119k5567m724J8421o4226J2278
$$ -161738 -143180 -125910 -156877 -142583 -44592 10064 82183 56616 51892 70313 6087 18365
5320A8365k9413l8568K5386O0978m8875m4701K4248k2764N749L5159p486L2095
$$ 18365 -11048 -49616 -24230 36748 -12127 -56828 -32580 -55344 -49595 -14436 -21922 10173
5308A0173O2926L8133o988q6137o5844m823L9426N4109j1619r4783r269L7261
$$ 10173 73099 111232 104244 18107 -47737 -52560 -13134 40975 29356 -65427 -74696 -37435
5296c7435N8730L1936k1729K6933K7004p3976r2295q681N0686M2082J4705j2082
$$ -37435 21295 53231 31502 58435 85439 11463 -80832 -89513 -38827 3255 17960 5878
5284E878o252J9060J5824n5310m6391P989n720J4277k5754L691j1866k7817P2509
$$ 5878 -374 18686 34510 -20800 -67191 -59202 -64922 -50645 -76399 -72708 -84574 -112391 -39882
5271c9882L8846p666J5154M5497J8335q2759j00155J8847P0200N1532m7158j0028
$$ -39882 -1036 -8702 6452 51949 70284 -12475 -112630 -93783 -23583 27949 -19209 -29237
5259b9237r151o123O6021P4940n0541l9596M5800J00040M364j0561k4456o0605
$$ -29237 -38388 -44511 21510 96450 45909 6313 52113 152153 156517 145956 121500 60895
5247F0895l3551n6438P8198N7440j7017k7377p2496k4876j9013N0053j2450j13405
$$ 60895 27344 -29094 49104 106544 89527 62150 -10346 -35222 -54235 -4182 -16632 -130037
5235a30037N254M5654M450J4462O8260M6598M7565j6188o9409p206m9624J2648
$$ -130037 -124783 -79129 -74679 -60217 8043 54641 102206 86018 16609 9403 -40221 -27573
5223b7573o306J9556M7202Q9m2459P624j0110n7162n7246Q740m0413k7271J01356
$$ -27573 -33879 -14323 32879 32968 -9491 -1867 -11977 -69139 -126385 -117645 -158058 -185329 -83973
5210h3973O3079M7652j6135J5496o832K5961K0747L3775j7236p0022l319j7348
$$ -83973 -20894 26758 10623 26119 19287 45248 65995 99770 82534 12512 9193 -8155
5198h155J4265K7247K1045n6556M665l6152o095P2266J6098q6787m2989R669N2893
$$ -8155 6110 33357 54402 -2154 2511 -33641 -39736 32530 48628 -38159 -81148 -71479 -18586
5185a8586l2927n3122P9163L8754m4710n4023J8713J9666K5284j7368q388K348
$$ -18586 -51513 -104635 -25472 13282 -31428 -85451 -66738 -47072 -21788 -39156 -47544 -45196
5173d5196j5838j5913m7646J0305j5126q13M4253O3563k2247l38r403j509R060
$$ -45196 -61034 -76947 -124593 -114288 -129414 -130227 -85974 -22411 -44658 -44996 -54399 -55908 -46848
5160d6848K3996k0325j0638m0687j4515M6125m0601k0509K9132L7399O2358p463
$$ -46848 -22852 -43177 -53815 -94502 -109017 -62892 -103493 -124002 -94870 -57471 4887 -2576
5148b576p4877Q14J6654k4746M3800Q8580l3239k806K752J248L4225q0840l435
$$ -2576 -77453 -76639 -59985 -84731 -40931 47649 14410 11604 14356 15604 49829 -31011 -34446
5135c4446l145n920j6067m6853O6470N0112J4642n2724j6834k0659j20330n1503
$$ -34446 -37591 -43511 -59578 -106431 -39961 10151 24793 -27931 -44765 -65424 -185754 -237257
5123b37257R8134L6688n161j2133M7979j8158j6329O2491R3189M3973j10488o279
$$ -237257 -139123 -102435 -107596 -119729 -71750 -89908 -106237 -43746 49443 93416 -17072 -23351
5111b3351P4905n2406k6360j8433r829p2642K0847M5223O4757R4527j8957l0521
$$ -23351 51554 -852 -27212 -45645 -55474 -128116 -107269 -62046 2711 97238 78281 47760
5099D7760k1594l8103r466L5816m4951j4234O8107o057o0990J3317M6480k4908
$$ 47760 26166 -11937 -21403 14413 -30538 -44772 23335 17278 -43712 -30395 16085 -8823
5087h823o1069j4401M756K0003K377K4581N1719j4433L3063L2575p2060q4647
$$ -8823 -69892 -84293 -79537 -59534 -57157 -32576 19143 4710 37773 70348 -1712 -86359
5075h6359j2644l881J9433M3596O319J5549j9039l491O2022J3701p7884n9343
$$ -86359 -99003 -102884 -83451 -39855 -33536 -17987 -37026 -40517 21505 35206 -42678 -102021
5063a02021J9672O1644O974j3978L7844r767l9536J4538M0627n687m3250O652
$$ -102021 -82349 -20705 -13731 -27709 10135 368 -39168 -24630 15997 10310 -32940 -26288
5051b6288k0614m9099R956k2840J1708L2597o440J5928M7383N1251j2324k5471
$$ -26288 -46902 -96001 -86045 -108885 -97177 -64580 -71020 -55092 -7709 43542 31218 5747
5039E747Q737l208k6641k1467R987M2326K4677J1642m9053J2548L5480M5092p0204
$$ 5747 14484 11276 -15365 -36832 -26845 15481 40158 51800 2747 15295 50775 95867 25663
5026B5663p7640k4762L351N8841Q8275k0416r0863r7705j4914k1250J9323o524
$$ 25663 -51977 -76739 -73388 -14547 73728 53312 -37551 -135256 -150170 -171420 -152097 -158621
5014a58621L7223P7293J13672J8960J751j02548n9238M502N5400J0766L7909m072
$$ -158621 -121398 -44105 69567 88527 90278 -12270 -71508 -67006 -11606 -840 37069 32997
5002C2997n22l11M8265M174j9436m1723K0770K5328n5263p6364L5080k3457r689
$$ 32997 32475 32164 80429 84603 65167 23444 44214 69542 14279 -62085 -27005 -50462 -60151
4989f0151Q293q3131J994L0773M0198L336l7145l140J0804L540j3962O3042O3391
$$ -60151 -51858 -134989 -132995 -102222 -62024 -58688 -95833 -98973 -88169 -84629 -98591 -35549 27842
4976B7842M4237j0083m8397L0736k4766n7915l5868o8330L4420M6359K9579K5209
$$ 27842 72079 61996 13599 44335 19569 -38346 -74214 -142544 -108124 -61765 -32186 -6977
4964f977j04413o8701M5687P3727K5494m2787l1561Q5570k3859R811J06518j53
$$ -6977 -111390 -180091 -134404 -60677 -35183 -77970 -109531 -23961 -47820 -38009 68509 68356
4952F8356k3016p8821n6673M6303P1001l0072q6529K2721o0128M4328J30728L0882
$$ 68356 45340 -33481 -90154 -43851 27150 -2922 -89451 -66730 -126858 -82530 48198 79080
4940G9080j5315j6249N1677J9383n4124o4490m1073l2597l6273L1404M4704M8477
$$ 79080 63765 47516 99193 118576 64452 -38 -41111 -73708 -109981 -78577 -33873 14604
4928A4604J1933j8657L535M1511r676l6682L9306J4582k8954k4542r9458n8941
$$ 14604 26537 7880 11415 52926 43250 6568 45874 60456 31502 6960 -92498 -151439
4916a51439K4686J6097N2811K3234J5319Q117n2506n60n737N643M5380K1510o640
$$ -151439 -126753 -110656 -57845 -34611 -19292 -11175 -63681 -64241 -69978 -64335 -18955 2555 -4085
4903d085K6276j0533m0192J0471j5503o1626J077k4951J3416l4191k7244J7066
$$ -4085 22191 11658 -28534 -18063 -33566 -95192 -94115 -119066 -105650 -139841 -167085 -150019
4891a50019K8422M9775l1493k1059M8009R136K3314q279O6763K9073l2096n249
$$ -150019 -121597 -71822 -103315 -124374 -76365 -67229 -43915 -52194 14569 43642 11546 6297
4879F297n7975m5963Q658l4307m7766K4782Q7697J4407j8200Q6819l978p3251
$$ 6297 -51678 -97641 -88983 -123290 -171056 -146274 -58577 -44170 -62370 24449 20471 -52780
4867e2780l719L6270N2720L9641n2862j3713l3782R379M5267j6843j1739k2143
$$ -52780 -56499 -20229 32491 72132 19270 5557 -28225 -18846 26421 9578 -2161 -24304
4855b4304L1974N2683L077k9735r6327k4224k9226p830L4009O4035J0506K9830
$$ -24304 7670 60353 63430 33695 -62632 -86856 -116082 -123912 -89903 -25868 -15362 14468
4843A4468J9003o1471k9666l523K5250N604L4832P1202O420o1790L369K5219P84
$$ 14468 33471 -28000 -57666 -61189 -35939 -30335 4497 75699 82119 20329 23698 48917 49701
4830D9701j0410m3712k3679p777m0954J6322l5582n2725j0200K5296L2495M8473
$$ 49701 39291 -4421 -28100 -35877 -76831 -60509 -96091 -148816 -159016 -133720 -101225 -52752
4818e2752j8159J3743L3449m3184l1019l2784l5466P6665O1275L8794K14p5250
$$ -52752 -70911 -57168 -23719 -66903 -97922 -130706 -166172 -89507 -28232 10562 10776 -64474
4806f4474l2941J5974M3291j1665M4543N7830K0544m866k6239j9038O6150N448
$$ -64474 -97415 -81441 -38150 -49815 -5272 52558 73102 68236 41997 22959 89109 94557
4794I4557q1269k2760L128j9624K6016J2338J2156j5715J3502p3386p9406j5292
$$ 94557 13288 -9472 -6344 -25968 48 12386 24542 8827 22329 -51057 -130463 -145755
4782a45755P0396P5191L3162l0771l2236J0668J0997m6830k399m850P5616K5493
$$ -145755 -75359 -168 32994 2223 -30013 -19345 -8348 -55178 -57577 -62427 13189 38682
4770C8682n3514J621n182K5709L6661J3022J3953M765k0286k6108K3317m4230
$$ 38682 -14832 -13211 -18393 7316 43977 56999 70952 75717 55431 29323 52640 8410
4758H410Q775J8574m353o6291J1168M0018m6548j17735k260R260Q575L1514L577
$$ 8410 17185 35759 31406 -34885 -23717 16301 -30247 -147982 -150242 -140982 -132407 -100893 -97316
4745i7316r291J6762N0878L6145L8661k6817n8404n6052Q2074k2645m7912K1027
$$ -97316 -106607 -89845 -38967 -2822 35839 9022 -49382 -105434 -23360 -46005 -93917 -72890
4733g2890P0386L7234L9913j5865p7978L201k773j5837K3312K5703j9402J9285
$$ -72890 -2504 34730 74643 58778 -19200 -15999 -18772 -34609 -11297 14406 -4996 14289
4721A4289J6630o224J0086m0830n4114p246K3616j4623j0683P7223P0662m8062
$$ 14289 30919 24695 34781 -6049 -60163 -67409 -43793 -58416 -69099 8124 78786 30724
4709C0724j4166M6767o817m3207o3325J7764M1607K1314n7118L373O5811k0279
$$ 30724 16558 63325 56508 13301 -50024 -32260 9347 30661 -26457 -23084 42727 22448
4697B2448l8056r608J0167J5713K2591Q309l2271P949j5386j5377Q022J8051l496
$$ 22448 -15608 -25216 -15049 664 23255 31564 -707 7242 -8144 -23521 -15499 2552 -944
4684i44k3848J6891L5126l9449k4424P510j0875l561O053k500r514J5428L5081
$$ -944 -24792 -7901 27225 -12224 -36648 -29138 -40013 -43574 -37521 -40021 -49535 -34107 974
4671I74O8988N5400q6485j7322M6030M0595j6710q3374k7636K5499L785k5211
$$ 974 69962 125362 38877 21555 67585 108180 91470 8096 -19540 5959 9744 -15467
4659a5467p141k8897l8830O116N0804N1586R734j0099j5704n5223O4921K1481
$$ -15467 -22608 -51505 -90335 -84219 -33415 18171 27905 17806 2102 -53121 11800 33281
4647C3281j2736k0380j8547j5097K6115m85K1760P1600m5234J0122O126J3954
$$ 33281 20545 165 -18382 -33479 -7364 -7849 13911 85511 40277 50399 56525 70479
4635G0479k4843k4833Q014L0985l145m0105n1992n5082p323M183M6216K7799N4086
$$ 70479 45636 20803 28817 59802 56657 16552 -35440 -90522 -97845 -93662 -47446 -19647 34439
4622C4439K5052n1032p7863o063k1020P9952K8505j7531l4333L8671M4739n7522
$$ 34439 59491 8459 -69404 -75467 -96487 -16535 11970 -5561 -39894 -1223 43516 -14006
4610a4006j2499Q8585j4027l6111m0415j8428l4255q510J4791J1094P7176q723
$$ -14006 -26505 62080 48053 11942 -28473 -46901 -81156 -89666 -74875 -63781 13395 4672
4598D672m041J1324R51M7699l8482n7300l4819M4504K8776L0237K58o2106o9381
$$ 4672 631 11955 12906 60605 22123 -35177 -69996 -25492 3284 33521 33779 -28327 -97708
4585i7708l3561M1217M4901j4452q677J08446M7364n0132j02222n0407O5185M368
$$ -97708 -131269 -90052 -45151 -59603 -68280 40166 87530 37398 -64824 -115231 -50046 -45678
4573d5678n0031M3268p481l6094l4670r59O1983J07882o5143k7222J4488J0663
$$ -45678 -95709 -52441 -59922 -96016 -130686 -131645 -69662 38220 -26923 -54145 -39657 -28994
4561b8994J8455L1122k6242k2642P126N1766P151m9326o5972r608P5035m6196
$$ -28994 -10539 20583 -5659 -28301 -21175 30591 37742 -11584 -77556 -87164 -12129 -58325
4549e8325j7893M1736K3303J8306r832m2590r260j301k6876j5257L430j0966k370
$$ -58325 -76218 -34482 -11179 7127 -2705 -45295 -54555 -55856 -82732 -97989 -94559 -105525 -107895
4536a07895J2407N5440P7954l0878l6241j4891j8670m5616K7084K078J7026j4446
$$ -107895 -95488 -40048 37906 7028 -29213 -44104 -62774 -108390 -81306 -79228 -62202 -76648
4524g6648m1181J6332O3758k7572j090m6703R4812L6850r160L2839k7630l0703
$$ -76648 -117829 -101497 -37739 -65311 -66401 -113104 -18292 18558 9398 42237 14607 -16096
4512a6096J1232m1443l2346M1834k5589q8609R655R339K6043m644R689K8836K6871
$$ -16096 -4864 -46307 -78653 -36819 -62408 -151017 -141362 -132023 -105980 -110624 -100935 -72099 -45228
4499d5228O959K3411N6473M1008n933L2338q2482j3622j596r059l9617n5708K6361
$$ -45228 -38269 -14858 41615 82623 76690 109028 26546 12924 11328 2269 -37348 -93056 -66695
4486f6695O5100o9602J5359j8656n6729O240j5815k214L67J6912O4556N8069N2564
$$ -66695 -1595 -71197 -55838 -74494 -131223 -124983 -140798 -143012 -142645 -125733 -61177 -3108 49456
4473D9456q707M269L1753J0342L1711K9388J936o2382l8000k5207J539L4028j05121
$$ 49456 40749 45018 76771 87113 118824 148212 150148 87766 49766 24559 26098 60126 -44995
4460d4995j6664P0469L7621P50k5471l5518l000L2k9790J9701K3645p766k3059
$$ -44995 -61659 8810 46431 47181 21710 -13808 -16808 -16776 -46566 -26865 -3220 -10986 -34045
4447c4045o513j063K8615k0891k8772l5090L1075M1778n1843k8093K3277n379
$$ -34045 -40558 -41621 -13006 -33897 -62669 -97759 -66684 -24906 -76749 -104842 -81565 -86944
4435h6944R930N2331m7165j5480k1136R8292Q4841K8898l034o8277r2068m1806
$$ -86944 -77014 -24683 -71848 -87328 -108464 -10172 74669 103567 100533 32256 -59812 -101618
4423a01618K5453J5762M5748J0440O5474J2919k6435j9186n2078p1992k2760k6309
$$ -101618 -76165 -60403 -14655 -4215 61259 74178 47743 28557 -23521 -95513 -118273 -144582
4411a44582k1321R7138L4686J2894j7334j8780J9574m4857J452K4629K5381K1833
$$ -144582 -165903 -68765 -34079 -21185 -38519 -57299 -37725 -82582 -81130 -56501 -31120 -9287
4399i287K3993m2213k0600m4693j2131Q546L7423J8090K8419M3789n347M6557
$$ -9287 14706 -27507 -48107 -92800 -104931 -96385 -58962 -40872 -12453 31336 25989 72546
4387G2546J8755n2609k9838O597m4703p9689J0914K3834P982Q2459M7442o2202
$$ 72546 91301 38692 8854 15451 -29252 -108941 -98027 -74193 -66211 16248 63690 1488
4375A488p14k9599p0439l6588J7804J9366n2168M480P1026L6684J0908k92q8904
$$ 1488 774 -28825 -99264 -135852 -118048 -98682 -150850 -146370 -75344 -38660 -27752 -28044 -116948
4362a16948K0988O3440l1378J0797M4583l9518K5726O4593k3936N1583J3274q858
$$ -116948 -95960 -32520 -63898 -53101 -8518 -48036 -22310 42283 18347 69930 83204 74346
4350G4346n5007p2877o6720O3138K6316o219J4366J1604M6672J5114l2683M6174
$$ 74346 19339 -53538 -120258 -57120 -30804 -37023 -22657 -11053 35619 50733 18050 64224
4338F4224L1102o5332l4457M7337Q024N1301q5130r2333j547j1289l127r149l3932
$$ 64224 95326 29994 -4463 42874 50898 102199 17069 -75264 -76811 -88100 -91227 -100376 -134308
4325a34308M2881P5790M2237K5999j3846m7918o0268k7869l5259L7916K8598M7095
$$ -134308 -91427 -15637 26600 52599 38753 -9165 -69433 -97302 -132561 -94645 -66047 -18952
4313a8952K4107l740P656J8643R034j3291m2543o120j5201J8100J9214j5594L0043
$$ -18952 5155 1415 9071 27714 36748 23457 -19086 -25206 -40407 -22307 -3093 -18687 11356
4300A1356N4195p1281o0291n4393N0003M136r83N4839l7091k6266j0133o846l0230
$$ 11356 65551 -5730 -66021 -120414 -70411 -66275 -67258 -12419 -49510 -75776 -85909 -92755 -122985
4287a22985k9514N3177Q5484j2747j8830k4093K7018n10J4641P5579k4897k8012
$$ -122985 -152499 -99322 -13838 -26585 -45415 -69508 -42490 -43000 -28359 47220 22323 -5689
4275e689j1088J3794R885n0776K1433o1489K3388Q0388j6774l7307M5123N14j4867
$$ -5689 -16777 -2983 6902 -43874 -22441 -83930 -60542 19846 3072 -34235 10888 11402 -3465
4262c465n9067n4983J2913P9678K6733k5319N642J5157J3585K6726l843M692j9424
$$ -3465 -62532 -117515 -104602 -24924 1809 -23510 -17868 -2711 10874 37600 33757 38449 19025
4249A9025R802r1934l6058R5313Q3009k491O0722P2j9277l6727P933J4202J0738
$$ 19025 28827 -63107 -99165 -3852 79157 76666 137388 137460 118183 81456 89389 103591 114329
4236A14329n0287K401K4043k8475m383Q930m1222m6909P6733J3164o30J9249o5848
$$ 114329 64042 66443 90486 62011 57628 66558 25336 -21573 55160 68324 67694 86943 21095
4223B1095m2369o7150N9417J3903K2556J7717k6566m6251L492L2736Q6687j0571
$$ 21095 -21274 -88424 -29007 -15104 7452 25169 -1397 -47648 -44156 -11420 75267 64696
4211F4696n0688o563o2579L6668L1434n6374Q9330R3136k508p5351q5952L1970
$$ 64696 14008 7445 -55134 -18466 12968 -43406 45924 139060 136552 61201 -24751 7219
4199G219M3311K5593l801O584L1602K7038k8128l6823j5894l816p0355n9191R2361
$$ 7219 50530 76123 72322 78906 110508 137546 109418 72595 56701 52885 -17470 -76661 15700
4186A5700o1753k1032L3333o532l0303n9695M4096N0272J01378L319j2030J0947
$$ 15700 -46053 -67085 -33752 -40284 -70587 -130282 -86186 -35914 65464 68783 56753 67700
4174F7700l9816l5834k9393l973K7557j5334m6570p572M4032M7263O9306L0844
$$ 67700 27884 -7950 -37343 -41316 -13759 -29093 -75663 -83235 -39203 8060 77366 108210
4162A08210m7534l5309R903l2610l4904j938L1280Q2135J8410n9091j7572k4590
$$ 108210 60676 25367 35270 2660 -32244 -34182 -2902 79233 97643 38552 20980 -3610
4150c610q672J7330m185L5392l6616Q141N9303k2674l5251L9579n9883r4588k7811
$$ -3610 -12282 5048 863 36255 -361 7780 67083 44409 9158 48737 -11146 -105734 -133545
4137a33545k0704P5085O0657n777l3529m165O9501J625o6372O7270q601J26p4780
$$ -133545 -154249 -79164 -18507 -24284 -57813 -61978 7523 9148 -57224 10046 1445 1571 -73209
4124g3209r127Q658K0636K4334K8590k958Q029o803q818L8815P2654n9696r1613
$$ -73209 -82336 -73678 -53042 -28708 -118 -3076 4953 -1850 -10668 28147 100801 41105 -50508
4111e0508J4565P8879m1706o4087K9615N0584j0032k2155o573k4674O2554J1003
$$ -50508 -35943 42936 1230 -62857 -33242 17342 7310 -14845 -21418 -46092 16462 27465
4099B7465k7741n9227k9390l628m645O9752R7791J3066n3918l0015M2108n5339
$$ 27465 -276 -59503 -88893 -92521 -97166 -27414 70377 83443 29525 -490 41618 -13721
4087a3721j02047k0519O3027m5779o740N3426N1701K5762N8900k2537l1861n278
$$ -13721 -115768 -136287 -73260 -119039 -125779 -72353 -20652 5110 64010 41473 9612 4334
4075D334q132p7760q445J9804R3416J9948m5788J7332K3886o5805m809k396j4261
$$ 4334 -3798 -81558 -90003 -70199 23217 43165 -2623 14709 38595 -27210 -32019 -34415 -48676
4062d8676k6994m5368j7070L7649L0028j2633J03875K9523p1880k5347L1779m5310
$$ -48676 -75670 -121038 -138108 -100459 -70431 -83064 20811 50334 -21546 -46893 -15114 -60424
4050f0424N3513M6955n1953l0784j0818k1136K950k5583j6954L3123O2266k8530
$$ -60424 -6911 40044 -11909 -42693 -53511 -74647 -71697 -97280 -114234 -81111 -18845 -47375
4038d7375J954R458L6403L1643m4021r5362L1878N1235m423k7562M7230R365j0277
$$ -47375 -45421 -35963 440 32083 -11938 -107300 -75422 -24187 -28610 -56172 -8942 423 -9854
4025i854l2495L378j2347L5787L2065R2360l3289k8211l1773J1018K5694k9484
$$ -9854 -42349 -38971 -51318 -15531 16534 108894 75605 47394 15621 26639 52333 22849
4013B2849J2264N2510j2652m5713q3845n0820K9548M7973L3614L6891J1534k2572
$$ 22849 35113 87623 74971 29258 -54587 -105407 -75859 -27886 5728 42619 54153 31581
4001C1581m2025m2409n7414J8872L0058L6831K6588r4861m0770q621j3419m5624
$$ 31581 -10444 -52853 -110267 -91395 -61337 -24506 2082 -92779 -133549 -142170 -155589 -201213
3989b01213O2999K1928N0115L2814j0297O3183K056P872K5088J6667O4944j7077
$$ -201213 -138214 -116286 -66171 -33357 -43654 19529 21585 29457 54545 71212 136156 119079
3977A19079q3140k9032L3090m2417o3760J6012K2915l5899l7708P9412K8271J0416
$$ 119079 35939 6907 39997 -2420 -66180 -50168 -27253 -63152 -100860 -21448 6823 17239
3965A7239R524j1580J3602N7008O2475N4824m7553p9206l0527r176M3209p0251
$$ 17239 26763 15183 28785 85793 148268 203092 155539 76333 45806 36630 79839 9588
3953I588l4277k1300O6651J1799k5674M5037l0518l9288o6749P9865K7891j8163
$$ 9588 -24689 -45989 20662 32461 6787 51824 21306 -17982 -84731 -4866 23025 4862
3941D862J5190j0615l6999j548R926O3363J2750m900l1022m8699m6348j4922L911
$$ 4862 20052 9437 -27562 -29110 -19184 44179 56929 52029 21007 -27692 -74040 -88962 -85051
3928h5051L1380M6598l6198k1352J2533L9573J9198n3806m0298m123L3934O9373
$$ -85051 -53671 -7073 -43271 -64623 -52090 -12517 6681 -47125 -87423 -91546 -57612 11761
3916A1761n5825L9309k8568o6919N160L4084J3678J0087j6031n4727M2949P2169
$$ 11761 -44064 -4755 -33323 -100242 -95082 -60998 -47320 -37233 -53264 -107991 -65042 7127
3904G127J5904m9761J2674j8333K938m7161R489L5245n1501L8812N0004l7782
$$ 7127 23031 -26730 -14056 -32389 -29451 -76612 -67123 -31878 -83379 -44567 5437 -32345
3892c2345m283j0266p837N3802P2980r297q7977n7905L1753Q3063K1224j3267
$$ -32345 -36628 -46894 -54731 -929 72051 62754 -25223 -83128 -51375 31688 52912 39645
3880C9645J3369k7130m1164j360R3764o2268k9171P122n9333k5989K9839K0700
$$ 39645 53014 25884 -15280 -16640 77124 14856 -14315 -7193 -66526 -92515 -62676 -41976
3868d1976R558L1461q829R338l558Q756j6836k4034o3412J7594m4292j5818K2069
$$ -41976 -32418 -957 -9786 -448 -4006 4750 -12086 -36120 -99532 -81938 -126230 -142048 -119979
3855a19979k7155J8498P632J0592j783K1203R926M1169K736r1347j6066L3545
$$ -119979 -147134 -128636 -121004 -110412 -112195 -90992 -81066 -39897 -37161 -128508 -144574 -111029
3843a11029Q901O6102L7596n7890K8111N2683K8288J1717r3848k2925K011o0291
$$ -111029 -102128 -36026 1570 -56320 -28209 24474 52762 64479 -29369 -52294 -50283 -110574
3831a10574J6774Q6143R135k0043j9914J9040n6251j232n7730K253O3455Q4908
$$ -110574 -93800 -7657 1478 -18565 -38479 -19439 -75690 -76922 -134652 -132399 -68944 15964
3819A5964K4229o3953o2152K7100J6007K6701J13806M9574m666o1998r5836l5952
$$ 15964 40193 -23760 -85912 -58812 -42805 -16104 97702 147276 142610 80612 -15224 -51176
3807e1176Q1560l1146k6065k8253L7439Q9998j8039q2775q23M4551p0868J3715
$$ -51176 30384 -762 -26827 -55080 -17641 72357 54318 -28457 -29280 15271 -55597 -41882
3795d1882L1107l17l64j8898k6183l318J0153L700J9376J281K3996l8264k8474
$$ -41882 -10775 -11092 -11456 -30354 -56537 -59855 -49702 -46002 -26626 -25345 -1349 -39613 -68087
3782f8087L0697K4782l2294L6995Q0498N3178j03201m0760J1294o9936M970L8076
$$ -68087 -37390 -12608 -44902 -7907 72591 125769 22568 -18192 -6898 -76834 -71864 -33788
3770c3788o609K1988L6942k2058m5769k8750l49J2899K4319j8790K8325L5411
$$ -33788 -40397 -18409 18533 -3525 -49294 -78044 -78393 -65494 -41175 -59965 -31640 3771
3758C771j06728j22385Q05P6884P9482k4634M8341L8571j3638k7599j1618l8551
$$ 3771 -102957 -225342 -224537 -147653 -68171 -92805 -44464 -5893 -19531 -47130 -58748 -97299
3746i7299q393M2682J3970j4471P2068m9570m472K583n1149J0819n1253m8318
$$ -97299 -105692 -63010 -49040 -63511 8557 -41013 -45485 -42902 -94051 -83232 -134485 -182803
3734a82803N6671L6289J4351j4550M4752M1967R5645L308o2174K7333n4682r249
$$ -182803 -126132 -89843 -75492 -90042 -45290 -3323 92322 95630 33456 60789 6107 -3142
3722c142K2968l5295m2913M711k2664J291j6956m7438L2320N1909M5851Q407l6701
$$ -3142 19826 -15469 -58382 -53671 -76335 -75044 -92000 -139438 -107118 -55209 -9358 -951 -37652
3709c7652j7465J5776K4043l484k4926J9651m5476l4156K6271O0369K6577K0219
$$ -37652 -55117 -39341 -15298 -18782 -43708 -24057 -69533 -103689 -77418 -17049 9528 29747
3697B9747k9077p5827k5396N4304O1924k0209n1011n914J7165L4763o239n3547
$$ 29747 670 -75157 -100553 -46249 15675 -4534 -55545 -61459 -44294 -9531 -15770 -69317
3685f9317k5482N1854R5803K5075k7081l8625o8222L2693j8755o530K4658m9050
$$ -69317 -94799 -42945 52858 77933 50852 12227 -55995 -23302 -42057 -48587 -23929 -72979
3673g2979K5524Q4307l3807K6106n0664o4702m0443R857N1801K0861K7095J3542
$$ -72979 -47455 36852 3045 29151 -21513 -86215 -126658 -116801 -65000 -44139 -17044 -3502
3661c502K3428j2390L233J2472j1297K755L4892l7028n5921Q2451M1087k6260
$$ -3502 19926 7536 10769 23241 11944 14699 49591 12563 -43358 39093 80180 53920
3649E3920k5562J04551P990r3085j368k2128j6708j3553m6101J4096N0090J3775
$$ 53920 28358 132909 140899 47814 46446 24318 7610 -5943 -52044 -37948 12142 25917
3637B5917m7975o8178L210L5947l0897N427J43k202k99J2337P131k8425l878M111
$$ 25917 -22058 -90236 -87026 -51079 -81976 -76549 -76406 -78608 -78907 -66570 -59439 -87864 -91742 -87631
3623h7631P1574K9582m7155M1719J5878p4925k770j4112o0167n6673N7127O2261
$$ -87631 -16057 13525 -33630 8089 23967 -50958 -53728 -67840 -128007 -184680 -127553 -65292
3611f5292l8985l6436O8415P8421K9837p652k3862L3729O2210j4792m1194l3577
$$ -65292 -104277 -140713 -72298 6123 35960 28308 4446 38175 100385 85593 44399 10822
3599A0822q3424L4081K7235L1280K6628P2376K755m1832j7056p424l1923p8713
$$ 10822 -72602 -38521 -11286 19994 46622 118998 121753 79921 62865 55441 23518 -55195
3587e5195n133O2365j0421J490p393M537l4188m1602Q5891M7981k8148p568k5671
$$ -55195 -60328 2037 -8384 -6894 -14287 -9750 -43938 -85540 351 48332 20184 12616 -13055
3574a3055n0606P790m0076L0229l5370j105P1243M0103j4723l8720j8334j8951
$$ -13055 -63661 -55871 -95947 -65718 -101088 -102193 -30950 9153 -5570 -44290 -62624 -81575
3562h1575K8583q4967o9222P284J28846K2875m128n2630m2166j6133N6750P1077
$$ -81575 -52992 -137959 -207181 -199897 -71051 -48176 -52304 -104934 -147100 -163233 -106483 -35406
3550c5406J7976N8119Q4103r5007k6010O151K6889n8265k8935J00814r171m5741
$$ -35406 -17430 40689 124792 29785 3775 9926 36815 -21450 -50385 50429 41258 -4483
3538d483j6014j3583k4034k020N170m3489j1519J9096p806K4486N1923m6877K918
$$ -4483 -20497 -34080 -58114 -60134 -54964 -98453 -109972 -90876 -98682 -74196 -22273 -69150 -66232
3525f6232j5006N5086K1499j6298L4286Q2353m2840m202n8995l0368l897J7785
$$ -66232 -81238 -26152 -4653 -20951 13335 95688 52848 48646 -10349 -40717 -44614 -26829
3513b6829l6829l8104M548j4617N5076P3197l6747n3666l8068J8054N6611M4209
$$ -26829 -63658 -101762 -97214 -111831 -56755 16442 -20305 -73971 -112039 -93985 -37374 6835
3501F835M3969K0153L4661m6640o4557L2765Q639o5774j5759P283K5522K7628
$$ 6835 50804 70957 105618 58978 -5579 27186 35825 -29949 -45708 -38425 -12903 14725
3489A4725Q194o2480k4123Q402J8672J9805R299k2336J0930n113K4162P366P0018
$$ 14725 22919 -39561 -63684 -55282 -36610 -16805 -7506 -29842 -18912 -24025 137 7503 77521
3476G7521n009j18760n0066P8369R2926J4127n2151l2418r853n8153l2809K6159
$$ 77521 72512 -46248 -96314 -17945 74981 89108 36957 4539 -5314 -63467 -96276 -70117
3464g0117L2677N1018O6883M5265K8451n6210q7930n1763J0543O1448N2298N0833
$$ -70117 -37440 13578 80461 125726 154177 97967 10037 -41726 -31183 30265 82563 133396
3452A33396m397k7253L520J1069n0194q9027p4791M368J1149Q178M0859L2216
$$ 133396 128999 101746 105266 116335 66141 -22886 -97677 -93309 -82160 -73982 -33123 -907
3440i07n532j6727K2213K0340m0756r714L920K5329Q3m9713K4327k283j6392n421
$$ -907 -6439 -23166 -953 19387 -21369 -31083 -27163 -1834 -1751 -51464 -27137 -29420 -45812 -51233
3426e1233j2979L0590k1826J2345M6132l46L4760l1034J335K5672P304m9550m585
$$ -51233 -64212 -33622 -55448 -43103 3029 2683 37443 6409 7744 33416 40720 -8830 -13415
3413a3415m065m3174l4506Q5279K7729J6639J4387p3142l9299j1948O7018K1911
$$ -13415 -17480 -60654 -95160 -9881 17848 34487 48874 -24268 -63567 -75515 -8497 13414
3401A3414J7693J0919r582k2994K1823l0290l3409O6279Q3270l7369j2789M883
$$ 13414 31107 42026 32444 9450 31273 983 -32426 33853 117123 79754 66965 71848
3389G1848m3655k0128l0470L7067n9249j997P4626k2544j9639K0827n9140L3671
$$ 71848 28193 8065 -22405 14662 -44587 -46584 28042 5498 -14141 6686 -52454 -18783
3377a8783M4533L0423O9679J7592k0989r2753j8035P0388K8884o4635n8588l4890
$$ -18783 25750 56173 125852 143444 122455 29702 11667 82055 110939 46304 -12284 -47174
3365d7174n734M0285L6567K6116l5938j6174N31L930j2241r868K2737j0405q0972
$$ -47174 -52908 -12623 23944 50060 14122 -2052 -1521 2409 -9832 -19700 3037 -7368 -88340
3352h8340r060N7108J09436r583l3176m4225n8413N7891L3462j4537O1589L5601
$$ -88340 -97400 -40292 69144 59561 26385 -17840 -76253 -18362 15100 563 62152 97753
3340I7753j3352L137p721j01761p7619k2508j3227l480R5251j9291k7397o3230
$$ 97753 84401 87538 79817 -21944 -99563 -122071 -135298 -138778 -43527 -62818 -90215 -153445
3328a53445m573M6486j6769n8379K3798O7914K9430K2607j4460l0944Q5996K8618
$$ -153445 -158018 -111532 -128301 -186680 -162882 -94968 -65538 -42931 -57391 -88335 -2339 26279
3316B6279n8509o1555m0114L0487P7995K0269N083l7895j9660L1794p816k9027
$$ 26279 -32230 -93785 -133899 -103412 -25417 -5148 -65 -37960 -57620 -25826 -33642 -62669
3304f2669m961M0344R54O784m3753j6877m0060k5282M2473L8842P39P469J4565
$$ -62669 -67630 -27286 -26332 -19548 -63301 -80178 -120238 -145520 -103047 -64205 -63466 -55997 -41432
3291d1432N3283L4435M2922n1275L6573J7056p3954l3064M3809L5191p3606m4990
$$ -41432 11851 46286 89208 37933 74506 91562 17608 -15456 28353 63544 -10062 -55052
3279e5052J1481O7514J2603m7774K8392n731k8244K0227N6254J995k6635j6323
$$ -55052 -43571 23943 36546 -11228 17164 11433 -16811 3416 59670 61665 35030 18707
3267A8707L9185J7349q8687j6211J7100k5351K4919R060k692J7691L4434j0649
$$ 18707 57892 75241 -13446 -29657 -12557 -37908 -12989 -3929 -6621 11070 45504 34855
3255C4855p3309k2533J1478M2105L5613r4431n3830L2693l4884M4804L4413N1271
$$ 34855 -38454 -60987 -49509 -7404 28209 -66222 -120052 -87359 -122243 -77439 -43026 8245
3243H245j6722k2675j3292J5111N6739o871k6717K0398L7671L2206k2738l4601
$$ 8245 -8477 -31152 -44444 -29333 27406 20535 -6182 14216 51887 84093 61355 26754
3231B6754n2152L7205j8579k5019J15710K0949j14580j6741j8254m9501K0747
$$ 26754 -25398 11807 -6772 -31791 83919 104868 -9712 -26453 -44707 -94208 -73461
3220g3461L7435N0339p609L1210P946O0412j3490K5333L2849j6397m8210l9242
$$ -73461 -36026 14313 6704 37914 45860 106272 92782 118115 150964 134567 86357 47115
3208D7115k0557K0871N999j6983M801N3035l6810n3821M2550n8688l4094R504
$$ 47115 26558 47429 53428 36445 41246 94281 57471 3650 46200 -12488 -46582 -37078
3196c7078P0854P5066k0696q1878o3253j6592O3062j2339l9584j486n29O87j5779
$$ -37078 33776 108842 88146 6268 -56985 -73577 -10515 -22854 -62438 -63924 -64453 -63766 -79545
3183g9545L5736N9356L1745J41389k4010p5195o2661J1316n6258q587j396l385
$$ -79545 -43809 15547 47292 188681 164671 89476 26815 38131 -18127 -26714 -28110 -31495
3171c1495J1248K2799o677L6529N9506m6576p7757L859P2771n971n1840m5210
$$ -31495 -20247 2552 -4125 32404 91910 45334 -32423 -28564 44207 38236 -13604 -58814
3159e8814K4315J8306O0823J2095k6844l060K4448n41l4234K487K491P490j7578
$$ -58814 -34499 -16193 44630 56725 29881 26821 51269 50728 16494 18981 21472 28962 11384
3146A1384m0840m8326k0722k368L6589K4614K3996j4988m2888N5921K7467J5592
$$ 11384 -29456 -77782 -98504 -100872 -64283 -39669 -15673 -30661 -73549 -17628 9839 25431
3134B5431m4759m8080J9864J4672j4387Q201M8520K3142n564Q3019K3041o1246
$$ 25431 -19328 -67408 -47544 -32872 -47259 -39058 9462 32604 27040 110059 133100 71854
3122G1854o4547n5463M4842k6495l1941m6942L3081m0198K3015L9397o709r772
$$ 71854 7307 -48156 -3314 -29809 -61750 -108692 -75611 -115809 -92794 -53397 -60106 -69878
3110f9878M8600m63m2555l5986R7256N8727k0925l2047k1516j7289K0441m9573
$$ -69878 -21278 -21741 -64296 -100282 -3026 55701 34776 2729 -18787 -36076 -15635 -65208
$$ [...]
##END NTUPLES=NMR SPECTRUM
##END=
