##TITLE=Analysis number 317441
Compound Code mo 07782
Project Code qc-cat
Chemist Name fudan
##JCAMPDX= 6.0         $$ Bruker NMR JCAMP-DX V2.0
##DATA TYPE= NMR SPECTRUM
##DATA CLASS= NTUPLES
##ORIGIN= Bruker BioSpin GmbH
##OWNER= nmr
$$ XWIN-NMR		Version 3.5
$$ Mon Feb 20 15:44:53 2006 GMT Standard Time (UT+0h)  MAYBRIDGE\nmr@NMR_250MHZ
##.OBSERVE FREQUENCY= 250.131544655141
##.OBSERVE NUCLEUS= ^1H
##.ACQUISITION MODE= SIMULTANEOUS (DQD)
##.ACQUISITION SCHEME= undefined
##.AVERAGES= 16
##.DIGITISER RES= 18
##SPECTROMETER/DATA SYSTEM= dpx250
##.PULSE SEQUENCE= zg30
##.SOLVENT NAME= CDCl3
##.SHIFT REFERENCE= (INTERNAL, CDCl3, 0, 16.522)
##AUDIT TRAIL= $$ (NUMBER, WHEN, WHO, WHERE, WHAT)
$$ ##TITLE= Audit trail, XWIN-NMR		Version 3.5
$$ ##JCAMPDX= 5.01
$$ ##ORIGIN= Bruker BioSpin GmbH
$$ ##OWNER= nmr
$$ C:\u/data/dgb/nmr/ADRS/16370/pdata/1/auditp.txt
$$ ##AUDIT TRAIL=  $$ (NUMBER, WHEN, WHO, WHERE, WHAT)
(   1,<2006-02-20 15:44:08.42 +000>,<MAYBRIDGE\nmr>,<NMR_250MHZ>,
      <created by zg, POWCHK disabled, PULCHK disabled
       configuration hash MD5:
       84 BC 41 DB A1 6E 1D 46 DA 25 12 A5 C1 ED C5 3A
       data hash MD5: 64K
       DB 21 4D 61 ED 10 DD 83 78 3D A6 11 25 64 C8 2B>)
(   2,<2006-02-20 15:44:29.23 +000>,<MAYBRIDGE\nmr>,<NMR_250MHZ>,
      <Start of raw data processing
       ef LB = 0.3 FT_mod = 6 PKNL = 1 SI = 32K 
       data hash MD5: 32K
       5A 4F 8B 50 48 12 A6 4C 15 B6 CC 8B A8 CA D6 9D>)
(   3,<2006-02-20 15:44:32.90 +000>,<MAYBRIDGE\nmr>,<NMR_250MHZ>,
      <apk 
       data hash MD5: 32K
       CD 79 5A D2 9F A0 B8 68 F9 A4 B7 F1 E9 69 64 02>)
(   4,<2006-02-20 15:44:34.25 +000>,<MAYBRIDGE\nmr>,<NMR_250MHZ>,
      <abs ABSG = 5 
       data hash MD5: 32K
       41 2B D8 01 EF 35 81 8C 7C 16 F3 FD 50 C1 62 9A>)
$$ ##END=
$$ 
$$ hash MD5
$$ CC A1 52 20 47 88 ED E9 74 70 A7 45 1F 93 BD 81
##$RELAX= 
##$RELAX= 
##$RELAX= 
##$RELAX= 
##$RELAX= 
##$RELAX= 
##$RELAX= 
$$ Bruker specific parameters
$$ --------------------------
##$DU= <C:\u>
##$EXPNO= 16370
##$NAME= <ADRS>
##$PROCNO= 1
##$TYPE= <nmr>
##$USER= <dgb>
##$AMP= (0..31)
100 100 100 100 100 100 100 100 100 100 100 100 100 100 100 100 100 100 
100 100 100 100 100 100 100 100 100 100 100 100 100 100 
##$AQSEQ= 0
##$AQ_mod= 3
##$AUNM= <au_zg>
##$AUTOPOS= <45 >
##$BF1= 250.13
##$BF2= 250.13
##$BF3= 250.13
##$BF4= 250.13
##$BF5= 500.13
##$BF6= 500.13
##$BF7= 500.13
##$BF8= 500.13
##$BYTORDA= 1
##$CFDGTYP= 0
##$CFRGTYP= 5
##$CHEMSTR= <none>
##$CNST= (0..31)
1 1 145 1 1 1 1 1 1 1 1 1 1 1 1 1 1 1 1 1 1 1 1 1 1 1 1 1 1 1 1 1 
##$CPDPRG= <>
##$CPDPRG1= <>
##$CPDPRG2= <>
##$CPDPRG3= <>
##$CPDPRG4= <mlev>
##$CPDPRG5= <mlev>
##$CPDPRG6= <mlev>
##$CPDPRG7= <mlev>
##$CPDPRG8= <mlev>
##$CPDPRGB= <>
##$CPDPRGT= <>
##$D= (0..31)
0 1 0 0 0 0 0 0 0 0.06 0 0 0 0 0 0 0.0002 0 0 0 0 0 0 0 0 0 0 0 0 0 0 
0 
##$DATE= 1140450246
##$DBL= (0..7)
120 120 120 120 120 120 120 120 
##$DBP= (0..7)
150 150 150 150 150 150 150 150 
##$DBP07= 0
##$DBPNAM0= <>
##$DBPNAM1= <>
##$DBPNAM2= <>
$$ [...]
##$SUBNAM7= <"">
##$SUBNAM8= <"">
##$SUBNAM9= <"">
##$SW= 20.6930455092707
##$SWIBOX= (0..15)
0 0 3 0 0 0 0 0 0 0 0 0 0 0 0 0 
##$SW_h= 5175.983436853
##$TD= 65536
##$TD0= 1
##$TE= 294.16
##$TE2= 300
##$TE3= 300
##$TEG= 300
##$TL= (0..7)
0 120 120 120 120 120 120 120 
##$TP= (0..7)
150 150 150 150 150 150 150 150 
##$TP07= 0
##$TPNAME0= <>
##$TPNAME1= <>
##$TPNAME2= <>
##$TPNAME3= <>
##$TPNAME4= <>
##$TPNAME5= <>
##$TPNAME6= <>
##$TPNAME7= <>
##$TPOAL= (0..7)
0.5 0.5 0.5 0.5 0.5 0.5 0.5 0.5 
##$TPOFFS= (0..7)
0 0 0 0 0 0 0 0 
##$TUNHIN= 0
##$TUNHOUT= 0
##$TUNXOUT= 0
##$USERA1= <user>
##$USERA2= <user>
##$USERA3= <user>
##$USERA4= <user>
##$USERA5= <user>
##$V9= 5
##$VALIST= <valist>
##$VCLIST= <CCCCCCCCCCCCCCC>
##$VD= 0
##$VDLIST= <DDDDDDDDDDDDDDD>
##$VPLIST= <PPPPPPPPPPPPPPP>
##$VTLIST= <TTTTTTTTTTTTTTT>
##$WBST= 1024
##$WBSW= 4
##$XGAIN= (0..3)
0 0 0 0 
##$XL= 0
##$YL= 0
##$YMAX_a= 287513
##$YMIN_a= -573773
##$ZGOPTNS= <>
##$ZL1= 120
##$ZL2= 120
##$ZL3= 120
##$ZL4= 120
##$ABSF1= 16.522
##$ABSF2= -4.171173
##$ABSG= 5
##$ABSL= 3
##$ALPHA= 0
##$AQORDER= 0
##$ASSFAC= 0
##$ASSFACI= 0
##$ASSFACX= 0
##$ASSWID= 0
##$AUNMP= <proc_1d>
##$AZFE= 0.1
##$AZFW= 0.1
##$BCFW= 0
##$BC_mod= 0
##$BYTORDP= 0
##$COROFFS= 0
##$CY= 12.5
##$DATMOD= 1
##$DC= 0
##$DFILT= <>
##$DTYPP= 0
##$F1P= 14.0000005364418
##$F2P= -0.99999901652339
##$FCOR= 0.5
##$FTSIZE= 32768
##$FT_mod= 6
##$GAMMA= 0
##$GB= 0
##$INTBC= 1
##$INTSCL= 1
##$ISEN= 128
##$LB= 0.3
##$LEV0= 0
##$LPBIN= 0
##$MAXI= 10000
##$MC2= 0
##$MEAN= 0
##$ME_mod= 0
##$MI= 0
##$NCOEF= 0
##$NC_proc= -6
##$NLEV= 6
##$NOISF1= 0
##$NOISF2= 0
##$NSP= 0
##$NTH_PI= 0
##$NZP= 0
##$OFFSET= 16.522
##$PC= 1
##$PHC0= 240.4373
##$PHC1= 7.293553
##$PH_mod= 1
##$PKNL= yes
##$PPARMOD= 0
##$PSCAL= 4
##$PSIGN= 0
##$REVERSE= no
##$SF= 250.13
##$SI= 32768
##$SIGF1= 0
##$SIGF2= 0
##$SINO= 400
##$SIOLD= 32768
##$SREGLST= <1H.CDCl3>
##$SSB= 0
##$STSI= 32768
##$STSR= 0
##$SW_p= 5175.98343685301
##$SYMM= 0
##$S_DEV= 0
##$TDeff= 65536
##$TDoff= 0
##$TI= <Analysis number 999999
Compound Code 99
Book Reference 9
Project Code 9>
##$TILT= no
##$TM1= 0
##$TM2= 0
##$TOPLEV= 0
##$USERP1= <user>
##$USERP2= <user>
##$USERP3= <user>
##$USERP4= <user>
##$USERP5= <user>
##$WDW= 1
##$XDIM= 32768
##$YMAX_p= 375232137
##$YMIN_p= -1048425
$$ End of Bruker specific parameters
$$ ---------------------------------
##NTUPLES= NMR SPECTRUM
##VAR_NAME=  FREQUENCY,     SPECTRUM/REAL,   SPECTRUM/IMAG
##SYMBOL=    X,             R,               I
##VAR_TYPE=  INDEPENDENT,   DEPENDENT,       DEPENDENT
##VAR_FORM=  AFFN,          ASDF,            ASDF
##VAR_DIM=   32768,         32768,           32768
##UNITS=     HZ,            ARBITRARY UNITS, ARBITRARY UNITS
##FACTOR=    0.157963299565203, 1,           1
##FIRST=     4132.6476996994, 0,             0
##LAST=      -1043.33573715361, 0,           0
##MIN=       -1043.33573715361, -1048425,    0
##MAX=       4132.6476996994, 375232137,     0
$$ Real data points
##PAGE= N=1
##DATA TABLE= (X++(R..R)), XYDATA
$$ [...]
23587b23976M3785J91634q2018O8740J20573j70730L512m7759l57417l7208Q3313
23576d07551p5550J26841J42131J47312p4197k9885N3396J26531n3362K1988j87622
23565b09968m9293J2788j39968j16181J80564K35480R5005R3937k41867j23801
23555b63304r6357r7937J75723L6123M0994J98182n7037j00521K09916l4306j34527
23544a23051n8724k3913M86806o1797J1225J17208k40351m196J99832r0871L0522
23533B42690J26848k70293k4576j61830j95615L5631J77781n9332l9013J33968
23523c3741k29225o5307Q1130O0463K75787J165j69521R3746N1661M0500j98555
23512i1897j69932K80175o8539P4289K41521m0931j501j87794k81708r9347k65144
$$ plain form
23587 -223976 -180191 11443 -70575 -1835 118738 -51992 -48480 -96239 -453656 -490864 -407551
23576 -407551 -483101 -356260 -214129 -66817 -141014 -170899 -117503 9028 -44334 -22346 -209968
23565 -209968 -259261 -246473 -386441 -502622 -322058 -86578 8427 102364 -139503 -263304
23555 -263304 -359661 -457598 -281875 -245752 -204758 -6576 -63613 -164134 45782 11476 -123051
23544 -123051 -181775 -205688 281118 219321 230546 347754 107403 103207 303039 212168 242690
23533 242690 369538 99245 74669 -87161 -282776 -247145 -69364 -128696 -167709 -33741
23523 -33741 -262966 -328273 -247143 -186680 89107 90272 -79249 14497 66158 106658 -91897
23512 -91897 -261829 18346 -50193 24096 265617 224686 223185 35391 -246317 -345664 -610808
23501f10808K67473J72098k04742N8664J73089K25866J49760o714p5947r854J8953
23490A57838J49300k97337j86901k3440N7789P0337l698J98979J43062J04698
23480C70627m381j84058K7515j01561J5912J98191J08456O2045j10027n2094J59121
23469D89746j13692l9938p7528j48569q4009j70888O307J75707q1341k40035j43497
23458d27737K0845N2161K04185K14261k56902j60650J02954K5608j6720O3719
23448a78276K76148K3699k29849J90057r4164J12402J79483K6595j64540k98790
23438a57235p6956p9752l3460P0419K10576J33506k62688j48613J9879J53112
23428a71212J37547P6117j61798j79670N8090J78788k6526m09688j22822J85089
$$ plain form
23501 -610808 -343335 -171237 -375979 -317315 -144226 81640 231400 224686 148739 138885 157838
23490 157838 307138 9801 -177100 -200540 -142751 -72414 -76112 122867 265929 370627
23480 370627 366246 182188 209703 108142 124054 322245 430701 492746 382719 330625 489746
23469 489746 376054 336116 258588 110019 26010 -144878 -138571 37136 -44205 -284240 -427737
23458 -427737 -406892 -354731 -150546 63715 -193187 -353837 -250883 -225275 -241995 -178276
23448 -178276 97872 121571 -108278 81779 -12385 100017 279500 306095 141555 -157235
23438 -157235 -234191 -313943 -347403 -276984 -66408 67098 -195590 -344203 -324324 -171212
23428 -171212 -33665 42452 -119346 -299016 -240926 -62138 -88664 -498352 -621174 -436085
23418d36085J72350j7578j01237O189J71517J27768R5809L19403R2092o1785k33267
23407A35176k77372j47812J76990L15348j66585j35537J26855Q0551k0948k00548
23397a13882p3142J028l9723J64791J43450K28676L0379k9060j6451p3182Q9675
23386C12559k21478o7198K34974J04240m12187k90068j37579N893J04799J76563
23376a89482J20626m179j3870n1029J60230N9145o249l3499l1681j16607m6985
23365a53580N627k8258m6202K73261K31399l1477j46198j16602n646m904K62055
23354B39475J98383k54282K19789N4320j18662J12012j93364j05845n0463l3686
23344F7677M4446n672j31102k84041k90111J47643N5678J62500R9619O3722k5602
$$ plain form
23418 -436085 -263735 -281313 -382550 -376361 -204844 -77076 18733 338136 430228 368443 135176
23407 135176 -142196 -290008 -113018 202330 35745 -99792 27063 107614 86666 -113882
23397 -113882 -187024 -185996 -225719 -60928 82522 311198 341577 312517 296066 222884 312559
23386 312559 91081 23883 258857 363097 -49090 -339158 -476737 -470844 -366045 -189482
23376 -189482 -68856 -73035 -86905 -137934 22296 81441 75192 41693 10012 -106595 -153580
23365 -153580 -147953 -176211 -222413 50848 282247 250770 104572 -12030 -17676 -22580 239475
23354 239475 437858 183576 403365 457685 339023 451035 257671 151826 101363 67677
23344 67677 112123 106451 -24651 -308692 -598803 -451160 -395482 -232982 -133363 -69641 -95243
23333i5243j28701k90887K01302P2551j3448J28158J739K371j54919j13027J59979
23322b30125L09349J12036j14101j66566p2197L2063k5044K43316k4822J22557
23312A86466J67547P9169K06087k25771O1980p8770l14808j36376K10040L9P164
23301A62767K9020k16229k11241J76830R9502r669m69221l3128J25921K47823
23291i7625l3416p4097p7895j08118j618K14452K51639m5116o4087P4779j99393
23280a60495n8343M03121L21147l17939m24935j03764J89072J88803J58135q2630
23270A12172l04107q9808R4713J7423m6035o7089K06677J80772L4217p7896q911
23259E2128Q2195q1708Q5037j54460r3941L62337k4300o2184j38889k09786o8179
$$ plain form
23333 -95243 -223944 -514831 -313529 -240978 -254426 -126268 -124529 -122158 -277077 -390104 -230125
23322 -230125 79224 191260 77159 -89407 -161604 -129541 -154585 88731 63909 186466
23312 186466 354013 433182 639269 413498 475478 396708 81900 -54476 155564 155603 162767
23301 162767 191787 -24442 -235683 -58853 40649 30980 -438241 -471369 -345448 -97625
23291 -97625 -131041 -205138 -283033 -391151 -392769 -178317 73322 28206 -35881 38898 -160495
23280 -160495 -218838 184283 505430 187491 -237444 -341208 -152136 36667 194802 112172
23270 112172 -191935 -281743 -187030 -169607 -215642 -282731 -76054 104718 138935 61039 52128
23259 52128 134323 52615 137652 -16808 -110749 251588 227288 165104 26215 -183571 -251750
23248b51750j7859J39951K31548o3645L500o1872n3848j48347k4598j04396Q9088
23237b62228L866J61689N3449M257q6375Q9422J6107N9167J80154k8125J53939
23226C45322l1118N2150r5315l13693q8230o802Q0612J08061l3379L2038m0874
23215H772K75259j04043j68411o2622J91906k0049n2254O0880J8281j7784k713
23204A27222O7752K705j28761J35482N6715j16767j21999k53886j55891j01043
23194d88471J64985L07104Q9545K7284j36266j45356j78896R8462L71666Q1487
23184A91544j41450J03592j54149j85490N3144J87584K6240J75425R0500q0572
23174B66368J10118j56862l07179j56284l5940p233o2025K6652l478K05924o6389
$$ plain form
23248 -251750 -269609 -129658 101890 38245 41745 -20127 -73975 -222322 -246920 -351316 -262228
23237 -262228 -258362 -96673 -43224 -38967 -125342 -35920 -19813 39354 219508 191383 345322
23226 345322 314204 366354 271039 -42654 -130884 -137686 -57074 50987 17608 49646 8772
23215 8772 284031 179988 11577 -51045 140861 120812 68558 129438 147719 129935 127222
23204 127222 194974 197679 68918 204400 261115 144348 22349 -231537 -387428 -488471
23194 -488471 -323486 -16382 73163 100447 -35819 -181175 -360071 -261609 110057 191544
23184 191544 50094 153686 -463 -185953 -132809 54775 81015 256440 346940 266368
23174 266368 376486 219624 -87555 -243839 -279779 -287012 -349037 -322385 -325863 -119939 -186328
23163a86328L2905K01785L1218j72273m7211J56153K27111q9750l28254k5098
23153a99742J01402Q694Q5104o1643j2632K60241J10742r280l1141n7774J4803
23142B08774j68273j96959J9341J33064o1861k61236j54588J3271L2810J76331
23132b59326m1931J740O8911K56484L37352m7344r8948k67157k59492J68231K86869
23121A45389p8248o6735K8301J63787m1873m9612m1955k3256J07300L3001o0530
23110A15569l08104k58416M5155q9622p3925j06960Q3287J60356j52726J35172
23100d50214J18802m9860L18978J42680J83583l3374j26509j92104r9459M4009
23090a43468L0180q9177L7188p2439j15665O9113N8002J31205K9870n3688k804
$$ plain form
23163 -186328 -153423 48362 79580 -92693 -139904 16249 243360 153610 -174644 -199742
23153 -199742 -98340 -89646 -4542 -66185 -78817 181424 292166 282886 251745 193971 208774
23142 208774 40501 -156458 -137117 -4053 -65914 -327150 -481738 -468467 -435657 -259326
23132 -259326 -301257 -299517 -230606 25878 363230 315886 216938 -50219 -309711 -141480 145389
23121 145389 67141 406 28707 192494 150621 101009 59054 35798 143098 176099 115569
23110 115569 -192535 -450951 -405796 -495418 -569343 -676303 -593016 -432660 -585386 -450214
23100 -450214 -331412 -381272 -62294 80386 263969 230595 104086 -88018 -187477 -143468
23090 -143468 -113288 -202465 -165277 -237716 -353381 -284268 -226266 -95061 -65191 -118879 -121683
23079a21683L66096J63466l55020j78725k0332j40132j782J42839J31049K832
23069a1392J77101Q4310O8594m16532r5326K2748N4916J78901r7415j98504l4845
23058b67444N6857K45079q0121J45647Q5152K32980L508r3552j51980j10523j43086
23047g7483j60742l806J74231K39867Q9627P8533r3378M5279N192j24399N6259
23036B29180p5134J82131j25143L3809K27354k24885k18066k9990j85339O0922
23026a25161O9926L2086r03n8890k03134n7962O0839r5328J6002j70833l4011
23015e67369Q2084K07574L96540K3705j26552j00601K22283J38578o9625j63504
23005D3113k43097K7051J30876j84569r5360m5394p6117M3815K3983J23756J04359
$$ plain form
23079 -121683 244413 407879 52859 -125866 -146198 -286330 -288112 -145273 -14224 -11392
23069 -11392 165709 250019 318613 -97919 -193245 -170497 -115581 63320 -34095 -232599 -267444
23058 -267444 -210587 34492 -45629 100018 185170 418150 421658 328106 176126 65603 -77483
23047 -77483 -238225 -242031 -67800 172067 261694 340227 246849 292128 297320 172921 229180
23036 229180 154046 336177 211034 244843 472197 247312 29246 -744 -186083 -125161
23026 -125161 -55235 -23149 -24052 -82942 -286076 -344038 -283199 -378527 -362525 -533358 -567369
23015 -567369 -485285 -277711 118829 142534 15982 -84619 137664 276242 206617 43113
23005 43113 -199984 -172933 -42057 -226626 -321986 -367380 -443497 -399682 -375699 -251943 -147584
22994a47584M5269J32877k8709j35158j60023J35427K15625O9233R1046k43795
22984b5792l35508j29464M3172P399P2448L68608M186j87853j10828J39379J76531
22973B2278j66348j38853O7106K8803J09699n7978P9334j6447j12010k24549O6224
22962c42741K35585K02408M5726l14995j69010L87468K70695j16193l23153N0557
22952g3653J68687P9414o5505l50716j72962L4932O9288K12770M18765M4704j61904
22941B03820k3699N578O3519J01033O0956j06164j4168j62519r2828j11607J58925
22930H2846M63253P0591l67479k33269l50380n5711K83438K18938j35959j37020
22920a60752k2371L1112K8913K16004M3080j38954r0666r8884J56300j18225k73973
$$ plain form
22994 -147584 -102315 30562 1853 -133305 -293328 -157901 57724 126957 218003 -25792
22984 -25792 -361300 -490764 -447592 -440193 -367745 863 5049 -182804 -293632 -154253 22278
22973 22278 -144070 -282923 -215817 -187014 -77315 -135293 -55959 -72406 -184416 -408965 -342741
22962 -342741 -107156 95252 140978 -174017 -343027 44441 315136 198943 -124210 -73653
22952 -73653 95034 174448 108943 -241773 -414735 -379803 -310515 -97745 321020 365724 203820
22941 203820 180121 185699 249218 350251 411207 305043 290875 128356 35528 -76079 82846
22930 82846 546099 616690 249211 15942 -334438 -390149 -106711 112227 -23732 -160752
22920 -160752 -183123 -152011 -123098 92906 135986 -2968 -93634 -192518 -36218 -154443 -428416
22909d28416j30248J02569M71993o2159n1230K36741Q5577k15273M1522J05569
22899A56645M5521k14672l77322k1927o0393L2254J18903o3400m2284J38709J83759
22888a04207J5217R3684J40839J35456P4378j48282j49872J81548K50941K6697
22878E16399l66182m03178j8258R6191O4314K27708J75548K7482r357j31800O8902
22867B47769j10461J40157k83207m41113O1562K97779Q0720M7387J07071k1211
22857A26453o4283Q2426R2199j14355k35652j88016j15202K27451O8901J22826
22847B748J93313J9826q2893j09384P489N3955M1606j46233j48140L1652M160
22836a31901K4468P0332K1473M2445k6238j08186q2463J98284j76102K3977J76826
$$ plain form
22909 -428416 -558664 -456095 15898 -46261 -97491 139250 224827 9554 51076 156645
22899 156645 202166 -12506 -389828 -411755 -472148 -439894 -320991 -384391 -426675 -287966 -104207
22888 -104207 -88990 4694 145533 280989 355367 207085 57213 238761 489702 516399
22878 516399 150217 -252961 -271219 -175028 -110714 116994 292542 320024 310667 178867 247769
22867 247769 137308 277465 -5742 -446855 -385293 -87514 -6794 40593 147664 126453
22857 126453 62170 144596 236795 122440 -113212 -301228 -416430 -188979 -120078 2748
22847 2748 196061 215887 132994 23610 31099 85054 126660 -19573 -167713 -136061 -131901
22836 -131901 -107433 -37101 -15628 26817 579 -107607 -190070 8214 -167888 -143911 32915
22825C2915k40349J11903n559n4396J16679J10590M469J02235P8279m8341r5823
22814A12602P7981j04917j98847l40578k9047N978m2529M1518J59341J10384J96276
22803a1838K4107O9171J62285k74186k48736J19029K09874J96151O2974O3115
22793C71946K6701j29746j65929k77228k311J07540q5295j90510j13121J27404
22783c30549K75145J55929m2856P6102J06050k15283M4448j59008j03r7907j60090
22772c48122l462r4204K05093L98937M5980k66567Q670J19443J17367J13392J45223
22761D41750p5759l29727r4152k13958K6139K37448J11908j9424j89727j73295
22751b78797J90402J29729Q0653j50976k52359j11653K16851J17619k73275J06140
$$ plain form
22825 32915 -207434 -95531 -101090 -155486 -38807 71783 76252 178487 256766 208425 112602
22814 112602 190583 85666 -113181 -453759 -482806 -476828 -519357 -477839 -318498 -208114 -11838
22803 -11838 12269 81440 243725 -30461 -279197 -160168 49706 245857 308831 371946
22793 371946 398647 268901 102972 -174256 -176567 -69027 -154322 -344832 -457953 -330549
22783 -330549 -55404 100525 57669 133771 239821 24538 68986 -90022 -90125 -188032 -348122
22772 -348122 -351584 -445788 -240695 158242 204222 -62345 -53675 65768 183135 296527 441750
22761 441750 365991 36264 -57888 -271846 -245707 -8259 103649 84225 -105502 -278797
22751 -278797 -88395 41334 121987 -28989 -281348 -393001 -176150 -58531 -331806 -225666
22741b25666L2760k7554k2602J30756J03008r3019j8371m3845k7676j49317q9630
22730d31156J29009Q9498P427K36494J27602k40111p6369K30290K08462j0204
22720B70942k75096j12091R5312k55210j87562L25109J90626M3996K04463L5500
22710C35989k03379j48052P9961R9023J19981o2207l48023j29106l3544K09205
22700h0152K55036N4978J34758J02119j17401k36193N7548j13264k11801n7790
22690b12162L2775P3943J94696l7218O0139P7854P1461j24976j37971j85968j76308
22679c63735l1881J83050P0425J02688K11571O3952j03248r2025N04k21439k00126
22668c80264k2777J43964j16683j98943J46307K80911J40594P4295J51691j37744
$$ plain form
22741 -225666 -192906 -220460 -243062 -112306 -9298 -102317 -120688 -164533 -192209 -341526 -431156
22730 -431156 -302147 -212649 -205222 31272 158874 -81237 -157606 72684 281146 270942
22720 270942 -4154 -116245 -20933 -276143 -463705 -138596 52030 96026 300489 335989
22710 335989 132610 -15442 64519 163542 283523 221316 -126707 -255813 -289357 -80152
22700 -80152 174884 229862 364620 466739 349338 113145 170693 57429 -154372 -212162
22690 -212162 -179387 -105444 89252 52034 112173 190027 261488 136512 -1459 -187427 -363735
22679 -363735 -395616 -212566 -142141 -39453 172118 236070 132822 40797 41301 -180138 -380264
22668 -380264 -403041 -259077 -375760 -574703 -428396 -147485 -6891 67404 219095 81351
22658H1351r5443j16195Q7682j2301k53912j07172J23191J43533K54631k33081
22648a27716k07554j34851q7537J82337J768L3532o1929J4803J04874O9687j8880
22637b31466K52281K9659j62301M5830P4955j1357q1863j7585J15344R7791K7896
22626A39184j21853J65133l6839j26992l0500N477j5840j34956J73971j8686J67564
22615A65663L87384p1901m30495j3299N019m0479Q9472J29545p2539k02620j05079
22604a59329j40860P5232K4726J24283J30077Q0936L9262k47219j59023J33818
22594i8097J12315J27505J02401L4609j86478j66458r9506J99647P0548j01384
22584d898P558J58990L73026m2089j25875l01000l01385j58194J15723O8917r3489
$$ plain form
22658 81351 -14092 -130287 -42605 -54906 -308818 -415990 -292799 -149266 105365 -127716
22648 -127716 -335270 -470121 -557658 -375321 -373553 -340021 -401950 -387147 -282273 -212586 -231466
22637 -231466 20815 50474 -111827 -65997 8958 -2399 -84262 -101847 13497 111288 139184
22626 139184 17331 182464 145625 18633 -11867 -6390 -22230 -157186 16785 -1901 165663
22615 165663 553047 481146 50651 37352 42371 1892 91364 220909 148370 -54250 -159329
22604 -159329 -300189 -224957 -200231 -75948 54129 135065 174327 -72892 -231915 -98097
22594 -98097 14218 141723 244124 278733 92255 -74203 -173709 25938 96486 -4898
22584 -4898 2660 161650 534676 492587 366712 65712 -235673 -393867 -278144 -209227 -302716
22573c02716j02236j33653L02844j09622o2765o2319R5707K95406K206N9760K58731
22562B41343L34204j08228m03945j95222J04452K22633J020j54004n6668j65665
22552a80080q5827J03724J44292M8507n7986J50194L05979k00705r4806Q9693
22542B22985L6292p1064j29282j8550J27810k40931j83826j10456k3892M03720
22532A2806K32777K13003k04962j78202J26762O0554j92043M0586j52457k42264
22522b83440K35041J99175m8532J20711J1267j23742N9212j583J32220L9211j03054
22511B36486j58844p8754p5376R9802Q9873J78907J28659k24365r9678j29641
22501c2931q1086M9247J84930M6130J49474J84831k2645r8394L9292j67068j15590
$$ plain form
22573 -302716 -404952 -538605 -235761 -345383 -408148 -470467 -374760 -79354 -77148 -17388 241343
22562 241343 575547 467319 63374 -131848 -27396 195237 196257 42253 -14415 -180080
22552 -180080 -265907 -162183 -17891 30616 -27370 122824 428803 228098 133292 222985
22542 222985 259277 188213 58931 40381 168191 -72740 -256566 -367022 -390914 12806
22532 12806 245583 458586 253624 75422 202184 262738 70695 111281 -41176 -283440
22522 -283440 -48399 150776 102244 222955 234222 110480 169692 168109 300329 339540 236486
22511 236486 77642 -1112 -76488 23314 113187 292094 420753 196388 96710 -32931
22501 -32931 -114017 -64770 120160 166290 315764 500595 477950 379556 418848 251780 136190
22490A36190j54176j78730K05194Q9919q907j57993Q2829L1594j28469k64145
22480c46694j17362J12797N8380J05238j99027j77200R9529K18164J33704K26264
22470A13793J58096K06185o7751j64687j11304l44509l89120O0195R2063K28819
22460b18220M92758K7078L4907j1597j8485P6287o027l30208k91571J2833K49188
22449A6943K81782j89426j49378j3407o0356k8188P3469J32317R5720Q4072k31047
22438A2501M6124m990l24734k24413k3957M1480K74843K36877n5264J0443q4759
22427i5849O245J57300l50192r3094K18027M0273J6632J22798m3588k9039M1960
22416h527R1747p0454m0358k28086K6988L19343j00161k02227l3058N6191K0061
$$ plain form
22490 136190 -17986 -196716 8478 98397 89490 -68503 14326 45920 -82549 -346694
22480 -346694 -464056 -351259 -292879 -187641 -386668 -563868 -464339 -246175 -112471 113793
22470 113793 271889 478074 410323 245636 134332 -210177 -599297 -539102 -447039 -218220
22460 -218220 274538 301616 336523 324926 306441 382728 376701 46493 -245078 -232245 16943
22449 16943 298725 109299 -40079 -53486 -113842 -142030 -68561 63756 159476 243548 12501
22438 12501 58625 53635 -271099 -495512 -519469 -477989 -203146 33731 -21533 -11090 -95849
22427 -95849 -89604 67696 -282496 -375590 -157563 -117290 -100658 22140 -21448 -50487 -8527
22416 -8527 83220 12766 -27592 -255678 -228690 90653 -9508 -211735 -244793 -188602 -168541
22405a68541O633r0888J47884O2360m14793l1638J58105K09206K4752K2065j38156
22394b13011k53361N8086O1787j48719P1655n4825Q864J29733K17885R7643J4853
22383i410l59479l19409p8049r8201R7133J76333J53098J58531m0962L33032j12901
22372a00284j80623j538K3036K79253J47456j75597o4878j58721o5494p035J01092
22361b03333J59279l312k08768l6002K37827J73491K35641N7931k28426r2755
22351I1573J56462k63713k62548J51713Q2292j99481O7671K03208l5351l9905
22341d8079j57329P8490R2671J95580J76491k06714o7432j44923L442L12184J89348
22330D23729p9226k70008N4703k18262j28094o8307J23640Q2922l3989j09419
$$ plain form
22405 -168541 -161908 -252796 -104912 -42552 -457345 -488983 -330878 -121672 -96920 -74855 -213011
22394 -213011 -466372 -408286 -346499 -495218 -423563 -478388 -469524 -339791 -121906 -24263 -9410
22383 -9410 -368889 -688298 -766347 -864548 -767415 -591082 -437984 -279453 -320415 12617 -100284
22372 -100284 -280907 -282445 -259409 19844 167300 -8297 -73175 -231896 -297390 -304425 -203333
22361 -203333 -44054 -47366 -256134 -292136 -54309 119182 354823 412754 184328 91573
22351 91573 248035 -15678 -278226 -126513 -44221 -243702 -176031 27177 -8174 -48079
22341 -48079 -205408 -126918 -34247 161333 337824 131110 63678 -81245 -77803 234381 423729
22330 423729 344503 74495 129198 -89064 -217158 -285465 -161825 -78903 -112892 -222311
22320b22311j00153J44760J70154R449J22980N25r8594l3406k26796O2781N9197
22309a11414Q48l0623p2861J08479l6944K6728P9030K1582k97778o1819K36940
22298a37832J51305p3702l1096J70310n5526j65441m3445j13174o1908P4189M8178
22287b38142N0050m8136J13758K24690O0335k8570r9462n579p6170K54198K27259
22276D34231k10700k72934j11859j58643O3108K60055l5971j9393L0484J53525
22266A31903j06543m6834J46791l04943M4308M3948N4990N7954j66890r9341r7924
22255c42581K12109q4368j83195q0662j26664L5170K01746J66741P3675J79475
22245E1446o381k29886j50249M25069K63718k91325L8810L95037j6525j88667
$$ plain form
22320 -222311 -322464 -177704 -7550 1899 124879 125404 26810 -6596 -233392 -170611 -111414
22309 -111414 -110566 -141189 -214050 -105571 -142515 -115787 -36757 -15175 -312953 -374772 -137832
22298 -137832 13473 -60229 -91325 78985 23459 -141982 -185427 -298601 -360509 -286320 -238142
22287 -238142 -188092 -236228 -122470 102220 162555 133985 34523 28944 -47226 206972 434231
22276 434231 223531 -49403 -161262 -319905 -256797 3258 -32713 -52106 -21622 131903
22266 131903 25360 -21474 125317 -179626 -135318 -91370 -36380 21574 -145316 -244657 -342581
22255 -342581 -130472 -214840 -398035 -478697 -605361 -570191 -368445 -201704 -128029 51446
22245 51446 45065 -184821 -335070 89999 353717 62392 101202 496239 479714 291047
22235B91047j67277o2970O7524J41609J61380r8464k61219n7931r6538M9835n1934
22224h4938M3145j11309k56190L6002L29161K1905j24446j15618n6641L4479J4840
22213b69610m2657J7734m233n1316o4826J57354L20211R4545j23015k07086j59762
22202c32661J5809j0447J08770J42317l5219J34856J33122m63151k60526J56217
22192d10913o430J05438P3934K00379J37858j19034L490R8702o0695p7902r4398
22181a49571J2900n3342K19159N6459j86017l49497R4495K165N4196j58949L4066
22170d23936J58756Q5528J9093J66405P0429j82557j20592P6403J51948r658m95
22159h676M1680R8014j37097k06318q5858J31601J37809J8015J62822m1414L4685
$$ plain form
22235 291047 123770 60800 128324 269933 431313 332849 71630 13699 -82839 -33004 -84938
22224 -84938 -41793 -153102 -409292 -373290 -44129 -22224 -146670 -262288 -318929 -284450 -269610
22213 -269610 -312267 -294533 -298766 -350082 -414908 -257554 62657 157202 34187 -172899 -332661
22202 -332661 -316852 -327299 -218529 -76212 -111431 23425 156547 -306604 -567130 -410913
22192 -410913 -417343 -311905 -237971 -37592 100266 -18768 -15278 83424 22729 -55173 -149571
22181 -149571 -136671 -190013 29146 85605 -100412 -449909 -355414 -353249 -299053 -458002 -423936
22170 -423936 -265180 -179652 -160559 5846 76275 -106282 -226874 -150471 1477 -8181 -8676
22159 -8676 33004 131018 -6079 -212397 -298255 -166654 -28845 -10830 151992 110578 145263
22148A45263j99147k06808l003M3835k4454n1758K06365m8507j97652K95222K00185
22137A59541k06276R4503L50873K28566m56163j81442M31322j52804m54643r5473
22127b81996J80322o333J57542K21657J246j39010L5173l41703p5419K71020n5587
22116c3088m3417O9974J69051j625M6524q7647k24227O7558j24485J14684J89074
22105A42376M9278j59338j02109n3025q421j03933n2697l0670K42784j37339M4022
22094a69072Q497J24667J19457o3387l9974O3470j6968j62624J38344J02911J76887
22083B82208j8970M864j36299n7222J20505K5795m7726k23886j48682J09709j22339
22072b12043K1250N345l3202M5584J49274L03044J15559n115j21619j61262o4664
$$ plain form
22148 145263 -53884 -260692 -263695 -219860 -244314 -296072 -89707 -138214 -335866 -40644 159541
22137 159541 -46735 47768 398641 627207 171044 -10398 420924 268120 -186523 -281996
22127 -281996 -101674 -108007 49535 271192 272438 133428 168601 -173102 -248521 22499 -33088
22116 -33088 -76505 -6531 162520 160895 207419 119772 -104455 -36897 -161382 -46698 142376
22105 142376 191654 32316 -69793 -122818 -131239 -235172 -287869 -318539 -75755 -213094 -169072
22094 -169072 -160575 -35908 83549 20162 -19812 43658 26690 -135934 2410 105321 282208
22083 282208 263238 268102 131803 74581 195086 220881 173155 -50731 -199413 -89704 -212043
22072 -212043 -190793 -185448 -218650 -173066 -23792 279252 394811 389696 268077 106815 42151
22061D2151j07797j94501J01874J1759j36182j4876J57491P6401L8110J61148
22051A35578J9075j91521j38443j21569j88225k7279k2829j2449J87501L39555
22041b0606R4177J94478O156o8596k6091k3509r7386k0488q8033J71174K37570
22030C58846l949r0420n3830J51757J3581N6973r5536k52843j06990R9651j79942
22019a02702q4488j17585m0793J80134K11281m475j33659j52619M8081Q6699J05878
22008d248k23318j28780J00077M48246J12920Q952j5168j18150k39838k23623
21998b82930J63143K13189n874j39140J48170P0525q0933j74000l05823k8212
21988d21885K70502K08992l9240N664M153N0566l6256M0428j87085J8446N9959
$$ plain form
22061 42151 -65646 -260147 -158273 -146514 -282696 -297572 -140081 -63680 -25570 135578
22051 135578 154653 -36868 -175311 -296880 -485105 -512384 -535213 -547662 -360161 -20606
22041 -20606 73571 268049 274205 205609 179518 156009 58623 38135 -49898 121276 358846
22030 358846 354897 264477 210647 362404 375985 432958 337422 84579 -22411 77240 -102702
22019 -102702 -187190 -304775 -345568 -165434 45847 41372 -92287 -244906 -196825 -110126 -4248
22008 -4248 -227566 -356346 -256269 191977 304897 313849 298681 180531 -59307 -282930
21998 -282930 -119787 93402 87528 -51612 96558 167083 86150 -87850 -393673 -421885
21988 -421885 -151383 57609 18369 24033 28186 78752 42496 82924 -104161 -85715 -25756
21977b5756K59410K20566k67824k25786j2241O0865j71727R352j2291J81111J08074
21966A23753k66770j1940K62560J58345j93310j95335K3221J58955n2079k34136
21956b26736M3372J09236M860J06854K34569M881j28054n4133j79687q6815M1665
21945a29988J69860L7899K39666K9195R859j45219j55175j34303L9382J24077
21935H5253k53730j90568J00171J63004K16502r3215J04463p4976j40931N2498
21925c1529L03326j97341j92107J10343O5621l5216J3036o0996j16817R6980j61537
21914b06237Q0311K06535K00270K01588j42745j88258Q0442O8262q4376l18967
21904a03175q3457K68979j11092p1014r8818j93143l1296J55198J82074n9929
$$ plain form
21977 -25756 233654 454220 186396 -39390 -51631 9234 -162493 -153141 -165432 15679 123753
21966 123753 -143017 -154957 107603 265948 72638 -122697 -99476 59479 7400 -226736
21956 -226736 -183364 -74128 -69268 37586 272155 277036 148982 94849 -84838 -171653 -129988
21945 -129988 39872 77771 317437 346632 356491 211272 56097 -78206 -38824 85253
21935 85253 -168477 -359045 -258874 -95870 120632 27417 131880 56904 -84027 -31529
21925 -31529 271797 74456 -117651 -7308 58313 23097 36133 -24863 -141680 -44700 -206237
21914 -206237 -125926 80609 280879 482467 339722 151464 231906 300168 215792 -103175
21904 -103175 -186632 82347 -28745 -99759 -198577 -391720 -423016 -267818 -85744 -145673
21894a45673J73490K00178r7639j68852m5701K45779L9547j51596j22003k36075
21884c08545q9396J51445L47189O0996r0892k58139n0272O3418K21561n4564j9820
21873b7019K53904M3847m71745k67830N5007J84747K41393J09347M5720J52360
21863C19731N8123k62395k9319j74896k29188J28838J56709N1739J10455J15880
21853B45677j12533j75998k59137N8228J332J02737L00895K61142j38484l66125
21843h2266j78856J91121J678N0610J43123J83991J01293Q3286k13077k90059
21833i156m8792K68037l6794m8962j408m1283J66135P3102j12787j16505k3138
21822F8449r511M2433k0683K9833J69471K02408j02515j17754J04085k70557j66087
$$ plain form
21894 -145673 27817 227995 130356 -38496 -84197 161582 201129 49533 -72470 -308545
21884 -308545 -397941 -246496 100693 161689 70797 -187342 -237614 -174196 47365 -7199 -27019
21873 -27019 226885 270732 -201013 -468843 -413836 -229089 12304 121651 167371 319731
21863 319731 377854 115459 86140 -88756 -317944 -189106 -32397 19342 129797 245677
21853 245677 133144 -42854 -301991 -243763 -242431 -139694 161201 422343 283859 -82266
21843 -82266 -261122 -70001 -68323 -17713 125410 309401 410694 493980 280903 -9156
21833 -9156 -57948 210089 173295 124333 122925 81642 247777 320879 208092 91587 68449
21822 68449 58938 101371 80688 110521 279992 482400 379885 262131 366216 95659 -70428
21811g0428K81758k3403k1631q5575k18452m3487J1929m5651k3427j04227j30360
21800d72954J19430Q7949P0261J83299Q8400j73112q1315n0213j6566j14919L7816
21789c21924Q327P4947J9821R3836K8679N0675q2975j22956k3657J03668L27180
21778A55621k2749j53969Q1413j11145j25905o317J0996J99263J26357L8694K470
21767A94729Q2947k3950j50767r5433k5898k21750M6273K9986J10987J79096R1418
21756B17638N1440K88156k33293p52141k47013J12800J07311Q1345J87446l3998
21746b20309P253j29783o702J48771L27741O5493j03170j10969n9881J03317j99150
21735a77389k42033q3166L8471R5641K39977P452m0489P3726j82039Q2575J3958
$$ plain form
21811 -70428 211330 187927 166296 80721 -137731 -181218 -169289 -214940 -238367 -342594 -472954
21800 -472954 -353524 -265575 -195314 -12015 76385 -96727 -178042 -228255 -244821 -359740 -321924
21789 -321924 -313597 -238650 -218829 -124993 -96314 -45639 -128614 -251570 -275227 -171559 155621
21778 155621 132872 -21097 60316 -50829 -176734 -183051 -172055 27208 153565 192259 194729
21767 194729 277676 253726 102959 7526 -18372 -240122 -193849 -163863 -52876 126220 217638
21756 217638 269078 557234 323941 -428200 -675213 -562413 -455102 -373757 -186311 -220309
21746 -220309 -213056 -342839 -349541 -200770 126971 192464 89294 -21675 -81556 21761 -177389
21735 -177389 -419422 -502588 -464117 -368476 -128499 -121047 -161536 -87810 -269849 -187274 -173316
21724a73316N4403O9460J14717r6994j89610Q8819J92232j12837j25462K69016
21714I0428J21186J68395O0721l15696r5416J45670q3620K18366Q0116k05148
21704A85002n1677k54907k98797J40341N00459R6227q0162K3643j09843K381Q7532
21693B40199J19645j20119j51486l1659p4087Q1510k1019J38393j66266k3975
21683h864K68473K20390j2625k60431j97735r6144P985l7443L0660k85728M8968
21672c22494K52586J44603j51378j03990j4634L9008P7404M68O4262J2147j38158
21661a40176J05499j22433j11816k5001K07840P8295k79309j78380P2118K04151
21651a89212J61362L8310k9776M1447K7412q7921j84600K2706J68883j31011j54330
$$ plain form
21724 -173316 -118913 -49453 65264 -31730 -221340 -132521 59711 -53126 -178588 90428
21714 90428 211614 380009 440730 125034 29618 175288 91668 310034 390150 185002
21704 185002 133325 -121582 -420379 -280038 220421 316648 236486 260129 150286 152667 240199
21693 240199 359844 239725 88239 56580 -17507 64003 42984 181377 15111 -8864
21683 -8864 259609 479999 467374 206943 9208 -86936 -78951 -116394 -85734 -371462 -322494
21672 -322494 -69908 74695 -76683 -180673 -195307 -156299 -78895 -78427 -14165 -2018 -140176
21661 -140176 -34677 -157110 -268926 -293927 -86087 -7792 -287101 -465481 -393363 -189212
21651 -189212 -27850 10460 -19316 22131 49543 -38378 -222978 -200272 -31389 -162400 -316730
21640c16730o1497J09666L5439j1847q442K99951L17886L7450k57804k89113q6832
21629b31873L2173J82531K0492N8227K60819J8695k07315K1900j32139j61624
21619a38114J49501K49868R6407L3894k93784l04152O6160r5147l3861O970M7201
21608b15057L62120K15586j58481k43954j52408K0162R9681n4135p4998j67940
21598c69424m9725J50260l0452K63656J77467P2883K7704m0731r3665o915K43962
21587C45020K0776p6504o6577j10100O3400J29522M4817o1053k52428k28944J16966
21576g5105Q932K05003K45718j97124k46091j06492J28271L66581O7497p887K72838
21565F62141o2639Q9369j66438l87707m36849n0124K48416J22131k72022j4856
$$ plain form
21640 -316730 -378227 -268561 -233122 -244969 -253411 46540 364426 401876 144072 -145041 -231873
21629 -231873 -199700 -17169 3323 61550 322369 341064 133749 155649 23510 -138114
21619 -138114 11387 261255 357662 391556 97772 -206380 -140220 -235367 -269228 -262258 -215057
21608 -215057 147063 362649 204168 -39786 -192194 -172032 -72351 -126486 -201484 -369424
21598 -369424 -419149 -268889 -299341 -35685 141782 214665 242369 201638 107973 101058 345020
21587 345020 365796 289292 222715 112615 176015 305537 350354 289301 36873 -192071 -75105
21576 -75105 -66173 138830 384548 187424 -58667 -165159 -36888 329693 397190 389303 662141
21565 662141 599502 688871 522433 134726 -302123 -352247 -103831 18300 -253722 -268578
21555b68578L02689o3335j30321P2667j79110j11761k4226J82046L82724P9385
21545B42180k05241r3963Q263M1411j15227j13946J60116J11396J11940j82513
21535c5584j27103R2189K20468j90927J6219K02248J22185j24401m8563k87417
21525a60686k30819J43845K7978l2959J42133o1466J28066M8673Q0033K24013
21515C08811J97592l841k16504l8655p455l55575l01856P6045J30316q7116Q1058
21504b17180n386J48792r3189k25623L6157K15759K24937L04859L618k11607j48186
21493C2951L09419K21099j84417k84021k1435p4675k10149r3493J64752J49646
21483I677j4584j06922m9498k5176M6581o55Q1299k674J16379m5026j52097J99468
$$ plain form
21555 -268578 34111 -29224 -159545 -86878 -265988 -377749 -401975 -219929 162795 242180
21545 242180 36939 -57024 -48761 -7350 -122577 -236523 -76407 34989 146929 -35584
21535 -35584 -162687 -70498 149970 -40957 -24738 177510 299695 175294 126731 -160686
21525 -160686 -391505 -247660 -219682 -252641 -110508 -171974 -43908 4765 84798 308811
21515 308811 506403 502562 286058 247403 239948 -115627 -417483 -341438 -211122 -298238 -217180
21504 -217180 -222566 -73774 -166963 -392586 -356429 -140670 84267 389126 392744 181137 32951
21493 32951 342370 563469 379052 95031 73596 -1079 -211228 -304721 -139969 9677
21483 9677 -4907 -111829 -161327 -186503 -139922 -140577 -59278 -61952 54427 9401 -142696 56772
21471E6772K10336J62825P4019l21935j4108j82221k38060N9434n719j9526q3820
21460c02003N8458r3680j86315K28483L28197m641j22116j89046j28563J92844
21450b18382o432J39381j787J28690K5651n7775J54l42611j97336J26641R7753
21439c06053J30186J47084Q0965k10507J31558l2524j56806N1647J20491J02038
21429E8079j32981j5773K7978q7366o9211K10325J86086J00295k87506k26740
21419b36814J06450J11682N5291J20665j24221k34720J5045J31486o2561r3005
21409b10702J35397N4008J8090n3832k96869J13723J1422J00036K20946Q3380
21399A75599O9693l5789q1593j13191k8726K00629j39659k60918m4933L05463
$$ plain form
21471 56772 267108 429933 503952 182017 167909 -14312 -252372 -192938 -198657 -218183 -302003
21460 -302003 -243545 -337225 -523540 -295057 33140 28499 -93617 -282663 -411226 -218382
21450 -218382 -224814 -85433 -87220 41470 67121 9346 9500 -333111 -530447 -403806 -306053
21439 -306053 -175867 -28783 52182 -158325 -26767 -59291 -216097 -164450 -43959 58079
21429 58079 -74902 -90675 -62697 -150063 -219274 -8949 177137 277432 -10074 -236814
21419 -236814 -130364 -18682 36609 157274 33053 -201667 -186622 -55136 -117697 -210702
21409 -210702 -75305 -21297 -3207 -57039 -353908 -240185 -228763 -128727 92219 175599
21399 175599 245292 209503 127910 14719 -14007 186622 46963 -213955 -258888 46575
21389D6575m1522l8099J0596m2387j52010R6403m034M48278Q1324k8326k1365
21378C55433j72774k15389j40533p3514j78282J12560K33558k139r3207j59892
21368c34179j13443p8282l0580K02141K35454k60938o0186O750J51726o6434J04806
21357b43165j7432K36836K61361o1315r6812j11405k00630k69672O7531R5550
21347c39153K86386N134N2448J05389j78632Q373J34501R8311p2952n4006J16303
21336A62102l3393K7948L7403j06431j82469p3105O7577L5970K27988n1504J497
21325A13583n8907q4808J8151O3931K50842K71498k35262r6585j75281j2288j90887
21314a36013l63714k16792K52087K48601K7116K05745J88233n0534K10366p5525
$$ plain form
21389 46575 5053 -33046 -22450 -64837 -216847 -120444 -124478 323800 405124 376798 355433
21378 355433 182659 -32730 -173263 -246777 -425059 -312499 -78941 -81080 -174287 -334179
21368 -334179 -447622 -525904 -556484 -354343 -118889 -379827 -440013 -433263 -281537 -347971 -243165
21357 -243165 -260597 -23761 237600 176285 79473 -31932 -232562 -502234 -434703 -339153
21347 -339153 -52767 -47633 4815 110204 -68428 -60055 74446 172757 99805 45799 162102
21336 162102 128709 156657 194060 87629 -94840 -167945 -100368 -64398 163590 112086 113583
21325 113583 54676 -30132 -11981 51950 302792 574290 339028 242443 67162 54874 -136013
21314 -136013 -499727 -716519 -464432 -215831 -188715 17030 205263 154729 365095 289570
21304B89570j36867J00701o86j84693M7229k35604j66059J74333K26628k89o5424
21293D8839m5661m1568p5961J4674J20733r0730k5033k5112K11742M03885J95632
21282F91440k14083j83522L5415k09540j74615J25645k7478l29292j52241J53756
21272b84515J03697R2763K8674q7036j32204j51462Q8201K43640Q3610L8107k59805
21261b36330m5753K30820J17063J11402q4979O9913J13889k4209q410O0047l991
21250B99462Q2322j78385j2458j9786Q9946J20297J78369J00440j52517J1070
21240E18760m7997j14878o5307k27780j68058J56470j18975P742J21727K02205
21230B63909N496O5962j98987p5604J224O5930q1900l5969j19305l7874J03288
$$ plain form
21304 289570 152703 253404 252718 68025 115254 -120350 -286409 -112076 114552 114263 48839
21293 48839 3178 -38390 -114351 -99677 21056 -69674 -94707 -119819 91923 495808 691440
21282 691440 477357 293835 329250 119710 -54905 70740 43262 -286030 -438271 -284515
21272 -284515 -180818 -88055 -59381 -146417 -278621 -430083 -341882 -98242 -14632 23475 -236330
21261 -236330 -282083 -51263 65800 177202 92223 162136 276025 251816 243406 303453 299462
21250 299462 381784 203399 190941 171155 261101 381398 559767 660207 507690 518760
21240 518760 470763 355885 290578 62798 -105260 51210 -67765 -60023 61704 263909
21230 263909 269405 335367 136380 60776 62000 127930 46030 10061 -109244 -147118 -43830
21219d3830o6000O6210J93497J7250J8889j00287o9335m1547o1151j72606j24651
21208c83561Q4536K79191J39731J37030j75041j28298P1125J14372j18772j31360
21198a11047j78041k8483K34213K10110m7479j82467j8674J30978L24907J41987
21188D76004M9250N4726m7322k16789l51459j58065K1693J81936K82482M4848
21178C37304k32089k0798P2108k24084J36851j46652J38026M3499q4723j6934
21168B508J29820P1071j33063k9294R1914q4074O5360j74770j56816l5132J07060
21157a45416J74860J70193r3184K6402k00575l7446J61748j41089k83366m09907
21147g77780K02377L88922j53977J2272p719J42385O9983n405J07299p6279K31094
$$ plain form
21219 -43830 -109830 -43620 149877 167127 186016 85729 16394 -25153 -86304 -258910 -383561
21208 -383561 -299025 -19834 119897 256927 81886 -46412 24713 139085 20313 -111047
21198 -111047 -289088 -317571 -83358 126752 79273 -103194 -121868 9110 334017 476004
21188 476004 525254 579980 532658 315869 -35590 -193655 -171962 9974 292456 337304
21178 337304 105215 84417 156525 -67559 69292 -77360 60666 104165 19442 2508
21168 2508 132328 203399 70336 41042 132956 48882 114242 -60528 -217344 -252476 -145416
21157 -145416 29444 199637 106453 132855 -67720 -105166 56582 -84507 -367873 -777780
21147 -777780 -575403 -186481 -340458 -328186 -335905 -193520 -123537 -128942 -21643 -97922 133172
21136A33172Q5405k3369r9880M4861Q4164r1860k05091j9518o227p0855J46845
21125b2353j03067J70233O1279K4386q979l02213N1378R1547j64740j05457O5406
21114b42580q6890j96110J7385M2393J13839j546O2988R1090K22478j75786R1050
21103f1689K06803J35511k30775L9125K51702n9247L7198N1291J72528Q7639j3752
21092F16334j42519k02284L1257k8761k26712j21748j3430r4361J59971J22888
21082A00635o294J04063O3224j35801k34797j95131J45150o7251K38098l2501
21072b0605J23327Q9537R09m5233p0331l8240K1261j24414k62575O8033J31564
21061a26767J80935J09417m1277k74058J1987J69346r774K10037N6309k11138
$$ plain form
21136 133172 218577 195208 95328 140189 224353 132493 -72598 -92116 -98343 -169198 -22353
21125 -22353 -125420 44813 106092 130478 121499 -180714 -129336 -37789 -202529 -307986 -242580
21114 -242580 -329470 -525580 -508195 -465802 -351963 -353509 -290521 -199431 23047 -152739 -61689
21103 -61689 145114 280625 49850 88975 340677 281430 318628 369919 542447 630086 616334
21092 616334 473815 271531 302788 274027 47315 -74433 -87863 -182224 -22253 100635
21082 100635 94341 198404 261628 125827 -108970 -304101 -158951 -226202 11896 -20605
21072 -20605 102722 192259 193168 147935 77604 39364 60625 -63789 -326364 -258331 -126767
21061 -126767 54168 163585 122308 -151750 -139763 29583 19809 229846 286155 75017
21051G5017j17853O5731L8975j29459o1344K14928J76971j32672j76781j63405
21041b09892k7560J46487K132o9129L0872p0203o5834J59563j61041J3822Q2841
21030a67942j42185R2807J28830N6864r4762O0144K27131K18800j62563j84990
21020C2134j81805R5591J48111O1044M8577K7847q8263l00173K2052L0613j02538
21009b06810O9097n2406j96822P540J95885l0885k24401O3328k718O4468K35674
20998g8050r2045j1687J94612J42463j14344j44993N8438j09846o7231Q6423J37525
20987A265N9111k34926p1564R8804R136m8083L62809N3350k55821j64657P6893
20976a13683K10131j18571o6405o3090J73061q0473p0510j1895P402J86185J54648
$$ plain form
21051 75017 -42836 22895 61870 -67589 -128933 85995 262966 130294 -46487 -209892
21041 -209892 -237452 -90965 -88833 -157962 -127090 -197293 -263127 -103564 -264605 -250783 -167942
21030 -167942 -310127 -217320 -88490 -31626 -126388 -66244 160887 379687 217124 32134
21020 32134 -149671 -54080 94031 155075 203652 231499 143236 -156937 -134885 -104272 -206810
21009 -206810 -137713 -190119 -386941 -379401 -183516 -214401 -438802 -375474 -378192 -313724 -78050
20998 -78050 -170095 -181782 12830 155293 40949 -104044 -45606 -155452 -222683 -136260 1265
20987 1265 60376 -174550 -246114 -147310 -138174 -186257 176552 229902 -25919 -190576 -113683
20976 -113683 96448 -22123 -88528 -151618 21443 -59030 -129540 -141435 -134033 52152 206800
20965B06800j74826j31549K41l1450m0846j37521k26929O1725P3539j15127J73471
20954c42472J40544j02459J56595J83724R842k03723j35970J00495J42460k9546
20944h0510k45783L0594l9953J4803J83708J47242L3043R1835l2404Q5515j55350
20933C2740j36225j04546r6882J20355m5869j42749Q5970L2672J06727j1525K39085
20922G9753k0911J32213K13488Q4356j8868j73719l09677J85772o9453j01973
20912I81R4941P0572o7783N6506j88469l8086K70414R564l7347l164k04373k58595
20900b94839J88716q1551n1990J44361J6326M26362J61387r747j5591j08524j20429
20889B54481J4933K91508M4627n4100J1344k5338J20549O5080k72845k71599K1659
$$ plain form
20965 206800 31974 -99575 -99334 -130784 -171630 -309151 -536080 -474355 -400816 -515943 -342472
20954 -342472 -201928 -304387 -147792 35932 45774 -157949 -293919 -193424 -50964 -80510
20944 -80510 -326293 -295699 -335652 -320849 -137141 10101 43144 134979 102575 188090 32740
20933 32740 -103485 -208031 -304913 -184558 -230427 -373176 -287206 -254534 -147807 -159332 79753
20922 79753 58842 191055 404543 488899 470031 296312 -13365 172407 102954 981
20912 981 95922 166494 98711 155217 -33252 -71338 199076 208640 171293 168129 -36244 -294839
20900 -294839 -106123 -187674 -239664 -95303 -78977 347385 508772 499025 483434 374910 254481
20889 254481 269414 560922 605549 551449 562793 537455 658004 723084 450239 178640 200299
20878B00299K4720J45255k26832j68051k57792J07867L63475j46946K4641O7606
20868A34242k1398j07977j60237K7347L0442N972o2134j15463M6018L3022k06920
20857c97086l2844L34595J89573J15889q2166k73686k97243K07575J70891J95742
20847A31240M5464k1844j28771j00349J9548L0137M8088O28P0668R2279O7852
20836B54940J6937j08585j66219j16704r4359j84493m724R9686K8420q5729O8007
20825b92823P1001J68765r2643j64069m032J84070J15775K34648J2510r2026j38112
20814C064j45745J28041Q5711n7873j06365P7192J45224J21895k47421O0207K56296
20803C20226q3438k81641p1013n3953R2323M4004K8046Q8169j77055k67976m208
$$ plain form
20878 200299 225019 370274 143442 -24609 -282401 -174534 188941 41995 66636 134242
20868 134242 112844 4867 -155370 -128023 -97581 -91609 -153743 -269206 -223188 -190166 -397086
20857 -397086 -429930 -95335 94238 210127 127961 -145725 -442968 -235393 -64502 131240
20847 131240 176704 154860 26089 -74260 -54712 -24575 23513 24141 94809 187088 254940
20836 254940 271877 163292 -2927 -119631 -213990 -398483 -403207 -303521 -275101 -360830 -292823
20825 -292823 -221822 -53057 -145700 -309769 -313801 -129731 -13956 220692 233202 141176 3064
20814 3064 -142681 -14640 71071 13198 -93167 -15975 129249 251144 3723 63930 320226
20803 320226 236788 -44853 -115866 -169819 -77496 -33492 -5446 82723 -94332 -362308 -366516
20792c66516L70579K26636n2057p6644k93655j56836K7074R8683N5500j449K63311
20781I4626J25033j2204J8107j5196L2826k35569j8998P3992j78205o8088J24540
20770e9136K54780J29069j29401l5355l2394Q1343j18031j00735k38951K21986
20760b6825K89520J52487q0448k10667k17962j05553O799o4027j55826J6343N4707
20749c41452j10555L03163K57939J83271k467m3688j79431j00552K190J04585
20739G3003J03509O3562k91395j88929M3201P1297j86551M0040Q9312K22418J28630
20728A68097l554j43364j50574N6409K4532J8315l2226o438j57128P8833N677
20717a41421R1433N7960j54540o8276k6939K55076K49579q0081n4289P8728j27178
$$ plain form
20792 -366516 4063 230699 178642 101998 -191657 -348493 -321419 -222736 -167236 -168685 94626
20781 94626 219659 207455 225562 210366 243192 7623 -11375 62617 -115588 -183676 -59136
20770 -59136 195644 324713 195312 159957 127563 208906 90875 -9860 -248811 -26825
20760 -26825 262695 415182 334734 124067 -93895 -199448 -192649 -256676 -412502 -396159 -341452
20749 -341452 -452007 -148844 109095 292366 289899 246211 66780 -33772 -31582 73003
20739 73003 176512 240074 -51321 -240250 -197049 -125752 -312303 -272263 -182951 39467 168097
20728 168097 164543 21179 -129395 -72986 -48454 -30139 -62365 -68803 -225931 -147098 -141421
20717 -141421 -49988 7972 -146568 -214844 -241783 13293 262872 182791 128502 207230 80052
20706H0052q1552J09267O5870M5734j7665k7709j72214n7908J38060m2284L2557
20695G2208k42552k8473O9309j2091l2058j53962J12937K79147J48381p3404k22935
20684h3493j80112k9254L0009K10245m4577R4846R387j08607K05411M0272p4464
20673F9663j89162n9876m5753r4396o4527J90073K31651j64908l5590Q9457P9139
20662E771l14626k42595n6115J54291J9417J04566J69119J37662L64529K28226
20652E70245k47657k05563k56918k14913J84253j261N0437O0367K85759J86809
20642D11558R5527j80129n4656P5318q0776J82782j26885k12270k56442j50686
20632b96659K20809M059k07809j53542J34308O5405J29091Q2643L9203J00898
$$ plain form
20706 80052 -1500 107767 173637 219371 201706 173997 1783 -56125 81935 39651 72208
20695 72208 -170344 -198817 -129508 -141599 -173657 -327619 -214682 64465 212846 139442 -83493
20684 -83493 -263605 -292859 -262850 -52605 -97182 -2336 7051 -101556 103855 144127 69663
20673 69663 -119499 -179375 -225128 -319524 -384051 -193978 37673 -127235 -162825 -73368 5771
20662 5771 -308855 -551450 -607565 -453274 -433857 -329291 -160172 -22510 342019 570245
20652 570245 322588 117025 -139893 -354806 -170553 -171814 -121377 -61010 224749 411558
20642 411558 507085 326956 272300 347618 266842 449624 322739 110469 -145973 -296659
20632 -296659 -75850 -71791 -279600 -433142 -298834 -233429 -104338 -21695 17508 118406
20622A18406K09772Q726j45230j04845j38729j45438J67912O9381n6484j67193
20612a83722n0750K9007j8473N8015K15516j25612k89055k47130l8228K67912
20602c82520J53581j40470J55096M1664k32876L3200Q2894P8860M7862q9383J5262
20591b36830p1567J03373J3148L8940l1659K30448n9754p0538K2512L7078K04643
20580A79794L7752L5326j40826p3251N3027K4610M1285j29M0012j78746l78795
20569c59941J34404L3064J18923K48673j29845N5693l12556r9741L9859J7469
20559b53998j9208K8807N1525J37477k7165K13594l3503j19794j41897N1590k3922
20548a36494k35450J20470K03312j00057k3002j04004L5337J2250o7405p8569
$$ plain form
20622 118406 328178 336904 191674 86829 -51900 -197338 -29426 39955 -16529 -183722
20612 -183722 -234472 -205465 -223938 -165923 49593 -76019 -365074 -612204 -650432 -382520
20602 -382520 -228939 -369409 -214313 -172649 -405525 -372325 -289431 -210571 -162709 -252092 -236830
20591 -236830 -308397 -205024 -191876 -152936 -184595 45853 -13901 -84439 -61927 -24849 179794
20580 179794 217546 252872 112046 38795 91822 116432 157717 157588 197600 18854 -359941
20569 -359941 -225537 -192473 -73550 175123 45278 100971 -211585 -311326 -271467 -253998
20559 -253998 -273206 -244399 -192874 -55397 -82562 131032 97529 -22265 -164162 -112572 -136494
20548 -136494 -371944 -251474 -48162 -148219 -171221 -275225 -239888 -227638 -295043 -373612
20538c73612K12753J62865k00858j12665M2760J60448Q9619N3590k09029J72316
20528a813J78321J32027O4422L0871J75159J96229j38319k05526j23260j30631
20518A77480p8575j16140n866J39172L8676l23974o0890L89473K6738k66185J25484
20507D5393O4157k48122l12956N2114J98453N1172j63661J05499K39269K45398
20497B76716j33426k10594j76071j10799j01762K17537J52637J82183j14751o1389
20487g9719o4043j42418J26664J84438j26135K48666M8828k8018r3342k6120p2919
20476b4118l30248l9248J85202L0891J10456j02490m4048N4521P2891J6816N138
20465f4237k18193j86853Q168j8452R8404J84146P1700N3551j1410J9149L0060
$$ plain form
20538 -373612 -160859 2006 -198852 -311517 -268757 -108309 -18690 34900 -174129 -1813
20528 -1813 176508 308535 372957 403828 578987 775216 636897 431371 308111 177480
20518 177480 98905 -17235 -23101 116071 154747 -169227 -230117 159356 186094 -80091 45393
20507 45393 109550 -138572 -451528 -399414 -200961 -149789 -313450 -207951 31318 276716
20497 276716 143290 -67304 -243375 -354174 -455936 -238399 -85762 96421 -18330 -79719
20487 -79719 -143762 -286180 -159516 24922 -101213 147453 196281 168263 74921 48801 -24118
20476 -24118 -354366 -393614 -208412 -177521 -67065 -169555 -213603 -159082 -86191 -69375 -64237
20465 -64237 -282430 -469283 -461115 -479567 -381163 -197017 -125317 -71766 -83176 -64027 -33967
20454c3967q9146j51063k92080k9642L45219K20792J0116J42666p4350r0636k0700
20443f2791K49677q0521j14190M4342L13618M8037q6605J46380j09926j87878
20433A60143p7735j41243j05799j34461K24539L03661p1621j41024N0147Q5205
20423A51812K49706j85095k02616J70145j8587j2002q6097m067L4580j00394J04144
20412A01529j69670R0100L22399K025p1802q7467P3945L3448J9330m521l7674
20401B71642k27448M5863J49995J33040n7832l3661K9602J10144j11134j19282
20391A90929j04374j03038J53702o3940l255j12878J54555K26805k88259k08906
20381a58659K33071K88760J31623j00465n0990o4014L05777j49901r6262k19081
$$ plain form
20454 -33967 -123113 -274176 -566256 -595898 -250679 -29887 -19771 122895 48545 -42091 -62791
20443 -62791 186886 106365 -7825 36517 350135 398172 311567 457947 348021 160143
20433 160143 82408 -58835 -164634 -299095 -74556 229105 157484 16460 66607 151812
20423 151812 401518 216423 13807 183952 165365 153363 67266 63199 97779 -2615 101529
20412 101529 -68141 21959 344358 346383 274581 187114 261059 294507 313837 309316 271642
20401 271642 44194 90057 240052 373092 315260 281599 311201 421345 310211 190929
20391 190929 86555 -16483 137219 73279 70024 -42854 111701 338506 50247 -158659
20381 -158659 74412 363172 494795 394330 343340 279326 585103 435202 338940 119859
20371A19859m4063k39027k95623M807L2749O6012K79674M15523k64801o3286p8980
20360f7156L01880K03847j65790l21671j2460L1536L39521J52496m03456k64087
20350b05340m2162K07748J62502O0942o2465k17366k06336Q3907K5986R4907K4
20339i7653J2898j66017K04148J0732k6591P0169Q2191j09586O5033J70028j03547
20328A11805j99476j5559p563P25O2116J76518l2917l0379j48705n18j42524R8573
20316a27904K5668L4044k7351o1715P7801M41227J49761q6054J2788J21899j74233
20305C85931k11462j64037J09837L52428j01489l18900k47601o7366J2693J94994
20295e4972J28985q900J3821M8426j39027o5123L65085K44055l28480M9265L7434
$$ plain form
20371 119859 75796 -163231 -458854 -454047 -421298 -355286 -75612 339911 75110 11824 -67156
20360 -67156 234724 438571 272781 -48890 -61350 -29814 309707 462203 58747 -205340
20350 -205340 -247502 -39754 122748 183690 121225 -96141 -302477 -218570 -192584 -97677 -97653
20339 -97653 -84755 -250772 -46624 -35892 -62483 7686 89877 -19709 45324 215352 111805
20328 111805 -87671 -103230 -110793 -110068 -47952 128566 95649 65270 -83435 -83953 -226477 -127904
20316 -127904 -102236 -68192 -95543 -157258 -79457 361770 511531 425477 438265 560164 385931
20305 385931 174469 10432 120269 472697 371208 52308 -195293 -262659 -249966 -54972
20295 -54972 74013 65113 78934 127360 -11667 -76790 288295 532350 203870 253135 290569
20284B90569j52832j69527q7178R5068l14925k4318J90579M4138J48283Q4240
20274A04097Q3437P320m8215j50002K45320J33982l9688n5156q6814n6467j08620
20263B9194k24144j908k4666j89311j39037Q7061L4085J50905M0860n6241R0659
20252b02543R4450L9611J96799j60472k27018K7827M6649K02482K8234M1340k641
20241H4718n0831J72077m821j15497j52678K58001N3847j37161j447k01261J28401
20230C3348o7423J02342J65249l1851r8338J29656K4611l1933K4610k0085r2655
20219A37531k13543p4288l82040r0173L63763J81145m5954j06114n8589o9065
20209c57327L54397j0380J6008J44912m9089l92521J36452K44490n0886l26113
$$ plain form
20284 290569 137737 -31790 -118968 -23900 -338825 -363143 -172564 -128426 19857 104097
20274 104097 187534 194854 146639 -3363 241957 375939 336251 281095 194281 137814 29194
20263 29194 -194950 -196858 -221524 -410835 -549872 -462811 -428726 -277821 -236961 -293202 -202543
20252 -202543 -108093 -68482 128317 -32155 -259173 -231346 -184697 17785 46019 87359 84718
20241 84718 33887 205964 201143 85646 -67032 190969 244816 107655 106208 -95053 33348
20230 33348 -34075 68267 233516 201665 103327 232983 257594 225661 250271 230186 137531
20219 137531 -76012 -150300 -532340 -622513 -258750 -77605 -123559 -229673 -288262 -357327
20209 -357327 -2930 -13310 2698 147610 98521 -294000 -157548 86942 36056 -290057
20199b90057j50338Q1113q1743M5902M8549L12882p1485j8823j36312k3834J82872
20188a01274M20455J11816k03080j83790j41034n1134J08642N4097O7917k2885
20178E9730j32162M3959j01088j58282R3421K59799k8367K29169R582q4483j38369
20167E2909r9440Q7855k93913J33509K67985J09211j1679p664l9602j12722J42876
20156B29325k08475j04715p5888M8996l3064l6009k908K62182n6781J20661J21585
20145B64909k16652K18392J26398k92177O7450Q838j93634j8935J91784J85182
20135C41555j04454k34227j0141J6270J14830n3885L4106j27996k22630K60619
20125A4047L96309L9623j62340j84648Q0211J18100j88366J0262n6969k24260
$$ plain form
20199 -290057 -440395 -359282 -441025 -395123 -346574 -33692 -105177 -124000 -260312 -284146 -101274
20188 -101274 319181 430997 227917 44127 -96907 -148041 -39399 14698 82615 59730
20178 59730 -72432 -28473 -129561 -287843 -194422 65377 37010 266179 275761 191278 52909
20167 52909 -46531 41324 -252589 -119080 148905 258116 246437 238773 199171 86449 229325
20156 229325 20850 -83865 -159753 -110757 -143821 -179830 -182738 79444 22663 143324 264909
20145 264909 48257 266649 393047 100870 168320 177158 -16476 -35411 156373 341555
20135 341555 237101 2874 -7267 9003 123833 69948 104054 -23942 -246572 14047
20125 14047 410356 449979 287639 102991 183202 301302 112936 123198 66229 -158031
20115a58031j62711L57350Q6978K05428j3394k98485L0463m734j31009j90675
20105b78820K07132O4167L10132K42503l395k399j72369n0203j13881n8237J00143
20094B44773j33808m0371J68722M7469k093m2883j54381k0175p1170K14853J01775
20083C12711K5747J858J4090j34207o6926p9916r6089P9124J06070l9134O7403
20072A90731j7673O9874j07797j12227K82502J96542k10307j67075K21873J6453
20062C62896l05880O5413M3811N9092K08566J29875j6086j81160l49773R4755
20052A11509K04805j5377j65143l18523j06907R8140l1460P5249J12964R9075
20042F4332K13011j06477P7123j25924j16003m8695m4730N3713M13236K76570
$$ plain form
20115 -158031 -320742 36608 123586 329014 315620 17135 47598 42864 -88145 -278820
20105 -278820 -71688 -7521 302611 545114 541719 539320 366951 316748 202867 144630 244773
20094 244773 110965 70594 239316 286785 284692 241809 87428 67253 -3917 210936 312711
20083 312711 338458 340316 354406 220199 153273 73357 -22732 56392 162462 123328 190731
20072 190731 173058 242932 135135 22908 305410 501952 291645 124570 346443 362896
20062 362896 57016 122429 166240 225332 433898 563773 547687 366527 16754 111509
20052 111509 316314 300937 135794 -182729 -289636 -191496 -222956 -147707 -34743 64332
20042 64332 277343 170866 247989 122065 6062 -42633 -87363 -33650 379586 656156
20032F56156j59303q5523J9306l9834j51595k62685J41267J21878k12441l6658
20022i432l6410Q2669J22156k6576j66003K365J97830j45962p5832o8305L5427
20011h8073J37956J28614J38504R6067K5007k25836q6753K3369l36311k15824
20001d03280J29367J78826J24754K4480q6925j66194l7307J64198K35413K25260
19991C88592j01057k2566J07498m18776l28610p3431o7045K03199o9654K71593
19981a10257J85223J36246K76507P908j25139m2586q5333n2356p697l92691o6002
19970b76177J17151K42495J927J12741Q1370j70066j81157J37433J29795j83591
19960A1921j34405L2613M3609J03538O9876j02408n0983m0292J68759K11301J40134
$$ plain form
20032 656156 496853 411330 430636 390802 239207 -23478 117789 239667 27226 -9432
20022 -9432 -45842 36827 158983 132407 -33596 -31231 166599 20637 -55195 -123500 -88073
20011 -88073 49883 178497 317001 413068 438075 212239 125486 148855 -187456 -403280
20001 -403280 -273913 -95087 29667 54147 -32778 -198972 -236279 -72081 163332 388592
19991 388592 287535 264969 372467 -46309 -374919 -448350 -515395 -312196 -381850 -110257
19981 -110257 74966 211212 487719 495627 370488 327902 242569 190213 182516 -210175 -276177
19970 -276177 -159026 83469 85396 198137 279507 109441 -71716 65717 195512 11921
19960 11921 -122484 -89871 -46262 57276 127152 24744 -26239 -66531 102228 313529 453663
19949D53663j69109m6810N7095K3413l1492j07947j56816j16506p1594N916J20419
19938c9768k9301j50518r8470O0079N1557j37245L9477L4851O8152j451o751J94089
19926a5299m3090j67041J94513L35462j14948M7172N4964r570L6195J760j18198
19915B01920j63585R0140J24996p8906l33761j15910O2368J04663J15034J08047
19905A15006M9077n9242l60684j8062L7465K46417J33061j30610M7616j43162
19895h3118K31013J75494k34964k82713K02011J65782K20425j48054N3780O2764
19885C62420j38339k58738l1907K56730J98321N3018k30574q7482K38526J69393
19875E31368l28718r4416P7654J22008k4966q7055j26134j88915r4215J04973
$$ plain form
19949 453663 284554 237744 294839 318252 286760 178813 21997 -94509 -166103 -160187 -39768
19938 -39768 -69069 -219587 -318057 -257978 -206421 -343666 -304189 -269338 -201186 -202637 -209388 -15299
19926 -15299 -58389 -225430 -30917 304545 189597 236769 291733 282163 318358 320118 201920
19915 201920 38335 128475 253471 174565 -159196 -275106 -212738 -108075 6959 115006
19905 115006 164083 104841 -255843 -273905 -236440 9977 143038 12428 60044 -83118
19895 -83118 147895 323389 88425 -194288 7723 173505 393930 245876 299656 362420
19885 362420 224081 -34657 -66564 190166 388487 441505 210931 123449 361975 531368
19875 531368 202650 108234 185888 307896 282930 195875 69741 -119174 -213389 -108416
19865a08416K73169J03000l4360K74315j04054l47652j22201R8856L84918N7937
19855D75512j20908R2003r2712K2193l7333j42708J5919j05404j00077J14867
19845A21352k7585J03195p3086j88809q131k18414r2080M5256J89785o8985j04341
19834c21843j76875K9777K62134K61869J89378O1910L01363J0397k2427P6642
19824F72325k74439l01299j74332J69099r366q6202J11874L2205m3969J28272
19814B24168j47015k42826n4766L05384M2598J03521J98741n3465j511q233K2852
19803C89448L8089K30559j24575j35470o3498K28512j39718j73599R305Q5363
19793C44416L6057q4151j11385k32769j57832J89625j0718L0531j33955j24150
$$ plain form
19865 -108416 164753 267753 233393 507708 403654 56002 -66199 32657 417575 475512
19855 475512 354604 446607 353895 376088 338755 196047 211966 106562 6485 121352
19845 121352 93767 196962 123876 -64933 -73064 -291478 -383558 -338302 -148517 -217502 -321843
19834 -321843 -498718 -468941 -206807 55062 244440 306350 607713 618110 595683 672325
19824 672325 397886 96587 -77745 91354 81988 -4214 107660 139865 95896 224168
19814 224168 77153 -165673 -220439 84945 127543 231064 429805 376340 374829 366596 389448
19803 389448 427537 658096 533521 398051 334553 563065 423347 249748 259053 344416
19793 344416 380473 296322 184937 -47832 -205664 -16039 -26757 3774 -130181 -254331
19783b54331K4339K06581P6519K82735l6890l51844j02992j42366K13782k3138
19773a07605K9098J65571M6925j22871J456J9141J25239J36770k07512l87710
19763c01498j06641R1426L71085J10611o8389j67966m7301J1487J38875K0881
19753E2570J33760J09175p958J76971k14795j94002O7438k7410J06815k09167
19743f603l3282R0972Q4244R2572j69476O1430o7245M3310K3973j68312J49843
19732A01426J50922K24977j27971o9022J60724j81074k70131J67590R1776M044
19722B53261j77244Q1593M7911k10831j90169J73667R8414k6733J00421J61747
19712C12037J15571J23336k07805k82633j99931J38302K25472j18123r1093o7204
$$ plain form
19783 -254331 -229992 -23411 53108 335843 298953 -52891 -155883 -298249 -84467 -107605
19773 -107605 -78507 87064 133989 11118 12574 31715 156954 293724 86212 -301498
19763 -301498 -408139 -316713 54372 164983 96594 -71372 -118673 -107186 31689 52570
19753 52570 186330 295505 287547 464518 249723 55721 123159 95749 202564 -6603
19743 -6603 -39885 51087 135331 227903 58427 119857 52612 95922 119895 -48417 101426
19732 101426 252348 477325 349354 280332 441056 259982 -10149 157441 249217 253261
19722 253261 76017 157610 205521 -5310 -195479 -21812 76602 49869 150290 312037
19712 312037 427608 550944 343139 60506 -139425 -1123 224349 106226 15133 -52071
19702e2071k1379K68813K75532K05506o6463l67688M408j34423j82420K51786
19692A81601J11494Q381j88293o5421n5011k2531k051j01860j08652K22569M8341
19681B8567J15338J36037J4477r6682j16868j41916J07546K84617K3795p1007
19671B83904K7385N5298J6752j11833J14403J46345P0536j6753k31446J4927k1495
19660C48023j169P2807N4204M6974P0067o0908K0953j09835q689J06476m45838
19649I3065j02071L3845j16695R3075o856J2571K96853P2000k37481j25576J06358
19638A19088j51868J09331j04515j41462J69562P6738N2500M8303J89356m5861
19628C21172k43199k5423j19714q5823K25840O9943j97970q1163R1254J15091
$$ plain form
19702 -52071 -73450 195363 470895 676401 609938 242250 246658 112235 -70185 181601
19692 181601 293095 301476 113183 47762 -7249 -29780 -31831 -133691 -242343 -19774 28567
19681 28567 143905 279942 294419 197737 80869 -61047 46499 331116 354911 283904
19671 283904 311289 366587 383339 271506 385909 532254 602790 586037 354591 369518 348023
19660 348023 346854 419661 473865 520839 590906 529998 550951 441116 432427 538903 93065
19649 93065 -9006 24839 -91856 1219 -5637 6934 303787 375787 138306 12730 119088
19638 119088 -32780 76551 -27964 -169426 136 76874 129374 177677 367033 321172
19628 321172 77973 52550 -67164 -152987 72853 142796 -55174 -136337 -45083 70008
19618G0008K849j92227j28413M44877K97454j05288R9888j33483j84868q0634
19608I0163N2786J35703j02871l24143j09602J03278J74152J68164q1636M9277
19598A55271Q2626r7288J54920K60219o1182J2537j64567j35343M5012M1900P6227
19587C70332P240p677j30052J30606K58978j23934j85554L0828j56167m8044P1896
19576B18452J46177q772j68965J3005j11240l16495o5983J34394J35287n9012
19566h3152q0904K1112L8093m3331K13155K00479p4864K62050K76371L843k35933
19555D96919j20427k59199k45270J59306L33833P6653j94378j55932J75957J73691
19545D41153j9287n6134o0070j29006j67266P3761P3276O4756k4955k16645o3878
$$ plain form
19618 70008 72857 -119370 -247783 197094 494548 389260 489148 355665 170797 90163
19608 90163 142949 278652 175781 -148362 -257964 -154686 19466 187630 105994 155271
19598 155271 237897 140609 295529 555748 494566 507103 342536 207193 252205 294105 370332
19587 370332 377572 369895 239843 370449 629427 505493 319939 350767 194600 146556 218452
19576 218452 364629 355857 186892 199897 88657 -227838 -293821 -159427 -24140 -83152
19566 -83152 -164056 -142944 -104851 -148182 64973 265452 190588 452638 729009 732852 496919
19555 496919 376492 117293 -127977 31329 365162 441815 247437 91505 267462 441153
19545 441153 421866 365732 305662 176656 9390 83151 156427 221183 196228 -20417 -84295
19534h4295J05943J28106K10988J81914l8451p352j19426j76281k7039r6109P0058
19523A48056o1640k17119k34832K8584K48920J20648l9139Q5438K01779k01091
19513G9604N727J77462M311j83987j56427R4941M9682k43803o0334R3310m2382
19502a81896J09503K91821L48052j65945p0846j41379l08894j02765J6175j01514
19492c07688K9474J16164L06657J72470K9459J07948J12012k6717j123l6707j73751
19481C28198k6952k70810j19541L75458J99778r0557j55172m2677j5604j1363
19471A70758j88247K35667J52762M3315L3475j86635j55892Q4017J06457J5885
19461C11562j61081J42704K80437q0996m6273j01975R8737k1378n2011J73576
$$ plain form
19534 -84295 21648 149754 360742 542656 504205 496853 377427 201146 174107 77998 148056
19523 148056 86416 -130703 -365535 -336951 -88031 32617 -6522 78916 280695 79604
19513 79604 85331 262793 267104 83117 -73310 21631 71313 -172490 -232824 -139514 -181896
19502 -181896 -72393 219428 567480 401535 330689 189310 -119584 -222349 -206174 -307688
19492 -307688 -278214 -162050 144607 317077 346536 454484 566496 539779 538656 501949 328198
19481 328198 301246 30436 -89105 286353 486131 395574 240402 197725 182121 170758
19471 170758 -17489 218178 370940 414255 447730 261095 105203 189220 295677 311562
19461 311562 150481 293185 573622 492626 446353 344378 443115 421737 369726 543302
19451E43302j40308k28916J29008q1123K95440N3827J62132L21651J98317P2278
19441A325608j55147j32553J08181Q9767J00362J39747J18925j28454q2800R9889
19431A483525r6403k57810j54596M2924J26214j27825k33006m31592J05406K22409
19421F79246M2620k65j25565j45845J7360N544j6119k09771m27711Q0117L94057
19410B93668K68185P0679l7897j43473o4635P2269J19412O1092K9484K72835K65771
19399A207390J48314J43670P2056J21887J12491m4761j63473O7891J11828J19034
19389A896327K23583j01284j94973j89470j07864j83926J32885L2047l55171l34738
19379H17416p8959Q3535j3001l55527K45R0000j78529O4510M25698O7176N8220
$$ plain form
19451 543302 402994 174078 303086 221963 517403 571230 733362 1055013 1253330 1325608
19441 1325608 1170461 1037908 1146089 1235856 1336218 1475965 1594890 1466436 1383636 1483525
19431 1483525 1387122 1129312 974716 1017640 1143854 1016029 783023 351431 456837 679246
19421 679246 721866 721601 596036 450191 467551 473095 456976 247205 -180506 -100389 293668
19410 293668 561853 632532 594635 451162 386527 458796 578208 639300 668784 941619 1207390
19399 1207390 1355704 1499374 1571430 1693317 1805808 1761047 1597574 1665465 1777293 1896327
19389 1896327 2119910 2018626 1823653 1634183 1526319 1342393 1475278 1507325 1152154 817416
19379 817416 738457 821992 808991 453464 453709 543709 365180 429690 855388 922564 980784
19368I80784j19624k21260m4888q5279k2301j7509j61886J4682J64883j78635
19358C08967o9973p4908K103P543M9821P1579j53564J29468Q6033j51128J7728
19347B23669J40268m0045J18204N98j63601n7808j12001o3511Q7467K13414J29770
19336D76424J09180J82710J36791p6941K626k80913q1939O9845q3784l7749R6360
19325E12610j2245j08440n0234j7226K69218J14931R0327l40243k30758l5819
19315A92121K02223L13537J23800j85808l97241j95887J64774k9048k49678J22727
19305F1520L71874L22500P1381k95986m4551K17060m3882k8217N6052k8222q7700
19294E71829k64998j1679r3909n7264P4993Q1338J74673k14400Q8272l597J05543
$$ plain form
19368 980784 861160 639900 595012 509733 487432 469923 308037 322719 487602 308967
19358 308967 238994 164086 166189 173732 223553 295132 141568 271036 357069 205941 223669
19347 223669 363937 323892 442096 442694 279093 221285 109284 45773 133240 346654 476424
19336 476424 585604 768314 905105 828164 830790 549877 467938 537783 453999 416250 512610
19325 512610 500365 391925 341691 324465 593683 708614 798941 458698 227940 192121
19315 192121 394344 707881 831681 645873 248632 52745 217519 188471 -61207 61520
19305 61520 433394 755894 827275 531289 486738 703798 659916 631699 687751 659529 571829
19294 571829 306831 295152 201243 143979 218972 300310 474983 260583 348855 345258 450801
19283D50801N1066M8666k6768j31o1984j35987n4381J50631L4685j38477J30022
19272D48143o266M4014j12844M7413n0721R2809K05177L10263o6977j80727O8705
19261G98989J97225K4101j67538j29385k7463j58624j47844j757R0909Q7048j9714
19250E45947J86646N8258k59852k16704j3932J35809J39964r3581j29715n0085
19240C02755L2151J48005M2794m9778o6310j82969N0595q6627J99804L42098J25223
19229H57741O2225k18699J42918K04916j17103P0352k13677k32517k7734p7881
19219D50541P3613J38172K71684Q7k08175j39761r4077l5761K01562Q7209O392
19208G51486M410j57953j45236j4247J0642K30165J0550P5178j73826j23151o014
$$ plain form
19283 450801 501867 550533 523765 523634 461650 325663 271282 421913 456598 318121 448143
19272 448143 441877 485891 373047 420460 369739 462548 667725 977988 911011 730284 798989
19261 798989 996214 1020315 852777 723392 695929 537305 389461 387704 478613 565661 545947
19250 545947 732593 790851 530999 314295 300363 436172 576136 482555 352840 302755
19240 302755 334906 482911 525705 475927 409617 226648 277243 190616 390420 732518 857741
19229 857741 919966 701267 844185 1049101 931998 1002350 788673 556156 528422 450541
19219 450541 524154 662326 934010 934097 725922 586161 492084 456323 657885 745094 751486
19208 751486 755896 597943 452707 438460 449102 679267 689817 764995 591169 468018 462004
19197D62004O6778l8570o7168k1057Q1123K88976J87820j06432j22558Q0319K53001
19186A064236j23884l34884K2860J25696j36522q941N1047M9601J40429j32000
19176G17638k31132p1790R2180J7019J33161n2741J00409j13589L9968K79860
19166I10983q7022r8409j9361L4767K5881j9238K18244J83460k7588K2187J55600
19155A299504K70594j31753k91779O2302J38675L3172l95899O7935J10999R5965
19145A259715K9364l3639P2325l1070l7606L18346K6940K6972q6379n8691k93465
19134A192812k56582J29959l4175p1806J85778J39611j65593R8632L538k96500
19124I25674o8841R9761k8152j5175K42389q0275q7584K3278J48764J21035O3439
$$ plain form
19197 462004 528782 490212 423044 401987 483110 772086 959906 853474 730916 811235 1064236
19186 1064236 940352 605468 628328 754024 617502 608561 659608 709209 849638 717638
19176 717638 486506 414716 506896 523915 657076 604335 704744 591155 631123 910983
19166 910983 823961 725552 706191 740958 766839 747601 965845 1149305 1121717 1143904 1299504
19155 1299504 1570098 1438345 1146566 1208868 1347543 1380715 984816 1052751 1163750 1259715
19145 1259715 1289079 1255440 1327765 1296695 1259089 1577435 1604375 1631347 1544968 1486277 1192812
19134 1192812 936230 1066189 1032014 960208 1145986 1285597 1120004 1218636 1222174 925674
19124 925674 856833 956594 928442 913267 1155656 1075381 987797 1011075 1159839 1280874 1344313
19113A344313j56327j64898n2140K44005M48396J21510j44121k6219K67855J57968
19103B040342n7393k1054j45863l090l37551J71727L42519Q8385J72208j82666
19093B067564j64622k26639N2206K39880J12724q196j69223k15901m17641j26512
19083A143640J05222J98034m786J5781K02556J91566j950l76015k22745k25581
19073A025722l3475J84785n8566o7774j43648J3032J75562J15523K84419J53063
19063A648643j3629J85813J19507L21746L24218J06373j54528q8180J93319N2146
19053B695428j69546J40331j16689K323K77911J32909l3492l69758o8741P1723
19043B562399K28256N6508l45172k62187m03614r9214k65036j85107R6280J01370
$$ plain form
19113 1344313 1187986 1023088 970948 1214953 1663349 1784859 1640738 1614519 1882374 2040342
19103 2040342 1982949 1961895 1816032 1812942 1475391 1647118 1989637 2078022 2250230 2067564
19093 2067564 1902942 1676303 1728509 1968389 2081113 2072917 1903694 1687793 1270152 1143640
19083 1143640 1248862 1446896 1442110 1457891 1660447 1852013 1850063 1474048 1251303 1025722
19073 1025722 992247 1177032 1118466 1050692 907044 920076 1095638 1211161 1495580 1648643
19063 1648643 1635014 1820827 1940334 2262080 2586298 2692671 2538143 2449963 2643282 2695428
19053 2695428 2525882 2666213 2549524 2551847 2829758 2962667 2929175 2559417 2490676 2562399
19043 2562399 2790655 2847163 2501991 2239804 1836190 1736976 1471940 1286833 1383113 1484483
19033A484483N1036J79826j7890k1905J4302o754K3616j43792j56767M0366J71690
19022A618211o6424R04l6309L303K4672l8575J75427o5155K9666k5493n8616J48375
19010A709986K50019j14371J60892J2808R5879l9674j22545J01066J24755j30729
19000B048086M4131J90743J76808P9895j27217J2017j3157M6472J21328K6067
18990B605173J39488o1382o2550L2517K88799j33620M014J62825K67411K40048
18980C482723Q9680q3627J32134K30393O7975J31254K25869P1391L02110M14711
18970E064613M72486L08896M56636N65317P54477O22905K32624N54026Q35809
18961I867789Q45895Q54754R85442J125338J058967J419863J959177K704765L162214
$$ plain form
19033 1484483 1535519 1715345 1697455 1675550 1689852 1683098 1706714 1562922 1406155 1446521 1618211
19022 1618211 1551787 1552691 1516382 1519685 1544357 1505782 1681209 1616054 1645720 1620227 1561611 1709986
19010 1709986 1960005 1845634 2006526 2019334 2115213 2075539 1952994 2054060 2178815 2048086
19000 2048086 2092217 2282960 2459768 2539663 2412446 2424463 2411306 2457778 2579106 2605173
18990 2605173 2744661 2683279 2620729 2653246 2942045 2808425 2812439 2975264 3242675 3482723
18980 3482723 3572403 3488776 3620910 3851303 3919278 4050532 4276401 4347792 4649902 5064613
18970 5064613 5537099 5845995 6302631 6867948 7622425 8245330 8477954 9031980 9867789
18961 9867789 10713684 11568438 12553880 13679218 14738185 16158048 18117225 20821990 23984204
18952B3984204M053357N852560Q095834J1814129J6627653K2539148K8053155
18945A21020040K8965638K4792248J8287624J3753412J3386874J3377944J1079752
18938B44663532P654813N657043M146108J396744l077915p844579j2988567j9837524
18930B19769655k7164592l0946535k8913467k2858692j6438993j1956553r040709
18923G2450114p266456n872479n225591m659595l930512l033751k610133k317885
18915C7533712j704307j279242j038728o93617n08454J55491N91295R89061J914981
18906C5960192K823182L784081O233933R311834J3606973J9620009K6541273L1562074
18898A49443551L0727121K4473500J6002264J2252406J5032986K1042777K2223518
$$ plain form
18952 23984204 28037561 33890121 41985955 53800084 70427737 92966885 121020040
18945 121020040 149985678 174777926 193065550 206818962 220205836 233583780 244663532
18938 244663532 252318345 257975388 262121496 263518240 260440325 252595746 239607179 219769655
18930 219769655 192605063 161658528 132745061 109886369 93447376 81490823 72450114
18923 72450114 65183658 59311179 54085588 49425993 45495481 42461730 39851597 37533712
18915 37533712 35829405 34550163 33511435 32817818 32309364 32464855 33056150 34045211 35960192
18906 35960192 38783374 42567455 48801388 58113222 71720195 91340204 117881477 149443551
18898 149443551 180170672 204644172 220646436 232898842 247931828 268974605 291198123
18891B91198123J6125805O993827j528338q068432j1060000j1268748j1635733
18884B70756504j5090635k2856950l1058471l4285999l0611533k3294800j6734665
18877I6823451j2738600j0001138q160136o901614o256914n554905n005370m209428
18869C7995346l480378l204496k891608k427981k079194j943173j867157j748502
18861A8352857j659396j527823j296944j179098j151238j198486r19436p50513
18853H669923n22844n66639p53126p37173l21591k66230m32845j41999j15123
18844D812353k62633j00846M1134Q2712j39215m94455j26058M051j87603q183
18834C621257l2033J17171k75638j91123j67277j20655l23596j22477K03551Q0180
$$ plain form
18891 291198123 307323928 314317755 312789417 304720985 293660985 282392237 270756504
18884 270756504 255665869 232808919 201750448 167464449 136852916 113558116 96823451
18877 96823451 84084851 74083713 65923577 59021963 52765049 47210144 42204774 37995346
18869 37995346 34514968 31310472 28418864 25990883 23911689 21968516 20101359 18352857
18861 18352857 16693461 15165638 13868694 12689596 11538358 10339872 9420436 8669923
18853 8669923 8147079 7580440 6827314 6090141 5768550 5502320 5069475 4927476 4812353
18844 4812353 4549720 4448874 4490008 4572720 4433505 3939050 3812992 3817043 3629440 3621257
18834 3621257 3589224 3706395 3430757 3239634 3072357 2951702 2628106 2505629 2709180 2789360
18824B789360k98155j07632j23992J0021j15074n6038j54336K3670J98760O317
18814B172901j27069k40153j46788J53097K358K1849Q2035k4847q6098L6125J87876
18803B031286k03829l42799j13054N3793L28816L08990J6471p3661l65512L30670
18793A971171M43138j00832l23820K4732J38046L17499J21336j09425l8695l0136
18783B413014m9609p6509K51256K27532k9568k06978j45006m52455j78818J70206
18773A923065J47538j17220k17077L32543K90658N2517J99384J52135J96837M31173
18763C391553M80647L4292q25943p49138k02798n2929r8980k83154M2855R810
18753A746215J38927n1328L8772l1717k01802m3954j37352J37943J32234J46562
$$ plain form
18824 2789360 2491205 2383573 2259581 2269602 2154528 2098490 1944154 1967824 2166584 2172901
18814 2172901 2045832 1805679 1658891 1811988 1814346 1836195 1918230 1893383 1807285 1843410 2031286
18803 2031286 1827457 1484658 1371604 1425397 1754213 2063203 2079674 2006013 1640501 1971171
18793 1971171 2414309 2313477 1989657 2014389 2152435 2469934 2591270 2481845 2443150 2413014
18783 2413014 2363405 2286896 2538152 2765684 2736116 2529138 2384132 1931677 1752859 1923065
18773 1923065 2070603 1953383 1736306 2068849 2359507 2412024 2611408 2763543 2960380 3391553
18763 3391553 3872200 3906492 3080549 2331411 2128613 2075684 1976704 1693550 1736405 1746215
18753 1746215 1885142 1833814 1872586 1840869 1639067 1595113 1457761 1595704 1727938 1874500
18743A874500J38851K73111J84084j06211k68640j37754N9302L0303m11706J34971
18733A770811Q28L082K3099K40631l3440k3588J48800k95177k83551K47478L0710
18722A829683j57752K76361K52408K03363j49927j27802J84200N30364K10287
18713C051185j80202l53194l4571J22561J59587M3217k21980L0046J8253j70840
18703B464062j0222k85008m00437J9023K6374Q3753J90566J28190O8402M848q981
18692B280570k60923p5530J28514J76125j59181j69303l37605k57771o4867J89826
18682A449855K78258K59547K04278L66655m1024P755J35375j72610l1923L6494
18672B492660j01807J03589K79690J84509K40505J29185j9400O9392n3041j20728
$$ plain form
18743 1874500 2013351 2286462 2470546 2364335 2095695 1957941 2017243 2047546 1635840 1770811
18733 1770811 1771639 1774721 1797820 2038451 2005011 1981423 2130223 1835046 1551495 1798973 1829683
18722 1829683 1671931 1948292 2200700 2404063 2254136 2126334 2310534 2840898 3051185
18713 3051185 2870983 2517789 2483218 2605779 2765366 2808583 2586603 2616649 2634902 2464062
18703 2464062 2453840 2168832 1768395 1787418 1813792 1897545 2088111 2216301 2284703 2289551 2280570
18692 2280570 2019647 1944117 2072631 2248756 2089575 1920272 1582667 1324896 1260029 1449855
18682 1449855 1728113 1987660 2191938 2558593 2517569 2525324 2660699 2488089 2456166 2492660
18672 2492660 2390853 2494442 2774132 2958641 3199146 3328331 3308931 3378323 3325282 3204554
18662C204554j1608K75348L13933L4513J19416k41302j37620j43436m80337J41225
18652C074686M22499J23051J37350r0213N3492R2010k6994J16256l0464R4357
18642C966030L83525N20407K76512O4171P5954L68281N80568M04331L52340K81071
18632G273190N47998P27215N65845O64709N64625M95734Q15964J222757J251059
18623A4129096Q64392J206237J801025K215397K882609L796256N119680O849357
18615C8864049R283477J2439778J6081281J8305218J6997297J4150923J3951991
18608A40074014J8463458K2579004K0089593J2845355P253590M577496J956593
18601B27839103p95410j157961P49678o29179r010703j9414201k2427941j6309642
$$ plain form
18662 3204554 3192946 3468294 3782227 3816740 3936156 3694854 3557234 3413798 2933461 3074686
18652 3074686 3497185 3620236 3757586 3667373 3720865 3812875 3785881 3902137 3871673 3966030
18642 3966030 4349555 4869962 5146474 5210645 5286599 5654880 6235448 6639779 6992119 7273190
18632 7273190 7821188 8548403 9114248 9778957 10343582 10839316 11655280 12878037 14129096
18623 14129096 14993488 16199725 18000750 20216147 23098756 26895012 32014692 38864049
18615 38864049 48147526 60587304 76668585 94973803 111971100 126122023 140074014
18608 140074014 158537472 181116476 201206069 214051424 221305014 225882510 227839103
18601 227839103 227043693 225885732 226635410 226006231 216995528 197581327 175153386 158843744
18593A58843744r866705r203119j3560317j7726417j6844828j3114041r719238
18586F8809079p197423n524188m677073l562849k687524k403894j946933j599537
18578C9209658j088143m87945j28732J27633P74698J826732K877369M294547N726437
18569E3132254Q152312J1966951J6623009K0871752K3575555K2539553J9515056
18562A76376442J9893046K3970419K5303911K0223271J3334482R579708P222950
18555B95904229K060439m151531n686047l515619o255156j6174446k4420247k3625449
18547B14136173j7777169j5892412j9580875k3113727k2368499j8394496j3985887
18540H3023108j0802140q558587p143779o081108n027289m527285m106838l687812
$$ plain form
18593 158843744 148977039 139773920 126213603 108487186 91642358 78528317 68809079
18586 68809079 61611656 56087468 51410395 47847546 45160022 42756128 40809195 39209658
18578 39209658 38121515 37633570 37504838 37632471 38407169 40233901 43111270 47405817 53132254
18569 53132254 61284566 73251517 89874526 110746278 134321833 156861386 176376442
18562 176376442 196269488 220239907 245543818 265767089 279101571 288681279 295904229
18555 295904229 297964668 293813137 288127090 284611471 278356315 262181869 237761622 214136173
18547 214136173 196359004 180466592 160885717 137771990 115403491 97008995 83023108
18540 83023108 72220968 63662381 56518602 50437494 45410205 40882920 36776082 33088270
18532C3088270k813804k572197k198980k161124k142139j909597j535026j521590
18524A6233813j328087j240058j315115j149837r27287o05256p35834o20397q16218
18515G495724q37583n88242j58574r9647j41029k28571j68328l28146m30979l74228
18505D140397r6176j71540l46849n35038l67600p4892l4197k41743j34062k41728
18495A896572j62493Q0152O0913j08779K4201J52969K79922m8969l82486l7161
18485A754841R6313j583Q4376k30260l36276Q4870M9180o5068P2630Q8380K440
18474A599843j99195M3138J85568j06058J86321j90442P1701J64010N9088J53646
18464A967620K07533J48723J09528J3013k886r2470J17522m0088q7085M4282L56072
$$ plain form
18532 33088270 30274466 27702269 25503289 23342165 21200026 19290429 17755403 16233813
18524 16233813 14905726 13665668 12350553 11200716 10273429 9668173 8932339 8311942 7495724
18515 7495724 6658141 6069899 5911325 5811678 5670649 5442078 5273750 4945604 4514625 4140397
18505 4140397 4044221 3872681 3525832 2990794 2623194 2548302 2514105 2272362 2138300 1896572
18495 1896572 1734079 1814231 1875144 1766365 1790566 1943535 2223457 2174488 1792002 1754841
18485 1754841 1851154 1849571 1933947 1703687 1367411 1452281 1501461 1436393 1509023 1597403 1599843
18474 1599843 1400648 1443786 1629354 1523296 1709617 1519175 1590876 1754886 1813974 1967620
18464 1967620 2175153 2323876 2433404 2446417 2443531 2351061 2468583 2428495 2341410 2385692 2741764
18453B741764L76591K23006J63909l6366j37654k33905l6434J49943m317k8682
18443C177855m9567k04260j24096k04709O9110K07993J87333j29751o9632J52716
18433C012992P9179Q8665J50498q3869J19310L50488P0554L3524K39562k3994
18423D036909l880L01429L67942M38944L72935M35042K44765M5733K80271K94314
18413F814404K42986j33746P7216K13103O03261O39810N51376P58652Q73160J175743
18403A1815965J790652K150787K955576M282546O418779R095121J1833076J4334572
18395F4677074J3791701R972296N690435M573675N209363L587092J939872K854000
18387A12295508M163618J870224j707538l661614l845881p406536j3037652j5287847
$$ plain form
18453 2741764 3118355 3341361 3505270 3468904 3331250 3097345 3060911 3210854 3206537 3177855
18443 3177855 3128288 2924028 2799932 2595223 2664333 2872326 3059659 2929908 2860276 3012992
18433 3012992 3092171 3180836 3331334 3247465 3366775 3717263 3787817 3821341 4060903 4036909
18423 4036909 4033029 4334458 4702400 5141344 5514279 5949321 6194086 6239819 6520090 6814404
18413 6814404 7057390 6923644 7000860 7213963 7817224 8457034 9008410 9767062 10640222 11815965
18403 11815965 13606617 15757404 18712980 22995526 29414305 38509426 50342502 64677074
18395 64677074 78468775 88441071 94131506 98705181 103914544 107501636 109441508 112295508
18387 112295508 116459126 118329350 116621812 112960198 109114317 101707781 88670129 73382282
18379G3382282j2812617r257990o445490m671562l478691k553885k325442k045527
18371B9791078j668644j413727j285934j033921p89635n64136n57030O9603q0491
18362B2467163J93835P80650J022520J094787J662200K441340L521298N228133
18354C8411926P461146J0998262J6252004K2578095L0271527L6846275L6084247
18347A98903482K6220683J4485945J0174680R455536L832532k520706r75778N044342
18339B64620716M462852l164062q229250j0036249j6077414k7506416l4546281
18332A69523896l1410390k3718775j6733582j2369049r420561p587764o027854
18325F2255921n131180n025970m643300l826552l530075k623746k233437j988788
$$ plain form
18379 73382282 60569665 51311675 44866185 40194623 36715932 34162047 31836605 29791078
18371 29791078 28122434 26708707 25422773 24388852 23599217 23035081 22478051 22547654 22467163
18362 22467163 22660998 23441648 24464168 25558955 27221155 29662495 33183793 38411926
18354 38411926 45873072 56871334 73123338 95701433 125972960 162819235 198903482
18347 198903482 225124165 239610110 249784790 259240326 263072858 260552152 259576374 264620716
18339 264620716 269083568 265919506 257690256 247654007 231576593 204070177 169523896
18332 169523896 138113506 114394731 97661149 85292100 75871539 68283775 62255921
18325 62255921 57124741 52098771 47455471 43628919 40098844 37475098 35241661 33252873
18317C3252873j343309j006282q27146p14070j84125J25063N12178R99308J710351
18308C2524841K746033M706974P351856J0784654J5708640K1051949K5365681
18301A20240628K5032008J7535829Q896527N019668L074296k488828p416812m842528
18293A65050788J695320L824026j20781m488834o040844q379442j5144649k1330541
18285A15065043k1267097j6498881j1420088q175973o511700n154830m210807
18278D1825667l258336k925994k480286k056220k056283j700187j573481j408427
18270B4366453j408723j009680p16319k12915K27592J81572L39386P55474N01202
18261B3024042L67526P30583J674114L173447M094913N769354Q153024J1845784
$$ plain form
18317 33252873 31909564 30903282 30076136 29362066 29177941 29303004 29815182 30814490 32524841
18308 32524841 35270874 39977848 47329704 58114358 73822998 94874947 120240628
18301 120240628 145272636 162808465 171704992 176724660 179798956 177310128 169893316 165050788
18293 165050788 166746108 170570134 170449353 165960519 159919675 151540233 136395584 115065043
18285 115065043 93797946 77299065 65878977 57703004 51191304 46036474 41825667
18278 41825667 38567331 35641337 33161051 31104831 29048548 27348361 25774880 24366453
18270 24366453 22957730 21948050 21231731 21018816 21246408 21427980 21767366 22522840 23024042
18261 23024042 23391568 24122151 25796265 28969712 33064625 38833979 46987003 58832787
18253E8832787J7436409K4611271L2980056L8864681L5649761J7536428p465140
18246B18446253k2537853k0071290o262794R774384K3369487K9405371K1141574
18239B53265132l491232l0692631m2707934l7537341k7151707j8729554j3031708
18232G9923025r319481o804084n378923m905468m498734l872820l209830k837276
18224C9096409k694509k405050k035672j390907r16805m11409N9991j445J74965
18215B9475568M98294P20117J392077K349813L502632M937298P113470J0185254
18207F0174523J5065585K2201448L1484442M2659388N0202284M5338864K1140494
18200B88267028j1031896k9473230k4523661n501301J4344786K8100256K8475384
$$ plain form
18253 58832787 76269196 100880467 133860523 172725204 208374965 225911393 218446253
18246 218446253 195908400 175837110 169574316 179348700 202718187 232123558 253265132
18239 253265132 249773900 219081269 176373335 138835994 111684287 92954733 79923025
18232 79923025 70603544 63799460 58420537 53515069 49016335 45143515 41933685 39096409
18224 39096409 36401900 33996850 31961178 30570271 29653466 29242057 29302048 29300603 29475568
18215 29475568 29973862 30693979 32086056 34435869 37938501 42875799 49989269 60174523
18207 60174523 75240108 97441556 128925998 171585386 221787670 267126534 288267028
18200 288267028 277235132 247761902 223238241 217736940 232081726 260181982 288657366
18193B88657366R691435k1540991m5254487m8505467l8567918k7258979j9051539
18186I8169420j3306172r670168p768652o702315o206487n401203m523553l993019
18178D0597851l474199l284177k831304k480864j836302j680190j201615r40025
18170B2869175q53346p38547o19525l98508m43181K74475O52033R44236J692073
18161B3378885K992179M761008P307525J0741534J4752216J7510238J5604201
18154I7047786P092564m653838j1072223q439052j506298M874279R267093Q306970
18146A00917281M91985j0325586j6701472j5828126j1788989q418441n804540
18139C2542112l894518k974179k251946k330201k147713j944849j417835q49120
$$ plain form
18193 288657366 298348801 276807810 231553323 183047856 144479938 117220959 98169420
18186 98169420 84863248 75193080 67424428 60722113 54515626 49114423 44590870 40597851
18178 40597851 37123652 33839475 31008171 28527307 26691005 25010815 23809200 22869175
18170 22869175 22015829 21277282 20657757 20259249 19816068 20090543 20742576 21686812 23378885
18161 23378885 26371064 31132072 38439597 49181131 63933347 81443585 97047786
18154 97047786 104140350 99486512 88414289 79975237 78468939 83343218 92610311 100917281
18146 100917281 101409266 91083680 74382208 58554082 46765093 38346652 32542112
18139 32542112 28647594 25673415 23421469 21091268 18943555 16998706 15580871 14731751
18131A4731751r74848r63297j056089q23270l57217l15869k92088l8855J04933
18122A0015151M28849J58719k84903J00559R28393J525757J902268K164553L265850
18113B0205196M117763O343491J0138889J6003910K5779275M2276109O5907589
18106A90772222R0726600Q3257936J0475379p6300374j01743445o3168913l2991162
18099A01028243j9215739j2380118p815655m866125m598119n895357n940755n609751
18091C4706624m366637l615249l219970k846685k314815j949460j442541j346252
18083A3605015j104257j132358j142713j096902q74215o54419n59672o34157n59569
18074E846753m87329l68282l76697l48537m02271k88360p5253m06105l40338l29405
$$ plain form
18131 14731751 13756903 12793606 11737517 10914247 10557030 10241161 9949073 9910218 10015151
18122 10015151 10444000 10602719 10317816 10418375 11346768 12872525 14774793 16939346 20205196
18113 20205196 24322959 30666450 40805339 56809249 82588524 124864633 190772222
18106 190772222 281498822 364756758 375232137 298931763 197188318 134019405 101028243
18099 101028243 81812504 69432386 61616731 56750606 52152487 46257130 40316375 34706624
18091 34706624 30339987 26724738 23504768 20658083 18343268 16393808 14951267 13605015
18083 13605015 12500758 11368400 10225687 9128785 8254570 7600151 7040479 6406322 5846753
18074 5846753 5359424 4991142 4614445 4265908 3863637 3575277 3500024 3093919 2753581 2424176
18064B424176j26815k14237j03268j78890J34080J19509k21627l75624n5159K62505
18054A664650k788K7767r3304j02491k06451J19166J0633j93801J0936K5590k83795
18043I76112k47337J96460J37370p4624k3999Q3706J14815K4926k77698k85987
18033F23744k2500r7904l42593k51388J71781J72242m9469l65650J2894J27636
18023b1207j19188N2795L5519o6557j86262n1071J01503l5635j2792R0272k7840
18012b40463L5401r4165j42368J56449K06298L50263k8671r099j21562j72608
18002f0525P7668L36886J09613p2253j75090l58486l75502j53485R9655J93842
17992c77677J1128p4476L3901J17161o2757m136J51211r2971j10175J09818q5915
$$ plain form
18064 2424176 2297361 2083124 1979856 1800966 1935046 2054555 1832928 1457304 1402145 1664650
18054 1664650 1661862 1689629 1596325 1493834 1287383 1406549 1417182 1223381 1234317 1259907 976112
18043 976112 728775 925235 1062605 987981 963982 1047688 1162503 1187429 909731 623744
18033 623744 601244 503340 160747 -90641 81140 253382 203913 -161737 -148843 -21207
18023 -21207 -140395 -87600 -52081 -118638 -304900 -355971 -254468 -290103 -302895 -212623 -240463
18012 -240463 -205062 -299227 -441595 -285146 -78848 271415 242744 233645 112083 -60525
18002 -60525 17143 354029 463642 391389 216299 -142187 -517689 -671174 -571519 -377677
17992 -377677 -366549 -441025 -407124 -289963 -352720 -356856 -205645 -298616 -408791 -298973 -384888
17981c84888p2268j01867n5028J03746M1636J13219k4419J989J61178Q4709N0477
17970h1516o4694k08899r0648N5412M0148k25028M4521J85081L41170l18258L4672
17959b88039J76106l6977l7279r1275M1375k063L587O2429J83564P2202M8193
17948A31823j38061m55315p323n8792J47012J08788P972n4530j41753K12386K25544
17937b2249R1589q1481O6330M7677J15436j9149l26272l70326j12188R4316j51281
17926f67598J75460Q1555j01606O902L473N3820R1388n872M0828J21039j43315
17915c43926q2149R493j02680j20940J7802P3878Q8309O9327M7890K0832N9507
17904b62657m779N8407O716J01885P874m20515j20214j93487l9623j26118M3365
$$ plain form
17981 -384888 -457156 -559023 -614051 -510305 -468669 -355450 -379869 -377880 -216702 -131993 -81516
17970 -81516 -146210 -355109 -445757 -390345 -350197 -575225 -530704 -345623 -4453 -322711 -288039
17959 -288039 -111933 -148910 -186189 -277464 -236089 -238152 -234565 -172136 11428 83630 131823
17948 131823 -6238 -461553 -468876 -527668 -380656 -271868 -263896 -318426 -460179 -247793 -22249
17937 -22249 69340 -12141 54189 101866 217302 198153 -128119 -498445 -610633 -516317 -667598
17926 -667598 -492138 -410583 -512189 -505287 -501814 -447994 -356606 -362478 -321650 -200611 -343926
17915 -343926 -426075 -416582 -519262 -640202 -622400 -548522 -460213 -390886 -342996 -322164 -262657
17904 -262657 -267436 -209029 -202313 -100428 -92554 -513069 -633283 -826770 -866393 -992511 -949146
17893i49146L76074K24891R0098Q4119M6848J33648O3766P5932M5917M3400q1186
17882A54361m704K63044K41939k3409q8625j19750k84953o128O4903K93131r176
17871D80633l11968j48824O406j12796k06012k81570J40936L29927L0624j54564
17861b27208m7648L2009J29783n9318j75620j78757O1218j3514l09030j4497n6226
17850h58808J32045N4305J70305J07776J56827J74449j39553q6472k58981J87708
17840c60399K56339J19904J405K60308K53030M9789J12826L41116J56587J66315
17830A357220M4803O1731j93869l15800J9075j10485j33195J35986m02239j83186
17820B80041j53536P5171k76805j10521K2496N4252M3769k62500j93711L42335
$$ plain form
17893 -949146 -573072 -348181 -258083 -173964 -127116 6532 70298 146230 192147 235547 154361
17882 154361 149657 412701 654640 631231 542606 422856 137903 131775 196678 489809 480633
17871 480633 168665 19841 26247 -86549 -292561 -574131 -433195 -103268 -72644 -227208
17861 -227208 -274856 -242847 -113064 -172382 -348002 -526759 -465541 -479055 -788085 -802582 -858808
17850 -858808 -726763 -672458 -502153 -394377 -237550 -63101 -202654 -289126 -548107 -360399
17840 -360399 -104060 15844 17249 277557 530587 580376 693202 1034318 1190905 1357220
17830 1357220 1402023 1463754 1269885 954085 973160 862675 729480 865466 463227 280041
17820 280041 126505 201676 -75129 -185650 -163154 -108902 -65133 -327633 -521344 -179009
17810a79009J07081J87099p7758o9705k0982j83716j42066J34811J2263q0476
17800c12458K03017o4418k08129K4185J24618o1299L0067Q7825K6716K3994J13826
17789a2056l442L1630N5531J46854K88049K87475n8159k9557l438j40909j75031
17778C86947l02905l24529K4830J67822J6656p7140p7323N5146O8543j07298l1375
17767b00626n8748o75L12298O155j19162O2326J24960r7814j99136q4200P4710
17756a79912o7624m3919K23376N8943J9191J04J19109j37209q225K41383J61538
17745C86755J02036j4577q7447K1107N2345J08476Q2550j34143j7912k70410l76516
17734a47736k907J24658k29211j86678J69980M01215J81151N724j23140k65231
$$ plain form
17810 -179009 -71928 115171 37413 -32292 -53274 -236990 -379056 -244245 -231982 -312458
17800 -312458 -109441 -173859 -381988 -357803 -233185 -294484 -264417 -176592 -149876 -125882 -12056
17789 -12056 -15498 16132 71663 218517 506566 794041 735882 706325 702887 561978 386947
17778 386947 84042 -240487 -215657 -47835 -31179 -108319 -185642 -130496 -61953 -169251 -200626
17767 -200626 -259374 -260049 52249 58404 -60758 1568 126528 28714 -170422 -254622 -179912
17756 -179912 -247536 -291455 -68079 -9136 10055 10159 129268 -7941 -16166 225217 386755
17745 386755 488791 474214 386767 407874 460219 568695 651245 517102 499190 228780 -147736
17734 -147736 -150643 -25985 -255196 -441874 -271894 129321 310472 316196 193056 -72175
17724g2175P3366O7154j32461o7107M9053j54845j01345j31846l1196j40313O616
17713f35099R1372l34698K54203L29455R6020J14849j35185n1535J60450L01717
17703A91549K71045k3340J08951m2576J00245M98440N7506j25340k66905k29749
17693E39826K02606K19866K09603Q9172k10516l04804m5238K26704q8606j17136
17683G21477l3012l03390j70738j6641j64851j23726j69097o692K58756P982o4373
17672f4305n3751j87329J038J70328R9741J4094N22O4447J05197K36143M7838
17661D33963l19520j29464N0009R7476L1034k51185p9889K03504J13352K64334
17651D13614J78011n6233R3726j46792l56147n3353K80043J62488L2099P1404
$$ plain form
17724 -72175 1191 68345 -64116 -131223 -82170 -237015 -338360 -470206 -501402 -641715 -635099
17713 -635099 -543727 -878425 -624222 -294767 -198747 -83898 -219083 -270618 -110168 191549
17703 191549 462594 439254 548205 505629 605874 1104314 1161820 1036480 769575 539826
17693 539826 742432 962298 1171901 1261073 1050557 745753 700515 927219 838613 721477
17683 721477 688465 385075 214337 197696 32845 -90881 -259978 -266670 -7914 68 -64305
17672 -64305 -118056 -305385 -304347 -134019 -34278 -20184 -19662 44785 149982 386125 433963
17661 433963 114443 -15021 34988 132464 163498 -87687 -167576 35928 149280 413614
17651 413614 591625 535392 629118 482326 126179 72826 352869 515357 547456 618860
17641F18860j80861j44012k2997J196r9474J12162j99743l32499Q204J55925L2136
17630e1103J44711j13478q6501m2132j41175j95064J99134M45505N98463O06059
17620A364419L13607J45369K86612j55473n45194o96196m46357k31879P6476M2912
17610A54296j3961J57571R4870k14005k49693j44058l4198j62885R9062k256j05141
17599d20398P6107Q6993m5336r9288p6224n0301J76443J2823j19568M1157Q3850
17588c33742k0672l3696O7553N2029K41905O8010L9544J91775o3647L52220M10948
17577I72227L55523L90391M57374J76010m77386m56691j78193k06870l17017l2326
17567F83042J78158j0190K15325j01599m48100k87233k93008j08953K78029k4654
$$ plain form
17641 618860 437999 293987 270990 272186 172712 284874 85131 -247368 -239164 -83239 -51103
17630 -51103 93608 -19870 -106371 -148503 -289678 -484742 -285608 159897 758360 1364419
17620 1364419 1678026 1823395 2110007 1954534 1409340 713144 266787 34908 111384 154296
17610 154296 140335 297906 392776 178771 -70922 -214980 -249178 -412063 -313001 -315257 -420398
17599 -420398 -344291 -257298 -302634 -401922 -478146 -528447 -352004 -339181 -458749 -417592 -333742
17588 -333742 -354414 -388110 -320557 -268528 -26623 41387 80931 272706 209059 561279 972227
17577 972227 1327750 1718141 2175515 2351525 1874139 1417448 1239255 1032385 715368 683042
17567 683042 861200 851010 1066335 964736 516636 229403 -63605 -172558 105471 80817
17557H0817m8514n7496k09225j5126J24679K42477j93444r5761R8767M2897j1421
17546d1350P74J3580o9346Q5229j3286J16823K10185o6533k84287m7925J33646
17535C7510L76882K42905J20799K2091J6102k41579J80516M93707L94710K63290
17525A906933K53678K25165j89176p03866l12891j07000k49787j70489j26306
17516E26261j75287j29446K96351q6461K44941q3465l01633j15745j66756J7861
17506B6621k3706O4467m4993j20970j80303r38R0780K080k29556j73182P3247
17495e16453k810j1714J93409J04219K73320J17705R6140q2711k17767J71405
17485A24743N70332K90394J99050N61520M95018J4250l24338k80713n39388l29750
$$ plain form
17557 80817 32303 -25193 -234418 -249544 -124865 117612 -75832 -171593 -72826 -29929 -41350
17546 -41350 -40576 -26996 -96342 -11113 -24399 92424 302609 236076 -48211 -96136 37510
17535 37510 414392 657297 778096 800187 816289 574710 755226 1248933 1643643 1906933
17525 1906933 2160611 2385776 2196600 1492734 1179843 1072843 823056 652567 526261
17516 526261 350974 221528 517879 431418 676359 592894 291261 175516 8760 26621
17506 26621 2915 67382 22389 -98581 -278884 -279822 -189042 -186962 -416518 -589700 -516453
17495 -516453 -519263 -530977 -337568 -233349 39971 157676 253816 171105 -46662 124743
17485 124743 695075 985469 1184519 1746039 2241057 2255307 1930969 1650256 1110868 781118
17475G81118k00882j34067j18046J90173J65573L3540p0448k28414k19525k0678
17465A78344L041k19126q0679J29398q448J4156n587l7366K1528K0879J57604
17454A73744L4611k0688n8000M5911q8407j67473n9946r3730q325P437J97195
17443c7671K32216L45064K84847M03272P92222M89295k78416n10736m99783j47265
17433A073045k96306k26269j88005K31688k58328j22693o0715L9526k03939p8582
17423i0578n8445j47453j59232J6808R9143m2333N3703J91323j51357J77634Q7436
17412b3351O8063J04457j70619j40913P7518J22170J8340k23650k70540O2828
17402c75697M3854K6275O549p1518j18313L11385L48669M5002p0305k41266k94320
$$ plain form
17475 781118 580236 446169 328123 518296 683869 717409 646961 418547 199022 178344
17465 178344 181385 -37741 -118420 10978 2530 16686 11099 -26267 -4739 16140 173744
17454 173744 208355 187667 129667 175578 87171 -80302 -140248 -233978 -242303 -234866 -37671
17443 -37671 194545 539609 824456 1227728 2019950 2509245 2230829 1720093 1220310 1073045
17433 1073045 776739 550470 362465 594153 335825 213132 152417 191943 -11996 -90578
17423 -90578 -149023 -296476 -455708 -438900 -339757 -382090 -328387 -137064 -288421 -110787 -23351
17412 -23351 44712 149169 -21450 -162363 -84845 37325 55665 -167985 -438525 -375697
17402 -375697 -331843 -305568 -299019 -370537 -488850 -177465 171204 216206 145901 -95365 -389685
17391c89685j00852J63738N1204o730p766j7053K4297j78303m1385J8869K69327
17380b14339N7106j44582k40341k45376J33684J99040O8919j3830J03058k75021
17370e71682J2766J6423J61051J9558K7851l6089J09781K229O1203l0494q1468
17359c08871j35861J4737j76107l5481j4041n3038j41751j05255O0329P1471J40604
17348f83264L04561N9476m2601K2035J42203m4154j44393M013N4741m5755L6478
17337c36660J07945K45727K15959j718j13868k25055n9129j81601n1018J52402
17327b47016L30o8058J07956K10433q3734j78111k65683p5285J81479J7049j0871
17316d11511K13781L3868l49893j41485K97748J57388m7559k32481k24025J31201
$$ plain form
17391 -389685 -490537 -326799 -275595 -282325 -290091 -307144 -282847 -461150 -502535 -483666 -214339
17380 -214339 -157233 -301815 -542156 -787532 -653848 -454808 -385889 -399719 -296661 -571682
17370 -571682 -558916 -542493 -381442 -361884 -334033 -370122 -260341 -258112 -196909 -227403 -308871
17359 -308871 -444732 -429995 -606102 -641583 -655624 -708662 -850413 -955668 -895339 -823868 -683264
17348 -683264 -378703 -319227 -361828 -339793 -197590 -241744 -386137 -382124 -327383 -373138 -336660
17337 -336660 -228715 17012 232971 231253 117385 -107670 -166799 -348400 -399418 -247016
17327 -247016 -246686 -314744 -206788 3645 -80089 -258200 -523883 -599168 -417689 -400640 -411511
17316 -411511 -197730 -163862 -513755 -655240 -357492 -200104 -247663 -480144 -704169 -572968
17306e72968k04407K15998J4602K89904R5575j1669N1614j32606n9439k0184j6538
17295c50118J37072k0650Q4345j70201j7204L1863k11093k4764J4160j43863J27200
17284e43253L30814J35277K67972L9217k38431J08233L9803m86003O4183J19014
17274a63174P8264J69819k51451j72839k4444O0077J1093k26050j54514J27373
17264e45846K88973j46474k48573J98074J81803J07575R1533k5546j67713j07873
17254c74067L73350J34431n4264o1550j35476j41869k17743j3983J784K70142
17244b19245K01618L2659j67764n4892J90737j6880q5138j44094j67964J02399
17234c28564o2562J08492J39120j67904N42O1549j64529R6916M9207k46288k59030
$$ plain form
17306 -572968 -777375 -561377 -546775 -256871 -161296 -172965 -121351 -253957 -313396 -333580 -350118
17295 -350118 -213046 -233696 -149351 -319552 -336756 -304893 -515986 -540750 -526590 -670453 -543253
17284 -543253 -212439 -77162 190810 230027 -8404 99829 139632 -346371 -282188 -163174
17274 -163174 -84910 84909 -166542 -339381 -363825 -303748 -292655 -518705 -673219 -545846
17264 -545846 -256873 -403347 -651920 -453846 -272043 -164468 -72935 -98481 -266194 -374067
17254 -374067 -717 133714 79450 17900 -117576 -259445 -477188 -491171 -489387 -219245
17244 -219245 -17627 15032 -152732 -207624 -16887 -33767 -118905 -262999 -430963 -328564
17234 -328564 -391126 -282634 -143514 -311418 -310876 -249327 -413856 -316940 -267733 -514021 -773051
17223g73051K62618L6962p3952o1338n5178L61114l4956l30101J46329K93335
17213b28218k2444j2238L3619J81754Q0172o7317k27562M8354K92846P7439N3924
17202B10329o6882o5412j83388n1038p2138N3672r2151J81009j22293j11774J27735
17191a92331k2055J73469N825l1638j82573j87224k8654J328O7812K386J73824
17180b19831J8811K4044j14812J27141K15911k04729j34698l07497Q4029K07702
17170c03929l2909j26350O9869K51490L38607n3782m37996j32894J32486J22227
17160a73181k13853p1637j26388M8067O1999o812J66887k1171N7047K46538J5252
17149a7252p8325J0156J89215j53214k04623j99750k5849p6498L48467K8898p5524
$$ plain form
17223 -773051 -510433 -473471 -547423 -608761 -663939 -302825 -337781 -667882 -521553 -228218
17213 -228218 -250662 -262900 -229281 -47527 32645 -34672 -262234 -213880 78966 156405 210329
17202 210329 143447 78035 -105353 -156391 -228529 -174857 -267008 -85999 -208292 -320066 -192331
17191 -192331 -214386 -40917 -35092 -66730 -249303 -436527 -465181 -463853 -396041 -393655 -219831
17180 -219831 -201020 -176976 -291788 -164647 51264 -153465 -288163 -595660 -511631 -303929
17170 -303929 -336838 -463188 -393319 -141829 196778 142996 -295000 -427894 -295408 -173181
17160 -173181 -387034 -458671 -585059 -536992 -474993 -481805 -314918 -336089 -279042 -32504 -17252
17149 -17252 -95577 -85421 103794 -49420 -254043 -453793 -479642 -556140 -207673 -178775 -254299
17138b54299j25951l2072R4885P6956N1479j25833M7887P5332K0397J08265K0360
17127d2594k69107k2136K55320J9365j88447J02166k24408J21688J22416q1741
17117b07478p6657n6998p0796k73903o690K02121J68295K332q6315k0317P6631
17106c49775K98119p335j81993k64283j31147O475J50451J79520J8310k1655q7356
17095c90669J29910q5160K7137N7581m3761J5979l0018J04364J54554Q5226k40684
17084b15541r3421N0214m2064j19527J32161P8788o448k51278j94367r487J76609
17073d94361M03329j24986N0175j86904j03602J71894o6515N306J52461J34221
17063e8982j2578J53774N9434j88576O3128n9025M5297j12764p6299j00987o9927
$$ plain form
17138 -254299 -380250 -412322 -317437 -240481 -189002 -314835 -266948 -191616 -171219 -62954 -42594
17127 -42594 -311701 -333837 -78517 -59152 -247599 -145433 -369841 -248153 -125737 -207478
17117 -207478 -284135 -341133 -411929 -685832 -692522 -490401 -322106 -319774 -406089 -426406 -349775
17106 -349775 -51656 -58991 -240984 -505267 -636414 -629939 -479488 -299968 -281658 -303313 -390669
17095 -390669 -260759 -345919 -318782 -261201 -304962 -288983 -319001 -214637 -60083 25143 -215541
17084 -215541 -308962 -258748 -300812 -420339 -288178 -209390 -215838 -467116 -661483 -670970 -494361
17073 -494361 -91032 -216018 -165843 -352747 -456349 -284455 -350970 -345664 -193203 -58982
17063 -58982 -71560 82214 141648 -46928 16200 -42825 2472 -110292 -186591 -287578 -357505
17052c57505R8574j2344k1628Q7169L9023J35990j87340j41679k1659J68840q6599
17041b99158O1676j3629O3867J76289n8389l16461j12782K8090m3935j68047P4877
17030f07602K55178o0766j50248k2080L13552m5948l05558N0299K17661j00918
17020d56430J62051M8826J20760q805l10123k22485J89267J67690L45314O9952
17010A06017k4303k74314j79833q1163R5305j20366l1276j7036J40086K01571
17000a85312j94211q9640J60177n8307J00894p5990j05616L58099K1194j59989
16990b28701J48421o7611l98156O7916M24564k58666j98565J1652Q5074J03386
16980c10686q2076j44012j79710M09601J4871L9175Q3708K99996R8075m894j43335
$$ plain form
17052 -357505 -258931 -271275 -292903 -205734 -166711 -30721 -218061 -359740 -381399 -212559 -299158
17041 -299158 -237482 -251111 -187244 -10955 -69344 -385805 -498587 -470497 -514432 -682479 -607602
17030 -607602 -352424 -413190 -563438 -585518 -271966 -317914 -623472 -573173 -355512 -456430
17020 -456430 -294379 -245553 -124793 -133598 -443721 -666206 -476939 -309249 36065 106017
17010 106017 81714 -192600 -372433 -453596 -358291 -478657 -509933 -526969 -386883 -185312
17000 -185312 -379523 -469163 -308986 -367293 -266399 -342389 -448005 -89906 -68712 -228701
16990 -228701 -80280 -147891 -546047 -478131 -53567 -312233 -510798 -499146 -414072 -310686
16980 -310686 -392762 -536774 -716484 -306883 -292012 -252837 -169129 130867 228942 224048 80713
16969H0713m3328k57274r0252k25828j67261k903n3639m6376J06656n865J4518
16958f90839L2111R7628L05618Q6137J13394J26233n1745m365k40457l36516J86742
16947c76059K52225p6569Q6936k6727L3234j49292m7056J86751K43080J42771
16937B69294k40298j10292J9219O0315r5198m8298J3335n7745j6193M3121r98
16926a63738m4177J30369j37309j03820j33508l7567O1669O2737l133l1327n6894
16915d56698o446k4907J0891O7482o2240M1025N3058j87535O2049J87039J82827
16904a33455k2284j17943j6104J67712R6796k04642j32685q0045L88905J10070
16894E6325q6013q5606q3236p7084J93597k6696j16129K31013q8823j62396J39295
$$ plain form
16969 80713 37385 -219889 -310141 -535969 -703230 -706133 -759772 -806148 -699492 -705357 -690839
16958 -690839 -658728 -561100 -255482 -169345 -55951 70282 18537 14172 -226285 -562801 -376059
16947 -376059 -123834 -200403 -113467 -140194 -106960 -256252 -303308 -116557 126523 269294
16937 269294 28996 -81296 -62077 -1762 -96960 -145258 -131923 -189668 -205861 -162740 -163738
16926 -163738 -207915 -77546 -214855 -318675 -452183 -489750 -428081 -365344 -368477 -399804 -456698
16915 -456698 -463144 -488051 -477160 -409678 -471918 -430893 -377835 -565370 -503321 -316282 -133455
16904 -133455 -155739 -273682 -289786 -122074 -25278 -229920 -362605 -442650 -53745 56325
16894 56325 -29688 -115294 -198530 -275614 -82017 -108713 -224842 6171 -82652 -245048 -105753
16883a05753l43944j18630Q1061p000P8203l0029M1321J36147j95214r550L16021
16872a57367K8405J44509n0474k3913j08244r69J18484P3034o3766O8694j150
16861B7243k77144l36165J05033J16474L8918Q0549R4186p2102k27927q5132Q6172
16850d49895K78733r1662j83977J38287n0934l6719o943o9001J42976R9210k80465
16839e10390K4362K04167l5336m5338P9670l0693J02402M3911k50559K0928K97058
16828i9818K02203R7354J28962L9158j45375k38309J90721M2720q8218j13475
16818A5923m1024m0818j29786m38214K18036L06094k0923k41940j2441K11970
16808a73123J22857r8828J86606L2540J60927p0633J21748n5070r8901j54967
$$ plain form
16883 -105753 -449697 -568327 -487266 -494266 -416063 -446092 -404771 -268624 -463838 -473388 -157367
16872 -157367 -128962 15547 -34927 -58840 -167084 -168053 -49569 23465 -40301 28393 27243
16861 27243 -249901 -586066 -481033 -364559 -325641 -245092 -150906 -223008 -450935 -536067 -449895
16850 -449895 -171162 -262824 -446801 -308514 -359448 -396167 -403110 -472111 -329135 -229925 -510390
16839 -510390 -486028 -281861 -317197 -362535 -282865 -313558 -211156 -167245 -417804 -396876 -99818
16828 -99818 102385 199739 328701 367859 222484 -15825 174896 217616 129398 15923
16818 15923 -25101 -65919 -195705 -633919 -415883 -109789 -130712 -372652 -385093 -173123
16808 -173123 -50266 -149094 37512 70052 230979 160346 282094 227024 128123 -26844
16798b6844k56945l3683k56873P8641K42449o0029K179l3203L6200J20158K13089
16787B5139j16505k32902j23443N8458q946L7988K72157Q1539j18051J89636N9547
16776A24617J15830M3466l45918k78596J25034K57390r5439Q018j6308K0815m5593
16765h6684j33079J62632l2810k16151j36889K49355K84430L0346K91578K2290
16755D35018j56194j63665j94397m5442p8388K98660K97487j83568k31439p7221
16745i9149m81636K0376J82334L2423j2047k2540j06049K52220L33594K36578
16735C36104k6260o2136J79268l6741k67949J2231J83489k0003j48940j28803
16725B0260o1085j68618r4340K24557r5299P3721M6122n4128j77431j00706J60592
$$ plain form
16798 -26844 -283789 -317472 -574345 -495704 -253255 -313284 -311105 -344308 -308108 -187950 25139
16787 25139 -91366 -324268 -447711 -389253 -398199 -360211 -88054 -6515 -124566 65070 124617
16776 124617 240447 283913 -62005 -340601 -215567 41823 -53616 -45598 -61906 -41091 -86684
16765 -86684 -219763 -57131 -89941 -306092 -442981 -193626 90804 121150 412728 435018
16755 435018 278824 115159 -79238 -124680 -203068 95592 393079 209511 -21928 -99149
16745 -99149 -580785 -560409 -378075 -345652 -357699 -380239 -486288 -234068 99526 336104
16735 336104 309844 247708 426976 390235 122286 134517 318006 298003 149063 20260
16725 20260 -40825 -209443 -303783 -79226 -174525 -100804 -54682 -108810 -286241 -386947 -226355
16714b26355J59825k1095O251J05582L2004J00251m7587j22136r4590J09900o0313
16703e8263N8788J36730j41154j47453K41904k4235Q8044r2746k06012j10149
16693b54546j28009J11492M9217j45788J919K01613K52207k7722j01654j53874
16683a95145L3016J85443Q8154L9417r7332j47351j06481l2179m5173L01117L79780
16672D03266j18705j68448J25404r1212k64470k8653j22012O86J84537j36498
16662b16105r7312J24085K54440J13611O0678K26682j2897j37470p2306j48610
16652I4796k15270k91064K9743K67920J54217J72349N6779j47023k06630L5956
16642d8227P2622j05794N3189J03644k5059K56614k76324l40127K7394j65275
$$ plain form
16714 -226355 -66530 -87625 -81374 24208 56212 156463 108876 -13260 -107850 2050 -58263
16703 -58263 525 137255 -3899 -151352 90552 66317 154361 61615 -144397 -254546
16693 -254546 -382555 -271063 -221846 -367634 -365715 -164102 88105 60383 -41271 -195145
16683 -195145 -162129 23314 111468 150885 53553 -93798 -200279 -232458 -277631 23486 403266
16672 403266 284561 116113 241517 150305 -114165 -142818 -264830 -264144 -79607 -216105
16662 -216105 -313417 -189332 65108 178719 239397 466079 453182 315712 243406 94796
16652 94796 -120474 -411538 -381795 -113875 40342 212691 269470 122447 -84183 -48227
16642 -48227 24395 -81399 -28210 75434 50375 306989 30665 -309462 -282068 -447343
16632d47343Q8594j07041J94850J02146J21985j0488r6832J36J4357p9965m7539
16621b67140L5391K01623J4771l3612R5611M8091j2864N259p6639j10216r9241
16610a98966q6983K14062m8444J35464J63362M9340M8406k36192j41393K0658
16600h0686J16097O748k03036K35168J11533r4875m5312p8071O1988N9153N3542
16589A42249N7996k414J71788n4104j88146j58153j03074q4538R7335P1972j6542
16578f5631P0020J71381o9899J20200l8948K3450o23j00587k65250j59098N00879
16567A85894K71923k22792k71282j30283k2009o7629J41711J20437l40225Q866
16557c25389J34641j11678R3561O606k4528J32907J35866K95705R5817j70985
$$ plain form
16632 -447343 -358749 -465790 -270940 -168794 -46809 -57297 -154129 -153993 -139636 -219601 -267140
16621 -267140 -231749 -30126 -15355 -48967 46644 94735 81871 87130 10491 -99725 -198966
16610 -198966 -285949 -71887 -120331 15133 178495 227835 276241 40049 -101344 -80686
16600 -80686 35411 42159 -160877 74291 185824 90949 45637 -32434 29554 88707 142249
16589 142249 200245 197831 369619 315515 127369 -30784 -133858 -218396 -121061 -49089 -65631
16578 -65631 4389 175770 105871 226071 187123 210573 209950 109363 -155887 -314985 185894
16567 185894 457817 235025 -36257 -166540 -188549 -256178 -114467 5970 -334255 -325389
16557 -325389 -190748 -302426 -208865 -202259 -226787 -93880 41986 337691 433508 262523
16547B62523n1850J66223K02687J90560K40730K42701M92477N2160j95277r0140
16537A512794J9196K1994J54469L24099L20131M50421k0352m22222k29850k42630
16527A888050j42972Q4476q9754J10560O34244N98154J35208m0289l54376p44831
16517B078470n67971j16458j9468j39416j75532j22176j2752O1924p1096K1551
16507I37076j85145j66300l4237L1516Q1161K91502K32792k81145m03047j36410
16497C67763j90431K0291m5005l29476k51122K95869L49080k82036n4776K49027
16487A29184l2000k4133K4890M9412n1540m8852P1856N6338N1701j23174O7730
16476A71412K59469m7832k9793n3262j07389J36010J3279Q0253r9100j57429j61546
$$ plain form
16547 262523 210673 376896 579583 770143 1010873 1253574 1746051 1798211 1602934 1512794
16537 1512794 1531990 1553984 1708453 2032552 2352683 2803104 2782752 2360530 2130680 1888050
16527 1888050 1745078 1829554 1739800 1850360 2484604 3082758 3217966 3177677 2823301 2078470
16517 2078470 1510499 1394041 1374573 1235157 1059625 937449 924697 986621 915525 937076
16507 937076 751931 585631 551394 582910 664071 955573 1188365 907220 504173 367763
16497 367763 177332 197623 152618 -176858 -427980 -132111 216969 -65067 -119843 129184
16487 129184 97184 73051 97941 147353 95813 46961 118817 175155 226856 103682 171412
16476 171412 430881 383049 353256 299994 192605 328615 341894 422147 323047 165618 4072
16465D072q63J80526k7078l9458R4889m1461N0284j7051j9930o5111J12658N2182
16453B83659K9586R8738n3167K05871J94691O7091K10298K36653r7782Q8344Q4061
16442A348043n507o3798L19723M08250N07812N7758j69754P4719p7443j16451
16432B283352j66333j00159r5407J68511M09560R3957j46548R732j49121k40336
16422B067208l80255l14587j44757j43296j35785j55489J00479j4935k92128k22638
16412C63817l5382j58730n0587l8077k43805k20128J3939L30061K02559K24955
16402C88622n8769Q2913j48056k11839M0161L879r4625N5443j39874O9132k2855
16391c5868k42736j43862K60526J26586K0677P3146j13631j49225j56069j54898
$$ plain form
16465 4072 3209 183735 156657 117199 212088 170627 220911 203860 183930 118819 231477 283659
16453 283659 313245 411983 358816 564687 759378 826469 1036767 1273420 1175638 1263982 1348043
16442 1348043 1342536 1278738 1598461 2006711 2514523 2572281 2402527 2477246 2399803 2283352
16432 2283352 2117019 2016860 1921453 2089964 2499524 2593481 2446933 2456665 2307544 2067208
16422 2067208 1686953 1372366 1227609 1084313 948528 793039 893518 878583 586455 363817
16412 363817 328435 169705 119118 81041 -162764 -382892 -368953 -38892 163667 388622
16402 388622 329853 412766 264710 52871 93032 96911 2286 57729 -82145 -13013 -35868
16391 -35868 -278604 -422466 -161940 -35354 -14677 58469 -55162 -204387 -360456 -515354
16381e15354J25142J00194j09291M7773K16765K41489J14629n2183m0330J03152
16371B31986O2205j8915k3414N3699j13664j53834k7912k006J26956J57320J16069
16360D08490l08444j38701J5518k3221O3372L9645R4746m2872j57543r9650K9101
16349a19559j83440J4050J37710m8499j7107J00469P7493j13410o087J78602O5524
16338H5746k9368j63981k4422O5930L5168M0062J25425j8004R6787l1548j72220
16327I575J78707J61558k0995k41849J3151Q3942J26397q2985k9958m3267j65535
16316a1259J26080J77028j02K9845M2299n8289N2500J06991j61012l38710j5331
16305d9960m2023N2547k9152j4697m2076p2746p2612j60020K75357J29458p8722
$$ plain form
16381 -515354 -390212 -290018 -399309 -351536 -134771 106718 221347 169164 128834 231986
16371 231986 294191 275276 251862 305561 191897 38063 10151 8145 135101 292421 408490
16360 408490 100046 -38655 -23137 -46358 17014 56659 151405 108533 -49010 -148660 -119559
16349 -119559 -302999 -288949 -151239 -199738 -216845 -116376 -38883 -152293 -158380 20222 85746
16338 85746 56378 -107603 -132025 -66095 -30927 9135 134560 116556 213343 181795 9575
16327 9575 188282 349840 328845 86996 100147 184089 310486 227501 197543 154276 -11259
16316 -11259 114821 291849 291747 321592 363891 305602 358102 465093 304081 -34629 -49960
16305 -49960 -91983 -39436 -68588 -83285 -125361 -198107 -270719 -430739 -155382 -25924 -104646
16294a04646k94049L0344K09966K10936K03842j70527j79921L3265J74566j05978
16284G798k84338o2676J2855J77576R6266j50515J08544j47608n1325J69192j59338
16273b83569J74513L32065k12338j63021J8009k1705K27555o1645j8849J31051
16263A22066j51450o6J83876R2016L5650M6598P2451j63201n1327P6461R3980
16252C57054O5905L5343r0094j35394N9890m4581j26889M6441J84512P0752k11280
16241B11659K84395K97014P6921O3088p189l707j64789k56888m5464j95660k31299
16230B8081j07289N3861K13182o5422L511j06324j07856O1695J20264K83974n4166
16219C23511j49576k8987Q382L2536k69725M6335l35719j77731L03340K60243
$$ plain form
16294 -104646 -398695 -368351 -158385 52551 256393 85866 -94055 -60790 113776 7798
16284 7798 -276540 -339216 -326361 -148785 -52519 -203034 -94490 -242098 -293423 -124231 -283569
16273 -283569 -109056 223009 10671 -152350 -134341 -156046 71509 9864 -8985 122066
16263 122066 -29384 -29450 154426 246442 282092 328690 401141 237940 186613 263074 357054
16252 357054 422959 458302 368208 232814 292704 248123 121234 167675 352187 422939 211659
16241 211659 496054 793068 869989 933077 925888 922181 757392 500504 455040 259380 28081
16230 28081 -79208 -25347 187835 122413 125924 19600 -88256 -26561 93703 377677 323511
16219 323511 173935 144948 153330 185866 -83859 -37524 -373243 -550974 -247634 12609
16209A2609q9230J01016L05483J80765M946k00087N4986p3184K4481L7639k75454
16198H3970J60291J30929L0307K07493J07935k73940j54552O1231J3408J5163
16188C82235p7627R0165J50721J8025L2783k21924Q5881J21178q0615j04378k9260
16177C67184N6293J3436j66225J26146M9672R2265Q7176J78817O1560J37908J74395
16166A178627M58138O60788L13609J1732K51245J37556M68404Q08948R88427J338207
16156F615681K138687L140915M175421M771612M370940J686595k186202m468717
16148B0244932m459717l295162k339858j514551j024113j93940p67754o26352
16140F023485n34168m60495o34061k63386l46317k28695j02083r2915O0794M4261
$$ plain form
16209 12609 -76621 24395 329878 510643 515589 315502 370488 297304 321785 359424 83970
16198 83970 244261 375190 405497 612990 720925 446985 292433 353664 367072 382235
16188 382235 304608 394773 545494 563519 596302 374378 460259 581437 500822 396444 367184
16177 367184 423477 436913 270688 396834 446506 538771 625947 804764 866324 1004232 1178627
16166 1178627 1636765 2297553 2611162 2622894 2874139 3011695 3480099 4289047 5277474 6615681
16156 6615681 8754368 11895283 16070704 20842316 25213256 26899851 24713649 20244932
16148 20244932 15785215 12490053 10150195 8635644 7611531 7417591 6649837 6023485
16140 6023485 5489317 5028822 4394761 4131375 3785058 3556363 3454280 3361365 3422159 3466420
16130C466420o352j49634K12982L09055J52176J91822M22202N14811M53830J85229
16120E752541K92320N50258J051135J929830K683008M025282N872138Q358284
16112C0514796J0548542J0951244O267138k815015j0397769j1249164p612929
16105B6206843m955014l414938k000964j364840q66383p28320q98809j029199
16097A0948376n27731l49390j77242K82422N15808J094988K195633L251311M739049
16088B1973224N562365M838503J845546k683113n179125m957436l619089k287937
16080A5492938j403682p35882m49020k50397Q3825P38236J326897K183188L212808
16071B0198911M220109M271448K505198q07484l855534m771685m127486k675699
$$ plain form
16130 3466420 3460068 3310434 3523416 3832471 3984647 4176469 4598671 5113482 5567312 5752541
16120 5752541 6044861 6595119 7646254 9576084 12259092 16284374 22156512 30514796
16112 30514796 41063338 52014582 58281720 55466705 45068936 33819772 26206843
16105 26206843 21251829 17836891 15835927 14471087 13604704 12876384 11977575 10948376
16097 10948376 10420645 10071255 9894013 10176435 10692243 11787231 13982864 17234175 21973224
16088 21973224 27535589 32374092 34219638 31536525 26357400 21399964 17780875 15492938
16080 15492938 14089256 13353374 12904354 12653957 12737782 13476018 14802915 16986103 20198911
16071 20198911 24419020 28690468 31195666 30388182 26532648 21760963 17633477 14957778
16063A4957778j753524j157880r17178l46875j00815j72770J50937L17183P42335
16054A1719191Q29980J346339K168480L292913N144004P566714J1085132J5171342
16046E8324095J7157305J2808396J498248r600478j3907104j3273518j0900124
16039D2106820p720455n282013l760378k920777k337329k146878j879924j791842
16031A4267224j294271j195197r18360q87942q00139q33372l62462l52730j03209
16022G519542j5559k02228k09728k20583J69431M92356N78442O96120O20679P71628
16012A0200100J454529K120404K572035L920220N934731Q345995J1291395J3979064
16004E9818473J4789724J2050890N298949n232289j4476865j6815741j2653069
$$ plain form
16063 14957778 13204254 12046374 11129196 10782321 10681506 10508736 10659673 10976856 11719191
16054 11719191 12549171 13895510 16063990 19356903 24500907 32067621 43152753 58324095
16046 58324095 75481400 88289796 89788044 80187566 66280462 53006944 42106820
16039 42106820 34386365 29104352 25343974 22423197 20085868 17938990 16059066 14267224
16031 14267224 12972953 11777756 10859396 9971454 9171315 8337943 7975481 7622751 7519542
16022 7519542 7503983 7301755 7092027 6871444 7040875 7533231 8111673 8807793 9428472 10200100
16012 10200100 11654629 13775033 16347068 20267288 26202019 34548014 45839409 59818473
16004 59818473 74608197 86659087 91958036 86725747 72248882 55433141 42780072
15997D2780072q185369n316273l561828k526355k021846j721466j776791j619167
15989A6050977r95289n92003o13981m4662M29230J088013J843625L039422M597139
15980B4802471N693200N769881K996235j914220n512857o014599m370476k898883
15972A8550752k110965j276363o33286k3516L23037M05733J096846J890792L145964
15963B1368994M750271N660457M377288M62452l855835o064527n553775l752853
15955A7392472k350773j442905j173154m86296l95918m03603j05896R177N01959
15946A1545063R84891R22903J478689K716517M372874O507697R181069J2583729
15938E0293432J4216710J0462481l145j1467657j5323574j1632296p541022n095310
$$ plain form
15997 42780072 34594703 29278430 25716602 23190247 21168401 19446935 17670144 16050977
15989 16050977 15055688 14463685 13849704 13805042 14234272 15322285 17165910 20205332 24802471
15980 24802471 30495671 36265552 39261787 37347567 31834710 25820111 21449635 18550752
15972 18550752 16439787 15163424 14530138 14506622 14829659 15235392 16332238 18223030 21368994
15963 21368994 26119265 31779722 36157010 36619462 32763627 26699100 21145325 17392472
15955 17392472 15041699 13598794 12425640 11939344 11543426 11139823 11033927 11043104 11545063
15946 11545063 12529954 13452857 14931546 17648063 22020937 28528634 37709703 50293432
15938 50293432 64510142 74972623 74969478 63501821 48178247 36545951 29004929 23909619
15930B3909619l371628k488822j903059j541319j315804j305074j350494j377611
15922I255808p81348r47900r77836o19238l77505l88888m07511l08850j75208
15913D271524o195q4668j90174J23521K24064M40731J94091J43142L92330Q18309
15903F326675Q91631J333960K122030L091139M396464N753630O450352M898062
15895C5263943O74974m083841o568028n780208m083764k866115k172390j329489
15887I055082p38846p31704q73560r37824j093574n57635l76950l82404l85274
15878B977311j06052o1455m37858k20187k53106j73193m6613l7119k49960l35002
15868A056766j52768q4679N1033k58574k05174l28990o8123J11073o4947j27276
$$ plain form
15930 23909619 20537991 18049169 16146110 14604791 13288987 11983913 10633419 9255808
15922 9255808 8474460 7526560 6548724 5929486 5551981 5163093 4755582 4446732 4271524
15913 4271524 4265329 4180661 3990487 4114008 4338072 4778803 4972894 5116036 5508366 6326675
15903 6326675 7218306 8552266 10674296 13765435 18161899 23915529 30365881 35263943
15895 35263943 35938917 31855076 25287048 19506840 15423076 12556961 10384571 9055082
15887 9055082 8316236 7584532 6710972 5773148 4679574 4121939 3744989 3362585 2977311
15878 2977311 2871259 2809804 2371946 2151759 1898653 1725460 1678847 1641728 1391768 1056766
15868 1056766 903998 819319 870352 611778 406604 77614 9491 120564 55617 -71659
15858g1659J01232J04243r1377j09655J25909K68609k74826L1003K15505N4076
15848C53060q453k22126r5838Q4831N5187K88533N09n7516R0328k38963n8784
15837A90768Q3681m9455k2710j19173j01798J04397K88199j38619j40222q520
15827H6548J3149n7871K60052J54368L7147r4517k47617j40770K42369O4899K9712
15816C47469l11780r7031p9902K10239J3733q5822L5517K2591K1035o6155K7104
15805C6998K0296q8607k45208J00927K4532j69817J0620k13422p6438K59213m7013
15794c87919N6852l8872j77311J08041K07293J00288j772j8849J5154J3237J115
15783a22743o9669l3978J10467K33640K9921k83630J006L0818p937R3344n6j04438
$$ plain form
15858 -71659 29573 133816 42439 -67216 58693 327302 52476 83479 298984 353060
15848 353060 344607 122481 26643 111474 166661 455194 455703 398187 488515 249552 190768
15837 190768 274449 224994 202284 83111 -18687 85710 373909 235290 95068 86548
15827 86548 99697 41826 301878 456246 493393 398876 151259 10489 252858 317757 347469
15816 347469 35689 -61342 -141244 68995 82728 -3094 32423 55014 76049 9894 36998
15805 36998 57294 -31313 -276521 -175594 -151062 -320879 -310259 -523681 -600119 -340906 -387919
15794 -387919 -331067 -369939 -547250 -439209 -231916 -131628 -133400 -152249 -137095 -123858 -122743
15783 -122743 -192412 -226390 -115923 117717 147638 -135992 -134986 -104168 -112105 -18761 -18817 -123255
15771a23255m0830M2159k24657m3176M46791J66758j73071p8173k0555j25349
15761a73358j03654k1378M1250J2337m5246Q4853K13135M3435o0093q8606m5033
15750a42358j9825J10909O3483j63622K5687J81847J05552r9982l0121l10717
15740b79147k79374K21442r3818j58735K3401k0523k9808j3474K71196r8507j13343
15729e70690K66013N5079q4300j07073J92133P0953J48353j83419n9417J10305
15719a62063N2340j43855p1208J4148K71344L18982j54029m5537J9520j80629
15709h0987q8622M3557K43048J08798q9184j36371j036r973l68729m426K19630
15698a64295L6758K2480l1495M122o318K05108P4931q3791m31918l74752K24157
$$ plain form
15771 -123255 -164085 -121926 -346583 -389759 57032 223790 50719 -27454 -48009 -173358
15761 -173358 -277012 -298390 -257140 -244803 -290049 -205196 7939 51374 -8719 -97325 -142358
15750 -142358 -162183 -51274 12209 -151413 -125726 56121 161673 61691 31570 -279147
15740 -279147 -558521 -337079 -430897 -589632 -566231 -586754 -616562 -630036 -358840 -457347 -570690
15729 -570690 -304677 -249598 -333898 -440971 -248838 -177885 -29532 -212951 -272368 -162063
15719 -162063 -109723 -253578 -324786 -310638 -39294 279688 125659 80122 99642 -80987
15709 -80987 -169609 -126052 116996 225794 136610 239 -797 -10770 -379499 -383925 -164295
15698 -164295 -127537 -105057 -136552 -132430 -138748 66360 141291 57500 -374418 -749170 -525013
15687e25013J99012m6485K07251P2740J963o7331J12611J07800k99356j13322
15677c50130k07257K43246M05368m5205j9294n6413M935J142J62027N8554j49337
15666D7636q9655M316O1801J06652n1266j26912L0146M5110R0531J03602J6403
15655B38364k21157j01765Q4055k40939j88489L14487J63297k48364j42529J56383
15645a86657j04741j36443n1124J00669Q1640J50180j80927J55398m8038r4753
15635c14796L20683j1071J38675j50333k89327j24254J96042J32195J75693J65107
15625B38614k550p279k60257p2802j89121J6511K3296J35539Q8281q6085n65J57446
15613D1028Q4582k45251o7676J23907J11899j62918J29009J32269j45329P6763
$$ plain form
15687 -525013 -326001 -372486 -165235 -92495 -90532 -157863 -45252 62548 -236808 -350130
15677 -350130 -557387 -314141 91227 46022 26728 -29685 -24750 -23608 138419 196973 47636
15666 47636 -42019 -37703 24098 130750 79484 -47428 -17282 27828 118359 221961 238364
15655 238364 17207 -84558 -503 -241442 -429931 -115444 47853 -200511 -343040 -186657
15645 -186657 -291398 -427841 -478965 -378296 -296656 -146476 -327403 -172005 -220043 -314796
15635 -314796 5887 -5184 133491 -16842 -306169 -430423 -234381 -102186 73507 238614
15625 238614 236064 228785 -31472 -104274 -293395 -276884 -253588 -118049 -29768 -115853 -116418 41028
15613 41028 125610 -119641 -187317 -63410 48489 -114429 14580 146849 1520 78283
15603G8283n3226p231R9089j28098j45434K80439N8916j41335n4918R565j76428
15592a80378n4061m9455K93383K54679j7629n8709O4417P7575L4261j83993n8127
15581A21963p5896o9485P0300k4565j96273k0876j10800P1256q3869o3598j27780
15570e09623l5540M58544L69529j67902j90469L7544J43307l3972j51960O7267
15560a3275Q340k96479m9723L45893K72211j52929j27426j06926r9982J05702
15550a14594p3865n7952P9926M5510K0451J50742L7431k4847M11696J35110O3399
15539F73007J05428k20589k79807n6719n6567N1381j75555K25361l8534r4182
15529A33224j37975O022j34822k3883o4165J27257P0981L6863J56565p8703k05432
$$ plain form
15603 78283 25057 17826 116915 -11183 -156617 123822 182738 41403 -13515 -3950 -180378
15592 -180378 -234439 -283894 9489 264168 246539 187830 252247 329822 364083 180090 121963
15581 121963 46067 -23418 46882 22317 -173956 -194832 -305632 -234376 -318245 -381843 -509623
15570 -509623 -545163 -86619 282910 115008 -75461 -37917 105390 71418 -80542 -13275
15560 -13275 -4935 -301414 -351137 -5244 266967 114038 -13388 -120314 -220296 -114594
15550 -114594 -188459 -246411 -166485 -120975 -100524 50218 87649 62802 474498 609608 673007
15539 673007 778435 557846 278039 221320 164753 216134 40579 265940 227406 133224
15529 133224 -4751 1271 -133551 -157434 -221599 -94342 -23361 13502 170067 91364 -114068
15518a14068J97199m2856P3922j30177k12064P6143K62958J45676p5051k4223
15508A57459r5097j81959p7081O5489J85882K6613M7501J81392j35133q6383J10489
15497A99172R0810l7554m279j6410n2226j16746j84225m701J98361J93951k70124
15486c971n5707q4285K2935L9481n0749n3341J17440k0944N0415j45843q7193
15475b71762l8063j14665R1330L4639J17062J96674j69868J29560K7969J93301
15465A96177K28448j18350q9827j00565J61844k1793k75587j02132k11368k3829
15455c56982J56075L3640r8528j5893J56887j87001p6242J09497K94489j49807
15445a33865O9913M7250J7787K1065l9588k12887k08953r795K58786J48949j42832
$$ plain form
15518 -114068 83131 40275 114197 -15980 -228044 -151901 111057 256733 181682 157459
15508 157459 62362 -119597 -196678 -131189 54693 81306 128807 310199 175066 88683 199172
15497 199172 289982 252428 248149 231739 179513 62767 -121458 -126159 72202 266153 -3971
15486 -3971 -59678 -143963 -121028 -81547 -132296 -185637 -68197 -89141 -38726 -184569 -271762
15475 -271762 -309825 -424490 -333160 -298521 -181459 15215 -154653 -25093 2876 196177
15465 196177 424625 306275 216448 115883 277727 255934 -19653 -121785 -333153 -356982
15455 -356982 -200907 -167267 -265795 -281688 -124801 -311802 -388044 -278547 15942 -133865
15445 -133865 -63952 -16702 1085 22150 -17438 -230325 -439278 -449073 -190287 -41338 -184170
15434a84170M5077K85734K48245M6743p6257k1394l07186q5729K07850J11826
15424B70739k76616k11398j36197J77205k896J23313J45438P1477j18246q7903
15414d5084J74097j2524k24675P172l4932J9850K59877j24908p6030J5631n1952
15403i3478J23603J49136P2732M057j34084N7741K96087L20616o0721q5381Q9700
15392G40008j12439m8142M2834j03392J34807P0946k0761q7613j13887j51207
15382C51154K8242K30193m1984k357J66382k2961p2417j62651o0941J23974L8011
15371E74645r2128q8411k21140q0289J21751P8674n5956L5473n1679j36383p752
15360G6805k49119K8584K07630J9382j14020j54712L8920K10972p1058r6853R4227
$$ plain form
15434 -184170 -139093 146641 394886 441629 365372 343978 36792 -48937 158913 270739
15424 270739 -5877 -217275 -353472 -176267 -179163 -55850 89588 161065 42819 -45084
15414 -45084 129013 116489 -108186 -101014 -135946 -116096 143781 18873 -57157 -41526 -93478
15403 -93478 30125 179261 251993 256050 121966 179707 475794 796410 735689 650308 740008
15392 740008 627569 579427 622261 518869 653676 724622 703861 616248 502361 351154
15382 351154 379396 609589 567605 565248 731630 708669 636252 473601 412660 536634 574645
15371 574645 482517 394106 172966 92677 214428 293102 237146 272619 220940 84557 76805
15360 76805 -172314 -143730 63900 83282 -30738 -185450 -146530 64442 -6616 -103469 -9242
15349i242N5991O8486J3522J61113j08792L2044k8027j32L2039J1555Q6243Q1923
15337C96723Q7875K7716p6091J1703k98148j85892p527j02412q4085O2424J72092
15326D378J94279K833l2288K00108K36946J18832k06720o1810J03546J36762J48650
15315H45516J1071m56231l57950K69235M72620M05761j6975j09896N2984P3514
15305A189649J7112k05962m8749o7201M7850J46741k44268l44352o1811P6467
15295E05476l0401J40935P348k21917j82597R4896J11501K1469r8536n6893l3341
15284B57940k07092l1301O4289j1742j39020j37914K01105L5556K02786J6175
15274B50782j04946j24208R3185m8789k8013J08013O6034o1927O0479j29404m2134
$$ plain form
15349 -9242 46749 115235 128757 289870 181078 213122 185095 184963 217002 228557 314800 396723
15337 396723 484598 512314 436223 447926 149778 -36114 -43641 -146053 -230138 -167714 4378
15326 4378 198657 201490 169202 369310 606256 725088 518368 456558 560104 696866 845516
15315 845516 856587 400356 42406 311641 784261 1190022 1173047 1063151 1116135 1189649
15305 1189649 1206761 1000799 952050 884849 932699 1079440 835172 490820 429009 505476
15295 505476 475075 616010 623358 401441 218844 313740 425241 446710 348174 291281 257940
15284 257940 50848 19547 83836 72094 -66926 -204840 -3735 31821 234607 250782
15274 250782 145836 21628 114813 66024 38011 146024 212058 150131 210610 81206 39072
15263C9072k7900j0770K1768J03397N5977j04984j15444R6741J00674L0641l9270
15252A49902j04591k48435j10473L3293M4266R9816K6285J09939J53030J78597
15242C31629k04551j54052M3489k48408J34751J34585P4191K9368j44853j61165
15232a65016j6554M9372M0578M6147k21734J54179K86654R7046p0869j99495j8849
15221a8541K22351R2716N2080o9682J6497L0857k6180n5827k74450n3673j8817
15210a02669j83866j650n2799J09396R1941k6582k3993j7014R3992L83826M81457
15199G52039q3261k17772M089J32997j46412M2478K34924K356j54156L0963O0102
15188F58347l7409k78648k74879K0626n4995J21052M07477o7769j05033p8685
$$ plain form
15263 39072 11172 402 22170 125567 181544 76560 -38884 57857 158531 189172 149902
15252 149902 45311 -203124 -313597 -280304 -236038 -136222 -109937 2 153032 331629
15242 331629 127078 -26974 16515 -231893 -97142 37443 111634 141002 -3851 -165016
15232 -165016 -181570 -132198 -91620 -45473 -267207 -113028 173626 270672 199803 308 -18541
15221 -18541 203810 296526 348606 278924 295421 326278 300098 244271 -30179 -83852 -102669
15210 -102669 -286535 -288185 -340984 -231588 -139647 -166229 -190222 -207236 -113244 270582 752039
15199 752039 668778 451006 455095 588092 441680 484158 719082 721438 567282 598245 658347
15188 658347 620938 342290 67411 88037 33042 154094 561571 493802 388769 310084
15178C10084k8419J5385l3238j22197j58046J81825j98332l513K24093j51947
15168C5695k09802P3660m7473K31418L42560K3661j62001j52640R0966O3661Q841
15157B98546k0756j14221j20891R0101J0642O0972R3142j50136k5913j61922k68483
15146c08919Q0837k8957P2192L72759P5320J58481Q7715J26066K97810j91753
15136G41551j89198p346P5886j61056l8481j82930l56749P8725K18198O9748L0054
15125B78402j23155k25068k1497K49183J96393J28725j69481m3777J93483K15016
15115F78224o8884k31165j96429J3428J42935j7693K44331J83917l58002j2763
15105C77899J06454o6776q0054m0554j21783k18896L29869J36003j1229j3761
$$ plain form
15178 310084 281665 297050 263812 141615 -16431 165394 -32938 -36451 187642 35695
15168 35695 -174107 -100447 -147920 83498 426058 449719 287718 135078 226044 289705 298546
15157 298546 277790 163569 42678 132779 143421 204393 297535 147399 121486 -40436 -308919
15146 -308919 -228082 -257039 -184847 187912 263232 421713 509428 635494 933304 741551
15136 741551 552353 545007 620893 459837 421356 238426 -118323 -39598 178600 248348 278402
15125 278402 155247 -69821 -91318 157865 354258 482983 313502 269725 463208 678224
15115 678224 609340 378175 181746 195174 338109 320416 564747 748664 390662 377899
15105 377899 484353 417577 337523 296969 175186 -43710 286159 422162 410933 397172
15095C97172k89051N8958J55330N9573K56700J15557j85862k19606M1174j01900
15085B88045P3332q3994j60810j5428O6748O1474J9732J61070R3940j14199n4009
15074C35901J50929O6455K15789l670k21062j10462k44151m4127R2733L4155K52984
15063E25474J16160j81459r874j28418l6965L5166q6500J23784K88904j72719
15053D73553j05564N6697J03951k7072q6427j24744j50287p7378M9769J98463
15043C10961o5781k2221L64660k38975l05841o1862j11496K24756K90337o0093
15033C24445j58329J28847M9193N1418Q7167p6026M557p0561Q7404L8366J54923
15022F21404P6793l4531l46096k88675L3918K97984J96679q2029N4377J70417
$$ plain form
15095 397172 108121 167079 322409 381982 638682 754239 568377 348771 389945 288045
15085 288045 361377 277383 116573 101145 167893 229367 249099 410169 504109 389910 335901
15074 335901 486830 553285 769074 765404 544342 433880 189729 145602 238335 272490 525474
15063 525474 641634 460175 450301 321883 284918 320084 233584 357368 646272 473553
15053 473553 367989 424686 528637 501565 415138 290394 140107 62729 112498 310961
15043 310961 245180 222959 587619 348644 42803 -19059 -130555 94201 384538 324445
15033 324445 166116 294963 344156 395574 482741 406715 411272 340711 428115 466481 621404
15022 621404 698197 663666 317570 28895 62813 360797 557476 475447 529824 700241
15012G00241l0973l10456p5334K18366N119Q7712J81440L2051p8442j79799n5069
15001D94856n1162j33051n4028n1102K48557J99638l2042r8125J8580J9582m1477
14990E20226j80548J12951J05500r0245k04369J70163R2387l8112m0365J26969
14980E74557l2726k68498O6336J85276k61762j96555J1513L13265J97554K80040
14970H69000p8842m8167Q9402O6722j45581l0710r4998j19646j12730j1931L20945
14959G03464j539k61016j32347K92781K28639K56865p9388j13733r3402q1210
14949G19114P55j59891Q5058N1513P6300p668J17148K46296l1905j06157J48265
14938A138828J00302l4047J48470R2090j24058L8539K17574n7427j17250l0236
$$ plain form
15012 700241 669268 358812 283478 501844 506963 594675 776115 808166 729724 549925 494856
15001 494856 443694 310643 256615 205513 454070 653708 621666 523541 542121 561703 520226
14990 520226 339678 452629 558129 467884 263515 433678 526065 487953 447588 574557
14980 574557 541831 273333 339669 524945 263183 66628 78141 391406 588960 869000
14970 869000 790158 741991 831393 898115 752534 721824 626826 507180 394450 382519 703464
14959 703464 701925 440909 308562 601343 829982 1086847 1007459 893726 800324 719114
14949 719114 719869 559978 645036 696549 772849 765181 882329 1128625 1096720 990563 1138828
14938 1138828 1239130 1205083 1353553 1445643 1321585 1360124 1577698 1520271 1403021 1372785
14928A372785n1323K94424L32727M18910K69440p1703o9120J71221L17136k82107
14918B702390j56724O1979J32757L15007M13424k20615l4409L41976N32128N25767
14908D613680K03105L29362K21728R5536L93560P90998J097071J568888J906310
14899A1220238K372054L235883M514353N644187N899802M602101K419821R55377
14891D0863816J483392L860478P175406J1130738J4986262J6533372J1989987
14884A08023451K423936p448612r992643n943198J11950O490989J1865834J4352241
14876A19883948J0475938o50176j2683323j7697729j4756708r299831m686438
14869G0585681j697498M27614m2494l149238o655586q708592q106215o422614
$$ plain form
14928 1372785 1321462 1615886 1948613 2367523 2636963 2565260 2496140 2667361 2984497 2702390
14918 2702390 2545666 2607645 2740402 3055409 3468833 3248218 3213809 3555785 4087913 4613680
14908 4613680 4816785 5146147 5367875 5463411 5856971 6647969 7745040 9313928 11220238
14899 11220238 13592292 16828175 21342528 26986715 32886517 37488618 39908439 40863816
14891 40863816 42347208 46207686 53383092 64513830 79500092 96033464 108023451
14884 108023451 110447387 102998775 93006132 87062934 87174884 93665873 105531707 119883948
14876 119883948 130359886 129709710 117026387 99328658 84571950 75272119 70585681
14869 70585681 68888183 69315797 69273303 66124065 59468479 50759887 42653672 36231058
14861C6231058m545744l518935k788023k229313j805329j809652j495473j250410
14853A6788179j018406q24672m26075j95424k34689n1525P002K33422K07683K76840
14843A4762335Q02109J270660J922184K786448M011642N887926Q085181R819038
14835D9347523J0053586P462751L545313J276217L151303O908612R902261J2767392
14827A04414958J6273683K1049882K3266319J7581925N154028l318727k521289
14820A81900779P25581j345037l769558R370Q188795J2855256Q900283o26256
14812B06839213o615036r345117j4515930j9780966j9677096j4281134p332060
14805A15291874l407060l408579n485038p788465r860713j1247920j1598956r824858
$$ plain form
14861 36231058 31685314 28166379 25378356 23149043 21343714 19534062 18038589 16788179
14853 16788179 15769773 14945101 14519026 14323602 14088913 14037388 14044390 14277812 14485495 14762335
14843 14762335 15564444 16835104 18757288 21543736 25555378 31443304 39528485 49347523
14835 49347523 59401109 66863860 70409173 71685390 74836693 81745305 91647566 104414958
14827 104414958 120688641 141738523 165004842 182586767 187740795 184422068 181900779
14820 181900779 182626360 181281323 177511765 177521135 185709930 198565186 207465469 206839213
14812 206839213 200224177 190879060 176363130 156582164 136905068 122623934 115291874
14805 115291874 111884814 108476235 102991197 95202732 85342019 74094099 62495143 52670285
14797E2670285p431244n909067m751983l692786k933064k460414k428494k185340
14789B0877893k114470k031804j821779j464004j178077j061801p86917p28311
14781I690730p30521o47632o28961n76876j17968k53185m47913l78633l58823
14772E550218l81109l94301k81697k86176m31430l58728J18806P2400l24779j91845
14762C091359r7631j67760j81046J9150J40010j59408m19414p698J13280K28532
14752B559374Q2916R73p519j32285M6209O3056M3363j03575J53248L09955M61522
14741C477237N40866R508J97795N19932N06562K66875O67473R10170J061999J749022
14731I907439K677792L592355M826637O206009O898485N176663J507267j776502
$$ plain form
14797 52670285 45239041 39329974 34577991 30885205 27952141 25491727 23063233 20877893
14789 20877893 18763423 16731619 14909840 13445836 12267759 11205958 10419041 9690730
14781 9690730 8960209 8312577 7683616 7106740 6988772 6735587 6287674 5909041 5550218
14772 5550218 5169109 4774808 4493111 4206935 3775505 3416777 3535583 3607983 3283204 3091359
14762 3091359 2993728 2825968 2644922 2664072 2804082 2644674 2225260 2217562 2330842 2559374
14752 2559374 2642290 2643263 2635744 2503459 2549668 2612724 2656087 2552512 2705760 3015715 3477237
14741 3477237 4018103 4027611 4225406 4745338 5251900 5518775 6186248 7096418 8158417 9907439
14731 9907439 12585231 16177586 21004223 27210232 34108717 39285380 40792647 39016145
14723C9016145k147579M75714L615719P343958J1953987J5802689J7137166J2231121
14715A05428920J62j1866710j5093786j0014498l125118K733797Q182350J2742284
14707H8987401J3711271O956883n689344j5381678j6690529j2778055p787975
14700E1327974m194294j236931J148568J590964m5994l505742o928428p133496
14692C1022621n712907l712047k900021k099086j841737j494487j176502j186229
14684A0899605j048838j018719r40615p73716q22523p60528o23908n60554m48602
14675C901602n24597l12302J44007j5719q8775l24424l15875j63534m39420j31309
14665A729654j78911Q7034l9281l30922k65135p3355J56455j21274o4843j14811
$$ plain form
14723 39016145 36868566 37344280 40959999 48303957 60257944 76060633 93197799 105428920
14715 105428920 105429082 93562372 78468586 68454088 65328970 68062767 76245117 88987401
14707 88987401 102698672 109655555 103966211 88584533 71894004 59115949 51327974
14700 51327974 47133680 45896749 47045317 48636281 48590287 45084545 38156117 31022621
14692 31022621 25309714 21597667 18697646 16598560 14756823 13262336 12085834 10899605
14684 10899605 9850767 8832048 7891433 7117717 6295194 5534666 4910758 4350204 3901602
14675 3901602 3377005 3064703 3208710 3192991 3104216 2779792 2463917 2300383 1860963 1729654
14665 1729654 1550743 1637777 1598496 1267574 1002439 929084 1085539 964265 899422 784611
14655G84611R6596l28760J67844J5017q9651k6142J1221J53j02681J04203o0633
14644E71778k95997k30134j10569j49611l1923q340J99100J52002M2084L01923
14634D40313R3863p4440m2719O152j57378k03517q8274J12338N6404o3616j68007
14623h8881j30503J89388k34391J41984J86037J4081j20203j01637p5454N1458
14613a68121J63239j60415P0609K17640l6241K8334J10939j06108m0830j35117
14603e6071Q7731r4280q7323j248J9498j50106K06733M23703K31867k51703l66510
14592c7709L337K63856K23032J23621j31909q7932j94948k48363P8366O0143L1262
14581H2756J84569j14076j67197r7204P2362J69177J06420o6435L8714l1859j81788
$$ plain form
14655 784611 881207 552447 720291 735308 645657 619515 630736 630889 528208 632411 571778
14644 571778 275781 45647 -64922 -214533 -246456 -254796 -55696 96306 138390 440313
14634 440313 534176 459736 417017 423169 265791 62274 -26000 86338 142742 79126 -88881
14623 -88881 -219384 -29996 -264387 -122403 63634 77715 -42488 -144125 -219579 -168121
14613 -168121 -4882 -165297 -94688 122952 86711 115045 225984 119876 79046 -56071
14603 -56071 31660 -62620 -149943 -151191 -131693 -281799 -75066 348637 580504 328801 -37709
14592 -37709 -34372 229484 452516 576137 444228 356296 161348 -87015 -8649 51494 82756
14581 82756 267325 153249 -13948 -111152 -38790 130387 236807 170372 209086 177227 -4561
14570d561k79872O4958L184m767N0978J9829M5875J51385P663k8698j3456k04666
14558a92148j14340J69677K99943P5004q4673j34973j7781k8145r5283J29617
14548F898K09646j20020q2480j00073j16338K04356o4718K3401J12396n7236q168
14537G664j5677O758O9652J10973j67398n9694K10300k33659Q225N1112J371o7578
14525g7951K07978k2881r6816j23252j47379J11648J47085j71830q6432j46277
14515d06107N3511J05828j92463M4172J96589q9961N0071J55774j39904j11304
14505c33794o5169J67257K42298n759J55030j96550k05244j649j44788J25235
14495b63133J43569k8045L0949K17740k70743j90297K9947K50675J32110K96671
$$ plain form
14570 -4561 -284433 -219475 -216291 -221058 -170080 -150251 -104376 47009 54672 25974 12518 -192148
14558 -192148 -306488 -136811 163132 238136 153463 18490 709 -27436 -122719 6898
14548 6898 216544 96524 14044 -86029 -202367 1989 -62729 -39328 73068 15832 7664
14537 7664 -8013 -1255 68397 179370 11972 -47722 162578 -71081 -62856 -11744 -10373 -77951
14525 -77951 130027 107146 10330 -112922 -260301 -148653 -1568 -173398 -259830 -406107
14515 -406107 -352596 -246768 -439231 -395059 -198470 -288431 -238360 -82586 -222490 -333794
14505 -333794 -398963 -231706 10592 4833 159863 -36687 -241931 -243580 -388368 -263133
14495 -263133 -119564 -147609 -116660 101080 -169663 -359960 -330013 -79338 52772 349443
14485C49443j5618o65791k6217J66269j21188m6073J61795J15436n0505j4336
14475a46785p9376k19487n0892J94036Q9327P0391R7005M0041J02R65P514J29580
14463A32421p3236K3649r1587J58950m9345n5361J70510J75347j25092j16726
14453A49530l2464j55886j34457j7779L1435J60641j40333J23041J30238k72997
14443a59031Q2855J05079K8242j48204j34729j13344Q9420J19492j51282J8350
14433b63152K02230O7288Q09R404L4435j38222j503j3639k63014K26989L22513
14422A84138q292o0782K5964J127p4577o9229J47682j88297K0412J49997J95032
14411C23175j62447j29603P6025m519j99594k74935n5385J27845J72350J84626
$$ plain form
14485 349443 333825 -331966 -358183 -191914 -313102 -359175 -197380 -81944 -132449 -146785
14475 -146785 -226161 -445648 -496540 -302504 -213177 -142786 -45781 -5740 -5638 -4673 2841 132421
14463 132421 59185 82834 -8753 150197 100852 45491 216001 391348 266256 149530
14453 149530 117066 -38820 -173277 -191056 -159621 1020 -139313 -16272 113966 -159031
14443 -159031 -76176 28903 57145 -91059 -225788 -339132 -249712 -130220 -281502 -263152
14433 -263152 -60922 6366 7175 16579 51014 -87208 -88711 -102350 -365364 -138375 184138
14422 184138 175846 115064 141028 142155 67578 -1651 146031 -42266 -21854 128143 323175
14411 323175 160728 31125 107150 102631 -96963 -371898 -427283 -299438 -127088 57538
14401E7538O869l3923j80291k12805P0319J81354K55250m8074j3415N4121j5728
14390A21215k49204k10439k04567L44379J42265J92347q2091j94824k6864K64308
14380I6525Q7700J44095Q8187J12953J26123K8470J18490M4500l566k4201K9407
14369H48683k75547j95838R1813P0243N596o6342j16553j40495o0796L5708R6063
14358B92535K595k3931J20863J70048j00941j09010k6297l94660k9770K97596
14348A99028K04470k52048k0994j63514l7212J08002J7798J49240q4146o2807
14338E7817r4461Q122L08893K46382J72454j7436J02364k7929J4573k46248j70176
14327C54355J22491k8233K34628K0326l10290j83642l2663M6802O6877j9403J199
$$ plain form
14401 57538 64407 30484 -149807 -362612 -292293 -110939 144311 96237 82822 136943 121215
14390 121215 -127989 -338428 -542995 -198616 -56351 135996 53905 -140919 -167783 96525
14380 96525 184225 328320 416507 529460 655583 684053 802543 847043 843477 819276 848683
14369 848683 573136 377298 469111 539354 544950 478608 362055 221560 160764 196472 292535
14358 292535 295130 271199 392062 562110 461169 352159 325862 -68798 -98568 199028
14348 199028 403498 151450 130456 -33058 -70270 37732 55530 204770 120624 57817
14338 57817 -36644 -28522 280371 526753 699207 681771 784135 756206 770779 524531 354355
14327 354355 476846 448613 683241 703567 393277 209635 176972 223774 290651 271248 272447
14316B72447J08599R7738j48797r9978K5474K92426K32990J0253k15909r3369
14306D81874J55575K54029Q2956o1818k29772j91342L8160P3195j7590k59082
14296C26185O4527J44186j36130K72590L4815j56469l32249q643J67278M9345
14286D25435l571M2985r4797K5778K3778p8023K0294q7770j41324m840N3073O3571
14274B44589l3032J9770l0558j66964N1447P5384n8597j37891o1560J24113P606
14263C4307K53987J23065p1338K5479J59099P6836k50602j75313N41250J49482
14253H66252K6909j32988J37058k7641j88142o5212j30281n8444J39841J47400
14243G14752m6526K12890R9685l02333j28109L54305L28509J77295J9672k54726
$$ plain form
14316 272447 381046 478784 329987 230009 255483 547909 780899 791152 575243 481874
14306 481874 637449 891478 974434 912616 682844 491502 529662 602857 585267 326185
14296 326185 390712 534898 398768 671358 706173 549704 217455 208812 376090 425435
14286 425435 421864 464849 370052 395830 419608 341585 361879 274109 132785 127945 181018 244589
14274 244589 211557 231327 200769 33805 85252 160636 102039 -35852 -97412 26701 34307
14263 34307 288294 411359 340021 365500 524599 601435 350833 175520 716770 866252
14253 866252 893161 760173 897231 869590 681448 616236 485955 427511 567352 714752
14243 714752 668226 881116 980801 678468 550359 904664 1233173 1410468 1430140 1175414
14233A175414j03634q0471m6327K27601J77752j8704L638j6516M6591J82540j50245
14222A397639l35908k26264q8808j05826j2232J36346K854J63315q2438J30593
14212I79271j4504k28124j63110J09414K94825J14912l70696J10066L14496j5105
14202A131445J3119M6591J69234J21055k12119J54216K83323q5827l4371o1946
14192A524720n1448k68653k86968n0102N6233j9834N3490j35599k31132k26056
14182C64651p597J89230k6388j50005j50252J1519j14570J54533o9289k29469
14172b7637J25512K89909j6567m4567r3628J67244j74023j64941L2533m4854Q1423
14161A30404L436j81817J95236J94421j59573j39423N9300q0327k35021J70552
$$ plain form
14233 1175414 1071780 991309 944982 1172583 1350335 1331631 1335269 1318753 1365344 1547884 1397639
14222 1397639 1061731 835467 746659 640833 628601 764947 767801 931116 848678 979271
14212 979271 964767 736643 573533 682947 977772 1092684 721988 832054 1146550 1131445
14202 1131445 1144564 1191155 1360389 1481444 1269325 1423541 1706864 1621037 1586666 1524720
14192 1524720 1473272 1204619 917651 867549 923782 903948 957438 821839 590707 364651
14182 364651 357054 546284 519896 369891 219639 231158 116588 271121 201832 -27637
14172 -27637 97875 387784 371217 326650 233022 400266 226243 61302 93835 48981 130404
14161 130404 133840 -47977 147259 341680 182107 42684 101984 21657 -213364 -42812
14151d2812P2223J0654K19435K54616n179J18630J2116J39100n5217k03580k2398
14140D97588P6441l13511k14302l7672J46932O7683j51383M0813J65475J68225
14130D46289r1466j96584m2748j37841O1866j4706n8763J42773p189j31391J72942
14119A43182J85421J41906P9295N3741j95508j23955L0589O3930m9656J1737o4728
14108B75954j77754L76034L00989j20730j58309q1158j47768K7429p9148J6064
14098B31603L7590m10577j96566J82891R7502K2931J66062j8499J68858L8247
14088C20042K16246q172l03548M3318n6435J21672J02894j22871j69428O5067
14078B08785j61177o4713o7364l3351L8613J11569J34731j10304q074k4936p3270
$$ plain form
14151 -42812 29411 40065 259500 514116 508937 627567 639683 778783 723566 519986 497588
14140 497588 574029 260518 46216 8544 155476 223159 71776 112589 278064 446289
14130 446289 354823 158239 115491 -22350 39516 24810 -33953 108820 101631 -29760 143182
14119 143182 328603 470509 549804 603545 408037 284082 314671 378601 328945 340682 275954
14108 275954 98200 474234 775223 654493 496184 415026 267258 294687 215539 231603
14098 231603 269193 -141384 -337950 -155059 -57557 -34626 131436 112937 281795 320042
14088 320042 536288 528116 224568 267886 211451 333123 436017 313146 143718 208785
14078 208785 47608 -17105 -84469 -117820 -79207 32362 167093 56789 48715 23779 -49491
14067d9491O9400K45354L5540r9915j73807m1582L9221k2939l55879R9429K64203
14056I534K89007P301m5796O7450N4228j57033j2432j02599q358j7711J28739
14045B12330J47347q4260M7675J48696j20896j82032l98812k07677J95699L27735
14035H5805K78155O7328m7990j69125L2972J05619J53464O549q3418K3972Q1664
14024E34995M9340k2177p5982N351j52385J376j20490Q2963o5501J76957K46053
14013F60500J67677m4134r7086J39556n3322j38925k59873k81554M1395R7274
14003B31508K40514k07054l22493j22912L24064K64611q181N8986J29092J65217
13993G53352Q0937m523j56733q3317M8925K14829m3761j66623j41759l5601K15326
$$ plain form
14067 -49491 19909 265263 300803 200888 27081 -14501 24720 1781 -354098 -254669 9534
14056 9534 298541 305842 260046 327496 381724 224691 212259 109660 101302 83591 212330
14045 212330 359677 275417 323092 471788 350892 168860 -229952 -437629 -241930 85805
14035 85805 363960 431288 383298 214173 247145 352764 506228 512777 429359 453331 534995
14024 534995 584335 562158 486176 491527 339142 340518 220028 302991 237490 414447 660500
14013 660500 828177 784043 686957 826513 773191 634266 374393 92839 134234 231508
14003 231508 472022 264968 -57525 -180437 143627 408238 400057 459043 588135 753352
13993 753352 834289 829766 673033 589716 638641 853470 809709 643086 501327 465726 681052
13982F81052K06843J67654M6279k01160l01226j5135O5560J9451j28818K90606
13972H31106J77526j07775m9921j27616j62619j18731p1342J87800J88209r1713
13962F54924Q3796Q0530j70808j15770L4775Q9257K26101J43021p6903j26462
13952H22461j10092p1735J98256q1842q9569K8895K76482n693k26202K51497Q0648
13941A073106k42041R2108P8748k6479j24611k16654j98377L00080L56809q4741
13931A007948k17856J48268N2702M7299n7220k15932j36395l3198o3426J85701
13921G17891J2700k8591p1464j87671k42191k40058J72995K86791J99627K28757
13911H48786P405N1217k89665N4623J76332O6284O2681J17975K100o0554j21397
$$ plain form
13982 681052 887895 1055549 1101828 900668 599442 584307 649867 669318 540500 831106
13972 831106 1008632 900857 850936 723320 560701 441970 370628 558428 746637 654924
13962 654924 738720 819250 648442 532672 567447 656704 882805 1025826 948923 822461
13952 822461 712369 640634 838890 757048 667479 696374 972856 967163 740961 992458 1073106
13941 1073106 831065 923173 1001921 975442 850831 634177 435800 735880 1092689 1007948
13931 1007948 790092 938360 991062 1038361 981141 765209 628814 595616 532190 717891
13921 717891 730591 702000 630536 442865 200674 -39384 133611 420402 620029 848786
13911 848786 856191 907408 617743 672366 848698 914982 977663 1095638 1097738 1037184 915787
13900I15787k06458j8048K43687J84190J66624j8583q6282J53812n1179q6898
13890A196652j7044J76281j24029p2214J57186k16024k18837J75705J6801j55743
13880I18734P5564n9022j56456P0740J84177L02155L5322n5990N132j89100n5159
13869A076097K51787J61680o9209j62148L33542J67106k48681j01737K5231K26154
13859A659822j0439j0354K63480Q0100p3604j77788P8153K79597K57706j70957
13849B175716J80465J69527q3200j27614J13971J16916J03658l0195J27203P4183
13839B820630J23293K7495m6747L6071R0206Q4223q5121M7084J64381K33170K30134
13828C724819l33596j40748K08298J17424k8488L45562L27668K52454L27642o05
$$ plain form
13900 915787 709329 691281 934968 1119158 1285782 1267199 1180917 1334729 1283550 1196652
13890 1196652 1179608 1355889 1231860 1159646 1316832 1100808 881971 1057676 1074477 918734
13880 918734 994298 935276 778820 849560 1033737 1335892 1371214 1315224 1320356 1131256 1076097
13869 1076097 1327884 1489564 1420355 1258207 1591749 1758855 1510174 1408437 1433668 1659822
13859 1659822 1649383 1639029 1902509 1982609 1909005 1731217 1809370 2088967 2346673 2175716
13849 2175716 2356181 2525708 2442508 2314894 2428865 2545781 2649439 2619244 2746447 2820630
13839 2820630 2943923 2971418 2924671 2960742 3050948 3135171 3050050 3097134 3261515 3494685 3724819
13828 3724819 3391223 3250475 3458773 3576197 3547709 3893271 4220939 4473393 4801035 4800430
13818D800430J21440J3495M02396K6638J58861J49315L08114K44753M89241L64356
13808G079039K53932M33652N3049J54436K72459M01171O29850K07481M26764O20066
13798A0531899M34659M75270M56781O49796P94622P45991Q88198R40830R15763
13789A6833809J447195J503836J614280J685034J701742K412522K812643L210962
13781C3222023L546592M029473M732487N553424O008140P015830Q550783J0125383
13773H2784135J2013026J4156181J6617192J9533993K1425246K2158663K1687819
13766B10376255J8203997J2485936M842550l530938j0601148j5378281j7678700
13759A98719671j8042743j6970760j5076117j2933915j1223222r696477q606501
$$ plain form
13818 4800430 4921870 4935365 5337761 5364399 5523260 5672575 5980689 6225442 6714683 7079039
13808 7079039 7332971 7766623 7819672 7974108 8246567 8647738 9277588 9485069 9911833 10531899
13798 10531899 10966558 11441828 11898609 12548405 13343027 14089018 14977216 15918046 16833809
13789 16833809 18281004 19784840 21399120 23084154 24785896 27198418 30011061 33222023
13781 33222023 36768615 40798088 45530575 51083999 57092139 64107969 72658752 82784135
13773 82784135 94797161 108953342 125570534 145104527 166529773 188688436 210376255
13766 210376255 228580252 241066188 245908738 242377800 231776652 216398371 198719671
13759 198719671 180676928 163706168 148630051 135696136 124472914 114776437 106169936
13752A06169936p694210o580209n538914m599995l926556l273194k356413j543153
13744G0657292r18654j16416Q36842K088217K953996L584441M384048N449815
13736H8919581O828812Q296510R802216J1732838J4102976J6854698J9810827
$$ plain form
13752 106169936 98475726 91895517 86356603 81756608 77830052 74556858 72200445 70657292
13744 70657292 69738638 69622222 70459064 72547281 75501277 79085718 83469766 88919581
13736 88919581 95748393 104044903 113847119 125579957 139682933 156537631 176348458
$$ [...]
##END NTUPLES=NMR SPECTRUM
##END=
