##TITLE=316683	mo 07783	adrs	fudan
##JCAMPDX= 6.0         $$ Bruker NMR JCAMP-DX V2.0
##DATA TYPE= NMR SPECTRUM
##DATA CLASS= NTUPLES
##ORIGIN= Bruker BioSpin GmbH
##OWNER= nmr
$$ XWIN-NMR		Version 3.5
$$ Tue Jul 11 13:45:59 2006 GMT Daylight Time (UT+1h)  MAYBRIDGE\nmr@NMR_250MHZ
##.OBSERVE FREQUENCY= 250.131544655141
##.OBSERVE NUCLEUS= ^1H
##.ACQUISITION MODE= SIMULTANEOUS (DQD)
##.ACQUISITION SCHEME= undefined
##.AVERAGES= 16
##.DIGITISER RES= 18
##SPECTROMETER/DATA SYSTEM= dpx250
##.PULSE SEQUENCE= zg30
##.SOLVENT NAME= DMSO
##.SHIFT REFERENCE= (INTERNAL, DMSO, 0, 16.522)
##AUDIT TRAIL= $$ (NUMBER, WHEN, WHO, WHERE, WHAT)
$$ ##TITLE= Audit trail, XWIN-NMR		Version 3.5
$$ ##JCAMPDX= 5.01
$$ ##ORIGIN= Bruker BioSpin GmbH
$$ ##OWNER= nmr
$$ C:/u/data/dgb/nmr/ADRS/15161/pdata/1/auditp.txt
$$ ##AUDIT TRAIL=  $$ (NUMBER, WHEN, WHO, WHERE, WHAT)
(   1,<2006-01-24 11:49:23.69 +000>,<MAYBRIDGE\nmr>,<NMR_250MHZ>,
      <created by zg, POWCHK disabled, PULCHK disabled
       configuration hash MD5:
       62 19 C7 07 E1 42 D1 B7 37 6C 3D D0 77 39 F9 E6
       data hash MD5: 64K
       89 9D 11 38 CA DC C3 0C DD EB 97 7F 88 45 A5 92>)
(   2,<2006-01-24 11:49:33.52 +000>,<MAYBRIDGE\nmr>,<NMR_250MHZ>,
      <Start of raw data processing
       ef LB = 0.3 FT_mod = 6 PKNL = 1 SI = 32K 
       data hash MD5: 32K
       1E 61 C5 7F DF E7 47 27 43 CE C3 B7 8F D8 32 A0>)
(   3,<2006-01-24 11:49:37.25 +000>,<MAYBRIDGE\nmr>,<NMR_250MHZ>,
      <apk 
       data hash MD5: 32K
       2B 23 05 C9 10 5A 69 79 01 20 A5 1F 78 AD 5A 9E>)
(   4,<2006-01-24 11:49:39.69 +000>,<MAYBRIDGE\nmr>,<NMR_250MHZ>,
      <abs ABSG = 5 
       data hash MD5: 32K
       65 D4 B7 AC 02 6D 8E F5 9F 8B D2 91 1E 19 1F 51>)
$$ ##END=
$$ 
$$ hash MD5
$$ 35 3A EA 34 F9 08 3F 3A 01 49 B1 36 F5 17 B3 53
##$RELAX= 
##$RELAX= 
##$RELAX= 
##$RELAX= 
##$RELAX= 
##$RELAX= 
##$RELAX= 
$$ Bruker specific parameters
$$ --------------------------
##$DU= <C:\Restored>
##$EXPNO= 15161
##$NAME= <ADRS>
##$PROCNO= 1
##$TYPE= <nmr>
##$USER= <dgb>
##$AMP= (0..31)
100 100 100 100 100 100 100 100 100 100 100 100 100 100 100 100 100 100 
100 100 100 100 100 100 100 100 100 100 100 100 100 100 
##$AQSEQ= 0
##$AQ_mod= 3
##$AUNM= <au_zg>
##$AUTOPOS= <9 >
##$BF1= 250.13
##$BF2= 250.13
##$BF3= 250.13
##$BF4= 250.13
##$BF5= 500.13
##$BF6= 500.13
##$BF7= 500.13
##$BF8= 500.13
##$BYTORDA= 1
##$CFDGTYP= 0
##$CFRGTYP= 5
##$CHEMSTR= <none>
##$CNST= (0..31)
1 1 145 1 1 1 1 1 1 1 1 1 1 1 1 1 1 1 1 1 1 1 1 1 1 1 1 1 1 1 1 1 
##$CPDPRG= <>
##$CPDPRG1= <>
##$CPDPRG2= <>
##$CPDPRG3= <>
##$CPDPRG4= <mlev>
##$CPDPRG5= <mlev>
##$CPDPRG6= <mlev>
##$CPDPRG7= <mlev>
##$CPDPRG8= <mlev>
##$CPDPRGB= <>
##$CPDPRGT= <>
##$D= (0..31)
0 1 0 0 0 0 0 0 0 0.06 0 0 0 0 0 0 0.0002 0 0 0 0 0 0 0 0 0 0 0 0 0 0 
0 
##$DATE= 1138103356
##$DBL= (0..7)
120 120 120 120 120 120 120 120 
##$DBP= (0..7)
150 150 150 150 150 150 150 150 
##$DBP07= 0
##$DBPNAM0= <>
##$DBPNAM1= <>
##$DBPNAM2= <>
##$DBPNAM3= <>
##$DBPNAM4= <>
##$DBPNAM5= <>
##$DBPNAM6= <>
$$ [...]
##$SUBNAM7= <"">
##$SUBNAM8= <"">
##$SUBNAM9= <"">
##$SW= 20.6930455092707
##$SWIBOX= (0..15)
0 0 3 0 0 0 0 0 0 0 0 0 0 0 0 0 
##$SW_h= 5175.983436853
##$TD= 65536
##$TD0= 1
##$TE= 294.16
##$TE2= 300
##$TE3= 300
##$TEG= 300
##$TL= (0..7)
0 120 120 120 120 120 120 120 
##$TP= (0..7)
150 150 150 150 150 150 150 150 
##$TP07= 0
##$TPNAME0= <>
##$TPNAME1= <>
##$TPNAME2= <>
##$TPNAME3= <>
##$TPNAME4= <>
##$TPNAME5= <>
##$TPNAME6= <>
##$TPNAME7= <>
##$TPOAL= (0..7)
0.5 0.5 0.5 0.5 0.5 0.5 0.5 0.5 
##$TPOFFS= (0..7)
0 0 0 0 0 0 0 0 
##$TUNHIN= 0
##$TUNHOUT= 0
##$TUNXOUT= 0
##$USERA1= <user>
##$USERA2= <user>
##$USERA3= <user>
##$USERA4= <user>
##$USERA5= <user>
##$V9= 5
##$VALIST= <valist>
##$VCLIST= <CCCCCCCCCCCCCCC>
##$VD= 0
##$VDLIST= <DDDDDDDDDDDDDDD>
##$VPLIST= <PPPPPPPPPPPPPPP>
##$VTLIST= <TTTTTTTTTTTTTTT>
##$WBST= 1024
##$WBSW= 4
##$XGAIN= (0..3)
0 0 0 0 
##$XL= 0
##$YL= 0
##$YMAX_a= 412149
##$YMIN_a= -439194
##$ZGOPTNS= <>
##$ZL1= 120
##$ZL2= 120
##$ZL3= 120
##$ZL4= 120
##$ABSF1= 16.522
##$ABSF2= -4.171173
##$ABSG= 5
##$ABSL= 3
##$ALPHA= 0
##$AQORDER= 0
##$ASSFAC= 0
##$ASSFACI= 0
##$ASSFACX= 0
##$ASSWID= 0
##$AUNMP= <proc_1d>
##$AZFE= 0.1
##$AZFW= 0.1
##$BCFW= 0
##$BC_mod= 0
##$BYTORDP= 0
##$COROFFS= 0
##$CY= 12.5
##$DATMOD= 1
##$DC= 0
##$DFILT= <>
##$DTYPP= 0
##$F1P= 14.0000005364418
##$F2P= -0.99999901652339
##$FCOR= 0.5
##$FTSIZE= 32768
##$FT_mod= 6
##$GAMMA= 0
##$GB= 0
##$INTBC= 1
##$INTSCL= 1
##$ISEN= 128
##$LB= 0.3
##$LEV0= 0
##$LPBIN= 0
##$MAXI= 10000
##$MC2= 0
##$MEAN= 0
##$ME_mod= 0
##$MI= 0
##$NCOEF= 0
##$NC_proc= -4
##$NLEV= 6
##$NOISF1= 0
##$NOISF2= 0
##$NSP= 0
##$NTH_PI= 0
##$NZP= 0
##$OFFSET= 16.522
##$PC= 1
##$PHC0= 231.4265
##$PHC1= 7.255132
##$PH_mod= 1
##$PKNL= yes
##$PPARMOD= 0
##$PSCAL= 4
##$PSIGN= 0
##$REVERSE= no
##$SF= 250.13
##$SI= 32768
##$SIGF1= 0
##$SIGF2= 0
##$SINO= 400
##$SIOLD= 32768
##$SREGLST= <1H.DMSO>
##$SSB= 0
##$STSI= 32768
##$STSR= 0
##$SW_p= 5175.98343685301
##$SYMM= 0
##$S_DEV= 0
##$TDeff= 65536
##$TDoff= 0
##$TI= <Analysis number 999999
Compound Code 99
Book Reference 9
Project Code 9>
##$TILT= no
##$TM1= 0
##$TM2= 0
##$TOPLEV= 0
##$USERP1= <user>
##$USERP2= <user>
##$USERP3= <user>
##$USERP4= <user>
##$USERP5= <user>
##$WDW= 1
##$XDIM= 32768
##$YMAX_p= 464798336
##$YMIN_p= -193095
$$ End of Bruker specific parameters
$$ ---------------------------------
##NTUPLES= NMR SPECTRUM
##VAR_NAME=  FREQUENCY,     SPECTRUM/REAL,   SPECTRUM/IMAG
##SYMBOL=    X,             R,               I
##VAR_TYPE=  INDEPENDENT,   DEPENDENT,       DEPENDENT
##VAR_FORM=  AFFN,          ASDF,            ASDF
##VAR_DIM=   32768,         32768,           32768
##UNITS=     HZ,            ARBITRARY UNITS, ARBITRARY UNITS
##FACTOR=    0.157963299565203, 1,           1
##FIRST=     4132.6476996994, 0,             0
##LAST=      -1043.33573715361, 0,           0
##MIN=       -1043.33573715361, -193095,     0
##MAX=       4132.6476996994, 464798336,     0
$$ Real data points
##PAGE= N=1
##DATA TABLE= (X++(R..R)), XYDATA
$$ [...]
18520 -84066 -54634 45289 40660 3082 27412 57638 66833 -10831 -69104 -59637 -17688 6018
18508 6018 27934 -11887 -1064 -8229 -25987 -22106 -473 25047 16205 -29287 15025 31651
18496 31651 19344 36897 35928 11083 18863 13532 -3523 -34352 -64874 -55206 -9665 18324 14021
18483 14021 -31912 15317 92998 57186 23907 20267 22849 -791 -27964 -34772 -77505 -44251
18471 -44251 -6035 -37160 -86963 -129491 -138766 -108422 -69374 -59918 -59463 25259 394 18837
18459 18837 31065 55369 -6137 -31984 -41963 -55029 -69314 3551 36136 -21176 -19939 27188
18447 27188 -14578 -48459 -66281 1242 69940 88525 79902 25463 -10399 18121 -20871 -14450
18435 -14450 51303 59347 14449 -958 -15543 -12369 -18271 -22972 -4360 10128 22946 -1773
18423 -1773 -17155 1126 27627 45613 38379 44286 21676 25845 29006 1602 -5408 36478 -6440
18410 -6440 -8505 15817 20864 -18860 -67719 -52222 1608 49456 27230 -30495 -56691 -40130
18398 -40130 -7915 8547 25288 32999 33636 4517 -6756 30919 77331 68252 54100 10240
18386 10240 2031 -5883 25565 59087 51073 65537 95659 76544 92608 96816 55300 37816
18374 37816 -13765 -18832 -27562 -33141 -20705 -22790 -14746 -26982 -34952 -71343 -121477 -97497 -118680
18361 -118680 -96252 -32542 141 60315 87256 36676 -34539 -39842 -70903 -27838 -39450 -23357
18349 -23357 2116 -1557 -27960 -15423 9656 -20689 -70501 -62939 -76428 -41001 -51519 23455
18337 23455 31745 10281 11851 64 -33140 -27293 -32571 -62942 -49367 -14249 -17191 -20693 -9848
18324 -9848 -50591 -102020 -79981 -51461 15005 43096 34082 28870 65992 97427 98410 68944 58179
18311 58179 110159 75327 106358 110329 90396 65971 37762 46384 36153 63972 45995 -12602
18299 -12602 -19319 -24300 -76485 -83160 -63323 -14808 1630 -2442 -13665 -24790 15171 -12478
18287 -12478 -35741 -51954 4558 38202 1840 -66518 -28000 12433 37410 71687 72781 31902
18275 31902 -17949 -27529 -38698 -64267 -40712 -15140 -68203 -36988 44888 86380 64706 52636
18263 52636 28653 27338 5620 53248 48615 -31411 -73583 6399 44060 -17811 -49149 -13012
18251 -13012 54327 130479 106957 26938 11829 -10433 -54678 -75429 -32669 7993 10132 29965
18239 29965 53092 8095 -28954 -7920 31088 17024 -15941 -26446 -32037 -16682 -44157 -37974
18227 -37974 -37944 -13350 42837 67740 102868 72478 14835 34485 35576 39240 10676 11872 22430
18214 22430 39480 81539 117161 80681 62974 52941 -2414 -11046 26863 121287 49747 -1102
18202 -1102 -82610 -85878 18529 31228 37629 26813 -35594 -59986 -67489 -88922 -45335 -27407
18190 -27407 -10707 -16038 -37012 5037 78361 62972 56995 40596 34736 47842 78853 86291
18178 86291 79884 51621 82859 83903 89801 54818 9919 -15168 -50 -9449 -73335 -116152
18166 -116152 -73557 -45220 24744 72805 14059 11652 -1938 -25545 -47398 -12858 -28564 -11816
18154 -11816 29841 1196 1090 -1910 -19152 -50627 -63533 -7638 44643 25176 -17486 28809
18142 28809 68709 27150 31066 73763 53906 -38917 -111178 -48212 -9546 17875 206 60621
18130 60621 57023 91648 109503 88176 46258 4807 4610 19280 26735 25994 20377 -1959 -15953
18117 -15953 -47847 -54297 28359 66759 66658 31992 -30613 -20662 -41154 -77438 -53384 -30328
18105 -30328 11181 28190 27784 -4092 -51931 13116 -12627 -34428 -27653 -52645 16681 45573
18093 45573 49321 -11097 -84970 -111417 -59873 -29526 -28401 -83701 -117913 -140048 -115752 -63888
18081 -63888 -67920 -65170 -53463 -80322 -75482 -77130 -63349 -11669 15879 33047 20422 23478 32291
18068 32291 32390 46556 -14323 -48536 -53052 -66804 -17801 -21213 -9097 19744 -27766 -31700 -27318
18055 -27318 -22658 -64328 -45777 -48910 -58743 -46932 -37343 -61553 -117290 -127991 -66825 10976
18043 10976 15431 -4352 9868 36714 74151 39607 37331 54547 26629 21386 -10308 1729
18031 1729 -7087 -48732 -17386 32923 67490 65180 25150 -35533 -54729 -24029 17620 11541
18019 11541 -20796 15722 -38405 -117115 -145254 -71004 -16214 -21969 -46360 -84524 -97496 -84035
18007 -84035 -105661 -98499 -35365 -32985 -39053 -13183 -41374 -47611 -10228 4421 42276 61318
17995 61318 60595 67686 61781 53097 45287 14236 12654 -33750 -29955 -45656 -18670 -2173 44928
17982 44928 47355 73249 29600 31672 11316 -28555 5146 20441 9052 4365 -38975 -49957
17970 -49957 -36375 -5303 -9306 25951 -8058 10615 61636 31051 11067 29138 18491 -4740
17958 -4740 8243 54909 53931 -5969 -5884 -38147 -23129 840 18010 -2874 -16007 -3733 3655
17945 3655 23801 34838 81414 60388 10992 -72863 -48550 -522 15982 -25236 -18221 -31799
17933 -31799 -22182 -23781 -6756 17495 5286 -6911 22777 19545 46497 16455 6045 17152
17921 17152 15847 73119 22012 -2242 -35769 -65566 -118591 -153046 -96629 -55306 11783 16201
17909 16201 -2626 8293 -24055 -23460 19643 57798 65159 -24333 -25341 -7055 -8501 -18763 -20144
17896 -20144 -21237 -39290 -45730 -8061 18610 57051 43376 14184 9699 26007 42248 18576
17884 18576 -13793 -6530 9155 -4514 -29902 -2173 -17759 521 38069 67261 68582 54701
17872 54701 23066 12269 -36243 -61795 -59826 -18229 -58188 -99398 -118830 -71217 -31589 -24404
17860 -24404 -24760 39674 62689 16856 -5409 23513 -17965 -31260 -51113 -67765 -83401 -33829
17848 -33829 18664 50456 42949 -34090 -61682 10860 23568 -8337 -33114 -66442 -67436 -106451
17836 -106451 -142454 -122153 -93829 -98509 -60824 2211 45333 71197 64486 36390 46496 -23468
17824 -23468 -15002 37838 45342 -19056 14330 28535 14707 4937 -24624 -59633 -29606 33546
17812 33546 15656 6251 12669 1122 -44093 -46250 2647 -7703 -18279 -5929 -20249 20456
17800 20456 43688 85968 92807 62019 53864 31600 35971 45431 79197 68734 63687 15573 15323
17787 15323 3918 -5885 -28236 -9160 23497 -33911 -47039 -67892 -33093 -28779 -50873 -43007
17775 -43007 16661 11487 -7080 -20463 -61065 -93827 -32862 55058 29124 -10036 -56826 -67558
17763 -67558 -48315 16880 -18946 -86548 -98126 -119651 -107068 -85936 -7203 16489 -2089 -9103
17751 -9103 -32435 -620 -18403 -6987 7116 -54245 -29979 13395 65090 94161 53063 35039
17739 35039 47149 40284 -27374 -31788 45434 11233 -50776 -75227 -40495 47357 58481 44267
17727 44267 102347 120720 126151 99608 64456 41872 3871 21442 41506 67201 43029 24766
17715 24766 19893 30189 34569 42120 33444 24129 -5885 -33419 -15195 30030 67514 43478 24385
17702 24385 22974 -22327 -8211 -39267 -68349 -68430 -45232 -2079 8471 -36204 -98228 -128457
17690 -128457 -130379 -100792 -30720 14742 59541 1554 -37604 -61406 -72802 -34212 27936 49081
17678 49081 33054 6824 11437 -9186 -8325 29798 44306 5485 -12799 9454 4567 14747
17666 14747 10323 33775 83140 70209 16359 11689 64187 68315 88872 52536 23593 -12428
17654 -12428 6676 51746 26047 21301 66603 102287 115957 105616 70808 98422 80099 10145
17642 10145 -13519 24407 51836 22604 4634 -56339 -83301 -38944 9197 -36248 -71246 -27410
17630 -27410 -3856 -48835 -59168 -80277 -83451 -15336 9540 11659 -11867 -41477 57348 83236
17618 83236 38798 -2919 35054 40442 37991 3579 -5050 65541 73313 64054 61133 14550 25372
17605 25372 68415 9234 -18235 -4716 18175 43382 71245 59831 79859 87061 38638 13067
17593 13067 -109 4370 15306 -25409 -46539 -71235 -49949 -8230 11918 28830 52742 54141
17581 54141 -23043 -16185 -4337 -50660 3950 10188 25000 60363 83291 45384 65892 104532
17569 104532 113483 89327 58813 39715 45068 15551 -22197 -12689 14 6715 -11982 38990
17557 38990 102122 87071 32118 -20704 -42671 -17783 73593 70244 63949 50784 19809 -15202
17545 -15202 -8252 -24279 -67975 -106576 -31758 18326 16284 -44079 -36954 -47714 -42134 -43643 -13100
17532 -13100 27980 17014 -12166 17009 8591 -63246 -59381 -2335 64018 61683 -20513 -66503
17520 -66503 -38284 -12420 -28191 -66164 -95527 -88646 -20451 -8986 -3542 31636 16536 25672
17508 25672 58365 7630 -3714 -14399 -23857 -21911 -8548 1439 -40934 -35881 -68462 -99662
17496 -99662 -23013 44052 -24406 -54802 -60485 -48138 14768 5411 4535 -16560 -42572 -13186
17484 -13186 -13311 44525 76491 27123 -18056 -24637 -52372 -33885 18551 65655 37643 52687
17472 52687 68056 91364 95490 90656 112197 126254 106516 55769 52183 52941 86323 63492 30890
17459 30890 27690 -4647 7886 -7581 -54896 -47108 2576 10367 16955 92186 67671 26407
17447 26407 -42322 -74325 -109505 -101604 -70896 -52652 -51648 17382 48767 4546 -8490 -10635
17435 -10635 29974 77063 54980 44596 8701 -19229 7697 17709 30483 33887 50336 83757
17423 83757 80175 79951 40342 68202 65057 -16760 -44547 -16452 2487 -24278 -26113 -28524 32801
17410 32801 63046 20252 8905 -35602 -35485 -3842 -5538 6444 1800 -9178 -15012 -26150 -51440
17397 -51440 -57778 28800 45484 22127 30563 -21568 4689 25713 23003 23616 49548 -11411 3347
17384 3347 6144 119 22641 93334 146797 96075 100859 63334 70422 65055 4923 32282 18113
17371 18113 20687 51437 53257 53075 25940 10044 893 58368 44352 16502 -7853 -31617 30344
17358 30344 -7782 -40082 -28458 601 31154 1860 -1409 -1111 -2960 -8724 -13834 -56379 -76860
17345 -76860 -30771 -21696 -8201 16698 -573 -15608 -33094 -52301 -34421 -56193 -35308 14861
17333 14861 48642 -7786 -30801 -22977 5032 -523 -22686 7537 51018 68449 71745 100473
17321 100473 85741 51393 38391 37958 18633 -8468 -22235 -45533 -47419 -23220 17913 60807
17309 60807 39771 32389 -19489 -28395 11506 32493 28827 100158 63479 -8077 8374 18905
17297 18905 10589 30949 26050 47365 61027 13528 -19795 -28974 13988 53727 49090 24526
17285 24526 34328 22472 16767 39554 73104 78558 17027 -10622 -32221 -59943 -21180 10959
17273 10959 37850 85349 65285 66119 40582 37990 38015 9207 10717 1931 -4458 42573 64651
17260 64651 77740 116195 69972 72676 5077 -27684 10851 -26384 -70512 -58830 -9622 -41415
17248 -41415 -77103 -34383 1957 10034 -11761 -48028 -63092 -60303 -46174 -14309 -7449 57666
17236 57666 59034 11345 5125 -44225 -45588 -11602 26331 36592 39721 42643 72470 27001 -16047
17223 -16047 -19882 -20776 23185 86989 95283 88692 60283 -51281 -54295 -23895 -6639 -68976 -85452
17210 -85452 -64203 -75641 -95336 -39969 -29429 -49328 -31527 5887 50622 69104 5850 -4149
17198 -4149 9828 -13771 -42828 -47595 -44511 -53910 -64897 -43766 -36740 -24480 -60985 -30529 10727
17185 10727 16155 -28431 -75988 -108912 -124786 -88077 -30911 29198 5161 -12393 -39201 -75340
17173 -75340 -83557 -78788 -92771 -91400 -63665 -74260 -106555 -91406 -98078 -42283 21766 56937
17161 56937 42501 60984 25557 54304 40633 55198 57091 24623 27947 55065 3005 -35617
17149 -35617 -32257 25410 6296 12511 -12150 -19319 8320 44563 79076 52172 -25647 -78250
17137 -78250 -97634 -103299 -84565 -11502 -11511 -14525 -11459 -1568 -18839 -43306 -26340 -28428 28687
17124 28687 30725 -2215 10291 15561 58653 14340 -27464 -46165 -25329 -16990 -28259 -24748
17112 -24748 -8651 41538 43866 -6274 -39878 -16384 29514 31102 60406 33784 18032 -42100
17100 -42100 -85521 -76119 -72719 -72143 -49272 259 -52062 -86050 -123526 -111073 -76095 -48988
17088 -48988 -3114 -27609 -27687 495 23285 -28896 -25627 4392 10209 -31302 9833 -6383 -80722
17075 -80722 -75295 -103899 -162517 -133599 -115399 -116764 -46617 -6391 26172 11876 30274 -10500
17063 -10500 -9012 -6508 -19982 13475 -20876 -25784 -66991 -87358 -98187 -73507 -104820 -114409
17051 -114409 -49742 3060 48446 86157 46045 46302 75548 85123 56894 51450 36112 40361
17039 40361 13920 -9306 -2946 50587 66060 9744 48962 104083 85413 31959 -35306 5688
17027 5688 58824 10830 -4378 -2771 29278 -7852 -51564 -63860 -113119 -88739 -20763 -15777
17015 -15777 -21677 -36068 -47977 -51483 -30098 -13666 -50061 -39687 -34189 -31033 -24555 29667 99179
17002 99179 76020 49383 54763 83791 86639 74718 25325 -7684 11760 22115 -3142 -63512
16990 -63512 -88808 -87207 -47538 -10682 -41283 -54338 12353 36381 15874 -27862 -8837 17901
16978 17901 -7501 7434 13703 10925 27999 4207 -36147 15533 29114 44471 56137 86333
16966 86333 105244 75736 62996 81086 69614 -5945 11706 -1003 -26096 -6893 -30700 -51560
16954 -51560 -62369 -11793 18023 -6547 -4657 -19350 -50690 -36587 -93547 -118607 -100453 -83174
16942 -83174 -93723 -76870 -61268 -35025 -45822 -21896 -20993 -24998 -9268 -26749 -21809 -11834 -2731
16929 -2731 -42917 -61089 -56541 -62993 -7799 82694 113610 112882 146238 95522 74333 97081 62795
16916 62795 48322 45868 1550 11049 117116 133191 119006 59953 1549 -44598 -14329 -26691
16904 -26691 -18024 -4664 -41332 -95391 -99203 -56776 -58868 -54679 2320 -33963 -64629 -65250 -16361
16891 -16361 35218 44760 9400 3048 6162 30512 39171 61095 16281 35559 71683 66039 18134
16878 18134 5303 -36480 -75889 -117260 -123773 -148622 -119635 -62412 -3055 32306 44798 -19603
16866 -19603 -40349 -45589 -8977 -41598 -92970 -127575 -82637 -65606 -62095 -52950 4261 36398
16854 36398 16145 -28800 -5823 -23002 -92032 -80815 -26888 24810 -12674 -36938 -26394 -36661
16842 -36661 -35301 -12872 -70689 -93938 -79885 -9531 70392 74027 53384 14226 13866 3982 -4242
16829 -4242 -6967 -35553 -37172 -7591 -9362 -34832 -24581 12652 5082 -41986 -54929 -36112 28981
16816 28981 64556 7809 -14216 -15195 -13986 -65783 -131146 -127218 -91982 -65751 -86033 -49171
16804 -49171 -21421 -5507 23339 -26611 -5198 2920 3712 -17648 -55793 -51472 -29790 -13338
16792 -13338 -37291 -93416 -112730 -85025 10553 -5603 14885 58448 16384 2815 32187 25961
16780 25961 -11522 -77402 -56557 -62757 -94439 -158446 -165579 -127183 -94152 -56237 -24461 -19455
16768 -19455 -53698 -117059 -101953 -43554 -24328 -40389 -39642 -16955 -77987 -92270 -118993 -94603
16756 -94603 -74669 -55981 -57391 -13741 -5575 6271 10009 -67685 -84030 -76015 -40629 -11066
16744 -11066 -40527 -38444 -71701 -31029 3208 62558 81303 36024 -47053 -42126 -6169 43122
16732 43122 -1573 34488 72170 85547 80020 44836 -6198 -60472 -48928 -51912 -22431 -33325
16720 -33325 -36255 -2544 4998 -39384 -27279 -42853 -43430 -33253 5999 17607 -23322 -44602
16708 -44602 -40950 33452 71738 88828 50388 79750 27343 12313 -11703 22751 -10655 -23891
16696 -23891 2172 48978 72844 54598 -6268 -17789 -8937 28613 -16305 -2763 -29618 -24464
16684 -24464 17646 -10679 -10203 20543 29538 -18153 -50950 -62388 -71619 -17423 -44441 -28506
16672 -28506 -6086 -4952 45222 33123 486 -20633 34987 58277 -11074 -49194 -46433 -62173
16660 -62173 -75514 -85574 -45855 -9167 -30004 -34332 -43961 -57954 -57104 -19000 25517 46621
16648 46621 -1534 -42253 -39098 -42740 -18683 -16569 -46615 -39800 -58358 -18694 39776 30719 -39338
16635 -39338 -90552 -128012 -114029 -43518 40015 17611 -37184 -46184 -87244 -99735 -83989 -84865
16623 -84865 -66723 -38628 -7114 10858 -31626 -25976 -6450 42980 44337 21770 29565 -7049
16611 -7049 -48772 -68531 -72851 -2635 -4248 -33350 -30598 -11060 -25666 -68154 -110197 -99596
16599 -99596 -39782 34189 41489 15586 43251 39559 25985 -35837 -51450 10788 25117 46130
16587 46130 77975 49109 38396 52285 64193 13692 11016 33647 6480 -19327 25066 80894
16575 80894 47723 4941 -12665 -50394 -33458 14427 -17768 -17447 -69241 -68009 -28309 39184
16563 39184 64065 87974 102455 70987 22692 -39166 -35420 -31842 -74542 -74291 -17684 1430
16551 1430 23335 30515 22139 -13085 -30994 -21319 -52696 -68344 -15648 -20621 -72782 -69701 -67087
16538 -67087 -68889 -13407 14992 13025 10926 24147 39350 73385 42576 41734 44948 -3109 -21425
16525 -21425 -27852 -47023 -72177 -65462 -31912 19118 24161 40523 26753 2213 34315 52689
16513 52689 36617 -21358 -58976 -24599 6736 49416 45882 -3410 7077 -33059 -63533 -43481
16501 -43481 -10390 -20027 10682 -6709 -52835 -18395 -11520 -34965 -37150 -4634 -24772 -29832
16489 -29832 -17543 6599 1063 17581 2867 -23021 12400 28320 90356 49485 -5906 -27456
16477 -27456 -73309 -92951 -103373 -10510 21856 35765 -10174 -65609 -79362 -50363 -73728 -93762
16465 -93762 -28984 -16365 -9069 -22938 -42806 -43206 -18038 10598 40886 34344 28335 -17118 -29223
16452 -29223 -52271 -35229 11623 61410 75725 37409 11771 2757 -11320 -27627 -51041 -58179
16440 -58179 -65458 -49516 -82249 -62508 -66940 -84468 -67917 -55352 -31210 -33731 26 3741
16428 3741 -53737 -86494 -101779 -90998 -100260 -85515 -98316 -67246 -66579 -73540 -25635 -30875 -21450
16415 -21450 -28752 -31385 6040 -22978 -75471 -60761 10071 14454 11159 12682 -11717 -24822 -49737
16402 -49737 -78513 -50797 -95241 -128843 -69060 -30585 -31028 -90736 -143843 -106752 -120045 -89822
16390 -89822 -96695 -62185 -556 -18944 -96984 -114794 -109692 -94233 -69930 -37254 -26151 -57678
16378 -57678 -38303 -4382 36548 72292 87714 88611 26666 -35601 -57953 -33824 -40463 -16130
16366 -16130 24916 44777 32918 36530 26470 -11372 10518 51234 46673 53396 149563 128788
16354 128788 46498 -20154 -64642 -73437 -87790 -47603 -35951 -26296 -101376 -74714 -75777 -25052
16342 -25052 -37475 -45267 -9391 24361 50281 54924 -7310 -65775 -30118 6401 12693 45089
16330 45089 29916 -6092 -1239 19940 -26335 -26657 11323 68157 20547 -8269 18099 76628
16318 76628 77913 53030 63850 37345 44706 84936 20035 -68356 -70207 -63266 -51231 16494
16306 16494 65150 13940 42006 -8748 -55439 -43192 -64869 -60940 -14676 -22568 -19442 11419
16294 11419 -11316 -15234 27537 75410 93453 35212 35340 18867 21370 38776 32467 78688 23943
16281 23943 -57412 -60741 4757 48863 12152 -3230 38461 34471 34659 50536 55365 12437 -80579
16268 -80579 -56639 -61553 -40608 -21936 13628 6146 13001 -8284 -46562 -74873 -44662 -40870
16256 -40870 -70866 -60535 -47592 -57561 -54468 -90908 -49429 -46222 -84276 -118455 -102635 -55507
16244 -55507 -43116 -41434 -1564 2397 34574 15154 10642 22310 31822 52672 61775 77700 122002
16231 122002 98945 64474 66950 47701 13926 -42324 -68862 -69392 -35164 30469 44341 53639
16219 53639 25955 -30325 -24930 -59676 -76281 -46106 -30458 -12683 19883 21857 54510 61586
16207 61586 82520 82770 60455 46009 13120 -26154 -289 42868 48845 36416 9466 -7208
16195 -7208 -3002 40021 132864 99553 4720 15425 27360 30805 49933 37860 32015 42219
16183 42219 58464 39849 24455 22722 -18057 -49713 -60688 -46020 9156 9766 -18508 -61801
16171 -61801 -39114 37841 73050 84083 128867 90275 45116 -7539 -42497 -42193 -28589 -42611
16159 -42611 -80416 -51934 8611 -665 -7188 12256 29405 -11770 -41941 -13103 3088 10379
16147 10379 -3780 -42066 -23170 -59813 -59743 -82335 -96247 -39534 -7505 -51600 -45563 -52205 -55787
16134 -55787 -5968 9928 -6026 6919 -46410 -55791 -46575 -61428 -48874 -32696 -13817 -11283
16122 -11283 -582 859 33227 -18485 -105363 -105404 -48603 -20629 -16958 -32917 -27145 -56278 -46668
16109 -46668 -77303 -73356 -14762 11885 59581 62596 -472 -69828 -142858 -100677 -27300 -37316
16097 -37316 -108327 -112710 -47409 -14917 -10383 -23832 -57602 -69640 -47004 -72046 -43108 -32305
16085 -32305 -35106 -70609 -66168 -44988 -85194 -96380 -78514 -50564 41874 78813 68653 39723
16073 39723 2316 11124 36464 10632 -60101 -57168 14877 -10946 19624 52852 42804 19995
16061 19995 -16881 -3267 -21340 -67238 -60652 -6042 -13013 -85240 -84889 -14016 -67879 -94210
16049 -94210 -58856 17987 54157 18596 -7391 36383 55059 19719 -31135 -58712 -59729 -35561
16037 -35561 -26350 -20275 11148 19175 -34327 -50794 -21352 -39846 -65605 -60870 -96953 -132149
16025 -132149 -108859 -9050 74058 106406 64847 28878 9042 -758 44385 86714 63011 25223
16013 25223 -12311 -49221 10837 17703 5688 -17231 -25636 17958 62811 59835 67913 104316
16001 104316 68115 4546 -10878 -85044 -85512 -40338 3081 37135 -28780 -66289 -113467 -130955
15989 -130955 -48288 -4163 -20286 -37420 -63059 -70100 -70360 -74288 -122257 -112740 -115436 -101306 -110439
15976 -110439 -94149 -51704 -38487 -5152 -8416 -42081 -130281 -154953 -83502 -16205 -54646 -106750
15964 -106750 -76529 -71857 -90353 -124385 -132382 -149520 -97618 -73216 -59005 -61445 -20284 -10489
15952 -10489 -17750 -47585 -40007 1355 -35095 -15195 -21491 -43521 -45302 -46196 -64500 -75526 -51450
15939 -51450 -2313 29750 23335 -11284 -44321 -46947 -84394 -81722 -35865 -38830 -60771 -65008 -90952
15926 -90952 -88405 -97212 -75551 -71845 -63186 -68250 2547 65174 56200 16509 -1719 -4651 -5761
15913 -5761 63771 39061 7351 -28140 -62078 -91529 -121449 -146273 -137093 -86517 -63732 -76162
15901 -76162 -28271 -6461 -13223 10066 22072 -8388 -60672 -36531 8071 4590 -29418 -29511 -30524
15888 -30524 -70400 -98497 -36886 15038 58035 82120 48389 5515 8595 47802 57088 28605
15876 28605 33024 14798 -22193 -49066 -90922 -78406 -35199 -54539 -25812 32063 35399 -10853
15864 -10853 39194 13242 1276 -8861 -33053 19069 4249 -8279 -5376 30822 42933 59225
15852 59225 60694 -6173 -14615 -37353 -44799 -16061 16165 33169 -11736 -12044 -1913 -66490 -34566
15839 -34566 -19891 25047 38502 5098 -44028 -24800 -27930 -96179 -70546 -125 12576 55720
15827 55720 67158 14351 4034 13009 -32474 8688 67565 38076 11318 -33459 -22278 14230
15815 14230 40644 51206 67125 28098 34518 91604 104135 66984 48300 37004 -36534 -80524
15803 -80524 -82266 -21437 5259 -29368 -42132 16258 66132 56699 60188 5934 -49680 -68465
15791 -68465 -92810 -127763 -56535 -60234 -24670 21446 54 -31229 -9772 6483 -1781 3424
15779 3424 -9152 23358 29573 25707 -5209 16417 -2310 48200 73659 30620 -40911 -64456
15767 -64456 -70762 -100906 -62019 -2302 24614 44660 5846 43278 83965 81046 33233 141
15755 141 2162 -2851 28337 -2637 5210 -8875 -1408 4222 -10100 -21262 -25714 11867 36283
15742 36283 27310 19584 38437 64548 80909 77402 55688 11070 49365 104028 113899 61639
15730 61639 43795 4551 -8458 -8555 -3581 37392 12701 -35211 -113643 -74821 -91063 -97125 -69201
15717 -69201 -23660 6090 15124 -22465 33492 15179 27695 27301 -4762 -33651 39665 58466
15705 58466 42834 59449 -10398 -77512 -71302 -60757 -78705 -85043 -74717 -78168 -984 17943
15693 17943 10415 8688 -33956 -25754 18314 72115 46654 -2248 -41487 -17183 28009 33696
15681 33696 -1898 -13950 -288 32474 14346 21326 28513 51050 22928 -5660 -10665 -30090
15669 -30090 -54520 -39722 -99552 -115338 -117429 -117394 -104101 -76295 -65034 -92894 -98186 -125125 -142131
15656 -142131 -77860 -52558 -68449 -88732 -79338 -84110 -53586 32680 38810 30096 65110 42231
15644 42231 12797 53209 16653 8517 -29641 -7095 -23810 -86560 -82314 -23962 1856 1371
15632 1371 -3702 7002 7733 -25967 -9370 12117 -18565 -72709 -98269 -89870 -47082 -19993 -10451
15619 -10451 -41724 -103556 -122853 -100468 -85980 -96741 -95676 -66098 -45384 -30030 4339 -16695
15607 -16695 -20283 -7987 5520 -29096 -32730 -6860 -23144 -263 21103 54459 35160 4390
15595 4390 -32432 -32133 -23627 341 14036 19274 49928 32572 -33752 -78912 -110739 -88660 -77375
15582 -77375 -38546 -62124 -59210 -44283 -9080 -517 -8492 20375 53704 60614 42632 3032
15570 3032 -46529 -1428 41277 12454 29871 13847 -27646 5632 29064 -57885 -81269 -49060
15558 -49060 -65929 -44892 15666 31053 38364 -3143 -28653 -69387 -100879 -83527 -64407 -37562
15546 -37562 -8061 36225 74217 37375 12107 -22090 -4376 28440 45079 22161 18852 34739
15534 34739 16723 -34924 -59925 -60039 -55403 -73080 -28813 -41162 -25417 -27338 -47141 -48496 -7809
15521 -7809 -22018 -22721 41280 27513 -35740 -67230 -90776 -36291 35615 36013 31109 17932 -489
15508 -489 -24884 -31129 -117196 -178573 -124035 -59778 -55300 -29943 -6246 11466 -2454 -48369
15496 -48369 -67881 -105200 -155022 -170139 -128596 -153668 -137318 -101685 -83825 -99070 -81949 -41919
15484 -41919 -15626 -2916 16073 22987 -8346 22960 -25684 -66640 -31579 42935 77144 47841
15472 47841 -11642 -577 91 -4301 -24443 -37259 -8496 30891 18751 -77819 -157395 -132378
15460 -132378 -99420 -23728 14088 -9104 -38818 -41995 -85803 -102992 -39046 -73055 -77042 -58126
15448 -58126 -90076 -109957 -128232 -133716 -107437 -98018 -29499 -9492 -17706 -2057 -6651 -25317
15436 -25317 -24080 -13531 -6302 13107 -49919 -122401 -62206 -13324 20387 -2970 -11659 -13155
15424 -13155 -88085 -77999 -60276 -63950 -70328 -42893 4191 -2848 15452 13767 7841 50432 49530
15411 49530 -6591 -100560 -142404 -158767 -191993 -168652 -91072 -70713 -40657 -30659 -7492 -259
15399 -259 19345 20477 82148 115260 62786 9854 46638 80709 5755 -55061 -80659 -205
15387 -205 62664 89169 71050 48396 18899 16718 51700 -4424 -4759 36696 41538 7666 -37206
15374 -37206 -45276 -55585 5750 34760 5362 688 45841 59028 41846 52324 54261 -38747
15362 -38747 -50479 -13431 24650 69578 69752 22844 -29119 -67647 -31676 -33827 -56815 -68280
15350 -68280 -29491 -32436 1335 20826 7024 33127 66134 25130 4962 12793 18913 6190
15338 6190 -68746 -26526 32239 37188 -152 -20824 -33718 -1535 -23923 -93409 -83553 -59034
15326 -59034 13701 19410 -50949 -70885 -41495 34424 61739 63348 56244 -22657 -51589 -92788
15314 -92788 -78213 -43079 -36310 -39656 -41397 -27598 -29064 -18966 -46229 -66446 -55094 -62188 -89088
15301 -89088 -86816 -42448 -16756 15942 24145 -15446 -34330 -23965 -37105 -33227 3025 20173
15289 20173 36237 57985 29922 -49037 -33610 24328 47370 26837 -43326 -46640 -8652 -53049
15277 -53049 -38845 -32396 -20000 376 -20275 -25640 -48555 -7042 4744 15186 27777 5478
15265 5478 -47966 -45200 -54385 -74905 -98416 -76727 -55577 -26857 -36166 -58666 -64073 -6834 -21458
15252 -21458 -34614 -21392 -247 17685 -6241 -43888 -6005 13223 69991 52655 5902 -7625
15240 -7625 -65239 -97460 -38738 40908 77407 75218 85762 62644 28780 20476 16710 -3435
15228 -3435 -20083 -26072 -19899 -41988 -22608 -33301 -37010 -35646 -64440 -87770 -49449 870 -17926
15215 -17926 26102 92626 101933 39758 7577 6096 87944 91092 86201 60790 45639 72171
15203 72171 75892 62862 26983 7888 14826 18416 42869 66878 86510 85325 138937 100916
15191 100916 46273 76793 82880 105143 123379 101436 88071 81849 64695 29860 20564 62368
15179 62368 42286 9716 4736 64563 112793 72603 26898 76 -56587 -76703 -71218 -42919
15167 -42919 -103368 -121003 -93055 -56804 -57209 -86638 -48070 -18519 -18217 -791 -12592 -4731 -21585
15154 -21585 -24623 -41881 -61790 -50764 -34635 -11665 -21200 -77916 -113684 -120840 -118291 -146441
15142 -146441 -95958 -61513 -91380 -48937 8919 26465 -39597 -111939 -153856 -134606 -96100
15131 -96100 -45531 -49122 -79209 -27073 6693 -6381 -64330 -103577 -92727 -72579 -80993 -58057
15119 -58057 -70571 -79042 -82299 -53586 -18164 4335 12598 31169 9468 -15613 8382 1128
15107 1128 -49346 -20736 -28012 -33937 -58154 -19429 5997 7737 -10591 -77347 -54643 -32979
15095 -32979 -51206 2853 87768 53432 -9553 -42179 8402 8143 -6648 4637 -25468 -105376
15083 -105376 -60829 -50936 -45281 -25002 -53884 -49289 -10364 21917 8334 -39986 -70222 -42548
15071 -42548 -13369 -363 15154 31906 20610 24154 -2500 5289 15256 34437 47926 45797
15059 45797 -29739 -94495 -64118 -57961 -67673 -48202 -63352 -9030 -27027 -50200 -10882 37459
15047 37459 28771 -26337 3144 31142 52462 48703 15794 -62778 -80592 -28540 31213 15911
15035 15911 14881 -63396 10142 78711 50289 31424 53611 47996 5957 2870 -32143 -57323
15023 -57323 -60709 -63778 -76836 -59518 -41352 -34293 -20861 41241 77168 102221 92362 8578
15011 8578 -16342 1143 14066 14959 65561 71112 66089 44805 36235 27197 11960 -20113 -15048
14998 -15048 16211 72212 123102 151758 149989 140635 100728 89983 82255 88033 33011 -7686
14986 -7686 39945 24284 20641 -14063 -56979 -74782 -63640 -19053 -57451 -143046 -128535 -60189
14974 -60189 11910 71291 22067 -51302 -135205 -163856 -134796 -71294 22310 99405 91624 64400
14962 64400 12678 8203 54134 18705 -9337 -8017 -49388 -47513 -54836 -43969 -20734 -18013 -41221
14949 -41221 -60173 -36071 -18913 17984 66955 45640 60011 59284 83757 68505 73224 60516
14937 60516 53521 21138 4450 13961 21274 16493 -80518 -117124 -124045 -53594 19335 45288 76676
14924 76676 18303 12999 32753 9112 14450 36422 16167 -1737 -8002 -11677 2150 13236
14912 13236 24155 -46293 -50095 394 12247 19294 45727 30648 7218 26545 23901 39047
14900 39047 48555 -4593 -33197 -19139 38259 109516 53099 -57314 -104645 -122379 -84448 -56844
14888 -56844 -37596 -37293 -22260 -64343 -31385 -18501 -32012 -27114 229 6735 -48085 -41060 596
14875 596 32955 5667 -26740 -15523 23843 -9318 -79651 -36404 18717 -36865 -65708 -29764
14863 -29764 -15772 -69862 -110557 -73177 -59375 -48824 -48285 -34219 6621 -27914 -11649 -6282
14851 -6282 18334 73512 30570 -59083 -41035 -48848 -38517 -7181 25539 -10859 -45550 19307
14839 19307 12059 -929 -25353 -81491 -50259 -14396 -9443 56341 66408 66231 43016 22405
14827 22405 -38659 -51581 -41390 -40549 -62685 -101978 -71409 -6620 24604 21613 2820 -39259
14815 -39259 -43670 -1259 21174 36759 7981 -3988 -1979 30083 35174 31405 55239 81200
14803 81200 96886 65831 34135 -21352 -79171 -61817 553 23051 28926 2569 -28071 -26300
14791 -26300 -17344 14383 35330 -27659 -74299 -19289 6192 -30964 -12821 6440 53921 -633
14779 -633 -70472 -34738 -3080 -52179 -64950 -104066 -122178 -92402 -53245 -19354 -47480 -42867
14767 -42867 12690 19251 69670 95820 126733 70438 -24434 -28955 -24911 -59548 -74285 -32082
14755 -32082 43119 8917 3374 10373 13095 44134 59409 59330 37315 45958 54082 28911 -20652
14742 -20652 -65979 -68092 -51791 23292 28765 5183 33915 -10918 -38342 -80654 -107440 -70760
14730 -70760 -23888 -49363 -49588 -30402 13150 50779 23600 -35829 -84841 -20884 -33402 -20603
14718 -20603 -10091 -37027 34432 56015 41004 40366 23419 29152 26989 33350 50334 80519 93663
14705 93663 32267 -47559 -68052 -90321 -65473 -76260 -95237 -106985 -177898 -138583 -68327 -53892
14693 -53892 -59859 -55453 -40399 -25695 -23889 -28560 -23990 -57108 -58036 -57894 3090 25730 8575
14680 8575 28961 35535 63134 41977 30328 17806 -34520 -48980 -57634 -82542 -61871 -15204
14668 -15204 -13793 11448 -10013 -45763 -59409 -86978 -75793 -26228 -31448 -10851 -20183 -7089
14656 -7089 -41469 -21048 -24610 -70619 -71655 -25745 16699 -6162 9273 39121 24673 82599
14644 82599 129305 131423 104957 99145 75790 100348 129491 121597 93193 89894 121951 147794
14632 147794 123164 111226 148689 152668 178562 182987 246460 302805 233913 199887 208003 183244
14620 183244 144240 98687 87039 95069 135717 152443 107706 97259 71294 65725 99019 122578
14608 122578 182403 164583 151843 130470 80926 16747 39417 26738 67898 84303 101391
14597 101391 91195 72672 69697 57661 92752 130619 119684 77634 20990 22509 14147 68863
14585 68863 114230 102313 78704 46561 26994 7634 49222 38222 21225 26371 42202 91466
14573 91466 71202 -15010 2572 104961 98811 70344 57607 2379 -8516 -4840 -64364 -77641
14561 -77641 -58185 -40151 -57945 -67821 -64339 -56118 -70939 -80818 -61636 -59168 -38157 -10803 -17512
14548 -17512 -35588 -51837 -63293 -117933 -89387 -45891 -53289 -63253 -22315 -41374 -468 24747
14536 24747 -8446 7360 80504 59293 29904 17865 -56989 -78370 -18190 2105 -54082 -73857
14524 -73857 -154719 -128981 -69164 -49462 -79600 -51907 -19725 13288 33919 24027 -2436 -42695
14512 -42695 -83169 -36845 -4293 -43316 -80555 -146656 -152729 -147935 -110271 -41910 -27145 -24838
14500 -24838 29022 104152 90631 2832 -3510 29679 37446 44004 55588 26731 4034 9278
14488 9278 -16169 -28233 -38922 14211 19329 -28403 -38195 -45557 -56774 -65556 -42766 -15062 -7872
14475 -7872 -79881 -125114 -107438 -112170 -85816 -64010 -72091 -52887 -72527 -70734 -26440 -7279
14463 -7279 896 20081 49636 18831 -35739 -80622 -168846 -155410 -139088 -98274 -95496 -157425
14451 -157425 -120552 -49089 -42908 -25936 -40560 -84209 -62874 -62476 -68794 -51510 -17958 -50939
14439 -50939 -114954 -126623 -138137 -158662 -160925 -111049 -47398 21485 38673 14749 41882 63742
14427 63742 42935 50761 26731 -41476 -31439 3361 -413 -3981 24806 46199 16008 16659 -11845
14414 -11845 -48147 -58186 -65253 -40332 -44093 -11741 -63376 -95943 8242 -7097 -59861 -30820
14402 -30820 15847 -32939 -25769 2909 37826 24589 -49942 -16508 55635 61306 8811 -2662
14390 -2662 -27940 -41491 -15348 -43769 -43811 -30795 -62613 -42075 13704 31717 33749 12540 29251
14377 29251 67704 75321 67327 31205 -28631 -77955 -76240 -58999 -35907 -27485 -30871 -20618 40210
14364 40210 79304 46951 -31601 -52326 -32860 -6558 -39083 -58859 -70429 -83117 -66358 2132
14352 2132 4526 41154 60976 26185 320 -4129 -12397 -44096 -5648 80938 92987 66511
14340 66511 119558 128343 123626 73700 35533 25996 52232 73606 46357 33769 40111 110267
14328 110267 150372 187638 120331 126008 100943 80414 93080 97808 23357 38529 43298 49661
14316 49661 65530 17808 25382 48461 19972 38744 79681 51811 37214 62977 38428 -6128
14304 -6128 14043 63419 36584 23464 58276 108890 111934 80882 108872 104569 68368 48513
14292 48513 57847 43021 104295 126499 101682 64396 24062 60296 88015 66153 52832 9519
14280 9519 -11940 -1266 34340 -3057 -47332 -25675 9442 35905 41800 74697 119283 98403
14268 98403 32093 19150 52593 50847 31165 26661 21057 72747 94312 100061 105589 149708 113637
14255 113637 59670 -3417 11981 64931 78298 80538 115637 119363 96738 28502 17787 70600
14243 70600 66905 41976 84900 115343 131838 182918 101671 28383 45657 42518 67700 85285
14231 85285 99796 92859 142637 134856 132431 142022 76162 36021 86532 64004 33943 -21101
14219 -21101 -32286 8462 4691 -35935 -34826 -90691 -119157 -56438 -38419 -74739 -74666 -1101 -3970
14206 -3970 -82452 -130964 -151853 -116811 -76888 -75909 -49706 -37369 -53158 -66429 -63186 -26953
14194 -26953 -10588 33920 72172 89945 43204 -6016 30935 25651 -9142 -9073 -44676 13633
14182 13633 43501 17366 10180 61169 75984 36336 26661 -12716 -1955 -12533 -40995 -813
14170 -813 -16944 16708 24504 -15575 -67618 -88415 -142583 -138354 -93776 -42042 3949 -11284
14158 -11284 -40434 3039 -5970 -19013 -7141 -16718 -38806 -41508 -23918 -22284 -86105 -82279 -95066
14145 -95066 -118055 -82676 -34192 -4033 12140 -13130 44727 75437 89052 16343 -29455 -85281
14133 -85281 -112082 -56286 12855 -6048 -17501 -23892 -58646 -25021 33088 38963 -437 -14901
14121 -14901 9920 12781 34425 41486 17993 1725 -18903 -47936 -55544 -13121 23082 3243
14109 3243 -11441 -38064 -102245 -80202 -871 39946 22920 79197 129164 82228 67179 51452
14097 51452 50572 21594 -13575 22486 -11075 -12560 23409 12280 13938 52346 26082 -10609
14085 -10609 -46123 -3441 28187 45681 74018 100978 72738 50813 -15592 -75455 -86566 -54796
14073 -54796 -10782 -31171 -42624 23838 77071 30371 -17989 -20752 44887 71396 59860 41369
14061 41369 38743 65014 29028 41315 56509 -9795 23581 45309 4679 -35295 -35140 -28385
14049 -28385 -7796 -24435 -7636 17807 35497 35990 33815 26647 79476 61732 29173 -12795
14037 -12795 11192 -7309 17841 -31827 -16822 -13322 -27244 -14143 -44764 -74969 -67639 -64917
14025 -64917 -31022 36081 13997 47906 73039 52641 29868 7009 27708 63050 58305 54703
14013 54703 35933 53037 46658 56210 98103 46944 5246 -33141 -43070 -54140 -88333 -75555
14001 -75555 -102288 -43145 -50754 -47458 -57618 -29862 27720 -27255 -56950 -36902 -15280 56850
13989 56850 3643 -4509 -17886 -37739 -54875 -14452 -20845 -32618 68857 101168 68799 17547
13977 17547 -7535 11091 -7566 -24184 7936 -1986 -43569 -2632 57834 102732 90322 40064
13965 40064 19627 31889 48179 82451 102893 144409 150356 115323 165514 175769 152541 118305
13953 118305 81627 77037 69692 55273 107077 109348 143382 146105 165813 171382 166781 141706 114604
13940 114604 76835 30971 28213 39115 55956 82308 67217 35932 35393 55902 7907 2729
13928 2729 80347 50404 67476 139336 165222 174185 111190 98088 19748 -15212 43237 60308
13916 60308 51891 43237 82694 118790 144820 155970 166481 165531 131936 148108 172213 155961
13904 155961 158232 139288 171454 201001 202630 208843 281843 336325 357719 346269 390837 389093
13892 389093 422619 442416 464036 558569 655699 707069 696870 725454 796327 810517 853495
13881 853495 957314 1014292 1075314 1128317 1293324 1488964 1650881 1823220 2032791 2272085
13871 2272085 2574639 2917609 3242124 3689079 4259729 4858271 5538651 6216278 6877697
13862 6877697 7539079 8228649 8937216 9532755 10053184 10465728 10746242 10927461 11057145
13853 11057145 11131002 11218185 11312767 11458665 11743334 12143356 12651378 13242655 13860362 14414044
13843 14414044 14922047 15412572 15772496 15944288 15959570 15948026 15840342 15686315 15573021 15561584
13833 15561584 15661780 15814853 16105358 16579259 17066149 17591424 18167712 18651123 19031744
13824 19031744 19200882 19129544 18795686 18261539 17583838 16858822 16180055 15627710 15237552
13815 15237552 15018423 14931873 15121152 15439168 15949092 16542564 17182769 17747775 18161556
13806 18161556 18315242 18314303 17986573 17356078 16571090 15739487 14969753 14391525 14000703 13856555
13796 13856555 13856606 14030489 14311252 14559367 14771665 14995986 15066305 14938357 14717096 14552066
13786 14552066 14338478 14170238 14121565 14130854 14231565 14466219 14811332 15151795 15531596 15981455
13776 15981455 16306412 16614916 16794886 16883387 16892186 16846745 16831372 16803326 16827549 16933091
13766 16933091 17115622 17455811 17940962 18487974 19170778 19831496 20421759 20862151 21092131
13757 21092131 20978429 20551641 19796276 18851218 17793080 16817451 16023465 15381442 14911796
13748 14911796 14573666 14441745 14512757 14725284 14998249 15278771 15528514 15652707 15586529 15261878
13738 15261878 14643049 13744973 12643699 11388600 10169661 8996900 7902758 6932101
13730 6932101 6111911 5328472 4646975 4094200 3575864 3175053 2824075 2488324 2252081
13721 2252081 2091818 1955441 1759740 1611779 1474009 1360153 1267513 1175376 1115620 1030998
13711 1030998 924193 853299 793686 726827 724141 757375 766966 696874 581279 546431 527569
13700 527569 553790 562698 519005 471440 440845 461942 473675 440346 376203 350783 330998 281460
13688 281460 294305 271764 291201 295630 299266 294443 256778 234488 253592 271664 244713 235648
13676 235648 207151 178758 173390 227500 244871 189770 181488 212602 252499 233952 236134 278843
13664 278843 254209 187776 224986 267571 231719 193332 235034 188967 168015 137107 141903 200002
13652 200002 215898 209999 167885 82282 127469 143874 127085 101176 110301 108076 98659 88930
13640 88930 110965 97476 80506 63740 36381 83371 154375 186541 195801 152975 131299 136161
13628 136161 105937 110507 96606 99168 110624 102816 119735 98231 35918 8966 10266 71633
13616 71633 41098 11061 9964 1536 -27292 -59792 -37030 -46372 -31068 -14884 -3111 -46487
13604 -46487 -20075 49925 35855 19440 29367 71858 69909 82350 40680 16986 10067 25029
13592 25029 10318 2985 73456 64412 21139 43092 46574 25873 95716 91896 84250 84317 66762
13579 66762 46623 64076 117134 65015 43767 11848 -3840 14787 21357 61664 39399 -11528
13567 -11528 -32379 -35068 -36243 -13949 -15351 8242 52956 112676 156842 140426 59385 17235
13555 17235 167 -11329 -46868 -30798 10140 68864 68870 11652 28803 50256 13482 17362 94092
13542 94092 144579 147406 96111 67070 42849 2975 -2330 -13139 4055 44402 61152 104355
13530 104355 127684 131011 97747 83995 72876 35934 -743 -36627 -18873 13178 38264 54555
13518 54555 13557 53970 100321 96598 45456 -10740 10293 31961 14366 6611 51718 57644
13506 57644 21089 5513 -23959 18317 11981 10303 -13834 -55692 -22208 20546 52919 28498
13494 28498 -7697 -35758 -21685 -21417 -24679 -5000 40121 60564 48852 63918 80017 76448
13482 76448 46076 2906 -11241 58658 85542 37241 -49083 -72519 -41346 -67395 -17898 -977
13470 -977 7120 21686 39571 78319 86581 -9520 -16676 9977 -18774 -24355 54776 148670 145261
13457 145261 71622 79662 36611 13410 42989 36591 38564 -4151 2078 40023 79194 90642
13445 90642 79110 19297 19703 24978 16092 22893 34308 53090 40518 52064 63706 58384 92792
13432 92792 70634 62573 12263 27926 24872 22547 29748 42887 -19084 -49881 -41024 -52359 -100503
13419 -100503 -94211 -53517 9798 30643 44072 18890 20798 50415 25353 3693 -15462 30809
13407 30809 48941 33965 2675 -18575 11960 30508 4562 30562 50388 12816 7032 -25666
13395 -25666 -62022 -71740 -30048 54793 83408 53532 40862 -5602 -13167 37214 83525 75857
13383 75857 86464 28912 -9239 -28429 -60954 -70198 -81863 -23464 85705 106204 80589 78851
13371 78851 129669 93424 42939 82589 114070 81528 88337 52843 24375 -7267 19217 43871
13359 43871 45978 15010 71439 78010 29935 30173 34707 21849 -21304 -31437 -30912 51977 86953
13346 86953 110043 82820 109793 173141 162234 112112 115463 135597 170474 213491 227009 197297
13334 197297 190233 118599 130217 197352 177121 178194 173243 134848 93271 140810 122171 130481
13322 130481 90910 34495 31313 81547 97253 137674 164652 218133 171673 85654 35696 59908
13310 59908 45866 25590 18368 38972 15584 14242 48084 22010 20766 13444 49208 53910 30553
13297 30553 70186 121854 83450 95537 71873 50561 54603 130172 131482 125986 127631 142779
13285 142779 126495 116718 122894 145063 77087 85375 94845 54687 101732 127610 108390 94380
13273 94380 97269 116543 113309 56984 74935 88184 91787 59046 52916 113372 85422 66862
13261 66862 49619 63264 66626 90497 159199 157637 121928 120798 121044 140268 136162 117489 91384
13248 91384 48025 26100 -28170 -31935 30215 75510 34995 60060 68093 94880 107261 106309
13236 106309 95207 109987 92816 85323 89640 72798 63784 1737 -11361 2181 41934 85405
13224 85405 149815 149324 144565 111589 70911 111297 153735 150569 119015 103289 148440 129702
13212 129702 46803 37703 51746 89316 94039 67329 82894 82797 -24672 -92351 -110746 -59113
13200 -59113 -35881 -59768 9760 62872 59027 47379 32834 65033 64515 96350 138921 151372
13188 151372 130036 85550 106233 80584 116922 160598 237192 242527 211730 194312 187601 187856
13176 187856 183927 143550 169450 246384 265062 300010 306772 286734 264933 258301 265752 242537
13164 242537 246311 283319 322863 286691 295617 280767 246305 217090 178731 183190 210721 226229
13152 226229 223277 207124 130514 97496 118116 163940 149842 121072 73595 55711 81018 62883
13140 62883 39390 56767 103637 128559 183960 184751 149499 206011 275364 322132 279677 313835
13128 313835 354926 372575 419073 401886 343057 292869 236603 221397 219537 251729 193894 177001
13116 177001 232443 209988 192048 162920 157608 148003 144783 128033 151320 134786 139588 143284
13104 143284 132361 132083 185760 193683 192142 200723 234198 225180 174918 167682 222784 226351 163680
13091 163680 112958 95951 115827 123790 153410 149215 183306 162985 120447 133908 181353 195414
13079 195414 167790 125494 138184 157334 159973 245888 286271 318711 315375 258920 186993 220850
13067 220850 251412 230417 254786 302068 279057 228984 256504 218083 185821 185964 138698 133638
13055 133638 174398 203786 182523 201594 284270 257959 229558 180129 211432 214685 234490 244992
13043 244992 247524 286008 293157 248516 159551 98539 95662 91289 138396 149867 108137 76917
13031 76917 117910 114234 118798 126975 75801 46435 74738 95066 80242 59478 80903 134183
13019 134183 158640 139874 147132 80827 76751 46228 11522 67838 100772 95569 85179 -7511
13007 -7511 30096 79105 56778 -13788 -77780 -16236 22892 38310 33531 75117 69922 5482
12995 5482 59679 95651 127580 133710 39757 35848 52248 54050 61332 46404 96779 105469 58393
12982 58393 13231 63356 147428 141903 108324 77778 41757 96210 148781 142205 105802 98468
12970 98468 72630 31510 69671 128027 97511 85670 69911 85029 95427 88420 108523 117676
12958 117676 112709 110883 118992 102421 74754 55266 57969 78120 73285 89541 140587 213143
12946 213143 213013 193223 148778 165064 143127 141784 133887 184827 254432 281717 267888 264772
12934 264772 282974 241998 177869 214468 216567 234094 260017 202114 142792 124617 140078 168185
12922 168185 163725 139550 182435 159704 137561 189573 245604 252304 218434 204889 284723 292003
12910 292003 255668 252901 246632 202427 157899 92465 107529 79238 111459 118240 140765 176442
12898 176442 152820 74263 93686 76999 27481 39649 19107 73385 114171 107391 103350 102268
12886 102268 69907 6978 63529 112915 143086 76322 96676 129808 133113 162962 154516 138186
12874 138186 137469 88075 91629 110905 141033 126403 128111 124763 135942 177216 133109 114800
12862 114800 86093 102511 104682 105441 104886 84218 105679 177536 200653 201247 175164 116048 110414
12849 110414 105213 87386 124232 177897 200897 151874 139004 119649 65935 56883 75774 96857
12837 96857 99757 122711 193833 157592 144050 185541 222869 206054 163038 149561 180573 236088
12825 236088 207729 198926 242218 253848 239316 229093 262465 260154 279366 282961 264855 284042
12813 284042 282701 232872 250098 328756 344217 286183 286647 304166 350551 430015 446166 433272
12801 433272 414854 421631 489966 516646 506649 559072 684560 748593 809439 786311 800864 824779
12789 824779 865465 940590 1027610 1108648 1182413 1330677 1515155 1658345 1786457 1977214
12779 1977214 2270536 2508504 2751012 3043572 3415753 3858342 4327669 4783743 5196068
12770 5196068 5600607 6076663 6554234 7027409 7413146 7785861 8073457 8314920 8492891
12761 8492891 8614840 8617143 8500705 8370176 8139518 7791127 7469006 7107834 6754281 6438803
12751 6438803 6002546 5693636 5328541 4961650 4676169 4440894 4211074 4010182 3853560
12742 3853560 3691910 3579146 3456906 3297064 3168908 3127192 3069781 3054752 3118488 3168122
12732 3168122 3189767 3184792 3235039 3376008 3473579 3562898 3644771 3751037 3940466 4145937 4367103
12721 4367103 4625231 4946979 5322188 5740970 6220348 6747332 7295077 7825165 8343716
12712 8343716 8876422 9390595 9843755 10245127 10618169 10925275 11150688 11220173 11134084 10920908
12702 10920908 10566512 10113725 9658267 9145066 8557029 7900442 7257855 6559702 5905519
12693 5905519 5339487 4852835 4363335 3923889 3543239 3215533 2950186 2762000 2560730
12684 2560730 2416427 2301701 2253112 2229634 2232333 2226063 2237880 2241558 2240094 2260484 2340947 2473535
12672 2473535 2634113 2814333 3009715 3212727 3486038 3756413 4039481 4441771 4990704
12663 4990704 5544140 6114201 6744645 7463635 8283859 9185992 10166006 11228331 12297119
12654 12297119 13343486 14388871 15476111 16582500 17606453 18490568 19265791 19865443
12646 19865443 20339780 20609472 20682493 20518543 20180627 19758805 19168508 18467942 17693285
12637 17693285 16850388 16022854 15160749 14317860 13561948 12803013 12063596 11369283 10768054
12628 10768054 10255443 9753627 9367207 9040908 8810302 8553163 8334205 8118114 8042585
12619 8042585 7937817 7855302 7857849 7961825 8045815 8141730 8320900 8477855 8674629 9016934
12609 9016934 9360668 9748645 10201118 10739126 11315420 12059419 12875826 13774122 14841722
12600 14841722 16028711 17312271 18717570 20192230 21741801 23240148 24643346 25955689
12592 25955689 27099182 28074288 28936255 29524027 29798407 29765813 29395749 28698301 27683851
12583 27683851 26464887 25049994 23473292 21804922 20034496 18285135 16579579 14886793
12575 14886793 13262352 11799057 10467401 9271496 8263400 7327955 6528038 5880649
12567 5880649 5314065 4852586 4425037 4078773 3772872 3463325 3227702 3018727 2784814
12558 2784814 2583281 2374486 2181118 2043046 1931707 1802934 1714980 1699774 1661388 1563979
12548 1563979 1485087 1422829 1389339 1273727 1261543 1278798 1304600 1233915 1182310 1174726 1184634
12537 1184634 1198552 1216554 1183632 1116373 1107200 1137904 1185643 1296165 1307182 1272511 1278434
12526 1278434 1319024 1407306 1499154 1562657 1617366 1679036 1818653 1922697 2030380 2101730 2221579
12515 2221579 2377059 2587770 2774083 3024005 3247219 3529466 3845159 4226898 4689058
12506 4689058 5233757 5820318 6550564 7366928 8302980 9380543 10621451 12029063 13534751
12497 13534751 15206259 17032310 18893355 20748453 22540237 24146052 25537295 26748255
12489 26748255 27721216 28426532 28817276 28950836 28867615 28543535 28101155 27696941 27304857
12480 27304857 27012709 26851564 26830204 26972206 27286529 27868217 28647857 29625899 30855872
12471 30855872 32291662 33830390 35413988 36879772 38111385 39025836 39504090 39544415 39056007
12462 39056007 38089139 36581950 34644117 32328394 29754291 26963151 24109178 21365326
12454 21365326 18774366 16437847 14387150 12562694 11002324 9627224 8449649 7491268
12446 7491268 6681411 5971273 5414086 4943514 4491275 4085640 3725796 3442935 3179413
12437 3179413 3004878 2810381 2577819 2385827 2280948 2184478 2054991 1947154 1857569 1775163
12427 1775163 1745005 1677992 1583929 1459936 1464638 1475473 1400322 1302364 1277089 1270136 1227927
12416 1227927 1193088 1183932 1127331 1109744 1141425 1177315 1253726 1199784 1146259 1164597 1163083 1160767
12404 1160767 1197222 1158176 1125075 1146302 1234420 1341382 1408571 1439706 1516135 1601672 1676479
12393 1676479 1779699 1963574 2115680 2223033 2415465 2706599 3031323 3322632 3729494
12384 3729494 4289309 4889669 5526828 6207257 6939113 7744851 8482956 9215793 9878212
12375 9878212 10488395 10954854 11278685 11470274 11529708 11523021 11456658 11268813 11009310 10746600
12365 10746600 10492047 10206070 9965673 9793444 9698091 9715228 9809750 10009900 10279927 10629916
12355 10629916 11002908 11487639 12046808 12682169 13298796 13911455 14383972 14695062 14839306
12346 14839306 14754085 14395138 13840276 13193642 12342661 11365704 10309539 9201804 8099058
12337 8099058 7086274 6141095 5331959 4683606 4131335 3600343 3141842 2823252 2560326
12328 2560326 2293854 2106334 1866733 1705501 1621187 1496150 1407281 1345659 1268454 1167040
12318 1167040 1098271 1105737 1044173 960167 819244 760559 816981 815100 783837 774227 744303 732855
12306 732855 693321 656765 652311 640039 677898 682843 695403 661311 676869 688515 658811 637138
12294 637138 601923 601533 607627 632609 654239 689218 667359 597289 532682 572094 624232 624523
12282 624523 625887 614373 528458 541789 529410 506529 489962 458938 439166 451517 538200 571754
12270 571754 532540 538774 531813 510968 544920 579491 593421 580128 539622 546380 571058 495720
12258 495720 497800 566085 554183 510021 479150 450645 473252 534203 556979 533522 528449 562859
12246 562859 571034 540275 583193 571818 558255 577783 602289 580792 558098 542705 518394 502452
12234 502452 522982 533896 557450 568088 559280 509456 542053 639544 616174 570904 584968 597579
12222 597579 561500 511267 502575 569851 540708 495066 460720 461596 475421 405792 409067 424909
12210 424909 467796 481155 558036 585939 641512 609764 560436 581630 554110 536158 578940
12199 578940 670544 649411 606863 622705 684731 663984 644789 618197 608996 694766 756694 769634
12187 769634 729535 746704 815503 814868 778577 769629 749825 744250 797536 755213 749794 728115
12175 728115 773276 803931 764842 765424 756307 782451 824720 787532 796388 821290 829766 836673 830959
12162 830959 828522 806552 819677 830688 876688 926348 919556 855236 872834 884399 869065 825801
12150 825801 797346 776793 749108 740242 762883 773579 802329 844627 865412 895669 825720 825493
12138 825493 853558 858923 839510 821757 830366 828052 833565 931616 954786 915698 922543 912025
12126 912025 862481 817771 790261 855929 884002 881075 867164 874576 851745 825123 874863 894565
12114 894565 895932 879591 902247 922502 916587 908185 921598 976960 1034439 1050298 1059381 1075216
12102 1075216 1071493 1062049 1097614 1146185 1171009 1215659 1223840 1201256 1210518 1234188 1204928 1177320
12090 1177320 1186718 1221197 1201418 1245378 1263527 1228060 1228994 1235733 1274467 1268520 1228715 1251413
12078 1251413 1291164 1281304 1286648 1316204 1328996 1328610 1329233 1319790 1291420 1299397 1385156 1431262 1406156
12065 1406156 1444238 1444284 1433280 1434359 1462802 1470733 1441163 1484905 1508650 1496725 1511468 1538067
12053 1538067 1574125 1619648 1671297 1687169 1683912 1618985 1597577 1630552 1680123 1718622 1802018
12042 1802018 1818390 1827413 1858135 1889441 1961312 2015125 2048792 2089565 2154022 2205767 2227824
12031 2227824 2221741 2225488 2250863 2289307 2366459 2409997 2444285 2492609 2541623 2593910 2662494 2716404
12019 2716404 2707400 2725452 2757214 2848018 2888869 2895197 2972911 2989623 2963584 3026549 3118394 3151286
12007 3151286 3184386 3229455 3323557 3360130 3396926 3455858 3506266 3553406 3647075 3707197 3771202
11996 3771202 3891420 3918797 3944746 4014643 4127111 4274163 4340889 4353112 4369691 4497538
11986 4497538 4628733 4735726 4816891 4928400 4991346 5056425 5164672 5304072 5459480 5542838
11976 5542838 5685547 5803960 5871656 5958629 6075007 6217747 6389044 6524797 6629665 6718515
11966 6718515 6877107 7030364 7166381 7340328 7477806 7609789 7747517 7892100 8057716
11957 8057716 8246810 8381320 8523457 8740837 8918281 9076107 9207962 9335915 9494026
11948 9494026 9697108 9931098 10105585 10313035 10498395 10666399 10829649 11031813 11234390
11939 11234390 11390796 11547408 11671764 11878531 11999268 12115362 12228952 12378303 12483676
11930 12483676 12596404 12782218 12854486 12910995 12957486 13046463 13118607 13144133 13164821 13238868 13295944
11919 13295944 13247596 13219486 13222762 13183853 13133960 13093734 12955597 12883834 12841493 12755400 12705215
11908 12705215 12625130 12519302 12343560 12140966 12030619 11867432 11655350 11489825 11375263
11899 11375263 11248103 11060047 10866142 10711852 10536668 10365588 10184661 9985469 9741662
11890 9741662 9541830 9395312 9263787 9070225 8972460 8895468 8695577 8496768 8303009 8149544
11880 8149544 8017361 7846972 7692866 7543466 7359632 7119964 6943656 6862999 6775552 6680981
11870 6680981 6577698 6374596 6199932 6043880 5930856 5776036 5644449 5485833 5393895 5382625
11860 5382625 5324998 5162254 5035206 4914577 4787081 4716807 4649006 4591384 4489482 4424220
11850 4424220 4339027 4279262 4178742 4030043 3952542 3888898 3799620 3724434 3683826 3652869 3592383
11839 3592383 3460981 3432632 3357881 3270608 3260423 3203620 3172534 3110996 3062274 2986710 2988043
11828 2988043 2928247 2842931 2790568 2728885 2684552 2635836 2634442 2570631 2498316 2461095 2477671
11817 2477671 2471161 2393327 2388533 2332831 2275182 2263925 2208569 2193368 2178468 2142864 2120984 2097576
11805 2097576 2055884 2029054 1997010 1933831 1927898 1881589 1742986 1725456 1740628 1714511 1713174
11794 1713174 1749980 1779972 1680424 1597330 1620313 1567381 1499701 1518036 1543341 1559554 1589681
11783 1589681 1559089 1520022 1506905 1467147 1432068 1403487 1425519 1427589 1458492 1474210 1383192
11772 1383192 1388437 1396176 1334445 1269493 1246076 1255305 1228333 1202016 1229340 1159617 1153682 1202200
11760 1202200 1237667 1202419 1188645 1242609 1295169 1262231 1256897 1248358 1188915 1188314 1176168 1117102
11748 1117102 1066508 1088049 1071507 1031537 970827 984377 1010184 1056379 1031016 1005378 1052110
11737 1052110 1076045 972201 931525 948278 1009448 999928 917264 951737 1012666 968130 946832
11726 946832 936014 936624 923001 915094 891683 904170 863689 825158 823907 850288 890264 927642
11714 927642 847981 877612 958770 963915 959095 980476 993343 990225 1010597 1091744 1107892 1139629
11702 1139629 1243882 1270112 1274508 1307682 1356411 1352978 1410429 1482426 1534163 1630306 1759491
11691 1759491 1887821 2056446 2213482 2312896 2452122 2720571 3050536 3377458 3753694 4123930
11681 4123930 4530044 5074461 5722252 6320810 6886685 7488797 8088768 8625028 9097969
11672 9097969 9478117 9812986 10048165 10201508 10215275 10136547 9949630 9729452 9408845 8975776
11662 8975776 8445351 7933318 7432472 6941625 6530037 6139305 5870910 5604962 5416168
11653 5416168 5236286 5051398 4998333 4938515 4830356 4777022 4775837 4803198 4907854 5031525
11643 5031525 5143768 5255628 5489171 5736968 6039251 6408762 6832008 7203619 7620542
11634 7620542 8054356 8504961 8856454 9125503 9280525 9350922 9339799 9295512 9227099 9103814
11624 9103814 9011262 8880940 8724335 8510228 8304274 8149072 7984382 7837208 7752687 7739650
11614 7739650 7792641 8009025 8324051 8718849 9142779 9552138 9911834 10246339 10537052 10718862
11604 10718862 10835160 10839604 10850539 10763577 10539067 10278761 9899982 9438340 8890097 8283323
11594 8283323 7751278 7286060 6802781 6393052 6038354 5770974 5529648 5354497 5166276
11585 5166276 5038205 5009086 5035983 5012626 4990203 4997655 5019631 5089087 5193752 5337833 5521815
11574 5521815 5744569 5945372 6240937 6495127 6886906 7429002 8001163 8601632 9231894
11565 9231894 9888086 10664417 11419453 12222843 13078734 13947392 14824510 15581552 16307287
11556 16307287 16843767 17223736 17500310 17635381 17582840 17397487 17055311 16587814 16088619
11547 16088619 15471309 14749556 13915915 13049496 12185964 11289317 10468943 9678247 9041597
11538 9041597 8519849 8037641 7635676 7268677 6914042 6595969 6417091 6304904 6186685
11529 6186685 6113041 6066023 6059428 6055643 6104457 6193376 6340052 6496326 6695426 6885456 7187210
11518 7187210 7546015 7959356 8368944 8802492 9253221 9663536 10049252 10347624 10506217
11509 10506217 10631036 10694306 10712771 10678074 10556527 10439721 10294556 10142124 9919947 9651799
11499 9651799 9457608 9312502 9255361 9313717 9474355 9756507 10155915 10633091 11107126 11518782
11489 11518782 11955134 12392890 12650273 12749642 12909674 12949539 12895874 12680057 12377031 11952710
11479 11952710 11447731 10848045 10232349 9568983 8995995 8427894 7858434 7384789 6982069
11470 6982069 6601595 6319553 6121147 5923214 5704402 5573003 5380740 5242414 5209828 5180504
11460 5180504 5234490 5300838 5387863 5528413 5708686 5874701 6044602 6229508 6423479 6715142
11450 6715142 7096428 7418764 7690610 7932818 8174856 8411174 8578530 8664826 8673767 8589049
11440 8589049 8446056 8300925 8070676 7768768 7377880 6915692 6456580 5960674 5494017
11431 5494017 5045736 4581737 4084101 3666429 3316336 3012911 2762430 2474817 2283200
11422 2283200 2111923 1913470 1692000 1588595 1464228 1354151 1248154 1156741 1131697 1115162
11412 1115162 1033148 950991 912734 905497 849057 764883 701965 704480 712125 665660 642729 661715
11400 661715 701273 672649 588776 500635 438939 434394 439700 439402 392424 370232 345512 294729
11388 294729 315698 350963 346125 295269 272446 272105 318782 328833 354785 359294 361415 397989
11376 397989 355718 357452 374438 320281 317867 249374 209735 254131 254744 285151 278272 160184
11364 160184 117601 196826 224461 260651 287639 296847 357761 341131 332128 324069 324301 263122
11352 263122 262102 263001 260968 250503 235528 268531 283004 241546 223491 180786 110879 116366
11340 116366 147187 124108 73480 90109 111557 121434 160070 152918 133466 127040 121518 78682
11328 78682 79103 81257 98228 174510 277402 267589 186415 139411 110824 157082 188795 164431
11316 164431 185846 153844 92546 62094 96051 209784 204259 170271 128229 69867 18519
11305 18519 65070 118085 94147 67600 65048 98649 153715 166402 151295 131213 160324 163848
11293 163848 200133 205493 156394 111934 109687 89455 60251 44021 9755 51814 70622 88376
11281 88376 74510 -6461 18491 30798 97749 160736 137299 135426 128009 82386 71116 94302
11269 94302 75114 107694 89833 60471 39208 61542 134511 146406 62858 25398 73328 135177
11257 135177 144176 174523 196428 181130 177820 118310 75198 69491 99120 97119 39559 6134
11245 6134 -13254 61654 114815 128673 88952 19649 8646 28703 67673 101313 131791 91440
11233 91440 56741 115314 128013 98407 84533 97557 60243 47782 70409 123797 138543 72841
11221 72841 10197 17946 92718 122065 93650 65221 76360 55304 45132 66898 88176 134148
11209 134148 145250 119401 81443 77842 83936 46954 76479 82987 62016 17981 40692 120709
11197 120709 126832 83795 62324 39774 37432 -12200 -5105 17165 38689 24301 93458 116791
11185 116791 154488 178015 145093 126117 81874 66452 84508 116426 152271 204026 156783
11174 156783 143450 83573 44968 21211 7087 18689 29015 50376 82038 128595 117243
11163 117243 116708 67926 87384 93297 107712 61113 8046 53927 74925 74073 39193 -23403
11151 -23403 -58621 -44673 -3549 30264 29024 62013 43802 -27898 -32795 -5378 14427 31194
11139 31194 58856 30306 -1737 -63976 -16567 68723 90211 125913 140964 154938 148375 100969
11127 100969 91194 88951 148049 154929 141578 104640 148082 133742 122006 104511 72321 125139
11115 125139 131989 154427 108446 90488 58138 28363 70572 124034 150687 157599 121095 108275
11103 108275 119621 142089 136237 154297 117323 54447 73798 145789 185776 168377 177805 127444
11091 127444 88652 129250 125997 139740 113345 140885 182857 132865 118117 165218 144554 166814
11079 166814 157093 138301 126381 123934 92469 50513 70957 60357 120973 119430 82733 38456
11067 38456 84940 119949 149487 146140 182730 210675 178909 135719 173367 231149 160414 85950
11055 85950 28491 42473 94923 107320 102853 84671 18362 5646 94285 169740 233083 224112
11043 224112 225409 219341 187917 164152 133464 137181 202393 301181 327975 330713 249244 162639
11031 162639 159056 205943 239188 229207 208810 250146 298098 379697 522790 493310 399783 387726
11019 387726 413693 441117 440367 422498 448205 525918 587786 690005 748424 721557 591222
11008 591222 485308 440968 441069 435954 423197 407966 374023 417933 470755 474981 416042 355645
10996 355645 308154 285217 213903 179568 244567 280546 304898 269234 205037 165544 190768
10985 190768 194474 148182 102721 109790 141761 148980 147040 126987 102742 108472 111086 124954 168311
10972 168311 219147 175474 32250 -28557 2579 22117 15239 5248 764 55211 68884 62955
10960 62955 46444 43278 58526 90435 106650 30554 49415 71582 78201 71841 72172 71592 36381
10947 36381 39386 29256 -29558 670 29313 26006 46911 22261 -3711 -23163 -6300 -13490
10935 -13490 1554 39567 44570 31433 59242 7350 -49027 -112124 -30480 38998 30105 -21204
10923 -21204 -70956 -49064 30846 94023 141683 147099 144181 99847 72417 59829 41099 58623
10911 58623 71146 80814 64975 73054 97849 60549 79609 62953 49183 46343 56394 91428
10899 91428 109271 135086 137253 129324 130303 141345 103477 132699 117323 37192 17577 36810
10887 36810 26592 40411 75158 69897 50661 64051 117443 100943 79777 62591 29203 -4867
10875 -4867 -31462 1170 17960 14090 36254 19373 24706 48696 22567 14319 38449 35754 17847
10862 17847 -32818 -31665 -6618 -38594 -43640 -42707 -34507 4528 58292 88226 39411 28476 10119
10849 10119 9596 68424 50739 30111 -5062 44973 122130 84361 48326 -34419 -27785 47525
10837 47525 88770 71442 39964 61318 61743 36998 49071 57084 102446 94060 41497 32562 43163
10824 43163 35986 90944 105356 130416 147095 179531 127447 61066 69531 162920 171724 163391
10812 163391 152267 157936 173449 194605 170888 129632 98988 68056 56116 67096 106063 125643
10800 125643 112271 80146 65448 36086 4210 5841 52086 59039 71907 94711 113494 110339
10788 110339 100815 124395 72488 21205 49052 42894 31755 49530 52894 -16026 8903 47786
10776 47786 43896 26936 38014 13313 -33964 16746 86393 120504 117341 99588 54522 57306
10764 57306 83176 85018 43904 40080 27744 44762 84940 52435 17164 12061 -62916 -35410
10752 -35410 73150 172891 219340 224146 175841 104852 69381 143616 179975 193013 229329 284443
10740 284443 291633 294148 266229 238904 271408 312742 326215 353602 340521 266599 251506 301192
10728 301192 379874 481931 504479 454238 422896 421983 421294 445914 478119 475072 431954 363488
10716 363488 368250 429501 457960 502013 516413 539160 534039 572601 619685 651378 593200 571957
10704 571957 592249 652847 705573 815020 982377 1129569 1162119 1161203 1174244 1238880 1342238
10693 1342238 1551940 1696089 1805566 1971166 2194681 2421072 2693813 3016967 3377398
10684 3377398 3767449 4175535 4668399 5368239 6098221 6815547 7589168 8431738 9309451
10675 9309451 10189397 11037419 11817908 12532222 13128567 13654122 13985832 14175430 14261576 14353851
10665 14353851 14390847 14416555 14465870 14480183 14475063 14481545 14653015 14833869 15066958 15359571 15592659
10654 15592659 15685933 15786524 15807514 15737616 15539679 15250981 14861460 14348249 13755268 13105194
10644 13105194 12405657 11705282 11034657 10399990 9836009 9324890 8812299 8338716 7972026
10635 7972026 7715871 7503163 7358334 7274783 7163479 7105891 7173592 7225119 7295486 7434348
10625 7434348 7704363 7972408 8307405 8740286 9177617 9588362 10143970 10764043 11513865
10616 11513865 12350906 13434764 14820228 16566905 18711520 21482644 24908910 29253503
10608 29253503 34516115 40444465 45938723 49247676 49520667 47742552 45547159 44190296
10600 44190296 44355900 46576303 51019850 58107276 68073120 79928197 90343422 94745423
10592 94745423 91310100 83253214 75043810 69485724 67299810 68609322 73626847 82570214
10584 82570214 95319383 109779627 120917020 122292736 112263836 96443218 81530922
10577 81530922 70564578 63994860 61385379 62371842 66701210 73746623 81695704 86679987
10569 86679987 84623662 75353166 63135236 52251754 44450324 39734926 37580862 37426654
10561 37426654 38905352 41473959 44022301 45070248 43385635 39084719 33700024 28747861
10553 28747861 24918895 22245758 20364093 18924828 17828007 16964834 16244343 15647509
10545 15647509 15193551 14847209 14562466 14353640 14174015 14037103 13985778 14003564 14043494 14065738
10535 14065738 14103078 14020185 13956353 13798442 13485563 13040253 12521835 11998105 11487040 10909894
10525 10909894 10306692 9669755 9100938 8546443 8085626 7700781 7314137 6962975 6609742
10516 6609742 6350079 6124846 5911661 5772705 5674837 5591843 5484762 5440088 5467466 5532253
10506 5532253 5624858 5733298 5855210 5988770 6155036 6323497 6561656 6902472 7257599 7576707
10496 7576707 7900297 8212285 8565239 8899422 9226128 9469700 9719219 9882861 10019748
10487 10019748 10079068 10063045 10016231 9988285 9945461 9929870 9833793 9686484 9601187 9595443 9549732
10476 9549732 9395250 9318713 9198680 9074216 8859164 8681201 8453924 8111723 7686873 7292891
10466 7292891 6918738 6452489 5889757 5339254 4892910 4474424 4078685 3773316 3483078
10457 3483078 3187713 2869658 2608829 2420491 2236354 2011727 1873689 1718386 1590987
10448 1590987 1516422 1372279 1316905 1274896 1210678 1133751 1043828 984234 936712 923318 909997
10437 909997 833258 785529 726849 688617 621547 624809 623983 645180 606053 523719 454434 449615
10425 449615 527667 539472 500841 467610 484029 464139 406243 471884 508639 455114 399306
10414 399306 388137 422418 456738 477542 467683 448032 467333 461363 417402 384434 413251 413771
10402 413771 366366 347524 344000 377760 416919 420371 403876 332078 330563 289979 276379 276461 263428
10389 263428 260271 217050 238183 226306 211594 258321 297349 288739 316958 333377 315982 292930
10377 292930 289654 329789 349082 349752 311832 330471 358568 310339 252983 223512 273775 302584
10365 302584 270572 262437 210901 193265 170325 177986 164027 155071 254194 346975 293729 242923
10353 242923 278690 273402 249900 253848 235122 230649 216336 227731 249850 234636 203728 216220
10341 216220 245641 227202 231505 236352 207737 177497 136349 138387 105173 165246 230809 213682
10329 213682 231989 274614 254553 213071 200629 182080 225715 234987 269523 276123 192347 178281
10317 178281 191271 236437 257153 256429 199184 197106 210014 209261 231744 263224 261584 228569 238957
10304 238957 213781 194567 236779 245082 221579 230953 199276 155073 107521 70608 111547 134566
10292 134566 104089 122793 165353 141358 116134 143351 194501 233285 169692 111861 73466
10281 73466 71558 30487 46752 99013 123916 123808 168506 183324 189333 184669 214557 182373 135291
10268 135291 76277 78934 101528 83337 72959 86781 111814 107463 100142 128066 183094 142966
10256 142966 152334 189023 178551 158586 185303 157806 95129 38842 75351 97508 51642 91987
10244 91987 64732 46263 84631 151259 133744 68287 92429 81497 96407 58790 66870 105585
10232 105585 127949 130126 186010 171822 110809 114292 140700 136788 183940 226549 222586 219006
10220 219006 215661 196900 170697 222873 181258 126671 99232 99065 75402 75647 80556 75964 137773
10207 137773 166474 184759 200425 198312 155339 81327 19005 24199 45177 66661 14805 50289
10195 50289 123307 151123 134016 158616 119434 117959 92248 62501 54406 77805 54657 67621
10183 67621 153716 207307 244884 214551 154454 175366 150920 220602 260343 265414 261269 203393
10171 203393 234719 263673 290841 348063 335652 297054 297292 329677 314943 345621 337823 350429
10159 350429 388148 427073 442834 441797 460084 459475 397766 337565 354997 382678 444365 538392
10147 538392 631302 720803 793342 773122 704287 619640 536311 481210 426758 393944 386102 373734
10135 373734 401802 388718 436163 411054 357174 304375 258270 213038 242374 280928 317363
10124 317363 341317 346192 384745 358884 295384 227721 170386 105378 154090 193656 142188 148403
10112 148403 196390 127897 18578 28087 69820 62491 105506 153873 134011 108413 139363 127032
10100 127032 163168 119450 134142 131829 152272 149069 189792 226184 227899 183011 122210 141443
10088 141443 99272 46638 31320 17640 36029 23046 2050 49395 32849 43985 78853
10077 78853 66500 49217 70040 114454 87662 77545 62343 15970 45617 37875 23681 33828
10065 33828 62468 117966 104694 90259 70780 10871 40751 80876 129016 102949 23142 -25185
10053 -25185 2252 40503 66305 143801 128036 110547 145122 174675 229889 206391 155969 142130
10041 142130 154086 171500 124762 152195 146113 120351 142044 165680 140968 90914 61161 121690
10029 121690 132616 132207 117612 121346 64160 -11131 11423 73540 62219 71966 68322 124822
10017 124822 159969 145202 99497 78284 92809 85938 90076 129076 138100 101261 83568 72180
10005 72180 46510 93248 73169 29332 40377 86235 51043 44344 66869 73931 54709 6363
9993 6363 -49467 -42115 -41483 -7494 -10146 32750 -10524 -8715 2556 41033 53069 79235 99645
9980 99645 95098 68939 53452 71585 70114 104636 102082 30424 1086 34426 42459 72080 117642
9967 117642 123304 101105 114206 160552 177652 117133 47410 9625 -13290 16756 -53334 -62651
9955 -62651 -20547 -13081 5637 44790 41821 92232 128626 127347 142239 146527 114815 92774 126405
9942 126405 121946 165530 162556 196556 173800 162516 149180 101455 80779 134484 195024 201539
9930 201539 275288 342643 380703 481458 628897 881657 1398406 2404045 3745823 3912001
9920 3912001 2603991 1413284 856143 587139 416830 345027 225035 159260 183065 136487
9910 136487 93698 36810 21958 105986 138125 156719 69254 7165 54356 111313 114803 79732
9898 79732 47363 36185 14535 40369 51474 49061 59036 62233 43771 79596 55565 29886
9886 29886 23491 31181 -34739 -132225 -152911 -133650 -49116 -42343 -41459 -20105 -83814 -130263 -88736
9873 -88736 -6290 79673 80005 110117 124191 69092 32680 2351 -12798 -6997 4884 49013
9861 49013 57253 47971 -23542 -32932 -54820 -28948 -21131 -1463 13978 54700 74924 36666 33136
9848 33136 46646 69193 71659 26588 8062 2725 39458 13272 1639 7602 -42483 -56774
9836 -56774 -87164 -92926 -59844 -35596 11081 8681 7220 5377 19217 8502 -773 53317 3255
9823 3255 -39443 -53698 -6392 -15107 -28309 -31643 -3566 12406 -1175 -36945 -42797 -57457 -46326
9810 -46326 -35488 -37261 -51280 -37601 -27702 -86726 -95422 -69042 -27231 -4615 -34327 -49359
9798 -49359 -56742 -53407 -61386 -50319 -31913 -55748 -59267 -4781 11927 52616 38041 44105 -7077
9785 -7077 -50688 -21285 -9672 -32176 -41103 -40401 -66109 -70706 -67486 -76858 -92411 -38618 26941
9772 26941 36824 107389 149507 143063 195890 191298 86975 50539 48467 11857 1127 949 -12813
9759 -12813 -14621 60077 104246 95174 68984 -30597 -120562 -145335 -101084 -81233 -94418 -45095
9747 -45095 -5302 -4681 3118 -23913 -60022 -86166 -53541 -22835 -68251 -86820 -52078 -46762 -38183
9734 -38183 19255 30461 31278 54684 19008 -41389 -72614 -24648 8762 13325 17552 20099 5968
9721 5968 -14436 -48730 -51986 -27537 -74867 -119369 -91820 -41606 -10438 -19171 -5681 -14812 -1530
9708 -1530 -41294 -50210 -53860 -102358 -92893 -14322 16659 -37274 -57687 -14835 -31638 -29629 -28645
9695 -28645 -68507 -101492 -102196 -92833 -97154 -73825 -32466 -36129 -30695 -67260 -65543 -45144 -20198
9682 -20198 -40591 -14787 9952 14766 -8433 -19916 -14297 -2203 -37929 -75320 -103012 -130656
9670 -130656 -115044 -101312 -42535 -15509 -24914 -32886 -16930 -33919 -42352 -46983 -46694 -2752 30820
9657 30820 33983 33390 2878 -23870 -5291 16869 35381 92047 71542 7375 -13286 36724
9645 36724 89409 75534 141587 254294 355114 348025 178888 41341 39852 40422 18372 -12906
9633 -12906 30646 13618 -77966 -68063 -547 22667 53374 38176 -6998 -13732 -26629 -83319
9621 -83319 -76370 -51325 -53127 -51374 -31943 -25289 -38019 -41339 -32161 -57660 -27311 12122 78779
9608 78779 62992 51884 69600 73742 40243 56003 91788 60242 66378 118544 112503 70603
9596 70603 29459 -12445 -22419 17590 8349 13713 -35773 -24198 -8551 -3624 -2305 375 18850
9583 18850 25648 36284 9453 -65208 -53912 -31383 2270 22533 4812 18974 83812 30065
9571 30065 -12706 25474 -4649 -5491 -30885 -37278 -35521 11814 -7354 -8940 13843 32916 23735
9558 23735 66894 41854 67921 113943 115709 57592 4318 2147 -30593 -45368 -48741 -47042 7970
9545 7970 2240 -893 14189 -2258 -19144 -40548 20191 68167 112557 95444 40657 943
9533 943 113 -5169 -41535 -38281 -22883 -44395 -13655 11425 -12392 -26076 -26923 -19080 5463 -17670
9519 -17670 -52508 -105180 -81731 -89350 -51610 -23195 -7324 36563 80818 82270 6384 -1049
9507 -1049 35635 -18765 -59955 -67917 -78280 -43737 19694 35796 -13616 -14343 14441 5843 39329
9494 39329 7897 -57257 1112 75319 58305 1680 -2504 -12975 -39085 -46301 -20720 -10820
9482 -10820 -36000 -69122 -122557 -32431 32473 -10486 -45934 24590 97371 77745 26428 37827
9470 37827 31153 27400 28002 57331 83632 160518 196913 175847 92186 53961 79800 52892 7093
9457 7093 7590 31132 -5563 -18703 -39060 -76252 2369 46590 60476 31387 49880 59859 9190
9444 9190 12462 -9149 13226 38761 52218 136044 79239 46859 54713 57407 62043 -27970 -77792
9431 -77792 -21337 8302 31139 23805 19049 60060 51109 61152 60608 54024 63149 -18696 -92348
9418 -92348 -111140 -92726 -59415 -20616 -14245 -66249 -81598 -78658 -29648 11158 16831 -15232
9406 -15232 -1402 -45891 -42381 -14895 66047 63288 62242 72566 40716 22092 3230 34369
9394 34369 49537 65129 57762 10163 6884 20174 44471 73230 35903 1260 -16545 5982
9382 5982 58990 72133 53893 12405 -10006 -43656 -51491 -55609 -15049 19725 24121 3153 26918
9369 26918 53098 25487 10877 -2922 -6190 -5932 -22794 -81142 -125119 -119884 -73769 -65801 -127031
9356 -127031 -94598 -28619 -7037 -23129 -26209 -7678 -49253 -36932 12131 28608 76971 86956
9344 86956 102572 31674 31089 76494 46214 -10797 -79552 -56895 -14640 -17367 -53940 -10755
9332 -10755 21945 39537 31225 17462 -14241 -49146 -55931 3843 49569 6436 -6574 14314
9320 14314 13527 -11425 -69403 -41788 26085 22140 50051 60424 77749 33761 536 -9141 13889
9307 13889 6611 24388 2031 17007 27233 58238 116763 96984 54421 44803 37605 81460
9295 81460 73631 10189 31990 59956 82942 108000 120963 108532 92519 79689 98217 119404
9283 119404 65045 81012 151600 181391 130762 108523 132207 207884 272895 297758 326760 346383
9271 346383 357877 446552 537229 584371 581578 566609 622312 712436 804905 866493 982463 1042475
9259 1042475 1108264 1170814 1278151 1396206 1444114 1466372 1491189 1516081 1517964 1454409 1413682
9248 1413682 1405696 1373300 1291558 1261002 1227656 1191830 1094266 1014636 1019916 1093483 1129029 1115627
9236 1115627 1122760 1127809 1099185 1011424 953701 1004464 1065220 1109678 1093339 1160648 1270064 1319411
9224 1319411 1346789 1386642 1469352 1577157 1698072 1808800 1898444 2013754 2071428 2109407 2130315
9213 2130315 2132692 2098065 1995145 1884798 1747533 1651119 1559797 1425421 1283144 1132754
9203 1132754 1008597 960547 920251 827752 747286 674292 623036 560350 546675 468526 478354
9192 478354 494839 419792 373177 347731 318843 273750 254962 241695 231413 238940 255635 222896
9180 222896 193340 205692 236320 232721 211481 175128 172288 202940 173080 157822 119847 104013
9168 104013 191155 229529 162812 183734 161357 134790 100893 70115 61953 106885 99272 104531
9156 104531 98082 80131 106442 136131 84859 91367 113691 158874 135518 65348 84664 130103
9144 130103 174522 158135 149156 160811 182479 163991 143813 133179 151991 163698 166600 191526
9132 191526 192653 142718 179585 189717 250506 273710 240361 227707 189970 219768 258594 270298
9120 270298 269902 266286 258950 273525 309772 291289 249801 272899 274513 316658 388668 337430 319202
9107 319202 313547 279251 333072 343310 327198 333487 316828 291428 304084 307331 281465 274201
9095 274201 319076 334318 358830 416858 463677 458899 415891 454228 438260 404954 387542 425651
9083 425651 424531 427264 489348 523037 524071 507487 455554 484817 528896 558991 560919 540438
9071 540438 473737 488298 470902 483841 454564 471161 503040 484995 403377 343259 359581 314145
9059 314145 213474 174286 132365 140574 140923 118319 139773 183937 264951 328434 343762 336409
9047 336409 311602 333374 336565 307224 281682 329837 358670 345105 346977 389607 418478 446720
9035 446720 405401 463153 486728 436994 424283 450781 502460 484408 445785 437776 403920 353498
9023 353498 384225 427515 379159 337918 324964 348917 365828 381116 393154 383732 397540 402209
9011 402209 444510 485388 567957 620395 644760 663340 679759 711472 742832 800119 872759 903053
8999 903053 976247 991527 1004551 1021415 954570 951741 990994 1002895 1073102 1128879 1140601 1147009
8987 1147009 1185034 1106277 1072813 1090141 1077656 1097007 1040993 1041326 1009997 966893 990687 1019932
8975 1019932 1038233 1040795 1067628 1104791 1136252 1206979 1258443 1356315 1485413 1544425 1576492
8964 1576492 1629419 1709513 1798046 1858809 1920801 1961406 2025929 2172612 2277400 2407052 2575221
8953 2575221 2786486 3035994 3376636 3817368 4192081 4487360 4588829 4394559 4061699 3750783
8943 3750783 3544621 3342467 3180056 2903531 2617090 2444051 2362840 2276058 2292339 2380701
8933 2380701 2485614 2604317 2786564 3025853 3286808 3385639 3336988 3222047 3122755 3095508
8923 3095508 3135765 3173255 3263827 3405799 3509796 3608865 3745190 3855153 3946992 4119837
8913 4119837 4353954 4575421 4784791 4993027 5218528 5443442 5730468 6003451 6296939 6556898
8903 6556898 6838201 7143604 7537239 7949470 8392657 8908314 9404159 9973143 10565732 11253390
8893 11253390 12006848 12798114 13640199 14632178 15694971 16886404 18256147 19727213 21324219
8884 21324219 23060999 24881568 26860306 29106893 31579556 34382395 37575377 41157330
8876 41157330 45275732 49970724 55372284 61521460 68593830 76791821 86235604 97132072
8868 97132072 109823323 124535806 141522670 160717805 181473606 202833168 224107907
8861 224107907 245332664 266394339 285986234 302500555 314479884 320772363 321114955
8854 321114955 316005780 306564731 294097114 279882163 265084132 250560975 236900738
8847 236900738 224419987 213184899 203275385 194620879 187270690 181166953 176232383 172378199
8839 172378199 169557948 167838745 167102821 167320122 168638298 171116334 174744384 179568562
8831 179568562 185647826 193188077 202271704 213040686 225726080 240541053 257678600
8824 257678600 277271935 299469731 324098914 350722878 378710706 406538267 431994914
8817 431994914 452236944 464078536 464798336 453211203 430078498 398043344 360681422
8810 360681422 321641626 283728929 248809531 217770233 190691178 167397757 147559799
8803 147559799 130636279 116074249 103568758 92748759 83332277 75088908 67753962
8796 67753962 61318373 55740514 50795443 46475634 42703505 39347623 36259028 33503386
8788 33503386 31114415 29076138 27304484 25678968 24242490 23014966 22064857 21410975
8780 21410975 20788760 19878924 18603145 17286443 16190229 15291154 14556399 13916090 13378660
8771 13378660 12861681 12430508 12061695 11620877 11266885 11053243 10837229 10697133 10693857 10850104
8761 10850104 11110117 11520782 11930450 12114973 12121344 11836675 11163916 10392689 9659868 9068109
8751 9068109 8492466 7993414 7580587 7261665 7007014 6782425 6541162 6393563 6350900 6277934
8741 6277934 6267674 6319909 6394473 6437183 6316070 5969072 5562303 5223170 4998850 4760628
8731 4760628 4558606 4424496 4229123 4065150 3907620 3721451 3592146 3514341 3425917 3334950
8721 3334950 3251026 3168280 3058007 2978459 2927274 2907030 2799725 2735196 2781738 2769784 2692081
8710 2692081 2595314 2550168 2448198 2416920 2392679 2363738 2317440 2284503 2252986 2213805 2212212
8699 2212212 2207880 2268680 2294977 2299576 2285711 2245344 2196950 2087853 2070186 1968255 1873061
8688 1873061 1779877 1608651 1467247 1429661 1424592 1400367 1350383 1272227 1269121 1287997 1278367 1216791
8676 1216791 1169573 1141763 1114623 1170638 1151696 1184454 1213001 1218473 1220205 1226076 1221655 1262327
8664 1262327 1238417 1225481 1279803 1260503 1318653 1369921 1387875 1356488 1291515 1262623 1313488
8653 1313488 1324162 1297609 1220872 1173643 1157363 1191304 1174441 1118818 1082181 1050314 1023882
8642 1023882 944307 955131 973526 962861 919858 892100 856630 863418 871629 886304 869833 900062
8630 900062 930547 931838 937452 985274 1000541 997584 1028114 1081888 1075827 1102611 1135795 1128109 1122854
8617 1122854 1099276 1061827 1001880 1012715 1031387 1030046 1033093 1055963 1015461 961812 919793 837108
8605 837108 772604 743693 781295 764154 726791 675261 687805 654367 638473 661471 686263 727302
8593 727302 733115 703302 715705 703674 665190 693248 688830 699024 779157 777286 751708 742118
8581 742118 739821 700726 673220 664018 679992 727201 838054 849294 864649 831078 808218 832552
8569 832552 829212 832677 849996 901912 864022 823433 818054 870837 817814 738703 664504 686004
8557 686004 646893 629361 676959 640350 634275 616208 654188 627271 655477 659588 685258 648041
8545 648041 644392 641699 561490 561869 537862 576263 571210 544906 484034 465153 492732 533038 521794
8532 521794 570594 603610 590726 534208 556141 572022 558742 567554 555831 583871 547917 523759
8520 523759 478806 490938 550056 553744 564012 586044 562873 532875 571522 565969 574657 578369
8508 578369 485734 418977 410171 405460 425857 386569 391257 353735 382978 466733 434968 449299
8496 449299 452273 443711 424070 440538 430343 455788 463229 459435 464624 498764 541917 506619 482604
8483 482604 506177 533839 579806 616024 654717 770980 793858 748421 682939 647298 640494 678214
8471 678214 732055 745027 800550 851618 862318 888718 926560 1011631 1039053 1140584 1236104
8460 1236104 1381703 1512036 1613558 1650098 1714423 1829104 1922561 1944946 1962528 1964030 1916099
8449 1916099 1877762 1853209 1763662 1688097 1632591 1619803 1580497 1558272 1518825 1433144 1407807
8438 1407807 1408557 1425983 1410208 1431537 1483791 1448138 1403461 1385915 1354268 1369032 1386278 1423458
8426 1423458 1485043 1606073 1697737 1781732 1834806 1914305 2003420 2026767 2048176 2186885 2282888
8415 2282888 2329216 2378873 2389632 2485575 2545767 2489447 2431367 2339530 2131003 1959912 1843053
8404 1843053 1684781 1531270 1368511 1291462 1240594 1141232 994038 931689 904303 858616 751060
8393 751060 675153 615781 574800 521208 479201 495172 496974 486436 475526 452652 427039 425211
8381 425211 361035 376644 461587 518679 640107 693043 766474 826759 763499 595162 433627
8370 433627 379712 354156 326827 324843 291188 241528 237200 271152 308540 288698 285933 247093
8358 247093 262761 312468 300036 281260 306663 306444 265306 229224 200445 207676 220915 227688
8346 227688 227881 275478 309727 277867 215297 198664 184725 236132 267114 230323 213394 213928
8334 213928 177705 119668 169808 248197 245420 185159 157595 192588 169022 155287 189729 152389
8322 152389 176494 204399 225103 193873 201529 231594 175490 180804 157342 122206 104425 109179
8310 109179 201111 188497 123208 131943 159393 178822 241734 278096 258174 296203 263664 163950
8298 163950 114097 87466 135888 154563 160889 181081 222702 213779 225060 245894 195630 216077
8286 216077 223902 239629 188532 202169 191519 157290 179907 189784 158084 183587 184504 148295
8274 148295 132814 134725 131152 134022 163823 162245 174708 216235 244936 248427 242408 228684 241834
8261 241834 215781 165076 152130 190368 169951 162466 229898 230942 218978 310551 335604 269278
8249 269278 264610 274465 241582 214281 219913 191370 199308 227043 242932 185777 211080 278513
8237 278513 243220 287766 323834 240286 153691 144235 155712 190924 193346 206995 161472 128659
8225 128659 129715 146504 168617 180031 188997 166157 113533 86303 95239 104106 107887 117531 164748
8212 164748 171826 105702 127992 138075 52600 77966 59105 58314 81308 118142 106641 89371
8200 89371 114258 117229 79098 79426 65782 96844 100220 140920 162069 198464 213722 201208 140836
8187 140836 98502 174210 225835 178197 95603 84228 74728 105797 103785 68904 68421 33054
8175 33054 41545 111133 118070 64489 21045 70464 101898 88829 81257 96596 122670 106533
8163 106533 108363 125929 166802 254486 290949 200882 186818 170044 152253 163912 142273 89911
8151 89911 60134 50601 73657 43970 83425 182223 179206 129430 85526 82579 78180 61869 95268
8138 95268 107666 85489 107637 67764 70797 126680 155204 165103 128322 130732 116030 98528
8126 98528 104181 133532 87650 93926 129678 129544 81784 100242 120109 162453 181312 184154 217943
8113 217943 190540 129425 108279 67691 94203 182781 177854 191577 233023 251948 191264 129753
8101 129753 161265 167987 177802 232278 211368 178433 139084 134904 166398 136246 88375 71889
8089 71889 90420 102363 118285 149991 103476 57779 26655 11444 24662 116035 139724 105865
8077 105865 98995 67180 28165 43636 108448 119079 124352 141232 161785 192066 209688 154180
8065 154180 129605 104335 116957 119675 132472 117772 22523 8945 52430 21842 13146 87971
8053 87971 95519 13072 -22406 42598 106125 131845 89511 118527 137193 141247 121873 101958
8041 101958 77483 1646 33197 92324 84742 57954 46322 15996 56546 63113 46451 17090
8029 17090 3004 -2970 11297 29210 72653 125635 112363 65775 50067 55395 43279 39331
8017 39331 13063 -14006 7439 30908 61672 50857 72596 75845 135105 202826 177560 101391
8005 101391 107907 97155 89054 132944 140683 147864 102386 74685 57927 58320 58421 119987 128875
7992 128875 110149 96599 77790 73854 35520 -16585 -12923 32400 72819 128535 147012 153443
7980 153443 121580 171931 220602 164732 122867 147502 153456 128666 152376 170471 154122 56007
7968 56007 17453 546 22750 73403 69332 72919 71968 58181 -3913 -4475 -2191 -11787 13047
7955 13047 42716 46383 68909 79621 79071 36294 12660 -31512 -21236 -20553 81976 103667 111232
7942 111232 107397 39222 19939 51079 88299 60412 77194 114046 109870 63112 62700 49461
7930 49461 3519 9430 81065 126299 115590 60277 76455 45591 18459 55596 115680 69112
7918 69112 19086 -7081 -5467 37312 66372 98067 102308 126148 53017 29225 67117 63206
7906 63206 64729 128119 138098 148439 114006 97531 129171 168405 186945 130735 124998 127690 165232
7893 165232 127712 89104 108036 126658 96127 109761 133740 120595 70485 86126 77687 22095
7881 22095 42174 54240 50182 101321 124020 133202 80549 80858 43674 -17761 -34606 -17191 29955
7868 29955 26808 14833 50048 92819 74080 40275 13905 67406 60260 61756 65610 92599 98276
7855 98276 152185 156548 149880 191173 166942 179002 155971 122216 141200 127537 55737 3352
7843 3352 2893 50590 57505 27204 20739 1805 62126 61854 38824 26664 37948 45995 67417
7830 67417 65856 50862 18453 8704 14067 -6267 44972 138352 140738 78035 52788 -10166 -2194
7817 -2194 -11791 -12783 -47208 13213 110848 142076 174235 148487 79180 64331 96683 110670 103695
7804 103695 97134 114539 84169 46524 10885 37271 24711 -23613 11090 25035 27942 934
7792 934 64318 139838 160044 179167 127515 129181 106838 99574 102108 143008 170796 141005 123618
7779 123618 117488 38892 71259 93062 62456 55798 100299 62932 7954 12242 19560 101328
7767 101328 122292 53161 20676 40701 65673 100491 95694 80531 34455 11417 -9159 -16797
7755 -16797 -51889 6759 61508 48628 46314 57003 57348 41534 45374 43139 82317 66811 73452
7742 73452 95018 101853 53723 -8022 9422 30919 72725 122211 83236 75817 45626 46187 13013
7729 13013 2148 -15915 -68658 -20568 54652 65074 92429 98142 77485 59279 58494 43540
7717 43540 35026 35629 26749 55066 32911 38409 76468 94985 83790 121048 133170 94227 77475
7704 77475 24602 -5302 38241 37393 32938 37555 32144 54681 61480 43789 4516 7483 49732
7691 49732 44044 39153 83188 77554 72056 85333 97727 53321 27923 -19500 -21731 -69821 -59034
7678 -59034 -14447 -28062 -21773 926 10789 72411 65767 -992 -16091 -196 1597 15588 15054
7665 15054 -30626 -58776 -52816 -29561 5101 65743 22091 -58945 -44400 12064 35467 38250
7653 38250 23238 25490 23928 17293 11054 -11756 -15760 1356 34276 43074 44777 44504 50086 43699
7639 43699 15357 64463 111932 105211 91594 42128 -1545 19075 55587 63268 110124 120807
7627 120807 135441 84154 70423 47441 61179 34300 26257 65036 48238 55122 42223 302
7615 302 -1091 -17947 14515 34764 25825 4487 33731 66996 63043 42524 7375 -4335 26857
7602 26857 76081 104651 100439 112274 108076 112193 9203 -23691 11275 45519 16571 -9778
7590 -9778 -4428 41516 83011 95473 133235 85598 40512 -37948 -63113 -28560 -21733 4460
7578 4460 86752 83355 79082 84998 83550 66875 41384 50472 63829 74560 84457 63975 44031
7565 44031 3415 -9280 5786 39662 11812 2389 32013 18096 -38186 -81435 -28535 -20585
7553 -20585 30338 68161 91550 90420 85082 62412 1395 25599 76885 64046 -16117 -24466
7541 -24466 -21077 -48499 -2314 44223 -9038 -54039 -37146 19902 72178 31441 19716 9297
7529 9297 37561 105411 97754 48477 14292 -75989 -41550 -11649 9399 29003 3021 6774
7517 6774 16963 -733 887 21595 74776 66076 73901 36435 53007 108668 95723 61679 34735
7504 34735 -37362 -5620 -9615 -29432 -37708 12737 66708 -18713 -19434 -10956 -32031 6183 36842
7491 36842 53228 86687 69817 20781 20672 13525 14152 62867 49737 12135 62478 86853 49131
7478 49131 51792 79610 105924 68236 124899 147028 80410 54607 50086 14572 9642 78711
7466 78711 108916 78443 18279 15859 60073 78632 38369 -18240 -31232 -63053 -58412 -2684
7454 -2684 40469 53354 3637 -21568 -21149 20547 27092 36665 80460 106656 113829 61286 -19881
7441 -19881 -6414 29265 5819 15806 9009 -22001 -39213 -30211 -16208 -6745 -10546 12073 -26901
7428 -26901 -25198 12848 14941 -16270 -25258 8373 24270 49451 54141 57098 70967 49643 -15880
7415 -15880 -24456 -45049 -52411 -34050 -50920 -13877 -27035 -10195 47387 83932 21440 3457
7403 3457 13542 13459 10922 16888 -33354 -19637 52667 72077 91545 75081 80561 94043 60756
7390 60756 81134 45796 9131 40912 28497 9697 24011 59124 74676 37299 -4534 -27330
7378 -27330 -41481 6707 48770 37147 88794 153926 157254 118698 9221 -56633 -21459 36761
7366 36761 40528 43034 788 -35763 -68892 -123448 -155240 -116478 -42376 13553 14845 71680
7354 71680 125358 119309 49363 52468 75700 43462 53384 11855 -46278 -473 72449 94097
7342 94097 108415 40522 -39382 4277 16402 -25269 -5719 -26628 -65003 -34176 30003 61776
7330 61776 61741 30935 21684 41079 36115 641 50219 75645 15656 14970 7284 89165 103394
7317 103394 93965 68589 68914 70437 45901 52643 35979 33125 -13402 -16516 39766 19041 -35191
7304 -35191 -91476 -113333 -77860 -12349 46881 27534 21003 49869 44322 31295 12164 31811
7292 31811 54094 64720 9684 10470 73465 127284 121246 97155 49159 7337 47333 78508
7280 78508 41849 65637 61822 77748 96358 117557 58042 44563 61884 86097 104040 46629
7268 46629 6733 -8980 -5036 -15238 -9939 5380 -20496 -25277 -1601 18142 59391 81205
7256 81205 47649 26896 73826 85807 65001 48692 10360 5247 -7813 21022 52178 66763
7244 66763 71810 25003 10949 75008 103028 43299 -3556 -1965 -3908 -19060 -43727 -13810
7232 -13810 2671 36914 41186 -18652 30812 85108 90792 57654 1273 35552 37901 42836 56702
7219 56702 43461 40371 40585 6964 -11128 68163 109324 27808 -33837 -35285 -1506 -4264 12031
7206 12031 -7837 -48068 -26696 35500 11623 36496 105108 125541 83787 61498 40632 5889
7194 5889 3846 31792 79284 84209 25773 -13925 -55793 -72663 -37813 14229 -11323 -33873
7182 -33873 -72571 -142870 -95124 4984 112137 97517 70051 -28787 -56259 -68563 -50955
7171 -50955 -2685 -4477 -6928 25765 77148 20821 -2650 9672 58278 19361 -15060 15338
7159 15338 56623 54429 59950 59464 37292 7774 -25096 -52010 -26312 -31045 -83754 -68005 -53904
7146 -53904 -64624 -68594 -41308 -34489 -72778 -86937 -44299 -662 20648 67282 91751 78834
7134 78834 120311 56677 -28158 -113431 -101796 -71184 2187 52737 29070 20571 -811 -350
7122 -350 21746 47527 18933 -11167 -64047 -90209 -66315 -9087 -9438 21550 30679 18633 -14736
7109 -14736 -33529 -8177 -10669 -38017 -50021 -20573 -24435 -27837 -24864 -24459 -8390 21575 -8519
7096 -8519 -57012 -62530 -63714 -40910 -4096 -4419 9882 7627 -32012 -11765 10155 15373 -4577
7083 -4577 -18187 -10214 -7497 18046 30004 60910 86567 36235 43380 42543 -897 -12665 -32617
7070 -32617 -44959 -31082 -30014 -12814 -40774 -52308 -19069 37623 35483 -7331 36078 53687
7058 53687 52709 37702 -21398 -67426 -95826 -87104 -37064 19428 25543 -4588 -6963 -24771 -9887
7045 -9887 -890 11478 -1947 -14013 -2390 -686 3820 605 -60412 -39075 30796 35025 21157
7032 21157 14415 41931 75411 49730 80695 71298 85295 85643 20023 -53660 -26185 -15589 -32315
7019 -32315 -7619 -420 939 -18194 -2725 -14639 -32850 -34628 -26904 -30686 -57448 -36683 2746
7006 2746 -11770 -52350 -56140 -66839 -81333 -55265 -74938 -61290 -36542 -40723 47365 122976
6994 122976 118339 51841 31111 -12564 -37501 -18157 17062 54730 29840 -14399 -24038 62800
6982 62800 67764 49936 60845 37543 4671 -19422 28926 14262 28583 51055 70530 19765
6970 19765 -16396 18655 38699 48310 18789 -249 -30729 -58330 -75247 -18491 22149 51354
6958 51354 28112 24854 39145 53058 3846 -33912 4429 58477 85832 83741 38780 39983
6946 39983 21640 -26005 -43493 -40447 -440 34267 -30124 -23751 11337 67289 65770 25341
6934 25341 -15571 -38660 27250 78314 39658 30602 77735 99314 98390 68539 37616 21385
6922 21385 41196 5701 25448 47606 26993 24694 40445 18653 -59602 -89069 -77102 -35233
6910 -35233 48603 94811 86087 33874 -4963 -12119 10503 -4173 31309 101257 72599 12524
6898 12524 11043 -1655 -10401 -13707 2104 23824 32941 20724 37362 -20946 -73209 -54382 -15857
6885 -15857 9438 8974 25286 -7848 -73422 -2723 5268 17341 43229 18686 25267 35703 7677
6872 7677 -89951 -113801 -66924 -60981 -36740 53381 52108 -2379 -26445 14368 86676 71870
6860 71870 35082 81136 28233 -91895 -118111 -71117 -33727 -530 39677 24523 -6785 -17464
6848 -17464 -2745 -5929 -51074 -101975 -82297 -80394 -54848 -25291 24035 55388 56966 -19504
6836 -19504 31661 81051 -18784 -44630 -49796 -65623 -19685 -25046 -5934 -58149 -81041 -27185
6824 -27185 -29202 -188 24817 45401 9008 39739 74663 61745 7159 9446 19787 73745
6812 73745 115463 35872 -20300 13537 -332 -18376 34201 76735 57316 -9385 -43980 -57814
6800 -57814 -34307 -9922 -33408 -47891 -24757 -63535 -48790 287 7379 12595 13179 -14660 -48625
6787 -48625 -18679 28422 11353 -4088 12768 20797 366 -11076 -74171 -48907 9366 33563
6775 33563 36930 25919 -7315 -25775 21632 7816 289 -15198 -15060 19453 67441 115651 121377
6762 121377 84341 61457 14197 -16583 -11615 -65257 -33946 53654 75088 71419 53115 62936
6750 62936 26529 47815 10282 -895 347 20341 55287 60875 35823 18737 36732 24827
6738 24827 23376 58954 95726 62531 32683 58479 49312 25523 54220 9951 38052 58506
6726 58506 43785 62157 18464 -26966 -73339 -77312 -35595 -14273 20794 -9892 -38250 -8814
6714 -8814 -24614 -49218 -7609 -32836 -89817 -17340 27284 28688 15862 -28180 9944 27961
6702 27961 56597 72256 61160 57352 31411 -29357 24601 38877 -9049 1644 37350 72438
6690 72438 77978 38878 41435 35695 16674 14946 28450 40168 42216 32748 18526 21829 -2472
6677 -2472 -46622 -50454 -25093 -21173 -65096 -33527 -56282 -57569 -815 52435 72565 76423 38478
6664 38478 31579 43068 -8174 -61201 -37591 -61673 -41695 -17850 -55624 -52706 -27900 -22195
6652 -22195 -49701 -85465 -83291 -36446 -36860 -16445 2299 1652 -28396 -104444 -125074 -76442 -30040
6639 -30040 -50713 -59943 -133305 -159916 -72920 -52773 -6687 -31735 -47182 -25420 -20520 -38623
6627 -38623 -47965 -24847 -56300 -77955 -80649 -85235 -70615 -128314 -137534 -72000 -74270 -72646 -22113
6614 -22113 33614 31460 13765 -9924 -44600 -80158 -50898 -23569 -18683 -13552 2728 4068 -24457
6601 -24457 -3921 -14265 18129 9725 46087 28204 81251 65915 58722 51569 15675 17354 19520
6588 19520 30026 9746 -74337 -72040 -5299 -28107 -54556 -81402 -32110 -23581 -70887 -53928
6576 -53928 -37851 -38689 -18189 -12739 -51587 -75102 -16345 -9377 -50374 -49352 -15638 8175 27370
6563 27370 85646 50122 -20756 -11763 61706 14428 -860 -11337 3400 -55869 -80357 -59627
6551 -59627 9304 19588 33492 38674 8967 -19832 22471 28120 17194 -8503 32836 59476
6539 59476 43272 47638 18743 -51063 -53457 10239 86321 79546 24794 23665 -2967 6328 18654
6526 18654 -23708 -3630 50528 37546 26663 -22578 -48304 -56486 -19937 -8050 -18352 -4519
6514 -4519 19203 -7736 -10176 2349 17616 43307 34924 -10763 -41578 -22452 8811 22850
6502 22850 41469 53968 111053 86549 39359 45353 64773 -9453 -56280 -56186 -43071 477 -32246
6489 -32246 -96330 -113268 -88545 -85214 -78103 -56953 -16445 4087 9056 -3067 -27743 -82276
6477 -82276 -37565 -29813 -51158 -41748 65 14278 -8581 -5478 -57841 -44530 -32966 -89692
6465 -89692 -87093 -87854 -51606 -85339 -123511 -115679 -71875 -96466 -136082 -147277 -177197 -114014 -62740
6452 -62740 -58872 -34367 -38053 -84558 -76110 -43920 -22626 -41933 -88917 -112640 -59988 27512
6440 27512 67506 566 26391 58050 11315 8864 48649 95300 124190 79491 73479 38552
6428 38552 19817 7575 -112436 -142033 -120464 -132345 -117030 -101792 -96659 -81068 -87916 -106284
6416 -106284 -90256 -90410 -69407 -92286 -53300 28775 19341 -15363 -36804 -47792 -69632 -66324
6404 -66324 -54602 -59524 -95098 -104358 4623 36683 46643 20898 3078 27171 -2049 -43587
6392 -43587 -28632 -6342 10415 17015 23046 -16004 -57537 -62574 -47217 -29966 -31945 -36569 -23228
6379 -23228 888 15348 40126 49783 56502 22614 -7837 -50718 -14520 -1434 -19767 -65730
6367 -65730 -112480 -83999 -4296 56706 82154 63683 11825 -49801 -92007 -96915 -60888 -25157
6355 -25157 -14038 -15571 -62414 -113472 -34389 13047 5221 -41373 -20505 -30681 -12451 -467
6343 -467 -20230 8797 -10389 -28470 976 18943 23906 10224 26827 82671 58164 36639
6331 36639 14811 -40124 -81917 -72914 -20810 -42421 -46748 -43797 -52404 -58429 -15323 55057 103322
6318 103322 104996 123751 72332 9675 -47218 -60424 -28335 17671 79992 134724 101125 39140
6306 39140 45882 28397 12034 42728 52259 -7654 -32888 8514 29186 -10323 -14256 -46843
6294 -46843 -29026 -52854 -38532 -31738 -36051 -25857 -40000 -8180 41286 84154 53002 36771
6282 36771 63995 97963 13976 -12776 35269 -6642 -8321 42978 23603 49158 39481 -11994
6270 -11994 -76380 -78098 -78708 -56023 -81594 -99408 -88579 -49119 -17162 -28468 -41084 -16451
6258 -16451 56853 47126 35097 32093 48363 43262 23704 3822 37095 85676 99546 74222
6246 74222 3010 -68480 -98383 -112254 -79000 -83022 -97111 -46595 15858 43761 4261 -5442
6234 -5442 13790 -48233 -34666 -55884 -60268 -44572 -30430 21835 30426 47010 85427 69379
6222 69379 -11062 -50890 -66143 -38341 61136 86706 56002 40725 -11598 -69360 -40289 9473
6210 9473 31822 31989 40171 29123 -38660 1759 -29543 -90682 -69122 -48610 -20011 -27723 -76257
6197 -76257 -74855 24568 62182 24204 -3312 18202 27374 -4425 -55154 -58164 -22362 -17096 -25656
6184 -25656 -59048 -44599 -24011 -45780 -123744 -121116 -76699 -68718 -82868 -72702 -145109 -141325
6172 -141325 -126421 -155894 -137765 -70096 -35784 -46727 3908 34028 33757 39317 -14665 -16443
6160 -16443 -74381 -91556 -27988 39014 77133 49480 3560 7302 57067 128447 110846 50371
6148 50371 10076 -22499 -62261 -60270 -6524 -9686 -12175 168 34497 37195 -16418 -12758 46909
6135 46909 31159 -9421 17280 72590 49247 7785 -28827 -57259 -84428 -20901 12256 739
6123 739 -19876 -13664 40078 44621 24578 38993 31318 -30645 -88588 -130965 -150704 -107905 -79643
6110 -79643 -120784 -138829 -115934 -95032 -81969 -34947 46606 33139 -7552 46 -2744 -27795
6098 -27795 -49050 29629 31521 -26092 -32405 -12023 -2440 6 760 -34072 -12457 22659 28046
6085 28046 17869 4908 40788 43374 -29628 -88822 -106376 -47067 -38451 -32924 -27920 -8537 51301
6072 51301 78416 71798 75877 57255 40423 64064 47151 17608 -15099 -31899 -2653 10768
6060 10768 17196 1145 -48606 -34697 -27871 -13478 27708 63919 89620 78665 44938 39836
6048 39836 76320 28472 -44418 -61388 -26401 27467 8119 -5920 24238 20192 30227 48104
6036 48104 2392 -56129 -70909 -33167 14430 7775 -58478 -112016 -94341 -32653 -18858 -65683
6024 -65683 -105771 -91141 -55974 -51224 -64225 -22340 24514 25626 15068 55129 53079 35880
6012 35880 15687 32384 11911 33830 60950 28292 4936 -367 22962 28129 72142 84201
6000 84201 88779 50274 1574 4745 -51219 -81110 -20744 -5071 -33102 -53157 -83808 -101743
5988 -101743 -66032 -28836 20779 49898 45484 34529 25008 -22373 -50654 -38976 10593 23513
5976 23513 2074 -28105 -42851 -64755 -88884 -75542 -59371 -97446 -115019 -83671 -58297 -81170
5964 -81170 -84742 -88107 -110825 -77039 -68473 -70357 -62795 -23066 -32136 -50076 -33169 -1249 -9861
5951 -9861 -5614 -79195 -99719 -40709 -23132 -15886 -21915 -41773 -62442 -58058 -47240 -43395 -3632
5938 -3632 51826 9327 -4165 66389 34640 -32636 39204 37101 -13835 -46851 -57150 -37065
5926 -37065 -36935 -36913 -45096 -73109 -73854 -47413 -28386 -60056 -35284 36831 29837 57054 76465 61107
5912 61107 45335 11258 4146 50546 40290 -6518 -9079 19 30367 67583 91524 121986
5900 121986 149974 108784 35790 29363 -16332 -24560 1063 27305 13614 -15059 -37248 -79612
5888 -79612 -61111 23233 25620 5248 19086 1785 -8659 -9871 -36951 -17942 -13243 -89291
5876 -89291 -36376 95237 92507 83512 15827 -15617 18484 44901 26607 -9275 736 -28348
5864 -28348 -16075 19488 24490 11246 10300 -7382 16360 -17616 -24664 59 -16907 22061 25061
5851 25061 -22943 -40004 -51520 -84080 -170144 -173835 -122142 -92817 -99517 -84710 -92126 -92189 -38490
5838 -38490 4202 -1904 20182 -9424 -25937 20656 30277 28950 18567 -24684 -58264 -3770
5826 -3770 -614 -33653 -64703 -62988 -39922 -27663 -39140 -21308 -25820 -48721 -42522 -93621 -92124
5813 -92124 -60644 -12682 -66218 -134276 -66295 -52714 -23396 36038 45698 43638 57166 5975
5801 5975 -23673 -30559 -5425 -37715 -40688 -8749 -15475 -32061 5321 46948 73559 114776 96491
5788 96491 39606 17165 14773 22589 31852 16907 1638 -60756 -25852 16964 -18708 -12680 -2341
5775 -2341 -38520 -51087 16418 58671 76796 134832 88001 10835 -7085 -56964 -98654 -126606
5763 -126606 -107611 -15105 5822 53201 91606 78911 66604 9949 -34814 23233 37404 68674
5751 68674 18617 2822 24975 8675 57019 28368 -10026 -5499 -51168 -51126 -64374 -121841 -84805
5738 -84805 -17015 -10663 -16698 -47082 -15469 8539 -24312 -71985 -96092 -57104 -41545 27598
5726 27598 46436 -22133 -60115 -35008 -50331 -40894 -46561 25081 42860 -172 8066 9631 -5929
5713 -5929 8351 -26745 -74015 -10829 5031 57176 85054 140362 87441 31600 56710 31267
5701 31267 37465 31639 -26158 -5261 14265 6832 -38287 -83217 -105256 -96411 -64295 -23185 25470
5688 25470 61107 40764 57550 35223 -43058 -135524 -152655 -127423 -44274 7730 51405 62442
5676 62442 13079 -44018 -73268 -98751 -89761 -53988 -78891 -94960 -117870 -140978 -151371 -129875
5664 -129875 -76469 -26402 -22107 -41036 -54766 -63029 -43845 -79616 -115134 -77990 -78812 -49785
5652 -49785 -11373 -1710 22674 -24278 -524 -3398 -7803 -1668 9938 50632 71064 82271 94155
5639 94155 86237 98410 61680 -36100 -47576 -2661 24816 10357 -3178 -38318 -63857 7998
5627 7998 28709 3196 -51426 -89878 -101653 -86811 -85016 -72863 -32844 -5483 17811 2443
5615 2443 -43244 -20394 -2833 55065 39960 20796 7385 -42525 -79104 -111522 -115423 -114822 -124131
5602 -124131 -85648 -48063 -51935 -35639 -3580 33011 58023 56128 42315 21358 32261 24762
5590 24762 20126 34725 -15935 -41679 -11052 -16044 12546 -2978 -8311 11271 8475 -4210 -68422
5577 -68422 -80884 -60649 -68375 -33106 -24284 -13127 17616 37298 15690 6752 3312 -52634 -36648
5564 -36648 -32204 -25264 -47212 -5852 30283 20536 49992 -11438 -92680 -108549 -101451 -96297 -85791
5551 -85791 -78080 -78413 -95877 -82640 -43553 -47129 -53080 -18024 1984 9693 -55596 -89187 -72106
5538 -72106 -45571 31140 30610 67705 44598 809 -14952 -42352 -50578 -68724 -9551 1070
5526 1070 7157 20671 -23809 -40006 -25171 -37254 -53767 -85456 -65763 -100646 -144793 -167568
5514 -167568 -94216 -9086 -63753 -100246 -42029 -3864 -54161 -117971 -66474 -26746 -897 25376
5502 25376 49656 21831 -18277 19120 66665 63732 60357 50912 63735 24195 -9699 -1010 21690
5489 21690 32331 -6495 -19254 -12862 -28402 -47417 -72457 -35327 -29541 -11136 -12455 -28744
5477 -28744 -74795 -98492 -84901 -65356 -41013 -61845 -57984 -44643 3598 105923 143451 81319
5465 81319 98480 44619 -5958 -13143 -9234 6188 31325 26097 25451 -3278 -3631 36845 41310
5452 41310 37939 54905 19408 -47734 -93372 -96621 -36235 44670 -21500 -110707 -112282 -102714 -144237
5439 -144237 -159400 -122133 -135315 -86763 -75031 -43449 -83896 -71371 -66671 -136625 -116439 -128592
5427 -128592 -140527 -86334 -33593 -9985 -33095 -13985 6133 -21598 -57446 -55730 -65076 -60759
5415 -60759 -85964 -34344 12081 8617 45654 50718 993 -57511 -62479 -78040 -59466 -37440
5403 -37440 -42639 -28355 -50526 -73292 -46273 -25763 -29095 -17236 18638 36921 23224 6440
5391 6440 4422 -8326 -10632 16394 39153 3719 -20084 -63439 -34077 -51041 -116740 -86325
5379 -86325 -25031 9529 2273 -50000 -116453 -110947 -95031 -41996 -62661 -99302 -140595 -174326
5367 -174326 -149103 -106633 -122900 -146696 -137896 -100987 -63104 -35508 -40778 -29519 -33725 -51665
5355 -51665 -71705 -65130 -31012 -25475 -8835 30531 7522 -2337 -16601 -36064 -36723 -55505 -46829
5342 -46829 -16164 -41 15423 37903 8829 17724 31711 8658 -24015 -17759 -9341 3408
5330 3408 9020 6735 -64230 -85965 -66420 30943 11985 -31253 -102120 -96622 -85094 -86860 -117876
5317 -117876 -123781 -47880 8633 21087 1634 -1537 10038 15748 -19441 -85770 -116686 -44690
5305 -44690 -7156 47429 42246 -5915 7112 -8066 -72275 -22010 -2666 -17694 -3450 -35759
5293 -35759 -73497 -34426 -44123 -46646 -21032 -37174 -67765 -108401 -87153 1959 13118 55923
5281 55923 38987 -7526 -24838 -51275 -101151 -88236 -71108 -140373 -127772 -121644 -33379 38029
5269 38029 22373 4980 17887 9081 21396 23008 72610 88190 77296 82128 89074 10634 17434
5256 17434 44440 -34894 -72229 -86038 -26557 70488 66056 -44268 -74010 -70750 -33868 -37461
5244 -37461 -54079 -38935 -16795 -20255 -15548 -42747 -25109 -54274 -75610 -13505 10157 22166
5232 22166 -11100 -26698 11576 -9448 -25264 -14115 18886 29614 48082 9203 1837 10921
5220 10921 13931 -52767 -62008 -15899 5254 -17709 -34269 7935 38398 -212 -14552 -16239
5208 -16239 -21634 34890 90528 24268 28013 -78 -55438 -12053 -19906 -59376 -108346 -83551
5196 -83551 -88139 -88086 -76553 -55118 -32091 -84901 -120392 -105682 -46443 -19571 52383 27209 -22707
5183 -22707 -30031 -19425 39127 28770 -49638 -64939 -51772 -32168 5923 -7528 12778 -8013
5171 -8013 14159 -19051 -48599 -58674 -35136 -87570 -120839 -69701 -26581 -29122 -13284 1816
5159 1816 -38253 -54166 -72192 1540 -1426 -60080 -92293 -128213 -112752 -70021 -110950 -193095
5147 -193095 -173637 -123159 -87173 -84012 -44246 -4529 11352 7529 -4636 -43263 -65087 -3847
5135 -3847 6993 -58496 -65337 -42362 -50475 -72749 -64186 -94459 -129089 -114975 -74372 -51970 -23054
5122 -23054 -14508 -21927 -40703 -16864 16962 18098 30472 41063 42081 66167 69033 68458 62943
5109 62943 13786 -6367 11540 -12720 601 9550 -13737 -9500 18487 -10182 -6772 -475 -18082
5096 -18082 -26869 27972 -1818 46377 44242 3911 -61979 -89666 -69940 -38694 -101594 -107961
5084 -107961 -73954 -29215 22956 1371 -23157 30612 86552 136107 128218 28674 -62860 -63924
5072 -63924 -9111 -6795 -16540 -33628 -24143 -48196 -72217 -68138 -78317 -81361 -63646 -44701 -64353
5059 -64353 -108427 -102556 -55212 11317 28604 -38895 -52505 -132299 -145294 -187270 -105910 -47535
5047 -47535 -34845 -67603 -33173 37219 47796 75915 57834 21859 -45412 -54142 -70224 -97562
5035 -97562 -89540 -97941 -90254 -90881 -62398 -30120 -38483 9148 21328 31423 3713 1461 24082
5022 24082 45809 45537 14898 -11416 4718 24718 20577 5507 -38705 -39027 -4517 -16166 -35603
5009 -35603 11257 34605 -9405 -10292 -10896 -38463 -33501 -62068 -80245 -55767 -45298 -39923 -92942
4996 -92942 -96900 -55823 -12720 7261 -43957 -50648 -76102 -129073 -114195 -43399 -18641 -23219
4984 -23219 14693 13688 18832 -44700 -70501 -62245 -50381 -76009 -60451 -82700 -23886 36960
4972 36960 32387 9968 -26772 -5456 70594 14599 -12135 -41117 -43248 -23348 -32159 -46562
4960 -46562 -798 19901 -34690 -53007 -19169 -54298 -90063 -33114 -2550 -25322 -56257 -66894
4948 -66894 -80520 -16383 53525 33607 11055 -10875 -86048 -120024 -133976 -81883 7823 36358
4936 36358 -13535 -35942 22986 10738 6504 20473 -46629 -91555 -69277 -78005 -63600 -44658
4924 -44658 -92496 -133783 -105171 -78571 -41801 -19268 -53760 -81447 -54755 -67545 -62688 -15966
4912 -15966 20847 -10349 -52102 -64640 -50958 -91759 -128213 -65450 10678 30327 39674 57432
4900 57432 56029 79593 67630 42441 -31382 -84859 -61286 -20980 -42386 -78893 -113880 -128157
4888 -128157 -125493 -77502 -72307 -57130 -2958 -35207 -95177 -108076 -107035 -133424 -123416 -39817
4876 -39817 -18216 -57529 -8285 16953 -41872 -89127 -92857 -63758 -25160 45979 35258 2263
4864 2263 -16091 -37353 -63848 -60005 -10136 -39044 -13659 9843 28433 48205 50723 60655 10625
4851 10625 -21319 -20318 -22835 -27905 -29291 -44622 -8892 -35033 -71843 -85334 -95393 -87401 -100076
4838 -100076 -69522 -62195 -46574 -97085 -139567 -113117 -107837 -56549 -47783 -69280 -92521 -25881
4826 -25881 61081 54293 24247 22875 6756 -17220 -46625 -58413 -87957 -79841 -64973 -25455
4814 -25455 -35325 -30534 -12893 -56391 -44689 -29078 -72848 -134334 -119926 -97258 -54303 -10947
4802 -10947 6728 32506 66409 42740 18702 25778 22207 24034 37157 43779 16 -6485 -29955
4789 -29955 -46814 -63571 -93919 -158470 -135666 -87982 -21071 -20153 -59136 -78281 -39359 -1253
4777 -1253 -21087 -81943 -51576 -26772 -28790 -28139 -26521 35964 33189 -16295 -56328 -23734 -12791
4764 -12791 14801 -30795 -40967 -34382 24258 -4889 -16374 -10219 -31617 -22350 -30400 -38105 -53232
4751 -53232 -28401 -18719 3256 13960 -14102 -11054 -11969 -12391 3720 22598 27769 29757 -6943
4738 -6943 -44640 -56207 -35828 -9689 -50663 -101665 -101647 -35116 17262 40939 50262 22015 3661
4725 3661 16072 -46230 -67650 -43000 -50029 18603 31877 19106 -16441 3471 11156 -54950
4713 -54950 -36283 12901 -48686 -89428 -104001 -40546 27220 -1637 -35012 -66376 -63029 -45641
4701 -45641 -22145 20740 19918 37111 2311 -82903 -94563 -26426 -25807 3484 -8165 -68822 -95782
4688 -95782 -53254 -17546 -19853 -59947 -84064 -53365 -33167 -51680 -65120 -89813 -62146 1665
4676 1665 51605 35517 -16487 1512 39905 20571 -53204 -84853 -68803 -28247 805 -2716
4664 -2716 3810 -19902 -35895 -61629 -36714 -59637 -95951 -111230 -88853 -11166 -2089 -3648 9746
4651 9746 27460 -41761 -114404 -101820 -48314 -82075 -99165 -90215 -82229 -87701 -89880 -84847 -48612
4638 -48612 -51399 -40055 -48535 -42538 -3610 10291 -9764 -42165 -63030 -71119 -73743 -109546 -155431
4625 -155431 -125848 -100275 -69083 -66828 -78078 -32567 -41879 -47429 -96426 -118318 -140070 -94713
4613 -94713 -42625 12772 22491 -28779 -37219 -66000 -39074 3873 28753 5278 -18325 -18151 -21169
4600 -21169 -13313 -23941 -64793 -72190 -25064 -15542 -68109 -85427 -53450 -61370 -148470 -134780 -55351
4587 -55351 20304 16409 24333 27427 42371 29664 12397 4418 -46150 -57165 -103424 -166811 -109322
4574 -109322 -64020 -57039 -62742 9518 20707 -26127 -38130 52099 83584 29559 25294 27310
4562 27310 47490 30043 24871 81779 73844 44971 40434 22359 2363 -71390 -52976 7308
4550 7308 26497 -29349 -56872 -61040 -25132 -41634 -16100 10355 -15908 -63975 -119937 -147710
4538 -147710 -92416 -93989 -115658 -61307 -16149 -45014 -52653 -43244 -70329 -44368 -12027 20538
4526 20538 -26979 -10272 57212 102139 74899 60598 33373 30101 -20881 -18060 -12236 -15454 -7545
4513 -7545 -27712 -18721 -49111 -76368 -56040 -40924 -93560 -103033 -25590 -30312 -64476 -46135 -70696
4500 -70696 -53499 -16299 54453 46726 78327 148639 105051 35405 26956 13334 -37823 -59310
4488 -59310 -28878 -35712 -16770 21161 -12142 -17444 -35785 18380 42643 98568 96813 21865
4476 21865 -306 -1109 19994 -25394 -17760 -40149 -73746 -12531 13788 49240 85197 80782 43453
4463 43453 -10844 -18911 -10784 9708 5003 17905 31276 39790 68929 135113 133175 128783 84457
4450 84457 35644 52051 21793 -24668 -33039 -54579 -48925 -62106 -70984 -82281 -122382 -65628
4438 -65628 -23604 -84259 -88032 -16736 36798 -31574 -59651 -77001 -76975 -110962 -132822 -125944 -81185
4425 -81185 -17922 -41420 -110384 -25105 1206 -67990 -35220 -7635 -10413 -25038 18526 46928
4413 46928 46773 15940 -51678 -117573 -98264 -56564 -36956 -49416 -80297 -64360 -61047 -52669 -47794
4400 -47794 -41500 -35020 -92329 -122381 -52323 -3878 -37192 -75638 -94229 -42196 -52106 -76475
4388 -76475 -85027 -86394 -81348 -46250 -9527 -30229 -19057 -23065 -12606 16212 45247 26997 -31233
4375 -31233 -19996 11016 23552 -37026 -93107 -97833 -65645 -94945 -80229 -45356 -42492 -33900
4363 -33900 21799 16569 -4522 43570 80848 29379 -6271 -281 -4187 -44872 -75980 -32275
4351 -32275 2052 -6906 -8240 -15650 853 586 -12364 -18734 -53365 -54988 -35738 -44799 -90747
4338 -90747 -83397 -102256 -156865 -146347 -106807 -67060 -108033 -126073 -99558 -115829 -81266 -58713
4326 -58713 -48828 -40081 12928 205 3010 16481 -3059 -10704 19173 9146 8227 -7449 10509
4313 10509 -27285 -4583 11302 -26054 -52728 -95774 -128116 -131829 -184873 -149487 -98073 -76977
4301 -76977 -58338 -78199 -71424 -80846 -41956 -109769 -112920 -33188 13666 -15336 -55174 -38447
4289 -38447 -32847 -16802 48686 92218 86584 26323 25129 30302 90867 130502 83208 -4886 -85953
4276 -85953 -97650 -40871 -1016 -78 -14428 -22827 -35144 -16455 -6662 18012 91944 63456 -17776
4263 -17776 -18604 14929 14171 6392 10023 -7383 -17236 -38854 -48984 -53656 -47447 -72196 -77239 -57275
4249 -57275 -46599 1703 9354 -14259 -43781 -44321 -45352 -56238 -70391 -73814 -31137 -20583 -31336
4236 -31336 7826 82242 123429 65825 18220 2760 25540 -27228 -58485 -29262 -14714 -7230
4224 -7230 36514 62982 32236 10856 13229 -26223 -60087 -53416 -60709 -131973 -185788 -137515 -74327
4211 -74327 -70664 -63395 741 20521 -66801 -49285 4444 3384 -11973 40799 65788 62250 -22393
4198 -22393 -108550 -56858 -11164 -20684 -39452 -15429 -43147 -41190 33636 34525 -14741 -8202 -29413
4185 -29413 -80570 -127810 -100573 -45072 10831 -49361 -72777 -29139 -23696 -47375 -36990 -11555
4173 -11555 1861 -46483 -5837 24496 60421 46864 -8642 -37065 -57539 -56510 17704 61955
4161 61955 59949 31314 -49048 -55134 -51882 -15675 -26055 -10939 32921 -5063 -12792 22586 669
4148 669 -73727 -97277 -43596 -36768 -94910 -123060 -131118 -105770 -65662 -85153 -53159 -38515 -74759
4135 -74759 -6313 60249 9898 -71047 -90432 -74016 -23124 -1688 -46435 -50587 -85202 -75499
4123 -75499 -42496 -85788 -123158 -60411 -19623 8584 26738 16894 21236 13740 33650 30985 5180
4110 5180 -30461 -23604 -28024 -70908 -41487 -28262 -14571 20023 53062 87841 51676 -3528
4098 -3528 28485 52103 24195 3811 16512 60527 40387 -654 -51627 -63267 -39002 -2395
4086 -2395 2719 26562 1885 -34648 -16921 32018 7710 -14498 -6398 28609 43634 30897
4074 30897 -7214 -49349 -16229 6501 17509 -24404 -87745 -49131 23413 27206 -30648 -55814
4062 -55814 -73112 -110880 -76901 -55297 -87668 -66001 -46077 -47282 -39706 -17822 41921 37337
4050 37337 -11403 11008 49144 26554 -29222 -51398 -2733 85219 108728 99859 22081 -8098
4038 -8098 35718 55424 68273 38865 -14114 2847 75094 86189 72116 78913 96953 97314 115869
4025 115869 68779 -30 18551 -8945 -40192 -27343 -3253 16342 -5323 571 -3639 -1923
4013 -1923 -5489 4500 12376 63964 4808 -30671 -63847 -56265 12774 -1723 -52026 -45637 -54164
4000 -54164 15827 46914 5191 -21104 29848 31970 15211 15242 17485 27250 -25015 -2807 -59004
3987 -59004 -80534 -96718 -54669 -24703 -33410 -43595 -14035 670 26817 25099 -1826 -61161
3975 -61161 -30313 -764 67539 50344 41833 42564 8309 17765 25571 -8627 -57119 -88039 -63047
3962 -63047 -25290 -1161 18532 2262 -14843 -32076 -30181 14346 -41089 -87002 -97680 -59181
3950 -59181 -38965 -49888 -56274 -72624 -51161 -23215 -6700 1073 -34623 -18257 16215 23357
3938 23357 -3092 -27786 -33325 28901 55856 47556 64976 50841 2035 -62335 -81678 -85480
3926 -85480 -40290 -42865 -75077 -45504 -33295 -27281 -8806 -56904 -82314 -61528 -65981 -81144
3914 -81144 -75456 -57929 -72522 -83324 -57990 -38741 1903 25835 -3463 -74122 -81054 -104909
3902 -104909 -39129 -14102 -20301 -16780 -13146 6624 -29487 -71353 -23017 70528 96178 79527
3890 79527 52398 19918 35405 30045 -27415 -77315 -106135 -107326 -91807 -97656 -41125 -40999 -67750
3877 -67750 -70502 -45414 5287 40430 -9007 -40168 -20356 -20665 -21327 12562 3459 18576 6669
3864 6669 -36509 -85932 -111257 -95436 -92228 -75285 -101387 -57428 -72698 -67182 -51787 -53170 -88825
3851 -88825 -47871 13868 25012 -16112 -61176 -117392 -124823 -78200 -44573 -14567 2044 51598
3839 51598 43386 36788 60306 48814 43892 10197 36703 59258 42389 15222 -39086 -17831
3827 -17831 33248 32304 -29834 -75572 -73261 -24270 -28109 1896 30787 32485 -14266 -68569 -42994
3814 -42994 -35918 -74875 -42231 -2944 -67 -24009 -72328 -94288 -117124 -53752 -19816 -14496
3802 -14496 -24086 -36312 -31796 -30854 41503 28049 20854 -1945 3431 -29511 -74817 -138187 -114820
3789 -114820 -46811 -50863 -2746 41537 32568 43870 90509 45843 -17340 -25861 -54220 -58405
3777 -58405 -48401 -17974 -51104 -75329 -52496 -43548 -77727 -66594 -43196 -48383 -21668 15354
3765 15354 18736 25688 32134 8837 -23797 -17623 -56950 -51691 -35413 -32022 -46957 -52912 -25635
3752 -25635 -34894 -20070 -22006 -24565 45781 67904 39660 31816 -14771 -9605 -36146 -17132 -39519
3739 -39519 -37553 -13851 -13264 -36359 -37944 -47873 -31107 -38544 -78690 -44561 14690 -6129 6719
3726 6719 3556 1797 5026 -23990 -42663 -21980 16066 -14946 -25471 -35095 -9635 -14270 -56375
3713 -56375 -41198 2407 33274 21376 41207 41626 34313 30291 47795 16137 17508 -53976 -97282
3700 -97282 -59017 23099 95728 37161 -46852 -59279 -61754 -33327 -16834 -42479 -38208 28515
3688 28515 88980 25399 -16511 708 11044 1401 -52296 -100517 -134682 -102161 -62450 -62102
3676 -62102 -27674 -31721 -80634 -31252 -22639 -19446 -14527 7119 43999 56932 42185 -226 -54078
3663 -54078 -52818 -31039 -34883 -12516 39843 56783 61583 31714 39168 76021 42474 -24862 -33121
3650 -33121 -9928 37904 11866 -3821 -40726 -48283 -39659 -61153 -25637 -7489 -14257 6179
3638 6179 11658 12644 -13886 -40494 -27587 -16184 -7085 -52892 -37062 -1405 31026 35264 29108
3625 29108 13824 12009 -18501 -51494 -68529 -93953 -86871 -70517 -88132 -76442 -69091 -49393
3613 -49393 -39049 8527 -5062 -11203 -61484 -33435 -36594 -79935 -19095 24298 60048 60493 60580
3600 60580 6299 -49915 -111289 -131903 -100402 -62117 -35251 -1753 17444 -52335 -61003 -99276
3588 -99276 -89431 -59738 -114347 -158762 -159336 -149795 -146083 -112099 -46545 -25630 6166 19238 2397
3575 2397 -56752 -42774 -34147 -67881 -91513 -80786 -23230 -2636 -25938 -35268 17496 8899 -10129
3562 -10129 -36482 -54815 -68741 -1436 15519 70281 128517 66189 19410 28559 80381 89913
3550 89913 134896 128106 55525 41272 75466 48105 -17628 -14754 33382 41765 36466 -21686 -2011
3537 -2011 -62828 -64891 -12190 -21181 -48011 27582 52929 6104 -7407 -2687 37164 47832 22424
3524 22424 -27241 -46494 -1473 28613 64691 45792 -134 9662 -15255 13407 44314 70679
3512 70679 55540 110211 37178 -28670 -63468 -78070 -84869 -57467 -80603 -161513 -138057 -82834
3500 -82834 -104394 -115605 -104219 -95278 -26431 29272 36091 42123 -12598 -35780 15943 42203
3488 42203 79303 53715 23624 62931 76911 74354 38066 7574 -40763 -52367 -38045 -8284
3476 -8284 -13118 -54231 -26793 54495 52624 73681 35893 14146 -41642 -92364 -41727 2160
3464 2160 9756 16720 23575 6044 28251 -5472 -62903 -64277 -43910 -24783 -11492 -30798 -32438
3451 -32438 -42393 -55687 -19055 -18900 -2704 2061 6881 -14993 19921 28367 31175 52659 34825
3438 34825 -26502 -48156 -96431 -108495 -81277 -61691 -76031 -73443 -50979 -41802 6214 -24833
3426 -24833 -52696 -48907 -74195 -115231 -89875 -72655 -29427 13091 49767 78931 51370 36397
3414 36397 -67542 -91201 -7557 19535 -40008 -30316 4461 -15879 -7727 19910 25897 -33561
3402 -33561 -54747 -31259 9826 2401 44172 7350 -21146 12731 6860 7748 17700 36654 6943
3389 6943 -6911 5382 82453 23036 -18349 -48964 -52310 -7131 -20964 -34878 -34138 -15821 37041
3376 37041 130563 126201 60147 6762 16350 48273 73808 64159 23986 -27901 -16126 -13876 -62136
3363 -62136 -10632 -32747 -24709 -39888 -21108 19247 59142 77058 79506 97580 83853 48818
3351 48818 40983 43910 57498 37781 23737 3915 7364 19605 29429 74752 80854 34755 -11255
3338 -11255 -56638 -38182 -35601 -5892 7357 -13759 -5500 12489 18968 -40648 -43773 -59545 -32569
3325 -32569 59421 65821 73618 76585 48084 4020 14379 21503 35277 49226 50927 35159 28894
3312 28894 46465 38987 42506 28489 -7469 37178 98419 53508 -57636 -97785 -84505 -53409
3300 -53409 -50224 -61635 -58845 -924 -18486 -68885 -76461 -15415 48504 50464 49579 4431 -28763
3287 -28763 -39283 -66818 -49172 -23522 129 1425 6353 -12438 18319 -1124 39969 19694
3275 19694 -10163 -36261 20452 81892 52106 33607 39539 -2303 -15318 24275 33669 37139
3263 37139 12957 4969 -24730 -16990 39260 26228 -42336 -7422 29992 54952 61325 36873
3251 36873 20791 35037 43327 42208 10242 47156 33991 15081 40197 65044 89660 83239
3239 83239 43019 41812 34617 46469 48688 -14301 -65898 -41225 -15012 11624 31923 48016
3227 48016 70697 79664 20455 32961 -8989 -73993 -48261 42355 28696 38445 54919 40026
3215 40026 -14104 -30288 -19673 3087 47233 21575 -12295 -23258 -23332 -10155 59218 56395 8795
3202 8795 16839 22066 -9755 3910 13567 -19040 -41159 -9572 -39117 -55881 -13761 7443 -3625
3189 -3625 8934 3176 -29724 -47848 -15314 -32036 -5952 -18659 -63979 23910 74975 -11565
3177 -11565 -19123 21776 31750 27358 11138 -43112 -56719 -28882 -20010 21100 32718 23415 15986
3164 15986 13166 100338 105413 62357 52288 11642 -10609 -8866 -4753 -9987 -13400 -18279 -28408
3151 -28408 -17779 -21389 10384 19521 54389 292 -105265 -108797 -104348 -79050 -8515 48994
3139 48994 17551 6998 -16575 -52233 -89755 -77262 -50114 -27179 -11573 -10067 179 -31338
3127 -31338 -15665 -166 17843 45262 101077 76411 45476 35431 25798 -2637 -25078 -48518
3115 -48518 -42363 -21267 -12777 14774 60155 96562 91444 2814 20714 76636 57945 50708 53574
3102 53574 123638 89274 72525 72584 24704 -14076 6286 16138 1551 -18400 6668 59860 63225
3089 63225 39720 27626 22424 -43433 -16691 15470 57817 72649 32458 42864 39690 1469
3077 1469 -5485 3782 44661 21409 30119 -5263 -37920 -25678 -61025 -56273 -47669 -34400 3963
3064 3963 53880 61949 38544 -14542 -41983 -53198 -40299 112 6723 61265 60756 41750 49346
3051 49346 57191 61540 95976 52473 19068 4215 15400 4704 -38857 -54811 -55296 -26831 -41263
3038 -41263 39389 148501 145124 63549 44282 13529 7044 1144 -34936 -56886 -55855 -79909
3026 -79909 -61689 -2494 10778 4479 15101 46393 49714 -28213 -58251 -14169 68971 55364
3014 55364 27983 35726 -3519 11378 18315 4815 -20640 -17151 48105 71936 52665 2674
3002 2674 13561 43950 -22389 -45314 -61728 -35663 -73875 -94717 -85583 -88170 -71364 -93400
2990 -93400 -110681 -112473 -94890 -59236 -22382 21370 13799 12912 -32422 -94851 -61498 -7890 25617
2977 25617 3485 4697 -3110 2774 25822 56353 68437 47737 51168 9896 -12200 5258 -2668
2964 -2668 5165 -11609 22352 22724 10314 12321 15703 -69190 -35682 14377 -7583 -1962 -49867
2951 -49867 -91928 -60983 5261 37519 46270 -8379 -14200 7469 10896 -5892 -35572 -61673
2939 -61673 -51532 -65348 -88617 -86916 -31807 -1019 -62116 -101717 -118532 -131605 -58891 -26941
2927 -26941 -50225 -50243 -43795 -45014 -65418 -64559 -11963 -1112 -26618 -24448 -28113 -47426 -38742 -16438
2913 -16438 -6498 -3705 -46530 -85649 -78597 -86663 -103195 -80085 3495 63560 72249 57184 20925
2900 20925 -5470 -30493 -32965 -35326 -81906 -88107 -28212 12018 36582 35888 9924 1517 25966
2887 25966 86902 28876 5704 7358 3381 54269 59748 -1491 -73036 -104525 -24196 -5838
2875 -5838 5199 17715 53184 28698 6487 51251 20052 2692 -20649 -29779 -32467 -61762
2863 -61762 -31712 1197 4887 13856 29768 45265 -7836 -42630 -9500 -46828 -14929 -28050
2851 -28050 -8230 24997 36230 90829 122338 121501 103831 99128 128432 113920 73384 38006
2839 38006 -29933 -61085 -63115 -11749 26040 32239 -4026 -5221 3908 52456 70360 34340 -69884
2826 -69884 -69746 -20467 -36690 -47153 -38010 13002 33622 63617 78914 59162 46998 18763
2814 18763 56993 111630 17172 -8661 -12508 -27430 -2748 2462 19249 40423 -14637 -41301
2802 -41301 -36309 6322 63787 85052 78136 50333 9256 29373 24667 -33096 -29260 -71396 -88544
2789 -88544 -91293 -47900 -33044 -40357 -39839 -1018 26973 48355 57232 53340 55612 -2365 -6162
2776 -6162 -18783 -68331 -33171 -35272 -52060 -39832 -29098 -42083 -65669 -67072 -387 24255
2764 24255 3507 -47971 24275 62539 71396 68740 47388 28847 91 13346 -31350 -49701
2752 -49701 -62097 -41811 -30433 -42571 -59206 -77642 -82145 -77639 -84119 -107777 -83266 -94321
2740 -94321 -84241 -79805 -70122 -92617 -96882 -23222 -14000 -24387 -14489 -41638 -34219 -40633 -74159
2727 -74159 -120031 -55133 -53469 -84894 -81969 -48881 -21429 -21018 -62469 -23306 31906 54632 73930
2714 73930 11820 -15657 -35121 -29801 -43184 -48863 -47633 -20023 -10199 -11305 -92830 -76703 -77919
2701 -77919 -110132 -55087 -11938 -29156 -32313 -46684 -67242 -54350 -25016 22858 -10656 10989
2689 10989 -26817 -27930 2396 5544 25475 -16630 -14618 -36618 -4688 13722 -15663 -34214
2677 -34214 -21828 6278 45875 34246 -28646 -49923 -20915 -20643 20507 -4227 6086 -1015
2665 -1015 14979 21571 -10297 -8790 -5687 9000 5473 -391 21195 14187 -15860 25613 13678
2652 13678 11253 55747 76549 51227 50028 34616 31514 35927 59968 79383 28453 -22155 -64762
2639 -64762 -12097 22190 42398 62945 129214 63590 -48944 -84973 -123713 -88305 -19398 23052
2627 23052 23565 22563 21523 16324 46724 39547 -37861 -72243 -54174 -15300 19982 64554 69443
2614 69443 691 -12583 -36222 -38533 -44093 -57954 -81416 -72768 -87689 -102308 -87017 -74397
2602 -74397 -57675 -39513 7812 24176 6471 8420 -32928 -35749 -31189 27290 17513 -17854 -5582
2589 -5582 53160 80788 87343 21400 3253 84 -587 -25812 -32855 -17214 60870 74578 89156
2576 89156 98101 44389 38513 44186 43046 -11509 -25505 -31496 -2986 4109 -42481 12364 87636
2563 87636 98097 56219 94788 102529 74536 32151 39772 29342 -52718 -36119 -5699 -16765
2551 -16765 -38527 -70628 -15351 21846 65278 31421 25869 -33659 -49877 -47530 -49771 -76050
2539 -76050 -71327 -16109 32652 31271 11164 -9801 -15998 -14694 -32229 -39559 -62071 -42386 -4701
2526 -4701 31672 26488 4779 -10683 45264 89222 32296 -3608 -3903 57772 52774 17637 -14178
2513 -14178 -51588 -73508 -40338 -42271 -40343 -43712 -24060 -41983 -39330 -32362 -2902 -41317 -58538
2500 -58538 -57297 -87259 -47663 813 27577 49131 16527 12399 -11949 7293 40870 85257
2488 85257 122848 162587 128316 101962 81415 54151 -15266 -36410 -11693 -20661 -25632 -31834
2476 -31834 17835 -3381 13539 -57846 -102695 -113271 -68156 2034 37802 -24520 -39382 -50197
2464 -50197 -29152 -49584 -108714 -54513 -9759 -13627 -29239 -36569 -38958 -25705 -24649 -46344 -21613
2451 -21613 -66386 -71771 19448 90364 80937 29337 40664 67504 21804 2281 -9481 -12256
2439 -12256 25942 34622 35123 -23868 -39786 -49281 6818 15990 4944 20693 64432 71316 58719
2426 58719 41293 48732 12858 -8427 20232 50106 53480 18626 40496 44703 24756 -22667
2414 -22667 -28836 -6252 21170 24231 -29782 -10790 -24694 -103037 -38415 33718 45734 -12408
2402 -12408 -25271 1218 55067 87068 93540 135412 126444 106994 103734 54076 -13851 11280
2390 11280 -24832 -26390 56500 120944 132643 123052 59306 65461 66303 69783 57980 32097 -25738
2377 -25738 -29326 43650 67530 96228 128580 121663 85181 64042 19090 -37215 -16983 30341
2365 30341 31433 36118 27787 38605 -30222 1069 75935 28995 20542 81898 70224 104595 122398
2352 122398 109999 64602 55200 32585 27746 46935 70604 88317 65951 81445 103615 29541
2340 29541 -2467 20180 46205 44539 54986 86898 60834 -11269 -24019 -16794 -16053 -39085 -14691
2327 -14691 -1330 17469 5674 -37036 -37229 -21953 -44126 -33865 -62482 -28005 -28905 -2207 91993
2314 91993 103086 56623 -13370 -42524 -17571 -8584 1213 -19575 15575 12358 37344 31006 21459
2301 21459 30517 20419 -34248 -57467 -56664 -21406 -23075 -72732 -80546 -30184 1212 54603 105839
2288 105839 116864 55115 -5276 -42116 12471 29650 -22466 -65787 -17332 34863 38432 14684
2276 14684 65130 88487 87137 31107 15755 54478 109684 119829 43018 18915 30687 58147
2264 58147 36811 18061 -5506 -45709 -38784 -9369 11431 -20310 -1983 22539 20560 16068
2252 16068 4292 -15041 -41929 -47827 -46996 -27265 -19680 -6158 -8777 -5723 46387 38624 26394
2239 26394 -20802 -32633 6853 -3508 29826 47493 55065 57195 41710 40128 44925 -19335 -34353
2226 -34353 -21532 -17662 47851 85884 48752 29499 -44948 -63963 -26577 19680 86623 55016
2214 55016 -19357 -23069 35513 14692 -42306 -68800 -63334 -10036 -65009 -107147 -110102 -90767
2202 -90767 -30176 -11862 -398 -9714 -24358 -30537 -98949 -73462 -47741 1014 41042 -269
2190 -269 -22114 -27696 5767 25896 23681 7743 8020 -5488 -42450 -26401 471 -23369 -66849
2177 -66849 -42021 -37720 5368 9965 19668 32915 16122 11701 55340 68341 89481 40898 8397
2164 8397 6087 35546 45328 57257 12990 -21285 -6310 -36383 -98994 -103711 -79344 -8291 14103
2151 14103 27614 37613 16340 35911 23879 10809 -16167 -14061 -6130 -32222 -48419 1179
2139 1179 20330 29870 36801 68740 65901 70248 78464 68070 25597 11247 34121 12210 12860
2126 12860 19986 18067 38083 61954 -18030 -47262 -104361 -125826 -63662 -16587 -49941 -72789
2114 -72789 -53983 -28821 -11852 -23865 -5523 35761 27955 -35208 -44648 -40772 -52738 -41378
2102 -41378 -7166 5620 59890 78571 70891 102352 91820 49876 22677 -166 13602 43283
2090 43283 25297 -9644 -17102 -59201 -71758 13237 70046 35406 15032 16827 9972 17534 6623
2077 6623 8799 -5655 20237 -180 -43008 -23232 -56242 -63303 -51483 -74540 -76699 -89715 -58150
2064 -58150 -13466 19044 35854 47724 3845 16083 12341 9740 15693 14798 -6682 -1307 10624
2051 10624 -20781 -9074 -12765 8479 70323 64985 45293 32756 -21052 -67028 -58813 -42893
2039 -42893 -9152 -31293 -33771 -19665 -53313 -79368 -64030 -20760 9679 4606 16857 -24239
2027 -24239 -89453 -96031 -61722 -24582 -22686 -52979 -14898 -15540 -20399 -30042 52900 71365 -8563
2014 -8563 -46608 -42526 -30006 -41350 -57522 -44012 -6137 51159 70894 34531 55531 77949
2002 77949 46657 39237 -6108 61360 82146 92515 137409 160694 131256 115894 93087 60176
1990 60176 29153 -13320 8951 -39166 -69652 -3969 44753 46088 65033 52427 20974 14871
1978 14871 -14369 -39802 -29536 22100 -8373 -58515 -39486 37990 10451 -19777 -9330 -3422
1966 -3422 -26513 -42001 -27623 -9857 -22108 -27762 3901 112675 107292 34564 -127 -24187
1954 -24187 -41662 -18284 -11604 -41822 -4474 -279 60106 65909 20862 62726 55685 8780 1574
1941 1574 35164 19247 -21442 -23208 26078 50574 80677 65130 3205 57299 67031 18594
1929 18594 8598 42874 104735 125810 97428 21241 -84688 -109834 -71722 -17532 -27981 -8964
1917 -8964 24858 18262 6586 -17099 -42215 -11151 -33503 -32845 -2060 27783 -32082 1946 14335
1904 14335 47942 35073 -4485 -17465 -5912 11890 11050 10697 3781 3222 28414 27073 66634
1891 66634 78905 61652 37399 24439 38129 71856 101844 135973 55908 1488 425 4817
1879 4817 2717 -11278 9697 36666 46705 71299 82754 40940 27001 34878 80349 105747
1867 105747 85909 84270 93037 97132 78355 84294 87427 66571 22724 -7403 -27671 11493 1823
1854 1823 -12661 23600 43710 22857 39982 65976 22054 -32269 -60385 -52440 -61080 -76804
1842 -76804 -47887 -19617 -37570 -25181 28398 7149 -16611 -55651 -16010 -20337 -10906 -2810
1830 -2810 -17256 -28598 -18757 21195 17249 -17573 -43 54794 56954 95127 111455 73738 96337
1817 96337 81187 38184 61741 94219 88833 62626 41773 68477 85349 66117 48028 99144
1805 99144 57880 -43448 -77211 -55441 38492 106811 72764 80583 81628 46432 17125 33492
1793 33492 58559 62719 59008 19705 60307 116141 128368 148936 127076 71521 57501 123609
1781 123609 143287 171873 135804 69940 91789 116837 117938 96558 61119 59513 80258 57964
1769 57964 6106 -21051 -25955 -10669 11759 14596 -3464 -37470 -42057 -5728 39254 68931
1757 68931 82221 61091 26431 65850 110170 78399 -7786 -66956 -71058 -69083 -63269 -8325
1745 -8325 52613 38599 8746 21327 22865 28283 1156 9439 6017 2648 10470 -15244 2684
1732 2684 64343 70072 46097 20310 43110 74759 58585 56490 -6068 -21608 46663 85755
1720 85755 88001 93082 84918 44629 14503 21440 30941 23905 62093 29999 15645 13849 20358
1707 20358 52167 109478 118373 100888 39046 -32336 8668 46653 76776 119063 41668 -12698
1695 -12698 -3988 36094 56210 31976 12072 32805 49323 69630 24808 32191 72661 90085
1683 90085 50989 -14991 -10333 -21134 -4341 33681 57642 -14176 -46876 -26421 -8370 726
1671 726 2515 -54417 -61121 -32180 -28667 -21206 8868 28119 36035 111449 111943 35840 -18790 -18534
1657 -18534 -1416 -8765 -9200 -12059 4062 6016 27185 38852 45241 90516 99255 58861 23861
1644 23861 24352 20706 5107 -25224 -10394 -3890 -14039 -68221 -68940 -20341 -27556 5712 -35669
1631 -35669 -63192 -85120 -83867 -39342 -20939 45377 74320 77959 58685 12104 -3694 -20653
1619 -20653 -6568 -6554 -9186 -35024 -38757 -38799 -6339 20444 26773 64389 48626 -51332 -91073 -69350
1605 -69350 43170 27277 -7139 30426 28067 26601 -64084 -81005 -31088 -3843 8794 33326
1593 33326 75376 34951 6995 -41663 -51391 -10307 7664 -40692 -13926 4149 12275 -45174
1581 -45174 -60757 -49118 -14060 11450 47794 60804 50174 14783 32269 69265 21727 -264
1569 -264 -89 -4345 -73308 -82414 -62907 -58977 -30888 -36601 -28776 -42908 -942 62252 48241 33625
1555 33625 13238 64411 74367 15869 -16402 22491 20336 9649 -1771 -35637 -11471 4845
1543 4845 -45842 -31904 -47039 -83222 -48580 -8017 -2975 -41131 -110208 -71786 -2807 56762
1531 56762 78219 73901 -5859 -33968 -8752 10492 5449 -19612 -49256 -36931 -15562 -11109
1519 -11109 -15931 -24731 27838 100734 128699 91752 54119 16726 -14344 -12497 37742 88858
1507 88858 81059 59258 41782 7590 -10733 -27139 -18642 -4640 -16591 -39787 -43873 24266
1495 24266 75570 102932 65780 -3081 2189 -18279 -31268 1821 58788 -9896 -46768 -24083
1483 -24083 -24792 -5736 24453 -372 -15959 -66010 -74821 -12373 -3133 9470 7148 -25885 19404
1470 19404 -28816 -36815 -21149 -35048 -36698 14634 72534 59435 80136 74620 56416 -16682
1458 -16682 -19896 7699 -42800 -75750 -46663 -29159 -2164 2747 -13087 31964 12406 -4085
1446 -4085 -56185 -75703 -11054 20670 46169 12168 -12040 19675 20750 -3633 9059 24130
1434 24130 10500 5794 -5756 -21964 -58090 -25101 17804 18023 27799 17126 -6736 37469 16066
1421 16066 53466 64281 32965 -17700 -4321 34652 43521 134 5295 38336 47198 36839
1409 36839 34700 10350 22018 23551 21498 43113 20938 7249 -29399 9671 31634 100956
1397 100956 102869 82260 100286 42837 27927 72103 134679 177450 133438 43381 58836 42543
1385 42543 -7270 3321 49480 18607 1780 50711 55009 43274 53233 49289 77815 139484
1373 139484 148116 104312 41680 12941 10532 47904 75492 147626 96364 59238 88373 113768
1361 113768 94393 75817 72264 123270 151645 130993 96554 66200 59700 44357 10571 46885
1349 46885 42558 -8650 -41220 -15910 -13071 -28819 -41570 -30588 -11735 58581 91916 77267
1337 77267 58312 36951 45960 63915 51803 20373 56266 71080 1971 -19961 -37145 -12904
1325 -12904 -24587 11323 64786 55307 63483 44236 50953 16799 31438 27127 36187 85284 54041
1312 54041 89047 85062 78888 101900 66347 47876 49056 44930 28864 35992 18229 -37222 -90860
1299 -90860 -48094 -12964 -71577 -102139 -112311 -69006 -34925 -21370 -36502 -25728 -46866 -12089
1287 -12089 -2443 -17547 -82498 -41491 89208 84003 62910 14818 -28101 -35556 -61156 -90685
1275 -90685 -122972 -94163 -64667 -18372 -4338 -32378 -26732 -16593 -5062 14689 10183 -34681
1263 -34681 -88392 -105046 -79067 -52040 -59474 -84617 -62825 -49589 -23501 -24561 -15884 -4879
1251 -4879 6821 61344 64046 69778 99055 42523 16596 -16676 31147 113560 72264 3930
1239 3930 -25928 -48281 -49682 -35974 -27549 6030 23734 45060 67737 58880 7061 -47274 2018
1226 2018 -18473 -32525 45265 118000 116443 75404 -21257 -55001 -23156 -1320 -8052 -27806
1214 -27806 -49755 -38612 29826 51854 12898 7728 20357 -1167 -13553 -16596 11724 37751
1202 37751 2732 3343 -5737 9464 -12180 -11449 -29862 -65830 -67010 -54386 -63523 -57151 -10365
1189 -10365 20419 38198 40129 -5605 -42411 -38394 -48106 -18381 41272 60797 21865 22728 35154
1176 35154 34393 58831 86267 84532 58946 50105 39004 -13381 753 14772 -5185 -29122 -61027
1163 -61027 -72913 -4621 -3209 16712 14258 14982 -22883 -58198 -32127 -26960 10051 56565 64133
1150 64133 105463 96695 66514 58814 9369 2458 56461 37189 20456 -45948 -73139 -55543
1138 -55543 -68112 -47856 19160 38864 17852 23633 19379 16751 -5104 25590 -58 -44781
1126 -44781 4774 46242 54731 57348 39552 4013 16003 -17841 -25160 10303 50035 47948 39763
1113 39763 87243 50722 31271 64549 56229 78008 85744 97493 97310 10922 -65953 -36637 659
1100 659 2402 -7415 61128 63142 85435 81961 122634 195061 208605 224674 171301 78853 64847
1087 64847 71016 62525 48981 7221 -39781 -43973 19370 17215 2239 983 8909 7644 19648
1074 19648 -3238 4415 10814 -17996 -23711 -57938 -44400 -34763 -35524 -89257 -111811 -50084 -27845
1061 -27845 -27978 -17237 -9448 -13881 -6827 -1603 -35861 -44478 18688 13938 -9653 -21857 -8086
1048 -8086 43139 18540 35367 55990 113273 139217 90682 76455 72991 52747 8307 10601
1036 10601 100073 185816 189664 176249 150850 108409 127348 71472 38715 50550 82249 87114
1024 87114 93148 68659 64324 109042 66414 17724 47616 58324 48741 58516 88040 78574 34862
1011 34862 21152 21270 4820 -22495 -34580 -44506 -76620 -67637 -7731 4709 10584 34843 49232
998 49232 21448 -21864 -41498 -28745 -18567 -8000 -58323 -69078 -59040 23199 12330 -27876
986 -27876 -11031 -2204 803 7132 -17357 3954 -40695 -52866 8787 31557 -17425 -43364 -28247
973 -28247 -12377 -22448 -57047 -71737 -99427 -101627 -94781 -92761 7020 46717 52525 30577 27855
960 27855 35362 59039 57954 24480 -38514 -52326 -17387 64234 108499 105118 71427 64448 -3976
947 -3976 -59165 -12917 64942 64716 31700 -25540 -27124 -23671 16818 51701 10734 -53634 -103406
934 -103406 -47721 16976 48242 72983 87008 77607 62725 11199 1056 46221 94718 140913
922 140913 105774 101395 149440 133533 82554 55344 75752 8299 -21286 -53176 -59484 -20357
910 -20357 -31973 -39760 -455 10097 -14780 -36776 -17577 61801 88879 124761 159482 182167
898 182167 165352 132888 72130 13216 -1360 -3714 35596 70448 30089 51727 41331 2890
886 2890 2620 -34661 -9702 87895 73412 8292 22611 56518 66100 31792 -60022 -50521 -22589
873 -22589 198 56774 76274 30301 -1205 11691 35234 56470 54205 26361 16410 3786
861 3786 19243 7660 41559 70082 84043 95690 46707 2909 44457 44355 67213 67850 60510
848 60510 79469 84552 60402 39011 14075 6397 24156 5052 -1902 20278 15494 11373 23421
835 23421 7325 53204 72290 61201 61422 79933 68928 86586 21837 39227 34067 78930 120644
822 120644 140214 142812 42848 56712 50943 37996 -3346 -11722 38401 19079 -2828 -35444
810 -35444 -104004 -80514 -6558 -4443 36481 97657 113943 139616 98801 70937 58380 63545
798 63545 81379 86568 101520 106895 123333 143953 112992 74963 46183 7359 20159 44224
786 44224 23479 59156 54395 9841 3049 -4424 6547 16017 -62063 -119783 -95909 -23810 41517
773 41517 15547 -4430 -13372 525 12388 39205 65970 8404 -24152 -8257 -13825 -19151 1895
760 1895 45193 30836 -4204 24704 47008 9660 -32492 -37866 -76351 -119233 -116367 -65550 -48870
747 -48870 7858 45427 60318 68333 41679 32089 -11120 -18169 61149 95097 42071 56309 129506
734 129506 134387 98231 60360 15414 36447 48125 75300 64142 109398 102639 62397 40602
722 40602 -23606 -63193 -76431 -34376 -2680 18151 61388 118950 116317 97285 26755 99426
710 99426 134649 118615 64253 24490 105551 116404 64868 5191 -8055 673 25614 54421
698 54421 54840 26991 40935 41412 740 -10797 -1794 -7706 3486 16198 55065 66829 6064
685 6064 25145 20102 17587 29753 42614 18495 -8434 -47726 -5589 32330 71239 69963 39228
672 39228 48325 54529 19413 -11130 -29738 -40057 -8813 45136 98680 96938 77849 73279 113272
659 113272 120675 71480 12673 -42155 -17616 40543 89600 75443 39980 17544 30653 57074
647 57074 61410 15394 45643 58892 32231 -8521 -36661 -4762 51093 78097 111567 76385
635 76385 52244 -18328 -27433 12824 34586 16402 32177 98566 112508 73778 7838 18749
623 18749 5572 20378 82007 102059 106270 94413 112262 132324 83477 10881 8072 -850 4413
610 4413 14634 25129 -3160 9862 59808 82741 34846 -13271 -2475 40572 73039 82570
598 82570 35396 20860 60846 103967 78994 52901 13411 -9821 12775 29391 12356 7119
586 7119 53996 59766 40699 22343 42411 36481 49768 -9874 -18667 -7077 2374 -2317 -30673
573 -30673 -61102 -24059 -8504 49503 36112 60242 69843 57774 808 8814 -49978 -7546
561 -7546 14660 -5304 40292 43104 18291 37550 58509 26523 35846 53511 59288 42171 41085
548 41085 66118 124839 158454 178210 183184 167124 129287 127236 97305 88147 71037 39944 4452
535 4452 -15421 -18972 -7185 -43861 -46419 -13246 -33967 -48679 -32472 14887 -1648 -44856 -9784
522 -9784 24452 69806 72112 82906 68858 57833 25896 -17010 -2129 -20415 -30424 24160
510 24160 45038 71419 60451 65077 51546 51158 35368 42481 29630 67652 33976 33402 40421
497 40421 30350 51790 47578 73269 104794 70696 5472 -10598 -1548 19840 10349 -15523 -27952
484 -27952 -16664 387 48353 79550 96756 68024 30149 43733 60910 92097 134105 81668
472 81668 30714 30259 51733 68533 69205 81136 75503 17789 -632 34811 57326 44336 14764
459 14764 -16345 -16782 -27035 -20115 -36351 -13344 -21419 6644 10547 9464 48084 53179 54317 39289
445 39289 51384 79726 90876 56337 53493 52329 113776 155736 84119 35338 5463 -25638
433 -25638 -32706 -16639 18175 11228 38911 37590 21367 -527 -9972 -13351 -5728 -3448 970 -2739
419 -2739 2697 47708 94263 68531 67868 15813 -16135 -8797 12564 42814 41397 19473 71529
406 71529 107073 80458 50346 67265 46483 50435 84794 72087 99394 139303 134262 113255
394 113255 115653 57216 44259 78591 60987 50533 36881 54111 90151 124388 102162 65894
382 65894 1268 6318 39778 33148 70688 108875 34268 11482 54902 33332 39624 14320 -27019
369 -27019 -37623 -71343 -87682 -1355 10953 21072 36513 64178 33702 38468 64146 111948
357 111948 121806 46354 12635 61289 69188 46871 43000 43972 63810 63965 12863 -20760 -18071
344 -18071 32338 60039 37149 33342 80699 86051 58581 103328 107920 95583 59911 60613 43181
331 43181 31509 21526 46930 126573 110579 81331 45911 8176 -119 38875 59414 50608 28722
318 28722 15106 42864 67036 94367 119616 76013 58820 24249 42664 41119 57080 67888
306 67888 36227 32441 59865 41987 40506 92 -18131 995 34954 44569 72707 97347 70952
293 70952 45072 43048 32433 62115 101195 71357 30329 10346 13793 65445 28906 -6290
281 -6290 -10699 -23908 -50250 -10048 15231 43447 36121 17745 50166 69069 107808 105185 49004
268 49004 26361 2513 15322 71116 100956 121038 118733 87332 123086 89275 56605 -12146
256 -12146 -40754 -12625 12709 20772 22654 68294 72573 51744 32597 -33986 -20453 -28485 -988
243 -988 -11896 -84188 -97807 -59893 -24781 -4096 29205 70339 67310 61907 47507 32358 46684
230 46684 54185 21628 20061 51047 72296 88059 54537 84763 82512 84339 81091 24028 -23391
217 -23391 67650 121410 100117 69502 54254 77368 60094 43534 26670 52919 40904 25005
205 25005 25473 7924 -17841 -29328 -8640 9407 -9785 29565 37084 39892 74760 98737 97645
192 97645 54604 17552 20703 31263 33924 16453 -13784 5328 65712 78569 30680 5561
180 5561 30811 61882 75912 141204 153045 130473 102590 116312 97688 74178 103217 151966
168 151966 174247 158306 100949 74228 55324 37858 60945 56192 28114 -16087 -18717 46321
156 46321 58111 45565 70757 39049 1571 -1898 29483 53340 35396 47860 47123 19626 -9201
143 -9201 -13735 1202 47010 51134 24177 19366 14714 28598 63147 88807 72004 85578 82242
130 82242 94365 102285 81699 14474 -13833 44733 76892 74426 76080 47568 65060 71974 34600
117 34600 21041 -19383 -7655 25799 60699 74640 91693 116833 100500 84898 79512 57044
105 57044 81540 96972 52171 24169 4363 7679 346 20123 68667 75205 58607 32585 36354
92 36354 71056 57209 5222 -27461 -18764 -2090 4806 13061 28032 27551 47718 46227 16224
79 16224 23273 69846 72402 45390 35250 30271 42823 12754 24055 50666 43649 32430 27098
66 27098 39702 59776 85048 77097 66257 60333 66647 90659 120460 97869 52665 36795 49454
53 49454 60268 33686 51983 27488 13482 2792 12846 16840 12653 23118 51115 73862 35635
40 35635 51229 69508 98511 93445 48982 15951 29646 87043 118421 111035 94435 53389 28896
27 28896 60166 51206 22753 53959 83400 94956 74764 62693 36131 43592 70016 65452 18302
14 18302 5585 17120 11449 -11658 4206 45081 54230 39876 20105 41697 88375 106810 87641
1 87641 83455
0 83455
$$ Imaginary data points
##PAGE= N=2
##DATA TABLE= (X++(I..I)), XYDATA
32767 35626 46471 69935 76567 121070 159051 154870 130291 112814 121790 109758 118021 91867
32755 91867 69593 65163 72856 55729 71940 150572 193080 213559 201879 201474 175248 139783
32743 139783 153774 185404 182954 186023 192586 183173 169715 192298 189575 167419 167716 169546 187168
32730 187168 203440 186182 180556 211750 248361 251258 209915 224868 268855 277103 259254 235516
32718 235516 210066 224694 260116 272587 287695 274173 264991 264335 282667 295579 286142 242615
32706 242615 238381 237639 237850 196491 192647 243400 235666 205666 151826 152989 182676 194897 232197
32693 232197 261007 235421 238131 211812 168500 229776 267528 239619 241231 288155 279664 249727
32681 249727 219917 232484 272781 253578 255967 239260 252397 249342 269771 294850 286073 273935
32669 273935 256107 279314 297875 285578 290888 275332 279190 275809 277099 286812 328065 346966
32657 346966 293215 263125 323069 358264 336301 323616 320645 295997 285830 278803 307504 364951
32645 364951 410666 404325 373289 365552 418318 428207 426470 434791 403833 389193 366349 338681
32633 338681 347111 348610 397565 369986 364181 378051 362188 404631 418497 412713 398776 419130
32621 419130 413177 356168 353592 393357 410540 431352 429025 406101 412419 437037 417103 398906
32609 398906 410551 414720 396610 393230 405392 379200 393487 390671 361635 355348 360122 362186 391415
32596 391415 436974 462950 457476 481619 446100 451403 460536 437325 416699 396532 429017 413754
32584 413754 446981 468951 426235 394602 373206 409620 465738 483660 501374 478201 471970 498891
32572 498891 448926 388281 415111 436174 437845 501011 500599 452104 436002 426806 425267 448263
32560 448263 464646 498041 486879 438429 404811 481986 507787 469990 418969 401712 455223
32549 455223 513195 488190 472301 496942 459531 439560 421176 423909 487839 528020 552877 565720
32537 565720 579013 544737 525195 522409 512615 504637 488311 492210 528481 559005 572285 519071
32525 519071 508596 560151 560947 561896 577331 565472 489657 509508 547401 522592 517586 511941 510526
32512 510526 499425 486480 533581 523275 505807 471582 457140 530263 504142 522180 512446 542585
32500 542585 621239 648863 648235 564446 512764 526709 556174 552255 576240 556159 552529 535589
32488 535589 544988 596209 638615 598442 592694 562871 580847 591033 591588 583378 592027 612009 589712
32475 589712 616307 604799 558923 570228 642268 632280 564365 535776 536668 524754 561429 594207
32463 594207 620993 627559 629810 620223 644709 620720 637347 664247 644865 649050 664473 639736
32451 639736 635411 641182 649007 616154 565853 547686 571974 560137 571735 603121 565384 576252
32439 576252 614178 623807 626850 625837 633471 661915 638026 619902 644569 664518 673314 653166
32427 653166 661490 653357 596179 581922 612587 656482 702858 736653 770469 784042 726260 667623
32415 667623 672461 682867 658679 630940 583253 564353 640660 668424 707539 678756 662974 656640
32403 656640 641782 685375 683369 682806 662762 669583 655695 630529 640733 696139 736985 729752
32391 729752 731921 758471 702982 654198 625090 631378 719365 746859 683865 705495 736183 764565
32379 764565 739703 718657 708413 643976 621428 563800 559055 598827 657216 718256 710765 704891
32367 704891 680131 671120 697254 699389 693783 708332 716663 742993 775386 745464 737817 702158
32355 702158 678565 670549 679158 692832 739791 756981 713968 727022 783214 755189 661809 661902
32343 661902 726583 753502 719983 730035 725424 728179 715432 650966 566410 559017 628052 647099
32331 647099 628409 704967 715836 679571 693676 692789 674285 659802 658516 672207 676842 648940
32319 648940 661944 664633 646007 664988 701987 719027 704891 643423 616826 640024 682822 686160
32307 686160 694662 694202 678630 662179 690313 731309 741176 753123 751889 738397 744412 817001 878999
32294 878999 858756 804440 759313 760288 763778 745554 720759 714800 721278 773793 736166 697390
32282 697390 698000 727597 728878 697487 776032 801422 775073 744053 706815 698135 721231 693165
32270 693165 680985 671773 721937 771044 779413 741426 756430 752340 761897 810121 796722 749650
32258 749650 703641 694711 697922 691404 714184 708316 664831 619129 616017 642512 655231 712432
32246 712432 717803 687516 697322 707923 673646 775302 811459 776182 723325 716480 751933 748546
32234 748546 753203 743657 728214 764848 782613 795175 810668 771494 769678 718826 728155 734168
32222 734168 742552 752478 776331 787977 766842 753814 732723 730522 761765 794705 813981 842822
32210 842822 879839 892488 874066 794272 778108 785431 806808 791885 764855 796043 855502 862928
32198 862928 857630 843954 805586 742118 727176 715296 659762 729005 741108 742150 688542 650452
32186 650452 640952 654959 673834 685611 708992 727515 672342 686718 758095 747245 712085 753838
32174 753838 754528 782750 837447 781974 699720 646516 630403 712558 720679 723426 763910 727237
32162 727237 683023 663763 681945 660605 657271 677806 699609 742780 763771 761221 785034 760071
32150 760071 732903 751792 784517 792853 804093 775389 762335 756063 752013 778929 777368 726921
32138 726921 770395 781123 802770 751762 682087 673065 690750 700680 712991 708957 751417 750503
32126 750503 734092 707177 664418 651615 748361 807295 835486 822095 799124 897199 940660
32115 940660 922855 886611 823190 802771 859566 892781 864052 828624 765738 692395 719486
32104 719486 714017 641191 682527 756015 732536 692888 767690 820700 837501 801402 753281 750432
32092 750432 743452 704542 721445 758003 752652 740730 700387 745703 779662 779298 812237 787678
32080 787678 749609 772496 776102 755173 727053 693288 724042 774008 812904 820483 741007 715176
32068 715176 777260 809018 829955 808220 804854 786454 802615 809428 767971 796620 798261 769843
32056 769843 765619 775780 742983 724713 717201 712890 740466 753457 746548 725202 716059 730479
32044 730479 725511 718575 727590 750534 781595 794586 799580 787834 733464 725815 715852 712828 721738
32031 721738 767253 805084 789009 805457 854599 874614 839663 779321 714705 674901 734733
32020 734733 726189 702993 685170 635758 677575 718120 709578 712943 729214 751340 791910 769640
32008 769640 772669 784846 773227 769799 756689 788087 747893 695435 732297 784181 794063 731840
31996 731840 707459 677582 761355 843928 881954 842023 789121 782632 807916 844072 841631 836403
31984 836403 808879 742770 743033 786488 801696 835396 845330 820230 792620 758161 769222 811988
31972 811988 815160 805679 815137 835570 789894 816296 819560 777155 826090 907260 899161 831155
31960 831155 763270 773317 734826 748339 765345 786742 776949 774586 726172 694768 692397 746414
31948 746414 748432 682411 673139 710825 758332 773840 750286 694423 720651 764744 775430 768277
31936 768277 798896 760659 736460 784140 812842 849726 839846 784947 765705 750876 716786 686259
31924 686259 711638 694002 686089 720083 735754 720217 711894 732307 748646 747543 758934 800193
31912 800193 847140 785522 720028 652914 665454 729331 748932 744054 745802 696884 713632 685049
31900 685049 676152 712218 750235 793704 801464 819563 850088 873040 868288 838422 816383 804735
31888 804735 801475 803496 822635 823403 801859 810789 780276 755228 747945 763953 770695 742579 753864
31875 753864 746280 735557 747484 749363 752881 791596 778768 810737 798482 764509 802431 833950
31863 833950 847825 851252 801266 718985 751778 833206 821321 761963 733224 754252 743535 765319
31851 765319 821861 834093 786677 756920 806611 824476 787978 809767 783136 775146 819542 815276
31839 815276 803614 817400 813602 797213 771988 779268 822133 830969 823024 825997 784619 725681
31827 725681 711901 753752 769404 783742 781931 785211 791053 776599 760224 782206 801112 807448
31815 807448 690035 713388 807606 880376 858626 849720 813337 784206 769510 775423 730278 688886
31803 688886 675960 682110 726849 761336 720326 693324 704898 691831 707382 793644 850556 883783
31791 883783 934620 928229 874593 812029 766168 745197 801542 777119 785492 804480 835169 810888
31779 810888 780695 747742 725235 764206 767817 780646 776763 728592 720401 777823 812006 783353
31767 783353 728545 743198 764865 777684 791775 836818 825805 789741 795186 820474 776771 744863
31755 744863 759657 751268 754361 804991 822866 830232 843980 809130 752942 747640 721507 698087
31743 698087 728650 813672 822381 820903 801124 785741 741935 716181 759423 796628 781224 784822
31731 784822 788094 788322 749899 731386 734281 757600 771075 772818 790176 780864 769445 757976 711096
31718 711096 725459 781116 846861 832630 779890 759396 739169 748218 745350 717525 731667 767023
31706 767023 808747 835537 776113 790797 798605 818636 820334 820354 794885 821165 831646 843810
31694 843810 863991 784162 723898 722128 696915 746633 750103 746960 841336 905619 844569 835472
31682 835472 834897 821894 846871 851197 865207 863558 821400 762399 791080 788779 757122 758566 755266
31669 755266 699380 693512 708032 731214 764650 814471 798937 792775 766849 775102 717175 733339
31657 733339 751273 745992 716484 735239 732454 714138 724721 777612 776512 802081 863674 858156
31645 858156 800545 788447 807973 765717 795910 774998 733010 708270 671153 681543 660768
31634 660768 654434 703336 722782 740186 733420 695399 710624 728880 716946 738850 685562 700556
31622 700556 781154 804339 779096 776377 803109 780972 775898 830763 799210 764949 728254 730013
31610 730013 786104 816087 771426 771803 734744 754593 774319 790846 785989 775613 738033 670707
31598 670707 688073 712992 730605 760699 763416 772117 754646 749673 729915 693019 660816 732159
31586 732159 775700 754789 747077 742601 763979 782038 807551 791624 794672 821015 801521 746885
31574 746885 752490 805402 838923 832771 753236 702606 746263 810768 861663 890483 881264 879393
31562 879393 860708 819170 796063 816359 812834 729696 741318 784537 809566 829706 818263 848720
31550 848720 875808 890734 863524 820831 787777 792489 762411 755474 796695 817639 790792 857113
31538 857113 918542 895819 851301 797179 785094 832674 870095 824958 778202 716284 725049 762032
31526 762032 776001 803016 852074 853524 858157 837925 823193 825484 809024 805552 833484 815314
31514 815314 781323 764334 783780 785015 827513 836637 835571 769908 822364 811686 784886 787720
31502 787720 822969 807461 785855 794966 794052 776528 792536 807420 784924 783798 800673 800731 836606
31489 836606 884312 911271 854144 824878 854605 876964 861060 854917 771805 720862 684396 713170
31477 713170 742784 724227 772400 793367 805606 812903 796353 790411 758454 711344 713127 755980
31465 755980 791561 748603 748479 706126 696006 695206 720070 773253 758285 735486 744335 805283
31453 805283 806630 749519 731259 760798 806376 820151 812279 758651 732539 742803 759753 801486
31441 801486 803288 791616 789148 836390 865849 888571 860449 833727 800565 790337 752788 719194
31429 719194 762034 784471 786775 749558 762841 799879 812726 809423 791788 771844 769050 805250
31417 805250 811518 808246 813010 900835 911124 856156 830249 833448 794351 743333 744175 806247 809611
31404 809611 795984 792524 763287 743363 798032 871837 830395 808086 822979 839860 770814 780897
31392 780897 780538 768834 739120 750793 763333 786370 819748 803146 728940 708882 736577 759057
31380 759057 843206 858317 834426 784140 712197 712234 700684 706086 711395 759729 787382 822595
31368 822595 793099 741050 747982 746930 776936 760355 738415 735349 770318 793677 810120 771245
$$ [...]
##END NTUPLES=NMR SPECTRUM
##END=
