##TITLE=Analysis number 316520
Compound Code mo 07791
Book Reference 453/80
Project Code adrs
Chemist Name lesleyd
##JCAMPDX= 6.0         $$ Bruker NMR JCAMP-DX V2.0
##DATA TYPE= NMR SPECTRUM
##DATA CLASS= NTUPLES
##ORIGIN= Bruker BioSpin GmbH
##OWNER= nmr
$$ XWIN-NMR		Version 3.5
$$ Thu Jan 19 08:33:35 2006 GMT Standard Time (UT+0h)  MAYBRIDGE\nmr@NMR_250MHZ
##.OBSERVE FREQUENCY= 250.131544655141
##.OBSERVE NUCLEUS= ^1H
##.ACQUISITION MODE= SIMULTANEOUS (DQD)
##.ACQUISITION SCHEME= undefined
##.AVERAGES= 16
##.DIGITISER RES= 18
##SPECTROMETER/DATA SYSTEM= dpx250
##.PULSE SEQUENCE= zg30
##.SOLVENT NAME= CDCl3
##.SHIFT REFERENCE= (INTERNAL, CDCl3, 0, 16.522)
##AUDIT TRAIL= $$ (NUMBER, WHEN, WHO, WHERE, WHAT)
$$ ##TITLE= Audit trail, XWIN-NMR		Version 3.5
$$ ##JCAMPDX= 5.01
$$ ##ORIGIN= Bruker BioSpin GmbH
$$ ##OWNER= nmr
$$ C:\u/data/dgb/nmr/ADRS/14890/pdata/1/auditp.txt
$$ ##AUDIT TRAIL=  $$ (NUMBER, WHEN, WHO, WHERE, WHAT)
(   1,<2006-01-19 08:32:57.98 +000>,<MAYBRIDGE\nmr>,<NMR_250MHZ>,
      <created by zg, POWCHK disabled, PULCHK disabled
       configuration hash MD5:
       62 19 C7 07 E1 42 D1 B7 37 6C 3D D0 77 39 F9 E6
       data hash MD5: 64K
       CF 2B CA C6 40 46 9B 25 1D 2F D3 0E 2B 4B AE 24>)
(   2,<2006-01-19 08:33:19.78 +000>,<MAYBRIDGE\nmr>,<NMR_250MHZ>,
      <Start of raw data processing
       ef LB = 0.3 FT_mod = 6 PKNL = 1 SI = 32K 
       data hash MD5: 32K
       60 F9 8C 88 9F 8B 32 BD FF 90 C6 5B 9A EF 83 90>)
(   3,<2006-01-19 08:33:21.89 +000>,<MAYBRIDGE\nmr>,<NMR_250MHZ>,
      <apk 
       data hash MD5: 32K
       CD C2 D7 24 FB D2 BA 75 25 4C 51 AD CC D6 05 3C>)
(   4,<2006-01-19 08:33:23.09 +000>,<MAYBRIDGE\nmr>,<NMR_250MHZ>,
      <abs ABSG = 5 
       data hash MD5: 32K
       92 0A BD 44 07 51 99 1A 3E 64 2A FF 0D D6 56 09>)
$$ ##END=
$$ 
$$ hash MD5
$$ 6E C7 21 08 8D AB AB 22 C0 FB 21 D6 55 2D 7D D7
##$RELAX= 
##$RELAX= 
##$RELAX= 
##$RELAX= 
##$RELAX= 
##$RELAX= 
##$RELAX= 
$$ Bruker specific parameters
$$ --------------------------
##$DU= <C:\u>
##$EXPNO= 14890
##$NAME= <ADRS>
##$PROCNO= 1
##$TYPE= <nmr>
##$USER= <dgb>
##$AMP= (0..31)
100 100 100 100 100 100 100 100 100 100 100 100 100 100 100 100 100 100 
100 100 100 100 100 100 100 100 100 100 100 100 100 100 
##$AQSEQ= 0
##$AQ_mod= 3
##$AUNM= <au_zg>
##$AUTOPOS= <14 >
##$BF1= 250.13
##$BF2= 250.13
##$BF3= 250.13
##$BF4= 250.13
##$BF5= 500.13
##$BF6= 500.13
##$BF7= 500.13
##$BF8= 500.13
##$BYTORDA= 1
##$CFDGTYP= 0
##$CFRGTYP= 5
##$CHEMSTR= <none>
##$CNST= (0..31)
1 1 145 1 1 1 1 1 1 1 1 1 1 1 1 1 1 1 1 1 1 1 1 1 1 1 1 1 1 1 1 1 
##$CPDPRG= <>
##$CPDPRG1= <>
##$CPDPRG2= <>
##$CPDPRG3= <>
##$CPDPRG4= <mlev>
##$CPDPRG5= <mlev>
##$CPDPRG6= <mlev>
##$CPDPRG7= <mlev>
##$CPDPRG8= <mlev>
##$CPDPRGB= <>
##$CPDPRGT= <>
##$D= (0..31)
0 1 0 0 0 0 0 0 0 0.06 0 0 0 0 0 0 0.0002 0 0 0 0 0 0 0 0 0 0 0 0 0 0 
0 
##$DATE= 1137659576
##$DBL= (0..7)
120 120 120 120 120 120 120 120 
##$DBP= (0..7)
150 150 150 150 150 150 150 150 
##$DBP07= 0
##$DBPNAM0= <>
##$DBPNAM1= <>
$$ [...]
##$SUBNAM7= <"">
##$SUBNAM8= <"">
##$SUBNAM9= <"">
##$SW= 20.6930455092707
##$SWIBOX= (0..15)
0 0 3 0 0 0 0 0 0 0 0 0 0 0 0 0 
##$SW_h= 5175.983436853
##$TD= 65536
##$TD0= 1
##$TE= 294.16
##$TE2= 300
##$TE3= 300
##$TEG= 300
##$TL= (0..7)
0 120 120 120 120 120 120 120 
##$TP= (0..7)
150 150 150 150 150 150 150 150 
##$TP07= 0
##$TPNAME0= <>
##$TPNAME1= <>
##$TPNAME2= <>
##$TPNAME3= <>
##$TPNAME4= <>
##$TPNAME5= <>
##$TPNAME6= <>
##$TPNAME7= <>
##$TPOAL= (0..7)
0.5 0.5 0.5 0.5 0.5 0.5 0.5 0.5 
##$TPOFFS= (0..7)
0 0 0 0 0 0 0 0 
##$TUNHIN= 0
##$TUNHOUT= 0
##$TUNXOUT= 0
##$USERA1= <user>
##$USERA2= <user>
##$USERA3= <user>
##$USERA4= <user>
##$USERA5= <user>
##$V9= 5
##$VALIST= <valist>
##$VCLIST= <CCCCCCCCCCCCCCC>
##$VD= 0
##$VDLIST= <DDDDDDDDDDDDDDD>
##$VPLIST= <PPPPPPPPPPPPPPP>
##$VTLIST= <TTTTTTTTTTTTTTT>
##$WBST= 1024
##$WBSW= 4
##$XGAIN= (0..3)
0 0 0 0 
##$XL= 0
##$YL= 0
##$YMAX_a= 456843
##$YMIN_a= -661572
##$ZGOPTNS= <>
##$ZL1= 120
##$ZL2= 120
##$ZL3= 120
##$ZL4= 120
##$ABSF1= 16.522
##$ABSF2= -4.171173
##$ABSG= 5
##$ABSL= 3
##$ALPHA= 0
##$AQORDER= 0
##$ASSFAC= 0
##$ASSFACI= 0
##$ASSFACX= 0
##$ASSWID= 0
##$AUNMP= <proc_1d>
##$AZFE= 0.1
##$AZFW= 0.1
##$BCFW= 0
##$BC_mod= 0
##$BYTORDP= 0
##$COROFFS= 0
##$CY= 12.5
##$DATMOD= 1
##$DC= 0
##$DFILT= <>
##$DTYPP= 0
##$F1P= 14.0000005364418
##$F2P= -0.99999901652339
##$FCOR= 0.5
##$FTSIZE= 32768
##$FT_mod= 6
##$GAMMA= 0
##$GB= 0
##$INTBC= 1
##$INTSCL= 1
##$ISEN= 128
##$LB= 0.3
##$LEV0= 0
##$LPBIN= 0
##$MAXI= 10000
##$MC2= 0
##$MEAN= 0
##$ME_mod= 0
##$MI= 0
##$NCOEF= 0
##$NC_proc= -3
##$NLEV= 6
##$NOISF1= 0
##$NOISF2= 0
##$NSP= 0
##$NTH_PI= 0
##$NZP= 0
##$OFFSET= 16.522
##$PC= 1
##$PHC0= 237.7154
##$PHC1= 6.726073
##$PH_mod= 1
##$PKNL= yes
##$PPARMOD= 0
##$PSCAL= 4
##$PSIGN= 0
##$REVERSE= no
##$SF= 250.13
##$SI= 32768
##$SIGF1= 0
##$SIGF2= 0
##$SINO= 400
##$SIOLD= 32768
##$SREGLST= <1H.CDCl3>
##$SSB= 0
##$STSI= 32768
##$STSR= 0
##$SW_p= 5175.98343685301
##$SYMM= 0
##$S_DEV= 0
##$TDeff= 65536
##$TDoff= 0
##$TI= <Analysis number 999999
Compound Code 99
Book Reference 9
Project Code 9>
##$TILT= no
##$TM1= 0
##$TM2= 0
##$TOPLEV= 0
##$USERP1= <user>
##$USERP2= <user>
##$USERP3= <user>
##$USERP4= <user>
##$USERP5= <user>
##$WDW= 1
##$XDIM= 32768
##$YMAX_p= 292768667
##$YMIN_p= -249977
$$ End of Bruker specific parameters
$$ ---------------------------------
##NTUPLES= NMR SPECTRUM
##VAR_NAME=  FREQUENCY,     SPECTRUM/REAL,   SPECTRUM/IMAG
##SYMBOL=    X,             R,               I
##VAR_TYPE=  INDEPENDENT,   DEPENDENT,       DEPENDENT
##VAR_FORM=  AFFN,          ASDF,            ASDF
##VAR_DIM=   32768,         32768,           32768
##UNITS=     HZ,            ARBITRARY UNITS, ARBITRARY UNITS
##FACTOR=    0.157963299565203, 1,           1
##FIRST=     4132.6476996994, 0,             0
##LAST=      -1043.33573715361, 0,           0
##MIN=       -1043.33573715361, -249977,     0
##MAX=       4132.6476996994, 292768667,     0
$$ Real data points
##PAGE= N=1
##DATA TABLE= (X++(R..R)), XYDATA
$$ [...]
19062A10517L90k2886k413j9239K3826M2405K9582J0490L7171N2540N7988L9122
19050C59493L4954L2957J3260j020R974J5686L3230O2043J22196K39618M33739
19039A356130N89958R3072l88424l32779l38861k69364j52144p1466k1252J3150
19029D78020N6477P6947J02525Q3235L4720K7722J5660J1334K4768L9957R4655
19018A046020J42418K16881M04716P34380J290696J775089M22302j104437j024597
19009C903468j043170q51907n63599l08644j55373p9546m5013J169M9837Q0074
18999I87296J3510j4906j0046J5871M8471Q3782J83256L36572N91062J052053
18989C286921J641923J343070p22266j049637j037083r70470p01494m10867k25602
$$ y = [110517, 110907, 88021, 85608, 66369, 90195, 132600, 162182, 172672, 209843, 262383, 320371, 359493, 394447, 427404, 440664, 439644, 449618, 465304, 498534, 560577, 682773, 922391, 1356130, 1946088, 2039160, 1650736, 1317957, 979096, 709732, 557588, 486122, 464870, 478020, 534497, 611444, 713969, 797204, 831924, 859646, 875306, 886640, 911408, 951365, 1046020, 1188438, 1405319, 1810035, 2544415, 3835111, 5610200, 6032502, 4928065, 3903468, 2860298, 2008391, 1444792, 1136148, 980775, 901229, 856216, 857385, 907222, 987296, 1000806, 985900, 975854, 991725, 1040196, 1123978, 1307234, 1643806, 2234868, 3286921, 4928844, 6271914, 5549648, 4500011, 3462928, 2492458, 1790964, 1380097, 1154495]
18980A154495j07701m8395k6056R263K3544L7943P6933P2265N8032K5230J6710
18969A292263O1685J19920J51536J35948K08962M02317O82002P64419J52837r8021
18959C873868l00781m63168l87472k66454j68189j9111Q8030K03004K90117L67799
18949C217643N07068P32093J101256J632875J617905K89362l19049m2399K10491
18940H947245N27703P60300J030908J510311K467392L697505N387892Q267717
18932C2596973J4140488K5590135M2708100M9115123J9911136j5084955l7318090
18925A31658910l4838804l0909158k2377992j3535005p078648l290197j724613
18918A7904493j693092j073785l08211J3971P8212J25772L86122J120735K455050
$$ y = [1154495, 1046794, 998399, 972343, 981606, 1005150, 1043093, 1120026, 1192291, 1250323, 1275553, 1292263, 1353948, 1473868, 1625404, 1761352, 1970314, 2372631, 3054633, 3819052, 3971889, 3873868, 3573087, 3109919, 2722447, 2455993, 2287804, 2268693, 2356723, 2559727, 2849844, 3217643, 3724711, 4456804, 5558060, 7190935, 8808840, 9098202, 8779153, 8736754, 8947245, 9474948, 10235248, 11266156, 12776467, 15243859, 18941364, 24329256, 32596973, 46737461, 72327596, 115035696, 164150819, 184061955, 168977000, 131658910, 96820106, 65910948, 43532956, 29997951, 22919303, 19629106, 17904493, 16211401, 15137616, 14829405, 14843376, 14921588, 15047360, 15433482, 16554217, 19009267]
18909A9009267M292155P121761J2086700K1731534L7911248N3525364L3776046
18902A89454075j820021l5411549l8387571l4970466k7417514j7948546j0493893
18895B3004515o248241l965698k580077j585213r39073o94569o97275q10274q33244
18886D650851p59016o17614m66464l48029k76351k25267j55842q2516n9687n8157
18876A601908o4100m6038M3307J40259K06532M4941j21594k55368k24359j98725
18866A126763j56196j09132p1028n3659m7571l9651l8620j7309o803j9330l3612
18855E33852l3480k1988r482j6854k6517l1420l5742k0772k9489k1948j0270o183
18843B69707o725j9279k7282k9352l915n301j3351j1017k2231j4497j3382o635
$$ y = [19009267, 23301422, 30423183, 42509883, 64241417, 102152665, 155678029, 189454075, 187634054, 152222505, 113834934, 78864468, 51446954, 33498408, 23004515, 16756274, 12790576, 10210499, 8625286, 7686213, 6991644, 6294369, 5484095, 4650851, 3891835, 3274221, 2807757, 2459728, 2183377, 1958110, 1802268, 1719752, 1660065, 1601908, 1537808, 1491770, 1535077, 1675336, 1881868, 1926809, 1805215, 1549847, 1325488, 1126763, 970567, 861435, 790407, 736748, 689177, 649526, 610906, 593597, 586794, 567464, 533852, 500372, 478384, 468902, 452048, 425531, 394111, 358369, 337597, 308108, 286160, 275890, 269707, 262982, 243703, 216421, 187069, 183154, 177853, 164502, 153485, 131254, 116757, 103375, 96740]
18831I6740J3544k915K298o24q94L0017K2210L63Q822m21L794l7716m8385k7012
18817E9821k1162l1517l3702p098k626j2026j1052m2385m6002l0117L768L5455
18805a38643O1961P8620N4439N2416L2127J9969J0732m360j800K397j1497l6720
18793A19641k3781k6833M24Q840r042j0595j4465j4443k8390l4480m1140m3347
18781a17611j3121M7243P4741O9696N9065M5865K8043N568j4586n811l829n810
18769A69453j1440K491j0614J2262K6799K4142J9701j6421l0754l3625k3517r204
18757A19273k6517k6656j038J6992J628j4605r612k539N974k0921k8382j1501
18745B096j2606m139p033l278m440k4713k3110l541P737J6844K5743K6928J4325
$$ y = [96740, 110284, 107369, 109667, 109043, 108149, 138166, 160376, 160739, 169561, 169140, 172934, 135218, 86833, 59821, 38659, 7142, -26560, -33658, -36284, -48310, -59362, -101747, -147749, -177866, -174098, -138643, -76682, 1938, 56377, 108793, 140920, 160889, 171621, 167261, 165461, 167858, 156361, 119641, 95860, 69027, 69451, 78291, 69249, 58654, 44189, 29746, 1356, -33124, -74264, -117611, -130732, -83489, -8748, 60948, 120013, 165878, 193921, 199489, 184903, 179092, 175263, 169453, 158013, 160504, 149890, 162152, 188951, 213093, 232794, 216373, 185619, 151994, 128477, 119273, 92756, 66100, 65062, 82054, 83682, 69077, 59465, 56926, 62900, 41979, 13597, 2096, -10510, -14649, -21682, -24960, -29400, -54113, -77223, -80764, -73027, -56183, -30440, -3512, 10813]
18732A0813J729Q239P953K4734m233j7419K968J3879R208O984R013j0674k8123
18719C5071k3899p145R894K97n628l4077j7105K4212L1169J6049j3735J4931K4420
18706E4454N759N600m559l234n050p219l411J768j658j0028N308K7283J3316j3955
18692F4374L045k980j6918j7176m20o275r937o977l258p341J1959M275K717O033
18678B1121l933j1238j174m732q14L488R267J0884J2512k162k543M454L835Q25
18664C9790j8720j7543P916j0624j4338j2475P48O947M439M037L811K7656P635
18651B9279k793M540K795N300J24m804J084l534q74p930k2767J2097P143R015
18637B8675J9681k710j4064k230J947k487o573n222l180J6597N710K457R326J8376
$$ y = [10813, 12542, 20781, 28734, 53468, 49235, 31816, 34784, 48663, 57871, 64855, 73868, 63194, 35071, 11172, 4027, 13921, 14218, 8590, -25487, -42592, -18380, 12789, 28838, 15103, 30034, 54454, 60213, 65813, 61254, 58020, 52970, 45751, 42340, 44108, 42450, 32422, 37730, 65013, 78329, 64374, 67419, 64439, 47521, 30345, 29925, 23650, 13713, 6736, 3478, -3863, 8096, 12371, 15088, 21121, 17188, 5950, 4776, 44, -770, 2718, 11985, 22869, 35381, 33219, 30676, 35130, 38965, 39790, 21070, 3527, 11443, 819, -13519, -25994, -25246, -18299, -13860, -9823, -6012, 21644, 29279, 26486, 31026, 33821, 39121, 39245, 34441, 35525, 31991, 31117, 23187, 420, 12517, 19660, 28675, 48356, 45646, 31582, 29352, 31299, 28812, 22239, 17017, 13837, 30434, 36144, 38601, 47927, 66303]
18623F6303J8781J8863o176o635j1996p813n875j4076Q52N554O282J952o788R530
18609F8758R792J917j460j1148n598j638o26p6K511l050J3027J4366K992p80o115
18594H2872j743K952r149j4839J75j2053k4307J228N639R876K200N735O265J3411
18580F8262m311j8665j9690m826n444l389r976k521J8930Q641O7q2K684L091j2399
18565B0372M191O31m804o955m391O406k546J994k072P427J5334l074j3412o681
18551A2420P380Q778M37l42j5334L008J6622R357K529M210K892J2140K8421K9158
18537A21676M2228O0968J07270J49569J51146K3953k2517L1458P2416j3069j32749
18526E92349j40538j24672r5864o1835l7734k9546j1917j3539j2394l181P400
$$ y = [66303, 85084, 103947, 97771, 91136, 79140, 71327, 65452, 51376, 52228, 57782, 64064, 66016, 59228, 68758, 78550, 80467, 79007, 67859, 62261, 60623, 59997, 59921, 62432, 59382, 72409, 86775, 89767, 88987, 82872, 81129, 84081, 74932, 60093, 60268, 48215, 23908, 25136, 30775, 40651, 42851, 48586, 54851, 68262, 63951, 45286, 25596, 20770, 15326, 11937, 1961, -560, 18370, 27011, 27078, 26996, 29680, 32771, 20372, 24563, 25194, 20390, 13435, 9044, 15450, 12904, 14898, 12826, 20253, 35587, 32513, 19101, 12420, 19800, 28578, 29015, 28673, 13339, 16347, 32969, 42326, 44855, 49065, 51957, 64097, 92518, 121676, 163904, 224872, 332142, 481711, 632857, 656810, 634293, 665751, 738167, 725098, 592349, 451811, 327139, 231275, 169440, 131706, 102160, 90243, 76704, 64310, 61129, 68529]
18515F8529J6466L1833J1285K7035M6842O3729J19970J65140O3339k9644k258
18504E82266N3601J8765r0071j03049r6696r0816q0824n4115l4162j3138k0190
18493G1571r898k791N084j429J6939K38j3455j8111k5764L584R018r63m601n787
18479B3635m323k680L4014P931j5197O373n410l570j2721n179J0873K646m553
18466C1839J452N369o870j9808p40P201J904j2556M743N474M151J6124P107m126
18452D1264P91j9129R674O065j1618r861j151K755J9092J9309K8594L338j6632
18439G2491j7218j6355j5865j511n870n294o6N661J1356j527L776J6374K0701
18426F6653P979q813j6494j0150o906n075j258O625n360J029Q13l238p034l256
$$ y = [68529, 84995, 116828, 128113, 155148, 201990, 265719, 385689, 550829, 614168, 584524, 582266, 635867, 654632, 564561, 461512, 364816, 274000, 193176, 139061, 104899, 91761, 71571, 61673, 58882, 63966, 62537, 79476, 79714, 66259, 48148, 22384, 25968, 34986, 34023, 29422, 23635, 19312, 16632, 50646, 58577, 43380, 49753, 44343, 40773, 28052, 22873, 33746, 36392, 31839, 33291, 38660, 31790, 11982, 11242, 18443, 20347, 7791, 12534, 18008, 22159, 38283, 45390, 41264, 42055, 22926, 32600, 38665, 27047, 17186, 16035, 18790, 37882, 57191, 85785, 89123, 72491, 55273, 38918, 23053, 21542, 15672, 10378, 10312, 15973, 27329, 25802, 29578, 45952, 66653, 74632, 65819, 49325, 39175, 32269, 27194, 25936, 32561, 27201, 28230, 29043, 25805, 18771, 15515]
18412A5515n002J0035j3397j1054l992l357N719N240J0526J0488N756L91l749
18399B3119j2129l343j024j942O369J7048K0900J2687j835k1744j1349j4338o949
18386E470J2394R604J4915P038K047m887Q467Q857J4687L360J2616P636K4859
18373A27063L8826O7889J21719J77028K35743J48147o233j44855j79108j57752
18363D28467j21885p7443m5208k7071j0704k254J820l489J472K1497j2375p153
18351A45674r444L832J2315L1364O8804J02414J94792K65640J95070J7788j30850
18340H97399j96319j91421j51583j16145o0467m5921m1943j4946q323J847Q08
18329G2986n230j8103J3677J2985p045k2218j1462L644J501J3608J0462q371k7408
$$ y = [15515, 10513, 20548, 7151, -3903, -7895, -11252, -5533, -293, 10233, 20721, 26477, 26868, 23119, 10990, 7647, 6623, 4681, 11050, 28098, 48998, 61685, 59850, 38106, 26757, 12419, 5470, 17864, 27468, 42383, 49421, 51468, 46581, 55048, 63905, 78592, 81952, 94568, 102204, 127063, 165889, 233778, 355497, 532525, 768268, 916415, 910182, 765327, 586219, 428467, 306582, 229139, 183931, 156860, 146156, 143902, 145722, 142233, 143705, 165202, 152827, 145674, 136230, 140062, 152377, 183741, 252545, 354959, 549751, 815391, 1010461, 1028249, 897399, 701080, 509659, 358076, 241931, 181464, 135543, 93600, 78654, 70331, 72178, 72986, 67756, 49653, 63330, 76315, 69270, 47052, 35590, 39234, 40735, 54343, 64805, 56434, 29026]
18316B9026l718K3120O325j7361r509k409r595J548J75M19M917k455J52N245r353
18301A6527m449n408p570M099o833l916J7302J5324J0640j0711j1774m06M228
18288A7053q974Q210P522l763l040J717n860r834p290N535J3919j772Q551m538
18274A7436l248m389n070p669L172Q761l529L07Q648m898M679N261j1713l736
18260D012J9232K15j431J293O813R748k103q564k475J3436J3375J1995k089j724
18246F1733M803K1089K3419Q502j2146j3705P691J3258J5762K7962M013o405K739
18233A58715L2801P169k0200l2509k4317r224Q789n987r029k419J2369N550j8436
18220A03272m50J3864L07N512M18K541o329J4334P715m118k0055k3801J0838P081
$$ y = [29026, 25308, 48428, 54753, 37392, 27883, 25474, 15879, 17427, 17602, 18021, 22938, 20483, 20635, 25880, 16527, 12078, 6670, -900, 3199, -3634, -7550, 9752, 25076, 35716, 25005, 13231, 12825, 17053, 8079, 16289, 23811, 20048, 17008, 18725, 12865, 3031, -4259, 1276, 15195, 13423, 21974, 17436, 14188, 9799, 4729, -2940, 232, 8993, 5464, 5771, 14419, 9521, 14200, 19461, 7748, 4012, 23244, 23459, 22028, 23321, 30134, 39882, 37779, 29215, 26740, 40176, 53551, 65546, 63457, 61733, 66536, 87625, 111044, 119546, 107400, 93695, 101386, 114644, 130406, 158368, 162381, 155976, 158715, 191516, 198685, 178485, 145976, 121659, 112435, 121224, 115237, 106208, 103789, 116158, 121708, 103272, 102822, 116686, 116993, 122505, 122923, 125464, 119135, 133469, 141184, 137066, 117011, 93210, 104048, 111129]
18206A11129o195j2407O6L7100K5545m404R42P532k1794k6949j4278Q940k375
18193A02852r952j6150j8210m479Q67O943K3757j0644j5977l302O249K006j473
18180F2487K1983K6197O581k3998n96K1378K4023j181j0995j5372p576o311l105
18167I3515p069Q003P361J1213M059q648r352p787Q09R231O76j0117J0835K7038
18153A29767L2501J2137j6546J335J8395J6972j620j421J910j5597J3815l255
18141A88393j1803j1545j2144l592K391J4206K3658m48p929n047P90J584L574
18128A82088R981K1680K3442R653K7788L6042K6721J3567K1783N1389O7207Q4371
18116E75712R7907J29181J75963K40701L01448L95109N94231Q86396J415172K488026
$$ y = [111129, 104934, 92527, 92593, 129693, 155238, 150834, 151776, 159308, 137514, 110565, 96287, 105227, 102852, 92900, 76750, 58540, 54061, 54928, 61871, 85628, 74984, 59007, 55705, 61954, 63960, 62487, 84470, 110667, 117248, 93250, 92654, 114032, 138055, 136874, 125879, 110507, 102931, 96620, 93515, 86446, 94449, 101810, 113023, 117082, 108434, 99082, 91295, 92104, 101335, 102011, 91894, 102729, 129767, 162268, 174405, 157859, 159194, 177589, 194561, 192941, 191520, 193430, 177833, 191648, 188393, 176590, 165045, 152901, 149309, 151700, 165906, 189564, 189116, 181187, 176140, 176930, 178514, 182088, 192069, 213749, 237191, 246844, 274632, 310674, 337395, 350962, 372745, 424134, 491341, 575712, 673619, 802800, 978763, 1219464, 1520912, 1916021, 2510252, 3396648, 4811820, 7299846]
18106G299846M714229P737093O343495l763985m943499m738708m366360l153290
18098E128821j825282j023213n93902l84042k64166j84501j32342q2347q2282
18089E56744l5864j2232P368O756L523J968K0043J3254L66J0929p297o506j2975
18076E46077k0961k4359k5196k3766j7997j954j3047k0470m87m092k2935p827
18064C62986m210O236R438k1P526J7984J3045o71J3042L262L762j473K109J5327
18050D48342J7745K94q470J4346P952m709p348n821J4776K5393M275O102J9481
18037E32358J5474J7322L6027M1746L7272K4508L6737P2087Q0883R5546J66947
18026A156907K12365J36464K668M6634J08626R2470p8065o4646o1650n1931p03
$$ y = [7299846, 12014075, 19751168, 26094663, 22330678, 17387179, 12648471, 8282111, 5128821, 3303539, 2280326, 1686424, 1302382, 1038216, 853715, 721373, 639026, 556744, 520880, 508648, 516016, 522772, 526295, 528263, 548306, 561560, 561926, 572855, 565558, 559052, 546077, 525116, 500757, 475561, 451795, 433798, 431844, 418797, 398327, 397840, 393748, 370813, 362986, 358776, 365012, 374450, 374429, 381955, 399939, 412984, 412313, 425355, 428617, 432379, 430906, 433015, 448342, 466087, 466381, 457911, 472257, 480209, 475500, 468152, 462331, 477107, 502500, 506775, 512877, 532358, 547832, 565154, 601181, 642927, 680199, 704707, 741444, 813531, 894414, 989960, 1156907, 1369272, 1505736, 1508404, 1555038, 1663664, 1756134, 1678069, 1613423, 1551773, 1499842, 1499139]
18015A499139M0369M8711J05253J50730J54296J77367K55879L99669M99378N07068
18005C837859M16675M19307M13004N54262O10932P15866N92098P64077J150417
17996I474497J565661K123469L027804M582852P303523J2731867K2868046L4696950
17988I8374669K5928766n880664k267065P913977J2548183j4993305k7225550
17981I4399011k2555152k0740502j5981396j0166875n659754l105091j787503
17974A4402738j226240o43259M5577P20125J439198K351602L620364N677703R532032
17965C5919840J7421027K8749289L2041655K433261o453594L822084J2402801
17958A26336363k082541k6950920k3118446k1247993j7471448j1933296o865647
$$ y = [1499139, 1539508, 1588219, 1693472, 1844202, 1998498, 2175865, 2431744, 2831413, 3330791, 3837859, 4254534, 4673841, 5086845, 5641107, 6252039, 6967905, 7560003, 8324080, 9474497, 11040158, 13163627, 16191431, 20774283, 28077806, 40809673, 63677719, 98374669, 124303435, 118422771, 116155706, 124069683, 136617866, 121624561, 94399011, 71843859, 51103357, 35121961, 24955086, 19295332, 16190241, 14402738, 13176498, 12533239, 12578816, 13298941, 14738139, 17089741, 20710105, 26387808, 35919840, 53340867, 82090156, 114131811, 116565072, 110111478, 113933562, 126336363, 124253822, 97302902, 74184456, 52936463, 35465015, 23531719, 16666072]
17951A6666072l891642k512437j905026j362184q75913o55709n79050m34720l34217
17942D115174k46821k93359k28002j90848j78606l14872l78100k80238k06948
17933A797380j66881j54863j25712n6026j2136l130O2315J41771J2715p1210Q7
17922A424310O2649L1454j74680j97309j66496j27891q1981m4593m3107k8667
17912F53689j4845k7845l5793m97L013l9217m6661l0458n158l208j9679k6182
17900D07159m1718k2067N133j0581j8686j6639k5559q109k65l078m265r032j1765
17887B40528j1758n648l39O633P527J192P608j7511l5268l6679j7107J1051r854
17874A40375k2079k7257n4975n0701l8397m1791k8414j9622J09K8012K1750J204
$$ y = [16666072, 12774430, 10261993, 8356967, 6994783, 6118870, 5463161, 4884111, 4449391, 4115174, 3868353, 3574994, 3346992, 3156144, 2977538, 2662666, 2284566, 2004328, 1797380, 1630499, 1475636, 1349924, 1293898, 1281762, 1278632, 1340947, 1482718, 1495433, 1424223, 1424310, 1486959, 1518413, 1343733, 1146424, 979928, 852037, 770056, 725463, 682356, 653689, 638844, 610999, 575206, 574709, 577722, 538505, 491844, 461386, 456228, 453020, 433341, 407159, 365441, 343374, 348507, 337926, 319240, 302601, 277042, 268933, 268668, 265590, 261325, 252293, 240528, 228770, 223122, 222783, 229416, 236943, 238135, 245743, 228232, 192964, 156285, 139178, 150229, 140375, 118296, 91039, 36064, -14637, -53034, -94825, -123239, -142861, -142752, -114740, -92990, -91786]
17862i1786L1604M2555M3447M8370M0904J9988P127N913q359k3615Q596m786o500
17849A13458k2581k0256K082r595k1916j8940l4905k4758j569q754J4536k588
17837c5786J1177M9010P0844M8950J5879J2181J8359j0554j5079k6182j0188k224
17825A26387o365n336L26N390q128k2753j2295p131J6958J83j5918n478o237N216
17811F4819j973r472m413R050j2483j3961j2567L871P50k4908j5771j1745m197
17798c3000M233O073K169j3426k5452K2138M9856N631l697j4888L937O128p29
17785H973O991J3214l49n709L304L692l880p984N53j3835k3864j1402m133R388
17771b5041K2526n760m814J209K3411J524J966O179K696Q54K900l948M778j024
$$ y = [-91786, -60182, -17627, 25820, 74190, 115094, 135082, 142209, 148122, 139763, 116148, 124744, 119958, 113458, 90877, 70621, 72703, 63108, 41192, 22252, -12653, -37411, -38980, -47734, -33198, -35786, -24609, 24401, 95245, 144195, 160074, 172255, 190614, 180060, 164981, 138799, 128611, 126387, 120022, 114686, 115012, 120402, 112274, 89521, 77226, 70095, 87053, 87236, 71318, 65840, 59603, 64819, 62846, 53374, 48961, 58011, 45528, 31567, 19000, 22871, 23621, -1287, -17058, -28803, -33000, -28767, -22694, -20525, -33951, -59403, -37265, 12591, 18222, 14525, -363, 3574, 9702, 8973, 15964, 29178, 28829, 23120, 26424, 30116, 26236, 18252, 18805, 4970, -18894, -30296, -34429, -25041, -2515, -8275, -13089, -11880, 11531, 13055, 15021, 21200, 23896, 24750, 27650, 23702, 28480, 27456]
17757B7456j7706N277Q565J5465N250k418m377j4358o58l239j01K414l011n62
17743A7997j2257p156m41k80N397P004p020n856q044l205J4259J8685N261l014
17729B1330p242q835N451K575k2287Q469l12N43n304N211l661j753r918j2838
17715b8571p000r59J3301O834R007k163L432q116j9601M006p001k243J4229O685
17701a8160j449j129K801P905K567K229J2016M402m996p542K959J3571J0085K2
17687B5281o509n231r658Q812J7306J7929p627j5363P952J2966J2402r395p356
17674D1509j3049j0398j5372j5163K717K0631M214l707J1143J5971j187L738o650
17661C4397p746o320J6520J3178L422l427k629l989N356j129p887m605m875Q73
$$ y = [27456, 9750, 15027, 23592, 39057, 44307, 41889, 37512, 23154, 22496, 19257, 19156, 21570, 18559, 17997, 5740, -1416, -1857, -2137, 3260, 10264, 3244, -2612, -10656, -13861, 398, 19083, 24344, 21330, 14088, 5253, 10704, 13279, -9008, -539, -851, -308, -5612, -401, -4062, -5815, -15733, -28571, -35571, -36530, -23229, -16395, -7388, -9551, -6119, -14235, -33836, -29830, -36831, -39074, -24845, -18160, -19609, -20738, -17937, -10032, -7465, -5236, 6780, 11182, 6186, -1356, 1603, 15174, 25259, 25281, 18772, 13541, 3883, 12695, 30001, 47930, 40303, 24940, 32892, 45858, 58260, 48865, 41509, 28460, 18062, 2690, -12473, -9756, 10875, 15089, 11382, 22525, 38496, 37309, 41047, 34397, 26651, 20331, 36851, 50029, 53451, 50024, 47395, 43406, 48762, 47633, 39746, 35141, 30266, 31139]
17647C1139k138N122O94o845k0164k0804O150P805j195M457M087j3035m352O435
17633b644J2868j8100n66Q055n822k3233r856O461R160K981J0251J0747m710J5895
17619A1487N095J405j596j382O906j435m999p499Q205p10O477J2386q766k0294
17605E280j2319m177q805R168j478m3N626k937p905M115J1478o66l188N207M18
17590b26J8027M765J762j5185j6019m031j4873M296K0151K76o708M699m550j686
17576i302o62L690J3751K674k134m726j3264j3907r678J0751P030Q459k738k0647
17562c0703K814P974J4539M132o865k667J5211Q765j020n297k903L311o962M820
17548E149j1357j2012p679L782N275P138Q920p265J2824M387j2766j5329N140
$$ y = [31139, 29001, 34123, 34817, 27972, 7808, -12996, -6846, 959, -236, 4221, 8308, -4727, -9079, -2644, 10224, -7876, -8442, -387, -6209, -29442, -39298, -32837, -23677, -20696, -10445, 302, -4408, 11487, 16582, 17987, 16391, 15009, 21915, 20480, 15481, 7982, 16187, 15477, 21954, 34340, 25574, 5280, -7039, -11216, -20021, -10853, -12331, -12374, -6748, -9685, -17590, -13475, -1997, -2663, -5851, -644, -226, 17801, 22566, 24328, 9143, -6876, -10907, -25780, -21484, -1333, -1057, -7765, -3066, -7616, -9302, -9964, -6274, 7477, 10151, 8017, 3291, -9973, -23880, -33558, -22807, -15777, -7318, -10056, -30703, -27889, -19915, -5376, -1244, -8109, -10776, 4435, 13200, 12180, 6883, 3980, 7291, 329, 5149, -6208, -18220, -25899, -22117, -16842, -9704, -784, -8049, 4775, 9162, -3604, -18933, -13793]
17535a3793m736O368M790Q660Q412P697j3439k785J6123l817o130j5422j8526
17522b6598n136K147N083J8713o375n810K440J6787P125O791o342n463j5222J299
17508a0561M204J1853R69j466j0400Q182Q044j0185j292m698j8163q15J0104J570
17494a2654J0484N533r162j6806q764m47L518K1595P867l606k387p875J6479K2053
17480B5828J1932k0802j7471M138l308j0448N982k509j3741r666n613Q127J4557
17467a2994R378J0142o976j5038L264N841j85J332j1950P36J3540j84j107J7187
17453A2986Q114j1581J9375J1932M351J2085J424K091M256j910J7655K8053L6877
17440A45708N9410J07866J93919K05901L2840m8065m639J8784l3111j30047j27765
$$ y = [-13793, -18529, -12161, -7371, 1289, 9701, 17398, 3959, 1174, 17297, 13480, 7350, -8072, -26598, -31734, -29587, -24504, -5791, -12166, -17976, -15536, 1251, 8376, 15167, 8825, 3362, -11860, -10561, -6357, 5496, 6465, 4999, -5401, 2781, 10825, 640, -652, -5350, -23513, -24328, -14224, -12654, -2170, 3363, -5799, -22605, -31369, -31816, -28298, -6703, 1164, -2442, -4829, -12704, 3775, 25828, 37760, 16958, -513, 3625, 317, -10131, -4149, -6658, -20399, -30065, -35678, -27551, -12994, -3616, 6526, -450, -15488, -12224, -6383, -6568, -5236, -17186, -16450, -2910, -3094, -4201, 12986, 21100, 9519, 28894, 40826, 45177, 57262, 58686, 60777, 65033, 63123, 80778, 108831, 145708, 205118, 312984, 506903, 712804, 745644, 697579, 692940, 711724, 678613, 548566, 420801]
17429D20801j16777q0103o8382m0404k2397m801j5057l553j740m603j0269J040
17417E3755J1055K1671N3761Q9804J30205J57543Q2084k0461N54M3074K9873r8508
17405E54410j16300j02219j07155p9271n3977l6830p153j2551K871o865L970j560
17393C7370j6849j3684m082R267p01p227k246J984J5204k725m050k987j746j7343
17379i815j288J6576L875o391j730K541j838L056R629j5473q493J224m029q793
17365b0949m167M481m864J0402k057J0771k355l339J5272l782j414O864J0885
17352A5748k608j9797P906m920n946m858P526L810O021M110j3111k98n423l503
17338a5343j6660Q294J1635j738m07K627P008J3104J234o664j3361k1237r365
$$ y = [420801, 304024, 223921, 155539, 115135, 92738, 87937, 72880, 69327, 67587, 62984, 52715, 53755, 64810, 86481, 140242, 230046, 360251, 517794, 599878, 579417, 579971, 623045, 652918, 554410, 438110, 335891, 228736, 149465, 95488, 58658, 51505, 38954, 41825, 34960, 38930, 37370, 20521, 6837, 2755, 12022, 11321, 4094, 1848, 3832, 19036, 16311, 12261, 9274, 7528, -9815, -11103, 5473, 9348, 2957, 1227, 3768, 1930, 4986, 14615, -858, -9351, -8127, -12156, -20949, -25116, -20635, -25499, -15097, -17154, -6383, -8738, -12077, 3195, -587, -2001, 4863, 15748, 13140, -6657, 1249, -3671, -9617, -14475, -6949, -3139, 2882, 6992, -6119, -6417, -11840, -15343, -32003, -23709, -12074, -13812, -14219, -11592, -4584, 8520, 9754, 3090, -10271, -31508, -40873]
17325d0873Q882J5620K633k758q81Q806L860r04j5400o958J4617L0791O111m842
17311A8704o927j7604j5940J0687J699K776m604L006j19J1139N067J6558o648
17298A7794n149n656r980j4573m210m588J1515j353q547m837J5137o438N088M518
17284a1279M481P889k222o959l024J5700N083N682J2046j792j0075n476J089j2928
17270a785k983m322J164k110k965q757J0554M394M37K401J0941M386j7727m865
17256a1237N355Q02Q986L34Q828k071k112j5145j8384k010R584P714j0237j6285
17242c5878L985R293K6460N415k0966O213P733k122R756M296j2840k71o361p410
17228a2697j8090K139R516J5328J7433O76J694j0557j2543o951L703k146n966
$$ y = [-40873, -31991, -16371, -13738, -16496, -17377, -8571, -4711, -5615, -21015, -27973, -13356, 17435, 23546, 18704, 11777, -5827, -21767, -11080, -9381, -6605, -11209, -8203, -8322, 2817, 7884, 24442, 17794, 12645, 6989, -2991, -17564, -21774, -26362, -14847, -16200, -24747, -29584, -14447, -20885, -15797, -11279, -6798, 1091, -1131, -8090, -11114, 4586, 9669, 15351, 27397, 25605, 15530, 10054, 11143, -1785, -4768, -9090, -7926, -10036, -13001, -21758, -11204, -6810, -6373, -3972, 6969, 11355, -6372, -11237, -5882, -5080, 3906, 4240, 13068, 10997, 8885, -6260, -24644, -26654, -17070, -9356, -19593, -35878, -31893, -22600, 3860, 9275, -11691, -5478, 2255, 133, 9889, 14185, 1345, 1074, -5287, -12697, -30787, -28648, -19132, -3804, 13629, 14305, 15999, 5442, -7101, -14052, -10349, -12495, -18461]
17215a8461K042M163J2630R770j8464m893P758J7070j0306j5076r859J8321J7206
17202A1901J046n346p388j825r437n087J319M847K70o112q553J1660N016K576
17188e113J54J859P171P044n822j8493J1504K1934N954M031N36P895k1757j3841
17174C056l630l528M763J3136j618Q83j479o072Q707R837k0401l936K409j7411
17160a5284l944J0517j856j2948m062K087Q89k685l534R41R321J2945K295n830
17146a1148N800m098m445J6482o235r984j6449n582J2096K3714o885m361r371
17133b0466P374J5649J65P025n766j4873N231j0365n915O700J345L959k337j085
17119a3359L544j249J4613k332j203L826n141p298Q030K4958K2286K606R40J5497
$$ y = [-18461, -16419, -12256, 374, 10144, -8320, -13213, -5455, 11615, 1309, -13767, -23626, -5305, 11901, 12947, 7601, 213, -1612, -11049, -16136, -14817, -9970, -9700, -15812, -24365, -12705, -7689, -5113, -4959, -3100, 4071, 11115, 5293, -13200, -1696, 20238, 26192, 30223, 30759, 38654, 16897, 3056, -574, -4102, 661, 13797, 12179, 13062, 11583, 5511, 14218, 24055, 3654, -282, 2127, -15284, -19228, -8711, -10567, -23515, -27577, -25490, -24601, -27286, -30820, -29879, -20558, -7613, -5318, -11148, -5348, -9446, -13891, 2591, -3644, -13628, -30077, -35659, -23563, 151, -6734, -11095, -20466, -13092, 2557, 2722, 9747, 3981, -10892, -5661, -16026, -21941, -15241, -13896, -9937, -12274, -13359, -9815, -11064, 3549, 1217, 14, 3840, -1301, -8599, -569, 24389, 46675, 49281, 50221, 65718]
17105F5718J6843J2074m175N422j4902k4015j1513q743j685p093p542r808N93
17092A1174O035r766M14Q56q747L696j2021M672J1309j3400N874P963o495n019
17078c455j6092n545O924j808q172L709J5219J8284j0328j2766o51M62P929J5455
17064I165P787J958l391o672J0449j630P754J1588j1792k1190q761n710n255p830
17050b3530K3618J4231k2110k1408l694J9498L0825p091n815m742j1471M908O43
17037f138q438j170l390k189O255J636j3316K121J3308J1334j184l534p062r914
17023b1681M597M843L695J0095m759J627q417j1330j3019J4121M147L85P866K33
17009g597k294l559k173j563J1617J2921P705M603r133j1733K891k286J0451N997
$$ y = [65718, 82561, 94635, 90460, 95882, 80980, 56965, 45452, 36709, 35024, 27931, 20389, 10581, 11174, 17209, 7443, 7857, 8713, -34, 3662, -8359, -3687, 7622, -5778, 96, 8059, 1564, -3455, -19547, -25092, -18168, -19976, -28148, -24439, -9220, 9064, -1264, -14030, -14681, -14219, -6290, 9165, 16952, 18910, 15519, 8847, 19296, 17666, 25420, 37008, 25216, 4026, -4735, -10445, -15700, -23530, 88, 14319, -7791, -29199, -32893, -13395, 17430, 10339, 4524, -218, -11689, -6781, -6138, -14576, -15746, -19136, -21325, -15070, -13434, -26750, -24629, -11321, 13, -1171, -4705, -11767, -21681, -17084, -12241, -8546, 1549, -3210, -1583, -10000, -21330, -34349, -20228, -16081, -15696, -7830, -7597, -9891, -13450, -15623, -17186, -5569, 7352, 15057, 19660, 10527, -1206, 1685, -601, 9850, 15847]
16995A5847k0438k4982N005J9746o972q855J5637J4335j5640l177m196k569l239
16982a9498j1251k82R237J2286J6539J5425m459l131q404j2166o738r485j68J2055
16968a0040J5083j066L206q379j61l082j04J1609J3091p999k815k232J0179J6558
16954C3848K595j9848r17k588m245j2283j4473j8974r598K608K814O516P286J6719
16940a0540J5098N990j1944j9196j431J199J1601J6937O455k284J783j3409j4630
16927a4371j3186m65J4829N877K831k541N980J519j627J6670J8780l286p520m371
16913A9119J0624J0938j5040n791J1727J452j1978Q676L30o882q504Q196r29N784
16899B7722n063Q575Q993J141K9146K9869J5415K7866K1853J8825N9353J08355
$$ y = [15847, -4591, -29573, -24568, -4822, -11794, -20649, -5012, 9323, -6317, -9494, -13690, -16259, -19498, -30749, -31031, -21794, -9508, 7031, 22456, 17997, 14866, 6462, -5704, -12442, -21927, -22095, -10040, 5043, 3977, 7183, -1196, -1357, -4439, -4543, 7066, 20157, 12158, 9343, 7111, 17290, 33848, 36443, 16595, 15678, 13090, 8845, -3438, -17911, -36885, -46483, -43875, -41061, -34545, -27259, -10540, 4558, 10548, -1396, -20592, -22023, -20824, -9223, 7714, 14169, 11885, 13668, 259, -14371, -27557, -28022, -13193, -7316, -4485, -7026, -1046, 473, -1154, 15516, 34296, 31010, 23490, 19119, 29743, 40681, 25641, 19850, 31577, 33029, 21051, 29727, 30057, 23175, 14671, 22867, 21938, 27722, 22659, 31234, 40227, 41368, 70514, 100383, 115798, 143664, 165517, 184342, 243695, 352050]
16887C52050J60328K11500K09219J72522Q9560M1247J7112m4798j11544j68350
16877I28846j94331j88449j63574j18366o7500m7229m5051k5748j0462k0268j8563
16866B9305j711k283Q128J6547O630n914j3583j1599q974Q087o393k366J1999
16853B7873J1410m974j6602l245J0458n670o254K728o108j5595J808J3284k111
16840G002M03K3908R909j1257k7429q996o082L174J4384l07j709P85J0343O316
16826B0444m904j5233J2042o364O993J5745j2235p369j4333j2263j582J0626R398
16813I65N76R790P217N505q836m491J0457j1749j0702J3970N207R475O27L41l082
16798B5270n798j6161l25n736j921j7695O621J4056P101j3142j8567Q233R172
$$ y = [352050, 512378, 723878, 933097, 1105619, 1195179, 1236426, 1253538, 1208740, 1097196, 928846, 734515, 546066, 382492, 264126, 196626, 149397, 104346, 78598, 68136, 47868, 29305, 27594, 25311, 33439, 49986, 56616, 50702, 37119, 25520, 16546, 24633, 18240, 15874, 27873, 39283, 34309, 17707, 14462, 24920, 19250, 12996, 15724, 9616, -5979, -4171, 9113, 7002, 7405, 31313, 41222, 29965, 2536, -6460, -12542, -9368, 5016, 4709, 3000, 3785, 14128, 20444, 15540, 307, 12349, 5985, 12978, 28723, 16488, 9119, -5214, -17477, -19059, -8433, 965, 1541, 11331, 18548, 24053, 15217, 10726, 21183, 9434, -1268, 12702, 17909, 27384, 28011, 28352, 25270, 19472, 3311, 2986, -2750, -4671, -22366, -15745, -1689, 5412, -7730, -26297, -18064, -8892]
16785h892o166N421P737J848Q113L695j5630j6709K561K533J794J0642P817j0383
16771e619K943k413o824q881n959l612Q440O289Q172P195M954K128n528j901J497
16756H81n48P122Q173n013J13l116n590N763l643Q670j424K185l517j1535P161
16741E682j3686K143O807M930Q566J832j5699k914l788J0906K2285K8566K4914
16728H0544K4439K5018J7309L1592j794j8148j3889j0959k9271j1080j5956k7582
16716E0223j3643N227R349l791q21K378r812p527j9738k1044K108j015O456J748
16702I8P338Q483j097P14K535K630j1521R412n649K124R289k124j114k329j216
16687A7573J4327L79p00m279p299l888j4368p911R952Q320q619l669J755j0691
$$ y = [-8892, -15058, -9637, -1900, -52, 8061, 11756, -3874, -20583, -18022, -15489, -13695, -3053, 4764, -5619, -2676, -5089, -11913, -20794, -26753, -30365, -21925, -15636, -7464, -269, 4685, 6813, 1285, -616, 881, 333, 7455, 15628, 10615, 10728, 7612, 2022, 7785, 4142, 12812, 11388, 13573, 10056, -1479, 5682, -8004, -5861, 946, 5876, 14442, 16274, 575, -2339, -6127, 4779, 27064, 55630, 80544, 104983, 130001, 147310, 178902, 177108, 158960, 145071, 134112, 104841, 93761, 77805, 50223, 36580, 41807, 51156, 47365, 46544, 48922, 39110, 31583, 11845, -9199, -7091, -8106, -1650, 98, 7436, 15919, 14822, 15536, 18071, 20701, 9180, 18592, 12943, 15067, 24356, 22232, 21118, 18789, 17573, 31900, 32279, 31579, 27300, 20001, 16113, 1745, -6166, 3786, 12106, 3487, -182, 1573, -9118]
16673i118O422K6106O5P315K647k378J275q934o554K963L680M155n664q596j0157
16658C227l176O415r338j798N577M879l88p631P070J0991q321o648j5868k2060
16644c7069r667j9920o404J3619P357r031P006R540L343N743J361N786l519P405
16630b4450R027J5684j3428N690M817M31K744m41Q552k83K719o696Q652P038P829
16615B7885N28J6188J0705M203p139l122q187k61l531J2640L250P309J5283P6
16601G5827m170N113J1610Q859J1225K9646J9448K438J382P905J4831J0309P979
16588B02402N959l254j2611k938j6049k4458k3416j3225j840N90j5772j9138n666
16575G0584j8257q836r93j0579p425L006P036q967L502P539N070n941L848R612
$$ y = [-9118, -2696, 23410, 23475, 30790, 33437, 31059, 32334, 23400, 16846, 19809, 23489, 27644, 21980, 13384, 3227, 51, 6466, -2872, -4670, 907, 5786, 5398, -2233, 4837, 15828, 7507, 859, -15009, -37069, -46736, -66656, -73060, -59441, -52084, -61115, -54109, -44569, -41226, -35483, -34122, -28336, -31855, -24450, -15423, 261, -13167, -7477, -2660, -2229, 515, 74, 8626, 8343, 11062, 4366, 13018, 20056, 27885, 28413, 44601, 55306, 59509, 52370, 49248, 41061, 40800, 37269, 49909, 53159, 60468, 75751, 75827, 71657, 76770, 88380, 97239, 108464, 138110, 157558, 159996, 161378, 169283, 184114, 194423, 202402, 208361, 205107, 192496, 189558, 173509, 149051, 125635, 112410, 110570, 111160, 95388, 76250, 70584, 52327, 43491, 42498, 31919, 24494, 27500, 34536, 25569, 29071, 36610, 41680, 35739, 39587, 49199]
16561D9199l131O891O86j6200j0902n48L942L068Q962j0978j6393P24j372m939
16547I009j0285J0800J5660J015j850N952L235p458o481m236Q425O713J250L556
16533C5305o832j4731Q632J2707K8873K3692K0191J2171O585O408O842J031j1059
16520A29815J980J28j6196k0838o885j442L153Q991M747K856M726q392l194J052
16506A00501o298j2105M653R312N175J1622K0909q120o532j3797K813J193N61
16493A09887m795j3318j5397R27Q495q388j5061j6422j1940l085o280L020q653
16480A8990j8791o898j817m741r364j4356j9549j5152j257j5179r045n147j732
16467a04038J0137K8054L0589K9293M7118P3225P8918Q6660O6447N8946N3713
$$ y = [49199, 46068, 52959, 53645, 37445, 26543, 25995, 29937, 33005, 41967, 30989, 14596, 15320, 13948, 9009, -1276, 9524, 25184, 26199, 24349, 30301, 33536, 26078, 19597, 15361, 23786, 30499, 31749, 35305, 28473, 13742, 22374, 35081, 63954, 87646, 107837, 120008, 126593, 133001, 139843, 140874, 129815, 131795, 131923, 115727, 94889, 88004, 86562, 89715, 98706, 103453, 106309, 111035, 102643, 99449, 100501, 94203, 82098, 86751, 96063, 101238, 112860, 133769, 125649, 119117, 105320, 108133, 109326, 109887, 105092, 91774, 76377, 77304, 85799, 77411, 62350, 45928, 33988, 30903, 24623, 27643, 18990, 199, -6699, -8516, -13257, -22621, -36977, -56526, -71678, -72935, -88114, -97159, -102306, -104038, -93901, -65847, -35258, -5965, 41153, 114378, 193296, 279956, 346403, 405349, 459062]
16456D59062M8598K3119L26k0639j7359j3166j0855k4411k4050k4877l2393j4127
16444C49228k319j7024j2427j0236j1024l906k506M524j8416n171N512M921Q025
16431B89181o718R973J2031Q085R979K652o021K233p82k082M307J3781o307p120
16417C23192O86o482J707k802n984J8389K5571L7521L291r181J6922J4475N20
16404D17825N531O747J174J6056L892J256l497K1283J8069P397J6763J3852j3634
16391E12714L310O591O565J4211J2655J4328J9358K4579M2753M9838L6683L1043
16379G74628M7876M9798M8460L6779M1899N3555O5830P7181Q3921Q2498R2881
16368A455306J15756J18838J63491J94695K36861L02808L66090L70625L53403
$$ y = [459062, 507660, 530779, 531105, 510466, 493107, 479941, 469086, 444675, 420625, 395748, 363355, 349228, 346909, 329885, 317458, 307222, 296198, 292292, 289786, 294310, 275894, 270723, 276235, 281156, 289181, 282463, 292436, 304467, 312552, 322531, 325183, 319162, 321395, 320613, 318531, 322838, 336619, 330312, 323192, 323878, 317396, 319103, 316301, 310317, 328706, 354277, 391798, 395089, 385908, 402830, 417305, 417825, 423356, 430103, 431277, 447333, 451225, 452481, 448984, 470267, 488336, 495733, 512496, 526348, 512714, 516024, 522615, 529180, 543391, 556046, 570374, 589732, 614311, 657064, 706902, 743585, 774628, 822504, 872302, 920762, 957541, 999440, 1052995, 1118825, 1196006, 1279927, 1362425, 1455306, 1571062, 1689900, 1853391, 2048086, 2284947, 2587755, 2953845, 3324470, 3677873]
16359C677873L18298L02550L14228K91108K68949K70039L12908M12416N82739
16350F751108Q04842J068972J404984J834033K510368L472224M809017O787627
16342B9443175J0074564J5807351K4531873L4078003L9225503L5431018K4808751
16335B13400238J3718630O292536p81341j1601913k5024945l5093032l7864225
16328A23045948l3946351k6653612j9025846j2731766q294537n524014l805880
16321A3063942k690914j937809j416588j058689q06219o22823m46950k91493j59141
16312C633316n5567k6608l9247q1772j02153j29604j83199k80914l20692l10806
16302B102754k79709k24430j84459j35115r5807p9365p5671m7938o3027p9511
$$ y = [3677873, 3996171, 4298721, 4612949, 4904057, 5173006, 5443045, 5755953, 6168369, 6751108, 7555950, 8624922, 10029906, 11863939, 14374307, 17846531, 22655548, 29443175, 39517739, 55325090, 79856963, 113934966, 153160469, 188591487, 213400238, 227118868, 233411404, 232630063, 221028150, 196003205, 160910173, 123045948, 89099597, 62445985, 43420139, 30688373, 22393836, 16869822, 13063942, 10373028, 8435219, 7018631, 5959942, 5153723, 4530900, 4083950, 3792457, 3633316, 3577749, 3551141, 3511894, 3430122, 3327969, 3198365, 3015166, 2734252, 2413560, 2102754, 1823045, 1598615, 1414156, 1279041, 1183234, 1103869, 1028198, 980260, 917233, 837722]
16292H37722n6206l3366j8841j1984l8516l1620j2394j7553j9034j6727j6156
16281E65325j5825l8554l0063l3013l5807k8505k6198k0626j5306n759p133j6746
16269B91790p770k1356j0688k1912j4458k0342j7919j4192p882l791Q680J5823
16257A75983J0052R125M241p051j0364p170k1784l8125j3592q232j7191j0871
16245F5021j0385q211j3333r028J441n952k570o010q08O292J169n54n41J1657
16231B8188k51j0016N086q107j3193k6557l3322j5909j1326k4499j9984k2591
16219a52481j8889k3158l2192j7770J83l243k427M3226O5791Q3715Q8324Q3993
16207A15072P4362O1352M0884J6224P646J1092M165L528j1556l6077k6706k9831
$$ y = [837722, 781516, 748150, 729309, 717325, 678809, 647189, 634795, 617242, 598208, 581481, 565325, 549500, 510946, 480883, 447870, 412063, 383558, 357360, 336734, 321428, 315669, 308536, 291790, 284020, 262664, 251976, 230064, 215606, 195264, 177345, 163153, 155271, 151480, 160160, 175983, 186035, 195160, 199401, 192350, 181986, 174816, 153032, 114907, 101315, 93083, 75892, 65021, 54636, 46425, 33092, 24064, 25505, 19553, 16983, 10973, 10165, 16457, 17626, 17072, 16531, 28188, 27937, 17921, 23007, 14900, 1707, -24850, -58172, -74081, -85407, -109906, -129890, -152481, -171370, -194528, -226720, -244490, -244307, -247550, -249977, -206751, -140960, -57245, 31079, 115072, 189434, 250786, 291670, 307894, 315540, 326632, 330797, 334325, 322769, 286692, 259986, 230155]
16195B30155j2739n281j8475o984j8591q296k635j2149k1599j9359R824L043m814
16182A12100r236m420j1785k40j7964j6071j0068r232j5580j3561j1323j1505
16170a8885n800J949P567J7933J7003j5814j8388r666Q268J4783J8546J4282l583
16157B8195q151j9580m75q194J2389L441p519k6405j1811k0332k4058k951P023
16144g8428L084L787j700J9703K8304J4471K7760J5750J8329M218J560M932r771
16131E1999j1653r671p843K539R895P945p017j2096l202J0302J7574K546l093
16118D8225k085j0251k1036K152J8400K445j2234M166K891J269K043O200j0093
16105C2092j3012J0993R807o315J3267J182r302j6833j5185M238j489o398N688
$$ y = [230155, 217416, 212135, 193660, 186676, 168085, 159789, 157154, 145005, 123406, 104047, 113871, 116914, 112100, 102864, 98444, 86659, 86419, 68455, 52384, 42316, 33084, 17504, 3943, -7380, -18885, -24685, -22736, -15169, 2764, 19767, 3953, -14435, -24101, -15833, -1050, 17496, 31778, 28195, 20044, 464, -11, -8205, 4184, 7625, 106, -26299, -38110, -58442, -82500, -85451, -78428, -75344, -71557, -73257, -53554, -25250, -10779, 16981, 32731, 51060, 55278, 56838, 61770, 51999, 40346, 30675, 22832, 25371, 35266, 43211, 36194, 24098, 20896, 31198, 48772, 51318, 48225, 46140, 35889, 14853, 17005, 35405, 37850, 25616, 29782, 32673, 33942, 35985, 42185, 32092, 19080, 30073, 39880, 33565, 46832, 48014, 38712, 21879, 6694, 10932, 9443, 3045, 8733]
16092H733m199J363Q73K720K781J158K575q40k680j2024L235k85j5345j6445N611
16077b2769J4217J7208J578l678o411J0325K02j1273p521R354J4680R545j0875
16064A4582J1354K4264Q547R42K3676L2175N3882N5347L3934M8502N4469J8730
16052C80404O799R090n732P34J345j0318m3648n1556o7008o3658m4607q488k851
16039A00506k475M248m831J1012O056P782p160J7004J6872m364k3954j8105j865
16026A00726L048p99m999l976j7910j7325k2259j0885J729j3509Q448M307k802
16013B3794J2001m991j2864M404N403n78j840L447j0832j2326n356J454O031J655
15999I402K236Q592n893J507J5584r934n661P870j186p648N795o14m368M560J0176
$$ y = [8733, 4534, 5897, 6770, 9490, 12271, 13429, 16004, 15164, 12484, 460, 3695, 3410, -11935, -28380, -22769, -8552, 8656, 10234, 6556, 145, 10470, 10672, -601, -8122, 1232, 15912, 25457, 14582, 25936, 50200, 58747, 59689, 83365, 115540, 169422, 224769, 258703, 307205, 361674, 380404, 387203, 396293, 390561, 391295, 392640, 382322, 338674, 287118, 220110, 156452, 111845, 103357, 100506, 98031, 102279, 97448, 108460, 114516, 122298, 115138, 132142, 149014, 144650, 120696, 102591, 100726, 103774, 102975, 97976, 94000, 76090, 58765, 36506, 25621, 27350, 13841, 22289, 26596, 23794, 35795, 30804, 17940, 22344, 27747, 27169, 25329, 28776, 17944, 5618, 262, 1716, 7747, 9402, 11638, 20230, 14337, 15844, 31428, 21494, 15833, 23703, 22517, 14869, 20664, 20050, 15682, 20242, 30418]
15984C0418P825q23O981j330j2920p573l317j2597k1055L756J0840P615M008K812
15970A4640P189n365J3729M451j927m981R191Q521j0975r203M71M999m824j158
15956B4758J4029j227j8112M569j4781J060O86k5180j5175J3521J474J0845K3752
15943B0219P203j8669l365r294j8426J4115J5887J5145J4934k866q034j8732q240
15930a23P712n302K231J7197n782o353K781J656n591j443K4627J3930o181j3975
15916B5384j6126j445O33N175n171o146J866o270J755R95M461J5212M766m950
15902B0139m501j1591p11N791L059r652j5559K563Q788l428R370J1643m081o968
15888D862j686J2266j220j533L458n990q024o303r510l907K358R201k601n735
$$ y = [30418, 38243, 37420, 44401, 43071, 30151, 22578, 19261, 6664, -14391, -10635, 205, 7820, 11828, 14640, 21829, 16464, 30193, 34644, 32717, 27736, 36927, 45448, 34473, 25270, 25741, 30740, 25916, 24758, 38787, 37560, 19448, 24017, 9236, 10296, 10982, -14198, -29373, -15852, -14378, -3533, 20219, 27422, 8753, 5388, -3906, -22332, -8217, 7670, 22815, 37749, 34883, 26849, 8117, -123, 7589, 2287, 4518, 21715, 15933, 9580, 12361, 14017, 8426, 6983, 31610, 45540, 39359, 25384, 9258, 7813, 8446, 13621, 8450, 2304, 4170, -2100, -345, 650, 5111, 20323, 25089, 20139, 15638, 4047, 3336, 9127, 12186, 2534, -13025, -10462, -1674, -5102, 4268, 15911, 11830, 4862, 3176, 15442, 14222, 12689, 16147, 10157, 2133, -4170, -13680, -17587, -15229, -6028, -8629, -14364]
15874a4364n197L121J491j0975l608K639J566K28J579O807K401j172j5951j3236
15860d4671Q568J3286N260O487Q247n020N124j2493P534Q800N03r6j34n414p627
15845a1646K480L439m328o227K281J4797J4206r393j6861J3369J3475j6629n391
15832f428o048R673j021j8064j586J1605K0491j906j0159o23P46o245p096l047
15818a9708M280R225N542K925L554n944j4076O623O068o623M734k105m235J0955
15804A215J05o156j894J614L530J0543q584P834K6074j815o803J7107Q962Q104
15790E9836J5351J2209K0297N2157N9888Q9489J38108J78235K02726J82397J35850
15779A146543O1123L8074j6737p5899j48762j98308j96376j70447j23657j05062
$$ y = [-14364, -19561, -16440, -14949, -25924, -29532, -26893, -25327, -25099, -23520, -16713, -14312, -15484, -31435, -44671, -36103, -22817, -17557, -11070, -2823, -7843, -2719, -15212, -7678, 1122, 1625, 1529, 1395, -4019, -11646, -9166, -5727, -10055, -16282, -14001, 796, 15002, 5609, -11252, 2117, 15592, -1037, -6428, -12476, -2803, -3824, -21888, -23474, -11869, 8622, 6716, -3443, -4066, -3320, -9565, -16661, -19708, -15428, -6203, -661, 2264, 5818, -126, -14202, -7579, -1511, -8134, -3400, -5505, -9740, 1215, 1320, -4836, -6730, -5116, -1586, 8957, 373, 8207, 34281, 32466, 25663, 42770, 51732, 59836, 75187, 87396, 107693, 159850, 219738, 309227, 447335, 625570, 828296, 1010693, 1146543, 1207666, 1245740, 1229003, 1153104, 1004342, 806034, 609658, 439211, 315554, 210492]
15769B10492n7373m3765k0291l0845j8653J728o73j2653j2121l272j5025r36r912
15756a3299N506R204j018j148j331o526m564p797m313M177M995K0612M693q32
15742H359j5264r079M897J2216l3p091j0598L447J7155J6620K042p796j0729P656
15728A1802K667j6190j2260K636N12m36o084m74J1170o925p388M571q9N664M154
15713f670O983N119n261n955r867L731p50J7521k051j9903p560l193k219J2895
15699a7180J8118N659l282k1379j4120L278k031K014m361L497N955l579J2599
15686a4812k029j4726q122k348N574J7704P684J2970M395j5314j8246J4345L136
15673i789n911m691o232l079L577P405J0949J6214L687k6287n697K856p075O069
$$ y = [210492, 153119, 109354, 89063, 58218, 39565, 41293, 40620, 27967, 15846, 12574, -2451, -3387, -13299, -7793, 1411, 393, -755, -2086, -8612, -13176, -20973, -25286, -21109, -16114, 4498, 9191, 8359, -6905, -15984, -11087, 1129, 1096, -5995, -16593, -13146, 4009, 20629, 22671, 14875, 4146, 11802, 14469, -1721, -13981, -11345, -10833, -11269, -17353, -17827, -6657, -13582, -20970, -16399, -16488, -10824, -6670, 313, 5432, 171, -5784, -15651, -11920, -12670, 4851, 2800, -17103, -24663, -27856, -30075, -17180, 938, 6597, 3315, -18064, -32184, -28906, -30937, -28923, -33284, -29787, -23832, -27411, -14812, -16841, -31567, -39689, -42037, -36463, -18759, -11075, 1895, 6290, -9024, -27270, -12925, -9789, -15700, -20391, -26623, -29702, -26125, -18720, -7771, 8443, 12130, -14157, -19854, -16998, -24073, -18004]
15659a8004l808k288J5347J5850J4250l548k0104l178p27p830j8966j8412j420
15646e2838o747K953N580J5497J8562J3761j396O240J2685J717r196P175J95p078
15632G110j5381J142k452M173k539K630p35n833N720q538j9510k851J5823J3345
15618g896J922P420K95j2934j4286j5885l395M815J2471Q954k227p07n859k69
15604b7581l974J678M664j2700j4380P514J3414J7385l369J3895K474J294m830
15591d516P850k824m655o148P690k2142j9944R118J2626j204Q242m522p10P424
15577a3715Q916l665m793J2670M097K694K658N064r596j1148o398J3354J0200
15564A0338j0978j9901K021n242j5591J875K0899n05r62M894n788m189Q53r716
$$ y = [-18004, -21812, -24100, -8753, 7097, 21347, 17799, -2305, -5483, -6210, -14040, -33006, -51418, -52838, -59585, -56632, -51052, -35555, -16993, -3232, -4628, 1612, 14297, 16014, 6818, 13993, 14188, 7110, -8271, -7129, -9581, -5408, -7947, -5317, -6052, -11885, -6165, -14703, -34213, -37064, -21241, -7896, -5974, 1446, 1741, -11193, -25479, -41364, -44759, -39944, -27473, -18519, -20746, -21453, -27312, -27581, -31555, -29877, -25213, -37913, -52293, -44779, -31365, -13980, -17349, -3454, -980, 314, -4516, 3334, 510, -4145, -10293, -2603, -24745, -44689, -35571, -22945, -24149, -15907, -20429, -21139, -13715, -4799, -8464, -13257, -587, 3510, 6204, 8862, 13926, 4330, -6818, -13216, 138, 10338, -640, -20541, -18520, -23762, -39353, -37478, -16579, -17084, -18046, -13152, -18940, -23129, -22276, -31992]
15550c1992L92N677M730K011O41m355M776R146q901j6935N537j599M475P283J0792
15535h322L644J906K83j836J325N965j5847n076n543j2493r24J7180J1974l646
15521a1410j1111R989n418l331M84L566l94m45j0256P782m950j648O935j470m971
15506b6648l538L018J882P114J3280O422j614J0935K340m938j00l913L53q362
15492c769p22j3003j3324P097R693P697j8505j0334M50O891M446j34l067Q3m324
15477c0825O078L351L05K933J0415n169J1327j7476j6553L964J8555J2273m155
15464d977Q338j1776l812P273J0690J3771M936L578o028q000n161l969N469Q04
15450A1136j6569j4003lK94J0869J0395k777p12k1775l977O992l113J4325N453
$$ y = [-31992, -31600, -25923, -21193, -19182, -18541, -22896, -18120, -8974, -17875, -34810, -29273, -30872, -26397, -19114, -8322, -4678, -2772, -2489, -4325, -3000, 2965, -12882, -17958, -23501, -35994, -36918, -19738, -7764, -11410, -22521, -12532, -17950, -21281, -20797, -17231, -17625, -18070, -28326, -20544, -25494, -27142, -20207, -21677, -26648, -30186, -27168, -25286, -18172, -4892, 1530, -84, 10851, 13191, 8253, 8153, 4240, 4593, -3769, -4491, -17494, -30818, -23721, -14028, -6331, -24836, -35170, -34720, -27829, -23383, -23517, -26584, -26501, -30825, -24747, -21396, -21091, -18158, -7743, -12912, -1585, -19061, -35614, -31650, -13095, -822, -4977, 3361, -8415, -12227, -4954, 5736, 19507, 24443, 28021, 21993, 13993, 8832, 4863, 10332, 11136, -5433, -19436, -19439, -19145, -8276, 2119, -658, -1370, -23145, -27122, -20130, -23243, -8918, -3465]
15436c465o415p107k48J0924J615k4647j605J2313m002P33l615n044m049M937
15422b9675O197J4431J4987r967J47Q699m234o432q839j8188N021J3196O526P039
15408a092k770q227J2533J8043j4671o193j8123q081O878qJ1029j470l276K694
15394a2734M998M066J305J9028q248k4273j3879J287J6745R953J045n775n640
15381a2122j907P122M834N070J270J715l949j4490n491Q969O593O58l116q6q784
15366a3714o204k447J0050j057l206L771o13n534l28j781j0787j129O022R182
15352a7775J7546K878j3660j2505l670r610n791M538N359k018q438R798K1892
15339a1456P56r948J831j694R022P192l974j0635R85k190r384M872N019l905L063
$$ y = [-3465, -9880, -16987, -17235, -6311, -4696, -29343, -30948, -18635, -22637, -21904, -25519, -30563, -34612, -29675, -23478, -9047, 5940, -4027, -3880, 4819, 585, -5847, -14686, -32874, -27853, -14657, -8131, -1092, -3862, -12089, 444, 18487, 3816, -2377, -20500, -28581, -21703, -21711, -10682, -12152, -15428, -12734, -7736, -3670, -2365, 16663, 8415, -15858, -29737, -28450, -11705, -1752, -707, -6482, -12122, -14029, -6907, -2073, 2997, 4267, 5982, 2033, -12457, -17948, -8979, -2386, -1728, -4844, -4930, -13714, -19918, -22365, -12315, -13372, -16578, -12807, -13420, -18954, -19282, -21063, -31850, -32979, -26957, -17775, -229, 2649, -11011, -23516, -27186, -36796, -42587, -38049, -32690, -34708, -43146, -33348, -11456, -10700, -20648, -18817, -20511, -11489, -4297, -8271, -18906, -17921, -20111, -29495, -24623, -19604, -23509, -20446]
15324b0446Q34L101O029M150K478q777k436J3521l210m754o407j4242r006Q999
15310c0166J7171p1o801p738J062M354Q584K309M830o212J464J7719Q972j1584
15296C893q98j9952j036N250J0550J821O194l10j6018l623O899L518k0k793Q577
15281B052M979J088o859k250N670l217j2216J245L282P351m981M641J782o470
15267c903O719M584J072m789o478j0369j253n335o474M364K3981o979j7856j52
15253b2868L536Q268o383m744R55j9997l370K0288J1470L3O433J3548J2342o34
15239A8877J1810m095q289r248r614j6460o156K901R639N758m459j1458n991N402
15225b1383Q461R8J8357O487P703j9902m143p206J2407J0159Q208l92m119j8877
$$ y = [-20446, -19612, -16511, -10482, -6332, -3854, -12631, -15067, -1546, -4756, -9510, -15917, -30159, -39165, -30166, -12995, -13066, -19867, -27605, -26543, -22189, -13605, -11296, -6466, -12678, -11214, 6505, 15477, 3893, 2995, -16957, -17993, -12743, -2193, -372, 5822, 5512, -10506, -14129, -7230, -3712, -3732, -6525, 2052, 7031, 8119, 1260, -990, 4680, 1463, -10753, -9508, -6226, 1125, -3856, 785, 2567, -3903, 2816, 7400, 8472, 3683, -2795, -13164, -14417, -19752, -26226, -21862, 2119, -4860, -22716, -22868, -19332, -11064, -17447, -22191, -21236, -41233, -44603, -24315, -12845, -12812, -6379, 7169, 19511, 18877, 30687, 26592, 18303, 9055, -559, -17019, -23175, -20274, -10635, -4877, -9336, -20794, -26785, -21383, -12922, -12824, 5533, 12020, 19723, -179, -4322, -11528, 879, 11038, 19246, 18854, 14735, -4142]
15211d142L36K63K63j605K733K200n229q725p238L927j525J422Q557P087J015
15196f61n204j840j3080P406N176Q87n499m172Q197R954K234k652J517K455M347
15181I065N243p530j3314j5719n464P032J5593o520r941K191L162P092J0031L926
15167D847K532L138r426j5622n78L855l118p199J3756N208N480j008j030o639
15153e804o98M89r186k549n4P65O471J6205O179n177M297p438j3409J527J302
15138g080J462l895Q678M951O79j0536K863Q096J1729j0455m661J1302o195r816
15124b878j0675J1847J7574K731j2830j396K394l786R279Q175J0790j1906j6239
15111C080K785M576j1631P06m51p378m469J558n31j0821J2246J3901j499l009
$$ y = [-4142, -3806, -3543, -3280, -4885, -2152, 48, -5181, -13906, -21144, -17217, -18742, -17320, -8763, -1676, -661, -5865, -7705, -20785, -13379, -8203, -7316, -12815, -16987, -8790, 1164, 3398, 746, 2263, 4718, 9065, 14308, 6778, -6536, -22255, -27719, -20687, -5094, -11614, -21555, -19364, -16202, -9110, 921, 4847, 7379, 10517, 1091, -14531, -15109, -11254, -14372, -21571, -7815, -2607, 2873, 1865, 835, -5804, -6502, -6013, -15199, -17748, -17802, -17037, -10566, 5639, 11818, 6641, 10938, 3500, -9909, -8382, -7080, -5618, -9513, -835, 4116, 4795, -5741, -2878, 5218, 16947, 6492, 1831, 13133, 6938, -2878, -13553, -1706, 15868, 18599, 5769, 4373, 6767, 2981, 12260, 20435, 31225, 19319, 3080, 5865, 10441, -1190, -484, -935, -8313, -12782, -11224, -11755, -22576, -10330, 3571, 2072, -937]
15097i37k295j3122o940l283q464J5178J7336J1340n44j3412k3557k1694J3545
15084c6849J1360O314M255J6140q439j1727r966k312J6743l792Q179L687j2147
15071a8554k681q461N361J0685r823k055P735N249Q50M250q622O479K177O049
15057a361L750j7443j4014o55L291l128J530j714L404R390L095k509Q745J0335
15043B716M535J134m474k2864j0053N785O08L953J1724J2010N583P539k57k9889
15029a1950n633J5393J510k782j278L120L447n239J2597R64p72j4835N57L799
15015a102n80p374n670J0106N890k535p341q150j2959J4859j519n498K120K2490
15001B737J0970j5256j1059K915O858p839m545K911O142P410j2301q610m702k452
$$ y = [-937, -3232, -16354, -23294, -26577, -35041, -19863, -2527, 8813, 8269, -5143, -28700, -50394, -36849, -25489, -19175, -14920, 1220, -7219, -18946, -28912, -31224, -14481, -18273, -10094, -6407, -18554, -21235, -29696, -24335, -13650, -23473, -25528, -17793, -12544, -11694, -7444, -16066, -9587, -7410, -1361, 2389, -15054, -29068, -29723, -26432, -29560, -28030, -29744, -26340, -16950, -13855, -16364, -7619, 2716, 7251, 8385, 3911, -18953, -29006, -23221, -22613, -18660, -6936, 5074, 10657, 18196, 17939, -11950, -17583, -2190, -680, -3462, -4740, -1620, 1827, -3412, 9185, 10149, 9377, -5458, -4901, -1102, -1682, -9056, -14726, -4620, 1270, -1265, -8606, -16756, -29715, -14856, -16375, -21873, -19753, 2737, 13707, -1549, -12608, -9693, -2835, -10674, -15219, -12308, -6166, 1244, -11057, -19667, -24369, -26821]
14987b6821R392J940l372Q816l979m371k162J4932Q476K584m578n906q737l39
14973a4125R897J351O289O509o290J0801l268J642J067O737L712l507K254M250
14959B7319J1590J662L15j1745j9804j445k135J2831j4124q524J3032R059r239
14946H792j258r969m442L346J5808q535L301k331R095j48j487n49L452j2587q832
14931f344q105M624O781R822J0185O11j0951j795M424j448p906j0506K776L036
14917d796q22K0368k84l951o125m952K6577p566n404L742k349p81j786o793j3795
14902h717j6885P641J9269m104p638j352Q525N826j0018q738J050L268P243n385
14888a0015J1727k712o096m577k48L608M922o492n116M530m272n843j0704K565
$$ y = [-26821, -17429, -15489, -18861, -10045, -14024, -18395, -20557, -5625, 2851, 5435, 857, -5049, -13786, -14125, -4228, -2877, 3412, 9921, 3631, 14432, 11164, 12806, 13873, 20610, 24322, 20815, 23069, 27319, 38909, 40571, 40886, 29141, 9337, 7892, 5757, 18588, 4464, -4060, 8972, 18031, 8792, 7534, -2435, -6877, -3531, 12277, 3742, 7043, 4712, 13807, 13659, 12172, 11623, 15075, 2488, -6344, -14449, -9825, -3044, 6778, 16963, 17574, 6623, 4828, 9252, 7804, -102, -10608, -7832, -4796, -5618, 14750, 14466, 10515, 4390, -562, 26015, 18449, 13045, 16787, 14438, 13657, 11871, 5078, -8717, -25602, -17961, 1308, -2796, -10434, -11786, -3261, 2565, -7453, -16191, -15141, -11873, -4630, -10015, 1712, -1000, -7096, -11673, -11921, -8313, -3391, -9883, -14999, -10469, -14741, -20584, -31288, -28723]
14874b8723R623J6916J2843N904p94o277J920m163N634q761J917L264n962J0828
14860A4169M179p633j1110q455j3389j154O756J7343J973R98j210p927p704q312
14846b1476j88l207Q603K93m203k350Q868R533Q85q772j163M230j1o582j042N007
14830a1575M101l584r496p122J326Q920J1704R369M996j00o060M87J1685m289
14816A0362j5889r148O78j0466O563J5962m257j0271J960K230L183l115r267P136
14802a4339J1410k947L0K446N746k607j4092m813K284p048j0688m79O735K633
14788b5729J1077P011j433R289J1692l079j2789l395Q645k364o368m149J1845
14775B53N107j2658j541O677K22L082n870j1677N151M611J090J292O129O58L505
$$ y = [-28723, -19100, -2184, 10659, 16563, 15769, 9492, 11412, 7249, 12883, 4122, 6039, 9303, 3341, 14169, 18348, 10715, -395, -8850, -22239, -23393, -16637, 706, 2679, 3677, 2467, -5460, -13164, -21476, -21664, -24871, -16268, -15975, -20178, -22528, -13660, -4127, -3242, -12014, -13177, -8947, -8958, -15540, -16582, -11575, -7474, -11058, -20554, -27676, -26350, -17430, -5726, 3643, 8639, 8539, 2479, 2966, 14651, 10362, -5527, -14675, -13997, -24463, -17900, -1938, -6195, -16466, -14506, -12276, -9093, -12208, -21475, -14339, -2929, -5876, -5846, -3400, 2346, -261, -14353, -19166, -16882, -23930, -34618, -35097, -28362, -25729, -14652, -7641, -9074, 215, 11907, 8828, -3961, -7356, 1289, -1075, -7443, -11592, 253, 5360, -7298, -8839, -2162, -1940, 1142, -4728, -16405, -11254, -6643, -5553, -4261, 1868, 2526, 6031]
14760F031K52j2676m916O630O30j308Q65N706L965j2567j822j3382j5948P660
14746c0880N273N11k929J5616J1594l118m469j586J783R418N338J0131K486l79
14732A8789L697p621L048j094j1000n15K76K98j541n380J367q354N758L144N195
14717F067q03m139L915j7471j698n893k0381L352J0914K666J0440P166R077O705
14703I917k747j6334k069J2714J1778K940j1220Q426K770K10j6060o754N552L071
14689B194N822P643P103j415l321m771j4518j0207p820N741J5130Q163J89M760
14675A4693O832j3209j4420l20q785l312N830J6116j0693j4734o932P623m598
14662b5909J2640M765p634r356K069L759p799K531N294p453O184O399L437P397
$$ y = [6031, 6283, -6393, -11309, -4679, -4049, -5357, -4492, 1214, 5179, -7388, -9210, -22592, -38540, -30880, -25607, -25096, -28025, -12409, -815, -3933, -8402, -9988, -8205, 1213, 6551, 16682, 19168, 18789, 22486, 14865, 17913, 16819, 5819, 5304, 5580, 5878, 4337, -1043, 324, -8030, -2272, 872, 6067, 5264, 1125, 5040, -12431, -14129, -20022, -40403, -37051, -26137, -23471, -13031, -5865, 3212, 9917, 7170, -9164, -11233, 1481, 13259, 16199, 4979, 13405, 16175, 16385, 325, -6429, -877, 2194, 8016, 15659, 22762, 21347, 18026, 13255, -1263, -11470, -19290, -13549, 1581, 9744, 9933, 14693, 21525, 8316, -6104, -6424, -15209, -18521, -12691, 3425, -7268, -22002, -28934, -21311, -25909, -13269, -8504, -16138, -25494, -23425, -19666, -27465, -24934, -19640, -27093, -20909, -14510, -11073, -3676]
14648c676J6551J2531J40j0979k5907l350L462J0140P792j1180j2908r267J5426
14635a1225J6501J1596j5624j4849r55Q158r40N089r929p44J3068K0179M547N65
14621B5437j0940j0194Q09Q378o41J894k751j0697l796j0390m207J825L833P566
14607c874O491k880L253J4292O246p616n924j2115L424K578k299N555l703q405
14593d977l391N728p82O01J0387o036j0500j0498J0051L163m154L841k713r40
14579a0220q209J0166R591j4769n72K682p965J2596J1851j828q884q378J7095
14566C156M980L90q014j6953q937m920K782j49O582J0037J9551q612p659j784
14552i550M334M284L235K664M207K926k3301r167J3145J6928k836j7103K234J7715
$$ y = [-3676, 12875, 25406, 25546, 14567, -11340, -14690, -11228, -1088, 6704, -4476, -17384, -26651, -11225, 5276, 16872, 1248, -13601, -14556, -6398, -7338, -2249, -12178, -12922, 146, 20325, 24872, 25437, 14497, 4303, 5112, 13490, 12849, 14743, 11992, 1295, -2501, -12891, -17098, -15273, -11440, -3874, 2617, -263, 2990, 17282, 23528, 15912, 9988, -2127, 1297, 3875, 1576, 7131, 3428, -4977, -8368, -2640, -3422, -2821, 7566, 1530, -8970, -19468, -9417, -6254, -10408, -6567, -9280, -10220, -18429, -8263, 1328, -13441, -14013, -11331, -19296, -6700, 5151, 3323, -5561, -13939, 3156, 8136, 8526, 512, -16441, -25378, -30298, -27516, -27665, -21083, -11046, 8505, -107, -7766, -9550, -5216, -932, 2303, 4967, 9174, 12100, -11201, -20368, -7223, 9705, 6869, -10234, -8000, 9715]
14538I715k113j0910Q30m202K239R712O338m093L304k665L20k19m804m330N212
14523D334j1126n59Q854m490o074l424O336R135l443n420M742P999J1023N662
14509B3549n830k440l628Q862M402j3083j0337K3179J017L314j5854j0156J2483
14496A5478O958o853r405O508m377j5111M450K990L072K747K649l300K422J4003
14482B2231P879j0292Q83N335r586j8760j622J268K318r044M817J0613J0357j7199
14468h02N15O861k692o53j975R160l37j0138Q370L867J1822j3726n884m851j8501
14453a8964k0988O111J2416R346J2259Q741M934J1422J643n310j9233k007k415
14440b045k329N763J5425k698j4673M838Q47k809n862K937O419J74O07p538k948
$$ y = [9715, 7602, -3308, -2478, -6680, -4441, 5271, 11609, 7516, 10820, 8155, 8475, 8256, 3452, -878, 4334, -6792, -7351, 1503, -2987, -9061, -12485, -6149, 2986, -457, -5877, -1135, 6864, 17887, 23549, 17719, 15279, 11651, 20513, 24915, 11832, 1495, 24674, 25691, 29005, 13151, 2995, 15478, 22436, 15583, 6178, 12686, 8309, -6802, -2352, 638, 3710, 6457, 9106, 5806, 8228, 22231, 30110, 19818, 20701, 26036, 16450, -2310, -3932, -2664, -346, -9390, -4573, 6040, 16397, -802, -287, 6574, 3882, 3229, 1254, 10414, 10077, -61, 8309, 12176, 23998, 10272, 4388, -463, -18964, -39952, -33841, -21425, -12079, 180, 8921, 13855, 25277, 26920, 21610, 2377, 370, -2045, -4374, 1389, 16814, 14116, -557, 4281, 5128, 2319, -3543, -606, 5813, 5987, 6594, -944, -3892]
14425c892J32j2562M197J3173r643k0167k184J4400l850l532P039J1065J6824
14412A1000k546j5648O028P619J129M619J712J5704p093j0682q020j1563j2781
14399b0522J827K2006J0528M903m330q954r915j6947L775l369k262Q881k673j24
14385a7176J7627J1390R778N680k715p719j570m486m673j615J498L524K280r194
14371B629M6P327m513r9N745l92M948J3245Q89j2560o247M28j642q897R638n5
14355A0490j3876M181r103M202j0107l052K1825M634p693J9898L77j8292j0625
14342g141l32k310m775o86K3055J6605r822r973l613m488P276N710r150N095P062
14327A2513P423m354o095q228j1986J7268N407q223l874K50Q837M12o547j0304
$$ y = [-3892, -3760, -16322, -12125, 1048, -8595, -28762, -30946, -16546, -20396, -23928, -16889, -5824, 11000, 8454, -7194, -1166, 6453, 7582, 12201, 13913, 29617, 22524, 11842, 3822, -7741, -20522, -18695, 3311, 13839, 18742, 14412, 5458, -4457, -21404, -17629, -20998, -23260, -14379, -17052, -17176, 451, 11841, 21619, 27299, 24584, 16865, 15295, 10809, 6136, 4521, 6019, 9543, 11823, 2629, 2675, 10002, 5489, 5390, 11135, 10743, 15691, 28936, 29825, 17265, 11018, 11446, 9804, 907, 10545, 10490, -3386, 795, -8308, -4106, -14213, -17265, 4560, 9194, 1501, 21399, 21776, 3484, -7141, -7473, -9783, -14558, -15244, 7811, 24416, 14594, 4621, 1008, -3480, 3796, 9506, 356, 5451, 12513, 19936, 15582, 9487, 1259, -10727, 6541, 11948, 3725, -149, 101, 8938, 9350, 2803, -7501]
14313g501m492O319K673M71L862k185P052m148L903P328J1514J655j1724P812
14299B2539l75q477l244K454n105P446N943L165J676J6250j476l447M551Q062
14285D9962R116j6897j0123p494n484m505P264j0874m047r240j016l496q615o672
14271b2121J7237m775Q10O625M093P545J3792J2368k1958j3927o650J3536M359
14258A0934J5411l305k1803n92p955m327J4960l891p018J6742m73p313r571J3695
14244E494J315l473J7374J9410J3112j739k89j2305r831K818k417j6702R05k090
14230A1582m083J930o015p933p862J5449k781j4942J7905M094K276N219J0999
14217B5838k762k4208m758K043L625p064M676N271L62Q138j266O596r89j873m279
$$ y = [-7501, -11993, -5674, -3001, -2530, 1332, -853, 6199, 2051, 5954, 13282, 24796, 26451, 14727, 22539, 22164, 13687, 10443, 12897, 7792, 15238, 21181, 24346, 26022, 42272, 40796, 37349, 41900, 49962, 59078, 42181, 32058, 24564, 19080, 14575, 21839, 10965, 6918, -2322, -3338, -6834, -15449, -22121, -4884, -9659, -8849, -2224, 1869, 9414, 23206, 35574, 13616, -311, -6961, 6575, 10934, 26345, 23040, 1237, 645, -7310, -11637, 3323, -568, -7586, 9156, 8683, 1370, -8201, 5494, 6809, 3336, 20710, 40120, 53232, 51493, 51204, 38899, 29068, 31886, 29469, 12767, 13672, 11582, 7499, 9429, 3414, -4519, -12381, 3068, 287, -14655, 3250, 7344, 9620, 14839, 25838, 23076, -1132, -5890, -3847, -222, -7286, -2610, 2661, 3023, 11161, 9895, 16491, 15502, 13629, 9350]
14202I350J940Q223P842j322j1611q260N799J805j0240Q8J1651N888j3456m351
14188C346Q67l375l099J3938J8160j6714j1040K1127J0504j855k341p850R265
14175C0933L095L096L249J0406m089r728o062j0101p639O741N895R623m417O568
14161C7570L749N714j1516l2400O432N058J0718R957M954r654p685n153N509j911
14147B1342o615m843q225r677j0605J9927J4772j872p061q278o96M950O92J1207
14133A5018J9222Q119J2616L2530j5582k8429k993q245j800Q131l999o086j1638
14120A6864k083j8589j4423n914P767Q157P329P164O554K048j2898m510k174N616
14106I08o764K95P502r71O690K609p42J144N656j583l802J8497L332l26j404j0572
$$ y = [9350, 11290, 19513, 27355, 26033, 14422, 6162, 11961, 13766, 3526, 3614, 15265, 21153, 7697, 3346, 4213, 838, -2261, 11677, 29837, 13123, 2083, 23210, 33714, 31859, 29518, 21668, 30933, 34028, 37124, 40373, 50779, 46690, 36962, 30900, 20799, 13160, 19901, 25796, 35419, 31002, 37570, 41319, 47033, 35517, 3117, 9549, 14607, 25325, 35282, 40236, 30582, 22897, 17744, 23253, 21342, 14727, 9884, 1659, -8018, -18623, 1304, 16076, 14204, 7143, -1135, -1831, 3119, 3811, 15018, 34240, 42359, 54975, 87505, 71923, 43494, 40501, 32256, 30456, 38587, 34588, 28502, 16864, 14781, -3808, -18231, -24145, -16378, -8221, -892, 6272, 12826, 14874, 1976, -2534, -4708, 908, -5856, -5561, 1941, 970, 7660, 10269, 9527, 10671, 16327, 14744, 10942, 29439, 32771, 32445, 31041, 20469]
14090B0469l99n071l277Q14j0883L017K86r869l137j0186L777N025J1635n561
14076c360k10J2574Q045J0585m100k897o361R179L16l534N098R220P210j3329
14062B8436j6189n973j024J844J6173p090r459J0410J9558k195k091L485P620
14049D3505M27k331j4082l347R49N969L423n820J6110O009p477j1654j5398j953
14035A4330R60p406n685Q706K239j1494O61Q407N695L63M968O717M851m235Q117
14020C7194P054j685n513J64Q271j933q025k0137j106K0975m340q307L361p335
14006A8638p405J2922J0568l66j8727q5J0317N278J2559R780O438J913j5804j1497
13992C4529O360K2765l55J488l517l508P414J0867R736r616k2279o610j0809j463
$$ y = [20469, 20070, 14999, 11722, 12536, 1653, 4670, 4956, -4913, -8050, -18236, -14459, -9434, 2201, -3360, -3570, 9004, 17049, 27634, 23534, 20637, 14276, 23455, 23771, 20237, 25335, 34555, 41765, 28436, 12247, 6274, 5250, 7094, 23267, 16177, 6718, 17128, 36686, 34491, 32400, 35885, 43505, 43932, 41601, 27519, 24172, 25121, 31090, 34513, 28693, 44803, 50812, 43335, 31681, 16283, 14330, 15290, 7884, 2199, 10905, 13144, 1650, 2311, 10718, 16413, 16776, 21744, 28461, 33312, 29077, 37194, 44248, 42563, 37050, 37214, 45485, 43552, 35527, 15390, 14284, 35259, 30919, 22612, 25973, 18638, 11233, 24155, 34723, 34357, 15630, 15545, 25862, 31140, 43699, 53479, 59917, 61830, 46026, 34529, 40889, 63654, 63299, 64787, 61270, 57762, 65176, 76043, 85779, 76163, 53884, 47274, 36465, 35002]
13978C5002k885k719R517O229p66j070K535J0885J5631l175o799R783J785m196
13964F9757M51j8465n422J86Q467N538N468J184j737M353N798J1902Q655R882
13950A06017J4094J7684K9363J1996J3039K9646K7506L9594N6909Q6689J21847
13939E54384J89421K88565M67023O48942O10485J55239l27015m92881n05365m42396
13929A146402l25193k13928j29200p5753n3886l5540k6668k6908j2493j25o948
13918B39760J5227J6011J0481J1997K5006L9709O8017Q2596J19703J88730L04683
13907A121920M62133N27536K67194k3701M3853K40879M56762L97866p5459m42498
13897B976485m90317m22447k45130L3778K71528J28979k81862l69305l65086l34049
$$ y = [35002, 32117, 29398, 38915, 45144, 44378, 43308, 45843, 56728, 72359, 69184, 62385, 72168, 73953, 69757, 70208, 51743, 46321, 46507, 54974, 60512, 65980, 67164, 65427, 69780, 75578, 87480, 96135, 106017, 120111, 137795, 167158, 179154, 192193, 221839, 249345, 288939, 345848, 432537, 554384, 743805, 1032370, 1499393, 2148335, 2758820, 2914059, 2587044, 2094163, 1588798, 1146402, 821209, 607281, 478081, 402328, 348442, 312902, 286234, 259326, 246833, 246708, 239760, 254987, 270998, 281479, 293476, 318482, 358191, 426208, 508804, 628507, 817237, 1121920, 1584053, 2111589, 2378783, 2355082, 2398935, 2639814, 3096576, 3494442, 3418983, 2976485, 2486168, 2063721, 1818591, 1852369, 2123897, 2252876, 1971014, 1601709, 1236623, 902574]
13887I02574k46004j58456p4522n0954m5574l2036k6477k1371o202n182Q259J8811
13875B62866K9194K9608L8933N3608P2417J04179J63898K51194M15322O26732
13865B047951P57838M84948j70435n40704o01592n39797m29205k92931j77428
13856E38645j19962q0933m4776n2584l5598l3653k7260j2160j9357j0341k991
13845I9030j3493k3985k881o561q468M988N485j731J809Q17K60J1516q158M133
13831F2761Q481j049j4724k98l210o278n111L210K281l354n013k283L528j136
13817C7805J6588L6j0130p321l347j8209O472J0715J3515p632L07J0816P881r088
13803D8408m214J0792n192r632p12K974R565P536p19l160r898p73O32Q258N543
$$ y = [902574, 656570, 498114, 423592, 372638, 327064, 295028, 268551, 247180, 240978, 235796, 244055, 262866, 292060, 321668, 360601, 414209, 486626, 590805, 754703, 1005897, 1421219, 2047951, 2805789, 3290737, 3120302, 2579598, 1978006, 1438209, 1009004, 716073, 538645, 418683, 337750, 292974, 240390, 204792, 171139, 143879, 131719, 112362, 102021, 99030, 85537, 61552, 58671, 52110, 43642, 48630, 54115, 52384, 54193, 55010, 55270, 66786, 58628, 62761, 71242, 70193, 55469, 55171, 51961, 45683, 40572, 43782, 46063, 42709, 37696, 35413, 38941, 37805, 54393, 54429, 44299, 36978, 33631, 15422, 21894, 32609, 46124, 38492, 38799, 49615, 57496, 48408, 44194, 54986, 49794, 40162, 39450, 42424, 51989, 59525, 58806, 55646, 45748, 44975, 45607, 53865, 59408]
13788E9408j171M804J5422N200j9344n958m950P042j4816J202o46l405k360o685
13774C3743J333J3771L294n9J1658O210o917o934L596N755L897Q414M644Q521
13760I0926q009j5699j091r985M610J0037J3683P189J0330M080J7423J3912K4369
13747A61775J7258k0096l6002k6559l433p900j68J166j1733r156j130K167J4327
13734H0516Q941l97P491Q688Q068Q786l113K954l924J911J88l993Q164J0245J3637
13719A48162L823r137j2508j19o538p036j1669o473J171J7394j491n328k57K772
13705A12766k070q403m880r054m996j6088q810l360M015Q705L0058J2823m17R941
13691A20230R638J5583K2541J5312n547k6924k8702r217j3648k5094j2267J1362
$$ y = [59408, 58237, 63041, 78463, 83663, 64319, 58361, 53411, 60453, 45637, 46839, 46193, 42788, 40428, 33743, 35076, 48847, 52141, 52082, 63740, 69950, 63033, 56099, 59695, 65450, 69347, 77761, 82405, 90926, 82917, 67218, 66127, 56142, 60752, 70789, 84472, 91661, 101991, 106071, 123494, 137406, 161775, 179033, 158937, 122935, 96376, 92943, 85043, 84875, 86041, 74308, 65152, 64022, 66189, 80516, 89457, 89060, 96551, 105239, 113307, 122093, 118980, 121934, 118010, 119921, 120109, 116116, 124280, 134525, 148162, 151985, 142848, 130340, 130221, 123683, 116647, 104978, 98505, 99676, 117070, 115579, 110251, 109994, 112766, 110696, 102293, 97413, 88359, 83363, 67275, 58465, 55105, 59120, 67825, 97883, 110706, 110289, 120230, 129868, 145451, 167992, 183304, 177757, 150833, 122131, 112914, 99266, 74172, 61905, 73267]
13679G3267R742R436J3175K9508M3095L7110J7929L822k2960l7190m2037l2259
13667A02638k8091n388J5249j863j456j167p25O414J1973k6013j1047J9855R753
13654I0132L955Q100j0345q400l077Q532o601J005q494O532J3249L528l237R450
13640A04329M936M753J0806K7092M1694L9712Q1551J13480P7846K3997l4095n6723
13628D39378m4371j1913K0992M9595R8231R0164N670p1268r7302r4587q8980n4525
13616B41084m7875k0784j9092k7338N59j05q928J363O97k773p239o675J1523J2010
13602A26427J7557Q694n038p193K5535O719J757J8807L0251M0876O1326P7329
13590D03047M9865L6025Q648R277N2068J17567K03910K86190K51428J13774o6143
$$ y = [73267, 83009, 92445, 105620, 135128, 178223, 215333, 233262, 237084, 214124, 176934, 134897, 102638, 74547, 69159, 84408, 82545, 81089, 79922, 79197, 85611, 97584, 71571, 60524, 80379, 90132, 94087, 102187, 91842, 83442, 80365, 88897, 82296, 83301, 74807, 81339, 94588, 98116, 94879, 104329, 109265, 114018, 124824, 151916, 193610, 233322, 314873, 428353, 506199, 530196, 496101, 439378, 395007, 383094, 404086, 453681, 551912, 642076, 647746, 576478, 479176, 384589, 295609, 241084, 193209, 172425, 153333, 125995, 126554, 126449, 117521, 118884, 119581, 116808, 109569, 102894, 114417, 126427, 143984, 152678, 147640, 140447, 165982, 172701, 174458, 193265, 223516, 264392, 325718, 403047, 452912, 488937, 497585, 506862, 558930, 676497, 880407, 1166597, 1418025, 1531799, 1465656]
13579A465656j29928j04756o0634o9239j47844j75187j34255j31147j13419p8651
13569C20596n3702l6277k1982r249p120j7629j1767n231k7619k4619q951J95L175
13556I9820l397J1207K3479J7297N542L280J3336K5674J9901L0559M2634P2238
13544C61570J03453J66235K31293K88554K84987J92547j8918j50414j55760q4846
13534A218701L824n2770j47733j57364j47292j34887r6699m3383k0960m3638m8773
13523C29026n7426m6805m0618l6852j9681Q044M83l407J0635m891j8543M117L954
13510A28036L860L231l563K3969K8984J7942O653j267K8780L5064P3157R3236
13498D38082J51524K17686J69124m168j14843j35723j30864r1827k3147O214o484
$$ y = [1465656, 1335728, 1230972, 1170338, 1101099, 953255, 778068, 643813, 512666, 399247, 320596, 266894, 230617, 208635, 199386, 192266, 174637, 162870, 157639, 130020, 105401, 96450, 96645, 99820, 96423, 107630, 131109, 148406, 153948, 157228, 170564, 196238, 216139, 246698, 289332, 361570, 465023, 631258, 862551, 1151105, 1436092, 1628639, 1609721, 1459307, 1303547, 1218701, 1222525, 1169755, 1022022, 864658, 717366, 582479, 485780, 442397, 421437, 377799, 329026, 271600, 224795, 184177, 147325, 127644, 135688, 136171, 132764, 143399, 138508, 119965, 124082, 128036, 131896, 135127, 131564, 155533, 184517, 202459, 209112, 207845, 236625, 271689, 344846, 438082, 589606, 807292, 976416, 972248, 857405, 721682, 590818, 498991, 475844, 482058, 475574]
13487D75574m4159k4847j7455J4694k415m3700o3622p0827n4500m0042k3949K109
13475A06861J1146J620j408o568n139l065O770K2498r871r295N063J592p97K644
13461A22051J0092J9155J9508J6185N397r806k8215l721J215P318m656K76L1208
13448A86007M6162P8693M6316n999l5396o0531m1162j4242k3713k7633l1003k1804
13436I5695m137l405j268Q089J4649l745j3209M668q580L210J188M352k901Q830
13422A03436O669J1895M209l839k0840j8418K095J750m6k3756j537J5675jj2400
13408F4892r628K777N985M754K0805K1561R655J4373J2147J0069J6656M744j4588
13395A64202j0090j164L345l70L053k109K056J8160J7305O147j3105j5490r150
$$ y = [475574, 431415, 406568, 389113, 403807, 401392, 357692, 294070, 223243, 168743, 128701, 104752, 106861, 118007, 119627, 118219, 111651, 106512, 103447, 110217, 132715, 122844, 113549, 118612, 120204, 119407, 122051, 132143, 151298, 170806, 186991, 192388, 182582, 154367, 150646, 151861, 159179, 154523, 154799, 186007, 232169, 310862, 357178, 351179, 315783, 255252, 214090, 199848, 176135, 148502, 117499, 95695, 91558, 88153, 86885, 94974, 109623, 105878, 92669, 97337, 88757, 91967, 93155, 97507, 94606, 103436, 110105, 122000, 126209, 122370, 101530, 83112, 85207, 86957, 86911, 63155, 61618, 77293, 77292, 64892, 55264, 58041, 64026, 68780, 89585, 111146, 120801, 135174, 147321, 157390, 174046, 178790, 164202, 154112, 152948, 156293, 155923, 158976, 156867, 158923, 177083, 194388, 200535, 187430, 171940, 162790]
13382A62790p698r80J0432K987p905j0411K46j567M855J3472J8908q439j0004
13369A66686j143J329J0480J6139J4555j2343o307J2229J4349K3869K1964N557
13357B67364p155M4367J2795r647P118r17k295o730j6054k8126l2668m0396q846
13344A78810k337O246K1333q530m804p525o515j896J2391J7426J1627N716J2686
13331B34628J5297K7228L1810Q184R870J8642k797j591J1107J7343M429j647o396
13318C66107j5986q313r098j7085l252J4786K9025L5735J5024k1504k114j204
13306C82121J4446R469k7410j9422j0839j3413J1382J8800P785k220l789j3042
13294C53868p590J8937K0774K6950L2334K986j2808j6485k5374j0289p054p845
$$ y = [162790, 155092, 154112, 164544, 167531, 159626, 149215, 149461, 147894, 152749, 166221, 185129, 176690, 166686, 165543, 166872, 177352, 193491, 208046, 195703, 189396, 201625, 215974, 239843, 261807, 267364, 260209, 304576, 317371, 307724, 314842, 313925, 311630, 304900, 288846, 260720, 228052, 187656, 178810, 176473, 182719, 204052, 195522, 190718, 183193, 176678, 174782, 187173, 204599, 216226, 221942, 234628, 249925, 277153, 308963, 317147, 327017, 345659, 342862, 341271, 352378, 369721, 374150, 372503, 366107, 350121, 341808, 332710, 315625, 312373, 327159, 356184, 391919, 406943, 385439, 383325, 382121, 396567, 406036, 378626, 359204, 348365, 334952, 346334, 365134, 372919, 370699, 366910, 353868, 346278, 365215, 385989, 412939, 445273, 448259, 435451, 418966, 393592, 383303, 376249, 368404]
13282C68404j7024j4461j1583l13O162L663m198j3205O195m464L633J8236M3945
13269C84990O0680O0500R0691J26035J75015J84202J30407N8087n7931j23416
13259A089260j36368j33739r0125p1337k7327j0773j3413j0788l3635m4946l4073
13248D82736o015K7781K3287J8934Q408N043R409K4647K4429n856j4657p725k798
13235E87623J8521N0788M8428M3487N4768N8904P8812R0256Q3243O4180O7913
13224A246923P0975L4723J6922J2628p47k15k8319k8641J3066J1935k55j5991
13212A333004k4996j5532K108Q025K2824M0325O5584J02803J08988J48636J66307
13201A958076J46969J54851J72586K54840L85597O13477R51387J465931K381969
$$ y = [368404, 351380, 336919, 325336, 325023, 331185, 334848, 330650, 317445, 323640, 319176, 322809, 341045, 384990, 445670, 506170, 596861, 722896, 897911, 1082113, 1212520, 1270607, 1212676, 1089260, 952892, 819153, 729028, 657691, 630364, 619591, 606178, 595390, 561755, 516809, 482736, 476721, 504502, 527789, 546723, 555131, 560174, 569583, 594230, 618659, 612803, 598146, 590421, 587623, 606144, 656932, 705360, 748847, 803615, 862519, 941331, 1031587, 1114830, 1179010, 1246923, 1317898, 1352621, 1369543, 1382171, 1381424, 1381209, 1352890, 1324249, 1337315, 1349250, 1348995, 1333004, 1308008, 1292476, 1294584, 1302609, 1325433, 1365758, 1431342, 1534145, 1643133, 1791769, 1958076, 2105045, 2259896, 2432482, 2687322, 3072919, 3686396, 4637783, 6103714, 8485683]
13192H485683M020497N992735N676329K222524j837538m262172l914367k768333
13184A3615358r82028O78463Q50324k68626j306696j555854j741796j815064j427998
13175F046083j033246p01633m41594k66255j49669q4897n5757o801N2320J20099
13165C478650J76846K47531L15633L32617L00725K57027K93271L89062N19086
13156F310448O56379Q36562J055105J281937J547669K066825L059983M838448
13148B1653356P997730J2947566J7517969J5458035J0788078J957089n093021
13141H3226802j0220042j3607368j1871828q713251n111865j384676K619309P528640
13133D2465721J3484607J7027117J0653616R00171r965705j3525097j1795413
$$ y = [8485683, 12506180, 18498915, 24175244, 26397768, 24560230, 20298058, 16383691, 13615358, 12633330, 13311793, 14162117, 13893491, 12586795, 11030941, 9289145, 7474081, 6046083, 5012837, 4311204, 3869610, 3603355, 3453686, 3368789, 3313032, 3306231, 3358551, 3478650, 3655496, 3903027, 4218660, 4551277, 4852002, 5109029, 5402300, 5791362, 6310448, 6966827, 7803389, 8858494, 10140431, 11688100, 13754925, 16814908, 21653356, 29651086, 42598652, 60116621, 75574656, 86362734, 88319823, 83226802, 73006760, 59399392, 47527564, 38814313, 33702448, 32317772, 34937081, 42465721, 55950328, 72977445, 83631061, 84531232, 74565527, 61040430, 49245017]
13126D9245017q394684l741310J392069P208998J4549645K1836214K0227603Q798522
13118A11122074n201887j5749397j5829543j2854216p676156j444795N081584
13111E7447664J2321126K0517801K4864413J6738266M375375q469393r200017
13104A18595235p90002J4716605L7125001N5174234M8733567J5148083k6411861
13097B62290862n0276498n2282196m5559710l4383346k2853160j4161078q774763
13090C4000111n558249l553743k280347j527785j066806o34268r4099N22453J134146
13081B0941413J721223K261684K970987M207372O280022R550135J4789072K3781815
13073H6503723L8810508N8383188O6312674M2758574n780070m2006185m9927145
$$ y = [49245017, 40850333, 37109023, 38501092, 45710090, 60259735, 82095949, 102323552, 111122074, 105920187, 90170790, 74341247, 61487031, 53810875, 52366080, 57447664, 69768790, 90286591, 115151004, 131889270, 136264645, 127795252, 118595235, 117805233, 132521838, 169646839, 224821073, 273554640, 288702723, 262290862, 212014364, 159732168, 114172458, 79789112, 56935952, 42774874, 34000111, 28441862, 24888119, 22607772, 21079987, 20013181, 19378913, 19284814, 19807267, 20941413, 22662636, 24924320, 27895307, 32102679, 38382701, 47932836, 62721908, 86503723, 125314231, 183697419, 250010093, 292768667, 286988597, 244982412, 195055267]
13066A95055267m3181779k8698367q629508J0412529J5638465j381455j8018106
13059A21197046k1401129k0285893j6180439j0070841l853166K216042R452109
13052F1073729J8477056K4171327J2742333r029882j8348514j8898769j6580633
13045E3606647j1589990n906386p52411M534256J1218656J8249151J7141047J408322
13037H7909292j1601735j3862587j3265064j0439788o193998k021571J801205
13030C2325754O131575J1439202J5696785J3609083Q239262L522672p987703j6868980
13022F6107650j6505972j3895334j0567822p053556m339145k640591j665162j148007
13014H292061r72045r10826p94183o77570n30269l67914k38396j79076j62745
$$ y = [195055267, 151873488, 123175121, 114545613, 124958142, 140596607, 139215152, 121197046, 99795917, 79510024, 63329585, 53258744, 49405578, 51621620, 61073729, 79550785, 103722112, 116464445, 107434563, 89086049, 70187280, 53606647, 42016657, 36110271, 35357860, 39892116, 51110772, 69359923, 86500970, 87909292, 76307557, 62444970, 49179906, 38740118, 32546120, 30524549, 32325754, 38457329, 49896531, 65593316, 79202399, 87441661, 90964333, 82976630, 66107650, 49601678, 35706344, 25138522, 18084966, 13745821, 11105230, 9440068, 8292061, 7320016, 6409190, 5615007, 4937437, 4407168, 4039254, 3800858, 3621782, 3459037]
13005C459037j66204j46895j18945j23869r5820m5388K913K8467J22577K35908
12995C151781L37404N15230Q02756J291750J916391K179632J748436J171749J27771
12986A3242900q49912r42621m5813J674855M307656O131594L193126k465822m898721
12977A9347242m839666m282689l160706j996304j171664p25994m63562l19792
12969B386865k55427k06769j33535j02752r2123j27559j48344j33805j35630j05436
12959I45485q1384r1421q0506o4112o5840n2572n4998o3719p1069o0173l9314
12948B20377L4594P2440J14482J35001Q0595j2576n7431n3155m0014m615J2298
12937E01996O925m958j9634k6984l277l0301k8904l1080n752M604J7424R310K3125
$$ y = [3459037, 3292833, 3145938, 3026993, 2903124, 2807304, 2761916, 2764829, 2793296, 2915873, 3151781, 3489185, 4004415, 4807171, 6098921, 8015312, 10194944, 11943380, 13115129, 13242900, 12392988, 11450367, 11404554, 13079409, 17387065, 23518659, 26711785, 24245963, 19347242, 14507576, 10224887, 7064181, 5067877, 3896213, 3170219, 2706657, 2386865, 2131438, 1924669, 1791134, 1688382, 1596259, 1468700, 1320356, 1186551, 1050921, 945485, 864101, 772680, 692174, 628062, 562222, 509650, 454652, 390933, 319864, 259691, 220377, 254971, 327411, 441893, 576894, 657489, 644913, 587482, 534327, 494313, 489698, 501996, 508921, 503963, 484329, 457345, 454068, 423767, 394863, 363783, 358031, 362635, 380059, 389369, 412494]
12924D12494J6101j91R894K1197r906j5764k2369k2344n414J1503K8181L7254
12912D60636M4221L5439N5747J25751K15673K02513j7553j47541j53610j34887
12902F86389q8412o1109l1008q652k044k0942n857j0928l2456k1907j1384O23
12890C92313j0857K68j8885j4005L844j9798l1151k2286k9925l1147l5824M59
12878A83006K7671K4166J1607J4195r252j3708j3209m458J9735R541j7982q485
12866B22827k761k774r291j0075j0539j5088J2499K6649O194p006o051R082J0546
12853B24212J2388j949k931L38N261L354J7407K2490J5494j0434j1169j8654k7520
12840B28287m162J3456J3635K464j1617j8784m870Q456Q773j0534m206K564P471
$$ y = [412494, 428595, 428404, 438298, 459495, 449589, 433825, 411456, 389112, 383698, 395201, 423382, 460636, 504857, 540296, 596043, 721794, 937467, 1139980, 1122427, 974886, 821276, 686389, 597977, 536868, 505860, 497208, 495164, 474222, 468365, 457437, 424981, 403074, 391690, 392313, 381456, 381724, 362839, 348834, 352678, 332880, 301729, 279443, 249518, 218371, 182547, 183006, 210677, 234843, 246450, 260645, 251393, 237685, 224476, 220018, 239753, 249294, 231312, 222827, 220066, 217292, 208001, 197926, 187387, 172299, 184798, 211447, 217641, 210635, 204584, 213666, 224212, 236600, 234651, 231720, 232058, 237319, 240673, 258080, 280570, 296064, 285630, 274461, 255807, 228287, 224125, 237581, 251216, 253680, 242063, 223279, 218409, 226865, 235638, 225104, 220898, 223462, 230933]
12827B30933p789K024j2525j1964o25P076Q307K948j6547j8054k937o443O883
12814A81287M612N424M015l694j0891J692L0001N19j651M065n568k2343j3172
12801A74296R776J8531O345M849N197J611J0816R419r45m194j592k0831m506L40
12787B09112j722q181j5296q22J112j0197r183J78O828J2594Q29J8396J4929n932
12773B12645j6852m76J4910K726q683R959L3J1650J7950J7503J4647n481j1401
12760B59130j921j2504k489o877K928J0362l357j4286r387j3614j2841J8771J9015
12747B32930o439j2232o351j4981j063j6975j8878L929J3296K6758J1554N603
12735B17151r232J0564K7142J2264J0725J2007q36q481q643j074L264m297k5406
$$ y = [230933, 223144, 225168, 212643, 200679, 200054, 207130, 215437, 218385, 201838, 183784, 180847, 174404, 181287, 185899, 191323, 195338, 191644, 180753, 182445, 212446, 212965, 211314, 215379, 209811, 187468, 174296, 184072, 202603, 208948, 213797, 218994, 220605, 231421, 240840, 239895, 235701, 234109, 213278, 208772, 209112, 207390, 199209, 183913, 183091, 184203, 174006, 164823, 165001, 171829, 184423, 185252, 203648, 218577, 212645, 195793, 195317, 210227, 212953, 204270, 214229, 214262, 225912, 243862, 261365, 276012, 270531, 259130, 257209, 244705, 242216, 235339, 238267, 248629, 245272, 230986, 221599, 207985, 195144, 213915, 232930, 226491, 214259, 207908, 192927, 191864, 174889, 156011, 159940, 173236, 199994, 211548, 217151, 207919, 218483, 245625, 257889, 268614, 280621, 279785, 271304, 262661, 261587, 264851, 260554, 235148]
12722B35148m995O3m412K563J9984K9266L8392M6501L6868j2059m7140m3461k4886
12709B71832k5805k0099k3448l212j5813k78Q252K0793L715j2854N230J5123j746
12696B21690J589O091P871K886J3157N802K659J6380K6673J3153l934j4254J0244
12683C10007J7170J8311J9920N8861Q6033R5157J13966J19733J24830J69850K58084
12672A391922L93487N95361P39834N23768m7909l97995m21800l61704l23082k94900
12662A796982l15924k89479k31455j77293j12689p8568o1090l6445k1683J1667
12652D84023J3563J8394J1997K4890J9899L8335Q3718J29402K09536L45395N10709
12641A889861M71027N9493j53664j23271o818K32327N09149O50247L58571j50081
$$ y = [235148, 230153, 230216, 225804, 228367, 248351, 277617, 316009, 362510, 399378, 387319, 340179, 296718, 271832, 246027, 225928, 202480, 199268, 183455, 183177, 191429, 212222, 215937, 203083, 208313, 223436, 221690, 223279, 229370, 237241, 240127, 253284, 259086, 261745, 278125, 304798, 317951, 314017, 299763, 310007, 327177, 345488, 365408, 424269, 510302, 605459, 719425, 839158, 963988, 1133838, 1391922, 1785409, 2380770, 3120604, 3644372, 3596463, 3198468, 2776668, 2414964, 2091882, 1796982, 1481058, 1191579, 960124, 782831, 670142, 591574, 530484, 494039, 472356, 484023, 497586, 515980, 527977, 552867, 572766, 611101, 694819, 824221, 1033757, 1379152, 1889861, 2360888, 2420381, 2266717, 2143446, 2136628, 2368955, 2878104, 3528351, 3886922, 3736841]
12631C736841l08616k20304L5007K96026J09112j81779k07264j84792j99739l20328
12621B554164l92907m13630l58766k81480k05441j38476r3894m1884j4599j2386
12611F00701m3853l1605j699m044J0956L4672O9600J01703J84257K78989M47382
12600A647059O41014O25536J88852l15570m90631n03300m51723l28039k10267
12591H02931j21744n5639j803M4134J17663J99477K16808K25274J98891J59955
12581A785947L6116j52098k62314k76026k37863j72382p3265j0399o325o0336
12571E71055p8261o7070m7601m7037l8119l2813k6060p879o57J0869J2038j070
12559B47395k261r974o829o985l189j4275j7297p415R119M061K184Q617J3940
$$ y = [3736841, 3428225, 3207921, 3242928, 3538954, 3648066, 3466287, 3259023, 3074231, 2874492, 2554164, 2161257, 1747627, 1388861, 1107381, 901940, 763464, 669570, 627686, 613087, 600701, 556848, 525243, 523544, 519500, 530456, 565128, 634728, 736431, 920688, 1199677, 1647059, 2288073, 2913609, 3102461, 2786891, 2296260, 1792960, 1341237, 1013198, 802931, 681187, 625548, 623745, 667879, 785542, 985019, 1201827, 1427101, 1625992, 1785947, 1822063, 1669965, 1407651, 1131625, 893762, 721380, 648115, 637716, 631391, 571055, 492794, 425724, 378123, 331086, 292967, 260154, 234094, 226215, 225558, 236427, 248465, 247395, 245134, 235160, 228331, 221346, 218157, 203882, 186585, 179170, 188289, 192350, 194534, 203151, 217091]
12546B17091K133J0164L5037N4976R7696J43427J37545P5143k0704r9796j00108
12535E52604o7315j4070K0126O9041M5593j9278p0473p7166p5875o6374k8725
12524B68088j2756j0614n163M300J2071J4939K5316J6116K3122M4359Q3852Q7279
12512E50909R6548J29879J96414K65789L80795N45562P62412R70697R37541M31533
12502E268079k98259p02936q32557p93813o56458m85611l42483k44100j77907
12493G33955j32149o2356j7327n1j0578n0106p3643o6946n5399m4947m4686k2966
12481A52801l824p873n858r595j4190m512j198L522j70o424l403Q100J5645j3401
12467A09620j071j948p582K90j0484k9627K090J4443P153q821j1042o320j4151
$$ y = [217091, 219224, 229388, 264425, 319401, 417097, 560524, 698069, 773212, 752508, 652712, 552604, 485289, 471219, 491345, 560386, 605979, 586701, 516228, 439062, 363187, 296813, 268088, 255332, 244718, 239555, 243855, 255926, 270865, 296181, 312297, 335419, 379778, 463630, 550909, 647457, 777336, 973750, 1239539, 1620334, 2165896, 2928308, 3899005, 4836546, 5268079, 4969820, 4266884, 3434327, 2640514, 1984056, 1498445, 1155962, 911862, 733955, 601806, 539450, 522123, 522072, 511494, 461388, 387745, 320799, 265400, 220453, 175767, 152801, 148977, 141104, 135246, 125651, 111461, 106949, 105751, 109273, 109103, 102679, 99276, 107376, 123021, 109620, 108549, 106601, 99019, 99309, 88825, 59198, 61288, 75731, 82884, 74063, 63021, 56701, 42550]
12454D2550j2148Q092J2491j489l484K797L592j0378k6736K720J6902Q926J31
12441D3966N680q3R720J0518r196j5905K169J3430m02R470J1565P474j3550J4296
12427H9152o341k0857j2406r019k0277J01p809P180Q595p365r019K333l397o071
12413D800J5563J0216J419m288O87K631m903m594k1147Q769J7841m169J0663J1367
12399D4855O892L592Q688J780j0010o197j0193m199O863N750j58N281O367k3603
12385C5708k0234o618K948Q405J366R884K0089P827j4220q413J1110p420r593
12372C0839k838L443n281q685l257Q240J1408j073K648j5921j1530L609J0124
12359B1726j3091j2229N655J2450J6222j77j1558q512n10O094R003r145k95N148
$$ y = [42550, 30402, 38494, 50985, 49496, 46012, 48809, 52401, 42023, 15287, 18007, 34909, 43835, 43966, 49646, 49563, 59283, 69801, 60605, 44700, 46869, 60299, 59897, 69367, 80932, 88406, 74856, 89152, 82811, 61954, 49548, 40529, 20252, 20353, 12544, 19724, 28319, 20954, 11935, 14268, 10871, 4800, 20363, 30579, 31998, 27710, 28397, 31028, 26125, 21531, 384, 9153, 26994, 22825, 33488, 44855, 51747, 55339, 64027, 65807, 55797, 49600, 39407, 35208, 42071, 47821, 47663, 52944, 59311, 35708, 15474, 8856, 11804, 20209, 21575, 31459, 51548, 59375, 45155, 36742, 47852, 40432, 30839, 28001, 31444, 26163, 17478, 14221, 22461, 33869, 32796, 35444, 19523, 7993, 11602, 21726, 8635, -3594, 2061, 14511, 30733, 30556, 18998, 10486, 9976, 16070, 25073, 15928, 15633, 20781]
12345B0781P30M298k106j8462j3997N115J8686J923N802M422j4179k353J253L065
12331A4978N822p695j4836J3306J4378P12J957M706j748o485m149k1115p742O950
12317i61P316q963m966J650m41m073K581L519J94m165j064N08o920J06K958K2667
12301I946n695n603K525k837J523Q674K832J1414m934j2957N665M177L414r093
12287I051j385L656J0226p922j0403j2572K126N948R272k305J8393Q406n264j0383
12273A6844j4314j2295K377R79k853J3822K213L866J908m277j3300J026Q34J490
12259a680J333p208l23L277J3329j2074L578N212k624q596j8980O956K0189J2278
12245A4667q752j1521l672j385n436J2178K2031j3951j9443o837J2308J2991j2215
$$ y = [20781, 21511, 25809, 23703, 5241, -8756, -3641, 15045, 16968, 22770, 27192, 13013, 10660, 11913, 14978, 20800, 13105, -1731, 11575, 25953, 26665, 28622, 33328, 31580, 25095, 20946, -169, -7911, -961, 6355, -2608, -7574, -5924, -6365, -10438, -7857, -4338, -4144, -8309, -9373, -8865, -15785, -15679, -12721, 9946, 4251, -1352, 1173, -1664, -141, 8533, 11365, 22779, 17845, 4888, 10553, 14730, 18144, 9051, 7666, 11322, 21548, 13626, 3223, -9349, -7223, -1275, 7997, 5692, 24085, 32491, 27227, 16844, 2530, -9765, -7388, -6409, -9262, 4560, 6773, 10639, 12547, 8270, -5030, -4004, -3170, -1680, -347, -7555, -7878, -4601, 8728, -3346, 232, 5444, 2820, -5776, -24756, -17800, 2389, 14667, 5915, -5606, -9278, -10663, -16099, -3921, 18110, 4159, -15284, -22121, -9813, 3178, -9037]
12232i037p446k095J440J4261K1276P289o898l297m328q070L07q888k0035o82
12218b6203K0455J7988O838J771j6032p464K29k915J2463J48p505J7466R076j560
12204B4755J918m067j6058j1426k771k297R172P793j1566J190m150N379K823Q1
12190G76j833l234O444J455J433R204j746p543j1682j209k38m751o89L901Q141
12175a571p123r405N108m878m659J5331J2761K953L19n173r810j7071M507J2683
12161f028K4443M861l689o726l99J893L836l23j8132J76R619J0839J299J895o152
12146A7412o161o176N77k236N773O221K145R247K759j8078J1148Q317q787j0351
12132A1810j029R743j7064r198q211K62k67N939m107p527J460J2109n151j4446
$$ y = [-9037, -16483, -18578, -17138, -2877, 18399, 25688, 18790, 15493, 11165, 3095, 3402, -5486, -25521, -26203, -5748, 12240, 19078, 20849, 4817, -2647, -2418, -5333, 7130, 7278, -227, 17239, 26315, 24755, 26673, 22606, 6548, -4878, -7649, -9946, -774, 7019, -4547, -3357, -7507, -2128, 695, 776, -1057, -4291, 2153, 3608, 5041, 14245, 12499, 4956, -6726, -7935, -8173, -12924, -13613, -9712, -1571, -8694, -18099, -12991, -17869, -22528, -7197, 5564, 8517, 8836, 3663, -6147, -23218, -18711, -6028, 18415, 23276, 19587, 12861, 12462, 14355, 18191, 17868, -264, -88, 9531, 20370, 21669, 23564, 17412, 11251, 5075, 5652, 3416, 9189, 15410, 17555, 26802, 29561, 11483, 22631, 30948, 22161, 11810, 10781, 20524, 3460, -5738, -13949, -13687, -13954, -8015, -12122, -19649, -18189, -6080, -11231, -25677]
12118b5677N812J6277R903L764N076n678j6449K204N959j5112p709J3050L0262
12105B1682J6004q389j1228k9794j7587j036J1865J396M274Q847j2120j0397Q857
12092a7626K6640j454q627q43M548o649P182M378K906J3170J7456q129j6484q721
12078G747r356K625o748r40q194K527J0211m104J105L826R989O210K883o06n888
12063A1287j2697o338l794m217M798P873n1m081l08O617J9498j0083O837m804
12049A0537k554r921l082O619m531p094o936J1946L81P946K120j5850o143R003
12035g559n119r612J0518l52j388j422P913j665r3R60J0175J3407K542k083M001
12020B0223j5823p096J838Q152j3445n888J575N888K411J0205J13r732K723O305
$$ y = [-25677, -19865, -3588, 6315, 10079, 15155, 9477, -6972, -4768, 1191, -13921, -21630, -8580, 21682, 37686, 29297, 18069, -11725, -29312, -30348, -18483, -17087, -12813, -3966, -16086, -26483, -17626, 9014, 7560, -1067, -1910, 2638, -4011, 3171, 7549, 10455, 23625, 41081, 32952, 16468, 7747, -1609, 1016, -5732, -6672, -14866, -12339, -2128, -6232, -5127, -1301, 8688, 14898, 17781, 17175, 11287, -1410, -7748, -11542, -15759, -10961, -3088, -3139, -7220, -7528, -911, 18587, 8504, 15341, 10537, 7983, -1938, -5020, 1599, -2932, -10026, -16962, -5016, -4635, 3311, 5431, -10419, -16562, -7559, -12678, -22290, -11772, -12124, -13512, -14934, -7021, -8686, -8779, -7819, 2356, 15763, 18305, 16222, 20223, 4400, -2696, -858, 7294, -6151, -12039, -10464, -4576, -2165, 8040, 8153, -1579, 1144, 7449]
12006G449P745R30L832o303r95j041j4375m537J978n205J0890M715j2722k918
11992a0557l29j3424o89J8741J9254O093j4893l574j1553J2369P084k987p133
11979a598p376j139o495J314L602n7Q696M842j3873p895J0987K377N928k100r690
11964a2477Q334K2717P247J5367O9j9140p335J35O70N205P763J037j4061q849
11950F682j4092N224N169P478o855J0697j1218r316j822p18m459N431J5836O959
11936A4996l890p021o243r870L327M008j5792m123Q704J1148N96o85n076q922
11922a8843o345K704J7697O506L910O822j6290j3254J3662p564r468Q703J5887
11909D127Q052J3077k517j2034j0119o685Q245j770R298k803j2439j429J2223
$$ y = [7449, 15194, 16124, 19956, 13653, 12658, 11617, -2758, -7295, -5317, -10522, 368, 5083, -7639, -10557, -10886, -24310, -24999, -6258, 12996, 19089, 4196, 622, -10931, 1438, 8522, 5535, -1598, -8974, -10113, -16608, -15294, -11692, -11749, -3053, 1789, -12084, -19979, -8992, -6615, -687, -2787, -12477, -4143, 18574, 25821, 41188, 41257, 22117, 14782, 14917, 15587, 20792, 28555, 29592, 15531, 6682, -7410, -2186, 2983, 10461, 3606, 14303, 3085, -6231, -8053, -8771, -13230, -7799, 8037, 14996, 11106, 4085, -2158, -12028, -8701, -4693, -20485, -24608, -15904, -4756, -4160, -4845, -9921, -18843, -25188, -22484, -4787, 1719, 5629, 12451, -3839, -17093, -3431, -10995, -20463, -11760, 4127, 12179, 25256, 22739, 10705, 586, -6099, 2146, 376, 9674, 6871, -5568, -6997, 5226]
11896E226R173J1051Q27N13j2254j1858K239J298k30M187Q730j111p400n262M579
11881I708K380p081k671M46K489k731N487o419r500m27O48j583j5088N154K667
11866a6521p350o450o555r630J187J6230J1609K541q019k961l708q347J707P314
11852b8953J7420K15L709j0561q418M42P628q966o638N554J3515m701O345J3291
11838a18N413j1237j3471m399l207J3785J5581k957p451r454k595P877Q924n744
11824i053n918M341J8512m933M411J1019M963l736n938l605j3821j6766m53J0931
11810a0046J2215j0362j1488N312m72n902K3935O507j1078L060P063j0772Q155
11797F127J196N212l606n603k009m819j0590p796n943M651R577P213K624L289
$$ y = [5226, 14399, 25450, 26277, 26790, 14536, 2678, 4917, 6215, 5985, 10172, 18902, 17791, 10391, 5129, 9708, 12088, 5007, 2336, 2782, 5271, 2540, 8027, 1608, -7892, -8319, -7671, -9254, -24342, -19188, -16521, -23871, -30321, -36876, -46506, -45319, -29089, -17480, -14939, -22958, -25919, -29627, -37974, -36267, -28953, -11533, -11318, -7609, -18170, -26588, -26146, -18518, -27484, -34122, -28568, -15053, -19754, -13409, -118, 5295, -5942, -19413, -23812, -27019, -13234, 2347, -610, -8061, -17515, -20110, -12233, -3309, -9053, -14971, -10630, 7882, 2949, 7360, 18379, 23342, 19606, 13668, 10063, -3758, -20524, -20977, -10046, 2169, -8193, -19681, -14369, -14841, -20743, 3192, 9699, -1379, 1681, 8744, -2028, 6127, 7323, 12535, 8929, 3326, 1317, -3502, -14092, -21888, -27831, -23180, -13603, -6390, -3766, -477]
11783d77J0823L624k460m902m393o467n26L41J1782k121j243r911p827m1p828
11768b1626k52R609J2538N816o626j1400J123M690m127j780m997k076j706Q631
11754a2183J3778l211r875r34n155L940L973j2099j0527M128N138J6432j115K210
11740e500K930R667p61r211j0189k881M017M061L903j995m93p203k508Q001O924
11725a238o031J505Q168J722M877p749K628r74q117j0284R924R105k719J136R202
11710A1155O40q406j2659r253J75M043p6n734p848L144J1319J1154K64p779p353
11695a7214J0117m955o458o041J0808R543p671q566l614k443J3759J5113q565
11682f187j2468q207O654J2076q457k654J5336m615J117m07m110J2074K664j9305
$$ y = [-477, 10346, 13970, 11510, 6608, 2215, -4252, -4778, -4437, 7345, 5224, 3981, -5930, -13757, -13798, -21626, -21878, -12269, 269, 6085, -541, -11941, -10818, -6128, -10255, -12035, -17032, -19108, -20814, -12183, 1595, -1616, -11491, -12425, -17580, -13640, -9667, -21766, -32293, -28165, -23027, -6595, -7710, -5500, -2570, 7097, 6336, -2875, -13064, -15945, -11928, -7867, -3964, -5959, -6452, -13655, -16163, -8162, -1238, -7269, -5764, 2404, 4126, 9003, 1254, 3882, 2908, -5209, -15493, -5569, 3536, 817, 1953, 11155, 11795, 3389, -9270, -18523, -18348, -14305, -14381, -20115, -27963, -24819, -13500, -2346, -2082, -9861, -17214, -7097, -12052, -18510, -24551, -13743, -4200, -11871, -20437, -24051, -26494, -12735, 2378, -6187, -18655, -26862, -20208, -8132, -16589, -19243, -3907, -8522, -7405, -7812, -11922, 152, 2816, -16489]
11668a6489j352J6397k097l719j5100K807J3849j268p161m804P585J5328Q8n688
11654a624j4332j3338q101O050J6802O719q972n785J2579K523P218J692O924J2718
11640B1073n725j4026n493N249N326j3169N64Q30L065o707K29p52K867L076N629
11625B036j2919o962J272N544L364J877o440o053m561J4105J6544L342k910p404
11611H35o500j3041j2478j07N818j66L422R251m673P243j57P336Q94M642j015
11596A304k470L751P653m678N282j481j7674o567Q746N111l843o759j3925J5069
11582a0481J5412j0989K022J7L781q129L313k37k898l306m872J294N8K169J551
11567a1295K550P530r163n046Q069O103p392o295n538p850K679K922K976P846
$$ y = [-16489, -17841, -1444, -3541, -7260, -22360, -19553, -5704, -6972, -14133, -18937, -11352, 3976, 4064, -1624, -15956, -29294, -37395, -31345, -14543, -7824, -16796, -22581, -10002, -7479, -261, 1431, 8355, 21073, 15348, 1322, -4171, 1078, 6404, -6765, -6201, -5371, -2306, -9013, -8784, -9536, -6669, -3593, 2036, -10883, -17845, -16573, -11029, -7665, -5788, -12228, -18281, -22842, -8737, 7807, 11149, 8239, 835, -5665, -18706, -31184, -31291, -25473, -25639, -22217, -12966, -17639, -10396, -10553, -3217, -2323, 2319, 1304, -1166, 2585, 10238, 5560, 10842, 9361, -8313, -14880, -6134, -1023, -4866, -11625, -25550, -10481, 4931, -6058, -4036, -4019, -238, -8367, -5054, -5291, -8189, -11495, -16367, -15073, -15015, -12846, -11295, -8745, -1215, -10378, -15424, -7355, -1252, -8644, -14939, -20477, -28327, -25648, -22726, -19750, -11904]
11553a1904j407N001N27n917j8535N396R824J1545J252n26J0868p558k0123n798
11539b7355J8688N335j0805q35Q534P464j6698p565j4331R070j727J0925l245
11526b2545n196O616J3543O366J1748Q456j5537k156J2710o83m947o463M161j754
11512D319o106j3746O808J617J023K730R30Q342r236p860J4039R054j6520m107
11498h713L319Q919p8l1Q086l732m766k0072j0275q204j228J301K0942o875j042
11483b2449J1971K984k802Q834N470q34O305O767J0547Q011k323p153j1162k2849
11469h683j2632R494P844M241N24N33J797j0032K476q524N94R757Q357j684j1308
11454g246k633J4753J0711j5353n803K863J2154J0178j2302j1252j405j302K689
$$ y = [-11904, -13311, -8310, -7783, -13700, -32235, -26839, -17015, -5470, -4218, -4744, 6124, -1434, -21557, -27355, -8667, -3332, -14137, -14972, -6438, 1026, -15672, -23237, -37568, -28498, -30225, -19300, -22545, -27741, -21125, -7582, -1216, 10532, 18988, 3451, 1295, 14005, 13322, 8375, 1912, 6073, 4319, -1787, -15533, -8725, -7108, -6085, -3355, -2425, 5917, -3319, -11179, 2860, 11914, -4606, -8713, -5394, 3525, 3447, 3416, 11502, 7770, 3004, -17068, -27343, -35547, -36775, -35474, -14532, -21407, -22449, -10478, -7494, -10296, -1462, 4008, 3174, 9479, 16246, 26793, 34804, 32481, 25328, 14166, -8683, -21315, -11821, -3977, 264, 788, 1321, 3118, -6914, -4438, -12962, -12368, -2611, 5746, 4062, -7246, -9879, 4874, 15585, 232, -5571, -2708, 9446, 19624, 7322, -3930, -5335, -6637, -3948]
11441c948P086j2769J113O087k90n454l885J5288J245J0091o430j5726o395N23
11427a3464J81R913j4449n587j544q82n479M140K0140k768j4361K418j0210J4735
11413a7217J8466M996k066K980l692L700J625k3152j1309N004K7311R650j1035
11400E261k027J675n994j3221J22J4745O802j2928j2857j8653n379M911Q446O892
11386b2205N141J4620K3010l648n20j2617m151J3596N249m906k159j8786k637
11373a0013R156N419O482q087M290o955o692M452J1923P357o914n089p764l902
11359f337p367j1467J0883q150p77R557K245M429j183j1075M092J3939J7966M786
11345B1541j288O428m286r473J2482n473l0375j4008Q04j709M548p33P164K2903
$$ y = [-3948, 3138, -9631, -8518, -2431, -2721, -8175, -12060, 3228, 4473, 14564, 8134, -7592, -13987, -13464, -13283, -3370, -17819, -23406, -24950, -25832, -31311, -27171, -7031, -9799, -24160, -21742, -31952, -17217, 1249, 6245, 4179, 7159, 3467, 7167, 8792, -14360, -25669, -20665, 6646, 16296, 5261, 3234, 4909, -1085, -14306, -14184, 561, 7363, -5565, -18422, -37075, -42454, -37543, -29097, -22205, -17064, -2444, 20566, 16918, 16398, 3781, -370, 13226, 18475, 13569, 11410, -7376, -10013, -857, 4562, 11044, 2957, 7247, 292, -6400, -1948, 9975, 17332, 10418, 5329, -2435, -6337, -13704, -25171, -14288, -22438, -23215, -13658, -11413, -6984, -8167, -19242, -15150, -1211, 16755, 21541, 20253, 26681, 22395, 12922, 25404, 19931, -10444, -24452, -23648, -25357, -20809, -21542, -14378, 8525]
11331H525P475O30q976p72L172K339M28q906L787l163k513j5J2488O843J257n081
11315A7518j5101m188q64r517n756m441J992K172j225M59P826J7880P482O451
11301B0688K560j0805q907j3485j0782J234J3546J123J203l011o45r12K903r902
11287a5192q68k098L200O63L202r465r833o006K0426K211k316o190Q254M841Q83
11272h288o23J304n915q194P298O073Q715M91N583P728q89j3178j4943P369O995
11257d74K387j2750L266J4695k197j124j432l577q541r740J9269J0630k1309l160
11243a4057P080M527q06P151p944p610K862O666J184j632r558r80k667r6J3247
11228b633l583K818J0586r602p490n557j1312k646J2340P52J7271p016n746O601
$$ y = [8525, 16000, 16630, 7654, 6882, 10054, 12393, 12821, 3915, 7702, 4539, 2026, 2011, 14499, 21342, 22599, 17518, 2417, -1771, -2635, -12152, -17908, -22349, -20357, -18185, -19410, -18951, -11125, 6755, 14237, 20688, 23248, 12443, 3536, -9949, -20731, -19497, -5951, -4828, -3625, -6636, -7281, -8193, -5290, -15192, -16060, -18158, -14958, -14295, -11093, -20558, -30391, -36397, -15971, -13760, -16076, -22266, -14012, -9171, -8288, -8911, -7607, -13522, -21716, -14418, -8345, 370, 861, 6444, 14172, 13283, 105, -14838, -7469, -474, 1913, -10837, -7571, 7124, 4927, 3803, 2371, -1206, -9747, -19487, -218, 10412, -10897, -14057, -6977, -2450, -3256, 3895, -4049, -11659, -8797, -2131, -947, -2579, -12137, -13117, -15784, -15880, -2633, -6216, -3398, 7188, -2414, -9904, -15461, -26773, -29419, -17079, -16327, 944, -6072, -11818, -5217]
11214e217P084q788m16L866p211K576J3978N918l766j159M513J394o856o364J2751
11199A2303J2437l471R800n073M9J48j3245j6284q150l321k734k263P903J0418
11185a483j737p518j368K89J0753J2228K891J119j553j3752j8135O506J2494J1466
11171A2200l714l254o013J632N549l754J254n863j0920k959M5J3939L867O642
11157H651J479n524J784j2570k872K0583N056J529k0704j7915O63N847L776J414
11143h803o054K386M218J2582Q969l909j5157j1658N443J4836P82o802m758P793
11129a32R571J514n05L442J7070K5947L8034K5204O071k5108k6416l5021l0724
11116H947r82J7701m058k0536j5739n66k39J9418K1488l115j4413l495R296O703
$$ y = [-5217, 1867, -6921, -7337, -3471, -10682, -8106, 5872, 11790, 8024, 6865, 11378, 12772, 5916, -448, 12303, 24740, 21269, 31069, 25996, 26045, 26193, 12948, -3336, -11486, -14807, -17541, -19804, -11901, -1483, -3220, -10738, -12106, -11817, -1064, 11164, 14055, 15174, 13621, -131, -18266, -11760, 734, 12200, 8486, 5232, -781, 851, 6400, 2646, 3900, -1963, -12883, -15842, -15797, -1858, 2009, 8651, 10130, 4606, 6390, -6180, -9052, 11531, 16587, 18116, -2588, -20503, -19840, -13993, -10217, -8803, -14857, -12471, -8253, 4329, 13298, 9389, -5768, -17426, -11983, 2853, 3635, -3167, -7925, -132, 9439, 10953, 10448, 13890, 30960, 56907, 94941, 120145, 126216, 101108, 74692, 39671, 8947, 7965, 25666, 21608, 1072, -14667, -15233, -15472, 3946, 25434, 22319, 7906, 4411, 13707, 20410]
11102B0410m817j4248J3802N220j5337o977p542M605N987J1434m748j1974q068
11089a2253P628Q782l424M073q408q516O235N63O156K364P008j6958o877J2143
11075a484J0411Q279k302k457n264l146j7422N3J2023J0399m787k76L129M569
11061A1725k261J0853o698j5328j1232J879R421m155p383O355K294n84j1656k
11047a6772K387k587K849L456o895P655P901l940p136K1489J0021M324O727j3045
11033A6434k4119j4439n29J2958J4666J584n81j2762o738q009m952J8922L238
11020d327j3587N469J0322j439P726K797l229j6259O121J9370O620j5888j9323
11007a5627P559J900J7981Q471o024q934n880R485o324O386N312n48K010j0883
$$ y = [20410, 15593, 1345, 15147, 20367, 5030, -1947, -9489, -4884, 1103, 12537, 7789, -4185, -12253, -4625, 4157, 733, 4806, -3602, -12118, -5883, -5320, 836, 3200, 10208, -6750, -13627, -1484, 8927, 17206, 14904, 12447, 7183, 4037, -13385, -13332, -1309, 9090, 4303, 4027, 7156, 11725, 9464, 20317, 13619, -1709, -12941, -11062, -1641, -5796, -13179, -6824, -4530, -5114, -16770, -16772, -14385, -16972, -14123, -10667, -17562, -9907, -2006, -5946, -13082, 8407, 18428, 22752, 29479, 16434, -7685, -22124, -22653, -9695, 4971, 6555, 5974, -6788, -13526, -21535, -26487, -7565, -4327, -17914, -12445, -2123, -3562, 4164, 6961, 3732, -12527, -6406, 12964, 19584, 3696, -15627, -8068, -6168, 11813, 20284, 14260, 5326, -554, 8931, 2607, 8993, 14305, 13757, 15767, 4884]
10993D884J297J599J0477J2609j0105q283M616J8819J3400m686p873J6892L1313
10980H4959K2800L5061N4210R8390J78070L13158M24071J17294k39197k32249
10970H56567k56380k12913j33274p4038m0786k9557k8951k1437j1186j9211j2688
10959A6146L966m852L380r576q89O403p043K611n002k1796o900L544J5328J1949
10945G269p722j101N301k699l038M569Q047J3080N562L019j227q209j5J4802k77
10930C7361p886l21q290j5944q819j8633q580P082R712K133L813l162K627J2261
10916C354J2996l827r411k05j37m547j957N457L881r43l593o346K34J143P743
10901C842j38l654Q682m849j5835m537n56R942R661m214m084r563R780K0126O240
$$ y = [4884, 6181, 7780, 18257, 30866, 20761, 12478, 17094, 35913, 49313, 44627, 36754, 53646, 84959, 107759, 142820, 197030, 295420, 473490, 786648, 1210719, 1328013, 1088816, 856567, 600187, 387274, 254000, 179962, 139176, 109619, 80668, 59231, 48045, 28834, 16146, 20112, 15260, 18640, 9064, 8175, 14578, 7535, 10146, 5144, -16652, -23552, -20008, -4680, 7269, -453, -1554, 3747, 1048, -1990, 2579, 10626, 23706, 29268, 32287, 31060, 22851, 22836, 37638, 37361, 29475, 29154, 20864, 4920, -3899, -22532, -31112, -24030, -14318, -12185, -8372, -11534, -8907, 3354, 16350, 12523, 3112, 2907, 2770, -1777, -3734, 1723, 5604, 4661, 1068, -5278, -5044, -3901, 3842, 3704, 50, 8732, 3883, -11952, -16489, -17045, -7103, 2558, -1656, -5740, -15303, -5523, 14603, 20843]
10886B0843k501n78n705K231J8064J3529M1685M5955J7560k095k0978k8896l1609
10873F7505j8277k2899r97K769j590m443M92R69j0428p321k431n1O783J0051O563
10858B6695l071j6220j0189K982q372j0766J1550m655k3602M799N209J4536J9119
10845H015J1130n260j2107n089o179L891L631j1101O555K8860R542j3669r997
10832H222K08r273Q123J3338n362M911k367l071J4003J4696J1259J2660j0982
10819E6365j6017p819O094m93j0889m949n715j2633L33N787J696M815l271j3341
10805c7K4660Q529j9733j7254j5360N192J5489Q853m949n451k50J1574P630j3297
10791E596r487j0525m798J1390J2336J74j844j1652N720N31m657L772k236l815
$$ y = [20843, 18342, 17764, 12059, 14290, 32354, 45883, 87568, 133523, 151083, 148988, 128010, 99114, 67505, 49228, 26329, 25332, 28101, 26511, 22068, 22560, 23529, 13101, 5780, 3349, 3298, 10081, 20132, 26695, 23624, 7404, -2785, 197, -8175, -18941, -7391, -12046, -35648, -30849, -25640, -11104, 8015, 19145, 13885, 1778, -3311, -9490, -5599, -1968, -13069, -6514, 22346, 31888, 18219, 8222, 8430, -843, 7280, 20618, 15256, 20167, 17800, 14729, 28732, 43428, 54687, 67347, 56365, 40348, 32529, 38623, 38130, 27241, 22292, 16577, 3944, 4277, 10064, 11760, 16575, 13304, -37, 24623, 33152, 13419, -3835, -19195, -14003, 1486, 10339, 5390, -61, -311, 11263, 18893, 5596, -3891, -14416, -19214, -7824, 4512, 4686, 2842, -8810, -3090, -2559, -7216, -3444, -5680, -9495]
10777i495J747M342n723k1638J140J8285K706K288J2198L089L634L411K53m21
10763A5816k330j4647j3848k472m97l825j126K745K54O668J4665o18n829j2529
10749a7573p857N811N443O84k471L920j141J831M367M426Q16q296J3895J9073
10735B2928p882j5372p299p009j874K87q432Q811q05n951J7636J6230K993k373
10721A1888J1196j1601r83l067j5471q750L715L301n056M256R91o216j1004M694
10707b2107J652K443K8852M608M40J03J162j1565q259L133k755j0256k103m345
10693a8997J2290R400K453K136m088k992L499J3163j381k2749j5813O62J3660
10680h757J336o535N670R985J85l576N085n006k345N939J7971N395j3537N43j1521
$$ y = [-9495, -7748, -3406, -9129, -30767, -29627, -11342, -8636, -6348, 5850, 8939, 12573, 15984, 16237, 15816, 13486, -1161, -15009, -17481, -17978, -21803, -22929, -20184, -19930, -13262, 1403, 785, -5044, -17573, -25430, -19619, -14176, -13492, -15963, -12043, -13184, -11353, -6986, -2560, -1744, -10040, 3855, 22928, 15046, -326, -7625, -14634, -16508, -16221, -24653, -15842, -16647, -22598, -4962, 11268, 14261, 11888, 23084, 11483, 10500, 7433, -8038, -16788, -13073, -9772, -14828, -10572, -9581, -15797, -26801, -22107, -20455, -18012, 10840, 15448, 15888, 15991, 17153, 5588, -2671, 462, -2293, -12549, -14652, -18997, -6707, 2693, 5146, 7282, 3194, 202, 3701, 16864, 15483, -7266, -23079, -22417, -8757, -7421, -13956, -8286, 1699, 1884, -1692, 3393, -1613, -3958, 1981, 19952, 25347, 11810, 12353, 832]
10665H32Q197J0639m74r339j264L244J0179j4236p836J949k522L552j8388j927
10651a7394J3700R165J667k144q603L390K753j1056J379K074p870R818Q209l431
10637A657m320M376o851o841P556J8221N479j609j3234M760Q868j9620j8100Q89
10623a8769p368J0444m398j9619J873M163J9450J4824J3844L673l286l08l209
10610A1314j0820J0797j0418j0220n844j0054P743J7535Q770r90j4822j3300J9286
10597a023P700K0l008l129K782K477J0669k229k657O807l784j7685P493J0635
10583A5068n837J286J620j569r769j2886l67O53R870J8799N944l002o823j7523
10569d536j5324j3503R639O475j3736n525J1480J0852N719L004l855J0967J290
$$ y = [832, 9029, 19668, 19194, 9855, 8591, 11835, 22014, 7778, -58, 1891, -631, 2921, -15467, -17394, -3694, 5471, 7138, 4994, -3609, -219, 2534, -8522, -7143, -5069, -12939, -3121, 5088, 1657, -2663, 1713, -5138, -11979, -4423, 13798, 19277, 17668, 4434, 9194, 18062, -1558, -19658, -18769, -26137, -15693, -20091, -39710, -37837, -33674, -14224, 600, 14444, 18117, 14831, 14523, 11314, 494, 11291, 873, -9347, -15191, -25245, -17502, 33, 8803, 7813, -7009, -20309, -1023, 6677, 6697, 3689, 560, 3342, 5819, 16488, 14259, 11602, 18409, 14625, -3060, 4433, 15068, 9231, 10517, 12137, 10568, 799, -12087, -12454, -11801, -1931, 16868, 22812, 19810, 12987, -4536, -19860, -33363, -23724, -17249, -30985, -36510, -25030, -14178, -8459, -5455, -9310, 1657, 2947]
10556B947J5691N731n085j0547M815J0346M157k710p771j0043j838M935m13K492
10542A2707N139p331j2855k59p558K364N765P830l895l578r94r437r006J2997
10528h111m626j2215o953q53P835R597j3115n666J1989P028J1344J3971k217r404
10514a396n332M841J786l457K19o872L790o975N914J5208J2036R663r605j0456
10500I364k461J0331k649p192K372l997q033n9m877k409J534J048k022N707l226
10485f569j1095q538K0289L969n883j2303L425Q509Q441O67Q300L260M271n495
10471A1248o752l607l497l067j121J0560L426L62n577m055j3653k3301r266J2346
10457c5954J5035J5425J2850Q74o214j5521q755j04J8922M7n15k125j2899J1855
$$ y = [2947, 18638, 24369, 19284, 8737, 13552, 23898, 28055, 25345, 17574, 7531, 5693, 10628, 10215, 12707, 17846, 10515, -2340, -2599, -10157, -7793, -2028, 5802, 1907, -1671, -2665, -12102, -21108, -8111, -12737, -24952, -31905, -32758, -24923, -15326, -28441, -34107, -22118, -15090, -3746, 10225, 8008, -1396, -6728, -1887, -101, -3558, -3339, -10211, -6421, -13396, -7482, 7726, 19762, 29425, 19820, 9364, 6903, 17234, 14585, 7393, 9765, 5768, -2265, -2324, -7201, -9610, -8076, -7028, -9050, -3343, -6569, -17664, -26202, -5913, -1944, -7827, -20130, -16705, -8196, 245, 912, 9212, 12472, 16743, 11248, 4496, 889, -2608, -5675, -6796, 3764, 7190, 7552, 1975, -2080, -15733, -39034, -48300, -35954, -20919, -5494, 7356, 8230, 2016, -13505, -22260, -22364, -3442, -3395, -3910, -6035, -18934, -7079]
10443g079K139j9406m031J2858k505J899P774k828L994R484j037n702O348L682
10429E590K566O542K843j3217j9016K761N59p281j4330j9721j109J4977J848k403
10415c9391J4030J4899O207k705J359r426j0683P893L062M684N277J4782L670
10402A3658M626J875m315r462N509K826J054K821l188n02J0286j1254q216n301
10388D17J967O228q577l547L883o330j5942N391J1900J0467J759L391m378o389
10374B40N645Q303N358R912j6138j0642Q096m942P991O559k435q331k577p943
10360i04k909O906l504k250J996J714l752j529j3442L189J7270N739m424j2704
10346h604J808J4012o670j2221P522P464j459j2810L358K66q359j882M832m165
$$ y = [-7079, -4940, -24346, -28377, -15519, -18024, -16125, -8351, -11179, -7185, 2299, 1262, -4440, 1908, 5590, 8156, 14698, 17541, 4324, -14692, -11931, -11372, -18653, -32983, -52704, -53813, -38836, -36988, -39391, -25361, -10462, -4255, -6960, -5601, -15027, -25710, -17817, -14755, -10071, -4794, 9988, 13658, 18284, 20159, 15844, 6382, 11891, 14717, 15771, 18592, 15404, 14902, 25188, 13934, 5718, 417, 2384, 8612, 35, -3512, 371, -5959, -21901, -16510, -4610, 5857, 7616, 11007, 6629, 240, 5885, 14188, 19546, 29458, 13320, 2678, 10774, 5832, 13823, 20382, 17947, 9616, 7039, -904, -3813, 3093, -411, -2661, -665, 1049, -2703, -4232, -17674, -14485, 2785, 8524, 4100, -8604, -6796, 7216, 546, -11675, -4153, 3311, 1852, -10958, -7600, -7334, -15693, -17575, -12743, -16908]
10332a6908K543R389l625k911k817O212K815j1404P178O297N498r707K517q164
10318a3087j0867Q649J0927P521J435o822l032k021j0367m329M369J5902j745
10305c467K839J4657M314p268o400j0863P88N658K449L719p891k3139j4449Q445
10291c0608J2240K616m809r54o198k793O274J2260J1316L724M346Q434q338j067
10277F443P783p703m860O03N425j0785n382J0877R53o952l926j43N583K617j8817
10262a8284P336L0433m725K825O935l443j7904j8921j931P477J6369n126j2999
10249a1958P346P155o334q682J592J3981j997m000n734M502Q515L015k181N820
10235A1040K7500j99j8658l05M623k119L496q162o796o645O51J205P255P383J95
$$ y = [-16908, -14365, -4976, -8601, -11512, -14329, -8117, -5302, -16706, -9528, -3231, 2267, -7440, -4923, -13087, -23954, -15305, -4378, 3143, 4578, -2244, -5276, -7297, -17664, -21993, -17624, -1722, -3467, -628, 14029, 18343, 11075, 4675, -6188, -5400, 258, 2707, 6426, -1465, -24604, -39053, -30608, -18368, -15752, -20561, -21515, -27713, -30506, -24232, -11972, -656, 3068, 7414, 15848, 7510, 6443, 14226, 6523, 1663, 2266, 7691, -3094, -8476, 2401, 3354, -3598, -7524, -7667, -2084, 533, -18284, -10948, 19485, 14760, 17585, 24520, 21077, 3173, -15748, -17679, -10202, 6167, 1041, -11958, -4612, 2543, -3791, -12473, -10881, 3100, 1103, -2897, -8631, -4129, 4386, 7401, 5220, 11040, 38540, 38341, 19683, 19378, 24001, 21882, 25378, 17216, 10420, 3775, 4426, 5631, 12886, 20269, 20464]
10220B0464j7151j9643L588p624J753J5533J202p086K898n627O800L161j2687
10207a4419P57O20j3276k033J1187J3374p395k787n576p561K785J2435J249k227
10193a2867P546J1382k123o250k700n497n170j3802m985O719J0184J0624Q910
10180A971N650J4669J0063J499L493j4432j5789J422K370o086K011K817o483L775
10166F950J0353j4652j4872k103R526k810P084J382L160k431M789j2670Q977O203
10152H886P695j1564l492M466J6686J6682J915n730K245m497k0840j5288L899
10139A063q005Q40J4404J3105m825j3171j1791M683K853l29o719K42J8116O096
10125A6562p930M745J03j6143P31J6650J3476r580k727l024J507o27j777n976
$$ y = [20464, 3313, -16330, -12742, -20366, -18613, -3080, -1878, -8964, -6066, -11693, -4893, -1732, -14419, -13662, -13042, -26318, -28351, -17164, -3790, -11185, -13972, -19548, -27109, -24324, -11889, -10640, -12867, -5321, 6061, 3938, -2312, -5012, -10509, -15679, -29481, -34466, -27747, -17563, -6939, 1971, 7621, 22290, 32353, 33852, 37345, 22913, 7124, 8546, 10916, 4830, 6841, 9658, 3175, 6950, 17303, 2651, -12221, -14324, -4798, -7608, -524, 858, 4018, 1587, 6376, -6294, 2683, 8886, 16581, 5017, 1525, 5991, 22677, 39359, 41274, 35544, 37789, 33292, 12452, -2836, 1063, -6942, -6102, 8302, 21407, 16582, 3411, -8380, -3697, -844, -1173, -7892, -7650, 10466, 16562, 8632, 13377, 13480, -2663, -1932, 14718, 28194, 18614, 15887, 12863, 14370, 13743, 11966, 5990]
10111E990q693l095O428n152n876J6435Q834n482q676N643j44l643p127p919J1918
10096e59N271k118o370q159q169J3625k582M251q796k868R087J7681M04j0293
10082D05p860K221L656k814p144r527r502o68O59J2334J3011q630p495Q757o403
10067a9000J4505J4362m764j1267j0504q54j543j133R88L291j483J4632P420o543
10053a893j7565n821Q183J6837L511j1096o44L527q27K2399J0262O312Q74j475
10039C2584r564j6089n477P852R783J198L543O784K618o921n874j2766o769p988
10025g086N314p993l848J1933L823L561Q580K52M419L719j0953j3362j0983j445
10011a4069Q628J3810K494R053m253p294N805Q265J0042p848n301J718J1888m12
$$ y = [5990, -2703, -5798, 630, -4522, -10398, 6037, 14871, 9389, 713, 6356, 6212, 2569, -4558, -12477, -559, 4712, 2594, -3776, -11935, -20104, -6479, -9061, -4810, -13606, -16474, -7387, 10294, 10698, 405, -7455, -5234, -1578, -4392, -11536, -21063, -30565, -31233, -30574, -18240, -5229, -13859, -21354, -12597, -19000, -4495, 9867, 5103, -6164, -16668, -17522, -19065, -20198, -19210, -15919, -17402, -2770, 4650, -1893, -19458, -25279, -17096, -259, 3252, -7844, -8488, -4961, -5788, 16611, 26873, 33185, 34059, 32584, 23020, 6931, 1454, 9306, 19089, 20287, 23830, 30614, 33232, 26311, 20437, 7671, 902, -7086, -1772, -9765, -13613, -1680, 2143, 5704, 14284, 14536, 18955, 22674, 11721, -1641, -12624, -14069, -5441, 8369, 10863, 19916, 15663, 8369, 14174, 22439, 32481, 24633, 19332, 21050, 32938, 32526]
9997C2526p997o984r395K491p742r56q83j444p620L121J160O356K880o54k2p697
9981b860o820K050Q523q025J2809J3093p197o706J0494J345j7215r84Q103J488
9967H098j207O86K916N041o12r805j6375R227L708l567j953O684N090J4740q0
9952B2591k544j1188j2053j4973R246J74l141n242K301O46J4517R860j3956N857
9938B095K882L438r46n583o72N991m369K9L265N032l250K019J5377q318K023n858
9922A3155n467o129j5776R998O655L115M51l686R809n032q252l712p215j761l795
9907a7642J5430J1092J1589m114k809n712j006P45l917m049o444R769K000O862
9893A1794J0737k031n547q701j773J2197L049j2274p832N297O779m102J0127O443
$$ y = [32526, 24529, 17545, 8150, 10641, 2899, 1943, 1060, -384, -8004, -4883, -3723, 2633, 5513, 4859, 4837, -2860, -9680, -7630, 893, -7132, 5677, 18770, 11573, 4867, 15361, 16706, -509, -1493, 6610, 8098, 6891, 7577, 10493, 15534, 14922, 5117, -11258, -2031, 1677, -1890, -3843, 2841, 7931, 22671, 22591, 20047, 8859, -3194, -18167, -8921, -8747, -11888, -17130, -14829, -14183, 334, 10194, -3762, 2095, 4977, 8415, 7469, 1886, 1214, 7205, 2836, 2865, 6130, 11162, 7912, 9931, 25308, 16990, 19013, 13155, 7688, 1559, -14217, -4219, 2436, 5551, 6002, 2316, 12125, 7093, -1159, -4871, -12086, -13847, -17642, -2212, 8880, 20469, 16355, 13546, 7834, 6828, 7573, 3656, -393, -6837, 2932, 4932, 11794, 22531, 20500, 14953, 6252, 4479, 16676, 19725, 7451, -381, 4916, 11695, 7593, 17720, 24163]
9879B4163P976o058k393R573n644J3699K356j1637J0189o386p196Q092k820k5393
9865H521k7354K888j466J511J1166J2832O369j2667k1205J2751P700P871J1580
9852B0497P330R794m409j1229j2642j0880L715J283j2195j416N301j440Q029R760
9838A1498J2607n10M002M802N938J8098n736j2902j7467r685R03J0632Q578M66
9824C1224L8K56O985p359q736p839m927m37k486r948Q605Q414n751N497J0865
9809B4401J4617j2730m022J89N513J1314Q94j4966n899k18J0933Q251r823j105
9795B7349l014P788q2p863r227J7543J0429j134j0177m225j028R628R089j484
9781D3592q009p997J0620m17j2624r077k990J436K559J320r483O796J1452J3492
$$ y = [24163, 32139, 26081, 23688, 33261, 27617, 41316, 43672, 32035, 42224, 35838, 28642, 36734, 33914, 8521, -18833, -15945, -17411, -15900, -4734, 8098, 14467, 1800, -19405, -6654, 1046, 8917, 20497, 27827, 37621, 33212, 21983, 9341, -1539, 2176, 3459, -8736, -10152, -4851, -6291, 1738, 11498, 24105, 23595, 27597, 32399, 38337, 56435, 50699, 37797, 20330, 10645, 11548, 22180, 30758, 31224, 31262, 31518, 38503, 31144, 22408, 14569, 9642, 9205, 6719, -3229, 5376, 13790, 8039, 13536, 24401, 39018, 26288, 22266, 22455, 27968, 39282, 40176, 25210, 19311, 19093, 30026, 38277, 28454, 27349, 24335, 32123, 32041, 24178, 14951, 32494, 42923, 41789, 31612, 27387, 26359, 35987, 45076, 43592, 35583, 27586, 38206, 37789, 25165, 16088, 13098, 14534, 17093, 18413, 8930, 15726, 27178, 40670]
9767D0670J509N226Q210J29j3200j689r332j4650K096K769J1014K202r513n546
9753A9895J1031K1494J3535j3353k7167j1012R250m119J7714l553q611j2964j252
9740A0888R952j972r444L506M913l417P012J2122K609L1839L175j1155j0284J040
9726E0784m339o640P000o555k7696M242J7553r490r828K113o965K2733K4768L626
9712F1306o691r319q220J752N647j5831P7M742j4739M877R191m079J1283J5107
9698E5103P35j148R336j085l379r475J2311L390q428o754j496O909J3433p862
9684F1590r97n786J3848R870j1290o038J1799k479j2560k3058L330J2782N629
9671E6640p947L850L653K62O16J229M270L647r510O053J0113L821O392j3023O701
$$ y = [40670, 42179, 47405, 55615, 55744, 42544, 40855, 31523, 16873, 18969, 21738, 32752, 34954, 25441, 19895, 30926, 52420, 65955, 52602, 25435, 14423, 23673, 19554, 37268, 33715, 25104, 12140, 10888, 20840, 18868, 9424, 12930, 17843, 14426, 21438, 33560, 36169, 68008, 71183, 60028, 49744, 50784, 46445, 39805, 46805, 40250, 12554, 16796, 34349, 24859, 15031, 17144, 10179, 32912, 57680, 61306, 54615, 45296, 37076, 38828, 44475, 28644, 28721, 33463, 18724, 23601, 32792, 28713, 39996, 55103, 55838, 54690, 64026, 62941, 59562, 50087, 62398, 65788, 57360, 50606, 49110, 56019, 69452, 61590, 60593, 54807, 68655, 78525, 67235, 61197, 72996, 70517, 57957, 34899, 38229, 51011, 56640, 48693, 52543, 56196, 56458, 57074, 58303, 62573, 66220, 56710, 62763, 72876, 76697, 83089, 70066, 76767]
9656G6767O169p874j5731k371j978J0642j7990k636N262r208J9195R688p138l5
9642F2762L878k826j0528J1017J2657n175L604J355p848j268Q645q047J708J732
9628G1666J234J5676J6477n018j6798K812Q340r034j1856j3353M387R295j2583
9615F1245m862J36K139J3540m344P285m659k875L69r344l033J3413M794J9571
9601I3375n462m987m489r402J3781J3378R469o79j1680j3808n823J4259J895N697
9587I5524j329k825j0829n619O324J4879M010k490K558o61j1789p922J0496Q747
9573I9074l575k824m268N567J0233L765r899r998J064r006P368j64j0381n149
9559G1807l486n701J1311R156N366j440j0872Q374k766R2l288K888J1005j574
$$ y = [76767, 82936, 75062, 59331, 56960, 54982, 65624, 47634, 44998, 50260, 41052, 60247, 69935, 62797, 62762, 66640, 63814, 53286, 64303, 76960, 71785, 75389, 76744, 68896, 67628, 76273, 68226, 69934, 71666, 72900, 88576, 105053, 100035, 83237, 86049, 94389, 85355, 73499, 60146, 64533, 73828, 61245, 56383, 56519, 58658, 72198, 67854, 75139, 70480, 67605, 67974, 58630, 55597, 69010, 73804, 93375, 87913, 82926, 78437, 69035, 82816, 96194, 105663, 104984, 93304, 79496, 73673, 87932, 89827, 95524, 94195, 91370, 80541, 74922, 81246, 96125, 100135, 97645, 100203, 99542, 87753, 79831, 90327, 99074, 95499, 92675, 88407, 93974, 104207, 107972, 98073, 88075, 89139, 80133, 87501, 87337, 76956, 71807, 68321, 62620, 73931, 83087, 88453, 87013, 76141, 84515, 81749, 81841, 78553, 81441, 92446, 90872]
9545I0872j7223J262J0487K867J38o565L145k9k783m051Q673M440N611K377O724
9530A05945Q39J52m80o414J1379p82j6597j0758N451N495K611j8466l794J5574
9516I0155K397q784n116L982J0704r51k139N393o538M370J8p122q282r324J0067
9501G8830M102r658n143J6962J3157L722J6781p016j3377j6403l182P072P153
9488I3000Q449p199p427o112J796Q491n425M508J0382J1181j833N722j4335j4005
9474H7193Q97q661r341K476R218J0960l027m812O03R761Q601q528j287o143j7942
9459F9968O443n188J4601J5694m722m989m501j9132j4671o42P597J4795J3212
9446H8465R194p105L73j0187j323Q037J3009J2901K0791j0396j2958J443k813
$$ y = [90872, 73649, 74911, 85398, 88265, 88403, 81838, 84983, 84954, 82171, 78120, 86793, 91233, 96844, 99221, 105945, 106784, 106936, 106456, 100042, 111421, 110639, 94042, 83284, 88735, 94230, 96841, 78375, 74581, 90155, 92552, 83768, 78652, 82634, 93338, 92387, 90248, 95641, 89103, 93473, 93491, 86369, 78087, 68763, 78830, 82932, 73274, 68131, 85093, 98250, 101972, 118753, 111737, 98360, 81957, 78775, 85847, 93000, 101449, 94250, 86823, 80711, 82507, 90998, 85573, 90081, 100463, 111644, 109811, 115533, 101198, 87193, 88090, 79429, 70088, 72564, 81782, 92742, 89715, 84903, 85506, 95267, 103868, 95340, 94053, 87910, 69968, 76411, 71223, 85824, 101518, 96796, 91807, 87306, 68174, 53503, 52861, 60458, 75253, 88465, 97659, 90554, 90927, 80740, 79417, 87454, 100463, 113364, 134155, 123759, 110801, 112244, 109431]
9433A09431q857O478J2143Q447P56j824k445j1584p711M65j772J758N265J0056
9419A20606n271j3010l606m240j628Q04l981Q502n530j0422R374R680j3437P902
9405I5743o279O096J2807j645M74k962j863J4743J757q428k002j8665P294J8149
9391A15219p077j061M605m703p698K451j435p069Q260L461P83j3731j2077k022
9377G7906K004J395P697k926J6162J6067k405p493m032k824l72m824J2865j193
9363A08027p336J0138J2592P736N031O602j8468M424L04O259m766j9042J638J9252
9349A32391J5546J1439j940o140Q372N570k717j1225q291k444K193O382o860j4256
9335A28020n138k477K0100R354p694L148K268n144m918O791K0594J1857k051m816
$$ y = [109431, 100574, 107052, 119195, 127642, 128398, 126574, 124129, 112545, 104834, 105299, 103527, 105285, 110550, 120606, 115335, 102325, 98719, 94479, 92851, 93655, 89674, 98176, 92646, 82224, 91598, 101278, 87841, 95743, 89464, 95560, 108367, 106722, 107196, 104234, 102371, 117114, 118871, 110443, 108441, 89776, 97070, 115219, 108142, 107081, 111686, 106983, 99285, 101736, 100301, 93232, 101492, 104953, 105736, 92005, 79928, 77906, 79910, 81305, 89002, 86076, 102238, 118305, 115900, 108407, 104375, 101551, 101179, 96355, 109220, 108027, 100691, 110829, 123421, 131157, 136188, 142790, 124322, 128746, 129050, 135309, 130543, 111501, 113139, 132391, 147937, 159376, 157436, 151296, 159668, 165238, 162521, 151296, 143005, 140561, 142754, 149136, 142276, 128020, 122882, 120405, 140505, 149859, 142165, 145313, 147581, 142437, 137519, 144310, 164904, 176761, 174710, 169894]
9321A69894r334M011J0169L185M454M630n71l303m533K658N433J1658n426r222
9307A83703J7493R759N810K0515P572N824n738n233l599R251L456m437n169k310
9293B36897j876L679j197K1747O117J309L096Q536R24J378N514m808J6756J0859
9279C08931J7455N678Q52K05R773j223O674P504p498J1932l2J5755n264n855K0235
9264C85122K3562J2151M735l046R633K0383K6307k153K227P092j746L624J7928
9251E05819L4464L3762K0872Q859J0987P055O450R976O903K6903L2530K0748K799
9238G28127K7245J9422J3383L6185K1503K8046M2668L3967J2365J4307L8240L4505
9226A049963L5718K0940K8243L1417J5927K4984M5877L0151L7109L0413L4904
$$ y = [169894, 160560, 164571, 174740, 177925, 182379, 187009, 186438, 183135, 178602, 181260, 186693, 198351, 192925, 183703, 201196, 210955, 216765, 237280, 244852, 250676, 244938, 239705, 236106, 245357, 248813, 244376, 239207, 236897, 235021, 238700, 237503, 259250, 265367, 266676, 269772, 278308, 279232, 280610, 286124, 281316, 298072, 308931, 326386, 332064, 332916, 333121, 342894, 341671, 348345, 355849, 348351, 360283, 360251, 376006, 370742, 364887, 385122, 408684, 420835, 425570, 422524, 432157, 452540, 478847, 476694, 478921, 486013, 484267, 487891, 505819, 540283, 574045, 594917, 603776, 614763, 621818, 628268, 638244, 645147, 672050, 704580, 725328, 728127, 755372, 774794, 788177, 824362, 845865, 873911, 916579, 950546, 962911, 977218, 1015458, 1049963, 1085681, 1106621, 1134864, 1166281, 1182208, 1207192, 1253069, 1283220, 1320329, 1350742, 1385646]
9215A385646N4441M4058K7834L1198L4299K9083K1038K1379J4764L3999K6052
9204A723791J3574J2442J0819J437K926L220M790j0039l071j3229n997r526k1635
9191A709502l0442k2574m8400n2734j7815j6415l2036k5683k9207m6417n0987
9180A336792m0665l9598l2458m0259l8793m1999m4519k5448k7322k6228l7890
9169I41613k4451k8684l3382l8071k5303k9278j6950r814j4682l8038m5866k7274
9157F09820k2203q487j707l8786l9645j4227L073n156j0729Q061j1260j7849q709
9144D42196j9084k9165j2326l161j6537k4046l010O399p439n99j1366k0692q110
9131B93060l050j8068j7178j1388N31J011j9117j1220n964j5468K19r033j227
$$ y = [1385646, 1440087, 1484145, 1511979, 1543177, 1577476, 1606559, 1627597, 1648976, 1663740, 1697739, 1723791, 1737365, 1749807, 1760626, 1762063, 1764989, 1768209, 1772999, 1762960, 1759889, 1746660, 1740663, 1731137, 1709502, 1679060, 1656486, 1608086, 1555352, 1537537, 1521122, 1489086, 1463403, 1434196, 1387779, 1336792, 1296127, 1256529, 1224071, 1183812, 1145019, 1103020, 1058501, 1033053, 1005731, 979503, 941613, 917162, 888478, 855096, 817025, 791722, 762444, 745494, 735680, 720998, 682960, 637094, 609820, 587617, 579130, 577423, 538637, 498992, 484765, 487838, 482682, 471953, 480014, 468754, 450905, 442196, 423112, 393947, 381621, 378460, 361923, 337877, 334867, 341266, 333827, 333228, 321862, 301170, 293060, 290010, 271942, 254764, 243376, 243907, 244918, 225801, 214581, 208617, 193149, 193368, 184335, 183108]
9118A83108Q840n288m590Q308L252O541p930j020j1038j4374L324J2179q129k1362
9104A51821l446o900M476k012j6441L75Q386l341j4555j3558K210l018j4782J7169
9090A06384j68j4450N539k985q19J528k43L526n52J550q567q022j5577L043O981
9075G7168m902j1405N093Q615J0407K492n435o43q838k2620L017Q910O077L220
9061G1156l27J377o921p572p078R058j457N500R430j5641n228J383k761J2035
9047F2954J0596j7732j3085k13L027P414o046K384J1443j655J627N556j148j6906
9033D8216K398Q420J16R842m108q842n105r158q63P192l382j5880j6875Q731J5808
9018C6510l000m896p275K8004J1380J747q152j1983j1718P06n47O311j7279o748
$$ y = [183108, 191948, 186660, 182070, 190378, 193630, 200171, 192241, 191221, 180183, 165809, 169133, 181312, 173183, 151821, 148375, 141475, 145951, 143939, 127498, 127873, 136259, 132918, 118363, 104805, 107015, 103997, 89215, 106384, 106216, 91766, 97305, 94320, 93501, 95029, 94786, 98312, 97760, 99310, 90743, 82721, 67144, 70187, 77168, 72266, 60861, 65954, 74569, 84976, 87468, 82033, 81390, 72552, 49932, 52949, 61859, 67936, 71156, 70829, 72206, 65285, 57713, 50635, 59693, 58236, 63736, 73166, 57525, 52297, 53680, 50919, 62954, 73550, 55818, 42733, 42520, 45547, 52961, 46915, 49299, 60742, 59087, 60714, 66270, 65122, 48216, 50614, 59034, 59150, 68992, 64884, 56042, 50937, 41779, 40916, 48108, 44726, 28846, 11971, 20702, 36510, 33510, 28614, 21339, 49343, 60723, 62470, 54318, 42335, 30617, 31323, 30776, 37087, 19808, 13060]
9004A3060L753P673k228q50l222n031O698m46l872J3609J8605O730j4689k0417
8990A9373J0516J8574k651j2601q172j5042M359J5762N801m324q550r607M588
8977A8026J1160J73J6891j3412j5989O13j227J1590m915j2802J741j614k132J050
8963I153R816O715j749P332m763M142L135j1789l184o933O237K0635K36j0394
8949B8589r195k592k411j1023J0837J6020p029k19K78k352n4O427n147O573k373
8934B6329j0774j756J489j5997r88Q679m07N963j830k343m127L240R719J093r967
8919H323j2863M163J9139R011R404o34l325j7336j2391M152R663j100j698Q612
8905B3120K731j6865n502P28J4316R791k881o432J229o597J080J1527J7840q237
$$ y = [13060, 16813, 24486, 22258, 21408, 18186, 13155, 19853, 19407, 15535, 29144, 47749, 54479, 39790, 19373, 29889, 48463, 45812, 33211, 25039, 9997, 14356, 30118, 35919, 31595, 23045, 13438, 18026, 29186, 29359, 46250, 32838, 16849, 17462, 16235, 27825, 22910, 10108, 11849, 10235, 8103, 9153, 18969, 25684, 23935, 31267, 26504, 30646, 33781, 21992, 18808, 11875, 18112, 38747, 38983, 28589, 19394, 16802, 14391, 3368, 14205, 30225, 23196, 22977, 23255, 20903, 20849, 27276, 22129, 28702, 26329, 15555, 13799, 15288, -709, -1697, 6982, 6575, 12538, 10708, 8365, 4238, 7478, 17197, 18290, 8323, -4540, -377, 18762, 27773, 37177, 36543, 33218, 15882, 3491, 7643, 17306, 16206, 14508, 23120, 25851, 8986, 3484, 4212, 18528, 28319, 25438, 19006, 20235, 13638, 14718, 26245, 44085, 35848]
8891C5848M198L890j2335q312J168q331m873j267M460N415Q87J1850N447M028
8877D2073r717j1149j9261M185J2544N686m999m025L165O621J0248m068m840k3292
8863C171O299J8867N587J666q646n572J0713M672m136m517j6364O72N080q137
8849I355k687Q00n145J890L828O29P046q108j2045J079K354k557R000P686J341
8834A4466R819m969n731J905J1116K538o002M684P49L463O821o959n43J994p837
8819B5514o339K66R200J2091M6J600j0255n456j1306q226R497j2039r10O974R043
8804A9700K466k420L619O438J3556N34m226m658M028n202j5686m854o990j8268
8790a1963J134J0193P875J8139N134j5218p909J188j1692l783q152k239J1065
$$ y = [35848, 40046, 43936, 31601, 23289, 24457, 16126, 11253, 9986, 14446, 19861, 20748, 32598, 38045, 42073, 32356, 21207, 1946, 6131, 18675, 24361, 19362, 15337, 18502, 25123, 35371, 31303, 26463, 3171, 9470, 28337, 33924, 35590, 26944, 21372, 32085, 36757, 32621, 28104, 11740, 12412, 17492, 9355, 6668, 7468, 2323, 4213, 8041, 8670, 15716, 7608, -4437, -3358, -1004, -3561, 5439, 13125, 14466, 24285, 19316, 13585, 15490, 26606, 29144, 23142, 27826, 28575, 32038, 38859, 31900, 31357, 33351, 25514, 19175, 19441, 28641, 40732, 40778, 42378, 32123, 26667, 15361, 7135, 16632, 4593, 3683, 10657, 19700, 22166, 19746, 23365, 29803, 43359, 43893, 39667, 35009, 39037, 33835, 18149, 13295, 6305, -11963, -10829, -636, 7239, 25378, 30512, 15294, 7385, 8573, -3119, -6902, -15054, -17293, -6228]
8777f228J4143L001n1n589j3933n472J1834J0905J0940R132J0648o469n260m909
8763B2692l737J2712q525o394l707M610P453m452r483M325k589l265N271J568
8749A6479q457n576Q204o52L044o879m424M046J1247l227n679N502J1293J911
8735B6832p748q464r07M610j323o646J4464J123k3998j3292O235J7909K9190J6549
8721E4534o515j9251N891j456p703j5169j3021n550M916M640J2181M391q907m289
8707D692o562J2133k812O365K443k955P149Q311p433p809p315o124M543m64J3643
8692A7805J2450n351J2144M715l589L873l563N509N629q981o066j4811r977l953
8678E834M209O980k894K361N858J1664n591j4908j9029l471P184m230q298o011
$$ y = [-6228, 7915, 10916, 10865, 5276, -8657, -14129, -2295, 8610, 19550, 28682, 39330, 32861, 27601, 22692, 18955, 31667, 23142, 16748, 13041, 17651, 25104, 20652, 11169, 15494, 12905, 9640, 14911, 16479, 8022, 2446, 10650, 9998, 13042, 6163, 1739, 5785, 17032, 13805, 8126, 13628, 24921, 26832, 19084, 10620, 9713, 14323, 13000, 6354, 20818, 21941, -2057, -15349, -9114, 8795, 37985, 54534, 48019, 28768, 34659, 33203, 25500, 10331, -2690, -8240, -3324, 1316, 13497, 17888, 8981, 4692, -1870, 10263, 7451, 13816, 16259, 13304, 20453, 28764, 21331, 13522, 6207, 83, 4626, 4162, 17805, 30255, 24904, 37048, 41763, 38174, 42047, 38484, 43993, 49622, 40641, 34575, 19764, 9787, 5834, 10043, 17023, 14129, 16490, 22348, 34012, 28421, 13513, -5516, -8987, -1803, -6033, -14331, -20342]
8664b0342J1090L245J038J0605P03J4122k958n823Q853l227R55j065P88J3029
8650C1013J222Q743n984L94m126o474q090p764N796J601M302M839j7894K754L364
8635A3696n218q441R383M967L079j965m770j59J7372K976J158L828o790p539l073
8620A8504o553p851o410O319n542j1234Q644L095Q545q332N696j967K4701J0003
8606C7618l767J862R388j8711j8336q842o030J1357J205n622Q460J9668p636l590
8592A7024K531J07m410j247M294l729M560K854P705r304K342j442m908J3314P699
8577C7390J4684J8981M426j5628J217k229j3429l423j0511m502p943l832J0198
8564B5399L85O040J148l889m709j5989N276Q584k927k507r122N81k44J0124K808
$$ y = [-20342, -9252, -6007, -4969, 5636, 6339, 20461, 17503, 11680, 20533, 17306, 18261, 17196, 17984, 31013, 32235, 40978, 34994, 35388, 31262, 24788, 16698, 8934, 14730, 16331, 20633, 25472, 7578, 10332, 13696, 8478, 37, 9420, 14387, 17466, 15501, 10731, 10572, 27944, 30920, 32078, 35906, 29116, 21577, 18504, 11951, 4100, -2310, 4009, -1533, -12767, -4123, -1028, 7517, -815, 4881, 2914, 27615, 37618, 33851, 35713, 45101, 26390, 8054, -788, -6818, 4539, 5744, 122, 8582, 28250, 20614, 17024, 19555, 19662, 15252, 14005, 18299, 14570, 19130, 21984, 29689, 20385, 22727, 21285, 16377, 29691, 37390, 52074, 71055, 75481, 59853, 61070, 58841, 45412, 41989, 31478, 26976, 19033, 15201, 25399, 25784, 31824, 32972, 29083, 24374, 8385, 13661, 22245, 19318, 16811, 7689, 8270, 8026, 18150, 20958]
8549B0958o675l485P483j2621j4068o061l84Q563l993K679l682N335Q509k794
8535b36j581Q820j7771q798Q372q830Q664J0736N862P36m129P681r221P992M331
8520A2628j9152j199J4051m035J797J502j3821j501j754R891J864P029J426j1770
8506c044N345O776l510j3873j0765K0478J9110j225j5839o131Q52l195Q294J1387
8492A4660j589j2766o634P812J5266L982m237J415k0110j2283J21L492J485J990
8478g396O660j224R640k012j015K594k0338r393K766J0919J0665J322r065R177
8464C300J1229m91M9k716M674P076j764L992o912q519j1356l643K621j1497r07
8449a4864J9545Q126K363j0214j0540j1263o068q078K441K1j100J523Q192K427
$$ y = [20958, 14283, 10798, 18281, 5660, -8408, -14469, -14853, -6290, -10283, -7604, -11286, -5951, 2558, -236, -1817, 7003, -10768, -19566, -11194, -20024, -11360, -624, 5238, 5974, 1845, 9526, 305, 8297, 12628, -6524, -7723, 6328, 2293, 4090, 5592, -8229, -9730, -11484, -1593, 271, 7300, 8726, -3044, 2301, 9077, 5567, -8306, -19071, 1407, 20517, 19292, 3453, -2678, -1826, -5021, 3273, 14660, 13071, 305, -6329, 1483, 16749, 20731, 16494, 17909, -2201, -14484, -14363, -10871, -9386, -7396, -736, -1960, 7680, 5668, 4653, 7247, -13091, -22484, -19718, -8799, 1866, 3188, -5877, 3300, 14529, 14038, 14087, 11371, 16045, 23121, 21357, 25349, 18437, 9918, -1438, -5081, -2460, -13957, -14864, 4681, 12807, 15170, 4956, -5584, -16847, -22915, -30993, -28552, -28531, -29631, -28108, -19916, -17489]
8435a7489J4590J1963J037m368j0076P065l806l872P847N337m11l372R013O157
8421A9615k288o466n176j1811r880J986J1687J4377o224p801J1390M316K435j4110
8407B050k1402Q384Q364j2370l959J005l520o799r006R674J6935j116j0665M807
8393a7618j0379J5249J2285Q058K376p927l943J5479m209M35R915j2445K652K739
8379A2667j0148J749j0864j4458M872R35O351J761j165o098l468q75M046J3384
8365a311O749R302m636j1163j2463j21J1134j221J3585N408j7798j5856p012j3558
8351c8961K832J2553J1923P567j0249m445K1906P097J6201N31j1623n155M019
8338A4196l893j8040P015P188Q62O491j0085j4559j1921J778J1401J2603J109
$$ y = [-17489, -2899, 9064, 10101, 5733, -4343, 2722, -1084, -4956, 2891, 8228, 7817, 4445, 13458, 19615, 17327, 10861, 5685, -6126, -16006, -14020, -2333, 12044, 5820, -1981, 9409, 13725, 16160, 2050, -19352, -10968, -2604, -14974, -18933, -17928, -21448, -28247, -37253, -27579, -10644, -11760, -22425, -17618, -27997, -12748, -463, 7595, 9971, 2044, -1899, 13580, 9371, 9806, 19721, 7276, 9928, 12667, 2519, 4268, -6596, -21054, -16182, -15247, -8896, -7135, -8300, -14398, -17866, -18741, -14695, -1311, 5438, 14740, 10104, -1059, -13522, -13643, -2509, -3730, 9855, 15263, -2535, -18391, -25403, -38961, -36129, -23576, -11653, -4086, -14335, -18780, 3126, 10223, 26424, 26955, 15332, 10177, 14196, 10303, -7737, -722, 6466, 7328, 13819, 3734, -10825, -22746, -20968, -9567, 3036, 4145]
8325D145o672o806K031J3104k0550j2672K0595J3334k075Q28N964m588j335O008
8311A1311q72n466j1499q264p49l17K2667k364j7331q325j3949K0821K1105j941
8297D827l820p311r731j835K877k094J2830k985N717J817p112K754o642J5857
8283E149M557o864J182k045l033K446r208o526j0385J6535J6472P756l701K440
8269A4775k429L69j1157j9749J4981M112q947K980R259N62k485P992O63P893p181
8254A1638j6797p793R870r02o871n094j22o79P3J0411J4902j185k766j0067o852
8239a2234K294n22J692M790o335J2362J7867J1841N02k3843p666P641L262K644
8225A4295M826p65N804o918j2821j248K848N159Q806l289l808j1239o7J3289P743
$$ y = [4145, -2527, -9333, -7302, 5802, -14748, -27420, -6825, 6509, 4434, 5262, 11226, 6638, 5303, 11311, 10439, 4973, -6526, -14790, -15539, -15856, 6811, 4447, -12884, -21209, -35158, -14337, 6768, 4827, 1007, -6304, -16035, -17870, -14993, -17087, -4257, -7242, -1525, 292, -6820, -4066, -10708, 5149, 9706, 2842, 4024, 1979, -1054, 1392, -7816, -14342, -24727, -8192, 8280, 16036, 12335, 14775, 12346, 12715, 1558, -18191, -3210, 902, -8045, -5065, 4194, 4756, 2271, 10263, 10926, 18819, 11638, -5159, -12952, -3082, -3984, -10855, -15949, -16071, -16750, -16677, -6266, 8636, 7451, 4685, -5382, -12234, -9940, -10462, -8770, -3980, -10315, 2047, 19914, 31755, 32257, 8414, 748, 8389, 11651, 14295, 19121, 18356, 24160, 17242, 4421, 3173, 6021, 11180, 19986, 16697, 12889, 1650, 1583, 14872, 22615]
8210B2615J2847N335q211l857j5343o595O198J1832j1249K825K930l468l191j2654
8196A4n531P52P882p998m668l732j167Q993Q619J8554J7949N53l829k540J0281
8181D4132Q562Q104j321j8829j8261M574K0076p437j0274m722p834n433J0840
8168B2177j0248r296K472o140Q766Q185j0037O81M813P232L407k699j7604R757
8154A1466m405m84J2837J1228J0162j913l498q837p95j482p371o608K952p339
8140E913k3011J1152J4342l886N303J6835J3732J0147j8921p478L925O772K986
8127C7811j1589j0840O746J5312k792J4472q28n635p325j409O186N27n200J3739
8113D9175r870k940o270q423k277o992J639j65N535L973L0776J9035n451R004
$$ y = [22615, 35462, 40797, 32586, 28729, 13386, 6791, 12989, 24821, 13572, 16397, 19327, 15859, 12668, 14, -5517, -4765, 3117, -4881, -9549, -13281, -14448, -5455, 3164, 21718, 39667, 40220, 36391, 33851, 44132, 52694, 60798, 59477, 40648, 22387, 26961, 47037, 39600, 29326, 24604, 16770, 11337, 22177, 11929, 2633, 5105, -1035, 7731, 15916, 5879, 6560, 11373, 18605, 22012, 19313, 1709, 11466, 7061, 6577, 19414, 30642, 40804, 38891, 35393, 26556, 25761, 24279, 16908, 10300, 13252, 5913, -17098, -5946, 8396, 4510, 9813, 26648, 40380, 50527, 31606, 24128, 28053, 34825, 37811, 26222, 15382, 22128, 37440, 34648, 49120, 48292, 42657, 35332, 33923, 40109, 40636, 35436, 49175, 39305, 36365, 30095, 21672, 19395, 12403, 14042, 13877, 19412, 23385, 54161, 73196, 67745, 76749]
8099G6749j4235j7374j602j6251j5501q124N983O668P120K575j4308n448J4642
8086B0894R526j2421O389P75j8643p48J7311k681r930m189M537J382j2995O863
8072F070J8083Q532J764J2447R859l558j5552N091R656J406j2657j2875q466q816
8058A0984q339R727q640k310Q229L41k2J3987q92j3064k210J1625l918j3838l981
8043b321Q543J3915p433j3680j3646M268J8366k219m146R230L646k984K941K860
8029A7340j517r533R0P140k552m200j370j568K732L771K2595L084M595m081L227
8014C9753q873N262K757R2q248l819r150k855m326q460m588l743N609K916M738
7999G065l509N105Q172q92K726q267Q078j230P60r595k945n990m135L139J1184
$$ y = [76749, 62514, 45140, 43538, 27287, 11786, 3662, 9645, 16313, 23433, 26008, 11700, 6252, 20894, 30420, 17999, 24388, 25163, 6520, 5772, 23083, 20402, 10472, 6283, 10820, 12202, -793, 6070, 24153, 32685, 34449, 46896, 56755, 53197, 37645, 42736, 52392, 53798, 41141, 28266, 19800, 10984, 2645, 12372, 3732, 1422, 9651, 9992, 9970, 23957, 23065, 10001, 7791, 19416, 15498, 1660, -2321, 6222, 20137, 12704, -976, -14622, -10354, 8012, 5793, 1647, 10877, 14523, 11539, 14480, 17340, 15823, 6290, 6380, 13520, 10968, 6768, 5398, 3830, 6562, 10333, 32928, 36012, 40607, 36526, 39753, 30880, 36142, 38899, 38991, 30743, 26924, 17774, 14919, 10593, 2133, -2455, -6198, -589, 2327, 7065, 3556, 8661, 16833, 15941, 18667, 10400, 18478, 17248, 18008, 8413, 5468, -522, -4657, -1518, 9666]
7984I666N481P349K747J4248o156l124K764q171k971k26m211J132P587O00Q846
7969C5561m355j7438r79J358L764K283j947q776j0783l63J6006N505n78P281m075
7954B2464j6654k01j447l742J2169J7281P803j3264j3829l836k1145O078N30N692
7940b101N927J5588L491o476n283K382L550j1037n881k126M548J3471k832j7959
7926d738j2504p729P325K882K00J2721R082N499J628P258p430j3802j3576L510
7912i674r406k476m559R311J2600J3668n8r03L343n665Q256j0037n732q80J128
7897a084Q566j0820j119l895n125K902Q756J2789q354m917O447O088L824j1504
7883B554l46R292P198q21M287M383J360n216q635O315m517J038p76L353j107r172
$$ y = [9666, 15147, 22496, 25243, 39491, 33335, 30211, 32975, 24804, 21833, 21607, 17396, 18528, 26115, 26715, 35561, 31206, 13768, 12789, 14147, 17911, 20194, 18247, 9471, -1312, -1675, 14331, 19836, 19258, 26539, 22464, 5810, 5609, 4162, 420, 12589, 29870, 37673, 24409, 10580, 6744, -14401, -8323, -7793, -2101, 3826, 19414, 22905, 16429, 11146, 13528, 17078, 6041, 160, -1966, 2582, 16053, 13221, -4738, -17242, -24971, -17646, -14764, -14564, -1843, 7239, 12738, 14366, 21624, 14194, 392, -13184, -9674, -19080, -21556, -26115, -16804, -4204, 9464, 9406, 8503, 11846, 6181, 14437, 4400, -1332, -2212, -1084, 7482, -3338, -4457, -8352, -13477, -10575, -1819, 10970, 2616, -2301, 4146, 10234, 14058, 2554, 2208, 11500, 18698, 17877, 22164, 26547, 27907, 22691, 14056, 20371, 15854, 16892, 16116, 19469, 18362, 9190]
7867I190K691J024o385k566R42M123j879L922M574K05r236j1828o657Q591k688
7852e977m948Q867L425o134J5361R189N507m61j1903j4614M87L296J5489j297
7838A6287r732k610k362n568L464m92l306j0256m418J7701k683p46Q20Q950O929
7823A1978Q096J3769J643j2674m069j1662j0497o608J0470J1121k250n409J047
7810D955N328k827K732J1679o996q059J0303K520n230l612r194j6115P628K407
7796d481l202Q030M288p050L699Q81j0566r547J267N164J0530M331L081j5591
7782i166M330P457n670n60O583N843o309K873n53n762k73O037J3519l515j3433
7767A401M185N877L222j7337m150j0770L557K888O995o744l810L096N272N545
$$ y = [9190, 11881, 12905, 6520, 3954, 4896, 9019, 7140, 11062, 15636, 15841, 6605, -5223, -11880, -3289, -5977, -10925, -2058, 1367, -4767, 10594, 19783, 25290, 24829, 12926, -1688, -1201, 2095, 17584, 16287, 6555, 3945, 1583, -3985, -521, -1013, -4319, -14575, -18993, -1292, -3975, -4721, -3901, 5049, 11978, 20074, 33843, 35486, 22812, 18743, 7081, -3416, -10024, 446, 11567, 9317, 3908, 4955, 10283, 7456, 10188, 21867, 14871, 6812, 17115, 19635, 14405, 10793, 1599, -14516, -6888, -4481, -7683, 347, 4635, -2415, 1284, 2165, -8401, -17948, -16681, -11517, -987, 3344, 6425, -9166, -4836, 2621, -3049, -3609, 2974, 8817, 2508, 5381, 4828, -934, -1207, 4830, 18349, 14834, 1401, 5586, 11463, 14685, -2652, -6802, -17572, -14015, -11127, -4132, -10876, -14686, -11590, -6318, -773]
7753g73J2658o052j9981k414J353j2123l891K2309J5740O571k926o577R348n137
7739H105K582k725m191P20j058K335l800r365o325o154p632l308J5090M419O52
7724a0655J4247J8905m414k2497n769J1072J3899J192j5548l473Q250j1904n263
7711a1958L449m010L979J696m152m122M584J2897J2836J69j1818k309r73P941
7697H209Q05m73r711K043O112q710j0132j0396o323J5487J7062j0653j793r80
7683i453j266l882o82l32q301l888J2289M125l257Q418l217Q958L299J56J3277
7668A6244O393o468j7320j0184K293K50m22m33m248M987J4971J260j1796j0504
7654a4977M272J0622Q317O866o192k5503K047K229J5930R935r115j3862J0075
$$ y = [-773, 11885, 5833, -14148, -16562, -15209, -27332, -31223, -8914, 6826, 13397, 10471, 3894, 13242, 8105, 10687, 7962, 3771, 4491, 3433, 5768, 1968, -7397, -13722, -19876, -27508, -30816, -15726, -11307, -10655, 3592, 22497, 18083, -4414, -10183, 889, 14788, 15980, 432, -3041, 5209, -6695, -11958, -8509, -12519, -8540, -6844, -10996, -15118, -10534, 2363, 15199, 15368, 3550, 1241, 268, 8209, 9014, 8541, -1170, 873, 6985, -1725, -11857, -22253, -28576, -13089, 3973, -6680, -8473, -9453, -10719, -14601, -15283, -15615, -23916, -27804, -15515, -11390, -14647, -6229, -9446, -488, 2811, 2967, 16244, 22637, 16169, -1151, -11335, -9042, -8792, -9214, -9647, -13895, -8908, 6063, 7323, -4473, -14977, -10705, -83, 8234, 15100, 8908, -16595, -14548, -12319, 3611, 13546, 4431, -9431, 644]
7641F44L197j1021l321K747L966n318m202j0829J431J4923j85O495n355p885r45
7626a5658J619m358R715J8414L53j5694j4362J1531j944N547k350KP441j348l860
7611d952q041J665N402j2254k524Q640j34l36M914O748M126R191L349r956m715
7596A123j0396m51m084m03k941L757L696l852J2458J0754o559j3302M021J1468
7582E289k537m853n195O336J0436K339j5268j4497K867N808j411R108O707J1637
7568A6766m717p70l337j3459O206k635j398r166J61l127K246N587n335p479J22
7553b0335P01N810J1324Q999k158J8N042O55n714j7497o042o746J2489M256M374
7538d824P716o88q4j515j7345P933Q352j0030j65M200Q245R1j3075j3342R322
$$ y = [644, 3841, -7180, -10501, -7754, -3788, -9106, -13308, -24137, -22706, -7783, -7968, -1473, -6828, -14713, -15658, -14039, -18397, -8682, 9732, 10085, -5609, -19971, -8440, -10384, -4837, -7187, -7185, 256, -1092, -4952, -12993, -11328, -5926, -18180, -20704, -12064, -12198, -12534, -7620, -872, 3254, 12445, 15794, 5838, 1123, -9273, -9724, -13808, -14211, -17152, -13395, -9699, -13551, -1093, 9661, 3102, -10200, -6179, 5289, 2752, -2101, -7296, -960, 9476, 11815, -3453, -17950, -15083, -9275, -10686, -1578, 5129, 16766, 12049, 11279, 7942, -5517, 689, -1946, -3344, -12510, -12349, -15476, -13230, -7643, -12978, -20457, -20335, -19634, -13824, -2500, 6499, 4341, 4359, 9401, 10056, 4342, -13155, -19197, -25943, -13454, -9198, -4824, 2892, 2204, 2120, 605, -16740, -8807, -455, -10485, -10650, -6450, 1795, 1886, -11189, -24531, -15209]
7523a5209m254L969J0428J025M062p230o39r111m982o281J2696J019L938N51r171
7508a9189L144N468N021O667j252o326k759M990J853K108K304P383j538k3980
7494a6106q170P454O428J647m453K555L605J0122n842J433O061q335j8341r657
7480c1599O349O265j453P403P677K215q489j1112n431R421M993j3998L694K754
7466b1311k639j2044J682J4820k940Q519J1737M827m634r653J221p933J1986L002
7452c360J452L176p583q218q314Q206L239P593j4097j7325M281K658P90R710J7896
7437A04J0307j2509n625r922j4684J078J2274J3795l063j0427L028L92n710P631
7423a3331m861L631J0431L425j138K561j0800L158o669q225P308J1352q868j462
$$ y = [-15209, -19463, -15494, -5066, -4041, 21, -7209, -7848, -16959, -21941, -28222, -15526, -14507, -10569, -10018, -19189, -16045, -10577, -5556, 1111, -141, -6467, -9226, -4236, -2383, -275, 2029, 9412, 7874, -16106, -24276, -16822, -10394, -8747, -13200, -10645, -7040, 3082, -2760, -1327, 4734, -3601, -21942, -31599, -25250, -18985, -20438, -13035, -5358, -3143, -11632, -22744, -28175, -18754, -13761, -27759, -24065, -21311, -23950, -35994, -34312, -19492, -22432, -13913, -2176, 2651, -1983, -11636, -10415, -18348, -6362, -3360, -1908, 1268, -6315, -14533, -22847, -14641, -11402, -3809, -17906, -35231, -30950, -28292, -27502, -17792, 104, 10411, -2098, -7723, -17645, -32329, -31251, -18977, -5182, -8245, -18672, -15644, -15252, -20962, -13331, -18192, -14561, -4130, -705, -1843, 718, -10082, -6924, -13593, -21818, -14510, -3158, -12026, -13488]
7409a3488j0991Q020Q008J041J2624J4069l451O65J0782k323k3280q471l119o070
7395a5984p73J6794R088o205K665n923M165J3151j0261j812q422k0895J0023J659
7381a2730j0040N144K94m477J8311K156P77M898J509K188r590J415Q934q471m660
7366d342n30j4339J2271L5489J0882j9181j7032o968k909l151J3336J5732j1246
7353H012j6295k2226n632N198J7517J5507n659j3183L070R944J5880N315p476
7340I972M569K322r49o032L004n784j0113L213K742N749j732J236m561p694k200
7325f258l82p650P557J074k933q407n580r348N805J3854J7356O898r113o061O799
7310C611p022k3533M761P015Q230O610l572L014P220j39k234P797J1545R373r488
$$ y = [-13488, -24479, -16459, -8451, -7410, 5214, 19283, 15832, 16497, 27279, 24956, 1676, -6795, -9914, -15984, -16757, 37, 9125, 2920, 5585, -338, 3827, 16978, 6717, 4905, -3517, -24412, -14389, -12730, -22770, -17626, -17332, -21809, -3498, -1342, -565, 4333, 5842, 8030, -1560, -145, 8789, 318, -4342, -4872, -19211, -6940, 28549, 39431, 20250, 3218, -3750, -6659, -9810, 3526, 19258, 8012, -8283, -30509, -36141, -30943, -13426, 2081, -3578, -16761, -13691, -3747, 12133, 17448, 9972, 14541, 16863, 15914, 9882, 12886, 7102, -3011, 202, 2944, 8693, 6961, 8197, 3636, -4058, -6258, -6640, -14290, -6733, -5659, -8592, -16999, -22579, -31927, -26122, -12268, 5088, 11986, 2873, -3188, 3611, -3411, -26944, -22183, -15168, -6938, -328, -3900, -886, 6334, 6195, 3961, 11758, 23303, 32676, 23188]
7295B3188k4270r301p516p29M104k535R39J4218r242o523r76j4596j2511K532
7281d3218J6106J1760l423p427K061Q043K6029Q948n551k8845K817J2446J9494
7268A9240J0559L874m713j5051k8697k3072J973Q649J3741P79J4436j568j2574
7255a2424K001K998r22l573j2631r19j0596n87P430P245J523K357K1061J1355
7241A4318j4212j860M342p486j3858p66J3504P429q038j2075r977L355R091N902
7227a0331J268j1116J1423O664l674J2738J4503N872j390j5763L29j6890n105
7214a1472O304k073P470J4178P882n688L311N117o735K362O996Q624j7143j7390
7200A743q273J716n163J1424Q784n566J4153j819j1900r101n069p320P984n251
$$ y = [23188, -1082, -10383, -17899, -18628, -14524, -17059, -16120, -1902, -11144, -17667, -18643, -33239, -45750, -43218, -27112, -15352, -18775, -26202, -24141, -16098, 9931, 18879, 13328, -15517, -12700, -254, 19240, 29799, 33673, 28960, 13909, -14788, -37860, -35887, -27238, -13497, -12718, 1718, 150, -12424, -10423, -7425, -8347, -11920, -24551, -25470, -36066, -36653, -29223, -21978, -20455, -18098, 2963, 14318, 106, -1754, 2588, -4898, -18756, -19522, -6018, 1411, -6627, -18702, -28679, -25324, -16233, -10331, -9063, -20179, -8756, -2092, -5766, 6972, 21475, 27347, 25957, 10194, 10523, -6367, -11472, -5168, -7241, 229, 14407, 22289, 16601, 19912, 25029, 18294, 20656, 27652, 36276, 19133, 1743, -6530, -4814, -9977, 1447, 10231, 4665, 18818, 16999, 5099, -4002, -9071, -16391, -8407, -13658]
7186a3658r266Q967O091j18j518k265J7147j2842k3535n998M267J475O790Q875
7172a5588L304K70K802M774K308j6732O853K2951K692p678j001J2299q356p349
7158A549Q706K015p744j0701q826k087m110J0056K700O785P141K325O936p965
7144F780j2154J984j601K720J3589J334p660o793j1618n538l452J1460Q469M425
7130A945m422j0614N967l926j96J307J1787l694k677M799J0884Q551o001q015
7116E695j2203J623R081O61L198N744l004j943J2501Q776L051m005j5795j2496
7102H84j788k423o445j495N76L105K0L643m276l055j770l793m161k206l967J8520
7086h631J3147j0801q166J0232q77j0268k684O556J3990R321l409o827p739l235
$$ y = [-13658, -22924, -13957, -7866, -7984, -9502, -11767, 5380, -7462, -30997, -36995, -32728, -31253, -24463, -15588, -12284, -12014, -9212, -4438, -2130, -18862, -12009, 10942, 13634, 5956, 4955, 17254, 8898, 1549, 10255, 12270, 4526, -6175, -15001, -17088, -21198, -11142, -8442, -1657, 5484, 7809, 14745, 6780, -5374, -3390, -4991, -2271, 11318, 12652, 4992, -1801, -13419, -18957, -22409, -10949, -2480, 1945, -2477, -13091, -7124, -11050, -11246, -9939, 1848, -1846, -4523, 276, 11160, 19711, 13710, 5695, -6508, -4885, 4196, 4857, 8055, 13799, 10795, 8852, 21353, 30129, 33180, 29175, 13380, 884, -904, -3327, -9772, -11267, -10691, -7586, -7566, -3923, -8199, -11254, -13024, -16817, -20978, -23184, -27151, -8631, 4516, -6285, -14451, -4219, -5096, -15364, -18048, -11492, 2498, 11819, 8410, 1583, -6156, -9391]
7072i391J0193J22N650j1155p453l433L073L616j4394Q268J1842k484J932j934
7058e548q008n59J2649P547j3939L951O780m238k021n554j841N554J034R16J7668
7043A4391K919j9207r263P495Q67q034r865j796N407M049n59L407j290J9285L652
7028A1458j510O968J1002P397m197k3125K662N469M254q19j2348m145O852m616
7014E302L908m836k057p266k2710J0666P965j1352j862M633p61K341M921j2452
7000b3560o511j1464J6029J0809m97P523O268n978k929j6614K953M256J1560N587
6986b568o014r50J370K193k439Q431n41N800P947J057N27l191Q632n500l579j0693
6970D82q645N523j318Q0m950j0586p48J5037K475K880K619p486m74Q018J635J184
$$ y = [-9391, 802, 924, 6574, -4581, -12034, -15467, -12394, -8778, -23172, -14904, -3062, -5546, -3614, -5548, -13556, -14115, -1466, 6081, -7858, -3907, 2873, -1365, -3386, -8940, -10781, -5227, -4193, -3277, 14391, 17310, -1897, -11160, -3665, -2798, -10832, -20697, -22493, -17086, -13037, -13596, -10189, -11479, 7806, 11458, 9948, 16916, 27918, 35315, 31118, 7993, 10655, 16124, 20378, 19559, 7211, 3066, 9918, 5302, 9210, 4374, 2317, -4949, -27659, -16993, -9028, -20380, -22242, -17609, -18370, -16029, -11108, -23560, -30071, -41535, -25506, -14697, -15194, -7671, -1403, -7381, -10310, -26924, -23971, -19715, -8155, -2568, -8582, -9532, -8162, -5969, -8408, 23, -518, 5282, 13229, 14286, 14813, 11622, 20254, 14754, 11175, 482, -8163, -2640, -3958, -3878, -8828, -19414, -20162, -5125, -2650, 230, 2849, -4637, -5111, 2907, 4542, 5726]
6954E726O343q186j3378j4480r079O195j957P024N467N699k537J3742K917j4805
6940a1309n33L619j474l619R081J2167J8836j6493j0476j3113n752J2048J512
6927e506N424p344j1086M530L693j626O673Q498K951O275q46j0120k750j857J694
6912a397J2216L544P92j5920j8887m857J265m327N965J6515L376O818j2954l627
6898a1478J014N455J2372n124m329R79m837O280n956m497J2473L670Q9j3699j2397
6883a9985O19O34K706j88R289p518M075J2852J3866J286j2822p245M719j2174
6869i886L23O103k6q547n886J2100p990k852N200R755q25N954J0555J5740j605
6854B8113n611n214L155N472j139q501q836l519j904j052n427l54j670j660j012
$$ y = [5726, 12069, 3883, -9495, -23975, -33054, -26859, -28816, -21792, -16325, -10626, -13163, 579, 3496, -11309, -11842, -8223, -9697, -13316, -4235, 7932, 26768, 10275, -201, -13314, -19066, -7018, -5506, -82, -7426, -18512, -13982, -10289, -11915, -5242, 3256, 6207, 12482, 11636, 1516, -1234, -3091, -1397, 10819, 14363, 15155, -765, -19652, -24509, -23244, -27571, -21606, -5091, -1715, 5103, -7851, -11478, -10464, -5009, 7363, 2239, -2090, -1111, -5948, 332, -5624, -10121, 2352, 6022, 6111, -7588, -19985, -19366, -18732, -16026, -16214, -6925, -14443, -10368, 2484, 16350, 17636, 4814, -2431, 2288, -9886, -9563, -3460, -3486, -12033, -17919, -5819, -13809, -16661, -11461, -1706, -2531, 3423, 13978, 29718, 28113, 22502, 17288, 20443, 25915, 24776, 16275, 7439, 3920, 2016, 964, -4463, -4817, -6487, -8147, -9159]
6839i159j6643p575K588J5499Q298q367n506J3999L403p546P970j2250q509K295
6825b1503J4038N553l655J5602J1772j5189k1486k193J3212R073J0680j1617j632
6812B655J0076J31j836J2385J810k406j1073j200J1428J562n298o9R224N527j8504
6797A4412l911M991k306r093O328l684O63R903m910k0717p465k088m1K300P476
6782h142N629o530L116P81M599Q640k876n459j484m228j3219O37l750l194L911
6767b1569J543J2184L313j839L099N046j153o915j485J7724K929l408J742m203
6753G008j1635K808j3963j5439j488L66k33P855J0101p371N153L325J81J0980
6739b352J1075j1784j4104k049L603K756l528J818O875j84J4477J984k591p119
$$ y = [-9159, -25802, -33377, -30789, -15290, -6992, -15359, -20865, -6866, -3463, -11009, -3039, -15289, -23798, -21503, -7465, -1912, -5567, 10035, 21807, 6618, -14868, -17061, -3849, 5224, 15904, 4287, 2655, 12731, 12862, 11026, 23411, 25221, 22815, 11742, 10542, 21970, 23532, 18234, 18165, 27389, 32916, 14412, 10501, 15492, 13186, 4093, 10421, 6737, 7400, 17303, 12393, -8324, -15789, -17877, -17918, -15618, -8142, -2513, -9043, -5927, -5146, -547, 8093, 5217, -242, -1726, -5954, -19173, -18536, -22286, -25480, -21569, -20026, -7842, -4529, -6368, -3269, 1777, 624, -6291, -7776, 9948, 12877, 9469, 11211, 7008, -4627, -1819, -15782, -31221, -32709, -32343, -32576, -24721, -14620, -21991, -16838, -13513, -13332, -2352, 8723, -3061, -17165, -19214, -15611, -12855, -16383, -14565, -7690, -7874, 6603, 8587, 5996, -1123]
6725a123l527m60K046l213j1190L163l957M107N229j0194N57J6455K984q043o790
$$ y = [-1123, -4650, -5110, -3064, -6277, -17467, -14304, -18261, -14154, -8925, -19119, -18562, -2107, 877, -7166, -13956]
$$ [...]
##END NTUPLES=NMR SPECTRUM
##END=
