##TITLE=Analysis number 316612
Compound Code mo 07798
Book Reference 444/70
Project Code adrs
Chemist Name howarde
##JCAMPDX= 6.0         $$ Bruker NMR JCAMP-DX V2.0
##DATA TYPE= NMR SPECTRUM
##DATA CLASS= NTUPLES
##ORIGIN= Bruker BioSpin GmbH
##OWNER= nmr
$$ XWIN-NMR		Version 3.5
$$ Fri Jan 20 12:44:15 2006 GMT Standard Time (UT+0h)  MAYBRIDGE\nmr@NMR_250MHZ
##.OBSERVE FREQUENCY= 250.131544655141
##.OBSERVE NUCLEUS= ^1H
##.ACQUISITION MODE= SIMULTANEOUS (DQD)
##.ACQUISITION SCHEME= undefined
##.AVERAGES= 16
##.DIGITISER RES= 18
##SPECTROMETER/DATA SYSTEM= dpx250
##.PULSE SEQUENCE= zg30
##.SOLVENT NAME= CDCl3
##.SHIFT REFERENCE= (INTERNAL, CDCl3, 0, 16.522)
##AUDIT TRAIL= $$ (NUMBER, WHEN, WHO, WHERE, WHAT)
$$ ##TITLE= Audit trail, XWIN-NMR		Version 3.5
$$ ##JCAMPDX= 5.01
$$ ##ORIGIN= Bruker BioSpin GmbH
$$ ##OWNER= nmr
$$ C:\u/data/dgb/nmr/ADRS/15050/pdata/1/auditp.txt
$$ ##AUDIT TRAIL=  $$ (NUMBER, WHEN, WHO, WHERE, WHAT)
(   1,<2006-01-20 12:43:07.91 +000>,<MAYBRIDGE\nmr>,<NMR_250MHZ>,
      <created by zg, POWCHK disabled, PULCHK disabled
       configuration hash MD5:
       62 19 C7 07 E1 42 D1 B7 37 6C 3D D0 77 39 F9 E6
       data hash MD5: 64K
       CB 0C B1 FF 40 CB AF BA 6B BD 77 CE 3D 4D F9 B0>)
(   2,<2006-01-20 12:43:30.23 +000>,<MAYBRIDGE\nmr>,<NMR_250MHZ>,
      <Start of raw data processing
       ef LB = 0.3 FT_mod = 6 PKNL = 1 SI = 32K 
       data hash MD5: 32K
       12 7F D5 C6 0E AE 9C 9E F5 52 B9 CC B6 4A 3D D8>)
(   3,<2006-01-20 12:43:34.88 +000>,<MAYBRIDGE\nmr>,<NMR_250MHZ>,
      <apk 
       data hash MD5: 32K
       DF 22 38 63 3E C7 1B 50 AC 86 6F 1C 8C 95 2E 65>)
(   4,<2006-01-20 12:43:37.26 +000>,<MAYBRIDGE\nmr>,<NMR_250MHZ>,
      <abs ABSG = 5 
       data hash MD5: 32K
       F9 E4 78 CD 0D 4A C1 9E AD F7 4E 0F 7B 70 CA 82>)
$$ ##END=
$$ 
$$ hash MD5
$$ 4E 78 DE D2 C3 B3 08 23 92 8B F7 BF 2D 6F 9E 19
##$RELAX= 
##$RELAX= 
##$RELAX= 
##$RELAX= 
##$RELAX= 
##$RELAX= 
##$RELAX= 
$$ Bruker specific parameters
$$ --------------------------
##$DU= <C:\u>
##$EXPNO= 15050
##$NAME= <ADRS>
##$PROCNO= 1
##$TYPE= <nmr>
##$USER= <dgb>
##$AMP= (0..31)
100 100 100 100 100 100 100 100 100 100 100 100 100 100 100 100 100 100 
100 100 100 100 100 100 100 100 100 100 100 100 100 100 
##$AQSEQ= 0
##$AQ_mod= 3
##$AUNM= <au_zg>
##$AUTOPOS= <49 >
##$BF1= 250.13
##$BF2= 250.13
##$BF3= 250.13
##$BF4= 250.13
##$BF5= 500.13
##$BF6= 500.13
##$BF7= 500.13
##$BF8= 500.13
##$BYTORDA= 1
##$CFDGTYP= 0
##$CFRGTYP= 5
##$CHEMSTR= <none>
##$CNST= (0..31)
1 1 145 1 1 1 1 1 1 1 1 1 1 1 1 1 1 1 1 1 1 1 1 1 1 1 1 1 1 1 1 1 
##$CPDPRG= <>
##$CPDPRG1= <>
##$CPDPRG2= <>
##$CPDPRG3= <>
##$CPDPRG4= <mlev>
##$CPDPRG5= <mlev>
##$CPDPRG6= <mlev>
##$CPDPRG7= <mlev>
##$CPDPRG8= <mlev>
##$CPDPRGB= <>
##$CPDPRGT= <>
##$D= (0..31)
0 1 0 0 0 0 0 0 0 0.06 0 0 0 0 0 0 0.0002 0 0 0 0 0 0 0 0 0 0 0 0 0 0 
0 
##$DATE= 1137760978
##$DBL= (0..7)
120 120 120 120 120 120 120 120 
##$DBP= (0..7)
150 150 150 150 150 150 150 150 
##$DBP07= 0
##$DBPNAM0= <>
##$DBPNAM1= <>
$$ [...]
##$SUBNAM7= <"">
##$SUBNAM8= <"">
##$SUBNAM9= <"">
##$SW= 20.6930455092707
##$SWIBOX= (0..15)
0 0 3 0 0 0 0 0 0 0 0 0 0 0 0 0 
##$SW_h= 5175.983436853
##$TD= 65536
##$TD0= 1
##$TE= 294.16
##$TE2= 300
##$TE3= 300
##$TEG= 300
##$TL= (0..7)
0 120 120 120 120 120 120 120 
##$TP= (0..7)
150 150 150 150 150 150 150 150 
##$TP07= 0
##$TPNAME0= <>
##$TPNAME1= <>
##$TPNAME2= <>
##$TPNAME3= <>
##$TPNAME4= <>
##$TPNAME5= <>
##$TPNAME6= <>
##$TPNAME7= <>
##$TPOAL= (0..7)
0.5 0.5 0.5 0.5 0.5 0.5 0.5 0.5 
##$TPOFFS= (0..7)
0 0 0 0 0 0 0 0 
##$TUNHIN= 0
##$TUNHOUT= 0
##$TUNXOUT= 0
##$USERA1= <user>
##$USERA2= <user>
##$USERA3= <user>
##$USERA4= <user>
##$USERA5= <user>
##$V9= 5
##$VALIST= <valist>
##$VCLIST= <CCCCCCCCCCCCCCC>
##$VD= 0
##$VDLIST= <DDDDDDDDDDDDDDD>
##$VPLIST= <PPPPPPPPPPPPPPP>
##$VTLIST= <TTTTTTTTTTTTTTT>
##$WBST= 1024
##$WBSW= 4
##$XGAIN= (0..3)
0 0 0 0 
##$XL= 0
##$YL= 0
##$YMAX_a= 509911
##$YMIN_a= -523438
##$ZGOPTNS= <>
##$ZL1= 120
##$ZL2= 120
##$ZL3= 120
##$ZL4= 120
##$ABSF1= 16.522
##$ABSF2= -4.171173
##$ABSG= 5
##$ABSL= 3
##$ALPHA= 0
##$AQORDER= 0
##$ASSFAC= 0
##$ASSFACI= 0
##$ASSFACX= 0
##$ASSWID= 0
##$AUNMP= <proc_1d>
##$AZFE= 0.1
##$AZFW= 0.1
##$BCFW= 0
##$BC_mod= 0
##$BYTORDP= 0
##$COROFFS= 0
##$CY= 12.5
##$DATMOD= 1
##$DC= 0
##$DFILT= <>
##$DTYPP= 0
##$F1P= 14.0000005364418
##$F2P= -0.99999901652339
##$FCOR= 0.5
##$FTSIZE= 32768
##$FT_mod= 6
##$GAMMA= 0
##$GB= 0
##$INTBC= 1
##$INTSCL= 1
##$ISEN= 128
##$LB= 0.3
##$LEV0= 0
##$LPBIN= 0
##$MAXI= 10000
##$MC2= 0
##$MEAN= 0
##$ME_mod= 0
##$MI= 0
##$NCOEF= 0
##$NC_proc= -3
##$NLEV= 6
##$NOISF1= 0
##$NOISF2= 0
##$NSP= 0
##$NTH_PI= 0
##$NZP= 0
##$OFFSET= 16.522
##$PC= 1
##$PHC0= 237.8403
##$PHC1= 7.095495
##$PH_mod= 1
##$PKNL= yes
##$PPARMOD= 0
##$PSCAL= 4
##$PSIGN= 0
##$REVERSE= no
##$SF= 250.13
##$SI= 32768
##$SIGF1= 0
##$SIGF2= 0
##$SINO= 400
##$SIOLD= 32768
##$SREGLST= <1H.CDCl3>
##$SSB= 0
##$STSI= 32768
##$STSR= 0
##$SW_p= 5175.98343685301
##$SYMM= 0
##$S_DEV= 0
##$TDeff= 65536
##$TDoff= 0
##$TI= <Analysis number 999999
Compound Code 99
Book Reference 9
Project Code 9>
##$TILT= no
##$TM1= 0
##$TM2= 0
##$TOPLEV= 0
##$USERP1= <user>
##$USERP2= <user>
##$USERP3= <user>
##$USERP4= <user>
##$USERP5= <user>
##$WDW= 1
##$XDIM= 32768
##$YMAX_p= 408218353
##$YMIN_p= -128869
$$ End of Bruker specific parameters
$$ ---------------------------------
##NTUPLES= NMR SPECTRUM
##VAR_NAME=  FREQUENCY,     SPECTRUM/REAL,   SPECTRUM/IMAG
##SYMBOL=    X,             R,               I
##VAR_TYPE=  INDEPENDENT,   DEPENDENT,       DEPENDENT
##VAR_FORM=  AFFN,          ASDF,            ASDF
##VAR_DIM=   32768,         32768,           32768
##UNITS=     HZ,            ARBITRARY UNITS, ARBITRARY UNITS
##FACTOR=    0.157963299565203, 1,           1
##FIRST=     4132.6476996994, 0,             0
##LAST=      -1043.33573715361, 0,           0
##MIN=       -1043.33573715361, -128869,     0
##MAX=       4132.6476996994, 408218353,     0
$$ Real data points
##PAGE= N=1
##DATA TABLE= (X++(R..R)), XYDATA
$$ [...]
16472b28k9693K7028j0571k2351K0172m460p0m1561j3294j7702J7638L7861J073
16459c6158j406K6543K7883K473j7283o6289j3132N9692N4447J8066k4048l6359
16447e571R341k2608j8043j7840l3468J001J1859L7243N8519M0812K4521m3432
16435D2334m1419l5188j5223K5666j1385j0877M2480M452J3903l2062l026K8192
16423G847j925R588j4341j0372K3485K0746O903k578K185r196l0115k0894J8442
16410b25J4114J979J341r213M0092J4068j1859n3489k6736k0482k8076K0401K1577
16397c6508j8871k3688K650K0265K5582K4097J0250o899q216j8485m8167L4268
16385d3722M107j1022j2943j4500P863l2498j4762K1772O9746K2948j6363k6308
$$ plain form
16472 -228 -29921 -2893 -13464 -35815 -15643 -20103 -20173 -61734 -75028 -92730 -75092 -37231 -36158
16459 -36158 -37564 -11021 16862 19335 2052 -64237 -77369 -17677 36770 54836 30788 -5571
16447 -5571 3770 -18838 -36881 -54721 -88189 -87188 -75329 -38086 20433 61245 85766 42334
16435 42334 915 -34273 -49496 -23830 -35215 -46092 -3612 840 14743 -17319 -20345 7847
16423 7847 5922 15510 1169 -9203 14282 35028 41931 39353 41538 32342 2227 -18667 -225
16410 -225 13889 15868 17209 7996 48088 62156 50297 -3192 -29928 -50410 -78486 -58085 -36508
16397 -36508 -55379 -79067 -76417 -56152 -30570 -6473 3777 -3122 -11338 -29823 -77990 -43722
16385 -43722 -39615 -50637 -63580 -78080 -70217 -102715 -117477 -95705 -25959 -3011 -19374 -45682
16373d5682L3803L2126k3654k8342J0621L3933K056l5372j4008j0277J5837K8732
16361b27O474k4357o052L228k8490R739P360k594J2171M0748M3637M0545l6904
16348F5278k3029k4617L3622m8391k4458L5416k746Q120j6581l4104L833J6343
16336a1314O924J281Q437k8565q728J746K7143K3840Q149j3454l276R696M066
16323B5945K3585K5463k3175n7426j2464M44M84j0302k6386j4342o468J2936L1500
16310c0206K555J1184L979k9180p705Q383J3061M006M172M1516J5600J2986o850
16297D3501m2724k3035n147L549q039r431J3682K4124L1518k5614l5537K82J3255
16284a9616j5001K4725K1436M372o52j5509J4767M6277j4080L0834R603m9329
$$ plain form
16373 -45682 -11879 20247 -3407 -31749 -21128 12805 14861 -20511 -34519 -44796 -28959 -227
16361 -227 6247 -18110 -24162 -20934 -49424 -39685 -32325 -34919 -22748 18000 61637 102182 65278
16348 65278 42249 17632 51254 2863 -21595 13821 11075 19195 2614 -31490 -27657 -11314
16336 -11314 -4390 -3109 5328 -23237 -31965 -30219 -3076 20764 28913 15459 12183 21879 25945
16323 25945 49530 74993 51818 -5608 -18072 -17628 -17144 -27446 -53832 -68174 -74642 -61706 -30206
16310 -30206 -27651 -16467 -12488 -41668 -49373 -40990 -27929 -23923 -19751 21765 37365 50351 43501
16297 43501 777 -22258 -27405 -23856 -31895 -41326 -27644 -3520 27998 2384 -33153 -32871 -19616
16284 -19616 -34617 -9892 11544 15916 15264 -245 14522 60799 46719 77553 87156 37827
16272C7827j4071M726K3881R494J2814J720o3171m7568j6001J3616J9224J4564
16260b945j2396p55J9450k8277k889J2523J2846k3074l5846k60L3301K1718k8040
16247c4644J8078M2019J538m1344k0630K4255L2799K3281m8993k6548K1031K674
16235f484k1378j8711j2021L3484K3409m812M1611J6123j2225r577r079j8487
16223A853J9889L9397m8294k0370K3152K1515j8353j8238j6249j8902l529J572
16211c6557L797Q106J120j8224j0502M8379L3719j8492p350j09R305k1519J1444
16198C117L9084j5861l8354j3234Q441J3559j0686Q428K4395J668r294k6908k0997
16185c6642l921K9238K2777m949j0981K4846q434k5353J721K5485J9111K0429
$$ plain form
16272 37827 23756 28482 52363 61857 74671 76391 13220 -34348 -50349 -36733 -17509 -2945
16260 -2945 -15341 -16096 3354 -24923 -27812 -15289 -2443 -25517 -61363 -61623 -28322 -6604 -34644
16247 -34644 -16566 25453 26991 -14353 -34983 -10728 22071 45352 -3641 -30189 -9158 -6484
16235 -6484 -27862 -46573 -58594 -25110 -1701 -6513 35098 51221 38996 29419 20340 1853
16223 1853 21742 61139 12845 -7525 15627 37142 18789 551 -15698 -34600 -38129 -36557
16211 -36557 -32760 -24654 -23534 -41758 -52260 -3881 29838 11346 3996 3887 13192 -8327 3117
16198 3117 42201 26340 -12014 -25248 -16807 -3248 -13934 -5506 18889 20557 11263 -15645 -36642
16185 -36642 -40563 -11325 11452 6503 -4478 20368 11934 -13419 -11698 13787 32898 53327
16173E3327j3884k8278j9464j5746k1283K7498P694k9001n083L5661K3055l067
16161A1429j1478j5788j953J428N132k572L843P117k4758J3959N1729j981M652
16148D0759j0411m0162K0376M53l355J8249J6566q766R231j5404K4997J3589j2417
16135E3705j745J3545l6798k8699j3802K6700r065L8222k880j429l0613j0717
16123c576q105J3847k3333K0813O917J751p953p912j3856O294r729m9022j6585
16110i0449M0378K1864J5428q70j6149k715J144J3599K3478k1359j4775L3409
16098B983N152R426k7329J0181L6424l1714j3407J5949J8225O261l3002K06r824
16085a0469k0520n326J7534j4558L3926K7031J557l7748l2328j8720Q852j3227
$$ plain form
16173 53327 39443 11165 -8299 -24045 -45328 -17830 -10136 -39137 -44220 -8559 14496 11429
16161 11429 -49 -15837 -17790 -16362 -11230 -13802 -9959 -2842 -27600 -13641 38088 36107 40759
16148 40759 30348 -9814 10562 11015 7660 25909 42475 33709 42940 27536 52533 66122 53705
16135 53705 51960 65505 28707 8 -13794 12906 3841 42063 39183 37754 7141 -3576
16123 -3576 -11681 2166 -21167 -354 6563 8314 361 -7551 -21407 -15113 -24842 -73864 -90449
16110 -90449 -50071 -28207 -12779 -13649 -29798 -32513 -31369 -17770 5708 -15651 -30426 2983
16098 2983 8135 17561 -9768 413 36837 5123 -8284 7665 25890 32151 -851 -645 -10469
16085 -10469 -30989 -36315 -18781 -33339 587 27618 29175 -8573 -40901 -59621 -50769 -63996
16073f3996L996K891L8738j0571N921K8562l544j0145m843M7207Q817n2037m0561
16060d9565J8778N5449N0414k831j6391k9194l7613l7823k421k972o409Q146N5849
16047C417j8317j0722J3835o253J861q066r817L2988K556J987K2617q633k7528
16034a0075n110J9508n722J7576j4771j0780K2121k3864j4542m241j2072J4074
16022b7898N1692K1788k1462q192l0654j2008K1657k5968r799J2592J5916m051
16010a6387J0657m742j6081k3593L635q88N515L1864R859K7125J0098l3123j7021
15997a3082L1834K6655p478k1782k2773j012j6654j1799J7366L842L633K5432
15985A4182N498N263k7382L465K0862j387M169j1001k7188J7112L7657k9979l2998
$$ plain form
16073 -63996 -60000 -57109 -18371 -28942 -23021 5541 1997 -8148 -12991 34216 43033 -9004 -49565
16060 -49565 -30787 24662 75076 72245 55854 26660 -10953 -48776 -51197 -54169 -60578 -52432 3417
16047 3417 -14900 -25622 -11787 -18040 -16179 -24245 -34062 -1074 1482 3469 26086 17453 -10075
16034 -10075 -15185 4323 -1399 16177 1406 -9374 12747 -11117 -25659 -29900 -41972 -27898
16022 -27898 23794 45582 24120 15928 -14726 -26734 -5077 -31045 -40844 -28252 -12336 -16387
16010 -16387 -5730 -10472 -26553 -50146 -46511 -47399 -41884 -10020 -161 26964 37062 3939 -13082
15997 -13082 18752 45407 37929 16147 -6626 -7638 -24292 -36091 -18725 -14883 -11250 14182
15985 14182 19680 24943 -2439 1026 21888 20501 24670 13669 -13519 3593 41250 11271 -21727
15972b1727k5743j0745J3844R374K3525p104j1099N99k268p770j1132K5328M9878
15959B4960J2721l8243l1945K15j4025L4015L544q22J459j5131J9033K8902m6610
15946b1927k1400L4100L1386L803jN444R282l506l4704k2572K338J7389K4628
15933B4260p607l6129l4491J6037R785J6437L7826j9333j6678K861K332j6550
15921b1250l1374J1081N109J7512P155O549k706l601q530L82K4115M452K3412
15908C2306l020p779j5007n171J0984J3665q367j0984p473P223j510P337k1340
15895i136j6555J545K6271o411N837M137L7781L304m3853K496M3364j9810l5287
15882f317J4383O27j492j696N915J3167J8005m1914j3439P01j5968k9069J4818
$$ plain form
15972 -21727 -47470 -58215 -44371 -34997 -11472 -18576 -29675 -29076 -31344 -39114 -50246 -24918 24960
15959 24960 37681 -562 -32507 -32292 -46317 -12302 -8758 -9580 -8121 -23252 -4219 24683 -21927
15946 -21927 -43327 -9227 22159 25962 25961 31405 40687 37181 2477 -20095 -17757 -368 24260
15933 24260 16653 -19476 -53967 -37930 -28145 -11708 26118 6785 -9893 -7032 -4700 -21250
15921 -21250 -52624 -41543 -36434 -18922 -11767 -5218 -7924 -11525 -20055 -19673 4442 8894 32306
15908 32306 29286 21507 6500 1329 12313 25978 17611 6627 -846 6377 4867 12204 -9136
15895 -9136 -25691 -24146 2125 -4286 1551 5688 43469 46773 2920 5416 48780 28970 -6317
15882 -6317 8066 8693 7201 5505 11420 24587 42592 678 -12761 -12060 -28028 -57097 -42279
15869d2279L1207L3665K1110L659p751L583l5946j4908j0951R394N1643Q052m365
15856D6113q884k3246o374J5537j7504N089r938o278M002r625k6555K7437K4872
15843A4646J6154K1300j6800j0698J3279j6035k7095J0492r256m1925k811M0058
15831h691j374j5082m24N939N182M0655P569k9587o906P391j2440k6278N065K9435
15817D54j3715j7609j0556K4247L267k9957J7704K6848K252N301J0433j3261K2955
15804B8363L020J3745J8634R007k1140m0373j1503m552N4k7792L2030K5499k422
15791B2570p877n2488k1405K5142n808j544K2008N335P664K0420J9420l481j7187
15778A2769k6374J0027O626k9149j2136n968j0672P36j915K0858N932k0203K9278
$$ plain form
15869 -42279 -11072 22593 43703 47362 39611 43194 7248 -7660 -18611 -9217 42426 50478 46113
15856 46113 37229 13983 7609 23146 5642 10731 793 -5485 -1483 -11108 -37663 -10226 14646
15843 14646 30800 52100 35300 24602 37881 21846 -5249 5243 -4013 -45938 -48749 -8691
15831 -8691 -10065 -25147 -25571 -19632 -14450 26205 33774 4187 -2719 4672 -7768 -34046 -28981 454
15817 454 -13261 -30870 -41426 -17179 -13912 -43869 -26165 683 2935 8236 18669 5408 28363
15804 28363 31383 45128 63762 72769 51629 11256 -247 -4799 -4745 -32537 -507 24992 22570
15791 22570 14693 -37795 -59200 -34058 -39866 -41410 -19402 -14067 -6403 14017 33437 29956 12769
15778 12769 -13605 -3578 3048 -26101 -38237 -44205 -54877 -54141 -56056 -35198 -29266 -49469 -20191
15765b0191j3833J0330K8097J4236k487l0564R758l893n6501j055N7148K7828
15753A8873j7762J0742J6381j0587l5685j8611J0059k1147L7993L4581j8622P052
15741A3267K145k2438l8508k26L1063L4959j1656k4700q532J5689J2868J4448
15729A8379L3816Q36K840k420k1322j2611p091j258k3836l1029K5941K0930q548
15716e373k9334j6428K5875J2570j5999O754J6186N302L2725j453j2472m13k6185
15703h245q594Q920l8659o141J7741L2896L2922K9746L259k5961j9980r475q285
15690A44k5557K7101L0920J4314l2483n7305k7303K5494K7722K5582m858K7425
15678C1196k442l165q711j0633n7569k7452M0944M7846j657k3586L780j8682n055
$$ plain form
15765 -20191 -34024 -23694 4403 18639 16152 -14412 -4654 -8547 -65048 -66103 -8955 18873
15753 18873 1111 11853 28234 17647 -18038 -36649 -26590 -47737 -9744 24837 6215 13267
15741 13267 15412 -7026 -45534 -45760 -14697 20262 8606 -16094 -24626 -8937 3931 18379
15729 18379 52195 53031 55871 53451 32129 19518 12427 11169 -12667 -43696 -17755 3175 -5373
15716 -5373 -34707 -51135 -25260 -12690 -28689 -21935 -5749 -447 32278 30825 18353 17940 -8245
15703 -8245 -16839 -7919 -46578 -52719 -34978 -2082 30840 60586 63845 37884 17904 8429 144
15690 144 -25413 1688 32608 46922 14439 -42866 -70169 -44675 -16953 8629 3771 31196
15678 31196 28754 25589 16878 6245 -51324 -78776 -37832 10014 8357 -15229 -11449 -30131 -35186
15665c5186J2477J2986J8429J649j24K7889L885l3852k0272R751J5664J4998r534
15652A8760j3955l0802j6619Q623k1247K1761R752n73j1241j0341J872K1249k0373
15639d3134k137L5992K4073L1844j7742m6235k4009K7349L7837r795l1509L579
15627a3887L6078l085j0478J1142l0516m534P189q975k4926J1144M2479j1026
15615F05j1697P277k3505j6987j621O717K0334q556K4737K4823L5275M5367j1638
15602I1131j7323r650l5930k0605j4609P709K5443N595K346L3112r618n8988m2414
15589d3801l752J0664j997L0789K9851n25j8228Q330l6216j8576m076K3357J69
15576b4011j1934j193L0839L599J1574J4998L0917J7076k5086o7636j8979J6569
$$ plain form
15665 -35186 -22709 -9723 8706 10355 10231 38120 42005 8153 -12119 -2368 13296 28294 18760
15652 18760 4805 -25997 -42616 -33993 -55240 -33479 -23727 -24300 -35541 -45882 -44010 -22761 -43134
15639 -43134 -45271 -9279 14794 46638 28896 -17339 -41348 -13999 23838 14043 -17466 -13887
15627 -13887 22191 19106 8628 19770 -10746 -15280 -8091 -17066 -41992 -30848 11631 605
15615 605 -11092 -3815 -27320 -44307 -45928 -39211 -18877 -27433 -2696 22127 57402 102769 91131
15602 91131 73808 64158 28228 7623 -6986 723 26166 31761 34107 67219 57601 -1387 -43801
15589 -43801 -47553 -36889 -38886 -8097 21754 21229 3001 11331 -24885 -43461 -47537 -24180 -24011
15576 -24011 -35945 -37138 -6299 -2700 8874 23872 54789 71865 46779 -20857 -39836 -23267
15564b3267K9420l197J673p812p521K5944O458j0790j0863m667J6413K173J8882
15551C2846L8451m6029m5166J5345M4102l5108j7690k3259j9575k492J6969J7132
15539b4474J1970J2656Q693k1845m3384J1606L9032k8573l2745P578M6719M3006
15527C0239K0375q110m5101J2298Q298Q982j130j9183J8976P15p707J8591R455
15514D6698j0739k213l3901j3689J6167R750m1559k9764L595J9708K7499o498
15502a4946O329k47K0188L464l544k8777J5560Q670K5208J6820o4432J2485J2074
15489H852M208J5454j365q350K795k9881m1959r158L4991L2050N884J3254j4508
15476A2267p989m625k360l324J8291n665m928k6281j7377L018K5070k531M687
$$ plain form
15564 -23267 6153 2956 4629 -3183 -10704 15240 21698 10908 45 -4622 11791 13964 32846
15551 32846 71297 25268 -19898 -4553 39549 4441 -13249 -36508 -56083 -58575 -41606 -24474
15539 -24474 -12504 152 8845 -13000 -56384 -44778 -5746 -34319 -67064 -59486 -12767 30239
15527 30239 50614 42504 -2597 9701 17999 26981 25851 6668 25644 26359 18652 37243 46698
15514 46698 35959 33746 -155 -13844 2323 12073 -29486 -59250 -55655 -35947 -8448 -14946
15502 -14946 -8617 -8864 11324 14788 11244 -17533 -1973 6697 31905 48725 -15707 -3222 8852
15489 8852 13060 28514 27149 18799 21594 -8287 -50246 -59404 -24413 7637 13521 26775 12267
15476 12267 4278 -347 -2707 -6031 12260 6595 1667 -24614 -41991 -38973 -13903 -16434 -11747
15463a1747Q839j4985L2820L189k9544J3738L1352K3789J0942J7488k6878j9583
15451C9420N900k0966K706p096Q448n148P612J6370p810o2592o441J9095M827
15438e675l925K5186Q515K8284m636l9904k8626m2521L2785O2128R197k8543P898
15425B0163n420k5199K4933N869N933j30r365k2962K410J5046j0529J5145J118
15412A7012q781n007L2435J7046m3375j3117J9694J2418l1593l375J4980J4524
15400B2861J2628M473k8932k3422J0394J5659Q663J3445Q627j0651j637P743l7645
15387B206l8475R155M6856P464k098K1602j319l1403k4395k3650l6945K5467L8138
15374g397R081k92j0715j7258K0115Q832K1345j9138k4112m240N719L793K439
$$ plain form
15463 -11747 -2908 -17893 14927 18116 -11428 2310 33662 57451 68393 85881 59003 39420
15451 39420 45320 24354 27060 19964 28412 23264 30876 47246 39436 -23156 -29597 -10502 -5675
15438 -5675 -9600 15586 24101 52385 47749 7845 -20781 -63302 -30517 31611 40808 12265 20163
15425 20163 14743 -10456 14477 20346 26279 26149 16784 -6178 -3768 11278 749 15894 17012
15412 17012 8231 3224 35659 52705 9330 -3787 15907 28325 -3268 -6643 8337 22861
15400 22861 35489 39962 11030 -12392 -1998 13661 22324 35769 44396 33745 32108 39851 2206
15387 2206 -36269 -27114 19742 27206 25108 46710 45391 13988 -10407 -34057 -71002 -45535 -7397
15374 -7397 1684 1392 -9323 -26581 -6466 2366 23711 4573 -19539 -23779 -18060 -14267 -11828
15361a1828k4397k5479L554K6359K8287M4051k146R568J0760j5908r791k4525
15349H505J569O279j8553J925k8747J6936J9769J3438P928k6593k1909m785K6397
15336B159K2510J1290j3266j876l2653j8326K2893L1945q504l8611l383J2830
15324a2992k1261j6748J5161m731r764l4396J8267J1009j7864N1790K7682K0150
15312B6303k129P50j7915J1489J4127K1487p552m0870N330R356o401k0857L437
15299c445P686j9327j973k8317p937J7714O035K4101J2704j9586k9834j427K3794
15286a9812J1366O292j0301l246K3456N106j7902k7963K302M2718j777j0495r119
15273i375J6366O170J927l426J0520j2195j7606J6642m320J9780k0528l5134K1865
$$ plain form
15361 -11828 -36225 -61704 -58150 -31791 -3504 40547 38401 47969 58729 42821 33030 8505
15349 8505 10074 16353 -2200 -275 -29022 -12086 7683 21121 29049 2456 -19453 -24238 2159
15336 2159 24669 35959 22693 20817 -11836 -30162 -7269 24676 16172 -22439 -25822 -12992
15324 -12992 -34253 -51001 -35840 -40571 -50335 -84731 -66464 -55455 -73319 -21529 6153 26303
15312 26303 24174 24924 7009 18498 32625 54112 46560 5690 11020 20376 13975 -6882 -3445
15299 -3445 4241 -15086 -17059 -45376 -53313 -35599 -29564 -5463 7241 -12345 -42179 -43606 -19812
15286 -19812 -8446 -2154 -12455 -15701 7755 12861 -5041 -33004 -30702 12016 10239 -256 -9375
15273 -9375 6991 13161 15088 11662 22182 9987 -7619 9023 4703 24483 3955 -31179 -9314
15260i314M4214P429k8386J2264J4637q921J966L6748J1517J959k5019m2777k4129
15247g812J5718J9638J016l0355j603k4080K2359J4643J3263j7053k0878k2850
15235c7994J6467J8287j0244m274O598J7388m1443m536L345L4616K8404N669j4218
15222A8065n4591r990R025M8534L9797r102m9739Q847N641k2454M5607n542j3888
15209A0210m686r421L8788K0497l9515P583p846q723j3032l1490q392J9286K8928
15196B187Q560J2269J8916j1359l4246N115K1572J2400j1232m79k7733L0592K5569
15183E2131n260p355J088j7893N446K3380J437j9277j3285L910J2951J5389k8263
15170B4399m5591K5582L2862j1623r338k5342O005m190k1778K2951K5082k8481
$$ plain form
15260 -9314 34900 42329 13943 26207 40844 31923 33889 70637 82154 84113 59094 16317 -7812
15247 -7812 7906 27544 28560 -1795 -3398 -27478 -5119 9524 22787 5734 -15144 -37994
15235 -37994 -21527 -3240 -13484 -17758 -11160 6228 -35215 -39751 -36406 -1790 26614 32283 18065
15222 18065 -36526 -46516 -37491 11043 50840 41738 -8001 846 6487 -15967 29640 24098 10210
15209 10210 5524 -3897 34891 55388 15873 23456 15610 6887 -6145 -37635 -46027 -26741 2187
15196 2187 10747 23016 41932 30573 -3673 1442 23014 35414 24182 23703 -4030 26562 52131
15183 52131 46871 39516 40604 22711 28157 51537 52974 33697 20412 24322 37273 52662 24399
15170 24399 -21192 4390 37252 25629 16291 -9051 -3046 -7236 -29014 -6063 19019 -9462
15158i462k3069N661K9028J2618J1755o086L532l184o180J2360l9155l0282O318
15145c6146J5998L1873m362j9098K0482j5701N22l758k0740K6020K6763q03n377
15132A5673J8022L5528q4m6476n574K4330J8691j1329j2895q342j4352N012J8392
15119C6596J6174p541k7313J3688j2807j6494j1465L9003J0580l078j8739J4852
15107C3456J9037j0833M52l0542n191l1540K0063J9497N885J0174J9793K3187
15095G3438j0284k6599K214l0834l4397q454J9758M825K0382L957J0639j3904
15083A0741k6441L1277L7709M422k1017o289J5218O30l2154J0333K1469p229n6216
15070a7547J0851O456o31M557N778k5584Q519K6028o96M027L6996J396j2482J4847
$$ plain form
15158 -9462 -32531 -26870 2158 14776 26531 20445 23977 20793 14613 26973 -12182 -42464 -36146
15145 -36146 -20148 11725 7363 -11735 8747 -6954 -6432 -10190 -30930 -4910 21853 21050 15673
15132 15673 33695 69223 69139 22663 17089 41419 60110 48781 35886 27544 13192 18204 36596
15119 36596 52770 45229 17916 31604 18797 2303 -9162 29841 40421 37343 18604 33456
15107 33456 52493 41660 42112 11570 6379 -25161 -5098 14399 20284 30458 50251 73438
15095 73438 63154 36555 38769 7935 -26462 -34916 -15158 -10333 10049 14006 24645 10741
15083 10741 -15700 15577 53286 57708 36691 30402 45620 46250 14096 24429 45898 38669 -17547
15070 -17547 -6696 -240 -871 3686 9464 -16120 -7601 18427 17731 21758 58754 60150 47668 62515
15056F2515m7541o4432j9404M1672L6993j353j6206J5182L1998J1265j6419l8381
15044d111K0034L2669M2163j7178j910j8352L306J9445J1804j0534r13j9872m6413
15031A0138K3947j501R478K0103l8952j7544K0513J2621j2664p586K0867K8068
15019F7488j0080k5255o159j071J9683J7635j2181k20p630j3545N162J8427K985
15006E5239j7029k0385J6191K8345J0812l5177j960k1910j7312K6133L590J1928
14994C8465k5528R23J1401r227J847q222Q58j4144O809J9305J5690Q530j8378
14981B8329j8462N484L9097P587j2924k719k279M359j1846K3411j2942l3360O422
14968B0157L1441J3219j7705o294j7644j7284J3441J213j9614K4029K6638l3215
$$ plain form
15056 62515 14974 -49458 -68862 -27190 9803 8450 -7756 7426 39424 50689 34270 -4111
15044 -4111 15923 48592 90755 73577 71667 53315 56621 76066 87870 77336 76423 56551 10138
15031 10138 34085 32584 42062 62165 23213 5669 26182 38803 26139 18553 39420 67488
15019 67488 57408 32153 25994 24923 44606 62241 50060 49840 42210 28665 33827 52254 55239
15006 55239 38210 17825 34016 62361 73173 37996 36036 14126 -3186 22947 26537 38465
14994 38465 12937 13860 25261 16034 17881 9659 10517 -3627 3182 22487 38177 46707 28329
14981 28329 9867 15351 54448 62035 49111 46392 44113 48472 36626 60037 47095 13735 20157
14968 20157 51598 64817 47112 40818 23174 5890 19331 20544 930 24959 51597 18382
14956A8382O325K9538k1763j1206J5976k5198m493K7609K2941L2732J9903J4768
14944A25514L8953K516J0662O9877N7784P9754J25306J33469K05984K78924K92733
14933A421476K62037J21337k1438j63626k45922k69359l16426k34504j52860q1950
14923C18765q6417n0276M890K4513k3330k8751j9100n235k2018L4120J0364k6886
14911A30639j1552j2098k1674k8344J0154k9347J4241K6472K2957q086k4963k4825
14899D3574n367l8294p674L1826K227k5240j555J3717O400Q998l5802R351K0409
14886B2570j3453k7139k828L947J8407K0002J5276j1014O298J1020m333j8855
14874A9898k344J6144N985M2659j681l5053j5555N152j1668q757k282N065K1964
$$ plain form
14956 18382 24707 54245 32482 21276 37252 12054 7561 35170 58111 90843 110746 125514
14944 125514 164467 166983 177645 247522 305306 385060 510366 643835 849819 1128743 1421476
14933 1421476 1683513 1804850 1783412 1619786 1373864 1104505 788079 553575 400715 318765
14923 318765 232348 182072 186962 211475 188145 159394 140294 135059 113041 147161 157525 130639
14911 130639 119087 106989 85315 56971 67125 37778 52019 78491 101448 93362 68399 43574
14899 43574 38207 -87 -7761 24065 26292 1052 -503 13214 19614 28612 -7190 2161 22570
14886 22570 9117 -18022 -20850 -16903 1504 21506 36782 25768 32066 43086 38753 19898
14874 19898 17554 33698 39683 82342 80661 45608 30053 35205 23537 14780 12498 17563 39527
14861C9527J9022o373m8344k0510J6960L0013O39k1273j9841j3725K3046P365
14849F506k4209j3210R578J2470m799o51j2104n985q210j3488O971J8341L597
14836b5193J7117K0114K8898p755J4091J4585l79q391K1188r19l5284P99L6606
14823G5477L7229m743l6838j2395J1163L0223l2223j8422j918L0846L0177J7429
14811A26005k1330j9335m2374k6909L000q572j131J4244j0787J3970L1674k0960
14799C7495K775n631k1585j8839k5267l955N506J2877j824K6148L3272M7606N4098
14786A42676J0384J9107l669k4531j0079k0960k3788n283Q169J572M285J5421
14774A13304K0616p099j1073K3847j3041j2764J1009J2276j4213p437o928R430
$$ plain form
14861 39527 58549 52176 3832 -16678 282 30295 30934 9661 -10180 -23905 -859 6506
14849 6506 -17703 -30913 -21335 -8865 -13664 -14315 -26419 -32404 -40614 -54102 -47131 -28790 -25193
14836 -25193 -8076 12038 40936 33181 47272 61857 61478 53087 74275 73356 38072 38871 75477
14823 75477 112706 107963 71125 58730 69893 100116 67893 49471 47553 78399 108576 126005
14811 126005 104675 85340 42966 16057 19057 10485 9354 23598 12811 26781 58455 37495
14799 37495 40270 34639 13054 -5785 -31052 -35007 -29501 -16624 -18448 7700 40972 88578 142676
14786 142676 153060 172167 168498 143967 133888 112928 89140 83857 92026 93598 97883 113304
14774 113304 133920 126821 115748 139595 126554 113790 124799 137075 122862 115425 108497 117927
14762A17927j9295k6094k0789J253K4500n017k9670l0971J147M1944Q488p64l312
14749E9347Q633O06L0189J426L7795M8061J2283K8428M651k2737m448r81K2086
14736B25339k1834j5083m5358k3875J1213m223k526J3563P598J653Q931j6369
14724A39029K9625P123j881J992l5442O460L995Q73n145l1732k5424L4046M9501
14711A73020O620m8384m4574J3181J9975L1091L0919M4628j4652l3292k6491k0843
14699A31198l60L038k3487l5647l1322j7665l2420q897j3202K1541j2430J0720
14687h933N0943O7856P200j3606r388K0732K4254J2957j6754n5368l9261l889
14675C6743M1377J6958K7868N8399p242J1657J9815O187K3502o429j0673k675
$$ plain form
14762 117927 98632 72538 51749 53002 77502 72485 42815 11844 12991 54935 63423 62659 59347
14749 59347 67980 68586 98775 100201 137996 186057 198340 226768 231419 208682 204234 203253 225339
14736 225339 203505 188422 143064 119189 130402 126179 123653 137216 144814 146467 155398 139029
14724 139029 168654 175777 173896 175888 140446 146906 150901 151774 146629 114897 89473 123519 173020
14711 173020 179640 131256 86682 99863 119838 150929 181848 226476 211824 178532 152041 131198
14699 131198 130838 133876 110389 74742 43420 25755 -6665 -15562 -28764 -7223 -19653 -8933
14687 -8933 42010 109866 117066 103460 94072 114804 139058 152015 135261 79893 40632 36743
14675 36743 78120 95078 122946 181345 174103 185760 205575 211762 235264 228835 218162 215487
14663B15487J4748Q881k2247J5385O752k0117q95L4245M4562M468l8278J8991
14651B81982k9054m5534k1221k4965P368N406j8583k9411q384J6071K9944L5970
14639A99589J0761K3709k0205N138k5203N863p625P473j6047Q32K3060P571j8329
14626A96587l367K0631P91K0628j3933J7929J5517n6325l3597K6398K3288j537
14614B13010M7554k227k2447Q180L248Q034j5519j158K7467M7114M2869K546j4445
14601C44226Q683k1425q277k0646o677J3120M0727l706k2322O01K8464J4368j1899
14588C55237r984J9233J7755r275j5357j2584M8198L5473N0546J0586j4k0838
14576D68976O795k8853l4094k398L5681K5846k2120k2106K9983J1931L9497L6922
$$ plain form
14663 215487 230235 239116 216869 232254 239006 218889 217994 252239 296801 301269 262991 281982
14651 281982 252928 207394 186173 161208 168576 173982 155399 125988 117604 133675 163619 199589
14639 199589 210350 234059 213854 218992 193789 199652 192027 199500 183453 184285 207345 214916 196587
14626 196587 193220 213851 214642 235270 221337 239266 254783 198458 164861 191259 214547 213010
14614 213010 260564 258337 235890 244070 247318 255352 239833 238675 266142 313256 356125 358671 344226
14601 344226 352909 331484 323207 302561 295884 309004 349731 346025 323703 324304 352768 367136 355237
14588 355237 345253 364486 382241 372966 357609 345025 393223 428696 479242 489828 489814 468976
14576 468976 475771 446918 412824 410426 446107 471953 449833 427727 457710 469641 509138 546060
14564E46060k3827m701L2630O528J2291L8521j2208o532K5179N1919M6596K1746
14552G34202K8802K8811K7438M1454N9629N7576M3393J261o288J2328k558M3218
14540A069266Q2438K3322L6863L1681R3225J14072R1908R8373M6433p483m859
14529A675239L8854M2987O1562N4387Q0290J09367L4249Q1411J15854R5783J20224
14518B510207J47179K14784J77284J82120K74466K87227L06689L77405M19978
14509D897339M97402N70521O91388Q07385R73398J208845J466107J661623J772725
14500A4546733J796585J813022J757691J854435K166753K876142M020379N856117
14492C6687857Q901420J4035936K2558380L4459247M7676379N7591034N7894638
$$ plain form
14564 546060 522233 517532 550162 556690 568981 607502 595294 588762 613941 665860 712456 734202
14552 734202 763004 791815 819253 860707 920336 977912 1021305 1022566 1016278 1028606 1026048 1069266
14540 1069266 1151704 1175026 1211889 1243570 1336795 1450867 1542775 1641148 1687581 1680098 1675239
14529 1675239 1714093 1757080 1818642 1873029 1953319 2062686 2096935 2178346 2294200 2389983 2510207
14518 2510207 2657386 2872170 3049454 3231574 3506040 3793267 4099956 4477361 4897339
14509 4897339 5394741 5965262 6656650 7464035 8437433 9646278 11112385 12774008 14546733
14500 14546733 16343318 18156340 19914031 21768466 23935219 26811361 30831740 36687857
14492 36687857 45589277 59625213 82183593 116642840 164319219 221910253 279804891
14485B79804891M5445646K1041812r250224l6488760n3647313n7470202n0750310
14478A38685540l9329673k7946692j8944167j2636935q383509n553684l696783
14471B2194097k509817j900888j674255j651504j703764j692321j594068j433175
14463H034305j221150r64655p35996n61971m45695l75770l21815k46861k23456
14454B936936k10454j58836j30256j25863j66247j40547q7019r6861r3307j34100
14444A593446j59874j34833p0241l8867l7061j6811j02492j10463p7171n8495
14434G87138l0983j8613O783j157m4853n9102l1330n0322p0857o2483k6508O698
14422D04411K3074L5048K3m9875q482J45l3308n2958Q205K7093l5819j4108l609
$$ plain form
14485 279804891 325250537 346292349 337042125 300553365 246906052 189435850 138685540
14478 138685540 99355867 71409175 52465008 39828073 31444564 25890880 22194097
14471 22194097 19684280 17783392 16109137 14457633 12753869 11061548 9467480 8034305
14463 8034305 6813155 5848500 5112504 4550533 4104838 3729068 3407253 3160392 2936936
14454 2936936 2726482 2567646 2437390 2311527 2145280 2004733 1917714 1820853 1727546 1593446
14444 1593446 1433572 1298739 1228498 1189631 1152570 1135759 1033267 922804 845633 787138
14434 787138 756155 737542 744325 743168 698315 639213 607883 557561 486704 424221 397713 404411
14422 404411 427485 462533 462556 412681 404199 404344 371036 318078 326283 353376 317557 303449 299840
14409B99840m39K0063k355j5161j8755K0476J800m4402K8893K2390l2518J9482
14397B99314J1596j2931m8094j8710L0672N614l5412k0760Q21K1229l6655l0666
14385A66018n2813J5467L5966L1631K2908k884k8456j3785J5779M051J914j5946
14373A79850P456J3578j0827k9325l5739K537p358p873j6590L3331N8887J8738
14361B06665j1321L2230J0967k2411q803j3919j2393k4465N797r496n597j2089
14349A35165L628K3552J0044q475j1669k5987K838N774J4198l6920k7004J0941
14337I6085k2464J0432q612m2150j4571K830N463O772J9949P866k47M2031O052
14324A09436m0953l2545l0905J4290J8184M584N876P567m552R665J8k3211R400
$$ plain form
14409 299840 299401 319464 317109 301948 283193 303669 305469 261067 289960 312350 279832 299314
14397 299314 310910 297979 249885 231175 261847 267461 232049 211289 212110 233339 196684 166018
14385 166018 113205 128672 164638 196269 219177 216293 187837 174052 189831 193882 195796 179850
14373 179850 187306 200884 190057 160732 124993 127530 120172 112299 95709 129040 187927 206665
14361 206665 195344 227574 238541 216130 207327 193408 181015 156550 162347 152851 147254 135165
14349 135165 138793 162345 172389 163914 152245 126258 129096 134870 149068 112148 85144 96085
14337 96085 73621 84053 75441 33291 18720 21550 27013 33785 53734 61600 61353 103384 109436
14324 109436 68483 35938 5033 19323 37507 42091 47967 55534 50982 60647 60665 37454 46854
14311D6854J8767P38m2213k4146k3576l5711K229O335L2275M064P02n833M62J5762
14297c291N1732J1466J7136J7305K2330J9983L1513J5866L5258k3303J1117L5693
14285B42805J6671K1671L3883L8100M7256J0721J7123N300k6109k9055n4342k6666
14273B97358m6077J4539L2726M881j9109M712K7797j8531m0176l6727m7107k9972
14261A44314q899k2963l1392L3812L3546q342k060k2781r820j8207O978l1542
14249F2644k9919l0806k416J2099r867K7562R748o784J2561k022J1167J1146L2508
14236I7621R394K850l5605k3184j3421j5942j4419j8336j2327L162K9986K4914
14224C4693l5873j2245Q834J4843j440R356J8418L3007l0938k3339R634k496K204
$$ plain form
14311 46854 65621 66359 24146 0 -23576 -59287 -57058 -50723 -18448 -14384 -13682 -19515 -19053 -3291
14297 -3291 48441 59907 77043 94348 116678 136661 168174 184040 219298 195995 207112 242805
14285 242805 259476 281147 315030 353130 400386 411107 428230 433530 407421 378366 324024 297358
14273 297358 251281 265820 298546 303427 284318 289030 316827 298296 258120 221393 174286 144314
14261 144314 135415 112452 81060 114872 148418 140076 138016 115235 105415 87208 94186 62644
14249 62644 32725 1919 -497 11602 1735 29297 39045 32261 44822 42800 53967 65113 97621
14236 97621 107015 109865 74260 51076 37655 21713 7294 -11042 -23369 -20207 9779 34693
14224 34693 -1180 -13425 -4591 10252 8812 18168 36586 69593 38655 15316 24950 22454 24658
14211B4658l6522j4620k1804j9089J6042K2359j8450Q436k1563j4450R568o969
14199g2404r03K2043r44o883J9420J8989J1562L2780k6648j3635J5535M1050J4361
14186E4323j9435K6925M2320K2491L5476O9732J07242J16601J09564M0966M3288
14175F49493M1061m1376r2215j08706j13163n2767o8171m0901K8954M045j8402
14164A87852r425J634J751j7132m1698j3101J8494m629J8045RM8918L8911M2341
14151B71970M5325K6730M8142J6057k7343k0949m2558m1021n3567l7113J5548
14140B01221k0958k9093K2808K392j4638J2191N9012O3877L9474m2977k5258M6694
14128C14745K9144j7166m6083m870l0853n4934m1203k1358l5669k5082j074K5042
$$ plain form
14211 24658 -11864 -26484 -48288 -67377 -51335 -28976 -47426 -38990 -60553 -75003 -65435 -72404
14199 -72404 -73307 -51264 -52208 -59091 -39671 -20682 -9120 23660 -2988 -16623 -1088 39962 54323
14186 54323 34888 61813 104133 126624 162100 231832 339074 455675 565239 606205 649493
14175 649493 690554 649178 556963 448257 335094 282327 214156 173255 202209 206254 187852
14164 187852 178427 180061 181812 164680 122982 109881 128375 123746 141791 141800 190718 229629 271970
14151 271970 317295 344025 392167 408224 380881 359932 317374 276353 222786 185673 201221
14140 201221 180263 151170 173978 176370 161732 173923 232935 296812 336286 293309 268051 314745
14128 314745 343889 326723 280640 275770 244917 189983 148780 127422 91753 66671 65597 90639
14116I0639j7013j5842O782k198j6092P124r306j9344p163j7986o13k37P792J0193
14102A6736k8095j166L3523J2622o674j8350Q346k6719l9788j3999J102K9319
14090c3143J0384R086K4188O444k1402J8427L5762o353k5110k3350k5511J7419
14078a3159L2779j7033k1025R55N8978Q431L701o39j0705j7776m252M687L0295
14065E5237k764k8873l8251j0119M3454P384j3901k3817j9598o52M737j1550M3248
14052D535N3231K8148L337j7373r639o410J5390K2925p502K5054k434L1504N0044
14039A90810J2394Q256N3453Q2530J77608K17564K76081K98905K62232J63892
14029A743725j0845j49391k39606k73627k85778j98360j23071j19259r9579n1578
$$ plain form
14116 90639 73626 57784 64566 62368 46276 53400 44094 24750 17587 -399 -1012 -1249 6543 16736
14102 16736 -11359 -12525 20998 33620 26946 8596 16942 -9777 -49565 -63564 -62462 -33143
14090 -33143 -22759 -13673 10515 16959 -4443 13984 49746 43393 18283 -5067 -30578 -13159
14078 -13159 19620 2587 -18438 -17483 41495 49926 53627 52988 42283 24507 20255 24942 55237
14065 55237 52473 23600 -14651 -24770 18684 26068 12167 -11650 -31248 -31900 -27163 -38713 4535
14052 4535 57766 85914 89251 71878 62239 55829 71219 94144 86642 111696 109262 140766 190810
14039 190810 203204 211460 264913 347443 525051 742615 1018696 1317601 1579833 1743725
14029 1743725 1732880 1583489 1343883 1070256 784478 586118 463047 343788 244209 192631
14019A92631J03N2911J7718o4432m1743n8713k9956j1171j4663K08L5881J9727
14007I8501k8732p1639M552L6543J3827k3624j7779J1462O736O012P790j9003
13995B4646k2512j0488p240J1426K166J2352R33j4305J2777K0642L0947Q830m5819
13982B4355k3511J4353Q037l481k0319L8663J9858j3599L743R548q574j5037j6668
13969A7368j1292J8097K1322m1142l2754J3969R721q136k4023O488J826l814j515
13956c3885J2684L7380K1454k1298P189M278K1659R24n293j608P765l0058k3122
13943a931M3609p766J6736q636J0592R319M1291K946l2116k723n967L294P224
13930G5872J7906k289N7860R9618J58512J54242J53482J02530M9390l4714j03050
$$ plain form
14019 192631 192734 245645 263363 198931 157188 98475 68519 57348 42685 42893 78774 98501
14007 98501 69769 -1870 2682 39225 53052 29428 11649 23111 29847 35859 43649 24646
13995 24646 2134 -8354 -15594 -4168 -2002 10350 11283 -3022 9755 30397 61344 70174 24355
13982 24355 844 15197 23234 19753 -566 38097 57955 44356 48099 57647 49073 34036 17368
13969 17368 6076 24173 45495 4353 -28401 -14432 -4711 -12847 -36870 -30382 -28556 -32370 -33885
13956 -33885 -21201 16179 37633 16335 23524 27802 49461 50385 45092 43484 51249 21191 -1931
13943 -1931 41678 33912 50648 42012 52604 61923 103214 106160 74044 71321 65354 68648 75872
13930 75872 93778 91489 149349 248967 407479 561721 715203 817733 867123 832409 729359
13919G29359j26555j91257j44568p3155o1174m4270m130k8195j7624J8022J5553
13908G2006k0516n0346k5283M212J8998K4768o281k9832k2772j4912R947j2222
13896e2233J1043l535N985J5595k4602k3473J5335K7354L1920j009R316J5508
13884B7204O785k5193m9653m109J3229J4578o220O695r086J2994J0329j7433l3839
13871e3719r639L8816k7930q507J8448L0092j9991K1663N8096k017k4410k4036
13859c134l20k213J0061K1452K1828k2369K6891p640k6345k7162J1727K264L214
13846H254j2526k5246j0001k7002K4189L9093J5149P203j2531N959K7523j4857
13834B5207j7952j3801K8640J579J5601q475k671j8393r922K3100k945j0284M198
$$ plain form
13919 729359 602804 411547 266979 193824 132650 88380 84250 56055 38431 56453 72006
13908 72006 51490 1144 -24139 -19927 -929 23839 17558 -12274 -35046 -49958 -40011 -52233
13896 -52233 -41190 -44725 -38740 -23145 -47747 -71220 -55885 -28531 3389 2380 11696 27204
13884 27204 33989 8796 -40857 -44966 -31737 -17159 -23379 -16684 -25770 -12776 -2447 -19880 -53719
13871 -53719 -63358 -24542 -52472 -60979 -42531 -12439 -32430 -10767 47329 45312 20902 -3134
13859 -3134 -3454 -5667 4394 25846 47674 25305 52196 44556 18211 -8951 2776 5040 8254
13846 8254 -4272 -29518 -39519 -66521 -42332 -3239 11910 19113 6582 12541 40064 25207
13834 25207 7255 -6546 22094 23673 39274 30799 28128 9735 -187 22913 19968 9684 13882
13821A3882n72L7764k3781k7206Q634P836l8994k6014j0455k687M2748O239J0677
13808a929J3561O3337j1000j5748R41k6359r700l923L252M37j9635Q076J7704
13795A9014p932O939r12j4041l5030J0757K4410M354j772j6453l3292J9306M0910
13782A6258q915k7539L410j2254N667M4528p137j7767J143l4950k1719k7178O213
13769h0240L3445K7987k6185K310J7807o082L84J0484k246q098R672j4997k0237
13756e5996p18J3058L5864J1323K5453K6614J1115k5550l9433j6729l3984J6629
13744c2354K0117J0618k7320j4831J7212j9388q808J0781R335j0598K3895L4437
13732A3096K2713j3371j9987j3991p812K0574L8987K3118k7518j8850j4091n658
$$ plain form
13821 13882 13310 51074 27293 87 8721 16557 -22437 -48451 -58906 -61593 -18845 -12606 -1929
13808 -1929 11632 74969 63969 48221 49162 22803 13103 9180 12432 12869 -6766 1310 19014
13795 19014 11082 18021 17109 3068 -31962 -21205 3205 7559 5787 -10666 -43958 -24652 16258
13782 16258 7343 -20196 -16786 -29040 -23373 21155 14018 -3749 -2606 -37556 -59275 -86453 -80240
13769 -80240 -46795 -18808 -44993 -42683 -24876 -30958 -30574 -20090 -22336 -30434 -20762 -35759 -55996
13756 -55996 -56714 -43656 -7792 3531 28984 55598 66713 41163 1730 -14999 -48983 -32354
13744 -32354 -12237 -1619 -28939 -43770 -26558 -45946 -54754 -43973 -34638 -45236 -21341 13096
13732 13096 35809 22438 2451 -11540 -19352 1222 40209 63327 35809 16959 2868 -2790
13720b790j6086l0616K1850J8027k6590K280J6616q669J0117K0439L2809k0487
13708A6900l7819l1911M0366M3974p88j3293o656l6677j5844J7226k4607l0716
13696g9845J7919K6124p017p191O717j4054Q267K6589l849k5641M247L8390p015
13683a6359o240j4589j6261L8666j585P914j2820J2596J5273j4288j0894j8254
13671c6841P464o945j476J077o224P534k462J8648L568J3344O665L9731j426k2954
13657A9703K4186Q71j9759k9506P41O041J0465j2512P083o432r558p757L610J4299
13643A475K0488k9567j6298J4618J5492J459q709l471j5969j681K3131J4304o134
13630I138k5802j0503m496Q216n84Q291K3651O85m458J3800P531k3036m953K5172
$$ plain form
13720 -2790 -18876 -49492 -27642 -9615 -36205 -33925 -17309 -25978 -15861 4578 37387 16900
13708 16900 -20919 -52830 -12464 31510 30722 17429 10773 -25904 -41748 -24522 -49129 -79845
13696 -79845 -61926 -35802 -42819 -50010 -43293 -57347 -49080 -22491 -26340 -51981 -47734 -9344 -16359
13683 -16359 -22599 -37188 -53449 -14783 -16368 -8454 -21274 -8678 6595 -7693 -18587 -36841
13671 -36841 -29377 -36322 -37798 -36721 -42945 -35411 -37873 -19225 -15657 -2313 4352 44083 42657 19703
13657 19703 43889 44760 25001 -4505 -3764 2277 12742 230 7313 881 -8677 -16434 -12824 1475
13643 1475 21963 -7604 -23902 -9284 6208 7667 -1042 -4513 -20482 -22163 968 15272 9138
13630 9138 -16664 -27167 -31663 -23447 -24031 -15740 7911 8596 4138 17938 25469 2433 -2520 22652
13616B2652J2184J9426k5326j807k6407Q675k7641K4889M1038K8821J7020j2289
13604H1235k759l6668l4384k3103k5428K592k197Q969L7561L7402j3310o4132
13592c4222j0622L8238K0499q526k6829P260K1994r336l8200k0776K0628M5576
13580E684Q451K346J2367Q293K702J7378m514P056k4291M508J6225k7983p0907
13567d2685k1434L4326J6196k3497L7212r795K705n827m236R010q304k463N638
13554a3154l0421P940J130J498P496O0635J5921n690m57m991k0725k413j9971
13541c202l0321l1810M1186N4943k2612J1429J5930j8257k4896j7268J3215M6475
13529C4812J1846j9027m842k0894k9555Q306L0122O877m8285j2989o343k195j8810
$$ plain form
13616 22652 34836 54262 28936 27129 722 9397 -18244 6645 47683 76504 93524 81235
13604 81235 78476 41808 7424 -15679 -41107 -38515 -40712 -31743 5818 43220 29910 -34222
13592 -34222 -44844 -6606 13893 5367 -21462 -14202 7792 -1544 -39744 -60520 -39892 5684
13580 5684 14135 16481 28848 37141 39843 57221 52707 59763 35472 39980 56205 28222 -42685
13567 -42685 -64119 -29793 -13597 -37094 118 -9677 -6972 -12799 -17035 -8025 -16329 -18792 -13154
13554 -13154 -43575 -35635 -34505 -33007 -25511 35124 51045 45355 44898 39907 19182 16769 -3202
13541 -3202 -33523 -65333 -24147 30796 8184 19613 35543 17286 -7610 -24878 -11663 34812
13529 34812 46658 27631 22789 1895 -27660 -19354 10768 17645 -30640 -43629 -49972 -52167 -70977
13516g0977j4021J6082K4500j1431L0477J927J539l010J8116J783o644N300n293
13503a1652j3563N453J3915M5766j4864j6022K8401m90r882j3741m1284K4490
13491c473K3906m335n286J4458J864m8942j3767J6885N0813K2336J0933j9833
13479D5559l2503K6775j4204m8440j4216p989J2519L4732Q324k1358k7028J2335
13467b5494P442l552N046L5022J0675J3552J0035J1812k6930m5029j2391k7449
13455d7261N748R275M826o427k557J6568J2236r214L5392J8728J4725l1917k5059
13442d937k1652l894K017k3517M9755J2312n067Q896j3711l3835k0131J4777J5643
13429b3344P938R426N424J4312j1387p372j52O86K0276J846K134L3507L239k3710
$$ plain form
13516 -70977 -84998 -68916 -44416 -55847 -25370 -23443 -21904 -24914 -6798 -5015 -11659 -6359 -11652
13503 -11652 -25215 -19762 -5847 39919 25055 9033 37434 36944 27062 13321 -27963 -3473
13491 -3473 20433 16098 10812 25270 27134 -21808 -35575 -18690 32123 54459 65392 45559
13479 45559 13056 39831 25627 -22813 -37029 -45018 -32499 2233 10557 -10801 -37829 -25494
13467 -25494 -18052 -21604 -16558 18464 29139 42691 52726 64538 37608 -7421 -19812 -47261
13455 -47261 -41513 -32238 -27412 -33839 -36396 -19828 -7592 -16806 18586 37314 52039 20122 -4937
13442 -4937 -26589 -30483 -28466 -51983 -2228 10084 5017 13913 202 -33633 -53764 -38987 -23344
13429 -23344 -15406 -5980 -556 13756 2369 -5003 -5155 -4469 15807 17653 19787 53294 56533 32823
13415C2823k0312o748l495P697P476k2855j5617K1389J4494l5852j407R252l087
13402a6242J9517J3117R215m805O11l867l9187J547K490k380j7523J2972R774
13389a4761l2864j3158L9857N4191M4168J8779K551l7053j5432k4407j8535M122
13377G458J0412k1483j1257J2101N547R682j5739p567K1799Q51J7615k2032j6628
13364i241J2364L0817j02l073O668j3241m77k7605j7434q222l3408O934N1350
13351d670N8l8885j3535Q659J4187N714j4121Q68r054Q650O525J5743N855J457
13337a2549k3635K5335J8809J2921j180r423r27j3635k5018Q140J1102K2731P4
13324A2745l1552j2086l860L916k1765K2623L060P690L740K471l539J15J0568
$$ plain form
13415 32823 12511 5763 2268 9965 17441 -5414 -21031 358 14852 -21000 -22407 -13155 -16242
13402 -16242 3275 16392 25607 20802 21413 17546 -21641 -20094 -17604 -19984 -37507 -24535 -14761
13389 -14761 -47625 -60783 -20926 33265 77433 96212 98763 61710 46278 21871 3336 7458
13377 7458 17870 -3613 -14870 -2769 2778 12460 -3279 -10846 10953 11804 29419 7387 -9241
13364 -9241 3123 33940 33838 30765 37433 24192 23715 -3890 -21324 -29546 -62954 -56020 -4670
13351 -4670 -4612 -43497 -57032 -48373 -34186 -28472 -42593 -41725 -50779 -42129 -35604 -19861 -14006 -12549
13337 -12549 -36184 -10849 7960 20881 19701 10278 9351 -4284 -29302 -21162 -10060 12671 12745
13324 12745 -18807 -30893 -34753 -30837 -52602 -29979 -26919 -19229 -15489 -13018 -16557 -16442 -5874
13311e874J6053n583p505m951k729K603k4676K4159J4917k8491l6044j2921l931
13298g4973N509K2389J9364M184j4850m0609p212k655L065K7811N1105R300j1603
13285i175J4439M13j6754k7196O851J4915J9565m6363j9650L4304K1572p951j329
13272a6359l2615J4086J2026l882K7589j9879J7910K6181K3802j999l1126M427
13260B0161J0953l4310k6744n064K3615J314K2382j8663n1891j04M9478R289m412
13247c996K4101j3829M907r66j8037L0628N806O826n84j2706k4202N2318K99m8618
13233A947k4297M9969J0642l5593p325N653K437J8821K3471j2419P635p550o197
13220B7194K4457k7053m061L221K3324N173J5771j54k7353p762M378l0684l6509
$$ plain form
13311 -5874 10179 4596 -2909 -7860 -10589 -7986 -32662 -8503 6414 -22077 -58121 -71042 -74973
13298 -74973 -69464 -47075 -27711 -23527 -38377 -78986 -86198 -88853 -85788 -57977 -6872 2428 -9175
13285 -9175 5264 5677 -11077 -38273 -31422 -16507 3058 -43305 -62955 -28651 -7079 -15030 -16359
13272 -16359 -48974 -34888 -22862 -26744 845 -19034 -1124 25057 48859 46860 15734 20161
13260 20161 31114 -3196 -29940 -35004 -11389 -10075 12307 -6356 -58247 -58351 -8873 416 -3996
13247 -3996 20105 6276 11183 10217 -7820 22808 28614 35440 34856 22150 -2052 50266 50565 1947
13233 1947 -22350 27619 38261 2668 -4657 996 3433 22254 45725 33306 40941 33391 27194
13220 27194 51651 24598 20537 23758 47082 52255 68026 67872 40519 32757 37135 6451 -30058
13207c0058J0663K363p181K5371o19j0459k1065N832R196P949J7571Q489o65r010
13193H377j5663l3212J0071J9410J6751p040j028J3354l383J1171j6436Q711K4633
13180C5716k8054k3087k397k120p855K7679m684p492K2813k2427l5644J8599J3698
13167a5255N724j568N781q249Q030N146j2322j7180K2838L7159Q699j0725o706
13154B1372R534Q224J9379l6863l9543r929R708p38o960N4089K7872j8395k562
13141C5188K9661k1927k8458j296j6030p39K6096j4404j0927r11N294J1209J881
13128A4637m0481j4465K0192K0150j5477k0595J647L877j0376J1506J5339p319
13116b1365l5721q189N582K1059K7909L2119J2604k7294k3184k6160L326M5062
$$ plain form
13207 -30058 -19395 -17032 -24213 1158 539 -9920 -30985 -25153 -15957 -8008 9563 18052 17387 8377
13193 8377 -7286 -40498 -30427 -11017 5734 -1306 -2334 11020 7637 18808 2372 11083 35716
13180 35716 7662 -15425 -17822 -19942 -27797 -118 -4802 -12294 10519 -11908 -47552 -28953 -15255
13167 -15255 -9531 -11099 -5318 -13567 -5537 -391 -12713 -29893 -7055 30104 38803 28078 21372
13154 21372 30906 39130 58509 21646 -17897 -27826 -18118 -18856 -25816 28273 56145 37750 35188
13141 35188 64849 42922 14464 13168 -2862 -3601 22495 8091 -2836 -3747 1547 12756 14637
13128 14637 -25844 -40309 -20117 33 -15444 -36039 -34392 -30515 -40891 -29385 -14046 -21365
13116 -21365 -57086 -65275 -59693 -38634 -10725 21394 33998 6704 -16480 -42640 -39314 5748
13104E748k188j1115L4400r418j0153K4731J3100k6558K6405n987k1829J854m2375
13091b3385k5299L2491J3133J5231l9964l5001M5860K1324N437M916k207J9978
13079C2514Q237k0913l4193o13L8560K3640J6640k5623j8595k1333p067l0918
13067c9664k5550m627J8197K6682j3545K2857K2652j931L5073j2930j0232m359
13055A2623l3281m637k1404P012K28K4377L0800N6439J0468j2091K148m8295j8751
13042E636o874J6122M14J4009n206l1121k027O824l712K2565O5n165j0137K606
13028C999J9761j4178m8736k6655L0844j5298j4076k563l865J8542M1680L3159
13016B2614J3425j6506k8379m4762J2785Q053J818o684L2499J4133k7892l3374
$$ plain form
13104 5748 3560 -7555 26845 17427 7274 32005 45105 18547 44952 38965 17136 18990 -23385
13091 -23385 -48684 -16193 -3060 12171 -27793 -62794 -16934 4390 9827 14743 12536 32514
13079 32514 40751 19838 -14355 -14968 23592 47232 63872 38249 19654 -1679 -8746 -39664
13067 -39664 -65214 -69841 -51644 -24962 -38507 -15650 7002 5071 40144 27214 16982 12623
13055 12623 -20658 -25295 -46699 -39687 -39459 -15082 15718 72157 82625 70534 72682 24387 5636
13042 5636 -1238 14884 15298 29307 24101 -7020 -9047 -2223 -5935 16630 16695 11530 1393 3999
13028 3999 23760 9582 -39154 -65809 -34965 -50263 -64339 -66902 -70767 -52225 -10545 22614
13016 22614 36039 19533 -8846 -53608 -40823 -32770 -30952 -37636 -5137 8996 -18896 -52270
13004e2270K6436L4910k5959m69k3584j4332R90N553PJ9711l870J2070O897k2868
12990c6778P582R436J3702k9138l686J5102K3768R231J5932k7080l2622J6142
12978a8409J4482J812j1786q770l314O191J101m5954p944J8922K514K8079L3004
12965I928K9968L6129k7649l1386j8709k4196N58l219r546J7324j090j5527k891
12952d0306R705J6947K3841O786m8039L686K8865J625m620l512K9852J254J1132
12939C7216J9532m59l1492r417j0018L83J76k0298N935K4095K7528l7084m748
12926A349m148K9595J2998Q823k9167r777J634J7552J8411M518l5667k6529O325
12913d083J3269M8606K3535o473m1580o758O406l2679J966j8644K827P165K1572
$$ plain form
13004 -52270 -25834 9076 -16883 -17352 -40936 -55268 -54278 -48725 -48718 -29007 -32877 -20807 -13910 -36778
12990 -36778 -29196 -19760 -6058 -35196 -38882 -23780 -12 9219 25151 -1929 -34551 -18409
12978 -18409 -3927 -2115 -13901 -22671 -25985 -19794 -18693 -64647 -72591 -53669 -51155 -23076 9928
12965 9928 39896 76025 48376 16990 -1719 -25915 -25357 -28576 -38122 -20798 -21888 -37415 -40306
12952 -40306 -30601 -13654 10187 16973 -31066 -27380 1485 3110 -1510 -5022 24830 26084 37216
12939 37216 56748 56289 24797 15380 5362 5745 5921 -14377 -8442 15653 43181 6097 1349
12926 1349 -2799 26796 39794 48617 19450 9673 11307 28859 47270 51788 16121 -10408 -4083
12913 -4083 9186 57792 81327 74854 33274 26516 32922 243 2209 -16435 -13608 -6443 15129
12900A5129q662J511k5892j0254J2288J3538j1743L222j694k0801k285J5297K7908
12887G562K3674P31o7429k795K0043L9275m503j4810j2209q217J8615M3467j3235
12874C0169j2220q924J093j8139K9028O421m2286o383J8374J007K6001l4070j6044
12861b5973P16J7584O021N829M160m9400J3915L7424p892k9171k95j329k95L3175
12847D469K6722l4095L1771l700R469L3422K2658j8195j1380m414j3085k3841
12835A9801R807K0116j7179k8292L020K3890R312l3936j0347O142j1298k0450
12823b9414j6978J8694M5907l9941r302M4376L702j6613K8193N599j8465j4698
12811A060j8156k2350j9603R832Q463K6504N0293L0204n025m293m8870j3633N3219
$$ plain form
12900 15129 6467 7978 -17914 -28168 -15880 -2342 -14085 -10863 -12557 -33358 -35643 -20346 7562
12887 7562 31236 31967 -35462 -38257 -18214 21061 16558 1748 -10461 -18678 -63 43404 30169
12874 30169 17949 9025 10118 -8021 21007 27428 -14858 -21241 -2867 -1860 24141 -9929 -25973
12861 -25973 -25257 -7673 -1652 4177 8337 -41063 -27148 10276 2384 -26787 -27082 -28411 -28706 4469
12847 4469 31191 -2904 28867 25167 34636 68058 90716 72521 61141 56727 43642 19801
12835 19801 29608 49724 32545 4253 7273 31163 40475 6539 -3808 2334 -8964 -29414
12823 -29414 -46392 -27698 18209 -21732 -31034 13342 17044 431 28624 34223 15758 1060
12811 1060 -17096 -39446 -59049 -49217 -40754 -14250 36043 66247 61222 56929 8059 -5574 47645
12798D7645J2093k4729m448o023k6328p297K1424J8601l8682P182R0P233J7246
12785B4007J2225L117K9188k054l8260m378q319q988J0894j5981r253r404J538
12772a5668J9748J3979P166j6009K50L200j1996k2161l949J6512l3792J1761j2763
12759d3722j0353l0970K8488L5802N1495L6840k2368m153j6334k2793L1081K6594
12747E9607l1960p009j4957j7131M0440J665j5043j2376J9712K4716J2021j6913
12735D2772J3609r267K20Q579k1489j0026m8622m3211K0217M3032K9959K0664
12723D6437M839k893l0323n01j6148K675r283j7068j2656J2781P558j4023O274
12710b2331P684J8110J1149P953m2231K1999N2851K1688l3604O466K2484m999
$$ plain form
12798 47645 59738 35009 30561 24538 -1790 -9087 12337 30938 -7744 -562 -472 6761 24007
12785 24007 36232 39349 68537 66483 28223 23845 15526 6538 17432 1451 -7802 -17206 -15668
12772 -15668 4080 18059 25225 9216 9466 12666 670 -21491 -25440 -8928 -42720 -30959 -43722
12759 -43722 -54075 -85045 -56557 -20755 30740 67580 45212 41059 24725 1932 33013 59607
12747 59607 27647 20638 5681 -11450 28990 30655 15612 3236 22948 47664 59685 42772
12735 42772 56381 47114 47334 55913 34424 24398 -24224 -67435 -47218 -4186 25773 46437
12723 46437 51276 48383 18060 17559 1411 4086 -5197 -22265 -34921 -22140 -14582 -28605 -22331
12710 -22331 -14647 3463 14612 22565 -19666 2333 55184 76872 43268 49734 72218 67219
12698F7219m728j2297m7735o6306K2434N125n416K9327M402J6175j7729j6031
12686b5560P916O25j5059Q663p228n995J4133J1279K3926Q438k7020k4452J9853
12673a0481j302j2775j1267L0942K4694L506j9148M963j5275j5424K3037j4j570
12660a14m880J3321p156K3503o07K0106j715k1636K873J9363j5146k5421K3051
12647B5542l2207j4564K3192m1196l1027N541M1041J3058j5151l0615K4636J9893
12635a1857L0058L198q0j0250P39K1778j5016m7055p638Q346l129o512L0713N848
12621h57o025n9546j8898l120j3965J2960L2389L5928M3508l8278j9631m1772
12609g7307p06J9216J9827K6379L6381r993j0736K2762j7743j6320J7658L2930
$$ plain form
12698 67219 62491 50194 2459 -63847 -41413 -36288 -41704 -12377 -7975 8200 -9529 -25560
12686 -25560 -17644 -17019 -32078 -23415 -30643 -36638 -22505 -11226 12700 21138 -5882 -30334 -10481
12673 -10481 -11783 -24558 -35825 -4883 19811 23317 4169 9132 -6143 -21567 1470 1456 -114
12660 -114 -4994 8327 1171 24674 24067 44173 42458 20822 23695 43058 27912 2491 25542
12647 25542 -6665 -21229 1963 -39233 -70260 -64719 -23678 -10620 -25771 -56386 -31750 -11857
12635 -11857 18201 21399 21319 11069 11808 33586 18570 -28485 -36123 -27777 -30906 -37418 -6705 -857
12621 -857 -6882 -66428 -85326 -88446 -102411 -89451 -57062 -21134 22374 -15904 -35535 -77307
12609 -77307 -78013 -58797 -38970 -12591 23790 13797 3061 25823 8080 -8240 9418 42348
12597D2348k2894p432O080j5924p779m099l1757r960m388p118N4505K8762p770
12584A2574l7375l9369j8105J5201M0648M909N226P016j2923j7246J2105K600
12572b4739j8416J4449M5094J3083k1322O961m60Q776k1765l4022K1978k134K928
12559i589J5019j094J7743R335j8848m0768n8855l8216N2868O1669O037K6279
12547B1580L6564K9577j0867l0022J6524k6907k513Q480j1944j0205M39m464R993
12534B6235l2384j7623K3533K303j6481K2517L0924L2903j4512n4468O618J2517
12522B2082k7621j4639r710L31J916J7451L1439n646l5273j5448M536j6459j2351
12509e9392O406K1602K4148m053k4419k5980K5102M2155J3411J0588K1501J1646
$$ plain form
12597 42348 19454 12022 18102 2178 -5601 -9700 -41457 -51417 -55805 -62923 -8418 20344 12574
12584 12574 -24801 -64170 -82275 -67074 -26426 -21517 -16291 -9275 -22198 -39444 -27339 -24739
12572 -24739 -43155 -28706 16388 29471 8149 15110 14650 23426 1661 -32361 -10383 -12517 -9589
12559 -9589 5430 4336 22079 31414 12566 -28202 -87057 -125273 -72405 -10736 -4699 21580
12547 21580 58144 87721 76854 46832 63356 36449 33936 42416 30472 20267 20706 16242 26235
12534 26235 -6149 -23772 -239 2064 -14417 8100 39024 71927 57415 2947 9565 22082
12522 22082 -5539 -20178 -29888 -29557 -27641 -10190 21249 15603 -19670 -35118 -30582 -47041 -59392
12509 -59392 -52986 -31384 -7236 -11289 -35708 -61688 -36586 5569 18980 29568 51069 62715
12497F2715r632j1991o925J2241o108k6593j9364J445j423p646k05J9251k309
12484C456J3575l0296Q043m02O1878j974j5347k7368j9237L682m32j7613N248
12471a6787K7360o549J359k7861j110L1256O932J1030R970j5373J4440J0440q842
12458C6265j9609j9494J8308M260m4722M439K1871J7145O229P485o944r56j9358
12445D919K2508p614K2856j5720j1978n794j7402j220K572K3154K7684J2388k7566
12432B8787j7550n6368k5950K0247M2048M9203J0688n8622J2767K8820K3552j111
12420E6511j3802j5942L6432K2400j6577j3100m0180J553j8637j6078j8855P674
12408b8601j9316M3109J7159J7936K7717p129j6546k2720j6904j4968j9199k3626
$$ plain form
12497 62715 53083 41092 34167 46408 40300 13707 -5657 -4212 -5635 -13281 -13486 5765 3456
12484 3456 17031 -13265 -5222 -5624 56254 54280 38933 11565 -7672 -3990 -4422 -22035 -16787
12471 -16787 10573 4024 5383 -22478 -23588 7668 14600 25630 35600 20227 34667 45107 36265
12458 36265 16656 -2838 15470 19730 -24992 -20553 1318 18463 24692 32177 25233 24277 4919
12445 4919 27427 19813 42669 26949 14971 9177 -8225 -9445 -6873 16281 43965 56353 28787
12432 28787 11237 -45131 -71081 -50834 -8786 40417 51105 -7517 5250 34070 57622 56511
12420 56511 42709 26767 63199 85599 69022 55922 15742 17295 -1342 -17420 -36275 -28601
12408 -28601 -47917 -4808 12351 30287 58004 50875 34329 11609 -5295 -20263 -39462 -63088
12396f3088L0061L4328M593M111l3789j3900K665j7590O629J6546j0622J8507
12384b1549m490l1240K317q231J3489N8472K0122l8784k5103N3772J519J1976
12372C2270P591l5792m7465K2334Q150J339r49J0759k3111q322k2713M7837J8104
12359A0032K4477P155k3192o231k0133l8259M489J6789K7636J3036p930o961p0
12346H38k578J2660R144r78j5189j3396l030L1270J1794q280k0932m3276J418
12333d0535J5970J7616k0473M869k3309J714L1735o231J6742K5866J0784J5563
12321E0311J718l3614k955M180j7020l4415J0156O188K551J017j375J3835n187
12308d610n499J1415m287r82j2122j5745l5094K5248J0609n409K5885M5017L5507
$$ plain form
12396 -63088 -33027 1301 5894 10005 -23784 -37684 -35019 -52609 -45980 -29434 -40056 -21549
12384 -21549 -26039 -57279 -54962 -63193 -49704 8768 28890 -9894 -34997 18775 20294 32270
12372 32270 39861 4069 -43396 -21062 -12912 -11573 -12522 -1763 -24874 -33196 -55909 -8072 10032
12359 10032 34509 41664 18472 12241 -7892 -46151 -41662 -24873 2763 15799 7869 908 838
12346 838 -1740 10920 20064 19086 3897 -9499 -12529 18741 30535 22255 1323 -41953 -40535
12333 -40535 -24565 -6949 -27422 -22553 -45862 -44148 -12413 -18644 -1902 23964 34748 50311
12321 50311 52029 18415 15460 19640 2620 -31795 -21639 -15451 -12900 -11883 -13258 577 -4610
12308 -4610 -10109 1306 -2981 -3963 -16085 -31830 -66924 -41676 -31067 -36476 -10591 34426 69933
12295F9933k2484n4350m2211N1780J9847j1064l2420N460J1873n280k5326j5733
12283d9975K736l0329L9617M461l5373K457M0661K8841R414l748j1031R720k0168
12270a2717M870K6390J3420k9874m4018l0024O456J8212J6308L4086J9228m1031
12258a8694J2753Q808j283J2890l5238k5983R267L1399j1713k7223K638k6050
12246f8429j1367K5077N4091L4175J1818k6785l5587O438L1792K2895M0416J2078
12234I6612k6921m4979j7495k1487J0510J4061J663K518k9245l9932r770K5712
12222c8753J4798k219J7700J5489J9623k0772m1202j38M1532j8610j1337l0923
12210e4812K7164o724k5150l749L1883L1978J032q924m3957K2434K1232k3040
$$ plain form
12295 69933 47449 -6901 -49112 2668 22515 11451 -20969 -15509 -3636 -8916 -34242 -49975
12283 -49975 -47239 -77568 -37951 -33490 -68863 -66406 -25745 3096 12510 8762 -2269 7451 -12717
12270 -12717 -7847 18543 31963 2089 -41929 -71953 -65497 -47285 -30977 3109 22337 -18694
12258 -18694 -5941 2867 1584 14474 -20764 -46747 -37480 -6081 -17794 -45017 -42379 -68429
12246 -68429 -79796 -54719 -628 33547 45365 18580 -17007 -10569 21223 44118 84534 96612
12234 96612 69691 24712 7217 -14270 -3760 10301 11964 14482 -14763 -54695 -64465 -38753
12222 -38753 -23955 -26174 -8474 7015 26638 5866 -35336 -35474 6058 -12552 -23889 -54812
12210 -54812 -27648 -34372 -59522 -63271 -31388 590 1622 -7302 -51259 -28825 -7593 -30633
12198c0633p067J6215L162P313l472K5547q15j9078J737r227M475j4202K2309
12185c736O473N313J1376j439j4888p06k7451k7237L0740L2878m671K2712k944
12172B6420k1457j6525J3863n744Q011O235j0034o954k588J7352L9424L1933m7184
12159C2752k5234J4678j378q462j7006N170R437L46n316m6428j6107L2033M348
12146b1167J0160j7743m57R095J5402J6039K4347l0828l0183J2238R045j0496
12134a4548L0526J5032j4118M1168k1032k9887n0731J4548O0310J75j3008J0143
12122B8578J8236L4902L9814k6079l2518q2269m1343J3259k339J292K4128J8573
12110e766K5627K9943J5861k5849l9144m6596L0975K504l554k6067K4586J8715
$$ plain form
12198 -30633 -37700 -21485 -18323 -11010 -14482 11065 10250 -8828 -7091 -16318 -11843 -26045 -3736
12185 -3736 2737 8050 19426 17987 3099 2393 -25058 -52295 -21555 11323 6652 29364 26420
12172 26420 4963 -11562 2301 -3443 4568 10803 769 -6185 -8773 8579 48003 79936 32752
12159 32752 7518 22196 20818 12356 -4650 520 9957 10303 4987 -41441 -57548 -25515 -21167
12146 -21167 -11007 -28750 -29207 -20112 -4710 11329 35676 4848 -25335 -13097 -4052 -14548
12134 -14548 15978 31010 16892 58060 37028 7141 -43590 -29042 31268 31443 18435 28578
12122 28578 46814 81716 121530 95451 62933 -19336 -60679 -47420 -49759 -48467 -24339 -5766
12110 -5766 19861 49804 65665 39816 672 -45924 -14949 -12445 -15999 -42066 -17480 1235
12098A235L696j9827K1390K2758k8456j6873M6370N5981l6890n8187q047J1917
12086d933k5182k3709K2903M408K143j6665j0744J434L189j0291J7608j6950J3211
12073d3578L849k440K3905M2989K8793j2868P598j9166j8457j1428n294Q805k2070
12060a9362J8159k6008J8060J6977J4242K3409Q700j4234k7855j7101L662j1547
12048a2898k0322J2879K9945M103j2315r326p609j4266O825J5902K6327J1142
12036C0387j7942K672O328M2012K2805j8421k3579l4401Q086J5094J9220k2777
12024B9484k5225j3146p606j1505L618n326R756J9591J4011J3389j9144k7877
12012a9980j1910r701P772Q416J6501q27j403J2601P264q962p606L5992j6773
$$ plain form
12098 1235 4931 -14896 6494 29252 796 -16077 30293 86274 49384 -8803 -16850 -4933
12086 -4933 -30115 -53824 -30921 -26513 -24370 -41035 -51779 -50345 -47156 -57447 -39839 -56789 -43578
12073 -43578 -39729 -42169 -18264 24725 53518 40650 48248 29082 10625 -803 -6097 2708 -19362
12060 -19362 -1203 -27211 -9151 7826 22068 45477 54177 39943 12088 -5013 -1351 -12898
12048 -12898 -33220 -20341 9604 13707 1392 -7934 -15543 -29809 -22984 -7082 19245 30387
12036 30387 12445 15117 21445 63457 86262 67841 44262 9861 17947 33041 52261 29484
12024 29484 4259 -8887 -16493 -27998 -24380 -29706 -19950 -359 13652 27041 7897 -19980
12012 -19980 -31890 -41591 -33819 -25403 -8902 -9729 -11132 1469 8733 -229 -7835 28157 11384
11999A1384k9928J5191M794K6825M992M173j2128p628K650j2739j4925O630O171
11986E462k1848%K5438m038r281m750j4824J3923m053j1917L3397P905p619J9832
11972B7627J2991O619k9858l2076n796J9478j5603J0565j2008j8575m889O0079
11960A8554J1913m473l8354k0195M86o876j2736N39j72K615M666N1900K1878j2909
11946A6836j7547k8543l4738j1624L7583N0653o846n692N313J9225k2195k2555
11934b0130p057J0561k6869Q177M206k0331L7770L5362M300k9592m8743m540K3172
11921c3714l295L130l9073k9015K6280M7270K969J8671K7257l557J3662l208K5206
11908E2583j3087j2647J2445j3004K2334L5297l9609p964j5401k6276J6089j6718
$$ plain form
11999 11384 -18544 -3353 1441 28266 33258 37431 25303 17675 20325 7586 -7339 -709 5462
11986 5462 -16386 -16386 9052 5014 -4267 -9017 -23841 -9918 -13971 -25888 7509 15414 7795 27627
11972 27627 40618 47237 17379 -14697 -20493 -1015 -16618 -6053 -18061 -36636 -41525 18554
11960 18554 30467 25994 -12360 -32555 -32069 -38945 -51681 -51142 -51314 -48699 -44033 7867 29745 16836
11946 16836 -711 -29254 -63992 -75616 -38033 12620 5774 82 5395 24620 2425 -20130
11934 -20130 -27187 -16626 -43495 -35318 -31112 -51443 -13673 21689 25989 -3603 -52346 -56886 -33714
11921 -33714 -37009 -33879 -72952 -101967 -75687 -28417 -25448 -6777 20480 16923 30585 27377 52583
11908 52583 39496 26849 39294 26290 48624 83921 44312 36348 20947 -5329 10760 -5958
11896e958l5451l1991j894m34K8535O49J5429J0079P377L5849L6262N357k1458
11883D2351J1957J5432K0058l6273n1582o1779j2714M1171N5139n15N706J404
11871C0355J5800l4487k803N119K9315K2192Q073j3026k0535m4857l422R117K9587
11858C0428j5628m0161j4434m313J9400L7269J3213j2774p955K782L3775P075
11846D8677k4660l1354k3132K3785J3527Q950k5983J9651J8876m2770k9399J9962
11834b3870P466M138l2713J7198J0788m419p967K6085L0427j114j629n324q858
11821A0208L1726j2143R162k216j2081j3709o120l670N0203k705O29J1034k9964
11808C0354j2611o0137K9347M0160Q161k1274J1003k2569l8663J4959K0837J5963
$$ plain form
11896 -5958 -41409 -73400 -75294 -75728 -47193 -46544 -31115 -21036 -13659 22190 58452 63809 42351
11883 42351 54308 69740 89798 53525 1943 -59836 -72550 -31379 23760 23245 28951 30355
11871 30355 46155 11668 8865 13984 43299 65491 73564 60538 40003 -4854 -8276 841 30428
11858 30428 14800 -25361 -39795 -44108 -24708 12561 25774 13000 5045 7827 41602 48677
11846 48677 24017 -7337 -30469 -6684 6843 15793 -10190 9461 28337 -14433 -43832 -23870
11834 -23870 -16404 -12266 -44979 -27781 -16993 -21412 -29379 -3294 27133 26019 24390 19066 10208
11821 10208 41934 29791 38953 36737 24656 10947 4827 1157 51360 48655 49284 60318 30354
11808 30354 17743 -42394 -13047 27113 35274 14000 25003 2434 -36229 -21270 -433 15530
11796A5530n05J8901j1770p2J2733L0622q595m5172k1003p956l5356j2918K2028
11783d3533L1645J7K7660l7395m0970J5375L8614M71k265K7346P118j4104k2510
11770a2531k0131K041q745j8678n582J9747J8664n385k2752P618K4515M6775K2974
11757D8530o773k1651n033N550M953m073L8637L3322q085l8835l9996K196p020
11744A722l0345p649j4523J9335k038J8698J5303J5147n543k0570j9553J5783
11732a4233R815k4520k1935L3270P666k8733P028J5496L8095k6682m63K4420k4821
11719e597j781N607M5924J4231k0253k7111R642R972k8558n069Q620j3067J6898
11706I458r16l5046j8228k3829O479K7226J0412L4353o942j0840K241j3766L4056
$$ plain form
11796 15530 15025 33926 22156 22084 34817 65439 56844 11672 -9331 -17287 -52643 -65561 -43533
11783 -43533 -11888 -11871 15789 -21606 -62576 -47201 -8587 -8116 -10381 16965 24083 9979 -12531
11770 -12531 -32662 -30621 -39366 -58044 -63626 -43879 -25215 -30600 -53352 -45734 -21219 25556 48530
11757 48530 41757 20106 15073 20623 25576 21503 60140 93462 85377 46542 6546 8742 1722
11744 1722 -28623 -36272 -50795 -31460 -33498 -14800 503 15650 10107 -10463 -30016 -14233
11732 -14233 -4418 -28938 -50873 -17603 -9937 -38670 -31642 -16146 21949 -4733 -5196 19224 -5597
11719 -5597 -7378 -1771 44153 58384 38131 11020 20662 30634 2076 -2993 5627 -7440 9458
11706 9458 8542 -26504 -44732 -68561 -62082 -34856 -24444 9909 2967 -7873 -5632 -19398 14658
11693A4658N1945j3908m7995l7082L2709P578K6906j6929j8112j3870K283Q366
11681c451O392k2677l3549K5243K2824j1318K372J5713L0360k522o56l2067M879
11668A543l5207j7815K6924N1090p721l387J392k1665J1902K1578P850k3054M351
11655A7781j6435J6496j4325k9607J3832m369L3873J8137Q604j5595k8936q759
11643i303m3043J5758K2819M2929L0417J0540j1286R456q99l5672k2049L0456
11631D0123o469k0923j7212j0348J8076L923J0835k7407k648L7586P733k4675
11619H594Q367k1578r649j1964j6041J8602K1677l1325J198K4034J7245M985k7155
11606a3010n153N69J9276j2448J0775k1363j1568k5547K4563K6717j246q951k5152
$$ plain form
11693 14658 66603 52695 4700 -32382 327 7905 34811 17882 -230 -14100 -11817 -3451
11681 -3451 2941 -19736 -53285 -28042 -5218 -16536 -14164 1549 31909 29387 28731 -3336 1543
11668 1543 -33664 -51479 -24555 26535 18814 15427 16819 -4846 7056 28634 36484 13430 17781
11655 17781 1346 17842 3517 -26090 -12258 -16627 17246 35383 43987 28392 -544 -9303
11643 -9303 -52346 -36588 -13769 29160 59577 70117 58831 68287 67388 31716 9667 40123
11631 40123 33654 12731 -4481 -14829 3247 7170 18005 -9402 -12050 25536 33269 8594
11619 8594 16961 -4617 -14266 -26230 -42271 -23669 -1992 -33317 -32119 -8085 9160 14145 -13010
11606 -13010 -18163 -17594 1682 -10766 9 -21354 -32922 -58469 -33906 -7189 -8435 -17386 -42538
11593d2538k8916L9455m263p857J3444M8672M421j2613j6019K0413M063j4417
11581C845m8193j3744J1556R659p760L5109K8370J2939J8096j2134K0909N405
11569F4057l4676k5478M121P44Q150J2494j380K091M450J8623l4989j9793P953
11556F367K0439J8037k2282N851Q549J0262J9117k3549j7439L193n1714p051J431
11543b8789J3673K4539K1994k8860l2666Q034k563K282j236R972L6302j865M047
11530B4864l298l4315J8502K0887q015J5678r822l1110P429L8259Q356n981L6419
11517G7853L0363p462k2693k0657o039l9439l9480j2710m397j3024m820L5240
11505b7265q603j409J8353J7466M080Q603k3459k1681l405J3448J8063n466J7966
$$ plain form
11593 -42538 -71454 -31999 -36262 -44119 -30675 17997 22418 9805 -6214 14199 18262 3845
11581 3845 -44348 -58092 -46536 -36877 -44637 -9528 18842 31781 49877 37743 58652 64057
11569 64057 29381 3903 8024 8768 16918 29412 28032 30123 34573 53196 18207 -1586 6367
11556 6367 26806 44843 22561 28412 36961 47223 66340 42791 25352 28545 -23169 -30220 -28789
11543 -28789 -15116 9423 31417 2557 -30109 -22075 -24638 -22356 -23592 -13620 22682 20817 24864
11530 24864 21566 -12749 5753 26640 18625 34303 24481 -6629 800 39059 47415 41434 77853
11517 77853 108216 100754 78061 57404 51365 11926 -27554 -40264 -44661 -57685 -62505 -27265
11505 -27265 -35868 -37277 -18924 -1458 2622 11225 -12234 -33915 -37320 -23872 -5809 -11275 6691
11492F691q367k809k7068j6492L0548K5446j2104j6452M4656L8252L591m5414
11480B0478j8886P078k0287p488J311n934q344q290j4671K0007k118j5374K2924
11467b9594N2965M474j3045k2216k7329k660m109l1652M0182M1494n990j6J9492
11454B1996j2206k0477j2336R531K773L437L3491K4307m1079l7941M9137K9674
11442E0307j7634l7752k2693K6439J9422j0744K8927L701l4503o519k3020J2015
11430a2054M904J6166L4342P151K3808P052p981k0471j3058q19N378J490k8209
11417A7699k5112l3214k808L3660M6243J8155m830N999n866j4201k7745K745J4465
11404B5190R822K976r785j9827J2108J3465k9837k5205M2440K1231m5964l2856
$$ plain form
11492 6691 -1676 -4485 -31553 -48045 -17497 7949 -4155 -20607 24049 62301 65892 20478
11480 20478 1592 8670 -11617 -19105 -17794 -23728 -32072 -40362 -55033 -35026 -37144 -52518 -29594
11467 -29594 23371 27845 14800 -7416 -34745 -37405 -41514 -73166 -32984 8510 2520 2504 21996
11454 21996 9790 -10687 -23023 -13492 -10719 -7282 26209 50516 9437 -28504 20633 50307
11442 50307 32673 -5079 -27772 -1333 18089 7345 36272 39973 5470 -1049 -24069 -12054
11430 -12054 -7150 9016 43358 50509 74317 81369 73388 52917 39859 39040 44418 45908 17699
11417 17699 -7413 -40627 -43435 -9775 36468 54623 49793 55792 49926 35725 7980 10725 25190
11404 25190 35012 37988 28203 8376 20484 33949 4112 -21093 21347 42578 -3386 -36242
11392c6242J8785n358j0370n299k0643L1419L7645n279j2956M03L7792r902j8931
11379A064K20j2938j635m512j6324j651L0891l832j5082k3502K6199J2137l0364
11366c9329o67J8593j3317l4755L5284K8923K9749L0955j1597J2378N0424j2301
11354I4340m0170k9080l8311q348K5177M9580j7344r594j5562L711N462K6242
11342D6103m000r060J7416q391r256j5734Q195R278l0217l7909K2901J5693L5551
11329D0570k393Q067J2835l226l024k4967j7904j4229J4945r047R688K0835k2481
11316I669m044J7422K0404K9335O248j1920m4348q707J8053L3838L7657k1990
11304H1617l0560l7823k8215J0280M1294j6917o162K703K7698J1775p159j6842
$$ plain form
11392 -36242 -17457 -22815 -33185 -38484 -59127 -27708 9937 4658 -8298 -7895 29897 19995 1064
11379 1064 1284 -11654 -13289 -17801 -34125 -35776 -4885 -8717 -23799 -47301 -21102 -8965 -39329
11366 -39329 -39996 -21403 -34720 -69475 -34191 -5268 24481 55436 43839 56217 106641 94340
11354 94340 54170 25090 -13221 -21569 3608 53188 35844 26250 10688 14399 19861 46103
11342 46103 42103 33043 50459 42068 32812 17078 25273 34551 4334 -33575 -10674 5019 40570
11329 40570 38177 46244 59079 55853 52829 27862 9958 -4271 10674 1627 11315 32150 9669
11316 9669 5625 23047 43451 72786 79034 67114 22766 14059 32112 65950 103607 81617
11304 81617 51057 13234 -14981 -4701 36593 19676 13514 16217 43915 55690 48531 31689
11292C1689k571O035J4576Q778K2668j2565q793l731K766J0430k9414r412k6398
11279D058j1474P690N4232L2795J2433q828m0769l2125r416j1378L5567L562p492
11266B8855p2471M442M4801K4398l0423L455p764K420Q112j7364J6268m357m2705
11253d2333k6835K629O998p232J9719J8659M6794M7575n1409m1437K9234Q961
11241A1323J846j3812o188J733J0843p535k9665k2990j1933o636N3488J6408j239
11228d357R843n941K6557o367l6560k1703J7980K250p979N572k1080R02J3420
11215b7463J8114L9477M7390K424m1557j573p804L594j2817J2425J3575j0900
11203C4885j4725k2870j6040N24N1003j4959j1290k047j2847q581L060K6044J2137
$$ plain form
11292 31689 29118 35153 49729 58507 81175 68610 59817 56086 58852 69282 39868 30456 4058
11279 4058 -7416 274 54506 87301 99734 90906 50137 18012 8596 -2782 32785 36347 28855
11266 28855 -43616 -39174 5627 30025 -398 3057 -4707 -2287 5825 -11539 4729 372 -42333
11253 -42333 -69168 -66539 -59541 -66773 -47054 -28395 18399 65974 14565 -26872 2362 11323
11241 11323 13169 -643 -6831 -5098 5745 -1790 -31455 -54445 -66378 -73014 -19526 -3118 -4357
11228 -4357 5486 -455 26102 19735 -16825 -38528 -20548 -18298 -26277 -20705 -41785 -40883 -27463
11215 -27463 -9349 30128 77518 79942 38385 36812 29008 32602 19785 32210 45785 34885
11203 34885 20160 -2710 -18750 -18226 32777 17818 6528 4481 -8366 -16947 -13887 12157 24294
11190B4294l386o550j9116j866L7846J6273k258K0994K3467j3573m0970j845n259
11177B8051K0818n107j4188J5383K7879K1551j1998m382M683o69j4834k4341m2746
11164A00o984K5890L4681J2622K3941j6305l3501j6315j612J3898L9704j7810
11152E8309k3549j3037K3082k9790k3285K5567M0j8924l528L171J9833Q68j7853
11139I04L4777J6496l2105n176J4213Q06m832l0037l2025k215J9977J9774L7188
11126C7745j2963l663j6730k5915r1Q319L5291K2613J1726K2256k3020l0810n335
11113A9423M77m93k034M3647k2823j4757J9471j3026J7619P258j4619l0124k5871
11100a5852L8646L5237k275j9433l919Q098q855K169R347j268k2241k1375j8241
$$ plain form
11190 24294 20908 14358 -4758 -6624 31222 47495 45237 66231 89698 76125 35155 33310 28051
11177 28051 48869 43762 29574 44957 72836 94387 82389 78007 82690 82021 67187 42846 100
11164 100 -6884 19006 53687 66309 90250 73945 40444 24129 22517 36415 76119 58309
11152 58309 34760 21723 44805 15015 -8270 17297 17337 -1587 -5115 -1944 17889 18757 904
11139 904 35681 52177 20072 14896 29109 29915 25083 -4954 -36979 -39194 -19217 557 37745
11126 37745 24782 21119 4389 -21526 -21617 -13298 21993 44606 56332 78588 55568 24758 19423
11113 19423 19900 19407 17373 61020 38197 23440 42911 29885 47504 54762 40143 10019 -15852
11100 -15852 22794 58031 55756 36323 32404 40502 31647 33816 43163 41895 19654 -1721 -19962
11087a9962P777P407m045J1179L3662r078j7539j876P019j9522j9662Q460m943
11074b1123J8958L9058O992k5413j4252j0359J7784J6484n2811r811L2835M89
11062a169K9830J5972l3283K7824K9924j2679k6819p845r831J5200J004j4153
11050A3975J2551j8149o607K0960J4049l6049M237K0136J537L545j9163j1980
11038i58J0116K0460l3239k6738j5K0956K2429k3355K2455K5560k8089K2297j25
11025C1754l1501l13L4877O59k5021j1178R79M296m0995j3934j1252n589o232
11012g3450m2165j1426J5445j639l924J0713N5470K9433j063K3470P10q685j0290
10999a7401K6579k3148n760Q171K6704J3807L2634L8776q63l6631k1469l0910
$$ plain form
11087 -19962 -12185 -4778 -8823 2356 36018 26940 9401 7525 14544 -4978 -24640 -16180 -21123
11074 -21123 -2165 36893 43885 18472 4220 -6139 11645 28129 -24682 -34493 -1658 -1169
11062 -1169 28661 44633 11350 39174 69098 56419 29600 21755 11924 27124 28128 13975
11050 13975 26526 8377 1770 22730 36779 730 4967 25103 26640 30185 11022 -958
11038 -958 9158 29618 -3621 -30359 -30374 -9418 13011 -10344 12111 37671 9582 31879 31754
11025 31754 253 -60 34817 35476 10455 -723 256 4552 -36443 -50377 -61629 -67218 -73450
11012 -73450 -115615 -127041 -111596 -113235 -117159 -106446 -50976 -21543 -22606 864 1574 -7111 -17401
10999 -17401 9178 -13970 -19730 -11559 15145 28952 61586 100362 99499 62868 41399 10489
10987A0489J2691J9049K2071Q384l3373O064M142j2523k4585L02j796O956N3010
10974G0881l049l4651J1360K4232j4103J3345M5973L175k9882q606L4006J0259
10962A22940p5j1936p297L9657K3337M0305L8366M6472N5930M7366P767Q9075
10950D91907K24799K78184K95944K91276L02572K33845J23305L6318l9063j41367
10940B097720k31090k71344k78437l25293k43118j60937j27288j13482p4981l0107
10930B41643k6049k3432k0718l1714M81o390k317K5648j9765q902m8587n9290
10918B0608l3014R063M5600M0157L4004j8376k2146R016j1445j4041K0102J10
10906G9638j2735J6476K762m4678m589n504k3169K3402L4704j0599k860O731j3288
$$ plain form
10987 10489 23180 42229 64300 72684 39311 45375 49517 36994 12409 12711 10915 17871 70881
10974 70881 67832 33181 44541 68773 54670 68015 113988 117163 87281 78675 112681 122940
10962 122940 122865 110929 103632 143289 166626 206931 245297 291769 347699 395065 402832 491907
10950 491907 716706 994890 1290834 1582110 1884682 2118527 2241832 2278150 2239087 2097720
10940 2097720 1866630 1595286 1316849 991556 748438 587501 460213 346731 271750 241643
10930 241643 215594 192162 171444 139730 140211 133821 131504 157152 137387 128485 79898 20608
10918 20608 -12406 -3343 42257 82414 116418 98042 75896 84912 73467 59426 79528 79638
10906 79638 66903 83379 86141 41463 36874 31370 8201 31603 66307 55708 52848 59579 46291
10893D6291k4957J6764N395m2300j2623J8910M9009j073P741J3662R497l125m3905
10880C9286j7784J168q627J6948L0167j845J1503N163k8140l7676o510J8893M888
10867B7434j3507J4177P890n7853o7774K2844N1290l658L855m906l2401j7437
10855g0046K2231K4880J5518k4915k0466J60L2914O1848O050L1974M3815l194
10843A20769r212M7481M4759J0498q547m7795n1929N48N0971K5129j2125l3876
10831A36671l3289n021k143J6240L5908j2506m681l2184j4816J5967j138J1090
10819A10098J1380J1375j7370O088J1930J9352K464o73J1367j9524N648L1842
10807A83977M666Q679L7829Q101l1023J2724L7331L1482J8657j3612m512j085
$$ plain form
10893 46291 21334 38098 43493 1193 -11430 7480 56489 55416 63157 76819 86316 83191 39286
10880 39286 21502 22670 14043 30991 61158 59313 70816 75979 47839 10163 3653 22546 27434
10867 27434 13927 28104 35994 -21859 -89633 -66789 -15499 -19157 -15302 -20208 -52609 -70046
10855 -70046 -47815 -22935 -7417 -32332 -52798 -52638 -19724 42124 48174 80148 123963 120769
10843 120769 111557 159038 203797 214295 205748 157953 106024 106572 157543 182672 170547 136671
10831 136671 103382 98361 96218 112458 148366 135860 131179 98995 84179 100146 99008 110098
10819 110098 121478 132853 115483 121571 133501 152853 155317 154644 166011 146487 152135 183977
10807 183977 188643 197322 235151 243252 212229 224953 262284 293766 312423 298811 294299 293214
10795B93214l2570j5665q827J0949m228n0262k9434l6214l0687K2738J3797m251
10783A28560J7814K5561l1902K194J0401K9639J3534r206M144l0906k5156j7301
10771A17376l1249K0292J8682m3694L686j709J7862j2155J9675J8107K159J6337
10759A45369j4596q628l0861k0626k2694k2341j736O860N921K3723L356K270o180
10746E9837N560j4534m839Q892P8567K3029l69j6044m8175J4108N5779J0169j1844
10733A60136K0579M9758N4064J1936j6017m6287j6537J1454j5399K4522L2532
10722B70741J1567L2365J6224j0970n028q143M400l1617m4527M070L910k5804
10710B17188k2779k3550K3841K2265L970m666n117K8650j468J1750L5431k3166
$$ plain form
10795 293214 260644 244979 236152 247101 242873 192611 163177 126963 96276 119014 132811 128560
10783 128560 146374 171935 140033 142227 152628 182267 195801 186595 190739 159833 134677 117376
10771 117376 86127 106419 125101 81407 85093 83384 101246 89091 108766 126873 129032 145369
10759 145369 130773 122145 91284 70658 47964 25623 23887 30747 36668 60391 63747 66017 59837
10746 59837 65397 50863 46024 54916 133483 156512 156143 140099 91924 106032 161811 171980 160136
10733 160136 180715 230473 284537 296473 280456 234169 217632 229086 213687 238209 270741
10722 270741 282308 314673 330897 319927 314899 306756 311156 279539 235012 239082 242992 217188
10710 217188 194409 170859 194700 216965 220935 216269 211152 239802 238334 250084 285515 262349
10698B62349J1824L2050m244k804O048j3930j7863l6110k2794k1246K5329j7562
10686B01047j3939O2220L3594K7401K2091J9073k7067j1079J7196o255j4110K55
10674C10427K6088L4020j6221M1636M0393r648M794k3390j1689O8950N1460m1779
10662D75041m2047k6791n0271J1155Q349L5893j2031k0999j0988Q876J4556j735
10650C89008L5485M8456n640k6202L5141K0020L0955q00k3566M5627J2462j2850
10638E48096J6489p652K1046L7845O408k0410l3521k4662J8786J8032K1307J0407
10626F12171J9466M0053M9577J9710R901K5016M7051P9395J208m179O118j6420
10614H89067K6193M4740L0806K6121M9671L5848N5479Q2663O4077J7636Q3248
$$ plain form
10698 262349 274173 306223 301979 299175 305223 291293 273430 237320 214526 193280 218609 201047
10686 201047 187108 249328 282922 310323 332414 351487 324420 313341 330537 324282 310172 310427
10674 310427 336515 370535 354314 395950 436343 426695 431489 408099 396410 465360 516820 475041
10662 475041 432994 406203 355932 367087 375436 411329 399298 378299 367311 376187 390743 389008
10650 389008 424493 472949 467309 441107 476248 496268 527223 526423 502857 548484 560946 548096
10638 548096 564585 556933 577979 615824 622232 601822 568301 543639 562425 580457 601764 612171
10626 612171 631637 671690 721267 740977 750878 775894 822945 902340 903548 899369 905487 889067
10614 889067 915260 960000 990806 1016927 1066598 1102446 1157925 1240588 1304665 1322301 1405549
10603A405549P1370Q1830K8675K2827L2680O9316P9938R3468J00922Q2399P3579
10592B142553J30189J42227Q2798M1288O8648P9340R5936J01057Q9388P7093J11295
10581C161812J31671J59501J75204K07074K28234K53776L29784L59712M12453
10572E419221M62811N53516O67438Q28901J039178J220404J421445J601684J735636
10563A4950234J896857J960657K027922K161859K313046K544382L118232L949236
10555C4922425N335241P677613J1703780J8609132K8911273L9939638M8727445
10548A95826547N4272333N4734908M8581883L6028885J8773797k61801j7653455
10541C90303097l3039318m3738160m9415842m9256714m7525334m1398073l2346316
$$ plain form
10603 1405549 1476919 1558749 1587424 1610251 1642931 1712247 1792185 1885653 1986575 2068974 2142553
10592 2142553 2272742 2414969 2497767 2539055 2607703 2687043 2782979 2884036 2973424 3050517 3161812
10581 3161812 3293483 3452984 3628188 3835262 4063496 4317272 4647056 5006768 5419221
10572 5419221 5882032 6435548 7102986 7931887 8971065 10191469 11612914 13214598 14950234
10563 14950234 16847091 18807748 20835670 22997529 25310575 27854957 30973189 34922425
10555 34922425 40257666 47935279 59639059 78248191 107159464 147099102 195826547
10548 195826547 250098880 304833788 353415671 389444556 408218353 407956552 390303097
10541 390303097 357263779 313525619 264109777 214853063 167327729 125929656 93583340
10534I3583340k3801131j6408126j0921246p386209n154248l693852k777730k257715
10526B1183083j986784j771739j692553j614181j475650j363539j226547j039134
10518I012956r11795q08365o56948n61218n12392m16319l30002l34081k89752
10509D192084k78285k43805k31895k12457k68564k01356j82403k12005j57072
10500B204242j67994j74173j11040j24670j17745p6345n1501p8174o5355m6589
10490A190656m6783m6645k8113l6209k5542k4720m1488j1697K133p173j394j8382
10478I04643l4913o305j1369k4844J2143L8933K2857N6620J18967J19618J15091
10467A311441J09535J00013O6637J0334m6514j37596j06646j18794j22779j50628
$$ plain form
10534 93583340 69782209 53374083 42452837 35066628 29912380 26218528 23440798 21183083
10526 21183083 19196299 17424560 15732007 14117826 12642176 11278637 10052090 9012956
10518 9012956 8101161 7292796 6635848 6074630 5562238 5145919 4815917 4481836 4192084
10509 4192084 3913799 3669994 3438099 3225642 2957078 2755722 2573319 2361314 2204242
10500 2204242 2036248 1862075 1751035 1626365 1508620 1432275 1380774 1302600 1237245 1190656
10490 1190656 1143873 1097228 1069115 1032906 1007364 982644 941156 929459 931592 924419 923025 904643
10478 904643 869730 863425 852056 827212 839355 878288 901145 957765 1076732 1196350 1311441
10467 1311441 1420976 1520989 1587626 1597960 1551446 1413850 1307204 1188410 1065631 915003
10457I15003j19951n5894q8946j07857n1640l4176n781M327J4676P593l3419o7355
10445C76580p151j259M079k6787j7749L1400P174q776l878k6426n5543r672l408
10432B58584k4306J965k7876p81J4977k4924j1627J0587J7130M4592J7984M7086
10420C23391P0651M6097L7970M2371K3103p120m617M337j578k1150q037K6506
10408E31924n707n5338m4340k6659k1763j916k0434l152o7660l9965r044M1926
10396B77872K869l2607m8986m0428k4349p378N999K9093K2513k6086m0269j0329
10384A07914L9357o604j8575J9847o464k1930J2825K516l2483k8939J9089k1864
10372F4689l3702k4907l2745J5972M649m428K2976K0519K1202l1419m9009n901
$$ plain form
10457 915003 795052 739158 650212 542355 490715 456539 450758 455085 469761 477354 443935 376580
10445 376580 369429 368170 372249 345462 327713 359113 366287 357511 353633 327207 271664 261992 258584
10432 258584 234278 236243 208367 207586 222563 197639 186012 196599 213729 258321 276305 323391
10420 323391 394042 440139 478109 520480 543583 536463 531846 536183 534605 513455 505418 531924
10408 531924 526217 470879 426539 399880 378117 376201 355767 352615 284955 244990 235946 277872
10396 277872 280741 248134 199148 158720 134371 126993 132992 162085 184598 158512 118243 107914
10384 107914 147271 140667 122092 141939 135475 113545 126370 128886 96403 67464 86553 64689
10372 64689 30987 6080 -26665 -10693 -6044 -10472 12504 33023 54225 22806 -26203 -32104
10360c2104M3171K6239p474l6160j823M1845M7078J1050M4237K1820M204r548
10348A52535J5031m027Q249l5141j7669M4449R513K9851o790M496J6997n106M815
10335B17203R044L1692l4678n5311k4412j4619m0426l4568k987L8465l279l9096
10323D7028J7649M4673q957k7410P091k2406j5502J5891K2627J9291K1265O598
10311A27838n676j6843P875p859N310n459J283j7129j7137P166J5296m162k182
10298H8321k8062R629M7306L2283k3690j4984L0955j6194o0671j5460J8727K1990
10286I0150J4862l0934k0815n20Q250j5292l2163j5229j461J0684K5960k7741
10274E751K2252L7712k2612R315n644K689k5493j5447q544l9404m0717J0340M1580
$$ plain form
10360 -32104 11067 37306 29832 -6328 -8151 33694 80772 91822 136059 157879 162083 152535
10348 152535 167566 163539 171788 136647 118978 163427 172940 202791 196001 200497 217494 212388 217203
10335 217203 226247 257939 223261 167950 143538 128919 88493 53925 50938 89403 86124 47028
10323 47028 64677 109350 100393 72983 80074 57668 42166 58057 80684 99975 121240 127838
10311 127838 122162 105319 113194 105335 110645 105186 106469 89340 72203 79369 94665 90503 88321
10298 88321 60259 69888 117194 149477 125787 110803 141758 125564 64893 49433 68160 90150
10286 90150 105012 74078 53263 52743 60993 45701 13538 -1691 -3152 7532 33492 5751
10274 5751 28003 65715 43103 52418 46774 49463 23970 8523 -21 -39425 -80142 -69802 -28222
10261b8222L0119K204k9786J0371k2498L969K4006m330J1892m081j6227k0342
10249d2925M745K6997K9566m2055k9532J6487j15J9824K7263L0938P0476J6932
10237A28601j9606j294J2319K7940L6264r24m9311l8529K0655J3657q772j2969
10225A08031M363k1404j1582J5853K3358j9004k8589l5531j1916k8405m534j5652
10213b5012n841L8354M4917J2871L2067l0856m6329j1292K6791MJ7140k2300J3623
10200D4137j4403m7171R747L1503n902j814O938J2942k6204J6745k0670j1362
10188e514l282K541O658J7740J8806L6367p923j5353k28K721p357n032L876J3784
10174E7804k1123K633j3899k426L3031l0037r032p801J2812K3111O741N246J2379
$$ plain form
10261 -28222 1897 4101 -25685 -15314 -37812 -33843 -9837 -14167 -2275 -6356 -22583 -42925
10249 -42925 -38180 -11183 18383 -23672 -53204 -36717 -36832 -17008 10255 41193 111669 128601
10237 128601 108995 107701 120020 147960 184224 183300 133989 95460 116115 129772 121000 108031
10225 108031 112394 90990 79408 95261 118619 99615 71026 35495 23579 -4826 -9360 -25012
10213 -25012 -30853 7501 52418 65289 97356 66500 20171 8879 35670 35674 52814 30514 44137
10200 44137 29734 -17437 -7690 23813 17911 16097 23035 35977 9773 26518 5848 -5514
10188 -5514 -8796 -6255 403 18143 36949 73316 65393 50040 49812 52533 45176 40144 44020 57804
10174 57804 36681 39314 25415 22989 56020 25983 16951 9150 21962 45073 51814 57060 69439
10161F9439j7476k3381L1244K6007J3372P988K6826K5356L0426k174P104Q076
10149B02807R986J00633R9285J51797K43921K77821L01093K85660K64111J89812
10139B126926R4658P406p6517k06974k05821k16780k87676k63628k50466j82781
10129E38347j27061j16076l8728j4660k1774l8977l0693m2217J6495K7376K2743
10118A74775l0673m9675m1671K5585L879N704r218Q807K4983m962p669M315j3947
10105I0233l790k1494l8755L7596L4598j8214m2345O863q553l034M0151L926j276
10092G5906k0590O942O867N599p454l6397J4835K1407o31J9450r895q019J2688
10079H0708J8506K4242J199M2736o993J594k5216J4079K6390L8835j3800j8158
$$ plain form
10161 69439 51963 28582 59826 85833 99205 107193 134019 159375 189801 187627 194731 202807
10149 202807 212793 313426 412711 564508 808429 1086250 1387343 1673003 1937114 2126926
10139 2126926 2221584 2228990 2152473 1945499 1739678 1522898 1235222 971594 721128 538347
10129 538347 411286 295210 256482 241822 220048 181071 150378 108161 124656 152032 174775
10118 174775 144102 94427 52756 78341 82220 87924 78706 87513 112496 107534 99865 104180 90233
10105 90233 86443 64949 26194 63790 98388 80174 37829 44692 36139 33105 73256 77182 75906
10092 75906 55316 62258 69125 74724 67270 30873 45708 67115 66484 85934 76039 68020 80708
10079 80708 99214 123456 124655 167391 160398 161992 136776 150855 177245 216080 202280 184122
10067A84122J3459M3183J2617J6364O4370O5918P1687J27523J53113J68478K36455
10056A157289M25101Q33901J704058L508492J914515j385252j585546k098872
10048D473686j665944r23318n47295l49459k35152j87057j27389p6702n6332k1800
10038B83238j6564k9843l5089k2956k9377K879r459j2383q125k2191o568k0302
10026G3260j0396O384l2275j5615M0574J1659j9562J9612n213J3946l6519j2890
10014C2965j2153j4275j9993J8627L262M29P842K221J8765J4093K612j8611l1325
10001D459P160J1892J0264L4200n23L084M665k8582j42j1977o1290J9708L9537
9988C2455K5246o613m1283l0082N901K3650J9751p525l3048J6928K7048l6775
$$ plain form
10067 184122 197581 240764 253381 269745 334115 400033 471720 599243 752356 920834 1157289
10056 1157289 1582390 2416291 4120349 7628841 9543356 8158104 6572558 4473686
10048 4473686 2807742 1884424 1337129 987670 752518 565461 438072 361370 305038 283238
10038 283238 266674 236831 201742 178786 149409 152288 142829 130446 122321 100130 93562 73260
10026 73260 62864 69248 36973 21358 61932 73591 54029 73641 68428 82374 45855 32965
10014 32965 20812 6537 -13456 5171 8433 8862 16704 18925 37690 51783 54395 35784 4459
10001 4459 11619 23511 33775 67975 67452 70536 75201 46619 46477 34500 -26790 -7082 32455
9988 32455 57701 51088 9805 -20277 -14376 9274 29025 21500 -11548 5380 32428 -4347
9976d347m2611L3070K0663Q899n60J7541m895o034L381L7530j3663l5980j7460
9963d466J3748r032p18K4038K4615J5543k6839n8421j9438J0830J1548J2807Q704
9950B919k9127l6475j198N2775J9362m679J9304K8497K9910R888J2271l3936l2584
9937C6927K6437K1247j1121k7491l6342l3024l738L3730k0231J511K1430K690
9925A2025j9792O519M4290J9177j6051r730l0996r347J1440J9352M748l362j7687
9912A0586j8206n333K688J1526k656k6370l293J5931L1297o873Q531j591m578
9899A1659j2057m3J1340n835m0480J3210K7495j2334K2535J7543O182K9391o767
9886F1839l9149j4272r757j3970j5936k409K1243J2089r360k5455m909J8051L2110
$$ plain form
9976 -4347 -46958 -13888 6775 15674 15114 32655 27760 21726 25107 62637 48974 12994 -4466
9963 -4466 9282 250 -468 23570 48185 63728 36889 -21532 -40970 -30140 -18592 -5785 2919
9950 2919 -26208 -62683 -63881 -11106 8256 3577 22881 51378 81288 91176 103447 69511 36927
9937 36927 63364 84611 73490 45999 9657 -23367 -27105 6625 -13606 -12095 9335 12025
9925 12025 -7767 -1248 43042 62219 46168 36438 5442 -3905 7535 26887 31635 28273 10586
9912 10586 -7620 -12953 -10265 1261 -1395 -27765 -31058 -15127 16170 9297 17828 16237 11659
9899 11659 -398 -441 10899 5064 -35416 -22206 5289 -7045 15490 33033 39215 68606 61839
9886 61839 22690 8418 -1339 -15309 -31245 -33654 -12411 -322 -9682 -35137 -40046 -21995 10115
9873A0115j6488j5725O179j4574K010k7506J3320J5917M942k063q000R217j0660
9860c3316k1621M5883R553j129j7528O496K6664j8542m599j0496K71k258J849
9847a8773l5638K3026K2055j2252J4640L8487l43l9996m8926J5030J3309K6046
9835c335K4038P501K9330j4578q676o118p014N762J0310k7951n0109K1521J3796
9822e523l642K203P841L298k1977L618n932p616j1148J9702L5287j1020J2800
9809A7891j2445j1033j1331K5157Q698N019l789k9028l1379o770L1236O297K3751
9796A2274J4924m3658l0200p762J5340J2411j3856j0048J4730K0394P864l706
9784a1293L4999l197j0053p758k6368L6261K4612k4462J6826J4177k9168L300
$$ plain form
9873 10115 -6373 -22098 -15919 -30493 -28483 -55989 -42669 -26752 -21810 -23873 -31873 -22656 -33316
9860 -33316 -54937 -9054 499 -630 -18158 -11662 15002 -3540 -8139 -18635 -18364 -20622 -18773
9847 -18773 -54411 -31385 -9330 -21582 -6942 31545 31202 -8794 -57720 -42690 -29381 -3335
9835 -3335 20703 28204 57534 42956 34280 28162 21148 26910 37220 9269 -40840 -19319 -5523
9822 -5523 -9165 -6962 879 4177 -17800 -14182 -20114 -27730 -38878 -19176 16111 5091 17891
9809 17891 5446 -5587 -16918 8239 16937 21956 18167 -10861 -42240 -49010 -17774 -11477 12274
9796 12274 27198 -16460 -46660 -54422 -39082 -26671 -40527 -50575 -35845 -15451 -7587 -11293
9784 -11293 23706 20509 10456 2698 -23670 12591 37203 12741 29567 43744 14576 17876
9772A7876K0210j8566o3598k2423J8727J2590K3206K2461J3687o539j5263K7032
9760B9400J3071r236K867k221k5385k6680r056R344K0172n677l6181Q190J5372
9747a6020M704j2110r34L124K1597n740q839J8110p581M2407M251J3472k6506
9734B9935m4500k733j4894J3923M2743J0119l4885m517L329j9764M7608J0097
9722C6461m302r930l3483j4590J7062K1533j8682l4040K418K8049k7081j290j6180
9709e4055J8851N3392l3051j4484n423R532l328R105j4776n191l6870l0161m534
9696a10993M1263j1264J5165P0352K762j1144P661k006k1997L1145q120k2548
9684a9724J1406p331K2348K1165k1717j4378K1796l837j1931j6073Q989o429m293
$$ plain form
9772 17876 38086 19520 -44078 -66501 -47774 -35184 -11978 10483 24170 17631 2368 29400
9760 29400 42471 33235 36102 33881 8496 -18184 -27240 -17896 2276 -3401 -39582 -31392 -16020
9747 -16020 -11316 -23426 -24360 -21236 361 -5379 -14218 3892 -3689 38718 42969 56441 29935
9734 29935 -14565 -17298 -32192 -18269 24474 34593 -292 -4809 -1480 -21244 26364 36461
9722 36461 32159 22229 -11254 -25844 -8782 12751 -5931 -39971 -37553 -9504 -36585 -37875 -54055
9709 -54055 -35204 18188 -14863 -29347 -34770 -25238 -28566 -19461 -34237 -39428 -76298 -106459 -110993
9696 -110993 -69730 -80994 -65829 4523 7285 -3859 3802 1796 -20201 10944 2824 -19724
9684 -19724 -8318 -15649 6699 27864 6147 -8231 13565 9728 -2203 -18276 -9287 -15716 -20009
9671b0009O917P237j0264M4169L9946k8130k5434j6772k728L2144L2248j8727
9659D0597l2659j972k4763J6687j5510p629L0029o661l0717N045M2002L5504n77
9646D9376L085p798k0359l094j9528l4756K1569P431L1317j3284j220J6600K152
9633C1491P720n0835k7472J2841N0m361j1022Q802L5474J9157J3194K1800P332
9620F4171n0236k2377r206K8814N3391P468k0089k7162k1190j4488K6415K7423
9608D2934J4233P947p296K306m1234K7196J1112O669p384k2201j7338K8236l8802
9595F378m8869j1911J7107N6044L600q411n322j0072k9584J4906J8045l157l3498
9582c4744n612J5671M1473j7437j585m6245q603K1171l756K025K9265N1978J4804
$$ plain form
9671 -20009 -13092 -5855 -16119 28050 67996 39866 14432 -2340 -5068 27076 59324 40597
9659 40597 7938 5966 -18797 -2110 -17620 -25249 4780 -1881 -32598 -27553 14449 49953 49376
9646 49376 52461 44663 24304 21210 1682 -33074 -11505 -4074 27243 13959 12739 29339 31491
9633 31491 39211 -11624 -39096 -26255 -26205 -30566 -41588 -32786 2688 21845 35039 56839 64171
9620 64171 13935 -8442 -17648 11166 64557 72025 51936 24774 3584 -10904 15511 42934
9608 42934 57167 65114 57818 60124 18890 46086 57198 63867 56483 34282 16944 45180 6378
9595 6378 -42491 -54402 -37295 18749 22349 13938 8616 -1456 -31040 -16134 1911 -1246 -34744
9582 -34744 -40356 -24685 16788 -649 -2234 -48479 -57082 -35911 -39667 -37642 -8377 43601 58405
9569E8405j2104l9088j8436M1331l9269n9387J4398Q898j8475L5964J1563j9078
9557c5278L719n025k8683K1310K6452k745J0656K030n789o89l657J8474R025j0292
9543d92j8872k3992O713l645j5122J4261m905R160J3745K3142j3792K91K0308
9530F800q317j6009j3654r097M997l3638J7805N5515L6945J7873J0383k0282l1761
9517A7560j592M543M50k5457Q645J0205j4543K0692J3808J3717M373n4970l8685
9504d1254l523K4637K1228o086n704r463J9075J6270p88P243K890j1936m5612
9491c3023n2980L425L0188q194Q521L2963K8063n735K4168J0998j6867j5651l0616
9478b4740P397N288m0002j3098K0492K3079N869q652j5617M894M0660O967K9551
$$ plain form
9569 58405 46301 7213 -11223 30108 -9161 -68548 -54150 -45252 -63727 -27763 -16200 -35278
9557 -35278 -31559 -36584 -65267 -43957 -17505 -20250 -9594 -7564 -13353 -14042 -17699 775 9800 -492
9543 -492 -19364 -43356 -36643 -40288 -55410 -41149 -46054 -36894 -23149 -7 -13799 -13508 6800
9530 6800 -1517 -17526 -31180 -40277 -35280 -68918 -51113 4402 41347 59220 69603 49321 17560
9517 17560 15968 20511 20961 -4496 4149 14354 -189 20503 34311 48028 52401 -2569 -41254
9504 -41254 -44777 -20140 1088 -4998 -10702 -20165 -1090 15180 14392 21635 24525 12589 -33023
9491 -33023 -86003 -82578 -52390 -60584 -52063 -19100 8963 3228 27396 38394 21527 5876 -24740
9478 -24740 -17343 -12055 -52057 -65155 -44663 -21584 -15715 -24367 -39984 -35090 5570 12537 42088
9465D2088R720l7418n464K8377K7024M303K0032k9714l4822j4202l2501J8258
9453d319L6054j5218j7774k2527r773r65o652Q456K5769K3272j0799l3982j4558
9440d3016M5452J2773l1470j6173l4595m2334K5521L8683J7362J9574N2366K4290
9428F8433j5182k6205k5720k4501q076J3317j0902R587Q771O449K1416J7550k6140
9415H797j3362Q047J1040l1144R466O88j0251K8128j2821l2032M788L2029K7315
9402C0688M111j7118Q970J3502J0147K1701k2502j9103k9775k7772J2914K6260
9390A2023q91k3541J5555L2311j3130k0191p508m072R407l627j1667l515l6914
9377e5760n787K1776J0833J2910O744p187l028j915j8077r215M5952M0138O538
$$ plain form
9465 42088 51808 14390 8926 37303 64327 68630 88662 58948 24126 9924 -22577 -4319
9453 -4319 31735 16517 -1257 -23784 -33557 -34522 -41174 -32718 -6949 16323 5524 -28458 -43016
9440 -43016 2436 15209 -16261 -32434 -67029 -109363 -83842 -45159 -27797 -8223 44143 68433
9428 68433 53251 27046 1326 -23175 -31251 -17934 -28836 -19249 -10478 -4029 17387 34937 8797
9415 8797 -4565 3482 14522 -16622 -7156 -6468 -16719 11409 -1412 -33444 -28656 3373 30688
9402 30688 34799 17681 26651 40153 50300 72001 49499 30396 621 -27151 -14237 12023
9390 12023 11132 -12409 3146 35457 22327 2136 -5372 -9444 -37 -3664 -15331 -18846 -55760
9377 -55760 -61547 -39771 -28938 -16028 -9284 -16471 -19499 -21414 -39491 -48706 -2754 37384 43922
9364D3922k8220k5197K3441j5140k5782P966j3491r003K6696L9328o360p841j3681
9351c362k3233M9211K1600j1014K0745l3310k5508P862L5085P833k3826k5736
9339c653k0597K4697N2398J1616J0844k395k2168K563J4581l9735j9183j4965
9327e997J4910J3294J9298r559r517j3485k2096n703K1830K5739j928p004L3613
9314E3395n118r396l944j7786R93K1618l085J8067q197m4913j9624K0709L4265
9301C6984j2943n4381K8620M28j3284J1583k3097n465M906J5649l885j1032R081
9288a6836P785k3395j6324M259L2201J9697q265K8397J8380L429L38k7993p495
9275A4178o2113q555L4930J5234L1896n392j9158J6213L075j8233O450n467K6024
$$ plain form
9364 43922 15702 -9495 13946 -1194 -26976 -19010 -32501 -41504 -14808 24520 18160 10319 -3362
9351 -3362 -26595 22616 44216 33202 53947 20637 -4871 2991 38076 45909 22083 -3653
9339 -3653 -24250 447 52845 64461 75305 72910 50742 53305 67886 28151 8968 -5997
9327 -5997 8913 22207 41505 31946 22429 8944 -13152 -18855 2975 28714 26786 19782 53395
9314 53395 48277 38881 34937 17151 18144 39762 36677 54744 46547 1634 -17990 2719 36984
9301 36984 24041 -30340 -1720 -1292 -14576 -2993 -26090 -31555 -26649 -11000 -14885 -25917 -16836
9288 -16836 -9051 -32446 -48770 -44511 -12310 7387 -878 27519 45899 49328 49666 21673 14178
9275 14178 -47935 -56490 -21560 -6326 25570 20178 1020 17233 20308 2075 8525 3058 29082
9262B9082j384o103R903J9875l638m7764N734J1306J3757L0941q213j2758l7818
9249B920p974J8457p299O015Q435n250k585r902N833k763M261J1579l875k4535
9235f683k8538J3813M9739K3649j0738o419N423K6112J1932l9061l3632o675L832
9222B754j4101m844K5908J1771k3577j9254k6096J1326L8436K4052r837j571j5492
9209e25R892j2934n102O263Q825j3967k4179L6125K0771q993R817M2372j6254
9196E2111j0621k2115n0085k1163m896K7892L0701J4417j7929K2848l2318j001
9184a2159K7529J9219K2906K308k6055j8325M381J2216j0716k7691j9555K1920
9172d022L288K6497J7709Q10P265l0131m5774l2159J5799P719m806p08M678K0310
$$ plain form
9262 29082 27698 21595 31498 51373 47735 -29 5705 17011 30768 61709 53496 40738 2920
9249 2920 -5054 13403 6104 12119 20554 15304 12719 2817 8650 5887 10148 21727 17852 -6683
9235 -6683 -35221 -21408 28331 51980 41242 34823 40246 66358 78290 39229 5597 -1078 2754
9222 2754 -11347 -16191 9717 21488 -2089 -21343 -47439 -36113 2323 26375 16538 14967 -525
9209 -525 9367 -3567 -8669 -2406 6419 -7548 -31727 4398 25169 16176 25993 68365 52111
9196 52111 41490 19375 -30710 -51873 -56769 -28877 1824 16241 -1688 21160 -11158 -12159
9184 -12159 15370 34589 57495 59803 33748 15423 19804 32020 21304 -6387 -25942 -4022
9172 -4022 -734 25763 43472 44282 51547 21416 -24358 -56517 -40718 -32999 -37805 -38513 -33835 -13525
9158a3525k1003J6078M0422J1981J1376j528j8976j4131K4319K6222M1569N569
9146A08373N381j0476j8716m4815j4579j4874P890J9454K567K9212Q965k7825
9134E0557j4142L944r620K2174J3718K0570j0197M707K3607Q114L3524Q120j2287
9121A42789o972K2547r400J7134L3640n326j1289k8129k4741j0570J3425P841
9109A40949N65K2459L7850O298K87l551q801L9864J7144K736J2807L4345L7143
9096C40095N4430K7221K7390j3768J6409M7064J8725J9340N3695P8691O2356P1599
9084H03247J53156J95052J58487K07698K32782K60074L20944M34579N83076P82385
9074D131480J076578J513290K195615L047162L669653L121288R95483j262313
$$ plain form
9158 -13525 -34528 -18450 21972 33953 45329 43801 24825 10694 35013 61235 102804 108373
9146 108373 113754 103278 84562 39747 25168 10294 18184 37638 40205 69417 78382 50557
9134 50557 36415 40359 30739 52913 66631 87201 77004 81711 105318 113432 146956 155076 142789
9121 142789 135817 158364 148964 166098 199738 194412 183123 154994 130253 119683 133108 140949
9109 140949 141514 163973 201823 208121 208408 204857 196056 235920 253064 255800 268607 302952 340095
9096 340095 394525 421746 449136 435368 451777 498841 517566 536906 590601 669292 731648 803247
9084 803247 956403 1151455 1309942 1517640 1750422 2010496 2331440 2766019 3349095 4131480
9074 4131480 5208058 6721348 8916963 11964125 15633778 18755066 19750549 18488236
9066A8488236k687071l132459k849420k216407j686693j259063r31724p24895
9058C000504n45160m13386l20961k40312k16103j65289j22041j10134j24683p7772
9048F64663q8262p3001l6462j3981k9412m2301j3044J0509k7179m6942j8811k9677
9036B56100l8770k7212n797J1133l7253m4853k1143K2209N7600k3421q956j3341
9024A26296l8232M623M7326K4486j1184J960K5397k3160n0455l5154m775p500
9012E9628J3567K1577j8869j4549j8145j4441J3516j4997J4096K6632j1549k5325
9000C1141k6125J1334m010J2966N369q225J9685L2583L0909j530j57q317l4676
8987F0947j8059P128R896j1425J4925n5752j0557K2978L265R958M628J6674R640
$$ plain form
9066 18488236 15801165 12668706 9819286 7602879 5916186 4657123 3725399 3000504
9058 3000504 2455344 2041958 1720997 1480685 1264582 1099293 977252 867118 742435 664663
9048 664663 576401 503400 466938 452957 423545 381244 368200 378709 351530 304588 285777 256100
9036 256100 217330 190118 184321 195454 158201 113348 92205 114414 172014 148593 139637 126296
9024 126296 88064 92687 140013 164499 153315 155275 180672 157512 107057 71903 67128 59628
9012 59628 73195 94772 75903 61354 43209 28768 42284 27287 41383 68015 56466 31141
9000 31141 5016 16350 12340 25306 30675 22450 42135 74718 105627 104097 103940 95623 60947
8987 60947 42888 50016 59912 48487 63412 7660 -2897 20081 23346 33304 37932 54606 64246
8974F4246j6608l323K9816K005j590j4833Q923m770m658k6235m656j2806K626
8961A8137K4802J1724j9964p801J7397K7140k8659k2160K6385o994L3503R195
8949H2705l4309m8695j6971M9414M4439J0766j2500k7552j9648k3050l80K0736
8937B4955J1688j5199J7731J1938o521m2663O171K2211o911Q641p743k5745L0601
8924B9154j6875j8991j2207K1174K5633k84m49K0412j069k7283j4665K4783j1690
8911A7643O772j7022n064K1446J7251J2016l2638J2032L2819J5611M721J8930
8899A04517J8225P372J2829K6496l1845l3453m202Q207J6651r826Q326N0668L2959
8886B06924L8040L6455p744L7407P3866M2632L9024N6630J08711J25148K29291
$$ plain form
8974 64246 47638 44315 74131 76136 74546 59713 68636 63866 59208 32973 28317 15511 18137
8961 18137 42939 54663 34699 26898 44295 71435 42776 20616 47001 40007 73510 82705
8949 82705 48396 -299 -17270 32144 76583 87349 74849 47297 27649 4599 4219 24955
8937 24955 36643 21444 39175 51113 44592 1929 8100 30311 23400 32041 24298 -1447 29154
8924 29154 12279 -6712 -18919 2255 27888 27604 27155 47567 46498 19215 4550 29333 17643
8911 17643 24415 7393 2329 23775 41026 53042 20404 32436 65255 80866 85587 104517
8899 104517 122742 130114 142943 169439 137594 104141 99939 108146 124797 114971 123297 173965 206924
8886 206924 244964 281419 273675 311082 384948 427580 466604 523234 631945 757093 986384
8875I86384K80567M42924P06983J100429J321650O69020l12546q52792j024155
8866C318464q94641o29517m65276l35452k22809j32779j02811j01022m1216o4724
8856C28217m1013O288m7981k5322K6137q468m5625k5122k4567l9369J171J2455
8844A16801o4348k3715L8641J2038k2601j0706q278J7111J706k725p611N42j1065
8831C5790r452J3132k4429k9821K0048J5073j6512J1938M5601k2854n4845J0827
8819e504j107K7670p2k3051j50K5601p429l122N825k4594k3874j2337K7445k6044
8805d0743k0686J3574J8167l675N189J4832J4403J4938j7346L032N62L304o01
8792D950j1181K4778M2477n412k1367j2425p341J461K4081j0758r344Q199J1118
$$ plain form
8875 986384 1266951 1709875 2416858 3517287 4838937 5507957 5195411 4342619 3318464
8866 3318464 2423823 1794306 1329030 993578 770769 637990 535179 434157 392941 328217
8856 328217 287204 293492 245511 220189 246326 237858 192233 167111 142544 103175 104346 116801
8844 116801 52453 28738 67379 79417 56816 46110 37832 54943 56649 53924 46313 46855 35790
8831 35790 26338 39470 15041 -14780 5268 20341 3829 15767 61368 38514 -16331 -5504
8819 -5504 -6611 21059 20987 -2064 -2214 23387 15958 12836 18661 -5933 -29807 -42144 -14699 -40743
8805 -40743 -61429 -47855 -29688 -33363 -28174 -13342 1061 15999 -1347 1685 2247 5551 4950
8792 4950 -6231 18547 61024 55612 34245 21820 14479 15940 40021 29263 19919 28118 39236
8779C9236j8067Q043L3724k410J0675l196k5588j6530J1318l638m1528k8521N575
8766c0907M7135N3450K1200r365r760o582p399k6752k9872j6192o485j1691J3180
8753b0040L538K1458q04K3535P124p486J2140j1406j8932J3066l094j4961N596
8740I734r835m322K5666q773j6551j4764p270j0136M613j063J0094K2019o229
8727f817M763J4575J2327Q421m6383j9504K6460K4044J089j4664j8822j3040J7638
8714i913L1531R194j2860k7840k6456J4847J2074Q898j3499k5734j8024K38K2099
8701c5445K6966N981L0499K4676J0518j1012n4250N33J2780k9702K3880p548k6699
8688b8823J5416l1719j820L7235j6630n686K6667K9294q757j173l1063k5242L6320
$$ plain form
8779 39236 21169 29212 62936 60526 71201 68005 42417 25887 37205 33567 -7961 -36482 -30907
8766 -30907 16228 69678 90878 81513 71753 65171 57772 31020 1148 -15044 -21529 -33220 -20040
8753 -20040 -16502 4956 4152 27687 34811 27325 39465 28059 9127 22193 19099 4138 9734
8740 9734 -101 -4423 21243 12470 -4081 -18845 -26115 -36251 -31638 -32701 -22607 -588 -6817
8727 -6817 -2054 12521 24848 33269 -13114 -32618 -6158 17886 18975 4311 -14511 -27551 -9913
8714 -9913 21618 30812 17952 -9888 -36344 -21497 -9423 -525 -14024 -39758 -57782 -57544 -35445
8701 -35445 -8479 -2498 28001 52677 63195 52183 -2067 -1534 11246 -18456 5424 -2124 -28823
8688 -28823 -13407 -45126 -46946 -9711 -26341 -32027 -5360 23934 15177 14004 -17059 -42301 -5981
8675e981K1587j6182j2845k554R777j4395k5030J4235J1083M7Q612K697K2138
8662A3189n42K5050K9565j0616m5716J8271k1259j9278M4101k6124j5965K995
8650f329j1089L5116p995j1246M439j7022J6782k1512k1719K5573r519J1992q473
8637b1002q416J3256K340k487N3053j7820k7539L9169N3437k2522l6518L964J9508
8624D8423K0425j8037j1928j0386j0393J4371K195J5498K1696l6766l3605J0598
8612A2091K5916K7377l4091j7752M2237N0052K6506q476k5956k2343K8362k1465
8600H2458k4751J3563K5866J3366J6651j1909m6762j3082K464l1003j6958K4646
8588C4549Q88j1506L811j6631j0482K5793K7740m0465j8812J5544l7114j8938
$$ plain form
8675 -5981 15606 -576 -13421 -15975 -6198 -20593 -45623 -31388 -20305 -20258 -11646 -8949 13189
8662 13189 12647 37697 67262 56646 10930 29201 7942 -11336 32765 6641 -9324 -6329
8650 -6329 -17418 17698 9703 -1543 2896 -14126 2656 -18856 -40575 -15002 -24521 -12529 -21002
8637 -21002 -29418 -16162 -13822 -16309 36744 18924 -8615 30554 83991 61469 24951 28915 48423
8624 48423 68848 50811 38883 28497 18104 32475 34670 50168 71864 35098 1493 12091
8612 12091 38007 65384 31293 13541 55778 105830 132336 123860 97904 75561 103923 82458
8600 82458 57707 71270 97136 110502 127153 115244 68482 55400 57864 26861 9903 34549
8588 34549 35437 23931 27742 11111 629 26422 54162 13697 -5115 10429 -26685 -45623
8576d5623l9030p660K6500K5775j411M166o901L7925K1690J8258J0358j7543j0880
8563A5624j3671j8925l0254q864L501J7691J6041J3829p623P983j5409Q221K1342
8550I486q328n294J720O98J974L54p428M145J4955n0140r495n889P806L8298K2087
8535A4949k452P003J0015K895l417j7063m6364r148R069j549R066J9632o457M3035
8521B9214q031j5446k5728j2057K7672K4051K7316m4885n1019l171L876J4031
8509c4177K8523N695J5765j8583n6436k9877L5964O8774K0006m6275r128J8783
8497i66k6726R28J4104K5176N105Q680K1606k4016N936J2776Q78M804k5274k1487
8483A524M2070J1514J4380P358j0021l0123k4678n26N581K7312j396m5733m842
$$ plain form
8576 -45623 -84653 -92313 -65813 -40038 -41449 -37283 -44184 -6259 15431 33689 44047 26504 15624
8563 15624 1953 -16972 -47226 -56090 -52589 -34898 -18857 -5028 -12651 -4668 -20077 -11856 9486
8550 9486 1158 -4136 -2416 -1718 256 610 -6818 -2673 12282 -37858 -47353 -53242 -45436 -7138 14949
8535 14949 12497 19500 29515 32410 28993 11930 -34434 -43582 -34513 -36062 -26996 -7364 -13821 29214
8521 29214 21183 5737 -19991 -32048 -4376 19675 46991 2106 -48913 -52084 -48208 -34177
8509 -34177 -5654 41 15806 -2777 -59213 -89090 -53126 15648 35654 -10621 -19749 -966
8497 -966 -27692 -26764 -12660 12516 17621 26301 47907 23891 29827 42603 43481 48285 23011 1524
8483 1524 43594 55108 69488 76846 66825 36702 12024 11498 17079 44391 42995 -2738 -7580
8470g580j4370m919j312q152J4723Q676K0373L9313k6794j9694j4471k2003l0363
8457f6573P442M7856M2735l8257j334J7508M2030j2842k6201k8462M033r561R87
8444b0639J7565K7486n533J6351k2369j1853P292L6553K1j8695j4876k2545K387
8431h855L606K3118K5513j8513R849L737k343J1239J685J2994L1003p524o181
8418G9328n20k7837k5595j5445r399o6757J7247M6408n225k2718K1420J477J0602
8405B986J416P041m2548r757M1175P440j1482o146M82m1189K3474L2809K693L2578
8391D0972k0073k5449L5K8688l2537m8537J9333K8594L1631K7126L140l4219l3428
8378a4724m163L5247m594k7503l4016M269P279l6520M658L6727L9806k4901m939
$$ plain form
8470 -7580 -21950 -26869 -28181 -36333 -21610 -12934 7439 46752 19958 264 -14207 -36210 -66573
8457 -66573 -59131 -11275 31460 -6797 -8131 9377 51407 38565 12364 -16098 -12065 -21626 -20639
8444 -20639 -3074 24412 18879 35230 12861 1008 8300 44853 44874 26179 11303 -11242 -8855
8431 -8855 -5249 17869 43382 24869 34718 38455 36112 47351 49036 62030 93033 85509 79328
8418 79328 78808 50971 25376 9931 532 -66225 -48978 -2570 -7795 -30513 -9093 -7616 2986
8405 2986 4402 11443 -31105 -40862 313 7753 -3729 -9875 -9393 -50582 -27108 5701 8394 40972
8391 40972 20899 -4550 -4515 24173 -8364 -56901 -37568 -8974 22657 49783 52923 18704 -14724
8378 -14724 -18887 16360 11766 -15737 -49753 -45484 -38205 -74725 -70067 -33340 6466 -18435 -23374
8365b3374L0911J500j3623L617j3638k8000j6153k221r980K4784K3724J8940N330
8352A817j0464m5998L3761M9924j9120j4377J2963j239J1047R870k0549K051J9525
8339B9211J7143M4461o01j5393N21m3234m5892j1704R475k6210p2758L1710K3567
8326e9704l40J9220L8022M6096j1993j2182k7920j7408k066j8120L4572K5857
8314A4034M583l1714l9828m142L549O417L3986J2305k4229O479J154j178j1794
8301c0378j7878m816K3633M489r481N6556O19j8896l0022j7698J0461J0259R528
8288a3624Q940j3710j5825K1938l123L371l722q081j4923p078J9123j8723j5572
8275f1009k061L298o334J7099K0924L1820J0874k6896k6743m334J510L3909J5724
$$ plain form
8365 -23374 7537 9037 -4586 -969 -14607 -42607 -58760 -60981 -70961 -46177 -22453 -3513 1817
8352 1817 -8647 -54645 -20884 29040 9920 -4457 8506 7267 18314 28184 7635 9686 29211
8339 29211 46354 90815 90214 74821 75342 32108 -13784 -25488 -16013 -42223 -114981 -83271 -59704
8326 -59704 -60044 -40824 -2802 43294 31301 19119 -8801 -26209 -28275 -46395 -11823 14034
8314 14034 18617 -13097 -52925 -57067 -53518 -47101 -13115 -810 -25039 -18560 -17406 -18584 -30378
8301 -30378 -48256 -53072 -29439 -24950 -34431 22125 22744 3848 -26174 -43872 -33411 -23152 -13624
8288 -13624 -4684 -18394 -34219 -12281 -15404 -12033 -15755 -23836 -38759 -45837 -26714 -45437 -61009
8275 -61009 -63070 -59772 -66106 -49007 -28083 3737 14611 -12285 -39028 -43362 -41852 -7943 7781
8262G781L551k2850k1939R297p825j9787K2699J9117K054j804j0169j166J0225
8249a0816J6637k2448j1880L8272L4094J2826j3421q566J3737k2820K390r098
8237A8907j5355m7257k0939k326k3467J4285K8010K1210l977J3980j428p616j1325
8224c7298o95N1293J6275K667K1484k283k6299n4385Q710L1813l790k1961j4670
8211b9139J2277J7665J1400j9432k1063J6497K6497j9969n1433J2802L5581K4953
8199A6636J5178j734j9070k1770L9324K7140J5812j3559l4390q192Q049l2390
8187h966J9320M4273m9212m1296K5464L3366J1771l1795N426j8021J0390J5598
8175A6318k6583k8735K8597O922k0289j3968l7206J9617L0738Q552j0081L6583
$$ plain form
8262 7781 11332 -11518 -33457 -24160 -31985 -51772 -29073 -9956 -7902 -9706 -19875 -21041 -10816
8249 -10816 5821 -16627 -28507 9765 43859 56685 43264 34698 48435 25615 28005 18907
8237 18907 3552 -43705 -64644 -66970 -90437 -76152 -48142 -26932 -30909 -16929 -18357 -25973 -37298
8224 -37298 -37993 13300 29575 32242 53726 51443 25144 -29241 -20531 11282 7492 -14469 -29139
8211 -29139 -16862 803 12203 -7229 -28292 -11795 14702 -5267 -56700 -43898 -8317 16636
8199 16636 31814 30080 11010 -10760 28564 55704 71516 57957 23567 15375 23424 -8966
8187 -8966 10354 54627 5415 -35881 -10417 22949 34720 2925 8351 -9670 720 16318
8175 16318 -10265 -39000 -10403 -3481 -23770 -37738 -74944 -55327 -24589 -16037 -26118 10465
8163A0465k5570l0480L8855q487k4551J2771j2047K51J4516K3584P253l874j4746
8150a2060J8608m1157l514L908j1918J1328o410o240q454K2767K7618q723l2396
8137d6643j1631K9990L2957J1277J5806K8540j7305j3176j5784j5408J7022K4925
8125D0570l1196k6860K2893m265o656q147j8033R266M8472K1797o932n204K5J3539
8111D9269j4993l9353j8227j7059J3342j8822Q56R035M558J0403L4484L3872L55
8098D7720k3827k91k6861k0393J4062K5190L289K4432L1667K0296j9537j1090
8086F4657l8797p031k4192l6166J5249N7420l744k2311L276r877n948K4630K2584
8073C9750R47j9323l6427m97M755j1978J5911P505R330m720L9704J0795k059l0473
$$ plain form
8163 10465 -15105 -45585 -6730 -15217 -39768 -26997 -39044 -38793 -24277 -693 6560 2686 -12060
8150 -12060 6548 -34609 -38123 -34215 -46133 -34805 -41215 -47455 -55909 -33142 -5524 -14247 -46643
8137 -46643 -58274 -28284 4673 15950 31756 60296 42991 29815 14031 -1377 15645 40570
8125 40570 9374 -17486 5407 1142 -5514 -13661 -31694 -22428 26044 47841 40909 35705 35730 49269
8111 49269 34276 -5077 -23304 -40363 -27021 -45843 -44987 -35952 -31394 -20991 13493 47365 47720
8098 47720 23893 23602 -3259 -23652 -9590 15600 18889 43321 74988 95284 75747 64657
8086 64657 25860 18829 -5363 -41529 -26280 31140 27396 5085 8361 -1516 -7464 17166 39750
8073 39750 40697 21374 -15053 -15550 -10795 -22773 -6862 643 9973 5253 44957 55752 53693 23220
8059B3220k9585j6312o491l6189M4656J7519J5973q245l911N8981j7412M660J3819
8046F0683l1248J747L2685n866M37k4975j9826M067j910M509p365l3579Q748K4846
8032A2953K3544j72n981k4958k51j458k9770l5268J3863K8407o546k9191L7477
8019a7351L2337L2993L577k1279J1514J212l1903J513n7148j7321K3879J4180
8007b3797p556j8641M4753K6796K0425j8750j0267l9895J2124J742Q018j1949
7995a6997j9173J3702L9918L8564j8140n3824j645K6595N065O983N034J50J06
7982B6338k5736K0977K601j9338k1349l748k0032J7859L9589L4214J8723l3928
7970C6170l1076J9854o052K8979k7830K489K9581k6226q094j7205k3957j6474
$$ plain form
8059 23220 -6365 -22677 -29168 -65357 -20701 -3182 12791 4546 635 59616 42204 46864 60683
8046 60683 29435 31182 63867 58001 58438 33463 13637 17704 15794 20303 12938 -20641 -11893 12953
8032 12953 36497 36325 30344 5386 5135 3677 -26093 -61361 -47498 -19091 -25637 -54828 -17351
8019 -17351 14986 47979 51556 30277 41791 43003 11100 12613 -44535 -61856 -37977 -23797
8007 -23797 -31353 -49994 -5241 21555 41980 23230 12963 -26932 -14808 -13066 -5048 -16997
7995 -16997 -36170 -22468 17450 56014 37874 -15950 -17595 9000 14065 21048 26082 26232 26338
7982 26338 602 21579 24180 4842 -16507 -20255 -40287 -22428 17161 51375 70098 36170
7970 36170 5094 24948 18896 47875 20045 22534 52115 25889 17795 590 -23367 -39841
7958c9841K6623J9525P100J3985L762p862k2021j2715J7799O497L9158m5179k6247
7945a9416m01R314k0750j9854M6435K6608M615L0707j7244k518J88P991n0740
7932e065K239K7477k2728j8916J4319K257P559K3376J2570M6946J4063q530m5978
7919D9589k3908K0776J226J1084J5136k3682k0581K3672k9615j8168m824k4769
7907b4064r374J1477J2365N685k0773k4971J4112M8759M077l1882N156k158l602
7894a5193K802J1327J755M461L2183n246k0874N502Q641k8196n2980j9559O787
7881f8590M496J2296K0888L4291J8289K0244J4848J0910j6502m0990j8770J2078
7869C488J3154j181K8538k3478l4743J7772j4429J8020K0513o183O37r850k0263
$$ plain form
7958 -39841 -13218 6307 13407 27392 31154 23292 1271 -11444 6355 12852 52010 6831 -19416
7945 -19416 -19817 -10503 -31253 -51107 -4672 21936 26551 57258 40014 37496 37684 45675 -5065
7932 -5065 -2826 24651 1923 -16993 -2674 -417 7142 30518 43088 90034 104097 95567 49589
7919 49589 25681 46457 47683 58767 73903 50221 29640 53312 23697 5529 705 -24064
7907 -24064 -33438 -21961 -9596 -3911 -24684 -49655 -35543 13216 17293 -14589 -9433 -11591 -15193
7894 -15193 -12391 -1064 691 5152 37335 32089 11215 16717 25358 -2838 -55818 -75377 -68590
7881 -68590 -64094 -51798 -30910 3381 21670 41914 56762 67672 51170 10180 -8590 3488
7869 3488 16642 15461 43999 20521 -14222 3550 -10879 7141 27654 21471 22108 12258 -8005
7856h005p703o09o777O55L3025K6313J8154j0128j0306k3262r494j761o973n109
7842a1980k0204K8729L4584K1119m1208l2821L974K9923j0709l4419m344j1057
7830d8413Q441J5744P641K319J0837j3986o101N454r549K387q219j2484j9949
7817f5878k5942k1527L1794K7064l760l727J6327o07J4597N3782J2295m0047k6398
7804c2027J5359j9705j2160M2060N977m4827J8766L962M5592L557m0726j2306
7792b6478K1487J0667p021M3234j9538l4196J1148k0250J464J8806J3602k4602
7780a1677j7834p985L4451J2320j1422J2510j1378k6056J6127Q198L0936J0186
7768C8376j9200l5616m4250j2820j8746K7095L1492J7520r539l155K2414j202
$$ plain form
7856 -8005 -15708 -16317 -23094 -22439 10586 36899 55053 44925 34619 11357 1863 102 -6871 -11980
7842 -11980 -32184 -3455 31129 52248 11040 -21781 -17807 12116 1407 -33012 -37356 -48413
7830 -48413 -39972 -24228 -16587 -14268 -3431 -17417 -23518 -18064 -27613 -25226 -33445 -45929 -65878
7817 -65878 -91820 -113347 -81553 -54489 -58249 -61976 -45649 -46256 -31659 22123 34418 -5629 -32027
7804 -32027 -16668 -36373 -48533 -6473 -496 -45323 -26557 -22595 22997 26554 -14172 -26478
7792 -26478 -4991 5676 -1345 41889 22351 -11845 -697 -20947 -19483 -677 12925 -11677
7780 -11677 -29511 -37496 -3045 9275 -2147 10363 -1015 -27071 -10944 -2746 28190 38376
7768 38376 19176 -16440 -60690 -73510 -92256 -65161 -33669 -16149 -25688 -28843 -6429 -7631
7756g631r798M352R930J5684L0610j4824k7062n472R161m649j8714m0482L3162
7743b5733K5646k7769k3354j1629p287J7578K0157L7431J0863N259J2398J1021
7731D4581n5164k29j8747j0076J1447K5047m460M513l9492q954J6705M941k0047
7718d9935M4486J0950q444o219Q429k6081k5772J6571M2150N745k4104k3897j320
7705c7441J8904L7489K8218p513k4901j2638J5112K1176l0324k3926j9769l2301
7693f7914N730m597J2383L8694r483K1409J3823k6338j3993j337N962O832j6602
7680c5431m3784k4359N1824N0673k780k4068M5089K0328q457Q254p239j2254j6609
7667A187L439j7927Q160L0308j4578k699L131o685m2863j475L8818L3879j1926
$$ plain form
7756 -7631 -17429 -13077 -3147 12537 43147 28323 1261 -4211 4950 301 -18413 -58895 -25733
7743 -25733 -87 -27856 -51210 -62839 -70126 -52548 -32391 5040 15903 21162 33560 44581
7731 44581 -10583 -10812 -29559 -39635 -28188 -3141 -7601 -3088 -42580 -51534 -34829 -29888 -49935
7718 -49935 -5449 5501 -2943 -9162 -733 -26814 -52586 -36015 6135 11880 -12224 -36121 -37441
7705 -37441 -18537 18952 47170 39657 14756 2118 17230 38406 8082 -15844 -35613 -67914
7693 -67914 -62184 -66781 -54398 -15704 -25187 -3778 10045 -16293 -30286 -31623 -25661 -18829 -35431
7680 -35431 -79215 -103574 -51750 -1077 -3857 -27925 17164 37492 29035 37289 30050 17796 1187
7667 1187 4626 -13301 -5141 25167 10589 7890 11021 4336 -38527 -40002 -1184 32695 20769
7654B0769k0468j5616p074k9525R203m139k443j3421K2466J5520m950j2371M732
7641c7317J7176L917K3786M0869l1826L459j0761p860n287j5772m105j1045P08
7628c4058p086L497R18K531k169R080K1433K5274o87j6109j7265M7637k9818l3356
7614c0178k0916J013Q621N447K5138o841O593K2934J1057l911k4718l5177O834
7601c4104R776N930j442K1446M0361J1500R341K27r819m9616m369k131l1220j8517
7587e2637L8529K0545m4266j6529O4646O5020o296J1505j2651m2083m981K0833
7575D1635j0570k1851M191J348n754k6716M206N936J0874J8621K3537k3144r125
7562A3188j4389k6527l2317Q493L8154J088l7828R364P886j7456M355J3498J153
$$ plain form
7654 20769 301 -15315 -22389 -51914 -42711 -46850 -49293 -62714 -40248 -24728 -29678 -42049 -37317
7641 -37317 -20141 -16224 7562 48431 16605 20064 9303 1443 -3844 -19616 -23721 -34766 -34058
7628 -34058 -41144 -37647 -36729 -34198 -36367 -27287 -5854 19420 18733 2624 -14641 32996 3178 -30178
7614 -30178 -51094 -50081 -41460 -36013 -10875 -17716 -11123 11811 22868 18957 -5761 -40938 -34104
7601 -34104 -24328 -18398 -19840 1606 41967 53467 62808 63035 53216 3600 -769 -2900 -34120 -52637
7587 -52637 -14108 6437 -37829 -54358 10288 75308 69012 80517 67866 25783 20802 41635
7575 41635 31065 9214 13405 14753 8999 -17717 -13511 -7575 3299 21920 45457 22313 13188
7562 13188 -1201 -27728 -60045 -51552 -13398 -12310 -50138 -40774 -32888 -50344 -45989 -32491 -31338
7549c1338N294L399K5824J1146M123L700l170j1069K4996K7395K4435j2226m1939
7536C0570l2561o339j3460J3253j9541o956m461J036j3594o644J7339K7583J2288
7523a487K4738K5335l2270m0362p313J1020j3591j7165p787M4408J8709k2293
7511a8058o170J2301k9725j7251M345L2688L3218P160N599k8873N834J9121j3538
7498F651k1933J0968K2306k5446l7453R860L1489M858j1416l3657J813r603N0077
7485a486J6016K8752l605l1640m7617j763K9257r476k0143j339L8576K1714k1789
7472d543r138J1359M36j0329j2865J280l657j012j1011K52K1716P348J9956P97
7458A0589k1670m767L265K2869K4978l924n293j6353J3345J4269M879J956k6426
$$ plain form
7549 -31338 -26044 -22645 3179 14325 18448 22148 18978 7909 32905 60300 84735 72509 30570
7536 30570 -1991 -8330 -21790 -8537 -28078 -35034 -39495 -38459 -52053 -58697 -41358 -13775 -1487
7523 -1487 23251 48586 16316 -24046 -31359 -20339 -33930 -51095 -58882 -14474 4235 -18058
7511 -18058 -24228 -11927 -41652 -58903 -54558 -21870 11348 18508 24107 -4766 1068 20189 6651
7498 6651 -15282 -4314 17992 -7454 -44907 -35047 -3558 1300 -10116 -43773 -41960 -51563 -1486
7485 -1486 14530 43282 39677 8037 -39580 -41343 -12086 -21562 -41705 -43044 -4468 17246 -4543
7472 -4543 -13681 -2322 -1886 -12215 -25080 -23800 -27457 -28469 -39480 -39228 -17512 -10164 9792 10589
7458 10589 -11081 -15848 -12583 10286 35264 31340 26047 9694 23039 37308 42187 44143 17717
7445A7717l7521j812P190L7843k347k5104m8220J4615L4782K5094L952k9959j2975
7432a6745j2548N708M9565L3883J353k990J1072j3513l7728l255k982n618J3677
7419A9879J5341J5528j3229l9928k4226J4115J0642j8066j6522P861J9882P416
7407a307k1315L84R501k5035J7229K5410K6531J4125p880r808J6569P908p124
7394D5188q228j9037r117j0892O976J5389r646r612K6067j7912j0128p387R663
7381A324K0193J1024j3383k9654p393K474J009q759j5917j750j4676j5346K3566
7368d7288M7136M5803k299k8330l8831K8838n350o389j5000k7799L7715L4220
7356B2426j8894J6505l4094m3016O047J6666K1731J3279L258j3648j2472k3226
$$ plain form
7445 17717 -19804 -21616 -14426 23417 21070 -4034 -52254 -37639 -2857 22237 26189 -3770 -16745
7432 -16745 -29293 -23585 25980 59863 61216 58226 69298 55785 18057 14802 11820 6202 19879
7419 19879 35220 50748 37519 -2409 -26635 -12520 -1878 -19944 -36466 -28605 -8723 -1307
7407 -1307 -22622 -22238 -12737 -37772 -20543 4867 31398 45523 37643 27835 44404 52312 45188
7394 45188 36960 17923 8806 -2086 4890 20279 10633 1021 27088 9176 -952 -8339 1324
7381 1324 21517 32541 19158 -10496 -17889 -15415 -14406 -23165 -39082 -40832 -55508 -70854 -47288
7368 -47288 -152 45651 43352 15022 -23809 5029 -321 -6710 -21710 -49509 -11794 22426
7356 22426 3532 20037 -14057 -57073 -51026 -34360 -12629 650 3908 -9740 -22212 -45438
7344d5438K4063O121Q817J3763m779o521j7307l14O944k6927j2745K3705K9020
7331a598N5068K554j9431j0630l0417J0431K1562K74l0545j6379J4570J6376K3068
7318C4903p52l8362l3631K809Q306K9847k578k1564K5087K1245m8177l1898J6140
7305c8625L5358N031r451l0985j0126J4740J8756K4248K0980j3240j3973J283
7293C996j102j5674O873L8576K3260k0447m2499O600J1521K460k3743j8308J1029
7280a7458J7073j9286k2502L7626L0675j1585Q853m87m595j9067J0855O540J4393
7267C1035K2030L131l9729l4515J1898j3228J817j2890p497j6784J7612J2292
7255b4828q184K5061L3295r798j964k612m065l132r727M468M385J4192L314m1392
$$ plain form
7344 -45438 -21375 -15254 -6437 7326 2547 -3974 -21281 -21595 -14651 -41578 -54323 -30618 -1598
7331 -1598 53470 56024 36593 25963 -4454 5977 27539 27813 -2732 -19111 -4541 11835 34903
7318 34903 34151 -4211 -37842 -35033 -26727 3120 542 -21022 4065 25310 -22867 -54765 -38625
7305 -38625 -3267 1764 -7687 -38672 -48798 -34058 -15302 8946 29926 16686 2713 3996
7293 3996 2894 -12780 -5907 32669 55929 35482 -7017 -417 11104 13564 -10179 -28487 -17458
7280 -17458 -385 -19671 -42173 -4547 26128 14543 23396 22909 18314 -753 10102 16642 31035
7267 31035 53065 56196 16467 -18048 -6150 -19378 -17561 -30451 -37948 -54732 -37120 -24828
7255 -24828 -33012 -7951 25344 15546 13582 10970 6905 3773 -5954 -1486 2899 17091 20405 -20987
7241b0987q786M357K6395L26l37o221p284j781L8684R969n426R235j4609l2562
7227i027j3774K808J3138j5663m761j2631J6350k587J1882L8217j4372o529J0521
7214A3572M662j3858J6110m913l0714k8485o161J5847N747J5317Q151J9577K6134
7201D0986l599j5831o432p167M37j5517M876K6876K3033l5467j6047j1080q964
7188b3896j0928M8573J1892k0232n6146l56J2386J2668K2954j5018j5697J4304
7176a9496J7033k7170j5274J1720k058K0944K0695k9556k3259O961K9727R842
7164A09J8250K7278j5913l9515j515R458J5913l8164K6319l401J1020l0019J8570
7151a610j0834N194j855l5885J4870J905L2521J5743k2601j9687k0243j0789M7817
$$ plain form
7241 -20987 -29773 -25416 979 1305 968 -5253 -12537 -14318 24366 34335 28909 38144 23535 -9027
7227 -9027 -22801 -19993 -6855 -22518 -27279 -39910 -23560 -26147 -14265 23952 9580 3051 13572
7214 13572 18234 4376 20486 15573 -15141 -43626 -49787 -33940 -28193 -12876 -4725 14852 40986
7201 40986 37387 21556 15124 7957 8394 -7123 -2247 24629 47662 12195 -3852 -14932 -23896
7188 -23896 -34824 13749 25641 5409 -50737 -51093 -38707 -26039 -3085 -18103 -33800 -19496
7176 -19496 -2463 -29633 -44907 -33187 -35245 -14301 6394 -23162 -46421 -39460 -9733 109
7164 109 18359 45637 29724 -9791 -11306 -1848 14065 -24099 2220 -1181 9839 -20180 -1610
7151 -1610 -12444 -7250 -9105 -44990 -30120 -28215 4306 20049 -2552 -22239 -42482 -53271 -5454
7138e454P2143j3142o9670k541M4971j0449m3046k6008J3200O1959N1294l8574
7126C4683k8096L2008L608o771J1314k6695k0630j396N560j3192K3169L0478k2673
7113B1367j8852J470Q948J5301L2544R688l464p378j9762m6314J9459K478J083
7100A6568j9243j2824j6769k0649J008m717K0918n118K9164K0441M3035R055j2071
7087D8798l5560O631R307k3814k7552l0946k971O719M495L1799N1980K9603J6741
7074H5230m9888l5037J3621j483p605j4372N946l6124j0396J8125p121q413Q206
7061c9311Q078N334L5793J652p103j7276J2659k5124l0276L8893J0962k0672K2075
7048d316j003J7276r940L571j422L7801k0990l5783J3274Q724K5660l933o99Q984
$$ plain form
7138 -5454 66689 53547 -16123 -18664 26307 15858 -27188 -53196 -39996 21963 73257 34683
7126 34683 6587 38595 42203 35432 46746 20051 -579 -1975 3585 -9607 13562 44040 21367
7113 21367 2515 3985 12933 28234 60778 70466 67002 59624 39862 -6452 13007 15485 16568
7100 16568 -2675 -15499 -32268 -52917 -51909 -56626 -35708 -40826 -11662 8779 51814 60869 48798
7087 48798 13238 19869 29176 5362 -22190 -53136 -56107 -49388 -44893 -13094 38886 68489 85230
7074 85230 35342 305 13926 12443 4838 -9534 -3588 -39712 -50108 -31983 -39104 -47517 -39311
7061 -39311 -31233 -25899 9894 11546 4443 -12833 -174 -25298 -55574 -16681 -5719 -26391 -4316
7048 -4316 -5319 11957 2017 5588 4166 41967 20977 -14806 -1532 7192 32852 28919 28220 37204
7034C7204j7593k304m86K062K8381O706l4058m0475O534K1947j2541J6522J9180
7021C1079J4592J809m109M645j3381n7129Q755L160N139l499n4413M593M2875
7008a5884M1583O346K144j8972l7893l6723o400R664k221L4884J313K9993K6015
6995C3849q740l6198k7994O864l031j04k8589k802j3872K8562L9089K3971j4226
6982c221j1858M720K7585K0763L977J046j6594k1545k3133j0601K925K4254j6805
6969a8487N418j7831m2741R107L9141K6160j560j5944m047k1797l239K0808m977
6956b9989R871K1383j5552j0558K0210J7181L489j0695n002J5312j898l4903L806
6943a7345J7803N199k1404j1808L2447j1131q716M636Q394N506P712q849n218
$$ plain form
7034 37204 19611 17307 16821 18883 47264 53970 19912 -20563 -14029 7918 -4623 11899 31079
7021 31079 45671 47480 43371 48016 34635 -22494 -13739 -10579 -5440 -8939 -63352 -58759 -15884
7008 -15884 25699 32045 34189 15217 -22676 -59399 -65799 -56135 -58356 -23472 -22159 7834 33849
6995 33849 25109 -11089 -39083 -32219 -35250 -35354 -63943 -66745 -80617 -52055 -12966 11005 -3221
6982 -3221 -15079 -10359 17226 37989 41966 43012 26418 4873 -18260 -28861 -25936 -1682 -18487
6969 -18487 -13069 -30900 -73641 -64534 -25393 767 -793 -16737 -20784 -42581 -45820 -25012 -29989
6956 -29989 -20118 1265 -14287 -24845 -4635 12546 16035 5340 338 15650 13752 -21151 -17345
6943 -17345 458 5657 -15747 -27555 4892 -6239 -14955 -10319 -1925 3581 11293 2444 -2774
6930b774K7101K7630j2666m4795k1225K0553J180j6266k2222K5612j4844J9314
6918a3402O720m1388R93K0355J1523j4110K395M5034K4689j6110j7470j2357k4892
6905b8020O726L857K6090L6181k3311k3463q572J0723J0186k6617j4684J9185
6893a1719K145l09j5157j61K2094M4296R787j5426r996O487j6498j9317J8254
6880A4480K9293k8761k8243J8391M178J5382J372l6659k4052r741J6932J9396
6868h032K6383j500k7983K2859K4931j810o225m4155k0448p197o099K7821N08
6855b0947q119J7654O262n740k0237J954j0025p57J1568J2218J3006L3111K8721
6842E8669K8079k9067k9258P650j4940Q498k2944K991M3871j2985j6323l5629
$$ plain form
6930 -2774 24327 51957 39291 -5504 -26729 -6176 -4996 -21262 -43484 -17872 -32716 -13402
6918 -13402 -6682 -48070 -47077 -26722 -15199 -29309 -26914 18120 42809 26699 9229 -3128 -28020
6905 -28020 -21294 -17437 8653 44834 21523 -1940 -10512 211 10397 -16220 -30904 -11719
6893 -11719 -9574 -9883 -25040 -25201 -3107 41189 50976 35550 25554 32041 15543 -3774 14480
6880 14480 43773 15012 -13231 5160 9338 24720 26092 -10567 -34619 -44360 -27428 -8032
6868 -8032 18351 16851 -11132 11727 36658 34848 28623 -15532 -35980 -43177 -49276 -21455 -20947
6855 -20947 -29066 -11412 -5150 -10890 -31127 -29173 -39198 -39955 -28387 -16169 -3163 29948 58669
6842 58669 86748 57681 28423 36073 21133 29631 6687 9678 53549 40564 24241 -11388
6830a1388l0045J155J0947K979k0180J9306L1985J3251l9096l1226n448N203j4147
6817f6704J485L3357J0623J0708l483q873j0815K5450J5284O846l8964J1760J1553
6804a773m155j634J017J7872j5956m0977j9549K9999J7925R486l0778J2119L1741
6791E337L443L7160j147J5245k299j2821r971J6690j2760j3355N828l476r949
6778A7925J3033l9609k1845J7185k304q604K801k3001r749J6320P595k5769M6123
6765i899M8032J4495K832k9080J6859J1974k4956J7936k2980l0059l2767m489
6753d2102K0627P596j1738K1682J2292o722l7133p723L2401J6525j2116j2251
6741a8662p57J0962l0687K4996L8120m126l1417J4488l757j1994J3533K8012o301
$$ plain form
6830 -11388 -41433 -40278 -29331 -26352 -46532 -27226 4759 18010 -21086 -52312 -57760 -52557 -66704
6817 -66704 -65219 -31862 -21239 -10531 -14014 -22887 -33702 -8252 7032 13878 -25086 -13326 -1773
6804 -1773 -5928 -7562 -6545 11327 -4629 -45606 -65155 -35156 -17231 -7745 -38523 -26404 5337
6791 5337 8780 45940 44793 60038 57739 44918 34947 51637 38877 25522 31350 27874 17925
6778 17925 30958 -8651 -30496 -13311 -15615 -24219 -21418 -44419 -54168 -37848 -30253 -56022 -9899
6765 -9899 38133 52628 55460 26380 43239 55213 30257 48193 25213 -4846 -37613 -42102
6753 -42102 -21475 -13879 -25617 -3935 8357 1635 -35498 -43221 -10820 5705 -6411 -18662
6741 -18662 -19419 -8457 -39144 -14148 23972 19846 -11571 2917 -840 -12834 699 28711 22410
6728B2410k7432L1390K4355j2367J0670L010m833j6175k0719j509k1067k5401
6716c7668N171L4741P76n4322p975K1497N299P2199M881K108l6914k3594k1964
6703c5765K5399J4518k2947o244J4292J6522j9881L892K4685k0206m153n237k9341
6690d4466P122J8724K2486j9755q011k4768L470k070J05M1819K2187k5401k0095
6677b8653l2015m732O477j4144k4201J7338M0735L5509j6757M16L5910J9309m8446
6664a3254j0567m520l2940M851L1081R800j0081K9296K5235K54l3280k0809j2916
6651c7850K0967J0061J5558L4320J0367j6997j7499L313N565p486K865M658K9526
6638E7368j3125j0745j8963j7391R759j0591k4173k0843J7494J0948L0857K1501
$$ plain form
6728 22410 -5022 26368 50723 38356 49026 52036 47203 31028 10309 8800 -12267 -37668
6716 -37668 -32497 2244 3020 -51302 -59277 -37780 -32481 39718 44599 46707 9793 -13801 -35765
6703 -35765 -10366 4152 -18795 -25039 -10747 5775 -14106 -10214 14471 -5735 -9888 -15125 -44466
6690 -44466 -37344 -18620 3866 -15889 -23900 -48668 -45198 -47268 -47163 -5344 16843 -8558 -28653
6677 -28653 -60668 -65400 -58923 -73067 -97268 -79930 -39195 -3686 -20443 -20027 15883 35192 -13254
6664 -13254 -23821 -28341 -61281 -56430 -25349 -15549 -25630 3666 28901 29155 -4125 -24934 -37850
6651 -37850 -16883 -6822 8736 43056 53423 36426 18927 22240 27805 20319 23184 27842 57368
6638 57368 44243 33498 14535 -2856 6903 -3688 -27861 -48704 -31210 -20262 10595 32096
6626C2096J8913L910l9118J3840L5402n65K0109j124R203l8538j4508R912k634
6613D6898l1428l6092Q689N70j6116J0656K5043J660J5903J8612L6490j6847l7431
6600B6607L058M1876J7704n574l2439l6464j8543l1699k285J9632J6457J8134
6588A6464k0962q577K202p90K5813J3675l5398K869k1978J5434j732k9310j2232
6575e4522L4385J536J1550j97m8391j6606N823K5900L0066J3778L434p143j876
6562b263p341P481J4738l3864j2724J4942L1765o340l7192j0876l208J4434J6799
6549a3649j079M667J8962k5168k9774l783l627K1488o869m696r754k5442K7846
6536e0878K5556J7577L1576L734q126j0989r765J3365O158O612k3448m930p965
$$ plain form
6626 32096 51009 54919 15801 29641 65043 64478 84587 83463 92666 54128 39620 49532 46898
6613 46898 15470 -20622 -11933 -11363 -27479 -16823 8220 9880 25783 44395 80885 64038 26607
6600 26607 29665 71541 89245 83671 51232 14768 -3775 -35474 -37759 -18127 -1670 16464
6588 16464 -4498 -13075 -10873 -11663 14150 27825 -7573 -4704 -26682 -11248 -12980 -42290 -54522
6575 -54522 -20137 -18601 -7051 -7248 -55639 -72245 -66422 -40522 -10456 3322 6756 -387 -2263
6562 -2263 -9604 -2123 12615 -21249 -33973 -19031 12734 6394 -30798 -41674 -44882 -30448 -13649
6549 -13649 -14728 -10061 8901 -16267 -46041 -49824 -53451 -31963 -38832 -43528 -53282 -78724 -50878
6536 -50878 -25322 -7745 23831 27565 19439 8450 -1315 12050 18208 24820 1372 -3558 -11523
6523a1523k2245l0639J8320J1561l19L4419J986L036J7891l827M933k2006j2032
6510a0445J2748N854m0263m5660L4912M8536J3232j2600j4867l3709K6655j2025
6498b7632j0401J6521L708j2710N0618L7519k8882J6726j332m0088m1044J7207
6486a9790L5123R15N726k698m0489m5062j8657J5388M6270J65k3443N3341k4549
6473a7760l1432l5020J0273O1457J3967K824l25j0492K47N771kk3116k3228J8096
6459b8740r341K0867J4315L5692O107J4366p293j05n7428l1159r048j6827J971
6446f6623K0204J6448J524j664j6475R339J1808k115N34K8158k562j6438j7713
6433c5575j3938o334J9639N5874L8654j1415l1465j2981j529J4910M2672L7754
$$ plain form
6523 -11523 -33768 -64407 -46087 -34526 -34845 -426 1560 4596 22487 18660 23593 1587 -10445
6510 -10445 2303 8157 -32106 -77766 -42854 5682 18914 6314 -8553 -42262 -15607 -27632
6498 -27632 -38033 -21512 -17804 -30514 20104 57623 28741 45467 44135 4047 -36997 -19790
6486 -19790 15333 16248 21974 19276 -21213 -66275 -84932 -69544 -23274 -23109 -46552 6789 -17760
6473 -17760 -49192 -84212 -73939 -12482 1485 4309 3984 -6508 -6261 -490 -492 -23608 -46836 -28740
6459 -28740 -38081 -17214 -2899 32793 38900 53266 45973 45868 -11560 -42719 -51767 -68594 -66623
6446 -66623 -46419 -29971 -28447 -30111 -46586 -37247 -25439 -27554 -27020 1138 -1424 -17862 -35575
6433 -35575 -49513 -55847 -36208 19666 58320 46905 15440 2459 930 15840 58512 96266
6421I6266m7999j2073j8177q676J9021R032j5588j7272l758N6M8031J6522k9500
6408C5885l2205k063l298J0700Q861J1012j474j4040k9671k0105o953J3288L0224
6395A61J606P932q412j7380J953k9702N133K1279J9416K906o231J8019r632n0620
6381d3572l1444r218L1922J1068j0526M9414J8667l7333j986L0160k0027K0657
6369G782p945R392J7114L4754l1417k4636q842j774J608p50J4749k0875J3665
6356B825j4026m705J1725r671L4451J8929j7130l3742k0948M133J1851J7144O957
6343G793P59j4801O815l805j6521J5253K7477j2986j379J910K0165j595j0238
6330A8847N724p850l874k1838m4447K755K6314Q510j0862L1433O575J6030M520
$$ plain form
6421 96266 48267 36194 18017 9341 28362 37394 21806 4534 776 832 48863 65385 35885
6408 35885 3680 1617 -1681 9019 17880 28892 27418 13378 -16293 -36398 -43351 -30063 161
6395 161 1767 9699 1287 -16093 -14140 -43842 -38709 -17430 1986 4892 -1339 16680 7048 -43572
6381 -43572 -75016 -84234 -52312 -41244 -51770 -2356 16311 -21022 -23008 7152 -12875 7782
6369 7782 -163 9229 26343 61097 29680 5044 -3798 -5572 -3964 -4714 10035 -10840 2825
6356 2825 -11201 -15906 -4181 -13852 20599 39528 22398 -11344 -32292 -28159 -16308 836 7793
6343 7793 8552 -6249 566 -3239 -19760 -4507 22970 9984 8605 10515 30680 29085 18847
6330 18847 24571 16721 12847 -8991 -53438 -50683 -24369 -15859 -26721 4712 11287 27317 31837
6317C1837O158J6523k3362j4930j1126K9445n959J2896p794m3763j1056Q989L034
6304i108J7495L973m0055j9642l5291j1863K3520J326L6181O2726K2997J0760
6292F3019K0788n9879n0450o613M1851L0361O818p631k3127P864q955k0164N477
6279f41Q811k6365k7716j7783K0545L0582J8777n223N232l762R920m913j5853
6266h389J1769l1759j8905J985J1893L4758L7877L2240o604M885k481J032J3763
6253H2064j236R107q680m5186k6580N105l4210P735m176j5267J7719k0589O293
6240b7901K968J3112J8694M1819p093k2706l0593j1692p946n806j1530K6149j2892
6227c5417J0030J2021J9831j0080k0351j0048l8478j0245L9869j7664j3288O175
$$ plain form
6317 31837 37995 54518 31156 16226 5100 34545 28586 41482 33688 -10075 -21131 -12142 -9108
6304 -9108 8387 12360 -27695 -47337 -82628 -94491 -70971 -69645 -33464 29262 52259 63019
6292 63019 83807 23928 -26522 -33135 8716 39077 45895 38264 15137 23001 14046 -6118 -641
6279 -641 8170 -18195 -45911 -63694 -43149 -12567 6210 987 6219 2457 12377 7464 -8389
6266 -8389 3380 -28379 -47284 -45299 -33406 1352 39229 71469 64865 69750 67269 68301 82064
6253 82064 80828 89935 81255 36069 9489 14594 -19616 -11881 -16057 -31324 -13605 -34194 -27901
6240 -27901 -24933 -11821 6873 48692 41599 18893 -11700 -23392 -31338 -37144 -48674 -22525 -35417
6227 -35417 -25387 -13366 6465 -3615 -23966 -34014 -72492 -82737 -42868 -60532 -73820 -67645
6215f7645K8887K9400l562j4651J1073R083j7233K3235M807k8023l3680j5951
6203g4260J0806O04L5487J6735k9991o162L0672k0936K0038M9397J4502l1998
6191A4894J3893p61J3163J6417P107j1072j4439l9282r239R73K29L8977j258r481
6177B0121j4108K8396j0828j0635M376K2128Q67j4714N604O887k2383m1112L8331
6164A2930M2330k1602o3251m0451J9299K4275j7540n0J0608M8628K2122J2022
6152D9320j5620j7119P392j2595l0682k6335k2499j0129L7470P615K6388K675
6140d119o900m4638J5737R788J5710k5876l4476J4969l776K5096J8455k5675k02
6127d5907N2714J7250k7034j1820o560J2828J9732q715l1038n267M1356J4306
$$ plain form
6215 -67645 -38758 -9358 -12920 -27571 -16498 -7415 -24648 -1413 3394 -24629 -58309 -74260
6203 -74260 -63454 -62850 -27363 -10628 -40619 -46781 -16109 -37045 -17007 32390 46892 14894
6191 14894 28787 28026 41189 57606 64713 53641 39202 -80 -9319 -8346 -8117 30860 29602 20121
6177 20121 6013 34409 23581 12946 17322 39450 40317 25603 31207 38094 15711 -25401 12930
6164 12930 55260 33658 -29593 -70044 -50745 -26470 -44010 -44060 -33452 15176 37298 49320
6152 49320 33700 16581 23973 11378 -19304 -45639 -68138 -78267 -40797 -33182 -6794 -4119
6140 -4119 -11019 -55657 -39920 -30132 -14422 -40298 -74774 -59805 -63581 -38485 -20030 -45705 -45907
6127 -45907 6807 24057 -2977 -14797 -21357 -8529 11203 2488 -28550 -33817 7539 21845
6115B1845j0299p093M380j56p082m3923j2036P808J8795P014K4763L2495j2562
6102B3949l201P039K3466l2296m3128m198j0606J2065M8157K7877j455k7422R558
6089B9805k1559j7101K6943j9143j0023l5477J2736n159J441N0070J2196n745
6077A8984K2769j7878K22K2242r532k1913m8518l6810L7933Q558m065J8072L6959
6064B7023k7172j1292J3299K0170N232j2784l4684J6817Q369q472N433r800l6600
6051d4461j4962K9593J5453P756K6452J0616j5847j6456q660P354K4470p102o539
6038G667j1311j4914j1943j8996L971J3909j0078K9379j0742l705m813j8735n809
6025e6120K6792N4935k1927k0748L7724N4077O950k3943k6769j1758j5095j5508
$$ plain form
6115 21845 11546 4453 8833 8677 1595 -42328 -54364 -46556 -27761 -20747 4016 36511 23949
6102 23949 20748 27787 51253 18957 -24171 -28369 -38975 -26910 21247 49124 47669 20247 29805
6089 29805 8246 -8855 18088 -1055 -11078 -46555 -33819 -38978 -37537 12533 24729 18984
6077 18984 41753 23875 24097 46339 36807 14894 -33624 -70434 -32501 -23943 -28008 -9936 27023
6064 27023 -149 -11441 1858 22028 27260 14476 -20208 -3391 4978 -3494 1939 -7861 -44461
6051 -44461 -59423 -29830 -14377 -6621 19831 30447 14600 -1856 -10516 -3162 21308 14206 7667
6038 7667 -3644 -18558 -30501 -49497 -45526 -31617 -41695 -12316 -23058 -26763 -31576 -50311 -56120
6025 -56120 -29328 25607 3680 -17068 20656 74733 81683 57740 30971 19213 4118 -11390
6013a1390k6372J3470J3273k7651j2004j0869J7071K9503J0313k5797J522J7585
6001a1346j3692L997P533k794M5901L8983k6491m0543m229j2972l9159l3404K8482
5988e9734O8395l53j5540K5606Q337P165kk2592m941O574K4703O823j4152J675
5974C1964m2155q80J4754J4557K1598l2695j9705m1582R841J4902M892L2109k2038
5961a4438k0741P334N2140K0301j8025m7080j8772j351J104R643P776j7530j392
5948d1031L7546M4864J0573M54j1420l7141J2202o030m5960l3813K0175R55L1315
5935a7311K593m745j0175k8326O117L6548K3269M00M253K620K4998K3788q0n780
5921E8169K6017J6831k6914k3779n1030j5292k159J5877K6483j8146l0533J1324
$$ plain form
6013 -11390 -37762 -24292 -11019 -38670 -50674 -61543 -44472 -14969 -4656 -30453 -28931 -11346
6001 -11346 -25038 -21041 -13508 -16302 29599 68582 42091 1548 -2681 -15653 -54812 -88216 -59734
5988 -59734 8661 8308 -7232 18374 26711 33876 33874 11282 6341 12915 37618 44441 30289 31964
5974 31964 -10191 -11071 3683 18240 39838 7143 -12562 -54144 -44303 -29401 -24509 7600 -14438
5961 -14438 -35179 -27845 24295 44596 26571 -20509 -39281 -40632 -39528 -29885 -22109 -39639 -41031
5948 -41031 -3485 41379 51952 52406 40986 3845 16047 10017 -35943 -69756 -49581 -48626 -17311
5935 -17311 -14718 -19463 -29638 -57964 -51847 -15299 7970 8370 12623 15243 40241 64029 63949 58169
5921 58169 84186 101017 74103 50324 -706 -15998 -18157 -2280 24203 6057 -24476 -13152
5909a3152J2150Q793k3210k585L9936n568k3797j6892P616Q903L8657L7848m1816
5896B6883k654k1920k4442K1509j7155j6603j6051J0958l32N5689j1122r869K1012
5883A5903J4489j4877k39L603k7442j8963R186J8118J9508p526j6693J3530K6816
5870C5413o6076m3296K6034N5074K7141L3362k3772k2393J1851j8042k6189q679
5858a9572m310L1341L359o895l305r927k6889j2977K6874J602J9551J7906n012
5845A1746l5835l4489K6268K9252j0778m728n678l221m557j5872K927P227K5841
5832a1897L1267k835k5801M4446J5881j6288k2752l8762l5974L0908M2347j6010
5820e470K1498K0326K6122n4658j8282K356k1876k532R855K2901L4270j8439k0559
$$ plain form
5909 -13152 -1002 7791 -15419 -18004 21932 16364 -7433 -24325 -16709 -7806 30851 68699 26883
5896 26883 24229 2309 -22133 -624 -17779 -34382 -50433 -39475 -39807 15882 4760 -5109 15903
5883 15903 30392 15515 15276 18879 -8563 -27526 -18340 -222 19286 11760 -4933 8597 35413
5870 35413 -30663 -73959 -47925 7149 34290 67652 43880 21487 33338 15296 -10893 -19572
5858 -19572 -23882 7459 10818 3923 618 -9309 -36198 -49175 -22301 -20699 -1148 16758 11746
5845 11746 -24089 -58578 -32310 -3058 -13836 -18564 -24242 -27463 -32020 -47892 -44965 -37738 -11897
5832 -11897 19370 16535 -9266 35180 51061 34773 12021 -26741 -62715 -31807 10540 -5470
5820 -5470 16028 36354 62476 7818 -10464 -8108 -29984 -32516 -22661 240 34510 16071 -4488
5807d488k2808k4243K0046K4097k8562k692j4J0950N195L7456L1204j3173j9156
5794A3812j4617K656J7943J7557p116K179j2406O604P522j203M521J1466j270
5781D7648n615j2160o2350l3647M690K72J2640k3300K2453N0492q716J4233K572
5768I212M503l7792O626r0k6039M899K0947j4562J6481K6021L2367k6625m3571
5755b7623j7380k348P262J281J9843k4660P832R816K8241J3483l6263R755M0300
5742B9539Q249j8073j6493J117J1655k2884j363j3430j0160j6197j4436K7100
5730c5376M3765J8017L405J6401k149k6212j9209K035p255j1889l0188L1427L6167
5717A8939j0883l1629l0010n542N57L4259j2061o400K6727J5784p016l7296m59
$$ plain form
5807 -4488 -27296 -51539 -31493 -7396 -35958 -38650 -38664 -27714 -22519 14937 46141 32968 13812
5794 13812 -805 1851 19794 37351 30235 32414 20008 26612 34134 32931 37452 48918 47648
5781 47648 42033 29873 -32477 -66124 -61434 -61162 -48522 -71822 -49369 1123 -7593 6640 9212
5768 9212 13715 -24077 -17451 -17541 -43580 -38681 -17734 -32296 -15815 10206 42573 15948 -27623
5755 -27623 -45003 -47351 -40089 -38808 -18965 -43625 -35793 -25977 2264 15747 -20516 -10761 29539
5742 29539 37788 19715 3222 4339 15994 -6890 -8253 -21683 -31843 -48040 -62476 -35376
5730 -35376 8389 26406 29811 46212 44063 17851 -1358 677 -6578 -18467 -48655 -17228 18939
5717 18939 8056 -23573 -53583 -59125 -58568 -24309 -36370 -42770 -16043 -259 -7275 -44571 -45030
5704d5030L7044Q819J8917J4440k5255l2569p918l87L6479L3956k689K3610j5613
5691D3804k2093k2691j5905K0230l8478j623J7231m218r994P886L2626j8003l705
5678a4933J5321j1990k909l4267j294M299J2789K0326Q321L896K1116j54r642
5665A0879j1888j3181J533L8211n340j47O254o836J534k6053k6946j2910K0969
5652b3921K7534o306j3104J8425l515j4983k6381J3080k1068k3717J8358M1896
5640a3702O750J4653K6499j7674j1870J5217j5350j0668M216n895k2902l542K928
5627c1340k5858p461J2129N0914J3483j1693k669k020J980k3314m9612j642K2923
5614e4180K554R805j7597J0333J552K1070M099r557Q561J3947M35l2277j9400
$$ plain form
5704 -45030 -7986 833 19750 34190 8935 -23634 -31552 -31939 4540 38496 35807 59417 43804
5691 43804 21711 -980 -16885 3345 -35133 -36756 -19525 -23743 -33737 -25851 6775 -11228 -14933
5678 -14933 388 -11602 -14511 -48778 -50072 -45773 -32984 -12658 -4337 -441 20675 20521 10879
5665 10879 -1009 -14190 -12657 25554 20214 20067 26321 19485 21019 -5034 -31980 -44890 -23921
5652 -23921 3613 -2693 -15797 2628 -887 -15870 -42251 -29171 -50239 -73956 -55598 -13702
5640 -13702 -6952 7701 34200 16526 4656 19873 4523 -6145 -1929 -7824 -30726 -34268 -31340
5627 -31340 -57198 -64659 -52530 -1616 11867 174 -2495 -4515 -2535 -25849 -75461 -77103 -54180
5614 -54180 -51626 -41821 -59418 -49085 -47533 -26463 -22364 -31921 -23360 -9413 -8978 -41255 -60655
5601f0655J3369K5247n239j4209L4042J0398j2706l3465J110P110K1431k7422
5589d0989k5552p246K5026J0350j7094J0898J7711J2694N356K3602p508k0922
5577a3674Q840j9910k4868n103K2806J160O325J6223p513L79K9767J4447o067
5564B2812k9571l2639k7107j7136R224L656J4384K4817m733l9313p742J3348p910
5551g7910j0527J0311L5516L1856p37J90Q093k3209P636P079Q477K4336j3454
5538G657k4496L076L820J0318k6351K606J0624l861q331K1545J0979l053j860
5525B673k0585m989k7214O16J549j7536L892J7457O5P064K7569n707j192J2884
5511c454K7004P612k9348j8854J8780j9286R650K0640j610K613j6241L458L462
$$ plain form
5601 -60655 -47286 -22039 -27278 -41487 -7445 2953 -9753 -43218 -42108 -34998 -13567 -40989
5589 -40989 -66541 -73787 -48761 -38411 -55505 -44607 -26896 -14202 -8846 14756 7248 -13674
5577 -13674 -4834 -24744 -49612 -54715 -31909 -30749 -24424 -8201 -15714 -15335 14432 28879 22812
5564 22812 -6759 -39398 -66505 -83641 -74417 -70761 -56377 -31560 -36293 -75606 -83348 -70000 -77910
5551 -77910 -88437 -78126 -42610 -10754 -11491 -11301 -3208 -26417 -18781 -11702 -3225 21111 7657
5538 7657 -16839 -13763 -9943 375 -25976 -23370 -12746 -16607 -24938 -3393 7586 4533 2673
5525 2673 -17912 -22901 -50115 -49499 -47950 -65486 -61594 -44137 -44072 -37008 -9439 -15146 -16338 -3454
5511 -3454 23550 31162 1814 -17040 1740 -17546 -7896 12744 11134 13747 -2494 964 4426
5498D426p373j5814l4614J9389M788J7597k016j7785p7m845j1910K1214K5181
5485a839K8311l648J6895m839n1584k9912K192R577P47K7288M710Q910k124O018
5471A0702J1993r027j9122j8322m783O833K6062K836l7128k086j0676K6489M685
5458a1544k3041J4592L4512J4175j6651l0235R035R730J2727M706j1444J574l970
5445D166r954J241K4745l7798k3520L1665O7J4082M841K2819K6387o721l7337
5432A4683k8216k4895n617J7655P102l4150j126n954L4556N6342j1077J110K9890
5419E0303r735j6473k2006M602K4157K0433l1076q235k439j7368q030P895j7322
5406b5294m280J8659l519k6829j7830K8838J4344M9419J4381Q942k3974k3760
$$ plain form
5498 4426 -2947 -18761 -53375 -33986 -29198 -11601 -13617 -31402 -31479 -36324 -48234 -27020 -1839
5485 -1839 26472 22824 39719 34880 -16704 -46616 -44424 -34847 -34100 -6812 -2102 6808 4684 10702
5471 10702 22695 13668 -5454 -23776 -28559 -21726 4336 7172 -29956 -32042 -42718 -16229 -11544
5458 -11544 -34585 -19993 14519 28694 12043 -18192 -9157 573 13300 18006 6562 8136 4166
5445 4166 -5788 -4547 20198 -17600 -41120 -9455 -9388 4694 9535 32354 58741 52020 14683
5432 14683 -13533 -38428 -44045 -26390 -19288 -53438 -54564 -60518 -25962 30380 19303 20413 50303
5419 50303 40568 24095 2089 6691 30848 51281 20205 11970 9531 -7837 -15867 -7972 -25294
5406 -25294 -29574 -10915 -14434 -41263 -59093 -30255 -15911 33508 47889 56831 32857 9097
5394I097L190J619j9375l2662q004L4835N952L7532J3503o9882k4511K5523J5418
5381g765Q560J0183k2707m459j613k5322O405N584o047r400L5372K9843J942j9502
5367A074K1083l262j2164n075j1798L806K7516k511l1156Q065k6966l1305L668
5354e9025L0224M094M021L5542l58j2243K5215K294P005K0141l1451l2650j1739
5341a8930j9637j8446l275M6323L2284K6569j9930l2465p938J5943O789k0321
5329a3034n057k7715j6859j5299J1376Q578L8389L2346j3457R998K1810J5977
5317D7053J8750k5882k5396J6157l804M696l7048l7822K3255L1215k2034l9565
5305e0425J2366q996k0928K4870L4911K491J2327M389j5078J0191n938k3384j5884
$$ plain form
5394 9097 12287 13906 -5469 -38131 -46135 -11300 -5348 32184 45687 -24195 -48706 -23183 -7765
5381 -7765 795 10978 -11729 -16188 -17801 -43123 -36718 -31134 -37181 -46581 -11209 18634 20576 1074
5367 1074 22157 18895 6731 1656 -10142 -6336 21180 18669 -12487 -4422 -31388 -62693 -59025
5354 -59025 -28801 -24707 -20686 14856 14498 2255 27470 29764 36769 56910 25459 -7191 -18930
5341 -18930 -38567 -57013 -60288 -13965 18319 44888 24958 -7507 -15445 498 7287 -13034
5329 -13034 -18091 -45806 -62665 -77964 -66588 -58010 -19621 12725 -732 9266 31076 47053
5317 47053 65803 39921 14525 30682 26878 31574 -5474 -43296 -20041 11174 -10860 -50425
5305 -50425 -38059 -47055 -67983 -43113 -8202 -5711 6616 11005 -4073 6118 180 -23204 -39088
5292c9088J1625J0530M145O996L3055K2310p995k1511m5403k7901J6913N1366
5280A5042K7087J3717j5717n6471j2196m659j0411L3598J7973j3734J6332J8883
5268B9444j5468o686j5022j1264J4779J6985Q311n232q703j6801k6770P443J8817
5255a0167N2009K1939k4826m4491m702P288K5566j0607l290k4957j2300k704k3701
5242e4943r125J4296k0030L290K4332K2065j1140Q812j1866K9354L736k0456M597
5229a7078K8963l363j2921K5042m7996k7168j6992M2266k5058m0452N340J7840
5217g1577Q0911J9673O103P07k5496J7945k3196j9783n337k9372l846L9715K1349
5204G796j665p498m0581k089L7535J8182p376K7524J8318j8095n8103r859J8381
$$ plain form
5292 -39088 -27463 -16933 -12788 -5792 27263 49573 41578 20067 -25336 -53237 -36324 15042
5280 15042 42129 55846 40129 -16342 -28538 -33197 -43608 -10010 7963 -5771 10561 29444
5268 29444 13976 7290 -7732 -18996 -4217 12768 21079 15847 7144 -9657 -36427 -28984 -10167
5255 -10167 41842 63781 38955 -5536 -10238 -2950 22616 12009 8719 -16238 -28538 -31242 -54943
5242 -54943 -64068 -49772 -69802 -66512 -42180 -20115 -31255 -22443 -34309 -4955 -1219 -21675 -17078
5229 -17078 11885 8522 -4399 20643 -27353 -54521 -71513 -29247 -54305 -94757 -89417 -71577
5217 -71577 9334 29007 35110 35817 10321 28266 5070 -14713 -20050 -49422 -53268 -13553 7796
5204 7796 6131 -1367 -41948 -44037 -6502 11680 4304 31828 50146 32051 -26052 -35911 -17530
5191a7530J3262L346j0342n831j2242K1281J8784J3970j92k7418j3946l2660P882
5178d1636M6248J1835j4593j8721j2721j6953M0035K7769j0164n2070k4017L0106
5166c4882P378n88q95M31P425J8380L4704k2074l9560k0953J5084J5834P139L0435
5152A7858j1208k18l1747n315J5778J9311R841J3364K4216j5211k9880j5487L1058
5139B2360M1768l3917j6856j563m239J8796P246K6179m163m5296m0814j4245K341
5126d2403n429J6744M3192q725j6755R364K807l1359j5021J4113j7827j46M4674
5113f771N4426k386k4167k2823k098M3132L404m4202l2925j9866J0737K2008K5485
5100C954j548N361L614k9745r564L7962J1826O36k5057j0041Q89j1540l312J797
$$ plain form
5191 -17530 -4268 -922 -11264 -17095 -29337 -8056 10728 24698 24506 -2912 -16858 -49518 -41636
5178 -41636 4612 16447 1854 -16867 -29588 -46541 -6506 21263 11099 -40971 -64988 -34882
5166 -34882 -27504 -28092 -28987 -28556 -21131 -2751 31953 9879 -29681 -50634 -35550 -19716 -12577 17858
5152 17858 6650 6432 -25315 -30630 -14852 4459 14300 27664 51880 36669 6789 -8698 22360
5139 22360 64128 30211 13355 11792 7553 26349 33595 59774 55611 10315 -30499 -44744 -42403
5126 -42403 -47832 -31088 12104 3379 -13376 -4012 -1205 -32564 -47585 -33472 -51299 -51445 -6771
5113 -6771 47655 45269 21102 -1721 -3819 39313 42717 -1485 -34410 -54276 -43539 -21531 3954
5100 3954 2406 7767 11381 -18364 -27928 10034 21860 22496 -2561 -12602 -11713 -23253 -26565 -24768
5086b4768j7239Q595o841K0973J3600o787K065J2489J0723k2865j7808n155R242
5073b3776l1232q529j9439J2521L1870L3502J738q435j2149M1296Q474K9782J4702
5060G0325m0220j7420R302k6713L88j0196J8230p215m9537K2904J1466Q338L475
5047f873K1184K5772l3201k8394J3188N0118j008J883M282l4601k9608J7904L6149
5034C6795J6488k4112P048o898o546o680k8831P526K0641K6788L7119K3461k663
5021A00136m2319k181j1235k8928l5389k124J6197P584l696K0204P946k6111K970
5008C054K5078Q64P143J4153L58j2781k2248j2411L5881k5235k8524L5286J1182
4995C1800J1451j8648j5879K1021Q683p894k1180j1610k1678J1607l562k697K1621
$$ plain form
5086 -24768 -42007 -33412 -40253 -19280 -5680 -12467 -10402 2087 12810 -10055 -27863 -33018 -23776
5073 -23776 -55008 -63537 -82976 -70455 -38585 -5083 -3345 -11780 -23929 17367 25841 55623 70325
5060 70325 30105 12685 21987 -4726 -4338 -14534 3696 -3519 -53056 -30152 -18686 -10348 -6873
5047 -6873 14311 40083 6882 -21512 -8324 41794 40786 42669 46951 12350 -17258 646 36795
5034 36795 53283 29171 36219 29321 22775 16095 -12736 -5210 15431 42219 79338 102799 100136
5021 100136 57817 55636 44401 15473 -19916 -22040 -5843 1741 -1955 18249 26195 84 3054
5008 3054 28132 28996 36139 50292 50650 37869 15621 3210 39091 13856 -14668 20618 31800
4995 31800 43251 24603 8724 29745 38428 30534 9354 -2256 -23934 -12327 -15889 -18586 3035
4982C035k8905l1728j372L5007o114J4522r948j8132M0839L4397j3055k5681j3159
4969b0294l0929J0823L3340M133m589Q087r029Q718k1164k8293O175L857J7265
4956b1900J4895K9782Q623q719J3205j4968l7121J3753N5150N941l8223j8669
4944A749M2688J0263k1659j8285R275j5281n849m630n1354r279M3211N1310P777
4931C9936m265k3307r656J378J6319l682J671P370j5549O932O472j9848j4007
4918a0236N259J9877K0999j031k8230k411j1806j5166l3458K5484K4808J1120
4906E209J3234r937O241j3975J4587M891K1916M321k0180k6613l1765J4744J0756
4893f571k2127n746P474L7034R372j3555k9281o502K6472P631j0877l1025k2575
$$ plain form
4982 3035 -25870 -57598 -58970 -23963 -30077 -15555 -25503 -43635 -2796 31601 18546 -7135 -20294
4969 -20294 -51223 -40400 -7060 -2927 -7516 571 -8458 260 -20904 -49197 -43022 -39165 -21900
4956 -21900 -7005 22777 31400 22681 35886 20918 -16203 -2450 52700 58641 20418 1749
4944 1749 44437 54700 33041 14756 24031 8750 2901 -1729 -53083 -62362 -19151 32159 39936
4931 39936 35671 12364 2708 4086 20405 16723 18394 25764 10215 17147 23619 3771 -10236
4918 -10236 -4977 14900 35899 34868 6638 4227 -7579 -22745 -56203 -30719 -5911 5209
4906 5209 18443 8506 14747 772 15359 20250 42166 46487 26307 -306 -32071 -17327 -6571
4893 -6571 -28698 -34444 -26970 10064 19436 5881 -23400 -29902 -3430 4201 -6676 -37701 -60276
4880f0276K2428K8461L755N490K4295j4781M815J9125j1672j1839j0243q419J7908
4867I047P131j3755K5828m139m428j1890r405J59Q872j0823l2561j9633J2574
4854d3023L8073J4695O578r009j0455K532J1663K7666j0812n2731q283l411k2456
4841e8973l777N690K3816J2535k2307J0853p77j8511J0790L7948O629P037r246
4828A707o0475L1095K730l9628l7363M0704L1468k488K6629K7812o02j2399j2411
4815c221j3848J5236K0371l2586m5253L182L8835K7363k0341l8827K2115K5930
4803a044K6145k6082R0K2620l1475p023J1921j0999L940R215N428K8306j2587
4790A8455P196N0552k3611k1127j3951q129R598j6599k7993J2767J0744J4644
$$ plain form
4880 -60276 -37848 -9387 -5632 -142 24153 9372 14187 33312 21640 9801 -442 -8861 9047
4867 9047 16178 2423 28251 24112 19684 7794 -1611 -1452 7420 -3403 -35964 -55597 -43023
4854 -43023 -4950 9745 16323 7314 -3141 -609 11054 38720 27908 -24823 -33106 -36517 -58973
4841 -58973 -62750 -57060 -33244 -20709 -43016 -32163 -32940 -51451 -40661 -2713 3916 10953 1707
4828 1707 -58768 -27673 -24943 -64571 -101934 -61230 -29762 -32250 -5621 22191 21589 9190 -3221
4815 -3221 -17069 -1833 18538 -14048 -59301 -56119 -17284 10079 -10262 -49089 -26974 -1044
4803 -1044 25101 -981 -891 21729 -9746 -16769 -4848 -15847 -11907 -2692 2736 31042 18455
4790 18455 25651 76203 52592 31465 17514 9385 18983 2384 -25609 -12842 -2098 12546
4778A2546q540K6704j8742k2505j2156r275k446m973J8986Q429ol0357k5652O433
4764f1554L2284m281N402N0545L3432J844j0547p877j6724R932m27n185q722Q850
4750B6972L2582j4467j5048k3417K940r569m0329j5084J2372K0968O827J6728
4738A475o379n464m2589j9891k2958r386L0582j8646L1894L3621m779j996K25
4725c4291m881N474K2185L1947R026m0803n784K0810k6929J5812L467p368J1044
4712b91j2927K0583K6815J1840j5387m1608o045K2004L547j0440K94K8098M1714
4699F8197j9439k8109k4592j7749j1839K68O179L4441L1127N889r142j724m754
4686B8753j8392j2970J8332J886q611q430n733l610L3962O380n223p210k0824
$$ plain form
4778 12546 4006 30710 11968 -10537 -22693 -31968 -34414 -39387 -20401 -11972 -11978 -42335 -67987 -61554
4764 -61554 -29270 -33551 -28149 22396 55828 57672 47125 39248 22524 32456 32029 26844 18122 26972
4750 26972 59554 45087 30039 6622 9562 -7 -40336 -55420 -43048 -22080 -15253 1475
4738 1475 -4904 -10368 -52957 -72848 -95806 -105192 -74610 -93256 -61362 -27741 -32520 -34516 -34291
4725 -34291 -39172 -33698 -11513 20434 29460 -11343 -17127 3683 -23246 -7434 -3967 -11335 -291
4712 -291 -13218 7365 34180 46020 30633 -10975 -17020 4984 8531 -1909 -1615 26483 68197
4699 68197 48758 20649 -3943 -21692 -33531 -33263 -27084 7357 38484 44373 35231 33507 28753
4686 28753 10361 -2609 15723 17609 8998 568 -5165 -8775 25187 31567 26344 19134 -1690
4673a690j8499j0216q730k316J3226L762P73J2039M588m1241l1630m426L9860
4660d4500o558J0307M5370L5040K9839l6695m7870L4225j2594m2291K3705k3509
4648c5531p512J5730J4248K2414l508O97R356j7166m77o502m2617J1420L5260
4635d188K7036m9310k6040J7700K0870K609J3625L630k0735L7721J4198J0724
4623D7840j4889N688p308j6628p686J298n717K0179Q652k6601P07r082j5598q07
4609a9952L392K470J5986J039J0907j817j0025q239j4130n735j4415L2474J7030
4596H985j2958j7973k791L209L587K7165K4870k9102k8011J4256J1773j9992j456
4583a8438N4847M2866m9333j9829j966j2725J7600K4412k0312j1388j946j1392
$$ plain form
4673 -1690 -20189 -30405 -39135 -41451 -28225 -24463 -23690 -11651 -7063 -48304 -79934 -84360 -44500
4660 -44500 -51058 -40751 4619 39659 69498 32803 -15067 19158 6564 -35727 -12022 -35531
4648 -35531 -43043 -27313 -13065 9349 5841 6538 15894 -1272 -1749 -8251 -50868 -39448 -4188
4635 -4188 22848 -26462 -52502 -34802 -13932 -11323 2302 5932 -14803 22918 37116 47840
4623 47840 32951 38639 31331 14703 7017 8315 2598 22777 31429 4828 5535 -3547 -19145 -19952
4609 -19952 -16560 -14090 1896 2935 13842 12025 2000 -6239 -20369 -26104 -40519 -8045 8985
4596 8985 -3973 -21946 -24737 -21528 -17941 9224 34094 4992 -23019 -8763 3010 -16982 -18438
4583 -18438 36409 79275 29942 10113 8147 -4578 13022 37434 17122 5734 3788 -7604
4571g604k651p570j2985n335K002j438K8983K2845k9514N224N8326N087J2706
4558F8076k0758k1339j0082Q794K8214J0819j3904N533p178m7672m173o002J8373
4545H701k5241Q765R935j1962L139K1535K334N116j9246j841J339m057J4667k249
4531A0935r803J5583k1639J0176n955k5109p927K1019M9101o700j5478j7126K3351
4518B0428J8851j9209j2840q804K4599M492J899l5120j5957J9815J0703K433l0913
4505a9623m8282m589K3119J9376J3708K0808K0958p577p477k4206k6461R089J8662
4492a2495J5354K7895k0258j1617j5912k2390K1129J4603J7526K2744J1366k4774
4480B3171n3429P819K7579J531J4834k7228k6654j0731q901M1806M7269k3588
$$ plain form
4571 -7604 -10255 -17825 -30810 -36145 -34143 -35581 -6598 16247 -13267 -8043 50283 55370 68076
4558 68076 47318 25979 15897 24691 52905 63724 49820 55353 48175 503 -3670 -9672 8701
4545 8701 -16540 -7775 2160 -9802 -6663 14872 17206 22322 3076 1235 2574 -1483 13184 10935
4531 10935 1132 16715 -4924 5252 -703 -25812 -33739 -12720 36381 29681 14203 -2923 20428
4518 20428 39279 20070 7230 -1574 23025 27517 29416 -5704 -21661 -1846 8857 11290 -19623
4505 -19623 -67905 -72494 -49375 -29999 -16291 4517 25475 17898 10421 -13785 -40246 -31157 -12495
4492 -12495 2859 30754 10496 -1121 -17033 -39423 -18294 -3691 13835 36579 47945 23171
4480 23171 -30258 -22439 5140 6671 21505 -5723 -32377 -43108 -52009 -10203 37066 13478
$$ [...]
##END NTUPLES=NMR SPECTRUM
##END=
