##TITLE=Analysis number 318742
Compound Code mo 07803
Book Reference 472/69/2
Project Code adrs
Chemist Name victoriam
##JCAMPDX= 6.0         $$ Bruker NMR JCAMP-DX V2.0
##DATA TYPE= NMR SPECTRUM
##DATA CLASS= NTUPLES
##ORIGIN= Bruker BioSpin GmbH
##OWNER= nmr
$$ XWIN-NMR		Version 3.5
$$ Wed Apr 12 11:50:00 2006 GMT Daylight Time (UT+1h)  MAYBRIDGE\nmr@NMR_250MHZ
##.OBSERVE FREQUENCY= 250.131544655141
##.OBSERVE NUCLEUS= ^1H
##.ACQUISITION MODE= SIMULTANEOUS (DQD)
##.ACQUISITION SCHEME= undefined
##.AVERAGES= 16
##.DIGITISER RES= 18
##SPECTROMETER/DATA SYSTEM= dpx250
##.PULSE SEQUENCE= zg30
##.SOLVENT NAME= CDCl3
##.SHIFT REFERENCE= (INTERNAL, CDCl3, 0, 16.522)
##AUDIT TRAIL= $$ (NUMBER, WHEN, WHO, WHERE, WHAT)
$$ ##TITLE= Audit trail, XWIN-NMR		Version 3.5
$$ ##JCAMPDX= 5.01
$$ ##ORIGIN= Bruker BioSpin GmbH
$$ ##OWNER= nmr
$$ C:\u/data/dgb/nmr/ADRS/2580/pdata/1/auditp.txt
$$ ##AUDIT TRAIL=  $$ (NUMBER, WHEN, WHO, WHERE, WHAT)
(   1,<2006-04-12 11:49:12.52 +100>,<MAYBRIDGE\nmr>,<NMR_250MHZ>,
      <created by zg, POWCHK disabled, PULCHK disabled
       configuration hash MD5:
       84 BC 41 DB A1 6E 1D 46 DA 25 12 A5 C1 ED C5 3A
       data hash MD5: 64K
       44 7F 04 2C 79 3F 04 52 F0 FD 00 1E 5D F0 A1 70>)
(   2,<2006-04-12 11:49:34.57 +100>,<MAYBRIDGE\nmr>,<NMR_250MHZ>,
      <Start of raw data processing
       ef LB = 0.3 FT_mod = 6 PKNL = 1 SI = 32K 
       data hash MD5: 32K
       0A A7 FB A3 72 8B 4E 22 BE BC 0E E0 65 9B 76 E1>)
(   3,<2006-04-12 11:49:39.93 +100>,<MAYBRIDGE\nmr>,<NMR_250MHZ>,
      <apk 
       data hash MD5: 32K
       CB 95 06 06 81 C5 52 AE 6C 96 EB 18 5B DC 0D FE>)
(   4,<2006-04-12 11:49:41.54 +100>,<MAYBRIDGE\nmr>,<NMR_250MHZ>,
      <abs ABSG = 5 
       data hash MD5: 32K
       62 D3 EB FB 69 DE 28 88 F2 B3 D5 D5 A4 F9 B1 E8>)
$$ ##END=
$$ 
$$ hash MD5
$$ 28 07 1F 8E 44 70 8D 19 8C A7 63 68 23 63 B7 4D
##$RELAX= 
##$RELAX= 
##$RELAX= 
##$RELAX= 
##$RELAX= 
##$RELAX= 
##$RELAX= 
$$ Bruker specific parameters
$$ --------------------------
##$DU= <C:\u>
##$EXPNO= 2580
##$NAME= <ADRS>
##$PROCNO= 1
##$TYPE= <nmr>
##$USER= <dgb>
##$AMP= (0..31)
100 100 100 100 100 100 100 100 100 100 100 100 100 100 100 100 100 100 
100 100 100 100 100 100 100 100 100 100 100 100 100 100 
##$AQSEQ= 0
##$AQ_mod= 3
##$AUNM= <au_zg>
##$AUTOPOS= <17 >
##$BF1= 250.13
##$BF2= 250.13
##$BF3= 250.13
##$BF4= 250.13
##$BF5= 500.13
##$BF6= 500.13
##$BF7= 500.13
##$BF8= 500.13
##$BYTORDA= 1
##$CFDGTYP= 0
##$CFRGTYP= 5
##$CHEMSTR= <none>
##$CNST= (0..31)
1 1 145 1 1 1 1 1 1 1 1 1 1 1 1 1 1 1 1 1 1 1 1 1 1 1 1 1 1 1 1 1 
##$CPDPRG= <>
##$CPDPRG1= <>
##$CPDPRG2= <>
##$CPDPRG3= <>
##$CPDPRG4= <mlev>
##$CPDPRG5= <mlev>
##$CPDPRG6= <mlev>
##$CPDPRG7= <mlev>
##$CPDPRG8= <mlev>
##$CPDPRGB= <>
##$CPDPRGT= <>
##$D= (0..31)
0 1 0 0 0 0 0 0 0 0.06 0 0 0 0 0 0 0.0002 0 0 0 0 0 0 0 0 0 0 0 0 0 0 
0 
##$DATE= 1144838949
##$DBL= (0..7)
120 120 120 120 120 120 120 120 
##$DBP= (0..7)
150 150 150 150 150 150 150 150 
##$DBP07= 0
##$DBPNAM0= <>
##$DBPNAM1= <>
$$ [...]
##$SUBNAM7= <"">
##$SUBNAM8= <"">
##$SUBNAM9= <"">
##$SW= 20.6930455092707
##$SWIBOX= (0..15)
0 0 3 0 0 0 0 0 0 0 0 0 0 0 0 0 
##$SW_h= 5175.983436853
##$TD= 65536
##$TD0= 1
##$TE= 294.16
##$TE2= 300
##$TE3= 300
##$TEG= 300
##$TL= (0..7)
0 120 120 120 120 120 120 120 
##$TP= (0..7)
150 150 150 150 150 150 150 150 
##$TP07= 0
##$TPNAME0= <>
##$TPNAME1= <>
##$TPNAME2= <>
##$TPNAME3= <>
##$TPNAME4= <>
##$TPNAME5= <>
##$TPNAME6= <>
##$TPNAME7= <>
##$TPOAL= (0..7)
0.5 0.5 0.5 0.5 0.5 0.5 0.5 0.5 
##$TPOFFS= (0..7)
0 0 0 0 0 0 0 0 
##$TUNHIN= 0
##$TUNHOUT= 0
##$TUNXOUT= 0
##$USERA1= <user>
##$USERA2= <user>
##$USERA3= <user>
##$USERA4= <user>
##$USERA5= <user>
##$V9= 5
##$VALIST= <valist>
##$VCLIST= <CCCCCCCCCCCCCCC>
##$VD= 0
##$VDLIST= <DDDDDDDDDDDDDDD>
##$VPLIST= <PPPPPPPPPPPPPPP>
##$VTLIST= <TTTTTTTTTTTTTTT>
##$WBST= 1024
##$WBSW= 4
##$XGAIN= (0..3)
0 0 0 0 
##$XL= 0
##$YL= 0
##$YMAX_a= 351861
##$YMIN_a= -417641
##$ZGOPTNS= <>
##$ZL1= 120
##$ZL2= 120
##$ZL3= 120
##$ZL4= 120
##$ABSF1= 16.522
##$ABSF2= -4.171173
##$ABSG= 5
##$ABSL= 3
##$ALPHA= 0
##$AQORDER= 0
##$ASSFAC= 0
##$ASSFACI= 0
##$ASSFACX= 0
##$ASSWID= 0
##$AUNMP= <proc_1d>
##$AZFE= 0.1
##$AZFW= 0.1
##$BCFW= 0
##$BC_mod= 0
##$BYTORDP= 0
##$COROFFS= 0
##$CY= 12.5
##$DATMOD= 1
##$DC= 0
##$DFILT= <>
##$DTYPP= 0
##$F1P= 14.0000005364418
##$F2P= -0.99999901652339
##$FCOR= 0.5
##$FTSIZE= 32768
##$FT_mod= 6
##$GAMMA= 0
##$GB= 0
##$INTBC= 1
##$INTSCL= 1
##$ISEN= 128
##$LB= 0.3
##$LEV0= 0
##$LPBIN= 0
##$MAXI= 10000
##$MC2= 0
##$MEAN= 0
##$ME_mod= 0
##$MI= 0
##$NCOEF= 0
##$NC_proc= -5
##$NLEV= 6
##$NOISF1= 0
##$NOISF2= 0
##$NSP= 0
##$NTH_PI= 0
##$NZP= 0
##$OFFSET= 16.522
##$PC= 1
##$PHC0= 181.5774
##$PHC1= -19.54313
##$PH_mod= 1
##$PKNL= yes
##$PPARMOD= 0
##$PSCAL= 4
##$PSIGN= 0
##$REVERSE= no
##$SF= 250.13
##$SI= 32768
##$SIGF1= 0
##$SIGF2= 0
##$SINO= 400
##$SIOLD= 32768
##$SREGLST= <1H.CDCl3>
##$SSB= 0
##$STSI= 32768
##$STSR= 0
##$SW_p= 5175.98343685301
##$SYMM= 0
##$S_DEV= 0
##$TDeff= 65536
##$TDoff= 0
##$TI= <Analysis number 999999
Compound Code 99
Book Reference 9
Project Code 9>
##$TILT= no
##$TM1= 0
##$TM2= 0
##$TOPLEV= 0
##$USERP1= <user>
##$USERP2= <user>
##$USERP3= <user>
##$USERP4= <user>
##$USERP5= <user>
##$WDW= 1
##$XDIM= 32768
##$YMAX_p= 416943082
##$YMIN_p= -795168
$$ End of Bruker specific parameters
$$ ---------------------------------
##NTUPLES= NMR SPECTRUM
##VAR_NAME=  FREQUENCY,     SPECTRUM/REAL,   SPECTRUM/IMAG
##SYMBOL=    X,             R,               I
##VAR_TYPE=  INDEPENDENT,   DEPENDENT,       DEPENDENT
##VAR_FORM=  AFFN,          ASDF,            ASDF
##VAR_DIM=   32768,         32768,           32768
##UNITS=     HZ,            ARBITRARY UNITS, ARBITRARY UNITS
##FACTOR=    0.157963299565203, 1,           1
##FIRST=     4132.6476996994, 0,             0
##LAST=      -1043.33573715361, 0,           0
##MIN=       -1043.33573715361, -795168,     0
##MAX=       4132.6476996994, 416943082,     0
$$ Real data points
##PAGE= N=1
##DATA TABLE= (X++(R..R)), XYDATA
$$ [...]
23505a02267m3801K83912j41559j54792m4930M9436J43317N7551j80148j06085
$$ -102267 -146068 137844 -3715 -158507 -203437 -154001 -10684 46867 -133281 -239366
23495b39366j98833J06591N1691K0381M0591m6500M5365m0513J14815R5557o801
$$ -239366 -438199 -331608 -279917 -259536 -218945 -265445 -220080 -260593 -145778 -50221 -57022
23484e7022r8902J3032K2866R4788l284P0737J10268j5931q3103o4777o9480j56552
$$ -57022 -155924 -142892 -120026 -25238 -28522 42215 152483 136552 53449 -11328 -80808 -237360
23472b37360J53954J05803j13661j98323m0735J02416J35004j24436o0231R8588
$$ -237360 -83406 22397 -91264 -289587 -330322 -227906 -92902 -217338 -277569 -178981
23462a78981L3561J40365J6098N0995k4565K2971Q6646j9087j9365l64932J18847
$$ -178981 -145420 -5055 11043 62038 37473 60444 147090 128003 108638 -256294 -137447
23451a37447L63126M2811P5397j06890j42317j62165k63185l05102L2331K03472
$$ -137447 225679 268490 343887 236997 94680 -67485 -330670 -635772 -603441 -399969
23441c99969J42671o197j6165L1423K90468K14920j54329j20130M4949J66731
$$ -399969 -257298 -263495 -279660 -248237 42231 257151 102822 -17308 27641 194372
23431A94372j15890l8866R4376K491o1247Q2195K16490k16763k06825M6523K08611
$$ 194372 78482 39616 133992 136483 75236 157431 373921 157158 -49667 -3144 205467
23420B05467J55427l6808m00797k16618L84045J37881m2801R4606M9503j47260
$$ 205467 360894 324086 -76711 -293329 90716 228597 185796 280402 329905 182645
23410A82645j13806o7191o5862l0258Q5488J4894m0384M6277K43004N4950k3101
$$ 182645 68839 1648 -64214 -94472 -8984 5910 -34474 11803 254807 309757 286656
23399B86656j48928k73237k83890K68941K34153j83529J79628J12325K0779k8738
$$ 286656 137728 -135509 -419399 -150458 83695 -99834 79794 192119 212898 184160
23389A84160l7223L0830k0138L2421j73782o3785j709N9842J22858p3652l1404
$$ 184160 146937 177767 157629 190050 16268 -47517 -49226 10616 133474 59822 28418
23378B8418J389M4256J03037J64535K0017k0521j69884j49113o5920Q5744O9234
$$ 28418 29807 74063 177100 341635 361652 341131 171247 22134 -43786 41958 111192
23367A11192j47798K316o3477N276Q4512K25633J4818O7506K568k18169p1396
$$ 111192 -36606 -34290 -97767 -92491 -7979 217654 232472 299978 302546 84377 12981
23356A2981j38501N7576j06796j86557J87135K41879N7048q7903j50784l4749
$$ 12981 -125520 -67944 -174740 -361297 -174162 67717 124765 36862 -113922 -148671
23346a48671J00342J57627K9835P4432m9744j39008r2685l656q7724J33575K4355
$$ -148671 -48329 109298 139133 213565 163821 24813 -67872 -71528 -159252 -25677 -1322
23335a322L4543O0954L4476R3676k1464k45647N980P8332L2902p7160q2213N4836
$$ -1322 33221 94175 128651 222327 200863 -44784 -38804 39528 72430 -4730 -86943 -32107
23323c2107p4826J25390j15938m9024k29359r4881J4066J00366j38297J69003
$$ -32107 -106933 18457 -97481 -146505 -375864 -470745 -456679 -356313 -494610 -325607
23313c25607M1755P3994K49613j495R7689m3269k49952j82894Q4417J60924K542
$$ -325607 -283852 -209858 39755 38260 135949 92680 -157272 -340166 -255749 -94825 -92283
23302i2283r238j02500m3870m0004M513k6066R4590J43441J83984O4037n2763
$$ -92283 -101521 -204021 -247891 -287895 -283382 -309448 -214858 -71417 112567 176604 123841
23291A23841q7506j49721k58462J83715K11773J22291R3068r3624L499j20513
$$ 123841 36335 -113386 -371848 -188133 23640 145931 238999 145375 148874 28361
23281B8361O9647P2925q4507k19760Q641K39230K63928o3463l69272l7061p6108
$$ 28361 98008 170933 86426 -133334 -124693 114537 378465 315002 -54270 -91331 -167439
23270a67439n5802K6226L2719k9388J79446J67697N7643l2224n8835o5121J07412
$$ -167439 -223241 -197015 -164296 -193684 -14238 153459 211102 178878 120043 54922 162334
23259A62334q1976k3500k9528j86022p0697q2523J87748J46091L7070j01058L6406
$$ 162334 80358 56858 27330 -158692 -229389 -311912 -124164 21927 58997 -42061 -5655
23248e655J48876K4871n4858J22528j9644k91592j55001j22059J34278N3853P5583
$$ -5655 143221 168092 113234 235762 216118 -75474 -230475 -352534 -218256 -164403 -88820
23237h8820J30558J49410J54660j38082M8553j36277k03038j28706o5221J1817
$$ -88820 41738 191148 345808 207726 256279 120002 -83036 -211742 -276963 -265146
23227b65146M3185j3425o0213J32009K63108O7471j15132j83003L1788K4980J55224
$$ -265146 -221961 -235386 -295599 -163590 99518 166989 51857 -131146 -99358 -74378 80846
23216H0846K30277J2573k4511j19757k32394j08953j4288k72282J09965J70066
$$ 80846 311123 323696 299185 179428 -52966 -161919 -176207 -448489 -338524 -168458
23206a68458K69668J38328Q6162M4081k5009j11575L4321L147j3252J82590k46236
$$ -168458 101210 239538 325700 369781 344772 233197 267518 270665 257413 440003 193767
23195A93767k16582K6288m0207j52707J57501Q1137R559M9157r8785J22758O0822
$$ 193767 -22815 3473 -36734 -189441 -31940 49197 58756 107913 9128 131886 192708
23184A92708j09862R8891J56499l4128j61210N6876j08543j70134J6146n5668
$$ 192708 82846 181737 338236 304108 142898 199774 91231 -78903 -62757 -118425
23174a18425J98755K7770Q2513M7181m2249q7371k40711m2207o0698r9709L6167
$$ -118425 80330 108100 190613 237794 195545 108174 -132537 -174744 -235442 -335151 -298984
23163b98984J00980O5415J35219N1963r7605J1790K17852o6893Q0854j9939k26047
$$ -298984 -198004 -132589 2630 54593 -43012 -31222 186630 119737 200591 180652 -45395
23152d5395o1567M028n7109N7489j77182O1001J82674p7007q6726J31346K15768
$$ -45395 -106962 -102934 -160043 -102554 -279736 -218735 -36061 -113068 -199794 -68448 147320
23141A47320j09400m4462k0471r5261o9906J98054R0435j33041j11022m9785k7989
$$ 147320 37920 -6542 -27013 -122274 -192180 5874 96309 -36732 -147754 -197539 -225528
23130b25528Q3261q970Q9953k58J56725l946j77636j82290L6246K92617r8354
$$ -225528 -142267 -151237 -61284 -61542 95183 91237 -86399 -268689 -232443 60174 -38180
23119c8180p2406P948J68542N9583m3489K92102K5574k31685k97246j19174K81770
$$ -38180 -110586 -102638 65904 125487 81998 374100 399674 167989 -129257 -248431 33339
23108C3339P2876K28205L7841k20268k96877p6767J02680J57370K0265k00843
$$ 33339 106215 334420 372261 151993 -144884 -221651 -118971 38399 58664 -142179
23098a42179j16812J16431n3774J06602Q6865j22735k5342K9312r3953K9657K23782
$$ -142179 -258991 -142560 -196334 -89732 -2867 -125602 -150944 -121632 -215585 -185928 37854
23087C7854m8876j52474j13569J5835J71695J38282j15057j98659M2839J21620
$$ 37854 -11022 -163496 -277065 -261230 -89535 48747 -66310 -264969 -222130 -100510
23077a00510m7313j4228p6506j94887R0858O1382l9782l3975R9362R2043k596
$$ -100510 -147823 -162051 -238557 -433444 -342586 -281204 -320986 -354961 -255599 -163556 -166152
23066a66152r6214J19034p4384j23674J38637L3532L3056j57485N7133J20285
$$ -166152 -262366 -143332 -217716 -341390 -202753 -169221 -136165 -293650 -236517 -116232
23056a16232J65670o5153j13260L6904K9359k3227Q5770j23458k4220Q2519K05137
$$ -116232 49438 -15715 -128975 -92071 -62712 -85939 -169 -123627 -147847 -65328 139809
23045A39809Q9375k12603j74078m6991R5418P6573J17391j01047L4278O4672k1382
$$ 139809 229184 16581 -157497 -204488 -109070 -32497 84894 -16153 18125 82797 61415
23034F1415Q1671M6952k6154r3754o102K3412n5756j16775k00234K38097p8184
$$ 61415 143086 190038 163884 70130 64028 87440 31684 -85091 -285325 -47228 -125412
23023a25412j03969J19917Q5840L09220L510j46742m3042J1861O8501J74923j6660
$$ -125412 -229381 -109464 -23624 285596 289106 142364 99322 111183 179684 354607 337947
23012C37947M5901J1706o9228M8015l9063r1846M5250Q891j02853L8948q0882
$$ 337947 383848 395554 326326 374341 335278 243432 288682 297573 194720 233668 152786
23001A52786l9767j85249j01710Q1460K03068Q5088K62425K02972j44586L7667
$$ 152786 113019 -72230 -173940 -92480 110588 195676 458101 661073 516487 554154
22991E54154j09671k76558j69367p3215K12239l0778J15200r5172p6149j4400
$$ 554154 444483 167925 -1442 -74657 137582 106804 222004 126832 50683 36283
22981C6283J07180J31945q7103K51230J98638k38498k36276j38221k0452L09248
$$ 36283 143463 275408 188305 439535 638173 399675 163399 25178 4726 313974
22971C13974L10886k27356o6849J47708K5932j12794k82083k19333J85339K74959
$$ 313974 624860 397504 330655 478363 504295 391501 109418 -109915 75424 350383
22961C50383j30584l75284m1384J29138R6131K49861O4288r5800j5239K52603
$$ 350383 219799 -155485 -196869 -67731 28400 278261 342549 246749 231510 484113
22951D84113k3081j34947j81716Q5405l9925j14651J5475L6782k37816p1215r2831
$$ 484113 461032 326085 144369 229774 189849 75198 90673 127455 -110361 -181576 -274407
22940b74407J43421J98419n8567n7843J87093o122K27119J65812k47890l85820
$$ -274407 -130986 67433 8866 -48977 138116 131994 359113 524925 277035 -108785
22930a08785l8715L005o2610O3434J53305q3183m7200O7569R8807J23139J7675
$$ -108785 -147500 -144495 -207105 -143671 9634 -73549 -120749 -53180 45627 168766 186441
22919A86441r69k35198j78336J94051o3983J64193J53742K05070J69230O7597
$$ 186441 185472 -49726 -228062 -34011 -97994 66199 219941 425011 594241 661838
22909F61838l17748k30629p2944J7121J17367R4033P6378k4096k14310j91945
$$ 661838 344090 113461 40517 57638 175005 269038 345416 321320 107010 -84935
22899h4935J67670K7153j14311K761j8468q5057j51002j23321J02642Q8572K09858
$$ -84935 82735 109888 -4423 -1662 -20130 -105187 -256189 -379510 -276868 -188296 21562
22888B1562J93109j04345l2838l7358p6100o345N918M5031l3497j71232j40476
$$ 21562 214671 110326 77488 40130 -35970 -42315 -36397 8634 -24863 -196095 -336571
22877c36571K3802J40924k3054k1283K41365J88258K4422j67478j42135p5677
$$ -336571 -312769 -171845 -194899 -216182 25183 213441 237863 70385 -71750 -147427
22867a47427o8240j30278l4191K13066P5195r962Q5939J48068o3191j87202j52113
$$ -147427 -215667 -345945 -380136 -167070 -91875 -101837 -15898 132170 68979 -118223 -270336
22856b70336K4344J9838N9017j2198j51048R934j74616J1421K81293l7597K63651
$$ -270336 -245992 -226154 -167137 -179335 -330383 -320449 -495065 -483644 -202351 -239948 23703
22845B3703n4128m0697J41126l899k6695p928O0080K1473l21906j01903Q0827
$$ 23703 -30425 -71122 70004 66105 39410 31482 91562 113035 -208871 -310774 -229947
22834b29947J10334K16506K06216p2978r2484J03506j77671j45789J32877m3777
$$ -229947 -119613 96893 303109 230131 137647 241153 63482 -82307 50570 6793
22824F793r9025p1352J49634N1252q2139N5265k5290q4162j70291m5694M5801
$$ 6793 -92232 -163584 -13950 37302 -44837 10428 -14862 -99024 -269315 -315009 -269208
22813b69208J89809K18030J37333j80905L0499j06364P6129J26934j11733R451
$$ -269208 -79399 138631 275964 95059 125558 19194 95323 222257 110524 119975
22803A19975p3669K1894n8458O5494K2721k28461j13341r233J4145K45171K03243
$$ 119975 46306 68200 9742 75236 97957 -130504 -243845 -253078 -238933 6238 209481
22792B09481j72119k7131P6743J696k01714n9196j5650M4127J37704N7100p3647
$$ 209481 37362 10231 86974 88670 -113044 -172240 -187890 -143763 -6059 51041 -22606
22781b2606p0071q4757R1439L75112j09229k88359o0353R2774J21933O5481J20301
$$ -22606 -92677 -177434 -85995 289117 179888 -108471 -168824 -76050 45883 111364 231665
22770B31665K9739k25590p2538q5018j10716j01310j72204K25663J75376l339
$$ 231665 261404 35814 -36724 -121742 -232458 -333768 -505972 -280309 -104933 -108272
22760a08272J483j79868k04252K73827J30504r189q6351p0826J20073J19439J59045
$$ -108272 -106789 -286657 -490909 -217082 -86578 -95767 -182118 -252944 -132871 -13432 145613
22749A45613R1457J4575k24377k31518J3679K57797J16562k4415J2244K1645r8057
$$ 145613 237070 251645 27268 -204250 -190571 67226 183788 159373 171617 193262 95205
22738I5205l6944j54043j36815P22o9373M3513J78792O1137P7848K2953k1548
$$ 95205 58261 -95782 -232597 -231875 -301248 -257735 -78943 -17806 60042 82995 61447
22727F1447o8550j04041j18517M3036j21129J53216K82494k8166q9451P358q694
$$ 61447 -7103 -111144 -229661 -186625 -307754 -154538 127956 99790 10339 17697 9003
22716I003k60938r4971O6036M18450K9219l03794j50946Q348J95435J18342Q97
$$ 9003 -251935 -346906 -280870 137580 166799 -136995 -287941 -279593 -84158 34184 35081
22705C5081O8343Q8023R7447P3881k06331L6477J62118r4768j29954k23077q5193
$$ 35081 103424 191447 288894 362775 156444 192921 355039 260271 130317 -92760 -177953
22694a77953J16480J47813k145p4167j26259n447K09196J64253M4632j14822j39641
$$ -177953 -61473 86340 84195 10028 -116231 -121678 87518 251771 296403 181581 41940
22683D1940k37748M2695J90391J77487l2036m4597R3564O793k26251K02947J09931
$$ 41940 -195808 -153113 37278 214765 182729 138132 231696 238489 12238 215185 325116
22672C25116L5268P0906k35361j38888k3533l0586l0081R3671J27855j19770K414
$$ 325116 360384 431290 195929 57041 33508 2922 -27159 66512 194367 74597 77011
22661G7011Q287q5816j70624J40912K66003R909J11818l5515k24370O2698J52680
$$ 77011 85298 -518 -171142 -30230 235773 245682 357500 321985 97615 160313 312993
22650C12993j72961L1489L5608n6506P0111q9831l09074k3393r0290M5306j23575
$$ 312993 140032 171521 207129 150623 220734 130903 -178171 -201564 -291854 -246548 -370123
22639c70123N3824J69888K31393J0734J88226j08293k14214j64049j35584q3721
$$ -370123 -316299 -146411 84982 95716 283942 175649 -38565 -202614 -338198 -421919
22629d21919L68J41808N2915M344j1250m0594j21232q4481L50056L2960n7005
$$ -421919 -421551 -279743 -226828 -222484 -233734 -274328 -395560 -480041 -129985 -97025 -154030
22618a54030r4598K15980j4811j6920q991J13702j39461N387J37848j22277p2567
$$ -154030 -248628 -32648 -47459 -64379 -73370 40332 -99129 -93742 44106 -78171 -150738
22607a50738o1702n6252q8328P6809J67037J92360Q3747K5696n563q8194o2230
$$ -150738 -212440 -268692 -357020 -280211 -113174 79186 162933 188629 183066 94872 32642
22596C2642j0116n3445k93102o039J39700J22198L3473J48917M591j39408M5601
$$ 32642 22526 -30919 -324021 -330060 -190360 -68162 -34689 114228 118819 -20589 25012
22585B5012J9795k00908k35054N9664R865Q79K22615J34644j32098r6420q3862
$$ 25012 44807 -156101 -391155 -331491 -321626 -320747 -98132 36512 -95586 -192006 -275868
22574b75868M1516J18417K37102K2769l7455p2246j2321J12821N3582M494J36
$$ -275868 -234352 -115935 121167 143936 106481 34235 21914 134735 188317 192811 192947
22563A92947p655m4500j62643N9766K65031O942j97690r9384n9288l2658n6883
$$ 192947 185292 140792 -21851 37915 302946 309888 112198 12814 -46474 -79132 -136015
22552a36015J18109K27258k09938p9516K55495O7440O1938j68398j28567q8515
$$ -136015 -17906 209352 -586 -80102 175393 242833 304771 136373 7806 -80709
22542h0709J08441K9327J3720k7024j29946j17366J40977J39542J62719j3567
$$ -80709 27732 57059 70779 43755 -86191 -203557 -62580 76962 239681 226114
22532B26114q8741R4927R0569p9327j45358j9392p5544m463Q0822m7855M5663
$$ 226114 137373 232300 322869 243542 98184 78792 3248 -1215 79607 31752 77415
22521G7415P818M1254k60318j70131J7548N6020p561J24487O4754O5476M2540
$$ 77415 85233 126487 -133831 -303962 -286414 -230394 -237955 -113468 -48714 16762 59302
22510E9302O319J37529m6062n9109j34967j45062j05401Q7976N0800n0538J11937
$$ 59302 65621 203150 157088 97979 -36988 -182050 -287451 -199475 -148675 -199213 -87276
22499h7276K17314j2457J61536o0199k02939k5705j11248L484K12371k4267J08171
$$ -87276 130038 117581 279117 218918 15979 -9726 -120974 -117490 94881 70614 178785
22488A78785j6889M684k5068J05100K4343j62620j76843J61268K02465J0955K38701
$$ 178785 161896 166580 141512 246612 270955 108335 -68508 92760 295225 306180 544881
22477E44881k91337k79937P4495R2563j84975k81238N9394K2774K96032J46659
$$ 544881 253544 -26393 48102 140665 -44310 -325548 -266154 -243380 52652 199311
22467A99311J3184l1386n4907j31968k16585j65948K2336J92664L45908m1823
$$ 199311 212495 181109 126202 -5766 -222351 -388299 -365963 -173299 172609 130786
22457A30786j1852K05638K9465m2497j03019j51903j24517j89894O7221J50238
$$ 130786 118934 324572 354037 311540 208521 56618 -67899 -257793 -190572 -40334
22447d0334j7856n8250N5250Q0184m285L3239j1130j60496R5963K06483o5781
$$ -40334 -58190 -116440 -61190 18994 14709 47948 36818 -123678 -27715 178768 112987
22436A12987p2217j51114J6288q7205O6168J65445k6341o5305l373Q3217k7374
$$ 112987 40770 -110344 -94056 -181261 -115093 50352 24011 -41294 -44667 38550 11176
22425A1176j31159j68702L0477M7361K4814J09974K73781O0793p8146j0762m5534
$$ 11176 -119983 -288685 -258208 -210847 -186033 -76059 197722 258515 180369 169607 124073
22414A24073p7870M6941J12086j26328j43129R9770O0518j7428j91694Q2574m6608
$$ 124073 46203 93144 205230 78902 -64227 35543 96061 78633 -113061 -30487 -77095
22403g7095J10629K82319M0219L9553j30724p9164r7929J44181m9064j63050j3497
$$ -77095 33534 315853 356072 395625 264901 185737 87808 231989 182925 19875 6378
22392F378j6424Q3522M9990R2253n5129k6053L3811q3531M88K8825j04473j36019
$$ 6378 -10046 73476 123466 215719 160590 134537 168348 84817 85305 114130 9657 -126362
22380a26362q3749O3892m4387O0695J42489l9471l793J41327Q0056j37354j98806
$$ -126362 -210111 -146219 -190606 -129911 12578 -26893 -30686 110641 190697 53343 -145463
22369a45463n0206P8602K04199j55103j29101j4645n3227K9178M8288P0743J13721
$$ -145463 -195669 -117067 87132 -67971 -197072 -211717 -264944 -235766 -187478 -116735 -3014
22358c014R9014j7585j42154m2557P0417j82990J05552J63086J05881n4567j43225
$$ -3014 96000 78415 -63739 -106296 -35879 -218869 -113317 49769 155650 101083 -42142
22347d2142J89313O6992j23062P87p5194O4499L9964L5393J09644j81916j88546
$$ -42142 147171 214163 91101 91888 16694 81193 121157 156550 266194 84278 -104268
22336a04268J02257J9876O6792k04696j24830M0439J91504J78084N2016j30387
$$ -104268 -2011 17865 84657 -120039 -244869 -204430 -12926 165158 217174 86787
22326H6787J17242O1188J47655J77677O4122j95722l19206k02691j5673J39376
$$ 86787 204029 265217 412872 590549 654671 458949 139743 -62948 -78621 60755
22316F0755J98634J56090r0766J05272j23701m60j69465M1616j98325m7985N7895
$$ 60755 259389 415479 324713 429985 306284 305824 136359 177975 -20350 -68335 -10440
22305a0440J28091P0761q1152l2677p7584o374J11719N43k3907L990k00493o2500
$$ -10440 117651 188412 107260 74583 -3001 -9375 102344 102887 78980 82970 -117523 -180023
22293a80023J65106R3916Q1383J16368j54309k75742R1699K43920J42409j16452
$$ -180023 -14917 78999 160382 276750 122441 -153301 -61602 182318 324727 208275
22283B08275p4800j29296j36326N0029J81674j9787q3948J43494p6213k46434
$$ 208275 133475 4179 -132147 -82118 99556 79769 -4179 139315 63102 -183332
22273a83332J5058K62660K22193r944j69008j77923j36010k97081M8425K55528
$$ -183332 -168274 94386 316579 306635 137627 -40296 -176306 -473387 -424962 -169434
22263a69434o6647P8315l5450k08178j27314K01598M04863L9496q230J6541k67508
$$ -169434 -236081 -157766 -193216 -401394 -528708 -327110 77753 117249 109019 125560 -141948
22252a41948k01991J54552K02656k6522n8412J17340O4266M598J78236J84781
$$ -141948 -343939 -189387 13269 -13253 -71665 45675 109941 114539 292775 477556
22242D77556L2114p2729l46808k52601k6102N0116J2K34604n3927o6945l8499
$$ 477556 509670 436941 90133 -162468 -188570 -138454 -138442 96162 42235 -24710 -63209
22231f3209J75039J16436J65189J84884p9036k76496j77176k8583n3369j4688
$$ -63209 111830 228266 393455 578339 499303 222807 45631 17048 -36321 -51009
22221e1009j05133O3934O5208p2933n5884M8797J60414o5479o3330k5359P4089
$$ -51009 -156142 -92208 -27000 -99933 -155817 -107020 53394 -12085 -75415 -100774 -26685
22210b6685n5580j18602k48542K4067J48694K32548L9964M5334q6881j74387k8119
$$ -26685 -82265 -200867 -449409 -425342 -276648 -44100 -4136 41198 -45683 -220070 -248189
22199b48189m9667J42075J49909j95072k69558K72851K68422m6312j60666K0789
$$ -248189 -297856 -155781 -5872 -200944 -470502 -197651 70771 24459 -136207 -115418
22189a15418J43652K9221J20743n9977j35428k825m7910N7112J2845M9582o75
$$ -115418 28234 57455 178198 118221 -17207 -20032 -67942 -10830 2015 51597 50922
22178E0922k9192j3565J61183P0784k07447j86509n6157K2968o1675j21975K2678
$$ 50922 21730 8165 169348 240132 32685 -153824 -209981 -187013 -248688 -370663 -347985
22167c47985J74962J50304p0284J48157L19541J11541k34650n2820J39862r2575
$$ -347985 -173023 -22719 -93003 55154 374695 486236 251586 198766 338628 246053
22157B46053j11304j28986r0601j28707J36361J50101o9488k06372O5044j29134
$$ 246053 134749 5763 -84838 -213545 -77184 72917 3429 -202943 -137899 -267033
22147b67033n0639K12859J02927o3493L1146J63233L1755l9356k2741J9149J74955
$$ -267033 -317672 -104813 -1886 -65379 -34233 129000 160755 121399 98658 117807 292762
22136B92762o3140j30820j20234o9269l6480k5771j15217J36330m9456l2398J99951
$$ 292762 229622 98802 -21432 -90701 -127181 -152952 -268169 -131839 -181295 -213693 -13742
22125a3742J01790j04986J30395L21949J6634j40982j63936q5191j69474P8087
$$ -13742 88048 -16938 113457 435406 452040 311058 147122 61931 -107543 -29456
22115b9456P6702j19169l6411o6473r2460N8985J30367J68404J53111M9686k10820
$$ -29456 47246 -71923 -108334 -174807 -267267 -208282 -77915 90489 243600 293286 82466
22104H2466k36930k02724J98098L17628r752j38356P7388K7781P6742j53147k92377
$$ 82466 -154464 -357188 -159090 158538 148786 10430 87818 115599 192341 39194 -253183
22093b53183P946j62096M910K46669J75015Q9930n648m3477n0331j13912r6121
$$ -253183 -245237 -407333 -402423 -155754 19261 109191 103543 60066 9735 -104177 -200298
22082b00298N5302J00439j82683l9080Q5254K85664J13978j99439r3554L3831
$$ -200298 -144996 -44557 -227240 -266320 -181066 104598 218576 19137 -74417 -40586
22072d0586l854l2333k6275L0111M4554M3382m5127n0434j95259j59806P627q2194
$$ -40586 -44440 -76773 -103048 -72937 -28383 14999 -30128 -80562 -275821 -435627 -428000 -510194
22060e10194R0795J07143J01562L0440M1070L8763j02167J29824J69180J60472
$$ -510194 -419399 -312256 -210694 -180254 -139184 -100421 -202588 -72764 96416 256888
22050B56888j89754p9890k009j69846j84983o5046P4273K77148J15017N3832J25681
$$ 256888 67134 -12756 -14765 -184611 -369594 -434640 -360367 -83219 31798 85630 211311
22039B11311J279L3625j6646r6993j27371k59919k31885r311J30654j9209o487
$$ 211311 212590 246215 229569 132576 5205 -254714 -486599 -495910 -365256 -384465 -390952
22028c90952J1958O03K2855K29852J43403l4299K523k9192j07647r8188n4495
$$ -390952 -378994 -378391 -355536 -125684 17719 -16580 -14057 -43249 -150896 -249084 -303579
22017c03579K24652L9373Q0830o3294j06455J59528L8877l6592J0669Q3128m6680
$$ -303579 -78927 -39554 41276 -22018 -128473 31055 69932 33340 44009 127137 80457
22006H0457k6201k3231o0663m8657p2649J99998L02143J3289k04148k09818k51134
$$ 80457 54256 31025 -29638 -78295 -150944 49054 351197 364486 160338 -49480 -300614
21995c00614L6792L7553K22623J9672n7495j59262j02255j28242k7169O5555N7968
$$ -300614 -263822 -226269 -3646 16026 -41469 -200731 -302986 -431228 -458397 -392842 -334874
21984c34874K27967K00010K55661j08686q4815R1364K5989Q5503O503l22816l07161
$$ -334874 -106907 93103 348764 240078 155263 246627 272616 358119 364622 41806 -265355
21973b65355J3900J1920j50573m2228J90422L0872O2350J01979n4509j53219J54359
$$ -265355 -251455 -239535 -390108 -432336 -241914 -211042 -148692 -46713 -101222 -254441 -100082
21962a00082K13042j8691K4409J06014p8671o7104R6087P5364P2324j09552k70578
$$ -100082 112960 94269 118678 224692 146021 78917 175004 250368 322692 213140 -57438
21951e7438p0390o1697J75026k6041o9938k24511p1767K10220k9482O4888J21069
$$ -57438 -127828 -189525 -14499 -40540 -110478 -334989 -406756 -196536 -226018 -161130 -40061
21940d0061j05242K8435K38435J26261j0249L7120L59726j72856k30774q251n5882
$$ -40061 -145303 -116868 121567 247828 237579 274699 634425 461569 230795 222544 166662
21929A66662k6293j42604j5348Q3425k09048l0667L7045J17265J43799j36807
$$ 166662 140369 -2235 -17583 65842 -143206 -173873 -136828 -19563 124236 -12571
21919a2571j83164l0717J68495k7334J55430J17321l242j87486l836o9767j7665
$$ -12571 -195735 -226452 -57957 -85291 70139 187460 184218 -3268 -7104 -76871 -94536
21908i4536K0420j8337M5155J61411J01962p5652J23524l791j02872j25084K4748
$$ -94536 -74116 -92453 -47298 114113 216075 140423 263947 260156 157284 32200 56948
21897E6948M2100j29548R477K6913j49662N7931P0066J283J33600J33993j84858
$$ 56948 99048 -30500 -21023 5890 -143772 -85841 -15775 -14492 119108 253101 68243
21886F8243k9466j20594j03191m961J65898K43884P6570k04676j60286p3034K01156
$$ 68243 38777 -81817 -185008 -189969 -24071 219813 296383 91707 -68579 -141613 59543
21875E9543R4211k2687O5471N2088P7966k27342j11052J28565K6536r0626q3252
$$ 59543 153754 131067 196538 248626 326592 99250 -11802 116763 143299 52673 -30579
21864c0579J38872K07774K97868N4013q3006j46459k11819j45998k8604M2452
$$ -30579 108293 316067 613935 667948 584942 438483 226664 80666 52062 94514
21854I4514L270m8711J8644J53176j30679o3457k7151K13702J75012l4810j49137
$$ 94514 97784 49073 67717 220893 90214 26757 -394 213308 388320 353510 204373
21843B04373r5954n3517P3081K0757r0488J2268n060l8721o8463L0796K6312k3446
$$ 204373 108419 54902 127983 148740 58252 70520 65460 26739 -41724 -10928 15384 -8062
21831h062p9114o2130K7001j4993j94082P3290J32826R9022j72728j5745j24644
$$ -8062 -87176 -149306 -122305 -137298 -331380 -258090 -125264 -26242 -198970 -214715 -339359
21820c39359o6214J05160J76944j04184Q5179J15940M6707k01305J55436R5587
$$ -339359 -405573 -300413 -123469 -227653 -142474 -26534 20173 -181132 -25696 69891
21810F9891k2965O1438J9242j31642L3167O7522O5079j9258l5706O3907K19720
$$ 69891 46926 108364 127606 -4036 29131 96653 161732 142474 106768 170675 390395
21799C90395l5721j79739j8912m105p1675j01699J94403o8406r5664J5982K52078
$$ 390395 354674 174935 156023 151918 80243 -21456 172947 104541 8877 24859 276937
21788B76937J32084j05929l454K7353J9259M4038p2637j1506r3829j88544o4131
$$ 276937 409021 303092 299638 326991 346250 390288 317651 306145 212316 23772 -40359
21777d0359n4702m0971J75174K53812m379q5488o3116R7250j82781j54803j19679
$$ -40359 -95061 -136032 39142 292954 288575 203087 139971 237221 54440 -100363 -220042
21766b20042M7229q5893J25907R4935J5253J6911j2318J11965k84670l215J82843
$$ -220042 -172813 -258706 -132799 -37864 -22611 -5700 -18018 93947 -190723 -193938 -11095
21755a1095R2096K29610O4998j53059j3682P6192K2079j39012k16866k10726J04908
$$ -11095 81001 310611 375609 222550 208868 285060 307139 168127 -48739 -259465 -154557
21744a54557K45336o3752r3909l579q740K10944J85275p6465j63788k06835o7202
$$ -154557 90779 27027 -66882 -70461 -79201 131743 317018 240553 76765 -130070 -197272
21733a97272j2234K9669P0209K1215k5574j70623J14642j2371J28886J16768J64108
$$ -197272 -209506 -179837 -109628 -88413 -113987 -284610 -169968 -182339 -53453 63315 227423
21722B27423p8634k1675k8209P8330R2542R4791j86281k05333Q3508j6816j2858
$$ 227423 148789 127114 98905 177235 269777 364568 178287 -27046 56462 39646 26788
21711B6788j04908j33329O7592J23230J20741K49466j37720j15290j90752p4521
$$ 26788 -78120 -211449 -143857 -20627 100114 349580 211860 96570 -94182 -168703
21701a68703l9794O045o6603J30051R2770J10550j90374q2954N5576N8394J30202
$$ -168703 -208497 -202452 -269055 -139004 -46234 64316 -126058 -209012 -153436 -95042 35160
21690C5160l2061k07140j76877M3693j02099R0036M19780L75973m7498j65216
$$ 35160 3099 -204041 -380918 -337225 -439324 -349288 70492 446465 398967 233751
21680B33751r8959j38358l5834m8516J81127K69625j4330q0604j86190r5186L10217
$$ 233751 134792 -3566 -39400 -87916 93211 362836 348506 267902 81712 -13474 296743
21669B96743M213p0716N0351P1034q252k38238j19123m281J07597j20649k23353
$$ 296743 300956 230240 280591 351625 343373 105135 -13988 -18269 89328 -31321 -254674
21658b54674J04837J73887p0316r8086m914Q0754P9492j06910o0246K20045J15363
$$ -254674 -149837 24050 -46266 -144352 -149266 -68512 10980 -95930 -156176 63869 179232
21647A79232k526k9817m5910n8405j51097j68891j12542J00613J7458J1569J5736
$$ 179232 176706 146889 100979 42574 -108523 -277414 -389956 -289343 -271885 -260316 -244580
21636b44580N6762J01247j38973j34730K03421J14593J6909K8686m6872j05520
$$ -244580 -187818 -86571 -225544 -360274 -156853 -42260 -25351 3335 -43537 -149057
21626a49057o827J17760o2400L6656J6906p790K963o5973j949L6944j93955p8874
$$ -149057 -155884 -38124 -100524 -63868 -46962 -54752 -51789 -117762 -119711 -82767 -276722 -355596
21614c55596J1159Q3110M6451k03086q0328l9212K64038M7750n098j009R7038
$$ -355596 -344437 -261327 -214876 -417962 -498290 -537502 -273464 -225714 -230812 -231821 -134783
21603a34783K42465m041r5087J15520j9871j0611J39132j01560j27239J80932
$$ -134783 107682 103641 8554 124074 104203 93592 232724 131164 3925 184857
21593A84857p0679j60075j58785j33118N8950O7120m4989O1920O923K4697J64634
$$ 184857 114178 -45897 -204682 -337800 -278850 -211730 -256719 -194799 -187876 -163179 1455
21582A455n4138j20155J46449P3898R8986j29746J53494j2198J38807J14653j46513
$$ 1455 -52683 -172838 -26389 47509 146495 16749 170243 158045 296852 411505 264992
21571B64992j58521J16891R3291k17601j69670j12938L8561m2883J35470O0810
$$ 264992 106471 223362 316653 99052 -70618 -183556 -144995 -187878 -52408 8402
21561H402j78060j0634K83921J46779j23416j4424n3458R9761J6403q3235k13228
$$ 8402 -169658 -180292 103629 250408 126992 112568 59110 158871 175274 92039 -121189
21550a21189j71521J27923J80697J22297m3560P9562k57316o5207J03992K32834
$$ -121189 -292710 -164787 15910 138207 94647 174209 -83107 -148314 -44322 188512
21540A88512j47620L4680M0934r3550n7800P6684J32249o3768k66194k47472O8364
$$ 188512 40892 75572 116506 22956 -34844 41840 174089 110321 -155873 -403345 -334981
21529c34981Q0078K13436J26646j23289o134k2654K22430K664j75728j11589M9196
$$ -334981 -254903 -41467 85179 -38110 -44244 -66898 155532 158196 -17532 -129121 -79925
21518g9925Q5188K44986M5747k36710j43652L5529K3650J00113l8765j3368o6390
$$ -79925 5263 250249 295996 59286 -84366 -48837 -25187 74926 36161 22793 -43597
21507d3597r9016N5847j9813k3688P8557k1008k37059k9649J20058l1335J13560
$$ -43597 -142613 -86766 -106579 -130267 -51710 -72718 -309777 -339426 -219368 -250703 -137143
21496a37143K61997J84745j31925m1477q8725n6961j09887N9374j22192l5131
$$ -137143 124854 309599 177674 136197 47472 -9489 -119376 -60002 -182194 -217325
21486b17325L9017j86377L6814J75987L1638K2702j87232j43322J61632J35631
$$ -217325 -178308 -364685 -327871 -151884 -120246 -97544 -284776 -428098 -266466 -130835
21476a30835L43887r554j09944k4975n7354J1152J42671r1544k3972j01815J17464
$$ -130835 213052 203498 93554 68579 11225 22377 165048 73504 49532 -52283 65181
21465F5181M1215l2759j7016n5386j85088J01598J37152R3631M1001m0535n2140
$$ 65181 106396 73637 56621 1235 -183853 -82255 54897 148528 189529 148994 96854
21454I6854j7090j30823q2933l2748K15521J73350r5171k40024n1595J72618J47214
$$ 96854 79764 -51059 -133992 -166740 48781 222131 126960 -113064 -164659 7959 155173
21443A55173q4883k60672k7384M8529j60147p0102J19486j8806Q0778J24775L7313
$$ 155173 70290 -190382 -217766 -169237 -329384 -399486 -280000 -298806 -218028 -93253 -55940
21432e5940o3998J0341j56676r4427K27679K6668m3022j7748J92480o9355j18741
$$ -55940 -119938 -109597 -266273 -360700 -133021 -106353 -149375 -167123 25357 -43998 -162739
21421a62739J49816l8455m639n6203R0980p209o1217Q5628k7836N697O9633j93502
$$ -162739 -12923 -51378 -56017 -112220 -21240 -28449 -89666 -4038 -31874 -26177 43456 -150046
21409a50046J06437M094q2294N1980Q4021Q7922k66393k141K15613J64650r0836
$$ -150046 -43609 -39515 -121809 -69829 14192 102114 -164279 -166420 49193 213843 123007
21398A23007j22586k29340K9163j07282J5822J09658n3600M2325Q3891O04o6346
$$ 123007 421 -228919 -199756 -307038 -291216 -181558 -235158 -192833 -108942 -108338 -174684
21387a74684q3522J74346K44845J11782l6402n9528J00179K01714K64227K79488
$$ -174684 -258206 -83860 160985 272767 236365 176837 277016 478730 742957 1022445
21377A022445k08692k57039j5641n073j95921k94533O392p9968l2772j12552m2492
$$ 1022445 813753 556714 541073 536000 340079 45546 51938 -28030 -60802 -173354 -215846
21366b15846M09908L34544M65337K40360J15104k87053q6064j99640l18545r8277
$$ -215846 194062 528606 993943 1234303 1349407 1062354 976290 776650 458105 359828
21356C59828K49750j4581k41706j87639k26597J7013L9456j0981r713J76163J42286
$$ 359828 609578 594997 353291 165652 -60945 -43932 -4476 -15457 -25170 150993 293279
21345B93279k11508q0428P5661R7356M0317o2693k38338j76508K07601J1661Q89
$$ 293279 81771 1343 77004 174360 214677 151984 -86354 -262862 -55261 -43600 -42711
21334d2711n1053k16660j93500M3866J23122K30563K44151L56042P9369j32991
$$ -42711 -93764 -310424 -503924 -460058 -336936 -106373 137778 493820 573189 440198
21324D40198j17257l8469R745j73626m7637N2570l3464K54937J90721j36718q9441
$$ 440198 322941 284472 294217 120591 72954 125524 92060 346997 537718 401000 311559
21313C11559k8761j74937Q710K13092o4983j76156r9049P2488J82515k0672j18850
$$ 311559 282798 107861 116571 329663 264680 88524 -10525 61963 244478 223806 104956
21302A04956o2113m8470j4835Q1032j16648l1315J13656k3563j492m9370L0113
$$ 104956 42843 -5627 -20462 60570 -56078 -87393 26263 2700 1208 -48162 -18049
21291a8049O932L5718p7584O9517P3215j06176J47707J7773n4962N8143o5602
$$ -18049 -11117 24601 -52983 16534 89749 -16427 131280 149053 94091 152234 86632
21280H6632o7237k58231N9910J49427l7705l8697K2154j06511J90600Q8492o4464
$$ 86632 19395 -238836 -178926 -29499 -67204 -105901 -83747 -190258 342 88834 24370
21269B4370j13981l7798K02020K92277J9970k21754m4216k3535J24587J95675
$$ 24370 -89611 -127409 74611 366888 386858 165104 120888 97353 221940 417615
21259D17615J66369k33235j07081J08477q70j98605k1493M2687K24886m3949l45404
$$ 417615 583984 350749 243668 352145 351275 152670 131177 173864 398750 354801 9397
21248I397k19278L36739J03670j01986N6715J8691j03367r9565k06939J19969
$$ 9397 -209881 126858 230528 128542 185257 203948 100581 1016 -205923 -85954
21238h5954j77005N7236j2186N7381j31760P7565K99958O9239n0576j5566J463
$$ -85954 -262959 -205723 -217909 -160528 -292288 -214723 85235 154474 103898 88332 89795
21227H9795L3490N7580j23705q1125Q5119J6738O6954j07961m0016L16354p0063
$$ 89795 123285 180865 57160 -23965 61154 77892 144846 36885 -3131 313223 243160
21216B43160k22761o2541J7894J25003k87850j19795K15913L56737j09244k49311
$$ 243160 20399 -42142 -24248 100755 -187095 -306890 -90977 265760 156516 -92795
21206i2795k4959n316j43302J436J619J03803r9900J15660Q6354N7916Q3096k7175
$$ -92795 -117754 -123070 -266372 -264936 -263317 -159514 -259414 -143754 -57400 516 83612 56437
21194E6437O7175J56038j40166j65897j33724J32795Q0593R8622J47079j05090
$$ 56437 123612 279650 139484 -26413 -160137 -27342 53251 151873 298952 193862
21184A93862L3087m4108k21924o8447J00933m140J77726r7973j36898O933R6777
$$ 193862 226949 182841 -39083 -107530 -6597 -10737 166989 69016 -67882 -60949 35828
21173C5828J1946j09845M2568p7155R4192K26226J58754r6628k0698P0057o8384
$$ 35828 47774 -62071 -19503 -96658 -2466 223760 382514 285886 265188 335245 266861
21162B66861K1464q0657p0436j82772k34859K11071K55632j49340j38198r7365
$$ 266861 288325 207668 137232 -45540 -280399 -69328 186304 36964 -101234 -198599
21152a98599M9656O0476J78823J72764j24697j82677k9174K5951J18127q8382
$$ -198599 -148943 -88467 90356 263120 138423 -44254 -73428 -47477 70650 -17732
21142a7732j70545L9330J3715J0753J58388Q542O4554l3165J0795m5471r4578
$$ -17732 -188277 -148947 -135232 -124479 33909 42451 107005 73840 84635 39164 -55414
21131e5414J00607L2731J00553J894K1519N394o9674J3573O1322n1722r4129n2025
$$ -55414 45193 77924 178477 180371 201890 207284 137610 151183 212505 160783 66654 14629
21119A4629j21828J43956p2116J67267O4531r8394k31426j9911M2168J05835J25713
$$ 14629 -107199 36757 -35359 131908 196439 98045 -133381 -153292 -111124 -5289 120424
21108A20424O9036L7401j58j09011K08699J93934j25973j51915o368l1207r6170
$$ 120424 189460 226861 226703 117692 326391 520325 394352 242437 236069 204862 108692
21097A08692J07976O7611Q3288k2199p9772k589k32801j53116J4370k63195J29993
$$ 108692 216668 284279 367567 345368 265596 263007 30206 -122910 -108540 -371735 -241742
21086b41742L61890J57713O8522j62320k30409N5516L043q3706l7318j23725R0299
$$ -241742 120148 277861 346383 184063 -46346 9170 12213 -71493 -108811 -232536 -142237
21075a42237k8685M5993k647j8074N5936n7593N0092K03505o7456l7840j87500
$$ -142237 -170922 -124929 -127576 -145650 -89714 -147307 -97215 106290 38834 994 -186506
21064a86506J09370M0054L5653j16087J86078K09923j03129j67034L2626L4220
$$ -186506 -77136 -37082 -1429 -117516 68562 278485 175356 8322 40948 75168
21054G5168r4058p0750J50815M0703n4548N9157L3548P9792m9295k6716J39000
$$ 75168 -18890 -89640 61175 101878 47330 106487 140035 219827 170532 143816 282816
21043B82816J16304P9745p023j2155K8310j23409r0190k8537j07796k06212j10412
$$ 282816 399120 478865 471842 459687 487997 364588 274398 245861 138065 -68147 -178559
21032a78559p4293j21294M5340K76340K49434P2087J19532J2741k13778k04165
$$ -178559 -252852 -374146 -328806 -52466 196968 269055 388587 401328 187550 -16615
21022a6615j59143O0770j5759j78034m5759J15028J09165L48996j7707n4101k12360
$$ -16615 -175758 -114988 -130747 -308781 -354540 -239512 -130347 218649 200942 146841 -65519
21011f5519m8667j17063l3089k473k2201J49395J27547K1547J18581k7030j10710
$$ -65519 -114186 -231249 -264338 -266811 -289012 -139617 -12070 9477 128058 101028 -9682
21000i682j8280j0181K0779J96036O4579l1996N5148J9890j46302K4691Q0368
$$ -9682 -27962 -38143 -17364 178672 243251 211255 266403 286293 139991 164682 245050
20989B45050P3240O2297k59534l1913J49453l0613j05857O1137J30376k48531
$$ 245050 318290 380587 121053 89140 238593 207980 102123 163260 293636 45105
20979D5105j39766Q0344N0970R8559k29110n4244K03028M54820L04189r1511j79639
$$ 45105 -94661 -14317 36653 135212 -93898 -148142 54886 509706 813895 722384 542745
20968E42745p8611m8819J77695q1795k11983j37923J3820j39597p3623J47109
$$ 542745 464134 415315 593010 511215 299232 161309 175129 35532 -38091 109018
20958A09018Q345N8851O8300j18182k30697j80047L8547K25709O8792J73450l4575
$$ 109018 117363 176214 244514 126332 -104365 -284412 -245865 -20156 48636 222086 187511
20947A87511O5105K10573j47665n5047k3359j49086M7393J47148J38514n8665
$$ 187511 252616 463189 315524 260477 237118 88032 135425 282573 421087 362422
20937C62422N4673J39291l5318j86467R3273N508j95718j59638q7949P8577r1987
$$ 362422 417095 556386 521068 334601 427874 433382 237664 78026 -9923 68654 -23333
20926b3333j58783J15215K1284J29176R5203J20414q1043j56565n6373l4771N9340
$$ -23333 -182116 -66901 -45617 83559 178762 299176 218133 61568 5195 -29576 29764
20915B9764J90048n5198j03530O9975J26593j30110P7649N6049r302k1424K06261
$$ 29764 219812 164614 61084 131059 257652 127542 205191 261240 251938 230514 436775
20904D36775M7067q3982P8714R23P8536R6617K12357J12510J23483K52762K51258
$$ 436775 483842 399860 478574 479497 558033 654650 867007 979517 1103000 1355762 1607020
20893A607020q5042n50121m54325q3494j88207l9436J12694k3276n283k2422o0995
$$ 1607020 1521978 971857 517532 434038 245831 206395 319089 295813 290530 268108 207113
20882B07113L3646J53522q9579q5627j8339k8768j1978l6004j83107R8057L56802
$$ 207113 240759 394281 304702 219075 200736 171968 159990 123986 -59121 38936 395738
20871C95738K75387N6611r6390k07679r1604J74590J04930K09244M19829K52611
$$ 395738 671125 727736 631346 423667 332063 506653 611583 820827 1240656 1493267
20861A493267K03385j40370j76254l60331m57709k07092J45649k9759j75165j88884
$$ 1493267 1696652 1556282 1380028 1019697 561988 354896 500545 470786 295621 106737
20851A06737k49118K61406N2999j7300q8626n4054J32336O1305j1289k0291l85337
$$ 106737 -142381 119025 172024 154724 66098 12044 144380 205685 194396 174105 -211232
20840b11232Q089l7071r0929R0111L18145J37660L9511N2101j02243K8064n659
$$ -211232 -203143 -240214 -331143 -241032 77113 214773 254284 306385 204142 232206 226547
20829B26547J0344J38835O7108j46450l33122p9507J75548R8731Q9022o2122k4082
$$ 226547 236891 375726 442834 296384 -36738 -116245 59303 158034 247056 184934 160852
20818A60852n365p7890j78677M1396P7318n4581M7655K9285L4953K15273j59340
$$ 160852 155487 77597 -101080 -59684 17634 -36947 10708 39993 74946 290219 130879
20807A30879N7005N0755m631o892O327J57036J6808L7215k33724j15683J17170
$$ 130879 187884 238639 234008 227116 233443 390479 407287 444502 210778 95095 212265
20796B12265K1022k38325j78070o4749K16460q8689J00196P6758k58658N9054
$$ 212265 233287 -5038 -183108 -247857 -31397 -120086 -19890 56868 -201790 -142736
20786a42736L161Q6310l284j14734n0640L41057L232l7087r0321p1971J2383J47006
$$ -142736 -139575 -53265 -56549 -171283 -221923 119134 122366 85279 -5042 -77013 -64630 82376
20774H2376L15514K48147Q0021k31449r1706p9436Q2042j68743j35372K7342J20575
$$ 82376 397890 646037 726058 494609 402903 323467 405509 236766 101394 128736 249311
20763B49311K01228M7722j7860k71004l9448J69445m596k56041P3130J31863Q1827
$$ 249311 450539 498261 480401 209397 169949 339394 334798 78757 151887 283750 365577
20752C65577j8155N8605r0048m0633j91308N8902K46686N2926J0444R6774j89696
$$ 365577 347422 406027 315979 275346 84038 142940 389626 442552 452996 549770 360074
20741C60074K3678J00076P1626j29781J4034o383M5740J934p8286o2438j27861
$$ 360074 383752 483828 555454 425673 439707 433324 479064 480998 402712 340274 212413
20730B12413L1014J03927o3419p1103j39394n8375K2941l9k2913n9706k312j9199
$$ 212413 243427 347354 283935 212832 73438 15063 38004 37965 15052 -44654 -46966 -66165
20718f6165L09208O901Q6231J0592K0471M0171J83108K32231J03010J07190l57145
$$ -66165 243043 249944 336175 346767 367238 407409 590517 822748 925758 1032948 675803
20707F75803l18796P6031o7582j06054k42620j74682J55026J87753O8187K0741
$$ 675803 357007 433038 365456 259402 16782 -157900 -2874 184879 253066 273807
20697B73807Q907j12719R5856J19600o0567j21071J7045r6344O6221J18208k03500
$$ 273807 282714 169995 265851 385451 324884 203813 220858 124514 190735 308943 105443
20686A05443k03053j8907K90459o8856n2284l6447N6924N4905j70292N2900J16979
$$ 105443 -97610 -116517 173942 105086 52802 16355 73279 128184 -42108 10792 127771
20675A27771Q2624O8808n9111L8939j74109j44545K3365N8644J18030R7866P3627
$$ 127771 210395 279203 220092 259031 84922 -59623 -36258 22386 140416 238282 311909
20664C11909L2012l4795m1078o2013J20289n061j77750Q8638k2920J68231J58621
$$ 311909 343921 309126 268048 206035 326324 321263 143513 232151 209231 377462 536083
20653E36083j61285j36927O9359J6675k28750j13335N088j34866k762J40134Q6280
$$ 536083 374798 237871 307230 323905 95155 -18180 -13092 -147958 -150720 -10586 75694
20642G5694k86269j23545l5483K46985M82840J09443J48359j09328j41915n7167
$$ 75694 -210575 -334120 -369603 -122618 360222 469665 618024 508696 366781 309614
20632C09614j9480o5698j22706R6183K69295k7865O5084L7999o2826L5810l2425
$$ 309614 290134 224436 101730 197913 467208 439343 504427 542426 479600 515410 482985
20621D82985l5750j63634R7699L332j79335o2620k24548j97175N9273K81117J55884
$$ 482985 447235 283601 381300 384632 205297 142677 -81871 -279046 -219773 61344 217228
20610B17228q6739k3880J39146o5920j04533Q2333K44329M3925r2702J02014J66939
$$ 217228 130489 106609 245755 179835 75302 157635 401964 445889 353187 455201 622140
20599F22140k2215k58705J1627R4329J79205r0870j77684r0539P3841j94463j61055
$$ 622140 599925 341220 352847 447176 626381 535511 357827 267288 341129 146666 -14389
20588a4389K02340j7702j81251j20953l4252O4617P3604k451J31521P1304K54413
$$ -14389 187951 170249 -11002 -131955 -166207 -101590 -27986 -30437 101084 172388 426801
20577D26801J24988j13753k34857J6366j8427J8792J06579J00826J51639K6294
$$ 426801 551789 438036 203179 219545 201118 219910 326489 427315 578954 605248
20567F05248j45647j06571J3462j06717j0336n7689L9388j84402j18540p9616
$$ 605248 459601 353030 366492 259775 249439 191750 231138 46736 -71804 -151420
20557a51420N5720J13541r656p3376J36281O3961l981m3401m6485j34657p1727
$$ -151420 -95700 17841 8185 -65191 71090 135051 131070 87669 41184 -93473 -165200
20546a65200Q7491J28033J98599J16265o8960j97594R7891O1052J71932J36951
$$ -165200 -77709 50324 248923 365188 296228 98634 196525 257577 429509 566460
20536E66460j13601j90245m0535P5871j33595R235O5094j38877N1117j72208k01815
$$ 566460 452859 262614 222079 297950 164355 173590 238684 99807 150924 -21284 -223099
20525b23099M2878L42124Q4193o6705l0901j01146L3995o3962j91484L7797J01406
$$ -223099 -180221 161903 246096 179391 148490 47344 81339 17377 -174107 -136310 -34904
20514c4904K4745J90567J03513N8496j45884k10282j29163p4254J04568J35583
$$ -34904 -10159 180408 283921 342417 196533 -13749 -142912 -217166 -112598 22985
20504B2985K85778J07982n1978r5938J16298N5374k85364j60776J69493J16566
$$ 22985 308763 416745 364767 268829 385127 440501 155137 -5639 163854 280420
20494B80420q7307k4673J08791m5392K02218R9066m4943j64558j73822K04326
$$ 280420 193113 168440 277231 231839 434057 533123 488180 323622 149800 354126
20484C54126J05102l0901k03630k36852o9075J33554N6925P3137J22612K54033
$$ 354126 459228 428327 224697 -12155 -81230 52324 109249 182386 304998 559031
20474E59031k0072K9229O4559j1079j32120k62573r0614O9744k7302j07231j03281
$$ 559031 538959 568188 632747 621668 489548 226975 136361 206105 178803 71572 -31709
20463c1709J90922M43174J12157m5336q9621j97791k89902J08170J46825j77024
$$ -31709 159213 602387 714544 669208 579587 381796 91894 200064 346889 169865
20453A69865J02442K21138L63384q841R9698J90539j9345j08170J26334M04107
$$ 169865 272307 493445 856829 847988 947686 1138225 1118880 1010710 1137044 1541151
20443A541151N69151M58776K92976p2207m31707n04152l7110r7382k35191r5410
$$ 1541151 2110302 2569078 2862054 2789847 2358140 1853988 1816878 1719496 1484305 1388895
20433A388895n3037j22396o1182m5059l7334j05099k6817Q7678P3488j16501q3194
$$ 1388895 1335858 1213462 1152280 1107221 1069887 964788 937971 1025649 1099137 982636 899442
20422H99442J74655K76077j8467k95379l17678J41129J87450L1080J06139K44745
$$ 899442 1074097 1350174 1331707 1036328 718650 859779 1047229 1078309 1184448 1429193
20412A429193K69274K37383M84861O08266J82125n4460j84690l21564m75709n44067
$$ 1429193 1698467 1935850 2420711 3028977 3211102 3156642 2971952 2650388 2174679 1630612
20402A630612k09854J72770n2268l6928Q1088l5926j46958j41179j87544n7651
$$ 1630612 1420758 1593528 1541260 1504332 1585420 1549494 1402536 1261357 1073813 1016162
20392A016162p9136n9989o1793J27590J41490j54303P926O8584J44740o1559j00117
$$ 1016162 937026 877037 815244 942834 1084324 930021 937947 1006531 1151271 1089712 989595
20381I89595k1445p740K9945J2897N1832j50746k8816K05306K87957R7132j60590
$$ 989595 968150 960410 990355 1003252 1055084 904338 875522 1080828 1368785 1465917 1305327
20370A305327j14396k47783l2285J86214O2989R3427K53040K73279M12785M07187
$$ 1305327 1190931 943148 910863 1097077 1160066 1253493 1506533 1779812 2192597 2599784
20360B599784L14720K65245q4003k34431k67864k76471l48559p7753L31801K76278
$$ 2599784 2914504 3179749 3095746 2861315 2593451 2316980 1968421 1890668 2222469 2498747
20350B498747L03401K01438N5935l7891l55018k02493M8519N58331N07182N07186
$$ 2498747 2802148 3003586 3059521 3021630 2666612 2464119 2512638 3070969 3578151 4085337
20340D085337M72558O22835N07758L76961K54340L44763J88654J4245R1065M53777
$$ 4085337 4557895 5180730 5688488 6065449 6319789 6664552 6853206 6867451 6958516 7412293
20330G412293P48405Q88960J505036K040353K127543K134573K689454L897899
$$ 7412293 8160698 9049658 10554694 12595047 14722590 16857163 19546617 23444516
20322B3444516N908437R172028J4389022K3536746L9946488O4808970P7260256
$$ 23444516 29352953 38524981 52914003 76450749 116397237 181206207 258466463
20315B58466463M5727682k5551010p4109576o2351173l8854102k3310364j4463551
$$ 258466463 304194145 278643135 204533559 142182386 103328284 80017920 65554369
20308F5554369q874982n700713l656406l011803k933476k284527j524322j261395
$$ 65554369 56679387 50978674 47322268 44310465 41376989 39092462 37568140 36306745
20300C6306745j507675j437933p56256l58559k75384j15644K78728N34621J339692
$$ 36306745 34799070 33361137 32604881 32246322 31970938 31855294 32134022 32668643 34008335
20291C4008335K350036L571555N143211P596238J1872002J9530033L3450287N7392178
$$ 34008335 36358371 39929926 45073137 52669375 64541377 84071410 117521697 174913875
20283A74913875P9708514O4472035J570969o8256769p4687294m9583346k9476951
$$ 174913875 254622389 319094424 320665393 252408624 177721330 128137984 98661033
20276I8661033j8420492j1855073p769240n278295l717105l087275k879649k595547
$$ 98661033 80240541 68385468 60616228 55337933 51620828 48533553 45653904 43058357
20268D3058357k573882k360468k024159j494841r98235j080545j186575j628936
$$ 43058357 40484475 38124007 36099848 34605007 33606772 32526227 31339652 29710716
20260B9710716j570293j027538o14566r0946k03387o28859j035963r91014j112223
$$ 29710716 28140423 27112885 26498319 26407373 26203986 25575127 24539164 23548150 22435927
20251B2435927r61513q87370q48597n20230k13653m13117l46991n08584o94352
$$ 22435927 21474414 20587044 19738447 19218217 19004564 18591447 18244456 17735872 17041520
20242A7041520p19973l50174l1657J67472R0030j70971o32907r35511o41697l42111
$$ 17041520 16321547 15971373 15939716 16107188 16197218 16026247 15393340 14457829 13816132 13474021
20232A3474021l57447j66216l87750n75835l84755k86737l6665j4634r7653k32081
$$ 13474021 13116574 12950358 12562608 11986773 11602018 11315281 11278616 11263982 11166329 10934248
20222A0934248L192P6170k59591k86900l49619k77968k63325j18375l47646m14461
$$ 10934248 10937440 11013610 10754019 10467119 10117500 9839532 9576207 9457832 9110186 8695725
20212H695725j89016l18195J6627L7366k07197m28294k32948k3675j94278J61314
$$ 8695725 8506709 8188514 8205141 8242507 8035310 7607016 7374068 7350393 7156115 7317429
20202G317429O9247J17102k37010k12084o2398j43794k64979k48193l5779K06979
$$ 7317429 7386676 7503778 7266768 7054684 6992286 6848492 6583513 6335320 6299541 6506520
20192F506520K49530K68569M8922k13493n05876k76104N5441K5262r6054l29628
$$ 6506520 6756050 7024619 7073541 6860048 6354172 6078068 6133509 6158771 6062717 5733089
20182E733089m29655L1956j23615o1977J46985J60499J9640J68076k13252n69955
$$ 5733089 5303434 5335390 5211775 5149798 5296783 5457282 5476922 5644998 5431746 4861791
20172D861791j84155j16196j57784J791Q601l15893M1767R5444l48717j26476
$$ 4861791 4677636 4561440 4403656 4405447 4414048 4098155 4139922 4235366 3886649 3760173
20162C760173J03739m5624j72346J74399M40201L23007j92991k34881J1327j87966
$$ 3760173 3863912 3818288 3645942 3820341 4260542 4583549 4390558 4155677 4167004 3979038
20152C979038j42809j4361L6034k72710k40655K2422K2970o9711l02505r7969
$$ 3979038 3836229 3821868 3857902 3585192 3344537 3366959 3389929 3320218 3017713 2919744
20142B919744P0868l3008m1704o1836k90813k29217l3654J00437J18722j25598
$$ 2919744 2990612 2957604 2915900 2854064 2563251 2334034 2300380 2400817 2519539 2393941
20132B393941j5319j14728O987j01258j06972J53567J9848l6387j31868j24728
$$ 2393941 2378622 2263894 2270881 2169623 2062651 2216218 2236066 2199679 2067811 1943083
20122A943083K1477m9378r5496N0726K7084k7214K4676J95343r8975K3698J41917
$$ 1943083 1964560 1915182 1819686 1870412 1897496 1870282 1894958 2090301 1991326 2015024 2156941
20111B156941K1205k59334k67708j08184k31525J12388J95443n5746l00337J1938
$$ 2156941 2178146 1918812 1651104 1542920 1311395 1423783 1619226 1563480 1263143 1275081
20101A275081J40121j55875R9348J21555N8607O189N0947q0294j28561j70066
$$ 1275081 1415202 1259327 1358675 1480230 1538837 1545026 1595973 1515679 1387118 1217052
20091A217052J9182K22707K08727p0879m7624J05551N0345j49732r4773J42951
$$ 1217052 1236234 1458941 1667668 1596789 1549165 1654716 1705061 1555329 1460556 1603507
20081A603507R5628p3157o337j70781j01479K8466K51563L0391j97360k18679
$$ 1603507 1699135 1625978 1619641 1448860 1347381 1375847 1627410 1657801 1460441 1241762
20071A241762q3826n1370k15842Q5407M3648J65002L02527j14846l919K4903K7245
$$ 1241762 1157936 1106566 890724 976131 1019779 1184781 1487308 1372462 1368543 1393446 1420691
20060A420691J2838k6021n6444J09701j23204J99216K71297N360J7221j66525
$$ 1420691 1433529 1407508 1351064 1460765 1337561 1536777 1808074 1813434 1830655 1664130
20050A664130j28805n3395j34832j54812m908K0769L598L3260o6387m5190r4812
$$ 1664130 1535325 1481930 1347098 1192286 1187378 1208147 1211745 1245005 1178618 1133428 1038616
20039A038616L0231j13995K7094J50808R1698J2976Q6040q2374L6675O6861K6473
$$ 1038616 1068847 954852 981946 1132754 1224452 1237428 1323468 1241094 1277769 1344630 1371103
20028A371103j35020o4999J17639K4549j95778o2466N0288j57026q2345K5280
$$ 1371103 1236083 1171084 1288723 1313272 1117494 1055028 1105316 948290 865945 891225
20018H91225j35678r3975n8146j41489N9012J44252M6155N6370J03844L3296j3866
$$ 891225 755547 661572 603426 461937 520949 665201 711356 767726 871570 904866 891000
20007H91000n66j03643M5858j05238R5206L1655J25367j35654J39659J94506k55143
$$ 891000 890434 786791 832649 727411 822617 854272 979639 843985 983644 1178150 923007
19996I23007n742K67672N2828j00364q7387Q4843J90870j78826j18871O1727J36868
$$ 923007 917265 1184937 1237765 1137401 1050014 1134857 1325727 1146901 1028030 1089757 1226625
19985A226625K4994l15276j77816j21778K00205k3626J80365j22467M299J76330
$$ 1226625 1251619 936343 758527 636749 836954 813328 993693 871226 875525 1051855
19975A051855m2815N12j93858R232L09975J02M2591l398l6128M9855j0781J99571
$$ 1051855 1009040 1009552 815694 824926 1134901 1135003 1177594 1174196 1138068 1187923 1177142 1376713
19963A376713Q5228q4689q3705j5577j73094j5027J44125K02778r0091k96910
$$ 1376713 1461941 1377252 1293547 1277970 1104876 1089849 1233974 1436752 1346661 1049751
19953A049751n7092J48273j26869o7554J02085n5940K40858R1394O9258J21604
$$ 1049751 992659 1140932 1014063 946509 1048594 992654 1233512 1324906 1394164 1515768
19943A515768j59871j83786j43372k8080O6646J44371j53062j44216J57756J62310
$$ 1515768 1355897 1172111 1028739 1000659 1067305 1211676 1058614 914398 1072154 1234464
19933A234464k66059l17242j43028Q7574L18470K57816K39114J77360L6992o3030
$$ 1234464 968405 651163 508135 595709 914179 1171995 1411109 1588469 1625461 1562431
19923A562431j89894n6734k1027j5210L4317R5250K5832J30093J24352R7406J19664
$$ 1562431 1372537 1315803 1294776 1279566 1313883 1409133 1434965 1565058 1689410 1786816 1906480
19912A906480k660k20043l65398j53822l0199J12343J01347M5783Q0761J76651
$$ 1906480 1903820 1683777 1318379 1164557 1134358 1246701 1348048 1393831 1474592 1651243
19902A651243k22839k44372j89588j19327l1505M6654l5958j61653N8643N0099
$$ 1651243 1428404 1184032 994444 875117 843612 890266 854308 692655 751298 801397
19892H01397o551J66503N2288P229k81452j88968K6736j8067j02635r2770K2742
$$ 801397 794846 961349 1013637 1020866 739414 550446 577182 559115 456480 363710 386452
19881C86452J41285j18725k0043K20377O824j1152J56786m1747j18965j08259
$$ 386452 527737 409012 388969 609346 616170 605018 761804 720057 601092 492833
19871D92833k2455J5109J39364j3174J4133J05810j05125K8434J6915n7704r2666
$$ 492833 470378 485487 624851 611677 625810 731620 626495 654929 671844 614140 521474
19860E21474K70817N02959K31138L41517M35404J94352l21740n30685m23111l00110
$$ 521474 792291 1295250 1526388 1867905 2303309 2497661 2175921 1645236 1222125 922015
19850I22015l01640n6655n1134M9168K29602o9607r35J22189J15894L7646n9956
$$ 922015 620375 563720 512586 561754 791356 721749 720814 843003 958897 996543 936587
19839I36587k89251j18568J8737J74559O0124o3638j80176N5260M7621N5669j57281
$$ 936587 647336 528768 547505 722064 782188 718550 538374 593634 641255 696924 539643
19828E39643J83628R1240M9485K81294L51948L65301L30915j31626l22792l09058
$$ 539643 723271 814511 863996 1145290 1497238 1862539 2193454 2061828 1739036 1429978
19818A429978k08574j70016j02951j2489o215m73710j93758K1849J88312P9407
$$ 1429978 1221404 1051388 948437 935948 929733 456023 262265 284114 472426 551833
19808E51833l8610L8593O6775R3788O4701K49349j28842j52316p2359m2841o8569
$$ 551833 513223 551816 618591 712379 777080 1026429 897587 745271 672912 630071 561502
19797E61502j11806o0554o5976R1494K28157J4753q535L2810J8292n4385o3413
$$ 561502 449696 389142 323166 414660 642817 657570 649035 681845 700137 645752 582339
19786E82339J23047q2584j54835J6958j6154K27063J22737p5890o1686j96559
$$ 582339 705386 622802 467967 484925 468771 695834 818571 742681 680995 484436
19776D84436o7794N4767O2817J57599j23120o4094o5094Q2036j347J6089N960
$$ 484436 416642 471409 534226 691825 568705 504611 439517 521553 520206 536295 542255
19765E42255j5762k5003j16044l3587J34745k60827m9867J60878K05597r3483
$$ 542255 526493 501490 385446 351859 486604 225777 175910 336788 542385 448902
19755D48902j81570r0295L44133J01810J00159k4426k15001j35105J98763q1597
$$ 448902 267332 177037 521170 622980 723139 698713 483712 348607 547370 465773
19745D65773l506J97160M5443J27691m6452p5816O6717j27507k0087J31231J05538
$$ 465773 462267 659427 704870 832561 786109 710293 777010 649503 629416 760647 866185
19734H66185L2786K00921L85345L15482R4717L13293L63289k17987o29013l43739
$$ 866185 898971 1099892 1485237 1800719 1895436 2208729 2572018 2354031 1725018 1381279
19724A381279k05026r961m9687p1773n2319n2358R7431l3769j46853j35265J91840
$$ 1381279 1176253 1166292 1116605 1044832 992513 940155 1037586 1003817 856964 721699 913539
19713I13539J63059M7343J9876o1966j00841o7447L5006l4680p0179O6098k18180
$$ 913539 1076598 1123941 1143817 1081851 981010 913563 948569 913889 843710 909808 691628
19702F91628k64862J19910j21374k6088M90068O54143O75799L18825j50542l33621
$$ 691628 426766 546676 425302 399214 889282 1543425 2219224 2538049 2387507 2053886
19692B053886k29148j10835o0388m8570j86159p7620P1333N0519l52787j5756
$$ 2053886 1824738 1713903 1653515 1604945 1418786 1341166 1412499 1463018 1110231 1094475
19682A094475L08841j6830j21257k11122k80908r3287K7396K07858J88482j082
$$ 1094475 1403316 1386486 1265229 1054107 773199 679912 707308 915166 1103648 1102566
19672A102566j16807J13023O6824q1901L5058J56677O3854n6330k80332M3496
$$ 1102566 985759 1098782 1165606 1083705 1118763 1275440 1339294 1282964 1002632 1046128
19662A046128N2883L3048J25145Q632j4762j9765k7899l6533j09120O083Q8825
$$ 1046128 1099011 1132059 1257204 1265836 1251074 1231309 1203410 1166877 1057757 1063840 1152665
19651A152665p8357k1075P7862O4522o0945J22348J21352J15635j57321k34186
$$ 1152665 1074308 1053233 1131095 1195617 1134672 1257020 1378372 1494007 1336686 1102500
19641A102500J81736J56821j34434o0557M7746Q7593p4210o1927J0066Q7668J8378
$$ 1102500 1284236 1441057 1306623 1246066 1293812 1381405 1307195 1245268 1255334 1343002 1361380
19630A361380K618j06420k5021P4950P0815j9256r6767p6328N9189K02141J15143
$$ 1361380 1363998 1257578 1232557 1307507 1378322 1359066 1262299 1185971 1245160 1447301 1562444
19619A562444k21263M2800L13K65364m8418n15846J50508Q1894J4051P3120O7387
$$ 1562444 1341181 1383981 1384294 1649658 1601240 1085394 1235902 1317796 1331847 1404967 1472354
19608A472354J01091L6387K4273j70917l29833o6249q1879R8886L48372O13j17337
$$ 1472354 1573445 1609832 1634105 1463188 1133355 1067106 985227 1084113 1432485 1433098 1315761
19597A315761j7630N4001J18343L2331K1763L18080L65897L9271l7181J62736
$$ 1315761 1298131 1352132 1470475 1502806 1524569 1842649 2208546 2247817 2210636 2373372
19587B373372j0905O8006O2776j15728k7073K92708K1305K03510J77784J31745
$$ 2373372 2362467 2430473 2493249 2377521 2350448 2643156 2664461 2867971 3045755 3177500
19577C177500j41654K7838m3188n0788j51523j69620p5907L7791M5863J6389K9908
$$ 3177500 3035846 3063684 3020496 2969708 2818185 2648565 2572658 2610449 2656312 2672701 2702609
19566B702609L7045k8799j92912j59289K28330J11165p9178J41640m4326L826
$$ 2702609 2739654 2710855 2517943 2358654 2586984 2698149 2618971 2760611 2716285 2720111
19556B720111K05769l9792J97198J90477K07880o8234j53105j3279L5393J44505
$$ 2720111 2925880 2886088 3083286 3273763 3481643 3413409 3260304 3247025 3282418 3426923
19546C426923K35472j21133K25691J42389o021K9163K411K1512N6949l5054l3672
$$ 3426923 3662395 3541262 3766953 3909342 3903321 3932484 3934895 3956407 4013356 3978302 3944630
19535C944630j3650l1599M9132Q9380o5506L2508J25771J98781L07603J22634
$$ 3944630 3930980 3899381 3948513 4037893 3972387 4004895 4130666 4329447 4637050 4759684
19525D759684J7767j30060l26272k17663o0016J3881K48459j4578J11150N9157
$$ 4759684 4777451 4647391 4321119 4103456 4043440 4057321 4305780 4291202 4402352 4461509
19515D461509L1344J12007j7023N0831P5698L54354N83823J019520J396028O26793
$$ 4461509 4492853 4604860 4587837 4638668 4714366 5068720 5652543 6672063 8068091 8694884
19505H694884n33148r95152n51078m35068k93488P4958K86930M57875M08277L73343
$$ 8694884 8161736 7166584 6615506 6180438 5886950 5961908 6248838 6706713 7114990 7488333
19495G488333j84371k83621M4735M29270O35554M94012P64235J109054J535296
$$ 7488333 7303962 7020341 7065076 7494346 8129900 8623912 9388147 10497201 12032497
19486A2032497K287849L301119L153149J334178j246231k034559j211961k6525
$$ 12032497 14320346 17621465 20774614 22108792 20862561 18828002 17616041 17589516
19478A7589516M62362J344195K078619J619297K41895r4989R61305K650980M552326
$$ 17589516 18051878 19396073 21474692 23093989 23335884 23240895 24202200 26853180 31405506
19469C1405506P204412J1742872J8328376K7249498L9028439M3534097K4941302
$$ 31405506 38609918 50352790 68681166 95930664 134959103 178493200 203434502
19462B03434502j5834287m2232936l4571062j8541501n928356M493060J6933447
$$ 203434502 187600215 145367279 110796217 92254716 86326360 90819420 107752867
19455A07752867L2769452M4913208M0026262J2359603j6837983k9530125k6992629
$$ 107752867 140522319 185435527 225461789 237821392 220983409 191453284 164460655
19448A64460655k4027048k2782869j7065159r506158k295316N172206J0863558
$$ 164460655 140433607 117650738 100585579 91079421 88784105 93956311 104819869
19441A04819869J2150310O849569k130005r016442r344604j186679P627130R197767
$$ 104819869 116970179 123819748 121689743 112673301 103328697 102142018 109769148 118966915
19433A18966915K481540m761148j137320M742105L032235m607711q533084m699566
$$ 118966915 121448455 116687307 115549987 120292092 123324327 118716616 110183532 105483966
19425A05483966L217395J1630812J5273195J1913324P388082J0645683J4137202
$$ 105483966 108701361 120332173 135605368 147518692 154906774 165552457 179689659
19418A79689659Q946125N35438m620769n539968p867907j4969366j6916265r783252
$$ 179689659 188635784 189171222 184550453 179010485 171142578 156173212 139256947 129473695
19410A29473695k007633K92989j156063J662835J1887397K5305899L6718483M3213771
$$ 129473695 127466062 127759051 126602988 128265823 140153220 165459119 202177602 245391373
19402B45391373L4745760K672970m1603005n7756784m1654588k3524137j2271174
$$ 245391373 280137133 282810103 241207098 183450314 141795726 118271589 106000415
19395A06000415p040125n615376n458128l235093r87937j885170n523417p357953
$$ 106000415 98960290 93344914 87886786 84651693 83663756 81778586 76255169 68897216
19387F8897216n850156m234034k779031j583085r41158l23098q11032k290916
$$ 68897216 63047060 58813026 56033995 54450910 53509752 53186654 52375622 50084706
19379E0084706l133370k722265k155175j955789j612609j397902j257989j176676
$$ 50084706 46951336 44229071 42073896 40118107 38505498 37107596 35849607 34672931
19371C4672931q52222r60641p24310o80211o97791n02522j64156L12822Q58268
$$ 34672931 33820709 32860068 32135758 31455547 30757756 30255234 30091078 30403900 31262168
19362C1262168l528j423722j992535j415890j173641j161283r12949p14262m63939
$$ 31262168 31258640 29834918 27842383 26426493 25252852 24091569 23178620 22464358 22000419
19353B2000419l47767l41247k85945k50598k43207J47090K5550l25297m33572
$$ 22000419 21652652 21311405 21025460 20774862 20531655 20678745 20704295 20378998 19945426
19344A9945426m90627n07294m32532l22790m06467l15041m56872n45986m94279
$$ 19945426 19454799 18947505 18514973 18192183 17785716 17470675 17013803 16467817 15973538
19335A5973538m46609l22610j90565j63106m59792k76718j19968k05952k98737
$$ 15973538 15526929 15204319 15013754 14850648 14390856 14114138 13994170 13788218 13489481
19326A3489481k61848j17480k42709j60700k87183m20243l16158j32956j28156
$$ 13489481 13227633 13110153 12867444 12706744 12419561 11999318 11683160 11550204 11422048
19317A1422048O516m3586l72872k98610j69279k83156j61328M1135J695J73794
$$ 11422048 11428564 11384978 11012106 10713496 10544217 10261061 10099733 10140868 10142563 10316357
19307A0316357O0869l13745p6053k56041l67534p5244q5297l874j9386p3132l28666
$$ 10316357 10377226 10063481 9987428 9731387 9363853 9288609 9203312 9199438 9180052 9106920 8778254
19296H778254j07719j23315k43206J88231J01709M4074k549k3493m2265j90473
$$ 8778254 8670535 8547220 8304014 8492245 8593954 8638028 8635479 8611986 8569721 8379248
19286H379248l62327p0571q4141n218J84155L61848N57482M51271k57284o69860
$$ 8379248 8016921 7946350 7862209 7856991 8041146 8402994 8960476 9411747 9154463 8484603
19276H484603n91863n88707m23326J96156N3168J09198m0526j46819j06096j7689
$$ 8484603 7892740 7304033 6880707 7076863 7130031 7239229 7198703 7051884 6945788 6928099
19266F928099k07340p1484j9554j99704j20451P2976j46865k52198k84852k48269
$$ 6928099 6720759 6649275 6629721 6430017 6309566 6382542 6235677 5983479 5698627 5450358
19256E450358Q8370M5641N1591J15039J29492r2557m02852K2115L94315N67856
$$ 5450358 5538728 5584369 5635960 5750999 5880491 5787934 5385082 5407197 5801512 6369368
19246F369368M65034J75096m37176o72206n84648k54122k04257j88399j84172
$$ 6369368 6834402 7009498 6572322 5900116 5315468 5061346 4857089 4668690 4484518
19237D484518j96852m1712j04388j84296k50339Q2303M5443j49439j7434P361
$$ 4484518 4287666 4245954 4141566 3957270 3706931 3789234 3834677 3685238 3667804 3675165
19227C675165j80488j61588o4113j0701J25950k9822j76455p3198P8182j17032
$$ 3675165 3494677 3333089 3268976 3258275 3384225 3354403 3177948 3104750 3182932 3065900
19217C065900K8029J6497j5448j31650p9056j27641j28402q5924q1558j55973
$$ 3065900 3093929 3110426 3094978 2963328 2884272 2756631 2628229 2542305 2460747 2304774
19207B304774j65722J45673L29787J70731m4493j49132p0785K22468o1742k61888
$$ 2304774 2139052 2284725 2614512 2785243 2740750 2591618 2520833 2743301 2681559 2419671
19197B419671k29092m6231o1667J69639J50524L5290j38215l7097j20821N4924
$$ 2419671 2190579 2144348 2082681 2252320 2402844 2438134 2299919 2262822 2142001 2196925
19187B196925o8724j27506J68896K7266j97633L3707J66084m7478j0134q2682
$$ 2196925 2128201 2000695 2169591 2196857 1999224 2032931 2199015 2151537 2141403 2058721
19177B058721k7141k22614j14610J05240J4462j01535p8428K75404J08735k78690
$$ 2058721 2031580 1808966 1694356 1799596 1814058 1712523 1634095 1909499 2018234 1739544
19167A739544p9658K57313R9056k67887R7176J9940j24782j03480r0493J13521
$$ 1739544 1659886 1917199 2016255 1748368 1845544 1865484 1740702 1637222 1546729 1660250
19157A660250P5134J36144J52105K5852J07360o1791k41358k56072k05993J2862
$$ 1660250 1735384 1871528 2023633 2049485 2156845 2095054 1853696 1597624 1391631 1404493
19147A404493j38099Q9717R3447j28891j65970o5506j59327J5456J65783K25183
$$ 1404493 1266394 1356111 1449558 1320667 1154697 1089191 929864 945320 1111103 1336286
19137A336286j0948j0238J30573J61012O9866k19140m5804M4101J79689N9759
$$ 1336286 1325338 1315100 1445673 1606685 1676551 1457411 1411607 1455708 1635397 1695156
19127A695156M161k19452j77221J77925K08052j70262j36969r8971k9137k1883
$$ 1695156 1699317 1479865 1302644 1480569 1688621 1518359 1381390 1282419 1253282 1231399
19117A231399n5840r5220P2866K05005P2764p4435j2951n2731j25907M8493j845
$$ 1231399 1175559 1080339 1153205 1358210 1430974 1356539 1343588 1290857 1164950 1213443 1211598
19106A211598l2151L9589r6339j61059m9515j21375J94779J80969j48936r6197
$$ 1211598 1179447 1219036 1122697 961638 912123 790748 985527 1166496 1017560 921363
19096I21363J10416K55064l8669n7175l8949P8354K07732K53727J60799K68985
$$ 921363 1031779 1286843 1248174 1190999 1152050 1230404 1438136 1691863 1852662 2121647
19086B121647N3153J552o027l5653k88145k60688N416M535K29392L84084K14236
$$ 2121647 2174800 2176352 2170325 2134672 1846527 1585839 1591255 1595790 1825182 2209266 2423502
19075B423502n4528J3764l0542l7657J22058o3264O396j43305l15382k27088j65102
$$ 2423502 2368974 2382738 2352196 2314539 2436597 2373333 2379729 2236424 1921042 1693954 1528852
19064A528852J0977J51697M7658O729j8329k46327N1459K925N8221K3923j9498
$$ 1528852 1539829 1691526 1739184 1745913 1727584 1481257 1532716 1535641 1593862 1617785 1598287
19053A598287j36338j11904K170K4829J0896j73340Q4911J8356L72146J22929
$$ 1598287 1461949 1350045 1352215 1377044 1387940 1214600 1299511 1317867 1690013 1812942
19043A812942n90j41001n8834J79454K30502O2420o2522j59081J4325l5129J62499
$$ 1812942 1812352 1671351 1612517 1791971 2022473 2084893 2022371 1863290 1877615 1842486 2004985
19032B004985K08484P0953J21433k5844j19292O871q0753l09280l20441L14821
$$ 2004985 2213469 2284422 2405855 2380011 2260719 2267590 2186837 1877557 1557116 1871937
19022A871937L25742Q7980j09253j73636k07999j72426m126N5869o6443L390k4191
$$ 1871937 2197679 2285659 2176406 2002770 1794771 1622345 1618219 1674088 1607645 1611035 1586844
19011A586844n5919P4879P5324j38946k9673Q6925N2477n9762r3323m0356k8437
$$ 1586844 1530925 1605804 1681128 1542182 1512509 1599434 1651911 1592149 1498826 1458470 1430033
19000A430033k58611O0390J61874o7773K7861Q8088M9946q8786j71578K97837
$$ 1430033 1171422 1231812 1393686 1325913 1353774 1441862 1491808 1403022 1231444 1529281
18990A529281L87111n5620k46493j34985m1500j58121J7070L9876l8625m2416
$$ 1529281 1916392 1860772 1614279 1479294 1437794 1279673 1296743 1336619 1297994 1255578
18980A255578k8987J38559L35486Q2617j8484J79822r1814r2884O879O7013j3286
$$ 1255578 1226591 1365150 1700636 1783253 1764769 1944591 1852777 1759893 1766772 1833785 1820499
18969A820499J17908j60789k31560j70322l4722p7512n025Q1161J81981J71501
$$ 1820499 1938407 1777618 1546058 1375736 1341014 1263502 1258477 1339638 1521619 1693120
18959A693120J72366j08158k9521j10298J45816l1332r2974O7039K39330L37553
$$ 1693120 1865486 1757328 1727807 1617509 1763325 1731993 1639019 1706058 1945388 2282941
18949B282941J16672J42043J83795k11510J48898K3459l8343l22097M8907m3117
$$ 2282941 2399613 2541656 2725451 2513941 2662839 2686298 2647955 2325858 2374765 2331648
18939B331648j39837l29284R306R0625J77170J78524o9502L2849K5242j07429
$$ 2331648 2191811 1862527 1871833 1962458 2139628 2318152 2248650 2281499 2306741 2199312
18929B199312K7487J71660L1323l21435j00369P7039J44566J7797k9697k20300
$$ 2199312 2226799 2398459 2429782 2108347 2007978 2085017 2229583 2247380 2217683 1997383
18919A997383j30902O5004K9772J28336J46090J24586J00943K37997K32983J67853
$$ 1997383 1866481 1931485 1961257 2089593 2235683 2360269 2461212 2699209 2932192 3100045
18909C100045N4406j33458J82648Q0888j79952k40293r6620m7362j48394P6360
$$ 3100045 3154451 3020993 3203641 3284529 3104577 2864284 2767664 2720302 2571908 2648268
18899B648268Q8245j2637j35059j93165j48052J21571P1231J52921M4142N4592
$$ 2648268 2736513 2723876 2588817 2395652 2247600 2369171 2440402 2593323 2637465 2692057
18889B692057K8895K25519R7256N6779J8163N8478J92273J92437N1751R5825j00761
$$ 2692057 2720952 2946471 3043727 3100506 3118669 3177147 3369420 3561857 3613608 3709433 3608672
18878C608672j64038Q1992j0027m3685j03133l43733q5218N7322j94975p2108
$$ 3608672 3444634 3526626 3516599 3472914 3369781 3026048 2940830 2998152 2803177 2731069
18868B731069q4791J2765j32919J12492r9131J69645L04400K831j52955J35896
$$ 2731069 2646278 2659043 2526124 2638616 2539485 2709130 3013530 3016361 2863406 2999302
18858B999302j40786n4299q1746J62281K19186J17504J30259o71j33506j65824
$$ 2999302 2858516 2804217 2722471 2884752 3103938 3221442 3351701 3351030 3217524 3051700
18848C051700J43364K84116M14670K17295K43834J14640k42498j28958j13090
$$ 3051700 3195064 3479180 3893850 4111145 4354979 4469619 4227121 4098163 3985073
18839C985073k46923j35053M7845J26481J38417K75458K20364N51108J015204
$$ 3985073 3738150 3603097 3650942 3777423 3915840 4191298 4411662 4962770 5977974
18830E977974J448651J523880M50894n29229n87084m95802j32408P21938J168832
$$ 5977974 7426625 8950505 9401399 8872170 8285086 7789284 7656876 8378814 9547646
18821I547646J392809J373085L95707p71695j425336j112560q06948m77801l13054
$$ 9547646 10940455 12313540 12709247 11937552 10512216 9399656 8592708 8114907 7801853
18812G801853J29774N54243N24036o6983p74993q81051p99723l17649j84976j18557
$$ 7801853 7931627 8485870 9009906 8942923 8167930 7286879 6487156 6169507 5984531 5865974
18802E865974l7782k20814L252J294j07936J30633J55769J12670K09589O60943
$$ 5865974 5828192 5607378 5610630 5611924 5503988 5634621 5790390 5903060 6112649 6773592
18792F773592P86780L04506l14062m15397k36472n8137L53539N61340P30200Q61834
$$ 6773592 7560372 7864878 7550816 7135419 6898947 6840810 7194349 7755689 8485889 9347723
18782I347723Q11913R76984J751147K360022K111348M25679j183470j327966r14959
$$ 9347723 10159636 11136620 12887767 15247789 17359137 17784816 16601346 15273380 14358421
18773A4358421n26145j57912O31837J626532K790501K955135K140296K34464q28724
$$ 14358421 13832276 13674364 14306201 15932733 18723234 21678369 23818665 24053129 23224405
18764B3224405n61583J53680J465862K930775M439578O014429Q346859J2427805
$$ 23224405 22662822 22816502 24282364 27213139 31652717 37667146 46014005 58441810
18756E8441810K0034572L5533006O4849987R4129736P7993506J107538q4244085
$$ 58441810 78476382 114009388 178859375 272989111 350982617 352090155 267846070
18749B67846070q7128696n3217462k9293017j6104161r315161n816001m593086
$$ 267846070 180717374 127499912 98206895 82102734 72787573 66971572 62378486
18742F2378486m405416m166216l772003l363238k681920k016665j464879p39538
$$ 62378486 57973070 53806854 50034851 46671613 43989693 41973028 40508149 39768611
18734C9768611m34436o58970p58290l31076M90555J154735J886975L370528M734439
$$ 39768611 39334175 38675205 37916915 37585839 38076394 39231129 41118104 44488632 49223071
18725D9223071O585270R418776J4984354K6148918M8644636Q0710783Q6901854
$$ 49223071 55808341 65227117 80211471 106360389 155005025 235715808 322617662
18718C22617662L4500212n6199168r2196675o3971031l6405617k1098699j2911423
$$ 322617662 357117874 300918706 208722031 144751000 108345383 87246684 74335261
18711G4335261q152890m942421l240957k540543k058609j795658j724912o88761
$$ 74335261 66182371 61239950 57998993 55458450 53399841 51604183 49879271 49190510
18703D9190510J80082Q007j936125l540309l351316k723838j994508j321806m04622
$$ 49190510 49370592 49378599 47442474 43902165 40550849 37827011 35832503 34510697 34106075
18694C4106075O50867J445631J199171J97787j502049k589488k194217j710695
$$ 34106075 34756942 36202573 37401744 37599531 36097482 33507994 31313777 29603082
18686B9603082j354947j079780p89860p71733j023663r65428o70617l12200l61233
$$ 29603082 28248135 27168355 26378495 25606762 24583099 23617671 22947054 22634854 22273621
18677B2273621l83266j62130k78640l35644l75274m06202m49441l87227l14802
$$ 22273621 21890355 21728225 21449585 21113941 20738667 20332465 19883024 19495797 19180995
18668A9180995n38692n88395m79632k56686l19005r9584j95216p5588q0932l45978
$$ 19180995 18642303 18053908 17574276 17317590 16998585 16899001 16703785 16628197 16547265 16201287
18658A6201287j64777k68915l81667j78084k77770j13275j19915l992n7421p7262
$$ 16201287 16036510 15767595 15385928 15207844 14930074 14816799 14696884 14692892 14635471 14558209
18648A4558209k63344j76887n8504K95622L95033M86191O13510O00280k09129
$$ 14558209 14294865 14117978 14059474 14355096 14750129 15236320 15849830 16450110 16240981
18639A6240981n94135k58759K42047M67039P61631J488045K150129K430583J403488
$$ 16240981 15646846 15388087 15630134 16097173 16858804 18346849 20496978 22927561 24331049
18630B4331049q46519k109490j636064n56486J79113n9541P5241P81957K066632
$$ 24331049 23484530 21375040 19738976 19182490 19361603 19302062 19377303 20159260 22225892
18621B2225892K753103J649534q62581k975996k857905j526575r24547l69959
$$ 22225892 24978995 26628529 25765948 22789952 19932047 18405472 17480925 17110966
18613A7110966K933L08822K67398j1864m90119n93646m62436q6613J9366L51045
$$ 17110966 17113899 17422721 17690119 17678255 17188136 16594490 16132054 16045441 16064807 16415852
18603A6415852L94072N38380R59978R00549Q20635R61677Q04909J622373L158358
$$ 16415852 16809924 17348304 18308282 19208831 20029466 20991143 21796052 23418425 26576783
18594B6576783N000539P648771J0351093Q495327J165144o276620o686578l465765
$$ 26576783 31577322 39226093 49577186 58072513 59237657 52961037 46274459 42808694
18586D2808694o00312K336067N988521J0378940J1957445Q811820M496831O171708
$$ 42808694 42208382 44544449 50532970 60911910 72869355 81681175 86178006 92349714
18578I2349714J0148914O236824n847456j3718096j1236994o589770l978299j954809
$$ 92349714 102498628 108735452 102887996 89169900 77932906 71343136 67364837 65410028
18570F5410028K59866K575580N252989R418958J5187545K3951905L8088121N4110256
$$ 65410028 65669894 68245474 73498463 82917421 98104966 122056871 160144992 214255248
18562B14255248N8760152M8297521L4986238L3945567K0816735j7628484n0138694
$$ 214255248 273015400 321312921 356299159 390244726 411061461 393432977 343294283
18555C43294283n7151007l5618533j884634L2198374N7852313N7340622K0911664
$$ 343294283 286143276 250524743 248640109 280838483 338690796 396031418 416943082
18548D16943082k6360463m8107724l7292899j5857724k923177o209795j8591865
$$ 416943082 390582619 342474895 305181996 289324272 286401095 280191300 261599435
18541B61599435k5971675k8323519k6928843j7776692q660458q27351P928124
$$ 261599435 235627760 207304241 180375398 162598706 153938248 153110897 161039021
18534A61039021J5803225J4945964J552084j5784612j8564271j0706793l313794
$$ 161039021 176842246 191788210 193340294 177555682 158991411 148284618 144970824
18527A44970824L17933K040625N089592J1912428J4356748P151329l457193m078895
$$ 144970824 145288757 147329382 152418974 164331402 178688150 185839479 182382286 178303391
18519A78303391J805401M839627N477404Q683146J0408156J0902229J6601795
$$ 178303391 180108792 184948419 190425823 199108969 209517125 220419354 237021149
18512B37021149J7222970N088884n513441n504452j1772655k5504743k9681511
$$ 237021149 254244119 259333003 253819562 248315110 236542455 211037712 181356201
18505A81356201k5228947k2423434j7824767j2008975q360966n958506l913989
$$ 181356201 156127254 133703820 115879053 103870078 95509112 89550606 85636617
18498H5636617k613667j502429N8159J157559J471222J758136L345553O359585
$$ 85636617 83022950 81520521 81578680 82736239 84207461 85965597 89311150 95670735
18490I5670735N992126R0312p297075q839854o165472l683767j058049K559001
$$ 95670735 101662861 101753173 94456098 85616244 79450772 75767005 74708956 77267957
18482G7267957O863686J0878242J0247522K232913r428109j2166436p151031m496367
$$ 77267957 84131643 95009885 105257407 107490320 98062211 85895775 78744744 74248377
18474G4248377m780516m660845l364060k029182o76106M90316J386186K110945
$$ 74248377 69467861 64807016 61442956 59413774 58737668 59227984 60614170 62725115
18466F2725115J744756J12096k470093l190043k331364k303099j919315l53577
$$ 62725115 64469871 64581967 62111874 58921831 56590467 54287368 52368053 52014476
18458E2014476K200739L853335M088450L342135J137237k871079p180432p004711
$$ 52014476 54215215 58068550 62157000 65499135 66636372 63765293 56584861 49580150
18450D9580150m607511k912389j880085j013518k27806k11880q45014j416496
$$ 49580150 44972639 42060250 40180165 39166647 38938841 38726961 37881947 36465451
18442C6465451j396173q39229n11112k0803N77600J214875J325329P93896n6503
$$ 36465451 35069278 34230049 33718937 33698134 34275734 35490609 36815938 37609834 37553331
18433C7553331q14787j185926p39220j033627j021000k49274O8240k8484p66570
$$ 37553331 36738544 35552618 34813398 33779771 32758771 32509497 32577737 32549253 31782683
18424C1782683j744187j746070p77218m17454q5823P53900J043466O15506P1376
$$ 31782683 30038496 28292426 27515208 27097754 27011931 27765831 28809297 29424803 29496179
18415B9496179m84295r48983j006341r14921j536536k066025j383262r10319l74049
$$ 29496179 29011884 28062901 27056560 26141639 24605103 22539078 21155816 20245497 19871448
18406A9871448j10204k26791M7177n7154j63698j87336o35753q73025n35666o00753
$$ 19871448 19761244 19534453 19581630 19524476 19360778 19173442 18537689 17664664 17128998 16528245
18396A6528245n94505j43869L17787N35850O61902K07002o08468q92255o10095
$$ 16528245 15933740 15789871 16107658 16643508 17305410 17512412 16903944 16011689 15401594
18387A5401594n84286m00846l53846K3106J21809K83143M2875q0765o54894p45715
$$ 15401594 14817308 14416462 14062616 14085722 14207531 14490674 14533549 14452784 13797890 13052175
18377A3052175l93007p6390J38L00141O04490R6487o84972r54019o24199n68594
$$ 13052175 12659168 12582778 12582916 12883057 13487547 13584034 12899062 11945043 11320844 10752250
18367A0752250l53684j96653R6859K29142K19706J06673k90877m27592m28243
$$ 10752250 10398566 10201913 10298772 10527914 10747620 10854293 10563416 10135824 9707581
18358I707581m37486o54878l53543n1213J62822j51126p7182o8791j76076l9233
$$ 9707581 9270095 8615217 8261674 8210461 8373283 8222157 8144975 8076184 7900108 7860875
18348G860875M2514k22866j67679k72763k19441K1412j90942l91170k37279n200
$$ 7860875 7903389 7680523 7512844 7240081 7020640 7042052 6851110 6459940 6222661 6217461
18338F217461p3595j63539o3611N364K7716j95593k39860j84898J5993j01062
$$ 6217461 6143866 5980327 5916716 5922080 5949796 5754203 5514343 5329445 5345438 5244376
18328E244376j10021m7257j85342k30246j94478k3579j10997j36226J01068J40058
$$ 5244376 5134355 5087098 4901756 4671510 4477032 4453453 4342456 4206230 4307298 4447356
18318D447356k07806l1613P7366J43330L9019Q8897k7346K2331k9985k4631j43841
$$ 4447356 4239550 4207937 4285303 4428633 4467652 4556549 4529203 4551534 4521549 4496918 4353077
18307D353077r1481j18975k05360k08548n9009j13558k0479m0593k9680M7253
$$ 4353077 4261596 4142621 3937261 3728713 3669704 3556146 3535667 3495074 3465394 3512647
18297C512647J20529J79802K04583p0474o5688K50653M42448P5358o5367k74456
$$ 3512647 3633176 3812978 4017561 3947087 3881399 4132052 4574500 4649858 4584491 4310035
18287D310035j31084k77812k26163j76109j05600o135R2700J04498L4761j80560
$$ 4310035 4178951 3901139 3674976 3498867 3393267 3387132 3479832 3584330 3619091 3438531
18277C438531l3681l9275j47875k25472R3034K79740J61658j47924j10119p6982
$$ 3438531 3404850 3365575 3217700 2992228 3085262 3365002 3526660 3378736 3268617 3191635
18267C191635q5850R3193j24046j37793N4578J18966K32025K35445M41212L61205
$$ 3191635 3105785 3198978 3074932 2937139 2991717 3110683 3342708 3578153 4019365 4380570
18257D380570J67708j14499j39364k71348o7680L50485J73774j3608l63046k03006
$$ 4380570 4548278 4433779 4294415 4023067 3955387 4305872 4479646 4466038 4102992 3899986
18247C899986K83233J54277j80948M7451K26510J74475J30512K10140M21158K30128
$$ 3899986 4183219 4337496 4156548 4203999 4430509 4604984 4735496 4945636 5366794 5596922
18237E596922K54189K42187N59677M32519K25990K79948M16936M53829M11180
$$ 5596922 5851111 6093298 6652975 7085494 7311484 7591432 8008368 8462197 8873377
18228H873377N13599Q17198P49029Q63576N79002O36762O24515J26134j25451
$$ 8873377 9386976 10204174 10953203 11816779 12395781 13032543 13657058 13783192 13657741
18219A3657741k38229K1936K58998J49259m60857o70834r54264o37374k33383
$$ 13657741 13419512 13441448 13700446 13849705 13388848 12718014 11763750 11126376 10892993
18210A0892993j970j46413j04134n12971k89758l00987o91450n22371n39392m71124
$$ 10892993 10891023 10744610 10640476 10127505 9837747 9536760 8845310 8322939 7783547 7312423
18200G312423m55856l42381p3239o8645l245J7127Q5541R48j98965j43001j69922
$$ 7312423 6856567 6514186 6440947 6372302 6369057 6386184 6471725 6472673 6273708 6130707 5960785
18189E960785k51217j8615O350K36337M03494L51607m3728m25880n29194m04147
$$ 5960785 5709568 5690953 5697303 5933640 6337134 6688741 6645013 6219133 5689939 5285792
18179E285792k5400K69318K45331N1182j19336l33096l34192l44919k62868j68716
$$ 5285792 5260392 5529710 5775041 5826223 5706887 5373791 5039599 4694680 4431812 4263096
18169D263096k38221j6898J96068J28177l6041k3134j22664p8490n8915M2576
$$ 4263096 4024875 4007977 4204045 4332222 4296181 4273047 4150383 4071893 4012978 4055554
18159D055554J47599l3714M5828j14280j40065k45734j93262J49599K76163L3861
$$ 4055554 4203153 4169439 4215267 4100987 3960922 3715188 3521926 3671525 3947688 3981549
18149C981549q7090n7005O158l21225j12283J61416p347n1046J8888J29431L8027
$$ 3981549 3894459 3837454 3843612 3522387 3410104 3571520 3564173 3513127 3532015 3661446 3699473
18138C699473r0223J3197J74840J96846M33138K77925J62876j7737L02805L00129
$$ 3699473 3609250 3622447 3797287 3994133 4427271 4705196 4868072 4850335 5153140 5453269
18128E453269J32505j36690K13606N62512N33135O74110O27185J082239J355974
$$ 5453269 5585774 5449084 5662690 6225202 6758337 7432447 8059632 9141871 10497845
18119A0497845J275911J772190K248972L288692N098793P930278J3067401K2384257
$$ 10497845 11773756 13545946 15794918 19083610 24182403 32112681 45180082 67564339
18111F7564339M3012401P4476673P8571694K6745576o3111218q3757612n0370036
$$ 67564339 110576740 185053413 263625107 290370683 227259465 143501853 93131817
18104I3131817k6740563j4456937q655826n404141l614782k968430k382687j926648
$$ 93131817 66391254 51934317 43278491 37874350 34259568 31291138 28908451 26981803
18096B6981803j358841j408086j455618j074485j102131j367996j292203j016626
$$ 26981803 25622962 24214876 22759258 21684773 20582642 19214646 17922443 16905817
18088A6905817p90122l92672n68048r33348k76737j33221l13799m76740m21214
$$ 16905817 16115695 15723023 15154975 14221627 13944890 13811669 13497870 13021130 12599916
18079A2599916l66659n10178o59173k94875j63511k75470l91506k95416k96794
$$ 12599916 12233257 11723079 11063906 10769031 10605520 10330050 9938544 9643128 9346334
18070I346334k27099j47566k5031j13342m5623o3740j27719j08068j04416j26680
$$ 9346334 9119235 8971669 8946638 8833296 8787673 8723933 8596214 8488146 8383730 8257050
18060H257050k20090j33452O8832L7812l73994k82452j00167j01300j69384k33336
$$ 8257050 8036960 7903508 7972340 8010152 7636158 7353706 7253539 7152239 6982855 6749519
18050F749519o0006Q0020k21679l99371l28780m84743j82145j35461k12572m0583
$$ 6749519 6689513 6769533 6547854 6148483 5819703 5334960 5152815 5017354 4804782 4764199
18040D764199j16374j31258j08863p7342m6264j06177M0556O3102r4443j93057
$$ 4764199 4647825 4516567 4407704 4330362 4284098 4177921 4218477 4281579 4187136 3994079
18030C994079j95674P6632J99382J07601q459r2126O1647J69968j85488k91253
$$ 3994079 3798405 3875037 4074419 4182020 4173561 4081435 4143082 4313050 4127562 3836309
18020C836309j67308J37097Q9248J5038j77627k7448K23714J38382j60090N6505
$$ 3836309 3669001 3806098 3895346 3910384 3732757 3705309 3929023 4067405 3907315 3963820
18010C963820J54690J41942j79947k23619m07513l90486j11484p9259m8446n2776
$$ 3963820 4118510 4260452 4080505 3856886 3449373 3058887 2947403 2868144 2819698 2766922
18000B766922P3902j358Q358J56161N9189j51796o2234j52571k28198j07201j3899
$$ 2766922 2840824 2839466 2847824 3003985 3063174 2911378 2849144 2696573 2468375 2361174 2347275
17989B347275j27398j82159N1555K41028M24667K91274n1362j51967k53006j39919
$$ 2347275 2219877 2037718 2089273 2330301 2754968 3046242 2994880 2842913 2589907 2449988
17979B449988R4644r9995l8215j37709k41942j99202M1900R5473j46080j27066
$$ 2449988 2544632 2444637 2406422 2268713 2026771 1827569 1869469 1964942 1818862 1691796
17969A691796Q9232R9785j64724j62936Q441j19678q5092Q1357K0675l089J11957
$$ 1691796 1781028 1880813 1716089 1553153 1561594 1441916 1356824 1438181 1458856 1455767 1567724
17958A567724Q2634j74193K2906K94774N7713l04372j61254N9454j73381k60166
$$ 1567724 1650358 1476165 1499071 1793845 1851558 1547186 1385932 1445386 1272005 1011839
17948A011839r7066O4594j159j96350M8665L8762M0209j84619k73420m4179m5005
$$ 1011839 914773 979367 978208 781858 830523 869285 909494 724875 451455 407276 362271
17937C62271j27637J5900J70392j31077J22345n5594R0114L7800l1812K351R9576
$$ 362271 234634 250534 420926 289849 412194 356600 446714 484514 452702 455053 554629
17926E54629j61467k71921p269P209O7292j50174L10448J20539l585N6707r0533
$$ 554629 393162 121241 113972 121181 188473 38299 348747 469286 465701 522408 431875
17915D31875j25997J18101R5963j0745j46626M9356J36076o0526j47890l6875
$$ 431875 305878 423979 519942 509197 362571 411927 548003 487477 339587 302712
17905C02712J6863j17682J23455J4228j10116J8463J54613j1074O5995J9080k31910
$$ 302712 319575 201893 325348 339576 229460 247923 402536 391462 457457 476537 244627
17894B44627j7977p8645p5098N7267J47937J49227N4852p6422J13223P9573j65461
$$ 244627 226650 148005 72907 130174 278111 427338 482190 405768 518991 598564 433103
17883D33103k42561j35410P6843K72101r651k4694q0961j68531m266J75617j4638
$$ 433103 190542 55132 131975 404076 394425 369731 288770 120239 115973 291590 276952
17872B76952k1786J32364K96709j5074k5156L6969m9490k35541Q3346j9910M8681
$$ 276952 255166 387530 684239 669165 644009 680978 631488 395947 479293 459383 508064
17861E08064k13438J54113k9897Q2669k14872k66080J05380J06924q6607K6029
$$ 508064 294626 448739 418842 501511 286639 20559 125939 232863 146256 172285
17851A72285K0247K929n9599k6072j002j22475k26802j01530j79137k7504L26896
$$ 172285 192532 195461 135862 109790 108788 -13687 -240489 -342019 -521156 -548660 -221764
17840b21764J21165R5570r7626k3820J13652r7873J02738J2280k0708J5004J40285
$$ -221764 -100599 -5029 -102655 -126475 -12823 -110696 -7958 4322 -16386 -1382 138903
17829A38903j29105j10994j09700l8366j8837m3819J16781p3546J20100j48473
$$ 138903 9798 -101196 -210896 -249262 -268099 -311918 -195137 -268683 -148583 -297056
17819b97056K6294Q5364J61696j03997L2526R7489m2253j97289J68234J82053
$$ -297056 -270762 -185398 -23702 -127699 -95173 2316 -39937 -237226 -68992 113061
17809A13061j63549J56013N9224K8963L1493j07844o1892J14759L86238L90294
$$ 113061 -50488 105525 164749 193712 225205 117361 55469 170228 556466 946760
17799I46760L20653M69513J44486m09276m32952l86734l42167o0536p5720j49750
$$ 946760 1267413 1736926 1881412 1472136 1039184 652450 310283 249747 174027 24277
17789B4277K7699R0968K8386m4207j59164j0173J58445M5787K7308l3206M703
$$ 24277 51976 142944 171330 127123 -32041 -42214 116231 162018 189326 156120 160823
17778A60823o0648j4382J09027Q291P9172J58501J90511J72428l34138k3698L04245
$$ 160823 100175 85793 194820 203111 282283 440784 631295 803723 469585 445887 750132
17767G50132K73470K62554M87576L66381j95339o30280n91314k53483k10635k0212
$$ 750132 1023602 1286156 1773732 2140113 1944774 1314494 723180 469697 259062 238850
17757B38850j06614K2272Q8711k18181J5510K26553j26969j12141j4189J91588
$$ 238850 132236 154508 243219 25038 40548 267101 140132 27991 13802 205390
17747B05390j92465k6656R1624L8006o4406o4231p4868M7526l6470p2340J49069
$$ 205390 12925 -13731 77893 115899 51493 -12738 -87606 -40080 -76550 -148890 179
17736A79K51491Q7523j04126j82007k28539l1206p700M7659J17825L129j0433
$$ 179 251670 339193 235067 53060 -175479 -206685 -214385 -166726 -48901 -45772 -56205
17725e6205o6784j7792k7586O6294M2936k197j55537l29858O7921M2490l2304
$$ -56205 -122989 -140781 -168367 -102073 -59137 -61334 -216871 -546729 -478808 -436318 -468622
17714d68622J6373K46995J56756P4158j11195j64768J9511l3324P6632R1578l8354
$$ -468622 -452249 -205254 -48498 25660 -85535 -250303 -230792 -264116 -187484 -95906 -134260
17703a34260J50699J62897o8332j50763j1418J21121J18439j85837j75604K62214
$$ -134260 16439 179336 111004 -39759 -51177 69944 188383 2546 -173058 89156
17693H9156J23659j73576n9911k8675j01042k73898K2439J01794L0351j6504P971
$$ 89156 212815 39239 -20672 -49347 -150389 -424287 -401848 -300054 -269703 -286207 -278236
17682b78236O3620L13J77855J6105k4925k2071M758k017L0358J59219l1171j16193
$$ -278236 -214616 -214303 -36448 -20343 -45268 -67339 -62581 -64598 -34240 124979 93808 -22385
17670b2385r8482o4785K6090L3067J36040N6874J15941J29033j46212o0877j15871
$$ -22385 -120867 -185652 -159562 -126495 9545 66419 182360 311393 165181 104304 -11567
17659a1567p6028O6030Q6399j1691J12393j29233r4127J0122k25967K7437k06746
$$ -11567 -87595 -21565 64834 53143 165536 36303 -57824 -47702 -273669 -246232 -452978
17648d52978J35222J98190K48033K0279j67759j84171j26832N3324J01832j83601
$$ -452978 -317756 -119566 128467 148746 -19013 -203184 -330016 -276692 -174860 -358461
17638c58461J73301Q4222Q2296M5378q5085k31609o0931K20106K88749L66401
$$ -358461 -185160 -100938 -18642 26736 -58349 -289958 -350889 -130783 157966 524367
17628E24367q573o8087q615k17427k02144p5833j11168J50615Q5123J62810k60967
$$ 524367 515794 447707 439092 221665 19521 -56312 -167480 -16865 68258 231068 -29899
17617b9899j59550j3092M944p5424m2099J08569j03200N6792J18131J7967J13111
$$ -29899 -189449 -202541 -197597 -273021 -315120 -206551 -309751 -252959 -134828 -116861 -3750
17606c750j18709K8994k5168r0060J4388J01127J92925J03592j1518k08280n8771
$$ -3750 -122459 -93465 -118633 -208693 -194305 -93178 99747 203339 191821 -16459 -75230
17595g5230j1203M5209p413k5226N6089O2918l1391Q8963M9955J48075Q8402M1551
$$ -75230 -86433 -41224 -48637 -73863 -17774 45144 13753 102716 152671 300746 389148 430699
17583D30699K9587k2202j38283k56446k01768o962J73308m2920j826Q3223L2254
$$ 430699 460286 438084 299801 43355 -158413 -165375 7933 -34987 -36813 46410 78664
17572G8664j3081m3118j60709o332J38042K35473j1952j01926j53299j23855j87500
$$ 78664 65583 22465 -138244 -144576 -6534 228939 216987 115061 -38238 -162093 -349593
17561c49593l3602P4982K27639j50648j73726k8480m8368J04912Q1757l1545J09659
$$ -349593 -383195 -308213 -80574 -231222 -404948 -433428 -481796 -376884 -295127 -326672 -217013
17550b17013J15817k8443p2874j18181L0240J70635J73058o9728R4654o9661k06896
$$ -217013 -101196 -129639 -202513 -320694 -290454 -119819 53239 -16489 78165 8504 -198392
17539a98392k31101p8143L0736k1691Q6547K26410L28578l5340k6604m4605j57684
$$ -198392 -429493 -507636 -476900 -498591 -412044 -185634 142944 107604 81000 36395 -121289
17528a21289j86125O7165m0604p6188K98270J74955o6239q3887j20137J00101
$$ -121289 -307414 -240249 -280853 -357041 -58771 116184 49945 -33942 -154079 -53978
17518e3978o7398R6427j23834l1543P5439K732m2801J2679R2778j38873K7254
$$ -53978 -121376 -24949 -148783 -180326 -104887 -102155 -144956 -132277 -39499 -178372 -151118
17507a51118L7033o7461R0330N3122k8741L68144J68499k69321j70375j5996k8976
$$ -151118 -114085 -181546 -91216 -38094 -66835 301309 469808 200487 30112 14116 -14860
17496a4860k16873N1465J28765J89269l4002P1384O2331M740r7754j34939j50355
$$ -14860 -231733 -180268 -51503 137766 103764 175148 237479 242219 144465 9526 -140829
17485a40829m9005K0093K46652o657N6091j6475j25969q9175K3154J2523M837
$$ -140829 -189834 -169741 76911 70254 126345 109870 -16099 -105274 -82120 -69597 -64760
17474f4760o1159M0793J43895l2925j88539J7848J25154P2473Q1064o491j32385
$$ -64760 -125919 -85126 58769 25844 -162695 -144847 -19693 52780 133844 127353 -5032
17463e032K1911k64448k19060J4780L68217J97507j19769o5655k8262J8509j695
$$ -5032 16879 -247569 -466629 -451849 -83632 113875 -5894 -71549 -99811 -81302 -82997
17452h2997p1935n6951O5657K84146N2714R1533j8377l2810M86649O01657O1008
$$ -82997 -154932 -211883 -146226 137920 190634 282167 263790 230980 717629 1319286 1380294
17441A380294k94916l24318l39113N2524P0867j82061l25625J16597N1391q9210
$$ 1380294 1085378 761060 421947 474471 545338 363277 37652 154249 205640 116430
17431A16430N2148K9382n3369J00362j4783k04650r213K600O6448j3715r6465
$$ 116430 168578 197960 144591 244953 230170 25520 16307 18907 85355 71640 -24825
17420b4825P2261J58089m3825k26065j11208J02919o493j60706Q0244J53932o7700
$$ -24825 47436 205525 161700 -64365 -175573 -72654 -79147 -239853 -159609 -5677 -73377
17409g3377k5594o9333n6900k1172J01689J24044k04305j76296q7729J14626J20798
$$ -73377 -98971 -168304 -225204 -246376 -144687 -20643 -224948 -401244 -488973 -374347 -253549
17398b53549J06397J44969M4176j01326q1698J03093m1487J9141p9885K08451
$$ -253549 -147152 -2183 41993 -59333 -141031 -37938 -79425 -60284 -140169 68282
17388F8282j96582j05016p1197k8467P5739l6383J70451J00264J71691J5719k11808
$$ 68282 -128300 -233316 -304513 -332980 -257241 -293624 -123173 -22909 148782 164501 -47307
17377d7307l2986o7242J06792K46762j646j24498O3546R9791k68808p7563M5817
$$ -47307 -80293 -147535 -40743 206019 204373 79875 143421 243212 -25596 -103159 -57342
17366e7342N9911K2089m8487l650J32045r3970K0573M1661p1225j53941j46463
$$ -57342 2569 24658 -23829 -27479 104566 10596 31169 72830 1605 -152336 -298799
17355b98799K14359L25443j0361J15423j93476j69215m9492j4481n0097J12517
$$ -298799 -84440 241003 230642 346065 152589 -16626 -66118 -80599 -130696 -18179
17345a8179o425j11005j51383J8898o5401p1033K4559L8287J50999J47029N6876
$$ -18179 -24604 -135609 -286992 -268094 -333495 -404528 -379969 -341682 -190683 -43654 13222
17334A3222J36508j75287j00845J1573M1627L2344j87798l7144J83812K3441J0108
$$ 13222 149730 -25557 -126402 -114829 -73202 -40858 -228656 -265800 -81988 -58547 -48439
17323d8439R2174J08602j04374j16973J88548o4638q6284l0785J04234k33015
$$ -48439 43735 152337 47963 -69010 119538 54900 -31384 -62169 42065 -190950
17313a90950j68933J8019K30759o822p3067O3040O1642L4627j53453k25512m2261
$$ -190950 -359883 -341864 -111105 -117927 -190994 -127954 -66312 -31685 -185138 -410650 -452911
17302d52911M4640P1088N5549R5076R5708J20096m8354j8385k12547l6772J80106
$$ -452911 -408271 -337183 -281634 -186558 -90850 29246 -19108 -37493 -250040 -286812 -106706
17291a06706l1072R6874N107j05464L4012j34741J15353Q2418N4943J99885N9090
$$ -106706 -137778 -40904 -35797 -141261 -107249 -241990 -126637 -44219 10724 210609 269699
17280B69699j35031P4803k2822n4033k3479O0067R1296j49219l54957J6135N3783
$$ 269699 134668 209471 186649 132616 109137 169204 260500 111281 -243676 -227541 -173758
17269a73758R5554K06508M9048j3756k13421M6930J96508k0369j82772j04791
$$ -173758 -78204 128304 177352 163596 -49825 -2895 193613 173244 -9528 -114319
17259a14319n5124k7958j38828P8509O6434l9753K6370J76556J36377J9895r6351
$$ -114319 -169443 -197401 -336229 -257720 -191286 -231039 -204669 -28113 108264 128159 31808
17248C1808l5754q7522j48223m7421J24273K93993p9748p0380j11315L2541r5066
$$ 31808 -3946 -91468 -239691 -287112 -162839 131154 51406 -18974 -130289 -97748 -192814
17237a92814J32972J41822k66541j30496J21137J48968J14526n5274K7333j81712
$$ -192814 -59842 81980 -184561 -315057 -193920 -44952 69574 14300 41633 -140079
17227a40079N2537P3401l4033n7096J30472M4702j1387L4055p2247q4067O227
$$ -140079 -87542 -14141 -48174 -105270 25202 69904 58517 92572 20325 -63742 -57515
17216e7515R9457M7608r2174j95741K2756J88124K49990J71787r7695j38486q3653
$$ -57515 41942 89550 -2624 -198365 -175609 12515 262505 434292 336597 198111 114458
17205A14458q5064r9732l50792j9780J5251Q760K46546P3409j23548N2421J12052
$$ 114458 29394 -70338 -421130 -440910 -425659 -416899 -170353 -96944 -220492 -168071 -56019
17194e6019P3756j68062j65681N6391K55471O6296n594P8219L6405l78q9462j24152
$$ -56019 17737 -150325 -316006 -259615 -4144 62152 56558 134777 171182 170804 81342 -42810
17182d2810j73869M2757P0888j05402j9842K07016J61187m0866p1651k01346Q956
$$ -42810 -216679 -173922 -103034 -208436 -228278 -21262 139925 99059 27408 -173938 -164982
17171a64982k4663J23898J54114L517p2900q7581p5486J10999J8457j63604Q4509
$$ -164982 -189645 -65747 88367 91884 18984 -68597 -144083 -33084 -14627 -178231 -93722
17160i3722K83168L8047k35495r7473j20118r5113J74319J05605j975P6758j68750
$$ -93722 189446 227493 -8002 -105475 -225593 -320706 -146387 -40782 -42757 34001 -134749
17149a34749l5108O6463N8522q9415J73695j2963q5112r4234j50814j1244Q8795
$$ -134749 -169857 -103394 -44872 -134287 39408 26445 -58667 -152901 -303715 -314959 -226164
17138b26164m7216J43898k9368R3345J61663J80387k3006j0633j59869l85754
$$ -226164 -273380 -129482 -158850 -65505 96158 276545 253539 242906 83037 -302717
17128c02717k8698J01090Q2125n0880K65584p8244o2640N4551l5518m0176J38923
$$ -302717 -331415 -230325 -148200 -199080 66504 -11740 -74380 -19829 -55347 -95523 43400
17117D3400j8792j10217j13040j52993K1953J48105L4015M3975n4595j53496O6353
$$ 43400 24608 -85609 -198649 -351642 -329689 -181584 -147569 -103594 -158189 -311685 -245332
17106b45332J52337j59482J10756L4184m4338K0506n4424k3808l9201M510J06864
$$ -245332 -92995 -252477 -141721 -107537 -151875 -131369 -185793 -209601 -248802 -244292 -137428
17095a37428J92964k7529p6357Q5446l5308j77553j35113K9596J14739K39629
$$ -137428 55536 28007 -48350 37096 1788 -175765 -310878 -281282 -166543 73086
17085G3086K11978j03799l02377J2338l1579j16609j6526J46398K6089M8612q4298
$$ 73086 285064 181265 -121112 -108774 -140353 -256962 -273488 -127090 -101001 -52389 -136687
17074a36687j23888j76486j24150J58114R0575R1980J98067k5538M2522k4858
$$ -136687 -260575 -437061 -561211 -403097 -312522 -220542 -22475 -48013 -5491 -30349
17064c0349J2727q8818O7276L1946o2423N7491J46963J05079k22309j0758J21590
$$ -30349 -17622 -106440 -39164 -7218 -69641 -12150 134813 239892 17583 6825 128415
17053A28415j73175j99748m3029j3037R3228K60404N1981j25822l4057q5124j5563
$$ 128415 -44760 -244508 -287537 -300574 -207346 53058 105039 -20783 -54840 -139964 -155527
17042a55527O1428j61141P7407J24423j35698j72388J17092J89251j41550j13234
$$ -155527 -94099 -255240 -177833 -53410 -189108 -361496 -244404 -55153 -196703 -309937
17032c09937L45j13993j6611J07218J76620J942j5154J25615k1003m0321r7312
$$ -309937 -309592 -423585 -440196 -332978 -156358 -154416 -169570 -43955 -64958 -105279 -202591
17021b02591O5908J33176J1787k7864j37587j74604L0248q4079j48482J79356
$$ -202591 -136683 -3507 8280 -19584 -157171 -331775 -301527 -385606 -534088 -354732
17011c54732K72947P7060n9692M318r2858J63069R6381j42594o2728j11250J02572
$$ -354732 -81785 -4725 -64417 -60099 -152957 10112 106493 -36101 -98829 -210079 -107507
17000a07507r116J34192q3874l0977j26652r0445L22934p513j66449j03869R2447
$$ -107507 -116623 17569 -66305 -97282 -223934 -314379 8555 1042 -165407 -269276 -176829
16989a76829K6802J29380L34260o1904k32532k2352m9462N8132j38238Q904j4477
$$ -176829 -150027 -20647 313613 251709 19177 -3175 -52637 5495 -132743 -123839 -138316
16978a38316q2110p7131j0677j02181k293K57730J29310P0440j16708p9885r5495
$$ -138316 -220426 -297557 -308234 -410415 -412708 -154978 -25668 44772 -71936 -151821 -247316
16967b47316l9126K53119J90946N2995r2168M406P474p2300j17332r4077O6468
$$ -247316 -286442 -33323 157623 210618 118450 122856 130330 58030 -59302 -153379 -86911
16956h6911J06644J15517N3565n1013J6389j26275j64208N6715J24663P6242l3685
$$ -86911 19733 135250 188815 137802 154191 27916 -136292 -79577 45086 121328 87643
16945H7643j9767L7383j03363Q7423L6392j7940q0729p3633j35692o5500K1569
$$ 87643 67876 105259 1896 89319 125711 107771 27042 -46591 -182283 -247783 -226214
16934b26214j5326N2777J75843o7528m9988M1181J24153j3936k06377l22j39364
$$ -226214 -241540 -188763 -12920 -80448 -130436 -89255 34898 20962 -185415 -185737 -325101
16923c25101r9263r4251l1306R3497J15678n4115J71286K24663k7809M9378K26821
$$ -325101 -424364 -518615 -549921 -456424 -340746 -394861 -223575 1088 -26721 22657 249478
16912B49478J04553O7839j39648l41158j59720j26329n739J84999p1672m4903
$$ 249478 354031 421870 282222 -58936 -218656 -344985 -350724 -165725 -237397 -282300
16902b82300K34484Q4994l7173L7703J26436k2773r6122j07470j69342p8628J26086
$$ -282300 -47816 37178 5 37708 164144 141371 45249 -62221 -231563 -310191 -184105
16891a84105J43937O0233M7386L7113O350j02143n028J20423K9063P0618J20429
$$ -184105 -40168 20065 67451 104564 110914 8771 3743 124166 153229 223847 344276
16880C44276j88840j04507k4461N6297j39142n6178O2773L9163q5723P5501J56682
$$ 344276 155436 50929 26468 82765 -56377 -112555 -49782 -10619 -96342 -20841 135841
16869A35841K3956j33279j35206j69259J10462l9013J39039p1197M5450J8463
$$ 135841 159797 26518 -108688 -277947 -167485 -206498 -67459 -138656 -93206 -74743
16859g4743p6190j64195J21069J87886j3810j28355k5818J72874O4714R4201j87935
$$ -74743 -150933 -315128 -194059 -6173 -19983 -148338 -174156 -1282 63432 157633 -30302
16848c0302Q270O9760j31373j06081j8732j39753J01055J26942M6227j36781m0783
$$ -30302 -22032 47728 -83645 -189726 -208458 -348211 -247156 -120214 -73987 -210768 -251551
16837b51551K16932r3785j77362O2190J78125J31879k88167n2332K09225J98638
$$ -251551 -34619 -128404 -305766 -243576 -65451 66428 -221739 -274071 -64846 133792
16827A33792J53195q5919k14285j08047j9580J17144J43707P7847o9045j2470
$$ 133792 286987 201068 -13217 -121264 -140844 -23700 120007 197854 128809 116339
16817A16339J51602J86808K4205j6496k11302k76803J95969L73k80750j14159
$$ 116339 267941 454749 478954 462458 251156 -25647 170322 170695 -110055 -224214
16807b24214j98387K5147J91013l6375j80865J48497M8579J23992J13145L8839
$$ -224214 -422601 -397454 -206441 -242816 -423681 -275184 -226605 -102613 10532 49371
16797D9371j61613k3814j730P9538j50764Q4475J86344J1197P4261M1580j11572
$$ 49371 -112242 -136056 -137786 -58248 -209012 -124537 61807 73004 147265 188845 77273
16786G7273j26206j21996L9141p8003j7683Q1605J88631M9088j60212p360j52494
$$ 77273 -48933 -170929 -131788 -209791 -227474 -145869 42762 91850 -68362 -75722 -228216
16775b28216j14251J1344n4386J03928l5239O0475Q9808r1035o5823l815j55881
$$ -228216 -342467 -331123 -385509 -281581 -316820 -256345 -166537 -257572 -323395 -327210 -483091
16764d83091k700R2054p3013J7577k3276m3925n0274J81067J25059o2361M1787
$$ -483091 -485791 -393737 -466750 -449173 -472449 -516374 -566648 -385581 -260522 -322883 -281096
16753b81096N3117K38444O0715R384Q390j26104l7165l8126r8018j44840j37589
$$ -281096 -227979 10465 71180 80564 88954 -37150 -74315 -112441 -210459 -355299 -492888
16742d92888q0779Q7606N29990Q3034j15422N982m6582j06012l5871r4214j38450
$$ -492888 -573667 -486061 43929 126963 11541 17523 -29059 -135071 -170942 -265156 -403606
16731d03606n4948J03988K4990R8154N5525j2757q5202N5769J38106R5681j7722
$$ -403606 -458554 -354566 -329576 -231422 -175897 -188654 -273856 -218087 -79981 15700 -2022
16720b022J49753m599j93411k15655J90470L3088J09948m0046j82337j24608m3520
$$ -2022 147731 143132 -50279 -265934 -75464 -42376 67572 27526 -154811 -279419 -322939
16709c22939N3122M5602N369P6111Q8273j7555j58406q0824l464o4846j3232k6951
$$ -322939 -269817 -224215 -218846 -142735 -54462 -72017 -230423 -311247 -314711 -379557 -392789 -419740
16697d19740k6312m6179M6293K27316K88108N1011P2365j3924j10630o3154j79178
$$ -419740 -446052 -492231 -445938 -218622 69486 120497 192862 178938 68308 5154 -174024
16686a74024r2381K18819l1115n8230j41741O362J59867N9465K00216K17408J1006
$$ -174024 -266405 -47586 -78701 -136931 -278672 -272310 -112443 -52978 147238 364646 375652
16675C75652l783l73279k85767L318K40097J26117n4361j71646j2726j4313k50950
$$ 375652 371869 -1410 -287177 -283859 -43762 82355 27994 -143652 -156378 -170691 -421641
16664d21641j34187J92685J79671M1595n0457o9925J66297Q6037n5367J09336
$$ -421641 -555828 -363143 -183472 -141877 -192334 -262259 -95962 -9925 -65292 44044
16654D4044j60684Q3372l7123j9415m3585k74872P8536R6687r7509J84956O4049
$$ 44044 -116640 -33268 -70391 -89806 -133391 -408263 -329727 -233040 -330549 -145593 -81544
16643h1544n0611m1036M2421l40579r2244K6025O8354N0637J16785J51286j16158
$$ -81544 -132155 -173191 -130770 -471349 -563593 -537568 -469214 -418577 -301792 -150506 -266664
16632b66664l0785K23530J40531k749l6604k2924n4874r7590j93543K38575L04200
$$ -266664 -297449 -73919 66612 63863 27259 4335 -50539 -148129 -341672 -103097 201103
16621B01103l6771k6548q2239j52131O3559q6549K4305j66253p4758J51202o0728
$$ 201103 164332 137784 55545 -96586 -33027 -119576 -95271 -261524 -336282 -185080 -245808
16610b45808n4525m0141p8258K00689K54800P8816K1938j19601j42597J75993
$$ -245808 -300333 -340474 -418732 -218043 36757 115573 137511 17910 -124687 51306
16600E1306J27778j52238M6247n2482j50659P9961M1408o00J22078M0043k46122
$$ 51306 179084 26846 73093 20611 -130048 -50087 -8679 -9279 112799 152842 -93280
16589i3280O9569J44237j81737m777J06496K9744j52515l02164J04609J48405
$$ -93280 -23711 120526 -61211 -65988 40508 70252 -82263 -384427 -279818 -131413
16579a31413K5250N7347n5174J6064k9836N431o5349j44722L9140J51258L029
$$ -131413 -106163 -48816 -103990 -87926 -117762 -112331 -177680 -322402 -283262 -132004 -128975
16568a28975Q0350L9370k41623r7151n8149M4214K5425R7015J38599j67845R9503
$$ -128975 -48625 -9255 -250878 -348029 -406178 -361964 -336539 -239524 -100925 -268770 -169267
16557a69267j04498n348R3092Q2669p6539l7568q2526L4779o7941L5619L01339
$$ -169267 -273765 -279113 -186021 -103352 -179891 -217459 -299985 -265206 -333147 -297528 3811
16546C811L6379K2020M491R9826K48567m2181r4801j51982q4482k20026k8604
$$ 3811 40190 62210 66701 166527 415094 372913 278112 126130 41648 -178378 -206982
16535b06982Q0572J10990N4249l6929m5332m7031j64431J22010J65427k25917
$$ -206982 -126410 -15420 38829 1900 -43432 -90463 -254894 -132884 32543 -193374
16525a93374j36698N3339J23430J49301j05575l5264J8873j73906j73729J6229
$$ -193374 -330072 -276733 -153303 -4002 -109577 -144841 -125968 -299874 -473603 -457374
16515d57374J11851R4958k2398p2180K04633J20621J2600j29162J71522n0418
$$ -457374 -345523 -250565 -272963 -345143 -140510 -19889 -7289 -136451 35071 -15347
16505a5347K9104o7118O7585n0257j13869J24757J44329m4110j16671p8748P9324
$$ -15347 13757 -53361 14224 -36033 -149902 -25145 119184 75074 -41597 -120345 -41021
16494d1021K64785j67229j01663J01001l2673L3357J05924K0725j41419m7203
$$ -41021 223764 56535 -45128 55873 23200 56557 162481 183206 41787 -5416
16484e416j03013j95504Q353J02557J19906R7094J26676M2075K1348p7332J6146
$$ -5416 -108429 -303933 -295580 -193023 -73117 23977 150653 192728 214076 136744 152890
16473A52890k78151l12544l8708j15721J73339K71495o9060L2579K25339k14849
$$ 152890 -125261 -437805 -476513 -592234 -418895 -147400 -216460 -183881 41458 -173391
16463a73391k77443j14695J59443m8138J42621K51648K37885k0029P8895k58173
$$ -173391 -450834 -565529 -406086 -454224 -311603 -59955 177930 157901 236796 -21377
16453b1377j89062r290j24113J12296N2196N9327q5463k2557k4989K01452k7m6827
$$ -21377 -210439 -219729 -343842 -231546 -179350 -120023 -205486 -228043 -253032 -51580 -51607 -98434
16441i8434m2669q809J5999j02813n6171m560K21626k5163m8413J9629J8868j12668
$$ -98434 -141103 -149912 -133913 -236726 -292897 -297457 -75831 -100994 -149407 -129778 -110910 -223578
16429b23578J50906K14700Q5181k12230K9130M5783l663j25335l4460M6913j343
$$ -223578 -72672 142028 227209 14979 44109 89892 86229 -39106 -73566 -26653 -27996
16418b7996N0018O9912k02855j91298N5087J18167J07680j8285K06237K9928l57054
$$ -27996 22022 91934 -110921 -302219 -247132 -128965 -21285 -39570 166667 196595 -160459
16407a60459j11638M4786q4902n2060J7867J21895L26825j99088j34022J21902
$$ -160459 -272097 -227311 -312213 -364273 -346406 -224511 102314 -96774 -230796 -108894
16397a08894R5441n950L4044O7040j84080r8818j9377r3359J71782K4956l5552
$$ -108894 -13453 -19403 14641 81681 -102399 -201217 -220594 -313953 -142171 -117215 -152767
16386a52767J86247J98307j99520L0691n3053q7925r8416k19765M7867K21188
$$ -152767 33480 231787 32267 62958 9905 -78020 -176436 -396201 -348334 -127146
16376a27146J44547j29639j68801n8077K52451J61000J5195P8506n5455J06821
$$ -127146 17401 -112238 -281039 -339116 -86665 74335 89530 168036 112581 219402
16366B19402m6351k25715r0308J01378l2330j50409R4014j31694J45J60733L5516
$$ 219402 173051 -52664 -142972 -41594 -73924 -224333 -130319 -262013 -261868 -101135 -65619
16355f5619j33500O6311J30673p8381j19391j22483K0326J58394L30192J70013
$$ -65619 -199119 -132808 -2135 -80516 -199907 -322390 -302064 -143670 186522 356535
16345C56535l09539l24795j9997J62537P9264j70905P1257k14600J6476K45231
$$ 356535 46996 -277799 -297796 -135259 -55995 -226900 -155643 -370243 -353767 -108536
16335a08536K33875M0885j17192Q6182m8582R4041J11974j46879r1608N7881P1267
$$ -108536 125339 166224 49032 135214 86632 180673 292647 145768 54160 112041 183308
16324A83308k1391m1707j2129M4055m2465J76194J18286j20359j01058p3653j30621
$$ 183308 161917 120210 108081 152136 109671 285865 404151 283792 182734 109081 -21540
16313b1540k33535N2211R7321J9851o4577L0311K88369J80345J37440l3368j37227
$$ -21540 -255075 -202864 -105543 -85692 -150269 -119958 168411 348756 486196 452828 315601
16302C15601l4582k05366j96142K91931N7016k03182l7672n6395N195J22304r5804
$$ 315601 281019 75653 -120489 171442 228458 25276 -12396 -68791 -63596 58708 -37096
16291c7096j08472N198j77398l1292J07676J28487J2457r4230J45772J26947J7342
$$ -37096 -145568 -140370 -317768 -349060 -241384 -112897 -100440 -194670 -48898 78049 95391
16280I5391k12907m5246K30483n3978O8684M7009j3793K9552o4063n0174P885
$$ 95391 -117516 -162762 67721 13743 82427 129436 115643 145195 81132 30958 38843
16269C8843m1785O0854j70624j09291j41176J37716J36898k5875k43587J41711
$$ 38843 -2942 57912 -112712 -222003 -363179 -225463 -88565 -114440 -358027 -216316
16259b16316K09853p3109N4206P9306m0053J10449L714o3404L6261p3818j43285
$$ -216316 -6463 -79572 -25366 53940 13887 124336 128050 64646 100907 27089 -116196
16248a16196M704R492n7672j99730l7178l4035m1303l20J14647K99627k3030j33000
$$ -116196 -111492 -102000 -159672 -359402 -396580 -430615 -471918 -472238 -357591 -57964 -80994 -213994
16236b13994j01229N2954J57050q3665K5297J32293J31778K9736j9634K549j04419
$$ -213994 -315223 -262269 -105219 -188884 -163587 -31294 100484 130220 110586 113135 8716
16225H716q6847O8803J38170r2276j0019l15749j15722L03963M3947j68923Q77
$$ 8716 -78131 -9328 128842 36566 26547 -289202 -404924 -100961 -57014 -225937 -225060
16214b25060J07637l7687M0901K3942j42011J71396K70340J96657k0039r1901
$$ -225060 -117423 -155110 -114209 -90267 -232278 -60882 209458 406115 386076 294175
16204B94175j93830k35613o7815J42346q5885Q1702J25019K5991p5960K6797j25795
$$ 294175 100345 -135268 -203083 -60737 -146622 -64920 60099 86090 10130 36927 -88868
16193h8868l0335J30430J78163j95038q5337q2608L6115k6070k02714L8781R1933
$$ -88868 -119203 11227 189390 -5648 -90985 -173593 -137478 -163548 -366262 -327481 -235548
16182b35548J28694j16931J4644M0627J04377M7017m5142j7546j65028l07884
$$ -235548 -106854 -223785 -209141 -168514 -64137 -17120 -62262 -79808 -244836 -552720
16172e52720K4608M9296K42128K18392Q8512k2847k37784j09108K1906J22509
$$ -552720 -528112 -478816 -236688 -18296 70216 47369 -190415 -299523 -277617 -155108
16162a55108M822L29829K33789P0295k15202k68567j35986k3872j1448j73539
$$ -155108 -150286 179543 413332 483627 268425 -142 -136128 -160000 -171448 -344987
16152c44987L450M9387K76049P4655j40121k5108J6760J97047k68401j38250m7487
$$ -344987 -341537 -292150 -16101 58554 -81567 -106675 -89915 107132 -161269 -299519 -347006
16141c47006O4457J03070m0264J35907J9019O8802o9915k33523J66818K65006
$$ -347006 -282549 -179479 -219743 -83836 -64817 3985 -65930 -299453 -132635 132371
16131A32371J29950l0585j28080j13738k45734J4624Q8105J87070r883j0944J00934
$$ 132371 262321 231736 103656 -10082 -255816 -241192 -153087 33983 24100 13156 114090
16120A14090J0273J17940k1773k09945j30010q7959O0515L5662o5309l2261Q1276
$$ 114090 124363 242303 220530 10585 -119425 -207384 -146869 -111207 -176516 -208777 -127501
16109a27501l2411l55988j66513K84402K41103K2517J78009L2541k59207n8949
$$ -127501 -159912 -515900 -682413 -398011 -156908 -134391 43618 76159 -183048 -241997
16099b41997J52507O0879k2026K1667k7287j984J37681l789j41404R4324N9887
$$ -241997 -89490 -28611 -50637 -28970 -56257 -58241 79440 75651 -65753 28571 88458
16088H8458R338K4370j41116j54596j03843l5091L5312J70257Q0622K45461J43062
$$ 88458 97796 122166 -18950 -173546 -277389 -312480 -277168 -106911 -26289 219172 362234
16077C62234k0798k92033l0205J53271n5950k51421J6149K22005o6648q4753j32328
$$ 362234 341436 49403 19198 172469 116519 -134902 -118753 103252 36604 -48149 -180477
16066a80477J1716J45706J83523J49770j10278j27597l917p3239l0537p6126j25689
$$ -180477 -168761 -23055 160468 310238 199960 72363 68446 -4793 -35330 -111456 -237145
16055b37145k91763R4475J75512K39168L0638j11167j53486J7930r7714J4299
$$ -237145 -528908 -434433 -258921 -19753 10885 -100282 -253768 -235838 -333552 -319253
16045c19253K18848K50387p0162Q217K6386k40277M7141K12141J03134o6040k5188
$$ -319253 -100405 149982 79820 88037 114423 -125854 -78713 133428 236562 170522 145334
16034A45334j93985j63402J2435Q8756Q2122O2632j79862M4254K44242J14544
$$ 145334 -48651 -212053 -199618 -110862 -28740 33892 -145970 -101716 142526 257070
16024B57070J681j54410j52104n0916k32544q1187J72334k836Q3545q555k36502
$$ 257070 258751 104341 -47763 -98679 -331223 -412410 -240076 -242912 -159367 -167922 -404424
16013d04424K9157K78537L41435K19025k20252l3414l3964r6959l54695l3392
$$ -404424 -375267 -96730 244705 463730 243478 210064 176100 79141 -275554 -308946
16003c08946J90473L3118N2353k0851r8387N3636j21979N8537M44923Q7237R7031
$$ -308946 -118473 -85355 -33002 -53853 -152240 -98604 -220583 -162046 282877 370114 467145
15992D67145k23442j78755k32627J86402K39135P2907J27301j31990j74086K7725
$$ 467145 243703 64948 -167679 18723 257858 330765 458066 326076 151990 179715
15982A79715o9661K3599j04647j29794K2662j4250k8758j2023O9012J01978N6708
$$ 179715 110054 133653 29006 -100788 -78126 -92376 -121134 -133157 -64145 37833 94541
15971I4541J56953M0228K00480K5638j03988K8895k18971k01874n8638o9297J6862
$$ 94541 251494 291722 492202 517840 413852 442747 223776 21902 -36736 -106033 -89171
15960h9171N5240q3559R1926J50244N068j7818r0594j60086p2052J33100M497
$$ -89171 -33931 -117490 -25564 124680 129748 111930 21336 -138750 -210802 -77702 -73205
15949g3205j32448n3403J45504Q7621n9327j10208O3929L10289p2277O8951J2134
$$ -73205 -205653 -259056 -113552 -25931 -85258 -195466 -131537 178752 106475 175426 187560
15938A87560k57267R9518K19981j20091j22646q9953o3008o584J40064p795j38309
$$ 187560 -69707 29811 249792 129701 7055 -82898 -145906 -152490 -12426 -20221 -158530
15927a58530o9300k9921Q3525J62875j05557p7816p5520O290n0055J24923O2685
$$ -158530 -227830 -257751 -174226 -11351 -116908 -194724 -270244 -263954 -314009 -189086 -126401
15916a26401J24738K1382m4664m5654J06431J06054k63543j31639O0884o4367
$$ -126401 -1663 19719 -24945 -70599 35832 141886 -121657 -253296 -192412 -256779
15906b56779J07143M8626R745j311j18999r2258J79328K10490J26708j51161k05937
$$ -256779 -149636 -101010 -91265 -92576 -211575 -303833 -124505 85985 212693 61532 -144405
15895a44405K71999K8557k61570r217O2220j10192K6419n0442Q4958K17056j87584
$$ -144405 127594 156151 -105419 -114636 -52416 -162608 -136189 -186631 -101673 115383 -72201
15884g2201K2320K9979j62053j25727O7731R4910J45481m6598p49J4721n4174
$$ -72201 -49881 -19902 -181955 -307682 -239951 -145041 440 -46158 -46907 -32186 -86360
15873h6360N3758K23457Q925k2524r9474j07244K3991L7521P3495J1542p5928
$$ -86360 -32602 190855 199780 177256 77782 -29462 -5471 32050 105545 117087 41159
15862D1159j17838L2966j18110J19872J10978J30346K10442j56824q5603j65094
$$ 41159 -76679 -43713 -161823 -41951 69027 199373 409815 252991 167388 2294
15852B294j11598J64900M2722j41689j45244j7834L07532P9825j56860j17530
$$ 2294 -109304 55596 98318 -43371 -188615 -206449 101083 180908 24048 -93482
15842i3482M5572R4820j43811P1288j12942L0902J21486N5501j42232J05525J19187
$$ -93482 -47910 46910 -96901 -25613 -138555 -107653 13833 69334 -72898 32627 151814
15831A51814O1032l6316l1840O4840j4777k01743p9088P6539j7248j29003J23388
$$ 151814 212846 176530 144690 209530 194753 -6990 -86078 -9539 -26787 -155790 -32402
15820c2402O3152J69789O8831k28141l47957K1363J17477p5108r7419N1877N4991
$$ -32402 30750 200539 269370 41229 -306728 -285365 -167888 -242996 -340415 -288538 -233547
15809b33547L0792J58149j83627k57321j0104M8519J45911J65192P8607j56757
$$ -233547 -202755 -44606 -228233 -485554 -495658 -447139 -301228 -136036 -57429 -214186
15799b14186Q8517K44391O5187k15568j19991R7191M9097J5525o5291j92803L366
$$ -214186 -125669 118722 183909 -31659 -151650 -54459 -5362 10163 -55128 -247931 -244565
15788b44565L18824L6775j4039q7218m1362J67600o8756L8967o9433o501J50720
$$ -244565 74259 111034 96995 9777 -31585 136015 67259 106226 36793 30292 181012
15777A81012P5548J26005J40710P6056m1876k67591p3100j3883K8991O0469P435
$$ 181012 256560 382565 523275 599331 557455 289864 216764 202881 231872 292341 299776
15766B99776j01192r5760L7998j5988j67598m8209j925j39601j60567O6509J082
$$ 299776 198584 102824 140822 124834 -42764 -90973 -92898 -232499 -393066 -326557 -325475
15755c25475m6850M9520J96114J5019j942j7598m4765N9265m8241J04103k852
$$ -325475 -372325 -322805 -126691 -111672 -113614 -131212 -175977 -116712 -164953 -60850 -63702
15744f3702M8647n5743l6950k0416k03208q6649J87683J42392K1689o0401L5018
$$ -63702 -15055 -70798 -107748 -128164 -331372 -418021 -230338 -87946 -66257 -126658 -91640
15733i1640J00183p5797j69246K7501O7884J19574M8237K18418m650k06638R6809
$$ -91640 8543 -67254 -236500 -208999 -141115 -21541 26696 245114 240464 33826 130635
15722A30635J9330J3412m237j76558o7128n9078m7164J87367M6303l2733j61205
$$ 130635 149965 163377 159140 -17418 -84546 -143624 -190788 -3421 42882 10149 -151056
15711a51056N453r721l6152m2057J19726j59122p8568K25605Q9264j8272m1285
$$ -151056 -145603 -155324 -191476 -233533 -113807 -272929 -351497 -125892 -36628 -54900 -96185
15700i6185P5556K43716l0684N1584m6511o9412m4134j77574j25281J69526J56536
$$ -96185 -20629 223087 192403 243987 197476 128064 83930 -93644 -218925 -49399 107137
15689A07137L6481m1588k27277j61828m9707L2364K1757K32519N5718o2333Q7893
$$ 107137 143618 102030 -125247 -287075 -336782 -304418 -282661 -50142 5576 -56757 31136
15678C1136J28861m968J06595J49587k04265k69051K8361J73335Q7026o1295j13986
$$ 31136 159997 155029 261624 411211 206946 -62105 -33744 139591 226617 165322 51336
15667E1336o7667R6222r1995J25661k1321k12264L867M685j57150q2492o1086
$$ 51336 -16331 79891 -12104 113557 92236 -120028 -116161 -111476 -268626 -351118 -412204
15656d12204K05399J13303J34434j8542J43860P8283k56221j60504j93159P1346
$$ -412204 -206805 -93502 40932 22390 166250 244533 -11688 -172192 -365351 -294005
15646b94005J27071j72529J4966K03232K12369J16395j73780k99763L357P1605
$$ -294005 -166934 -339463 -324497 -121265 91104 207499 33719 -266044 -262687 -191082
15636a91082J37579n8785L8602n9876K43463j29223J3435K12356k48948k0158
$$ -191082 -53503 -112288 -73686 -133562 109901 -19322 -5887 206469 -42479 -62637
15626f2637k1457m9294K12600j6350k15429j52075N7701M19745K69429j29149
$$ -62637 -84094 -133388 79212 62862 -152567 -304642 -246941 172804 442233 313084
15616C13084Q165J37711m8835j99499j13506j0169J96980l5966k02528n3789q4120
$$ 313084 321249 458960 410125 210626 97120 86951 283931 247965 45437 -8352 -92472
15605i2472k75630J8042O1690K10482K67140J49596r5551k14847j54068J71664
$$ -92472 -368102 -350060 -288370 -77888 189252 338848 243297 28450 -125618 46046
15595D6046j7979p8628J78344O1927o3122J81422J71287j79587J17750r6670j1157
$$ 46046 28067 -50561 127783 189710 126588 308010 479297 299710 417460 320790 309633
15584C09633n0564l39412j75556M6847J7136Q2201j2317N5217J36593j17362k23854
$$ 309633 259069 -80343 -255899 -209052 -191916 -109715 -122032 -66815 69778 -47584 -271438
15573b71438L3793R6052q047j02662M464j57862j5669K51148J43568j81855j36448
$$ -271438 -237645 -141593 -149640 -252302 -247838 -405700 -421369 -170221 -26653 -208508 -344956
15562c44956R3281J26132j69721J50766P3936j39680p7510j150K33537K91855
$$ -344956 -251675 -125543 -295264 -144498 -70562 -210242 -287752 -288902 -55365 236490
15552B36490N6208j04536j20223M3892R0712J8871j20137p799m2227O549m0892
$$ 236490 292698 188162 67939 111831 202543 221414 101277 93478 51251 57800 16908
15541A6908r4726K12813J40567j9178Q5828p2525k72647O7883N744k40125O7690
$$ 16908 -77818 134995 275562 256384 342212 269687 -2960 64923 70667 -169458 -101768
15530a01768L4954K17696o3020L8591J8293Q241P0454K46928K48085j60674k59903
$$ -101768 -66814 150882 87862 126453 144746 152987 223441 470369 718454 557780 297877
15519B97877l17328o1341j2234J07526P3018j18647K9973J14859r2976K3062k9337
$$ 297877 -19451 -80792 -93026 14500 87518 -31129 -1156 113703 20727 43789 14452
15508A4452O8915O5548o3302O3786M2101J07639J26089j25327k58741k3484J11827
$$ 14452 83367 148915 85613 149399 191500 299139 425228 299901 41160 17676 129503
15497A29503M7942l2039p6668q9293n6296L9991k2586K20960K47066j3251k44163
$$ 129503 177445 145406 68738 -20555 -76851 -36860 -59446 161514 408580 395329 151166
15486A51166j60346j698k059M1173l6770J12710J72913n9328l6985m9843j41195
$$ 151166 -9180 -10878 -12937 28236 -8534 104176 277089 217761 180776 130933 -10262
15475a0262j10168j05279J16492J27307K5702P2128k5589p389l181o4387l8365
$$ -10262 -120430 -225709 -109217 18090 43792 115920 90331 82942 79761 15374 -22991
15464b2991k4459n1378j40520K20570J39936q2158M0004N9631M0823Q988j49833
$$ -22991 -47450 -98828 -239348 -18778 121158 39000 79004 138635 179458 188446 38613
15453C8613p4268K79838J27446N7081L0721k45373j50663N2795J8907Q456l63038
$$ 38613 -35655 244183 371629 428710 459431 214058 63395 116190 135097 143553 -219485
15442b19485K8902O1115K06737P6200L9356Q9908Q8674j36984k11710j46359m7885
$$ -219485 -190583 -129468 77269 153469 192825 282733 371407 234423 22713 -123646 -171531
15431a71531M2744K53917O3943j67979n4691l1895R6883j9049j37666l155O6345
$$ -171531 -128787 125130 189073 21094 -33597 -65492 31391 12342 -125324 -128479 -62134
15420f2134j7071k8712J28128j0824J3741J28221j31740R4775n1354l3476j0858
$$ -62134 -79205 -107917 20211 9387 23128 151349 19609 114384 63030 29554 18696
15409A8696k0556L9136p8962o905n1823m6643L3874n3507J52253Q4758J16691
$$ 18696 -1860 37276 -41686 -48591 -100414 -147057 -113183 -166690 -14437 70321 187012
15398A87012K8290o5496r9278k94809J32864K96290j7516r2126k69888J27776
$$ 187012 215302 149806 50528 -244281 -111417 184873 167357 75231 -194657 -66881
15388f6881K58726L1177o6748L3201k19074m3589J03230J90226N4069q0969J30845
$$ -66881 191845 223022 156274 189475 -29599 -73188 30042 220268 274337 193368 324213
15377C24213J83837j36263k44596q9497J64160N1805j81123r8720r1139k4706
$$ 324213 508050 371787 127191 37694 201854 253659 72536 -26184 -117323 -142029
15367a42029J2851J99153J01938K4871k5838m7323J55236n3152K4528q2701m13606
$$ -142029 -129178 69975 171913 196784 170946 123623 278859 225707 250235 167534 -246072
15356b46072j70917K62816k0932Q2788N2521O9910j90o5382m095R1968R534k3126
$$ -246072 -416989 -154173 -175105 -92317 -39796 30114 29924 -35458 -39553 52415 61949 38823
15344C8823j37015L0729q032K1346J10743J2340O4172n9912j9938p7694m2173
$$ 38823 -98192 -67463 -75495 -54149 56594 68934 133106 73194 53256 -24438 -66611
15333f6611J5481J0605K44910O8761P2792N3054q6199r7409m7341j90071k10806
$$ -66611 -51130 -40525 204385 273146 345938 398992 312793 215384 168043 -22028 -232834
15322b32834J06335R4954J16612J29664J347R4451J8373l3416j09939r4121J3444
$$ -232834 -126499 -31545 85067 214731 216078 310529 328902 295486 185547 91426 104870
15311A04870K2553J87440N9140q4027j22914k2637j66647J7607j06367J69288
$$ 104870 127423 314863 374003 289976 167062 144425 -22222 -4615 -110982 58306
15301E8306m1915R2086J34352L5971j87750j60911J24600J71981j01565q8832
$$ 58306 16391 108477 242829 278800 91050 -69861 54739 226720 125155 36323
15291C6323n992J66873K6270J88906J5579j62147J04089k2928j74097k9693Q9818
$$ 36323 30331 197204 223474 412380 427959 265812 369901 346973 172876 143183 233001
15280B33001j67825p9203o2501N0622R0254P1228J17415M2985j30832r7761j07708
$$ 233001 65176 -14027 -76528 -25906 64348 135576 252991 295976 165144 67383 -40325
15269d0325J9889J05682j1522R6728l1728j00910K4828j30009m3154N0334O6033
$$ -40325 -20436 85246 73724 170452 138724 37814 62642 -67367 -110521 -60187 5846
15258E846o4956J88412R5704k28479m4485K61145m9993N0245j1037p6157J22745
$$ 5846 -59110 129302 225006 -3473 -47958 213187 163194 213439 202402 126245 248990
15247B48990j2408M4062K06407R8540R3880J98236q104o4659m5186q569q581N6877
$$ 248990 236582 280644 487051 585591 679471 877707 869603 804944 759758 751189 742608 799485
15235G99485P0279q6067J2701j8930m283O1103p7007j32502k545J33176p6060
$$ 799485 869764 783697 796398 777468 773185 834288 757281 624779 622234 755410 679350
15224F79350j87714n0350K9678J32349P0591j56581o6884p0865j11601k9380J09528
$$ 679350 491636 441286 470964 603313 673904 517323 450439 379574 267973 238593 348121
15213C48121P7624j94727j10492N9569j60016j6322M5568m0810J86749j26109
$$ 348121 425745 231018 120526 180095 20079 3757 49325 8515 195264 69155
15203F9155k69O9176K06741J89973M0511p7439l35234r5635L6070P7075J12704
$$ 69155 68886 138062 344803 534776 575287 497848 162614 66979 103049 180124 292828
15192B92828P4321j0185j43490p2541O261J4672n6374L3936j8294m814O2185J25808
$$ 292828 367149 356964 213474 140933 147194 161866 105492 139428 121134 116320 178505 304313
15180C04313j26591j16028j2192j3903N8050j73096J69263Q2117k60351j84726
$$ 304313 177722 61694 49502 35599 93649 -79447 89816 171933 -88418 -273144
15170b73144J94632J64553K33197l9839p0090R1928j96903k05523j03977K90431
$$ -273144 -78512 86041 319238 279399 209309 301237 104334 -101189 -205166 85265
15160H5265K6882j58799j16650n6644P7985K09038N5410M1124p540l0540j42793
$$ 85265 112147 -46652 -163302 -219946 -141961 67077 122487 163611 156071 125531 -17262
15149a7262j15499o1481P3184j05807J11334K04302j7933j04222j18948N3347
$$ -17262 -132761 -194242 -121058 -226865 -115531 88771 70838 -33384 -152332 -98985
15139i8985J7632J63572l0537L2059l8814R4703j76431k24473K22855J01173O8274
$$ -98985 -81353 82219 51682 83741 44927 139630 -36801 -261274 -38419 62754 131028
15128A31028o4683o5174p7412J4310K92068P4330j63560j71625N2241q4613o3549
$$ 131028 66345 1171 -76241 -61931 230137 304467 140907 -30718 21523 -63090 -126639
15117a26639J63791O2153j14125n7673J60049J24806m1515q3198L2073l8835k71073
$$ -126639 37152 99305 -14820 -72493 87556 212362 170847 87649 119722 80887 -190186
15106a90186k0594O0245p5293K0796J60984j37936J572O9091K21244J36911j00652
$$ -190186 -210780 -150535 -225828 -205032 -44048 -181984 -180412 -111321 109923 246834 146182
15095A46182p5031P6868N3182K20417M8251j16610k39747n3144j68831Q8755O0847
$$ 146182 71151 148019 201201 421618 469869 353259 113512 60368 -108463 -19708 41139
15084D1139L39690L9067j34390j91216q7295J6693j7592J09800p4923j66958L6765
$$ 41139 380829 419896 285506 94290 6995 23688 6096 115896 40973 -125985 -89220
15073h9220M8118m5244j8387L5135m8854k836q6142k9062J08212K26219J77891
$$ -89220 -41102 -86346 -104733 -69598 -118452 -121288 -207430 -236492 -128280 97939 275830
15062B75830p5122m0183m4256k37942Q4382K58616j28892l2988K02372m5852j0187
$$ 275830 200708 160525 116269 -121673 -37291 221325 92433 59445 261817 215965 205778
15051B05778j48694J1846J37833l612j5247j84482Q1663L35084j97086k54798
$$ 205778 57084 68930 206763 203151 187904 3422 85085 420169 223083 -31715
15041c1715R6863j5727j84301O8269l3937k4392m4350O7681K40981L0750n3023
$$ -31715 65148 49421 -134880 -66611 -100548 -124940 -169290 -101609 139372 170122 117099
15030A17099p9222m7568K21069J28342j6578q1959j15084L9002m2537k68041j92778
$$ 117099 37877 -9691 211378 339720 323142 241183 126099 165101 122564 -145477 -338255
15019c38255J27726L73076n9779P32M9930p5348j68925n393j83896n2003J66259
$$ -338255 -210529 162547 102768 103500 153430 78082 -90843 -96236 -280132 -332135 -165876
15008a65876K94840Q5786p2232j2893M9373j4819M7470j31629q1232j72488J03837
$$ -165876 128964 214750 142518 129625 178998 164179 211649 80020 -1212 -173700 -69863
14997f9863J12962J23598q2201m988m8802o7583J3058j10929p688J96792J93084
$$ -69863 43099 166697 84496 79508 30706 -36877 -23819 -134748 -142436 54356 247440
14986B47440M949j44153K0110l3994l2160j49116r5384R6279J30754J66187k02337
$$ 247440 252389 108236 128346 94352 62192 -86924 -182308 -86029 44725 210912 8575
14975H575j92520K7870J80768J116J44460K23091j76912k29277Q1439J70901r0404
$$ 8575 -183945 -156075 24693 25809 170269 393360 216448 -12829 68610 239511 149107
14964A49107R9022J48290J66676j27476m04417r2105N5752p3719j1717L4959P6166
$$ 149107 248129 396419 563095 435619 31202 -60903 -5151 -78870 -90587 -55628 20538
14953B0538J39374J05412j65574k13591l5047N8720J23001J82314K4440k16717
$$ 20538 159912 265324 99750 -113841 -148888 -90168 32833 215147 239587 22870
14943B2870M1797N5985L0291R1104L1317j76617n4197M3240M90j13826J26540
$$ 22870 64667 120652 150943 242047 273364 96747 42550 85790 86280 -27546 98994
14932I8994q0756p0849P464K36472k1442j67906k38383P4196K4706q6211l7538
$$ 98994 18238 -52611 -45147 191325 169883 1977 -236406 -162210 -137504 -223715 -261253
14921b61253j0400k24486Q8190J87462R4312R0572r0369j39042K8066R1042k4098
$$ -261253 -271653 -496139 -407949 -220487 -126175 -35603 -125972 -265014 -236948 -145906 -170004
14910a70004j38607J25305J72765K19636p3479j78550l8289j93341J3384K23044
$$ -170004 -308611 -183306 -10541 209095 135616 -42934 -81223 -274564 -261180 -38136
14900c8136J34066o8515n3294J10928j7752o1011J90226J22881j65620j35662
$$ -38136 95930 27415 -25879 85049 67297 6286 196512 319393 153773 18111
14890A8111J58883j1651n0574q8797o8255J8135K8929k14984j38969K7433J52509
$$ 18111 176994 165343 114769 25972 -42283 -24148 4781 -210203 -349172 -321739 -169230
14879a69230K7818O9943j20190J5532L09676J34143L2845j39424j31385k9000
$$ -169230 -141412 -71469 -191659 -176127 133549 267692 300537 161113 29728 728
14869G28l6097O0340J91837l7319k41047k08750J16475J20670L9200Q7345J57877
$$ 728 -35369 24971 216808 179489 -61558 -270308 -153833 -33163 6037 93382 251259
14858B51259l69499j75459K8613r6731J68749J97139R058m9234q041m7620p6852
$$ 251259 -118240 -293699 -265086 -361817 -193068 4071 13129 -36105 -44146 -91766 -168618
14847a68618J16245j2152L371K73851J43888r7421p8772J34107j28601P0912J5924
$$ -168618 -52373 -64525 -61154 212697 356585 259164 180392 314499 185898 256810 272734
14836B72734q3429r5570R1278J22110j41268j45677J32746J33538j53644l7761
$$ 272734 189305 93735 185013 307123 165855 20178 152924 286462 132818 95057
14826I5057l4170k50603j70530n1051J07679K66597N6890j24069j96234J13590
$$ 95057 60887 -189716 -360246 -411297 -303618 -37021 19869 -104200 -300434 -186844
14816a86844n6714q4767J72419J63668K2032K09946K73312K0214k00832k38939
$$ -186844 -243558 -328325 -155906 7762 29794 239740 513052 533266 332434 93495
14806I3495j28717J36744o1329o60k0288k32234j16023m4162o784J29508N8204
$$ 93495 -35222 101522 40193 39533 19245 -212989 -329012 -373174 -379958 -250450 -192246
14795a92246J05235J68518Q3518j80520j57382m6483J26329m1841K93805m3633
$$ -192246 -87011 81507 165025 -15495 -172877 -219360 -93031 -134872 158933 115300
14785A15300j50540j67518r5030J95313k3041J81436J59638j28470n7935P7410
$$ 115300 -35240 -202758 -297788 -102475 -125516 55920 215558 87088 29153 106563
14775A06563J07565l3066L3699P9157j09851J19343J70027r1963j41699J31231
$$ 106563 214128 181062 214761 293918 184067 303410 473437 381474 239775 371006
14765C71006J93507Q2205j50530o5866j26717p7342K8982K01032j44910j48373
$$ 371006 564513 646718 496188 430322 303605 226263 255245 456277 311367 162994
14755A62994L3964p2608j61712k55J26239l2809J99653O3986k3879n4040k20860
$$ 162994 196958 124350 -37362 -37617 88622 55813 255466 319452 295573 241533 20673
14744B0673m3771K0814K17693L3883r7236j01833P7990P8026n4631N0872p0599
$$ 20673 -23098 -2284 215409 249292 152056 50223 128213 206239 151608 202480 131881
14733A31881l2795n7607J51544J36239j99882p1159P9661K00597J08329j50080
$$ 131881 99086 41479 193023 329262 129380 58221 137882 338479 446808 296728
14723B96728j58274N7525L7516O4214l6927j09188j75366o6383J61394J91379
$$ 296728 138454 195979 233495 297709 260782 151594 -23772 -90155 71239 262618
14713B62618J21959L6863O7880L5283k63757q9375M7664q6390o3161O4507O4947
$$ 262618 384577 421440 489320 524603 260846 171471 219135 132745 69584 134091 199038
14702A99038j56018j1722l1397j49643k6621l863J7455L9934J70757R5319L2981
$$ 199038 43020 31298 -99 -149742 -176363 -180226 -162771 -122837 47920 143239 176220
14691A76220l13430k43902Q441L10010K86606K7102J04133k22588k73874M6909
$$ 176220 -137210 -381112 -372671 -62661 223945 251047 355180 132592 -141282 -94373
14681i4373K63142J58461K5077J18732N2167m9181P2570K3601m2361j31576l536
$$ -94373 168769 327230 352307 471039 523206 474025 546595 570196 527835 396259 392723
14670C92723q0338K3170n2678K182K1046n0945m714J20687N3433J31559J9132
$$ 392723 312385 335555 282877 285059 306105 255160 250446 371133 424566 556125 575257
14659E75257o5754j71405n6385J46297J09332K0090n4334K3172q8052K18891K44124
$$ 575257 509503 338098 281713 428010 537342 557432 503098 526270 438218 657109 901233
14648I01233j10755k22097k42580N4403q1270n3139J37037K26679K3777m0731
$$ 901233 790478 568381 325801 380204 298934 245795 382832 609511 633288 592557
14638E92557k4099j32289j08461M5914r921K55091J81612l8520K0347P4290l3589
$$ 592557 568458 436169 327708 373622 363701 618792 800404 761884 782231 856521 822932
14627H22932j11297P2404q2840k26903L3128R3466m1299k8704O4556j35187r4584
$$ 822932 711635 784039 701199 474296 507424 600890 559591 530887 595443 460256 365672
14616C65672L8265P1457R7162K9252p3615j19707P9328J5116l8681N0224m5002
$$ 365672 403937 475394 572556 601808 528193 408486 487814 502930 464249 514473 469471
14605D69471P9824k77222k17515J96254L49704K1157j05439l7681j64426n3811
$$ 469471 549295 272073 54558 250812 600516 621673 516234 478553 314127 260316
14595B60316K9404P7406J89200j86191J41813J01641K4866r0554l2681q3906Q6360
$$ 260316 289720 367126 556326 370135 511948 613589 638455 547901 515220 431314 517674
14584E17674j8205r4181j33041j16828J5970L3529l433J05020j67511M9082M8259
$$ 517674 499469 405288 272247 155419 171389 204918 201485 306505 138994 188076 236335
14573B36335L1055N9067K17368J17497m3505k7637m6822j4214J76947q9054j10520
$$ 236335 267390 326457 543825 661322 617817 590180 543358 529144 706091 617037 506517
14562E06517P7078M6983j46603o5895L9838J2148j24580l0859R6160r9150j35484
$$ 506517 583595 630578 483975 418080 457918 470066 345486 314627 410787 311637 176153
14551A76153r9920J10476N3706L0844J32610j16439j96425j28710j5680L4109
$$ 176153 76233 186709 240415 271259 403869 287430 91005 -37705 -53385 -19276
14541a9276p1142J7069J65039L5539k66028k1712j2515j52099K02441J90108k6164
$$ -19276 -90418 -73349 91690 127229 -138799 -160511 -173026 -325125 -122684 67424 41260
14530D1260M4611Q4676J563k5684P9747n0039N9490J49091J22725k54686j26759
$$ 41260 85871 170547 172110 146426 226173 176134 235624 384715 507440 252754 125995
14519A25995j3708L4619M9367k8412p2197J84418K26076J7175p3984k00698j74219
$$ 125995 112287 146906 196273 167861 95664 280082 506158 523333 449349 248651 74432
14508G4432O2007J15323j33446j02353R3184R9253K27563K93220j91178j16663
$$ 74432 136439 251762 118316 15963 109147 208400 435963 729183 538005 421342
14498D21342j36361j1403l9417j35387j40159r5696J81883M5171j95581l7215
$$ 421342 284981 273578 234161 98774 -41385 -137081 44802 89973 -105608 -142823
14488a42823J05209J28090J2796o0128n3260m4006k8646J46431P1013M739J69735
$$ -142823 -37614 90476 103272 43144 -10116 -54122 -82768 63663 134676 139415 309150
14477C09150j3928r1761l6157n0117j30424j51772O53J9754L1740j55652k0132
$$ 309150 295222 203461 167304 117187 -13237 -165009 -164356 -144602 -112862 -268514 -288646
14466b88646j47501j15867J79144L14453L33095J49387m9790l81721j20862J07278
$$ -288646 -436147 -552014 -372870 -58417 274678 424065 374275 -7446 -128308 -21030
14456b1030Q8873l0879j13993Q0983L05113J10734p9380m08784j95000j0775M2837
$$ -21030 67843 36964 -77029 3954 309067 419801 340421 -68363 -263363 -274138 -231301
14445b31301k2971q1318J82582Q8760M7053K18939Q1179j24029j28062J27737
$$ -231301 -254272 -335590 -153008 -64248 -17195 201744 282923 158894 30832 158569
14435A58569J44812r6393J09307J0598j41784k27577j8037m745K34042L13974
$$ 158569 303381 206988 316295 326893 185109 -42468 -60505 -65250 168792 482766
14425D82766j09328l00715j58349m5765K52552J177J08882j63985p3498J29089
$$ 482766 373438 72723 -85626 -131391 121161 122338 231220 67235 -6263 122826
14415A22826K54998J61311k14748j68362q9781J62195J07239L984j98560k26250
$$ 122826 377824 539135 324387 156025 66244 228439 335678 339662 141102 -85148
14405h5148O7461J66097q5316J1743n7960l7914o6053J42512o7276j61786k6767
$$ -85148 -17687 148410 63094 74837 16877 -21037 -87090 55422 -11854 -173640 -200407
14394b00407K21325P1363J33961P3144j00616j33443m398K06699n5590k8863j25892
$$ -200407 20918 92281 226242 299386 198770 65327 60929 267628 212038 183175 57283
14383E7283j18879N0426k15829O1994p3152J15062L21788j02056p1725L14604
$$ 57283 -61596 -11170 -226999 -165005 -238157 -123095 198693 96637 24912 339516
14373C39516P0299j63608j35342J0093o5817j49706R0000L6446J34206N278J4201
$$ 339516 409815 246207 110865 120958 55141 -94565 -4565 31881 166087 171365 185566
14362A85566j04537J05717J8707k08869l73372k382K34306J15925j03522J6881
$$ 185566 81029 186746 205453 -3416 -376788 -379170 -144864 -28939 -132461 -115580
14352a15580P9284j02098O4824K16686J49117m9272j39412m6901J19828R2235
$$ -115580 -36296 -138394 -73570 143116 292233 242961 103549 56648 176476 268711
14342B68711L4779K2485p1401r1006p8171l0826J52739N639l06180o6827k11289
$$ 268711 303490 325975 254574 163568 85397 54571 207310 212949 -93231 -160058 -371347
14331c71347j83688J43593J45363J63108j3146l16071n3827k9030K22833N9504
$$ -371347 -555035 -411442 -266079 -102971 -116117 -432188 -486015 -515045 -292212 -232708
14321b32708K16096k2026j38622O9678K25996j01311k7782N651J68111M7888l1183
$$ -232708 -16612 -38638 -177260 -107582 118414 17103 -10679 -5028 163083 210971 179788
14310A79788j62446J1081m9605m1815J46919J2725j17531j1502J13853j00659
$$ 179788 17342 28423 -21182 -62997 83922 96647 -20884 -32386 81467 -19192
14300a9192p9604m6366J52613J91129j25128q3987j1693J48641p7978j64597N8623
$$ -19192 -98796 -145162 7451 198580 73452 -10535 -22228 126413 48435 -116162 -57539
14289e7539J15912J66208j225k29057Q3522R5461k76983k87506J19343J2951l2837
$$ -57539 58373 224581 223356 -5701 77821 173282 -103701 -391207 -271864 -258913 -291750
14278b91750j6724K03175L36149n9570Q567O3599R6591k20823j05473J02145j47561
$$ -291750 -308474 -105299 230850 171280 179847 243446 340037 119214 13741 115886 -31675
14267c1675m9661n953p6771L0581P2263R7721O213j7718K57236j75165j84614
$$ -31675 -81336 -87289 -164060 -133479 -61216 36505 42718 25000 282236 107071 -77543
14256g7543P1611J46560m2346n3380K22264l019j00278J3233r7506l1457J09392
$$ -77543 -5932 140628 98282 44902 267166 264147 163869 177102 79596 48139 157531
14245A57531K1495R163R2738j15281k14986K8636L5460p6663j57516j06539p3324
$$ 157531 179026 188189 280927 165646 -49340 -20704 14756 -61907 -219423 -325962 -399286
14234c99286K59156N0023l5437K1198L75347K70289M79j91284L3754k29356j52009
$$ -399286 -140130 -90107 -125544 -104346 271001 541290 541769 350485 384239 154883 2874
14223B874J11203P3586J21541j54597r0395M4857J54563q7465p310p7546L7419
$$ 2874 114077 187663 309204 154607 64212 109069 263632 176167 168857 91311 128730
14212A28730o0561K2952R6052J06731N7981k02076k86212j74167L95677J29516
$$ 128730 68169 91121 187173 293904 351885 149809 -136403 -310570 85107 214623
14202B14623K08114K04144k33354j90730k5674J09651k8265j95574q9361p4306
$$ 214623 422737 626881 393527 202797 177123 286774 258509 62935 -26426 -100732
14192a00732R0958J10005m3967q5644N9939J35288j16138j36347Q9543N4643J18110
$$ -100732 -9774 100231 56264 -29380 30559 165847 49709 -86638 2905 57548 175658
14181A75658J8110k33820p8146k3723j55726P1093j02774j71179J61240M90741
$$ 175658 193768 -40052 -118198 -141921 -297647 -226554 -329328 -500507 -339267 151474
14171A51474P9576p9135K65551J15946l57761k37472j82910p7196J8834Q9173
$$ 151474 231050 151915 417466 533412 175651 -61821 -244731 -321927 -303093 -213920
14161b13920L04707K05749p7600k61124k6066K28609J12816R637j18972J19051
$$ -213920 90787 296536 218936 -42188 -68254 160355 273171 282808 163836 282887
14151B82887j6704l46602n6678L27435J07120k8083k07576j51319k9660J00212
$$ 282887 266183 -80419 -137097 190338 297458 269375 61799 -89520 -119180 -18968
14141a8968Q3089J08705J39567r2342p8081K8711k75819m6607o5971J74547q9700
$$ -18968 64121 172826 312393 220051 141970 170681 -105138 -151745 -217716 -43169 -132869
14130a32869J70310J35743J89673m390j90500j21531O4148p149L4017k4035l75658
$$ -132869 37441 173184 362857 358467 167967 46436 110584 103435 137452 113417 -262241
14119b62241P0916K53948J78368o0210M0688O4128j73284j57365J28077l0578
$$ -262241 -191325 62623 240991 180781 221469 285597 112313 -45052 83025 52447
14109E2447j55331J04420J16482j33061n5665N935Q3457k7110O8819L69472m62
$$ 52447 -102884 1536 118018 -15043 -70708 -64773 18684 -8426 60393 429865 429403
14098D29403j91730r4616O4201k33315k56909o3485j6567P3863J12501j8445j25336
$$ 429403 237673 143057 207258 -26057 -282966 -346451 -363018 -289155 -176654 -195099 -320435
14087c20435J27230K40089j07957q9926K65293O8042K7666o9473j64952m9216
$$ -320435 -193205 46884 -61073 -150999 114294 182336 210002 140529 -24423 -73639
14077g3639J21061J10361l2614m6407o5901l7056k42557M0860N9224O3351O9428
$$ -73639 47422 157783 125169 78762 12861 -24195 -266752 -225892 -166668 -103317 -33889
14066c3889o1691j30227M3194L7457L7540l8033J89082r0626k23065k5736n6424
$$ -33889 -95580 -225807 -182613 -145156 -107616 -145649 43433 -47193 -270258 -295994 -352418
14055c52418j99223K45426J32819Q7286j03458j53968J11554K81507J7821J3971
$$ -352418 -551641 -306215 -173396 -86110 -189568 -343536 -231982 49525 67346 81317
14045H1317O9402j36456k34313Q9594J02167J29713o6762n523n3397r5016Q3471
$$ 81317 150719 14263 -220050 -130456 -28289 101424 34662 29139 -24258 -119274 -35803
14034c5803l7076M4755L983j60449J4080O625l00335R0345L30046J94469L0605
$$ -35803 -72879 -28124 -24141 -184590 -170510 -163885 -464220 -373875 -43829 150640 181245
14023A81245p3239j00089l8675J0067j61569k14334j131K0093r2083Q7560o2029
$$ 181245 108006 7917 -30758 -20691 -182260 -396594 -397725 -377632 -469715 -382155 -444184
14012d44184q905Q997J12604J78628L0005l4511k0483J65822K92308j09705k61809
$$ -444184 -453089 -444092 -331488 -152860 -122855 -157366 -177849 -12027 280281 170576 -91233
14001i1233p9466q474L0464J3001j06776n1288l4150J96901J76234R1838j40647
$$ -91233 -170699 -179173 -148709 -135708 -242484 -293772 -327922 -131021 45213 137051 -3596
13990c596L7483J0525j38659j11149J89983q8112j16214K9192j42453j50244J89355
$$ -3596 33887 44412 -94247 -205396 -15413 -103525 -219739 -190547 -333000 -483244 -293889
13979b93889L27055Q5708k42893l05699j2083J49440k2875q9670J38637O4784
$$ -293889 33166 118874 -124019 -429718 -441801 -292361 -315236 -404906 -266269 -201485
13969b01485R9273k4608J65932j21025k466K50136N7045r5882j11865o934J97041
$$ -201485 -102212 -126820 39112 -81913 -84379 165757 222802 126920 15055 8121 205162
13958B05162N6728m2916M928J04368q0233q9972o2434K0394L6008n7749J50270
$$ 205162 261890 218974 223902 328270 248037 158065 95631 116025 152033 94284 244554
13947B44554j23237N4907N7087J52867j17417k81223k1368J86837j71901k77662
$$ 244554 121317 176224 233311 386178 268761 -12462 -33830 153007 -18894 -296556
13937b96556R8362K05564j6443j277M4458j19468j43404m9348m3041J63754J70147
$$ -296556 -198194 7370 -9073 -10350 34108 -85360 -228764 -278112 -321153 -157399 12748
13926A2748L0569j32290j19740k69918M1185R5780M3664J58117K61249l1415J81516
$$ 12748 43317 -88973 -208713 -478631 -437446 -341666 -298002 -139885 121364 89949 271465
13915B71465j18516j01251j44124j39651J79869J11055l1738N1407k08568j5009
$$ 271465 152949 51698 -92426 -232077 -52208 58847 27109 78516 -130052 -145061
13905a45061J86166n4411r2303o7502q6013p9506J09590J17223M937J9380L9952
$$ -145061 41105 -13306 -105609 -173111 -259124 -338630 -229040 -111817 -106880 -87500 -47548
13894d7548P0832j47249J76844J2202r2005L5082O488R4152l5938r3314j20842
$$ -47548 23284 -123965 52879 65081 -26924 8158 14646 108798 72860 -20454 -141296
13883a41296p4226J51528o4488P26K2016o2359N0041R0064K1805p7823j62785
$$ -141296 -215522 -63994 -128482 -127756 -105740 -168099 -118058 -27994 -6189 -84012 -246797
13872b46797l2339K04752J39880L01190q4004j5337l2234L742j4721k629r0455
$$ -246797 -279136 -74384 65496 366686 282682 267345 235111 238853 224132 221503 131048
13861A31048l5567J1329j11594K01930K48643J04144m51104k72774K2162n6233
$$ 131048 95481 106810 -4784 197146 445789 549933 98829 -173945 -151783 -208016
13851b08016J21236J46452P2799p5606P7949J969N5830M6399O0026M099j27119
$$ -208016 -86780 59672 132471 56865 134814 136783 192613 239012 299038 303137 176018
13840A76018r3772j7669o4611P296k484R3658j00203M5205K7506J21783P2334
$$ 176018 82246 64577 -34 7262 4778 98436 -1767 43438 70944 192727 265061
13829B65061m2059m26107N8003K46607n5763J19388Q5830J15061j59710j44421
$$ 265061 223002 -203105 -145102 101505 45742 165130 250960 366021 206311 61890
13819F1890Q2634J53676j45782k19496K35666K42626l5520o6560k21828n8249
$$ 61890 144524 298200 152418 -67078 168588 411214 375694 309134 87306 29057
13809B9057j14359O9852O2286N6208L545p8867J33426k22733K1252Q0862M0061
$$ 29057 -85302 -15450 46836 103044 106589 27722 161148 -61585 -40333 40529 80590
13798H0590k93731R956L3026Q2506J77370j00332N812r7677j15869K7740j53383
$$ 80590 -213141 -203185 -170159 -87653 89717 -10615 -4803 -102480 -218349 -190609 -343992
13787c43992J83850K71482j52952k05885M5122J26040Q6526n4766j34985j17181
$$ -343992 -160142 111340 -41612 -247497 -202375 -76335 10191 -44575 -179560 -296741
13777b96741L2919M4386j54860L0676K7284k4601J21270K1132J84056K8757J7608
$$ -296741 -263822 -219436 -374296 -343620 -316336 -340937 -219667 -198535 -14479 14278 31886
13766C1886m9880L0053K08725r7028k11027j98312J1415O9651J05022J94804m8890
$$ 31886 -17994 12059 220784 123756 -87271 -285583 -274168 -204517 -99495 95309 46419
13755D6419K8558l2339j15932k144M85J8967j47707J6349L4340N0854N6590j38442
$$ 46419 74977 42638 -73294 -75438 -74953 -55986 -203693 -187344 -153004 -102150 -45560 -184002
13743a84002j76759j12861k8290J74056l16m4856Q1055J53085j15325J95977R2797
$$ -184002 -360761 -473622 -501912 -327856 -328172 -373028 -291973 -138888 -254213 -58236 34561
13732C4561J01537N4250k64657k07262L9546j35747Q4981J46931N7162K3942P7022
$$ 34561 136098 190348 -74309 -281571 -242025 -377772 -292791 -145860 -88698 -64756 12266
13721A2266J35525r2660k44525j32429L4846J55381N5932j05279K6826M6064n6972
$$ 12266 147791 55131 -189394 -321823 -286977 -131596 -75664 -180943 -154117 -108053 -165025
13710a65025K21289L3387j51322j15615J47208n0427J29471K54731j98984k45618
$$ -165025 56264 89651 -61671 -177286 -30078 -80505 48966 303697 104713 -140905
13700a40905L5608P2504r9894q4402N7370N723J30461j36339j06805O6158O1261
$$ -140905 -105297 -32793 -132687 -217089 -159719 -153996 -23535 -159874 -266679 -200521 -139260
13689a39260K44447Q1744l4669m5800k3359j45701J51849J21879m1124j56054
$$ -139260 105187 186931 152262 106462 83103 -62598 89251 211130 170006 13952
13679A3952j85305J06814J59068j28290j98943J51568K27087K00642o364k70729
$$ 13952 -171353 -64539 94529 -33761 -232704 -81136 145951 346593 340229 69500
13669F9500j46297J29683K28943K1728j22398k87733k34262M6527J05000n1574
$$ 69500 -76797 52886 281829 303557 181159 -106574 -340836 -294309 -189309 -240883
13659b40883J55423K3549R0962O6767J68286q2312j80174O4351r5121j68432R9076
$$ -240883 -85460 -61911 29051 95818 264104 181792 1618 65969 -29152 -197584 -98508
13648i8508j18870k1227K66048J16134q3069p0543k0134q7843J02908J0906O9881
$$ -98508 -217378 -238605 27443 143577 60508 -10035 -30169 -118012 -15104 -4198 65683
13637F5683j26933J15623M3875r1116k2163j6014l9966j3766p2737J24766K1366
$$ 65683 -61250 54373 98248 7132 -15031 -31045 -71011 -84777 -157514 -32748 -11382
13626a1382p180p6725Q4622M1355J08905N2855j1788l2442m4178J937R0968j01952
$$ -11382 -18562 -95287 -10665 30690 139595 192450 180662 148220 104042 105979 196947 94995
13614I4995J6811O5909j13171j81237J21503L6531j34832k53159N8308J59349
$$ 94995 111806 177715 64544 -116693 4810 41341 -93491 -346650 -288342 -128993
13604a28993M8070J59201j48347P6165M3319J77248O3916J03283p4281j0414q4774
$$ -128993 -80923 78278 -70069 6096 49415 226663 290579 393862 319581 309167 224393
13593B24393k49006j73433J06302N1480J2873l1711N6188J01986Q5647J0636J6098
$$ 224393 -24613 -198046 -91744 -40264 -27391 -59102 -2914 99072 184719 195355 211453
13582B11453J02484j04594j28237J4375j5063j3225J67494J08946j13296j94541
$$ 211453 313937 209343 81106 95481 80418 67193 234687 343633 230337 35796
13572C5796l4577m5448j12098J14957j7824J8202J39258K24676R881r2426l8972
$$ 35796 1219 -44229 -156327 -41370 -59194 -40992 98266 322942 332823 240397 201425
13561B01425N7536j58265K7745j0770k09326J95966J00567k65226N4228Q4736
$$ 201425 258961 100696 128441 117671 -91655 104311 204878 -60348 -6120 78616
13551G8616J34361m0774J4377j3377m644J76344m8805j15978j45080j28634L9741
$$ 78616 212977 172203 186580 173203 168559 344903 296098 180120 35040 -93594 -53853
13540e3853J07729L7092l57565r1921j11377n0564J20193L30164K28689q5569
$$ -53853 53876 90968 -266597 -358518 -469895 -520459 -400266 -70102 158587 73018
13530G3018J9354q3172j00554j6581J33729K320r7324N7732M7295Q0962k07308
$$ 73018 92372 9200 -91354 -107935 25794 28114 -69210 -11478 35817 116779 -90529
13519i0529J85479J36433k62846Q8914J77217l6809K81j75101r7124N6184J97325
$$ -90529 94950 231383 -31463 57451 234668 197859 198140 23039 -74085 -17901 179424
13508A79424m7627j19213P8101J04113J64149j0550j97587r7538k15068m0614
$$ 179424 131797 12584 90685 194798 358947 348397 150810 53272 -161796 -202410
13498b02410J8222p8532K2116l4650J75150J80314n429j2265j44493n7594N5321
$$ -202410 -184188 -262720 -240604 -275254 -100104 80210 74781 62516 -81977 -139571 -84250
13487h4250J04011j70597j49390K06685J53094K5539J77606K17709K1218p7970
$$ -84250 19761 -150836 -300226 -93541 59553 85092 262698 480407 501625 423655
13477D23655j08791k30901N2109L06902M0m4134n4778k66125k10171J49120J88174
$$ 423655 314864 83963 136072 442974 443014 398880 344102 77977 -132194 16926 205100
$$ [...]
##END NTUPLES=NMR SPECTRUM
##END=
