##TITLE=Analysis number 317278
Compound Code mo 07810
Book Reference 453/100
Project Code adrs
Chemist Name lesleyd
##JCAMPDX= 6.0         $$ Bruker NMR JCAMP-DX V2.0
##DATA TYPE= NMR SPECTRUM
##DATA CLASS= NTUPLES
##ORIGIN= Bruker BioSpin GmbH
##OWNER= nmr
$$ XWIN-NMR		Version 3.5
$$ Wed Feb 15 09:14:53 2006 GMT Standard Time (UT+0h)  MAYBRIDGE\nmr@NMR_250MHZ
##.OBSERVE FREQUENCY= 250.131544655141
##.OBSERVE NUCLEUS= ^1H
##.ACQUISITION MODE= SIMULTANEOUS (DQD)
##.ACQUISITION SCHEME= undefined
##.AVERAGES= 16
##.DIGITISER RES= 18
##SPECTROMETER/DATA SYSTEM= dpx250
##.PULSE SEQUENCE= zg30
##.SOLVENT NAME= CDCl3
##.SHIFT REFERENCE= (INTERNAL, CDCl3, 0, 16.522)
##AUDIT TRAIL= $$ (NUMBER, WHEN, WHO, WHERE, WHAT)
$$ ##TITLE= Audit trail, XWIN-NMR		Version 3.5
$$ ##JCAMPDX= 5.01
$$ ##ORIGIN= Bruker BioSpin GmbH
$$ ##OWNER= nmr
$$ C:\u/data/dgb/nmr/ADRS/16040/pdata/1/auditp.txt
$$ ##AUDIT TRAIL=  $$ (NUMBER, WHEN, WHO, WHERE, WHAT)
(   1,<2006-02-15 09:14:02.41 +000>,<MAYBRIDGE\nmr>,<NMR_250MHZ>,
      <created by zg, POWCHK disabled, PULCHK disabled
       configuration hash MD5:
       84 BC 41 DB A1 6E 1D 46 DA 25 12 A5 C1 ED C5 3A
       data hash MD5: 64K
       0C E2 5F FA 73 A6 6B 4E 38 0B D4 A0 1E 02 85 EF>)
(   2,<2006-02-15 09:14:23.38 +000>,<MAYBRIDGE\nmr>,<NMR_250MHZ>,
      <Start of raw data processing
       ef LB = 0.3 FT_mod = 6 PKNL = 1 SI = 32K 
       data hash MD5: 32K
       95 22 BA 13 2C 44 D7 5A F8 9B 88 09 4C E5 D9 D5>)
(   3,<2006-02-15 09:14:28.23 +000>,<MAYBRIDGE\nmr>,<NMR_250MHZ>,
      <apk 
       data hash MD5: 32K
       D8 8F 37 F5 9C 68 C1 57 41 E2 3C 8E CF C1 7F 93>)
(   4,<2006-02-15 09:14:29.64 +000>,<MAYBRIDGE\nmr>,<NMR_250MHZ>,
      <abs ABSG = 5 
       data hash MD5: 32K
       AF 6A DF 89 FB 23 85 EC 53 56 FB 04 DD F6 CB 03>)
$$ ##END=
$$ 
$$ hash MD5
$$ A9 25 3C 86 31 E1 9E 83 E2 22 31 07 32 78 70 02
##$RELAX= 
##$RELAX= 
##$RELAX= 
##$RELAX= 
##$RELAX= 
##$RELAX= 
##$RELAX= 
$$ Bruker specific parameters
$$ --------------------------
##$DU= <C:\u>
##$EXPNO= 16040
##$NAME= <ADRS>
##$PROCNO= 1
##$TYPE= <nmr>
##$USER= <dgb>
##$AMP= (0..31)
100 100 100 100 100 100 100 100 100 100 100 100 100 100 100 100 100 100 
100 100 100 100 100 100 100 100 100 100 100 100 100 100 
##$AQSEQ= 0
##$AQ_mod= 3
##$AUNM= <au_zg>
##$AUTOPOS= <4 >
##$BF1= 250.13
##$BF2= 250.13
##$BF3= 250.13
##$BF4= 250.13
##$BF5= 500.13
##$BF6= 500.13
##$BF7= 500.13
##$BF8= 500.13
##$BYTORDA= 1
##$CFDGTYP= 0
##$CFRGTYP= 5
##$CHEMSTR= <none>
##$CNST= (0..31)
1 1 145 1 1 1 1 1 1 1 1 1 1 1 1 1 1 1 1 1 1 1 1 1 1 1 1 1 1 1 1 1 
##$CPDPRG= <>
##$CPDPRG1= <>
##$CPDPRG2= <>
##$CPDPRG3= <>
##$CPDPRG4= <mlev>
##$CPDPRG5= <mlev>
##$CPDPRG6= <mlev>
##$CPDPRG7= <mlev>
##$CPDPRG8= <mlev>
##$CPDPRGB= <>
##$CPDPRGT= <>
##$D= (0..31)
0 1 0 0 0 0 0 0 0 0.06 0 0 0 0 0 0 0.0002 0 0 0 0 0 0 0 0 0 0 0 0 0 0 
0 
##$DATE= 1139994839
##$DBL= (0..7)
120 120 120 120 120 120 120 120 
##$DBP= (0..7)
150 150 150 150 150 150 150 150 
##$DBP07= 0
##$DBPNAM0= <>
##$DBPNAM1= <>
$$ [...]
##$SUBNAM7= <"">
##$SUBNAM8= <"">
##$SUBNAM9= <"">
##$SW= 20.6930455092707
##$SWIBOX= (0..15)
0 0 3 0 0 0 0 0 0 0 0 0 0 0 0 0 
##$SW_h= 5175.983436853
##$TD= 65536
##$TD0= 1
##$TE= 294.16
##$TE2= 300
##$TE3= 300
##$TEG= 300
##$TL= (0..7)
0 120 120 120 120 120 120 120 
##$TP= (0..7)
150 150 150 150 150 150 150 150 
##$TP07= 0
##$TPNAME0= <>
##$TPNAME1= <>
##$TPNAME2= <>
##$TPNAME3= <>
##$TPNAME4= <>
##$TPNAME5= <>
##$TPNAME6= <>
##$TPNAME7= <>
##$TPOAL= (0..7)
0.5 0.5 0.5 0.5 0.5 0.5 0.5 0.5 
##$TPOFFS= (0..7)
0 0 0 0 0 0 0 0 
##$TUNHIN= 0
##$TUNHOUT= 0
##$TUNXOUT= 0
##$USERA1= <user>
##$USERA2= <user>
##$USERA3= <user>
##$USERA4= <user>
##$USERA5= <user>
##$V9= 5
##$VALIST= <valist>
##$VCLIST= <CCCCCCCCCCCCCCC>
##$VD= 0
##$VDLIST= <DDDDDDDDDDDDDDD>
##$VPLIST= <PPPPPPPPPPPPPPP>
##$VTLIST= <TTTTTTTTTTTTTTT>
##$WBST= 1024
##$WBSW= 4
##$XGAIN= (0..3)
0 0 0 0 
##$XL= 0
##$YL= 0
##$YMAX_a= 317232
##$YMIN_a= -276597
##$ZGOPTNS= <>
##$ZL1= 120
##$ZL2= 120
##$ZL3= 120
##$ZL4= 120
##$ABSF1= 16.522
##$ABSF2= -4.171173
##$ABSG= 5
##$ABSL= 3
##$ALPHA= 0
##$AQORDER= 0
##$ASSFAC= 0
##$ASSFACI= 0
##$ASSFACX= 0
##$ASSWID= 0
##$AUNMP= <proc_1d>
##$AZFE= 0.1
##$AZFW= 0.1
##$BCFW= 0
##$BC_mod= 0
##$BYTORDP= 0
##$COROFFS= 0
##$CY= 12.5
##$DATMOD= 1
##$DC= 0
##$DFILT= <>
##$DTYPP= 0
##$F1P= 14.0000005364418
##$F2P= -0.99999901652339
##$FCOR= 0.5
##$FTSIZE= 32768
##$FT_mod= 6
##$GAMMA= 0
##$GB= 0
##$INTBC= 1
##$INTSCL= 1
##$ISEN= 128
##$LB= 0.3
##$LEV0= 0
##$LPBIN= 0
##$MAXI= 10000
##$MC2= 0
##$MEAN= 0
##$ME_mod= 0
##$MI= 0
##$NCOEF= 0
##$NC_proc= -4
##$NLEV= 6
##$NOISF1= 0
##$NOISF2= 0
##$NSP= 0
##$NTH_PI= 0
##$NZP= 0
##$OFFSET= 16.522
##$PC= 1
##$PHC0= 103.5297
##$PHC1= 4.575176
##$PH_mod= 1
##$PKNL= yes
##$PPARMOD= 0
##$PSCAL= 4
##$PSIGN= 0
##$REVERSE= no
##$SF= 250.13
##$SI= 32768
##$SIGF1= 0
##$SIGF2= 0
##$SINO= 400
##$SIOLD= 32768
##$SREGLST= <1H.CDCl3>
##$SSB= 0
##$STSI= 32768
##$STSR= 0
##$SW_p= 5175.98343685301
##$SYMM= 0
##$S_DEV= 0
##$TDeff= 65536
##$TDoff= 0
##$TI= <Analysis number 999999
Compound Code 99
Book Reference 9
Project Code 9>
##$TILT= no
##$TM1= 0
##$TM2= 0
##$TOPLEV= 0
##$USERP1= <user>
##$USERP2= <user>
##$USERP3= <user>
##$USERP4= <user>
##$USERP5= <user>
##$WDW= 1
##$XDIM= 32768
##$YMAX_p= 271932902
##$YMIN_p= -329101
$$ End of Bruker specific parameters
$$ ---------------------------------
##NTUPLES= NMR SPECTRUM
##VAR_NAME=  FREQUENCY,     SPECTRUM/REAL,   SPECTRUM/IMAG
##SYMBOL=    X,             R,               I
##VAR_TYPE=  INDEPENDENT,   DEPENDENT,       DEPENDENT
##VAR_FORM=  AFFN,          ASDF,            ASDF
##VAR_DIM=   32768,         32768,           32768
##UNITS=     HZ,            ARBITRARY UNITS, ARBITRARY UNITS
##FACTOR=    0.157963299565203, 1,           1
##FIRST=     4132.6476996994, 0,             0
##LAST=      -1043.33573715361, 0,           0
##MIN=       -1043.33573715361, -329101,     0
##MAX=       4132.6476996994, 271932902,     0
$$ Real data points
##PAGE= N=1
##DATA TABLE= (X++(R..R)), XYDATA
$$ [...]
22276d034o77j02243j30974J4307R5838J35207J27253j2941o5099o2512r0769
22265i6644n8464K2769P8653L7194P02M618M1105J4269K5792L8629J9880o5539
22253F2964n5482k9315J5825O425j9962l7357J8466K9701L3450M7974o3707j13860
22241a04878O1714K1077p5512m5249j4830P830N0601P3406M3336L8474K0912j20751
22229d3870J1265L3933k1374j9376q659k053j3643K0322J1537m9201R9928L0948
22217D9757J9613j4726m0840N8563L1320K6444q3254q0242M9975o713k762q1039
22205g3904k1528M9077p0661j18352p048O5504J3531R2266J6323m407j529L9691
22193b1037n6102N2197K7428j2953L2748L2541k1353n1166k54Q2121j1459n0920
$$ plain form
22276 -4034 -4711 -106954 -237928 -223621 -127783 7424 134677 121736 56637 -5875 -96644
22265 -96644 -155108 -132339 -53686 -16492 -15790 -11172 29933 44202 69994 108623 128503 62964
22253 62964 7482 -21833 -6008 417 -19545 -56902 -38436 -8735 24715 72689 8982 -104878
22241 -104878 -43164 -22087 -97599 -142848 -157678 -149848 -99247 -25841 17495 55969 76881 -43870
22229 -43870 -32605 1328 -20046 -39422 -48081 -50134 -63777 -43455 -31918 -81119 18809 49757
22217 49757 69370 54644 13804 72367 103687 130131 46877 -33365 16610 9897 7135 -73904
22205 -73904 -95432 -46355 -117016 -235368 -242416 -176912 -163381 -71115 -54792 -59199 -60728 -21037
22193 -21037 -77139 -24942 2486 -10467 22281 54822 33469 -17697 -17951 64170 52711 1791
22181A791l4526o6568J1497j3281N6645l0807j05345R8498J7697m8961k3672J4664
22169a22368k5928J0867J3296J8119K3881j11098l2625P4604M079N3299O8171
22158b5703M1719k5837l6041J175l4720q7397l7870R2041P7317M7782p2013j2937
22146g2484j4744l759L9389J6634p0001m4408L8441O5336N524j6935k5346n2400
22134a34753J0249k4172P3718R0051Q7042k6672m7751M5574N536m539o0962m7670
22122c4349j08782J20452l0328l8657L0626L3856l3526n7713J3492Q685J48422
22111E2178J623j6427q4362p7024M8137M1038M4414l6151k8974Q2471P1905m8337
22099E0491n0347p7591m2773m2359O3748K2092N7635N4734R0015n186p8433n6642
$$ plain form
22181 1791 -32735 -99303 -87806 -101087 -44442 -75249 -180594 -82096 -64399 -113360 -137032 -122368
22169 -122368 -148296 -137429 -124133 -106014 -82133 -193231 -225856 -151252 -147173 -93874 -25703
22158 -25703 16016 -9821 -45862 -44687 -79407 -166804 -204674 -112633 -35316 12466 -59547 -72484
22146 -72484 -87228 -90987 -51598 -34964 -104965 -149373 -110932 -45596 -40072 -57007 -82353 -134753
22134 -134753 -124504 -148676 -74958 15093 102135 75463 27712 73286 78822 74283 13321 -34349
22122 -34349 -143131 -22679 -53007 -91664 -61038 -27182 -60708 -118421 -104929 -96244 52178
22111 52178 53801 37374 -46988 -124012 -75875 -34837 9577 -26574 -55548 26923 98828 50491
22099 50491 144 -77447 -120220 -162579 -98831 -76739 -19104 35630 125645 120459 42026 -14616
22087a4616r1833Q750J18637R4389j108o8520p1321o275K0133R143l1233P0013
22075C6159m5954p4477J11752Q4302J6708O307r1605l0482l1650M1464O4390J3159
22063A00073o6460m8177K4492n7754J6025M7261k2569K0023k7243K455N600N3238
22051D6964K6935n4366j9973r5961m4860O8104J49510L6147r9816o9279q519J5838
22039d9276k1377K2105K5976J34831N3405O8508J6369o7276m3873n1910n3815
22028C3667P9281J16214o441o3703p8131Q77J511j01857m7319k5113N0919q3468
22016a23563m248M4563J36863N7933m940p7843K7483K1113m49K1739j0209o3850
22004B4592J2335l279k5761j3480n7169p9190K0965N7776n2863n0786k1846P8093
$$ plain form
22087 -14616 -106449 -97699 20938 115327 114219 45699 -25622 -31897 -11764 -2621 -33854 36159
22075 36159 -9795 -84272 27480 111782 128490 134797 43192 12710 -18940 22524 86914 100073
22063 100073 33613 -14564 9928 -47826 -31801 15460 -7109 12914 -14329 -11874 -6274 46964
22051 46964 73899 19533 -440 -96401 -141261 -73157 76353 112500 12684 -56595 -65114 -49276
22039 -49276 -70653 -48548 -22572 112259 165664 234172 250541 183265 139392 87482 33667
22028 33667 112948 229162 222721 159018 80887 81764 83275 -18582 -65901 -91014 -40095 -123563
22016 -123563 -127811 -83248 53615 111548 106608 28765 56248 77361 76912 98651 88442 24592
22004 24592 36927 33648 7887 -5593 -62762 -141952 -120987 -63211 -116074 -166860 -188706 -110613
21992a10613O3897l9942m4071o327m6715r0695N3058J04227L9573N4144J3564
21981i900l4104j0845L1513Q7586l6511j09859r3881L0533Q5791k6377r754L5856
21969e9952L8022K4067K1663M0110K4755k2260P4312j5835j11117L5657K1400
21958G0822j07408l0815L0601J4906j4645n0243n4976J4240K2821P3945J29100
21947I8348L8422j51239j769k1498p1193k5025N1107Q039p1204J9822N3985j01087
21935a73292Q1493J09216q6590k8993N0959P5704n8851j26264Q0207k2894M5376
21924e3929J292M1978O0208m2391L4754j6943l8868o3961K7303M105j07510j4737
21912a68699R7078k5514k0408P1301N451k9481j5531M8820N2059j30285L3281
$$ plain form
21992 -110613 -46716 -86658 -130729 -137056 -183771 -274466 -221408 -117181 -77608 -23464 -9900
21981 -9900 -44004 -54849 -23336 64250 27739 -82120 -176001 -145468 -59677 -86054 -95808 -59952
21969 -59952 -21930 2137 23800 63910 88665 66405 140717 124882 13765 49422 70822
21958 70822 -36586 -67401 -36800 -21894 -36539 -86782 -141758 -127518 -104697 -30752 98348
21947 98348 136770 -14469 -16238 -37736 -108929 -133954 -82847 -74808 -146012 -126190 -72205 -173292
21935 -173292 -91799 17417 -69173 -98166 -47207 28497 -30354 -156618 -76411 -99305 -53929
21924 -53929 -52637 -10659 49549 7158 41912 24969 -13899 -77860 -50557 -46452 -153962 -168699
21912 -168699 -71621 -97135 -117543 -46242 -40791 -70272 -85803 -36983 15076 -115209 -81928
21901h1928L9332n3232M0830O467j5034m3095j9356M3381L0311O7887j520q3624
21889f9581k1881k2827l4680J9252R1932M1970m0273l301Q882j3234N7040j6265
21877b966K2399J2280J6153m4533j0474j14453q5490Q4469Q5348j2048L7620N8804
21865D7109J8642J053j04956l3310M6062N7236o4165n6614l637L3572m2838O3671
21853c8175k6619J4821R2515J6987l4677J01144L7236q8345j01611O407M4983
21842B4666l2853o2209K9715M8792K4985k3852P0189J14519l1964j23365n2786
21831a4163P3096m4629n8262M8737k2660k1025N2763P2646n276q9964q7672q1363
21819a77772Q639j0921J3231N2905j0536j450R107O5747L0198L9362o7226r2415
$$ plain form
21901 -81928 -42596 -95828 -54998 -48531 -63565 -106660 -126016 -82635 -52324 15563 14043 -69581
21889 -69581 -91462 -114289 -148969 -129717 -37785 4185 -36088 -39389 -30507 -43741 13299 -2966
21877 -2966 19433 31713 47866 3333 -7141 -121594 -207084 -122615 -37267 -49315 -11695 47109
21865 47109 65751 66804 -38152 -71462 -25400 31836 -32329 -88943 -92580 -59008 -101846 -38175
21853 -38175 -64794 -49973 42542 59529 24852 125996 163232 74887 -26724 -20317 24666
21842 24666 -8187 -70396 -40681 8111 33096 9244 79433 193952 161988 38623 -14163
21831 -14163 58933 14304 -43958 4779 -17881 -38906 13857 86503 81227 -8737 -96409 -177772
21819 -177772 -169133 -180054 -166823 -113918 -124454 -125904 -116797 -51050 -20852 18510 -48716 -141131
21807a41131k5073j3159L2061N6773M5768l9829k8986L3890M3535J1819J8664
21796e668N596j7253j6057K6707k0124k0146N6785N3133n7901p5900k8250O5354
21784c3724J4640o1623m9316K3298K0849J3616M0059m8801L4440J41511j3810
21773H1139o681n7966n7318n8101k8564l6690M4356K4711N3378j5756K1511j05825
21761a41806J1191O9679L2733L1425M512p911k6611r058j3534k3497k2273L5556
21749e9594R758N7039K2310k633N136l4083m3068m2567O0016K5563L5550j4051
21737A9376o498O309M4811N2793M910M1242K1623N759N5683l2985o8967n4811
21725H9245j06653r368N5127j02241r9737l3490j7232Q4058J03753L4098j35189
$$ plain form
21807 -141131 -166204 -179363 -147302 -90529 -44761 -84590 -113576 -79686 -36151 -24332 -5668
21796 -5668 -72 -17325 -33382 -6675 -26799 -46945 9840 62973 5072 -70828 -99078 -33724
21784 -33724 -19084 -80707 -130023 -106725 -85876 -72260 -32201 -81002 -46562 94949 81139
21773 81139 74458 16492 -40826 -98927 -127491 -164181 -119825 -95114 -41736 -57492 -35981 -141806
21761 -141806 -130615 -60936 -28203 3222 7734 -177 -26788 -35846 -49380 -72877 -95150 -59594
21749 -59594 -49836 7203 29513 26880 32016 -2067 -45135 -87702 -27686 -2123 33427 19376
21737 19376 12878 19187 63998 116791 121701 162943 184566 190325 246008 213023 144056 89245
21725 89245 -17408 -26776 28351 -73890 -173627 -207117 -224349 -140291 -36538 -2440 -137629
21714a37629j9752j3219M9216O4825O5823n4526r6636k3600M2264O2759j13802
21703a74277n8034P3617Q2270j7823J2366Q923J18923P9598l411l9520n7414m5211
21691a9993k2267m1385q3380k5829j702N2760L9687N1769M8929l3005m7690o8640
21679a50746M2281J62613R3530j00239J6351q648r4500J9111n0562N635R7686
21668C2512J7630L2942K4101m8352n9988j05802l1757M3633O4737R0252n879k2624
21656C1405j7462O1100K9538k7016o0575m4741J2616N4951q5382n2222K4378M9027
21644b4383J1469K6061J2423L642n1929j3786K0005M9048N3766l8182m6493k3315
21632b1674p2338J762M4040N3774j03009l7761R5478M5016P621J1541M0484j26974
$$ plain form
21714 -137629 -157381 -170600 -121384 -56559 9264 -45262 -141898 -165498 -123234 -60475 -174277
21703 -174277 -232311 -158694 -76424 -94247 -81881 -72958 45965 125563 122152 82632 25218 -19993
21691 -19993 -42260 -83645 -167025 -192854 -194556 -141796 -102109 -50340 -1411 -34416 -82106 -150746
21679 -150746 -108465 54148 147678 47439 63790 55142 -39358 -20247 -70809 -65174 32512
21668 32512 50142 83084 107185 58833 -1155 -106957 -138714 -95081 -30344 59908 54029 31405
21656 31405 13943 75043 104581 77565 16990 -27751 -15135 39816 -45566 -97788 -73410 -24383
21644 -24383 -12914 13147 25570 29212 -22717 -36503 -16498 32550 86316 48134 1641 -21674
21632 -21674 -94012 -92250 -48210 5564 -97445 -135206 -39728 5288 12909 24450 64934 -62040
21620f2040l5893N9499M7394k9660j4750L3842j9895n541N7768Q9645K7644n3760
21608I4253q8979q5499Q1874N0533j07473l6498j6335r17j1654R745J09097R8941
21596I7088n0663M4690J4369m1589k8828k4407J302L9626L0257J5593Q75P160
21584A05473R542q0306k1419n2381r8114l5057J7500J35473j3451q6132m023L1492
21572i1403J4202L4191L6850j1951J7407n198l0142l7624l4018k3455j495J13066
21560a9570L3945l0611j1137j6320k1696l6202k1593P111J40648Q1701K4767m7750
21548H3293j33973l4916J4510k3658J3865P5267Q3068m0024j3193K7873Q92o8080
21536a5076r690m2422o2394Q3069j4944j94N6939J5100p5898p9570q0304k8011
$$ plain form
21620 -62040 -97933 -38434 8960 -20700 -35450 -1608 -21503 -27044 30724 120369 148013 94253
21608 94253 5274 -80225 1649 52182 -55291 -91789 -108124 -109041 -120695 -110950 -1853 97088
21596 97088 46425 91115 105484 63895 35067 10660 11962 51588 81845 97438 98313 105473
21584 105473 115015 34709 13290 -39091 -137205 -172262 -154762 -19289 -32740 -118872 -122895 -91403
21572 -91403 -77201 -43010 -6160 -18111 -704 -5902 -36044 -73668 -107686 -131141 -132636 -19570
21560 -19570 14375 -16236 -27373 -43693 -65389 -101591 -123184 -116073 24575 106276 131043 83293
21548 83293 -50680 -85596 -71086 -94744 -80879 -5612 77456 37432 24239 52112 53004 -15076
21536 -15076 -24766 -67188 -129582 -46513 -61457 -61651 -4712 10388 -65510 -145080 -225384 -253395
21524b53395K3325L0034J69145J9918K9799n054j38517m924J05386J4488o9861
21513g9656j976O4019J13295K726m8558m2583M7531M1394o8774n9371N972m1871
21501f7852M2845R5721p9594o7048q718r721p829M4679L376m9354P3266l844k7049
21488f1122j0678k8027N0918P9137q009K8629n960M4189J4621j49365n4681M3338
21476e7010P4742k0383r749K516L3272P1898P6681p0678q2253M1257n0000p5222
21464f4929p218r835M0160p7552j5907R833L5170N7953k0905K0234M9974M0109
21452E7087o6016n0968p572o776K0090J5260K4117M4632p0441r0574m7352J9856
21440a58657M8068m5256M993N5292L6269m6725K9935M3288qq448q015m9978m0781
$$ plain form
21524 -253395 -230070 -200036 -30891 -10973 18826 13772 -124745 -129669 -24283 -9795 -79656
21513 -79656 -81632 -17613 95682 98408 49850 7267 54798 96192 27418 -31953 -25981 -67852
21501 -67852 -25007 70714 -8880 -75928 -84646 -94367 -102196 -57517 -54141 -103495 -30229 -34073 -61122
21488 -61122 -71800 -99827 -48909 30228 22219 50848 44888 89077 103698 -45667 -100348 -57010
21476 -57010 17732 -2651 -12400 -9884 23388 95286 171967 101289 19036 60293 10293 -64929
21464 -64929 -72147 -81982 -41822 -119374 -135281 -125448 -90278 -32325 -53230 -32996 16978 57087
21452 57087 -8929 -59897 -67469 -74245 -54155 -38895 -14778 29854 -40587 -131161 -178513 -158657
21440 -158657 -110589 -155845 -150852 -95560 -59291 -106016 -76081 -32793 -32801 -41249 -49264 -99242 -140023
21427a40023P4951N0827k4598l628p2237M0177N7735N0053k319m1573L7503L1630
21415E8498q7708p0910p9037M9772O3076O459N510K7191M1573M4369J4760m6808
21403B6745n1075q3728N5382J244m9439l3939L5996L439M3475L1434K5188j740
21391B982K8298K5843q3330k8506K370j916j5243m8449Q5965J3006k7544K1817
21379b4707P0571p6136j54393P0144R0373j3516J02931r552l6260q9833n7334
21368a27712L0453P4325j3639n4131J909K9285N956R938Q7112j1884l3171p0556
21356g2115j18576p145J21134N4896n4057J9704m4084n6271k1257J2949P1535
21345i3287R4355N378q9105k6286O4698l9163k1360J17475R1169K4418R337J9668
$$ plain form
21427 -140023 -65072 -14245 -38843 -42471 -114708 -74531 -16796 33257 30938 -10635 26868 58498
21415 58498 -29210 -100120 -179157 -129385 -66309 -59850 -54340 -27149 14424 58793 73553 26745
21403 26745 -24330 -108058 -52676 -51432 -100871 -134810 -98814 -95375 -51900 -20466 4722 2982
21391 2982 31280 57123 -26207 -54713 -52343 -54259 -69502 -117951 -31986 -18980 -46524 -24707
21379 -24707 45864 -30272 -184665 -114521 -24148 -37664 65267 55715 19455 -70378 -127712
21368 -127712 -97259 -22934 -36573 -90704 -88795 -59510 -53554 -43616 43496 31612 -1559 -72115
21356 -72115 -190691 -197836 -76702 -21806 -75863 -56159 -100243 -156514 -177771 -164822 -93287
21345 -93287 1068 6446 -82659 -108945 -44247 -83410 -104770 12705 103874 128292 137629 157297
21333A57297o1337o5158o191j13209K5910M9814q3660j6824N9972P0702J663N394
21321B4373k3374n4517j2245J3004r571J33136K0520K0012k4942k3912r7549j03036
21309a38101r266N2251R0687L6343J9157l6485m6746J2490M5957K2790m3887r6112
21297i0922m6661o4395L3318O7551J17766M1716J87n5857j6720k2020M5049P5699
21285H4711k3840J5670o852n5385m5499J4103K4148o3835l1382j5903l9647O8808
21273g4903J05090k0435j5721m5227O7056J0294Q097j2810R437m07J856m3573
21261a1246N522M1682n0857R927k0471K5501M2903q5631p6005J9898j2774O804
21249a04747k5820M9241K8293l5035K1825M8368M648o3372N342j2230m97l9376
$$ plain form
21333 157297 95960 30802 24611 -88598 -62688 -12874 -96534 -113358 -53386 17316 18979 24373
21321 24373 999 -53518 -65763 -52759 -62330 70806 91326 111338 86396 62484 -35065 -138101
21309 -138101 -147367 -95116 -4429 31914 51071 14586 -32160 -19670 26287 49077 5190 -90922
21297 -90922 -137583 -201978 -168660 -101109 16657 58373 58560 2703 -14017 -36037 9012 84711
21285 84711 60871 76541 69689 14304 -31195 -17092 7056 -56779 -88161 -104064 -143711 -74903
21273 -74903 30187 9752 -5969 -51196 15860 26154 34251 21441 30878 30471 32327 -11246
21261 -11246 -5724 35958 -14899 -4972 -25443 58 42961 -42670 -118675 -98777 -111551 -104747
21249 -104747 -130567 -81326 -53033 -88068 -66243 -17875 -13227 -76599 -71257 -83487 -83984 -123360
21237a23360J05819K1200L6860j02035j3570N8199q398o6115K8033J7937k5280
21226g0710m6295k0165K6245K9188O4107P5081l310l3997J5255J11056L3149j38866
21214D0738j35130l7770k0342j3473J12185N5807o8611l8731k0562J27008L8443
21203C9562n5096Q945o5473p2299l2319J1429O4775K8440m4651j16326o9294j4807
21191c17114J1220J25348J17862N0698M90j2q7936o6090k3159P2084J38027m1959
21179b0541J1299m1729o1627K572O8657J06652P4906o2600j18733j5168m8500
21168a04812M812L9566K5064j9317n313N0849K7805o0961L631L379O2601p1557
21156d4253K8270M833K091M1755J573M0183m7352o1154r9876L9243L7141P6791
$$ plain form
21237 -123360 -17541 3659 40519 -61516 -75086 -16887 -25285 -91400 -63367 -45430 -70710
21226 -70710 -117005 -137170 -110925 -81737 -17630 57451 54141 20144 35399 146455 179604 40738
21214 40738 -94392 -132162 -152504 -165977 -53792 2015 -66596 -105327 -125889 1119 39562
21203 39562 -15534 -6589 -72062 -144361 -176680 -165251 -100476 -72036 -116687 -233013 -302307 -317114
21191 -317114 -305894 -180546 -62684 -11986 -11496 -11508 -99444 -165534 -188693 -116609 21418 -20541
21179 -20541 -9242 -50971 -112598 -110026 -41369 65283 140189 77589 -41144 -56312 -104812
21168 -104812 -100000 -60434 -35370 -54687 -60000 -9151 18654 -42307 -38676 -35297 27304 -44253
21156 -44253 -15983 -11150 -9059 32696 34269 74452 27100 -34054 -133930 -94687 -57546 19245
21144A9245k4740L626p951L5122O867m8600M0976P0056k7257l6147j2343m3361
21132b4507M283n919K6521J7093m1114j4063k2310K1469M0563K1955J8825o7307
21120b4511j5337O8882Q790J2036M9089M4006o4758o4924J342n1122j22854o994
21108a66355k3059J8813N1541P182L3218p4237J10761Q0204o3722l2785Q6382
21097B7943K8399q650m0128o3529N0191n6525p2966L8404O4857j173j47947l651
21085a84775J72346R4366n304j5688K082l1998j2927n9756k0013O7910P539q3842
21073g0060l6912K6902J9286L8596l2849J8865L3967m4620K3063L3813J3654M1855
21061F5560j1581Q056j0508j06329o8367l553P846j2495k3463J08317J25605J9108
$$ plain form
21144 19245 -5495 -1869 -9820 25302 32169 -16431 24545 94601 67344 31197 18854 -24507
21132 -24507 -20224 -26143 378 17471 -23643 -37706 -60016 -38547 2016 23971 42796 -24511
21120 -24511 -39848 29034 37824 49860 98949 142955 78197 13273 14615 -36507 -159361 -166355
21108 -166355 -189414 -170601 -119060 -111878 -78660 -152897 -42136 38068 -25654 -58439 27943
21097 27943 56342 47692 7564 -55965 -5774 -62299 -135265 -96861 -32004 -33177 -181124 -184775
21085 -184775 -12429 81937 76633 60945 63027 31029 18102 -41654 -61667 6243 13782 -70060
21073 -70060 -106972 -80070 -60784 -22188 -55037 -36172 -2205 -46825 -23762 10051 23705 65560
21061 65560 53979 62035 51527 -54802 -123169 -126722 -118876 -131371 -154834 -46517 79088 98196
21049I8196j8675j41216p8654R515Q1623K1085K1662j8325m0207k6598k6088Q9645
21037b8037O8818k4281O382K273N926l5878K316o480P3328K456m1208j36118L6222
21024g4281L4092N4149r6294P1477k8734m6885k7545Q5149M7661k1016J0503K3156
21012C1432O0500k3779N7313k4936o907m3063q302k9396j04215O3880L784o7675
21000i1364N2490j4681j8810n5886N1675O0607L223J6532K1393k4973o6278j8701
20988h4773n164O2853N1015O0601R622l8088n0828r2548q5532K3965Q8298O8612
20976H033l3469M9762J13144n3863j23837M556J06473p395o2957j8006n6782M6395
20964b7946Q5090p9213k6005J8161Q1910R1936N221l5620j6109O5427J3361o1679
$$ plain form
21049 98196 79521 -61695 -140349 -130834 -49211 -28126 -6464 -24789 -64996 -91594 -117682 -28037
21037 -28037 40781 16500 22882 25155 31081 -4797 -2481 -8961 64367 66823 25615 -110503 -74281
21024 -74281 -40189 13960 -82334 -10857 -39591 -86476 -114021 -28872 18789 -2227 8276 31432
21012 31432 91932 68153 125466 100530 93623 50560 42258 12862 -91353 -27473 -23689 -91364
21000 -91364 -38874 -53555 -72365 -128251 -76576 -15969 -12746 3786 25179 206 -66072 -84773
20988 -84773 -89937 -27084 23931 84532 94154 56066 5238 -87310 -172842 -148877 -60579 8033
20976 8033 -25436 24326 137470 83607 -40230 -35674 70799 63404 447 -17559 -74341 -27946
20964 -27946 57144 -22069 -48074 -29913 51997 143933 149154 113534 97425 162852 176213 114534
20952A14534j11728j5867m3698o5898K748K8072j7502l6805J20230R6477K9479
20941A00042r4553o6283r9726j23368k1925J60711J65899L0105r2518P0187P3116
20930A01687q2107p7506n8121J04867J5768q3594n0220L8216O3507J5883L3587
20919B1967L4463Q0308J2647r9818J34j043j0634L8282j43087m0797R2854K0068
20907E344J426n9356r455p411K6285m8728O7432l4522j07818R0923P7219K8234
20895B9573l2834L904j472j2014k5364K6868K4985r6800o1167r829j6755k5540
20883a96445L7212K9392L2358O3397o767o4961J0611O6253L707j489K3722J7051
20871A4041o8775o3369K9141P2410L9186J9542p1000o3995k0809O5658j7947m6548
$$ plain form
20952 114534 2806 -13061 -56759 -122657 -119909 -91837 -109339 -146144 -25914 70563 100042
20941 100042 5489 -60794 -160520 -283888 -305813 -145102 20797 50902 -41616 28571 101687
20930 101687 19580 -57926 -116047 -11180 4588 -79006 -129226 -91010 -27503 -11620 21967
20919 21967 56430 136738 149385 49567 49701 48658 38024 76306 -66781 -107578 -14724 5344
20907 5344 6770 -52586 -62041 -69452 -43167 -91895 -24463 -58985 -166803 -75880 1339 29573
20895 29573 -3261 643 -829 -12843 -38207 -11339 13646 -83154 -144321 -154150 -170905 -196445
20883 -196445 -159233 -129841 -97483 -34086 -40853 -105814 -95203 -28950 -25243 -26732 -3010 14041
20871 14041 -54734 -118103 -88962 -16552 22634 42176 -28824 -92819 -113628 -47970 -65917 -112465
20859a12465K5918Q1263L7676K708l5711k2498q4164l4843R875k0594O4610J00076
20847A1851K5195K7975j3329j3395J2945P357o8448K7984K6010q6113l1407P7778
20835D403L9697Q292P7196p5423q1820j806n63M171P7448N1312m5769j4150P9946
20822A22934q6674o6970j4376L4186M2018K4374o2315K1898j9943O2874m776r9532
20810d6302Q378J2321k272J0046p1317o830K8958N1980J529J2676n580n2013M5273
20797a3153N4286J8652o8854l4537m3106J14837O0197M5614j03311l9244K3100
20786A4481K4625R3058O96j7345l5104L1072p9742q7010J2462O8723j2824n9541
20774d6449k8600Q413l9134K785l5921m1021K5365j2513Q5598r20Q1051O0392
$$ plain form
20859 -112465 -86547 -5284 32392 35100 -611 -23109 -107273 -142116 -132241 -152835 -88225 11851
20847 11851 37046 65021 51692 38297 51242 58599 -9849 18135 44145 -41968 -73375 4403
20835 4403 44100 52392 129588 54165 -27655 -29461 -30024 -25853 51595 102907 57138 42988 122934
20822 122934 36260 -30710 -45086 -10900 31118 55492 -6823 15075 -4868 58006 53230 -46302
20810 -46302 -37924 -25603 -27875 -17829 -89146 -95976 -67018 -15038 -13509 -833 -6413 -58426 -13153
20797 -13153 41133 59785 -9069 -43606 -86712 28125 88322 133936 30625 -8619 14481
20786 14481 39106 132164 132860 115515 80411 111483 31741 -55269 -42807 25916 13092 -46449
20774 -46449 -75049 -66636 -105770 -102985 -138906 -179927 -154562 -167075 -81477 -82397 -1346 59046
20762E9046k4132M7832n0898p8895j4812J4062K1082K1099L3370j1558M7840K5788
20750H9824N8573q3017o2074j156k7609Q662j3171j772m5081P779l010n2474r8878
20737b23404M232L7568J1269n606J17288R6818M1925k0382o6363r5154r724M2001
20725f9532m0547M7074J7244k132N3390j6733q8180Q1493L8893j2214m1752L5391
20713B395l0431M7759M5802j08652o145m257n466N378j7679q9357n2048N0975
20701a61726L3956k7747O0743P5896l3238m3758m0324k2349M7431L287J4078j001
20689i4752L9311j7320O6160k0754l1737M1355K1777Q5909K5360k0886N3717j09674
20677C8466p0110p5729j6813K6156J03556R7005p4798m6331J8944J3373j1302
$$ plain form
20762 59046 34914 82746 31848 -47047 -61859 -47797 -26715 -5616 27754 16196 64036 89824
20750 89824 148397 65380 3306 2150 -25459 -16797 -29968 -31740 -76821 -69042 -72052 -124526 -223404
20737 -223404 -219172 -181604 -170335 -175941 -58653 38165 80090 59708 -6655 -101809 -111533 -69532
20725 -69532 -110079 -63005 -45761 -47893 5497 -11236 -99416 -17923 20970 8756 -32996 2395
20713 2395 -28036 19723 65525 -43127 -49272 -53529 -58995 -53617 -71296 -160653 -212701 -161726
20701 -161726 -127770 -155517 -94774 -18878 -52116 -95874 -136198 -158547 -111116 -107829 -93751 -94752
20689 -94752 -55441 -72761 -6601 -27355 -59092 -17737 4040 89949 115309 94423 148140 38466
20677 38466 -31644 -107373 -124186 -98030 5526 102531 27733 -18598 346 13719 2417
20666B417P655J3835L9487m0940J424k1244k2734m5418N2366J6099M1518N3927
20654I8392K0239j8245p4778m960M6361k7612p4309N134m5407K7368N5312l0536
20642b3041r3535J537M5998P4589K5568K7076o4357n2654j6288P1068q674o6892
20630g9605l4091K6811L733K1834q5068n2140O4921K6284O1167M1492L9227k946
20618C1619l6680q5452q7505n9354J17971J47162M1847l3035m8490k2976K2202
20607a2691K3218l165N6887m0819J8814L8363j10994j30283k1527N5365P1109
20596e5723M8547o0221j7217K5198M9985k371m6196n2822L9695J07545K5020M9872
20584A11312O4292m2051k1285n5733r5106n9737m6889m0352J933N0510n3607N1649
$$ plain form
20666 2417 10072 23907 63394 22454 23878 2634 -20100 -65518 -13152 2947 44465 98392
20654 98392 118631 100386 25608 20648 67009 39397 -34912 -29778 -75185 -47817 7495 -23041
20642 -23041 -116576 -115039 -69041 5548 31116 58192 -6165 -58819 -75107 -4039 -12713 -79605
20630 -79605 -113696 -86885 -83152 -61318 -146386 -198526 -133605 -107321 -46154 -4662 34565 31619
20618 31619 -5061 -90513 -178018 -237372 -119401 27761 69608 36573 -11917 -34893 -12691
20607 -12691 10527 7362 64249 23430 42244 80607 -30387 -160670 -182197 -126832 -55723
20596 -55723 -7176 -67397 -84614 -59416 -9431 -11802 -57998 -110820 -71125 36420 61440 111312
20584 111312 175604 133553 112268 56535 -38571 -98308 -145197 -185549 -183616 -133106 -186713 -135064
20572a35064Q4337J9565j5928m6008j2751J1416N4997P2167j9574J57L7692J8300
20560F9306m8324o0041M0049L4053l0891O8475j2640q7823m9839K7004Q4437L6386
20548G0152m2347n1150n4931o5834n3330m1144N2745J33622Q7738L6614l0602
20537D1533K1530L4528j3033k4203q209J3189j6423m7006r9435N3924O3951k2207
20525a861p0686j7883M5960M0304q0389k8023L806N1622N1196O0969L1814j18887
20513c2058J2247J67140N3575L9543K7487p0285p2039k5548J7401n6734q1390
20502b0661K9256P4218L9288r0556r6217N853J0575N895J7054j7972J8690R4197
20490F9620O6154Q586o3116N4775n4669k6445m1336J9695o179o6555o0174J6126
$$ plain form
20572 -135064 -50727 -31162 -47090 -93098 -105849 -94433 -39436 32731 13157 13314 51006 69306
20560 69306 20982 -39059 990 35043 4152 72627 59987 -27836 -77675 -50671 33766 70152
20548 70152 27805 -23345 -78276 -144110 -197440 -238584 -185839 -52217 35521 72135 41533
20537 41533 63063 97591 84558 60355 52146 65335 48912 1906 -97529 -43605 20346 -1861
20525 -1861 -72547 -90430 -44470 -4166 -84555 -112578 -108772 -57150 -5954 55015 86829 -32058
20513 -32058 -19811 147329 200904 240447 267934 197649 125610 100062 117463 60729 -20661
20502 -20661 8595 82813 122101 31545 -64672 -58819 -48244 -42349 -25295 -43267 -24577 69620
20490 69620 135774 144360 81244 136019 81350 54905 13569 33264 27085 -39470 -99644 -83518
20478h3518J02588L739J3850q6497J72N5518P481j0968j1661L823l3399k1589
20466f0461L8412L0717P3491q188L8112J8920q1234j33495j9376Q4133O1068l1740
20454A0359L0955k8016l5654j2764j992k6418n4591K3183J7336K1733O6521L9218
20442D9870J2075p7487k7934K7427N2017o5029m8202P3836R0962Q164p784o6163
20430B1752m9750L3369K8291J0976M2555J403M1147K1581J7819N759j10483j12223
20418d7804k8034K9090n574L5596P5779O2084l2870q2049L827L1447l6858m0180
20406c5546L1406M414j03045l936R1758M328k8070Q399k0228R056p3815J9896
20394i5383K8377M2989K4172o815m3874o4742K8911O0761N82p4532M0783M3895
$$ plain form
20478 -83518 19070 22809 36659 -49838 -49666 5852 13333 2365 -9296 -5473 -38872 -60461
20466 -60461 -22049 8668 82159 73971 112083 131003 49769 -83726 -103102 -18969 42099 10359
20454 10359 41314 13298 -22356 -35120 -37112 -63530 -118121 -94938 -77602 -55869 10652 49870
20442 49870 61945 -15542 -43476 -16049 35968 -29061 -77263 -3427 87535 95699 87915 21752
20430 21752 -27998 5371 33662 44638 87193 88596 129743 151324 169143 174902 64419 -47804
20418 -47804 -75838 -46748 -52322 -16726 59053 121137 88267 6218 10045 41492 4634 -35546
20406 -35546 -4140 274 -102771 -106707 -14949 -10621 -38691 -30292 -50520 -41464 -115279 -95383
20394 -95383 -67006 -24017 155 -6660 -50534 -115276 -86365 -25604 -25022 -99554 -58771 -14876
20382a4876K7219O6706p2854j24420N5143J03042O5151k6286j1397j9093Q2945
20371A31280n1139j79480J4216R9076K2509j4757J1380R3432m6590n2976m1877
20360a4926R3073R208m9471n9215q6520o1665O093N3991J11261n1307m4209J14591
20348B0904J01173K4426p1340j06169L2076K230k7676K8337o3436l6440l900n8537
20336a58352M0627L3655M3136J08582k0762p0676r2659N7586M5375j10895k2937
20325a47320j9250j6059L2539Q6998L7160Q1864L5255n9830o2414j9801P2033
20314B1175O9920M1694k368o8047m2436m4291l70K7795J1877M9304l2305q3719
20302e1771k400j5919N409o1779M3971J64858J9572M0248L1163j0368m3819o4516
$$ plain form
20382 -14876 12343 79049 6195 -118225 -63082 39960 105111 78825 67428 48335 131280
20371 131280 80141 -99339 -85123 13953 36462 21705 33085 126517 79927 26951 -14926
20360 -14926 78147 87355 37884 -21331 -107851 -169516 -163423 -109432 1829 -49478 -93687 20904
20348 20904 122077 146503 75163 -31006 1070 3300 -24376 3961 -59475 -95915 -99815 -158352
20336 -158352 -117725 -84070 -40934 67648 46886 -23790 -116449 -58863 -13488 -124383 -147320
20325 -147320 -166570 -182629 -150090 -63092 -25932 55932 91187 31357 -31057 -50858 21175
20314 21175 91095 132789 130421 62374 19938 -24353 -24723 3072 14949 64253 31948 -51771
20302 -51771 -54171 -70090 -64681 -126460 -82489 82369 101941 142189 173352 162984 119165 54649
20290E4649j6381M231j2947K5891q8680j22611p164M3689K0320j720N3529L7216
20278i978J0851n6975l2934J2490K9359J2067j5653M7538L0726m492l1937L4272
20266B5334N8770j8076l9075p4020n3459M3863J4064q617J1222l0412O5820j1853
20254a6439p4493J6445j3847R74m868K1109o1006K0450k7265J1047J47738N7058
20242G6903l8157J04174j2584k6074o0169q788M5633p1869p9125O962k268k5041
20230i0403j5008P4561m1364l7605N651N0222l9313l6546R5115R3750k7115n6346
20218b4401m6367J5802k5661l9931k0301j5802J1386N9908r908o5012j1310N8715
20206a12882j7372m9847Q7241K7929L755j0783m8463J4899J29235l4720j09559
$$ plain form
20290 54649 38268 42499 29552 55443 -33237 -155848 -163012 -119323 -99003 -100723 -47194 -9978
20278 -9978 873 -56102 -89036 -76546 -47187 -35120 -50773 -3235 27491 22999 -8938 25334
20266 25334 84104 66028 26953 -47067 -100526 -56663 -42599 -51216 -39994 -70406 -4586 -16439
20254 -16439 -90932 -74487 -88334 -87360 -92228 -71119 -132125 -111675 -138940 -127893 19845 76903
20242 76903 38746 142920 130336 104262 44093 35305 80938 9069 -70056 -63094 -65362 -90403
20230 -90403 -105411 -30850 -72214 -109819 -104168 -53946 -93259 -129805 -34690 59060 31945 -24401
20218 -24401 -70768 -54966 -80627 -120558 -140859 -156661 -145275 -85367 -95275 -160287 -171597 -112882
20206 -112882 -130254 -180101 -92860 -64931 -61176 -71959 -120422 -105523 23712 -11008 -120567
20195a20567J3442M8472r926k3016K2674J4746K3610k0287J9140Q5495M9860L9587
20183A43230n6199k948K4639j0563p2357l6473q7269N6673M5934J20018r074p9039
20171C6572j14386n3670n2377l3522Q3125N6296Q9100M3343k1136R623N1038j0142
20159H3864l6585l2230M4409l6619m9232p0428N2369L9257L8839l8034p1358K6767
20147d8981k459j7580Q0469O2418J1675k7680n681J0032l0273m1587n7668k2958
20135i0273J7091Q4840J07842J2501j9757l3557j02887j14744l5299L2672O5938
20124g5633R1803O8600M0556r664o142k6951j06286m4343O9472O3199o9949K6038
20112B0700J8453J0259l7871p2286M1919P7701j2399L2464J4652j2755n478M1043
$$ plain form
20195 -120567 -107125 -58653 -68579 -91595 -68921 -54175 -30565 -50852 -31712 53783 103643 143230
20183 143230 87031 84083 108722 98159 25802 -10671 -97940 -41267 4667 124685 115611 36572
20171 36572 -77814 -131484 -183861 -217383 -134258 -77962 11138 54481 33345 42968 94006 83864
20159 83864 47279 15049 59458 22839 -26393 -96821 -44452 -5195 33644 -4390 -75748 -48981
20147 -48981 -51440 -69020 11449 73867 85542 57862 52181 62213 31940 -9647 -67315 -90273
20135 -90273 -73182 11658 119500 132001 112244 78687 -24200 -138944 -174243 -141571 -75633
20124 -75633 16170 84770 125326 115662 109520 82569 -23717 -68060 1412 64611 -5338 20700
20112 20700 39153 49412 11541 -60745 -18826 58875 46476 78940 93592 80837 75359 116402
20100A16402m2165l7411L7061k1496p1800l2488n2884j4552O0098N6026O048M9726
20088E2565q283n4991N7330L9762N012J1681M2858N4080l9325p5390o7628M5642
20076F3313r1005o8403j389J04415K4602P09J1896o3938m0938p3912K6210Q8146
20064b0294N4993J3996L2288L0027q7176j2846M467N6097k670n4760r6912j9343
20052a02133O5842P2703M2654p0108n3740M6476K0613m7726o710q8686L8922K1189
20040f0704q3270K3554L9661l1125k0942p4684J9241P6723O3784j4330J3804L2922
20028a5366K338K4964N4178K1229r580j19542p4138J8458J3697J8164J37583M2770
20016A14755j1978p582M377M824n4502p6168K4531n4999k9030j8700l2562J4664
$$ plain form
20100 116402 74237 36826 73887 52391 -19409 -51897 -104781 -119333 -59235 -3209 2839 52565
20088 52565 44282 -10709 46621 86383 91395 103076 145934 200014 160689 85299 17671 63313
20076 63313 -27692 -96095 -97484 6931 31533 32242 44138 -19800 -60738 -134650 -108440 -20294
20064 -20294 34699 48695 80983 111010 23834 10988 15455 71552 68882 14122 -82790 -102133
20052 -102133 -36291 36412 79066 8958 -44782 1694 22307 -25419 -32129 -120815 -81893 -60704
20040 -60704 -143974 -120420 -80759 -111884 -132826 -207510 -188269 -111546 -47762 -62092 -48288 -15366
20028 -15366 -13028 11936 66114 87343 77763 -41779 -115917 -97459 -83762 -65598 71985 114755
20016 114755 102777 95195 99572 104396 49894 -26274 -1743 -56742 -85772 -104472 -137034 -122370
20004a22370N5228m5690J4185L3408p5139M8804M7104o2855L5080Q6668Q7134
19993A01557o7836p1348j43500L0489N7424j5762M7085Q2357J6437L3168j2007
19982E8064j3656j8603k1526m7888n8437r884K1600L6335p2700L3441O7352N9101
19970C3199m6863l1732l8585J4469M5342j9889M0832l117j0543m132n3216r935
19958h4170M729L2457L3652k3274o2261m3150M9067L0755O1146k0744O5829m7908
19946c872l0937n2949P7931M4759K7593O1511m9145l4811J183L5043l2773n6958
19934a3425L1439J3342n640J7040n4208L812l50m0928n919J430K250r087m9740
19921a09984O719K1080O9072m1973k8009m0274M6715R6552j2715m0636J4570P2824
$$ plain form
20004 -122370 -67142 -112832 -98647 -65239 -140378 -91574 -44470 -107325 -72245 14423 101557
19993 101557 33721 -37627 -181127 -150638 -93214 -108976 -61891 20466 36903 70071 58064
19982 58064 44408 25805 4279 -43609 -102046 -111930 -90330 -53995 -126695 -93254 -25902 33199
19970 33199 -13664 -45396 -83981 -69512 -24170 -44059 -3227 -6344 -16887 -21019 -74235 -84170
19958 -84170 -79441 -46984 -13332 -36606 -98867 -142017 -92950 -62195 -1049 -21793 44036 -3872
19946 -3872 -34809 -87758 -9827 34932 62525 124036 74891 40080 41263 76306 43533 -13425
19934 -13425 18014 31356 25716 42756 -11452 -7640 -7990 -48918 -54837 -53407 -51157 -60244 -109984
19921 -109984 -103265 -82185 -13113 -55086 -83095 -123369 -76654 19898 7183 -33453 -18883 53941
19909E3941O1290l4821m3438K5641K4206n2564j9386j2975q001k8202p090M7757
19897F358j6131L947n4107l7037j9803O6727M8200N6648L0525K90K3089K347r9948
19884A1105j60640J483N5326J4558m0497K7658N4356M9396O8325k9165m7348n0354
19872d5797k2906o62N9402J7663J6012j8874m9148M2734K7794o7944k7393N5182
19860a3937N621k3327p785Q1393J650N1146k9818k0241J3514K2163k8134l056
19848D9189o0180l8779K5834K8487r8985l1745O5540J04688R3921j7412L2543
19837A53101n5017l2677q6677j36917j24236M0844P8160J28346J06058P8759q779
19826A40965l5053o7868n9861M989P3896K1241J6221J2186L7691M5655p9469j08198
$$ plain form
19909 53941 115231 80410 36972 62613 86819 34255 14869 1894 -6107 -34309 -41399 6358
19897 6358 -9773 -5826 -59933 -96970 -116773 -50046 -1846 54802 85327 85617 108706 111053 11105
19884 11105 -149535 -148052 -92726 -78168 -118665 -91007 -36651 12745 81070 51905 4557 -45797
19872 -45797 -68703 -69365 -9963 7700 23712 4838 -44310 -1576 26218 -41726 -69119 -13937
19860 -13937 -8316 -31643 -39428 41965 43615 94761 64943 44702 58216 80379 52245 49189
19848 49189 -10991 -49770 -23936 4551 -94434 -126179 -60639 44049 137970 120558 153101
19837 153101 98084 65407 -21270 -158187 -282423 -241579 -163419 -35073 70985 149744 140965
19826 140965 105912 38044 -21817 -16828 57068 78309 94530 106716 144407 190062 110593 2395
19814B395l8036O2364J25129p5079j39328l5634j3960q712k2056N5013J03088
19803A5184l5007O513M7001O473m0707r2008M3888K1316m5542k032o711o4454
19791a46086P9096K0263N180R6717N5911M3845L1930l3718l8318n8337l0444L3522
19779E9561L3822J1360r8970r049L0848M3790o0805J5185M7436J9611Q6784n8340
19767A21233j5139J0837j35388K6276N8943j7126Q7116p7362j68526n0641J6360
19756a43417Q457N859M6525J9746R647J5037j7924J9206Q837l2796N462M7166
19744h195M7063N3629k7074q0086N0891m0490n5493L9281J6393m7443M3169N485
19732b870O0674J467o4981p354L276K4043j6175r3232m4365N8643J00654P2442
$$ plain form
19814 2395 -35641 26723 151852 76773 -62555 -98189 -112149 -120861 -142917 -87904 15184
19803 15184 -19823 -13310 33691 40164 -543 -92551 -48663 -27347 -72889 -74921 -81632 -146086
19791 -146086 -66990 -46727 -41547 55170 111081 154926 186856 153138 114820 56483 26039 59561
19779 59561 93383 104743 5773 -3276 27572 71362 10557 25742 73178 92789 179573 121233
19767 121233 106094 116931 -18457 7819 66762 49636 136752 59390 -109136 -159777 -143417
19756 -143417 -134960 -129101 -82576 -62830 -53183 -38146 -56070 -36864 -28027 -60823 -55361 -8195
19744 -8195 38868 92497 65423 -14663 36228 -4262 -59755 -20474 -4081 -51524 -8355 -2870
19732 -2870 57804 59271 -5710 -13064 -9788 14255 -1920 -95152 -139517 -80874 19780 92222
19720I2222Q6734r754J0293J2379J1475j41795j08637J7970m4l8919K6792Q698
19708c2586l3756l4893K407M7901K8252M2828K2579J813P7957J546m9491o6897
19696G660M6421o041n3036l5996M6520K6927j3252O0717M9373l2729p6882k965
19684A6717j6214J8545m7344M4468M5075k5125Q691J23925j8979k8559J8682m3197
19672I6685n2838p5055l1386J67591K8820p8323p9955k0830l6400l4499r608J6440
19660a09358M9049Q6394l3424P607o2232J257n4382o2179j6842R0597Q6356O8187
19648E1030L5083J2566o4162r3175r528J6414L0277P4002P2679P905n1732n1728
19636B9631p2694m3050k5773l8876N9888O6790k2374l0090K9434K1042K9486J3138
$$ plain form
19720 92222 178956 169202 179495 191874 203349 61554 -47083 -29113 -29157 -68076 -41284 -32586
19708 -32586 -66342 -101235 -98828 -50927 -22675 20153 42732 44545 122502 124048 74557 7660
19696 7660 54081 48040 -4996 -40992 5528 32455 19203 79920 129293 96564 19682 16717
19684 16717 503 19048 -28296 16172 61247 36122 44813 168738 149759 121200 139882 96685
19672 96685 43847 -31208 -62594 104997 133817 55494 -24461 -45291 -81691 -116190 -125798 -109358
19660 -109358 -60309 26085 -7339 268 -61964 -60707 -115089 -177268 -194110 -103513 -17157 51030
19648 51030 86113 98679 34517 -58658 -68186 -51772 -21495 52507 125186 133091 81359 29631
19636 29631 -43063 -86113 -111886 -150762 -90874 -24084 -46458 -76548 -47114 -26072 3414 16552
19624A6552J441L1822o1344k8446k759l2442q6940j20475N4684J21393Q7663L1962
19612A3111K3214M5908k1896k9870M9241R583q0727k0840K7835m6522j5864j8897
19600f5724L2824o752k4540J8839j02013n5550M6772O8212L8392K3187j3584N0767
19588A0830l7300j7304N983k4084j29307M391M4945p232R2993O7260Q0970q4238
19576G907j58583k6818L7633L7638L6089K8892l5630M8309l1875q3753J3235j6965
19564a43921o5834O9193J52724Q3697l9576j7830l4762K5623O3008N6221m0601
19553A07942r5803p0478j3526Q780m7294J3209K4548K6656M0725j1879o5110q5516
19541a67746K7724J06977O2994K151p5561j4658K4276j2120Q792P2620n2220n175
$$ plain form
19624 16552 17993 49815 -11529 -39975 -42734 -75176 -162116 -282591 -227907 -106514 -18851 13111
19612 13111 36325 82233 60337 30467 79708 89291 8564 -12276 15559 -30963 -46827 -65724
19600 -65724 -32900 -39652 -64192 -45353 -147366 -202916 -156144 -87932 -49540 -26353 -39937 10830
19588 10830 -26470 -43774 -37791 -61875 -191182 -186791 -141846 -149078 -56085 11175 92145 7907
19576 7907 -150676 -177494 -139861 -102223 -66134 -37242 -72872 -24563 -56438 -140191 -126956 -143921
19564 -143921 -209755 -140562 12162 95859 56283 38453 3691 29314 92322 148543 107942
19553 107942 12139 -58339 -71865 -63085 -110379 -97170 -72622 -45966 -5241 -17120 -82230 -167746
19541 -167746 -140022 -33045 29949 32100 -43461 -58119 -33843 -45963 -37171 35449 -16771 -21946
19529b1946J987j7699k8434j1838O4240k2292J4909J1415k763L7520m5186K6743
19517F656k4647m9990m38K5641K6284q2972L356J06148J06563J1480o1853j28882
19505f2654j364L1297M7048L5683k6708J2881j3744j0296m8819o3685o9761P9871
19493i0251J14093K4007P464J6460o7193m4081M9646M5089L4409k6110q767m456
19481E0310M314j6692n4325k3816N904l0401Q2995Q3119p2354q5138o5532P4613
19469d7003M9296j169O5912R9405P6200n0692j30226k4624Q450n9598l9417Q3800
19457C0334O0531L92l4261l970l1416j150Q1586J62959J99523J63139J37081O5667
19445H30415q2516j24829j50674j97314j23605o9822K8513K5501j4356Q1561M8446
$$ plain form
19529 -21946 -19959 -37658 -66092 -77930 -13690 -35982 -21073 -9658 -12421 25099 -20087 6656
19517 6656 -17991 -67981 -68419 -42778 -16494 -99466 -96110 10038 116601 128081 66228 -62654
19505 -62654 -64018 -32721 14327 50010 23302 36183 22439 12143 -36676 -100361 -170122 -90251
19493 -90251 23842 47849 55313 71773 4580 -39501 10145 55234 89643 63533 54766 50310
19481 50310 54624 37932 -16393 -40209 -34305 -64706 18289 101408 29054 -56084 -121616 -47003
19469 -47003 2293 1124 67036 166441 242641 191949 61723 37099 45549 -14049 -53466 30334
19457 30334 90865 91257 56996 53026 21610 20460 102046 265005 464528 627667 764748 830415
19445 830415 747899 623070 472396 275082 151477 81655 110168 135669 121313 202874 251320
19434B51320j46979j16566N3394P165p4754L7268N3363m1749J7272j5145m8356
19423b3767j4818K3271K5006O9061J10063N8278K25276R4694O5025M9134J14465
19412G95688O6047r5571j53411k13646k12226p5652m4966r2105q1010Q3045r63
19401b4770n6100k1838l311K809Q0776J53845j8718j4151n2428Q247l1772L0929
19389E3518O2807r9008q0734R4085m5576J872L2787n5638j306m4608K1743k7380
19377h7438n0000J855K841k8595P9337J28342L7992n5111n3642J33408K4677m3423
19365I0243r2241j1105K2676N2804J24813j07141j10698J717p413j18870j7422
19354a72637N9136M9793l8069O3910J21813J8948j2063n1827m9712j7189N0336
$$ plain form
19434 251320 104341 -12225 41169 48334 -26420 10848 64211 22462 39734 24589 -23767
19423 -23767 -38585 -15314 9692 78753 188816 247094 472370 567064 632089 681223 795688
19412 795688 861735 766164 612753 399107 186881 111229 66263 -25842 -106852 -23807 -24770
19401 -24770 -80870 -102708 -106019 -103210 -22434 131411 112693 98542 46114 54361 22589 53518
19389 53518 116325 17317 -63417 30668 -14908 -13036 19751 -35887 -37193 -81801 -60058 -87438
19377 -87438 -137438 -135583 -132742 -161337 -82000 46342 84334 29223 -24419 108989 133666 90243
19365 90243 -1998 -13103 9573 62377 187190 80049 -30649 -28932 -36345 -155215 -172637
19354 -172637 -113501 -63708 -101777 -37867 83946 102894 90831 39004 -10708 -27897 22439
19343B2439M49O05J7578L7731n386o3619j1001N017j5347n9336p9553L4820M151
19330a11452r3J06363K423n8234k6421l4044k575L7573J19286L9308n2812q4501
19318f5179M500N9986N6164J076K2806P1946K0609L5417l4378m9771N056N4974
19306A83206l8850l6744K8650O957p770P883J5759l5528o2944l3120q5555L249
19294e4807O4241R0269k3664O3074j5955p9528r710k3571k1701j3272J7971L9505
19282C2852J7868J8487M4908M0732L759q0866L1938J932o3933k7060K0916l7840
19270C693L2086k3307m1264o3019K7984P6389k3615Q146M259n7192J9861K5800
19258a0179j3056K3608L8627o9772l8173N6556R5694J2261K9750q5347K479L9868
$$ plain form
19343 22439 22888 23493 41071 78802 73416 9797 -1204 3813 -11534 -70870 -150423 -115603 -111452
19330 -111452 -111545 -5182 -2759 -60993 -87414 -121458 -124033 -86460 32826 72134 19322 -65179
19318 -65179 -60679 -693 55471 56547 79353 151299 171908 207325 172947 123176 128232 183206
19306 183206 144356 107612 136262 143219 135449 143332 159091 123563 60619 27499 -58056 -54807
19294 -54807 9434 99703 76039 139113 123158 43630 33920 10349 -11352 -24624 -6653 32852
19282 32852 50720 69207 114115 154847 158606 77740 109678 111610 47677 20617 41533 3693
19270 3693 35779 12472 -28792 -91811 -63827 12562 -11053 -2907 1352 -55840 -35979 -10179
19258 -10179 -23235 373 39000 -30772 -68945 -12389 83305 95566 125316 39969 42448 82316
19246H2316k6344k7605l5865j3417j1432R68n7300M8195L5208k5653J0519L6177
19234A5767k5268j0615L5127M4203j7968L9875L1210O745L4599R884m7770m0885
19222G4904q1706m7587k163l7959m70q789j4526J05399N6428k5367K0945j5018
19210B4091J22025l0445k5196P1300l8849l9066m5169K6446O5031K2200l9530
19199A12838q8987k6326O4533M3822N867m5590j14816m7288m6041O7939K3805
19188e0244N3774M7489L2515J7712r9358m0370N156L2625Q2483M1886k1130r2581
19176I957r0842K1651J596K8608k1042m7940J00342K6454r3525j3960N0291P8710
19164E0300r612Q7736Q3043r1052j21639p1231o1607m2031J00828O1544N0234
$$ plain form
19246 82316 55972 28367 -7498 -20915 -32347 -31379 -88679 -40484 -5276 -30929 -20410 15767
19234 15767 -9501 -20116 15011 59214 41246 81121 112331 119076 153675 163559 115789 74904
19222 74904 -6802 -54389 -56552 -94511 -94981 -103770 -118296 -12897 43531 18164 39109 24091
19210 24091 146116 115671 90475 161775 122926 83860 38691 65137 130168 152368 112838
19199 112838 23851 -2475 62058 105880 111747 66157 -48659 -95947 -141988 -74049 -50244
19188 -50244 3530 51019 83534 101246 1888 -38482 -33326 -701 81782 123668 102538 9957
19176 9957 -80885 -59234 -57638 -29030 -50072 -98012 2330 28784 -64741 -78701 -28410 50300
19164 50300 40688 128424 211467 120415 -1224 -72455 -134062 -176093 -75265 -13721 36513
19153C6513N4316o3344J6223P0539L3667M9530p9979j48423r4753M08l1497Q6221
19141g0579M7181M3123L9976P3851O3434L9642l1883p7733J3477m5792o2912m2375
19129a0590M047P5926o0884m6818P8168R5471k6064m6281K9231n9067P949L1487
19117G2575m4329j7500M0654R2839k6445j05915o0336R6475L5828J3868P3592
19106A71306o878O878L6537j1489q3411k7958L8081N2434l130n318n0868K1961
19094A38145r4849K6100N2321K6750j06531M8648O775o7072k5472J36615J25034
19083B66464m1392O6991p8977j29997K9075M7384n5826N4921J2362j24759k2885
19072B3361j055Q7359L2961k0015l3453K2042k3901l5869R0851k0584k9015L7869
$$ plain form
19153 36513 90829 27485 43708 114247 147914 197444 117465 -30958 -125711 -125303 -156800 -70579
19141 -70579 -23398 19725 59701 133552 196986 236628 204745 127012 140489 94697 31785 -10590
19129 -10590 -6543 69383 8499 -38319 39849 135320 109256 62975 92206 33139 41088 72575
19117 72575 28246 10746 51400 144239 117794 11879 -48457 48018 83846 97714 171306
19106 171306 164428 171306 207843 196354 112943 84985 123066 175500 172370 167052 116184 138145
19094 138145 43296 69396 121717 148467 41936 90584 97359 30287 4815 141430 266464
19083 266464 225072 292063 213086 83089 112164 159548 103722 158643 171005 46246 23361
19072 23361 22306 109665 142626 122611 89158 111200 87299 51430 142281 121697 92682 130551
19060A30551l1757n8744r8567k9402J40144J7843l1769o0433J05444P5540k6512
19049A32338n8938p119L8796O1392j7004j5679r0402O7913q418r2814j8696k348
19037a0979l3210m3848k9895O6299M660o665J4187j0212j5804M4413N1885j1860
19025A8971l2789J03757O038n4173N0887j873r724r343l1441M6291J20985O9619
19013B77205p1036o9936m7664K819m9391j06546M9004P6209J334O1n0556k7218
19001a5715N1877L0823j958O8896Q5654J2345N3869j1228o9975m6577m7024M1660
18989A52647N6291k8357l8525j7532j23228p5269o1877J7292J05421R884k6470
18978b9723R6374R7555O6625n8193k4918j3929R9912R7865K9949r7274l4539o6035
$$ plain form
19060 130551 98794 40050 -58517 -87919 52225 70068 38299 -22134 83310 158850 132338
19049 132338 73400 66281 105077 166469 149465 133786 43384 111297 102879 10065 -8631 -10979
19037 -10979 -44189 -88037 -117932 -51633 -46973 -53638 -39451 -49663 -65467 -21054 30831 18971
19025 18971 -13818 89939 95977 41804 92691 90818 81094 71751 40310 86601 207586 277205
19013 277205 206169 136233 88569 91388 41997 -64549 -15545 60664 61998 62059 11503 -15715
19001 -15715 36162 66985 65027 133923 219577 231922 285791 274563 204588 158011 110987 152647
18989 152647 208938 180581 142056 124524 1296 -73973 -135850 -118558 -13137 -3253 -29723
18978 -29723 66651 164206 230831 172638 147720 133791 233703 331568 361517 264243 229704 163669
18966A63669j01358L0194Q823O2594N9599K6481j5819l1347m4019L9757J17371
18955C15945J6157m7443l4578M3354k3817m4229l3959M1966j3988p800m3103m5539
18943A22966m8503N7974P6259j7610q550P9273R344P8164K7214l9513p0624K0320
18931B86714j2315J454M8663k1239n0500q0946M8775J8570j050j1011J2667M913
18919B44695m9248Q410M618J0405L5486R7921m3574q3547k0101J07694R485m6406
18907B75838K0824L9248J435k1352J0613O2093L040N8998J23205J1703k9083L5511
18895E92073P6635P739j7970M4025O8342Q6640J40013N4947N5229Q8354K00393
18884A396420K38818P1290R2927K51257l240j04520P3600J69822J34824J51144
$$ plain form
18966 163669 62311 92505 101328 163922 223521 250002 234183 202836 158817 198574 315945
18955 315945 332102 284659 250081 293435 269618 225389 191430 233396 219408 211608 168505 122966
18943 122966 74463 132437 208696 191086 182536 261809 271153 349317 376531 337018 266394 286714
18931 286714 274399 275853 324516 303277 252777 171831 220606 239176 238126 227115 239782 244695
18919 244695 195447 203857 208475 218880 254366 352287 308713 225166 205065 312759 322244 275838
18907 275838 296662 335910 337345 315993 326606 388699 391739 450737 573942 585645 556562 592073
18895 592073 668708 676447 658477 702502 770844 857484 997497 1052444 1107673 1196027 1396420
18884 1396420 1635238 1706528 1799455 2050712 2047472 1942952 2016552 2186374 2321198 2472342
18874B472342J30549R6022J49467J97531J77734K45177K93463L51373M71987P51828
18864E337473R53847J129139J625529K377880L566163N632558J0013906J9461145
18856E0097640L3851867K9994108J1881206J1180307J0309498j1600728k3196193
18849A12517705k6153479k5618503j9045314j1615398o827000m307650k923411
18842A6026950j962216j338337j094776q85619m27788k49828j12340J6139R6212
18833A0068397J46644L01503N98377R55777J441562K388965L693546N879497J0764811
18824C6239079K1008411L6954880L3859187J3183223J1563730J1100886j2513933
18817A51395463k5889385k9236349k8937702k1739841j3210048p832934n015137
$$ plain form
18874 2472342 2602891 2698913 2848380 3045911 3223645 3468822 3762285 4113658 4585645 5337473
18864 5337473 6291320 7420459 9045988 11423868 14990031 20622589 30636495 50097640
18856 50097640 83949507 113943615 125824821 137005128 147314626 135713898 112517705
18849 112517705 86364226 60745723 41700409 30085011 23258011 18950361 16026950
18842 16026950 14064734 12726397 11631621 10746002 10318214 10068386 9956046 9972185 10068397
18833 10068397 10215041 10516544 11114921 12070698 13512260 15901225 19594771 25474268 36239079
18824 36239079 57247490 94202370 128061557 141244780 152808510 163909396 151395463
18817 151395463 125506078 96269729 67332027 45592186 32382138 24549204 19534067
18810A9534067l489393k493307j824220j428968j166938r70845q13544o31325
18802F715527m97285l98765l82936l54855k30395q1705M336N4037Q6759m8848
18792D865870l58716l92192m01782m60258l86918l92036l77391l05595j36912
18783A654070j0980j8803r0447o9921M6603q3781j24842j25569k17129j33338
18773H25863j18149j45012K3036L5108K5386m2978L5342J35761J52957L27152
18763A254466J82165J5519k6278j84676j70252j32897r6897j29102j43788l3027
18753E35233n1486q6379l1010k9077p9149j06992l0864L6363N4352K1415n3385
18742A79021K3031M8715l3868q7770M2453L3564O1401O390j3322M7602M6604O9442
$$ plain form
18810 19534067 16044674 13551367 11727147 10298179 9131241 8160396 7346852 6715527
18802 6715527 6218242 5819477 5436541 5081686 4851291 4769586 4773922 4827959 4914718 4865870
18792 4865870 4507154 4114962 3713180 3252922 2866004 2473968 2096577 1790982 1654070
18783 1654070 1643090 1624287 1533840 1463919 1510522 1426741 1301899 1176330 959201 825863
18773 825863 707714 562702 585738 620846 646232 603254 638596 774357 927314 1254466
18763 1254466 1436631 1452150 1425872 1241196 1070944 938047 841150 712048 568260 535233
18753 535233 483747 397368 366358 337281 258132 151140 120276 156639 210991 232406 179021
18742 179021 202052 250767 216899 129129 171582 205146 266547 272937 259615 307217 353821 423263
18730D23263r9852o5555p473J6074N5485K3655o9567m8512o0149p4232j24044
18719c0907l1239N2324P5924N8733M226l7340M155N4117q0171j3767J13463l2329
18707A37189k1739Q373j7544L8115k1854n6164j9019l090l1195N1784O6136j3682
18695A17310k4787k4868l3529M3615k105L0203R5340J6121q9233k259R0776N360
18683B21944p9109l5974n0579j01625P4820N2480q5464o7423L8632J21897j3630
18672G5969k5352J3626l874J5701J18616J24408k4153r9221J6736J1642o2991
18661A61107r6336n9003n1156N416J07957j186m7622p412N2469j7015k6957j0920
18649I342K5015K7362n0412J691P3612j7997j00324J2671L9434J25420o3798M8438
$$ plain form
18730 423263 323411 257856 250383 266457 321942 345597 276030 227518 167369 93137 -30907
18719 -30907 -62146 -9822 66102 124835 129061 91721 95876 149993 69822 56055 169518 137189
18707 137189 115450 123823 106279 144394 122540 66376 47357 44267 13072 64856 130992 117310
18695 117310 92523 67655 34126 77741 75636 105839 201179 217300 128067 125808 216584 221944
18683 221944 142835 106861 56282 -45343 29477 81957 -3507 -70930 -32298 89599 75969
18672 75969 50617 64243 60369 76070 194686 319094 294941 195720 212456 224098 161107
18661 161107 64771 5768 -45388 -39972 67985 66799 19177 11765 64234 47219 20262 9342
18649 9342 34357 61719 11307 12998 86610 68613 -31711 -19040 20394 145814 82016 130454
18637A30454Q1371o346q6330l178J3952k4963N1906J990l1645l3919K8787j9744
18625A02335j7547Q3467q3495j9532J6843o8773K4790o653j9070o7181l0053J35169
18613E0300R1744l2933K513j9884r3093m4184Q3900M9274k8927j0882M8625J6184
18601A12637l4235R11k9488M7955j3079K9592M88O7562K7915p9702j59494J8406
18589a0532L6353K3388K5851l8965q9602L5242M0641o420N3036R5214n8845k8923
18577G6438N4306M8080K1254q1321j8833J1542J8585n017j0098k5281q6864o1421
18565e8630o5812R6024N3497l8541J6851l3446M6931L9381m765o816M7228k1332
18553G0570q5169j9069n348P4639M787j6241K6008L09n0618j6646L4205J197J1878
$$ plain form
18637 130454 211825 205479 119149 115971 129923 104960 156866 158856 127211 93292 122079 102335
18625 102335 84788 168255 84760 65228 82071 13298 38088 31435 12365 -54816 -84869 50300
18613 50300 142044 109111 111624 91740 -1353 -45537 38363 87637 58710 47828 96453 112637
18601 112637 78402 79313 49825 97780 84701 114293 114781 182343 210258 130556 -28938 -10532
18589 -10532 25821 49209 75060 36095 -53507 -18265 22376 15956 68992 164206 105361 76438
18577 76438 130744 178824 200078 118757 99924 111466 130051 125034 114936 89655 2791 -58630
18565 -58630 -124442 -28418 25079 -13462 3389 -30057 16874 56255 51490 44674 91902 70570
18553 70570 -14599 -33668 -39016 35623 40410 24169 50177 50486 -132 -16778 17427 18624 30502
18540C0502M6747O3755k2387O0428m609p1655m4966M1268M7393q470R4615R9373
18528C31994k2617j04008L3008n3579p1148q5696K8541m5349J3727j6374j6566
18517h067N8072J06128p6298q1964N226L7146p7503L3054N5479n7166N09J4887
18505I503l88K8346n0106L120N8867J38437Q9240M2968K5375O4362l2963j17385
18493B59376m0610o1871K9038l7549j12421n2669K3760K7833P3458J3826p1362
18482E0809K3063M9188j9418l8624K6080L8281j0412R979Q8482j1429l3803k8424
18470A43772n3304m1564O7300K2594n1645o2683J06146N7764P2489L8367j1926
18459B87310n9283k0082L448j7632n08j4455J08153M450m5689j18835n8506L3996
$$ plain form
18540 30502 77249 141004 118617 179045 174436 102781 57815 99083 146476 138006 232621 331994
18528 331994 309377 205369 238377 184798 113650 27954 56495 11146 24873 8499 -8067
18517 -8067 50005 156133 79835 -2129 3097 40243 -37260 -4206 51273 -5893 -5384 9503
18505 9503 9115 37461 -12645 -9525 49342 187779 277019 319987 345362 409724 376761 259376
18493 259376 218766 156895 185933 148384 35963 -16706 7054 34887 108345 122171 50809
18482 50809 73872 123060 103642 65018 91098 129379 118967 128946 217428 205999 172196 143772
18470 143772 90468 48904 116204 138798 87153 24470 130616 188380 260869 299236 287310
18459 287310 228027 207945 211393 193761 193253 178798 286951 291401 245712 126877 68371 102367
18447A02367J7385P7975m6426q5716r0875K6218j0862n9743J1123Q2212M5655
18436F9313n7257j45921j00164Q7954K3509k4483l392Q6640M0905L5598K9116
18425D1818j0427k0849M3828N7974P6898k1925o9409J3689n7143O1935P6492j3965
18413A78916k0452r9508k7888M6486J5146R5594j1848l3498m8094P6223m0816
18402A30261M05k5482n9162j06556L06m4835K7665K9909j6072Q8267J7237M4659
18390H6602o6254L897Q1576J07758p6835k7393M6136K1097J9645j11545p9577
18379E107J09143M8451M3064N4290l4868m457K050P553m2810o3728J6675K0164
18367A60634k819o4792R2801O4312o4191j4875K5406n1755j6574N8379K7023M285
$$ plain form
18447 102367 119752 197727 151301 65585 -25290 928 -9934 -69677 -58554 23658 69313
18436 69313 12056 -133865 -234029 -146075 -122566 -147049 -150441 -63801 -22896 12702 41818
18425 41818 31391 10542 54370 112344 189242 167317 97908 111597 54454 116389 192881 178916
18413 178916 158464 58956 31068 77554 92700 188294 176446 142948 94854 171077 130261
18402 130261 130666 105184 46022 -60534 -60228 -105063 -77398 -47489 -63561 24706 41943 86602
18390 86602 20348 24245 105821 213579 136744 109351 155487 176584 196229 84684 5107
18379 5107 114250 162701 205765 260055 225187 220730 222780 230333 187523 123795 140470 160634
18367 160634 157815 93023 185824 250136 185945 171070 196476 144721 128147 186526 213549 217834
18355B17834n5102o005K9970J7228j05027J07J07760N4830j0978o1103K9697M4394
18343B63605n8332N5718M1077p6701k472K5623L4152p2170J9653O5620R8301l0272
18331C63802K846m9834l8881l8238J2521M8830l2575M9347m8009N0004N6464M9544
18319D25821k7011l9502n8752k7109K2008o8102P8255J26759J5082j0818k0709
18308D15922M2457k7975K2994j9329l6040L1205m0509o5923N1943K9696j9651
18297C84790l3771j3057Q1177m8924Q380N8198L8609J20253N5679j9415L3166
18286F65085M9336J37617J25056P8117P3628R8351K00620L42948J34872L5068
18276A940698n598j9495n8041k19497J6831J19544J11724K10079K78961K69532
$$ plain form
18355 217834 162732 156727 186697 203925 98898 99005 206765 261595 250617 189514 219211 263605
18343 263605 205273 260991 302068 225367 222895 248518 282670 210500 230153 295773 394074 363802
18331 363802 366648 316814 277933 239695 252216 301046 268471 317818 269809 319813 376277 425821
18319 425821 398810 359308 300556 273447 295455 227353 305608 432367 447449 436631 415922
18308 415922 458379 430404 453398 434069 398029 429234 388725 322802 374745 404441 384790
18297 384790 351019 337962 419139 370215 378595 436793 475402 595655 651334 631919 665085
18286 665085 714421 852038 977094 1055211 1128839 1227190 1427810 1770758 1905630 1940698
18276 1940698 1935100 1915605 1857564 1638067 1654898 1774442 1886166 2096245 2375206 2644738
18266B644738J96965R2018J78321K34625K45579L63096P03586P54840Q29587R56313
18256G199668J011213J312142J925914K934286M279736O796979J2233271K3389192
18248F1082401M0388110L6989011K2126246J9298002q367902l0091037l3265566
18241A08159265l1955626k4282016j5003593q922987n597529l729115k584262
18234A6084137j713013j317885r93937q00264o88009m24076j97753J51189K99964
18225A0400353M85077N06181L42717O64433J230731K239982L587336N999904J0912366
18216C6369080K0873743L6179548L3922022J9309973J6947643p196501k7549387
18209A28856121l0340100k9150820k2223340j3830774q357003n452174l673622
$$ plain form
18266 2644738 2841703 2933721 3112042 3346667 3592246 3955342 4658928 5413768 6243355 7199668
18256 7199668 8210881 9523023 11448937 14383223 18662959 25459938 37693209 61082401
18248 61082401 101470511 138459522 160585768 179883770 171515868 141424831 108159265
18241 108159265 76203639 51921623 36918030 27995043 22397514 18668399 16084137
18234 16084137 14371124 13053239 12059302 11259038 10571029 10146953 9949200 10100389 10400353
18225 10400353 10885430 11391611 11734328 12398761 13629492 15869474 19456810 25456714 36369080
18216 36369080 57242823 93422371 127344393 146654366 163602009 156405508 128856121
18209 128856121 98516021 69365201 47141861 33311087 24954084 19501910 15828288
18202A5828288k634914j957775j379319j092815r09275q04962p14484p17159o98712
18193D918873n60796m10004l49725l57455k62789k41465k47194n4814j26096J41645
18183B450180J66183K8860N2970M3952j73089k61824l37113j79995j07718j38402
18173A544004j09110j25237j50407j14152q2663k3742m1076j10133j6268j2813
18163G58403q2529R509j3426q8339j77376r950J72111P9844j3235K9996j2618
18152F52390p9626j19606j32O3653o9543J05416k3209m6782m8880L1619N7255
18141E22555J3166l502M1828K5122N6913K3578m1978K2807O6185P9713P1573K6445
18129I04405N5168J02119R3394J56698O7804R6848P0584J65949K27455K51679
$$ plain form
18202 15828288 13193374 11235599 9856280 8763465 7854190 7049228 6334744 5617585 4918873
18193 4918873 4358077 3948073 3598348 3240893 2978104 2736639 2489445 2434631 2308535 2450180
18183 2450180 2616363 2645223 2698193 2742145 2569056 2307232 1970119 1790124 1682406 1544004
18173 1544004 1434894 1309657 1159250 1045098 962435 938693 897617 787484 771216 758403
18163 758403 675874 685383 671957 583618 406242 396292 568403 648247 635012 665008 652390
18152 652390 572764 453158 453026 516679 447136 552552 529343 482561 433681 465300 522555
18141 522555 535721 532219 574047 599169 656082 679660 637682 660489 726674 806387 877960 904405
18129 904405 959573 1061692 1155086 1311784 1379588 1476436 1547020 1712969 1940424 2192103
18119B192103L48707L45486M74947P32864Q63162J065069J403061K029065L071876
18110A2526340M812215Q215396J5670413L2379335N3774402K8269817j0337108
18103A45310810k6713051l5361896l0183818j8337939j0225928o065461l890754
18096A4531963k708651k075761j535637j332397j045002q21413n40547m08997
18088D063558m00684l40891k42781l63977k95496k08098k41861j71673j06411
18079A691686j03387n0652J7172m5010r0141o3809p4020j09950j02782j29481
18069I39626k19853j80497p0433J2849O7498L4381o5757j458J6340k9702p4828
18058D28166P9878L3070j33953p7327n9834p7673L6872J862m4395M4076O6182
$$ plain form
18119 2192103 2540810 2886296 3361243 4094107 4957269 6022338 7425399 9454464 12526340
18110 12526340 17338555 25553951 41224364 73603699 127378101 155647918 145310810
18103 145310810 118597759 83235863 53052045 34714106 24488178 18422717 14531963
18096 14531963 11823312 9747551 8211914 6879517 5834515 5013102 4472555 4063558
18088 4063558 3662874 3321983 3079202 2715225 2419729 2211631 1969770 1798097 1691686
18079 1691686 1588299 1537647 1554819 1509809 1419668 1355859 1281839 1171889 1069107 939626
18069 939626 719773 539276 468843 481692 549190 583571 517814 516356 532696 502994 428166
18058 428166 508044 541114 407161 329834 270000 192327 229199 231061 186666 230742 296924
18047B96924j33467p151Q367m296l4674n4553m1133r529j3438J04839k9243O284
18035H8930N0063J6872J2127m8683l078R3392R552j1581k3017l7529O9062L6614
18023B52724m0202p3780o2960M7935k3783o9966n3894J2428O4820j3001p0156
18012b9835n9172n9211k3509r457k1352Q1826Q0921l7477J9162l2869j3063j6972
18000a21008k1504M8792J8390J8406N5942K7338K2051l4777M6707Q1077p9610
17989F1804k8802j1822O6221M8493m5773m5879L7494l2881p0449N986J11028n8272
17977C7148l2557K3119l8908J6837R7392L4326n9008J2610j268m0847J5524o2339
17965B029l4120J06322j3961q5227Q2690j674m6426j8838P7294Q2140m4639p4359
$$ plain form
18047 296924 163457 156306 164673 160377 125703 71150 30017 20488 7050 111889 82646 88930
18035 88930 138993 155865 167992 119309 116231 209623 219175 207594 184577 147048 216110 252724
18023 252724 212522 138742 75782 123717 99934 29968 -23926 -11498 53322 40321 -29835
18012 -29835 -89007 -148218 -171727 -181184 -202536 -120710 -39789 -77266 -58104 -90973 -104036 -121008
18000 -121008 -142512 -93720 -75330 -56924 -982 26356 48407 13630 60337 141414 61804
17989 61804 33002 21180 87401 135894 90121 44242 81736 48855 -21594 -15608 95420 37148
17977 37148 4591 27710 -11198 5639 103031 137357 78349 90959 89691 48844 64368 2029
17965 2029 -32091 74231 60270 -24957 57733 56059 9633 -9205 68089 150229 105590 31231
17953C1231J4498M6470L3857j9022q3760l8424p6244k8766N0059P4124r8212k2036
17941a16225J01438R7905L4976n074j07517j2731o2960j15468Q0217N6514J23527
17930G4602l6082k3015Q1970K8199o9810n910K257j036k4372K0586m9037K1739
17918B0091Q0978K8620j3916j7972K6864n9344k5296J2732k1730q843M137j8890
17906G431m0127L3627J2411q2850K1575m9953q2692q0948j0714r11J18205J17357
17894c7589p7362m661O3924P2529P8761L7839m8423l3141R069P9768L4623J160
17882A76497m225k3163j02043M2438l1014m7692N4696M1869o2297j02428J6546
17871d0816j5621m5011M398m0041K1972O9340Q8264O9099K5179p2533j37044j44275
$$ plain form
17953 31231 45729 92199 126056 107034 23274 -15150 -91394 -120160 -70101 4023 -94189 -116225
17941 -116225 -14787 83118 118094 113020 5503 -7228 -70188 -185656 -105439 -48925 74602
17930 74602 38520 15505 97475 125674 55864 49954 52211 51175 26803 47389 -1648 20091
17918 20091 101069 129689 115773 97801 124665 65321 40025 52757 31027 22184 26321 7431
17906 7431 -32696 931 13342 -69508 -47933 -97886 -180578 -261526 -272240 -273151 -154946 -37589
17894 -37589 -114951 -119612 -55688 16841 95602 133441 85018 51877 60946 140714 175337 176497
17882 176497 172272 149109 47066 89504 58490 10798 65494 107363 45066 -57362 -40816
17871 -40816 -56437 -101448 -97050 -137091 -115119 -45779 42485 111584 136763 64230 -72814 -217089
17859b17089J9817J16851R8140j6061L9590P2847p8837p2638k9506N5591R884
17848a411l7433k3785q7011n0364R943j925k3018l876L6624P7150L8427O2608
17836d071J766J933J4560m3765j2543J0251P988p4958M9106N5371J3435j7236
17824A837o267L644Q357J4267m6007O3916L9101j3539j8322Q1299R220l2892J519
17811A06133l0150P3255M8415k638j773Q124j59062p8071o4537j9940O4202N8709
17799B667P4347r4430p3316l0902l2849j0303Q5269L6444J7695q631L8978p3181
17787f8212l2024J18023R5904l3145j42721m3787R801K0684K0452K56N0498k8177
17775c2448k0895M0424O9275p873m2176j4462M6179K5263o7528m9226L5768m865
$$ plain form
17859 -217089 -197272 -80421 17719 1658 41248 114095 35258 -37380 -66886 -11295 -1411
17848 -1411 -38844 -62629 -149640 -200004 -190061 -191986 -215004 -218880 -182256 -105106 -66679 -4071
17836 -4071 -2305 -372 14188 -29577 -42120 -31869 -23881 -98839 -49733 5638 19073 1837
17824 1837 -4430 -786 7571 21838 -24169 39747 78848 65309 46987 128286 137506 104614 106133
17811 106133 75983 149238 197653 195015 193242 201366 42304 -35767 -100304 -120244 -56042 2667
17799 2667 77014 -17416 -90732 -121634 -154483 -164786 -79517 -43073 -25378 -34009 4969 -68212
17787 -68212 -100236 17787 113691 80546 -62175 -105962 -96161 -75477 -55025 -54769 -4271 -32448
17775 -32448 -53343 -12919 56356 48483 6307 -8155 38024 63287 -4241 -53467 -17699 -22564
17763b2564L5516N3866K0244m1473m3346k8602k3448K6554k0278l3237l8240N0279
17751f4729p382l4142k6113K9955J7262j4527L0989k7381J05597O7162l4639Q216
17739E0268R3741R730o6572r782k3050J3127P6602R6522k5052j67044j28781N0550
17727b9741P3480l0195k2746k8711J7567O9759k995n0594o488N0075K1216l1963
17715B8664n8559k4003j8636N344K7238l344o2131M8727L2677R497N1733o395
17703C0812q623J2517K1672j4840k0930j0795k6484k0884L9160L2891J9579O2639
17691A16714J00311J63241J66625J45757J44795k617j21579j42920j69179j39783
17681B61365q7840o2834k4389l2523R152j0122M8420J1556j3989j2167J8078l0533
$$ plain form
17763 -22564 12952 66818 87062 45589 2243 -26359 -49807 -23253 -43531 -76768 -115008 -64729
17751 -64729 -72111 -106253 -132366 -102411 -85149 -99676 -68687 -96068 9529 76691 42052 50268
17739 50268 144009 153739 87167 77385 54335 67462 144064 240586 215534 48490 -80291 -29741
17727 -29741 43739 13544 -9202 -37913 -20346 49413 46418 -4176 -10664 39411 60627 28664
17715 28664 -29895 -53898 -72534 -67190 -39952 -43296 -105427 -56700 -24023 -14526 37207 30812
17703 30812 22189 34706 56378 41538 20608 9813 -16671 -37555 1605 34496 54075 116714
17691 116714 217025 380266 546891 692648 837443 834826 713247 570327 401148 261365
17681 261365 173525 110691 86302 53779 62931 52809 101229 112785 98796 86629 104707 74174
17669G4174M8975J2712n3422q180P852n272J910K8693Q9362L0887J835J47604
17657C77130K10367J99795K8237K5618l2949j92335j10497j02408k16971j15770
17647G0217p9793p8287m760O2891M6374j2687L8690J9134p2805k4714k1186k3317
17635h0243J06320L6302J0863k5152k9486N2837l599p2543L1131J8811o7973n94
17623b3326R309N9743m0584k473k0913p1849j7762K7572O3073L4605n4582m4873
17611h2060K0512m1732j8944o119K3262P0383J7723l1925j8265R6378N4455o1583
17599B2085J8770R0803m6966n2616k772o1746j29634L5263M0258P8793N9580o0095
17587h277m0997J44708M0046j46108l4399J754m5025j6759k2893o4983p784J18803
$$ plain form
17669 74174 123149 135861 82439 74259 82111 76839 78749 107442 196804 227691 229526 377130
17657 377130 587497 787292 815529 841147 808198 615863 505366 402958 185987 70217
17647 70217 -9576 -87863 -92623 -29732 16642 3955 42645 61779 -11026 -35740 -56926 -80243
17635 -80243 26077 62379 73242 48090 18604 71441 67842 -4701 26430 45241 -22732 -23326
17623 -23326 -14017 45726 5142 2669 -18244 -90093 -107855 -80283 -17210 17395 -37187 -82060
17611 -82060 -61548 -103280 -122224 -128343 -105081 -34698 -16975 -48900 -67165 29213 83668 22085
17599 22085 40855 131658 84692 32076 29304 -32442 -162076 -126813 -86555 -7762 51818 -8277
17587 -8277 -49274 95434 135480 -10628 -45027 -43273 -88298 -105057 -127950 -192933 -200717 -81914
17575h1914L985j9666O8873o3819o8000j1353N9082O5851J7509l0387l7221k3275
17563a20335k1142m9701J6701J43281N2473o9215q5350l2017Q0667P7820O8544
17552F1726l4694m6596n6553j17144n4463L8102M5716M229l3350N7264O0183J6204
17540e9376K0357k9180m8818O0347J2967j8046J2598L2923J1510P4985j28987
17529e8720r8670K3407J6707O8013J2981j32719K011O5844Q2111O4511N1078m2206
17517E4348P4731n0733o4995m6217m7783O8074O3311l357k9982n4932p7305o4240
17505a79080K8895Q2127L5666q7369M2502J17377M150l3639M4116L4547J00594
17494A89886J8264j12753o7046L384p4004l2078P0117O2273j6201L665o4263J9830
$$ plain form
17575 -81914 -77929 -97595 -28722 -92541 -160541 -171894 -112812 -46961 -29452 -59839 -97060 -120335
17563 -120335 -141477 -191178 -174477 -31196 21277 -47938 -133288 -165305 -84638 -6818 61726
17552 61726 27032 -19564 -76117 -193261 -247724 -209622 -163906 -159677 -193027 -135763 -75580 -59376
17540 -59376 -39019 -68199 -117017 -56670 -43703 -61749 -49151 -16228 -4718 70267 -58720
17529 -58720 -157390 -133983 -117276 -49263 -36282 -169001 -166990 -101146 -19035 45476 96554 54348
17517 54348 129079 78346 13351 -32866 -80649 -12575 50736 47379 17397 -37535 -114840 -179080
17505 -179080 -150185 -68058 -32392 -119761 -77259 40118 44268 10629 54745 89292 189886
17494 189886 208150 95397 28351 31735 -42269 -74347 -4230 58043 41842 45507 -18756 1074
17482A074N7663m9455q8584M5613M6770R7243K3235o0883j04680K3600n0928k2897
17470h2229j03180J153L3156L4479o041o8488L1353N1518m94L5519k5811o1452
17458a60517K0524k4394R711J6783N7997R9928k669q4558K5473M2076K849L3681
17446C6884L0094K3286M8654N8838J15627J23209K00814J82742k1741k07956k26004
17435C64447j70210q8436n5550n235j315p6056k6133k4371O1163P067J8130M8319
17423E1820j2357q4572r9925m5098L3491R6061l3588o2968M8254N4444j4154O0039
17411h553m1218r188N9467n758j2663L5021J1442j13126N2P3012N8107j7158o1423
17398c1986Q122k122k7016M2327J3722M1091K302q5606l3794p3496J3984Q2590
$$ plain form
17482 1074 58737 9282 -79302 -33689 13081 110324 133559 72676 -32004 -8404 -59332 -82229
17470 -82229 -185409 -184256 -151100 -116621 -122662 -191150 -159797 -108279 -108773 -73254 -99065 -160517
17458 -160517 -139993 -164387 -154676 -137893 -79896 20032 17363 -67195 -41722 354 3203 36884
17446 36884 66978 90264 138918 197756 313383 436592 637406 820148 798407 590451 364447
17435 364447 194237 105801 50251 45016 43701 -32355 -58488 -82859 -21696 -14629 3501 51820
17423 51820 39463 -45109 -145034 -190132 -156641 -60580 -94168 -157136 -108882 -54438 -68592 -8553
17411 -8553 -49771 -58959 508 -5250 -17913 17108 28550 -84576 -84524 -11512 46595 29437 -31986
17398 -31986 -23864 -25986 -53002 -10675 3047 44138 46440 -39166 -72960 -146456 -132472 -49882
17386d9882p6290L500J60899M5354P927j07729o4002M7877N7946Q5642L4104j19221
17374B6125j05009O4953m0083o7050j0261M5698N6521J759L639k9623K6965P6130
17362D9764K538L096K9947K0588L6329r1652j10077L0477J06258J4784l5351k7381
17350B9320m1338n0865p2712Q7623P2451o1637J5749M5114M0466j4388k4828L4168
17338E9123P7053Q0432k4002r6351j06256L2699j0818K7374l8995k302O6653j4193
17326E0417L7384O3097j6627O0152n5757p0362K6729k2544J03634R116j04006
17315H1233p0200j33957P7705j3161O4825P8143q515k6539l9542J4844Q7648L4863
17303A47347Q3920J92666K46722K58371K42866K31971K47775p1982r0064q2447
$$ plain form
17386 -49882 -126172 -122672 38227 83581 91508 -16221 -80223 -32346 25600 111242 145346 26125
17374 26125 -78884 -13931 -54014 -121064 -131325 -85627 -29106 -27347 -23708 -53331 -26366 49764
17362 49764 52302 55398 85345 105933 142262 50610 -59467 -28990 77268 92052 56701 29320
17350 29320 -12018 -62883 -135595 -47972 24479 -37158 -21409 23705 64171 49783 24955 59123
17338 59123 136176 216608 192606 96255 -10001 22698 11880 39254 259 -2043 64610 50417
17326 50417 87801 150898 134271 194423 138666 68304 95033 72489 176123 185239 81233
17315 81233 11033 -122924 -45219 -58380 6445 84588 76073 49534 9992 24836 112484 147347
17303 147347 231267 423933 670655 929026 1171892 1403863 1651638 1579656 1489592 1407145
17293A407145k18268k39581k65206j88164j63595k1414k5214Q576p763o3891p1104
17282A51521O247J9664j30055k3275n7311J1085j3539L3731P2918K0941J1038
17271A02965j0909K382j1447Q8173l2098j01726m6165J3265J6258p0517n6562
17260a06381M4522R144r6818O4522M1493N6600J04564J2431m2279j70264m0532
17249a22998Q6161j2170L6095j3824L6330K0516J0061N3340k367l0311o6629k6855
17237c2651K2838L0849K2353n4611l8248L0181N5335M3203q90r0074N8833M2718
17225H9836n2406k4621q1031j4143k0561o5327P4814L6670J9860P9438P2987K166
17213A17682r2952m5638K5693J04686j6697j58998k4081L9196j220L6331m0432
$$ plain form
17293 1407145 1188877 949296 684090 495926 332331 310917 285703 294279 286516 222625 151521
17282 151521 157768 177432 47377 24102 -33209 -22124 -35663 -1932 70986 91927 102965
17271 102965 92056 94438 82991 171164 139066 37340 -8825 4440 20698 -49819 -106381
17260 -106381 -61859 -52715 -149533 -85011 -43518 13082 117646 130077 87798 -82466 -122998
17249 -122998 -36837 -49007 -12912 -26736 9594 30110 40171 93511 91144 60833 -5796 -32651
17237 -32651 -9813 21036 43389 -11222 -49470 -19289 36046 79249 78359 -11715 47118 89836
17225 89836 37430 12809 -68222 -82365 -102926 -168253 -93439 -56769 -36909 42529 115516 117682
17213 117682 24730 -20908 4785 109471 92774 -66224 -90305 -51109 -52329 -15998 -56430
17202e6430P7745P198K3288O2921k8011R68m8786p412k4002j9601m3614j0436
17190f6172P6689N2686K9216j26361l8606N7423O6717J01781m2208m5873j9516
17179D5776k9169L8687P5436M4744q8395q7533j8162K1135J6730r7616R067l0220
17167i9520o189j6155P2865Q9883m1703r3269l0283K7824P1429O0636L650q117
17155C1051O7533l8151l9007q2334J00038P4132L3864q9753o4408o690Q2317K6802
17143I5394l9816l2876p6595m0J4663p940J9149M6763O0328q0728r1906n152N4303
17130d4453j1159k4487j4018M2292P6762K6357j3159o8711K5438l2706n7868N0727
17118d4985R2472K8455q1099j11983K1989J0845N3383L5457k2566n129K6146M8930
$$ plain form
17202 -56430 21315 28513 51801 114722 86711 87679 38893 31481 7479 -12122 -55736 -66172
17190 -66172 10517 63203 92419 -33942 -72548 -15125 51592 153373 111165 65292 45776
17179 45776 16607 55294 130730 175474 87079 -454 -18616 2519 19249 -78367 -69300 -99520
17167 -99520 -105709 -121864 -48999 40884 -819 -94088 -124371 -96547 -25118 35518 39168 31051
17155 31051 98584 60433 21426 -60908 39130 113262 147126 57373 -7035 -13725 68592 95394
17143 95394 55578 22702 -53893 -53933 -39270 -47210 -28061 18702 79030 -1698 -93604 -98756 -44453
17130 -44453 -55612 -80099 -94117 -51825 24937 51294 38135 -30576 -5138 -37844 -95712 -44985
17118 -44985 47487 75942 -5157 -117140 -95151 -84306 -30923 4534 -18032 -23161 2985 51915
17106E1915J0408o3248j4252O8843k5407N7191m7062K1876L0954n731j5957m6494
17094B3036o882j6565J9847m792m4883m4813O1335M9776l5201P817L5382R0474
17082A34531K862j7818P766l5214K4422m9674j8562k5091k8369M9731k3388k4911
17070c715J8785j10578L4902J37122L2707n7422m2571K3857l871j1958j9876k559
17058e177J8371J2163l1129k2647l5688n331O1804j5560n2799p262O4201M2925
17046B3871L1884j0540n6814j9666r1351J3382O9034l5164l0861K9100K1749j2086
17034f7462l7685l464N6667O6089j8621n2700N9497Q0909p1831m2570p580M8934
17022A0183P22O1775R3184n8308j00244J62k3422Q069l5068M7690P5537J5196
$$ plain form
17106 51915 62323 -925 -15177 53666 28259 85450 38388 60264 91218 85487 69530 23036
17094 23036 16154 -411 19436 14644 -30239 -75052 -13717 36059 858 8675 44057 134531
17082 134531 137393 119575 127341 92127 116549 66875 48313 23222 -5147 44584 21196 -3715
17070 -3715 15070 -95508 -60606 76516 109223 51801 9230 33087 29216 17258 -2618 -5177
17058 -5177 13194 25357 -5772 -28419 -64107 -69438 -7634 -23194 -75993 -83255 -19054 23871
17046 23871 55755 45215 -11599 -31265 -122616 -109234 -40200 -75364 -106225 -77125 -55376 -67462
17034 -67462 -105147 -108611 -51944 14145 -4476 -57176 2321 83230 11399 -31171 -38751 10183
17022 10183 10905 72680 165864 107556 7312 7474 -15948 -7879 -42947 4743 80280 95476
17010I5476L6116o3445j00780l4389J1945J12097J63058L6894j6026k218n921
16999B32807j14570N4429O4785j667J7141o4754N994o2314p5416N7193n405R0652
16987A98875N265l3642k1451p9909j16264m5396M1484Q2419Q1007R09l9687k7710
16975D5900L3767O6504M6341j575r760j7598n581n1823q3155m7482M8290O861
16963C0689J6649p9476k8261J06345Q5567l2224q0844J8230P3477O8029L3584
16952B11765m7531q4383j38368l8388P5313L7369K4983M3851m9638m4619M8587
16941C8941N0264M4106j8182o3474j7279M1067l8195o1193n8159n1171n2807r185
16929a95267K0646O949l130m3155M6996J60194R5915m230O9110l6636K7000j7300
$$ plain form
17010 95476 131592 68147 -32633 -67022 -55077 57020 220078 256972 240946 238728 232807
16999 232807 118237 172666 237451 235784 252925 188171 194165 131851 56435 113628 108223 198875
16987 198875 204140 170498 149047 69138 -47126 -92522 -51038 31381 112388 113297 73610 45900
16975 45900 79667 146171 192512 190937 181177 163579 157998 106175 23020 -24462 23828 30689
16963 30689 47338 -32138 -60399 45946 131513 99289 18445 36675 110152 178181 211765
16952 211765 164234 79851 -58517 -96905 -21592 15777 40760 84611 34973 -9646 38941
16941 38941 89205 133311 115129 51655 34376 75443 37248 -23945 -82104 -133275 -186082 -195267
16929 -195267 -174621 -167672 -170802 -213957 -166961 -6767 89148 84918 154028 117392 144392 127092
16917A27092j0215n6424m7758L0711J5318p8894k421J0515J00043O1621p1140
16906G8448O5187J4010j7586L3986L04j4908L235P3815P0396n3516m7742r318
16894A96311l3672o8028J1362N941M899J06326l4672q9325J7178K2141K5145l6670
16882A26936m9274L3944M4577K7800R6342m3131r4163o304l7227P1991m4739j6757
16870A09995N33j2812J42146L9498M5351l8580o5101r5240l5445q309R5148O7372
16858B44556q4231nk2370K2213R49Q3107n834r0254O8442L7011n2620m329R5028
16845B91663L045J1704l7319K9704L2257l9101m4551n8259m4845l8434N6962K7655
16833A90481L9477P3452J35210k0890m7937J3229M0288L0119k859q8251j00573
$$ plain form
16917 127092 116877 60453 12695 43406 58724 -20170 -22591 -12076 87967 149588 78448
16906 78448 143635 157645 140059 174045 174349 159441 162676 236491 306887 253371 205629 196311
16894 196311 162639 94611 105973 111914 116813 223139 188467 99142 116320 138461 163606 126936
16882 126936 77662 111606 156183 183983 280325 237194 143031 136727 99500 171491 126752 109995
16870 109995 110528 97716 239862 279360 324711 286131 221030 125790 90345 82036 177184 244556
16858 244556 160325 160320 137950 160163 161112 244219 238385 148131 216573 253584 200964 196635 291663
16845 291663 294708 306412 269093 298797 331054 291953 247402 189143 144298 105864 162826 190481
16833 190481 229958 303410 438620 417730 369793 383022 423310 453429 450570 362319 261746
16822B61746j1634Q9679Q0328J5025j07604M2301J8887r089O3554J569J7114K7014
16810D88890M4593L1848l6603m685k4053L5938q0096m5655K4632P1982J25364
16799F32155j02577m3096L8268O2545L2033l8664N7189k1556J7058j9567L0563
16788F44351J02232P4771j6948L6793N8208J40628Q9554K9966P5427R8352O911
16777A340245l3194J37909J43031J07223J58625M7821M1422K03670J92559J21060
16767B460371J77231L72010M33559M40417N61289P49217Q58365J026190J168197
16758H246846J336335J697954K042021K748625L695631N413046Q505152J4547938
16750D8233548K4798038L5955264M1404910M2664246M1015587K9209692Q651617
$$ plain form
16822 261746 250112 339791 420119 435144 327540 369841 388728 379639 443193 444762 461876 488890
16810 488890 533483 565331 528728 524043 499990 535928 455832 410177 434809 506791 632155
16799 632155 529578 486482 524750 587295 619328 580664 637853 616297 633355 613788 644351
16788 644351 746583 821354 804406 841199 899407 1040035 1129589 1159555 1234982 1333334 1340245
16777 1340245 1307051 1444960 1587991 1695214 1853839 1901660 1943082 2146752 2339311 2460371
16767 2460371 2637602 3009612 3443171 3883588 4444877 5194094 6052459 7078649 8246846
16758 8246846 9583181 11281135 13323156 16071781 19767412 25180458 33685610 48233548
16750 48233548 73031586 108986850 150391760 193056006 234071593 263281285 271932902
16743B71932902r710795k4425639l7064314m2585094l9888689l2663026k3837717
16736F1757628j5919890j0385334o816898m777570l455105k615702k090501j703094
16728A3993534j478136j391016j279257j143904r12837q37748q18786p60233m64796
16719D906821m79201k98341k77557k38079j84615k94464k27407j59974k13813
16710B533370k76551k14640k12723k12592o1392j33704j02461p5460n1477j27589
16700A064781j08037q8640q849k9421q6504j04945k3855p649l5003L8971k8283
16689E82566j15388o1260l0090l6806K8464j4206n1540J6128k529j01629l8869
16678A74841M9542K2374m4382k403K0824j7919J8921p2933p9956J3334N7634R6646
$$ plain form
16743 271932902 262222107 237796468 200732154 158147060 118258371 85595345 61757628
16736 61757628 45837738 35452404 28635506 23857936 20402831 17787129 15696628 13993534
16728 13993534 12515398 11124382 9845125 8701221 7788384 6950636 6131850 5371617 4906821
16719 4906821 4427620 4129279 3851722 3613643 3429028 3134564 2907157 2747183 2533370
16710 2533370 2256819 2042179 1829456 1616864 1555472 1421768 1319307 1243847 1192370 1064781
16700 1064781 956744 868104 859255 829834 743330 638385 614530 606881 571878 610849 582566
16689 582566 467178 405918 375828 339022 367486 353280 301740 317868 315339 213710 174841
16678 174841 224383 246757 202375 199972 220796 202877 221798 148865 68909 82243 139877 236523
16666B36523P5194l9958q1688o019m561K4581r670r8945M5080Q4402k240n1217
16654A71482r7186R4017J6774k5176k3690l6859m6611o3594l0366l8641l9490
16643a19340L4068K6991n3962L7602O3423K6615O977Q281k357J2119j5316R716
16631C4817k6653m79L1927K4366K3045J5128l0815P0284J8990l7047r4136N371
16619C4798j2298J17495J11785L28j02301j12936l5252K3866o8068p640J5267
16608c4956N7034j3483p3857K7965L4525L7092k8668m7238L5240J774O6750k7992
16596C4186p886K7570q679o0467j1206P3332Q3102N202K9630n568k4066m8293
16584H6857J3625j8128m3343o6469J00488J40800J1725p2651L4387R7593J71865
$$ plain form
16666 236523 311717 271759 190071 184052 179491 204072 194402 95457 140537 224939 222699 171482
16654 171482 74296 168313 185087 159911 136221 99362 52751 -10843 -41209 -79850 -119340
16643 -119340 -85272 -58281 -112243 -74641 -11218 15397 22374 30655 28298 40417 25101 34817
16631 34817 8164 7685 39612 63978 87023 102151 71336 141620 160610 123563 29427 34798
16619 34798 22500 139995 251780 252108 149807 36871 1619 25485 -42583 -50223 -34956
16608 -34956 22078 8595 -65262 -37297 -2772 34320 5652 -41586 -6346 -4572 62178 34186
16596 34186 26300 53870 45191 -15276 -26482 46850 129952 135154 164784 159216 135150 86857
16584 86857 100482 82354 39011 -27458 73030 213830 225555 152904 187291 284884 456749
16573D56749J22346J64479M4167n3294k0343n6348j41159p4319j6549j8778p4603
16562C32348m614L8365O4877j3897L9683r779L4936j05271l7081j9883p7787o5060
16550A76837n0510l4542M939L3955k1117k4917m9214n8240N0964k8790j9818n6104
16538g6557k7196L8542J3821j2400J8159k9387o4997O1680m7527k8286P6919J7474
16526e9755M0669K1148L2296M76k263m6110N453P842N1013P5827l8072o1419l3474
16513f369O0723N2316n2841l9390l2363Q625o6795n3280R9089L8876K0064O2677
16501I1332m4236j44092l1026M0456R8591l28k9671n8445j6388o2323J1978J06560
16489c7592o6439p8583O9439N7110r5k6556K4060K3215L6809M1308N8593l0659
$$ plain form
16573 456749 579095 743574 787741 734447 714104 657756 516597 442278 425729 406951 332348
16562 332348 327734 366099 430976 417079 456762 446983 481919 376648 339567 319684 241897 176837
16550 176837 126327 91785 96724 130679 109562 84645 35431 -22809 28155 -635 -20453 -76557
16538 -76557 -103753 -65211 -51390 -63790 -45631 -75018 -140015 -78335 -125862 -154148 -77229 -59755
16526 -59755 -19086 2062 34358 34834 32571 -13539 -8086 -244 50769 126596 88524 27105 -6369
16513 -6369 54354 106670 53829 14439 -17924 -9299 -76094 -129374 -30285 8591 28655 91332
16501 91332 47096 -96996 -128022 -87566 11025 10697 -18974 -77419 -93807 -156130 -144152 -37592
16489 -37592 -104031 -182614 -113175 -56065 -56160 -82716 -58656 -35441 1368 42676 101269 70610
16477G0610m0952L2391L4541L4658q3453J1580J17421o0145q7343r552Q7590l588
16465A03758p426R595J1421o7840n5362l0166k2993j7330P6886k1561N6816M2646
16453G8444K3488k9847J0363l5456j13001R3588K3475r688j9408q6143J8433M2996
16441b756P805l5633P575N2517l1793m5577L1124Q0812M5833N4735J6482k3595
16429A57529m1516j11288j02299j250J2813P2399l3054j1704P3464N1739K212
16418F9045k8666m2259J0243l9969K786J5230J7661m6128m8795k2061J4573N4566
16406d3774M7508N5295R711m434j15935p9987M9771M3998k4482j3245K566r9731
16394a72739M0285L5355L3256N6613j3956j10478P3967Q1266L8792N8543j6456
$$ plain form
16477 70610 29658 62049 96590 131248 47795 59375 176796 116651 29308 19756 107346 103758
16465 103758 96332 105927 117348 49508 -5854 -36020 -59013 -76343 543 -21018 35798 78444
16453 78444 101932 72085 82448 46992 -66009 27579 51054 41366 21958 -64185 -45752 -2756
16441 -2756 5049 -30584 -23009 29508 -2285 -47862 -16738 64074 109907 164642 181124 157529
16429 157529 116013 4725 -97574 -98824 -86011 -13612 -46666 -58370 15094 66833 69045
16418 69045 40379 -1880 8363 -31606 -28820 -13590 4071 -42057 -90852 -112913 -98340 -43774
16406 -43774 3734 59029 68740 64306 -51629 -131616 -81845 -37847 -62329 -75574 -73008 -172739
16394 -172739 -132454 -97099 -63843 -7230 -21186 -131664 -57697 23569 62361 120904 104448
16383A04448j7549O5993J0718q4408l1305j3593J05858o3482r8671o7182O7478
16372b1695J25797M7783m4280j15468r6709N8024N8346J3761Q8770l5284p0829
16361H216j40711n1731J59919P0056m2455K5220j1094j3189K6223K7234K0996
16350G8684P2840k5979k2094r773j4587L7268o193j06467j2865P659j4274L0682
16338A4901j1824j4594o332L0446k0328n4557K0288l343J7386J3270M6226m3101
16326a1562m1021m116M5773M4589M2044k7120k1924m4684l1319M3366J05060q0676
16314A8410q1393n0477M462j6594l247N5999j3303m3832N7685m1076K011k186
16302a13541l0229J5127K5420N0788K7881j00487n3836L749M6104O3850O438N0026
$$ plain form
16383 104448 86899 152892 163610 79202 47897 34304 140162 76680 -21991 -89173 -21695
16372 -21695 104102 151885 107605 -7863 -104572 -46548 11798 25559 114329 79045 8216
16361 8216 -132495 -184226 -24307 45749 3294 28514 17420 4231 30454 57688 78684
16350 78684 151524 125545 103451 93678 79091 116359 110166 3699 -9166 -1507 -15781 14901
16338 14901 3077 -11517 -17849 12597 -7731 -62288 -42000 -45343 -27957 -14687 31539 -11562
16326 -11562 -52583 -56699 -10926 33663 75707 48587 26663 -18021 -49340 -5974 99086 18410
16314 18410 -62983 -113460 -108998 -125592 -128839 -72840 -86143 -129975 -72290 -113366 -111355 -113541
16302 -113541 -143770 -128643 -103223 -52435 -24554 -125041 -178877 -175128 -129024 -65174 -58736 -8710
16290h710n6481n6082O0479K0658k2857N5276P0875J02359l0541L6606l1505k2009
16278A18068p0489q800N6680l0322j15306l9382k7732Q727O3798L9552L4424n6771
16266b7553n5719j4677O4069N2064L0369q093L7378k3203o4428m286K160J6238
16254D319R48M227J1297j2232M8271J3179q0066o2165K144J8103k5410J2827M3485
16241b1073K5843p30K0617L9081p3630r6029k6672J870P555K5968K9647J4722
16229e2831L5040M6136J3696k9396m6036j9661K7643Q4687M7922K8023j0263M2929
16217A67889q6809J863L652r4506j4549O1220L7628l5362k2470m2036m5424J0716
16205e8188o5366M2116J27089L1657m8896p8902p6888m1082J59447J03666R0387
$$ plain form
16290 -8710 -65191 -121273 -60794 -40136 -62993 -7717 63158 165517 134976 171582 140077 118068
16278 118068 47579 38779 95459 65137 -50169 -89551 -117283 -108556 -44758 -5206 29218 -27553
16266 -27553 -83272 -97949 -33880 18184 48553 40460 77838 54635 -9793 -14079 -11919 4319
16254 4319 5267 9494 20791 8559 56830 70009 -10057 -72222 -70078 -51975 -77385 -64558 -21073
16241 -21073 4770 4040 24657 63738 -9892 -105921 -132593 -130723 -123168 -97200 -67553 -52831
16229 -52831 -17791 28345 42041 12645 -33391 -53052 -25409 59278 107200 135223 124960 167889
16217 167889 81080 82943 86595 -7911 -22460 38760 76388 41026 18556 -23480 -68904 -58188
16205 -58188 -123554 -81438 45651 77308 28412 -50490 -127378 -168460 -9013 94653 185040
16194A85040n9661j01778k7436P5036J91812K02406K17010K77696K00875J20951
16184A281951N3132J5685l3717j14136j47103k14410k71845k46635o5156l715
16174B54051l1988m4468n2277o285l5203K1883m8212q2237M5353P9393M8231o0153
16162H8088p1295J1489K9314Q6681p9858L4866m238m4910O4200p0520m1961k0606
16150a8750R739O8347M4311J0487j5513q5484q5395o2027J08245j453J5912K7805
16138A6224n0967J7441L7476J24394J1950J9311k6293o8557R358j18921m3332
16127g1916K1121P1599L7713O6900J385k5478m1767j4735P2674Q8372m9029j23892
16115C2947K0405q825L0673o207j38980k4702L4666m676K9683o0410J6010L7879
$$ plain form
16194 185040 125379 23601 -3835 71201 263013 465419 682429 960125 1161000 1281951
16184 1281951 1335083 1350768 1317051 1202915 1055812 841402 569557 322922 257766 254051
16174 254051 222063 177595 125318 119033 83830 105713 57501 -24736 20617 100010 148241 88088
16162 88088 16793 28282 57596 144277 64419 99285 95047 50137 114337 43817 1856 -18750
16150 -18750 -9011 59336 103647 114134 98621 13137 -72258 -134285 -26040 -27493 -11581 16224
16138 16224 -34743 -17302 20174 144568 156518 175829 149536 80979 90337 -28584 -71916
16127 -71916 -50795 20804 58517 125417 126802 101324 59557 44822 117496 205868 156839 32947
16115 32947 53352 44527 75200 68993 -69987 -94689 -60023 -64699 -35016 -95426 -79416 -41537
16103d1537O2275Q3545Q0532k7218q0391l8613j00418J7739k1981M1325J02718
16092G7976K3385K8503p5307q3950J00019M3363n8127j3585j8887k16n8120p1254
16080a06200K4192O8899P33j06491j4496j0302n1925P5967M4124r221M7296K8813
16068h611K0396J12981J3719j00820r1277r2526p6802o0871N7328L4355L3403
16057a58725Q757m400N521Q0652O6499Q7024m9290r0728l3361M8254k0882L7271
16045b3408o539L9623K4346P506p8870J1235J5764k8540l4651n2927k0385Q4583
16033f2263k0453m0420K0352Q1651K5524M1411O820k3964p3145o9971m7547J1989
16021a50016O4368k5011M1647L6387N6619k1519J17634m042o3857L3348j8863
$$ plain form
16103 -41537 20738 104283 184815 157597 77206 38593 -61825 -44086 -66067 -24742 77976
16092 77976 101361 129864 54557 -29393 70626 113989 55862 42277 23390 23174 -34946 -106200
16080 -106200 -82008 -13109 -12376 -118867 -133363 -143665 -195590 -119623 -75499 -84720 -37424 -8611
16068 -8611 11785 124766 138485 37665 -53612 -146138 -222940 -283811 -226483 -192128 -158725
16057 -158725 -149968 -154368 -148847 -68195 -1696 85328 36038 -54690 -88051 -39797 -60679 -23408
16045 -23408 -29947 9676 34022 41528 -37342 -26107 -10343 -38883 -73534 -126461 -146846 -62263
16033 -62263 -82716 -123136 -102784 -21133 4391 45802 52622 28658 -44487 -114458 -162005 -150016
16021 -150016 -85648 -110659 -69012 -32625 23994 2475 120109 116067 52210 85558 66695
16010F6695q8508J8925M9844p330N4296m3759q7752L9248J8470K4818k67Q5100
15998A29780p2494j8365M2376j4591k4300N3928L7861m6689n2686q1244o4623
15987a11047m1569j8937J6745L3290J4778O6630M9053q9028K5773M0153L5781
15976B1622L3384p8974R22K0185o162j9472K8834J2860p2637n7653L1531K3387
15964f2173O5212k8404L2939O2236r966p0980m020K9314K36m70R796L6766K8808
15951H9294P234n6828m0163O7507k8869r4899K1815j7358P2574O3906L517q7137
15939E93J7160n477J8865k7295L7855m1377k8846L5942j9054n2463m324m5487
15927a13908K1988k9L9945K6563m3667j2249n151j6552Q285r5325q466O8574n6354
$$ plain form
16010 66695 -21813 -2888 46956 39626 93922 50163 -37589 1659 20129 44947 44680 129780
15998 129780 57286 38921 81297 66706 42406 96334 134195 87506 34820 -46424 -111047
15987 -111047 -152616 -171553 -154808 -121518 -106740 -40110 8943 -80085 -54312 -14159 21622
15976 21622 55006 -23968 -23046 -2861 -9023 -28495 339 13199 -59438 -117091 -85560 -62173
15964 -62173 3039 -25365 7574 69810 59844 -11136 -15156 14158 14394 13924 23720 60486 89294
15951 89294 96528 39700 -463 67044 38175 -56724 -34909 -52267 20307 84213 87730 593
15939 593 17753 12276 31141 3846 41701 324 -28522 7420 -11634 -64097 -68421 -113908
15927 -113908 -91920 -91949 -52004 -25441 -69108 -81357 -86508 -103060 -94775 -190100 -198566 -129992 -186346
15914a86346M1854N6958Q0172P3851n7405m2817k1166n9256J700L7044P6253P1752
15902G2594K4212m7394k2654N1991n7836p8936n594O5424O2368n010r847p2836
15890b3518l4198M6116j4218N440L9106n7827l1412q557j846k8764o2068N3571
15878a18175M5575m1418o204O4279R253M3732N3244M970J2098l8045O1703l9058
15866E1954j51083n9772O3059M1027l202p4526m4125O5126j8484m4592N6791R4464
15854b3363P110p5103k2378M3088J1412j7493K3710J6706l3243p0574N5908r962
15842i4182L3842K5941m802O0418J7083L3201Q978q2966N3364O908j7849J8834
15830E8770k1454l9395k6609M8435L8187o8244l4967J0456l1433k3757L5241N3269
$$ plain form
15914 -186346 -144492 -87534 -7362 66489 9084 -33733 -54899 -114155 -112455 -75411 842 72594
15902 72594 96806 49412 26758 78749 20913 -58023 -63617 1807 64175 59165 49318 -23518
15890 -23518 -57716 -11600 -25818 -20378 18728 -39099 -70511 -79068 -80914 -109678 -171746 -118175
15878 -118175 -72600 -114018 -120222 -55943 -46690 -2958 50286 55256 67354 29309 91012 51954
15866 51954 -99129 -158901 -95842 -54815 -58017 -132543 -176668 -111542 -130026 -174618 -117827 -23363
15854 -23363 -16253 -91356 -113734 -70646 -59234 -76727 -53017 -36311 -69554 -140128 -84220 -94182
15842 -94182 -60340 -34399 -39201 21217 38300 71501 80479 -2487 50877 57785 39936 58770
15830 58770 37316 -2079 -28688 19747 57934 -10310 -45277 -34821 -66254 -90011 -54770 -1501
15818a501K8325N977j00735j2701O2154m1350n9724l4500J16220P2271J9133k7293
15806B6276J1746L1226r027J215j1854L0035j2107j2294k3927J1046P9870m1451
15794H0754k1127K0183M7315o570j03205j10551P2616O9204l8557m6069o2518
15783i8525K8778J33872j7458J3352L014P683l838M453m2502L4362L3623n2796
15771D4018L4799j5557j7671q309K2592m5255J3075o5556k2567M581P7793Q1125
15759A03068q6981j8861J0429m8572l5237j2892N9890P8042q100l0655n3630J768
15747d1731n350k7633l8082j6287m5925J40490P3466k6313l7976J12440N3871
15736A40970q1704k5980r0182k775k9297K5627k9401l7295O7265L2835J8847L8990
$$ plain form
15818 -1501 26824 32801 -67934 -80635 -18481 -59831 -119555 -154055 -37835 34436 53569 26276
15806 26276 38022 69248 60221 61436 49582 79617 67510 55216 31289 42335 122205 80754
15794 80754 59627 79810 127125 120555 17350 -93201 -20585 48619 10062 -36007 -98525
15783 -98525 -69747 64125 46667 60019 63033 70716 66878 71331 28829 63191 96814 44018
15771 44018 78817 63260 45589 37280 59872 14617 27692 -37864 -60431 -55850 21943 103068
15759 103068 16087 -2774 7655 -40917 -76154 -89046 -29156 48886 40786 10131 -43499 -41731
15747 -41731 -47081 -74714 -112796 -129083 -175008 -34518 38948 12635 -25341 87099 140970
15736 140970 59266 33286 -56896 -59671 -88968 -63341 -92742 -130037 -62772 -29937 -11090 27900
15724B7900o1259j20520M0302J17448Q0784N3419k6663J2777m1333R920N2623
15713A45398k0187k702p3656r1532k9344L1904L2399J3400N440M766M9627O265
15701G1778n8851j3789J6238l8548l0309P187o0964N7570N7582o071j2989J6254
15689E088k5689L6433j329l3030K4895m1315N1877l3012j6036r638N4788M7237
15677F0269q55N6707M4291o0411o9867n1962j2862K7307K9258Q280K5389n2657
15665B887J25169q768j5251J5219m1360P925P8174o8009m6440n2485k4369o2549
15653h9857Q876P2414Q0742L8794n0609P5794m6639j35416J1226R7834L5380l4627
15641F3912j2644m7869j6246k3215L0096L4566l966L4417k3122K1751p294l5007
$$ plain form
15724 27900 -33359 -153879 -113577 3871 84655 138074 111411 124188 82855 92775 145398
15713 145398 125211 122509 48853 -42679 -72023 -40119 -7720 5680 11120 15886 65513 71778
15701 71778 12927 -862 15376 -23172 -53481 -46294 -107258 -49688 7894 1823 -11166 5088
15689 5088 -20601 15832 14503 -18527 6368 -34947 16930 -16082 -32118 -41756 13032 60269
15677 60269 59414 116121 160412 100001 30134 -21828 -34690 -7383 21875 30155 55544 2887
15665 2887 128056 119288 104037 119256 77896 85821 163995 95986 49546 -2939 -27308 -89857
15653 -89857 -80981 -8567 72175 110969 60360 136154 89515 -45901 -34675 63159 98539 63912
15641 63912 51268 3399 -12847 -36062 -5966 28600 24634 59051 35929 57680 50386 15379
15629A5379L2425m2949j8466l3280N5527L8363j6856K142j6246L7557j1659m6880
15617d943m9707N3004M4238j0553M1259p4612n452N1236M3939q1006r4936M1773
15605d5760N7656l4222j8646K0980L3923m2455l9172R425J8054j1125J6468L4587
15593b87j1782j590O8782K9888l7946o3246j9176P2235O6949L7094L3551J1661
15581A86133k9547M4198j3910m2960j03850k3369n2151K7349R6980P623j8087
15570G8409j2518m8948K1869p926o9304p704L8809O484N3696N4757J5901L8515
15558A62040J1801p1352j67805q150q211Q0754K3530M0084q795n5619o2016j4660
15546g8399L0081M999K9431M8604l8658Q6252M2054j5955l3089J7818j4292j1175
$$ plain form
15629 15379 47804 4855 -13611 -46891 8636 46999 30143 32285 16039 53596 41937 -4943
15617 -4943 -54650 -1646 42592 32039 73298 -1314 -6766 44470 88409 7403 -87533 -45760
15605 -45760 11896 -22326 -40972 -19992 13931 -28524 -67696 -58271 -40217 -51342 -34874 -287
15593 -287 -12069 -13659 55123 85011 47065 -16181 -35357 36878 103827 140921 174472 186133
15581 186133 156586 200784 186874 143914 40064 16695 -35456 -8107 88873 96496 78409
15570 78409 65891 16943 38812 30886 -38418 -46122 -7313 -829 52867 107624 123525 162040
15558 162040 173841 102489 -65316 -73466 -81677 -923 22607 62691 53896 -1723 -63739 -78399
15546 -78399 -48318 -43319 -13888 34716 -3942 82310 124364 108409 75320 93138 78846 67671
15534F7671L2235J0451Q866K1063o7759o9864j5241l5453N8846J07072n6851p8459
15522a7423r4384k062J10168J11886j34828j16149O3928N7990j0034O5423L2113
15511F6628l7103n0597m2347J4437J18741o171n9100o0473N2138j0973l1333J7449
15499b8704M8512o5936m3593M6709K6731l248j27764M7527P7680L4709l6182j30172
15487a53731j0659J63567N7231N2208o1908o7642J0686j1070P3802l1265k8079
15476f860l9126j359J7105Q5008j8177j305m1717k6428l6733K6424N8872K8068
15464D3772O6710j7376l6036j8961M762m2644k6063l039R0788K5090R6437j4013
15452A69427r0364o2899j2169k8384P5301l681J0828L4038k4498p4211r8186N150
$$ plain form
15534 67671 99906 110357 119223 140286 72527 2663 -12578 -48031 10815 117887 61036 -17423
15522 -17423 -111807 -113869 -3701 108185 -26643 -142792 -78864 -20874 -30908 34515 66628
15511 66628 29525 -21072 -63419 -48982 69759 63588 4488 -55985 -3847 -14820 -46153 -28704
15499 -28704 19808 -46128 -89721 -43012 -16281 -19529 -147293 -99766 -22086 12623 -23559 -153731
15487 -153731 -164390 -823 56408 108616 46708 -20934 -10248 -21318 52484 21219 -6860
15476 -6860 -45986 -47345 -30240 54768 36591 35286 -6431 -32859 -69592 -43168 15704 43772
15464 43772 110482 93106 57070 38109 42871 227 -25836 -28875 61913 87003 183440 169427
15452 169427 79063 16164 3995 -24389 50912 47231 58059 92097 67599 -6612 -104798 -99648
15440i9648L263L1402Q7621n6027k5383J3375N0624o6661j5352O7684L097L9081
15428C3076L4563j8606n8751K0672P5090J821o7442j9435M745k2211l9881l860
15416f0219K8455P1097K3549l0496j6272o418J6943m3819q0214K9590l611M2518
15404b8897K1931J7839K1211L1366P5414l3569m0802l4059j21342L112L7819m8350
15392i8327j6746j5358Q6594k6127K7604J1117J8347J7279J4173P5738N5137n1971
15380I7460n0062l0529J0477j6015n1507m6857k802L8169N2625J03120O1822J1271
15368A77172l8430j7970K2071J91j63844o3717L4726m2533J0154N0926M0415N1707
15356F0868J39174n2012j66257r0850M9220L5292l9853k9024j1804M0191j7865
$$ plain form
15440 -99648 -96385 -64983 22638 -33389 -58772 -45397 5227 -61434 -76786 -9102 -6005 33076
15428 33076 67639 49033 -9718 10954 86044 87865 20423 988 5733 -16478 -56359 -60219
15416 -60219 -31764 39333 62882 32386 16114 9696 26639 -17180 -97394 -67804 -71415 -28897
15404 -28897 -6966 10873 32084 63450 138864 105295 64493 30434 -90908 -87796 -49977 -98327
15392 -98327 -115073 -130431 -43837 -69964 -42360 -31243 -12896 4383 18556 94294 149431 97460
15380 97460 47398 16869 27346 11331 -40176 -87033 -89835 -51666 959 104079 165901 177172
15368 177172 138742 120772 142843 143034 -20810 -84527 -49801 -92334 -82180 -31254 9161 60868
15356 60868 200042 148030 -18227 -109077 -59857 -24565 -64418 -93442 -105246 -65055 -82920
15345h2920J0011l211q234K8435J9681J0190m877o6344l7009K5766l6327r828
15333a54667J01437N7128J1232n766N6583j9268n9123n7620P2151J2636r9550
15322h4827J8282R028l3290K1515m281K0948J977K272O2535K1370j0112j38860
15310a13443n9660K1690P4475l2728n1615K7513m290O555J4029m4505K7308Q0484
15298e4187L9432J0294J7073r707n2560L6765K0552k388l7086r4997M4839N29
15286h1441m2647J8131n0622n1451J2323K4117l407j718O7836P1145p1354K585
15274a06503Q4585M7044Q102r7562Q644Q4331L6437n052K5378J4070n7622l1083
15262A0769M8592P353p7466K0533N5187p389n0140l0879M6216P3385L6467L9232
$$ plain form
15345 -82920 -72909 -76120 -84354 -55919 -36238 -26048 -30925 -97269 -134278 -108512 -144839 -154667
15333 -154667 -53230 3898 15130 9364 65947 46679 -12444 -70064 2087 14723 -84827
15322 -84827 -66545 -57517 -90807 -69292 -73573 -52625 -50648 -48376 14159 35529 25417 -113443
15310 -113443 -173103 -151413 -76938 -109666 -161281 -133768 -138058 -131503 -117474 -161979 -134671 -54187
15298 -54187 -14755 -4461 12612 2905 -49655 -12890 7662 5274 -31812 -126809 -81970 -81441
15286 -81441 -124088 -105957 -156579 -208030 -195707 -171590 -174997 -176715 -108879 -37734 -109088 -106503
15274 -106503 -21918 25126 33228 -64334 -55690 28641 65078 60026 85404 99474 41852 10769
15262 10769 59361 66714 -10752 9781 64968 57579 7439 -23440 22776 96161 132628 171860
15250A71860m8168J8908j7234l6350l6968l6109j6228J1105r740m6220o7726o5801
15238a78671Q6648m536k6303P3089N9720j6130O1634l1893J7619m1895q435j04147
15226a13300r7418K01455Q3606m6332p664k731p0275j9891q773p1791M0052P3435
15214c9627o974P8053O0819q3631r8510r163J6649K4225j6811L2758M8892l1415
15202b4735R067N5537O9200J16156o8976j45086j2582j6396O663N8968M1156K6304
15190A15276p8923n1352K7060n1183o1442N951l2855n5551Q4676K9088N7648Q736
15178b871K1688m8682N9353m9744r3221N8247J21711R0534N153n4748l3554p2546
15166A320O558j9386J7269M8097k6380M6304p0200k5755q310j8974N4955L6396
$$ plain form
15250 171860 123692 142600 125366 89016 52048 15939 -289 10816 1076 -45144 -112870 -178671
15238 -178671 -92023 -96559 -122862 -49773 9947 -6183 55451 23558 41177 -718 -9153 -113300
15226 -113300 -210718 -9263 74343 28011 20347 17616 -52659 -72550 -81323 -153114 -113062 -39627
15214 -39627 -46601 31452 92271 8640 -89870 -99033 -82384 -58159 -74970 -42212 6680 -24735
15202 -24735 -15668 39869 109069 225225 156249 11163 -1419 -17815 -11152 47816 88972 115276
15190 115276 36353 -14999 12061 -39122 -100564 -94613 -127468 -183019 -98343 -69255 -11607 -2871
15178 -2871 18817 -29865 29488 -20256 -113477 -55230 66481 157015 162168 107420 73866 1320
15166 1320 7878 -11508 5761 53858 27478 73782 3582 -22173 -30483 -49457 5498 41894
15154D1894K4937j03077j0986K8894J0127N1844j6766m2496L1336O0792L1782
15143A08281N0158p1129r5865j02904J667J11729J07842l4510o3847r0342O8508
15132a0412M2774L5673l7285l1314j944k7177l703J8008j6859R2438P443m3352
15120B4290j4382M9535K7060o0246o5368n2439l9963K115M9095Q4265O0674J6716
15108H1352J3479l7364j7623l819M5667M03l6150k1874k1072q4812k7433L6175
15096g3071O1388L5402J0924M210L9606J7270p804J345O8778K112n6305l8499
15084F5356r753l0059N0082l7313l7408k451N4159l1225j3233Q687n285n3951
15072d2394o6788N1744M5130L8754n0451m3415M7006N4751m3896q4716L0584M9623
$$ plain form
15154 41894 66831 -36246 -47232 -18338 -8211 43633 26867 -15629 15707 76499 108281
15143 108281 158439 87310 -8555 -111459 -109792 1937 109779 75269 11422 -78920 -10412
15132 -10412 32362 68035 30750 -564 -2508 -29685 -33388 -15380 -32239 60199 67642 24290
15120 24290 9908 59443 86503 26257 -39111 -91550 -131513 -129398 -80303 3962 64636 81352
15108 81352 94831 57467 39844 36025 81692 82095 45945 24071 2999 -81813 -109246 -73071
15096 -73071 -11683 23719 34643 38853 78459 95729 87925 89270 158048 160160 103855 65356
15084 65356 55603 25544 75626 38313 905 -1546 52613 21388 8155 16842 11557 -42394
15072 -42394 -109182 -57438 -12308 26446 -24005 -67420 -20414 34337 -9559 -94275 -63691 -14068
15060a4068N8082Q0423M5943p6771j15981O0161N9340J30584n7826q2856J4783
15049A01814k2704K3852N7402L0130k5936n4036J1233m7690J3171k9628o2302
15038d694n1190n9327J06642Q0802N2216j9005j19207j668M6018n1288o686P3706
15026D6319q2463M891Q2107m794k281p045J00449K2765l3443p0897p1844n4674
15014g0910j0060O6648O6844l0955j2790L9909j9677o3427O7856O3145l3337J09603
15002A72849J02963K8785m0803j1726m0440n0512Q51l662P7311r0781j52749j21885
14990a29799K2125M2591m5976n6331Q0070O8359K3593o5348m1215L0759R2967
14979B1795L9653j17376k3968n4565J3058m0314L9633M4215O4533k2440J1398
$$ plain form
15060 -14068 44014 124437 170380 93609 -22372 37789 97129 227713 169887 87031 101814
15049 101814 79110 102962 160364 190494 164558 110522 121755 74065 87236 57608 -4694
15038 -4694 -55884 -115211 -8569 72233 124449 105444 -13763 -15431 30587 -20701 -27387 46319
15026 46319 -36144 -31253 50854 46060 43779 36734 137183 159948 126505 55608 -16236 -70910
15014 -70910 -80970 -14322 52522 21567 8777 48686 29009 -34418 33438 96583 63246 172849
15002 172849 275812 304597 263794 252068 211628 161116 161967 158305 235616 144835 -7914 -129799
14990 -129799 -107674 -65083 -111059 -167390 -87320 -18961 4632 -60716 -101931 -71172 21795
14979 21795 61448 -55928 -79896 -134461 -121403 -161717 -122084 -77869 -13336 -35776 -24378
14968b4378R676m9984j5245L6298J8190j469O7322J06547q401l4098j2922j2170
14956G9366J9700N9248j6846o6462q7461l6202J6449M0828O3983n256l6789P298
14944C7856M420K9092k5676n8156j05M5606N4636J2830r7520p2262n3050O7380
14932e4949Q7403L3764J4953j6256l1765k0114k1795l3711O0796M0429m7425r7704
14920h6374n6104M0696p224O0239l9571p2006k6561J4224O1028P3068k2318L8386
14908b2517q600m147O1225K1506l2709l0997J7523m5862o6442j7992l502P4712
14896e7802N9300M6995j5642j1719k8688k0187m8850l4734n2104j349J6997n5736
14884b03519L1889J13550q855l6365j2622L7763O0339K1046J01239j0969p5018
$$ plain form
14968 -24378 -14702 -64686 -79931 -43633 -25443 -26912 40410 146957 138556 104458 91536 79366
14956 79366 99066 158314 141468 75006 -12455 -48657 -32208 8620 72603 67347 30558 37856
14944 37856 42276 71368 45692 -12464 -12569 33037 87673 100503 2983 -69279 -122329 -54949
14932 -54949 32454 66218 81171 64915 33150 13036 -8759 -42470 18326 58755 11330 -86374
14920 -86374 -142478 -101782 -109006 -48767 -88338 -160344 -186905 -172681 -111653 -38585 -60903 -22517
14908 -22517 -31117 -35264 25961 47467 14758 -16239 1284 -44578 -111020 -129012 -132514 -57802
14896 -57802 1498 48493 32851 21132 -7556 -27743 -76593 -111327 -163431 -164780 -147783 -203519
14884 -203519 -171630 -58080 -66935 -103300 -115922 -78159 -17820 3226 104465 93496 18478
14873A8478p7900J9944J0615N5915j4450l8048J8015J1918l3439K2940L4313p2878
14861d4577j4965O1628O6798n2864j18745k6476N7831J18887O2097Q4239M6021
14850B39874q1271j26670q6980N6842R1564l7013q6341j7533N0538P4713Q0818
14839A58541m5142j18600o0595l5266K6642N8338J36087o4715j54155n6616Q7551
14828f7930N8911P921q0028O9331Q0806J6648l0192n7569R9485M6892L7204r2902
14816H8577q3540m5227n5765J3119O3584M6074N57l7313K3479O4671O8658K5976
14804A72850l531p1878j569j077L2028K4954l8012L3268J0641J334M8202k2852
14792A84358n5484q3667q4657n8902n7249k3594L6095N8879K4970j577P5610L2189
$$ plain form
14873 18478 -59422 -39478 -28863 27052 12602 -25446 -7431 4487 -28952 -6012 28301 -44577
14861 -44577 -59542 2086 68884 16020 -102725 -129201 -71370 47517 109614 193853 239874
14850 239874 158603 31933 -55047 1795 93359 56346 -29995 -47528 3010 77723 158541
14839 158541 113399 -5201 -65796 -101062 -74420 -16082 120005 55290 -98865 -155481 -67930
14828 -67930 -9019 -1098 -81126 -11795 69011 85659 55467 -2102 97383 144275 181479 88577
14816 88577 5037 -40190 -95955 -82836 -19252 26822 27379 -9934 13545 78216 146874 172850
14804 172850 169319 97441 95872 94795 126823 151777 113765 147033 157674 159008 207210 184358
14792 184358 128874 45207 -39450 -98352 -155601 -179195 -143100 -84221 -59251 -60828 14782 46971
14780D6971j9294Q3313K6712j12945k6899p306m4955J29175M9596j2991L7273
14769A48650l3068m5330m8718j8299j2504O2704L5125n075j7966k1956J6897m1994
14757A8466m5769p2745p5585K4282N5496K1420J3305M0161L3473J9922M1306o188
14745F7544l9975K7325J9327J7890K6645l1610N1009j7372m684l7987q8275o9800
14733g9963l1988M1403K5292j13552L6689k8161K749L9852K1001N2557Q1804r452
14721C8231n4287o8550J2280N1663L0463j518q252m6956p506K3690j8274J10663
14709F1647R6457j0008m9646o9246k9356q411N2993n6597R871N7953k4059k5417
14697F181k5719R1653N3693K5289m1107r0231r341N8625N5291J5395L9353J1358
$$ plain form
14780 46971 27677 110990 137702 24757 -2142 -9448 -54403 74772 124368 111377 148650
14769 148650 115582 70252 21534 3235 -9269 53435 88560 83485 65519 43563 60460 18466
14757 18466 -27303 -100048 -175633 -151351 -95855 -74435 -61130 -20969 12504 32426 73732 67544
14745 67544 27569 54894 74221 92111 118756 87146 138155 120783 116099 78112 -10163 -79963
14733 -79963 -111951 -70548 -45256 -158808 -122119 -150280 -147531 -107679 -86678 -34121 47683 38231
14721 38231 -16056 -84606 -72326 -20663 9800 8282 30 -46926 -54432 -30742 -49016 61647
14709 61647 158104 148096 98450 29204 -152 -8563 44430 -12167 -2296 55657 31598 6181
14697 6181 -19538 72115 125808 151097 109990 19759 10418 69043 124334 139729 179082 190440
14685A90440r9788p106J9574k5962k9213L1081N581l1634m1194M4690J4342L4892
14673A05703J7233o9903m8825l8387Q7932L9234n141n749k4044m8095o855K8211
14661C1314n716P0517J0047j02404M5423O9932q768m6732k2701p4284j9160O7584
14649A5052M8249l3567O005N2407l8721l6454l7047j0668N7308M750l3356j4981
14637b1023K4067n045r69K4383N8773j171L2850K4835j71760k6781P3704J714
14625A3577n2453J2963K9181O5472K1272L5727K4769l2991j5418J9551j2148o4330
14613D5172q3289l7348P7215j1499L0312m1780n1769O5391k2494J8774o6701m3227
14601a21243P4539M4071J0135J3609M6896m7784k7750L3646l6156j16444k1399
$$ plain form
14685 190440 90652 83546 103120 77158 47945 79026 84607 52973 11779 56469 70811 105703
14673 105703 122936 53033 4208 -34179 53753 92987 87846 82097 58053 9958 3103 31314
14661 31314 25598 96115 106162 3758 49181 119113 110345 63613 40912 -33372 -52532 15052
14649 15052 63301 29734 35739 88146 49425 12971 -24076 -34744 22564 27314 -6042 -21023
14637 -21023 3044 -2001 -2970 21413 80186 79015 111865 136700 -35060 -61841 11863 13577
14625 13577 -38876 -25913 3268 68740 90012 125739 150508 117517 102099 121650 109502 45172
14613 45172 -38117 -75465 1750 -9749 20563 -21217 -72986 -7595 -30089 -11315 -78016 -121243
14601 -121243 -46704 -2633 7502 21111 68007 20223 -7527 26119 -10037 -126481 -147880
14590a47880K9567N4524M8448P157R5929L1166J6170O683m8972m7079l1678n1130
14578c7095k4013k028l0634j7815l0843N0854L4159O6395q4106o3338L1075J54721
14566D7332L5476l9829Q360o4035o4384K8283N588o7961M7467P6885k2343J08148
14554I8987M1577L2703q2735l3458k4343p2676k8061O855M5698P386L4241o4105
14542c7931j8390N4132M4959P1841p1536l8034N0354K7317j9174m0167J9280O0539
14530A03190J8884m1962J4479L9634p0615q963K8955l507k6074k1855K263m3267
14518h838Q1150L237j21790l5643Q94k2994k2785k7195N2339M4236n2615P8235
14506c1769J5940j6714O8066j5429o4695K400J835J1958J07730N7789n2204o3363
$$ plain form
14590 -147880 -118313 -63789 -15341 -8184 87745 118911 135081 141764 92792 45713 14035 -37095
14578 -37095 -61108 -63136 -93770 -111585 -142428 -91574 -57415 8980 -75126 -138464 -107389 47332
14566 47332 82808 42979 51339 -12696 -77080 -48797 -43209 -111170 -63703 13182 -9161 98987
14554 98987 140564 173267 90532 57074 32731 -39945 -68006 -61151 -15453 -8067 26174 -37931
14542 -37931 -56321 -2189 42770 114611 43075 5041 55395 82712 63538 23371 42651 103190
14530 103190 122074 80112 94591 134225 63610 54647 83602 80095 54021 32166 34429 -8838
14518 -8838 72312 75549 -46241 -81884 -80990 -103984 -126769 -153964 -101625 -57389 -110004 -31769
14506 -31769 -15829 -32543 35523 20094 -44601 -42201 -40366 -28408 79322 137111 84907 21544
14494B1544o7430k8395k134J39682Q7528L5233o1700p4113k6173J912P2924N2296
14482A51174j0439l2424k7411p0744j11078k3207N2777K9587R4995P083L9008
14471I9321j7832n8979j6925M9969j5936J811j9493J5169J8150O7111P334o7706
14459F1994l9933K698m948k7655o1640J9096N990J1889j6823M8143j7408J6M0320
14446B1739j7373o61r984L4118l7498R1000O6131L8686j4105j05335o2062l480
14434A176n5946J3082J10329K4811J965r396p471n7381q0350L7672M7751j7404
14422H838R296Q519J1364K6521J8777p2278q0793L412K7443j7419l0372j0103
14410i6795L663n377P3361J3530L5359O9732M5502p7620J0353n7535o9918O7350
$$ plain form
14494 21544 -45886 -74281 -76415 63267 150795 186028 124328 50215 24042 25954 98878 151174
14482 151174 140735 108311 80900 10156 -100922 -124129 -71352 -41765 53230 60313 99321
14471 99321 81489 22510 5585 55554 39618 41429 21936 37105 55255 122366 129700 61994
14459 61994 22061 24759 19811 -7844 -69484 -50388 -44398 -32509 -49332 -1189 -18597 -18581 21739
14446 21739 4366 3705 -6279 27839 -9659 81341 147472 186158 172053 66718 4656 1176
14434 1176 -54770 -41688 68641 93452 95417 86021 78550 21169 -59181 -21509 26242 8838
14422 8838 18134 26653 38017 64538 83315 11037 -69756 -66344 -38901 -56320 -86692 -96795
14410 -96795 -93132 -98509 -25148 -11618 23741 93473 138975 61355 71708 14173 -55745 11605
14398A1605N1160o0014j5833R461r409k2444J00092K6876m164O0263j036m2891
14386A03666q7105o8198j19947P964M0767n0997m8109M3392J23376J05599M2068
14375I2476j7518p1734M4613M583j9478o460l2347n1345J35973M9382l4894N5850
14363A49101l1804j04821m6248K6238K8638n8646n7200K863P3951M9990K581K5195
14351E9838K1991l3613j04046N6851J51209p1379k6838n2296L2138r545M3097
14340F7407K6562k0618j42323K3370J36127J7556n1874J9272k3436l6263l6012
14329b0232L2438J554o8848Q980M3085k8590o451j2238Q0926R6474p0677l7413
14317A9008l9948L6907M5722l6574o9879p3673R9992N5904K2q875l011j3526Q1032
$$ plain form
14398 11605 62765 2751 -13082 -3621 -13030 -35474 64618 91494 87330 147593 146557 103666
14386 103666 16561 -51637 -171584 -163620 -122853 -173850 -221959 -178567 -55191 50408 92476
14375 92476 74958 3224 47837 52420 32942 26482 -5865 -57210 78763 128145 93251 149101
14363 149101 117297 12476 -33772 -7534 21104 -37542 -94742 -91879 -17928 32062 34643 59838
14351 59838 81829 48216 -55830 1021 152230 80851 54013 1717 33855 24310 67407
14340 67407 93969 73351 -68972 -45602 90525 108081 56207 75479 52043 15780 -20232
14329 -20232 12206 13760 -55088 -46108 -3023 -31613 -38064 -50302 30624 127098 56421 19008
14317 19008 -20940 15967 61689 25115 -44764 -118437 -18445 37459 37481 28606 25595 12069 93101
14304I3101K8072q292J10331M9114j1777n9486n3719p2817m0865K2721L7907L7348
14292A31638j6586m1877M5957R308l3111r573n6415k9022l4081j07952j8639N5985
14280a04368J34831M9255o6667j0317p0258r5154j2831N2797J18818N7526j2727
14269D0905l9345n3714Q0419k4572p3095j7369R2749P8379p051j8112L2460J01713
14257A93367J4713l7873j3575r7610l8123l6224n2189Q079J4386k1037J929O4710
14245E53O2703l8384M167J7711q3669o1184L77L6979Q0032Q6946L3931J0875r06
14232A50131j10998q8845j8587M101J16582k9058L357J7131N929J6798k8507j02975
14220f4941l9343L9707j3071P263R1823O3032O626R5049J1146j27241k2323Q1897
$$ plain form
14304 93101 121173 112881 223212 272326 260549 201063 147344 74527 33662 56383 94290 131638
14292 131638 115052 73175 119132 128440 95329 85756 29341 319 -33762 -141714 -160353 -104368
14280 -104368 30463 79718 13051 2734 -67524 -162678 -175509 -122712 -3894 53632 40905
14269 40905 1560 -52154 28265 3693 -69402 -86771 5978 84357 77306 59194 91654 193367
14257 193367 208080 170207 156632 59022 20899 -15325 -67514 -59435 -45049 -66086 -64157 553
14245 553 63256 24872 29039 46750 -36919 -98103 -97726 -60747 19285 106231 140162 151037 150131
14232 150131 39133 -49712 -68299 -64198 52384 23326 26683 43814 49743 66541 38034 -64941
14220 -64941 -104284 -64577 -77648 -70385 21438 84470 91096 186145 197291 70050 47727 129624
14208A29624N4125o4445j26299L558K5443m9488n6199K7396N2379p9908M0491
14197d3323J33445J8532L3725k6883k8213O6846j1133k4809p2153m7263l2603
14186c3832l6454N6584M9072J882o4372j9222l8306J1880L2516N3851n8622K9455
14174a5568J20974l4445j4052l845K917L3462m0368P23o4588k4586L0869O8806
14162F0299J5711L306l97j946n810J26925J9489j1155n6960k2270l0099j8564
14150G8529L6549j5650k6777j444K3701j0073p3448k0050Q870j3851j88P5658
14138F1826J5770r7665k6091L329k5506o56K6571p296N3934O1068K2477K5380
14126A13141N0942n7208m2306J5067l4615n9704P5352Q6080L5390j22929n5180
$$ plain form
14208 129624 183749 119304 -6995 -3437 22006 -27482 -83681 -56285 -3906 -83814 -43323
14197 -43323 90122 108654 142379 115496 87283 154129 142996 118187 46034 -1229 -33832
14186 -33832 -70286 -13702 35370 37252 -27120 -46342 -84648 -72768 -40252 13599 -45023 -15568
14174 -15568 105406 70961 56909 53064 55981 89443 49075 49798 -14790 -39376 -8507 60299
14162 60299 76010 79316 78919 76973 71163 198088 217577 206422 149462 127192 97093 78529
14150 78529 115078 99428 72651 71207 94908 84835 11387 -8663 207 -13644 -13832 61826
14138 61826 77596 -20069 -46160 -42831 -68337 -68993 -42422 -49718 4216 65284 87761 113141
14126 113141 164083 106875 64569 79636 45021 -14683 60669 146749 182139 59210 4030
14115D030m9285j2715J8648M0230L2729Q9175N4973m4571k7757m6857k2457m8525
14103a2382J6262r0870o0537L4321L2997O4013J25680J9873l0995n0140m0791
14092G431q1122n046P3813O770L5748o962K1424J9042L7135K0908l8704k1693
14080F8744P009N8117N5100J7200r9623j02630l8554p6007j6457L777m1198P5325
14068h9197N1919m608l4495M1050k4581j9987O2768N3647J3826j002j1480l909
14056C3951j7811j1814l2303l9826K9999M479K1538P6502m2097m041P1144K1577
14044A11298j05746p7572L548j6912J06300L5375M1463M8323n6581l8178J1804
14033F3122l0160P4872m8408K2870N7416l5042L7564K656p4513k4510m2782J05594
$$ plain form
14115 4030 -45255 -57970 -39322 908 33637 122812 177785 133214 105457 58600 36143 -12382
14103 -12382 3880 -86990 -147527 -113206 -80209 -16196 109484 129357 98362 48222 7431
14092 7431 -73691 -78737 -4924 1846 37594 30632 52056 71098 108233 129141 90437 68744
14080 68744 75753 133870 188970 206170 106547 3917 -34637 -110644 -127101 -123324 -164522 -89197
14068 -89197 -37278 -41886 -76381 -35331 -59912 -79899 -17131 36516 50342 49340 37860 33951
14056 33951 16140 4326 -27977 -67803 -37804 -33325 -11787 64715 22618 18577 89721 111298
14044 111298 5552 -72020 -68472 -85384 20916 56291 97754 146077 89496 51318 63122
14033 63122 32962 107834 59426 82296 139712 104670 142234 144890 70377 45867 3085 108679
14021A08679k4532j38394n6727Q141J1368M1936K0174L3272l0052l7198K9811
14010c3522J4492K4796j2349J4370Q1408j9791o1757M6005Q2698O898K8879J442
13998A73569J6465k4305m602o3521o0816k0864l438l5016p8436Q0595r9168j7616
13986a37153J24463L6332N1535L0240l0880j23804m155o4556N097l3634j8978
13975a65493L2082j0896K6076J91502L7840k0159J1250J7121L8041j995M019o1582
13963I7806J3699j1381K3088q121K6394J10570O474j78915j45136M4739R7220
13952G6437R411K0348l6745N3244K4186J8974L2570O027p2768m9608o0401l3021
13940a1346J23913Q6875K4270l926J9721n5129o7995j08102L9140k7207k9750
$$ plain form
14021 108679 84147 -54247 -110974 -102833 -91465 -49529 -29355 3917 -26135 -63333 -33522
14010 -33522 -19030 5766 -6583 7787 89195 69404 7647 53652 136350 143248 172127 173569
13998 173569 190034 165729 161127 97606 36790 15926 12488 -22528 -100964 -20369 -119537 -137153
13986 -137153 -12690 23642 75177 105417 74537 -49267 -53422 -117978 -112881 -146515 -165493
13975 -165493 -133411 -144307 -118231 73271 111111 90952 102202 119323 157364 155369 159388 97806
13963 97806 111505 100124 123212 115091 141485 252055 258529 79614 -65522 -20783 76437
13952 76437 85848 106196 69451 122695 146881 165855 198425 204452 131684 82076 21675 -11346
13940 -11346 112567 199442 223712 219786 239507 184378 116383 8281 47421 20214 -9536
13929i536O8264K0485l1306q265K7545J06093M89q6002m4214l3689k4186O6521
13917E2199Q9530J6643l7619n168j4553m5005o2529n186j2178l1800L2006K7886
13905D226j0735L6000l8334m208l4338O4834N3104l258r757k840M8222k2665j2971
13892F7280j33600k106L6758J0170m2133N0938M6259P3466L5238K6368l5586p3767
13880E9285j4657P8317K1231q0547m3030O7603m0097l1213l4296R098K8912m6487
13868b5881r2022J41064M3399K1003p8637m2418J9892j133N1350N6888j3665j8246
13856F1594j8181M8899M9998K6997M464n6774k6481q3277q7919O5072K090K9646
13844A6128N5791N9653K9776o220j7040R2059P6606p1801r7470o8035N6284Q8312
$$ plain form
13929 -9536 58728 79213 47907 39642 67187 173280 173769 87767 43553 9864 -14322 52199
13917 52199 141729 158372 120753 115585 101032 56027 -6502 -11688 -23866 -55666 -23660 4226
13905 4226 -6509 29491 -8843 -13051 -47389 17445 70549 67291 57534 54694 102916 80251 67280
13892 67280 -66320 -68426 -31668 -21498 -63631 -12693 33566 107032 142270 168638 133052 59285
13880 59285 44628 122945 144176 63629 20599 88202 48105 16892 -17404 -8306 20606 -25881
13868 -25881 -117903 23161 66560 87563 8926 -33492 -13600 -14733 36617 93505 79840 61594
13856 61594 43413 92312 142310 169307 173771 116997 90516 7239 -80680 -15608 -13518 16128
13844 16128 71919 131572 161348 155128 138088 230147 306753 234952 137482 69447 125731 214043
13832B14043L3854n6251p4264n9512j1597J03940J5406r8869J4319m4877M0913
13821G7105K8005q185L8181l8494m9762O2468j7832p0386q8085J8051J22579P2457
13809A46102Q887m5805M8721m418r3335K736R6348o7886m4587k6576R071m1394
13797a2136o9390J02957Q6539k9055r795L508J5189L7428j02857p4463m3204L4334
13785f0945J30034J777k2304k0669L8759l5967l8456l117K3205j7930p4497o2583
13773a42693J1879J31422M4264l8898j570N8487L2581j7593K3371k4364q9831
13762a2945k2868L3916L2856K2852j31201o6571j2464k231M7760L4628L6862M7114
13750G708P682N0746m431N7823m5206M9854p336K9461o1858j24501J8002M3154
$$ plain form
13832 214043 247897 191646 117382 57870 46273 150213 165619 66750 81069 36192 77105
13821 77105 105110 96925 135106 96612 46850 109318 91486 21100 -66985 -48934 73645 146102
13809 146102 154989 109184 157905 153487 60152 62888 159236 91350 46763 20187 29258 -12136
13797 -12136 -81526 21431 107970 78915 69120 72628 87817 125245 22388 -52075 -95279 -60945
13785 -60945 69089 70866 48562 27893 66652 30685 -7771 -10888 12317 -5613 -80110 -142693
13773 -142693 -130814 608 44872 5974 4404 62891 95472 77879 101250 76886 -12945
13762 -12945 -35813 -1897 30959 53811 -77390 -143961 -156425 -158656 -110896 -76268 -39406 7708
13750 7708 15390 66136 61705 119528 74322 124176 116840 146301 84443 -40058 -22056 21098
13738B1098O8635n1682j1879J32846R9222O0893l3844o0949l3242q2334r2279
13727A6485K3792J22305O0636k6899l8818J5814o7851j2996L8469L7271N4467
13716B22675m894j285K6951m4677J6516o7375j39031M1189Q6109l5674n1440J5197
13704F4261M3741N503k9914L2049M9271M1290n0841M0531Q5230R2554Q1707J3779
13692D69161P8426Q1982J6186l9270l8531P436M7091Q3781N11k0005o762k7034
13680F52972j08658k13845j08949n2129Q8702l3435j23535L6396P9687Q772j6976
13669B09002p3039K9346N6974k4567j05699l8611L0237O7041l5L933J0606O3776
13657B28964j7237p2847j5247r895N4831J20436J40543P0982J0340l4132k8839
$$ plain form
13738 21098 89733 38051 26172 159018 258240 319133 285289 224340 191098 108764 16485
13727 16485 40277 162582 223218 196319 157501 173315 105464 92468 130937 168208 222675
13716 222675 217781 216496 243447 198770 215286 147911 8880 50069 136178 100504 49064 64261
13704 64261 108002 113505 83591 115640 164911 206201 155360 195891 281121 373675 455382 469161
13692 469161 547587 629569 645755 606485 567954 575390 622481 706262 706773 686768 680006 652972
13680 652972 544314 330469 221520 169391 258093 224658 101123 137519 217206 225978 209002
13669 209002 135963 165309 222283 197716 92017 53406 83643 150684 150649 154582 165188 228964
13657 228964 211727 138880 123633 113738 168569 289005 429548 500530 510870 476738 447899
13646D47899M4242J17528L72442L35796K02229q675j07767k76836k37892k75416
13636F13550j70324m3050j0674m8732j7724K7861J4459J48698K44930O6100r8700
13625G26394j20647r724p1100j24147j23103p9006o6337P702L1643L8920M1219
13614B51814m6859N5257k9742L0077P0220Q9559k5288r5201k4084M3538O8198
13603C87489R4040K16711K18137P3685l2967j19247j49977r9766j27272L5485
13593D96318Q1437J81657J92878J09014j5566o8442n8097n456J5768J21563R6658
13582A147732p6613k20434j16085p6267m7205n1235q3756r6427j16681l7070M0300
13571B66259N021L0992P6799J1098m5044r6770j06348L6954K851J962L246n1674
$$ plain form
13646 447899 492141 609669 982111 1317907 1520136 1511461 1403694 1126858 888966 613550
13636 613550 443226 400176 389502 340770 323046 350907 365366 514064 758994 825094 726394
13625 726394 605747 596023 524923 400776 277673 198667 132330 140032 171675 210595 251814
13614 251814 204955 260212 230470 260547 330767 420326 395038 299837 275753 319291 387489
13603 387489 481529 698240 916377 990062 957095 837848 687871 588105 460833 496318
13593 496318 577755 759412 952290 1061304 1045738 977296 919199 913743 929511 1051074 1147732
13582 1147732 1071119 850685 734600 658333 611128 559893 476137 379710 263029 225959 266259
13571 266259 271280 302272 379071 390169 345125 248355 142007 178961 181812 183774 187020 135346
13559A35346p0488L2035M0492K8758n8133O3865N3516q440M9471J0060J62504
13548D38986J39852J32246K23757J43177j02995j06985r2725P676p7790k09228
13538D95971q6237n6850N8202J23030J06855j04089p4968n3680j41011l3724K8494
13527B61993P8088k2043m7779M5209m8459Q1493J08455l6591m4588k7289M0713
13516C89202Q873m5923j0171j08383j0382P289j1101R0961m2570n5003m553M2462
13504B50701J7359k7687j6633N616R287J07100N4037O3425J45354K9898j17682
13493E20775p6532n9388m1410p136k3582r839j04987M1353Q0285o3644L2339K839
13481B91073n4182p9281m7843k5771Q453K1542L5937J7863j2797K5131l3620L8082
$$ plain form
13559 135346 64858 96893 137385 166143 108010 171875 225391 216951 266422 276482 438986
13548 438986 578838 711084 934841 1078018 975023 868038 775313 782989 705199 495971
13538 495971 409734 352884 411086 534116 640971 536882 461914 408234 267223 233499 261993
13527 261993 340081 318038 270259 315468 267009 348502 456957 420366 375778 348489 389202
13516 389202 398075 352152 341981 233598 223216 230505 219404 310365 267795 212792 208239 250701
13504 250701 268060 240373 223740 229356 238643 345743 399780 463205 608559 638457 520775
13493 520775 444243 384855 343445 336309 312727 302888 197901 239254 319539 255895 288234 291073
13481 291073 236891 157610 109767 83996 92449 113991 149928 167791 154994 180125 146505 184587
13469A84587Q4119J34315j2246m5374K5827J351o700O1124R261o5018J9099L38
13457C90683q1926j53641r567J06173Q9752q392k2200M6265K1459j56514m1695
13446A80397j7087r120R8775R6376l3391k0650L3711l7222k5078M2649l996O6266
13434C71630J00786K4270p5632n2293q5613j8514n6950k8567P9301L2791K7332
13423C18541K9257J3644K1434m2107m1424P1490l598J03155L9253k5867k5089
13412D58689J7305N0974M6028j6854j33401p9988K6336K2028n1144j4106l2013
13401B93854Q0618m7497m7715K2155k0435J23847M4156q1466J3965j04246q7776
13390A89460J18043L3576Q93j16373o7679N6984N5868m7749k0133Q085J11362
$$ plain form
13469 184587 268706 403021 390775 345401 371228 372579 365879 427003 436264 371246 390345 390683
13457 390683 308757 155116 145549 251722 341474 333082 310882 357147 378606 222092 180397
13446 180397 163310 154190 252965 349341 315950 295300 329011 291789 266711 309360 305364 371630
13434 371630 472416 496686 421054 368761 283148 264634 207684 179117 258418 291209 318541
13423 318541 347798 361442 382876 340769 299345 370835 367237 470392 509645 483778 458689
13412 458689 475994 526968 572996 556142 422741 342753 369089 391117 339973 325867 293854
13401 293854 374472 326975 279260 301415 280980 404827 448983 367517 381482 277236 189460
13390 189460 307503 341079 341972 225599 157920 214904 270772 223023 202890 210975 322337
13379C22337N3073P9922k7824n7210O1251L43M663O354L7803n4161p4269M745
13367C57027J1530Q520R579k776j9573K9722k5898n0942J5924K4078n82n5454
13355C01155J6096Q5499M014l521M7388J6428j00423l4188q4643l3965L7803Q8756
13343C40399j8694j6195n6808L0939J16659P1327j2580L4679M6747l1393N247
13332E10327K7608M0400J83760K24210J49395N8353O2998j28218j32587j20650
13322H75596q9952m6066j30341R3944M1718n0797q4807q2371O550M5776M4717
13311F23967m3917q1611j3661j6072L7001J8919J09676N1244k6452l4158q306
13300F16630O4009Q3701O4534j4958J7098m5787k4122L8863q602n7097L208N117
$$ plain form
13379 322337 375410 455332 427508 370298 431549 431892 436555 442909 480712 426551 352282 357027
13367 357027 368557 377077 386656 383880 364307 394029 368131 317189 333113 357191 356609 301155
13355 301155 317251 402750 406764 403243 450631 467059 366636 332448 247805 213840 251643 340399
13343 340399 321705 305510 248702 279641 396300 467627 455047 489726 536473 505080 510327
13332 510327 537935 578335 762095 986305 1135700 1194053 1257051 1128833 996246 875596
13322 875596 785644 739578 609237 703181 744899 694102 609295 526924 533474 579250 623967
13311 623967 580050 498439 484778 468706 505707 524626 634302 685546 659094 624936 616630
13300 616630 680639 764340 828874 813916 831014 785227 761105 799968 791366 734269 737477 742594
13288G42594n1592m4358R3824K6715K3844P4633k5477m1211K4258k7416J7715
13277H13529M7028O9065K2930o7252Q4088J11521R2343O1128P193L8721L5584
13266A315878L9808J38801J25773J45671K24057J93428J35039J93353K33377L68642
13256C113827M65024O96734J100126K024032L790926O142723P284294N886529
13248C0504215J727033k629691n235057n654196m687259l012314j520895m25416
13240I066420R12503K291727K573461P55251j137039k178572k484355k127087
13232G672309j382811q38762n13905l29549k24775j25101r4708O992J95739K32266
13222D597695J49958J89219K59607K94875M74155N88048P07913Q76524R63803
$$ plain form
13288 742594 691002 646644 740468 767183 791027 865660 840183 798972 823230 795814 813529
13277 813529 860557 929622 952552 885300 969388 1080909 1173252 1234380 1241573 1280294 1315878
13266 1315878 1355686 1494487 1620260 1765931 1989988 2183416 2318455 2511808 2745185 3113827
13256 3113827 3578851 4275585 5375711 7399743 11190669 17333392 24617686 30504215
13248 30504215 32231248 29601557 24366500 18712304 14025045 11012731 9491836 9066420
13240 9066420 9978923 12270650 14844111 15599362 14462323 12283751 9799396 7672309
13232 7672309 6289498 5450736 4936831 4607282 4382507 4257406 4162698 4169690 4365429 4597695
13222 4597695 4747653 4936872 5196479 5491354 5965509 6553557 7261470 8137994 9101797
13213I101797J124284J418631K073309L345923N428126R480724J6798490K5370133
13205G4141417K5038827J2172115m084017j5327017j9327452j6842110j1317773
13198D4453990o002361j642662K619229Q123286J5174942J8396417J1617279j215048
13190I1525072j1049162j4657079j3134120q092631k152109L884416J1672675
13183E7997062K0819016K3009562J3099987k996535j4250121j8274418j5995668
13176F3408885j0069657l934532J522274P582642J5673146K4091551K3274511
13169A21548820J0292109n889467j4773285j5465164q524343M126517K0578671
13162A11893858L5148654M1136330L5852435K4456948N649541j9711678l8603427
$$ plain form
13213 9101797 10226081 11644712 13718021 17063944 22492070 31972794 48771284 74141417
13205 74141417 99180244 111352359 107268342 91941325 72613873 55771763 44453990
13198 44453990 38451629 36808967 39428196 47551482 62726424 81122841 92740120 91525072
13190 91525072 80475910 65818831 52684711 44592080 42439971 46324387 57997062
13183 57997062 78816078 101825640 114925627 111929092 97678971 79404553 63408885
13176 63408885 53339228 49404696 50926970 58509612 74182758 98274309 121548820
13169 121548820 131840929 125951462 111178177 95713013 87188670 91315187 111893858
13162 111893858 147042512 188178842 224031277 248488225 254137766 234426088 195822661
13155A95822661m3609707l9594207l0263867k0311460j3106031q722963o108122
13148C4106304m317828l217778k484427k100123j622063j369374j059781o19859
13140A7315071j68602J52760N45309J056608J458692J813475K675974L955152
13132B8804439N532643Q248950J3133616K2178889L6777077M8202679M2892432
13125B05770725L0665820J3817324n621814k9242100m0203372l8360197k9689787
13118A07136599j6007009q23643J4886324K3874429J1260989p497632j8616008
13111A14214049k2905186j9752387j2727607o432400j237707M265516J1868196
13104F7292474K2078917K4209967P306232r565556j8628740k0975468j6347340
$$ plain form
13155 195822661 152212954 112618747 82354880 62043420 48937389 40214426 34106304
13148 34106304 29788476 26570698 24086271 21986148 20364085 18994711 17934930 17315071
13140 17315071 17146469 17299229 17844538 18901146 20359838 22173313 24849287 28804439
13132 28804439 34337082 42586032 55719648 77898537 114675614 162878293 205770725
13125 205770725 236436545 250253869 244632055 215389955 175186583 136826386 107136599
13118 107136599 91129590 90305947 105192271 129066700 140327689 132830057 114214049
13111 114214049 91308863 71556476 58828869 52396469 51158762 55424278 67292474
13104 67292474 89371391 113581358 120887590 111322034 92693294 71717826 55370486
13097E5370486r248841l219300K721288J0157299J9190634J8938610L634591q637219
13089H8907548j4969254j5944102j1826894o618587k315425J584956O350969J3531150
13081E8700361K3055039K5713348J1464050q343237j9542604k3144189k0045269
13074D7857499j3582120q396862n222654l462316k471267j756105j380885j304263
13066A0281027j200641r80735p69852o57081m89584l79066k89478l36034k95516
13057D883040k58768j42747j02045j5124O0678J43790L43703P95161J627747K618201
13047I953636K936915J633028l27603j585661j937397j489184n98816L24518J604648
13038A0514084L689508O314917P082711M637216K85933m369145o259524o060344
$$ plain form
13097 55370486 46121645 42902345 45623633 55780932 74971566 93910176 97544767 88907548
13089 88907548 73938294 57994192 46167298 39548711 37233286 38818242 45169211 58700361
13081 58700361 81755400 107468748 118932798 110589561 91046957 67902768 47857499
13074 47857499 34275379 25878517 20655863 17193547 14722280 12966175 11585290 10281027
13066 10281027 9080386 8099651 7329799 6672718 6183134 5804068 5514590 5178556 4883040
13057 4883040 4624272 4481525 4379480 4364356 4425034 4568824 4912527 5707688 7335435 9953636
13047 9953636 12890551 14523579 14195976 12610315 10672918 9183734 8584918 8909436 10514084
13038 10514084 14203592 20518509 27601220 32238436 32524369 28155224 21895700 15835356
13030A5835356m678858l021802j927359j205977q92765o89725n00351k68465k60302
13021B389752q8656j27196o7422j41926j28320j70507k24174k88518j18638r2230
13011I42165p3482l2288p1932J1450j9617J1465l2775j2036m4879m7370L3727
13000F64428J20763j6119k7208J661l1563m067K976j3978L0210o5761P8609J2188
12988G52139k7584j40956j08373j1089M0698m218K2390P7583L8432j06111q3795
12977D49116p6765J6997Q1689P1817o9040O4061Q5135K6806k8975q8569l2847
12966D99425N8662n9155j15254j4278M3658J41001J26359J72494J96320J97852
12956A247084K9184j48526k05677k43050j75739n3309q7306L5739R9440l710J3136
$$ plain form
13030 15835356 11156498 8134696 6207337 5001360 4108595 3418870 2918519 2650054 2389752
13021 2389752 2301096 2173900 2106478 1964552 1836232 1665725 1441551 1153033 1034395 942165
13011 942165 868683 836395 764463 775913 756296 767761 734986 722950 678071 630701 664428
13000 664428 785191 769072 741864 743525 711962 707895 710871 696893 727103 661342 739951 752139
12988 752139 724555 583599 475226 464137 504835 500617 523007 600590 639022 532911 449116
12977 449116 372351 389348 471037 542854 473814 537875 623010 649816 620841 532272 499425
12966 499425 558087 498932 383678 369400 413058 554059 680418 852912 1049232 1247084
12956 1247084 1276268 1127742 922065 679015 503276 449967 362661 398400 497840 494130 507266
12945E07266O1368L5769j6451o3524o6026m9613l8899K0146J62975J18880J4185
12934F86076p8392r8969j33033m6196j18230j24560j86P8805L7145M3074m4152
12923B01382L0306M6589j15633j14179j8278K2208M5681N2665K8295j5277j14191
12912D9568p2704l3309L8694N8008J8640J13085j5860j20266l5658k3305O1607
12901C8500N1515p8634N5981J187q209R9618K3117J2208k320P0986j6994l1252
12889B15703L5612o7500j05776m6477k3085K9271L2835j1857o3764p4355M1836
12878c7557L6670N2401K2236P5957N585j07414J4189N0250o122o973m8219r3428
12866d2425j3141k4558n182O585L0429J4106K3267N6698o8526r6242N8507N1424
$$ plain form
12945 507266 568634 604403 587952 524428 458402 408789 369890 390036 553011 671891 686076
12934 686076 607684 508715 375682 329486 211256 86696 86510 165315 202460 245534 201382
12923 201382 231688 278277 162644 48465 30187 52395 98076 150741 179036 163759 49568
12912 49568 -23136 -56445 -17751 40257 58897 171982 156122 35856 198 -23107 38500
12901 38500 90015 11381 67362 68549 60340 159958 183075 195283 192963 263949 246955 215703
12889 215703 251315 183815 78039 31562 8477 37748 70583 58726 -5038 -79393 -37557
12878 -37557 -887 51514 73750 149707 155292 47878 62067 112317 106195 99222 51003 -42425
12866 -42425 -55566 -80124 -85306 -78721 -48292 -34186 -10919 45779 -22747 -118989 -60482 -9058
12854i058O939L015k2466l4445N716N8396M2603k3595l4671l8852l460p171k8614
12841h5663M5358k0643n9809l1544r283J02857J4305k1283Q1727l134L3648R548
12829E6084j5572j9427J6766l6150K1959m5276N361O0489L7526K3486j5661o2796
12817B6789L98L3010k3228j45270L1865J04717L2392n5791j6217m527K9918N2158
12805F6214k2761j7496m8871j1607M4309J1767j43320j32171L5523O6983O8802
12794h2628M5525k7434R2362K1723Q33L8431R4173m1460j05906k6938K1288L7065
12782F7034L9123k5048j41648Q0597J27418R1077R8506J5573n0859j05434j12334
12771H4005k3613l2358k9690J405R648L2723n692j9967l4095J6053n8666q615
$$ plain form
12854 -9058 -2119 896 -21570 -56015 -50299 8097 50700 27105 -7566 -46418 -49878 -57049 -85663
12841 -85663 -40305 -60948 -120757 -152301 -161584 -58727 -44422 -65705 16022 12888 46536 56084
12829 56084 40512 21085 37851 1701 23660 -21616 -16255 44234 81760 105246 89585 26789
12817 26789 27187 60197 36969 -108301 -76436 28281 60673 4882 -11335 -15862 14056 66214
12805 66214 43453 25957 -22914 -34521 9788 21555 -121765 -253936 -218413 -151430 -82628
12794 -82628 -37103 -64537 27825 49548 50381 88812 182985 141525 35619 8681 29969 67034
12782 67034 106157 81109 -60539 20058 147476 238553 337059 352632 301773 196339 84005
12771 84005 60392 28034 -1656 -251 9397 42120 36428 16461 -17634 -1581 -60247 -68862
12759f8862m272K5912k6848k0768K8095j3667o5161M9734N8866O2263p9102O144
12747d7666r023j45959p6445J31908J04281L3330J01140R5692N9042P8289q744
12736C15845q335M251j6835L472l1025L5322N4532R1110J29731J13540J11589
12725H03197N9270n8816j69668j27078j14719j34575j10020k374m2857k0975P8053
12714A59438J5680l6873j680P0518J2863j04805K75J01165j1990r1988l7440k9647
12702D5516R926k7967J6793r467j8287Q2041J13150K7203J36285J34069K177M0524
12690E51963J66373K22757J79475L5661K3842M9619n6079j29670q5605M1838P6925
12679A077099R9473q1490k29293j62416j44101q9097j46047o8330n5098r6321
$$ plain form
12759 -68862 -73134 -47222 -74070 -94838 -66743 -80410 -145571 -95837 -36971 25292 -53810 -47666
12747 -47666 -56689 -202648 -279093 -147185 -42904 -9574 91566 187258 246300 324589 315845
12736 315845 307510 311761 294926 298398 267373 302695 357227 448337 578068 691608 803197
12725 803197 862467 803651 633983 506905 392186 257611 147591 145217 102360 81385 159438
12714 159438 175118 138245 136565 207083 219946 115141 115416 216581 204591 112603 75163 45516
12702 45516 55442 27475 44268 34801 16514 98555 211705 238908 375193 509262 511439 551963
12690 551963 718336 941093 1120568 1156229 1180071 1229690 1173611 1043941 958336 1000174 1077099
12679 1077099 1176572 1095082 865789 703373 559272 470175 324128 255798 200700 104379
12669A04379r9894r6659K0288K8215p3981n8073J03832J00701J2836o2670p9063
12658a00089j8604J20959J01035m7564J6714K1485r4822k4106P5670J57211J67844
12647C75733J53147N9900Q790o2312k07594o7616J03627M1118K60852K86921K04156
12636A156722Q1801J9363j31604j34428k29330r7861n0944j12246j44307q3541
12626B73625l218k9307j6803p0985o9604P1098R912m6711m9189j5404n7094k1864
12614b5544k3071J7272J03536Q731m9865L9369K1948P2274j1667j38077p532J7803
12602B5177j6058J7960K8038n3871J24772J84113J23686J28794J39457m452j11095
12591E86521j33882q85M7703j6249L7249l8672m7621p6547p8259r0996j13481
$$ plain form
12669 104379 4485 -92174 -71886 -43671 -117652 -175725 -71893 28808 41644 -21026 -100089
12658 -100089 -118693 2266 103301 55737 72451 93936 -886 -24992 50678 207889 375733
12647 375733 528880 588780 597570 535258 327664 260048 363675 404793 665645 952566 1156722
12636 1156722 1238523 1257886 1126282 991854 762524 664663 613719 501473 357166 273625
12626 273625 270407 241100 224297 153312 83708 154806 164718 118007 68818 53414 -3680 -25544
12614 -25544 -48615 -31343 72193 80924 31059 70428 92376 164650 152983 14906 7374 25177
12602 25177 9119 27079 55117 1246 126018 310131 433817 562611 702068 697616 586521
12591 586521 452639 451754 499457 483208 520457 481785 434164 357617 279358 188362 74881
12580G4881L9156R9642O82k5313n2006j21476j02324L4258n5388q0776q161Q9478
12568a07347O8467O1744M047o5548l1136K1263J7616K2662l0912l5368L9686K9804
12556e022l6752L973J07271l481N7926o2460o7605L061J00475L3785L8025R0140
12544B59336L5104j7824q9602o0541r0179N8650M6946l4638O9832P5335P3119
12533C25538k4360q0364m5342p1899L5283N6691m1169q0932m3002k9515N7282
12522E8211J0504p6247M1948R961k3794j4975J9686j8282j5202j09686M4486L8795
12510c4595N6202n0167j8811N0989M9735o0931J8647k8092l6618J1535J14212
12499G2106J4516n5563L8961Q577q0112o3754L1776L6177K882o7658n326P2657
$$ plain form
12580 74881 114037 213679 214361 189048 137042 15566 -86758 -52500 -107888 -188664 -196825 -107347
12568 -107347 -38880 22864 26911 -38637 -69773 -48510 -30894 -8232 -39144 -74512 -34826 -5022
12556 -5022 -41774 -37801 69470 65989 123915 61455 -6150 -3089 97386 131171 169196 259336
12544 259336 294440 276616 187014 126473 36294 94944 141890 107252 177084 252419 325538
12533 325538 301178 220814 175472 103573 138856 195547 154378 73446 30444 929 58211
12522 58211 68715 -7532 34416 44377 20583 5608 25294 7012 -8190 -117876 -73390 -34595
12510 -34595 21607 -28560 -47371 3618 53353 -7578 11069 -17023 -53641 -42106 72106
12499 72106 86622 31059 70020 78597 -1515 -65269 -33493 2684 5566 -62092 -67418 5239
12487E239K0537j0046M4657k4186j12215o6087O5528J77371P2709j6698o2987
12476I3822j07658j68406R420N2055R0441l1875L7105P4745L5632J6121K0342
12465A21744n8066l6962k9795n4432q856Q3825L3120n8043o3800J735j3313J7462
12453f5381J0034j4533M2767n7119n6355N543M2164J05299R8475R1699R945o0823
12441A51715k0532m1995j8728m2812l9015L5947k6642J5739N344L9204j8026o5503
12429b5304L516L2431O2334N3176j4171l2867l4498l9859o685K1204k0563m7961
12417d9247o4945n661m6438j9346N3083M4753l3648m675Q8915o463k7712K561
12405f8823K52M9274M6546L4921R563k7679j0887Q387l9427l1588L1964P0959
$$ plain form
12487 5239 25776 15730 60387 36201 -76014 -142101 -76573 100798 173507 156809 93822
12476 93822 -13836 -182242 -172822 -120767 -30326 -62201 -25096 49649 85281 101402 121744
12465 121744 63678 26716 -3079 -57511 -66367 17458 50578 -7465 -71265 -69530 -82843 -65381
12453 -65381 -55347 -69880 -27113 -84232 -140587 -135044 -92880 12419 110894 202593 212538 151715
12441 151715 131183 89188 70460 27648 -11367 24580 -2062 13677 19021 58225 40199 -25304
12429 -25304 -21788 10643 72977 126153 111982 79115 44617 4758 -1927 19277 -1286 -49247
12417 -49247 -114192 -119853 -166291 -185637 -132554 -87801 -121449 -126124 -37209 -43672 -71384 -68823
12405 -68823 -68571 -19297 27249 62170 71733 44054 33167 41554 2127 -29461 2503 73462
12393G3462l7857O3663l3485q5833j4965k4158L118N6850P6345j0156J8064k751
12381H2297p1496l9332K6788K0489j7885l0565l8790r3331r4911K391R1320L919
12369a59106L6482P7582J11453m583j39818J721N2993K0130r186r9279j21387
12358b32998J05648J38822K2659L927J4353j8113l6585o811O7298M1808o556k9500
12346F3952j2759r675m4405m7926L0777n2631M0929J2277l8005l2774k7743K6262
12334i1721Q573k6463J09273M8057q6017m5773p799o8705k0599Q3925K5311m1683
12322a13621O1488M8606M890q6023j22236M6414N1072p728k2608L5887L3185M8817
12310b1857o3161Q2843N0602j11893j04174P5349J4837m9234L7224J8810m5514
$$ plain form
12393 73462 35605 99268 65783 -20050 -35015 -59173 -56055 795 77140 66984 85048 82297
12381 82297 10801 -28531 -1743 18746 861 -29704 -68494 -161825 -256736 -254345 -163025 -159106
12369 -159106 -122624 -45042 66411 61828 -77990 -76269 -23276 -3146 -12332 -111611 -232998
12358 -232998 -127350 11472 34131 38058 52411 34298 -2287 -9098 58200 100008 93452 63952
12346 63952 51193 41518 -2887 -50813 -20036 -72667 -31738 -19461 -57466 -90240 -117983 -91721
12334 -91721 -83148 -109611 -338 47719 -38298 -84071 -91870 -160575 -181174 -97249 -71938 -113621
12322 -113621 -52133 -3527 1363 -84660 -206896 -160482 -109410 -117138 -139746 -103859 -70674 -21857
12310 -21857 -85018 -2175 48427 -63466 -167640 -92291 -77454 -126688 -89464 -70654 -116168
12299a16168Q4021J8455L518J0454q1225J2323J502L4831K0312k8472k8175l2927
12287a01551m065O8884L8136n2494J5569k5852L0215K6408l6950o8599l6195k9233
12275a75727J0299N8118N0206P9698k708m7060L657j06032J00650N1552p0345
12264d7692l2558n8879P5591M5395l3475K1020O3980o8324P699o2993o4576Q6674
12252f8138M2906J9664M4875L1114n3918n7092k4653N0753M7250l1971k494N688
12240C984M7633k5474r9965Q0691K8627j4272l2174k4495k0233j049K5007K1797
12228i923l3484n8826J5154P6598J27281k1695j09364K6269n790K4685M932M452
12216D0289n4862K4671M3512k962k2942k8469j971o6317j37478J1616N0051M3817
$$ plain form
12299 -116168 -32147 -13692 -10174 280 -80945 -68622 -67120 -32289 -11977 -40449 -68624 -101551
12287 -101551 -105616 -36732 1404 -51090 -35521 -61373 -31158 -4750 -41700 -110299 -146494 -175727
12275 -175727 -165428 -107310 -57104 22594 19886 -27174 -23517 -129549 -28899 22653 -47692
12264 -47692 -80250 -139129 -63538 -18143 -51618 -30598 33382 -34942 -27243 -90236 -154812 -68138
12252 -68138 -25232 -5568 39307 70421 16503 -40589 -65242 -14489 32761 790 -1704 3984
12240 3984 51617 26143 -73822 6869 35496 21224 -10950 -35445 -55678 -56727 -31720 -9923
12228 -9923 -43407 -102233 -87079 -10481 116800 95105 -14259 12010 6220 30905 35837 40289
12216 40289 -14573 10098 53610 50648 27706 -763 -2734 -69051 -206529 -194913 -144862 -101045
12204a01045R3162o8747k6311J03095Q0978n7418l3974K1546M6905j5741o047
12193C6403j1683Q0075j9473r5416j5696Q958j1209q565j9293r1368L0979M0636
12181g5652j077k9431J9759N1526J2581R4701J3436o8338o0471j1624M1413K1211
12169H034j4193o4640o4733j0108Q7550j5834n3720M725J350Q851R0556j9029
12157d1191o3379L3245K3296O9014j7401j8874K0401k215m6167l3522K0930Q460
12145d7403n5294k7134R7991O0645l6224k8021p3894n9115L630Q7309K0435j2865
12133f9940K6182l7656p8081j1918O5674N9517R2162N0528l1553k3923j08137
12122f7145o0152J10675P2479k1032r984p1285q7681J1792M2505k8054j974l8412
$$ plain form
12204 -101045 -7883 -76630 -102941 154 81132 23714 -10260 11286 58191 42450 36403
12193 36403 24720 104795 85322 -10094 -25790 -16832 -28041 -36606 -55899 -147267 -116288 -75652
12181 -75652 -76729 -106160 -86401 -34875 -22294 72407 85843 17505 -42966 -54590 -13177 8034
12169 8034 -6159 -70799 -135532 -145640 -58090 -73924 -127644 -122919 -121569 -112718 -22162 -41191
12157 -41191 -104570 -71325 -48029 20985 3584 -15290 5111 2896 -43271 -76793 -55863 -47403
12145 -47403 -102697 -129831 -31840 28805 -7419 -35440 -109334 -168449 -164819 -77510 -57075 -69940
12133 -69940 -43758 -81414 -159495 -171413 -105739 -46222 45940 96468 64915 40992 -67145
12122 -67145 -127297 -16622 55857 34825 24841 -46444 -134125 -122333 -79828 -107882 -109856 -148268
12110a48268N1032J1207p2177p5511P8449L4986K599J1205J7113n3006m453J29128
12098a7696Q4805k6796l6887r3544L3989N4376O8291k5883o3816j00669m6262
12087a70092J20690j2437m6605n2990K8615O0060P0424J03620n827L6748j3906
12076A18300n1220n1874n3139l0976M9451N2558k9816r3468j44063r652l1196
12065b75095J12974J12579O5254j827l055m2077l0575k6888N4578l4013L243p548
12053g2450o3648Q851M7193k5128o7737N2256k255l873K3426J31739N0587n8378
12041B0583K2443k9137j1862n0095p2905m951j871P2569P2745q1150j19969r760
12029a93360J8683O6240Q4964o586j8475j2020K9909K0227R3933L400l8328k9120
$$ plain form
12110 -148268 -97236 -86029 -158206 -233717 -155268 -120282 -117683 -106478 -89365 -142371 -146824 -17696
12098 -17696 67109 40313 3426 -90118 -56129 -1753 66538 40655 -23161 -123830 -170092
12087 -170092 -49402 -61839 -108444 -161434 -132819 -72759 -2335 101285 95458 132206 118300
12076 118300 67080 15206 -37933 -68909 -19458 33100 3284 -90184 -234247 -243899 -275095
12065 -275095 -162121 -49542 15712 13885 10830 -31247 -61822 -88710 -34132 -68145 -64902 -72450
12053 -72450 -136098 -127247 -80054 -105182 -172919 -120663 -122918 -126791 -103365 28374 78961 20583
12041 20583 43026 13889 2027 -48068 -120973 -125924 -127795 -55226 17519 -63631 -183600 -193360
12029 -193360 -174677 -108437 -23473 -30059 -48534 -60554 -30645 -10418 83515 86915 48587 19467
12017A9467r3586K6239Q4605m3651j25901l637O2141N0631M3647J3707o7858L2497
12005a699J4446N219k7807L8912j9186N2791o374O646L0620n768n7119o2938m7068
11992g9325M0970j5567o1878L3160J39534l059r460k022m57r8625l9877M0596
11980e6010J8032J8014P4796k4422l6677k6607J01071m769p8175r2047J1830O2694
11968c2270O5778J0387j17368q3564j1055N5342L7726j4077k6034N7094M8334
11957i707J3780p5778P582l1713O521O021J8846o9872n4379M1912Q3467J5841
11945d7479k8470l9305L8334M2214L4653P2719k2864q5783K0274j2392j3655O7961
11933B6207o3000j8001J0062K3729p1277q6704k489L7937q924p6519L7096N3429
$$ plain form
12017 19467 -74119 -47880 36725 -6926 -132827 -136464 -74323 -23692 19955 33662 -34196 -1699
12005 -1699 12747 17966 -9841 29071 9885 62676 56302 62948 93568 87800 30681 -32257 -79325
11992 -79325 -38355 -53922 -115800 -82640 56894 53835 44375 42353 41896 -56729 -96606 -56010
11980 -56010 -37978 -19964 54832 30410 -6267 -32874 68197 63428 -14747 -106794 -94964 -32270
11968 -32270 33508 43895 -73473 -157037 -168092 -112750 -75024 -89101 -115135 -58041 -9707
11957 -9707 4073 -71705 -64123 -95836 -89315 -83294 -64448 -134320 -188699 -146787 -63320 -47479
11945 -47479 -75949 -115254 -76920 -34706 -53 72666 49802 -35981 -15707 -28099 -41754 26207
11933 26207 -36793 -54794 -44732 -21003 -92280 -178984 -181473 -143536 -152460 -228979 -191883 -138454
11921a38454J05197N5946p0078j1339M3631m1104L8165L1551k2093K4290L7916
11910E3628O4309J5425m3408o2966K103o1402m3935J01588P0907q1653p1831k7334
11898h4569J4614K4551n3229r4671L091p086O3939J29182J2882L6185M8287Q050
11886A01226J0808m4992j3885j5448j24367r861N0582M0888R939k614j7283m0137
11874e5144m331q926q8217j34214J4137N0114J04098J29811j2716q7891k0637
11863a13916j5813J00077Q341p4835j2064j4433l1990K9704R873o566J0723O1916
11851d8983m8170j24664r993P5165K5650M9958J24559L4088n226m3101j6509j3391
11839f17k5251o3535l8081k8658j9737N3971Q6111l0849l4305O3495R6030l0064
$$ plain form
11921 -138454 -33257 22689 -47389 -58728 -15097 -56201 -18036 13515 -8578 15712 53628
11910 53628 117937 133362 89954 26988 29091 -32311 -76246 25342 96249 14596 -57235 -84569
11898 -84569 -69955 -45404 -98633 -193304 -190213 -197299 -133360 -4178 8704 44889 93176 101226
11886 101226 112034 67042 53157 37709 -86658 -96519 -45937 -5049 4890 2276 -15007 -55144
11874 -55144 -59475 -68401 -156618 -290832 -276695 -226581 -122483 7328 -5388 -93279 -113916
11863 -113916 -129729 -29652 -21311 -96146 -108210 -122643 -154633 -124929 -115056 -121622 -110899 -48983
11851 -48983 -97153 -221817 -231810 -156645 -130995 -81037 43522 77610 72384 29283 12774 -617
11839 -617 -25868 -89403 -127484 -156142 -175879 -121908 -35797 -66646 -100951 -37456 58574 28510
11827B8510p9837j5230L9326P986j2526Q1398J33415l3198q6717l1490q8704m884
11815f1951Q781l4025O7172J8042j2675M7115M1201q613J963p917J46J4171L3506
11802A06916j26310j21322J31012Q3130L0736r249j6656r0802m0045k968p7870
11791a33428K8120L0737j8138O1492p120o0742L9529k3623K5532k358n325L8745
11779b6579q5110n222J8109j0827L1832M2424K7050Q293r7685r8720o6628j0056
11767b73119J35715J20330J8105j6081k6081K0984l3456n1906L236J7803J21037
11756C6567O2774k447j18062o9147J15491J17181k2968j05165r901j7492K3137
11745I968M8108o035n0149n7875k9437K7707J8256j480M3451m1931k4538L4129
$$ plain form
11827 28510 -51327 -66557 -27231 -19245 -31771 49627 183042 149844 63127 31637 -57067 -61951
11815 -61951 -53170 -87195 -20023 -1981 -14656 32459 73660 65047 67010 59093 59239 73410 106916
11802 106916 -19394 -140716 -9704 73426 104162 94913 78257 -12545 -52590 -55558 -133428
11791 -133428 -105308 -74571 -92709 -31217 -38337 -99079 -59550 -83173 -57641 -59999 -65324 -26579
11779 -26579 -111689 -116911 -98802 -109629 -77797 -35373 -8323 -30 -97715 -196435 -263063 -273119
11767 -273119 -137404 -17074 1031 -15050 -41131 -20147 -53603 -105509 -102273 -84470 36567
11756 36567 99341 96894 -21168 -90315 25176 142357 119389 14224 4323 -13169 9968
11745 9968 58076 52041 1892 -55983 -85420 -57713 -39457 -40937 2514 -39417 -63955 -29826
11733b9826R193l6160O7157O9601p114j7916o6157J2127j8313L9092K0869J5269
11721E7822j0162l8224J7450m2545j4785O5162n342J0111J6995P341P0768J3027
11709A47618J8093n9580m6956j15171k4932N5037J2230P2755j447m3870k963J2309
11697B3123O0816L8660N0304p1312P330k9216J11503M4486m9619o5451p5290j37710
11685i2376N0517M8315K4538K8358l7860l7164n803l5833L7651K5272j5713p4442
11673h4540N5688J32384M0501j23580j22795P0800M1747K0536j0884J55201j8498
11662A56560n9476o0637k6298k0562o7375j5175k213j2325P5187O3941L6402L662
11650G1691k9618M5104N0700j7371j21928j28092q9413J29863O6989J7819M7945
$$ plain form
11733 -29826 -20633 -56793 10364 79965 72851 54935 -11222 905 -17408 21684 42553 57822
11721 57822 47660 9436 26886 -15659 -30444 34718 29376 39487 56482 63823 134591 147618
11709 147618 165711 106131 59175 -55996 -80928 -25891 -13661 59094 57647 13777 10814 23123
11697 23123 83939 122599 172903 101591 108921 79705 191208 235694 186075 120624 45334 -92376
11685 -92376 -41859 6456 30994 59352 21492 -15672 -21475 -57308 -19657 5615 -10098 -84540
11673 -84540 -28852 103532 144033 20453 -102342 -31542 10205 30741 19857 175058 156560
11662 156560 97084 36447 10149 -10413 -77788 -92963 -95176 -107501 -32314 31627 68029 71691
11650 71691 42073 87177 137877 120506 -1422 -129514 -218927 -89064 -22075 -4256 43689
11639D3689J3799j757o2549m2509L9745Q7426m8353L6014l6860j11193r7288N4165
11627a25671Q7921N9323R4252k306J8652j04797J8524j01o2407J1720L1170L5299
11615F1579j3420p4585j11340Q9611J40824J3935m8993J0801j747j8212l1407
11604A7046M8722R262O410l514j1979n589j9798l5769n7809P4945P7317m7321
11592E1923r4781k0842j2680l8053N4030N0498k2261K6218O7855m921n3643j0442
11580g099k4043J2538R5901P2317J0426m5767o3729m0931Q492o5598k7641k0719
11568i5853j2462N7121K1435r66m5905l1301m4683Q536J48153P9215K0289k8724
11556G4855q4926M2675L5021p8852k3250L7759K7245j7036j0047m7226J3873k290
$$ plain form
11639 43689 57488 55731 -6818 -49327 -9582 77844 29491 65505 28645 -82548 -179836 -125671
11627 -125671 -37750 21573 115825 113519 132171 27374 45898 45797 -16610 -4890 26280 61579
11615 61579 48159 -26426 -137766 -48155 92669 106604 57611 68412 66665 48453 17046
11604 17046 65768 75030 81440 77926 65947 60358 40560 4791 -53018 21927 99244 51923
11592 51923 -42858 -63700 -76380 -114433 -60403 -9905 -32166 -5948 61907 56986 3343 -7099
11580 -7099 -31142 -18604 77297 149614 160040 114273 50544 9613 18105 -47493 -75134 -95853
11568 -95853 -108315 -51194 -29759 -30725 -76630 -107931 -152614 -144078 4075 83290 103579 74855
11556 74855 -10071 32604 67625 -11227 -34477 3282 30527 13491 3444 -43782 -29909 -32199
11544c2199K9182j565o3700n6867r1573J9870P4218P6446N8290m9743K8236K3615
11532A4210j11317k3198N251O2687N7924M4147n5158k1400R945j6136r0963l6519
11520a60527M2541J4655l2373j6367M1757L3946j1949l7887r3547M4714J28942
11509d6095Q914M4645J2614p1841l9438M5607L7964L8820k7068m0691O2955o7318
11497d0932n077l8275l5412j7468K2180J7482N1419J6930j01618m9237P1779L8831
11485f9398k4328O8703L7520l6331m9601j0368P4386M9371k3406n7951N454m0577
11473g6526Q1436O6346l5856O229p6280J9263J8789L6262q160K8726K3679J5317
11461I9225Q311n6292k4356Q791l09J7694l7857j06764K84P073K4591M0178M2503
$$ plain form
11544 -32199 -3017 -4582 -68282 -125149 -216722 -196852 -122634 -46188 12102 -37641 -9405 14210
11532 14210 -97107 -120305 -115054 -52367 5557 49704 -5454 -26854 -16909 -33045 -124008 -160527
11520 -160527 -117986 -103331 -135704 -152071 -110314 -76368 -88317 -126204 -219751 -175037 -46095
11509 -46095 -37181 7464 20078 -51763 -91201 -45594 -7630 31190 4122 -36569 26386 -40932
11497 -40932 -46009 -84284 -119696 -137164 -114984 -97502 -46083 -29153 -130771 -180008 -108229 -69398
11485 -69398 -93726 -25023 12497 -23834 -73435 -83803 -9417 39954 16548 -41403 -35949 -76526
11473 -76526 4910 71256 35400 41629 -34651 -15388 3401 39663 31503 60229 83908 99225
11461 99225 107536 51244 26888 35679 35370 53064 15207 -91557 -91273 -84200 -59609 -19431 23072
11448B3072o7889J2198M8099O98j1478o2090q4006j5452K5090J03175J9382n7321
11436f6522N1980P5156o9831o4510R225L1918k2129q5217l342L3010J01247R2257
11424H3242k1132m7882k885j6082n3370q7377l3198L259K2866Q8923L9703M3992
11412B0059L4063K4188K5626l4121J1525N6809j10980q7635J70303K1169q5416
11401D5590j3723J2862n406p2621k8609o3500M9472O3515k0408L1563l9420k0556
11389f1241k9725j9774N0378p1602l6611K384M8507J28566N5529m3672J4587m807
11377C2519L1982m6681q703R0341M9517j18177l4497Q7575q004j0477k513j2963
11365D9919p3603n5049J022J4929O6309k1142j8363j8810m3442K1375l4694J9139
$$ plain form
11448 23072 -44817 -32619 15480 16178 4700 -57390 -141396 -156848 -131758 -28583 -9201 -66522
11436 -66522 -14542 60614 -9217 -73727 -64502 -32584 -54713 -139930 -143272 -110262 -9015 83242
11424 83242 62110 14228 11343 -4739 -58109 -145486 -178684 -175425 -152559 -63636 -23933 20059
11412 20059 54122 78310 103936 69815 81340 138149 27169 -60466 109837 131006 45590
11401 45590 31867 44729 39323 -33298 -61907 -125407 -75935 -12420 -32828 -1265 -40685 -61241
11389 -61241 -90966 -110740 -60362 -131964 -168575 -166191 -117684 10882 66411 22739 37326 32519
11377 32519 64501 17820 9117 99458 148975 30798 -3699 83876 75872 65395 62882 49919
11365 49919 -23684 -78733 -77711 -62782 3527 -17615 -35978 -54788 -98230 -76855 -111549 -92410
11353i2410N4865K8088l2476J170K080j8350J1470k9634k5318J00702L1727o4892
11341c2978R972K449M8270j3822q9138N1854N7036j08468l1529Q715L5197m0997
11329a03439m1074o1159R211R3650k829L1951Q8058n932L5984l7587m658l7997
11317c5821r9914O719J03027m415K480N8506M0430l3034p5509j9067k7635k9232
11305a13465k9010O3387O2208M3354J7698J0700M0256q6793p2308l8744N459K1766
11293g5492O9539K156J1154K9338M8632j6319o6528n265k4103l5684J2768k0023
11281f9827n4533k4648Q8131P9416P484p2691n0618o3830K3936j1563l4784R0985
11269i2542N2312n7973n3327K1961L1549K7488j7003R063j3591P864O316K3286
$$ plain form
11353 -92410 -37545 -9457 -41933 -40763 -38683 -57033 -45563 -75197 -100515 187 31914 -32978
11341 -32978 -23006 -20557 27713 13891 -75247 -23393 33643 -74825 -106354 -97639 -62442 -103439
11329 -103439 -144513 -205672 -196461 -102811 -105640 -73689 14369 8437 44421 6834 2176 -35821
11317 -35821 -135735 -129016 -25989 -30404 -27924 30582 71012 37978 -37531 -56598 -84233 -113465
11305 -113465 -142475 -79088 -16880 26474 44172 54872 95128 8335 -63973 -102717 -97258 -75492
11293 -75492 -5953 -3797 7357 36695 85327 69008 2480 -2785 -26888 -62572 -49804 -69827
11281 -69827 -124360 -149008 -60877 18539 26023 -46668 -97286 -161116 -137180 -148743 -183527 -92542
11269 -92542 -40230 -98203 -151530 -129569 -98020 -70532 -87535 -78472 -92063 -84199 -77883 -54597
11257e4597R0953m889m3282j3521K8270K0847k9736p5652m2754M0993P9665l8412
11245d2115q2649j00500M3036J16921n0822j15412k8873J44309R0742k2843L1438
$$ plain form
11257 -54597 36356 31467 -11815 -25336 2934 23781 -5955 -81607 -124361 -83368 -3703 -42115
11245 -42115 -124764 -225264 -182228 -65307 -116129 -231541 -260414 -116105 -25363 -48206 -16768
$$ [...]
##END NTUPLES=NMR SPECTRUM
##END=
