##TITLE=Analysis number 317718
Compound Code mo 07822
Book Reference 461/26
Project Code adrs
Chemist Name toml
##JCAMPDX= 6.0         $$ Bruker NMR JCAMP-DX V2.0
##DATA TYPE= NMR SPECTRUM
##DATA CLASS= NTUPLES
##ORIGIN= Bruker BioSpin GmbH
##OWNER= nmr
$$ XWIN-NMR		Version 3.5
$$ Wed Mar  1 11:39:46 2006 GMT Standard Time (UT+0h)  MAYBRIDGE\nmr@NMR_250MHZ
##.OBSERVE FREQUENCY= 250.131544655141
##.OBSERVE NUCLEUS= ^1H
##.ACQUISITION MODE= SIMULTANEOUS (DQD)
##.ACQUISITION SCHEME= undefined
##.AVERAGES= 16
##.DIGITISER RES= 18
##SPECTROMETER/DATA SYSTEM= dpx250
##.PULSE SEQUENCE= zg30
##.SOLVENT NAME= CDCl3
##.SHIFT REFERENCE= (INTERNAL, CDCl3, 0, 16.4544)
##AUDIT TRAIL= $$ (NUMBER, WHEN, WHO, WHERE, WHAT)
$$ ##TITLE= Audit trail, XWIN-NMR		Version 3.5
$$ ##JCAMPDX= 5.01
$$ ##ORIGIN= Bruker BioSpin GmbH
$$ ##OWNER= nmr
$$ C:\u/data/dgb/nmr/ADRS/17200/pdata/1/auditp.txt
$$ ##AUDIT TRAIL=  $$ (NUMBER, WHEN, WHO, WHERE, WHAT)
(   1,<2006-03-01 11:39:09.69 +000>,<MAYBRIDGE\nmr>,<NMR_250MHZ>,
      <created by zg, POWCHK disabled, PULCHK disabled
       configuration hash MD5:
       84 BC 41 DB A1 6E 1D 46 DA 25 12 A5 C1 ED C5 3A
       data hash MD5: 64K
       D6 90 55 2B 61 22 9D 26 99 14 38 95 ED DE E7 F0>)
(   2,<2006-03-01 11:39:28.62 +000>,<MAYBRIDGE\nmr>,<NMR_250MHZ>,
      <Start of raw data processing
       ef LB = 0.3 FT_mod = 6 PKNL = 1 SI = 32K 
       data hash MD5: 32K
       E3 C3 06 AB 47 97 46 A0 EB E6 9F 1B 9F E6 05 90>)
(   3,<2006-03-01 11:39:32.58 +000>,<MAYBRIDGE\nmr>,<NMR_250MHZ>,
      <apk 
       data hash MD5: 32K
       DF 33 84 DD 22 5F 30 ED 47 65 2B A8 22 F2 18 17>)
(   4,<2006-03-01 11:39:34.37 +000>,<MAYBRIDGE\nmr>,<NMR_250MHZ>,
      <abs ABSG = 5 
       data hash MD5: 32K
       E5 69 F7 ED AD E4 5E E4 A0 38 4C 38 53 6D B4 40>)
$$ ##END=
$$ 
$$ hash MD5
$$ 80 25 0E 83 0D EE 5E 94 A0 31 86 EA 75 2F B3 D4
##$RELAX= 
##$RELAX= 
##$RELAX= 
##$RELAX= 
##$RELAX= 
##$RELAX= 
##$RELAX= 
$$ Bruker specific parameters
$$ --------------------------
##$DU= <C:\u>
##$EXPNO= 17200
##$NAME= <ADRS>
##$PROCNO= 1
##$TYPE= <nmr>
##$USER= <dgb>
##$AMP= (0..31)
100 100 100 100 100 100 100 100 100 100 100 100 100 100 100 100 100 100 
100 100 100 100 100 100 100 100 100 100 100 100 100 100 
##$AQSEQ= 0
##$AQ_mod= 3
##$AUNM= <au_zg>
##$AUTOPOS= <23 >
##$BF1= 250.13
##$BF2= 250.13
##$BF3= 250.13
##$BF4= 250.13
##$BF5= 500.13
##$BF6= 500.13
##$BF7= 500.13
##$BF8= 500.13
##$BYTORDA= 1
##$CFDGTYP= 0
##$CFRGTYP= 5
##$CHEMSTR= <none>
##$CNST= (0..31)
1 1 145 1 1 1 1 1 1 1 1 1 1 1 1 1 1 1 1 1 1 1 1 1 1 1 1 1 1 1 1 1 
##$CPDPRG= <>
##$CPDPRG1= <>
##$CPDPRG2= <>
##$CPDPRG3= <>
##$CPDPRG4= <mlev>
##$CPDPRG5= <mlev>
##$CPDPRG6= <mlev>
##$CPDPRG7= <mlev>
##$CPDPRG8= <mlev>
##$CPDPRGB= <>
##$CPDPRGT= <>
##$D= (0..31)
0 1 0 0 0 0 0 0 0 0.06 0 0 0 0 0 0 0.0002 0 0 0 0 0 0 0 0 0 0 0 0 0 0 
0 
##$DATE= 1141213148
##$DBL= (0..7)
120 120 120 120 120 120 120 120 
##$DBP= (0..7)
150 150 150 150 150 150 150 150 
##$DBP07= 0
##$DBPNAM0= <>
##$DBPNAM1= <>
$$ [...]
##$SUBNAM7= <"">
##$SUBNAM8= <"">
##$SUBNAM9= <"">
##$SW= 20.6930455092707
##$SWIBOX= (0..15)
0 0 3 0 0 0 0 0 0 0 0 0 0 0 0 0 
##$SW_h= 5175.983436853
##$TD= 65536
##$TD0= 1
##$TE= 293.16
##$TE2= 300
##$TE3= 300
##$TEG= 300
##$TL= (0..7)
0 120 120 120 120 120 120 120 
##$TP= (0..7)
150 150 150 150 150 150 150 150 
##$TP07= 0
##$TPNAME0= <>
##$TPNAME1= <>
##$TPNAME2= <>
##$TPNAME3= <>
##$TPNAME4= <>
##$TPNAME5= <>
##$TPNAME6= <>
##$TPNAME7= <>
##$TPOAL= (0..7)
0.5 0.5 0.5 0.5 0.5 0.5 0.5 0.5 
##$TPOFFS= (0..7)
0 0 0 0 0 0 0 0 
##$TUNHIN= 0
##$TUNHOUT= 0
##$TUNXOUT= 0
##$USERA1= <user>
##$USERA2= <user>
##$USERA3= <user>
##$USERA4= <user>
##$USERA5= <user>
##$V9= 5
##$VALIST= <valist>
##$VCLIST= <CCCCCCCCCCCCCCC>
##$VD= 0
##$VDLIST= <DDDDDDDDDDDDDDD>
##$VPLIST= <PPPPPPPPPPPPPPP>
##$VTLIST= <TTTTTTTTTTTTTTT>
##$WBST= 1024
##$WBSW= 4
##$XGAIN= (0..3)
0 0 0 0 
##$XL= 0
##$YL= 0
##$YMAX_a= 293505
##$YMIN_a= -428013
##$ZGOPTNS= <>
##$ZL1= 120
##$ZL2= 120
##$ZL3= 120
##$ZL4= 120
##$ABSF1= 16.45439
##$ABSF2= -4.238783
##$ABSG= 5
##$ABSL= 3
##$ALPHA= 0
##$AQORDER= 0
##$ASSFAC= 0
##$ASSFACI= 0
##$ASSFACX= 0
##$ASSWID= 0
##$AUNMP= <proc_1d>
##$AZFE= 0.1
##$AZFW= 0.1
##$BCFW= 0
##$BC_mod= 0
##$BYTORDP= 0
##$COROFFS= 0
##$CY= 12.5
##$DATMOD= 1
##$DC= 0
##$DFILT= <>
##$DTYPP= 0
##$F1P= 14.0000005364418
##$F2P= -0.99999901652339
##$FCOR= 0.5
##$FTSIZE= 32768
##$FT_mod= 6
##$GAMMA= 0
##$GB= 0
##$INTBC= 1
##$INTSCL= 1
##$ISEN= 128
##$LB= 0.3
##$LEV0= 0
##$LPBIN= 0
##$MAXI= 10000
##$MC2= 0
##$MEAN= 0
##$ME_mod= 0
##$MI= 0
##$NCOEF= 0
##$NC_proc= -4
##$NLEV= 6
##$NOISF1= 0
##$NOISF2= 0
##$NSP= 0
##$NTH_PI= 0
##$NZP= 0
##$OFFSET= 16.45439
##$PC= 1
##$PHC0= -107.7108
##$PHC1= 6.937052
##$PH_mod= 1
##$PKNL= yes
##$PPARMOD= 0
##$PSCAL= 4
##$PSIGN= 0
##$REVERSE= no
##$SF= 250.130016909928
##$SI= 32768
##$SIGF1= 0
##$SIGF2= 0
##$SINO= 400
##$SIOLD= 32768
##$SREGLST= <1H.CDCl3>
##$SSB= 0
##$STSI= 32768
##$STSR= 0
##$SW_p= 5175.98343685301
##$SYMM= 0
##$S_DEV= 0
##$TDeff= 65536
##$TDoff= 0
##$TI= <Analysis number 999999
Compound Code 99
Book Reference 9
Project Code 9>
##$TILT= no
##$TM1= 0
##$TM2= 0
##$TOPLEV= 0
##$USERP1= <user>
##$USERP2= <user>
##$USERP3= <user>
##$USERP4= <user>
##$USERP5= <user>
##$WDW= 1
##$XDIM= 32768
##$YMAX_p= 486092930
##$YMIN_p= -924470
$$ End of Bruker specific parameters
$$ ---------------------------------
##NTUPLES= NMR SPECTRUM
##VAR_NAME=  FREQUENCY,     SPECTRUM/REAL,   SPECTRUM/IMAG
##SYMBOL=    X,             R,               I
##VAR_TYPE=  INDEPENDENT,   DEPENDENT,       DEPENDENT
##VAR_FORM=  AFFN,          ASDF,            ASDF
##VAR_DIM=   32768,         32768,           32768
##UNITS=     HZ,            ARBITRARY UNITS, ARBITRARY UNITS
##FACTOR=    0.157963299565203, 1,           1
##FIRST=     4115.73674192281, 0,            0
##LAST=      -1060.2466949302, 0,            0
##MIN=       -1060.2466949302, -924470,      0
##MAX=       4115.73674192281, 486092930,    0
$$ Real data points
##PAGE= N=1
##DATA TABLE= (X++(R..R)), XYDATA
$$ [...]
$$ plain form
22233 -17250 58545 -114467 -127682 -52363 65525 1684 58643 -60015 -245129 -334670 -193543
22222 -193543 7032 36244 -1087 -53315 -74272 73910 95988 14174 -66275 -43880 53261
22211 53261 122225 122772 235516 211441 154194 69194 -129342 -165547 -77736 -84696 -340241 -348425
22199 -348425 -97194 -179627 -340057 -388502 -416775 -247167 -304086 -287135 -57219 67411
22189 67411 16962 57925 113614 63072 -28543 155895 206577 173437 141797 184234 297242
22178 297242 150737 -55334 -128327 -7107 43094 -113043 -166356 -108137 -860 -46213
22168 -46213 -90037 -169187 -325183 -389223 -357151 -344609 -367518 -347003 -79642 216436 316664
22157 316664 674917 721755 628957 682349 534237 410153 282520 57658 -212801 -121741
$$ packed form
22233a7250P5795j73012j3215P5319J17888o3841N6959j18658j85114q9541J41127
22222a93543K00575K9212l7331n2228k0957J48182K2078q1814q0449K2395R7141
22211E3261O8964N47J12744k4075n7247q5000j98536l6205Q7811o960k55545q184
22199c48425K51231q2433j60430m8445k8273J69608n6919J6951K29916J24630
22189F7411n0449M0963N5689n0542r1615J84438N0682l3140l1640M2437J13008
22178B97242j46505k06071p2993J21220N0201j56137n3313N8219J07277m5353
22168d6213m3824p9150j55996o4040L2072J2542k2909K0515K67361K96078J00228
22157C16664L58253M6838r2798N3392j48112j24084j27633k24862k70459R1060
$$ plain form
22147 -121741 227356 264442 81825 183123 134293 29008 50274 -82541 -216306 -149681
22137 -149681 -46620 -38986 35106 136988 67646 -40070 82496 115637 26974 -47386 63306
22126 63306 -90843 -134783 -130874 -254978 -224085 -193597 -155730 -112865 -106570 -141180 -168019 -210828
22114 -210828 -45202 3524 15403 108475 169071 57601 -50961 10457 114567 126593 127555
22103 127555 56441 -157775 -264580 -422132 -464156 -314467 -214222 -57913 -8135 6415
22093 6415 -85232 -72666 44732 -54468 -262297 -262640 -34043 87936 -142008 -326882 -204484
22082 -204484 -204249 -338792 -534026 -377759 -184401 -117471 18202 43359 -54321 -72792 -247471
22071 -247471 -135070 -23183 -139164 -176418 -52737 23667 196710 53016 -134102 -84405
$$ packed form
22147a21741L49097L7086j82617J01298m8830j05285K1266j32815j33765O6625
22137a49681J03061P634P4092J01882o9342j07716J22566L3141q8663p4360J10692
22126F3306j54149m3940L909j24104L0893L0488L7867M2865O295l4610k6839m2809
22114b10828J65626M8726J1879R3072O0596j11470j08562O1418J04110J2026R62
22103A27555p1114k14216j06805j57552m2024J49689J00245J56309M9778J4550
22093F415r1647J2566J17398r9200k07829l43K28597J21979k29944j84874J22398
22082b04484K35j34543j95234J56267J93358O6930J35673K5157r7680j8471j74679
22071b47471J12401J11887j15981l7254J23681P6404J73043j43694j87118M9697
$$ plain form
22061 -84405 17851 61428 176017 139221 68073 16854 1136 76406 -113823 -105570 -82019
22050 -82019 -119777 -178024 -307686 -401752 -282812 -247525 -436452 -498888 -408625 -288792 -232125
22039 -232125 -150116 -81927 -13640 14988 140537 -43233 -122745 -172692 -166911 -167570 -160803 -278559
22027 -278559 -202854 -58939 -11736 36875 40590 -105818 -7308 187424 128462 4652 -20990
22016 -20990 115495 103340 110616 126904 128972 185643 144981 60608 30018 -25072 -14153 25997
22004 25997 44288 143981 255890 187914 75900 -201394 -215219 -203153 -212789 -56942 82879
21993 82879 281239 352547 58960 -125280 -115692 -47201 19933 92191 -30081 -137169 -88869
21982 -88869 9731 -32757 -17807 85880 248216 352640 276885 248103 309625 274414 261527
$$ packed form
22061h4405J02256M3577J14589l6796p1148n1219j5718P5270j90229Q253K3551
22050h2019l7758n8247j29662r4066J18940L5287j88927o2436R0263J19833N6667
22039b32125Q2009O8189O8287K8628J25549j83770p9512m9947N781o59O767j17756
22027b78559P5705J43915M7203M8611L715j46408R8510J94732n8962j23810k5642
22016b0990J36485j2155P276J6288K068N6671m0662q4373l0590n5090J0919M0150
22004B5997J8291R9693J11909o7976j12014k77294j3825J2066r636J55847J39821
21993H2879J98360P1308k93587j84240R588O8491O7134P2258j22272j07088M8300
21982h8869R8600m2488J4950J03687J62336J04424p5755k8782O1522l5211j2887
$$ plain form
21971 261527 102318 77062 202754 304842 249316 132827 41318 -95991 -27609 132589
21961 132589 168389 32311 -80254 -125905 -200901 -281317 -104631 -88400 -8869 132093 -56796
21950 -56796 -104710 -119324 -249894 -190043 128261 264082 188558 28756 -29767 -40071 212912
21939 212912 389153 384001 329508 201357 140026 211158 152893 117201 75745 -29532 41803
21928 41803 36144 31411 16152 -69167 -49240 -9577 -142786 -145956 51300 104889 246339 170406
21916 170406 -28689 -78100 -21696 93503 96480 -144748 -143391 -113497 -62637 72125 53282
21905 53282 -33399 -1586 15024 -31201 -143676 -138806 -185291 -280525 -381777 -188767 -203540
21894 -203540 -141748 69208 134701 -11017 -24796 242834 235031 221050 118844 -62378 -139946
$$ packed form
21971B61527j59209k5256J25692J02088n5526j16489r1509j37309O8382J60198
21961A32589L5800j36078j12565m5651p4996q0416J76686J6231P9531J40962j88889
21950e6796m7914j4614j30570N9851L18304J35821p5524j59802n8523j0304K52983
21939B12912J76241n152n4493j28151o1331P1132n8265l5692m1456j05277P1335
21928D1803n659m733j5259q5319J9927L9663j33209l170J97256N3589J41450p5933
21916A70406j99095m9411N6404J15199K977k41228J357K9894N0860J34762j8843
21905E3282q6681L1813J6610m6225j12475M870m6485r5234j01252J93010j4773
21894b03540O1792K10956O5493j45718j3779K67630p803j3981j02206j81222p7568
$$ plain form
21883 -139946 -97220 -207368 -334028 -297904 -468731 -320285 74737 221595 32073 -62228
21873 -62228 -51438 74040 79922 -6062 -172809 -265004 -152565 -139436 -211646 -278529 -120013
21862 -120013 59780 32750 -38351 -40747 178631 309259 322353 263588 110859 171688 84018
21851 84018 -55683 39093 -29150 -208402 -220410 -143128 -167848 -273634 -327946 -197193 -166482
21840 -166482 -334620 -328942 -192476 -108976 -188112 -146864 7846 -21468 4265 -26504 29567
21829 29567 118785 177567 44426 83254 64820 76165 23830 -108672 -186470 -202583 -281161
21818 -281161 -274173 -144828 -184024 7085 102747 44205 -142464 -238154 -286933 -320091 -141656
21807 -141656 -226376 -101517 -49869 -125702 115930 325980 320585 277737 210790 -58887 -27071
$$ packed form
21883a39946M2726j10148j26660L6124j70827J48446L95022J46858j89522r4301
21873f2228J0790J25478N882q5984j66747r2195J12439J3129p2210o6883J58516
21862a20013J79793k7030p1101k396K19378J30628J3094n8765j52729O0829q7670
21851H4018j39701R4776o8243j79252j2008P7282k4720j05786n4312J30753L0711
21840a66482j68138N678J36466Q3500p9136M1248J54710k9314K5733l0769N6071
21829B9567Q9218N8782j33141L8828j8434J1345n2335j32502p7798j6113p8578
21818b81161O988J29345l9196J91109R5662n8542j86669r5690m8779l3158J78435
21807a41656q4720J24859N1648p5833K41632K10050n395m2848o6947k69677L1816
$$ plain form
21796 -27071 -25982 -158525 -197387 -1775 -33300 8259 145132 143476 198056 72444 -56317
21785 -56317 -78824 -36063 63194 78256 171249 89694 -77402 -114144 -45046 -63541 -25567
21774 -25567 106918 136135 239013 160206 6717 -142847 -38686 -61155 -106172 13652
21764 13652 54830 -159337 -298583 -198683 -189807 -353159 -271230 -1605 280712 331955 389593
21753 389593 323049 153525 37460 -20737 104502 80180 -25652 -117650 -21078 94589
21743 94589 97475 111403 12957 -54280 -261092 -183028 -156951 -282014 -351836 -447913 -268656
21732 -268656 -178399 -170776 -125093 -252783 -130516 -39460 96946 126293 74784 142632 1255
21721 1255 -190232 -212443 -63799 -89765 43225 63867 -40580 -133774 -277233 -204548 -146690
$$ packed form
21796b7071J089j32543l8862J95612l1525M1559J36873j656N4580j25612j28761
21785e6317k2507M2761R9257J5062R2993q1555j67096l6742O9098j8495L7974
21774b5567J32485K9217J02878p8807j53489j49564J04161k2469m5017J19824
21764A3652M1178k14167j39246R9900Q876j63352Q1929K69625K82317N1243N7638
21753C89593o6544j69524j16065n8197J25239k4322j05832r1998R6572J15667
21743I4589K886J3928r8446o7237k06812P8064K6077j25063o9822r6077J79257
21732b68656R0257P623M5683j27690J22267R1056J36406K9347n1509O7848j41377
21721A255j91487k2211J48644k5966J32990K0642j04447r3194j43459P2685N7858
$$ plain form
21710 -146690 -62736 88364 231586 134954 -23675 -180616 -344293 -292380 -236564 -172154
21700 -172154 -221862 -60218 94977 151531 181379 14104 10012 113263 34846 -133303 -161617
21689 -161617 -58924 -15977 30045 45070 -28840 -53988 75951 334834 249479 152977 184177
21678 184177 -6759 -141306 12442 -18092 -216688 -259643 -262211 -155387 69086 -48219
21668 -48219 -216107 -281092 -234853 -138059 22915 21308 -2943 30418 -211 -141162 1025
21657 1025 92257 110759 4016 -38147 56456 168241 279528 218758 114643 9344 -117273
21646 -117273 -59796 -17947 66050 58538 -36096 8168 -38649 -276485 -301101 -184812 -83003
21635 -83003 -116444 -83078 -240298 -274136 -392265 -246399 18101 36633 142867 347279
$$ packed form
21710a46690Q3954J51100J43222r6632j58629j56941j63677N1913N5816O4410
21700a72154m9708J61644J55195N6554K9848j67275m092J03251p8417j68149k8314
21689a61617J02693M2947M6022J5025p3910k5148J29939K58883q5355r6502L1200
21678A84177j90936j34547J53748l0534j98596m2955k568J06824K24473j17305
21668d8219j67888o4985M6239R6794J60974j607k4251L3361l0629j40951J42187
21657A025R1232J8502j06743m2163R4603J11785J11287o0770j04115j05299j26617
21646a17273N7477M1849Q3997p512r4634M4264m6817k37836k4616J16289J01809
21635h3003l3441L3366j57220l3838j18129J45866K64500J8532J06234K04412
$$ plain form
21625 347279 255926 95713 113608 -38358 -350754 -306477 -228487 -145922 -76524 -106931 -1240
21614 -1240 19718 -134174 -198474 -283427 -123484 1591 28242 10148 -101362 -67572 -29782
21603 -29782 -129729 -143807 -14298 58003 11735 82701 171954 3797 -119111 -263391 -17680
21592 -17680 70537 60590 36898 27003 24986 70809 -10728 -20383 81943 123962 82231 128003
21580 128003 135084 -8399 -130930 -142650 -129266 90532 165604 97089 -12670 81417 16785
21569 16785 -56198 -165991 -88325 -32709 -91439 -185601 -133912 -134018 -188148 -70729 -96757 59648
21557 59648 42538 21982 -5423 -64849 21659 -83 15537 55435 122188 84477 -7140 -117894
21545 -117894 -167205 -287960 -87684 -51719 -110523 22530 204415 239728 208033 102641
$$ packed form
21625C47279r1353j60213J7895j51966l12396M4277P7990Q2565O9398l0407J05691
21614a240K0958j53892o4300q4953J59943J25075K6651j8094j11510L3790L7790
21603b9782r9947j4078J29509P2301m6268P0966Q9253j68157j22908j44280K45711
21592a7680Q8217r947k3692r895k017M5823q1537r655J02326M2019m1731M5772
21580A28003P081j43483j22531j1720J3384K19798P5072o8515j09759R4087o4632
21569A6785p2983j09793P7666N5616n8730r4162N1689j06n4130J17419k6028J56405
21557E9648j7110k0556k7405n9426Q6508k1742J5620L9898O6753l7711r1617j10754
21545a17894m9311j20755K00276L5965n8804J33053J81885L5313l1695j05392
$$ plain form
21535 102641 48103 -80353 -97779 -158025 -222204 -303641 -258947 -9626 105174 76647 -61818
21524 -61818 -16944 98685 259107 363126 362171 397816 496285 401052 274381 113404 -25039
21513 -25039 -49502 -76744 -113867 -278021 -354414 -281526 -165941 -212174 -299283 -274113 -109944
21502 -109944 -16953 -216079 -257724 -39300 119595 39748 -82751 35870 81388 50216
21492 50216 224789 348676 190925 159008 123069 6386 -155327 -91744 121743 19371
21482 19371 -154764 -210877 -150874 -119859 -221680 -213885 -294188 -273894 -124488 -89758 50996
21471 50996 -75221 -32430 -16206 107927 -65150 -191352 -206819 -120277 -198903 -161366 -121876
21460 -121876 -231017 -189337 -104012 -3425 -140942 -231118 -219388 -100151 44898 72751
$$ packed form
21535A02641n4538j28456j7426o0246o4179q1437M4694K49321J14800k8527j38465
21524f1818M4874J15629J60422J04019r55L5645R8469r5233j26671j60977j38443
21513b5039k4463k7242l7123j64154p6393P2888J15585m6233q7109K5170J64169
21502a09944R2991j99126m1645K18424J58895p9847j22499J18621M5518l1172
21492E0216J74573J23887j57751l1917l5939j16683j61713O3583K13487j02372
21482A9371j74135n6113O0003L1015j01821P795q0303K0294J49406L4730J40754
21471E0996j26217M2791J6224J24133j73077j26202j5467Q6542p8626L7537L9490
21460a21876j09141M1680Q5325J00587j37517r0176J1730J19237J45049K7853
$$ plain form
21450 72751 126176 72995 100392 -34968 -180665 -209309 -160114 -105956 258 172133 100740
21439 100740 -33770 -66759 -164302 -229298 -365628 -373253 -195834 -244005 -189014 -185344 15029
21428 15029 79845 -112552 -449980 -587182 -465984 -410473 -438408 -283626 -101169 -76175
21418 -76175 -294826 -407469 -255401 -172346 -89057 -88746 -104457 -112950 39083 161885 284417
21407 284417 257283 56311 49532 175739 354163 187184 -149138 -357353 -304183 -208149
21397 -208149 -20074 -23296 -69827 23808 68380 19648 -37003 -232260 -89435 73095 -12338
21386 -12338 19738 97840 113931 193950 -74363 -77561 47967 -89247 -177967 -142744 -80599
21375 -80599 -33349 -177641 -134878 53753 -43947 -98312 -371990 -558020 -633401 -568474 -563628
$$ packed form
21450G2751N3425n3181K7397j35360j45697k8644M9195N4158J06214J71875p1393
21439A00740j34510l2989r7543o4996j36330p625J77419m8171N4991L670K00373
21428A5029O4816j92397l37428j37202J21198N5511k7935J54782J82457K4994
21418g6175k18651j12643J52068Q3055Q3289L11j5711q493J52033J22802J22532
21407B84417k7134k00972o779J26207J78424j66979l36322k08215N3170R6034
21397b08149J88075l222m6531R3635M4572m8732n6651j95257J42825J62530q5433
21386a2338L2076P8102J6091Q0019k68313l198J25528j37214q8720L5223O2145
21375h0599M7250j44292M2763J88631r7700n4365k73678j86030p5381O4927M846
$$ plain form
21364 -563628 -478732 -264673 -114731 26755 66885 197882 184892 -13899 -115596 -79789
21354 -79789 -44936 174118 204465 193784 81394 -46449 19281 82598 73963 -9296 -138559
21343 -138559 -219202 -23213 181291 70087 -87 -80332 -126197 -153866 -140854 15030 -45451
21332 -45451 -76180 -186831 -309272 -331635 -14849 103314 58455 15008 -123057 -58685 -139458
21321 -139458 -334394 -180758 -22509 85885 79067 -22681 -53458 96567 183513 -3303
21311 -3303 118773 251421 268867 186832 190116 239316 180553 166568 275682 123901 -17483
21300 -17483 -42323 -87888 73394 159826 47915 -5802 9288 31186 52379 -46518 -140170
21289 -140170 -95051 -22859 -20263 -74083 -196970 -81127 -63839 -98844 185732 468155 286912
$$ packed form
21364e63628Q4896K14059J49942J41486M0130J30997j2990j98791j01697L5807
21354g9789L4853K19054L0347j0681j12390j27843O5730O3317q635q3259j29263
21343a38559q0643J95989K04504j11204p0174q0245m5865k7669J3012J55884o0481
21332d5451l0729j10651j22441k2363L16786J18163m4859m3447j38065O4372q0773
21321a39458j94936J53636J58249J08394o818j01748l0777J50025Q6946j86816
21311c303J22076J32648J7446q2035L284M9200n8763j3985J09114j51781j41384
21300a7483k4840m5565J61282Q6432j11911n3717J5090K1898K1193r8897r3652
21289a40170M5119P2192K596n3820j22887J15843J7288l5005K84576K82423j81243
$$ plain form
21278 286912 193871 129910 158646 -17906 -278532 -291277 -239725 -175275 64710 51444 -37461
21267 -37461 -144043 -216527 -320652 -339167 -366230 -396531 -176111 -136030 -98445 27070 6443
21256 6443 -36967 -13145 -5691 -43843 16290 52955 163809 317471 162366 57343 -39547
21245 -39547 -90013 -69820 126143 134608 -23067 21870 107306 86385 92284 130551 132029 105567
21233 105567 160742 249764 231766 200558 4393 -160644 -215674 -258293 -380201 -527697 -429640
21222 -429640 -232837 -294921 -362916 -273339 -248408 -245226 -335107 -386303 -189643 -25014 105792
21211 105792 47980 -92244 -11648 -165203 -275142 -143264 22164 24658 129074 13812
21201 13812 147861 144992 165131 25185 -143463 -138844 -109604 -78850 -215866 -170953 -262711
$$ packed form
21278B86912r3041o3961K8736j76552k60626j2745N1552O4450K39985j3266q8905
21267c7461j06582p2484j04125j8515k7063l0301K20420M0081L7585J25515k0627
21256F443m3410K3822P454l8152O0133L6665J10854J53662j55105j05023r6890
21245c9547n0466K0193J95963Q465j57675M4937Q5436k0921N899L8267J478k6462
21233A05567N5175Q9022j7998l1208j96165j65037n5030m2619j21908j47496R8057
21222d29640J96803o2084o7995Q9577K4931L182q9881n1196J96660J64629J30806
21211A05792n7812j40224Q0596j53555j09939J31878J65428K494J04416j15262
21201A3812J34049k869K0139j39946j68648M619K9240L0754j37016M4913r1758
$$ plain form
21190 -262711 -236138 -231987 -102428 16327 134885 341445 231008 185661 179029 43408 19721
21179 19721 133302 249485 36913 -16135 12796 -12179 100297 -15591 9784 95089 -858
21168 -858 -86827 -124483 -156871 -192926 -158917 -25256 -50923 51278 107055 86044 9651 -67603
21156 -67603 -94620 79342 68610 60763 -63071 -55721 -108140 -127767 -118540 73692 -60377
21145 -60377 -115784 80 177649 263649 217783 131137 109056 148141 15523 -209527 -162542
21134 -162542 -212095 -154250 -108987 -32028 62556 261196 226744 9043 17379 -88185 -229286
21123 -229286 -320363 -196316 -171957 -77566 -61839 -175945 -198394 -335745 -348278 -229832 -105938
21112 -105938 -5577 -45179 -41564 -27393 -36804 -37534 -106008 -116655 -199181 32137 131632 98153
$$ packed form
21190b62711K6573M151J29559J18755J18558K06560j10437m5347o632j35621k3687
21179A9721J13581J16183k12572n3048K8931k4975J12476j15888K5375Q5305r5947
21168h58q5969l7656l2388l6055L4009J33661k5667J02201N5777k1011p6393p7254
21156f7603k7017J73962j0732p847j23834P350n2419j9627R227J92232j34069
21145f0377n5407J15864J77569Q6000m5866q6646k2081L9085j32618k25050M6985
21134a62542m9553N7845M5263P6959R4584J98640l4452k17701Q336j05564j41101
21123b29286r1077J24047K4359R4391J5727j14106k2449j37351j2533J18446J23894
21112a05938J00361l9602L615J4171r411p30o8474j0647q2526K31318R9495l3479
$$ plain form
21100 98153 45894 49571 174092 343281 432744 359508 90176 -16032 -95849 54546 120905
21089 120905 111333 281047 78504 -182865 -204975 -163990 -97229 -163191 -276552 -307881 -283325
21078 -283325 -281552 -354499 -325343 -143182 71031 48556 -128681 -226081 -209057 -302718 -343810
21067 -343810 -270622 -125942 -35569 -80880 -121384 -110940 -171455 -6488 -115938 -154339 -158740
21056 -158740 -233975 -311366 -220140 -190942 -134885 -186031 -91635 -2362 -64008 -130993 -228142
21045 -228142 -190437 -121317 -108538 -117931 -133939 -202246 -29089 -51478 -53800 -25614 55300 -15240
21033 -15240 -37585 -64558 -135965 -120584 65419 178193 74597 145523 183671 185313 138278
21022 138278 128890 -56548 -275289 26532 21241 -161462 34085 124218 66333 187083 217906
$$ packed form
21100I8153n2259L677J24521J69189Q9463p3236k69332j06208p9817J50395O6359
21089A20905r572J69714k02543k61369k2110M0985O6761o5962j13361l1329K4556
21078b83325J773p2947K9156J82161K14213k2475j77237r7400J7024r3661m1092
21067c43810P3188J44680R0373m5311m0504J0444o0515J64967j09450l8401m401
21056a58740p5235p7391R1226K9198N6057n1146R4396Q9273o1646o6985r7149
21045b28142L7705O9120J2779r393j6008o8307J73157k2389k322K8186Q0914p0540
21033a5240k2345k6973p1407J5381J86003J12774j03596P0926L8148J642m7035
21022A38278r388j85438k18741L01821n291j82703J95547R0133n7885J20750L0823
$$ plain form
21011 217906 228093 125983 64525 -40344 -166448 -48064 -72307 -1355 211241 201982 28575
21000 28575 -143946 -266499 -245364 -57491 185361 232983 69573 191956 -9361 70444
20990 70444 116009 26783 73813 20983 49498 90858 -159040 -216803 -212568 -222906 -198390 -96070
20978 -96070 -85763 -210153 -345891 -314662 -107177 -116147 -10332 266695 292355 -60813 -242756
20967 -242756 -183588 -276115 -176707 -11284 -19073 105604 -117120 -351686 -364886 -180754 -76562
20956 -76562 -227220 -250275 1066 100026 -19818 -44848 -145919 -157018 60562 79298 -24381
20945 -24381 -29870 -282091 -414858 -193892 -12574 -142684 -217745 -91416 -29949 20647 213433
20934 213433 363562 250423 -49578 -199107 -163721 -222989 -277175 -251668 -249492 -303923 -99811
$$ packed form
21011B17906J0187j02110o1458j04869j26104J18384k4243P0952K12596r259j73407
21000B8575j72521j22553K1135J87873K42852M7622j63410J22383k01317P9805
20990G0444M5565q9226M7030n2830K8515M1360k49898n7763M235j0338K4516J02320
20978i6070J0307j24390j35738L1229K07485q970J05815K77027K5660l53168j81943
20967b42756N9168r2527R9408J65423p789J24677k22724k34566j3200J84132J04192
20956g6562j50658k3055K51341R8960j19844k5030j01071j1099K17580J8736j03679
20945b4381n489k52221j32767K20966J81318j30110p5061J26329O1467N0596J92786
20934B13433J50129j13139l00001j49529L5386n9268n4186K5507K176n4431K04112
$$ plain form
20923 -99811 -34303 -22846 -9629 75740 34542 -28651 43078 58278 54404 65447 -79696 -21952
20911 -21952 38231 18743 65752 101341 26780 -17729 -151048 -50990 253221 402868 261368
20900 261368 290555 415485 408444 272078 176625 -62900 -307537 -407850 -265022 -83859
20890 -83859 -75803 -129109 -10407 -8179 -75734 -8052 33375 -4261 -55764 18127 113457 235541
20878 235541 192160 157433 308199 201851 61876 93626 68897 -32118 -206093 -410634
20868 -410634 -428975 -194233 -20465 -32821 4498 28176 -29455 89975 150436 205854 101656
20857 101656 75960 30476 3205 -56383 -84630 -77740 132536 89333 45579 70907 149221
20846 149221 361405 414115 182911 -36359 2027 104487 36694 50595 250482 349592
$$ packed form
20923i9811O5508J1457J3217Q5369m1198o3193P1729J5200l874J1043j45143N7744
20911b1952O0183j9488M7009L5589p4561m4509j33319J00058L04211J49647j41500
20900B61368K9187J24930p041j36366r5453k39525k44637j00313J42828J81163
20890h3859Q056n3306J18702K228o7555O7682M1427l7636n1503P3891R5330J22084
20878B35541m3381l4727J50766j06348j39975L1750k4729j01015j73975k04541
20868d10634j8341K34742J73768j2356L7319K3678n7631J19430O0461N5418j04198
20857A01656k5696m5484k7271n9588k8247O890K10276m3203m3754K5328P8314
20846A49221K12184N2710k31204k19270L8386J02460o7793J3901J99887R9110
$$ plain form
20836 349592 342382 233248 94005 -54094 43138 76900 157604 185937 143582 79997 168552
20825 168552 22987 -101335 14982 84930 81741 13499 -118877 -219885 -300942 -267663 -170238
20814 -170238 -165754 -59420 49536 22744 -14825 2244 -155321 -373554 -458440 -370166 -104827
20803 -104827 -3136 -39102 -166418 -251818 -205074 -95243 -74272 13309 -76858 -199225 -275345
20792 -275345 -232420 -64516 138706 307490 118033 -61622 -25713 81636 103783 25377
20782 25377 -6213 197100 247598 144398 125982 162320 262538 332742 192244 38573 4789
20771 4789 315536 853835 1276683 1601738 1430687 1378541 1305969 919166 633150 569978
20761 569978 511423 520003 445181 401288 428447 528840 841632 1130315 1520848 1547786 1458801
$$ packed form
20836C49592p210j09134j39243j48099R7232L3762Q0704K8333m2355o3585Q8555
20825A68552j45565j24322J16317O9948l189o8242j32376j01008q1057L3279R7425
20814a70238M484J06334J08956k6792l7569J7069j57565k18233q4886Q8274K65339
20803a04827J01691l5966j27316q5400M6744J09831K0971Q7581r0167j22367p6120
20792b75345M2925J67904K03222J68784j89457j79655L5909J07349K2147p8406
20782B5377l1590K03313N0498j03200j8416L6338J00218P0204j40498j53671l3784
20771D789L10747N38299M22848L25055j71051n2146p2572l86803k86016o3172
20761E69978n8555Q580p4822m3893K7159J00393L12792K88683L90533K6938q8985
$$ plain form
20750 1458801 1147304 901514 777448 480088 295243 102318 69927 121668 -14096 -231260
20740 -231260 -358181 -337680 -125926 100078 86283 -30399 -26039 -37130 -125377 -152767 -53491
20729 -53491 -23204 -11737 -9202 -140578 -219130 -122114 -89591 8170 20299 45264 57798 90441
20717 90441 168352 10775 -31873 -43139 -77889 -47579 -47721 -146332 -218333 -132389 -21519 179204
20705 179204 268352 133913 65548 -86307 75208 214325 209688 136434 223734 442233 376243
20694 376243 142974 56892 125416 225386 328103 345672 417363 458545 329702 67925 -70601
20683 -70601 -197277 -227130 -326968 -265678 -204946 -42786 -49422 7748 -44199 65330 76547
20672 76547 28566 117331 324340 402881 474703 672664 870416 1122012 1055078 955684 729045
$$ packed form
20750A458801l11497k45790j24066k97360j84845j92925l2391N1741j35764k17164
20740b31260j26921K0501K11754K26004j3795j16682M360j1091q8247k7390R9276
20729e3491L0287J1467K535j31376p8552R7016L2523R7761J2129K4965J2534L2643
20717I0441P7911j57577m2648j1266l4750L0310j42r8611p2001Q5944J10870K00723
20705A79204Q9148j34439o8365j51855J61515J39117m637p3254Q7300K18499o5990
20694C76243k33269q6082O8524R9970J02717J7569P1691M1182j28843k61777j38526
20683g0601j26676k9853r9838O1290O0732J62160o636N7170n1947J09529J1217
20672G6547m7981Q8765K07009P8541P1822J97961J97752K51596o6934r9394k26639
$$ plain form
20661 729045 541838 449047 371265 244909 173620 312621 427933 639236 764924 1005647
20651 1005647 1505974 1633927 1646783 1342066 1004497 623917 314456 176798 152931 36226
20641 36226 -154665 -111394 -41150 54836 48394 -49229 76578 126309 73137 27852 99697
20630 99697 187024 180072 294805 137310 132605 9922 49874 199048 327133 433679 566709
20619 566709 325463 125123 92557 105397 140630 206575 156706 -14538 -98085 -25596 -21455
20608 -21455 -49586 -82060 -69761 -43382 -20161 72616 183425 151148 198597 243231 157054
20597 157054 88466 99051 -85934 -120358 -267787 -197459 -99722 -16693 -123746 -153238 -14035
20586 -14035 -18812 -83668 -38212 195349 127687 141803 173198 289415 256125 166874 -198045
$$ packed form
20661G29045j87207r2791p7782j26356p1289J39001J15312K11303J25688K40723
20651A005647N00327J27953J2856l04717l37569l80580l09461j37658k3867j16705
20641C6226j90891M3271P0244R5986o442r7623J25807M9731n3172m5285P1845
20630I9697Q7327o952J14733j57495m705j22683L9952J49174J28085J06546J33030
20619E66709k41246k00340l2566J2840L5233O5945m9869j71244q3547P2489M141
20608b1455k8131l2474J2299K6379K3221R2777J10809l2277M7449M4634q6177
20597A57054o8588J0585j84985l4424j47429P0328R7737Q3029j07053k9492J39203
20586a4035m777o4856M5456K33561o7662J4116L1395J16217l3290q9251l64919
$$ plain form
20575 -198045 -112090 49050 130655 166619 331475 211662 193479 129661 54787 -1006 -130336
20564 -130336 -9796 77223 70613 18060 -18558 -193502 -302401 -479048 -404106 -123902 -17760
20553 -17760 205299 270059 296798 342947 250909 263071 202387 197054 213830 232380 244462 181908
20541 181908 123253 -207373 -111626 -42431 78536 -22390 62090 29758 -227686 -263853 -152634
20530 -152634 -202276 -269301 -193624 58561 303337 298138 394623 351730 34363 18317 222141
20519 222141 176006 118459 219407 485559 577048 345087 221382 46402 51585 157745
20509 157745 124874 174657 131507 181742 237616 152480 -17029 -63868 -84233 73206 189570
20498 189570 -76834 -39023 81244 62073 17148 -49254 -68126 138969 152945 112014 27101
$$ packed form
20575a98045Q5955J61140Q1605L5964J64856j19813j8183o3818p4874n5793j29330
20564a30336J20540Q7019o610n2553l6618j74944j08899j76647P4942K80204J06142
20553a7760K23059O4760K6739M6149r2038J2162o0684n333J6776J8550J2082o2554
20541A81908n8655l30626R5747O9195J20967j00926Q4480l2332k57444l6167J11219
20530a52634m9642o7025P5677K52185K44776n199R6485m2893l17367j6046K03824
20519B22141m6135n7547J00948K66152R1489k31961j23705j74980N183J06160
20509A57745l2871M9783m3150N0235N5874q5136j69509m6839k0365J57439J16364
20498A89570k66404L7811J20267j9171m4925o6402j8872K07095J3976m0931q4913
$$ plain form
20487 27101 117673 -11592 -48680 103287 -13244 -108611 92804 166962 166532 115826 -18817
20476 -18817 37841 248876 302030 220027 218842 190551 150785 356084 448529 494341 469565
20465 469565 302530 89586 87072 65033 -21099 -115429 6575 195392 301469 339036 465673
20454 465673 514204 659184 895083 1168907 1220678 1026886 784673 662515 488280 432123
20444 432123 443418 498739 522767 669883 627906 566054 604448 937318 1333447 1301663 971978
20433 971978 611064 451525 372310 344388 349795 266821 228124 168608 113534 -24669 -48051
20422 -48051 174680 336704 439869 195940 123754 110099 369465 400110 223240 9630
20412 9630 15467 199230 121079 -1134 -21297 -16681 148969 135729 197160 310320 236311
$$ packed form
20487B7101R0572j29265l7088J51967j16531r5367K01415P4158m30n0706j34643
20476a8817N6658K11035N3154q2003j185k8291l9766K05299R2445M5812k4776
20465D69565j67035k12944k514k2039q6132r4330J22004J88817J06077L7567J26637
20454D65673M8531J44980K35899K73824N1771j93792k42213j22158j74235n6157
20444D32123J1295N5321K4028J47116m1977o1852L8394L32870L96129l1784l29685
20433I71978l60914j59539p9215k7922N407q2974l8697n9516n5074j38203k3382
20422d8051K22731J62024J03165k43929p2186j3655K59366L0645j76870k13610
20412I630N837J83763p8151j22213k0163M616J65650j3240O1431J13160p4009
$$ plain form
20401 236311 267013 286500 51357 -75138 19577 111322 128027 125219 262346 390487 413730
20390 413730 357195 156010 17471 -27686 46725 105979 115479 28208 -10411 151039 620250
20379 620250 1094892 1379351 2213032 3362855 3831839 3610083 2807023 1938782 1399226
20370 1399226 1025366 892561 973124 1017627 1179614 1169475 1383071 1799038 2780093 4383826
20360 4383826 5273757 4853234 3805523 2643420 1712022 1302376 982127 602745 314352
20351 314352 326491 333916 208325 135947 -4635 -164865 -4147 83616 333637 625562
20341 625562 671644 527730 380006 342113 236758 185026 217628 193624 226499 306139 373229
20330 373229 368561 345571 313169 381931 436643 494491 481104 317531 153899 -8966 -178855
$$ packed form
20401B36311L0702J9487k35143j26495R4715R1745J6705k808J37127J28141K3243
20390D13730n6535k01185j38539m5157P4411N9254R500q7271l8619J61450M69211
20379F20250M74642K84459Q33681J149823M68984k21756q03060q68241n39556
20370A399226l73860j32805Q0563M4503J61987j0139K13596M15967R81055J603733
20360D383826Q89931m20523j047711j162103r31398m09646l20249l79382k88393
20351C14352J2139P425j25591p2378j40582j60230J60718Q7763K50021K91925
20341F25562M6082j43914j47724l7893j05355n1732L2602k4004L2875P9640O7090
20330C73229m668k2990l2402O8762N4712N7848j3387j63573j63632j62865j69889
$$ plain form
20319 -178855 -167320 -151850 -20243 120692 421290 597546 399435 442346 444697 453293 519317
20308 519317 601760 666181 676527 559125 244989 -11652 -932 377875 797022 1144232
20298 1144232 1354564 1537389 1843461 1979962 2025210 1778345 1526334 1384906 1288311 1262712
20288 1262712 1121763 879113 995496 1311859 1346846 1424138 1657536 1868561 1839821 1618450
20278 1618450 1428341 1313705 1241688 1054811 1067147 1275798 1562271 1922169 2619240 3543481
20268 3543481 4265867 4808858 4901555 4441835 3705377 3013685 2488450 2049741 1745385 1564750
20258 1564750 1236762 1128878 1486169 2018529 2916514 3646089 3940952 3921655 3344140 2866529
20248 2866529 2473515 2146572 1775521 1519683 1377651 1163730 1171245 1170209 1122517 1069131
$$ packed form
20319a78855J1535J5470J31607J40935L00598J76256j98111M2911K351Q596O6024
20308E19317Q2443O4421J0346j17402l14136k56641J0720L78807M19147L47210
20298A144232K10332J82825L06072J36501M5248k46865k52011j41428r6595k5599
20288A262712j40949k42650J16383L16363L4987P7292K33398K11025k8740k21371
20278A618450j90109j14636p2017j86877J2336K08651K86473L59898O97071R24241
20268C543481P22386N42991R2697m59720p36458o91692n25235m38709l04356j80635
20258A564750l27988j07884L57291N32360Q97985P29575K94863j9297n77515m77611
20248B866529l93014l26943l71051k55838j42032k13921P515j036m7692n3386
$$ plain form
20238 1069131 1179972 1354022 1438614 1661383 1471172 1663523 2045119 2524259 3162180 3648815
20228 3648815 4121688 4543660 4907772 4997397 4582871 4062506 3698161 3531888 3598753 3801695
20218 3801695 3893377 3860825 4186063 4684918 5272394 5903756 6689770 7953638 8973207
20209 8973207 9516527 9337231 9325869 9495041 10131951 11354429 12666992 14714726 17448801
20200 17448801 21275658 26706003 34482824 46140281 65095183 97187700 149195571
20193 149195571 212442534 246345573 233452251 190912158 140453459 101338602 77229372
20186 77229372 64183027 57971481 56664253 60280212 69680421 87360269 119853694 176379407
20178 176379407 256498145 318282675 318091806 269907554 200557561 139065676 97165068
$$ packed form
20238A069131J10841J74050Q4592K22769j90211J92351L81596M79140O37921M86635
20228C648815M72873M21972L64112Q9625m14526n20365l64345j66273O6865K02942
20218C801695R1682l2552L25238M98855N87476O31362P86014J263868J019569
20209H973207N43320j79296j1362J69172O36910J222478J312563K047734K734075
20200A7448801L826857N430345P776821J1657457J8954902L2092517N2007871
20193A49195571O3246963L3903039j2893322m2540093n0458699l9114857k4109230
20186G7229372j3046345o211546j307228L615959R400209J7679848L2493425N6525713
20178A76379407Q0118738O1784530j90869m8184252o9349993o1491885m1900608
$$ plain form
20171 97165068 71058046 54226608 42766125 34729073 28580872 23961608 20612176 18220404
20163 18220404 16311440 14945964 13813074 13179910 12657715 11761883 10719761 9757916 8980121
20154 8980121 8603743 8324692 7745508 7160627 6610017 6112076 5903164 5886065 6038255 6426338
20144 6426338 6783865 6963148 6695681 5977441 5326038 5009296 4870833 4703445 4508211
20135 4508211 4140871 3878918 3716987 3467676 3311114 3201032 3054441 3104717 3169680 3496241
20125 3496241 4134392 4596182 4822602 5235012 5537341 5368523 5087068 4882738 4584831
20116 4584831 4375959 4265603 4215262 4434773 4544741 4763583 5266877 5794040 6073366 6385552
20106 6385552 6908676 7287681 7578284 7991944 8497332 9088360 9609889 10643593 12104911
$$ packed form
20171I7165068k6107022j6831438j1460483q037052o148201m619264l349432k391772
20163A8220404j908964j365476j132890o33164n22195q95832j042122r61845p77795
20154H980121l76378k79051n79184n84881n50610m97941k08912j7099J52190L88083
20144F426338L57527J79283k67467p18240o51403l16742j38463j67388j95234
20135D508211l67340k61953j61931k49311j56562j10082j46591N0276O4963L26561
20125C496241O38151M61790K26420M12410L02329j68818k81455k04330k97907
20116D584831k08872j10356n0341K19511J09968K18842N03294N27163K79326L12186
20106F385552N23124L79005K90603M13660N05388N91028N21529J033704J461318
$$ plain form
20097 12104911 13984806 16611422 20168117 24900576 31393025 41137207 56070077 79644692
20089 79644692 117223809 168609622 216999644 248844482 264959360 255012298 220374877
20082 220374877 175635319 132526380 100104879 79547377 68507500 64472473 66665403
20075 66665403 76048833 95948272 128322639 164524024 190130380 204675993 202722905
20068 202722905 179444278 145056714 109144610 79277004 58130519 44154696 34771477
20061 34771477 28298467 23786152 20293855 17520795 15387755 13723823 12589672 11834000
20053 11834000 11232455 10819506 10781926 10848854 10458891 9696083 8911933 7997404 7045921 6209988
20043 6209988 5601146 5256709 4994724 4798044 4678197 4822332 4996047 5314941 5527457
$$ packed form
20097A2104911J879895K626616L556695M732459O492449R744182J4932870K3574615
20089G9644692L7579117N1385813M8390022L1844838J6114878r947062l4637421
20082B20374877m4739558m3108939l2421501k0557502j1039877m035027K192930
20075F6665403R383430J9899439L2374367L6201385K5606356J4545613j953088
20068B02722905k3278627l4387564l5912104k9867606k1146485j3975823r383219
20061C4771477o473010m512315l492297k773060k133040j663932j134151p55672
20053A1834000o01545m12949l7580O6928l89963p62808p84150r14529r51483q35933
20043F209988o08842l44437k61985j96680j19847J44135J73715L18894K12516
$$ plain form
20034 5527457 5534189 5593430 5203441 4681095 4257504 3595483 3022412 2628163 2351448 2260455
20024 2260455 2026172 1966969 2073719 2092994 1980895 1777963 1764252 1749236 1826343 1701164
20014 1701164 1420157 1268294 1248135 1171487 1124426 1135866 1174331 1156162 998625 1028297 1057906
20003 1057906 990151 1121398 1071607 944490 934295 931587 926802 1204492 1352445 1251000 1114365
19992 1114365 1194375 1208835 1130696 1026795 1021098 1021230 974186 1033937 974217 849583 863512
19981 863512 923173 927333 953578 827460 811468 694200 667514 608057 647509 562019 500689
19970 500689 393850 514951 592019 707604 693016 674713 669073 635213 687892 791940 881911
19959 881911 772062 726494 714885 835590 628350 529270 586615 448301 441554 503505 526126
$$ packed form
20034E527457O732N9241l89989n22346m23591o62021n73071l94249k76715r0993
20024B260455k34283n9203J06750J9275j12099k02932j3711j5016P7107j25179
20014A701164k81007j51863k0159p6648m7061J1440L8465j8169j57537K9672K9609
20003A057906o7755J31247m9791j27117j0195k708m785K77690J47953j01445j36635
19992A114365Q0010J4460p8139j03901n697J32m7044N9751n9720j24634J3929
19981H63512N9661M160K6245j26118j5992j17268k6686n9457L9452q5490o1330
19970E00689j06839J21101P7068J15585j4588j8303n640l3860N2679J04048Q9971
19959H81911j09849m5568j1609J20705k07240r9080N7345j38314o747O1951K2621
$$ plain form
19948 526126 531012 449270 525274 682454 737460 608728 445267 447822 145220 2289 90035
19937 90035 33870 714 185467 447697 413144 374937 469120 436126 404893 421554 360514
19926 360514 259336 325495 473049 494116 527909 567250 524927 477767 473254 337169 217465
19915 217465 106834 102997 123994 130960 226906 146297 72506 68744 124600 291646 418401
19904 418401 286850 -57783 2162 243259 278936 209983 209234 229641 207224 108065 75573
19893 75573 218718 223506 178995 158508 332824 341712 250701 209567 56571 46173 137249
19882 137249 217225 355339 425761 299796 132569 34049 -90 19659 64480 32779 161911
19871 161911 348699 417152 380515 297670 205149 261390 217504 69784 114662 170977 296989
$$ packed form
19948E26126M886q1742P6004J57180N5006j28732j63461K555l02602j42931Q7746
19937I0035n6165l3156J84753K62230l4553l8207R4183l2994l1233J6661o1040
19926C60514j01178O6159J47554K1067L3793L9341m2323m7160m513j36085j19704
19915B17465j10631l837K0997O966R5946q0609p3791l762N5856J67046J26755
19904D18401j31551l44633N9945K41097L5677o8953p49K0407k2417r9159l2492
19893G5573J43145M788m4511k0487J74316Q888r1011m1134j52996j0398R1076
19882A37249P9976J38114P0422j25965j67227r8520l4139J9749M4821l1701J29132
19871A61911J86788O8453l6637q2845r2521N6241m3886j47720M4878N6315J26012
$$ plain form
19860 296989 379045 435453 434842 144592 -112942 -57889 171754 404519 437262 236493 150005
19849 150005 59437 156583 238193 359249 467122 354078 218956 -4031 -114356 -91379
19839 -91379 160366 382563 325138 134199 140960 92215 133573 101855 55784 38013 -5660
19828 -5660 165464 369579 360088 179319 118389 267737 441414 187317 125057 175159 26645
19817 26645 -79745 -167752 -108377 -75309 -285742 -418297 -288016 -124689 -180810 -258418 -239763
19806 -239763 -269906 -247973 -303850 -303969 -242733 -214636 -96161 -18782 -12895 -163151 -225208 -204760
19794 -204760 -218772 -279427 -349945 -320108 -173021 -223834 -177717 95447 137915 63745 79288
19783 79288 36407 -54547 -231366 -384853 -541475 -416017 -206523 -82114 -22565 -139460
$$ packed form
19860B96989Q2056N6408o11k90250k57534N5053K29643K32765L2743k00769q6488
19849A50005r0568R7146Q1610J21056J07873j13044j35122k22987j10325K2977
19839i1379K51745K22197n7425j90939O761m8745M1358l1718m6071j7771m3673
19828e660J71124K04115r491j80769o0930J49348J73677k54097o2260N0102j48514
19817B6645j06390q8007N9375L3068k10433j32555J30281J63327n6121p7608J8655
19806b39763l0143K1933n5877j19O1236K8097J18475P7379N887j50256o2057K0448
19794b04760j4012o0655p0518K9837J47087n0813M6117K73164M2468p4170J5543
19783G9288m2881r0954j76819j53487j56622J25458K09494J24409N9549j16895
$$ plain form
19773 -139460 -38281 -24536 -9893 120231 97717 -85297 -206206 -172629 25796 5229
19763 5229 76289 17324 145520 199935 137590 33669 -65209 96060 135908 33578 185
19752 185 -62253 -189853 -276082 -244233 43705 118822 119649 -7632 -165928 -31607 40679
19741 40679 69402 143933 152334 91192 -99027 -165803 -130712 -11993 69729 -45013 31104
19730 31104 117164 11811 -2174 51242 -112953 -197221 -248072 -284466 -247687 -38673 39889
19719 39889 96511 -19089 -6850 26804 -4552 -14167 -30343 -72391 -95822 -165076 -104126 -146027
19707 -146027 -75594 -108425 -299351 -278139 -146589 -53791 -177056 -240146 -188600 -160953 -164440
19696 -164440 -23137 -111915 -89310 -81318 -190102 -138692 -104036 -67154 67377 -6019 -104142
$$ packed form
19773a39460J01179J3745J4643J30124k2514j83014j20909L3577J98425k0567
19763E229P1060n8965J28196N4415o2345j03921r8878J61269L9848j02330l3393
19752A85o2438j27600q6229L1849K87938P5117Q27j27281j58296J34321P2286
19741D0679K8723P4531Q401o1142j90219o6776L5091J18719Q1722j14742P6117
19730C1104Q6060j05353j3985N3416j64195q4268n0851l6394L6779K09014P8562
19719C9889N6622j15600J2239L3654l1356r615j6176m2048k3431o9254O0950m1901
19707a46027P0433l2831j90926K1212J31550R2798j23265o3090N1546K7647l487
19696a64440J41303q8778K2605P992j08784N1410L4656L6882J34531p3396r8123
$$ plain form
19685 -104142 43267 -30960 -86990 37864 90501 221780 263711 245792 153031 -47575 -28894
19674 -28894 80779 44738 -673 -9257 -119772 -232162 -181568 31452 -13053 -9845 -15512
19663 -15512 -98213 -264661 -234745 9058 -131319 -271050 -288725 -89862 118104 177912
19653 177912 -132144 -206087 -114678 -95657 -131241 46383 53797 63074 78551 50987 183119
19642 183119 102670 -76915 -211755 -147238 -53639 -33189 -127937 -159487 -137480 -74358 -9206
19631 -9206 -165780 -224956 11746 -11484 -56735 125836 309202 465186 399987 348496 314725
19620 314725 444099 548322 366541 373855 265070 188424 215073 229478 417079 808181
19610 808181 1170331 1391854 1472026 1358451 1070502 830997 613919 478701 291246 255683
$$ packed form
19685a04142J47409p4227n6030J24854N2637J31279M1931j7919r2761k00606J8681
19674b8894J09673l6041m5411q584j10515j12390N0594K13020m4505L208n667
19663a5512q2701j66448K9916K43803j40377j39731j7675J98863K07966N9808
19653A77912l10056p3943R1409J9021l5584J77624P414R277J5477k7564J32132
19642A83119q0449j79585j34840O4517R3599K0450r4748l1550K2007O3122O5152
19631i206j56574n9176K36702k3230m5251J82571J83366J55984o5199n1491l3771
19620C14725J29374J04223j81781P314j08785p6646K6649J4405J87601L91102
19610H08181L62150K21523Q0172j13575k87949k39505k17078j35218j87455l5563
$$ plain form
19600 255683 455441 420452 465349 635398 796477 1135213 1435891 1555898 1485482 1200531
19590 1200531 1062082 901257 506820 97130 -180885 -224566 -84334 -18923 93762 283950
19580 283950 361120 426209 346771 170012 43303 39921 40432 55288 -25046 26842 -77928
19569 -77928 -144545 -237286 -24894 379732 364434 231555 151658 92382 -28885 -175640 -119095
19558 -119095 36883 60195 27936 -42643 -214628 -149580 -69143 -92703 -86197 99905 19473
19547 19473 118119 20831 -202584 -117162 -38711 -85055 -1775 -12011 -86970 -17362 36570
19536 36570 207735 373305 380509 297887 184780 85373 95836 150394 -2481 -159380 -122840
19525 -122840 28744 -3966 -31819 94633 34197 -164777 -274686 -199754 -185062 -154489 -51636
$$ packed form
19600B55683J99758l4989M4897J70049J61079L38736L00678J20007p0416k84951
19590A200531j38449j60825l94437m09690k78015m3681J40232O5411J12685J90188
19580B83950P7170O5089p9438j76759j26709l382N11J4856q0334N1888j04770
19569g7928o6617r2741K12392M04626j5298j32879p9897n9276j21267j46755N6545
19558a19095J55978K3312l2259p0579j71985O5048Q0437k3560O506J86102q0432
19547A9473R8646r7288k23415Q5422P8451m6344Q3280j0236p4959O9608N3932
19536C6570J71165J65570P204q2622j13107r9407J0463N4558j52875j56899L6540
19525a22840J51584l2710k7853J26452o0436j98974j09909P4932J4692L0573J02853
$$ plain form
19514 -51636 -105037 -95173 -107213 5755 73551 148910 118571 18100 631 55881 272781
19503 272781 520375 855517 1188750 1362282 1558958 1476097 1306277 1224012 953288 723927
19493 723927 395015 167867 279040 435635 542854 798792 933765 1149845 1161661 1173356
19483 1173356 1164551 848357 762031 594112 271326 213344 189926 309119 382530 409417 222327
19472 222327 9124 39728 -22699 -87483 10785 28496 58514 -149 -192051 -341830 -347171
19461 -347171 -88100 21668 30064 38633 250735 183663 -22516 -39710 -161893 -256208 -46055
19450 -46055 65448 129719 194667 173298 -10458 -187728 -197535 -74474 -215933 -323275 -275355
19439 -275355 -80877 -5628 142739 74356 9322 -24746 -200766 -273657 -165441 -50694
$$ packed form
19514e1636n3401R864j2040J12968O7796P5359l0339j00471j7469N5250K16900
19503B72781K47594L35142L33233J73532J96676q2861j69820q2265k70724k29361
19493G23927l28912k27148J11173J56595J07219K55938J34973K16080J1816J1695
19483A173356q805l16194q6326j67919l22786n7982k3418J19193P3411K6887j87090
19472B22327k13203L0604o2427o4784R8268J7711L0018n8663j91902j49779n341
19461c47171K59071J09768Q396Q569K12102o7072k06179j7194j22183r4315K10153
19450d6055J11503O4271O4948k1369j83756j77270r807J23061j41459j07342M7920
19439b75355J94478P5249J48367o8383o5034l4068j76020p2891J08216J14747
$$ plain form
19429 -50694 -86267 -24398 14596 143519 194409 147535 -47291 73212 117506 -69491 -164550
19418 -164550 -115086 -65060 -107321 -35601 140635 211537 134730 246163 153516 -82091 -69229
19407 -69229 84048 242070 182670 24639 -62537 83479 260117 163616 -79502 -195206
19397 -195206 -267175 -218490 -95877 -68297 -182481 -69734 4267 108462 25191 -122607
19387 -122607 -189598 -93012 -77302 -65452 -49499 -113648 -119001 50787 -32329 -194453 -137456
19376 -137456 -120293 -84405 -369819 -440902 -245122 -72482 -156350 -155902 -66017 -176649 -283044
19365 -283044 -171014 -85157 -20883 -115736 -183146 -361374 -275172 -195812 -186270 -310730 -386500
19354 -386500 -326634 -330287 -204683 -28023 22295 -70974 -151808 -91648 93837 31291 -73995
$$ packed form
19429e0694l5573O1869L8994J28923N0890m6874j94826J20503M4294j86997r5059
19418a64550M9464N0026m2261P1720J76236P0902p6807J11433r2647k35607J2862
19407f9229J53277J58022n9400j58031q7176J46016J76638r6501k43118j15704
19397a95206p1969M8685J22613K7580j14184J12747P4001J04195q3271j47798
19387a22607o6991R6586J5710J1850J5953o4149n353J69788q3116j62124N6997
19376a37456J7163L5888k85414p1083J95780J72640q3868M48Q9885j10632j06395
19365b83044J12030Q5857O4274r4853o7410j78228Q6202P9360R542j24460p5770
19354c86500N9866l653J25604J76660N0318r3269q0834O0160J85485o2546j05286
$$ plain form
19343 -73995 224978 283826 141279 36875 -227938 -321552 -132863 -87841 -248573 -346251
19333 -346251 -259262 -183050 -96283 -52475 -106045 -251292 -235023 -168494 -161552 -351592 -266431
19322 -266431 -215160 -129109 -186785 -113613 34225 73858 81007 -74196 -92652 55424 68614
19311 68614 42669 -53255 -233754 -278586 -306646 -140379 -37308 94650 -76804 -3694 -34858
19300 -34858 -77815 -87126 -58705 125988 154833 -73326 -54934 -59179 -247832 -324113 -170831
19289 -170831 -65715 -65955 -222513 -193795 -158592 -156272 -37067 63125 290541 198279 162940
19278 162940 207674 156253 166317 169284 -66338 -323753 -410087 -451848 -207904 -149240 -145022
19267 -145022 -20050 -1259 -19127 243147 289050 293371 228250 206302 285721 447965 736037
$$ packed form
19343g3995K98973N8848j42547j04404k64813r3614J88689M5022j60732r7678
19333c46251Q6989P6212Q6767M3808n3570j45247J6269O6529O942j90040Q5161
19322b66431N1271Q6051n7676P3172J47838L9633P149j55203j8456J48076J3190
19311F8614k5945r5924j80499m4832k8060J66267J03071J31958j71454P3110l1164
19300c4858m2957r311K8421J84693K8845k28159J8392m245j88653p6281J53282
19289a70831J05116k40j56558K8718L5203K320J19205J00192K27416r2262l5339
19278A62940M4734n1421J0064K967k35622k57415q6334m1761K43944N8664M218
19267a45022J24972J8791j7868K62274M5903M321o5121k1948P9419J62244K88072
$$ plain form
19256 736037 1254231 1709624 2010236 2019894 1792561 1370981 765507 406806 179165 91212
19246 91212 7246 -63361 519 -116112 -21985 -79517 -243996 -143690 -133638 -2421 188607
19235 188607 120779 100972 -58097 -47140 53300 5983 20167 133332 2709 -82526 -659
19224 -659 194251 296650 151843 -9975 -89224 -32431 12162 -107799 -117084 41020 -19035
19213 -19035 -2698 -213259 -313726 -165464 -177279 -169916 -46098 -98262 -31884 -16499 -69316
19202 -69316 -34970 -35255 -127514 -137859 -31749 -91563 -226264 -141838 -222475 -70893 48880
19191 48880 119334 128194 226951 278536 294797 167398 129523 -94950 -222090 -123575 -70260
19180 -70260 61652 35921 -97830 -36979 93660 59106 42510 37772 246371 139079 -105020
$$ packed form
19256G36037N18194M55393L00612R658k27333m21580o05474l58701k27641q7953
19246I1212q3966p0607O3880j16631R4127n7532j64479J00306J0052J31217J91028
19235A88607o7828j9807j59069J0957J00440m7317J4184J13165j30623q5235Q1867
19224f59J94910J02399j44807j61818p9249N6793M4593j19961r285J58104o0055
19213a9035J6337k10561j00467J48262j1815P363J23818n2164O6378J5385n2817
19202f9316L4346k85r2259j0345J06110n9814j34701Q4426q0637J51582J19773
19191D8880P0454Q860R8757N1585J6261j27399l7875k24473j27140R8515N3315
19180g0260J31912k5731j33751O0851J30639l4554j6596m738K08599j07292k44099
$$ plain form
19169 -105020 -208452 -319335 -198566 -224826 -208777 -285146 -381280 -179524 -8011 -38120
19159 -38120 -93099 16960 -90653 -145149 -247763 -227288 -99044 -45786 -139938 -142811 -136498
19148 -136498 -121800 66321 243597 185404 11555 -118661 -12828 -18489 -32635 -82009 -105969
19137 -105969 -185191 -285425 -73134 12040 -94785 -183471 -148770 4630 -42478 -20307 56154
19126 56154 -105372 -160137 -28329 141829 193583 25214 23993 59254 46140 37529 181379
19115 181379 310998 184853 63949 -17371 -26922 50808 -93924 -93156 -225262 -195657 -144601
19104 -144601 -126757 -47193 -290588 -475762 -474924 -428041 -151414 -24581 -72734 -95550 579
19093 579 -200841 -301167 -244384 -236906 -273385 -224903 -75771 -67921 -285336 -302273 -302158 -269915
$$ packed form
19169a05020j03432j10883J20769k6260J6049p6369r6134K01756J71513l0109
19159c8120n4979J10059j07613n4496j02614K0475J28244N3258r4152k873O313
19148a36498J4698J88121J77276n8193j73849j30216J05833n661j4146m9374k3960
19137a05969p9222j00234K12291Q5174j06825q8686L4701J53400m7108K2171P6461
19126E6154j61526n4765J31808J70158N1754j68369j221L5261j3114q611J43850
19115A81379J29619j26145j20904q1320r551P7730j44732P68j32106K9605N1056
19104a44601J7844P9564k43395j85174Q38M6883K76627J26833m8153k2816R6129
19093E79k01420j00326N6783P478l6479M8482J49132P850k17415j6937J15L2243
$$ plain form
19081 -269915 -197060 -190878 -319512 -222130 -150426 12374 -142366 -131270 -112656 -78388 -44778
19070 -44778 20081 -18113 5919 77700 -40932 -127804 -158138 -209986 -59560 154972 64480
19059 64480 -64959 -162176 -47493 -52637 -148855 -137374 -76899 36751 51554 -81185 -42049
19048 -42049 -31801 3285 -30830 -316674 -424277 -69690 273121 289956 173346 75228 105016
19037 105016 190401 353207 342778 46274 -220560 -226128 -298590 -170826 -8600 121369
19027 121369 -61602 -242182 -292726 -197798 -99614 -57361 -47195 -94208 -136621 -79498 -18802
19016 -18802 -215526 -165531 -147412 50681 32177 -73463 -365096 -223615 -16031 -18921 -46992
19005 -46992 -166954 -80863 25295 236824 272208 191668 217240 87083 -86643 -100129 -209935
$$ packed form
19081b69915P2855O182j28634R7382P1704J62800j54740J1096J8614L4268L3610
19070d4778O4859l8194K4032P1781j18632q6872l0334n1848J50426K14532r0492
19059F4480j29439r7217J14683n144r6218J1481O0475J13650J4803j32739L9136
19048d2049J0248L5086l4115k85844j07603L54587L42811J6835j16610r8118K9788
19037A05016Q5385J62806j0429k96504k66834n568p2462J27764J62226J29969
19027A21369j82971j80580n0544R4928R8184M2253J0166m7013m2413N7123O0696
19016a8802j96724M9995J8119J98093j8504j05640k91633J41481K07584k890k8071
19005d6992j19962Q6091J06158K11529L5384q0540K5572j30157j73726j3486j09806
$$ plain form
18994 -209935 -99384 -87424 -306397 -394177 -261802 -140098 -170661 23240 33496 -39386
18984 -39386 86156 190203 6556 -32248 -99281 -230146 -429109 -389379 -77941 197075
18974 197075 4611 -151830 -125075 -65777 -91031 39214 11430 -98996 53031 76181
18964 76181 99766 10864 -76473 -198493 -133826 -144762 59460 66936 -211325 -237173 -108742
18953 -108742 -225880 -271311 -188113 -132130 -19426 174839 210018 72953 -21168 -144843
18943 -144843 -253911 -250523 -265506 -277121 -272595 -186973 -184313 -193336 -85549 -134685 -395346 -407383
18931 -407383 -243373 -213038 -287908 -214196 -178725 -156629 -88362 -143726 -173933 -176150 -314149
18920 -314149 -174243 -210482 -171105 -163385 -183589 -288335 -281274 -186963 52209 142968 161261
$$ packed form
18994b09935J10551J1960k18973q7780J32375J21704l0563J93901J0256p2882
18984c9386J25542J04047j83647l8804o7033j30865j98963L9730L11438K75016
18974A97075j92464j56441K6755N9298k5254J30245k7784j10426J52027K3150
18964G6181K3585q8902q7337j22020O4667j0936K04222P476k78261k5848J28431
18953a08742j17138m5431Q3198N5983J12704J94265L5179j37065r4121j23675
18943a44843j09068L388j4983j1615M526Q5622K660r023J07787m9136k60661j2037
18931d07383J64010L0335p4870P3712L5471K2096O8267n5364l0207k217j37999
18920c14149J39906l6239L9377P720k0204j04746P061R4311K39172R0759J8293
$$ plain form
18909 161261 119135 36899 33452 -150413 -207491 -47328 -10204 -18490 31932 52962 199571
18898 199571 28960 -77864 68457 163625 243398 230886 168346 63619 -28639 -158171
18888 -158171 -177410 -107852 -78185 -120003 -97890 -44526 64538 14325 66322 -47622 -75264
18877 -75264 19210 68293 239152 218222 59213 -115914 -109535 139642 149935 30324 196017
18866 196017 131339 123961 -34224 -115036 -223980 -226164 -167591 -80793 -32648 17264 28233
18855 28233 98266 185143 82375 -26245 -25479 53094 122749 33381 -90918 -181288 -231624
18844 -231624 -153099 -86743 91626 -77866 -253181 -35053 176985 298372 227150 45341
18834 45341 -69716 -137672 68070 135034 -123110 -191841 -226339 -357740 -202574 -65940
$$ packed form
18909A61261m2126q2236l447j83865n7078J60163L7124q286N0422K1030J46609
18898A99571j70611j06824J46321R5168P9773j2512o2540j04727r2258j29532
18888a58171j9239O9558K9667m1818K2113N3364J09064n0213N1997j13944k7642
18877g5264R4474M9083J70859k0930j59009j75127O379K49177J0293j19611J65693
18866A96017o4678p378j58185q0812j08944k184N8573Q6798M8145M9912J0969
18855B8233P0033Q6877j02768j08620P66P8573O9655q9368j24299r0370n0336
18844b31624P8525O6356J78369j69492j75315K18128K12038J21387p1222j81809
18834D5341j15057o7956K05742O6964k58144o8731l4498j31401J55166J36634
$$ plain form
18824 -65940 -134960 -183691 -166751 -72572 -133239 -131463 -2450 68584 16683 46521 10554 -15954
18812 -15954 -103295 -148163 -222874 -80315 -24205 71750 150523 -10615 -218 66441 -28311
18801 -28311 -79794 -60613 -228582 -289103 -161186 69222 112904 -75760 -173503 -104802 -124217
18790 -124217 -273082 -484648 -557061 -406386 -191663 -307723 -321355 -368007 -448057 -388086
18780 -388086 -273559 -131715 -123812 -278185 -313124 -249791 -186862 -105630 35742 38456 -60031
18769 -60031 -34752 150273 119964 252821 829727 1419710 1572836 1285404 881133 435937
18759 435937 61847 31248 -20842 191977 238097 145008 217386 189351 44992 -47699 -88401
18748 -88401 -158012 -299752 -320215 -94062 177232 114448 212816 127956 92779 238731 200138
$$ packed form
18824f5940o9020m8731J6940R4179o0667J776J29013P1034n1901K9838l5967k6508
18812a5954q7341m4868p4711J42559N6110R5955P8773j61138J0397O6659r4752
18801b8311n1483J9181j67969o0521J27917K30408M3682j88664r7743O8701j9415
18790a24217j48865k11566p2413J50675K14723j16060j3632m6652q0050N9971
18780c88086J14527J41844P903j54373l4939O3333O2929Q1232J41372K714r8487
18769f0031K5279J85025l0309J32857N76906N89983J53126k87432m04271m45196
18759D35937l74090l0599n2090K12819M6120r3089P2378k8035j44359r2691m0702
18748h8401o9611j41740k0463K26153K71294o2784R8368q4860l5177J45952l8593
$$ plain form
18737 200138 134565 91845 -6327 -159658 -307181 -276950 -104390 -219458 -428848 -287251
18727 -287251 -75280 -74139 -115189 -38043 -73181 -30986 33458 215784 240273 194815 -84766
18716 -84766 -171491 -83766 -29730 23409 -39616 6568 -10911 80297 324825 333685 146357
18705 146357 245380 432636 447110 499445 258516 91349 206768 180403 66813 -23651
18695 -23651 -126933 -19207 -149759 -27815 108948 138308 -47584 -254288 -267766 -99987
18685 -99987 62924 64712 76654 -76768 -196703 -285500 -344675 -212716 -141341 -68698 17441
18674 17441 107674 86670 -6356 -173819 -242362 -197925 -183266 -371023 -453085 -383561 -397019
18663 -397019 -301372 -68623 162781 152252 28106 2108 53667 -88156 23861 65054
$$ packed form
18737B00138o5573m2720r8172j53331j47523L0231J72560j15068k09390J41597
18727b87251K11971J141m1050P7146l5138M2195O4444J82326K4489m5458k79581
18716h4766q6725Q7725N4036N3139o3025M6184j7479R1208K44528Q860j87328
18705A46357R9023J87256J4474N2335k40929j67167J15419k6365j13590r0464
18695b3651j03282J07726j30552J21944J36763K9360j85892k06704j3478J67779
18685i9987J62911J788J1942j53422j19935q8797n9175J31959P1375P2643Q6139
18674A7441R0233k1004r3026j67463o8543M4437J4659j87757q2062O9524j3458
18663c97019R5647K32749K31404j0529j24146k5998N1559j41823J12017M1193
$$ plain form
18653 65054 28883 -27458 -74058 12174 97621 132935 182025 -21935 -148222 -174582 -182268
18642 -182268 -148804 29840 220321 268545 141642 139863 88537 -108040 -189157 -38645 61147
18631 61147 5276 -37837 -25299 -12783 163820 221490 203673 93414 133360 315523 293464
18620 293464 196903 99823 49501 14547 -90012 97768 308288 452497 513640 458054 300652
18609 300652 199683 164154 -6998 -43280 95790 84183 42694 -19353 66596 69303 -74748
18598 -74748 69796 147771 56702 -141599 -164747 -168215 -98626 -28572 19009 10837 -158692
18587 -158692 -101757 -45704 28678 79556 -16796 -138618 -87446 -91164 53341 102085 20892
18576 20892 614 -8910 5866 -91697 -53367 -25635 70257 32043 -3399 147422 169124 57620
$$ packed form
18653F5054l6171n6341m6600Q6232Q5447L5314M9090k03960j26287k6360p686
18642a82268L3464J78644J90481M8224j26903j779n1326j96577q1117J50512R9792
18631F1147n5871m3113J2538J2516J76603N7670j7817j10259L9946J82163k2059
18620B93464r6561r7080n0322l4954j04559J87780K10520J44209O1143n5586j57402
18609C00652j00969l5529j71152l6282J39070j1607m1489o2047Q5949K707j44051
18598g4748J44544P7975r1069j98301k3148l468O9589P0054M7581q172j69529
18587a58692N6935N6053P4382N0878r6352j21822N1172l718J44505M8744q1193
18576B0892k0278r524J4776r7563L8330K7732R5892l8214l5442J50821K1702j11504
$$ plain form
18564 57620 287049 222390 30687 -37473 -27669 -25032 -98155 -57537 -85164 46199 31116
18553 31116 -98931 -54403 95880 67209 -10969 16417 6134 47544 155396 243152 220651
18542 220651 61332 -171980 -152530 -57898 -127717 20518 80153 119829 114594 169914 29156
18531 29156 -92729 18696 -5442 -28437 112463 118967 160462 14725 -170677 -185660 -58120
18520 -58120 179346 253299 237114 104953 5932 -116642 -102406 9207 -5731 -50635 -80969
18509 -80969 -253435 -261596 -240990 -11661 82997 -46770 -7976 9330 16002 89782 117718
18498 117718 213290 299250 317362 225993 36550 -78817 110217 295720 331171 333426 149854
18487 149854 94690 106744 59656 25957 212708 229619 27666 -16164 52889 32298 23775
$$ packed form
18564E7620K29429o4659j91703o8160R804K637p3123M0618k7627J31363j5083
18553C1116j30047M4528J50283k8671p8178K7386j0283M1410J07852Q7756k2501
18542B20651j59319k33312J9450R4632o9819J48235N9635L9676n235N5320j40758
18531B9156j21885J11425k4138k2995J40900O504M1495j45737j85402j4983J27540
18520e8120K37466P3953j6185j32161r9021j22574J4236J11613j4938m4904l0334
18509h0969j72466q161K0606K29329R4658j29767L8794J7306O672P3780K7936
18498A17718R5572Q5960J8112r1369j89443j15367J89034J85503L5451K255j83572
18487A49854n5164J2054m7088l3699J86751J6911k01953m3830O9053k0591q523
$$ plain form
18476 23775 -14984 -181597 -273757 -161259 -22651 55178 17214 -94539 -125171 -89770 -274790
18465 -274790 -284194 -94419 -151533 -281421 -418597 -508516 -309238 -109038 83900 162394
18455 162394 141497 27677 -71673 -144075 -183870 -197156 -339006 -217968 -109978 53534
18445 53534 142655 231910 82633 -94059 -81104 -184212 -251671 -161516 -133802 -17732 124503
18434 124503 108631 3093 -124745 -234435 -67991 92386 46003 41066 578 -11681 66594
18423 66594 120759 16004 -67527 -74855 -67552 33263 134480 113781 78563 -68558 -106639
18412 -106639 -87551 -64938 -190134 -126897 -248209 -378879 -308377 -142151 -13888 -18778 40755
18401 40755 32213 51077 -41051 -58938 -145393 -178002 -126396 -69292 30466 102611 182998 221150
$$ packed form
18476B3775l8759j66613r2160J12498J38608P7829l7964j11753l0632L5401j85020
18465b74790r404J89775n7114j29888j37176q9919J99278K00200J92938P8494
18455A62394k0897j13820r9350p2402l9795j3286j41850J21038J07990J63512
18445E3534Q9121Q9255j49277j76692J2955j03108o7459R0155K7714J16070J42235
18434A24503j5872j05538j27838j09690J66444J60377m6383m937m0488j2259P8275
18423F6594N4165j04755q3531p328P303J00815J01217k0699l5218j47121l8081
18412a06639J9088K2613j25196O3237j21312j30670P0502J66226J28263m890N9533
18401D0755q542J8864r2128j7887q6455l2609N1606N7104R9758P2145Q0387L8152
$$ plain form
18389 221150 234554 306146 225247 145227 125819 110540 31591 59334 182075 125830 24978
18378 24978 -33673 62378 251789 262799 369841 183679 158443 121977 49036 -89865 -154463
18367 -154463 3938 71120 29403 -64008 -209550 -109819 -47923 70750 192203 342504
18357 342504 317636 303796 257657 211647 155480 237988 302759 338983 239656 183075 -27122
18346 -27122 -153038 1942 -11421 -81444 -38016 -161850 -86032 38494 79771 84559 -39355
18335 -39355 -162471 -29569 -25453 -102081 -92335 -211447 156434 409439 327215 197310 -142056
18324 -142056 -312974 -306567 -386269 -313301 -150306 31219 130492 77307 80628 40747 -6283
18313 -6283 -66123 -144882 -198787 -189488 -6448 82817 125637 36885 -15410 28354 159308 161422
$$ packed form
18389B21150J3404P1592q0899q0020j9408j5279p8949K7743J22741n6245j00852
18378B4978n8651R6051J89411J1010J07042j86162k5236l6466p2941j38901o4598
18367a54463J58401O7182m1717r3411j45542R9731O1896J18673J21453J50301
18357C42504k4868j3840m6139m6010n6167Q2508O4771L6224r9327n6581k10197
18346b7122j25916J54980j3363p0023M3428j23834P5818J24526M1277M788j23914
18335c9355j23116J32902M116p6628R746j19112L67881K53005q2224j29905l39366
18324a42056j70918O407p9702P2968J62995J81525R9273n3185L321l9881m7030
18313f283n9840p8759n3905R299J83040Q9265M2820q8752n2295M3764J30954K114
$$ plain form
18301 161422 54434 -34376 -44899 -67558 -109243 -21707 856 -11251 -177128 -271948 -239055
18290 -239055 -31756 -53892 -249673 -130637 -70599 -86672 -28549 111471 161040 112436 -11996
18279 -11996 -129237 -181104 -171636 -293527 -294907 -263276 -202276 -86343 38707 228 123212
18268 123212 231026 111484 -79224 -51058 2354 -16310 -207347 -220130 30182 138666
18258 138666 47936 -98817 17757 30075 14647 -83885 -56981 -157262 -322209 -274910 -18939
18247 -18939 -134684 -219651 -190123 -96737 40563 87407 151941 50700 -73903 -117547 -2749
18236 -2749 41667 -24053 -132337 -457458 -811243 -924470 -714055 -101144 262165 503233
18226 503233 426530 225442 91767 141259 114472 286264 374556 417015 384250 197741 171990
$$ packed form
18301A61422j06988q8810j0523k2659m1685Q7536K2563j2107j65877r4820L2893
18290b39055K07299k2136j95781J19036O0038j6073N8123J40020M9569m8604j24432
18279a1996j17241n1867R468j21891j380L1631O1000J15933J25050l8479J22984
18268A23212J07814j19542j90708K8166N3412j8664j91037j2783K50312J08484
18258A38666r0730j46753J16574J2318j5428r8532K6904j00281j64947M7299K55971
18247a8939j15745q4967K9528R3386J37300M6844O4534j01241j24603m3644J14798
18236b749M4416o5720j08284l25121l53785j13227K10415O12911L63309K41068
18226E03233p6703k01088j33675M9492k6787J71792Q8292M2459l2765j86509k5751
$$ plain form
18215 171990 38489 41904 216805 405090 462867 198030 246200 266125 211513 128307 -84855
18204 -84855 12063 25981 69532 214942 209750 -121959 -240266 -99174 154633 298919 299632
18193 299632 279089 143086 136714 210871 -55655 -181214 -54990 61965 102922 162600 140721
18182 140721 126331 289854 223091 76350 125517 217186 349506 323301 294606 183387 102987
18171 102987 15585 295131 360684 397644 456361 140561 -24133 184529 310426 128299
18161 128299 64120 86866 166547 52284 81972 175392 126078 -61838 -205815 -248302 -70491
18150 -70491 49750 122930 84658 194097 584754 890471 1009600 919346 637140 439276
18140 439276 234413 242102 342459 391448 487803 458254 589660 913270 1243632 1374377
$$ packed form
18215A71990j33501L415J74901J88285N7777k64837M8170J9925n4612q3206k13162
18204h4855R6918J3918M3551J45410n192l31709j18307J41092K53807J44286P13
18193B99632k0543j36003o372P4157k66526j25559J26224J16955M0957N9678k1879
18182A40721j4390J63523o6763j46741M9167R1669J32320k6205k8695j11219q0400
18171A02987q7402K79546O5553L6960N8717l15800j64694K08662J25897j82127
18161A28299o4179K2746P9681j14263K9688R3420m9314j87916j43977m2487J77811
18150g0491J20241P3180l8272J09439L90657L05717J19129r0254k82206j97864
18140D39276k04863P689J00357M8989R6355k9549J31406L23610L30362J30745
$$ plain form
18130 1374377 1428828 1585708 1726505 1881028 1977774 2013834 2065262 2451106 2749100 3122012
18120 3122012 3588620 4180032 5014680 5988500 7263251 9001748 11163829 14106478 18299519
18111 18299519 24909644 35673680 54782187 92424939 168611061 280211757 328674568
18104 328674568 293844969 218423410 137027457 83173169 54166347 38220184 28455644
18097 28455644 21894164 17371666 14414592 12270862 10692939 9505445 8463472 7637804
18089 7637804 6943046 6264591 5652365 5092402 4594604 4288128 3891983 3466114 3345432
18080 3345432 3050765 2622235 2247822 2149367 2292110 2418309 2261572 2169079 2079715 1893457
18070 1893457 1726263 1688432 1567487 1315109 1124968 972544 1054293 909875 628861 447736
$$ packed form
18130A374377N4451J56880J40797J54523R6746L6060N1428L85844K97994L72912
18120C122012M66608N91412Q34648R73820J274751J738497K162081K942649M193041
18111A8299519O610125J0764036J9108507L7642752P6186122J11600696M8462811
18104C28674568l4829599p5421559q1395953n3854288k9006822j5946163r764540
18097B8455644o561480m522498k957074k143730j577923j187494j041973q25668
18089G637804o94758o78455o12226n59963m97798l06476l96145m25869j20682
18080C345432k94667m28530l74413r8455J42743J26199j56737r2493q9364j86258
18070A893457j67194l7831j20945k52378j90141j52424Q1749j44418k81014j81125
$$ plain form
18060 447736 408988 459555 453485 358411 322541 446413 510334 373170 334028 349810 287909
18049 287909 284431 201032 299017 467196 481357 444123 358688 134041 -104156 -25048 153127
18038 153127 248869 240887 247865 210381 251751 264846 301146 179019 18445 170648 202511
18027 202511 356882 423032 289336 186312 153388 97853 -33978 -140870 -196527 -130249
18017 -130249 -106748 -176319 7751 187368 274048 286604 228076 326565 258093 251244 261498
18006 261498 293897 161548 -38161 32040 240843 203880 42043 -3195 13993 147986
17996 147986 369570 443508 377390 393121 640704 1021659 1506406 2466846 3626804 4711417
17986 4711417 5672013 6307326 6262370 5607107 4441115 3238143 2275145 1987007 1633746
$$ packed form
18060D47736l8748N0567o070r5074l5870J23872O3921j37164l9142J5782o1901
18049B87909l478q3399R7985J68179J4161l7234q5435k24647k38197P9108J78175
18038A53127R5742p982O978l7484M1370J3095L6300j22127j60574J52203L1863
18027B02511J54371O6150j33696j03024l2924n5535j31831j06892n5657O6278
18017a30249K3501o9571J84070J79617Q6680J2556n8528R8489o8472o849J0254
18006B61498L2399j32349j99709P0201K08803l6963j61837m5238J7188J33993
17996A47986K21584P3938o6118J5731K47583L80955M84747R60440J159958J084613
17986D711417R60596O35313m4956o55263j165992j202972r62998k88138l53261
$$ plain form
17977 1633746 1225397 912338 583901 356015 382785 582827 507756 336669 288142 225168
17967 225168 246273 355079 477927 409448 285806 352662 425886 359494 329468 294069 203894
17956 203894 233028 304143 229647 241884 344579 411659 443649 389857 241646 179109 130586
17945 130586 67263 270282 199598 79265 36833 -57153 -86693 -137934 -29314 166439 142156
17934 142156 29152 83814 290050 49011 -242387 -222491 -199616 11513 -17439 -277450
17924 -277450 -298008 -163259 8788 186780 30936 -208149 -286209 -326412 -304719 -85215
17914 -85215 61697 144175 53495 -61942 -29506 52974 148809 142019 213793 345163 364168
17903 364168 465910 382630 150717 -3193 -14357 -17079 -78861 -94271 -263812 -200329 19378
$$ packed form
17977A633746m08349l13059l28437k27886K6770K00042p5071j71087m8527o2974
17967B25168K1105J08806J22848o8479j23642O6856P3224o6392l0026l5399r0175
17956B03894K9134P1115p4496J2237J02695O7080L1990n3792j48211o2537m8523
17945A30586o3323K03019p0684j20333m2432r3986k9540n1241J08620J95753k4283
17934A42156j13004N4662K06236k41039k91398J9896K2875K11129k8952k60011
17924b77450k0558J34749J72047J77992j55844k39085p8060m0203K1693K19504
17914h5215J46912Q2478r0680j15437L2436Q2480R5835o790P1774J31370J9005
17903C64168J01742q3280k31913j53910j1164k722o1782j5410j69541O3483K19707
$$ plain form
17892 19378 -49576 -152677 24874 75589 8495 2479 31915 26242 -203799 -305963 -361190
17881 -361190 -92845 -71643 -18448 26895 55986 -48206 -158140 -152424 -40706 -91396 -255413
17870 -255413 -189685 -175245 -207577 -125809 -100014 22049 65947 151366 124415 93968 22260
17859 22260 -150409 -195096 -317133 -453186 -407677 -377393 -282280 -211269 -113361 -141650 -169922
17848 -169922 -219158 -268032 -360161 -443752 -192599 -54528 -39062 -118976 -128872 -236071 -259988
17837 -259988 -392646 -569684 -449275 -313910 -306951 -226643 36919 107289 -46096 -72159
17827 -72159 -77338 -357694 -466597 -260610 -18740 187560 128305 39206 36624 353974 394840
17816 394840 258878 181132 185794 71293 -112695 -25915 -24702 233324 271396 239134 163497
$$ packed form
17892A9378o8954j03101J77551N0715o7094o016K9436n673k30041j02164n5227
17881c61190K68345K1202N3195M5343K9091j04192j09934N716J11718n0690j64017
17870b55413O5728J4440l2332Q1768K5795J22063M3898Q5419k6951l0447p1708
17859B2260j72669m4687j22037j36053M5509L0284R5113P1011R7908k8289k8272
17848a69922m9236m8874r2129q3591K51153J38071J5466p9914r896j07199k3917
17837b59988j32658j77038J20409J35365O959Q0308K63562P0370j53385k6063
17827g2159n179k80356j08903K05987K41870K06300n9255q9099k582L17350M0866
17816C94840j35962p7746M662j14501j83988Q6780J213K58026L8072l2262p5637
$$ plain form
17805 163497 135060 273146 342399 409862 254543 141981 111521 62291 218981 280466 124144
17794 124144 60821 -166713 -396283 -264786 -248587 -135796 -7978 21243 189805 348824
17784 348824 344258 282894 362506 297309 218589 113920 125558 103676 108690 77748 7254 -24207
17772 -24207 150729 125503 149686 104494 16944 -67329 -11451 -11864 81261 82766 9668 10061
17760 10061 21520 120389 224003 39782 -99439 -122511 -135665 -71854 -231747 -229038 33067
17749 33067 69248 202771 136732 -47210 -248360 -418958 -277785 -32683 76507 24609
17739 24609 -113603 -292835 -268369 -93979 -81265 -107533 -264856 -247601 -209208 -100837 45675
17728 45675 5650 87183 88295 47232 41786 -50977 -110514 -97698 -229929 -185791 -115515 -23125
$$ packed form
17805A63497k8437J38086O9253O7463j55319j12562l0460m9230J56690O1485j56322
17794A24144o3323k27534k29570J31497J6199J12791J27818K9221J68562J59019
17784C48824m566o1364P9612o5197p8720j04669J1638k1882N014l0942p0494l1461
17772b4207J74936k5226K4183m5192q7550q4273N5878m13R3125J505p3098L93
17760A0061J1459R8869J03614j84221j39221k3072j3154O3811j59893K709K62105
17749C3067L6181J33523o6039j83942k01150j70598J41173K45102J09190n1898
17739B4609j38212j79232K4466J74390J2714k6268j57323J7255L8393J08371J46512
17728D5675m0025Q1533J112m1063n446r2763n9537J2816j32231M4138P0276R2390
$$ plain form
17716 -23125 -41351 -128173 37795 -67258 -263727 -180073 -32105 2807 4037 20676 122973
17705 122973 -55058 -188466 -103580 -33302 -240737 -142478 -86235 -106969 -129494 -41944 -191380
17694 -191380 -217208 -177805 -127421 -118023 50114 88763 95330 -51912 -32081 40083 205479
17683 205479 269018 333489 447220 441994 516922 817399 1293938 1719013 2076190 2576487
17673 2576487 2785837 2448909 1829647 1310889 1056111 999447 827639 516254 224680 1193
17663 1193 -106233 8166 174039 190537 224594 193987 123786 266857 394160 399682 336893
17652 336893 48262 42458 -36166 -152114 -300056 -338571 -359507 -352897 -291696 -272513 -251871
17641 -251871 -221374 -42605 15071 -77832 -66886 4856 16145 -21506 -91846 -171635 -63570
$$ packed form
17716b3125j8226q6822J65968j05053j96469Q3654J47968L4912J230J6639J02297
17705A22973j78031j33408Q4886P0278k07435R8259N6243k0734k2525Q7550j49436
17694a91380k5828L9403N0384R398J68137L8649O567j47242J9831P2164J65396
17683B05479O3539O4471J13731n226P4928L00477M76539M25075L57177N00297
17673B576487K09350l36928o19262n18758k54778n6664j71808l11385k91574k23487
17663A193j07426J14399J65873J6498L4057l0607p0201J43071J27303N522o2789
17652C36893k88631n804p8624j15948j47942l8515k0936O610O1201J9183K0642
17641b51871L0497J78769N7676r2903J0946P1742J1289l7651p0340p9789J08065
$$ plain form
17630 -63570 -14142 -3500 45102 159218 123164 64071 40149 11489 16373 79814 103946 35720
17618 35720 -47315 -273327 -323334 -335814 -183467 22116 -220060 -349563 -268187 -366841 -463416
17607 -463416 -303839 -299251 -181982 100795 139732 111106 171652 17005 36267 -31842 -134999
17596 -134999 -74883 17103 86676 181315 299892 107266 52324 153576 39111 -99565
17586 -99565 -262942 -143349 -117104 -66654 49531 13787 109713 107248 -125732 -134864 50785
17575 50785 155981 76663 -70746 -36685 40759 -45329 40182 159871 214971 182763 78028
17564 78028 138591 165323 50908 -58097 -36502 140 -5895 163649 -21180 -151882 -3521
17553 -3521 -46698 -147125 -375041 -638221 -665153 -462332 -321009 -353505 -299835 -211804 -95570
$$ packed form
17630f3570M9428J0642M8602J14116l6054n9093k3922k8660M884O3441K4132o8226
17618C5720q3035k26012n0007j2480J52347K05583k42176j29503Q1376r8654r6575
17607d63416J59577M588J17269K82777L8937k8626O0546j54647J9262o8109j03157
17596a34999O0116R1986O9573R4639J18577j92626n4942J01252j14465j38676
17586i9565j63377J19593K6245N0450J16185l5744R5926k465k32980r132J85649
17575E0785J05196p9318j47409L4061P7444q6088Q5511J19689N5100l2208j04735
17564G8028O0563K6732j14415j09005K1595L6642o035J69544j84829j30702J48361
17553c521m3177j00427k27916k63180k6932K02821J41323l2496N3670Q8031J16234
$$ plain form
17542 -95570 -37659 34951 138711 83560 32649 8431 38595 -12556 -118153 -234569 -116146
17531 -116146 144286 256169 181374 47065 -55776 -42109 -178159 -377926 -320576 -89016
17521 -89016 33520 203074 280986 167174 137000 9270 -154199 -250698 -209032 -302877 -258722
17510 -258722 -191457 53670 65120 -109651 -378597 -279890 -158313 -141059 -102877 -97833 -17435
17499 -17435 195864 95440 93763 -75634 -142152 -85139 -199654 -106754 -124905 -135505 -250889
17488 -250889 -150205 -130675 -31029 17806 -91338 -48465 -76014 -76430 -184085 -312343 -385215
17477 -385215 -236501 -2026 58091 85195 -32678 -66252 -142494 -163914 -151644 -132888 -28313
17466 -28313 104224 44364 -132666 -173032 -154167 -84537 27859 28074 49392 21631 -58620
$$ packed form
17542i5570N7911P2610J03760n5151n0911k4218L0164n1151j05597j16416J18423
17531a16146K60432J11883p4795j34309j02841J3667j36050j99767N7350K31560
17521h9016J22536J69554P7912j13812l0174j27730j63469r6499M1666r3845M4155
17510b58722O7265K45127J1450j74771k68946R8707J21577J7254L8182N044Q0398
17499a7435K13299j00424j677j69397o6518N7013j14515R2900j8151j0600j15384
17488b50889J00684J9530R9646M8835j09144M2873k7549m16j07655j28258p2872
17477c85215J48714K34475O0117K7104j17873l3574p6242k1420J2270J8756J04575
17466b8313J32537n9860j77030m0366J8865O9630J12396K15K1318k7761q0251
$$ plain form
17455 -58620 -135452 -150852 -137254 981 98851 154134 132681 43895 113928 249828 180304
17444 180304 206923 282615 500054 765694 1339170 1852529 1921113 1496493 1089090 955529
17434 955529 725680 372208 86662 179404 242297 304302 440263 457599 143575 29276
17424 29276 -81495 84386 136563 293997 241130 110251 -21883 -184977 -176969 -5220
17414 -5220 -28218 -50095 -113894 24227 132504 -6010 -182385 -247669 -54403 113694 45220
17403 45220 -57664 -35349 -53737 11269 55209 161280 181121 180115 217889 160874 -7073
17392 -7073 -15097 -47256 -107318 -90644 -84419 -2996 59835 118498 -15418 -150453 -170570 -238067
17380 -238067 -169845 -147958 4314 84880 24715 42078 115707 67097 -93402 -2666 -26976
$$ packed form
17455e8620p6832j5400J3598J38235R7870N5283k1453q8786P0033J35900o9524
17444A80304K6619P5692K17439K65640N73476N13359O8584m24620m07403j33561
17434I55529k29849l53472k85546R2742O2893O2005J35961J7336l14024j14299
17424B9276j10771J65881N2177J57434n2867j30879j32134j63094Q008J71749
17414e220k2998k1877o3799J38121J08277j38514j76375o5284J93266J68097o8474
17403D5220j02884K2315j8388O5006M3940J06071J9841j006L7774n7015j67947
17392g073q024l2159o0062J6674O225Q1423O2831N8663j33916j35035k0117o7497
17380b38067O8222K1887J52272Q0566o0165J7363P3629m8610j60499R0736k4310
$$ plain form
17369 -26976 -144812 -133242 -4132 -36557 -103113 -231765 -283152 -191227 -313226 -265237 -330256
17358 -330256 -287633 -121949 -112251 -92419 220499 446376 347844 159020 168695 110843 47179
17347 47179 -10338 -38511 -50644 89967 107258 -61962 -180325 -154102 -140810 -180917 -142457
17336 -142457 -193055 -42496 142756 84399 -43119 105126 179020 34239 13634 62428
17326 62428 114060 194317 174724 233074 136618 23230 37609 31053 -103627 -135357 -4765
17315 -4765 32632 65067 191882 39942 45998 45234 127328 124354 169585 81292 -9047 -14334
17303 -14334 41116 14572 -149411 -73256 18625 12377 85694 130288 247670 158543 93802
17292 93802 111630 105709 170368 93800 64742 -44156 -1535 -105740 45692 -26160 -107537
$$ packed form
17369b6976j17836J1570J29110l2425o6556j28652n1387R1925j21999M7989o5019
17358c30256M2623J65684R698J9832L12918K25877r8532j88824R675n7852o3664
17347D7179n7517k8173j2133J40611J7291j69220j18363K6223J3292m0107L8460
17336a42457n0598J50559J85252n8357j27518J48245P3894j44781k0605M8794
17326F2428N1632Q0257j9593N8350r6456j13388J4379o556j34680l1730J30592
17315d765L7397L2435J26815j51940O056p64Q2094k974M5231q8293r0339n287
17303a4334N5450k6544j63983P6155R1881o248P3317M4594J17382q9127o4741
17292I3802J7828n921O4659p6568k9058j08898M2621j04205J51432p1852q1377
$$ plain form
17281 -107537 -153217 -27730 75845 44281 -147794 -141995 -98086 -108356 -190831 -509 -37843
17270 -37843 -85973 110484 122826 47926 -101901 -111044 -137962 -347947 -449659 -309672 -51679
17259 -51679 -83690 -97163 -128232 -367001 -469074 -626894 -554755 -403064 -435278 -318209 -213755
17248 -213755 -238217 -129276 -18099 -6907 -81445 103944 139875 55001 -96505 -150696 -66333
17237 -66333 -45478 11763 -91648 -146980 -77081 98128 102583 -26518 -132423 -117380 -199883
17226 -199883 -296267 -363511 -475550 -524952 -245100 -38305 80759 293799 287711 336598 238618
17215 238618 150634 44339 17284 125951 206489 296830 306414 230438 342605 237162 219949
17204 219949 68001 160372 147990 -12852 37660 135258 78865 205920 185241 105156 105643
$$ packed form
17281a07537m5680J25487J03575l1564j92075N799M3909j0270q2475J90322l7334
17270c7843m8130J96457J2342p4900j49827r143k6918k09985j01712J39987K57993
17259e1679l2011j3473l1069k38769j02073j57820P2139J51691l2214J17069J04454
17248b13755k4462J08941J11177J1192p4538J85389L5931q4874j51506n4191Q4363
17237f6333K0855N7241j03411n5332O9899J75209M455j29101j05905J5043q2503
17226a99883r6384o7244j12039m9402K79852K06795J19064K13040o088M8887r7980
17215B38618q7984j06295k7055J08667Q0538R0341R584p5976J12167j05443j7213
17204B19949j51948R2371j2382j60842N0512R7598n6393J27055k0679q0085M87
$$ plain form
17193 105643 91576 142819 245429 429775 486584 572568 467673 418932 607704 524083 297684
17182 297684 292253 342972 251199 299339 353091 184459 86063 28971 32354 48425 21888 230435
17170 230435 292335 179158 214420 293036 226921 123947 92193 258192 261816 314258 281170
17159 281170 186847 90370 270904 443782 307725 350139 426831 433183 409104 287151 375449
17148 375449 537717 507892 468355 518261 383281 468739 671569 824745 877494 843496 909296
17137 909296 1266386 1374092 1238281 1197544 1413351 1437041 1485252 1629707 2047429 2817637
17127 2817637 3702834 4426829 5236539 5815562 6247688 6622352 6823387 7075364 7035548 7023435
17117 7023435 6937681 6995174 7127787 7680895 8325411 9300797 10854264 12910992 15686642
$$ packed form
17193A05643j4067N1243J02610J84346N6809Q5984j04895m8741J88772q3621k26399
17182B97684n431N0719r1773M8140N3752j68632r8396n7092L383J6071k6537K08547
17170B30435O1900j13177L5262P8616o6115j02974l1754J65999L624N2442l3088
17159B81170r4323r6477J80534J72878j36057M2414P6692O352k4079j21953Q8298
17148C75449J62268k9825l9537M9906j34980Q5458K02830J53176N2749l3998O5800
17137I09296L57090J07706j35811m0737K15807K3690M8211J44455M17722P70208
17127B817637Q85197P23995Q09710N79023M32126L74664K01035K51977l9816j2113
17117G023435q5754N7493J32613N53108O44516R75386J553467K056728K775650
$$ plain form
17108 15686642 19463864 24266880 31335036 41671436 57594900 83163529 125371389
17101 125371389 194182080 291851427 388346204 453094544 486092930 468933413 401238582
17094 401238582 311180245 222026036 152760247 106708164 77467053 58440036 45665195
17087 45665195 36712315 30106774 25098517 21396161 18568923 16604185 14975134 13712346
17079 13712346 12630601 11989102 11560364 11298391 11120519 10688426 10110001 9550008 8980956
17070 8980956 8494320 8154366 7649879 7021616 6211828 5462776 4860969 4240853 3552031
17061 3552031 3086157 2745715 2461050 2148967 1871796 1625618 1532176 1470080 1549500 1566710
17051 1566710 1543885 1404927 1520917 1462528 1267446 1206966 1163510 1046682 903631 910685
$$ packed form
17108A5686642L777222M803016P068156J0336400J5923464K5568629M2207860
17101A25371389O8810691R7669347R6494777O4748340L2998386j7159517o7694831
17094D01238582r0058337q9154209o9265789m6052083k9241111j9027017j2774841
17087D5665195q952880o605541n008257l702356k827238j964738j629051j262788
17079A3712346j081745o41499m28738k61973j77872m32093n78425n59993n69052
17070H980956m86636l39954n04487o28263q09788p49052o01807o20116o88822
17061C552031m65874l40442k84665l12083k77171k46178r3442o2096P9420J7210
17051A566710k2825j38958J15990n8389j95082o0480m3456j16828j43051P054
$$ plain form
17041 910685 991033 1088408 842525 644232 578313 407835 432346 507468 402282 425857 538560
17030 538560 435949 296825 403969 276783 292303 305038 400981 448445 416572 366595 146457
17019 146457 140066 120524 81395 -42566 -148260 -74628 -93231 -78606 257723 383017 328309
17008 328309 260286 298831 401395 476960 216670 131995 167962 127414 -78874 -10316 28449
16997 28449 148442 -42290 -197312 -220253 -121367 42103 54110 -95721 -174099 -209737 -341711
16986 -341711 -412395 -293941 -117361 -33127 -59826 -141750 -160470 -75287 -87246 -24231 -125890
16975 -125890 -51874 94287 307168 527643 544723 754897 957263 869953 623696 478769
16965 478769 448298 274048 244276 249732 285028 338333 536896 279797 274262 437097 536710
$$ packed form
17041I10685Q0348R7375k45883j98293o5919j70478K4511P5122j05186K3575J12703
17030E38560j02611j39124J07144j27186J5520J2735R5943M7464l1873m9977k20138
17019A46457o391j9542l9129j23961j05694P3632j8603J4625L36329J25294n4708
17008C28309o8023L8545J02564P5565k60290q4675L5967m0548k06288O8558L8765
16997B8449J19993j90732j55022k2941R8886J63470J2007j49831p8378l5638j31974
16986c41711p0684J18454J76580Q4234k6699q1924j8720Q5183j1959O3015j01659
16975a25890P4016J46161K12881K20475J7080K10174K02366q7310k46257j44927
16965D78769l0471j74250k9772N456L5296N3305J98563k57099n535J62835R9613
$$ plain form
16954 536710 535519 524639 329054 135467 16658 125976 73226 -142064 16076 140486
16944 140486 211409 352391 465309 584487 662249 483143 218400 332250 316079 309115
16934 309115 450302 396055 95199 -110648 -28106 40349 35909 -205444 -219422 -270078 -305357
16923 -305357 -119359 142906 182130 141977 133519 218122 278741 220806 286257 286627 365530 207061
16911 207061 266780 288902 254046 213941 -6900 17686 -60597 -233914 -169674 -168324 -85644
16900 -85644 -58691 205858 257118 194220 56683 128479 171552 60337 82118 231761 278502
16889 278502 228401 121890 -90150 -110094 -224829 -218103 -166317 -176433 -76217 -265282 -496223
16878 -496223 -373185 -222216 -170199 -94224 544 -44204 -2777 -143222 -271533 -171572 -31551
$$ packed form
16954E36710j191j0880j95585j93587j18809J09318n2750k15290J58140J24410
16944A40486P0923J40982J12918J19178P7762j79106k64743J13850j6171o964
16934C09115J41187n4247l00856k05847Q2542O8455m440k41353j3978n0656l5279
16923c05357J85998K62265L9224m0153q458Q4603O0619n7935O5451L70P8903j58469
16911B07061N9719K2122l4856m0105k20841K4586p8283j73317O4240J350Q2680
16900h5644K6953K64549N1260o2898j37537P1796M3073j11215K1781J49643M6741
16889B78502n0101j06511k12040j9944j14735O726N1786j0116J00216j89065k30941
16878d96223J23038J50969N2017P5975R4768m4748M1427j40445j28311R9961J40021
$$ plain form
16867 -31551 -41824 76930 166244 29107 -136349 -240395 -326246 -97848 75919 61554
16857 61554 -56001 -337667 -347849 -204709 42045 195957 300703 204896 14906 -30315
16847 -30315 3114 37140 139619 278801 180952 60795 -73463 -274173 -181654 -10696
16837 -10696 245723 187527 -99054 -303788 -304022 -340615 -211281 -160477 63011 163605 124766
16826 124766 33407 131671 256263 80434 -201551 -80682 237650 154666 176858 234018
16816 234018 186240 102824 -92739 -162604 -111086 -110971 -85655 2430 15197 280142 344390
16805 344390 47467 -148026 -92073 -38732 -84160 -71865 -32447 -45663 57385 169371 116987
16794 116987 54728 245490 239613 115443 249961 435736 379864 222225 98470 180367
$$ packed form
16867c1551j0273J18754Q9314j37137j65456j04046q5851K28398J73767j4365
16857F1554j17555k81666j0182J43140K46754J53912J04746r5807j89990m5221
16847c0315L3429L4026J02479J39182r7849j20157j34258k00710R2519J70958
16837a0696K56419n8196k86581k04734k34l6593J29334N0804K23488J00594l8839
16826A24766r1359R8264J24592j75829k81985J20869L18332q2984K2192N7160
16816B34018m7778q3416j95563o9865N1518J15K5316Q8085J2767K64945O4248
16805C44390k96923j95493N5953N3341m5428J2295L9418j3216J03048J11986n2384
16794A16987o2259J90762n877j24170J34518J85775n5872j57639j23755Q1897
$$ plain form
16784 180367 292774 233137 86329 -4398 -144913 -144826 -68597 -100593 -117992 -135913 1996
16773 1996 -94709 -186992 -124889 -148399 -218338 -116372 -54145 30354 20702 2752 -136255 -120916
16761 -120916 -57253 -138802 -157341 -325208 -412828 -206922 -25016 77056 61247 -32053 -39216
16750 -39216 106667 134914 196897 86205 185940 417619 220475 54747 144121 107745 236022
16739 236022 365065 165647 -22247 -584 71256 153788 161457 110815 -53620 -36042 -138866
16728 -138866 -184746 -217564 -275660 -182885 -218431 -158508 -119903 -131407 -17063 -76993 -268502
16717 -268502 -529482 -467438 -257518 -25119 91890 122984 141532 -61990 -149822 -211032
16707 -211032 -182259 -123666 28932 -23390 -25926 -9389 42148 -90889 -97508 54885 73092
$$ packed form
16784A80367J12407n9637j46808r0727j40515Q7P6229l1996j7399j7921J37909
16773A996r6705r2283O2103k3510o9939J01966O2227Q4499r652j7950j39007J5339
16761a20916O3663q1549j8539j67867q7620K05906J81906J02072j5809r3300p163
16750c9216J45883K8247O1983j10692R9735K31679j97144j65728Q9374l6376J28277
16739B36022J29043j99418j87894K1663P1840Q2532P669n0642j64435J7578j02824
16728a38866m5880l2818n8096R2775l5546N9923L8605j1504J14344n9930j91509
16717b68502k60980O2044K09920K32399J17009L1094J8548k03522q7832o1210
16707b11032K8773N8593J52598n2322k536J6537N1537j33037o619J52393J8207
$$ plain form
16696 73092 -67165 -127113 50847 30415 -19430 -62702 -74608 -126195 -311344 -361650 -214447
16685 -214447 -203124 -288829 -251770 -29099 241945 140928 79724 -9241 -97223 -115301 -69563
16674 -69563 -122979 -172547 -38405 120358 176847 244916 82624 -40628 60457 277706
16664 277706 258315 167791 214602 145813 40489 -48021 -110433 -123222 -51032 77893 163179
16653 163179 -50790 -198732 -253733 -228109 -327233 -365653 -421493 -326641 -348918 -332235 -171401
16642 -171401 -44248 31468 109442 -37467 -101470 -176871 -197264 -173214 -173555 -272956 -378746
16631 -378746 -361462 -273283 -229728 -261234 -197770 -310917 -374879 -490393 -434611 -217525 -154131
16620 -154131 -293966 -303401 -166727 -116652 -78452 -64655 -96981 -82219 -94415 -52381 -146842
$$ packed form
16696G3092j40257n9948J77960k0432m9845m3272j1906n1587j85149n0306J47203
16685b14447J1323q5705L7059K22671K71044j01017o1204q8965q7982j8078M5738
16674f9563n3416m9568J34142J58763N6489O8069j62292j23252J01085K17249
16664B77706j9391r0524M6811o8789j05324q8510o2412j2789P2190J28925Q5286
16653A63179k13969j47942n5001K5624r9124l8420n5840R4852k2277J6683J60834
16642a71401J27153P5716P7974j46909o4003p5401k0393K4050l41r9401j05790
16631c78746J7284Q8179M3555l1506O3464j13147o3962j15514N5782K17086O3394
16620a54131j39835r435J36674N0075L8200J3797l2326J4762j2196M2034r4461
$$ plain form
16609 -146842 -55570 100155 138933 161171 23471 -70958 -148603 -362035 -446630 -356558 -172116
16598 -172116 -17285 41021 86551 78683 30022 61052 -30684 11809 -1806 -220859 -260288
16587 -260288 -226157 -192006 -129153 -140679 -146050 -152264 -176071 -92119 108783 36047 -201176
16576 -201176 -270900 -213885 -87597 -60749 -9991 182627 248454 27427 -90749 -151484 -157545
16565 -157545 -205085 -134192 15958 -21712 -34207 -86178 -83706 -148938 -242884 -37318 91725
16554 91725 -108311 -105078 -391781 -447451 -305303 -143577 -128277 -191076 -261506 -282476 -39964
16543 -39964 18853 -239004 -491709 -300080 -65760 213335 464964 590971 435654 382481
16533 382481 184932 117018 115011 67457 60992 75648 -31943 -157755 -231728 -3232 -33489
$$ packed form
16609a46842R1272J55725L8778K2238j37700r4429p7645k13432q4595R0072J84442
16598a72116J54831N8306M5530p868m8661L1030r1736M2493j3615k19053l9429
16587b60288L4131L4151O2853j1526n371o214k3807Q3952K00902p2736k37223
16576b01176o9724N7015J26288K6848N0758J92618O5827k21027j18176o0735o061
16565a57545m7540P0893J50150l7670j2495n1971K472o5232r3946K05566J29043
16554I1725k00036L233k86703n5670J42148J61726J5300o2799p0430k0970K42512
16543c9964N8817k57857k52705J91629K34320K79095K51629J26007j55317n3173
16533C82481j97549o7914k007m7554o465J4656j07591j25812p3973K28496l0257
$$ plain form
16522 -33489 -56141 95645 338194 540841 863799 1219503 1828815 2307970 2561682 2394353
16512 2394353 2213070 1827519 1287212 874913 529478 444179 361096 257628 109752 41961
16502 41961 69191 39471 147843 209097 126921 99495 171585 216844 266554 223037 185189
16491 185189 127256 38055 66713 13528 -69220 -55934 -63518 -103796 -64322 16005 22990 29051
16479 29051 12213 -49357 -36010 -118199 -280036 -297940 -209425 -38255 -30352 -70284 79511
16468 79511 -35693 28751 87624 181754 211793 104050 -45287 -102259 -215814 -253224 -118009
16457 -118009 -149559 -144557 8398 -41375 9484 62796 -106775 -172691 -55744 -61070 -53393
16446 -53393 -98731 -179892 -216030 -242246 -207668 -126380 -171662 -300359 -219740 -121030 -127585 -132000
$$ packed form
16522c3489k2652J51786K42549K02647L22958L55704O09312M79155K53712j67329
16512B394353j81283l85551n40307m12299l45435q5299q3083j03468j47876o7791
16502D1961K7230k9720J08372O1254q2176k7426P2090M5259M9710m3517l7848
16491A85189n7933q9201K8658n3185q2748J3286p584m0278L9474Q0327O985O061
16479B9051j6838o1570J3347q2189j61837j7904Q8515J71170P903l9932J49795
16468G9511j15204O4444N8873R4130L0039j07743j49337n6972j13555l7410J35215
16457a18009l1550N002J52955m9773N0859N3312j69571o5916J16947n326P677
16446e3393m5338q1161l6138k6216L4578Q1288m5282j28697Q0619R8710o555m415
$$ plain form
16434 -132000 -193750 -333078 -202060 -12595 37013 -29728 -166478 -79945 119766 137423
16424 137423 57960 101588 -75979 -166796 -10336 -25529 125497 281789 319737 240060 -64172
16413 -64172 -208257 -121350 116549 132134 -57422 -141185 -187714 -466789 -610240 -478742
16403 -478742 -333929 -432391 -405357 -412020 -233718 -17699 92257 257204 333464 295289 51887
16392 51887 -99668 -164660 -243226 -287607 -343208 -172363 170581 178342 133056 -34291 -175212
16381 -175212 -273684 -215132 -275874 -136823 42144 158547 441409 474926 300792 304086 117664
16370 117664 50863 56996 94355 123826 90139 167588 112974 186229 211500 241180 221001 117893
16358 117893 209232 -94 -103879 -135928 8948 230776 109349 2423 -34792 242442
$$ packed form
16434a32000o1750j39328J31018J89465M9608o6741j36750Q6533J99711J7657
16424A37423p9463M3628j77567r0817J56460j5193J51026J56292L7948p9677l04232
16413f4172j44085Q6907K37899J5585j89556q3763m6529k79075j43451J31498
16403d78742J44813r8462K7034o663J78302K16019J09956J64947P6260l8175k43402
16392E1887j51555o4992p8566m4381n5601J70845L42944P761m5286j67347j40921
16381a75212r8472N8552o0742J39051J78967J16403K82862L3517j74134L294j86422
16370A17664o6801O133L7359K9471l3687P7449n4614P3255K5271K9680k0179j03108
16358A17893R1339k09326j03785l2049J44876K21828j21427j06926l7215K77234
$$ plain form
16348 242442 202109 19861 33813 99300 238958 582398 626375 542020 380460 218085
16338 218085 284963 260721 483198 514901 473535 400481 300000 372258 610961 626657 440925
16327 440925 498928 434359 639006 648298 518312 403598 361970 370224 435463 432698 389583
16316 389583 480383 519140 587276 694469 893691 758820 627894 600604 472133 490130
16306 490130 743141 567724 464089 372912 313485 424909 496725 389063 317849 369223
16296 369223 585401 481592 336377 119721 163621 310294 184356 -39861 -215610 -118451
16286 -118451 41709 118788 269932 319993 212266 163183 110765 35886 103985 49257 -96924
16275 -96924 -49670 81247 -1332 6802 186468 139747 115388 180951 105764 6786 -116404
$$ packed form
16348B42442m0333j82248J3952O5487J39658L43440M3977q4355j61560j62375
16338B18085O6878k4242K22477L1703m1366p3054j00481P2258K38703J5696j85732
16327D40925N8003o4569K04647R292j29986j14714m1628Q254O5239k765m3115
16316C89583R0800L8757O8136J07193J99222j34871j30926k7290j28471J7997
16306D90130K53011j75417j03635r1177n9427J11424P1816j07662p1214N1374
16296C69223K16178j03809j45215k16656M3900J46673j25938k24217j75749R7159
16286a18451J60160P7079J51144N0061j07727m9083n2418p4879O8099n4728j46181
16275i6924M7254J30917q2579Q134J79666m6721k4359O5563p5187r8978j23190
$$ plain form
16264 -116404 -66219 85778 157756 192631 43402 -60801 -66846 -201814 -182763 -117656 -37048
16253 -37048 186756 261618 246833 322034 392999 336411 121587 116997 239406 217393 44128
16242 44128 -76291 -66110 32759 -163053 -199005 -186215 -91741 121076 275664 283222 271091
16231 271091 211619 36668 67181 178450 176775 242696 158916 -143218 -197253 -154711 -8074
16220 -8074 73661 -11181 -240083 -362562 -354785 -329778 -165347 -39966 66331 78520 126494
16209 126494 133508 79883 -115695 -49459 90266 36371 91774 230120 243435 130596 -48138
16198 -48138 -170750 -198200 -125325 -157997 -174140 -51583 109490 96789 -27097 109189 165816
16187 165816 185906 125349 -78565 -181917 -6598 106536 95491 77910 -88279 -302905
$$ packed form
16264a16404N0185J51997P1978L4875j49229j04203o045j34968J9051O5107Q0608
16253c7048K23804P4862j4785P5201P0965n6588k14824m590J22409k2013j73265
16242D4128j20419J0181R8869j95812l5952J2790R4474K12817J54588P558j2131
16231B71091n9472j74951L0513J11269j675O5921q3780l02134n4035M2542J46637
16220h074Q1735q4842k28902j22479P777K5007J64431J25381J06297J2189M7974
16209A26494P014n3625j95578O6236J39725n3895N5403J38346J3315j12839j78734
16198d8138j22612k7450P2875l2672j6143J22557J61073j2701j23886J36286N6627
16187A65816K0090o0557k03914j03352J75319J13134j1045j7581j66189k14626
$$ plain form
16177 -302905 -198858 142178 100046 -197194 -402948 -386290 -270221 -302182 -398364 -543655
16167 -543655 -339782 -221894 -130011 -61108 -29005 -26136 55149 105329 31710 -158400 -138680
16156 -138680 -219849 -276209 -190424 -220405 -48430 89 -12364 -59444 -15806 146137 78920
16145 78920 127587 52886 5279 -43028 -18322 33455 -172093 -123199 84438 43984 -46430
16134 -46430 -138224 -231893 -155488 -12797 9622 -162382 -252613 -142632 -136157 -117235 63393
16123 63393 20017 134552 76980 -86492 -20742 113075 109194 -21111 17542 147491 151092
16112 151092 101959 29168 64274 47561 -10004 178022 260306 324850 395020 310064 170948
16101 170948 157865 124872 -5559 -92293 -105912 -66358 -38759 -68729 -8649 42890 -97547
$$ packed form
16177c02905J04047L41036m2132k97240k05754J6658J16069l1961r6182j45291
16167e43655K03873J17888R1883O8903L2103K869Q1285N0180p3619j90110J9720
16156a38680q1169n6360Q5785k9981J71975M8519j2453m7080M3638J61943o7217
16145G8920M8667p4701m7607m8307K4706N1777k05548M8894K07637m0454r0414
16134d6430r1794r3669P6405J42691K2419j72004r0231J09981O475J8922J80628
16123F3393m3376J14535n7572j63472O5750J33817l881j30305L8653J29949L601
16112A51092m9133p2791L5106j6713n7565J88026Q2284O4544P0170q4956j39116
16101A70948j3083l2993j30431q6734j3619L9554K7599k9970O0080N1539j40437
$$ plain form
16090 -97547 -172193 -110107 -153505 -250267 -376838 -162708 -82549 -142147 -218050 -180734 -227794
16079 -227794 -289205 -237988 -191867 -107185 -16691 -121514 -107436 -41442 -128361 -85779 141186
16068 141186 79099 35109 187263 175936 9796 -218478 -164125 -35811 -250030 -152454
16058 -152454 3314 -30313 -71478 -17589 6853 107214 39166 -16097 -8701 6233 163764
16047 163764 131357 123928 -15408 -127972 -133920 -101492 -100469 -264478 -265478 -185425 -41910
16036 -41910 174256 199383 28209 -82696 -105036 -86817 -90804 -105251 -123938 -100135 16536
16025 16536 47323 54392 32118 -201401 -196718 29530 68024 74897 -37239 -110312 57388
16014 57388 198511 24052 -17167 -28970 -73948 -134926 14001 -10607 -72491 -83767 -75376
$$ packed form
16090i7547p4646O2086m3398r6762j26571K14130Q0159n9598p5903L7316m7060
16079b27794o1411N1217M6121Q4682R0494j04823J4078O5994q6919M2582K26965
16068A41186o2087m3990J52154j1327j66140k28274N4353J28314k14219R7576
16058a52454J55768l3627m1165N3889K4442J00361o8048n5263P396J4934J57531
16047A63764l2407p429j39336j12564n948L2428J023j64009j000Q0053J43515
16036d1910K16166K5127j71174j10905k2340J8219l987j4447j8687K3803J16671
16025A6536L0787P069k2274k33519M683K26248L8494O873j12136p3073J67700
16014E7388J41123j74459m1219j1803m4978o0978J48927k4608o1884j1276Q391
$$ plain form
16003 -75376 -72159 -98303 -21522 -157186 -134042 -60251 -120311 -39505 -26003 144073 194811
15992 194811 142477 71184 52750 -248548 -466022 -508487 -410634 -292961 -221547 -25809 68009
15981 68009 -71468 -214475 -138902 -180541 -258932 -283609 -275599 -135549 8075 41439 -28427
15970 -28427 -95109 -98416 5108 131147 203214 156163 43983 45545 69692 309200 397004
15959 397004 354021 165379 128641 215017 -126538 -292342 -246497 -231084 -86323 131390
15949 131390 224817 279564 249590 255699 297086 229829 239162 211141 76507 3466 -10472 218673
15937 218673 341166 284618 147811 11281 -106548 -43017 73103 60616 42821 190124
15927 190124 235621 256872 103522 141876 91452 37317 -39650 -277458 -329497 -130658 -206445
$$ packed form
16003g5376L217k6144P6781j35664K3144P3791o0060Q0806J3502J70076N0738
15992A94811n2334p1293j8434l01298k17474m2465R7853J17673P1414J95738R3818
15981F8009j39477j43007P5573m1639p8391k4677Q010J40050J43624L3364o9866
15970b8427o6682l307J03524J26039P2067m7051j12180J562K4147K39508Q7804
15959C97004m2983j88642l6738Q6376l41555j65804M5845J5413J44761K17713
15949A31390R3427N4747k9974O109M1387o7257R333k8021j34634p3041j3938K29145
15937B18673J22493n6548j36807j36530j17829O3531J16120j2487j7795J47303
15927A90124M5497K1251j53350L8354n0424n4135p6967k37808n2039J98839p5787
$$ plain form
15916 -206445 -305529 -177735 -97216 77145 19181 -269881 -251751 -332035 -385454 -379310 -343488
15905 -343488 -260384 -204034 -199355 -150587 -143589 43226 308589 302763 213617 247835 160548 95567
15893 95567 222752 264511 9491 -99806 148338 285712 121221 -164006 -283859 -194111
15883 -194111 -219869 -195820 -107621 -119531 -149367 -128189 -14463 -19552 -156915 -270081 -166255
15872 -166255 -115584 -36025 74515 186869 109287 -84447 -136198 -258479 -285541 -237807 -242765
15861 -242765 -328911 -269721 -115010 -24242 -112739 -123835 -178778 -124392 -62960 30815 170228
15850 170228 129952 74579 154550 94958 36682 247885 161542 161772 383079 437993 151579
15839 151579 -15219 -41394 -44572 64951 77352 104015 105731 -27786 -61255 -31175 -2476
$$ packed form
15916b06445r9084J27794Q0519J74361n7964k89062J8130q0284n3419O144L5822
15905c43488Q3104N6350M679M8768O998J86815K65363n826q9146L4218q7287o4981
15893I5567J27185M1759k55020j09297K48144J37374j64491k85227j19853Q9748
15883a94111k5758K4049Q8199j1910k9836K1178J13726n089j37363j13166J03826
15872a66255N0671P9559J10540J12354p7582j93734n1751j22281k7062M7734m958
15861b42765q6146N9190J54711R0768q8497j1096n4943N4386O1432R3775J39413
15850A70228m0276n5373P9971n9592n8276K11203q6343K30K21307N4914k86414
15839A51579j66798k6175l178J09523J2401K6663J716j33517l3469L0080K8699
$$ plain form
15828 -2476 219756 176932 -154365 -149947 -185471 -289438 -286237 -207296 -95852 -300322 -256499
15817 -256499 -81669 29156 -52220 -95329 -159593 -210098 -168527 -82266 -110941 -206140 -109141
15806 -109141 -77039 -129988 19884 46247 140005 232722 257139 33667 307 40610 -184704
15795 -184704 -263705 -242010 -117287 -68014 -43062 212628 336165 221715 154040 45890
15785 45890 36863 102325 227224 148960 -94950 -113938 211369 173283 101213 22075 -38140
15774 -38140 24979 -24726 -10100 -22590 -101331 -91521 24793 161117 60557 90485 46347
15763 46347 229489 243478 178884 17391 -139235 -94814 16856 226647 231653 35828 -104791
15752 -104791 -280065 -430512 -412782 -227666 -138785 -152839 -61929 38381 -88828 -64124
$$ packed form
15828b476K22232m2824l31297M418l5524j03967L201P8941J11444k04470M3823
15817b56499J74830J10825q1376m3109o4264n0505M1571Q6261k8675r5199R6999
15806a09141L2102n2949J49872K6363R3758R2717K4417k23472l3360M0303k25314
15795a84704p9001K1695J24723M9273K4952K55690J23537j14450o7675j08150
15785D5890r027O5462J24899p8264k43910j8988L25307l8086p2070p9138o0215
15774c8140O3119m9705J4626j2490p8741R810J16314J36324j00560K9928m4138
15763D6347J83142J3989o4594j61493j56626M4421J11670K09791N006j95825j40619
15752a04791j75274j50447J7730J85116Q8881j4054R0910J00310j27209K4704
$$ plain form
15742 -64124 -81279 -18873 -26812 -200767 -257483 -35849 174547 135433 -24832 27750 -59378
15731 -59378 -129428 -164468 -171563 -245931 -170452 -157998 -139340 -6099 201711 292461 284273 22502
15719 22502 -98123 -158911 -261541 -4053 -33555 -180438 -88862 -43817 134001 178364 264940
15708 264940 416903 115069 109577 22096 -68015 -19942 -88910 -122667 -68942 -267372 -565983
15697 -565983 -421204 -283134 -264319 -225938 -286392 -283910 -36488 -31247 66607 63053 75690
15686 75690 -17310 61660 234265 83461 -133203 -259352 -288127 -205830 24804 165517
15676 165517 14647 36910 -92225 -257854 -249173 -238867 -175465 -311544 -212648 -122661 -119187
15665 -119187 -211177 -249600 -461941 -427825 -250946 -148540 -162297 -6948 210134 268772
$$ packed form
15742f4124j7155O2406p939j73955n6716K21634K10396l9114j60265N2582q7128
15731e9378p0050l5040p095p4368P5479J2454J8658J33241K07810R0750q188k61771
15719B2502j20625o0788j02630K57488k9502j46883R1576M5045J77818M4363Q6576
15708B64940J51963l01834n492q7481r0111M8073o8968l3757N3725j98430k98611
15697e65983J44779J38070J8815L8381o0454K482K47422N241R7854l554J2637
15686G5690r3000P8970J72605j50804k16664j26149k8775Q2297K30634J40713
15676A65517j50870K2263j29135j65629Q681J0306O3402j36079R8896Q9987L474
15665a19187r1990l8423k12341L4116J76879J02406j3757J55349K17082N8638
$$ plain form
15655 268772 119595 -88304 -141017 -249837 -146231 3246 59491 21684 63724 42238
15645 42238 -32060 92820 67244 188838 90894 -92309 -77868 -236352 -253126 -261778 -325015
15634 -325015 -330253 -324782 -338590 -174191 -176613 -172216 -70598 40672 241518 279601 429843
15623 429843 238243 48904 133772 214535 34818 -115217 -47267 201031 250119 128726
15613 128726 188298 128327 242443 357677 225512 135173 150291 344227 281660 299152 150747
15602 150747 -39591 -77619 -14187 26418 121406 -35516 -16769 -90981 -153776 -75790 31263
15591 31263 12985 -59596 -90022 -80057 -130999 -109925 -48949 -78352 -135152 -166627 -153980 -43030
15579 -43030 -140356 -112681 -160706 -154455 -41179 -52914 -139214 -209472 -297874 -331845 -171740
$$ packed form
15655B68772j49177k07899n2713j08820J03606J49477N6245l7807M2040k1486
15645D2238p4298J24880k5576J21594r7944j83203J4441j58484j6774q652o3237
15634c25015n238N471j3808J64399k422M397J01618J11270K00846L8083J50242
15623D29843j91600j89339Q4868Q0763j79717j50035O7950K48298M9088j21393
15613A28726N9572n9971J14116J15234j32165r0339J5118J93936o2567J7492j48405
15602A50747j90338l8028O3432M0605R4988j56922J8747p4212o2795P7986J07053
15591C1263j8278p2581l0426R965n0942K1074O0976k9403n6800l1475J2647J10950
15579d3030r7326K7675m8025O251J13276j1735q6300p0258q8402l3971J60105
$$ plain form
15568 -171740 2838 -26736 -73573 -103895 -134625 -13346 -35262 -65201 -19780 -55689 -140420
15557 -140420 62179 147472 193956 268868 116529 -83632 -25664 -3171 133616 314478
15547 314478 367394 322221 256734 194564 139263 128994 283456 154811 158830 84393 61597
15536 61597 25435 3402 -11713 70569 16399 106447 157567 78857 -129738 -65660 -149659
15525 -149659 -253343 -350294 -263971 -288200 -221676 36607 8428 -190764 43862 167066
15515 167066 112478 123680 125615 29971 180266 167668 -3619 -10148 -68962 14919 -33425
15504 -33425 -111143 8679 24588 -11678 70935 157646 94723 137510 227257 174661 221139
15493 221139 129707 -7282 -43830 -19297 119320 201040 165300 98275 40745 158537 192480
$$ packed form
15568a71740J74578k9574m6837l0322l0730J21279k1916k9939M5421l5909q4731
15557a40420K02599Q5293M6484P4912j52339k00161N7968K2493J36787J80862
15547C14478N2916m5173o5487o2170n5301j0269J54462j28645M019p4437k2796
15536F1597l6162k2033j5115Q2282n4170R0048N1120p8710k08595O4078q3999
15525a49659j03684r6951Q6323k4229O6524K58283k8179j99192K34626J23204
15515A67066n4588J1202J935r5644J50295j2598j71287o529n8814Q3881m8344
15504c3425p7718J19822J5909l6266Q2613Q6711o2923M2787Q9747n2596M6478
15493B21139r1432j36989l6548K4533J38617Q1720l5740o7025n7530J17792L3943
$$ plain form
15482 192480 226495 97006 4959 64366 -42405 -14002 160110 168975 34224 24144 -12635
15471 -12635 13913 74530 20943 39125 24946 -45614 -41994 -146383 -202829 -119372 -12687
15460 -12687 86621 57934 -125432 -251807 -318631 -380850 -218737 -177706 -110510 -73854 3970
15449 3970 59961 186970 223061 114529 115102 72147 210123 253997 226094 86329 126504
15438 126504 164177 303183 473910 114525 -65238 -10170 115162 35445 -169238 -173961
15428 -173961 -234812 -283540 -216603 -175578 -144082 -60726 -116872 4209 139050 105775 24654
15417 24654 44870 209008 -26346 -145474 -98971 -138969 -140343 -160495 -170351 -244029 -261605
15406 -261605 -105123 47399 4165 -7398 -138143 -136660 -154404 -219649 -149195 -48237 -165903
$$ packed form
15482A92480L4015j29489r2047N9407j06771K8403J74112Q865j34751j0080l6779
15471a2635K6548O0617n3587J8182j4179p0560L620j04389n6446Q3457J06685
15460a2687R9308k8687j83366j26375o6824o2219J62113M1031O7196L6656P7824
15449C970N5991J27009L6091j08532N73m2955J37976M3874k7903j39765M0175
15438A26504L7673J39006J70727l59385j79763N5068J25332p9717k04683m723
15428a73961o0851m8728O6937M1025L1496Q3356n6146J21081J34841l3275q1121
15417B4654K0216J64138k35354j19128M6503l9998j374k0152r856p3678j7576
15406b61605J56482J52522m3234j1563j30745J483j7744o5245P0454J00958j17666
$$ plain form
15395 -165903 -87965 11914 -8367 -74137 -196145 -349076 -386217 -224212 -2636 -10112 -260882
15384 -260882 -338982 -448426 -406528 -311667 -85090 107245 69840 21973 -11860 -1352 -45751
15373 -45751 -42979 194368 281513 200674 275263 305430 151598 179355 140241 -86096 -14864
15362 -14864 -235774 -205475 70374 211069 167313 72104 80190 59414 -237116 -52106 178402
15351 178402 67185 -68910 102600 213200 274332 150684 34738 -83678 -101252 -290005
15341 -290005 -311824 -215007 22066 91948 494 -4545 -16396 -96314 -237323 -310171 -337468
15330 -337468 -189286 -30941 35179 39703 153931 89461 134526 163317 49485 50973 40492
15319 40492 -69716 -283307 -207325 -58793 -169050 -19810 171027 36225 17000 93088
$$ packed form
15395a65903P7938R9879k0281o5770j22008j52931l7141J62005K21576p476k50770
15384b60882p8100j09444M1898R4861K26577J92335l7405m7867l3833J0508m4399
15373d5751K772K37347Q7145q0839P4589L0167j53832K7757l9114k26337P1232
15362a4864k20910L0299K75849J40695m3756r5209Q086k0776k96530J85010K30508
15351A78402j11217j36095J71510J10600O1132j23648j15946j18416j7574j88753
15341b90005k1819R6817K37073O9882r1454n039j1851p9918j41009p2848k7297
15330c37468J48182J58345O6120M524J14228o4470M5065K8791j13832J488j0481
15319D0492j10208k13591P5982J48532j10257J49240J90837j34802j9225P6088
$$ plain form
15309 93088 470 -199145 -308767 -265697 -217806 -280085 -413294 -415912 -166063 -172969 -94015
15298 -94015 93154 56546 81421 118340 169647 154316 -1425 -157264 -92155 -181425 -180115
15287 -180115 -173336 -236541 -192607 -55140 -76615 -164139 -121954 -25002 206857 263812 44294
15276 44294 108969 -71756 -269210 -242830 -163535 -49850 -56248 -246872 -323690 -360779 -163528
15265 -163528 -268863 -490620 -389188 -158392 -36043 32274 73661 -76374 -214094 -146478
15255 -146478 -4172 8846 -17011 -68824 -59051 -38535 58508 43800 10897 -15907 26456
15244 26456 80396 149817 195755 148579 143964 179505 -20905 -4851 174105 172578 156643 179605
15232 179605 52561 -36391 -85891 -207124 -158489 -186774 -29691 2737 -50754 -110626 -364420
$$ packed form
15309I3088r2618j99615j09622M3070M7891o2279j33209k618K49849o906P8954
15298i4015J87169l6608K4875L6919N1307j5331j55741j55839O5109q9270J310
15287a80115O779o3205M3934J37467k1475q7524M2185R6952K31859N6955k19518
15276D4294O4675j80725j97454K6380P9295J13685o398j90624p6818l7089J97251
15265a63528j05335k21757J01432K30796J22349O8317M1387j50035j37720O7616
15255a46478J42306J3018k5857n1813R773K0516R7043j4708l2903k6804M2363
15244B6456N3940O9421M5938m7176m615L5541k00410J6054J78956j527j5935K2962
15232A79605j27044q8952m9500j21233M8635k8285J57083L2428n3491n9872k53794
$$ plain form
15221 -364420 -249571 15411 149552 69446 -72246 -177238 -159903 -214890 -201794 -180358
15211 -180358 -211055 -125189 -81627 -142912 -249329 -188082 -332397 -232857 -70125 -110761 78317
15200 78317 127102 -24578 -12276 -46535 50452 243505 273089 89082 -242426 -394009 -89489
15189 -89489 328645 265875 156941 76892 56052 5322 733 -51717 -213113 -445159 -507838
15178 -507838 -442695 -388734 -213052 -137658 -183205 -101934 -203626 -187242 -268850 -335049 -169283
15167 -169283 -21099 -229196 -227527 -172980 -148947 -11028 25750 -80572 -1625 68032 -5730
15156 -5730 -69358 -47774 36414 91157 17500 -21962 -170609 -179523 -99836 210007 304552 94012
15144 94012 27828 -46618 5979 14075 -119594 -150634 8807 129915 -63806 -323033 -360701
$$ packed form
15221c64420J14849K64982J34141q0106j41692j04992J7335n4987J3096K1436
15211a80358l0697Q5866M3562o1285j06417O1247j44315R9540J62732m0636J89078
15200G8317M8785j51680J2302l4259R6987J93053K9584j84007l31508j51583L04520
15189h9489M18134o2770j08934q0049k0840n0730m589n2450j61396k32046o2679
15178e07838O5143N3961J75682P5394m5547Q1271j01692J6384q1608o6199J65766
15167a69283J48184k08097J669N4547K4033J37919L6778j06322P8947O9657p3762
15156e730o3628K1584Q4188N4743p3657l9462j48647q914P9687L09843R4545k10540
15144I4012o6184p4446N2597Q096j33669l1040J59441J21108j93721k59227l7668
$$ plain form
15133 -360701 -405447 -259538 -50225 -153745 -296755 -103833 13190 90452 103017 41367
15123 41367 78109 387458 236311 -2037 -43478 -33548 -34184 28210 7785 -126666 -290958
15112 -290958 -274418 -227037 -158666 -147742 -229486 -181311 -143820 -166320 -52358 -130194 -225999
15101 -225999 -72055 51900 -89691 -187984 -91871 -67116 -124783 -93473 -68790 -39886 -152472
15090 -152472 -271590 -302017 -216833 -67407 -20117 73432 2287 -61826 -139551 -355284 -391514
15079 -391514 -229500 -212162 -163001 -124439 -153298 -298546 -201481 -93053 -166142 -320170 -189959
15068 -189959 -262093 -306414 -351958 -288992 -265637 -136504 -106790 61321 161852 -56499 -204990
15057 -204990 -62814 78136 2138 -6880 -4962 68667 161915 227727 211148 239652 79659
$$ packed form
15133c60701m4746J45909K09313j03520j43010J92922J17023P7262J2565o1650
15123D1367L6742L09349j51147k38348m1441R930o36O2394k0425j34451j64292
15112b90958J6540M7381O8371J0924q1744M8175L7491k2500J13962p7836r5805
15101b25999J53944J23955j41591r8293R6113K4755n7667L1310K4683K8904j12586
15090a52472j19118l0427Q5184J49426M7290R3549p1145o4113p7725k15733l6230
15079c91514J62014J7338M9161L8562k8859j45248R7065J08428p3089j54028J30211
15068a89959p2134m4321m5544O2966K3355J29133K9714J68111J00531k18351j48491
15057b04990J42176J40950p5998r018J918P3629R3248O5812j6579K8504j59993
$$ plain form
15046 79659 -51232 -154476 -248859 -125371 -52024 51334 -50579 18672 33363 123956 -19067
15035 -19067 13803 118020 242730 304288 187802 97136 77266 34512 -32647 -75323 -51494
15024 -51494 18415 44983 -199110 -217701 -184437 -61444 4366 11100 -51834 -82396 -37
15013 -37 191449 240633 8418 10943 -75677 129939 177736 59930 267400 243188 165312
15002 165312 -19748 -95073 -51793 -33513 33681 -6641 11076 48361 65354 218957 316469
14991 316469 260853 112651 197755 244190 86049 -208431 -181946 -118756 -28837 160553 303485
14980 303485 200346 109300 38801 139674 226388 371516 244565 95685 197655 166826
14970 166826 27901 104175 79315 -74087 -112498 -210691 -197488 -203945 -72218 -154129 -247841
$$ packed form
15046G9659j30891j03244r4383J23488P3347J03358j01913O9251J4691R0593j43023
15035a9067L2870J04217J24710O1558j16486r0666j9870m2754o7159m2676K3829
15024e1494O9909K6568k44093j8591L3264J22993O5810O734o2934l0562Q2359
15013c7J91486M9184k32215K525q6620K05616M7797j17806K07470k4212p7876
15002A65312j85060p5325M3280J8280O7194m0322J7717L7285J6993J53603R7512
14991C16469n5616j48202Q5104M6435j58141k94480K6485O3190Q9919J89390J42932
14980C03485j03139r1046p0499J00873Q6714J45128j26951j48880J01970l0829
14970A66826j38925P6274k4860j53402l8411r8193J3203o457J31727q1911r3712
$$ plain form
14959 -247841 -289886 -139732 -153455 -155196 -261327 -242049 -311832 -199152 9940 19492 -17411
14948 -17411 -203674 -226056 -106906 -79183 26046 -45860 1524 -69537 -139784 -137968 -189680
14937 -189680 -213389 -135341 171153 110245 -102988 -263622 -323796 -193462 35633 39485 150611
14926 150611 246280 190735 204699 156577 24258 36471 59328 -58416 47623 -827 -132376
14915 -132376 -65328 96529 161216 204852 113936 -80225 -68857 -5210 -82907 62217 40447
14904 40447 -50484 -94077 24756 197689 195003 183754 181903 -19253 -192931 -239958 27794
14893 27794 172369 225833 108741 97357 109892 172156 182923 288269 147305 152432 314323
14882 314323 284347 169391 284947 422147 444017 154404 7807 19044 84087 172362
$$ packed form
14959b47841m2045J50154j3723j741j06131J9278o9783J12680K09092R552l6903
14948a7411j86263k2382J19150K7723J05229p1906M7384p1061p0247J816n1712
14937a89680k3709P8048L06494o0908k13233j60634o0174J30334K29095L852J11126
14926A50611R5669n5545J3964m8122j32319J2213K2857j17744J06039m8450j31549
14915a32376O7048J61857O4687M3636r0916j94161J1368O3647p7697J45124k1770
14904D0447r0931m3593J18833J72933k686j1249j851k01156j73678m7027K67752
14893B7794J44575N3464j17092j1384J2535O2264J0767J05346j40964N127J61891
14882C14323k9976j14956J15556J37200K1870k89613j46597J1237O5043Q8275
$$ plain form
14872 172362 238465 92737 -56903 -206021 -283891 -345343 -442174 -417015 -420945 -183736 -30928
14861 -30928 -133323 -142347 -181474 -181409 -47579 -83566 -97852 -142198 -60970 25643 142429 129956
14849 129956 51434 -11074 -42246 -29034 111207 15236 -30653 -65943 -46543 53730 32387
14838 32387 -60374 -150901 -171586 -106558 -75269 94041 222730 128501 42376 -31852 -88180
14827 -88180 86838 317798 308532 277440 262098 358118 84600 -41635 -3065 -110866 -116869
14816 -116869 -145376 -32995 17148 39594 -10349 -58919 48734 90942 99100 -67956 -284375
14805 -284375 -293940 -199230 -149166 -122004 -43359 -39160 -141646 -326029 -144526 -182957 -316126
14794 -316126 -410736 -437447 -360037 -157987 130223 313087 398601 336474 184497 49351
$$ packed form
14872A72362O6103j45728j49640j49118p7870o1452r6831K5159l930K37209J52808
14861c0928j02395r024l9127O5J33830l5987j4286m4346Q1228Q6613J16786j2473
14849A29956p8522o2508l1172J3212J40241r5971m5889l5290J9400J00273k1343
14838C2387r2761r0527k0685O5028L1289J69310J28689r4229q6125p4228n6328
14827h8180J75018K30960r266l1092j5342R6020k73518j26235L8570j07801o003
14816a16869k8507J12381N0143K2446m9943m8570J07653M2208Q158j67056k16419
14805b84375r565R4710N0064K7162P8645M199j02486j84383J81503l8431j33169
14794c16126r4610k6711P7410K02050K88210J82864Q5514o2127j51977j35146
$$ plain form
14784 49351 -85999 15069 -40003 -11151 -89804 -186062 -31254 -123188 -126163 47165 84860
14773 84860 119542 213742 134893 -73076 -74160 -86186 -115131 -232858 -279101 -202195 -78564
14762 -78564 -66650 79960 106926 16253 -152021 -169221 -141819 -133991 -159912 -199859 -138717
14751 -138717 -124832 39133 116733 154646 72772 57393 130554 73235 101955 330166 370841
14740 370841 250850 198493 127176 35751 25282 139690 50279 -109855 -31066 -31494 7839
14729 7839 206795 153615 8614 103488 305632 471340 353966 203871 259470 419721
14719 419721 302313 172883 81822 66974 26633 -63979 26300 25420 66815 109205 75559
14708 75559 155681 264613 110984 -124399 -90880 -70115 -169745 -240943 -391955 -303361 -168604
$$ packed form
14784D9351j35350J01068n5072K8852p8653r6258J54808r1934k975J73328L7695
14773H4860L4682R4200p8849k07969j084j2026k8945j17727m6243P6906J23631
14762g8564J1914J46610K6966r0673j68274j7200K7402P828k5921l9947O1142
14751a38717J3885J63965P7600L7913q1874j5379P3161n7319K8720K28211M0675
14740C70841j19991n2357p1317r1425j0469J14408q9411j60134P8789m28L9333
14729G839J98956n3180j45001R4874K02144J65708j17374j50095N5599J60251
14719D19721j17408j29430r1061j4848m0341r0612R0279q80M1395M2390l3646
14708G5559Q0122J08932j53629k35383L3519K0765r9630p1198j51012Q8594J34757
$$ plain form
14697 -168604 -175170 -148958 -135221 -144082 113040 312955 448011 494913 332637 195582 159749
14686 159749 16781 68606 275338 455102 414497 491110 441497 124447 22774 17623 22171
14675 22171 -110503 -117510 -23270 -43430 52839 94453 80439 -25413 -217056 -71363 155877
14664 155877 248784 254021 229866 78700 118348 -21761 -52400 -91166 -256868 -309353 -155729
14653 -155729 -156793 -151026 -115541 -97243 102112 290459 240098 276661 251716 93879 -4762
14642 -4762 35906 44436 88127 126692 220078 79977 -233702 -323771 -260801 -152364 -164256
14631 -164256 -189633 -69295 81908 985 -107026 -103562 -43347 -24696 -192523 -157896 -95635
14620 -95635 -147795 -116383 -9348 -13467 -96258 -67168 -40560 8758 13905 -48174 -114428 -227461
$$ packed form
14697a68604o566K6212J3737q861K57122J99915J35056M6902j62276j37055l5833
14686A59749j42968N1825K06732J79764m0605P6613m9613l17050j01673n151M548
14675B2171j32674p007R4240k0160R6269M1614j4014j05852j91643J45693K27240
14664A55877R2907N237k4155j51166L9648j40109l0639l8766j65702n2485J53624
14653a55729j064N767L5485J8298J99355J88347n0361L6563k4945j57837r8641
14642d762M0668Q530M3691L8565R3386j40101l13679r0069O2970J08437j1892
14631a64256k5377J20338J51203q0923j08011L464O0215J8651j67827L4627O2261
14620i5635n2160L1412J07035m119q2791K9090K6608M9318N147o2079o6254j13033
$$ plain form
14608 -227461 -85610 47471 -85567 -318875 -247399 -85517 17240 119627 86528 205805
14598 205805 299251 387242 240589 200354 230401 74575 84734 179355 212631 116074 176232
14587 176232 192741 167264 216311 201347 187684 163563 312241 413270 417903 315980 321947
14576 321947 300577 332260 426293 352971 202679 150745 134456 178742 247423 208724 206887
14565 206887 248404 156804 94831 35830 7936 62378 88592 64073 50079 89496 43557
14554 43557 101888 269610 324857 404150 165565 -2013 40321 152527 251088 305477 251263
14543 251263 80154 10039 35284 59 33793 -19211 70016 255728 223899 152691 -865
14532 -865 1050 97421 108630 25523 71147 270714 243214 179325 74616 208675 77505
$$ packed form
14608b27461J41851J33081j33038k33308P1476J61882J02757J02387l3099J19277
14598B05805R3446Q7991j46653m0235L0047j55826J0159R4621L3276r6557O0158
14587A76232J6509k5477M9047j4964j3663k4121J48678J01029M633j01923N967
14576C21947k1370L1683R4033p3322j50292n1934j6289M4286O8681l8699j837
14565B06887M1517r1600o1973n9001k7894N4442K6214k4519j3994L9417m5939
14554D3557N8331J67722N5247P9293k38585j67578M2334J12206R8561N4389n4214
14543B51263j71109p0115K5245l5225L3734n3004Q9227J85712l1829p1208j53556
14532h65J915R6371J1209q3107M5624J99567k7500o3889j04709J34059j31170
$$ plain form
14521 77505 45565 89641 55016 276862 412644 382231 337034 406702 395320 382072 230218
14510 230218 124569 223368 388238 643428 544709 508963 266168 1731 -96897 -187502
14500 -187502 -154083 -79676 -92726 -118386 -87858 -129299 28109 96236 -68653 -30471 -42730
14489 -42730 -75659 -107487 -190373 -53068 -52421 -122836 4270 -13307 -89840 -92051 -150100 -72561
14477 -72561 95973 68999 131769 99114 147992 232024 152929 147319 297939 147394 231784
14466 231784 175565 78199 37948 39210 288830 323593 253756 336803 296192 300211 220483 57182
14454 57182 62708 208350 266123 260254 9511 -41999 13166 99594 115799 116945 131482 125422
14442 125422 157006 66399 12652 -127742 103419 220197 275209 282495 160784 117687 20057
$$ packed form
14521G7505l1940M4076l4625K21846J35782l0413m5197O9668j1382j3248j51854
14510B30218j05649R8799J64870K55190r8719l5746k42795k64437r8628r0605
14500a87502L3419P4407j3050k5660L0528m1441J57408O8127j64889L8182j2259
14489d2730l2929l1828q2886J37305O47p0415J27106j7577p6533k211n8049P7539
14477g2561J68534k6974O2770l2655M8878Q4032p9095n610J50620j50545Q4390
14466B31784n6219r7366m0251J262K49620L4763o9837Q3047m0611M019p9728j63301
14454E7182N526J45642N7773n869k50743n1510N5165Q6428J6205J146J4537o060
14442A25422L1584r0607n3747j40394K31161J16778N5012P286j21711m3097r7630
$$ plain form
14431 20057 138081 100333 101656 151974 129445 97552 54955 12200 90174 101629 -52822
14420 -52822 -144350 -127385 -128061 -63600 -34888 -234643 -159851 -200169 -192223 -94518 20517 63180
14408 63180 173297 67441 -69967 49590 23084 -1527 -15375 -33484 -63960 -38840 68372
14397 68372 -12569 118653 88384 20935 -58933 -61341 -50283 -155652 -72829 -152632 -157394 -150614
14385 -150614 -137637 -31859 116716 145744 221021 239723 260929 54933 29795 120358 130840
14374 130840 172153 224682 412109 276910 160577 211599 336046 365205 175371 -11784
14364 -11784 53644 202479 417060 417169 337482 367911 288185 183904 252481 373237 354441
14353 354441 374551 182713 100661 171783 160456 125288 271401 611336 490067 539716 577601
$$ packed form
14431B0057J18024l7748J323N0318k2529l1893m2597m2755P7974J1455j54451
14420e2822r1528J6965o76O4461K8712j99755P4792m0318P946R7705J15035M2663
14408F3180J10117j05856j37408J19557k6506k4611j3848j8109l0476K5120J07212
14397F8372q0941J31222l0269o7449p9868k408J1058j05369Q2823p9803m762O780
14385a50614J2977J05778J48575K9028P5277J8702K1206k05996k5138R0563J0482
14374A30840M1313N2529J87427j35199j16333N1022J24447K9159j89834j87155
14364a1784O5428J48835K14581J09p9687L0429p9726j04281O8577J20756j8796
14353C54441K0110j91838q2052P1122j1327l5168J46113L39935j21269M9649L7885
$$ plain form
14342 577601 482008 397956 464185 425022 552756 660095 446951 344345 465897 351882
14332 351882 113963 166671 292824 124397 11849 31208 47158 19866 78818 293491
14322 293491 446823 388771 320118 209509 196575 94209 155403 219111 103701 147050 280827
14311 280827 383132 457637 319584 335266 537471 529933 457396 502477 513872 624868 385412
14300 385412 395072 412122 449715 522050 675967 668225 710987 741536 651533 654651 774034 790866
14288 790866 716192 464261 418472 508907 424797 572652 768255 792751 938496 911268 797827
14277 797827 961537 1093216 1204606 1279090 1192143 1079595 1046703 1005185 816192 735381
14267 735381 717893 590717 596451 484295 427831 629534 728623 610787 393170 460473 639562
$$ packed form
14342E77601r5593q4052O6229l9163J27734J07339k13144j02606J21552j14015
14332C51882k37919N2708J26153j68427j12548J9359J5950k7292N8952K14673
14322B93491J53332n8052o8653j10609j2934j02366O1194O3708j15410M3349J33777
14311B80827J02305P4505j38053J5682K02205p538p2537M5081J1395J10996k39456
14300C85412R660J7050L7593P2335J53917p742M2762L0549r0003L118J19383J6832
14288G90866p4674k51931m5789R0435q4110J47855J95603K4496J45745k7228j13441
14277G97827J63710J31679J11390P4484q6947j12548l2892m1518j88993q0811
14267G35381j7488j27176N734j12156n6464K01703R9089j17836k17617O7303J79089
$$ plain form
14256 639562 736107 712514 723787 688546 737683 755545 615924 531834 416957 317900 303889
14245 303889 312451 273414 488119 658305 706405 879568 980729 900264 602094 590669 495499
14234 495499 341096 404583 393562 410030 572302 423182 177709 237119 368975 436602
14224 436602 451040 479511 461315 448009 599555 561707 516637 490654 378531 266741 269927
14213 269927 368649 457748 652748 620474 487945 328745 349076 277820 353625 387340 235923
14202 235923 188179 145634 283682 378835 341746 246321 206243 293292 210189 151677 295226
14191 295226 420465 503098 482016 332041 339548 289946 252904 356515 98885 13918 61088
14180 61088 152779 447321 465683 395358 344989 440706 339461 190115 353741 236416 70815
$$ packed form
14256F39562R6545k3593J1273l5241M9137J7862j39621q4090j14877r9057j4011
14245C03889Q562l9037K14705J70186M8100J73163J01161q0465k98170j1425r5170
14234D95499j54403O3487j1021J6468J62272j49120k45473N9410J31856O7627
14224D36602J4438K8471j8196j3306J51546l7848m5070k5983j12123j11790L186
14213B69927R8722Q9099J95000l2274j32529j59200K0331p1256P5805L3715j51417
14202B35923m7744m2545J38048R5153l7089r5425m0078Q7049q3103n8512J43549
14191B95226J25239Q2633k1082j49975P507m9602l7042J03611k57630q4967M7170
14180F1088R1691K94542J8362p0325n0369R5717j01245j49346J63626j17325j65601
$$ plain form
14169 70815 -57336 -155440 -90040 14664 5076 165001 274275 174909 168704 210486 258346
14158 258346 288570 340689 251188 295154 227187 110287 224363 287549 201995 233705 177366
14147 177366 -125005 -39252 161253 292885 354052 338144 391831 149164 94067 80381 160269
14136 160269 310267 177864 164945 253538 253744 350554 235237 204469 473714 481528 475285
14125 475285 459497 343453 186370 140011 202930 147156 241167 342659 408571 458082 284317
14114 284317 153704 207752 201329 204541 162480 364822 524565 560839 577676 594563 528341
14103 528341 392258 440802 281021 39233 54556 -12342 149543 130937 98318 191159 212736
14092 212736 126708 72021 86164 200001 204733 52631 56194 206292 311964 433368 469032
$$ packed form
14169G0815j28151r8104O5400J04704r588J59925J09274r9366o205M1782M7860
14158B58346L0224N2119q9501M3966o7967j16900J14076O3186q5554L1710n6339
14147A77366l02371Q5753K00505J31632O1167j5908N3687k42667n5097j3686P9888
14136A60269J49998j32403j2919Q8593K06R6810j15317l0768K69245P814o243
14125D75285j5788j16044j57083m6359O2919n5774R4011J01492O5912M9511j73765
14114B84317j30613N4048o423L212m2061K02342J59743L6274J6837J6887o6222
14103E28341j36083M8544j59781k41788J5323o6898J61885j8606l2619R2841K1577
14092B12736q6028n4687J4143J13837M732j52102L563J50098J05672J21404L5664
$$ plain form
14081 469032 328959 197645 176719 94969 -105213 -175567 -186624 -186562 -141918 15061 -10779
14070 -10779 14409 75524 169237 182289 277676 -19638 -207418 -24903 264529 243556 218609
14059 218609 176964 231239 214650 36859 20543 154211 178210 97588 169007 236543 194373
14048 194373 373439 515193 513743 365937 401802 392759 307274 343921 630917 754302 606800
14037 606800 298568 75119 122112 198746 266630 277942 264724 95968 119047 129134 207785
14026 207785 248717 224160 229912 124320 187315 310019 312524 387755 518452 385844 328911
14015 328911 380590 283866 266817 254178 218827 418413 522752 288521 98496 179555 313265
14004 313265 507716 546037 439363 515023 518705 410302 420077 582460 415620 416013 635785
$$ packed form
14081D69032j40073j31314k0926q1750k00182p0354j1057O2M4644J56979k5840
14070a0779K5188O1115R3713J3052R5387k97314j87780J82515K89432k0973k4947
14059B18609m1645N4275j6589j77791j6316J33668K3999q0622P1419O7536m2170
14048A94373J79066J41754j450j47806L5865r043q5485L6647K86996J23385j47502
14037F06800l08232k23449M6993P6634O7884J1312j3218j68756K3079J0087P8651
14026B07785M0932k4557N752j05592O2995J22704K505P5231J30697j32608n6933
14015C28911N1679r6724j7049j2639l5351J99586J04339k34231j90025Q1059J33710
14004C13265J94451L8321j06674P5660L682j08403R775J62383j66840L93K19772
$$ plain form
13993 635785 533485 505259 562133 553918 555409 644933 497754 375421 349511 339562 245918
13982 245918 170206 184041 232203 275439 287746 242147 336170 497101 526629 321706 262616
13971 262616 195275 139579 207977 222646 96058 32732 6121 116346 122993 134986 148918
13960 148918 246464 236410 252362 542521 569607 556415 598963 416219 364752 351907 288114
13949 288114 296946 462574 436239 654015 757234 792349 542370 291801 199927 233960 326939
13938 326939 213842 165244 319512 447503 527854 417008 378270 315571 331879 455825
13928 455825 464980 538171 520299 478766 567122 455073 275699 349819 344857 376382 328802
13917 328802 307591 185865 219552 259899 273064 287577 329659 304586 216203 160656 221589
$$ packed form
13993F35785j02300k8226N6874q215J491Q9524j47179j22333k5910r949r3644
13982B45918p5712J3835M8162M3236J2307m5599R4023J60931K9528k04923n9090
13971B62616o7341n5696O8398J4669j26588o3326k6611J10225O647J1993J3932
13960A48918R7546j0054J5952K90159K7086j3192M2548j82744n1467j2845o3793
13949B88114Q832J65628k6335K17776J03219L5115k49979k50569r1874L4033R2979
13938C26939j13097m8598J54268J27991Q0351j10846l8738o2699J6308J23946
13928D55825R155P3191j7872m1533Q8356j12049j79374P4120m962L1525m7580
13917C28802k1211j21726L3687M0347J3165J4513M2082k5073q8383n5547O0933
$$ plain form
13906 221589 463112 359396 214790 140053 29804 231209 211881 175825 345252 561895
13896 561895 655966 571564 585427 718423 683870 740511 718200 661480 543275 571015 593099
13885 593099 579427 529975 521955 610100 677460 623842 726871 777461 526056 480860 576718
13874 576718 636928 589264 743384 833972 653287 724650 768655 586995 673573 642304 644683
13863 644683 756183 732414 701301 761749 676294 631771 736931 785462 697793 513596 543641
13852 543641 545042 654634 955371 1113344 816447 708733 982549 924678 787568 615089
13842 615089 586954 699008 802112 819118 877657 644187 593313 821088 911083 888703 760790
13831 760790 689587 742483 759313 884186 892004 926068 922017 678084 653659 684343 732704
$$ packed form
13906B21589K41523j03716j44606p4737j10249K01405j9328l6056J69427K16643
13896E61895R4071q4402J3863J32996l4553N6641k2311n6720j18205K7740K2084
13885E93099j3672m9452q020Q8145O7360n3618J03029N0590k51405m5196R5858
13874E76718O0210m7664J54120R0588j80685P1363M4005j81660Q6578l1269K379
13863F44683J11500k3769l1113O0448q5455m4523J05160M8531q7669j84197L0045
13852E43641J401J09592L00737J57973k96897j07714K73816n7871j37110j72479
13842F15089k8135J12054J03104J7006N8539k33470n0874K27775Q9995k2380j27913
13831G60790p1203N2896J6830J24873P818L4064m051k43933k4425L0684M8361
$$ plain form
13820 732704 909380 882055 742576 695865 764164 935493 770306 771812 855229 879207 901113
13809 901113 900349 1070198 898819 809777 964969 1112884 1052256 908862 667152 684455 656478
13798 656478 552281 568996 738271 923714 743807 607240 662719 849965 914877 844474
13788 844474 857618 1013226 1064917 794643 758562 827938 872051 1054634 1099436 1076051 1120007
13777 1120007 1214488 1289359 1391616 1181838 1108273 1157118 1115571 1040537 979306 887856 898514
13766 898514 1034158 939750 919722 845957 745882 846760 1054987 1049670 1022811 1168848 1282202
13755 1282202 1429400 1274682 955448 787727 932023 972853 934964 1154895 1120564 1057821
13745 1057821 920227 944695 942910 1049961 1050739 1138302 1157490 1197854 1080722 1085310 1101762
$$ packed form
13820G32704J76676k7325j39479m6711O8299J71329j65187J506Q3417K3978K1906
13809I01113p64J69849j71379q9042J55192J47915o0628j43394k41710J7303k7977
13798F56478j04197J6715J69275J85443j79907j36567N5479J87246O4912p0403
13788H44474J3144J55608N1691k70274l6081O9376M4113J82583M4802k3385M3956
13777A120007R4481P4871J02257k09778p3565M8845m1547p5034o1231r1450J0658
13766H98514J35644r4408k0028p3765j00075J00878K08227n317k6859J46037J13354
13755A282202J47198j54718l19234j67721J44296M0830l7889K19931l4331o2743
13745A057821j37594K4468j785J07051P78Q7563J9188M0364j17132M588J6452
$$ plain form
13734 1101762 1102234 1058256 1067998 1219799 1130027 1090731 1068695 970490 956795 1108731 1210985
13723 1210985 1140203 1223404 1277398 1348164 1399486 1318675 1096021 1149846 1077426 1017025 967373
13712 967373 1087612 1188211 1344540 1216416 1153743 1214359 1434066 1248714 1067546 1129078
13702 1129078 1451320 1623161 1681354 1733008 1576117 1497277 1537861 1326397 1323542 1477267
13692 1477267 1425330 1400993 1302076 1345658 1496290 1626830 1600162 1602326 1583060 1678175 1730079
13681 1730079 1761929 1743383 1642341 1537448 1394720 1401960 1552654 1747521 1803740 1818642
13671 1818642 1768184 1826282 1724236 1711604 1780525 2019821 2150700 1969176 1709348 1805918
13661 1805918 1810663 1646520 1678718 1911342 1852647 1841189 1939585 2189879 2214273 2334249 2453795
$$ packed form
13734A101762M72m3978R742J51801q9772l9296k2036r8205j3695J51936J02254
13723A210985p0782Q3201N3994P0766N1322q0811k22654N3825p2420o0401m9652
13712I67373J20239J00599J56329j28124o2673O0616K19707j85352j81168O1532
13702A129078L22242J71841N8193N1654j56891p8840M0584k11464k855J53725
13692A477267n1937k4337r8917M3582J50632J30540k6668K164j9266R5115N1904
13681A730079L1850j8546j01042j04893j42728P240J50694J94867N6219J4902
13671A818642n0458N8098j02046j2632O8921K39296J30879j81524k59828R6570
13661A805918M745j64143L2198K32624n8695j1458R8396K50294K4394J19976J19546
$$ plain form
13650 2453795 2657164 2717682 2526316 2694997 2723576 2917321 2990786 3101345 3117276 2882963
13640 2882963 2635072 2696700 2756455 2692215 2606238 2585568 2649523 2563761 2665764 2689852 2608206
13629 2608206 2562389 2652576 2639507 2688536 2659666 2542404 2639152 2672268 2679461 2664617 2865034
13618 2865034 2841130 2752467 2742505 2878180 2761189 2717857 2714600 2777621 2776237 2935122 2950280
13607 2950280 3063330 3022627 3004221 3000808 2975573 3088011 3016673 3159918 3249545 3196392 3224894
13596 3224894 3297897 3282866 3209438 3417456 3504829 3490363 3485394 3500190 3608118 3794040 3983438
13585 3983438 3975512 3907503 3825107 3808933 3818004 3838581 3933640 3766332 3838850 3895064 4090034
13574 4090034 4072532 4117625 4100448 4037713 4189171 4245072 4530639 4787927 4621187 4473451
$$ packed form
13650B453795K03369O0518j91366J68681K8579J93745P3465J10559J5931k34313
13640B882963k47891O1628N9755o4240q5977k0670O3955q5762J02003K4088q1646
13629B608206m5817R0187j3069M9029k8870j17262R6748L3116P193j4844K00417
13618B865034k3904q8663r962J35675j16991m3332l257O3021j384J58885J5158
13607B950280J13050m0703j8406l413k5235J12438p1338J43245Q9627n3153K8502
13596C224894P3003j5031p3428K08018Q7373j4466m969J4796J07928J85922J89398
13585C983438p926o8009q2396j6174R071K0577R5059j67308P2518N6214J94970
13574D090034j7502M5093j7177o2735J51458N5901K85567K57288j66740j47736
$$ plain form
13564 4473451 4377488 4363082 4524326 4500243 4565378 4866363 4854766 4727538 4828437 4970403
13554 4970403 4972516 5048314 5062678 5039656 5061600 5076796 5294160 5380130 5341102 5299485 5441541
13543 5441541 5567691 5668941 5876170 5956321 6087279 6266914 6187350 6077824 6056583 6231895
13533 6231895 6505072 6588300 6669884 6705860 6775650 6718392 6821154 6975924 7166704 7411615
13523 7411615 7627656 7872576 7856639 7804354 7979953 8138694 8228167 8418834 8495241 8511150
13513 8511150 8596880 8742543 8996047 9054085 9189852 9418826 9572764 9766705 9892653 9784013
13503 9784013 9725021 10063625 10370767 10492372 10713115 10964307 11029011 10986377 11052728 11383962
13493 11383962 11434868 11546751 11756139 12071045 12376136 12562452 12711834 13103222 13462829
$$ packed form
13564D473451r5963j4406J61244k4083O5135L00985j1597j27228J00899J41966
13554D970403K113P5798J4364k3022K1944J5196K17364Q5970l9028m1617J42056
13543E441541J26150J01250K07229Q0151J30958J79635p9564j09526k1241J75312
13533F231895K73177Q3228Q1584L5976O9790n7258J02762J54770J90780K44911
13523G411615K16041K44920j5937n2285J75599J58741Q9473J90667P6407J5909
13513H511150Q5730J45663K53504N8038J35767K28974J53938J93941J25948j08640
13503I784013n8992L38604L07142J21605K20743K51192O4704m2634O6351L31234
13493A1383962N0906J11883K09388L14906L05091J86316J49382L91388L59607
$$ plain form
13484 13462829 13733905 13861809 14087063 14303835 14503908 14822879 15080634 15410070 15740273
13475 15740273 15912170 16191699 16482466 16907538 17321076 17625601 17830566 18185855 18560258
13466 18560258 18937439 19339512 19882929 20140492 20449769 20910568 21502198 22130236 22595643
13457 22595643 23064999 23504800 24041498 24578682 24985278 25500877 25920461 26509784 27348154
13448 27348154 27898513 28423345 28966772 29556504 30263600 30845196 31305355 31855184 32590730
13439 32590730 33368571 33941951 34683679 35514492 36507532 37434074 38365865 39032085 40017067
13430 40017067 40848851 41650862 42577489 43554390 44454990 45382288 46348608 47403066 48255314
13421 48255314 49006764 50031674 51097037 51999658 52814905 53927661 55067112 56196001
$$ packed form
13484A3462829K71076J27904K25254K16772K00073L18971K57755L29436L30203
13475A5740273J71897K79529K90767M25072M13538L04525K04965L55289L74403
13466A8560258L77181M02073N43417K57563L09277M60799N91630O28038M65407
13457B2595643M69356M39801N36698N37184M06596N15599M19584N89323Q38370
13448B7348154N50359N24832N43427N89732P07096N81596M60159N49829P35546
13439C2590730P77841N73380P41728Q30813R93040R26542R31791O66220R84982
13430D0017067Q31784Q02011R26627R76901R00600R27298R66320J054458Q52248
13421D8255314P51450J024910J065363R02621Q15247J112756J139451J128889
$$ plain form
13413 56196001 57346318 58377868 59278104 60033469 60742622 61501355 62305200 62952699 63595732
13404 63595732 64403103 65075931 65749820 66476916 67104615 67629462 68092977 68478853 68663486
13395 68663486 68681347 68749908 68956912 69003882 69102902 69272524 69091781 68781182 68437552 68022815
13385 68022815 67602026 67193164 66927092 66431049 65720954 65128741 64536102 63779098 62872707
13376 62872707 61940187 60996983 60161820 59408095 58567642 57451775 56607166 55702850 54811980
13367 54811980 53726738 52760753 51875947 50973908 50323121 49651297 48634180 47597632 46582467
13358 46582467 45483221 44558350 43856749 42989770 41800590 40788296 40098515 39456252 38531196
13349 38531196 37654992 36992007 36097070 35339279 34606361 33892497 33076855 32344378 31600983
$$ packed form
13413E6196001J150317J031550R00236P55365P09153P58733Q03845O47499O43033
13404F3595732Q07371O72828O73889P27096O27699N24847M63515L85876J84633
13395F8663486J7861O8561K07004M6970R9020J69622j80743l10599l43630m14737
13385F8022815m20789m08862k66072m96043p10095n92213n92639p57004r06391
13376F2872707r32520r43204q35163p53725q40453j115867q44609r04316q90870
13367E4811980j085242r65985q84806r02039o50787o71824j017117j036548j015165
13358D6582467j099246r24871p01601q66979j189180j012294o89781o42263r25056
13349C8531196q76204o62985q94937p57791p32918p13864q15642p32477p43395
$$ plain form
13340 31600983 30780997 30076588 29458188 28946717 28362733 27965593 27372926 26669719 26046869
13331 26046869 25371452 24810742 24413583 23970501 23387229 22827126 22265528 21766283 21205908
13322 21205908 20806011 20542781 20217764 19713487 19308101 19040414 18691972 18392009 18128390
13313 18128390 17800601 17407690 17090109 16952382 16607305 16145941 15746646 15569268 15383966
13304 15383966 14887745 14726743 14657196 14430092 14157073 13919967 13690775 13279858 13147652
13295 13147652 13013052 12798303 12565235 12343138 12016723 11725896 11518730 11367209 11206701
13286 11206701 11054727 10978127 11005202 10675144 10296912 10113330 9908004 9832625 9796330 9711188
13276 9711188 9666396 9659167 9533193 9240492 8878610 8706754 8505658 8376268 8519279 8473894
$$ packed form
13340C1600983q19986p04409o18400n11471n83984l97140n92667p03207o22850
13331B6046869o75417n60710l97159m43082n83272n60103n61598m99245n60375
13322B1205908l99897k63230l25017n04277m05386k67687l48442k99963k63619
13313A8128390l27789l92911l17581j37727l45077m61364l99295j77378j85302
13304A5383966m96221j61002o9547k27104k73019k37106k29192m10917j32206
13295A3147652j34600k14749k33068k22097l26415k90827k07166j51521j60508
13286A1206701j51974p6600K7075l30058l78232j83582k05326p5379l6295q5142
13276I711188m4792p229j25974k92701l61882j71856k01096j29390J43011m5385
$$ plain form
13266 8473894 8210472 8094179 8027172 7937939 7786650 7691709 7573513 7319564 7295841 7184991
13256 7184991 7138311 7293413 7338645 7420404 7270887 6965803 6665368 6631913 6607868 6319359
13246 6319359 6453629 6458825 6551811 6374990 6199387 6156639 6123147 6098073 5903480 5720239
13236 5720239 5596447 5318781 5044950 5182548 5197680 5126201 5066547 5124470 5216044 5067624
13226 5067624 4855237 4684262 4616539 4633051 4562159 4531815 4631091 4710270 4446668 4375490 4403293
13215 4403293 4300680 4140843 4117402 4350807 4313718 4124972 4241672 4133553 4043836 3998058
13205 3998058 3863216 3815478 3812836 3745421 3783152 3925558 3918373 3776687 3706773 3489878 3357123
13194 3357123 3610324 3596881 3645991 3530482 3433820 3300834 3191308 3295258 3465976 3385905
$$ packed form
13266H473894k63422j16293o7007q9233j51289r4941j18196k53949k3723j10850
13256G184991m6680J55102M5232Q1759j49517l05084l00435l3455k4045k88509
13246F319359J34270N196R2986j76821j75603m2748l3492k5074j94593j83241
13236E720239j23792k77666k73831J37598J5132p1479n9654N7923R1574j48420
13226E067624k12387j70975o7723J6512p0892l0344R9276P9179k63602p1178K7803
13215D403293j02613j59837k3441K33405l7089j88746J16700j08119q9717m5778
13205C998058j34842m7738k642o7415L7731J42406p185j41686o9914k16895j32755
13194C357123K53201j3443M9110j15509r6662j32986j09526J03950J70718q0071
$$ plain form
13184 3385905 3219000 3130288 3136407 3072887 3074358 3017069 2853212 2885346 3019475 2916880 2865513
13173 2865513 3007855 3241129 3101614 3133947 2989579 2784746 2730054 2703409 2712425 2658034
13163 2658034 2735343 2943383 2866530 2756129 2424111 2264792 2465698 2552242 2415132 2350165
13153 2350165 2493997 2533270 2543323 2572670 2484947 2562890 2701598 2753735 2734334 2758124 2976066
13142 2976066 3171064 3181533 3074055 2906555 2758861 2607235 2565194 2606797 2738776 2925415
13132 2925415 2601167 2231699 2243813 2420579 2362821 2194583 2348343 2433089 2368867 2201670
13122 2201670 2040004 1788242 1827138 1831489 1790300 1831290 1976681 2018002 1789332 1726093 1717994
13111 1717994 1684069 1730372 1813880 1853846 1943679 1914909 1677215 1524112 1749389 1729978 1655267
$$ packed form
13184C385905j66905q8712O119o3520J471n7289j63857L2134J34129j02595n1367
13173B865513J42342K33274j39515L2333j44368k04833n4692k6645R016n4391
13163B658034P7309K08040p6853j10401l32018j59319K00906Q6544j37110o4967
13153B350165J43832L9273J0053K9347q7723P7943J38708N2137j9401K3790K17942
13142B976066J94998J0469j07478j67500j47694j51626m2041M1603J31979J86639
13132B925415l24248l69468J2114J76766n7758j68238J53760Q4746o4222j67197
13122B201670j61666k51762L8896M351m1189M0990J45391M1321k28670o3239q099
13111A717994l3925M6303Q3508L9966Q9833k8770k37694j53103K25277j9411p4711
$$ plain form
13100 1655267 1745080 1567287 1352754 1465754 1465837 1575229 1603851 1535429 1508069 1302586 1194595
13089 1194595 1275019 1536894 1465886 1516152 1517668 1557893 1594724 1478067 1390704 1322239 1314691
13078 1314691 1154028 1021790 1080254 1197633 1064518 1032366 1151272 1211782 1176324 1286119
13068 1286119 1259971 1070886 1018571 1038892 1076878 1129834 1292662 1377466 1341665 1331249 1214395
13057 1214395 1042124 1123723 1329578 1389301 1286190 1244764 1306455 1256543 1125075 1085628
13047 1085628 983408 1102690 1167907 1202339 1091044 957705 882095 971185 1066262 1084253
13037 1084253 1080876 1124082 1103212 1080876 1092559 1065672 1023299 892730 850832 820666 812092
13026 812092 826948 872820 877411 1045479 1148596 1209353 1164944 1037060 915931 828413 909650
$$ packed form
13100A655267Q9813j77793k14533J13000Q3J09392K8622o8422k7360k05483j07991
13089A194595Q0424K61875p1008N0266J516M0225L6831j16657q7363o8465p548
13078A314691j60663j32238N8464J17379j33115l2152J18906O0510l5458J09795
13068A286119k6148j89085n2315K0321L7986N2956J62828Q4804l5801j0416j16854
13057A214395j72271Q1599K05855N9723j03111m1426O1691m9912j31468l9447
13047A085628j02220J19282O5217L4432j11295j33339p5610Q9090R5077J7991
13037A084253l377M3206k0870k2336J1683k6887m2373j30569m1898l0166q574
13026H12092J4856M5872M591J68068J03117O0757m4409j27884j21129q7518Q1237
$$ plain form
13015 909650 869431 901089 799621 923516 824712 771284 788460 952494 1023724 1034249 1062408
13004 1062408 1038392 880396 760840 823712 732923 900230 1028240 1170519 1160622 917186
12994 917186 867289 958864 1078386 1140333 1105497 1120804 1160678 1005592 912475 742382 529223
12983 529223 394007 429446 550051 698761 454806 287821 374368 440932 584028 742095
12973 742095 639815 552946 608354 694709 895862 945288 1012699 1024001 866548 673350 619233
12962 619233 516006 353544 311021 348693 560411 630346 796710 790970 924256 851445 792512
12951 792512 956666 983682 971590 864418 569677 445225 739926 847879 717394 565120
12941 565120 659871 566577 459165 474134 550070 812987 755361 483483 555906 679146 722526
$$ packed form
13015I09650m0219L1658j01468J23895r8804n3428J7176J64034P1230J0525K8159
13004A062408k4016j57996j19556O2872r0789J67307J28010J42279r897k43436
12994I17186m9897R1575J19522O1947l4836J5307L9874j55086r3117j70093k13159
12983E29223j35216L5439J20605J48710k43955j66985Q6547O6564J43096J58067
12973G42095j02280q6869N5408Q6355K01153M9426O7411J1302j57453j93198n4117
12962F19233j03227j62462m2523L7672K11718O9935J66364n740J33286p2811n8933
12951G92512J64154K7016j2092j07172k94741j24452K94701J07953j30485j52274
12941E65120R4751r3294j07412J4969P5936K62917n7626k71878P2423J23240M3380
$$ plain form
12930 722526 689555 649404 559937 414293 279680 221673 192217 265019 521718 574021 455077
12919 455077 421761 456797 385027 250145 393975 495874 507465 411985 437868 526348 702855
12908 702855 773748 782538 699296 486028 480177 526369 522072 433961 423375 509894 577380 636512
12896 636512 588994 397484 379455 489073 532314 473645 379915 298821 263740 378476 386241
12885 386241 384345 572064 716222 593390 471627 429141 570031 597427 526629 369800
12875 369800 291860 306589 324731 311978 419786 472133 483771 506422 332172 207822 3639
12864 3639 32605 254672 295190 274828 361325 278690 282211 290294 363497 402827 379684 283401
12852 283401 40842 5218 100862 194993 290943 278231 336613 339279 391216 482002 454107
$$ packed form
12930G22526l2971m0151q9467j45644j34613n8007k9456P2802K56699N2303j18944
12919D55077l3316L5036p1770j34882J43830J01899J1591r5480K5883Q8480J76507
12908G02855P0893Q790q3242k13268n851M6192m297q8111j0586Q6519O7486N9132
12896F36512m7518j91510j8029J09618M3241n8669r3730q1094l5081J14736P765
12885C86241j896J87719J44158j22832j21763m2486J40890K7396p0798j56829
12875C69800p7940J4729J8142j2753J07808N2347J1638K2651j74250j24350k04183
12864C639K8966K22067M0518k0362Q6497q2635L521Q083P3203L9330k3143r6283
12852B83401k42559l5624R5644R4131R5950j2712N8382K666N1937R0786k7895
$$ plain form
12841 454107 362791 279485 428572 561828 658433 702960 481759 214046 168292 249133 151069
12830 151069 164609 253502 243449 297006 239537 137340 306972 240457 163661 293722 316814
12819 316814 177728 -66266 4234 111006 191859 119733 124644 139596 300071 318425 155162
12808 155162 243801 347778 144924 141090 284270 294242 374991 341139 332855 483896 481189
12797 481189 463985 435953 422673 496114 438135 286858 244897 96817 -19997 107438 238150
12786 238150 282916 377019 354058 230892 188636 275801 289132 289427 144065 -92133 -30404
12775 -30404 110566 122579 229711 318079 263987 270866 104376 189562 107002 254399 376798
12764 376798 290847 256622 258693 262467 335677 437316 521177 404262 321825 364999 376304
$$ packed form
12841D54107r1316q3306J49087J33256R6605M4527k21201k67713m5754Q0841r8064
12830A51069J3540Q8893j0053N3557n7469j02197J69632o6515p6796J30061K3092
12819C16814j39086k43994P0500J06772Q0853p2126M911J4952J60475J8354j63263
12808A55162Q8639J03977k02854l834J43180R972Q0749l3852q284J51041k707
12797D81189j7204k8032j3280P3441n7979j51277m1961j48080j16814J27435J30712
12786B38150M4766R4103k2961j23166m2256Q7165J3331K95j45362k36198O1729
12775c0404J40970J2013J07132Q8368n4092O879j66490Q5186q2560J47397J22399
12764C76798q5951l4225K071L774P3210J01639Q3861j16915q2437M3174J1305
$$ plain form
12753 376304 354004 173574 25780 111375 145051 87725 53992 173731 195497 261568 319844
12742 319844 357954 237741 90892 67790 -110580 -177489 -124218 -16883 15966 126290
12732 126290 266788 401511 335337 262588 424160 593727 605016 654099 566039 423632
12722 423632 173016 49245 146588 181504 297380 324151 230664 204284 207997 277246 446673
12711 446673 532463 527402 383359 273015 341330 442914 589656 548466 281456 115093
12701 115093 2394 142780 209689 149549 173136 121971 149365 278631 237907 153095 239512
12690 239512 246581 148023 251272 210430 131840 71715 54597 123002 206353 214320 245880 201920
12678 201920 287454 261854 119001 41717 129583 297530 321190 368907 433025 248301 187521
$$ packed form
12753C76304k2300j80430j47794Q5595L3676n7326l3733J19739K1766O6071N8276
12742C19844L8110j20213j46849k3102j78370o6909N3271J07335L2849J10324
12732A26290J40498J34723o6174p2749J61572J69567J1289M9083q8060j42407
12722D23632k50616j23771R7343L4916J15876K6771r3487k6380L713O9249J69427
12711D46673Q5790n061j44043j10344O8315J01584J46742m1190k67010j66363
12701A15093j12699J40386O6909o0140K3587n1165K7394J29266m0724q4812Q6417
12690B39512P069r8558J03249m0842p8590o0125j7118O8405Q3351P967L1560m3960
12678B01920Q5534k5600j42853p7284Q7866J67947K3660M7717O4118j84724o0780
$$ plain form
12667 187521 253137 271825 223604 9037 -40533 -13488 15777 -60861 -22995 195393 292526
12656 292526 149823 97028 163630 249404 373873 323921 260379 28025 78077 167175 451126
12645 451126 651206 577559 395333 389529 374558 248509 286151 397376 451441 397368 317999
12634 317999 399638 390746 328330 233516 231288 390069 255937 129045 222761 171001 143975
12623 143975 133069 97486 30031 -13252 -167792 -13495 190826 176569 118504 -2734 -83646
12612 -83646 -138993 43731 264992 179108 28035 113625 53194 7292 153959 200101 207197
12601 207197 199469 210115 419462 460065 361864 234537 204450 248880 252617 336686 298966
12590 298966 318491 294321 308311 308010 427635 334603 107717 45560 213295 210076 174916
$$ packed form
12667A87521O5616J8688m8221k14567m9570K7045K9265p6638L7866K18388R7133
12656B92526j42703n2795O6602Q5774J24469m9952o3542k32354N0052Q9098K83951
12645D51126K00080p3647j82226n804j4971j26049L7642J11225N4065n4073p9369
12634C17999Q1639q892o2416r4814k228J58781j34132j26892R3716n1760k7026
12623A43975j0906l5583o7455m3283j54540J54297K04321j4257n8065j21238q0912
12612h3646n5347J82724K21261q5884j51073Q5590o0431m5902J46667M6142P096
12601B07197p728J0646K09347M0603r8201j27327l0087M4430L737Q4069l7720
12590B98966J9525k4170J3990l01J19625r3032k26886o2157J67735l219l5160
$$ plain form
12579 174916 327286 383447 359058 310901 337489 509735 388561 140678 -78194 -74103 -17161
12568 -17161 -129415 -44752 31068 68256 143133 131721 155596 288255 260702 65446 22287
12557 22287 36053 109435 88485 111898 295590 222573 371757 354825 347151 421418 339356
12546 339356 276441 178103 84726 -45461 -38444 132564 152032 124627 194661 143948 200064
12535 200064 339135 372542 288572 184446 66532 -61486 119692 164414 53876 190
12525 190 -20000 157490 179465 275143 272833 141698 116934 131343 106808 151428 13375 41109
12513 41109 14447 -124243 122297 245691 94784 30541 -98171 -250106 -249900 -69294 -2121
12502 -2121 163942 309460 117860 115012 99749 96335 17873 92385 146345 139862 211202 235577
$$ packed form
12579A74916J52370N6161k4389m8157K6588J72246j21174k47883k18872M091N6942
12568a7161j12254Q4663P5820L7188P4877j1412K3875J32659k7553j95256m3159
12557B2287J3766P3382k0950K3413J83692p3017J49184j6932p674P4267q2062
12546C39356o2915r8338r3377j30187P017J71008J9468k7405P0034n0713N6116
12535B00064J39071L3407q3970j04126j17914j28018J81178M4722j10538n3686
12525A90k0190J77490K1975R5678k310j31135k4764J4409k4535M4620j38053K7734
12513D1109k6662j38690K46540J23394j50907o4243j28712j51935K06J80606O7173
12502b121J66063J45518j91600k848j5263l414p8462P4512N3960o483P1340K4375
$$ plain form
12490 235577 350198 252641 222139 195042 149886 30804 39885 103712 38944 -3320 187859
12479 187859 290096 104044 95990 80525 283734 352387 9812 -60996 22430 55823 95703
12468 95703 81529 -74681 -118329 -119776 -242342 -160090 23908 -12668 -89752 -54094 -26147
12457 -26147 -61024 -22939 220386 307298 159948 118290 49281 170933 283031 138486 119275
12446 119275 220210 181928 104617 116251 233591 197863 168278 155315 232490 248743 176086
12435 176086 70996 -64247 -157669 5340 39787 -131137 -135469 -4568 35070 105765 126837
12424 126837 112541 14302 88453 195283 228903 50849 180631 394306 442627 323590
12414 323590 178011 88724 35220 9482 72815 114978 165388 57520 -31382 30829 127077
$$ packed form
12490B35577J14621r7557l0502k7097m5156j19082R081O3827o4768m2264J91179
12479A87859J02237j86052q054j5465K03209O8653l42575p0808Q3426L3393L9880
12468I5703j4174j56210m3648j447j22566Q2252J83998l6576p7084L5658K7947
12457b6147l4877L8085K43325Q6912j47350m1658o9009J21652J12098j44545j9211
12446A19275J00935l8282p7311J1634J17340l5728k9585j2963P7175J6253p2657
12435A76086j05090j35243r3422J63009L4447j70924m332J30901L9638P0695K1072
12424A26837j4296r8239P4151J06830L3620j78054J29782K13675M8321j19037
12414C23590j45579q9287n3504k5738O3333M2163N0410j07868q8902O2211R6248
$$ plain form
12403 127077 255532 286744 202523 73264 81394 30135 44736 129025 17463 -109560 -179823
12392 -179823 6064 19661 18114 28489 93797 177398 104307 -27995 -87614 -22502 141477
12381 141477 245700 325355 308485 106672 195290 259813 226778 259777 360168 251557 175009
12370 175009 262575 426142 308885 314121 401878 381152 503567 419722 206910 66071 34326
12359 34326 -174843 -190488 -42788 -28495 -30525 90056 232237 451745 298741 33464
12349 33464 51242 111664 151029 115958 42328 -59408 -184458 -206601 -195894 -214790 -283504
12338 -283504 -164736 -20908 150486 174220 116337 -60447 -7515 -9490 -11825 32478 15717
12327 15717 5076 -153714 -193697 -26880 203338 306993 214501 60882 -136249 -216090
$$ packed form
12403A27077J28455L1212q4221j29259Q130n1259J4601Q4289j11562j27023p0263
12392a79823J85887J3597j547J0375O5308Q3601p3091j32302n9619O5112J63979
12381A41477J04223P9655j6870k01813Q8618O4523l3035L2999J00391j08611p6548
12370A75009Q7566J63567j17257N236Q7757k0726J22415q3845k12812j40839l1745
12359C4326k09169j5645J47700J4293k030J20581J42181K19508j53004k65277
12349C3464J7778O0422L9365l5071p3630j01736j25050k2143J0707j8896o8714
12338b83504J18768J43828J71394K3734n7883j76784N2932j975k335M4303j6761
12327A5717j0641j58790l9983J66817K30218J03655r2492j53619j97131p9841
$$ plain form
12317 -216090 -188788 75665 190638 255255 191259 97815 -11844 73455 124740 145193 264426
12306 264426 202823 172784 179787 131487 67948 -5626 -65016 -94453 -49528 101821 244657
12295 244657 198775 -24592 52080 92992 86350 105444 116211 84232 61345 35928 47552
12284 47552 -65648 -215007 -179756 -141225 -213251 -93994 43659 38851 -7888 -155730 -44997
12273 -44997 63483 59274 102921 44878 60154 130321 245279 220926 236982 127744 -25418
12262 -25418 -44487 180263 206797 151923 108502 32697 -59530 -149668 -135701 -81124 -164270
12251 -164270 -124008 63623 94844 78474 191769 197940 118667 113602 -122213 -341644 -154496
12240 -154496 -33928 252368 361681 299213 241828 189416 4166 -5649 -35192 -115998 -70979
$$ packed form
12317b16090K7302K64453J14973O4617o3996r3444j09659Q5299N1285K0453J19233
12306B64426o1603l0039P003m8300o3539p3574n9390k9437M4925J51349J42836
12295B44657m5882k23367P6672M0912o642J9094J0767l1979k2887k5417J1624
12284D7552j13200j49359L5251L8531p2026J19257J37653m808m6739j47842J10733
12273d4997J08480m209M3647n8043J5276P0167J14958k4353J6056j09238j53162
12262b5418j9069K24750K6534n4874m3421p5805r2227r0138J3967N4577q3146
12251a64270M0262J87631L1221j6370J13295O171p9273n065k35815k19431J87148
12240a54496J20568K86296J09313o2468n7385n2412j85250r815k9543q0806M5019
$$ plain form
12229 -70979 -25562 12896 -20935 -153973 -204283 -10058 159535 184011 200917 145293 92012
12218 92012 -120423 -273613 -205357 -179988 -344750 -249864 -104936 -95119 157975 316861 449319
12207 449319 428440 262312 251968 17739 -132534 -282782 -136310 -20064 68863 140904
12197 140904 124587 67944 12432 87154 -71595 -102775 -156842 -131471 -135850 -69640 122204
12186 122204 130159 -126083 -233057 45490 150242 127720 159033 141226 114803 79938 2951
12175 2951 -128502 -267642 -425350 -402069 -109830 3369 -887 1077 -103161 12074 56573
12164 56573 50507 -161253 -325232 -358148 -120317 101995 248540 275641 338868 273291 167100
12153 167100 66818 185617 195840 147077 81094 94961 198592 368357 309875 128130
$$ packed form
12229g0979M5417L8458l3831j33038n0310J94225J69593K4476J6906n5624n3281
12218I2012k12435j53190O8256K5369j64762R4886J44928R817K53094J58886J32458
12207D49319k0879j66128j0344k34229j50273j50248J46472J16246Q8927P2041
12197A40904j6317n6643n5512P4722j58749l1180n4067K5371m379O6210J91844
12186A22204P955k56242j06974K78547J04752k2522L1313j7807k6423l4865p6987
12175B951j31453j39140j57708K3281K92239J13199m256J964j04238J15235M4499
12164E6573o066k11760j63979l2916K37831K22312J46545K7101O3227o5577j06191
12153A67100j00282J18799J0223m8763o5983J3867J03631J69765n8482j81745
$$ plain form
12143 128130 123374 39617 -117788 -263785 -345035 -215836 -4877 -115829 15663 66062
12133 66062 81652 277073 168244 -31031 -27026 53351 156687 50115 77973 -21643 -149684
12122 -149684 5453 185945 183356 238100 169640 84958 2450 -173421 -161671 -231063 -145563
12111 -145563 -131756 -211933 -239789 -264086 -64045 -78570 -170208 -108536 20787 45068 -30092
12100 -30092 -38193 151030 118571 27430 84500 172617 222134 123675 160966 153225 64829 85715
12088 85715 34124 91015 70922 136791 17620 49589 124203 227759 309506 73154 184547
12077 184547 128605 -139343 38494 66719 -121322 -155824 31027 38765 46574 -8183 -141209
12066 -141209 -164999 53373 -7888 98879 210111 398457 308743 114869 139129 274203
$$ packed form
12143A28130m756q3757j57405j45997q1250J29199K10959j10952J31492N0399
12133F6062J5590J95421j08829j99275M005Q0377J03336j06572K7858r9616j28041
12122a49684J55137J80492k589N4744o8460q4682q2508j75871J1750o9392Q5500
12111a45563J3807q0177k7856k4297K00041j4525r1638O1672J29323K4281p5160
12100c0092q101J89223l2459r1141N7070Q8117M9517r8459L7291p741q8396K0886
12088H5715n1591N6891k0093O5869j19171L1969P4614J03556Q1747k36352J11393
12077A84547n5942k67948J77837K8225j88041l4502J86851P738P809n4757j33026
12066a41209k3790K18372o1261J06767J11232J88346q9714j93874K4260J35074
$$ plain form
12056 274203 360732 243936 123127 -102206 -219294 -205350 -262551 -382895 -405342 -334043
12046 -334043 -129121 -43547 -105454 -162643 -171755 -96718 -74398 -103319 -90312 -114069 -30645
12035 -30645 55418 218074 59535 3897 61795 183149 221356 262088 203864 234227 280889
12024 280889 155521 66180 19762 22255 -29023 53632 182634 133240 68220 -132595 -208036
12013 -208036 -265510 -83331 -174026 -288229 -276423 -110387 -905 -61266 -94032 24120
12003 24120 22624 248368 196231 -58643 -42090 59011 -25279 -7471 -147624 -213648 -158136
11992 -158136 112409 297180 274280 213888 241141 114504 -20718 -8912 -57219 -42422 -11299
11981 -11299 104718 201226 103728 -14537 -119300 -95927 -7359 -34015 -59154 68729 104190
$$ packed form
12056B74203Q6529j16796j20809k25333j17088J3944n7201j20344k2447P1299
12046c34043K04922Q5574o1907n7189r112P5037K2320k8921J3007k3757Q3424
12035c0645Q6063J62656j58539n5638N7898J21354L8207M0732n8224L0363M6662
12024B80889j25368q9341m6418K493n1278Q2655J29002m9394o5020k00815p5441
12013b08036n7474J82179r0695j14203J1806J66036J09482o0361l2766J18152
12003B4120j496K25744n2137k54874J6553J01101q4290J7808j40153o6024N5512
11992a58136K70545J84771k2900o0392K7253j26637j35222J1806m8307J4797L1123
11981a1299J16017R6508r7498j18265j04763K3373Q8568k6656k5139J27883L5461
$$ plain form
11970 104190 78397 28221 50854 86783 -78350 -102484 167639 305261 -28537 -149147
11960 -149147 -174592 -291347 -167897 37361 80548 24019 -10735 -43820 127562 53139 -133733
11949 -133733 -109909 -3227 -46354 -314179 -318931 -187215 -107691 -136676 -200536 -62704 28740
11938 28740 -11976 69780 191737 137684 -47364 -66742 -127458 -214194 -172690 -64444 23388
11927 23388 116613 76948 -140810 -208764 -89097 -6640 37100 199185 152256 112737 49004
11916 49004 -171843 -312895 -292026 15229 207770 281878 284936 163015 51154 28185 -13508
$$ packed form
11970A04190k5793n0176K2633L5929j65133k4134K70123J37622l33798j20610
11960a49147k5445j16755J23450K05258M3187n6529l4754l3085J71382p4423j86872
11949a33733K3824J06682m3127k67825m752J31716P9524k8985o3860J37832R1444
11938B8740m0716Q1756J21957n4053j85048j9378o0716q6736M1504J08246Q7832
11927B3388R3225l9665k17758o7954J19667Q2457M3740J62085m6929l9519o3733
11916D9004k20847j41052K0869L07255J92541P4108L058j21921j11861k2969m1693
$$ [...]
##END NTUPLES=NMR SPECTRUM
##END=
