##TITLE=Analysis number 319591
Compound Code mo 07829
Book Reference 444/146
Project Code adrs
Chemist Name howarde
##JCAMPDX= 6.0         $$ Bruker NMR JCAMP-DX V2.0
##DATA TYPE= NMR SPECTRUM
##DATA CLASS= NTUPLES
##ORIGIN= Bruker BioSpin GmbH
##OWNER= nmr
$$ XWIN-NMR		Version 3.5
$$ Fri May 19 14:33:01 2006 GMT Daylight Time (UT+1h)  MAYBRIDGE\nmr@NMR_250MHZ
##.OBSERVE FREQUENCY= 250.131544655141
##.OBSERVE NUCLEUS= ^1H
##.ACQUISITION MODE= SIMULTANEOUS (DQD)
##.ACQUISITION SCHEME= undefined
##.AVERAGES= 16
##.DIGITISER RES= 18
##SPECTROMETER/DATA SYSTEM= dpx250
##.PULSE SEQUENCE= zg30
##.SOLVENT NAME= CDCl3
##.SHIFT REFERENCE= (INTERNAL, CDCl3, 0, 16.4434)
##AUDIT TRAIL= $$ (NUMBER, WHEN, WHO, WHERE, WHAT)
$$ ##TITLE= Audit trail, XWIN-NMR		Version 3.5
$$ ##JCAMPDX= 5.01
$$ ##ORIGIN= Bruker BioSpin GmbH
$$ ##OWNER= nmr
$$ C:\u/data/dgb/nmr/ADRS/4800/pdata/1/auditp.txt
$$ ##AUDIT TRAIL=  $$ (NUMBER, WHEN, WHO, WHERE, WHAT)
(   1,<2006-05-19 14:32:42.06 +100>,<MAYBRIDGE\nmr>,<NMR_250MHZ>,
      <created by zg, POWCHK disabled, PULCHK disabled
       configuration hash MD5:
       84 BC 41 DB A1 6E 1D 46 DA 25 12 A5 C1 ED C5 3A
       data hash MD5: 64K
       81 02 9D 14 4E A9 47 4B 88 A0 75 9D 5E F3 A2 9D>)
(   2,<2006-05-19 14:32:53.84 +100>,<MAYBRIDGE\nmr>,<NMR_250MHZ>,
      <Start of raw data processing
       ef LB = 0.3 FT_mod = 6 PKNL = 1 SI = 32K 
       data hash MD5: 32K
       C0 25 DB 92 5D 08 FC 72 25 B3 4F DB 8A 66 4A A5>)
(   3,<2006-05-19 14:32:55.51 +100>,<MAYBRIDGE\nmr>,<NMR_250MHZ>,
      <apk 
       data hash MD5: 32K
       2B 18 C2 71 F4 FE A1 FA FE 0A CA DE 91 79 88 FC>)
(   4,<2006-05-19 14:32:56.23 +100>,<MAYBRIDGE\nmr>,<NMR_250MHZ>,
      <abs ABSG = 5 
       data hash MD5: 32K
       05 FE 3C 1C D0 10 08 BF 84 65 1E 79 09 71 27 12>)
$$ ##END=
$$ 
$$ hash MD5
$$ AA FD 22 EA 8A 89 69 A4 2D 4F 4E 4C 54 A4 66 D6
##$RELAX= 
##$RELAX= 
##$RELAX= 
##$RELAX= 
##$RELAX= 
##$RELAX= 
##$RELAX= 
$$ Bruker specific parameters
$$ --------------------------
##$DU= <C:\u>
##$EXPNO= 4800
##$NAME= <ADRS>
##$PROCNO= 1
##$TYPE= <nmr>
##$USER= <dgb>
##$AMP= (0..31)
100 100 100 100 100 100 100 100 100 100 100 100 100 100 100 100 100 100 
100 100 100 100 100 100 100 100 100 100 100 100 100 100 
##$AQSEQ= 0
##$AQ_mod= 3
##$AUNM= <au_zg>
##$AUTOPOS= <41 >
##$BF1= 250.13
##$BF2= 250.13
##$BF3= 250.13
##$BF4= 250.13
##$BF5= 500.13
##$BF6= 500.13
##$BF7= 500.13
##$BF8= 500.13
##$BYTORDA= 1
##$CFDGTYP= 0
##$CFRGTYP= 5
##$CHEMSTR= <none>
##$CNST= (0..31)
1 1 145 1 1 1 1 1 1 1 1 1 1 1 1 1 1 1 1 1 1 1 1 1 1 1 1 1 1 1 1 1 
##$CPDPRG= <>
##$CPDPRG1= <>
##$CPDPRG2= <>
##$CPDPRG3= <>
##$CPDPRG4= <mlev>
##$CPDPRG5= <mlev>
##$CPDPRG6= <mlev>
##$CPDPRG7= <mlev>
##$CPDPRG8= <mlev>
##$CPDPRGB= <>
##$CPDPRGT= <>
##$D= (0..31)
0 1 0 0 0 0 0 0 0 0.06 0 0 0 0 0 0 0.0002 0 0 0 0 0 0 0 0 0 0 0 0 0 0 
0 
##$DATE= 1148045561
##$DBL= (0..7)
120 120 120 120 120 120 120 120 
##$DBP= (0..7)
150 150 150 150 150 150 150 150 
##$DBP07= 0
##$DBPNAM0= <>
##$DBPNAM1= <>
$$ [...]
##$SUBNAM7= <"">
##$SUBNAM8= <"">
##$SUBNAM9= <"">
##$SW= 20.6930455092707
##$SWIBOX= (0..15)
0 0 3 0 0 0 0 0 0 0 0 0 0 0 0 0 
##$SW_h= 5175.983436853
##$TD= 65536
##$TD0= 1
##$TE= 295.16
##$TE2= 300
##$TE3= 300
##$TEG= 300
##$TL= (0..7)
0 120 120 120 120 120 120 120 
##$TP= (0..7)
150 150 150 150 150 150 150 150 
##$TP07= 0
##$TPNAME0= <>
##$TPNAME1= <>
##$TPNAME2= <>
##$TPNAME3= <>
##$TPNAME4= <>
##$TPNAME5= <>
##$TPNAME6= <>
##$TPNAME7= <>
##$TPOAL= (0..7)
0.5 0.5 0.5 0.5 0.5 0.5 0.5 0.5 
##$TPOFFS= (0..7)
0 0 0 0 0 0 0 0 
##$TUNHIN= 0
##$TUNHOUT= 0
##$TUNXOUT= 0
##$USERA1= <user>
##$USERA2= <user>
##$USERA3= <user>
##$USERA4= <user>
##$USERA5= <user>
##$V9= 5
##$VALIST= <valist>
##$VCLIST= <CCCCCCCCCCCCCCC>
##$VD= 0
##$VDLIST= <DDDDDDDDDDDDDDD>
##$VPLIST= <PPPPPPPPPPPPPPP>
##$VTLIST= <TTTTTTTTTTTTTTT>
##$WBST= 1024
##$WBSW= 4
##$XGAIN= (0..3)
0 0 0 0 
##$XL= 0
##$YL= 0
##$YMAX_a= 510713
##$YMIN_a= -593912
##$ZGOPTNS= <>
##$ZL1= 120
##$ZL2= 120
##$ZL3= 120
##$ZL4= 120
##$ABSF1= 16.44343
##$ABSF2= -4.249743
##$ABSG= 5
##$ABSL= 3
##$ALPHA= 0
##$AQORDER= 0
##$ASSFAC= 0
##$ASSFACI= 0
##$ASSFACX= 0
##$ASSWID= 0
##$AUNMP= <proc_1d>
##$AZFE= 0.1
##$AZFW= 0.1
##$BCFW= 0
##$BC_mod= 0
##$BYTORDP= 0
##$COROFFS= 0
##$CY= 12.5
##$DATMOD= 1
##$DC= 0
##$DFILT= <>
##$DTYPP= 0
##$F1P= 14.0000005364418
##$F2P= -0.99999901652339
##$FCOR= 0.5
##$FTSIZE= 32768
##$FT_mod= 6
##$GAMMA= 0
##$GB= 0
##$INTBC= 1
##$INTSCL= 1
##$ISEN= 128
##$LB= 0.3
##$LEV0= 0
##$LPBIN= 0
##$MAXI= 10000
##$MC2= 0
##$MEAN= 0
##$ME_mod= 0
##$MI= 0
##$NCOEF= 0
##$NC_proc= -3
##$NLEV= 6
##$NOISF1= 0
##$NOISF2= 0
##$NSP= 0
##$NTH_PI= 0
##$NZP= 0
##$OFFSET= 16.44343
##$PC= 1
##$PHC0= 167.0597
##$PHC1= 4.462638
##$PH_mod= 1
##$PKNL= yes
##$PPARMOD= 0
##$PSCAL= 4
##$PSIGN= 0
##$REVERSE= no
##$SF= 250.130019650446
##$SI= 32768
##$SIGF1= 0
##$SIGF2= 0
##$SINO= 400
##$SIOLD= 32768
##$SREGLST= <1H.CDCl3>
##$SSB= 0
##$STSI= 32768
##$STSR= 0
##$SW_p= 5175.98343685301
##$SYMM= 0
##$S_DEV= 0
##$TDeff= 65536
##$TDoff= 0
##$TI= <Analysis number 999999
Compound Code 99
Book Reference 9
Project Code 9>
##$TILT= no
##$TM1= 0
##$TM2= 0
##$TOPLEV= 0
##$USERP1= <user>
##$USERP2= <user>
##$USERP3= <user>
##$USERP4= <user>
##$USERP5= <user>
##$WDW= 1
##$XDIM= 32768
##$YMAX_p= 433775931
##$YMIN_p= -113883
$$ End of Bruker specific parameters
$$ ---------------------------------
##NTUPLES= NMR SPECTRUM
##VAR_NAME=  FREQUENCY,     SPECTRUM/REAL,   SPECTRUM/IMAG
##SYMBOL=    X,             R,               I
##VAR_TYPE=  INDEPENDENT,   DEPENDENT,       DEPENDENT
##VAR_FORM=  AFFN,          ASDF,            ASDF
##VAR_DIM=   32768,         32768,           32768
##UNITS=     HZ,            ARBITRARY UNITS, ARBITRARY UNITS
##FACTOR=    0.157963299565203, 1,           1
##FIRST=     4112.99545573868, 0,            0
##LAST=      -1062.98798111433, 0,           0
##MIN=       -1062.98798111433, -113883,     0
##MAX=       4112.99545573868, 433775931,    0
$$ Real data points
##PAGE= N=1
##DATA TABLE= (X++(R..R)), XYDATA
$$ [...]
20442e0408N16l2126j9845K0057L278L75J7114P562J2435K9902J1764J9509o852
20429A3281K7531j201j0856J4641k6808k8185P306K233o354O524j7001K5604K5328
20416C2043n261j9684J4124K4201k3782m8196K192k908l6526j2907J7395J6893
20404d2416m386J1701Q970O857j0534k3827P094J8052K9332L3700N222J963M270
20391D5998l3725j71n591l455m8910k4446M2527L8547M3943o169j7535k4044K658
20378I627J0974m584o010K229k9184k2088Q719J4614J2219M0027K8101J5099j3196
20365F6547l5730J553K1965j2802n0710o08K3659j175j2722K0645J7507k3333
20353A4796k4581k7776N114J4639J1787m213O834M892k6113M811K0160K3269L8705
$$ y = [-50408, -49892, -82018, -101863, -81806, -78528, -78153, -61039, -53477, -41042, -11140, 624, 20133, 13281, 40812, 39611, 28755, 43396, 16588, -11597, -4291, -2058, -8412, -1888, -18889, 6715, 32043, 26782, 7098, 21222, 45423, 21641, -26555, -24363, -27271, -63797, -76704, -59309, -42416, -46802, -35101, -26131, -19274, -29808, -53635, -46541, -28489, 843, 34543, 39765, 41728, 45998, 12273, 12102, 6511, 3056, -45854, -70300, -27773, 10774, 54717, 48548, 31013, 6969, 9627, 20601, 16017, 10007, 12236, -16948, -39036, -30317, -15703, -3484, 36543, 64644, 79743, 66547, 30817, 32370, 54335, 41533, -9177, -9785, 13874, 12699, -23, 20622, 38129, 14796, -9785, -37561, -32447, -17808, -6021, -10234, -3400, 1492, -24621, -19810, 350, 23619, 62324]
20340F2324k0244m9135L314J5183k994K7729J6052j5502J0142k1913r926j6452
20328a422r991l602K2745J4262L589K2807q41j9250n281K0809r202q910r783j2374
20314C556P785K0280j8420J738J1684k5738o915J5050n978J2416N836j5175R4
20301F213j3900k56J5826K6761j0375k1669k4068K2069O036J6411J0424p953J4592
20288D0111n855j9163k3792k6754j30L0563K1607J7956j026j5764o073j4018r446
20275a1784K9099l219j1297L4271J5713j4350M723j6525k6817j0849J1731K2100
20263B2796j3454n890j4769L7130j4310J2295J3207o710k9458k866K3801J2850
20251C4622j2845j9891j8835k3165p22J3419J6728M2775J4402j6618k8820l1768
$$ y = [62324, 42080, -7055, -3741, 11442, 8448, 36177, 52229, 36727, 46869, 24956, 15030, -1422, -11413, -15015, 7730, 21992, 25581, 48388, 47547, 28297, 23016, 43825, 34623, 25713, 15930, 3556, 11341, 31621, 13201, 14939, 26623, 885, -6030, 9020, 3042, 15458, 21294, 6119, 6213, -7687, -7943, 7883, 34644, 24269, 2600, -21468, 601, 6637, 23048, 33472, 25519, 40111, 34256, 15093, -8699, -35453, -35583, -5020, 16587, 34543, 33517, 17753, 11680, -2338, -11784, 17315, 14096, 2799, 37070, 52783, 38433, 43156, 26631, -186, -11035, 696, 22796, 9342, 3452, -11317, 25813, 11503, 23798, 37005, 30295, 837, -2029, 21772, 34622, 21777, 1886, -16949, -40114, -40836, -27417, -10689, 32086, 46488, 29870, 1050, -30718]
20239c0718J1912N253n991N359L2458J0678p039j3292K0900k2726L552l385j7543
20226a0582j3380k1623O899L484J6330J4171L7658J1022J9836m142j7662l122
20214C8889j8858k4785o664J499J391j2601j6461j0632p121J8355j1887J6545
20202c2330K1720M4539L4811n553j4903n676m455O020n539j6381k097r837q450
20189A869k910q730K829K2088j0654J1773J1960k2301O867J6606j8101J05O01
20176A2002l1534m1229j5179L95M081J2574O39N586L7982N846l158J179M089J3525
20162F798K3807L1962k0562j6101M51j6243m119o247M8607M195r331k1205j3365
20149H647J3754R203r564l1152k0868K4836K9723k3215n923J5872l993o598N579
$$ y = [-30718, -18806, -13553, -19544, -14185, 18273, 28951, 21912, 8620, 29520, 6794, 10346, 6961, -10582, -23962, -45585, -38686, -35202, -18872, -4701, 32957, 43979, 63815, 59673, 42011, 38889, 20031, -4754, -11418, -9919, -8528, -21129, -37590, -48222, -55343, -36988, -48875, -32330, -10610, 33929, 68740, 63187, 48284, 42608, 38153, 44173, 38634, 22253, 20156, 10319, 1869, -1041, -9771, -6942, 15146, 4492, 16265, 28225, 5924, 12791, 29397, 11296, 11401, 12002, -19532, -60761, -75940, -75545, -71464, -58890, -58251, -52665, -14683, -8837, -11995, -10816, -6727, 6798, 30605, 62567, 42005, 25904, 26355, 10112, 5993, -254, 48353, 52548, 43217, 22012, 8647, 22401, 31604, 22040, -9112, -29980, -5144, 24579, 1364, -4559, 11313, 7320, 722, 6301]
20136F301O310K1530j5507m329L5211O854l1635L188j342q840l4505j1724m163
20123c2651K9002K6727o555j0688j5782j3598K3687O805O266l9217l7946O95K6589
20110c6666L1084j116K0946j4280l1855M0598J0170k2443m73j4560K169n429K9747
20097G892J2660j912l071M886j5627k4088Q130K2982j0110k4507j2638M9999K1424
20084C6020l8411j0113O493J0935J7554J8054j9793k8889j3556L628L631J9319
20072D872q019k0792K3807L72k4762O134K2350J3139m0561j6646K7063L5211k2544
20059c76l6561o276j370j8515K7587L2618N0926j0896J4796m850m506J3347R4
20046E6018j1653j6298l2115Q020K9295Q133k6275j7279J7296j066j0236M24p021
$$ y = [6301, 12611, 34141, 18634, 14305, 49516, 56370, 24735, 27923, 26581, 17741, -16764, -28488, -32651, -3649, 23078, 16523, 5835, -9947, -23545, 142, 6947, 13213, -26004, -63950, -63255, -36666, -5582, -6698, 14248, -32, -31887, 8711, 18881, -3562, -4035, -18595, -16426, -21855, 7892, 20552, 18640, 15569, 20455, 4828, -19260, -11130, 11852, 1742, -22765, -35403, 14596, 36020, -2391, -12504, -6011, 4924, 22478, 40532, 20739, -8150, -21706, -18078, -14447, 4872, -3147, -23939, -132, 240, -24522, -18388, 3962, 17101, -23460, -40106, -13043, 22168, -376, -36937, -43213, -44583, -63098, -35511, -2893, 48033, 37137, 51933, 47083, 42577, 55924, 56018, 44365, 28067, -4048, 3972, 33267, 41400, 15125, -2154, 15142, 14076, 3840, 4264, -2757]
20033b757L1332l2l7260Q568M491l3148K639l769q184K5013j459J0523m604K832
20019e815L0296k2415k2945j0858L0164K03j7502J8203q18q974M151p256j2225
20006b5791J6565Q655K201J7110Q732m246o22j1634j4941k6127J0525L1576R015
19993B1018J293l0141j4094J7035k83P751n792r183k0303K7424K8978J667j341
19980B4029l7750j3159K2904J7143r091k5250M883o023K8373O226k3963j2163
19968b3841N975L724P721K1460j3718K5451J5458J9452j1612n9157K7202L0609
19956D8724o204j8509j0488J689Q768M3651j1612m3864J84Q069J0511p239r89
19943B2691J8802J8707j7869j4840j424M951Q576j9036l822P271J8039Q517j4525
$$ y = [-2757, 28575, 28543, -8717, -149, 4342, -28806, -26167, -29936, -38120, -13107, -14566, -4043, -8647, -5815, 24481, 2066, -20879, -31737, -1573, -1370, -18872, -669, -1487, -10461, -6310, -13566, -25791, -9226, -571, 1630, 18740, 27472, 23226, 22604, 10970, -3971, -30098, -19573, 12003, 21018, 22311, -7830, -21924, -4889, -5172, 2579, -3213, -12396, -32699, -5275, 23703, 25370, 24029, -13721, -26880, -3976, 13167, 4076, -21174, -16291, -22314, 6059, 12285, -11678, -23841, -17866, -14142, -6421, 15039, 1321, 26772, 42230, 61682, 50070, -9087, 18115, 48724, 42520, 24011, 13523, 15212, 23980, 67631, 56019, 12155, 12339, 20408, 30919, 23680, 22691, 41493, 60200, 42331, 27491, 26067, 31018, 39594, 20558, 16736, 24007, 42046, 50563, 36038]
19930C6038l3223l769j049k610L2359r148k8310q172K091M245P022m162p063P294
19916h457J5938k172J1500J2012j2495p328J429M542M776K430j2229K4657M374
19903C8977J0306j3769K0782L248l1337J7908j8100l9065K2758K4952K0680j6760
19891D0580k2514M374j8769q078M615k814p011J7364M904J7993k5062p586j094
19878c098K3202j7755l127J6241j5232j3594k3668J5876L5795J4272k0223k4046
19866a5357K4834j1918j8230j9389j707J5610L9642J7964M376J7657J7271k942
19854F7811j3136j5378j3717j726j3462K4894M4807K2205j8640n0397p6J4394
19842D7579k8587j806m971j3374J5608J680l3437L642O982K447l763o96j0978
$$ y = [36038, 2815, -954, -2003, -4613, 27746, 18598, -9712, -17884, -15793, -11548, -4526, -8688, -15751, -8457, 7481, 5309, 16809, 28821, 16326, 8998, 10427, 14969, 19745, 22175, 9946, 34603, 38977, 49283, 35514, 56296, 59544, 28207, 46115, 28015, -11050, 11708, 36660, 57340, 40580, 18066, 22440, 3671, -4407, 208, -2606, -9617, 7747, 12651, 30644, 5582, -2004, -3098, 20104, 2349, -778, 15463, 231, -13363, -37031, -21155, 14640, 28912, 8689, -15357, 9477, -2441, -20671, -40060, -41767, -26157, 13485, 31449, 35825, 53482, 70753, 67811, 54675, 39297, 25580, 23854, 10392, 35286, 80093, 102298, 83658, 33261, 33185, 47579, 18992, 17186, 12215, -1159, 14449, 16129, -17308, -13666, -6684, -4237, -8000, -8696, -19674]
19829a9674j9058K2229K5371O557j0132q965k172J1561J1879j8592o949k357J2086
19816A784M6997j1k5681k0455N609j3245k8107j8295j281J4559n040l229J6805
19803b9590l545J7263P861K4355K6604j203j9508N85j3154J2341k772r441J1531
19790B1327p469k0227j615R695j9724J2692K8631L216K217j6095r798k921P569
19777G498L5380q290j5900j5180j647K5255K5307J0549k8551j9294r543M0095
19765D5679K6569k8495r668j9181j5924j0856M0003L553L569J4692j385j9287
19753B9269J4857o635k7912k889R452J5497l243j7713l8179m43L9528J4091O585
19740C2265k6934l4129J4972M5717J7569n218K1148k4956m1460n894J9888j737
$$ y = [-19674, -38732, -16503, 8868, 15425, 5293, -3672, -5844, 5717, 17596, -996, -7945, -10302, 1784, 48781, 48770, 23089, 2634, 8243, -5002, -33109, -51404, -52685, -38126, -43166, -46395, -29590, -33135, -15872, -8011, 16344, 42948, 41745, 22237, 22822, 9668, 22009, 19237, 9796, 21327, 13858, -6369, -7984, 1711, -18013, -5321, 23310, 26526, 28743, 12648, 2850, -71, 7498, 42878, 34588, 18688, 3508, 1861, 27116, 52423, 62972, 34421, 15127, 5584, 45679, 72248, 43753, 34085, 14904, -1020, -11876, 28127, 31680, 35249, 49941, 48556, 29269, 44126, 37491, 9579, 6690, 16142, 31639, 28396, 10683, -27496, -27939, 11589, 25680, 32265, 5331, -28798, -13826, 31891, 49460, 44242, 65390, 40434, -1026, -6920, 12968, 11231]
19728A1231K5651J3946L039J8468k9641j3313k0620K8607K5025k4360m0621k2698
19716b5286O84j4809L1596q601j2959J1108J0689M066J6649O077K175O663j4224
19703A3828P285j5484K836J0016R10j8642J3232K4005q703m680k0118K5919J362
19690C1766N550M773j5778j875k805j1338k7593o668L1795J8862q529j1068L3387
19677D0479j8486j5522j6219p014J2701o30K6103o63p754L168J1506q054K1932
19664D1547O097k395k7739K301n470j6024k1012J6908P394P635o591o887J4742
19651A0506J0055J1175r373q459K0144K8028Q333k8887j0054P352J4039L4096
19639H6955J5466l2725k667R295L497k4587n7607k0444l289J5191J5244L1681
$$ y = [11231, 36882, 50828, 53867, 72335, 42694, 29381, 8761, 37368, 62393, 38033, -2588, -25286, -24602, -39411, -7815, -16416, -29375, -18267, -7578, -3512, 13137, 19214, 21389, 28052, 13828, 21113, 5629, 8465, 18481, 19391, 749, 13981, 37986, 29283, 24603, 4485, 30404, 31766, 37316, 42089, 26311, 24436, 21631, 10293, -17300, -23968, 7827, 26689, 18160, 7092, 40479, 21993, 6471, -9748, -16762, -4061, -4691, 21412, 20749, 12995, 16163, 27669, 19615, 41547, 47644, 45249, 17510, 19811, 14341, -1683, -22695, -5787, 1607, 9242, 2651, -4236, 10506, 20561, 31736, 22363, 13904, 34048, 62076, 70409, 41522, 31468, 38820, 52859, 86955, 102421, 69696, 67029, 76324, 79821, 55234, -2373, -22817, -26106, -10915, 4329, 36010]
19627C6010L1758j2689j779l747l1703o622J0103N668J7305J5431L874j1466J1245
19614F3388q704l4551l8495q891J3642J090K1819r915q377M6985L1587r492l0950
19601B9136K6661J8843M942j6312m1088N464J846l9324J9232r98J5229K2436j7143
19588B8924k0098J9471J4004j3094J8899p102j7817k2957J7206j6652n883O739
19576A640J097J3738j4681k8805L2057K5688l045j0815j2263J7935J7612N688
19564D5846j0488k8341j3296N966j252Q987L075m947J607m204j6248J3264m042
19551d073Q308j3178J9303l0417m718j737j4586L3814K9704M1506O112m760j4611
19538E0667J0990n431j0589k5009n000J5593L9842k5136k6573r816j5724L6934
$$ y = [36010, 67768, 55079, 53300, 49553, 17850, 11228, 21331, 26999, 44304, 59735, 63609, 52143, 63388, 54684, 20133, -18362, -27253, -13611, -12521, 9298, -617, -8994, 37991, 69578, 60086, 29136, 55797, 74640, 79582, 63270, 22182, 27646, 29492, -9832, 9400, 8402, 23631, 46067, 28924, 8826, 28297, 42301, 29207, 48106, 41004, 23187, 230, 17436, 784, -5099, 1640, 2737, 16475, 1794, -27011, 5046, 30734, 27689, 16874, 4611, 22546, 40158, 45846, 35358, 7017, -6279, -313, -1565, 7422, 10497, 5550, 7157, 2953, -13295, -31, -4073, 4235, -8943, 10360, -20057, -24775, -26512, -41098, -7284, 22420, 63926, 70038, 65278, 50667, 61657, 56226, 45637, 20628, 15628, 31221, 71063, 45927, 19354, 9538, -6186, 30748]
19526C0748R055o163O707J2159P472O252J4557J9010k0452k5902J1301l1l3604
19513C1109r172q715n062K0625O618j1389j4118j337Q359P766j117N996K9986
19500E9549M821j1168j8900j9949q240l5927P922J0465n115M8955O629J7234J9047
19487G5323J638l592m378j5334j3354K4703K2194k3942k9922l887P055J236k7535
19474A0205L7852L5113O970K5382q086l7949j9715O779J7691j3831l765n266j4052
19461C7328O783j7253J6590J6152j6230J876m3624j9409J680J357K0038P510p457
19448E341n920L7134M3574n230j3784L793P72l4536l606L453j6108j0141J9675
19435B4417j8817K0842M1764R125o891l5227r968n684M151k1802o782K8915P835
$$ y = [30748, 39803, 33640, 40347, 52506, 59978, 66230, 80787, 99797, 79345, 53443, 64744, 64713, 31109, 21937, 13222, 8160, 28785, 35403, 24014, 9896, 8559, 16918, 24684, 23567, 29563, 59549, 64370, 53202, 34302, 14353, 6113, -29814, -21892, -11427, -16542, 32413, 39042, 56276, 75323, 76961, 73369, 68991, 53657, 40303, 65006, 87200, 63258, 33336, 29449, 36504, 37740, 10205, 48057, 83170, 90140, 115522, 107436, 69487, 49772, 56551, 74242, 60411, 56646, 51380, 37328, 44111, 26858, 43448, 59600, 43370, 45246, 1622, -17787, -16107, -14750, 5288, 12798, 5341, -579, 36555, 80129, 74899, 61115, 64908, 65680, 31144, 27538, 30991, 14883, 4742, 24417, 5600, 26442, 68206, 77331, 70440, 35213, 25245, 19561, 23712, 1910, -4872, 24043, 31878]
19422C1878J6165P021n385j6086o643R562K038J2133j2875j3202q621R292K1980
19409D7257l813l469L2617l968J0703o257j3762r739J3838P075l5839L858K6125
19396F4626J8622k5435j5100K4479K0210P838j0043m0446O220q543J363J6391
19384F0182j7165J7585J995j0064m1879l471N3890k4001k3787R114N467R998n219
19371C2645L0758J9414r578J0440k4137k4631j3211J7735K9495k9321q552K0990
19359E2047L7447k3033l4974l090O902n971R053J1254k6925j8900K63J3307P915
19346B5295J720j0475j1248J5068M8394j8530l1291p467M706M702j1667J0618
19334A9825J012J5405R259j4944J1799K6528k259l829N977j2193k1858K0140Q902
$$ y = [31878, 48043, 55064, 49679, 33593, 26950, 36512, 38550, 50683, 37808, 24606, 15985, 25277, 47257, 43444, 39975, 72592, 68624, 79327, 73070, 59308, 49569, 63407, 70482, 34643, 38501, 64626, 83248, 57813, 42713, 67192, 87402, 95240, 85197, 44751, 50971, 42428, 43791, 60182, 43017, 60602, 62597, 52533, 10654, 7183, 61073, 37072, 13285, 22399, 27866, 37864, 32645, 63403, 82817, 73239, 83679, 59542, 34911, 21700, 39435, 68930, 39609, 31057, 52047, 89494, 66461, 31487, 28397, 35299, 29328, 38381, 49635, 22710, 3810, 4073, 17380, 25295, 27015, 16540, 5292, 20360, 68754, 50224, 18933, 11466, 16172, 20874, 9207, 19825, 20837, 36242, 45501, 30557, 42356, 68884, 66625, 62796, 68773, 56580, 34722, 54862, 63764]
19321F3764j3333j7681j2958o501L458K7908J8185p492J4076k546j1065R014J881
19308F6710l155k15j068N751L034j0117j0622m532N504J979j7421n140K3203J0103
19294F4014L1521K9333M325J817l1524j5246j8223j2233J4121p39j3288j1898
19282D1980J8055J1361l0584k8383J9365K9036k0869j8457Q069J1945K5327J6927
19270H3772k0277k4249k5376k987M3146M3254j0859m0157j7433K2720r941J2529
19258E4142Q333J5621k034j8191J4063J9611L201k5907j5999j6292j3027q57L093
19245B5757j1612K2540L7901L5739j2078n179j3821q352K348k9564j3353j4500
19233A5826J7965K2731J4693l164M4021N70m0362R564M5810m810k7677j677J1704
$$ y = [63764, 50431, 32750, 19792, 13291, 16749, 44657, 62842, 55350, 69426, 66880, 55815, 64829, 66710, 63555, 63340, 62272, 68023, 71057, 60940, 50318, 45786, 51290, 53269, 35848, 30708, 53911, 64014, 95535, 124868, 129193, 131010, 99486, 84240, 66017, 53784, 67905, 67166, 53878, 41980, 60035, 71396, 40812, 12429, 31794, 60830, 39961, 21504, 29573, 41518, 66845, 83772, 63495, 39246, 13870, 10883, 54029, 97283, 86424, 46267, 28834, 51554, 41613, 54142, 62475, 78096, 76062, 57871, 71934, 91545, 94746, 68839, 52840, 36548, 23521, 22664, 25757, 14145, 36685, 74586, 110325, 98247, 93068, 79247, 70895, 73243, 43679, 30326, 15826, 33791, 56522, 71215, 68051, 112072, 112642, 72280, 81844, 127654, 122844, 95167, 93490, 105194]
19220A05194O922n5868K358M071J909j2536J0613Q951P727k449J1217K0569k7744
19207H0934K9683J5161m2834l8622J2569M8230L4090q936o491j5775j4702K0106
19195A13413J6909J0293K525j8089O5954O4730n092J7256M2030L3172j5561m0712
19183B86828J0834J2228N347k5241k1861K5166L1817M44K2602K9593k0600l9340
19171C17817j8075K4906J0219j2397k0882k9472n7984n3708q033J0601j9572o532
19159A36888p43J7792K1648o979n2167j9860K4320L8820L4890N560k3594j053
19147A75522J2369J1899J367K2183O3779N2714J9761J4417M1149Q212p599K0712
19135D36485j0862n0983o3790j4737K2010K0007N6295J7162J2531M528o492R392
$$ y = [105194, 112116, 56248, 58606, 62677, 64586, 52050, 62663, 71614, 79341, 76892, 88109, 108678, 80934, 110617, 125778, 82944, 44322, 56891, 105121, 139211, 130275, 123784, 108009, 93307, 113413, 130322, 140615, 143140, 125051, 191005, 255735, 250643, 267899, 309929, 343101, 327540, 286828, 297662, 309890, 315237, 289996, 268135, 293301, 325118, 325562, 348164, 377757, 357157, 317817, 299742, 324648, 334867, 322470, 301588, 272116, 214132, 160424, 152391, 162992, 143420, 136888, 136145, 153937, 175585, 168606, 116439, 96579, 120899, 159719, 194609, 200169, 176575, 175522, 187891, 199790, 201157, 223340, 287119, 339833, 359594, 374011, 415160, 423372, 415773, 436485, 425623, 374640, 310850, 296113, 318123, 338130, 394425, 411587, 424118, 428646, 422154, 431546]
19123D31546k6780n9658p4796j6004P646j0957n4977j2827l280k6844K819J4062
19111A69950J1035J392N380j819r906l333K5849K4465j5021k0989k3385J1569
19099A75187j2767J8740k0772J9931j5391m0880m358K5585l546p530q610K8184
19087A53773J7031J7533j3931k2269k159J7543K4314j1741j6093l5665J1613P820
19075A47769K8066q639J3561J7158K0498J1768K2559K0044M7796L4487J2825L5564
19063D03456K2226j0102m7160n3120o4938j7821K0230N0619M1601K0748K6909
19052C92648L8872R418j9030l2808q7209n8925l1693k0565R324J6607j2106o998
19040A97535j9780k4699j155L078p788P62r068R633K4733l013j6775j5584K3304
$$ y = [431546, 404766, 345108, 270312, 254308, 261954, 250997, 196020, 183193, 179913, 153069, 155888, 169950, 180985, 182377, 187757, 185938, 176032, 172699, 198548, 223013, 207992, 187003, 163618, 175187, 162420, 181160, 160388, 180319, 164928, 124048, 119690, 145275, 141729, 134199, 125589, 153773, 170804, 188337, 174406, 152137, 149978, 167521, 191835, 180094, 164001, 128336, 139949, 147769, 175835, 167196, 180757, 197915, 218413, 230181, 252740, 272784, 320580, 355067, 367892, 403456, 425682, 415580, 368420, 315300, 250362, 232541, 252771, 303390, 344991, 365739, 392648, 431520, 440938, 421908, 389100, 301891, 242966, 211273, 190708, 200032, 216639, 204533, 197535, 177755, 153056, 151901, 154979, 147191, 147953, 138885, 148518, 173251, 170238, 153463, 137879, 161183]
19027A61183N5819L5091K9180N499L0905J2391k8967j466Q086K9794k54J2883
19015C50144k0J023k171L376M648P302J0650M2773L6839L0039M4367l861l8265
19002D86844l8254m8240p3898o2459l6128J3284p503k0613M884J458M489J3427
18990B37291r997k0740r652j6094J092J1782J0123k3616p556j7228r115m223k200
18977A39867L991J7680J8918N911j5220k2336J3890O4393Q88k1053k3474p436
18965A76019j7858j1207P563J0237J7198K931K1905J7524N186j3252j0863j2680
18953A92703R226Q493p722J9635L2665r421M3372L197j8766m3189l6408N535K9833
18940B29153L9873k055N681N466J6382L6025o62l0708k8847l1276n31k4414J8098
$$ y = [161183, 217002, 252093, 281273, 286772, 317677, 330068, 301101, 299635, 307721, 337515, 337261, 350144, 350124, 351147, 348976, 352352, 357000, 364302, 374952, 417725, 454564, 484603, 528970, 525109, 486844, 448590, 400350, 326452, 263993, 227865, 241149, 233646, 213033, 217917, 219375, 223864, 237291, 227294, 206554, 196902, 180808, 181900, 193682, 203805, 180189, 172633, 155405, 146290, 142067, 139867, 143858, 161538, 180456, 186367, 171147, 148811, 162701, 227094, 227982, 206929, 183455, 176019, 158161, 146954, 154517, 164754, 181952, 184883, 206788, 224312, 229498, 216246, 205383, 192703, 201929, 210422, 202700, 222335, 255000, 245579, 288951, 292148, 273382, 230193, 193785, 199320, 229153, 269026, 266971, 272652, 278118, 294500, 330525, 329863, 299155, 270308, 239032, 238501, 214087, 232185]
18927B32185J7620o04k273J5520l1477j8071L4050P054j8806k0142l5025k5176
18915A54855O895K3878L9225J7547n817m0547K330N346N396j2676M589L2040M1080
18902B74141J8940K5916J6088N2739K6733J8346M7935K6056j109k5833j5036J6066
18890D80982r771N31M1706N516j0309l5310m1940O480K7050l6588m8517j0742
18878C69088k903m734l0572q064k6863J527j737j4183j6487J5193O235M564J1955
18865C03019j3216K7184J9401K3166J20K0758k130q56j0852j490L6009M1431J3772
18852D56316J1696j8381j1770k016M084K3084l242j4023l0546k1900J0565L3960
18840D37827M3195J0731L628n592k982P022k5709j7860l0605l4757k2165k2687
$$ y = [232185, 249805, 249201, 246928, 262448, 230971, 212900, 246950, 254004, 235198, 215056, 180031, 154855, 161750, 185628, 224853, 242400, 236583, 196036, 198366, 203712, 209108, 196432, 201021, 233061, 274141, 293081, 318997, 335085, 387824, 414557, 432903, 480838, 506894, 505785, 479952, 464916, 480982, 471211, 471742, 513448, 518964, 508655, 473345, 431405, 437885, 464935, 428347, 379830, 369088, 366185, 361451, 330879, 322815, 295952, 297479, 295742, 281559, 265072, 280265, 286500, 291064, 303019, 289803, 316987, 336388, 359554, 359674, 380432, 378302, 377446, 366594, 365104, 401113, 442544, 456316, 468012, 449631, 437861, 435845, 439929, 463013, 459771, 445748, 415202, 393302, 403867, 437827, 481022, 491753, 495381, 489789, 486807, 493829, 468120, 450260, 419655, 384898, 362733, 340046]
18828C40046q790k1218J052J6889o830K1347L4623p795J3013J8987L3396L5704
18816D70424Q906M8523O3273L3809J4527J4186j3001l3196m213L7685L0067L5842
18804G06832l130m3744n8273k9301k5418l4325n2838l6420J8903K6593n459L905
18792D67325j2406k0862k5964m90J3746L1495J4861k819L856J1469j8117j7586
18780D44508n752k6934k1799K167M0231K805L5783R848N8991O8684N0389P2936
18768G31857P6620M1629J0967L0767r437p1618m0208O554J4061j291k9421n0263
18756G10217k9167k5503k7917K0922K2562j2130n0632K2998J3998m066m470j1826
18744F24986J5087L0148K422j0127J5923J8572M7100M3659N5138P2560K4609N9128
$$ y = [340046, 331256, 310038, 311090, 327979, 321149, 342496, 377119, 369324, 382337, 401324, 434720, 470424, 479330, 527853, 591126, 624935, 639462, 653648, 640647, 607451, 603238, 640923, 670990, 706832, 703702, 659958, 601685, 572384, 546966, 512641, 459803, 423383, 442286, 468879, 463420, 467325, 454919, 434057, 408093, 407603, 421349, 452844, 467705, 464886, 468742, 480211, 462094, 444508, 438756, 411822, 390023, 392190, 432421, 435226, 471009, 480857, 539848, 608532, 658921, 731857, 808477, 850106, 861073, 891840, 882403, 810785, 770577, 777131, 791192, 789901, 760480, 710217, 681050, 655547, 627630, 648552, 671114, 658984, 608352, 631350, 645348, 641282, 636812, 624986, 640073, 670221, 672643, 662516, 678439, 697011, 744111, 787770, 842908, 915468, 940077, 999205]
18732I99205M9234J3854p207J2996k556L7443M8448L1268K2572O6590P6834J3149
18720A361830l0813l5629j7052j7380l7176o9284m8300j5243M8542O2572N9667
18709A261734O2019N6814Q9786R3035O4332O8918P6167K7103M4293P2138O7734
18698A984073J14774J42508J29675J83392K31739K18401J91927K31268K33112
18689C660869L41196M36981N64589Q13519J193455J792602K675939L699743M777763
18680A9956656N941562O317284N608905M631784K678765j55479k239631l228893
18672C9510953m028753l367841j494831N8215J755161L081785L151036K784584
18664D1450309K116063J179654n158j230921k346603k964995l720449m639473
$$ y = [999205, 1048439, 1062293, 1055086, 1068082, 1065526, 1102969, 1151417, 1182685, 1205257, 1271847, 1348681, 1361830, 1331017, 1295388, 1278336, 1260956, 1223780, 1154496, 1106196, 1090953, 1139495, 1202067, 1261734, 1323753, 1380567, 1470353, 1563388, 1627720, 1696638, 1772805, 1799908, 1844201, 1916339, 1984073, 2098847, 2241355, 2371030, 2554422, 2786161, 3004562, 3196489, 3427757, 3660869, 4002065, 4439046, 5003635, 5817154, 7010609, 8803211, 11479150, 15178893, 19956656, 25898218, 32215502, 37824407, 42456191, 45134956, 44979477, 42739846, 39510953, 35482200, 32114359, 30619528, 30677743, 32432904, 35514689, 38665725, 41450309, 43566372, 44746026, 44740868, 43509947, 41163344, 38198349, 34477900, 29838427]
18656B9838427m241804l541313l121730k387642j592347j052779p18549m94078
18648A2688185l33614k31031j80763j35162p9368L8242J73100L64521O53266J063357
18638A4020733J733874K826145M418528O409191Q166947R363034Q909238O174478
18630F2022168K443706j693231n437581p601501o936777n052695k132767J041112
18622C6652434L666761N949445P259639O725524N566126L209629o13426m124223
18614F4291909o197827p934349q541215p173544n787069m455301l095632k130205
18606A8976767j569303j192072r46753q17863o98858o34973o17983n73148m95871
18597A1429943m22917m00318l57160l34315l23634k85468k84617k62677k52113
$$ y = [29838427, 25596623, 22055310, 18933580, 16545938, 14953591, 13900812, 13182263, 12688185, 12354571, 12123540, 11942777, 11807615, 11728247, 11766489, 11939589, 12304110, 12957376, 14020733, 15754607, 18580752, 22999280, 29408471, 37575418, 46938452, 55847690, 62022168, 64465874, 62772643, 57335062, 49733561, 42796784, 37744089, 35611322, 36652434, 40319195, 46268640, 53528279, 60253803, 65819929, 69029558, 68416132, 64291909, 58094082, 50159733, 41618518, 34444974, 28657905, 24202604, 21106972, 18976767, 17407464, 16215392, 15268639, 14450776, 13751918, 13116945, 12498962, 11925814, 11429943, 11007026, 10606708, 10249548, 9915233, 9591599, 9306131, 9021514, 8758837, 8506724]
18588H506724k64097l08655l27291l18813k51835k36924k19868j84599j73830
18579F220812j15923j04673j24861j20099r3191j08910j6714L8316J01212K01442
18569E877411K45295J33580M3819j2266j35837k34467k14769j23259m0437L4051
18559E573121O1038P1796J34380K09796K92593M12187O24499Q85113J347838K154192
18549A1766553L180347M157563M877090M918918M285169K782584N97285j516156
18541C5049353k854022l317307k908889j449419P67822L455740N627248O247117
18533D0617643M836214K208528j084138m551509o976488p114185n614985l805033
18525A8516047k456854j732543j253045q73209o22979m72400l72510k82127j85337
$$ y = [8506724, 8242627, 7933972, 7606681, 7287868, 7036033, 6799109, 6579241, 6394642, 6220812, 6104889, 6000216, 5875355, 5755256, 5662065, 5553155, 5536441, 5574757, 5675969, 5877411, 6122706, 6256286, 6300105, 6287839, 6152002, 5917535, 5702766, 5579507, 5539070, 5573121, 5634159, 5705955, 5840335, 6050131, 6342724, 6754911, 7379410, 8264523, 9612361, 11766553, 14946900, 19104463, 23981553, 28900471, 33185640, 35968224, 36565509, 35049353, 32195331, 28878024, 25969135, 24519716, 25287538, 28743278, 34370526, 40617643, 45453857, 47662385, 46578247, 42026738, 35050250, 27936065, 22321080, 18516047, 16059193, 14326650, 13073605, 12200396, 11577417, 11105017, 10732507, 10450380, 10265043]
18516A0265043j46969j43346j08720p0629j4866M5371J50532K46531M06728N95336
18506A1225011R06773J349528K010554L123749M599986O027229P118535P168459
18498D3529824O302622N172690M004818K602237J242790L4371j187895k101448
18490E9600009k331563r43987K366511N916475Q046314P932464N476715R51103
18482H7014041m231002q278189j0412389j1040768r867721p740758n464697l731156
18474B6247361k642217j997572j580407j292704j047130q85134p94297p28869
18466A5279031o46854n76538n70707n19152m64210l77987l70158l64907l70998
18457A1017520l50529l32203l52887l15853k28803k08631j53713j19585j15015
$$ y = [10265043, 10118074, 9974728, 9866008, 9795379, 9780513, 9825884, 9976416, 10222947, 10629675, 11225011, 12131784, 13481312, 15491866, 18615615, 23215601, 29242830, 36361365, 43529824, 49832446, 55005136, 59009954, 61612191, 62854981, 62889352, 61701457, 59600009, 57268446, 56324459, 58690970, 64607445, 72653759, 80586223, 86062938, 87014041, 82783039, 74504850, 64092461, 53051693, 43183972, 35443214, 29978517, 26247361, 23605144, 21607572, 20027165, 18734461, 17687331, 16802197, 16007900, 15279031, 14632177, 14055639, 13484932, 12965780, 12501570, 12123583, 11753425, 11388518, 11017520, 10666991, 10334788, 9981901, 9666048, 9437245, 9228614, 9074901, 8955316, 8840301]
18448H840301p1286q8579q8180l0465L6876J18914K15987L11597M73516O94934
18438A0413615R97324J492760K215918L266752M272416M338819L077813J294196
18430C1369613n90308k605176l984534l697325k282338o87561Q55830K499080
18422B0877281M019991M762648M097643K309612n667k448848m502151n159620
18414B3950889m295915k936452j959819j359294r85182o82789n04367l74017k85223
18405A0567831k20524j32194j16566o0445J6564N3102J10916J79959K58741L74376
18395A1031760N65426Q00278J180760J806298K853864M637176P276217J0116428
18387D0268207J1464235R823958N953263J047752m169329q584931r847340p743649
$$ y = [8840301, 8769015, 8680436, 8592256, 8561791, 8598667, 8717581, 8933568, 9245165, 9718681, 10413615, 11410939, 12903699, 15119617, 18386369, 22658785, 26997604, 30075417, 31369613, 30779305, 28174129, 24189595, 20492270, 18209932, 17522371, 18378201, 20877281, 24897272, 29659920, 33757563, 36067175, 36061508, 33612660, 29110509, 23950889, 19654974, 16718522, 14758703, 13399409, 12414227, 11731438, 11227071, 10853054, 10567831, 10347307, 10215113, 10098547, 10038102, 10054666, 10107768, 10218684, 10398643, 10657384, 11031760, 11597186, 12397464, 13578224, 15384522, 18238386, 22875562, 30151779, 40268207, 51732442, 61556400, 67509663, 68557415, 64388086, 55803155, 45955815, 38212166]
18379C8212166m202956q60848K177035N062007P135829P363408N450780K440524
18371F2777945j403377n287605p774084p829726o553795n207167l979117k897670
18363B1845404k003203j472421j093108q08971o69357n90995m80521l89917l54633
18354A3982278l18891k09754r1754K6890J52168K98018M58923O07192Q61207J274294
18344A7040571J947831L005270M664149P115260R880237J1394899J1173767J0326957
18336G6548941Q351371L772985j756641n193466p251472r055088r381449p195166
18328D8840015l528005O33387M727585Q453509J0914065J0792282P459152J902584
18320I0194574m177562r458802j2628919j2535886r833498o664367m383388l129711
$$ y = [38212166, 34009210, 33148362, 35325397, 40387404, 47523233, 54886641, 60337421, 62777945, 61374568, 56086963, 48312879, 40483153, 33929358, 28722191, 24743074, 21845404, 19842201, 18369780, 17276672, 16467701, 15798344, 15207349, 14726828, 14336911, 13982278, 13663387, 13453633, 13361879, 13388769, 13540937, 13838955, 14297878, 14905070, 15766277, 17040571, 18988402, 21993672, 26657821, 33773081, 43653318, 55048217, 66221984, 76548941, 84900312, 88673297, 86916656, 81723190, 74471718, 65416630, 56035181, 48840015, 45312010, 45945397, 50672982, 59126491, 70040556, 80832838, 88291990, 90194574, 86017012, 76558210, 63929291, 51393405, 41559907, 34895540, 30512152, 27382441]
18312B7382441k385089j774466j386243j105345r47026q55110p50727o04390m67011
18303A7107034l71299k77442j86243n0651L8309J27796K98898N84644R82315J601285
18293A9854646K562504M214535O471046Q526254R266347P765843M588507L90871
18285F3640553l890030p081295p582726n499822k099067J436820M161932N611255
18277D8697620N150666L123659k47731l729281o621882p707762p162162n493696
18269B6009431l742068k557309j791953j308943j022721p79841o47431n56845
18261A3602320n30054n42966m90557m44563l80354l44944k95044k19238j61624
18252A0192976j40290j11927m7474M8794J60262L79517Q18053J457193K156254
$$ y = [27382441, 24997352, 23222886, 21836643, 20731298, 19784272, 18929162, 18178435, 17574045, 17107034, 16735735, 16458293, 16272050, 16221399, 16259708, 16387504, 16686402, 17271046, 18253361, 19854646, 22417150, 26631685, 33102731, 41628985, 50895332, 58661175, 63249682, 63640553, 59750523, 52669228, 45086502, 39586680, 37487613, 38924433, 43086365, 48697620, 53848286, 56971945, 56724214, 52994933, 46373051, 38665289, 31503127, 26009431, 22267363, 19710054, 17918101, 16609158, 15586437, 14806596, 14159165, 13602320, 13072266, 12529300, 12038743, 11594180, 11213826, 10868882, 10573838, 10354600, 10192976, 10052686, 9940759, 9893285, 9942079, 10102341, 10481858, 11299911, 12757104, 14913358]
18243A4913358K651976K606480J905802P99757n49163j752194k387883k154248
18235A6033885j242383n685R95317J571283J503026Q07529j66436j274640k223679
18226A5998217k559061k206278j620167j079525p72386n89506m58494l76667k73065
18217F063068k20742j99009j96001j86863j88194j86988k04570j65407j41143
18208D374151j58514j59211r1868r3162j31989j26139j29226j47755j52668j31973
18198C051646p0194p0715r1261o5998m7750o4155n9128n6821l7881q3302n5049
18187B349392o7828o4538p1704r5263p1834l3120m7902m2325k9364o8363n3728
18176A703423k0334j5614l8815r688N1850Q0910J26232J60465J64373J73598P6600
$$ y = [14913358, 17565334, 20171814, 22077616, 22877373, 22328210, 20576016, 18188133, 16033885, 14791502, 14785817, 15781134, 17352417, 18855443, 19662972, 19496536, 18221896, 15998217, 13439156, 11232878, 9612711, 8533186, 7760800, 7171294, 6712800, 6336133, 6063068, 5842326, 5643317, 5447316, 5260453, 5072259, 4885271, 4680701, 4515294, 4374151, 4215637, 4056426, 3964558, 3871396, 3739407, 3613268, 3484042, 3336287, 3183619, 3051646, 2981452, 2910737, 2819476, 2753478, 2705728, 2641573, 2582445, 2525624, 2487743, 2404441, 2349392, 2281564, 2217026, 2145322, 2050059, 1978225, 1945105, 1897203, 1854878, 1825514, 1757151, 1703423, 1683089, 1667475, 1628660, 1618972, 1670822, 1751732, 1877964, 2038429, 2202802, 2376400, 2453000]
18165B453000J8071j09404j68714j58200j62418q1081j9013j3706M174k9882k7246
18154A705581j3412l7278o3865l5578m2929n487M8518R2678J17399J11754P7400
18143A954781K9305k7482p3243r7380q2736l9853l1255k2893j3144L1024Q8450
18132A715574J23550J43103Q2709L3303p578m7108r4010j08306l3401K4322O9816
18121A901974P5911R0713J27485K24071L39335M65592P13636J155420J912503
18112G006640L329489N515389O981707M731835K130985J70517k737736o743967
18104B0384859o394426l736810k111241j367527r33792o46740m53163l13839k57612
18095D169709k48291k21084k10052j88469j61951j77270j84470j60784j15302
$$ y = [2453000, 2471071, 2361667, 2192953, 2034753, 1872335, 1791254, 1772241, 1758535, 1762709, 1732827, 1705581, 1692169, 1654891, 1591026, 1555448, 1512519, 1507032, 1555550, 1648228, 1765627, 1877381, 1954781, 1984086, 1956604, 1883361, 1785981, 1703245, 1663392, 1632137, 1609244, 1596100, 1627124, 1715574, 1839124, 1982227, 2064936, 2098239, 2090661, 2043553, 1949543, 1841237, 1807836, 1832158, 1901974, 1977885, 2068598, 2196083, 2420154, 2759489, 3225081, 3938717, 5094137, 7006640, 10336129, 15851518, 22833225, 27565060, 29696045, 29866562, 27128826, 20384859, 13990433, 10253623, 8142382, 6774855, 5841063, 5194323, 4741160, 4427321, 4169709, 3921418, 3700334, 3490282, 3301813, 3139862, 2962592, 2778122, 2617338, 2502036]
18086B502036j10978q1958o9385p7795n3639q4202j03847q0512j18752p9935l9426
18075A601607k4769j2654J867q700k3181l7169p4249p3297n3870o3387n4621n5895
18063A121682m2559j3125l4890l4393k5173l2368n3385j9894K000j5152J2905
18052H65648j9272j9897k7422j287j8222j003J0266q05J1874k1623m0144j0608
18040G27505o219m6137k9053j7558n928k4219l6505n1969l4661k7125P589L3326
18028D89046q252j5268O05o95j6112l3298l9244j9312K4445m8418l3469L354J1023
18015C14405j8505m765J7935O1547J9824K4583P9728O8385M6265K345j6564j7910
18003E77273m3457k2298l1371q100K6493L6789M1915N153k3494J4259l2607n9023
$$ y = [2502036, 2391058, 2309100, 2239715, 2161920, 2108281, 2024079, 1920232, 1839720, 1720968, 1641033, 1601607, 1576838, 1564184, 1566051, 1557351, 1534170, 1497001, 1422752, 1349455, 1295585, 1232198, 1177577, 1121682, 1079123, 1065998, 1031108, 996715, 971542, 939174, 885789, 865895, 867895, 852743, 865648, 846376, 826479, 799057, 797770, 779548, 778545, 788811, 788006, 799880, 778257, 738113, 727505, 721286, 675149, 646096, 628538, 622610, 598391, 561886, 509917, 475256, 448131, 455720, 489046, 480794, 465526, 466131, 465436, 449324, 416026, 376782, 357470, 381915, 333497, 300028, 303382, 314405, 295900, 291135, 309070, 370617, 390441, 415024, 494752, 563137, 609402, 611747, 595183, 577273, 533816, 511518, 480147, 472047, 498540, 535329, 577244, 582397, 558903, 573162, 540555, 481532]
17991D81532p1228p4640o5367p049J8076p102k1751j5613p528J0237n891j0262
17979B23414l2836m5966k206J8860j2585p447j3699j4266l219j7349K7186K2292
17967A42179M4902K4514J040j1830j3566q416M7460Q1178p482L604K5809N044
17955C34436m6124K1498Q231k516J6192K84m5L7263L164p106o803p243l2879m1086
17941B77266o0348l8556j2780l078l5322j2563J6207r580k8661q605Q948L3257
17929A26185K039l1151j8165j4878j4990N812J8764O577k1534k7320k3037K4190
17917C2492O1983l093J9500L1281Q067l721L4338M7091K5971J1978P294k2427
17905B50754m4425j6931n284k9529p861N9162K6527J3960J2914r322l7364n7660
$$ y = [481532, 410304, 335664, 270297, 263248, 281324, 274222, 252471, 236858, 229330, 239567, 233676, 223414, 190578, 144612, 142406, 161266, 148681, 141234, 127535, 113269, 110050, 92701, 119887, 142179, 187081, 211595, 212635, 200805, 187239, 178823, 226283, 307461, 299979, 303583, 329392, 334436, 288312, 309810, 318041, 315525, 331717, 332001, 331956, 369219, 372383, 365277, 358474, 351231, 318352, 277266, 216918, 178362, 165582, 162504, 127182, 114619, 130826, 121246, 92585, 83980, 92928, 126185, 128224, 97073, 78908, 64030, 49040, 54852, 73616, 80193, 58659, 31339, 8302, 32492, 94475, 91382, 110882, 142163, 150230, 146509, 180847, 227938, 253909, 265887, 273181, 250754, 206329, 189398, 184114, 154585, 146724, 205886, 232413, 246373, 259287, 249965, 212601, 154941]
17893A54941l1501k8973M265j1498P329Q803r781J7234R215k6167j7606p963J4968
17880H3266j1607j4496L088q030n853r111J8290K7065K9187k9211o749k8164M226
17867E1901O0766J5043J1439J692N064J8225O2402O0355L0319j096M272l6035
17855B84347m1000J4280J7014M1963J1270P729K1020k5626k8756o972j4954L399
17843B83714l6023n2257m1164m1591r394l4871j4049J777k673J0172K2353K542
17831H8536J0268J0718M142K020l863r350L137L0533L7822K0205K5588M6824K3918
17818B90498L561P365l876j0318J967l481O5395O0903K2859k0163m8038m9070
17806C17602n1502m7505l1124m500K9816P66j0541M550k1579j5328p029l2380
$$ y = [154941, 123440, 94467, 98732, 87234, 94563, 103366, 93585, 110819, 120034, 93867, 76261, 68298, 83266, 71659, 57163, 60251, 52221, 46368, 37257, 55547, 82612, 111799, 82588, 75839, 47675, 51901, 112667, 127710, 139149, 140841, 145905, 164130, 226532, 286887, 317206, 316110, 320382, 284347, 243347, 257627, 274641, 316604, 327874, 335603, 356623, 330997, 302241, 295269, 280315, 283714, 247691, 195434, 154270, 112679, 103285, 68414, 54365, 56142, 53469, 63641, 85994, 88536, 98804, 109522, 113664, 115684, 111821, 102471, 105608, 136141, 173963, 194168, 219756, 266580, 290498, 294059, 301424, 297548, 287230, 289197, 285716, 351111, 412014, 434873, 414710, 366672, 317602, 266100, 218595, 187471, 182971, 212787, 213553, 203012, 207562, 185983, 170655, 163626, 131246]
17794A31246o4303J2826q465j7809N230j8968R569K5620j9569o977P890j726j693
17781E2871l022J6687J0220K038M3008N0225N1669M2738J6858M2235M9553l329
17769C71751l67j09K640J0864r625m9074o317J162K4530Q278l2381l1688n6083
17756B33581o6694j8024O895k198k6017k146Q115J0608n662j3677j9906m1951
17744F2924k1903j2597J8881k892r608k9000M859K2246K8070L6306L220j9488
17732H1018k3301j7350J0595M8300M1566J6090J5765K5195r105k3559J8186l4589
17720A48811l1705k3638k8475k0210K3453J5747J6371Q860K1555j0986j2559k7333
17708G9891j0348j9721j8569n146k05P663O441j4422j0142j0770J546K2870K2719
$$ y = [131246, 66943, 79769, 71304, 53495, 58725, 39757, 49326, 74946, 55377, 48400, 56290, 54564, 52871, 49849, 66536, 76756, 78794, 121802, 172027, 223696, 266434, 283292, 325527, 375080, 371751, 371384, 371275, 373915, 384779, 375154, 326080, 319763, 320925, 345455, 353733, 321352, 289664, 233581, 166887, 148863, 155758, 153560, 127543, 125397, 133512, 144120, 138458, 124781, 104875, 62924, 41021, 28424, 47305, 44413, 34805, 5805, 10664, 32910, 60980, 97286, 100506, 81018, 57717, 40367, 50962, 99262, 140828, 156918, 172683, 197878, 188773, 165214, 183400, 148811, 117106, 93468, 64993, 44783, 68236, 83983, 100354, 109214, 130769, 119783, 107224, 79891, 69543, 49822, 31253, 26107, 25902, 33565, 40006, 25584, 15442, 4672, 6218, 29088, 51807]
17695E1807j7095j1612l775k3488o356N590J3539K2241K6902J221j5631j9711
17683B3632J6443J8832K494j7091k3322j4586L5010n219l0770q458j8691k2151
17671d3877J4229J6586O869K1618J9453L971k1985l4002l4434j1755M4228K7331
17659H232J7650l091k0881q152R704j233k1604l1339K0563J0523L014o669J1728
17646a1555P759j2081K0571J676r996K5642k58j8934l3419n932J2041K1126M414
17633A054L103M988R162K211k1868j8572L075J501q513m380K3658L819k8584J8836
17619a0510L1052j0952r985P005l744n608J7377M213j0276J4143j4189l826J6010
17606B0710n802p782m4799J8577K2395o004j5870r812r208J5753K3168p102N481
$$ y = [51807, 34712, 23100, 19325, -4163, -10519, -4929, 8610, 30851, 57753, 58974, 43343, 23632, 40075, 58907, 61401, 44310, 20988, 6402, 41412, 36193, 5423, -3035, -21726, -43877, -29648, -13062, -6193, 15425, 34878, 38849, 16864, -17138, -51572, -63327, -19099, 8232, 25882, 22791, 1910, -6242, 3462, 2229, -19375, -50714, -30151, -19628, -16614, -23283, -11555, -3796, -15877, 4694, 6370, -3626, 22016, 21758, 2824, -30595, -36527, -24486, -3360, 1054, 4157, 9145, 18307, 20518, -1350, -19922, -16847, -15346, -23859, -28239, -4581, -762, -29346, -10510, 20542, 9590, -395, 6610, 2866, -2742, 14635, 18848, 8572, 22715, 8526, 4700, 20710, 14908, 7126, -37673, -19096, 3299, -2705, -18575, -28387, -37595, -21842, 1326, -5776, -295]
17593b95n455n709J8381Q02O912k9740J1904J562q649j612J682m944j9065N574
17579b8652L3064k0578K1888j0731j7438J4951k546l263J2220K8509p290j7226
17567B908Q874O486K7707j6100l0629J9750j8982j6729n731Q33J3380j3592K8241
17554F416L2699O030k427j6783k3516j225j864l515j0267J1677L2872K0996l5587
17541A5506k0534J8672J2127k1972l0114K4678r829l830J0352K4354k7282k6475
17529c4347q480m378J7408K1577J9079j2741l3109o912J9286j5764j2159K2059
17517b8481J2264l52j5043L7332n878k3917j1701j4381M062r747K1556J2570k908
17504b4624J9501M589j4689j8392J8372J4818J615J0767N432Kk5526K1256j2181
$$ y = [-295, -5750, -11459, 6922, 7724, 14636, -15104, -3200, -1638, -10287, -11899, -10217, -15161, -34226, -28652, 4412, -16166, 5722, -5009, -22447, -7496, -10042, -13305, -1085, 27424, 20134, 2908, 11782, 18268, 45975, 29875, -754, 18996, 14, -16715, -22446, -21613, -8233, -21825, 6416, 39115, 45145, 42718, 25935, 2419, 1194, -670, -4185, -14452, -2775, 30097, 51093, 15506, -5028, 13644, 25771, 3799, -26315, -1637, -11466, -15296, -4944, 19410, -7872, -34347, -42827, -47205, -29797, -8220, 10859, -1882, -34991, -41903, -22617, -38381, -50540, -28481, -16217, -16569, -31612, 5720, -158, -24075, -35776, -50157, -46095, -55842, -34286, -21716, -24624, -5123, -534, -15223, -33615, -15243, -425, 1190, 11957, 17389, 17391, -8135, 13121, 940]
17491I40q29K190k1713j1310O688j4097j7914J3438K8494j971R806O571k2803
17478b2510k0875K4534r560N635L0315L1205j5945j6302j6334j665j4536M33J1093
17465a4512r448m932L890J2291l8133k2536J4414N5768q303j0039O161N395M852
17452e132j4592O504K796K741J7333K2526O417O524N0141L6609q77n1j95l2172
17438I8572m1231l5330l0882q145L131J5421R926q069l4622N464K9354Q955O600
17425A9144k115j0184l4862J1179L4618J3668Q859j9885J1263L1942K4930j6398
17413G2159k8966k1437p853k7548K8254J2932k3693J5106L48O117o904J060K931
17400B2506j0181J1183k6785J5526r126m632j0248J5626L1916R797J531j8854
$$ y = [940, 111, 2301, -19412, -30722, -24034, -38131, -56045, -42607, -14113, -16084, -6278, 293, -22510, -43385, -18851, -28411, -22776, 7539, 38744, 22799, 6497, -9837, -11502, -26038, -25605, -14512, -23960, -28892, -25002, -12711, -50844, -73380, -58966, -3198, -11501, -21540, -15379, -9984, -5132, -19724, -13220, -10424, -7683, 9650, 32176, 38593, 45117, 95258, 131867, 130990, 130939, 130744, 98572, 57341, 22011, -8871, -17016, -13885, 1536, 11462, 3393, -31229, -25765, 3589, 12544, 19144, 17029, 6845, -28017, -16838, 17780, 31448, 40307, 20422, 31685, 63627, 88557, 72159, 43193, 21756, 13903, -13645, 14609, 27541, 3848, 18954, 19302, 25419, 18515, 19575, 22506, 12325, 23508, -3277, 12249, 3123, -1509, -11757, 3869, 35785, 45582, 47113, 28259]
17388B8259l037L150r960m591L1428J915m9096k3120K4274N329N430K735p912
17375D804J708m440M2027J4367l159m406j3357l8921j6657j2865J9166J8198j9914
17362a3449j1410J0553L2314M883k2249K280M696j2250K0686l2974j4404l535
17350c4859J1524J9704K2938J1865o792R24J8142k8768o259K2224P136j0072q990
17337A8717r809K200q349k1667J4561J1628k8873k0396J5729L849o412j4858k2659
17324f6339Q88J5315l823r514R291M2284J2654j7225r62R207J7366O856K6613
17311D2611j7264k1467Q677n767J7090M94n610j2246n079j412J7586L6737j0763
17298D3587l4989L710p525j9211J853K2904o414P838n091j7728k5626Q504J5190
$$ y = [28259, 25222, 28372, 18412, 13821, 45249, 47164, -1932, -25052, -778, 4551, 9981, 12716, 4804, 6512, 2072, 44099, 58466, 55307, 50901, 37544, -1377, -18034, -30899, -11733, 6465, -13449, -24859, -14306, 18008, 22891, 642, 2922, 7618, -4632, 16054, -16920, -31324, -34859, -23335, -3631, 19307, 31172, 24380, 25304, 43446, 14678, 8419, 30643, 37779, 27707, 18717, 8908, 11108, 2759, -18908, -4347, 7281, -21592, -41988, -26259, -22410, -28822, -43680, -66339, -65451, -50136, -53959, -63473, -54182, -11898, 756, -16469, -17431, -8224, 9142, 15998, 42611, 25347, 3880, 12557, 6790, 23880, 24374, 18764, 6518, 1439, 27, 17613, 54350, 43587, 8598, 12308, 4783, -14428, -12575, 10329, 3915, 11753, 6662, -11066, -36692, -28188, -12998]
17285a2998J2492K7617r242l6569k0341K005L227J5595K637j8604m271K9622k302
17272a1132R490K5749j3827j502n615k3665j0683j7483j7977k7723J3097M1082
17260d0189K6413J573M803J7460l272j2757K425J988k1367K1358J3248l0620j4426
17247c3363l403K4483R237L4614K7266j9464J2007L714m7885l5367J4307K5767
17235A1913L050j1626K0273j6139j5688j2643K0995J9018o684M490p835K271n639
17222E756p812q015j7605K3023P312K2848k121k2972p059j797J1631K6193j277
17209B8105k507k9154M26m836j9268J7303q057J5414K2653n922l149j7489j7375
17196b3856J529J3173K4708N528K1398j800j9066m1423J2507o333J3040j1538
$$ y = [-12998, -506, 27111, 17869, -18700, -39041, -37036, -33809, -18214, -15577, -34181, -38452, -8830, -11132, -1642, 24107, 10280, 8778, 3163, -20502, -31185, -48668, -66645, -94368, -81271, -40189, -13776, -12203, -7400, 10060, 6788, -5969, -3544, -1556, -22923, -1565, 11683, -18937, -33363, -36766, -12283, -3046, 31568, 58834, 39370, 51377, 55091, 7206, -28161, -13854, 11913, 14963, 3337, 23610, 7471, -8217, -20860, 135, 19153, 12469, 16959, 9124, 11395, 5756, -2056, -10071, -27676, -4653, 2659, 25507, 23386, 414, -6645, -8442, 3189, 29382, 28105, 25598, -3556, -3130, -7966, -27234, -9931, -17988, -2574, 20079, 14157, 11008, -6481, -23856, -22327, -9154, 15554, 21082, 42480, 40680, 21614, -19809, -7302, -13635, -595, -12133]
17184a2133m129K5195J477j6382j847J9731o310j790K0453j561l4052j7234j0046
17171c8628J2108J3304q626L892K836R670P991k398P139O740P106k9825n242r089
17157b3022j5931j684L216K838L1775J0930p310K32K5233j4771j2786K786j9183
17144a7677K4283J5605p366j259j3396J7261Q920O631k5594k1083K8020N677j4567
17131E455Q884j3355p685M59k164K2555J4872j233m500K5565r058j0717K4730
17118E3808k8837j2930K2613n3805q162K3917K4253O998j4455j8843j7095j0513
17106c3051J6383k4386k5181k939r481M7872J3057q912p96k301J3934L654k3271
17093c5418L844N964r142j2166J2526J6436L346J3796j5009j6813J0785n016j234
$$ y = [-12133, -16262, 8933, 10410, -5972, -7819, 11912, 5602, 3812, 24265, 22704, -11348, -28582, -38628, -26520, -13216, -21842, -17950, -15114, -5444, 2547, 149, 7288, 14028, 21134, -8691, -13933, -23022, -38953, -40637, -37421, -34583, -2808, 8122, 812, 1044, 26277, 11506, -1280, 1506, -17677, 6606, 22211, 14845, 13586, 190, 17451, 26371, 33002, 7408, -13675, 14345, 20022, 5455, 14339, 984, -6701, -6242, -8406, 14149, 29021, 27788, 23288, 48853, 39795, 29078, 53808, 24971, 12041, 34654, -19151, -27313, -3396, 20857, 27855, 13400, -5443, -22538, -33051, -16668, -41054, -66235, -69174, -78655, -30783, -17726, -26638, -27434, -29735, -15801, -12147, -35418, -31574, -25610, -34752, -46918, -34392, -17956, -14610, -814, -15823, -32636, -21851, -26867, -28101]
17080b8101L358O951j8571l814M0801m3088m0773J2820J6356L1530L1017j6175
17068g689N646M205m314M204M439k7693o545n486R859J4855J084o182p691k0321
17054d1629Q488J8163q92m983k2780J727L448J1118L0021K092n797M501k5345
17041b1868m3132N043K5877N963l3896K0632K1438k2069K478M3102J5671j5777
17029C462K3892L0287P380k7361m9111J2651J4066j2482l182J0379k2015m0849
17017e2883J4578J3828j1376j4328j8101J0541q374R352L4413K6735n74k2376
17005a8565K264Q024q709j4408k8650R91j5376J2882K3520J8072p25L3542J0502
16992B3364j7695j2800m376L5946j0732K975l0331L462J812k9982J7141O319j6532
$$ y = [-28101, -24743, -17792, -36363, -40177, 624, -42464, -83237, -70417, -54061, -22531, 8486, -7689, -2043, 2162, -2152, 2052, 6491, -21202, -27747, -33233, -23374, -8519, -7435, -13617, -21308, -41629, -33141, -14978, -15870, -20853, -43633, -41906, -38458, -27340, 2681, 4773, -1024, 3477, -21868, -65000, -59957, -34080, -28117, -62013, -41381, -19943, -42012, -39534, 3568, 19239, 3462, 27354, 57641, 65021, 37660, -11451, 1200, 15266, 2784, -398, 9981, -12034, -52883, -38305, -24477, -35853, -50181, -68282, -57741, -66115, -56763, -22350, 4385, 3811, -18565, -16301, -8277, -16986, -31394, -60044, -59053, -74429, -61547, -38027, -19955, -20680, 12862, 23364, 5669, -7131, -11507, 24439, 13707, 16682, -13649, -10187, -8375, -38357, -21216, -14897, -31429]
16979c1429P124n399j9786r478J2223P380P005J1604j7152m4242K1966L3112P414
16966a9658j4741j3555M2243K5813M431j2594J4760J0979j4872M769M326k1514
16954A0387j7873j9695J3368l050k5545L656K3253R625j3120m038j4974k6675
16942f4681j4301K7534M1416L4159J6009k922j2435q257R216k1912j2087J121
16930g140R052K7973l553j0197L632l22r509r94K1504r224k1660n67j5802j0874
16916b7681j9463j0887M3586J3994K0759J7513r134q657k9829k0289k0848R282
16904d1654k3111L1150K9147J025o383J8664L9738k0664m8206j0561l0222P624
16892e3453L922O88K5690J4554K7847J7070j5493l4834j1117R012L459k866j406
$$ y = [-31429, -24305, -29704, -49490, -58968, -46745, -39365, -32360, -20756, -37908, -82150, -60184, -27072, -19658, -34399, -47954, -5711, 20102, 24533, 11939, 26699, 37678, 22806, 27575, 31901, 10387, -7486, -27181, -13813, -16863, -42408, -38752, -15499, -5874, -18994, -23032, -38006, -64681, -78982, -51448, -10032, 24127, 40136, 37214, 24779, 16522, 25738, 3826, -8261, -7140, 1912, 29885, 26332, 16135, 19767, 19445, 9936, 8942, 30446, 21222, -438, -1005, -16807, -27681, -47144, -58031, -14445, -451, 20308, 37821, 28687, 20030, -9799, -30088, -50936, -41654, -64765, -33615, -4468, -3443, -9826, 8838, 48576, 27912, -20294, -30855, -61077, -53453, -49531, -48843, -23153, -8599, 19248, 36318, 20825, -14009, -25126, -16114, -12655, -15521, -16927]
16879a6927n903O644j0701k0921l862L2935K142k8898j3980K2362M3765r714j1561
16866a4619n566j645K2247l0410J9381J84k1309J6171K8301k3271p418j2675K949
16853b7680J929j619j1619P953j410m83M324P935J8007j0965m793J149O97J2532
16839d043j270J7933k2583j3505J1293j507Q797o91J5867j2593k9475l055J3209
16826b1623j3597Q62j92m360K1363J6751O879m9990q924o431M122K447K57l174
16812e5610j5646L104L6822K5392j7150l0085K4247J6053m596q436J4000J002
16800a0903J8524P470l8370l2774m510N9494J9073J2921n306j0520j2752k6493
16788b4146J882L3160J187j5369r995J4721M507j7855Q105j0428j1491J6489K2106
$$ y = [-16927, -22830, -16186, -26887, -47808, -51670, -18735, -16593, -45491, -59471, -37109, 6656, -3058, -14619, -20185, -21830, 417, -29993, -10612, -10428, -31737, -15566, 12735, -10536, -17954, -30629, -27680, -25751, -27370, -38989, -31036, -32446, -32929, -28605, -20670, -2663, -13628, -18421, -17272, -16575, -4043, -5313, 12620, -9963, -23468, -12175, -13682, -4885, -5576, 10291, -2302, -31777, -34832, -21623, -35220, -34358, -34550, -38910, -17547, -796, 6083, -43907, -52831, -59262, -55140, -52693, -52436, -55610, -71256, -68152, -31330, -5938, -23088, -53173, -28926, -12873, -17469, -25905, -11905, -10903, 7621, 15091, -23279, -56053, -60563, -1069, 18004, 30925, 25619, 15099, 2347, -24146, -22264, 10896, 12083, -3286, -13281, 1440, 5947, -11908, -3803, -14231, -25722, -9233, 12873]
16775A2873j726j6162p181K6061K66K033q289P725m979O385P952j290Q525P961
16761D0154q126o793j9624p295o854N242J569j1969K5387M0972J6825j492l4082
16748C3914l9532o662m12N280r730K1125O164q781l0839m228k6890j9066K5892
16735e3765K6651j1263K4030k300k671r03J4074K3420l3709j1334j8767J542R173
16722c5822O652Q905l291p858J8780J2175Q337J6640K4570l253j6650q923J4515
16709C4777m689l4630O959J6403P726m588k5710K350J4421o055k0910k0951J8629
16696a6268L884Q647K6773j6192k8706K2030K2530o201l2576j9268J1279L4118
16684A0050j5315j9348Q967J1965L979p235j2634r021J6882j1286M342J4941K4438
$$ y = [12873, 11147, -5015, -12196, 13865, 14131, 16164, 7875, 15600, 10621, 17006, 24958, 23668, 32193, 40154, 32028, 25235, 5611, -1684, -8538, -3296, -1727, -13696, 11691, 52663, 69488, 67996, 33914, -5618, -12280, -12692, -7412, -17142, 3983, 10147, 1366, -29473, -33701, -60591, -79657, -53765, -27114, -38377, -14347, -16647, -19318, -20221, -6147, 17273, -16436, -27770, -46537, -44995, -35822, -29170, -20265, -23556, -31414, -12634, -459, 7878, 24518, 49088, 45835, 29185, 20262, 34777, 30088, -4542, 2417, 18820, 26546, 21958, -3752, -1402, 13019, 6964, -13946, -34897, -16268, -12384, -3737, 23036, 6844, -21862, 168, 22698, 16497, -16079, -35347, -24068, 10050, -5265, -24613, -15646, -3681, 298, -6937, -19571, -28592, -11710, -22996, -18654, -3713, 20725]
16671B0725J3831N655j5116m443K5954k860k4196o742j9886P237J8972m326k4245
16658i440l0177r583J2978K2123K3337Q012O859K1987J4548j1747J495J2682p62
16645F2312j9496j4446K0607k9730l2837J4342j1046k6104M2486K3205k9088K3120
16633B3325K0461k324j381j5259R882j3910j8051N917l0032Q42L4790L9698k5956
16620B8002r286k6136n346J1487L9962K2880O840j8657J982j6294q012j0967K940
16607A9395j0320k4909K8078L2336J4095k2922k9500k287J1998l301o245J1472
16595A7890k4623j2117j023L5568K2366l199j8344j1978j6347M459j1832k1861
16583d1041j703q024j8512M5770L9879J3033k4800k7279K2978k35j3810J461J0305
$$ y = [20725, 34556, 40211, 25095, 20652, 46606, 43746, 19550, 12808, -7078, 159, 19131, 14805, -9440, -39617, -49200, -36222, -14099, 9238, 17250, 24109, 46096, 60644, 48897, 50392, 63074, 62312, 42816, 28370, 48977, 19247, -13590, 752, -10294, -36398, 6088, 29293, 205, 23325, 43786, 41462, 40081, 24822, 34704, 20794, 2743, 8660, -21372, -20530, 14260, 53958, 28002, 18716, -7420, -12766, -1279, 38683, 61563, 68403, 49746, 51728, 35434, 27422, 16455, 19395, 9075, -15834, 12244, 44580, 58675, 35753, 6253, 3966, 15964, 12663, 6418, 17890, -6733, -18850, -19873, 15695, 38061, 34862, 16518, 4540, -11807, -7348, -19180, -41041, -42744, -50768, -69280, -23510, 16369, 29402, 4602, -22677, 301, 66, -13744, -12283, -1978]
16570a978M543R129J4508Q354j8100J1925O274o038j6930J9548j6321k8297m7119
16557f0502J1563L3218K1690k3836j3707J3408M771j8169M218r017L3012L454
16545A03J1446Q153j1314r345N066o30N703P689l4626m8953j464J4357J9972J9849
16531a3994K142J2025m0094m7543K6635L1765K2881J6052m169o804j2280j839
16519a5223K1022J657P274k3152J3405P992l90j303l4049k73M319J1210n922J4840
16505A407l0132l3634n736K0782j4032J9882M7279k748Q265L971j9455M85n510
16492i176J3131J8358k27N96J1407M252M169l789k6781P622l2447l5641K6562
16479b1964J6741M994N003P090J584m4954J689L0494K1372K8077j9202j1021k4322
$$ y = [-1978, 2565, 11694, 26202, 34556, 16456, 28381, 34655, 28617, 11687, 31235, 14914, -13383, -60502, -48939, -15721, 5969, -17867, -31574, -18166, -13395, -31564, -27346, -36363, -3351, 103, 11549, 19702, 8388, -957, 4109, 3479, 9182, 16871, -17755, -66708, -68172, -53815, -33843, -13994, -11852, 173, -39921, -87464, -60829, -29064, -6183, 9869, 5700, -1104, -13384, -15223, 5799, 7456, 14730, -8422, 4983, 12975, 12585, 11282, -22767, -23040, -18721, -7511, -13433, 1407, -28725, -62359, -68095, -47313, -61345, -41463, 5816, 3068, 11333, 15304, -4151, -3666, -9176, 3955, 22313, 22086, 22682, 34089, 38341, 42510, 38721, 11940, 19562, -12885, -48526, -21964, -5223, -229, 4774, 11864, 13448, -31506, -29817, 677, 22049, 50126, 30924, 19903, -4419]
16466d419j2028m7206K523J4687J4080J3320j4709N680J8705O159j2025J922J9935
16453F624J8643J576l4814k4909j623K1069K0892n144j850j3594M29j555J5184
16440I28K1314m103o648K0321J693l733k7005J685J5763J1563j1744j5461Q82
16427E455m863q136j3999k0922M328N0335J2847k1464M240R123j1038r381L994
16414E19L0139M9831k9269l2796J188K187Q942M628l059J7512J2711m89r505k6384
16400B6155j7599j1351N045J0654j7604q384J6778J6564j2952j5480j8157J3806
16388a2525M935K5832K4161j0477r490n717k277p373J176j0369N770P788N848
16375A7282q545k7859K1467j1159R95N994k3121J5022M4775P050l1068j5932q115
$$ y = [-4419, -16447, -63653, -61130, -46443, -32363, -19043, -33752, -28072, -9367, -3208, -15233, -13311, 6624, 25267, 26843, -7971, -32880, -34503, -13434, 7458, 2314, 464, -13130, -12701, -14256, 928, 22242, 18139, 11491, 31812, 33505, 29772, 2767, 4452, 20215, 31778, 20034, 4573, 5455, 592, -7544, -21543, -42465, -38137, 12198, 25045, 3581, 7821, 16944, 5906, -3475, 519, 30658, 80489, 51220, 18424, 19612, 21799, 30741, 35369, 32310, 49822, 62533, 62044, 52539, 26155, 8556, -2795, 2250, 12904, -4700, -13084, 3694, 20258, 7306, -8174, -26331, -12525, -7590, 18242, 42403, 31926, 22436, 16719, 14442, 7069, 8245, -2124, 3646, 11434, 17282, 8737, -19122, 2345, -8814, -7819, -1825, -24946, -9924, 34851, 41901, 10833, -5099, -13214]
16362a3214P456n871J7245L2224K281J1728j8187l7491K760L167J9884n680l6217
16349a9915j6265j6429K6051k352N341o316K1705n717J558O144J9327m27k5828
16336a3123k1641j172J5030Q42O418J4245K5260m778l195j8379j3948J802j4396
16323b7035J4055M510K6616L6309l2265l1804K6152M5115j7606m8602l6722J4284
16311b6993M062K8589R612k323J0916J4759J7519k0445k6493k1418m195k1283
16299c7693p047J5895m230l2078K2068L8382K4676Q044j0514o493l611K7164o189
16286B8374j8640j3944K2814J260J9188L1513J1136j6431m3731n6534j1074K1737
16274b4332K6067P950L557J1679R726l420l2619k9842J9738K3290j7674j3430
$$ y = [-13214, -5758, -11629, 5616, 37840, 40121, 51849, 33662, -3829, -1069, 2098, 21982, 16302, -19915, -36180, -52609, -26558, -28910, -23569, -29885, -8180, -13897, -12339, -6195, 13132, 12705, -13123, -34764, -35936, -20906, -20064, -13646, 599, 25859, 21081, 17886, -493, -14441, -12639, -27035, -12980, -8470, 18146, 54455, 22190, -9614, 16538, 61653, 44047, -4555, -41277, -26993, -22931, 5658, 15270, 12947, 23863, 38622, 56141, 35696, 9203, -12215, -16410, -37693, -44740, -28845, -33075, -65153, -43085, -4703, 19973, 28017, 17503, 11010, 7399, 34563, 28374, 9734, -4210, 18604, 19864, 39052, 70565, 81701, 65270, 21539, -34995, -46069, -24332, 1735, 9685, 13242, 24921, 34647, 31227, -1392, -31234, -11496, 11794, -5880, -19310]
16262a9310K4127J7505O324M426r911K513j3183k2674k7621O601O058J3450K8913
16249A7218n644k0594k7957j270L541L674N517J5728q371J1831q868K6594r90
16236A0409k8626j1012L0302K4607k8139k0072j124N865k332J7581N535r247k987
16223i240m407M037J2266Q802K490j3884k168J3876K3083p700l5851j2327j1248
16210c2271j6200J5601K4372m290j4874J2045J3219M235J4800p439J1540j4339
16198F399m4157j5397J8952n352k5214Q339J9980k057l529L4683L876L1448q760
16185A9211j2494P57R417M4909j1634k1666O343j5946k3611j3596K0314p671Q928
16172C261O482J1038j4759l7342r574M1323J961L0163K4507r769l347K348M187
$$ y = [-19310, 4817, 22322, 28646, 33072, 23161, 25674, 12491, -10183, -37804, -31203, -25145, -11695, 17218, 11574, -9020, -36977, -38247, -34706, -31032, -25515, -9787, -18158, -6327, -15195, 11399, 10409, -18217, -29229, 1073, 25680, -2459, -22531, -23655, -17790, -20122, -2541, 2994, -6253, -9240, -13647, -9610, 2656, 11458, 13948, 64, -2104, 11772, 34855, 27155, -8696, -21023, -32271, -48471, -32870, -8498, -12788, -27662, -15617, -2398, 1837, 16637, 9198, 20738, 6399, -37758, -53155, -34203, -39555, -64769, -56430, -36450, -38507, -42036, -7353, -3477, 27971, 19211, 6717, 7474, 16891, 61800, 50166, 28500, 34843, 18897, -4714, -18310, 2004, -5667, 3261, 9743, 20781, 6022, -31320, -40894, 429, 2390, 32553, 57060, 47291, 43944, 46292, 50479]
16159E0479k3190k9948k6912L412o116N473K7859J9330K4739K7544l1477l1657
16147I536j1298j5762l571J3845j61R208N809m0059O372q6K0414K0073J3369k2265
16133E424j4223q56K601P667J2001L093L690P936p597p208l380N133p632j6103
16119i454l223P287n062K9362K0422j774K4339N848j0607k943n932k3935N776
16106C0104P654K876m849r11K820J7210n902l5665j5390J4071M0422J3077r130
16093E6387k4191R142k180j7323r200j1407k3472K8053L7898n498k457k9822j4956
16080i026J4252K3064M9481j503m1823k3814k8580J2892K7844n860K114k670j8665
16067b294K8559K716k5071L519L1200j3760l6277k4954M910J1384j3354P127K2490
$$ y = [50479, 27289, -2659, -29571, -26159, -32275, -26802, 1057, 20387, 45126, 72670, 41193, 9536, -1762, -17524, -21095, -7250, -7411, 1797, 7606, -32453, -26081, -26167, -5753, 14320, 27689, 5424, -8799, -9655, -7054, 613, 12614, 15707, 19397, 27333, 19736, 12528, 9148, 14281, 6649, -9454, -12677, -5390, -10452, 18910, 39332, 37558, 61897, 67745, 57138, 54195, 48263, 24328, 30104, 37758, 40634, 35785, 34874, 37694, 54904, 49002, 13337, -2053, 12018, 52440, 65517, 56387, 32196, 41338, 39158, 21835, 12635, 1228, -22244, 5809, 43707, 38209, 35752, 5930, -9026, 5226, 28290, 77771, 76268, 34445, 10631, -17949, -5057, 22787, 16927, 19041, 16371, -2294, 26265, 28981, 3910, 7429, 38629, 24869, -11408, -36362, -31452, -20068, -33422, -26295, -3805]
16054c805j5476Q392K184N285j2126j0983K3297k4713j5247J1977R893j688L43
16041b2667Q269n895K0427J6440L8905j0135j1737K644q227k766k441K207J7967
16028D2991j6815k1075p948K1393K3565nj2021l6335j8107k6109J7476j4472K5926
16015b1536L9905K0894n115k3074O152K751n171K952J2104o08O495J2268o358
16002D1659j5921N345O478J2158L769N310j2990l9859J1756R535l8889n608L1350
15989A4093J7001Q056k2007N829K4408k0266j4020o681J0610M1994l180l2476
15977B3361j5013j7697Q569j5927q633l832k352o439L138J4349K0705J2967o19
15964A2577O320L77m9647k5784L1795L8607J2571l2941m5769J0628l262j6226
$$ y = [-3805, -19281, -10889, -8705, -3420, -15546, -26529, -3232, -27945, -43192, -31215, -21322, -23010, -22667, -14398, -20293, 134, 16574, 55479, 45344, 33607, 36251, 28024, 25258, 22817, 25024, 42991, 26176, 5101, -2847, 18546, 42111, 42106, 30085, -6250, -24357, -50466, -32990, -47462, -21536, 18369, 39263, 34148, 11074, 17226, 19977, 14806, 17758, 29862, 29254, 35749, 48017, 41659, 25738, 31083, 37561, 49719, 53488, 58798, 45808, 5949, 17705, 27240, -11649, -17257, 14093, 31094, 39150, 17143, 22972, 47380, 27114, 13094, 6413, 17023, 59017, 55837, 23361, 8348, -9349, -780, -16707, -25340, -29172, -31524, -37963, -34825, -20476, 229, 13196, 12577, 18897, 19274, -30373, -56157, -24362, 14245, 26816, -6125, -51894, -41266, -44528, -60754]
15952f0754L4091J2978K5555l5246l1094O897N524K8828J7366Q881J169J7601
15940C1796J9283j1132L709j142J5194P821P389m3382j9995R338O408N992j721
15927B9558L2466L597m311P821L066j3718J4863L527m773m1770l3302K0661J9599
15914C7284K8524K0516m252m0741j3730r817j9243Q99K4164K3151j6013Q106k9565
15901I283L143j141J0305k371Q757q855p471m577K9461M260J1204l164k2941m65
15887B5428J7926j1979j3983P134j5496j5010o605Q144J6457o41k1081j6592R883
15874a6415J3846j5519k3348N900k203r899q21L3572K4330p088O830L5698j665
15861D3218j1147j7657k139o890r47j0259J1189K3592j3308j1421K2851j096l0661
$$ y = [-60754, -26663, -13685, 11870, -23376, -54470, -47573, -42049, -13221, 4145, 13026, 14195, 31796, 51079, 39947, 43656, 42514, 57708, 65529, 72918, 29536, 9541, 18879, 25287, 31279, 29558, 62024, 65621, 61310, 69131, 72197, 58479, 73342, 76869, 72096, 30326, -2976, 17685, 37284, 65808, 86324, 82072, 41331, 27601, 17784, -1459, -560, 23604, 46755, 30742, 38848, 9283, 12426, 11285, 21590, 19219, 27976, 19121, 11650, 7073, 36534, 40794, 51998, 48834, 25893, 25428, 43354, 31375, 17392, 24526, 9030, -5980, -12585, -4441, 12016, 11375, -9706, -26298, -16415, -2569, -18088, -41436, -35536, -37739, -47638, -48459, -14887, 9443, 2355, 9185, 44883, 43218, 32071, 14414, 12275, 5385, 4438, -5821, 5368, 28960, 15652, 4231, 27082, 25986, -4675]
15848d675J1178L932K6784j8876j784l156n394K610J3951J306o57M166j3131o93
15834A5561N011l1098q267L8093J6069J415P357o114Q901j4292l7356o994K24
15821a1490j6757J5851M1482K3397k9461l3746K4486M817m7308J6848K0345k8411
15809a9947r373M1214K3348k7258j5153M924K030N812l695K6914K185R420n928
15796C4493J0636k000k3861L760J9560J074j3412j2033J8215o289m628J957K1281
15783D8753j6868J1116j5852o478J2538k6474l7464j461J3600L613K6565l007
15771H581R714K2519j4709l4486r941K6740L6939L3122M299M451r915m3618j5245
15758A8451P810k3663j2811j9514J4330L6057k176j1986j4802K344J1002J6035
$$ y = [-4675, 6503, 10435, 37219, 18343, 16559, 13403, 8009, 10619, 24570, 25876, 25219, 29385, 16254, 15561, 20572, -10526, -18793, 19300, 35369, 36784, 44141, 38027, 46928, 32636, -4720, -11714, -11490, -28247, -12396, 29086, 52483, 23022, -10724, 13762, 18579, -28729, -11881, 8464, -19947, -29320, 11894, 35242, 7984, -7169, -2245, -215, 5597, 1902, 28816, 31001, 40421, 34493, 45129, 43129, 19268, 23028, 42588, 43662, 30250, 18217, 36432, 30143, 25515, 27472, 48753, 31885, 43001, 27149, 20671, 33209, 6735, -30729, -32190, -18590, -14977, 11588, 8581, 18295, 40814, 26105, -8381, -18322, 8418, 45357, 78479, 82778, 87229, 77314, 33696, 18451, 26261, 2598, -10213, -29727, -15397, 20660, 18484, 6498, -8304, -5960, 5042, 21077]
15746B1077J2245J8163n059p305k2546k5672j8538L1252J2880p227Q489J6305
15734C4064K6773k2231j9700m6133J5839K180k0380p079M38j2454L118L1479K4472
15721A0386L101k3218j4553K2964K4640o785J6484J5141m9146p345L2729p731
15709A6667l1092m008n250K3606K5485k524Q703j9794j1214J8334j0345j5546
15697f978k8045r338N4003M3269k025l2343j4510p48K1517K0669K3283J1015J6452
15684I6221l3550n2384o657j5431p958J0113N084k31K0922J1446J2242k9610j1805
15671a598O639P250J4276N145k5624j2162O046N171K6193K1265n00P22j1322j2946
15657B8555k4059O540L619M290j1191m6086j2707L8205M296J6140M3498P331k5600
$$ y = [21077, 33322, 51485, 46426, 39121, 16575, -9097, -27635, 3617, 16497, 9270, 17759, 34064, 60837, 38606, 18906, -27227, -11388, -9208, -29588, -36667, -36229, -48683, -45565, -14086, 10386, 13487, -9731, -24284, -1320, 23320, 16535, 33019, 48160, -986, -8331, 24398, 16667, -14425, -18433, -23683, -77, 25408, 22884, 31587, 11793, 579, 18913, 8568, -6978, -35023, -44361, 9642, 52911, 50886, 18543, 4033, 3285, 24802, 45471, 68754, 79769, 96221, 62671, 10287, 3630, -11801, -19759, -9646, -4562, -4793, 16129, 27575, 39817, 10207, -1598, 5041, 12291, 26567, 31712, 6088, -6074, -28, 5143, 31336, 52601, 52101, 52823, 41501, 28555, 4496, 11036, 14655, 18945, 7754, -38332, -51039, -12834, -8538, 7602, 51100, 58431, 32831]
15644C2831j0386L3697K597J559l2187k3005m1242r37K8306K9093J3011p133K0177
15631D6381J8708j3809k8611r59N04J2044n597M16M8406L158j7079l6078J7750
15618D5234K8934k3719j7355k310o681r516k0947K6130M384m979J1443o872j8455
15605E291j5271J5107P070j1582k1102L5514J1848j9344J1178K2961J1320K510
15593E5500k3804k427j3911K9445k415l670K764k1796k820J4502L550J8890O436
15580F0244K6177m832j2901l3384j2858j7034P750L6903J7157n360k2543j8999
15568B0320l2591L87J8596P198J8909J4440n803k9592K6479J9700J8904j3330
15556F3617k5756j5157R093J5563M453N773k4240k0578l2876j0150N95L768j5537
$$ y = [32831, 22445, 56142, 58739, 60298, 28111, 5106, -36136, -37073, -8767, 20326, 33337, 26204, 46381, 65089, 51280, 22669, 21710, 22214, 34258, 28661, 29077, 77483, 80641, 63562, 27484, 45234, 74168, 50449, 33094, 30784, 24103, 14587, -6360, 19770, 24154, 19175, 30618, 23746, 5291, -9980, 5127, 12197, 615, -20487, 15027, 26875, 7531, 18709, 41670, 52990, 55500, 31696, 29269, 15358, 44803, 42388, 38718, 41482, 19686, 16866, 31368, 34918, 53808, 60244, 86421, 81589, 68688, 35304, 22446, 5412, 13162, 50065, 67222, 61862, 39319, 20320, -12271, -11884, 6712, 13910, 32819, 47259, 41456, 11864, 38343, 58043, 76947, 63617, 37861, 22704, 31797, 47360, 51813, 57586, 33346, 12768, -20108, -30258, -29663, -25895, -41432]
15543d1432K0042J1626J9918K7615q511l7376J5441K5363k799P982k5038q556
15531D275J6888J3382R304j8322j6670L9488K7706r85j0686J1857n052j5691j853
15518E3641k2650l7264P582L2890J1215L808K3061K0402j4028l7930j377K8969
15506F8319l853k2342R786M69k7660k6608R323L2770K3124k7342p663O585j2791
15493B2117n35L1864O130r738J5768l3890j702J3250j7735k0361J1378K9751K0523
15480F6820k174j0745j524j1446m6449j3696K6182J1670L405q110J7249K2492
15468E3674k869q786j1989L946P799r419j0942J7998K482K052o905R527R826k9060
15454B7334k4120K8071J1922M406J2637k5991j7992N3105L9405j1328l7327j2545
$$ y = [-41432, -21390, -9764, 10154, 37769, 29258, -8118, 7323, 32686, 29887, 37869, 12831, 4275, 21163, 34545, 43849, 25527, 8857, 48345, 76051, 75066, 64380, 76237, 71185, 55494, 53641, 30991, -6273, 1309, 34199, 45414, 49222, 72283, 92685, 78657, 40727, 39350, 68319, 64466, 42124, 51910, 52379, 24719, -1889, 7434, 40204, 63328, 35986, 28323, 34908, 22117, 21582, 53446, 59576, 49838, 65606, 31716, 30014, 43264, 25529, 5168, 16546, 46297, 66820, 64646, 53901, 52377, 40931, -5518, -19214, 6968, 18638, 22043, 13933, 31182, 53674, 50805, 42019, 30030, 33976, 41775, 32356, 21414, 39412, 41894, 43946, 37041, 46568, 56394, 27334, 3214, 31285, 43207, 47613, 60250, 34259, 16267, 69372, 108777, 97449, 60122, 47577]
15442D7577k107o618j3970j5974P073J1928O315J7657K9381k1626l7725N537K5670
15429E3118j5254j7340J3839J7766r339K5122M785j4596K2259p342r753m65K6126
15416H8926Q33j1283l0176j1043K5074O598j949k0755j4854R909J3876J4687n543
15403F4300j9813N229K0436P959N510m6056j1188J1465k3478N260K0550R424J2442
15390F2040o167l4154N526J6942L650k421r788j5870p347q96M1861J125k8800
15377B5701K0612K554R973J84j7678j2772O045J1911K7999K983j8989j698l744
15364E3081J0662j5760k988M729l513l6504o557M4J4503M0737K2147l367J6301
15351I3515J2536l1873o57K0841o754j5749R935J7063j6788n7532J3471L3777
$$ y = [47577, 45470, 38852, 24882, 8908, 15981, 27909, 34224, 51881, 81262, 59636, 21911, 27448, 53118, 37864, 20524, 34363, 52129, 42790, 67912, 72697, 58101, 80360, 73018, 63265, 62800, 88926, 89759, 78476, 48300, 37257, 62331, 68929, 66980, 46225, 31371, 41280, 55156, 69843, 64300, 44487, 49716, 70152, 78111, 83621, 37565, 26377, 37842, 14364, 19624, 40174, 49598, 62040, 55873, 21719, 27245, 44187, 47837, 45416, 35628, 19758, 12411, 11515, 53376, 54501, 25701, 46313, 48867, 58840, 59024, 41346, 28574, 34619, 46530, 74529, 77512, 58523, 56825, 53081, 63743, 47983, 44995, 49724, 46211, 9707, 3150, 3194, 17697, 58434, 80581, 77214, 93515, 106051, 74178, 73521, 94362, 87608, 71859, 81794, 98857, 82069, 24537, 38008, 71785]
15339G1785M304J6739K2213k7320m027J0996L579m467k0114q555l1094P423J7822
15326E9284J117Q179L1455K6868M53m311K644L9080k32m0761m1845r644K2035
15313I4322J6740l79P360l895j7215K0447M922j8045r639j5100k146l449k0365
15300E3558k2018Q265K9143O353k1703J7938m0423n228L4682K1060j3449j4289
15288E3889J9537J3330K005j612j1563J1710J6227o97m928J1465J9969j7562j8722
15275I3048p240j7868j3328j4856K3045J837l331k7121l5568r50L712K1339K1142
15262D3861M8147K9247q748m677k9536j6997O938k8574m577L6612N383j5781m035
15249E7263J0645j1912J9017J4047K1847k978j0031L65J3580j801j751l0784k6527
$$ y = [71785, 76089, 92828, 115041, 87721, 83694, 94690, 98269, 93802, 73688, 65133, 34039, 41462, 59284, 60401, 68580, 100035, 126903, 127356, 123045, 125689, 164769, 164537, 123776, 81931, 72287, 94322, 111062, 110683, 118043, 114148, 96933, 117380, 122302, 104257, 94618, 79518, 77372, 73923, 53558, 31540, 39805, 68948, 75301, 53598, 71536, 31113, 25885, 60567, 81627, 68178, 53889, 73426, 86756, 88761, 87149, 75586, 87296, 103523, 102826, 97898, 109363, 129332, 111770, 93048, 85808, 67940, 54612, 39756, 62801, 64638, 61307, 34186, -1382, -2332, 1380, 22719, 43861, 92008, 121255, 112507, 107830, 78294, 61297, 68235, 39661, 35084, 71696, 77079, 61298, 57263, 67908, 55996, 75013, 89060, 110907, 107929, 97898, 98263, 111843, 110042, 108291, 77507, 50980]
15236E0980K2931M2856K2109k7950n1242N682J9134J2523R540L5444L5272k5375
15224A51904l3792J2298j0909K864o440p260r484o062P381K8368p035k2672L2510
15211A31671J6338j8671M997k757J2805P768l2014n0645j021K218J5506J297J1626
15198I9118j0290k0742K8658M617j8029N189M3985K5960J6578r801j6188J1561
15186A60616j4761J6053P005J9344K7757R580P334J1921M7897Q9994J00777J58509
15174F42026K51101L22359L30392L55871K89533J63662j9470j79739k59609l04286
15164A591840l23546k97266j96368j12421r3032j06229m5604l1252n2540j5666
15154C17916k3091o022J2512j020l61j4326k4739j1240k0198r065k8948k3559
$$ y = [50980, 73911, 116767, 138876, 110926, 59684, 65366, 84500, 97023, 106563, 142007, 177279, 151904, 118112, 130410, 119501, 122365, 115925, 108665, 99181, 93119, 100500, 128868, 121833, 99161, 131671, 148009, 129338, 134335, 131578, 144383, 152151, 120137, 69492, 68471, 70689, 86195, 87492, 99118, 88828, 68086, 96744, 101361, 83332, 88521, 132506, 158466, 175044, 165243, 149055, 160616, 145855, 161908, 168913, 188257, 216014, 225594, 232928, 244849, 292746, 382740, 483517, 642026, 893127, 1215486, 1545878, 1901749, 2191282, 2354944, 2335474, 2155735, 1896126, 1591840, 1268294, 971028, 774660, 662239, 569207, 462978, 417374, 386122, 333582, 317916, 294825, 288803, 301315, 300295, 299934, 285608, 260869, 249629, 229431, 220366, 191418, 167859]
15142A67859K7577K2422K9051K9100k4137l7476l4264k0786j1714L1552K1781
15131B00965N249J972k840l0451K076L6600O024j5120j0474R915l0983k2239j0524
15118A40170M464r394J2409J0381k0436o169m361J3920J6102o172Q689j6258l6275
15105A07070O94J5863l952j5800o514r884J2632L3795k2705j4469j223N584K818
15092A03909p128K8667j232R425j7143l7896J4122J4270K0896o083J4723j9160
15080A17370l773J5756p457O539o326j6652j7144J4263K3382K1273P237j866k1400
15067A31202J26L4479J3187l8453k1991n475k0409m736K6782J3766J2120m621
15055A35977k5733j5030J248q852o576L1980q319J0495j279O490J5669K967j8625
$$ y = [167859, 195436, 217858, 246909, 276009, 251872, 214396, 180132, 159346, 147632, 179184, 200965, 206214, 208186, 205346, 174895, 176971, 213571, 219595, 204475, 194001, 203916, 172933, 150694, 140170, 144634, 135240, 147649, 158030, 137594, 131425, 127064, 140984, 157086, 150914, 159603, 143345, 107070, 107764, 123627, 119675, 103875, 97361, 87477, 100109, 133904, 111199, 96730, 95507, 101091, 103909, 96781, 125448, 124216, 133641, 116498, 78602, 92724, 106994, 127890, 121807, 136530, 117370, 113597, 129353, 121896, 128435, 122109, 105457, 88313, 102576, 125958, 147231, 154468, 152602, 131202, 131328, 165807, 178994, 140541, 118550, 113075, 92666, 87930, 114712, 128478, 140598, 135977, 110244, 95214, 96462, 87610, 81034, 113014, 104695, 115190, 113911, 120401, 136070, 139037, 120412]
15042A20412J538J106j3691j1218J6587K3488J3539M290l471k2127J837K8801
15030A61091M1499J9441m1716k5434o951J2303j3045K536K6436J0810j4890J3495
15018A85575j4945k1841Q541k6902k6441J809l306j1819J1198j6128M213L633
15006I3587K1463K3436R849N505M0184J9628j4410J1604l666l7098O521Q142k4066
14993A60679j6112J2236p830r622m5132j3610L7200K0427n253N934l3503m882
14981A00532K8473M9022J6475Q150M5658M5029K5578K4105K2854j1747J4306L530
14969C71965l7290l3831m1279k8856k2229r737K7586K775k1225N534J9054K343
14957B34810Q381k3759l32K0349J7953k4143l6026k79J2365j355l449l3905P261
$$ y = [120412, 121950, 123056, 109365, 98147, 114734, 138222, 151761, 156051, 152580, 130453, 132290, 161091, 202590, 222031, 180315, 154881, 147930, 160233, 147188, 149724, 176160, 186970, 172080, 185575, 170630, 148789, 157330, 130428, 103987, 105796, 102490, 90671, 101869, 85741, 89954, 93587, 115050, 138486, 148335, 153840, 194024, 213652, 199242, 210846, 207180, 170082, 176603, 184745, 160679, 144567, 156803, 148973, 139351, 94219, 80609, 117809, 138236, 132983, 138917, 105414, 100532, 129005, 178027, 194502, 202652, 248310, 293339, 318917, 343022, 365876, 354129, 368435, 371965, 334675, 300844, 259565, 230709, 208480, 198743, 226329, 229104, 207879, 213413, 232467, 234810, 243191, 219432, 219100, 239449, 257402, 233259, 197233, 196954, 209319, 207964, 204515, 170610, 177871]
14944A77871M945j2590M148J2620K1290p044k6405L295K9654P409M1229M7312
14932C03734L2137K6478p011n676k2439k5020k9101m584j0090q324j4451L5M888
14919B40576j2605n790Q504P75O565j6662j7772N687j3849l2481Q747K4073J2484
14906B08252M1216K6593P488Q44N637J9260M483k4149J2918K211l589R864L4080
14893C45108J3812q860J3053P2221L3082j5804j421j5894m44N5135J01090J09198
14881G00276P1978P8055N5766M2249j0439l3796l9581l1117k3398R934Q1109J99912
14869A100948K59261L12314L66956M01610L38152J82461m2190k13827l41084l51336
14859B013265l22402k89235k20322j40319p6224k8743j9333m1711l9223k439j9165
$$ y = [177871, 182816, 170226, 174374, 186994, 208284, 201240, 174835, 178130, 207784, 215193, 256422, 303734, 335871, 362349, 355338, 349662, 327223, 302203, 273102, 268518, 258428, 250104, 235653, 235688, 240576, 227971, 222181, 230685, 231460, 238025, 221363, 203591, 209278, 195429, 162948, 171695, 195768, 208252, 249468, 276061, 283549, 284393, 290030, 309290, 313773, 289624, 302542, 304753, 301164, 311028, 345108, 358920, 350060, 363113, 435334, 468416, 452612, 451191, 435297, 434853, 489988, 591078, 700276, 772254, 850309, 906075, 948324, 937885, 904089, 864508, 833391, 809993, 819927, 901036, 1100948, 1360209, 1672523, 2039479, 2441089, 2779241, 2961702, 2919512, 2705685, 2364601, 2013265, 1690863, 1401628, 1181306, 1040987, 964763, 936020, 916687, 874976, 835753, 833314, 814149]
14848H14149J802L3715N477M732M0863M5336j6839m2016j2074m244k4605Q772
14836H55068Q243J8274K3757p024l8742r044r409j2253J398N3002J5062k9407
14824H68925m0351l3375N2572L5892k9614j6936j0030N674J094k5688l2381p472
14812G68310L5749L1289J4950m707J7637Q452K3846j244l8448l3474j9650j2039
14800G90671l4429o333L5176K8953M5813P2673L7389N0255M0291N7246L9554O2395
14788A219654L1595N9084L7018P445m842L6264L3746M9930J9359M2579M0079J7407
14776A589318M144J7094L0856L124J4291K8284J5059K3390J7105K6688M0893M5390
14764A855636N0299N9069K7704O1619R4040P6462N9563O6230J37050J93436K00349
$$ y = [814149, 815951, 849666, 855143, 859875, 900738, 946074, 929235, 887219, 875145, 870901, 846296, 855068, 863311, 881585, 905342, 898318, 859576, 850532, 841123, 828870, 830268, 883270, 898332, 868925, 828574, 795199, 847771, 883663, 854049, 837113, 827083, 832757, 833851, 808163, 775782, 768310, 804059, 835348, 850298, 845591, 863228, 871680, 895526, 894282, 855834, 822360, 802710, 790671, 756242, 749909, 785085, 814038, 859851, 932524, 969913, 1020168, 1060459, 1117705, 1157259, 1219654, 1251249, 1310333, 1347351, 1354796, 1349954, 1386218, 1419964, 1469894, 1489253, 1531832, 1571911, 1589318, 1593462, 1610556, 1641412, 1644536, 1658827, 1687111, 1702170, 1725560, 1742665, 1769353, 1810246, 1855636, 1905935, 1965004, 1992708, 2054327, 2148367, 2224829, 2284392, 2350622, 2487672, 2681108, 2881457]
14753B881457K35541K46981K30290K32665K77615L03811K88238K83470L31785
14744E311853L97907M75703O02275P64628R62425J238142J541911J868010K107468
14735A5270322K199132K158444K039369J941145J980864K312288L073899M491259
14727C5466722O797355J0428891J6156091K5175430L7522920N1286391O2838305
14720B45672105O7420853O1635036M3669236J5378701j6927330m3517693n9779393
14713C13551515o4657918n8438743m4249371k9615521j9265217j3013381r099928
14706G5211436o425668m635516l485670k834814k523551k556249k732815k951509
14698D7065644l076588l008437k775737k379331k009463j746948j601450j473558
$$ y = [2881457, 3116998, 3363979, 3594269, 3826934, 4104549, 4408360, 4696598, 4980068, 5311853, 5709760, 6185463, 6787738, 7552366, 8514791, 9752933, 11294844, 13162854, 15270322, 17469454, 19627898, 21667267, 23608412, 25589276, 27901564, 30975463, 35466722, 42264077, 52692968, 68849059, 94024489, 131547409, 182833800, 245672105, 313092958, 374727994, 418397230, 433775931, 416848601, 373330908, 313551515, 248893597, 190454854, 146205483, 116589962, 97324745, 84311364, 75211436, 68785768, 64150252, 60664582, 57829768, 55306217, 52749968, 50017153, 47065644, 43989056, 40980619, 38204882, 35825551, 33816088, 32069140, 30467690, 28994132]
14690B8994132j397774j384073j304412j179606j072401r56748q29114o89799
14682B0180205n77674n28644n03024m96148n21454n90709o27997o24377o29412
14673A5080766n91877n42473m62208m24911m08791m21234l70023l27469k73358
14664A1258422l10870k68000k85765k42876k04208j82577j48638j06386j10973
14655I398129j17607j81272k28638k55929l14091k83959k58459k84098k59823
14646G214253j90275k18792k25284j38074j25107j53569j62458j18034j15516
14637E767144j13877j42558j71802j82193j69483k14525k16684j65181j20916
14628D269925j61825j40430r9881p5824n1834p1762q9931o7659q6958r4645r5342
$$ y = [28994132, 27596358, 26212285, 24907873, 23728267, 22655866, 21699118, 20870004, 20180205, 19602531, 19073887, 18570863, 18074715, 17553261, 16962552, 16334555, 15710178, 15080766, 14488889, 13946416, 13484208, 13059297, 12650506, 12229272, 11859249, 11531780, 11258422, 10947552, 10679552, 10393787, 10150911, 9946703, 9764126, 9615488, 9509102, 9398129, 9280522, 9099250, 8870612, 8614683, 8300592, 8016633, 7758174, 7474076, 7214253, 7023978, 6805186, 6579902, 6441828, 6316721, 6163152, 6000694, 5882660, 5767144, 5653267, 5510709, 5338907, 5156714, 4987231, 4772706, 4556022, 4390841, 4269925, 4108100, 3967670, 3867789, 3791965, 3740131, 3668369, 3578438, 3510779, 3423821, 3329176, 3233834]
14617C233834j05103j00767n8068j10723j20882o7543k5154n3396n3884l6181
14607B502133o1655m3028l1126l8197k6024q700n4861q2688p4187o4243m7409
14596A970015p4476p4988l4935m4537o4640j17432j07197n7950n6730j03203p4286
14585A159641r8541o5304o7183p2838q5923q6632k4883k7838l9199l4985m7348
14574E08967k561j8463k5818k2780n2277k0256k2090j3779k7105R89J1230K4955
14562C41012Q117j0364p803J4405K258l2947j9875j0971j959M807K6547K2923
14550C36150L306n0733j7604o696P139m031j7972k4027O223O054j3551j1183L9747
14537B52822K0897p052q81N572j9183k0394R00J4K5154M4478K1895j7659K462
$$ y = [3233834, 3128731, 3027964, 2969896, 2859173, 2738291, 2670748, 2645594, 2592198, 2538314, 2502133, 2440478, 2397450, 2366324, 2328127, 2302103, 2293403, 2238542, 2155854, 2081667, 2017424, 1970015, 1895539, 1820551, 1785616, 1741079, 1676439, 1559007, 1451810, 1393860, 1337130, 1233927, 1159641, 1061100, 995796, 928613, 855775, 769852, 683220, 658337, 630499, 591300, 556315, 508967, 506406, 487943, 462125, 439345, 387068, 366812, 344722, 330943, 303838, 304827, 316057, 341012, 349129, 338765, 330962, 345367, 347625, 314678, 294803, 283832, 281873, 286680, 313227, 336150, 339456, 288723, 271119, 264423, 271562, 267531, 249559, 225532, 231755, 237809, 224258, 213075, 252822, 273719, 266667, 265786, 271358, 252175, 231781, 232681, 232695, 257849, 302327, 324222, 306563, 309025]
14524C09025m901N319L8194R035l4402k5787l72l7198j6987k7879n687k963n387
14511B00010Q098K20p515J1760l815O250O575k3642j0736R150P065N339J6850
14498B25609M877j5712j674L1677K0771j2708J037K2771m981o35J13J9302K5276
14485C15723q198P38k1257l1398k5694M689J0779k500r303J9344R206j0635j566
14472B49928J128P683j3531j3212J4430k776k3696p925q994J2601J4747J0643
14460B41026l0271l0104K327M430j1539Q806j9142L2929K7883j0393j4925m2486
14448A58541k0195p130k8114k6275j3282J3207m528M696r458k6927j2786j1720
14436A6029Q116m622j7574J9840n407r900j844M1174o156N374J3070J689o49P777
$$ y = [309025, 304124, 309443, 347637, 356672, 322270, 296483, 296111, 258913, 241926, 214047, 208360, 205397, 200010, 208108, 208328, 200813, 212573, 208758, 215008, 221583, 197941, 187205, 196355, 203420, 208759, 225609, 230486, 214774, 213100, 244777, 265548, 252840, 253877, 276648, 271667, 271032, 271145, 290447, 315723, 307525, 308263, 287006, 255608, 229914, 234603, 245382, 242882, 233579, 252923, 262129, 251494, 249928, 251056, 258739, 245208, 231996, 246426, 243650, 219954, 212029, 203035, 215636, 230383, 241026, 210755, 180651, 182978, 187408, 175869, 184675, 165533, 198462, 226345, 215952, 201027, 158541, 138346, 131216, 103102, 76827, 63545, 76752, 72224, 76920, 67462, 40535, 27749, 16029, 24145, 19523, 1949, 21789, 16382, 6482, 4638, 45812, 39656, 45030, 58100, 59789, 59140, 66917]
14422F6917N745l4874l4760J0927M958L8l6721R395J238O182j3637k3378r284
14409d7254j3179J1381K5777P512j2727K7655M1610j2886L583K9901l315O937
14397F4995j9415k604p413j0452M596j4869j1314m009J722J9578M058J238J7311
14384D3422J0021j491l2845o852r926k3611J1904K6386K6971R130J5785k3367
14372D5527l4001K045J6389l5220n315J4160J5476j7792j5391n968L9480J9044
14360C8434Q206J953j9384r938k3147l1556K3978K0800j6545J1226q240j9086
14348b3299l859K3293N1794Q223O890Q802m878l5023k8377L4205k1741n853J1088
14335B1265l543l150Q737j3871J4189J2939K071L153l7337j3415j428p387o086
$$ y = [66917, 72662, 37788, 3028, 13955, 18913, 18951, -17770, -8375, -7137, -955, -14592, -37970, -47254, -60433, -49052, -23275, -15763, -28490, -835, 40775, 27889, 31472, 61373, 58058, 64995, 45580, 42976, 35563, 25111, 29707, 14838, 3524, -485, 1237, 20815, 24873, 26111, 43422, 53443, 51952, 19107, 12255, 2329, -21282, -9378, 17008, 43979, 53109, 68894, 45527, 11526, 13571, 29960, -5260, -10575, 3585, 19061, 1269, -14122, -20090, 19390, 38434, 46640, 48593, 29209, 19271, -3876, -35432, -11454, 9346, -7199, 4027, -4213, -23299, -27158, -3865, 47929, 56152, 63042, 71844, 66966, 31943, 3566, 37771, 16030, 10177, 21265, 17722, 14572, 23309, 9438, 23627, 36566, 38637, 41790, 4453, -8962, -10390, -17777, -23863]
14322b3863n464L0613J3575k4030l3115k609l5639j6849K0292M8362K8902j737
14310a562k7289m483j2519k588k7461k6080L5508J7879M607K6939K2115M1233
14298D6299K3870o672j5423j6773l2166J6788K365K2554L873k4452O946K1227
14286D8436J2686K2402K966J8382J056K4206K7236J8166R666J1042p3J499j1334
14273A86336j141N876N729M6732O3779N7369J29760K09277K67354K68444L51546
14262A591061L83401K80980J66897J9572j74408k57021k98542l12932k95295j95325
14252I08388j64125j25173p1725n3589l4986m6910m5098l6608l1425k4278J88
14241B74659J2475l2037q778j6987q363k94j9223j9974l0716p370r995n699P998
$$ y = [-23863, -29327, 1286, 14861, -9169, -42284, -44893, -80532, -97381, -77089, -28727, 175, -1562, -28851, -33334, -45853, -48441, -75902, -101982, -66474, -48595, -43988, -17049, 5066, 46299, 70169, 63497, 48074, 31301, -865, 15923, 18288, 40842, 44715, 20263, 27209, 48436, 61122, 83524, 86490, 104872, 105928, 130134, 157370, 175536, 185202, 196244, 196171, 197670, 186336, 185195, 191071, 196800, 243532, 307311, 364680, 494440, 703717, 971071, 1239515, 1591061, 1974462, 2255442, 2422339, 2441911, 2267503, 2010482, 1711940, 1399008, 1103713, 908388, 744263, 619090, 547365, 493776, 458790, 411880, 366782, 330174, 298749, 274471, 274659, 287134, 255097, 246319, 229332, 220969, 220675, 201452, 181478, 150762, 143392, 133397, 127698, 135696]
14228A35696J1407k8539j7642j4418j1393m89L735P066M351K4862j2921j8880
14216H2835k7523J8226J6939j5477l9209p626R318J0118n639n93l08K1249o744
14203E5566l55j7827p120j8331J323R569j051J1151O848J9553K4976L523m9155
14190C8670j4019J2735J0687k5043J1141J9555l1913m4644k574j5409r205J7858
14178c2161N475N1208q46J4721o285j7398J357r706j8707J0449J9948J8269n333
14165C0991n252j5572J1120j404J3633M018l1097p358K4391J4337r294J0345R386
14152D8244J3471M95l6466k2300j2419j2314J3774j213k311J1315L7557N670k4931
14139A8572q765m2212k3494K1476K9578Q613o368K805p865K438M291r951r425
$$ y = [135696, 147103, 118564, 100922, 86504, 75111, 74622, 78357, 85423, 89774, 114636, 101715, 82835, 55312, 73538, 90477, 75000, 35791, 28165, 37483, 47601, 41962, 41369, 41061, 62310, 55566, 55211, 37384, 30264, 11933, 13256, 22825, 21774, 32925, 39773, 59326, 84302, 87825, 38670, 24651, 37386, 48073, 23030, 34171, 53726, 21813, -22831, -25405, -40814, -50019, -32161, -26686, 24522, 23676, 38397, 32112, 14714, 16071, 6365, -12342, -1893, 18055, 36324, 30991, 25739, 10167, 21287, 19883, 33516, 37534, 6437, -921, 23470, 37807, 28513, 38858, 48244, 61715, 62210, 25744, 3444, -8975, -21289, -7515, -8728, -11039, 276, 37833, 43503, 18572, 9807, -32405, -55899, -34423, -4845, 3768, -2600, 205, -7660, -5222, -931, -10882, -20307]
14126b0307R081J9301Pl441R160J2653j5974j109j06J217L268J1322O712l8018
14112f234q203J4168O331L048j8468l964o543L261m899J6555J4378J1762k6246
14099e054n457L6155K0466N921j209M694O897j6604k1750K1013J0019K2466J000
14086G8557j1841K3738L9669L2516j831Q449K3089L0856M8654L8504M3095R8219
14074D51674J87391L18708M08340N31743N63889M61917K68242J6383k24473m63559
14064B520255n01159m54046l95228l00505j55404j00695o2084r9151k0800k1472
14054D09711j4107R378k688r035m2867n4344l6960k2787M310l428r681k7399j6146
14041A83957J4904j0153k5961r557j026K142M866k1158j5564n236q032P650K010
$$ y = [-20307, -11226, 8075, 8082, 4641, 13801, 26454, 10480, 9371, 9265, 10482, 13750, 25072, 31784, -6234, -14437, -269, 6062, 9110, -9358, -13322, -19865, -16604, -21503, -4948, 9430, 21192, -5054, -10511, 25644, 46110, 52031, 50822, 55516, 62413, 45809, 24059, 45072, 55091, 77557, 78557, 66716, 90454, 130123, 162639, 160808, 169257, 192346, 223202, 271856, 310360, 353455, 451674, 639065, 957773, 1366113, 1897856, 2461745, 2923662, 3191904, 3208287, 2983814, 2520255, 2019096, 1565050, 1169822, 869317, 713913, 613218, 551134, 451983, 431183, 409711, 395604, 404982, 402294, 393259, 350392, 296048, 259088, 236301, 240611, 237183, 227502, 200103, 183957, 198861, 188708, 162747, 153190, 152164, 154306, 159172, 138014, 122450, 117214, 109182, 116832, 118842]
14028A18842J6482m3132N918j5748l3976kJ6015Q632j0156k4050l888k3851O404
14015A7490j4639j273J4707O1623j3311r212j7580j3934l681K338j1266k8031
14003a6769J9069O1463J6885n764k0282Q070q840k0033k1007O041K2039n108k8018
13990G746l3201j984K5496J9893k93J2874j0354L225J2499j3m6291K5367M8376
13977F3340p955k1531k3919l6265n655Q787J6334L2753P889J6048k4474q962j9665
13964c275k1553O196L3496R550q701J3660N176J6703J4417k6426l4345k5619k4429
13951d5150j0272K0060M926m474P467L2814J7515L2282Q435j9365j5423l637R674
13938C4852k5193j0966J2675J127q856J789N629L334N291k7212Q377K7638J0002
$$ y = [118842, 135324, 92192, 98110, 82362, 48386, 48384, 64399, 73031, 62875, 38825, 34937, 11086, 17490, 2851, 1578, 16285, 77908, 64597, 55385, 37805, 23871, 20190, 22528, 11262, -16769, 2300, 63763, 80648, 74884, 54602, 62672, 53832, 33799, 12792, 18833, 40872, 35764, 7746, -25455, -27439, -1943, 17950, 17657, 30531, 20177, 23402, 35901, 35888, -10403, 14964, 63340, 55385, 33854, 9935, -26330, -31985, -23198, -6864, 25889, 33778, 49826, 25352, 16390, -3275, -24828, -18632, 14864, 24414, 15713, 29373, 34549, 51252, 65669, 39243, 4898, -20721, -45150, -55422, -35362, -30436, -34910, -27443, 5371, 22886, 55168, 63603, 44238, 28815, 25178, 34852, 9659, -1307, 11368, 12495, 3639, 5428, 11057, 14391, 19682, -7530, 847, 28485, 38487]
13925C8487l1945k2036J9488Q259j9222j6571R444J1443K9791K2516n0272k4964
13913b5582L6341M6762k1423l8283J9906L2337K3172O227M125M3294L6656O5433
13901B28965O9697Q3046J37785K00302J94029Q6099k3767o8244j03713j52139
13891F52060j38960q4518o1186l6274N643J7009P30j1026n4893l8898j9144o3201
13879A67342j7866N280k594o673k6796p672l30N900K1588n901k653k8969k889
13866I7767o502j9777j9113m623p506k4113Q087j814k841K5937k413J387r794
13853C4682l96j5912m58j1128J9396J950R175J2686q537k257L197L2013M6803
13840A21214K9659K6248J0770J9140J6061K528k7233J870J3795p941j5547j0818
$$ y = [38487, 6542, -15494, 3994, 12253, -6969, -23540, -14096, -2653, 27138, 49654, -618, -25582, 10759, 57521, 36098, -2185, 17721, 50058, 73230, 79457, 83582, 126876, 163532, 228965, 298662, 381708, 519493, 719795, 913824, 999923, 976156, 907912, 804199, 652060, 513100, 428582, 367396, 331122, 336765, 353774, 354504, 343478, 288585, 249687, 230543, 167342, 149476, 154756, 152162, 145489, 118693, 111021, 110691, 116591, 138179, 132278, 129625, 100656, 97767, 91265, 71488, 52375, 47752, 40246, 16133, 24220, 22406, 19565, 45502, 43089, 44476, 34682, 34286, 18374, 17916, 6788, 26184, 28134, 37309, 49995, 41458, 39201, 42398, 74411, 121214, 150873, 177121, 187891, 207031, 223092, 225620, 198387, 200257, 214052, 206111, 190564, 179746]
13828A79746k496m0418k8080M631K764J2963q277k3255j7341j6027j2297J2813
13816F4726R17k2157j1788k1776Q212K0352O466o105K1863K0511k4143l9061k672
13803A5345R337p22J1279k0856k0626q133M029k564K3402R622j0885k4230q627
13790b3629K2304J6026M236L127l4670j9249M925J392n128q864L3450L3375J3406
13777D0701Q70k8567k6581l0897J6956K0457L4461k016q846K380k6462P569k2061
13764b2036n502L52J6452J8800j6970K947K1825j6775J1246K9330r069j7247j1803
13751A550k3807k3920N324j9295L537M818P667j8521n754J4906K0193q564o704
13738d8570J4239J547Q816p301j3336J0042j3246K8154r265j7546j9622J3847
$$ y = [179746, 177250, 136832, 108752, 113383, 116147, 129110, 120833, 97578, 80237, 64210, 51913, 64726, 65643, 43486, 31698, 9922, 18134, 38486, 44952, 38847, 60710, 81221, 57078, 18017, 15345, 24682, 23960, 35239, 14383, -6243, -14376, -10347, -12911, 10491, 20113, 9228, -15002, -23629, -1325, 14701, 18937, 22064, -12606, -31855, -26930, -25538, -30666, -39530, -6080, 27295, 40701, 41571, 13004, -13577, -44474, -27518, -7061, 27400, 25384, 16538, 18918, -7544, 25, -22036, -27538, -27186, -10734, 8066, -8904, -5957, 15868, -907, 10339, 39669, 30600, 13353, 1550, -22257, -46177, -40853, -60148, -56611, -51793, -44126, -62647, -68401, -53495, -33302, -41866, -48570, -34331, -32784, -23968, -31269, -44605, -34563, -47809, -19655, -28920, -46466, -66088, -52241]
13726e2241K2470j2246K2228m346R211P387o550m02J466j0345L2680J0982R789
13713C0083K806j462N69j938k5434k7713J3664K8177j760L2128K8492k4311n1096
13700B205j7927m808j2830l1594N441J3655k923K3375K6079K1951q311j1855J3579
13687A6037j0533j9509L8211J2803k3315k0769j2378j6352k4858m208j4215J6856
13675f2230L4910L35J5331L9344K0692l5206k2122m160K347K5599k196J4063j2469
13662A4238k9538j3634j0066K927j592k4278k877K2503L4458K3058J608q48j003
13649A4956k7066k6086j6508N243L2124K4153q272m613M260J4776Q045M416k2729
13636B699j3805J1562k036M847M037J6033j1197j6831M65M549J076n205P530L2651
$$ y = [-52241, -29771, -42017, -19789, -24135, -14924, -7537, -14087, -14489, -13023, -23368, 9312, 20294, 30083, 32889, 31427, 31996, 30058, 4624, -23089, -9425, 18752, 16992, 49120, 77612, 53301, 2205, -15722, -20530, -33360, -64954, -59513, -45858, -48781, -25406, 673, 22624, 14313, 2458, 16037, 5504, -14005, 24206, 37009, 13694, -7075, -19453, -35805, -60663, -64871, -79086, -62230, -27320, -26985, -11654, 27690, 48382, 13176, -8946, -13106, -10759, 14840, 12644, 26707, 14238, -15300, -28934, -39000, -36073, -37665, -61943, -64820, -42317, -7859, 15199, 16807, 15959, 14956, -12110, -38196, -54704, -49461, -17337, 6816, -1456, -6069, -1809, 12967, 21012, 25428, 2699, -11106, 456, -1580, 3267, 7304, 23337, 12140, -4691, -4226, 323, 1399, -3806, 3724, 36375]
13622C6375k0537l565J4724n238j0916n001L0364m022k8577o5599k03M2249J2681
13609g265M1319k4492l3449K260J7845J9266N735k9057R918M3751j4418k1255
13597A0158j8041Q492M251R888k3072j7913j1009j2125p924J0194L0186K0437
13585C522K0536J1410l0014r04L3488l1561l1314J3343M580K675l513q638K8949
13572A2559j0675p428P349n865j725J1276J7004J2276j8640k9857P206R733J3368
13559A6581j2514L0820j3082k5927K824k1999l2490L0O173Q847P709k2464n422
13546f0914R409J1403N254j6308n8J8422p1j5676O510j9599J1597K2485k3702
13533e1248L675P115k5570N15L5369J401k2523J9225K8278J6941k2546M793L145
$$ y = [36375, 15838, 12273, 26997, 21759, 10843, 5842, 36206, 32184, 3607, -61992, -62195, -19946, -7265, 34054, 9562, -23887, -21627, -3782, 15484, 21219, -7838, 2080, 45831, 31413, 10158, -7883, 609, 4860, 14748, -8324, -26237, -37246, -49371, -57295, -47101, -16915, 3522, 24058, 35468, 5454, 4550, 38038, 6477, -24837, -11494, -6914, -4239, -7752, -16390, 12559, 1884, -5544, 1805, -4060, -5785, 5491, 22495, 34771, 16131, -13726, -6520, 3213, 16581, 4067, 34887, 21805, -4122, -1298, -23297, -55787, -55757, -49584, -40737, -33028, -55492, -60914, -51505, -40102, -34848, -51156, -51214, -32792, -32863, -48539, -42029, -61628, -50031, -27546, -51248, -47573, -40458, -66028, -65513, -30144, -28743, -51266, -32041, -3763, 13178, -9368, -4575, -1430]
13520a430j9547o383J7741Q047J8682J0830j320J0166M425j3156k8857j3660O147
13507h315R006O442q500j211J2886m077j2567j5969o478k020r411N757J6591K3604
13493E738j4666p244J225j4398J5713O513l179m1148l5139K8942L5641K2382O274
13480F654j240n570J3163J875k699k341q718j7984j0183N473J7841K4429P561
13467B8261m086l137l7527J540q25L1486K2105j2096j0463k3661r752N538J4911
13454B294n318q863N5437J2982j6152k1414k0972k727J9925j212m107l3598j9182
13441d2907j0119L3923K5473J4290p546k4826k4907P079j3650r88L7046J0086
13429B954k0746m547j163J0036K8339p990k5867l821R065k2827j6712J5605J7936
$$ y = [-1430, -20977, -27360, -9619, -1572, 17110, 27940, 26620, 36786, 41211, 28055, -802, -14462, -8315, 691, 7133, -1367, -2578, 10308, 6231, -6336, -22305, -28783, -30803, -40214, -34457, -17866, 5738, -8928, -16172, -14947, -29345, -13632, -7119, -10298, -51446, -86585, -57643, -22002, 380, 6654, 5414, -156, 13007, 14882, 12183, 9842, 1124, -16860, -27043, -21570, -3729, 20700, 28261, 24175, 21038, -16489, -14949, -15774, 15712, 37817, 25721, 15258, -8403, -18155, -12617, 2294, -3024, -11887, 43550, 56532, 40380, 18966, -2006, -4733, 15192, 13980, 9873, -23725, -42907, -53026, -19103, 6370, 20660, 13114, -11712, -36619, -29540, -43190, -44178, -7132, 2954, -17792, -22339, -23502, -13466, 14873, 6883, -18984, -22805, -13740, -36567, -53279, -37674, -19738]
13416a9738k5442j4762K373K3019L4603J706K7M2191J0200j4182m4572k8098K6907
13403e768R477R927P558J0063q976k7107m853K6096k5201j4486J3500j1787K7692
13390F135L1668J3666R915j550m9456k6395k3837j3596L0370L2614K5868R749
13378D5151k7507j5323N297M168j2509K1256N455J2968M242l0759m0091q379R431
13365b6600K1774K1688j0072j484l379J3685L60J290k6651N325Q862k1700j4442
13352c1344L945L795m725M454k8346Q586J7518K0921K1185l2456n135L6519J6223
13339C1140k2585k6345K5467J5765K8883q563l4236l8396r011J9241n863K63K310
13326b1930J3061r075k745j2511n849J0608p556L6152Q160j7030l3635J7721L627
$$ y = [-19738, -45180, -59942, -57569, -34550, 53, 1759, 1786, 43977, 54177, 39995, -4577, -32675, -5768, 3709, 13636, 21194, 31257, 22281, -4826, -9679, 16417, -8784, -23270, -9770, -21557, 6135, 37803, 51469, 61384, 59834, 10378, -16017, -39854, -53450, -23080, 9534, 35402, 45151, 17644, 2321, 7618, 11786, -723, 20533, 25988, 38956, 43198, 12439, -27652, -36031, -26600, -4826, 16862, 6790, 5306, 1927, 15612, 15972, 17262, -9389, -4064, 4798, -16902, -31344, -27399, -23604, -28329, -23875, -52221, -43635, -26117, -5196, 15989, -16467, -21602, 14917, 31140, 8555, -17790, 7677, 23442, 52325, 43762, 9526, -28870, -37881, -18640, -24503, -24240, -21930, -8869, -17944, -20689, -33200, -39049, -28441, -35997, 155, 8315, -8715, -42350, -24629, -21002]
13313b1002Q795o497k7151j649O008r509Q032O252j0387K7524j947L7j1830K874
13299c0450l4927J5270K2518L4056J395k6339O077J8657J4493O361k340r014k1862
13286f105j3296J5427J0119N381L5643J7637k0494k8401k0606K6904j2569r496
13274A44P150j2115M0805q976l2507l798L1610n666M330k8181j2758K0090l348
13261c220l4035J2156J4399j7005m0504m148K8561k599M1273N90j0959j4122l0306
13248e9919j5948K0853O157r640L8183L0741l6783j6145N590m92J8240J4146n606
13235a0623M1452K9970n9177k9655n057m0702J9839K1717p456O301J9779O789
13223f823O406j5279k7505m54K282K546k7275J8294L1533N425k4169J2129J6234
$$ y = [-21002, -12207, -18704, -45855, -47504, -41496, -51005, -42973, -36721, -47108, -19584, -21531, -21494, -33324, -30450, -65377, -50107, -27589, 6467, 7862, -18477, -12400, 6257, 20750, 27111, 24771, 15757, -6105, -19401, -3974, 6145, 11526, 47169, 64806, 44312, 15911, -4695, 22209, 9640, 144, 7294, -4821, 35984, 27008, -5499, -9297, 22313, 16647, 20977, -7204, -19962, 128, -3220, -37255, -25099, -10700, -27705, -68209, -72357, -43796, -46395, -5122, -4532, -15491, -29613, -59919, -75867, -55014, -48857, -58497, -20314, 10427, -26356, -42501, -36911, -37403, -19163, -5017, -10623, 30829, 60799, 1622, -28033, -33090, -73792, -53953, -32236, -39692, -33391, -13612, -6823, -417, -15696, -43201, -43655, -41373, -38827, -66102, -47808, -16275, -10850, -35019, -22890, -6656]
13210f656J3256k0610J0972J1119N633j3222j0759R548q39k5197j52N0430K2449
13197D5972k1493k6996J2500M412l0368k1940J8526J3790l9102k652j7352Q841
13185e5862J0480n268O481L1012M4727K1437k680k7181j3369J4457J8232K2991
13173F5457j3216j9544j4552q306l783k7673l641J6045k27L1662M805k0271r132
13160b376L24k725K2276J265o852p119m4643j4116L1401L2811J9585j4139l7199
13147b1507J5932K2246j6394k2111q685K689J0326j597k365J6774M425L6539J9419
13134E5691J785k1053j0938k872j4107j3363J9192J0156L363K5630J1223j9852
13122D4855k3464j5048o347j1138J3717Q866j7882J1442L1190K4494q613l7142
$$ y = [-6656, 6600, -14010, -3038, 8081, 13714, 492, -10267, -719, -1558, -26755, -26907, 23523, 45972, 24479, -2517, 9983, 14395, -15973, -37913, -19387, -5597, -44699, -47351, -64703, -55862, -45382, -50650, -44169, -13157, 31570, 53007, 50327, 23146, 9777, 24234, 42466, 65457, 52241, 32697, 18145, 9839, 6056, -21617, -25258, -9213, -9440, 22222, 27027, 6756, -2376, -2052, -4777, 17499, 18764, 11912, 4793, -39850, -53966, -22565, 10246, 29831, 15692, -21507, -5575, 16671, 277, -21834, -30519, -27830, -17504, -19101, -21466, -4692, -267, 36272, 55691, 57476, 36423, 25485, 22613, 8506, -4857, 14335, 24491, 27854, 53484, 64707, 44855, 21391, 6343, -4, -11142, 2575, 11441, -6441, 5001, 36191, 60685, 52072, 14930]
13110A4930q592J001k0657k4234J858j1403n731K8266J4573q53N02Q864m914l2734
13096c9124p821M250N956l738K1465J4983N938l653o013J448Q060k0073k0345
13083c8667K295K1857K5831K8433j194k7174k9535l1317J5355J1882J4829K7646
13071B0241J7858L7035J4143p1148l2336J1584L917Q545j1910Q65j6315j688j5316
13058c4525j262L0538J4454K0967J2779j2917J8770N980q81j5543l1400J6374
13046B3334j9341l2454m0387J5421K2505o330k306L6500K6838j5245j4147j4386
13034a9998j8814K0032J982K8798J041k2229m768j6527J4512j643P711N384n9
13021d578k4974m656J6662N033L4689l1400o889L5193k3093j5133m091P933l083
$$ y = [14930, 6338, 7339, -13318, -37552, -35694, -47097, -52828, -24562, -9989, -10842, -10340, -1476, -6390, -39124, -46945, -42695, -36739, -40477, -19012, -4029, 1909, -1744, -7757, -6309, 1751, -18322, -38667, -36372, -14515, 11316, 39749, 38555, 11381, -18154, -49471, -34116, -22234, -7405, 20241, 38099, 75134, 89277, 18129, -14207, -2623, 1294, 9839, -2071, -1206, -17521, -19209, -34525, -35787, -5249, 9205, 30172, 42951, 30034, 48804, 54784, 53903, 38360, 6960, 23334, 3993, -28461, -68848, -53427, -30922, -37252, -39558, -3058, 23780, 8535, -5612, -19998, -38812, -18780, -16798, 12000, 13041, -9188, -13956, -30483, -15971, -17614, -9903, -4519, -4578, -29552, -34208, -17546, -12513, 22176, -9224, -16113, 19080, -4013, -19146, -23237, -15304, -18387]
13008a8387K9989Q817J6685m094l3893k0647K231J8901J3268o880j8176J8168
12996E982j2462J0766K0637L067J5454k2624k7831M1472N454r699j4712j720O213
12983A9997L163j3379j6763j7338J2322J7251l921l677P895K0084m6262q957K1770
12970g815k430K3957j24J1844J5391n417o450r420q018K924P574k0751j2782q477
12956a9994J6468R774k4897j345q043J5865J4768J2828m235j781L622k4692m013
12943a5675K196P503J2304J5795j6634j3038j4829j1926J3881J9352j5094j242
12931a7407j8606k903J1365P18J4893M2709K4814r969N806K200m0961j8164J2852
12918G347K8847l4388j3028K0238K1408m919J042r303m890Q05J7902k3013j9161
$$ y = [-18387, 11602, 20419, 37104, 33010, -883, -21530, -19299, -398, 12870, 5990, -12186, 5982, -6480, 4286, 24923, 27990, 43444, 20820, -7011, 34461, 39915, 30216, 15504, 13784, 19997, 23160, 9781, -6982, -24320, -11998, 5253, 1332, -2345, 5550, 25634, -20628, -29585, -7815, -10245, 13712, 13588, 25432, 40823, 35406, 28956, 19536, 11518, 14442, 22016, 1265, -11517, -19994, -3526, 6248, -18649, -19994, -28037, -12172, 2596, 15424, 11189, 9408, 13030, -11662, -15675, -13479, -5976, 6328, 22123, 5489, -7549, -22378, -34304, -20423, -1071, -16165, -17407, -36013, -38916, -27551, -26833, -11940, 30769, 55583, 45614, 51420, 53620, 12659, -5505, 7347, 36194, 1806, -11222, 9016, 30424, 25505, 26547, 17244, 12354, 13159, 31061, 8048, -11113]
12905a1113j4786J2744n736k713k1714j5044N5175L856j0668l6698j1129J0256
12893d7570K7751L2064k3595k3914n175K5006L521j0700q629M909J8234k1109
12881b9207q171J0848J8715o026k2772j902J0337K6736J0375M290N509J468Q624
12868B8824k2711O164J2109k8574N014j1132j8376M5137K3122j0575J6698P425
12856E3125j717N012J9760j5699o101j5995j7952O603p393p843P618n890K264
12843A5792l012N159j1199p28j2844m507M218O494M31j1377J0982K6904k0862
12830E451j3233k3652k8385M123K3474K4470J1607K7349J284m918K763J0970m923
12817C6380o205j0507k1283k1429J4784J3898j1195J5420Q548j1670P401j4809
$$ y = [-11113, -25899, -13155, -18891, -21604, -43318, -58362, -3187, 669, -9999, -46697, -57826, -47570, -19819, 12245, -11350, -35264, -40439, -15433, -11912, -22612, -31241, -26332, -8098, -29207, -37378, -26530, -7815, -13841, -36613, -38515, -28178, -1442, 8933, 13223, 18732, 20200, 28824, 6113, 12277, 24386, -4188, 826, -10306, -28682, 16455, 39577, 29002, 45700, 53125, 51408, 56420, 76180, 60481, 54380, 38385, 20433, 27036, 19643, 11800, 19418, 13528, 15792, 12780, 17939, 6740, 6012, -6832, -11339, -7121, -627, -196, -11573, -591, 26313, 5451, -7782, -31434, -59819, -55696, -32222, -7752, 3855, 31204, 32488, 27570, 30333, 41303, 36380, 30175, 19668, -1615, -23044, -8260, 5638, -5557, 9863, 18411, 6741, 14142, -667]
12805f67j3189j9844N447K2445M722q216K0362K3876J2044J2401L1188l9358j9465
12792C1746p695J1193L705k3663k8812j8726P130N48J8745q15M909k1184R587
12779a3332J289P413J1049n404j3746j7382L1287L564N455j5005j5711L573M653
12766a2297m240J4558J480j6855J8611N923Q427J3361m905j3839l6919O490K9654
12753I449q154k9803J1531j2528J0382L2339K2303J7486j9518j5783j62K8046
12741D5588j9126m1575l2068k1464J5760L7634J6618J3521p104j1164k3234p296
12729c3910o290M9630Q142j9051q886j4473j053M439O769R288j3947J6856J3339
12716A0853L359J3627K3404r652l1637j3551n824J7025M749J3694k1303J2309
$$ y = [-667, -13856, -33700, -28253, -5808, -1086, -9302, 11060, 34936, 46980, 59381, 90569, 51211, 31746, 24051, 35244, 38949, 15286, -13526, -32252, -25122, -24574, -5829, -6644, -1735, -22919, -13332, -12043, -4630, 6419, 1015, -12731, -30113, 1174, 4738, 10193, -4812, -20523, -16950, -12297, -16537, -1979, -499, -17354, 1257, 7180, 15607, 28968, 24063, 10224, -26695, -20205, 9449, 1295, -28508, -16977, -29505, -19123, 13216, 35519, 53005, 33487, 17704, 17542, 45588, 26462, -15113, -47181, -68645, -52885, -15251, 1367, 14888, 7784, -3380, -26614, -33910, -40200, 9430, 17572, -1479, -10365, -24838, -25891, -21452, -14683, -5395, -19342, -2486, 10853, 14212, 27839, 51243, 41591, 9954, -3597, -9421, 7604, 12353, 26047, 4744, 17053]
12704A7053P4864Q2110N0472M4466K5545O300l7260o3670o9070o4305l8618j5047
12692A2840j7673p385M708j3737r694n077J2634L1109J9464J8009j7907p986P707
12679B7012j5544j1029J6297L2060J620K4548O407k4070k4011j0773J6674j2320
12667B6871k0538R810J3848j8657k3204P290n21j9499j448L0635J7184k3943j8301
12654b0473K7474J9457J695j2826k1968j3733m761L7020K793M540J1967Q813j4943
12641B5055J9006M916k8064J079j3500k5340m888J7614l8458J2785L0273K6848
12629B7326N464R309m3923k3418m883P509J3641l1906j118R710K6361M5382p686
12616C1768m029k1856j6948J2073J0260L2034J1590k6435j5465m396k005r770
$$ y = [17053, 91917, 174027, 224499, 268965, 294510, 300810, 263550, 199880, 130810, 66505, 27887, 12840, -4833, -12218, -7510, -21247, -30941, -36018, -23384, 7725, 27189, 45198, 27291, 19305, 27012, 11468, 439, 16736, 48796, 50416, 74964, 81371, 57301, 33290, 22517, 39191, 26871, 6333, 16143, 29991, 11334, -11870, -4580, -5101, -24600, -26048, 4587, 21771, -2172, -20473, 7001, 26458, 28153, 15327, -6641, -20374, -25135, 11885, 14678, 19218, 31185, 39998, 25055, 44061, 48977, 20913, 21992, 8492, -16848, -21736, -4122, -42580, -29795, 478, 27326, 32790, 42099, -1824, -25242, -30125, -22616, -8975, -40881, -41999, -32289, -5928, 39454, 31768, 27739, 5883, -11065, 1008, 11268, 43302, 54892, 28457, 12992, 8596, 6591, -3179]
12604c179j307P117J6950j0012o277l2094Q26J4015J5188K3901j329l4586k7059
12591c7846q445J608K5038J0137p255Q422j353L1376M886M207k1371k0607K612
12578h591M236M840k1639o467r987K6113l3349l5628L1251N0540J7777q201k2101
12565a1206k4302Q674J3620N198j8031Q234j0505K453J6839j3287K6085J0866
12553A4638L223K3626p427l1327r038j1147K494P516J2085N117l5765j4039L3311
12540f733J4318o943j3684k7221J2100r817J4761K9888K1305J4876m4379j2394
12528a3923K509l799j145L101k2261m246Q972J3638R731k529j1823Q38K774J8246
12514H3R834k1916m389j1702K6686K902j5912Q445p775k5982M8931L3045R676
$$ y = [-3179, -4486, 2631, 19581, 9569, 3292, -28802, -27976, -13961, 1227, 25128, 23799, -10787, -37846, -46291, -44683, -19645, -9508, -16763, -8341, -9694, 21682, 26568, 30775, 9404, -11203, -8591, -4355, 485, -21154, -27621, -37608, -11495, -44844, -80472, -49221, 1319, 19096, 10895, -11206, -35508, -26834, -13214, -8016, -26047, -17813, -28318, -25865, -9026, -22313, 3772, 14638, 17861, 41487, 34060, 2733, -6305, -17452, -14958, -7442, 4643, 9760, -26005, -40044, -6733, 7585, 642, -13042, -40263, -28163, -37980, -23219, 6669, 27974, 42850, -1529, -13923, -11414, -15213, -16358, -13257, -35518, -39764, -30792, -17154, -7423, -9952, -21775, -20937, -18163, 83, 9917, -11999, -16388, -28090, -1404, 1498, -14414, -5969, -13744, -39726, 9205, 42250, 51926]
12501E1926p35q03N583j2937O338p99M1413Q827j8591l8259j6615m130N578J2986
12487C9782k2914l5385k3036M141j4138R462K6439l17K866m035j2478n919L2232
12474c300K5882L9332l724j2298k9212k3413L2608j512l87k1k2357k5353L864
12461a9891M1794j1701j8275j9407K7064k1028k4569K2120L3503M7053J0185k3936
12449D2912l4513k2561j1183Q272J4550j0306j7624J940j6822l920J6220O315
12437b6720O569j7863N418K2031K4972L2915K7705l429m3639l0898k4877r209
12425c7025j4182l1269K0212K4986N389K638K1445L1711l9723K417J1745j5150
12413a6806L090K1785L621j9901k6995R305m129K1576L2661j6497l1512l495L1319
$$ y = [51926, 51191, 50388, 55971, 43034, 49372, 48573, 89986, 98813, 80222, 41963, 25348, 21218, 26796, 39782, 16868, -18517, -41553, -37412, -51550, -42088, -15649, -15966, -13100, -17135, -29613, -35532, -3300, 22582, 61914, 58190, 45892, 16680, -6733, 25875, 24363, 23976, 23955, 1598, -23755, -19891, 21903, 10202, -8073, -27480, -416, -21444, -46013, -23893, 9610, 56663, 66848, 42912, 8399, -14162, -25345, -17073, -2523, -12829, -30453, -28513, -45335, -49255, -33035, -26720, -20151, -38014, -32596, -10565, 14407, 47322, 75027, 71598, 27959, -2939, -27816, -37025, -51207, -82476, -62264, -37278, -31889, -29251, -7806, 23905, -15818, -13401, -1656, -16806, -13716, 8069, 11690, -8211, -35206, -25901, -30030, -8454, 24207, 7710, -23802, -27297, 4022]
12400D022J3633j256R090j952k4585l271L8865k9282l6871J233R114J5712p602
12387a3150k3237K5930K4514J6828J6218k7101q783k2122N624p688J1162o118
12375g923L1723j0314j0102J0295J0895P927n77Q431k2677J2345q869l780K4842
12362D2216P868m2193j8327Q254j9715J8916R892K22m0737j7982Q50J416K3467
12349b5853j1887K1620M8637j5113j4328L2838p92m1964J7324J6357l0389J1191
12337G641K3538J5912J153j2186J1829R783l7471o191k6316j758m680O510j5392
12324b7628M3608J4627o520k4083j1252K9236k9j8509J4168j0339k309P042k7293
12311a9281p35p557P039J0988K0149j1090k329k6798o04N284J5157J5055P816
$$ y = [4022, 17655, 16399, 25489, 23537, -1048, -4319, 34546, 5264, -31607, -30374, -21260, -5548, -13150, -36387, -10457, 14057, 30885, 47103, 20002, 11219, -10903, -5279, -12967, -1805, -7923, 23800, 13486, 3384, 13679, 24574, 32501, 31924, 40355, 17678, 30023, 21154, 17374, 42216, 50084, 7891, -10436, -2182, -21897, -2981, 6911, 7133, -33604, -51586, -50736, -49320, -25853, -37740, -16120, 32517, 17404, 3076, 35914, 35122, -6842, 10482, 26839, -3550, 7641, 31179, 47091, 48244, 36058, 47887, 57670, 20199, 14008, -12308, -14066, -18746, -12236, -27628, 15980, 30607, 24087, 4, -11248, 17988, 17959, -550, 13618, 3279, 970, 8012, -19281, -20016, -27573, -20534, -9546, 10603, -487, -2816, -29614, -30218, -24934, -9777, 5278, 13094]
12298A3094J9950j8483j9966N502L475L773Q465j1486j0013K1286j8982k9341
12286c2726K766K0329r792m619J168M1450K5779k0447k7508K304K691k3678k2344
12273d4627j0281q660J6591J6382j661J0201p263R254m929J3876M620l3990j044
12260d1531j584K1288J9483J5928k3266m492l2050q403k419K0404k439N4269O296
12247B1484j5382j5717p637Q84R74K3143j3775J1053K8631k2901j8077k0519k4328
12234e2167K694J0165n157r77o786J0013R179j9370J0820K4819K5543p757J9857
12221B0876Q265j6427l955j3992j5881L2151J8357l7899k3339k535J2018m481
12209b6842j0220Q367J5662M61Q574j9198j1165O091L7268P557j3094j328m73
$$ y = [13094, 33044, 14561, -5405, 97, 3572, 7345, 15810, 4324, -5689, 15597, -3385, -32726, -29960, -9631, -19423, -24042, -22874, 18576, 44355, 23908, -3600, -1296, 1395, -22283, -44627, -54908, -63568, -46977, -30595, -32256, -22055, -29318, -20064, -24993, -11117, -6497, -40487, -41531, -43115, -21827, -2344, 13584, -9682, -14174, -46224, -54627, -57046, -36642, -39081, 15188, 21484, 6102, -9615, -17252, -16368, -15394, 7749, -6026, 5027, 33658, 10757, -7320, -27839, -52167, -49473, -39308, -44465, -45442, -52228, -42215, -33036, -52406, -41586, -16767, 8776, 1019, 20876, 29141, 12714, 8759, -5233, -21114, 11037, 29394, -8505, -31844, -34379, -22361, -26842, -37062, -28695, -13033, -12572, -3998, -23196, -34361, -28270, 8998, 16555, 3461, 2133, 1660]
12196A660k599l50J6042P700k8676k1321q735L025L4530j3488j2464K114J3701
12183h861q828j5770J3584J7632J2651N949j3057o490p958k545n974l152j3028
12170c5847K811J5790k24K9630K7560R752j3223k1814k0294p703n442N406l399
12157a6997J8927q957j3992L983j0250n257L9734J1263j6043K829p116k8646m581
12144c5103o720J2442O657N94k652j0474M3662J7l8017K8236L8886R859M957j1836
12130D0508o419p612J081j5490n810J0070j3467j7371j2613J8196J1721k591k5644
12117b5441L950N191J1355K1689K0898K6930q264n480o605j799J9132J0652O898
12104G9106K3057j776j109J3164P5701J38997R1931N1119n609k3473m0821j03626
$$ y = [1660, -939, -1289, 14753, 22453, -6223, -27544, -36279, -33254, 1276, -12212, -24676, -22562, -8861, -17689, -33459, -19875, -2243, 10408, 16357, 3300, -3190, -11148, -13693, -19667, -22819, -35847, -33036, -17246, -17470, 12160, 39720, 49472, 36249, 14435, -5859, -13562, -19004, -13598, -16997, 1930, -7027, -21019, -17036, -27286, -32543, 7191, 18454, 2411, 5240, -1876, -30522, -35103, -41823, -29381, -22724, -22130, -24782, -35256, 8406, 8423, -29594, -1358, 37528, 47387, 52344, 40508, 34089, 26477, 27558, 12068, 6258, 16328, 2861, -14510, -27123, -8927, 2794, 203, -25441, -21491, -16300, -4945, 16744, 37642, 64572, 56308, 50828, 44223, 42424, 61556, 72208, 79106, 102163, 100387, 99278, 112442, 188143, 327140, 419071, 470190, 464581, 441108, 400287, 296661]
12092B96661j01513p7759k2781m918J368n302k1070l0333l6661O49J4522K5117
12080C7980k089J2047j9831k7411M681R672k5390P035O816k0110M1320J1155L226
12067C9101J7450k2414n0304O947J0596K362L3434M9602j3433k6532j0758J0952
12055D7003o837j8161k0858q07j9150r748p778j3091o08K8834K8748R231k8476
12042a1698K915j6289J9428J2650j6919K8426n21j3472n931k326j5109K5527K7556
12029C4237Q144k6898k7683R304P110R394l3644J0542K1142j4339k9161j0781
12017d2633M383K736j6335K2767j4546j155P490J5692n515j3835K6417M4072l2295
12004b757l1401J7628J0204o817J4270J9921K1549P68k9834L286k1280O342P863
$$ y = [296661, 195148, 117389, 94608, 89690, 91058, 85756, 64686, 34353, -2308, -1659, 12863, 37980, 35891, 47938, 28107, 696, 5377, 15049, -10341, -3306, 3510, -16600, 24720, 35875, 39101, 56551, 34137, -16167, -9220, 1376, 3738, 37172, 86774, 73341, 46809, 36051, 47003, 40166, 22005, 1147, 340, -18810, -28558, -36336, -49427, -50035, -21201, 7547, 16778, -11698, -8783, -25072, -5644, 7006, -9913, 18513, 17992, 4520, -1411, -3737, -18846, 6681, 34237, 42381, 15483, -12200, -2896, 4214, 13608, -20036, -9494, 11648, -2691, -31852, -42633, -38250, -35514, -51849, -29082, -43628, -44783, -37293, -21601, -27116, -40951, -14534, 29538, -2757, -34158, -16530, -6326, -13143, 1127, 21048, 42597, 43365, 13531, 16817, -4463, 1879, 9742]
11991I742L420k4009j1660J7462K8228P749l371j2658k1433j0333J2926K9098
11979B5161N839q165j0793l3150L640k706j2860j342r708M912J1300k6766J4918
11966c9720K4231k2676K033M0198L1391k698Q632K2545J9746l0548j5179j8964
11954A8991l7975J1356K3474l156k8776j3304J70k70J5829J7163r929l070n685
11941a5182O837J5852Q818k6237j6973k6099J426K2536J322o155j3131k910n142
11928e5038m448L0989J5941r358j3526J434J8055J077k4258j0788K7455K331j3296
11915c3430J5438J2784r297l3613j6639m3L7058L6299p358q994p412q288Q542
11902a4953O801q91O460l951J2004k1728j0515P187K1411r926m2549l4792j0567
$$ y = [9742, 13162, -10847, -22507, -5045, 23183, 30932, 27561, 14903, -6530, -16863, -3937, 25161, 31000, 22835, 12042, -21108, -17468, -20174, -33034, -34376, -44084, -39172, -27872, -54638, -39720, -15489, -38165, -36132, 4066, 35457, 32759, 41391, 63936, 83682, 53134, 37955, 18991, -18984, -7628, 15846, 12690, -16086, -29390, -29220, -29490, -13661, 3502, -6427, -9497, -15182, -8345, 7507, 16325, -9912, -26885, -52984, -51558, -29022, -27700, -33855, -46986, -49896, -55038, -59486, -28497, -12556, -21914, -35440, -34006, -15951, -14874, -39132, -49920, -22465, -20134, -33430, -17992, -5208, -14505, -48118, -64757, -64800, -27742, 8557, 1199, -7795, -15207, -23495, -14953, -8152, -9043, -2583, -6534, 5470, -16258, -26773, -19586, 1825, -8101, -50650, -85442, -96009]
11889i6009K4862M2067j765L7693K0006L890m3091j7428P200J6847K0250O247
11877B0769J2747J000j475j3675k7482m3584J3268n341J6881J481J4936Q116l96
11864b755r535m689p097J5993j7371J0744j5260j3463R119J0142k637q124J1811
11851b3122R672j3286J5139J7138K6907l7210o5135K3009N8049J7865l1921j0045
11839a2940J1150p356j2791m031J9848j4140n5455L1503K8826N322O683L3280
11827B9899O129L059j140Q427j2039n5744R373L4236j1711K875J4630k1572j2772
11814f350j563K7313K9649L887k2618k1477o98j0032k780P918K129r928q94K6684
11800B1240J1738J638k467r958n830J4045L265N592j0205N252q394j3139j4935
$$ y = [-96009, -71147, -29080, -30845, 6848, 26854, 30744, -12347, -29775, -22575, -5728, 14522, 20769, 33516, 34516, 33041, 19366, -8116, -51700, -38432, -43773, -26892, -25411, -10475, -2359, -2755, -12290, -16979, -24076, -8083, -25454, -14710, -29970, -43433, -34314, -24172, -26809, -34933, -23122, -13450, -26736, -11597, 5541, 32448, -4762, -69897, -46888, 11161, 29026, -2895, -12940, -1790, -9146, -21937, -25968, -6120, -20260, -75715, -44212, -15386, -10064, -3381, 29899, 36028, 39087, 37947, 46374, 34335, -21409, -12036, 22200, 10489, 13364, 27994, 6422, -6350, -7913, 19400, 49049, 52936, 30318, 8841, 8143, -1889, -4669, 3249, 5378, -4550, -5444, 21240, 32978, 34616, 32149, 22191, 16361, 30406, 33671, 39263, 29058, 34310, 25916, 12777, -2158]
11787b158J5095K2754k276j6373q648j5785r728K7959J6787j0108K0892N768k0549
11774B3630J971j0253K2128K3422j6827o871P952l227J0135l4501l8543J3618
11762g366L8709o888k001L0740J3266k7857l672j0892k5874k2657L060J1840K621
11749f971j0650M9279m867p654j2824k7531K6580L1511N312k4847l6412k1680
11737d0754L4329k4332j7411J2088R417L4729j4873l5427J3601j3347q61J6106
11725b6735M68R353J354K9731M0640k2592k0412O535J0585j9848O878J8577r491
11712B5043m7832k1335L6685j891J2724K4689N843J5871l567k7871q869k462M311
11699A1339j6459K953k5031o5395J9076K8982K0027L0532J6373j9629j8550O740
$$ y = [-2158, 12937, 35691, 33415, 17042, 8394, -7391, -17119, 10840, 27627, 17519, 38411, 44179, 23630, 25601, 15348, 37476, 60898, 44071, 37200, 45152, 41925, 52060, 17559, -20984, -7366, 31343, 24455, 22454, 53194, 66460, 38603, 34931, 24039, -1835, -24492, -21432, -9592, -6971, -17621, 31658, 26791, 19137, 6313, -21218, 5362, 36873, 42185, 17338, -19074, -40754, -6425, -30757, -48168, -36080, -26663, 8066, -6807, -42234, -28633, -41980, -42841, -26735, -26267, -16914, -15560, 14171, 54811, 32219, 11807, 18342, 28927, 9079, 15957, 34534, 25043, -22789, -44124, -7439, -9330, 3394, 28083, 33926, 49797, 46230, 18359, 9490, 7028, 11339, -5120, -2167, -27198, -92593, -73517, -44535, -24508, 6024, 22397, 2768, -15782, -9042]
11687i042k3464K601J5117J697k1530K942p206j9735K14J5979N0259L6378M208
11674D8418j1512k9785j9840q02J4218M377j1300r281o462p112N762J0556M915
11661g848L947j1912l6725k1644K6135K8123N390L282Q541N240J6986J060k3248
11648b673o827r444l1118N852k5717M683L4301Q084K7453M223o157p229J2519
11635G950M857k5582j0856K0380J7886j3214k1480j5129M2971L211j542K5172
11623C4624Q565j5460j5256j5061j5638k080J581Q727m376j2909K9065L8521l015
11610C7288n993j0036l6386k6483n152N655J6431Q009k077j9409m697J8283j3861
11597c8428p41K3790L056j0747J8891K0568Q979j3053M073K083j095J0448P879
$$ y = [-9042, -32506, -29905, -14788, -13091, -34621, -31679, -38885, -58620, -58406, -42427, 7832, 44210, 48418, 36906, 7121, -12719, -13521, 697, 5074, -6226, -15507, -21969, -29081, -23319, -12763, -7848, -3901, -15813, -52538, -74182, -48047, -19924, -14534, -11252, -2711, 2529, 19515, 20575, -2673, -9500, -18944, -50062, -44210, -69927, -65244, -30943, -22859, 4594, 8817, 2660, -4569, 7950, 12807, -12775, -23631, -3251, 14635, 1421, -20059, -35188, 7783, 10994, 9452, 34624, 43189, 27729, 12473, -2588, -18226, -20306, -18725, -9998, -14374, -27283, 1782, 40303, 37288, 31295, 21259, -15127, -41610, -46762, -41107, -24676, -16667, -18744, -38153, -42850, -24567, -38428, -39169, -15379, -12323, -23070, -4179, 16389, 25368, 12315, 16388, 18471, 17376, 27824, 35703]
11584C5703j863q781k6276m0862J3148n247O712J1830k5003k734L841K4049J5663
11571A80K1468l5085j4217l520Q520k923n937J8412L4749J2092j9129k3787o845
11558a6022P011L4017J3942j5310k3904J5603J2138j144o390N3514J5625k1037
11546F8043j568p207n136k4445j1227r674k5750o06J1146k0238L524k1668O74
11533d4132J6705j6338n817J4551J0306J3728J1056K453q430M1184Q37j1091m3026
11520a8014k1568K5989N502m377J6834K1537K566j4815j5408l718K3156j3220
11508D464J2775M878M655k2371J7675J8656o1050k2925m536n365o839L3875J9374
11495f734n686L417K980l200J916P170K050O082j3216l0863O924K4964K8748M761
$$ y = [35703, 33840, 25059, -1217, -42079, -28931, -34178, -27466, -15636, -40639, -43373, -39532, -15483, 180, 21648, -13437, -27654, -31174, -22654, -25577, -31514, -13102, 21647, 33739, 14610, -9177, -16022, -9011, 25006, 38948, 23638, -266, 15337, 27475, 26331, 19941, 73455, 89080, 68043, 66475, 59268, 54132, 29687, 18460, 8786, -16964, -17570, -6424, -26662, -23138, -44806, -44132, -27427, -43765, -49582, -35031, -24725, -10997, 59, 2512, -5918, 35266, 36103, 25012, -18014, -39582, -13593, -8091, -12468, 4366, 25903, 28469, 13654, -1754, -5472, 17684, 4464, 17239, 22117, 26772, 4401, 22076, 40732, -20318, -43243, -47779, -53144, -59983, -26108, -6734, -12420, -9003, -6023, -9223, -7307, -137, 1913, 7995, -5221, -36084, -29160, -4196, 24552, 29313]
11481B9313j8887J3967O150k9092j490n06n297K344p551l4828L7424N479O102
11468C128P988J2879R372j298j4362K892Q09M540k9906K3638L6353J8244J587
11455G5864l5933l472m478j2171K321k1703j0437M280J1862k3707p518K4682m359
11442d769L2381l7239k3090J0418m480K0242j5525j1323k93j1079J4359J1825
11430a8573L2978J4415k0639j7296J2205L8270K1793P420k9123k7973q500L9997
11418D4974J9424k4480L5730N951j8524K0796j0869n027q242l1857k7781p869
11406g774k5029j2357o435K5417j3185j778M2723M3649J1137k7658k2059P536
11394A4187j763j6664j7929O513J1122k9302m564L0088o533K0150K5998J7190
$$ y = [29313, 10426, 24393, 30543, 1451, -39, -545, -5842, -3498, -11049, -45877, -8453, -2974, 3128, 11116, 23995, 33367, 32069, 17707, 20599, 21408, 25948, -3958, 19680, 56033, 74277, 75864, 39931, 36459, 31981, 19810, 22131, 428, -10009, -5729, 6133, -17574, -25092, -410, -4769, 27612, -9627, -32717, -22299, -26779, -6537, -22062, -33385, -33678, -44757, -30398, -18573, 14405, 28820, 8181, -9115, 3090, 41360, 63153, 70573, 41450, 13477, 4977, 44974, 64398, 39918, 75648, 81599, 63075, 83871, 73002, 67975, 59733, 27876, 95, -7774, -32803, -45160, -51595, -26178, -39363, -41141, 1582, 45231, 56368, 28710, 6651, 14187, 12424, -4240, -22169, -15656, -4534, -33836, -38400, -8312, -14845, 5305, 31303, 48493]
11382D8493j9706l6338j3246L299j238j3076O941K7715J0854j4546j6013J907
11370a4954r022J2490J5396q172m407M913l2236j9279J297K6083n572J3175Q44
11357a9444j2121l321N077j4950j7638K2290Q615K5814J7589n972O625N175N395
11344B3134j215j6404k2474o02M825L015n979p126k3573P652L0301K1719j4082
11331h09l3006R622o478J513j172J8549j2996k948R145k121j490O394n109m578
11317b5484P94O060K575n701K1745J3879j8213J4917P744k1921j9384J8793J7551
11304A3355J6254k0843j424M585O646q387P017J7256J2218J235q911m3593n691
11291a0283J0151m129K6585q079k6369m193J4378j2300k8601J227o854j0421j047
$$ y = [48493, 28787, -7551, -20797, -17498, -18736, -31812, -24871, 2844, 13698, -848, -16861, -14954, -23976, -11486, 3910, -4262, -8669, -3756, -35992, -55271, -53974, -27891, -33463, -20288, -19444, -31565, -34886, -29809, -44759, -62397, -40107, -31492, -5678, 11911, 5939, 12564, 17739, 23134, 21919, 5515, -16959, -17561, -12736, -9721, -15700, -22826, -46399, -38747, -8446, 13273, -809, -33815, -24193, -30671, -29158, -30330, -11781, -24777, -27725, -18580, -20701, -22191, -15797, -20906, -25484, -24690, -18630, -16055, -21756, -11, 13868, -4345, 10572, 18316, -3605, -22989, -4196, 13355, 29609, 8766, 7342, 11927, 18573, 10186, 17203, 34459, 46677, 47912, 39001, -4592, -10283, -132, -4261, 22324, 14245, -12124, -16317, -1939, -14239, -42840, -41613, -48467, -58888, -59935]
11278e9935J2150l734J4067J8682k286J8935p510k4154n0626j7618J8355L1011
11266e2663k753K660N826J2764L515j827K7323J0346j0443k7699j1952O124P364
11253c1415J0044L3538K312l3935J7500L6314q283J6161j0323P568q633o033j2237
11240A2578j1813k7397j6883L1396k869k3383j3490J1689L267j4504j8477J7614
11228e2272l268L4822L2395K386p964j739R465l743p992p807M083J6103J8186
11215C2655k3206O821K2310J749l4090j0774J3325J0154Q334j3241j0508J2567
11203A6096n677k1570O033j5238j5738J7196J3200J7576r702j4382M841L439r169
11190a3095K7845N322J0930q042j7489J5798k6685j5901n798m15K3618r765M911
$$ y = [-59935, -47785, -51519, -37452, -18770, -21056, -2121, -9631, -33785, -84411, -102029, -83674, -52663, -55416, -52756, -46930, -34166, -30651, -32478, -5155, 5191, -5252, -32951, -44903, -38779, -31415, -21371, 12167, 14479, -19456, -1956, 34358, 26075, 42236, 31913, 39481, 30848, 24815, 12578, 765, -26632, -43515, -12119, -14988, -38371, -51861, -40172, -36905, -51409, -69886, -52272, -55540, -20718, 11677, 14063, 6099, 4360, 13825, 10082, 2090, -5717, -1634, 14469, 32655, 9449, 16270, 38580, 40329, 6239, -4535, 8790, 18944, 27278, 14037, 3529, 16096, 10419, -11151, -5118, -20356, -36094, -18898, -5698, 11878, 2176, -12206, -7365, -3926, -13095, 14750, 20072, 31002, 22960, 5471, 21269, -5416, -21317, -27115, -27530, -3912, -13677, -8766]
11177h766O72J0021M032q118q02O008j4227L640n237j4589J6421J6814K2377R062
11163C7308M338k4282m180J1198K4631q821m1225J5145K6523m217k0478N379M864
11150B6183M165r785j2085j2545J364r186J9739j2778k1008q45K8178K4269j010
11137B4656q903J0073j4862j2568m854j688j9680J961p434k743J3049O354N530
11124a1109K3882j2805l716l7817k5045K6180J6902J3037L6593m987j6087o805
11112a777J4146j4303k1266Q812K7448j4864m493J6759J015L090j701O672r250
11099A0288k2788k3604k535O85N1618L6559j4346k3671j4714n96k3801k6238j4016
11086f7159p39p835M0584L4933j1771J1818K1475l0051j5269J3035J4818Q102
$$ y = [-8766, -8094, 1927, 5959, -2159, -2961, 3047, -11180, -7540, -12777, -27366, -10945, 5869, 28246, 37308, 41646, 17364, 13184, 24382, 49013, 40192, -1033, 14112, 40635, 36418, 15940, 21319, 26183, 30348, 20563, 8478, -4067, -2703, -11889, 7850, -4928, -25936, -26781, 1397, 25666, 24656, 15753, 25826, 10964, -1604, -6458, -8146, -27826, -25865, -33299, -36042, -22993, -16639, -11109, 12773, -32, -3748, -41565, -66610, -40430, -23528, -10491, 26102, 21115, 5028, -1777, 12369, -1934, -23200, -14388, 13060, -1804, -6297, 10462, 11477, 14567, 12866, 19538, 10288, -12500, -36104, -38639, -37954, 13664, 50223, 35877, 12206, -2508, -3104, -26905, -53143, -67159, -67898, -75733, -35149, -216, -11987, -169, 21306, -8745, -24014, -10979, 3839, 11941]
11074A1941K649k2409J3487J1980l5918j4925J491J3426J4634J7250L5902M415
11062E3923N474j061m359m3666k616k6957K0000K85K0102l2038j5892J383J8478
11049f944J4051r275q986n688M0054k372k1327j7335j2618J4615J0742j4784l2822
11036e2689j8584Q0693M2481j3414l2027k6287O793P213j3934Q111j7158n268
11024c4070J39r715L0155K0128J423j8407j4383n495p67J6115K9746m3059m4861
11011g3051L0919J2257P536q064o182K1226K1599j4058k3364K0426m436k7431
10999d2623J5916R20O500m416j971J4795J6907P961L371j9585j8539J3620q240
10986a5384J5647L478P368K579Nj6448j5265j0461J8792J375n9494k96J4102J6227
$$ y = [11941, 14590, -7819, 5668, 17648, -18270, -33195, -31704, -18278, -3644, 13606, 49508, 53923, 59397, 58336, 53977, 10311, 7695, -19262, 738, 1023, 21125, -10913, -26805, -25422, -6944, 7107, -2168, -11154, -16842, 23212, 20840, -487, -17822, -30440, -15825, -5083, -19867, -52689, -71273, 9420, 51901, 38487, 6460, -19827, -13034, -5821, -19755, -11644, -28802, -34070, -33931, -43646, -13491, 6637, 8060, -10347, -24730, -30225, -30992, -14877, 14869, -28190, -73051, -42132, -29875, -22339, -30403, -36585, -15359, 6240, -7818, -31182, -10756, -15192, -42623, -26707, -25787, -19287, -23703, -25674, -10879, 6028, 13989, 17360, -2225, -20764, -7144, -15384, 263, 3741, 11109, 13688, 13693, -2755, -18020, -28481, -9689, -8314, -67808, -68104, -54002, -37775]
10972c7775J0481J3090j1143j5312j4291P025J0598j5116j2966N549J7899K8699
10960a3262N115J8621Q656j8601k0138j359L0466K8695m690K266q214K2091l213
10947D6433l7369k2167j3056K2845N834j9235J4167L3503K5616o578j5229j1302
10935B3462j5517j9937M885M3676L369k2089k1253J3909j3394k2577l458k0269
10923d9193J306l614K909R051K1117k458l290r87J3630r699N650L1045K548k3475
10909e460n3750K5495L1047M0870o636k5211K281j393O735L495k3345j1569j7030
10896c4471m1109O180N6715K4336q037K430J1170k0312k6309q128J6250R061j0276
10883b2500K645K9432Q276l088j176N136j1709m765k5415j3128J694P022j3568
$$ y = [-37775, -27294, -14204, -25347, -40659, -54950, -47925, -37327, -52443, -65409, -59860, -41961, -13262, -8147, 10474, 19130, 529, -19609, -20968, 9498, 38193, 33503, 35769, 27555, 49646, 46433, 9064, -13103, -26159, -3314, 2520, -16715, -2548, 30955, 56571, 49993, 34764, 23462, 7945, -11992, -7107, 36569, 39938, 17849, -3404, 10505, -2889, -25466, -28924, -49193, -47887, -51501, -48592, -39541, -18424, -20882, -24172, -25159, -11529, -21228, -15578, 15467, 18015, -5460, -59210, -33715, -2668, 38202, 31566, 6355, 8636, 7243, 13978, 17473, -5872, -17441, -34471, -75580, -69400, -12685, 11651, 3614, 6044, 17214, -3098, -29407, -37535, -21285, -12224, -22500, -19855, 9577, 17853, 14765, 13589, 18725, 7016, 2251, -23164, -36292, -34598, -27576, -41144]
10870d1144q323j5345Q751K3695N891q764J7531Q262k3140r457Q424K4417J9333
10857A0131J4654l7867k1175l855R073L1199K2161k0859j9338J5182K0399O499
10845B6204m468j7019j9794K1977O009r273K685K8311N087k1990j8684o485n897
10832a3337p060M717L3437M234m736J2938k8411m5180L8249R5l8572J4517m026
10819c3135r63m353p437M637P103N13J9264j0158k1393j4828L062O183L4319J9374
10805B188j5991J1827m137j2130j3400n307j2131R634J5536M004k6732J1200O016
10792b9423j41K4678L3909K6936J5636j3390j952k3652l3112J1524j5315N619
10780A317l734k528J238Q307K6156j6027k1261j4018N59J092O064O584M344n687
$$ y = [-41144, -49467, -64812, -56061, -32366, -26475, -35239, -17708, -9446, -32586, -42043, -33619, -9202, 10131, 24785, -13082, -34257, -38112, -29039, 2160, 24321, 3462, -15876, -694, 19705, 26204, 21736, 4717, -15077, 6900, 12909, 3636, 6321, 34632, 39719, 17729, -955, -7440, -13337, -20397, -15680, 17757, 21991, 17255, 30193, 1782, -43398, -5149, -5054, -43626, -29109, -33135, -34098, -38451, -45888, -41251, -34148, -33635, -14371, -24529, -45922, -60750, -57688, -51505, -17186, 2188, -13803, -1976, -6113, -18243, -31643, -36950, -49081, -39447, -23911, -19907, -46639, -35439, -29423, -29564, -4886, 29023, 55959, 71595, 58205, 56253, 32601, -511, 11013, -4302, 1317, -2417, -4945, -3707, 4600, 30756, 14729, -6532, -20550, -19991, -18899, -12835, -6251, -1907, -7594]
10766g594K142K7514J6354k68n9953j3305N4657K7466m1610m6637l0031K0456
10754e0809K2961K497N003r754J1450J6427j5657j828j981K1955j3692n999j0957
10741c0384J7818J1472J539J1878q707L476J8011J3372l8535l3150L7296J4175
10729A8261l6154K3032j5097L299L614L822R699j7385N087J0264J0967J0536l8485
10716h540j0790J3243k180j2654K931j2508M990J6012J1737k0777l008J0844K9925
10703A9225N3024R335l5456j7801l1717M273k9996O152m800k0280J6563L1534
10691E6M152Q936j0218k0119J077j662J1292O668O028J787j4478j5468N955K6459
10677A0465K7654j9500j3739j0250J3994P06K2924K3455l006k2652j5101k0123
$$ y = [-7594, -5452, 22062, 38416, 38148, -21805, -35110, 19547, 47013, 5403, -41234, -71265, -50809, -27848, -25351, -20348, -30102, -18652, -2225, -17882, -19710, -21691, 264, -13428, -19427, -30384, -12566, -1094, 445, 12323, 3616, 7092, 25103, 38475, -60, -33210, 4086, 18261, -17893, 5139, -9958, -6659, -3045, 777, 10476, -6909, -1822, 8442, 19409, 29945, -8540, -19330, -6087, -8267, -20921, -17990, -30498, -25508, -9496, 2241, -18536, -21544, -10700, 19225, 72249, 81584, 46128, 28327, -3390, 883, -29113, -22961, -27761, -48041, -31478, 56, 4208, 13144, 2926, -17193, -16116, -17778, -6486, 182, 6210, 7997, -6481, -21949, -15994, 10465, 38119, 18619, 4880, -5370, 8624, 9330, 32254, 55709, 52703, 30051, 14950, -5173]
10665e173l8388k2579K4534N5544J2300k7461L400k9063l7073O684J0200M1451
10653e624K6156k0947j0983J4868j5085J0319K6662K463j4421q030L506j9230
10641a0346m892j5153m106K5901K3954Q287n974J4185j8069j7358J3390q833k0724
10628a9738L089M013k8547j4070J3374M5818R626j0671K782R187n899k7404k253
10615b0693N614K1152R096K0238m81l2972J2595K6813r656k3460l803J5633K6759
10602D6835J6086k2438o483k0269j9833P638J2077j65r728j4952J306K8897M059
10589B3030j5178n959M659j3874j1989O464J7517J1021j7768M935J462K034M967
10576A1321l625k4465j6961M584J0319M1415O605k390j7354j3189K7292J9051
$$ y = [-5173, -43561, -66140, -41606, 13938, 26238, -1223, 2177, -26886, -63959, -57275, -47075, -5624, 20532, -415, -11398, 3470, -11615, -1296, 25366, 27829, 13408, 5378, 8884, -10346, -15238, -30391, -34497, -8596, 15358, 23645, 17671, 31856, 13787, -3571, 9819, 986, -19738, -16649, -12636, -41183, -55253, -41879, 3939, 13565, 2894, 5676, 14863, 8964, -18440, -20693, -15079, 6073, 15169, 35407, 34926, 1954, 14549, 41362, 31706, 8246, 4443, 20076, 46835, 62921, 40483, 34000, 13731, -6102, 1536, 13613, 13448, 3720, -11232, -9926, 18971, 23030, 7852, 1893, 6552, -7322, -19311, -12847, 4670, 15691, -2077, 2858, 4320, 6354, 11321, 7696, -16769, -33730, -29146, -18827, 22588, 29193, 26803, 9449, -3740, 23552, 42603]
10564D2603m012j0711j8474l8114k2125K2505k3868k0914O942L6706n287L117
10552c1632J4426L1364N662l3947k0911p873K0342J6158J8409j4135j1273n24
10540a3934J0797J3135R970k7264m8902M1005J6005j4479o679k1818J3685J947
10528b6532L5288M227j8946p514q533P029K2907l3940j1909L0662j8335j5535
10516d1131L1992J651J7787j3324o044J0406M4415j1382j4621l4368j1711K9055
10504B725N972l2589j2293k79j3977K912j5874r71K4932J9620j3441L783P000
10491b2480k3040j7468J4590N3674L3320j7732j2090J2162j9060m5066R331N650
10479b8209J1168M7985L0607l1774l3293m628p190J1344k4483k9022Q886J9311
$$ y = [42603, 38591, 27880, 9406, -28708, -50833, -28328, -52196, -73110, -66168, -29462, -34749, -31632, -17206, 14158, 19820, -14127, -35038, -42911, -22569, -6411, 11998, -2137, -13410, -13934, -3137, 9998, 19968, -7296, -56198, -15193, 812, -13667, -20346, -42164, -28479, -26532, 8756, 12983, -5963, -13477, -22010, -14981, 7926, -26014, -37923, -7261, -25596, -41131, -9139, -7488, 10299, -3025, -9069, 1337, 45752, 34370, 19749, -14619, -26330, 2725, 8697, -23892, -36185, -36464, -50441, -47529, -63403, -64374, -39442, -19822, -33263, -29480, -22480, -45520, -62988, -48398, 5276, 38596, 20864, 8774, 20936, 1876, -43190, -33859, -28209, -17041, 30944, 61551, 29777, -3516, -8144, -15334, -3990, -28473, -57495, -48609, -29298]
10467b9298L7571k2525R233J2090m703m532R015J2659j4157l3859j915L1590J4943
10454A6112n329q046J5528J6929j6806j3538j7256k2816K5656K4254j0977m8808
10442d5097K730k832m948R514J5713K53j0305o99Q981K0947K244j8805R228K1481
10428H405M135k722j2053r477J384l958J3439L2437n957N649K1356m656j7496
10415C0486k1775l164O160P970K3227j5559j6034L7954k3781n2714J3263J4651
10403F84M294r025M552R423j4250m550O986p154j324l5866Q386o657J1314j4797
10389d7984L392L1558k7262j4552K5303M2767J3576k4026n5583k512M0079J4203
10377a041J125R107J3462k5626j0824o278R956J6089J6414o445j4743k5242K7045
$$ y = [-29298, 8273, -14252, -5019, 7071, 2368, -2164, 6851, 19510, 5353, -28506, -30421, 1169, 16112, 10783, 2737, 18265, 35194, 18388, 4850, -12406, -35222, -9566, 14688, 3711, -45097, -42367, -45199, -50147, -40633, -24920, -24667, -34972, -35671, -26690, -5743, -3499, -22304, -13076, 8405, 12540, 9818, -2235, -11712, -10328, -14286, -847, 31590, 25633, 31282, 52638, 47982, 30486, 8711, 5547, 11707, 19677, 42904, 27345, 11311, 49265, 25484, -27230, -13967, 684, 4978, -4047, 505, 9928, -4322, -8872, -1886, -9040, -10364, -46230, -37844, -44501, -33187, -47984, -44592, -13034, -40296, -54848, -29545, 13222, 26798, 2772, -52811, -55323, -15244, -1041, 84, 9191, 22653, -2973, -13797, -20075, -10119, 5970, 22384, 15939, 1196, -24046, 2999]
10364B999K5452q934Q04R4o147k7157O139N420r698j2972K4099N751J435k1706
10350a4421J4803k085k1951k318j0104j3110J6377N2078L9945J2281l9524k1743
10338A0228n701k2762j5260J9200N570J358M285L449o875J3402K0980j4456o982
10325F436N874j1549q075K945o132J637k7606P656J6055L633o669J9880J1445
10312A5530L790J4342j8376j5058J447k1845P095M1042J1636l3112Q220K1308
10300C6019j0281J746j2841O275m163m570K1288J9532J4174j3808j0957J5293
10288E7707pk4747J1669j5205q962R413m5126m2462L1513K4056N964p305k31K9360
10274B5637J2482j1602k7846k7527L7144j210j8846K957J805M414j4475p218l265
$$ y = [2999, 28451, 19517, 20321, 20415, 14268, -12889, -6750, -1330, -11028, -24000, 99, 5850, 7285, -14421, 382, -1703, -23654, -25972, -36076, -49186, -32809, 19269, 59214, 71495, 31971, 10228, 4527, -18235, -33495, -14295, -8725, -7367, -3082, 367, -6508, 6894, 27874, 13418, 6436, 12310, 761, -7314, -4369, -10501, -8864, -36470, -28814, -12759, -9126, -15795, 4085, 15530, 19320, 33662, 15286, 228, 1675, -20170, -13075, 27967, 39603, 6491, 14711, 36019, 25738, 27484, 14643, 20918, 16755, 12185, 33473, 53005, 67179, 53371, 42414, 57707, 57700, 32953, 44622, 29417, 20455, 29868, -15258, -57720, -26207, -2151, 3813, -3492, -3723, 25637, 38119, 26517, -1329, -28856, 8288, 7078, -11768, -8811, -7006, -2592, -17067, -24285, -27550]
10261b7550L6946l82p435J815L542Q087K5637O030m7879J4392N3317K586n1146
10248A7960l3078m4479J1418J3106j434j5231R582K6256L0839K2931m736m162
10236B8972k481J4672J822n945R302K4362k5386k1198J8100l8208k3108L663O902
10223h531O036j4503j563L9909M66l1204M007j4841J2906J9028l231l3938k650
10210b8109J2062j3020j6195p773K3270M6291Q816k7780l7970J1869J1177J534
10198a5828N60r910j9907J3871K7181J940r109K495q297r271k4378K8575J1011
10185a1067j5689k1389J2323K4524J2035l856r921J9334k374j6258P69j5122m302
10172c0993M3223J2619k102k941l588p697k5503r294j8877R064L0455K9595P790
$$ y = [-27550, 9396, 9014, 1579, 3394, 6936, 15023, 40660, 46690, -1189, 13203, 66520, 69106, 17960, -15118, -59597, -48179, -35073, -36507, -51738, -42156, -15900, 14939, 37870, 33134, 28972, 26491, 41163, 42985, 37040, 46342, 70704, 45318, 24120, 42220, 4012, -19096, -15433, -8531, -2495, -16998, -18561, 21348, 21814, -9390, -5383, -20224, -7318, 11710, 8479, -25459, -28109, -16047, -29067, -45262, -53035, -29765, 16526, 25342, -2438, -40408, -28539, -17362, -15828, -15268, -25178, -45085, -31214, -4033, -2093, -11202, -8707, -17004, -26275, -50653, -22078, -11067, -26756, -48145, -35822, -11298, 737, -3119, -13040, 6294, 3920, -12338, -11569, -26691, -30993, 12230, 24849, 22747, 19806, 16218, 8521, -16982, -26276, -45153, -36089, -5634, 23961, 31751]
10159C1751j3846o877P570j6287K7572J947j5519l9417L464j263J69J0726J1049
10146A039k511j870n246J4209K0404Q472r267k6328k2384m662J095j3093k3939
10133f4081K0525K5118J3267k573J1979k0992q722J1150J2634J5150Q114j0495
10121A1074M0807K9429k4493j3012K443l3065j0178Q626j2561r629O571n714j9495
10108b9197k4805M4381K5858j203K5766r981Q649Q633k9138R708K942j6543r137
10095E933k2863j9414o180l2257L0177K5281J2805j6229j6087j8217N718K2717
10083b8616k119Q092K6123J3887j3362j7471p62n673o37q311J8846j7065r354
10070c6422M5895K9853k2889q991j3455o562K1384J1357o916R509r20k5831J605
$$ y = [31751, 17905, 11028, 18598, 2311, 29883, 31830, 16311, -23106, -19642, -20905, -20736, -10010, 1039, -1472, -3342, -8588, 5621, 26025, 34497, 25230, -1098, -23482, -28144, -27049, -40142, -64081, -43556, -18438, -5171, -7744, 4235, -16757, -25479, -14329, -1695, 13455, 21569, 11074, 51881, 81310, 56817, 43805, 46248, 13183, 3005, 11631, -930, -10559, -3988, -9702, -29197, -54002, -9621, 16237, 15034, 40800, 30819, 39468, 48101, 18963, 28671, 31613, 15070, 5933, -16930, -36344, -42524, -74781, -44604, -19323, -6518, -22747, -38834, -57051, -51333, -28616, -30735, -22643, 3480, 17367, 4005, -13466, -14228, -19901, -20538, -28849, -10003, -27068, -36422, 9473, 39326, 16437, 7446, -6009, -12571, 8813, 20170, 13254, 22763, 21843, -3988, -2383]
10057b383J826P949P075l415J3975m288R806k2190O373K9910K601k278l9588P481
10043A2854L9857n619j7892m1570k2200p889j7267J2287M0879J995q558J8728
10031E605N36J0931K8819k4075k7380J3560m187k8727J2732K6868Q518j2127l6171
10018b5098q8R913K9648K8807j6461k6481q693K4783L0821K7822J1030K1754J1249
10005A19006p39K2694M8758O9951J19152J97377J85684J32693R7092k666j20641
9994H68361j67005j85389j25249p4769q3340m8328k2659j3232k5022j5771J0666
9983A18263K6398n418k1823k3397r972k1967k5832p532J5462Q330L423J058J1512
9970F8505N179j7578k4738j6371k5935l540J1036Q737n710n872n447j6966q908
$$ y = [-2383, -557, 7392, 14467, 11052, 25027, 20739, 30545, 8355, 14728, 44638, 47239, 44961, 5373, 12854, 52711, 47092, 29200, -12370, -34570, -42459, -59726, -47439, -6560, -4565, -13123, 5605, 6141, 17072, 45891, 21816, -5564, 7996, 3809, -24918, -12186, 14682, 23200, 11073, -25098, -25186, -15273, 14375, 43182, 26721, 240, -8453, 16330, 47151, 74973, 86003, 107757, 119006, 118267, 140961, 189719, 259670, 378822, 576199, 761883, 894576, 991668, 989002, 868361, 701356, 515967, 390718, 315949, 232609, 184281, 161622, 148390, 123368, 107597, 118263, 144661, 139243, 117420, 94023, 84051, 62084, 36252, 28720, 44182, 52512, 55935, 56993, 68505, 73684, 56106, 31368, 14997, -10938, -14478, -3442, 5295, -415, -6287, -11734, -28700, -37608]
9957c7608j863K1749N829J8325K9151L361L009j1498p232l0804l789R421j5867
9944a7816K7524K3075P990J6596k9992l7673O103r808L7309L338j0871j8467r561
9931a2253M032p273r778P507R860Q420K9530o249L14k2681j8223L851Q32m394
9917a6505J2168M1865K1224j1060p679j304K2344L831J4247l0676k6499j3573
9905H383j8332p004K2692K2754j3362j3781R261j5532o193k0527K3261J49j8482
9892b6713n590M2270N306m5905J454J6369J8102l683J4159k8006l1299Q833K2232
9879a2471J2204K8388Q731p856n8k6673m61j6K1078k328l485K494j8653Q14j6917
9864a5209j4010m823J6829K6630r19R880j648j5163J0421l93K626j8189k6238
$$ y = [-37608, -39471, -17722, -11893, 6432, 35583, 38944, 41953, 30455, 23223, -7581, -11370, -1949, -17816, 9708, 32783, 40773, 57369, 27377, -10296, -4193, -14001, 23308, 26646, 15775, -2692, -12253, -8221, -15494, -25272, -17765, -7905, 515, 30045, 23796, 24110, 1429, -16794, -12943, -12111, -16505, -4337, 37528, 58752, 47692, 40013, 38709, 61053, 64884, 79131, 48455, 21956, 8383, -9949, -16953, 5739, 28493, 15131, 1350, 10611, -4921, -11114, -31641, -8380, -8231, -26713, -32303, 9967, 15273, -30632, -29178, -12809, 5293, 1610, 15769, -12237, -43536, -34703, -12471, -267, 28121, 36852, 28996, 28938, 2265, 1804, 1788, 22866, 20538, 17053, 19547, 894, 1708, -15209, -29219, -34042, -17213, 9417, 8498, 18378, 16730, 1567, 11988, 11595, 14221, -3968, -30206]
9851c0206m865K3470n24k3689q066J1433Q236L729J4921l478J4013l992K2266
9838B3248J5916p841n2281j5110N1808K7963R373L7861j3794j3765r540l0154
9826B3684j2195M90j6986J4121l5j6414k7972J2304K7846j1970O424J7172l1037
9813a4568r30K7690N096n738M6964l883j6394j9019k0204j340L73k6153J605M606
9799b1895L389N306q49J3016L2293j5844p664k582J934p032j2278k1879R304K6408
9785A627J3922P211p164k701k8446o316j1015q764J2877J6957K2553J0145L918
9772B4804L729k7478j2367P224J8645K267l5613m4430k9596j4213L7864M8032
9760b1132R748J0053K76j4364k5980k4171J8186J8302N439q483K3532j4919j8440
$$ y = [-30206, -35071, -11601, -12125, -35814, -43880, -32447, -24211, -20482, -5561, -9039, 4974, 982, 23248, 39164, 31323, -20958, -36068, 15740, 43703, 53076, 90937, 77143, 63378, 53838, 23684, 11489, 11979, -5007, 9114, 9079, -7335, -35307, -23003, 4843, -7127, -703, 16469, -14568, -15498, 12192, 17288, 11550, 58514, 54631, 38237, 19218, -986, -2326, -1953, -28106, -26501, -21895, -18506, -13200, -14049, -1033, 31260, 15416, 7752, 5170, 7104, 72, -12206, -34085, -24781, 1627, 15549, 22760, 15596, 12895, -15551, -21867, -32882, -41646, -28769, -11812, 10741, 20886, 24804, 28533, 1055, -11312, -4088, 14557, 16824, -18789, -63219, -92815, -107028, -69164, -21132, -11384, -1331, -1055, -15419, -41399, -65570, -47384, -29082, -23643, -32126, -8594, -23513, -41953]
9747d1953r634K1132L1586J4469j5875K318n467l9173J5984K5512J0769j6507
9735f839k5760l1639p386N1390L8085q549j3684n154j0850j7861J4616J2970K1431
9722A0770l444Q429L186j5192J6082J8834k685j0040l4867O484J4126j938Q205
9709A7950j0676l7114J9538j2475l2890K369R2J0545K1820Q844p245l105J0468
9696a1879l821j9819j8932L1178L4080j2359m0127K067J7478K8093k3249k773
9684b0063O509j886M783L2760L024m1239K529R320r803j7248j8119J5604N259
9671b8570J9986J6615J7218k2856j9592J089O5L783J2598R314J8966J8559N864
9658E3039k8285k5957L998j8355o287J327k076m1102K5424K1850n965K6480R042
$$ y = [-41953, -51587, -30455, 1131, 15600, -275, 2043, -3424, -42597, -26613, -1101, 9668, -6839, -32599, -64238, -71624, -20234, 17851, 9302, -4382, -9536, -20386, -38247, -23631, -10661, 10770, 7326, 15755, 18941, 3749, 19831, 38665, 35980, 25940, -8927, -2443, 11683, 9745, 17950, 7274, -29840, -10302, -22777, -55667, -53298, -53206, -42661, -20841, -11997, -19242, -22347, -11879, -15700, -35519, -54451, -23273, 10807, -1552, -41679, -39612, -22134, 5959, -17290, -20063, -13554, -15440, -10657, 22103, 25127, -16112, -13583, -4263, -14066, -31314, -49433, -33829, -28570, -8584, 8031, 25249, 2393, -17199, -16110, -16045, -12262, 336, 9650, 28616, 47175, 53039, 24754, -1203, 2795, -15560, -21847, -20520, -22596, -63698, -38274, -16424, -22389, 4091, 13133]
9645A3133j6080J6169j5885L1365P107k8046l6475j0302K0221j165J7485Q283
9633E810l863j6989J8846q333k0010L5740J7895l1863N485J7399J8416m1250j9196
9620b1913J1205K7026K1990J2273R051N613K264j6177k729l403l2614J6466L120
9607C2172l2313m428O195j2541n679k662J1388J7700r61m63l8650m6365J2063
9594f4544N5003O237n11L878J4729j1444K253l469q578N303K118j6631P34m549
9580a9471M387Q125n653J6977M932j7708j9965J6739J6851j5674M252K0489R821
9567B4102Q5Q266k6667l75j8340m0267k1548J0334J7809L149J753J4195Q239j4759
9553c4024K4754K9346l1482k0605J5321J9020N787k1967m262l1063N436K0952
$$ y = [13133, -2947, 13222, -2663, 28702, 35809, 7763, -28712, -39014, -18793, -19958, -2473, 5810, 1947, -15042, 3804, -4529, -24539, 11201, 29096, -2767, 2718, 20117, 38533, -2717, -21913, -10708, 16318, 38308, 50581, 59632, 65245, 67509, 51332, 48603, 45200, 12586, 29052, 32172, -141, -4569, 1626, -10915, -16594, -19256, -7868, 9832, 8871, 8408, -30242, -76607, -64544, -9541, -3304, -3815, 63, 14792, 3348, 5601, 2132, -6446, -1143, 975, -15656, -14922, -19471, -15084, -6959, -12612, 4365, 9297, -8411, -28376, -11637, 5214, -10460, -6208, 14281, 24102, 24187, 32453, 5786, 5411, -12929, -53196, -74744, -64410, -46601, -43452, -41699, -27504, -19265, -34024, -9270, 20076, -11406, -32011, -16690, 2330, 8117, -13850, -18112, -49175, -43739, -22787]
9541b2787m47r402L1014q847k0400L917j2311K5797K3550O832J0193J8234j2054
9528C3289o326K227r575r478n897j0471M060l553j2614m518P489j0771j2151J0503
9514b7786N439K7497k857L8292N983p642k9762L3076J6512l2277k9065O280P878
9501A1568j3383m209J1123k2518q944j2015j5049Q903K3750k49j9131j5359j355
9488e6868k0628L584L0528K7689M1924N368k5686j0785R112J7136K0864m00l1298
9475A0540j0378K1616n3j5997k5449K2479%N753R509j0969n668l2542P093R189
9461a4877r508l48J0536N249L1586K3588j042j5295k2880J272j3722j6535L0779
9448H803N2647J6178l5158O622k241k9825l9184K3117J1299K755r368K6926j0523
$$ y = [-22787, -23234, -32636, -1622, -10469, -30869, -26952, -39263, -13466, 10084, 16916, 27109, 45343, 33289, 26963, 29190, 19615, 10137, 4240, -6231, -2171, -5724, -18338, -22856, -15367, -26138, -38289, -27786, -22347, 5150, 2293, 40585, 46568, 38926, 9164, 42240, 58752, 26475, -2590, 3690, 11568, -1815, -6024, 5099, -17419, -26363, -38378, -53427, -44524, -20774, -21023, -40154, -55513, -56868, -77496, -73912, -43384, -15695, 26229, 31597, 5911, -4874, 4238, 21374, 42238, 41838, 10540, 162, 21778, 21725, 5728, -19721, 2758, 2758, 8511, 18020, 7051, 1383, -31159, -24066, -14877, -24385, -24733, -14197, -8948, 22638, 46226, 45184, 29889, 7009, 8281, -5441, -21976, 8803, 61450, 77628, 42470, 49092, 46851, 17026, -22158, 959, 12258, 15013, 5645, 32571, 22048]
9435B2048l0017j4038m506L730J2204L6365n591j5442k942j1295j1548J4623j3630
9422b0039j3181L2912J3201Q860k4132j815o854N784M853n82j91J1235p429l0786
9408b8164j3604l396J6543L8668K8843J1422j2777n8244m0404K4898L8965l3p484
9395d767R519p06J7512R693L944j6727Q227k50m1391l103K6994j7923r985j3735
9381c2698o179J172j2555K2186J7366K4027J1684k6105J086r089J2718K5116m499
9368B4230k7276o575J281n852K8415L369J3130j0086p081q179R835l5152o146
9355b6087K1597j3012N921N01r530L7161Q694k4202J4229j2460k5822J9260L2859
9342B9109p485L622P847j5301k0229j7664k9176J0868L5303J2293r848K0137P437
$$ y = [22048, -7969, -22007, -26513, -22783, -10579, 25786, 20195, 4753, 1811, -9484, -21032, -6409, -20039, -33220, -308, 12893, 21753, -2379, -4194, -11048, -5264, -411, -993, -1184, 10051, 2622, -28164, -41768, -45164, -28621, 10047, 38890, 50312, 37535, -20709, -61113, -36215, 2750, 2717, -4767, 4752, 4046, 21558, 31251, 35195, 18468, 26695, 26445, -14946, -18049, 8945, -8978, -18963, -32698, -38877, -37705, -50260, -28074, -10708, 13319, 25003, -1102, -16, -9105, 3613, 28729, 24230, -3046, -9621, -8340, -14192, 14223, 17592, 30722, 20636, 13555, 5376, 15211, -19941, -26087, -4490, -17502, -11581, -11080, -20610, 16551, 25245, 1043, 15272, 2812, -23010, -3750, 29109, 21624, 25246, 33093, 17792, -2437, -20101, -49277, -38409, -3106, 9187, -661, 19476, 26913]
9329B6913p641K8671R087j4586m6308k4300K1887K4531K0896k497j867o334r816
9316A8636o339j5781o826J6853P463Q422l8020o732r172J5894k0091J4767K2621
9303A695J7795j8020J2897J1776R173l3302j2017p186K2633L3458n913j8523J4786
9290B9252K1627m1111l7480J1508K9323J2685P700O995j9669k2803J1903K8838
9278C8768K1003j205j8312o403O017j4499O11M378k9943k2226K4405J4088R897
9265B6579l186k0385j626J0427J4481L5939j1724K91R740n0286l0366K5890J6922
9252B2696n929O743j5742l6359r865L7313M035O553O897J5649j359l225Q044K608
9238C8059n260K1668q634p169k0995L3581M606j3369p147J356K6840J3136l5598
$$ y = [26913, 19272, 47943, 57030, 42444, -3864, -28164, -6277, 18254, 39150, 36653, 34786, 28452, 18636, 12297, -3484, -10310, 6543, 14006, 22428, -15592, -22324, -31496, -15602, -35693, -20926, 1695, 19490, 1470, 14367, 26143, 35316, 2014, -10003, -17189, 5444, 38902, 32989, 14466, 29252, 50879, 9768, -27712, -16204, 13119, 25804, 33504, 40499, 20830, -1973, 9930, 38768, 59771, 58566, 40254, 33851, 39868, 25369, 25980, 30358, 415, -21811, 2594, 16682, 26579, 23393, 3008, 1382, 11809, 26290, 62229, 50505, 50796, 60536, 10250, -20116, 5774, 22696, 16767, 23510, 7768, -28591, -38456, -1143, 2892, 9445, 16342, 31991, 30632, 27407, 35451, 38059, 32799, 54467, 45833, 38664, 17669, 51250, 55856, 42487, 35340, 36696, 63536, 76672, 41074]
9225D1074k0314Q31p661p193L1992L2674n201j3450l7151k1114L622n290J1647
9212D466J4438J4557J070L041Q830p49j3505j3879J572l0521j188p285J7971Q768
9198G586l3478k1628K4388L1682K966p726k0215J1060O039K3931R361K8565K107
9185F4638j8244j7696R284L6289K0024k0647m2266P138j2005k8385N465j291o5
9172B239K1438j2080J6918J2760Q610J5800k158N56j148J282J0444o074k31k5302
9158D3054l4824J0815J8586l773k0886K32J5942L2955J9768j2017k1304m6309
9146B239m213K8425K7097K0205L115R316r420n1205N601L7487j6779K1920J9401
9133I3189j2481K8252J5161Q38l7007J427L3872l050o450j2230j596J5813K2942
$$ y = [41074, 20760, 21591, 13930, 6737, 38729, 71403, 66202, 52752, 15601, -5513, -1891, -7181, 4466, 18904, 33461, 34531, 37572, 46402, 45653, 32148, 18269, 19841, -10680, -11868, -19153, -1182, 7586, -25892, -47520, -23132, 8550, 11516, 3790, -16425, -5365, 674, 24605, 33966, 62531, 64638, 46394, 28698, 37982, 74271, 94295, 73648, 31382, 38520, 26515, -1870, 3595, 2304, 2239, 23677, 11597, 28515, 41275, 49885, 65685, 63527, 64083, 62935, 64217, 74661, 68587, 68356, 43054, 8230, 19045, 37631, 33858, 12972, 13204, 29146, 62101, 81869, 69852, 48548, 2239, -1974, 26451, 53548, 73753, 76868, 86184, 76764, 25559, 31160, 68647, 51868, 73788, 93189, 80708, 108960, 124121, 124959, 87952, 89379, 123251, 120201, 113751, 101521, 99925, 115738, 138680]
9120A38680M989L473K2207j9971N628K4363L2910K9943N070l0728j5456K9118
9108B30226K8246P330l701j0617J9554M1235K991K6655N9867N1147M1215P5339
9096E69487P3680R2852J05013J46304J29170J44057J82154L16642M24213N51241
9086B734813P18395R83663J339662J561669J505451J131363N47386j50029q34257
9077I538116j347481j445147j234075r72829p66327n43146m04727l22451k49923
9068B252010k24569j59170j28213r1441j27243j00941n5852n3329n8603r0773
9058A161876o5138n7984k9288k1410p1282n6838k3174o4010k8082q434p442l1995
9046F96799n1881n2788N232m606l604k7939k7812j8420k0641l3122l8528j5692
$$ y = [138680, 143669, 147142, 169349, 149378, 155006, 179369, 212279, 242222, 247292, 216564, 201108, 230226, 258472, 265802, 262101, 251484, 271038, 312273, 315264, 341919, 401786, 452933, 494148, 569487, 643167, 736019, 841032, 987336, 1116506, 1260563, 1442717, 1759359, 2183572, 2734813, 3453208, 4436871, 5776533, 7338202, 8843653, 9975016, 10522402, 10372373, 9538116, 8190635, 6745488, 5511413, 4538584, 3772257, 3229111, 2824384, 2501933, 2252010, 2027441, 1868271, 1740058, 1648617, 1521374, 1420433, 1364581, 1311252, 1252649, 1161876, 1096738, 1038754, 1009466, 988056, 916774, 859936, 836762, 772752, 744670, 736236, 728794, 696799, 644918, 592130, 597362, 592756, 589152, 561213, 533401, 514981, 494340, 461218, 422690, 406998]
9034D06998J337N421k7322k0720r914K7124j2206k2595J6932P748m1632q157r220
9021C13794j9564m0194k745n843j2388M182p237J3160K440P559J639j4800j2075
9008B27928Q683p588k8655K1778J4237J6435J546j1660m4362n547Q523m945j3539
8995A82834k0411j9345j5459K589k408l0084m269J7370q800j3790p27j3690j4563
8982E9247q566P379J9752J3198J334q541L911k3069N667j1202k5288J1719k576
8969D2965n83j4353K7816K376j4731j3218N420N750L711K9816k1774j8143M728
8956C9780J1139J1208M167j4341m854J2485r296l3960J64R997j4529J6319q993
8943A9286n7900j5372J668L0693K107M2309J5317p77l0535k7669P54J2260o276
$$ y = [406998, 408335, 413756, 386434, 365714, 355800, 382924, 370718, 348123, 365055, 372803, 331171, 323014, 313794, 294230, 254036, 251291, 245448, 233060, 237242, 230005, 243165, 245605, 253164, 254803, 240003, 227928, 236611, 229023, 200368, 222146, 236383, 252818, 254364, 242704, 198342, 192795, 201318, 196373, 182834, 162423, 143078, 127619, 130208, 127800, 97716, 93447, 110817, 102017, 88227, 87500, 73810, 59247, 50681, 58060, 77812, 91010, 92344, 83803, 87714, 64645, 70312, 59110, 33822, 45541, 42965, 42382, 28029, 55845, 58221, 43490, 30272, 35692, 41442, 45153, 74969, 53195, 35052, 39780, 50919, 62127, 66294, 51953, 47099, 59584, 50288, 16328, 16492, 26489, 11960, 28279, 19286, -38614, -53986, -52318, -21625, -19518, 22791, 38108, 37331, 6796, -20873, -20119, -7859, -14135]
8930a4135L128Q957p291J906K3672J9575L747k4787j247k4945j5924K9206J8535
8917B0397j757m1460l1852K3760K248k7531r636J8419N9109N279J52q715p148
8904A265J9884j206r826K2724J7998j8033j7970K4040J2634j6143o938p166m818
8891A6445l6501j3026J8891p856J2800K9104j1860p386p837K0137J5531k6786
8879A656N177j098J3246J8784k7917l8307J4357K5930k163q731l214n500m1029
8866d8809n12L7148L1275J8504j9931j8199k3262J0469J0038J6295K3488j2693
8854B3811k8193P770j6003j9302n190M1399j667M278K0567J5440J4082k2410L833
8841C8415j7666J3084K3671J22k763l6100O540J0697j0771L404M39m433q663j3207
$$ y = [-14135, -11007, -2050, -9341, -7435, 16237, 35812, 39559, 14772, 13525, -11420, -27344, 1862, 20397, 18640, -22820, -54672, -30912, -28664, -56195, -65831, -47412, 11697, 16976, 17128, 8413, 1265, 21149, 19943, 10117, 32841, 50839, 32806, 14836, 38876, 51510, 35367, 28429, 21263, 16445, -20056, -33082, -14191, -22047, -9247, 19857, 7997, 611, -7226, 12911, 28442, 1656, 6833, 5735, 18981, 37765, 9848, -28459, -14102, 11828, 9665, 934, -2280, -7780, -48809, -49321, -12173, 19102, 37606, 17675, -524, -23786, -13317, -3279, 13016, 36504, 23811, -4382, 3388, -12615, -31917, -37107, 4292, 2625, 6903, 27470, 42910, 56992, 34582, 38415, 20749, 33833, 57504, 57626, 54863, 18763, 25303, 36000, 25229, 28633, 29072, 24639, 15976, 2769]
8827B769K406K8155k2295j1378l313J3132R576M891j7236k4416o060J1814J4320
8814B365j25o196K482K914j1374M836j4437J0588L3608J923k1453J438K4348n350
8800B5567J633J3965n223l3561j7735R204k3230R639L3140Q769l152j4021K552
8787G547K0990k024j8909n183p925L9366K2809J614j4658l9033l455N866o251
8774G54m567R299J5487Q532l2537J2320K3710J5412k9416l9839J4928J9130L827
8761A7040J5215m562j1574J4588l172n1086j2699K9103k2320o590O520J7786K0614
8748H863K1081L7060R172j7536k6014j1327l1425j8504J4263j2387j6397j3753
8736e6904K354J4177K4375l13J9029N909j3194J9451Q510K7009l521m6009j4911
$$ y = [2769, 5175, 33330, 11035, -343, -3656, 9476, 19052, 23943, 6707, -17709, -23769, -11955, 2365, 2240, -3956, -1474, 1440, -9934, -5098, -19535, -8947, 24661, 26584, 5131, 6569, 30917, 25567, 27200, 41165, 35942, 2381, -15354, -6150, -29380, -19741, 13399, 22168, 19016, 4995, 7547, 28537, 26513, 7604, 2421, -5504, 33862, 56671, 58285, 43627, 4594, 1139, 7005, 754, -3813, 5486, 20973, 29505, -3032, 9288, 32998, 48410, 18994, -20845, -5917, 13213, 17040, 32255, 27693, 16119, 30707, 27535, -23551, -36250, -7147, -29467, -36057, -29537, -11751, 8863, 29944, 67004, 76176, 58640, 32626, 21299, -10126, -28630, -14367, -26754, -43151, -56904, -54550, -40373, -15998, -16311, 2718, 8627, -4567, 14884, 23394, 50403, 46882, 873, -14038]
8723a4038J9414K6431K0541J7904K908p499Q513j1151k4471j7175j9150K118q265
8710c920R01n180j744J3596p754l954K5764M590J7666P915j1579J193p568k7463
8696B463O906L2849l3377l1451n116k7338R071N104J7933R199L5042J6865k0313
8683A7837j2490p741M23J5439n195n877J0171O48j80j2315K9426L6605J2690j3487
$$ y = [-14038, 5376, 31807, 52348, 70252, 73160, 65661, 74174, 63023, 38552, 21377, 2227, 4345, -3920, -3019, -8199, -9943, 3653, -4101, -8055, 17709, 22299, 39965, 47880, 36301, 37494, 29926, 2463, 9369, 42218, 8841, -22610, -27726, -55064, -45993, -40889, -22956, -13757, 21285, 38150, 17837, 5347, -2394, -1971, 13468, 8273, 2396, 12567, 13215, 13035, 720, 30146, 66751, 79441, 65954]
$$ [...]
##END NTUPLES=NMR SPECTRUM
##END=
