##TITLE=Analysis number 318992
Compound Code mo 07857
Book Reference 489/6
Project Code adrs
Chemist Name alim
##JCAMPDX= 6.0         $$ Bruker NMR JCAMP-DX V2.0
##DATA TYPE= NMR SPECTRUM
##DATA CLASS= NTUPLES
##ORIGIN= Bruker BioSpin GmbH
##OWNER= nmr
$$ XWIN-NMR		Version 3.5
$$ Wed Apr 26 12:34:11 2006 GMT Daylight Time (UT+1h)  MAYBRIDGE\nmr@NMR_250MHZ
##.OBSERVE FREQUENCY= 250.131544655141
##.OBSERVE NUCLEUS= ^1H
##.ACQUISITION MODE= SIMULTANEOUS (DQD)
##.ACQUISITION SCHEME= undefined
##.AVERAGES= 16
##.DIGITISER RES= 18
##SPECTROMETER/DATA SYSTEM= dpx250
##.PULSE SEQUENCE= zg30
##.SOLVENT NAME= DMSO
##.SHIFT REFERENCE= (INTERNAL, DMSO, 0, 16.522)
##AUDIT TRAIL= $$ (NUMBER, WHEN, WHO, WHERE, WHAT)
$$ ##TITLE= Audit trail, XWIN-NMR		Version 3.5
$$ ##JCAMPDX= 5.01
$$ ##ORIGIN= Bruker BioSpin GmbH
$$ ##OWNER= nmr
$$ C:\u/data/dgb/nmr/ADRS/3240/pdata/1/auditp.txt
$$ ##AUDIT TRAIL=  $$ (NUMBER, WHEN, WHO, WHERE, WHAT)
(   1,<2006-04-26 12:33:45.44 +100>,<MAYBRIDGE\nmr>,<NMR_250MHZ>,
      <created by zg, POWCHK disabled, PULCHK disabled
       configuration hash MD5:
       84 BC 41 DB A1 6E 1D 46 DA 25 12 A5 C1 ED C5 3A
       data hash MD5: 64K
       0A 0B 59 DE 7B 04 43 25 7A 7A C5 FD F6 FB 1E 9C>)
(   2,<2006-04-26 12:33:59.90 +100>,<MAYBRIDGE\nmr>,<NMR_250MHZ>,
      <Start of raw data processing
       ef LB = 0.3 FT_mod = 6 PKNL = 1 SI = 32K 
       data hash MD5: 32K
       C7 D5 06 5B 9A F5 4C D0 73 99 C7 89 6F 76 25 00>)
(   3,<2006-04-26 12:34:03.46 +100>,<MAYBRIDGE\nmr>,<NMR_250MHZ>,
      <apk 
       data hash MD5: 32K
       D4 C2 13 92 06 9D CC A0 ED F9 0A D2 0C FE 4F 76>)
(   4,<2006-04-26 12:34:04.46 +100>,<MAYBRIDGE\nmr>,<NMR_250MHZ>,
      <abs ABSG = 5 
       data hash MD5: 32K
       8C 80 EC 4F 0B A4 7A A3 E9 FC 33 86 01 74 72 63>)
$$ ##END=
$$ 
$$ hash MD5
$$ 0E 34 CD CE 52 92 6D 14 89 D9 19 40 E1 C2 D4 37
##$RELAX= 
##$RELAX= 
##$RELAX= 
##$RELAX= 
##$RELAX= 
##$RELAX= 
##$RELAX= 
$$ Bruker specific parameters
$$ --------------------------
##$DU= <C:\u>
##$EXPNO= 3240
##$NAME= <ADRS>
##$PROCNO= 1
##$TYPE= <nmr>
##$USER= <dgb>
##$AMP= (0..31)
100 100 100 100 100 100 100 100 100 100 100 100 100 100 100 100 100 100 
100 100 100 100 100 100 100 100 100 100 100 100 100 100 
##$AQSEQ= 0
##$AQ_mod= 3
##$AUNM= <au_zg>
##$AUTOPOS= <26 >
##$BF1= 250.13
##$BF2= 250.13
##$BF3= 250.13
##$BF4= 250.13
##$BF5= 500.13
##$BF6= 500.13
##$BF7= 500.13
##$BF8= 500.13
##$BYTORDA= 1
##$CFDGTYP= 0
##$CFRGTYP= 5
##$CHEMSTR= <none>
##$CNST= (0..31)
1 1 145 1 1 1 1 1 1 1 1 1 1 1 1 1 1 1 1 1 1 1 1 1 1 1 1 1 1 1 1 1 
##$CPDPRG= <>
##$CPDPRG1= <>
##$CPDPRG2= <>
##$CPDPRG3= <>
##$CPDPRG4= <mlev>
##$CPDPRG5= <mlev>
##$CPDPRG6= <mlev>
##$CPDPRG7= <mlev>
##$CPDPRG8= <mlev>
##$CPDPRGB= <>
##$CPDPRGT= <>
##$D= (0..31)
0 1 0 0 0 0 0 0 0 0.06 0 0 0 0 0 0 0.0002 0 0 0 0 0 0 0 0 0 0 0 0 0 0 
0 
##$DATE= 1146051224
##$DBL= (0..7)
120 120 120 120 120 120 120 120 
##$DBP= (0..7)
150 150 150 150 150 150 150 150 
##$DBP07= 0
##$DBPNAM0= <>
##$DBPNAM1= <>
$$ [...]
##$SUBNAM7= <"">
##$SUBNAM8= <"">
##$SUBNAM9= <"">
##$SW= 20.6930455092707
##$SWIBOX= (0..15)
0 0 3 0 0 0 0 0 0 0 0 0 0 0 0 0 
##$SW_h= 5175.983436853
##$TD= 65536
##$TD0= 1
##$TE= 295.16
##$TE2= 300
##$TE3= 300
##$TEG= 300
##$TL= (0..7)
0 120 120 120 120 120 120 120 
##$TP= (0..7)
150 150 150 150 150 150 150 150 
##$TP07= 0
##$TPNAME0= <>
##$TPNAME1= <>
##$TPNAME2= <>
##$TPNAME3= <>
##$TPNAME4= <>
##$TPNAME5= <>
##$TPNAME6= <>
##$TPNAME7= <>
##$TPOAL= (0..7)
0.5 0.5 0.5 0.5 0.5 0.5 0.5 0.5 
##$TPOFFS= (0..7)
0 0 0 0 0 0 0 0 
##$TUNHIN= 0
##$TUNHOUT= 0
##$TUNXOUT= 0
##$USERA1= <user>
##$USERA2= <user>
##$USERA3= <user>
##$USERA4= <user>
##$USERA5= <user>
##$V9= 5
##$VALIST= <valist>
##$VCLIST= <CCCCCCCCCCCCCCC>
##$VD= 0
##$VDLIST= <DDDDDDDDDDDDDDD>
##$VPLIST= <PPPPPPPPPPPPPPP>
##$VTLIST= <TTTTTTTTTTTTTTT>
##$WBST= 1024
##$WBSW= 4
##$XGAIN= (0..3)
0 0 0 0 
##$XL= 0
##$YL= 0
##$YMAX_a= 410739
##$YMIN_a= -293694
##$ZGOPTNS= <>
##$ZL1= 120
##$ZL2= 120
##$ZL3= 120
##$ZL4= 120
##$ABSF1= 16.522
##$ABSF2= -4.171173
##$ABSG= 5
##$ABSL= 3
##$ALPHA= 0
##$AQORDER= 0
##$ASSFAC= 0
##$ASSFACI= 0
##$ASSFACX= 0
##$ASSWID= 0
##$AUNMP= <proc_1d>
##$AZFE= 0.1
##$AZFW= 0.1
##$BCFW= 0
##$BC_mod= 0
##$BYTORDP= 0
##$COROFFS= 0
##$CY= 12.5
##$DATMOD= 1
##$DC= 0
##$DFILT= <>
##$DTYPP= 0
##$F1P= 14.0000005364418
##$F2P= -0.99999901652339
##$FCOR= 0.5
##$FTSIZE= 32768
##$FT_mod= 6
##$GAMMA= 0
##$GB= 0
##$INTBC= 1
##$INTSCL= 1
##$ISEN= 128
##$LB= 0.3
##$LEV0= 0
##$LPBIN= 0
##$MAXI= 10000
##$MC2= 0
##$MEAN= 0
##$ME_mod= 0
##$MI= 0
##$NCOEF= 0
##$NC_proc= -5
##$NLEV= 6
##$NOISF1= 0
##$NOISF2= 0
##$NSP= 0
##$NTH_PI= 0
##$NZP= 0
##$OFFSET= 16.522
##$PC= 1
##$PHC0= 119.2257
##$PHC1= 70.02644
##$PH_mod= 1
##$PKNL= yes
##$PPARMOD= 0
##$PSCAL= 4
##$PSIGN= 0
##$REVERSE= no
##$SF= 250.13
##$SI= 32768
##$SIGF1= 0
##$SIGF2= 0
##$SINO= 400
##$SIOLD= 32768
##$SREGLST= <1H.DMSO>
##$SSB= 0
##$STSI= 32768
##$STSR= 0
##$SW_p= 5175.98343685301
##$SYMM= 0
##$S_DEV= 0
##$TDeff= 65536
##$TDoff= 0
##$TI= <Analysis number 999999
Compound Code 99
Book Reference 9
Project Code 9>
##$TILT= no
##$TM1= 0
##$TM2= 0
##$TOPLEV= 0
##$USERP1= <user>
##$USERP2= <user>
##$USERP3= <user>
##$USERP4= <user>
##$USERP5= <user>
##$WDW= 1
##$XDIM= 32768
##$YMAX_p= 419424905
##$YMIN_p= -1108554
$$ End of Bruker specific parameters
$$ ---------------------------------
##NTUPLES= NMR SPECTRUM
##VAR_NAME=  FREQUENCY,     SPECTRUM/REAL,   SPECTRUM/IMAG
##SYMBOL=    X,             R,               I
##VAR_TYPE=  INDEPENDENT,   DEPENDENT,       DEPENDENT
##VAR_FORM=  AFFN,          ASDF,            ASDF
##VAR_DIM=   32768,         32768,           32768
##UNITS=     HZ,            ARBITRARY UNITS, ARBITRARY UNITS
##FACTOR=    0.157963299565203, 1,           1
##FIRST=     4132.6476996994, 0,             0
##LAST=      -1043.33573715361, 0,           0
##MIN=       -1043.33573715361, -1108554,    0
##MAX=       4132.6476996994, 419424905,     0
$$ Real data points
##PAGE= N=1
##DATA TABLE= (X++(R..R)), XYDATA
$$ [...]
19399 -23168 -6480 -196476 -322701 -525586 -343868 -268375 -156982 -74599 -210073 -297675
19389 -297675 -496826 -540637 -537482 -598755 -492469 -574044 -715935 -735852 -516009 -317573 -437629
19378 -437629 -532447 -458581 -270603 -297270 -345858 -417915 -387069 -370059 -263437 -440028 -335126
19367 -335126 -179320 -103552 -347725 -554556 -535539 -351227 -183910 -89897 -239081 -508885
19357 -508885 -135830 3456 133534 226255 54746 181585 119131 -155181 -603681 -570959
19347 -570959 -207583 -60459 -193059 -109157 114663 168484 216338 477245 34501 -191699
19337 -191699 -256483 -59050 -181509 -138419 -109453 -345179 -369128 -332497 -237477 -140490 -294776
19326 -294776 -409886 -353072 -526612 -517570 -316917 -163841 -136202 -44580 20714 -163083 -42310
19315 -42310 145496 73628 162964 15374 8335 62475 57825 -186196 -293629 -496874 -392171
19304 -392171 112989 256094 140462 53641 51846 -116906 -130826 68662 193670 142308
19294 142308 186547 170319 81859 -74966 -103410 26925 17376 167086 -19363 30683 122559
19283 122559 211993 43578 71473 101323 -2337 171848 218415 15254 -88660 -148621
19273 -148621 -159417 -232052 -465119 -594212 -528548 -424332 -384138 -253471 -220947 -56358
19263 -56358 -291412 -369923 -169006 -149044 -253547 -450637 -515526 -203143 -206113 -484607 -503784
19252 -503784 -607431 -478917 -603252 -666975 -401606 -364601 -274966 -70554 150775 61330
19242 61330 -16674 -250768 -285088 -239564 -360128 -366925 -92538 120257 152913 60767 -246936
19231 -246936 -447461 -303062 -178168 -321034 -308782 -276277 -224200 -22696 13726 161012
19221 161012 322254 283697 172914 184855 39333 39981 19694 -110798 -293754 -137990 -202927
19210 -202927 -260206 -179345 -52268 -25788 59076 -133000 -166855 -48039 -80067 -228385 -328362
19199 -328362 -423935 -239689 -90088 170569 240738 304365 -67582 -342466 -351603 -199943
19189 -199943 -151103 165746 125063 50046 -191255 -149563 -63592 -314363 -509417 -497316 -288027
19178 -288027 -71773 130705 -93217 -249270 -239313 -292280 -448367 -555234 -476889 -356990
19168 -356990 -164284 -252928 -230580 -117826 -128637 -79633 -122593 -355062 -600585 -589366 -716223
19157 -716223 -816045 -612561 -409976 -315961 -373365 -212285 -63539 -95582 12 -74177 -257094
19146 -257094 -152340 -122426 -95511 -310617 -462581 -263148 -177278 -198402 -468463 -616927
19136 -616927 -471537 -378546 -294014 -288290 -381111 -384539 -311858 -461919 -426512 -181335 -113611
19125 -113611 -195296 -467446 -517345 -608204 -603432 -457549 -216512 -45836 -232261 -357519
19115 -357519 -166549 -150511 -307621 -385040 -247197 -219980 -235678 -137915 -67931 -199165 -397726
19104 -397726 -413856 -367779 -190923 -259667 -227595 -372294 -415813 -322585 -348613 -256059 -355445
19093 -355445 -495685 -789962 -987331 -952541 -814273 -365496 -5782 -141502 -329943 -449815
19083 -449815 -648330 -676441 -662278 -630264 -465714 -358995 -443601 -700832 -588087 -416904
19073 -416904 -480767 -696040 -628687 -520590 -506466 -538881 -453560 -295546 -398157 -184885
19063 -184885 -70538 -51474 -254 214917 346740 126840 35461 -194950 -95204 -18730
19053 -18730 -26908 -5918 -124165 -233193 -147261 -333429 -490132 -506270 -373463 -156737 -114758
19042 -114758 15222 192422 144201 89336 220998 238129 185628 52684 -112900 -255479
19032 -255479 -276037 -200048 -361005 -417464 -284712 -183938 50605 170232 72031 -123632
19022 -123632 -82095 -35590 -178552 -484867 -541653 -537535 -494970 -463850 -503733 -699409 -646633
19011 -646633 -235871 -215306 -164381 -62634 -15196 -121291 -15452 -63114 -335927 -527097
19001 -527097 -603408 -557799 -527864 -408719 -390446 -443648 -444083 -486883 -289895 -170143 -191107
18990 -191107 -105299 -194031 -148435 -84322 -57740 -53987 1337 -58422 -64789 -152802 -210284 -34005
18978 -34005 55080 -41735 -84140 186203 126033 158957 113964 138368 187524 120522 -15397
18967 -15397 -275098 -486484 -413562 -228383 -239711 -110643 66204 133939 63314 14010 -243086
18956 -243086 -289490 -227559 -458600 -588362 -457655 -223827 -66834 -48873 -277648 -484850
18946 -484850 -212640 -308963 -609213 -463018 -201296 -330528 -558595 -509981 -308500 -188863
18936 -188863 -287362 -349508 -174052 -73357 -30707 -14022 -72542 -36339 -39698 239093 224566
18925 224566 136815 -52966 -93535 -107063 -296909 -300323 -252296 -247098 -433442 -405661 -15462
18914 -15462 120521 157216 312389 391212 417649 239902 253951 12031 11956 -16107 -247400
18903 -247400 -343910 -303636 -110275 -320857 -657573 -783292 -565780 -565512 -436346 -491201 -522978
18892 -522978 -506208 -280066 44314 -27519 17309 -52172 -140531 -105126 -119538 -151610 -291612
18881 -291612 -416652 -260512 -117883 -111214 -32972 -92064 -389743 -536978 -233337 -238672 -342792
18870 -342792 -385069 -422229 -349466 -353173 -269697 -254632 -216081 -208428 -322688 -218014 -112956
18859 -112956 2244 -155327 -202482 -166403 -174911 -234004 -453891 -344114 -378060 -408076 -426978
18848 -426978 -540018 -517263 -338746 -451171 -733466 -554341 -468635 -253014 34334 -46031
18838 -46031 -149146 -513982 -587181 -621767 -636038 -618081 -485996 -362378 -336586 -285884 -269560
18827 -269560 -251256 -150722 -277866 -415232 -591959 -565553 -662186 -688216 -248684 41982
18817 41982 58278 -271131 -568841 -421412 -284736 -190700 -90281 -320731 -282357 -95188
18807 -95188 -80548 52882 299060 212194 -128012 -278235 -323817 -338605 -225747 -235089 -221803
18796 -221803 -48946 -87518 -228944 -229442 -14837 -158153 -199271 -183769 -356194 -180375 -206315
18785 -206315 -291153 -57942 133323 5388 138223 489896 373727 272819 -11267 -33780
18775 -33780 -110420 -340910 -327617 -481157 -387041 -458823 -524684 -296556 -174094 -24920 -57436
18764 -57436 -107545 -24491 -110657 -127831 -104492 -91273 -158528 -72313 82536 70400 -283216
18753 -283216 -263190 -187550 -37835 -73544 -90483 -163221 -217133 -212191 -322065 -156092 50459
18742 50459 -161969 -195121 -207413 -296008 -483394 -360698 135935 149933 102634 -10847 -1058
18731 -1058 -41023 -76438 -128905 -45678 1021 -29079 -415590 -676945 -691691 -587525 -755905
18720 -755905 -586779 -449058 -487262 -408652 -296069 -247133 -494898 -830193 -854722 -507944
18710 -507944 -301836 -178609 66974 94208 -15140 -230804 -129282 12031 83654 22942
18700 22942 133453 67127 112471 8409 186402 270114 81004 -7385 -99311 -403825 -520184
18689 -520184 -557538 -577655 -670483 -507537 -531236 -463932 -494273 -664145 -481037 -442273 -563161
18678 -563161 -664657 -409352 -375650 -181489 -135621 -16601 -105300 -273856 -424444 -384769
18668 -384769 -243847 -314295 -392069 -383987 -465526 -364004 -282803 -41857 24592 15302 -34025
18657 -34025 -108913 -194848 -267699 -240057 -92318 174222 99464 -92567 -282775 -585303 -397861
18646 -397861 -558148 -813340 -960142 -897771 -496299 -160333 -53223 -36195 -128985 185976
18636 185976 204714 -121904 -227200 -297173 -330763 -330879 -215701 -45981 -8808 -39594 -107325
18625 -107325 -88915 -161983 -210733 -347297 -15235 178736 284539 288587 -59577 148527
18615 148527 48170 -117320 -184260 -350623 -317611 -258264 -341332 -319521 -283087 -410261 -163604
18604 -163604 160627 437536 356534 19324 -218005 -324469 -238234 -266271 -263066 -260516 -372479
18593 -372479 -439806 -422285 -551884 -711769 -659552 -401143 -253876 -331101 -241199 -130686
18583 -130686 -270750 -426828 -187148 165967 118621 -251535 -213158 -98662 137506 29469
18573 29469 -126006 -117079 -269204 -505444 -392387 -357078 -268029 -303270 -391700 -256485 -118197
18562 -118197 -4273 124101 234230 164192 -90369 -127009 -21034 8331 -56737 -209735
18552 -209735 -237162 -207734 -281578 -165019 -155696 -310641 -178987 114572 -119475 -350474
18542 -350474 -430747 -470069 -336984 -264509 -136858 -188857 -291843 -336204 -67738 -117618 -94274
18531 -94274 -122661 -80614 -219633 -78598 -72741 -92082 -316076 -432448 -248821 -418675 -505736
18520 -505736 -677975 -617357 -198392 -169301 -104373 -169584 -238148 -134362 -204264 -39025 251404
18509 251404 337817 401846 195623 -107807 -226116 -45208 949 -160533 -146861 -5430
18499 -5430 241123 50007 -16260 -127891 -254366 -321938 -344259 -456766 -392642 -473494 -381743
18488 -381743 -451292 -578316 -700819 -386537 -308055 -407964 -242250 -74725 36826 -215076
18478 -215076 -233257 -91205 -177435 -212539 -113854 -106074 -172426 -265146 -282544 -37713 58039
18467 58039 -75074 -224355 -459099 -549087 -600025 -504872 -550364 -414435 -224797 -273526 -418472
18456 -418472 -190674 -23166 -161297 -347645 48825 535108 285900 -142101 -97576 72104
18446 72104 58402 -248117 -143916 30750 184994 142766 -137354 -199414 -214611 20190
18436 20190 45030 -29654 -31919 -123554 -308454 -236671 -215511 -116536 -8957 -50453 -11722
18425 -11722 -19852 -206182 -269585 -148273 -47957 -301939 -485255 -590402 -522713 -456561 -424730
18414 -424730 -316864 -207842 -125149 -130969 -298840 -384420 -297961 -193986 42632 265035
18404 265035 308891 181860 315109 116613 32067 -30388 -111949 -85467 -304345 -507377
18394 -507377 -310294 -408730 -331371 -470923 -285332 -140167 98388 38627 31379 187186
18384 187186 153485 -270476 -513467 -480129 -486319 -452686 -378943 -398295 -544923 -746461 -835819
18373 -835819 -483296 -333749 -246499 -237845 -166090 -218274 -132228 562 -159061 -346290 -491127
18362 -491127 -671165 -423667 -153674 62377 -70602 -411081 -623869 -656697 -455802 -252850
18352 -252850 -364776 -453549 -202097 -31536 -321623 -366217 -369456 -277922 -111531 -129056 -158046
18341 -158046 -361298 -454253 -530110 -410470 -246218 -335218 -448544 -454418 -453130 -177329 -208958
18330 -208958 -83418 117094 21798 -99039 -243460 -464592 -425590 -222401 -49768 -81125
18320 -81125 -270365 -362843 -135589 22407 169458 -60285 -206308 -224937 -424471 -414854
18310 -414854 -185360 43014 162262 142875 137795 19613 75359 89311 348553 194365
18300 194365 203606 110876 119896 238844 298405 101471 115436 14816 69674 108771 -20569
18289 -20569 74492 -191985 -380842 -487486 -383195 -325349 -294958 -246495 -350463 -235770
18279 -235770 -130567 -372051 -330370 -327778 -258378 -8410 52028 44536 125681 161576 88052
18268 88052 344186 455328 436301 255792 -1729 -154085 36052 46199 43274 18013 299
18257 299 -110817 -321085 -345469 -345772 -268047 -114619 -95445 -383224 -602683 -415950 -201385
18246 -201385 -325670 -257710 -120063 131397 -9126 -209958 -205071 -123610 -204915 -76910
18236 -76910 49027 -16250 -166067 -317243 -173211 -122646 -294687 -297422 -305328 -263625 -109765
18225 -109765 26993 91651 127613 254514 287082 243469 217516 -36827 -292040 -357363 -396796
18214 -396796 -353156 -227019 -208260 -416333 -473792 -447800 -479838 -273095 -277862 -196610 -198788
18203 -198788 -584555 -434711 -374867 -329911 -149060 -21315 -62659 -51095 -247321 -57412
18193 -57412 -77439 -158496 -267263 -280591 -242119 -19114 -125061 -260001 -301555 -227688 -174378
18182 -174378 -258862 -417927 -398056 -375308 -311803 -152150 -106050 -226923 -201193 -102921 -82675
18171 -82675 -77281 42718 -170214 -525922 -469135 -358882 -388947 -239298 -215848 -255729 9680
18160 9680 107654 19085 179667 55896 -371101 -416828 -216837 6345 -82833 -166019 -260687
18149 -260687 -119070 -214468 -354127 -399896 -560612 -531359 -555405 -487017 -358372 -290579 -320722
18138 -320722 -264028 -361781 -280948 -216502 -228844 -653798 -575604 -474353 -576774 -599632 -477686
18127 -477686 -192851 -228086 -327718 -472684 -557330 -604699 -436537 -82306 -156159 -243224 -252312
18116 -252312 -226843 -438275 -568484 -200733 -317434 -375009 -489659 -635260 -833813 -1088021
18106 -1088021 -1056301 -793943 -430841 -462497 -523875 -400583 -604741 -813930 -384669 -103212
18096 -103212 -185960 -300604 -368471 -391036 -411729 -366078 -398632 -261644 -397361 -291546 -101245
18085 -101245 -258829 -225483 68416 24272 -83430 -53088 -73469 -153307 -157743 -227403 -369086
18074 -369086 -341877 -224905 -221851 -30857 -45341 -255634 -359325 -361049 -608409 -697500 -391118
18063 -391118 -118133 -367777 -514688 -293046 -170964 -309773 -245519 -283679 -285568 -310991
18053 -310991 -412520 -443592 -251106 -262122 -474927 -466016 -380260 -179040 -39675 -163238
18043 -163238 -312196 -224223 10792 237989 116971 -19806 -237550 -89507 -137596 -272487
18033 -272487 -320368 -330293 -558887 -454604 -197582 73655 86182 -115329 -186709 -261675 -261165
18022 -261165 -234143 -73450 58462 36575 84440 -15745 -198135 -226696 -215064 -204730 -254234
18011 -254234 -131606 -429766 -498447 -387908 -229389 -31014 -42984 -193872 -356303 -461134
18001 -461134 -337230 -400950 -295521 -341651 -291634 -389162 -707937 -615286 -371510 -364872 -429864
17990 -429864 -352208 -392869 -368269 -214106 100266 151478 16580 -27804 22629 87044 64972
17979 64972 -204740 -268037 -274434 -257978 -475997 -634830 -639389 -590024 -608442 -557684 -587801
17968 -587801 -528020 -140984 -88247 -196307 -162385 -298916 -423234 -606615 -362539 -299764
17958 -299764 -349731 -448196 -292889 -60225 63536 90531 -123820 -384182 -523009 -257567
17948 -257567 -55966 -133700 -221762 -417949 -411955 -505063 -410835 -126753 -375095 -471508 -330413
17937 -330413 -252004 -266832 -309358 -113831 26446 -49797 -19121 -108383 -464415 -670125 -366270
17926 -366270 -286570 -116010 17067 -55633 -118100 -44889 174787 -180456 -407040 -378076
17916 -378076 -286048 -218723 -181513 -428424 -543562 -338897 -200430 -270044 -339346 -508812
17906 -508812 -659853 -492068 -400184 -377513 -204261 -229158 -249040 -204123 160981 208101 278478
17895 278478 448545 300620 201486 83548 123125 -68601 -95742 -265967 -257548 -157673 30015
17884 30015 222587 268342 -25216 -234937 -423200 -371520 -337648 -173867 -78309 -30409 -12198
17873 -12198 74562 -101289 -86849 25775 -166592 -207044 -143060 -138392 -270446 -352720 -275840
17862 -275840 -100001 -55069 -65081 -94064 -95595 -75005 -344322 -171659 293735 285604 56976
17851 56976 -63782 -238798 -260827 -186068 39712 94721 -179635 -129135 -131593 -260835 -489525
17840 -489525 -357728 -311204 -384384 -113564 148195 120913 -209561 -351176 -556695 -708176
17830 -708176 -602212 -470099 -403752 -305119 -109520 84725 119904 192697 199025 314860 100089
17819 100089 -70802 -4491 97244 7145 -10216 -185134 -151212 -226763 -58295 -50933 -137017
17808 -137017 -306829 -394916 -470177 -300984 135946 217765 -86495 -352058 -248616 -237668
17798 -237668 -240548 -291461 -487282 -572654 -393523 -31804 157121 177184 119 -187138
17788 -187138 -141634 -300283 -403731 -225694 -163381 -197260 -488507 -344581 -382296 -226262
17778 -226262 -177478 -329644 -235955 -88810 -29515 -43755 -165103 -32033 -69828 -169667 -53352
17767 -53352 16242 74451 -39397 -155288 -196436 5464 -168599 -452667 -429013 -522552 -479050
17756 -479050 -331982 -427905 -264320 61219 84132 -107670 -199564 -33738 -84327 -255849
17746 -255849 -277175 -218124 -153776 44281 -79091 -124613 -142574 -12004 130647 -4251
17736 -4251 -128045 6907 77305 85519 167723 62663 9023 -38924 -287106 -269343 -219069
17725 -219069 63562 -179513 -521274 -522500 -620464 -399007 -179770 22494 23800 -320783
17715 -320783 -457323 -182292 -80793 -287823 -393682 -70904 31709 -14696 -305155 -219736
17705 -219736 -352293 -447417 -400161 -359401 -418960 -500787 -564993 -552168 -415946 -192946 -331205
17694 -331205 -498503 -581646 -523441 -492714 -191983 131309 20005 -133886 -99178 -65568
17684 -65568 -224909 -93151 84918 303038 353981 174894 145427 74423 -270632 -318646
17674 -318646 88027 290610 133691 -13730 1545 -24067 47775 -236084 -520781 -517892
17664 -517892 -408544 -273346 -191449 -97469 -195625 -348350 -226662 -181182 -207185 -68493
17654 -68493 -105091 106917 161624 -230511 -525963 -247530 -88724 26294 -1329 -180500
17644 -180500 -245508 -164874 -68353 -153185 -237933 -232194 -313724 -297724 -101922 104354 386819
17633 386819 253803 40426 12019 -96373 -211761 74933 414695 274914 -47690 -112169
17623 -112169 -282900 -97533 -71000 -219181 -196203 -151849 -56839 -256038 -192922 -104242 -117019
17612 -117019 73329 141818 -65710 -177615 -282806 -232794 -66725 59891 89815 -35534
17602 -35534 -385977 -591322 -317348 -195084 -259713 -314864 -340307 -408615 -114747 -153883 -282211
17591 -282211 -193643 76064 123431 -109043 6256 -79954 -219689 -16013 214363 333789
17581 333789 175297 -190132 -310162 -287357 -215263 8763 99657 38319 128081 134970 -70913
17570 -70913 -98768 -90239 -39058 -255834 -332747 -280275 -306882 -412355 -435092 -591318 -542036
17559 -542036 -499141 -390489 -187795 11843 -52397 -183954 -56127 -90750 -153068 -300204
17549 -300204 -432500 -294171 -380737 -446351 -583131 -459902 -267786 -524911 -518725 -270041
17539 -270041 -222772 -205783 -114128 31795 226732 62670 -155843 -237581 -335823 -89374
17529 -89374 262328 360784 342473 114654 -218025 -236737 -132978 -173975 -503371 -752402
17519 -752402 -705312 -694226 -607941 -613908 -349744 -89582 -172798 -193648 -126454 -244464 -293969
17508 -293969 -332043 -283969 -357259 -246652 -224565 -302392 -443019 -440791 -494721 -594416 -430679
17497 -430679 -297052 -26468 146952 319243 350222 170443 44532 -296405 -446277 -589807
17487 -589807 -568205 -425363 -297012 -506508 -309464 -23962 18659 191458 174379 58127
17477 58127 3237 56496 167409 138216 92408 138475 106922 67587 -194617 -344910 -335320
17466 -335320 -332193 -555095 -766918 -543311 -506543 -352973 -248458 -240411 -145697 2121 -3375
17455 -3375 -214314 -467913 -312660 -8440 227530 106217 -197623 -431396 -357562 -282882
17445 -282882 -648651 -418796 59831 135181 218699 112049 -170600 -165386 39455 160315
17435 160315 255684 264354 272091 204772 177261 81668 -280243 -219956 354359 322816 187674
17424 187674 -178419 -414141 -343660 -302091 -210748 -54365 70800 -121122 -69785 -91598
17414 -91598 -163101 -363534 -343226 -109302 -174589 -153196 -459307 -624708 -266910 -120709
17404 -120709 -231060 -95677 -116610 -411386 -468434 -346299 -343883 -379425 -403248 -389437 -245250
17393 -245250 -115314 -84347 53303 -98517 -124092 -34386 -74774 2609 -112548 -148157 -249967
17382 -249967 -156895 -184238 -117746 112012 236208 179991 380919 146420 -180547 -96853
17372 -96853 52239 -22285 177171 115190 100110 -24496 -139024 17622 131286 42797
17362 42797 -124230 -292386 -350879 -251628 -381059 -484009 -456250 -250614 -417473 -269240
17352 -269240 -116834 6402 -215190 -544753 -553991 -606514 -654938 -404607 -213256 -90093
17342 -90093 64561 -271309 -377049 -304652 -36657 217686 314974 242254 -24368 -130998
17332 -130998 -305720 -117102 -72477 -176558 -248423 -283520 -116554 -324691 -311443 -229977
17322 -229977 -182810 -347480 -489266 -265667 -154722 -173895 -245914 -327293 -326409 -280021 -164698
17311 -164698 -44285 -34782 -154428 -370760 -254228 -93662 45052 189471 169326 145599
17301 145599 -198794 -379336 -240391 -72859 -169443 -192243 146028 46761 -14640 45437
17291 45437 116496 37417 -17611 -188105 -564125 -454324 -155997 -136991 -198517 -168814 -86102
17280 -86102 -173284 -347543 -445327 -318971 -196424 -255836 -362110 -658177 -598064 -417879
17270 -417879 -279841 -149590 2194 -233795 -305167 -238819 -261096 -203987 -166842 -168564 -100417
17259 -100417 211455 232548 160606 71913 112538 93640 -61481 -102817 -213029 -225596 -213836
17248 -213836 -16955 268927 255885 200287 309006 95838 -526719 -525050 -269681 -347151
17238 -347151 -337294 -1724 -4313 -100014 -406870 -332982 -378071 -393767 -121330 -112107 -263085
17227 -263085 -368902 -127424 -66672 -102732 -25931 -34798 15546 -106279 -146524 -160556 -208364
17216 -208364 -179746 -419 74395 24818 -154311 -295041 -260253 -205628 -104641 -195632 -119815
17205 -119815 -57353 -193401 -242824 -206483 -199956 -118675 -173862 -348469 -368922 -172997 -71986
17194 -71986 144847 250200 149412 44705 50831 138810 -28792 -194046 -190285 -233381 -84470
17183 -84470 -231152 -296678 -326367 -454987 -545090 -554915 -294135 -209365 -90547 -99559 -39266
17172 -39266 339241 444438 279726 267464 299034 132233 70475 -50353 14371 -98662
17162 -98662 -13046 21085 152554 388798 437920 354141 -259308 -251025 -106595 -152102 14805
17151 14805 -24308 -132567 -100730 -44604 -19704 -146728 -271259 -703480 -1054879 -807661
17141 -807661 -486616 -471942 -528593 -454411 -310770 -219589 -355029 -230940 -51922 -176265
17131 -176265 -230846 -127833 -268306 -201843 -309612 -309991 -196454 -357278 -492134 -392542 -268248
17120 -268248 -271667 -241630 -117009 -188750 -197037 -100909 -124306 -191840 63229 141921 251936
17109 251936 309106 66547 -243891 -222973 -188014 -87575 -26309 -15689 -66570 65682 155422
17098 155422 107604 69809 12150 -254969 -247905 -14175 -19487 -73314 -159648 -332727 -237119
17087 -237119 -222495 -410153 -544595 -562746 -575612 -703739 -645596 -572792 -471132 -480008 -323700
17076 -323700 -406138 -461726 -232411 -262536 -192244 -110238 -320225 -407779 -53387 -33430 -20501
17065 -20501 97043 101506 9662 -196789 -25147 67568 -127970 -347098 -519439 -758210
17055 -758210 -537530 -257731 -67540 25844 78020 136263 22966 -3327 -112718 -145448
17045 -145448 -181302 -229895 -260920 -210759 -322528 -480604 -524446 -490924 -361424 -342845 -321386
17034 -321386 -150877 63487 162320 -178741 -311960 -394747 -581287 -276847 -146515 -189172
17024 -189172 -309565 -158865 -171642 -422758 -597601 -350803 -240951 -172251 29124 -182675
17014 -182675 -245629 -35408 106116 -77794 -400227 -381285 -367884 -468659 -232698 -11290
17004 -11290 77725 -74357 -328282 -228287 -158800 -218259 -695794 -691727 -747979 -783826 -598093
16993 -598093 -501869 -314468 -292173 -81041 155336 209799 288988 552531 404824 165153
16983 165153 327363 314421 320238 209590 81059 -285475 -477846 -271708 -170472 -48406
16973 -48406 46304 120963 -97816 -37471 -33540 15091 170575 58073 -94751 -96592 -91924
16962 -91924 -177723 -237708 -54501 -62324 83478 -68694 -287852 -254913 -135541 117291 70459
16951 70459 -206310 -215695 59882 240336 255575 183723 13154 -253500 -329275 -491804 -635854
16940 -635854 -588467 -446900 -281672 -177876 -120660 -98391 127813 142451 -159857 -65826
16930 -65826 -145840 -78906 -10396 -228453 -525237 -292807 -11660 54848 -389403 -416139 -470623
16919 -470623 -474764 -191807 -247608 -296551 -293720 -207327 -76924 59540 -10756 115454 31290
16908 31290 -171934 -148684 -197903 -370356 -423741 -521750 -484079 -411003 -331237 -112126 41622
16897 41622 113679 249761 -232 31570 16007 -200045 -469184 -657918 -606003 -285633
16887 -285633 -399863 -567682 -549909 -466102 -211910 -184093 -213552 -421126 -512054 -487009 -416139
16876 -416139 -411170 -97566 49948 102057 97240 218779 400106 126480 -118610 -148120 -113435
16865 -113435 -92420 -158845 -412809 -235113 151242 117286 -186967 -273837 -335547 -444193
16855 -444193 -368508 -290698 -472268 -356644 -150867 45835 177315 120567 199796 123917
16845 123917 128622 285484 224412 159162 378583 616384 461759 190407 150923 115438 166561
16834 166561 275514 202436 107126 -41143 12987 265259 346857 191024 23726 -207466
16824 -207466 -170391 -54489 -26163 -51416 -53315 -13795 133616 -122285 -251249 -18304 109215
16813 109215 285063 264275 363497 345326 176452 15253 -108182 -367317 -349958 -138874
16803 -138874 -243730 -288942 -191697 -183819 -140101 -11154 63931 -54330 -64836 5135 -21604
16792 -21604 -106777 -72361 -160605 -226870 -62990 60142 27533 58257 37896 -108609 -190609
16781 -190609 -38542 -17412 2277 47688 180564 433286 484683 222243 74530 -73156
16771 -73156 -207601 -285796 -319988 -449737 -702768 -732470 -429573 -300760 -278454 -230655 -240738
16760 -240738 -469016 -643750 -383117 -171698 -174249 -218038 -215176 -386802 -161330 22905
16750 22905 82641 8465 -126935 -91278 -115253 -97563 -9902 -107930 -219564 -166100 -92999
16739 -92999 -197750 -352924 -537100 -542065 -346228 -340228 -201308 -97133 -313326 -394679 -291748
16728 -291748 -442112 -478052 -476182 -247342 27552 -78389 -147048 -248382 -326203 -376192 -563395
16717 -563395 -499067 -329676 -202680 -300844 -290910 -217858 -271083 -567470 -408893 -337114 -479385
16706 -479385 -535074 -363996 -182273 -293754 -305363 -414742 -244090 -446167 -714323 -578719
16696 -578719 -200292 -140400 -189136 -101915 35516 82583 37011 132058 -42986 -71441 179709
16685 179709 -22813 -205934 -363513 -569767 -607572 -447169 -310047 -321630 -215443 -167394
16675 -167394 -211843 -255566 -239599 -233050 -171290 18105 136920 72260 -37903 -55984 -103830
16664 -103830 -245199 -167765 -140705 -275246 -327277 -338519 -197320 -115432 -16365 60893 -16522
16653 -16522 -6200 84876 205920 164521 133451 10201 31312 309096 173764 182943 554180
16642 554180 502337 266293 105972 3376 53220 286264 115499 -137779 -239625 -274748
16632 -274748 -401211 -381404 -93091 185779 52404 -258270 -85976 5250 -46799 -155291
16622 -155291 -367718 -304358 -272293 -94072 102214 -8581 38409 130559 19918 101689
16612 101689 371091 422522 153303 -2065 -42788 177531 286883 165221 11061 -27351
16602 -27351 -82902 252411 380452 245959 347871 256769 311354 382608 393324 300540 -17832
16591 -17832 -127875 -16993 51954 -70344 -243055 -130758 -63158 96229 205115 98834
16581 98834 -58716 -168806 5485 91131 161696 212655 -232366 -494147 -298906 24928
16571 24928 69213 38403 -53666 -192866 -120575 121774 232906 -2270 75263 1961 -255381
16560 -255381 -203892 -154926 -385234 -287354 -181841 -223566 -155664 36755 -141872 -37156
16550 -37156 -105297 -256716 -260322 -212249 5977 123593 254721 417058 459399 202488 51369
16539 51369 60634 14101 215537 137496 -225513 -132784 -176617 -262446 -127574 -142070 -242139
16528 -242139 -327628 -417692 -532817 -512895 -365136 -258248 -143077 -40740 -26697 -29687 168334
16517 168334 102213 -51617 -192927 -243086 -159010 -402889 -378865 -335700 -203485 9409
16507 9409 342947 400195 117596 26762 104516 119430 29261 -139003 -94026 111440 305778
16496 305778 267041 188373 -29022 -173678 -132613 43691 -178958 -254683 -323828 77517
16486 77517 -16742 -375492 -269731 -334386 13047 307657 329561 73069 34704 -105517
16476 -105517 -117857 63937 52498 -81319 -272083 -211702 -278050 -37725 -1647 -116800
16466 -116800 55149 219552 -45194 -91848 -27316 -192474 -427419 -461643 -198871 36255
16456 36255 -76477 -9072 -4184 64983 -43002 -192238 -248959 -271582 -191367 -303345 -128082
16445 -128082 18742 128596 -68611 -188603 -181867 -239923 -649916 -971792 -799297 -625494
16435 -625494 -527946 -485067 -437557 -361817 -191192 163927 101025 -142247 -96466 -282659 -496661
16424 -496661 -292501 228054 211572 -161992 -325171 -525278 -509482 -497229 -236428 2766
16414 2766 -163648 -314814 -338165 -113485 -75821 -204875 -121732 130891 114595 142852 -49203
16403 -49203 -97580 -80295 -46003 131984 325245 588548 647798 285871 -6577 -276801
16393 -276801 -138064 38307 122134 114144 -94972 -439247 -326497 -243480 -99831 111436
16383 111436 86005 24033 199017 404497 245828 214997 150051 -122323 -232373 -462607
16373 -462607 -503610 -278858 -100431 -84214 -34670 129561 118536 -14585 184215 380536
16363 380536 286258 74915 -238873 -248488 -163893 -113023 -138032 -318792 -313657 -210083 89566
16352 89566 2747 -277607 -248151 -153614 -271607 -72833 30308 60608 -145531 -256263
16342 -256263 -109973 -113673 -14182 216032 289518 243435 555028 522201 431431 380572 225446
16331 225446 208191 212315 150512 267333 423528 207587 -78544 -257213 -167932 -185668 -269680
16320 -269680 -62036 53035 153019 49867 -23478 76013 149851 264589 291177 288043 12
16309 12 -158812 83381 118369 -221791 -213851 -46521 22657 146854 220588 308408 309307 1861
16297 1861 -30306 79859 -95215 -199889 -142032 123204 186138 153455 20261 -161081 -59968
16286 -59968 -60940 -297054 -658072 -525143 -279067 -22416 78900 12756 216718 82224
16276 82224 -170156 -438787 -288880 -283813 -412040 -344486 -159364 -16024 267847 380045
16266 380045 201185 -65651 -86420 -22104 -78668 127694 129728 43241 72545 30155 -102600
16255 -102600 -166677 -133432 82939 73413 -107312 -38161 171900 205921 41161 -89775 -93973
16244 -93973 -259567 -227752 -164884 -318890 -144773 -126642 -191681 -162312 228993 386311 368783
16233 368783 207631 87609 -52091 -137471 -170147 -21124 124315 -34096 -152894 -24315
16223 -24315 -26311 129797 286908 327163 124329 -37741 56869 208493 4289 -198292
16213 -198292 -168368 107629 -49877 -74755 -74339 -154295 -19644 93938 31447 -214036 -266920
16202 -266920 -159636 -162940 -90663 -155751 -54898 180596 159014 161128 175941 -22906 -215246
16191 -215246 -405261 -371956 -213489 -429025 -503962 -512729 -279897 -221196 -61984 -1194 151030
16180 151030 139286 157473 -37570 -294912 -385600 -465091 -371857 -260769 -196273 -183164 -43524
16169 -43524 -50173 -159584 -125329 -133869 -491670 -643569 -415300 -241722 -368895 -519106 -444599
16158 -444599 -250227 -202851 -273830 -301188 -367681 -375410 -217680 -131464 -21008 99039 28576
16147 28576 21014 39694 24112 -77460 -58926 -101679 -125943 -192364 -445145 -313747 -159509
16136 -159509 129275 253818 126870 -108228 -163663 -185982 -117738 -127143 -108490 -40994 47164
16125 47164 69577 38474 -98736 -15469 -122702 51793 153328 8948 -787 18962 56419
16114 56419 -13699 -2788 -104431 -100606 -76019 106560 -49271 -195048 -224180 -214081 -333457
16103 -333457 -243614 -289733 -510494 -376123 -409531 -684091 -559138 -1945 88421 47551
16093 47551 -149615 -47128 53760 -177913 -245420 -75324 218402 264413 13119 -231009
16083 -231009 -253126 -229367 -159336 17639 5405 27958 119543 393953 519190 444818 365198
16072 365198 139225 76042 32807 -84756 6670 -192639 -121012 166195 206892 185281 151522
16061 151522 178920 -66845 -397936 -268863 -83209 -262921 -117885 18321 -96474 -159875
16051 -159875 -181218 -5391 -75500 108433 127539 -210686 -502656 -416914 -368897 -344490 -379542
16040 -379542 -370491 -657996 -556215 -439665 -459862 -388780 -117683 -122767 -226498 -177723 -169266
16029 -169266 -211986 -243012 -55515 184321 92383 96598 191926 34350 26926 74653 -30768
16018 -30768 -5483 41736 -31301 61816 59384 72201 -6956 -278995 -514050 -340791 -115602
16007 -115602 157109 306152 180464 227151 128274 -52335 -219762 -252226 -286008 -293505 -241553
15996 -241553 -186385 -281315 -218098 -218746 -61295 283318 436218 359254 482850 751862 740827
15985 740827 262881 58635 179802 323987 318134 43817 -105291 79413 293361 429418
15975 429418 484332 344691 288997 201017 -54791 97198 250509 299981 96784 -129570
15965 -129570 -149866 161983 421446 260139 225478 222492 196518 224129 340456 311649 20688
15954 20688 101197 216002 220200 139424 126651 264269 272191 157370 -117901 55169 147047
15943 147047 97391 243434 493965 305772 173963 -58537 365464 201549 37525 -48771
15933 -48771 -179745 -55968 370317 464294 408292 329559 349022 259421 192797 102262 122931
15922 122931 118076 211788 38152 -123498 -280862 -98699 -28233 68967 140446 26979 -82318
15911 -82318 -28443 133072 166867 104391 362546 350823 249338 294577 278455 472792 662635
15900 662635 608468 343706 102196 221986 240433 108392 -196587 -237975 -119953 4246
15890 4246 231331 268614 276602 288975 -80463 -180059 -37710 92136 103441 224810 344055
15879 344055 153961 -149352 -198959 -115303 -159708 -80722 129449 276178 281533 162777 -154298
15868 -154298 43233 203921 23144 -68612 -172184 -120772 127193 205587 142139 -14832
15858 -14832 -18590 228129 271028 256239 357007 627041 586387 367835 557307 565208 477513
15847 477513 269846 209294 71156 -51267 169556 207149 337305 508833 503578 443196
15837 443196 388788 431733 435338 448805 300159 236862 381466 295097 313955 411630 342010
15826 342010 384748 159194 19752 123106 371664 318894 136785 26444 144782 82802
15816 82802 61843 203633 321745 557849 410706 425132 502860 508975 495328 478962 518456
15805 518456 298855 189646 58510 -125427 -39420 114042 295262 302168 119427 -62082
15795 -62082 -18911 232269 375385 407662 447867 279770 257847 146934 143776 234209 250088
15784 250088 580750 312225 74663 -54703 207586 507980 417419 419868 390233 404956
15774 404956 437313 297407 -96959 -148670 274541 654788 879983 732351 731129 796320
15764 796320 737641 975693 859176 994695 914378 992704 1103306 802666 672730 911991
15754 911991 996244 1265350 1217041 1062840 1093128 1381121 1602781 1654632 1811140 1958846
15744 1958846 2138504 2352856 2469244 2616150 2915088 3647349 4470542 5106934 6538297
15735 6538297 8843553 12240729 18343462 27734824 35721930 38128284 39005652 40213302
15727 40213302 40248877 33079774 20718012 11928102 7681751 5837824 4368757 3605185
15719 3605185 3076612 2882732 2771979 2799215 2564070 2435863 2207912 1880599 1810845 1729717
15709 1729717 1637159 1329076 1278722 1106868 1124231 1073009 1115823 956116 892695 629919
15699 629919 887896 1247525 1189705 695724 464201 485020 538559 548730 715937 941716
15689 941716 986365 756470 695586 804433 879835 904483 784194 769744 652168 565615 513593
15678 513593 384814 582437 753143 638824 659936 717864 750944 574927 382271 70895
15668 70895 272711 306615 49802 175399 563065 337094 340420 386925 267285 111957
15658 111957 446463 402645 353700 417211 210541 124353 173341 318924 256157 153623 113697
15647 113697 216129 282434 232699 120590 43621 -62204 76443 294835 343658 291509
15637 291509 105148 10179 -7951 2703 79224 184656 321002 148069 -17291 -231258
15627 -231258 -262066 -277333 -462436 -172100 87234 128780 206497 18627 -144107 -151015 209746
15616 209746 291527 157920 159340 22030 150096 76480 73048 105140 81959 80024 -27177
15605 -27177 -63806 135890 268865 507062 432336 403888 474004 178788 11876 -197969
15595 -197969 -33209 167541 213174 105062 43504 155298 321662 478034 278303 264571
15585 264571 285713 220071 91648 2208 234346 243008 325743 42157 -263529 -207031 -239517
15574 -239517 -285171 -111130 -190972 -152361 -24550 -188709 -297777 -359393 -429039 -275774
15564 -275774 -52845 22662 52504 242725 298888 103857 -149451 -145589 -52584 -103383 -276679
15553 -276679 -301983 -110082 41958 72931 79890 -25121 -88781 9679 30513 -60049 -124449
15542 -124449 -307956 -362781 -573832 -704348 -622129 -779274 -726764 -450222 -121626 -34716
15532 -34716 2834 -106512 -48794 -165285 -372843 -348599 -269280 -205551 -183244 -215566 -29657
15521 -29657 176576 99445 -131215 -162156 -163838 -229572 -243715 -185459 -123705 -50433 61356
15510 61356 -131521 -323490 -165388 73370 7598 76803 143948 69605 -18386 146714 275045
15499 275045 315438 323585 286758 84883 151302 298317 56816 -108593 -83380 138499 103360
15488 103360 38483 86184 171504 -25745 44735 246135 330962 152185 161048 163602 -211712
15477 -211712 -309354 -198673 -376384 -590219 -430984 -113655 269133 410882 616265 402121
15467 402121 269873 276518 191981 4794 -175323 -28299 180385 243780 147958 -142876
15457 -142876 -351698 -332227 -159698 -171037 -172226 -257980 -204763 103585 139349 214751 14816
15446 14816 -102056 -124552 12977 313009 334119 191518 -194746 -203372 -164934 -42063 -74132
15435 -74132 -71719 1921 -47868 -49338 202128 376971 109410 141726 246519 125769 114258
15424 114258 225153 249563 233757 282182 249645 145765 127602 157458 187769 82789 113663
15413 113663 23314 173053 166710 76731 -93093 -220719 -292111 -232474 -234482 -117948 52849
15402 52849 289821 326853 451277 429905 -12469 -321513 -335339 -60873 207018 -55181
15392 -55181 -249984 -123526 -82832 -80725 154398 218711 217158 150801 16322 -202814 -161128
15381 -161128 83984 76681 40733 -110101 -162113 -228297 -137094 6007 56870 70715 -44172
15370 -44172 60933 233370 360768 286213 389191 262377 -166592 -161269 2543 -315297
15360 -315297 -164430 19090 -70215 -239224 -296986 -132839 -157574 -501891 -345796 -97707
15350 -97707 -209876 -413990 -289240 -30918 167548 135498 14560 -256045 -543449 -442548
15340 -442548 -163160 85026 -25215 2035 -20912 -306453 -259442 85343 332949 319164
15330 319164 235474 73938 33765 -215135 -275812 -228331 39758 88110 -385480 -297410 -186422
15319 -186422 -426788 -378074 -123143 -68636 -211153 -469106 -261565 -70375 197216 26846
15309 26846 -253442 -171295 -138201 -332310 -355307 -88610 -196406 -453688 -343090 121598
15299 121598 147184 -99782 -195160 -110640 7016 20501 41549 103050 128858 147612 52241
15288 52241 32280 50059 58353 309366 388385 178250 -45955 127823 105062 -62746 -134902
15277 -134902 -216068 -283671 -156388 -224466 -226571 -118142 -163523 -137733 58265 7335 -100140
15266 -100140 95076 305149 294741 136272 -1862 -228118 -131413 -284351 -469224 -306052
15256 -306052 -49608 -173654 -149736 49052 23327 -212443 -230778 -173334 -64284 8583
15246 8583 191160 512204 340629 219597 273300 361506 438388 594885 609760 283830 165918
15235 165918 367785 464296 -49442 -244241 27648 184116 415612 238411 18900 105150
15225 105150 -60620 107429 196206 209643 197715 34502 -190313 -239677 -95875 -5349
15215 -5349 79490 231973 266397 289817 152284 -135166 -88191 210605 239510 282875 361286
15204 361286 300986 230191 57776 117170 37655 113 13215 17243 51991 -34896 165344
15193 165344 394225 262236 114719 78865 -52508 -108084 230330 304039 204526 70514
15183 70514 -81628 -178056 -170473 56636 170324 284969 284722 147790 260308 253529 -36460
15172 -36460 -60623 180559 297090 192879 -27465 -171065 -206282 -187635 -30495 102291
15162 102291 228988 192855 42191 31935 68345 81266 73770 -24242 -6932 143535 318961
15151 318961 104013 369599 494160 392777 358762 385674 354480 129482 52254 6277
15141 6277 42586 136290 294599 515467 789761 476205 259768 88565 27397 -55363 71635
15130 71635 171165 392726 463278 407226 319228 -6933 -208429 -217618 69994 79168 122790
15119 122790 -71241 -352383 -335555 -393594 -270139 -135815 -166576 -334699 -302301 -167478
15109 -167478 220709 197508 55706 164138 445924 765256 829336 373238 89331 131755
15099 131755 138895 166489 311076 446828 635753 544283 333535 156868 -69743 -30806
15089 -30806 -56994 92789 136885 21382 236187 492348 441267 423875 296448 220217 47606
15078 47606 134333 196178 92492 98567 -143261 -322908 -345093 -263696 -59981 -143914 -342161
15067 -342161 -61690 249268 142967 81354 -39838 -75488 174350 325175 305961 290683
15057 290683 144115 181389 228277 203899 241748 346327 213364 225837 133923 86213 104869
15046 104869 251720 130626 -104005 -318077 -349010 -76059 164404 -11165 -168862 -98873
15036 -98873 -16728 -171243 -265988 -108566 128548 1882 -63724 74042 204984 206708 -43938
15025 -43938 -95481 -159938 68302 196555 211996 109817 -75936 10353 87461 315816 309730
15014 309730 386436 211119 194757 259372 218597 184575 72616 138133 384777 468215 569783
15003 569783 563941 740227 266927 -82279 2711 119011 111840 83058 73384 161007 148818
14992 148818 248317 408624 296284 102601 -56056 -138189 2317 76999 368150 269547
14982 269547 77484 108969 81213 -148996 -183406 -95030 121902 87777 60387 136981 89622
14971 89622 -12104 -5366 -41014 -36687 35184 -125073 -236802 -242128 -90546 120374 429172
14960 429172 568796 363780 226600 259496 130605 -6344 75835 273191 410904 432383
14950 432383 311046 175000 65704 -67221 -92524 -30010 182520 57649 14586 62451
14940 62451 -109322 -88801 131800 105001 79233 116800 -57775 136494 404845 438401 234408
14929 234408 267425 258914 276648 488505 747581 355668 176153 191038 296654 411222
14919 411222 489375 382903 325578 228143 270738 277627 253296 393714 416689 563065 294820
14908 294820 -122962 -226325 -168378 -125427 137806 208682 235257 149717 81948 -106956 -105934
14897 -105934 57181 216014 289538 226673 284065 536656 444199 352706 261927 201470 360813
14886 360813 335583 239470 125126 136368 84583 142366 232978 260330 158062 148611 249996
14875 249996 267255 86384 29512 -58913 -32900 73541 66947 -6785 -18126 16922 -44308
14864 -44308 19434 202772 344829 432079 506026 329152 219381 351724 473392 298453
14854 298453 241100 209643 44185 -25834 -82625 -75648 131008 106843 144937 145296 276445
14843 276445 108216 -70423 -91317 97241 -112482 -242281 -112371 106387 49851 115954
14833 115954 -71328 -47281 139747 132956 36008 45039 159111 187926 210223 210138 175930 310342
14821 310342 416085 59147 -95072 93129 168602 359585 362411 314725 345586 410219 499345
14810 499345 499201 281745 569285 506243 294599 287220 520425 425264 222735 15290 171984
14799 171984 254962 360228 451342 554133 125251 -121155 64611 11994 52980 220102
14789 220102 -40880 -71895 -72548 -185315 -57436 54950 -28578 115156 159906 151068 298124
14778 298124 327846 481110 477833 530716 552276 372176 407535 385695 187267 37542 230553
14767 230553 323420 258110 139458 -7047 171880 138792 -224465 -163007 54575 -3740
14757 -3740 3432 84558 327517 318717 60000 185148 221027 152582 295606 398886 427648
14746 427648 597397 524273 489908 489048 389497 295803 80541 -80642 -9419 59288 27462
14735 27462 88571 48197 241464 467193 309471 123384 271047 271240 129796 277601 318309
14724 318309 595021 634695 571800 442737 244421 117922 108061 176597 381028 400697 310379
14713 310379 361879 408574 339106 240438 191531 45985 46171 128977 439029 581065 549068
14702 549068 438761 248578 115484 157573 211577 168689 25503 -24762 -135027 -52121
14692 -52121 221111 479469 183410 264680 408319 305976 303911 297232 381211 604364 626531
14681 626531 521708 224446 276966 328072 204847 99339 11084 263565 423602 562361
14671 562361 361227 265403 199973 63567 26009 277353 157383 134189 189484 325292
14661 325292 654550 639709 454990 523292 424995 136870 175005 145994 273521 236712 122637
14650 122637 96636 -7373 -206204 -39666 136384 356462 333996 263270 169045 127073
14640 127073 167728 301763 378672 439599 432604 320342 164878 77635 227755 127714 -28846
14629 -28846 79493 35451 117224 317886 239679 381475 427143 650134 826637 732679 565860
14618 565860 404691 282423 179901 188924 293934 505178 461459 517482 426627 212178
14608 212178 255740 175149 -20908 -248193 -172899 201257 336153 238130 186493 229979 109424
14597 109424 272575 459739 531337 671473 555624 211648 144982 40645 117870 250893
14587 250893 216667 183055 51301 -30714 51171 61402 95366 -71234 29824 226193 267486
14576 267486 17951 84682 107094 -28450 -169690 -321448 -27137 552531 827841 714799
14566 714799 597862 638877 604798 378066 201068 -15318 -292301 -232466 9798 77240
14556 77240 271928 375854 357669 448579 438503 365790 16732 -21391 94432 38993 522
14545 522 73368 210248 182101 273501 431969 413465 422256 474901 552764 378089 362969 515122
14533 515122 469195 171669 312037 358565 356077 412989 331222 102142 213489 365902 295008
14522 295008 340016 508819 430808 371895 211798 212742 261543 239388 199613 348904 358805
14511 358805 264325 53744 82686 323977 458115 326477 469588 540350 393980 312727
14501 312727 338429 332761 533304 306524 56365 95133 165579 295624 266401 302116 275819
14490 275819 237688 280175 147078 -3603 95768 200771 524676 430251 305422 431860
14480 431860 553719 493793 653247 587080 387449 271393 321638 323710 288861 464207 625700
14469 625700 828434 731610 529367 498679 509422 355763 241073 183192 303939 528937
14459 528937 409181 465198 664430 766149 662610 445293 511627 444400 353030 402708
14449 402708 281158 294093 278540 151651 -38103 63947 165823 284461 451865 513186
14439 513186 377654 378395 382284 267996 7499 -23825 174790 72878 218233 312817 410502
14428 410502 467664 299408 256823 322050 271324 146291 179422 281495 290001 233795 266629
14417 266629 175640 183573 273777 198254 11307 -24585 -65511 167462 233878 528581 408215
14406 408215 325501 281345 357808 555175 677108 509721 199566 -37025 185925 427332
14396 427332 442330 416508 374217 475579 621757 513482 384196 141242 232334 233160 263329
14385 263329 349889 247223 228654 359666 412110 432644 485677 476570 344092 199520 118596
14374 118596 369698 471825 731932 930830 867698 518879 514560 513638 532623 763059 763851
14363 763851 586161 657287 611694 306127 130065 423146 697927 484527 388159 210671
14353 210671 171115 299352 407149 428742 138709 194291 249136 128561 332544 568021
14343 568021 445935 393649 406289 408111 442438 619232 719295 628994 424307 349089 418995
14332 418995 551840 700087 667699 590911 435023 101090 9430 -157121 -169964 -6317
14322 -6317 299849 531488 665185 444325 181191 323649 566111 398097 211147 214501
14312 214501 570755 704659 699362 504205 411405 316990 639030 849811 818697 730103 526124
14301 526124 656343 742009 764050 942332 1083290 1049936 946181 801833 528721 594234
14291 594234 291040 384339 368191 437279 579755 572327 610125 532057 590742 555852 463269
14280 463269 456274 656790 661818 421238 303206 391825 233089 192935 286855 210001 313947
14269 313947 435967 346656 323221 447188 361151 218057 370467 330168 240076 339345 417564
14258 417564 338793 276265 462626 441948 399874 249231 99733 170088 214131 236382 -78030
14247 -78030 -169898 -185526 -17399 15736 -48737 105219 324422 628464 623517 572006 674919
14236 674919 607088 549367 589244 409504 366630 336421 427423 530430 615040 783336 743155
14225 743155 501519 595677 700387 601095 625203 556412 439647 407057 445348 266264 275461
14214 275461 626601 626409 526138 624282 599933 621491 680791 681126 709066 699838 679825 575036
14202 575036 597617 491930 357503 394229 436100 342413 130685 153711 232605 341630 536897
14191 536897 507590 341708 357235 598374 630759 594334 403645 219892 84840 240748
14181 240748 340023 95294 109157 355366 358757 312354 298711 334201 330814 383439 292723
14170 292723 324647 417403 290960 311575 606867 518896 404005 410232 418105 492453 546876
14159 546876 633989 753181 651959 400267 262152 299891 357229 384177 511451 638860
14149 638860 723217 573966 526519 665001 744312 829853 630282 360113 382704 408175 428087
14138 428087 621183 594191 493775 520892 313476 475849 587544 353035 419098 546005
14128 546005 630663 547924 546587 593392 910096 1019089 853353 940861 826899 579603 529548
14117 529548 689579 845545 657318 501111 367626 447187 388763 672725 985038 1012660
14107 1012660 820336 521515 644785 563223 598599 888085 1011104 878571 766561 754807
14097 754807 810073 745784 591255 487912 444958 420804 538938 676071 823014 814083 652566
14086 652566 689985 755835 617956 578224 493345 407299 442476 697211 440153 394237 460503
14075 460503 633596 809110 667087 722308 670975 822877 747290 379587 426199 556070
14065 556070 619258 878169 844504 920383 1191753 946756 616610 523682 572692 496321 222917
14054 222917 369226 407160 591832 780078 713118 649689 730392 657918 696801 919624 642567
14043 642567 503483 500818 383012 375025 408773 340231 462298 585260 628063 643889 529280
14032 529280 661204 815103 1040811 1176784 1210080 1123481 780456 913356 752965 631203
14022 631203 747729 800186 824046 895068 984979 799811 666823 501659 492656 562121 620821
14011 620821 748753 850906 905118 969602 828794 775806 642518 373813 265071 493426
14001 493426 497314 313431 517968 632736 950586 1272223 1280090 1137723 1124789 691960
13991 691960 363165 484425 496346 477977 370116 453027 541623 495652 446665 608169 496681
13980 496681 578108 604174 696754 819286 659707 518285 409086 385258 425980 610438
13970 610438 855998 762583 616377 709453 917126 895725 934397 1001917 933036 914293 811857
13959 811857 593511 461845 586152 429507 306584 117598 344675 464675 411993 542518
13949 542518 699334 509441 309281 273111 437045 775627 807790 858826 924322 1055199
13939 1055199 810097 772241 711703 424534 521764 677576 688822 903813 992161 838601
13929 838601 647748 527834 733769 709125 817615 758015 809809 698977 621410 715063
13919 715063 806588 705402 706765 738742 690349 756594 503401 380958 577114 540076 472375
13908 472375 417051 485720 533789 363945 312062 461704 491923 523480 425968 568234 587410
13897 587410 421732 222276 158674 462198 701776 568923 887441 1137440 1132005 1238418
13887 1238418 994001 771821 654820 736841 652469 681609 884296 1044697 1145016 921107
13877 921107 902599 665191 732142 684790 592192 534881 692227 882314 704042 810146
13867 810146 1029858 1000333 1057201 922183 759989 871715 780031 672141 759005 937663
13857 937663 1023932 902263 854305 978660 919324 756817 409103 181156 337072 619750
13847 619750 787328 767346 841901 717808 800411 956681 822095 479999 424848 628024
13837 628024 887428 963290 718830 589243 596293 541985 653014 764575 781130 830289 744806
13826 744806 652882 602911 746936 938051 864270 812908 739576 625673 618328 978705 998299
13815 998299 905557 924368 718166 321012 443934 839814 710763 582197 515044 618225
13805 618225 723428 867388 875109 930041 882827 809751 588825 575431 754797 950672 971634
13794 971634 703713 387518 325152 309443 345992 466818 692244 777079 565342 408101
13784 408101 256410 224199 252537 503425 744586 709874 547378 649302 706290 541319
13774 541319 564881 586535 492050 517917 538278 776759 970951 835517 799731 866225 872780
13763 872780 775029 722886 927644 849970 777844 853394 772004 548392 454985 369456 438761
13752 438761 587377 674780 741363 891013 724258 532669 749287 934307 1000122 862539
13742 862539 861382 804553 958339 1165056 989070 831955 685468 785577 1067122 959204
13732 959204 971421 915592 834990 925336 828761 402788 315739 218818 238686 365638 452078
13721 452078 554891 630953 596726 985965 1111950 1129398 1156595 1154610 1013998 936365 809279
13710 809279 850603 833857 604886 750564 996895 990574 813337 722251 503236 601856 888535
13699 888535 885860 969493 1060340 918027 687274 482802 595460 764980 917034 993643
13689 993643 966868 1109135 1028270 945290 903615 879878 774196 743312 576750 472045 647652
13678 647652 766631 952247 998335 1040924 980849 874281 874202 870737 1068303 1211118 1023215
13667 1023215 790491 596199 544709 825431 1044552 1127768 956578 829797 654070 513909
13657 513909 948279 1172912 1331464 1217819 1075403 946586 1059620 1028457 1274300 1337474
13647 1337474 1375185 1225340 1134655 1185098 1162516 1220763 1343653 1177089 1053664 927010
13637 927010 1041805 1060308 1127124 1200559 1153777 824987 681798 489941 616847 667822
13627 667822 622786 693429 765217 969940 1056623 1188394 1087589 849281 930008 1130409
13617 1130409 1178475 1035566 863092 858461 944756 1020988 1331141 1540623 1240345 1128925
13607 1128925 868446 663782 740821 550073 657747 836050 704233 664215 701421 857890
13597 857890 1164153 995368 878616 840310 708041 690818 1054253 1245393 1056165 1171506
13587 1171506 1025711 885866 1053458 1044604 1224419 1476083 1475526 1305257 1430761 1387904
13577 1387904 1427261 1398764 1084693 965803 921384 902676 1074241 1141641 1245557 1290580
13567 1290580 1430516 1287811 1163036 1115661 1092547 1233001 1292070 1153320 1188013 1125422
13557 1125422 1030294 1036747 1131627 1047524 788726 716709 872193 969736 1033032 1130661 1023374
13546 1023374 879385 976997 857000 803713 570813 605079 770955 910470 811187 1020976
13536 1020976 1196972 1219532 1161540 1114974 1087482 1020581 984162 808768 886730 1172881 1348637
13525 1348637 1282419 1128338 1067772 986750 949990 994735 1132832 1035679 1281901 1298416 1365971
13514 1365971 1188232 971450 833006 793324 782681 894476 895653 865347 1004758 976994
13504 976994 1028607 1317634 1473199 1686323 1625027 1437940 1360078 1174588 1095530 1316475
13494 1316475 1277511 1268532 1172073 1183101 896814 1044437 1331039 1453958 1363723 1482007
13484 1482007 1447322 1430298 1387141 1440836 1610858 1357930 1206440 1332239 1370577 1339480
13474 1339480 1279394 1384738 1507269 1494758 1310140 1257342 1381239 1611355 1622216 1412473
13464 1412473 1320031 1159874 1149620 1306692 1446301 1560634 1526741 1227849 859511 784300
13454 784300 879596 1063399 1223121 1295822 1341369 1453933 1567937 1476670 1391751 972609
13444 972609 805434 1045838 1200492 1540245 1426797 1106390 1369078 1579918 1277334 1165233
13434 1165233 1050280 857303 881357 990497 1016603 1217115 1379099 1284542 1287045 1201482
13424 1201482 1028706 1033682 1400843 1757238 1592561 1115943 1171087 1306748 1414968 1315453
13414 1315453 1248166 1281585 1229725 1206196 1461456 1602437 1532682 1724476 1748353 1599155
13404 1599155 1531364 1427091 1094234 1013527 1038335 992679 905306 1262415 1445654 1359182
13394 1359182 1338673 1269474 1094444 1249082 1533814 1588963 1468889 1481926 1634221 1732392
13384 1732392 1775342 1620260 1344345 1480813 1484839 1325070 1333389 1382541 1323528 1174049 1133075
13373 1133075 1082159 1178802 1175785 1154325 1046695 1103596 1465856 1595566 1243589 1324511 1601882
13362 1601882 1713745 1699482 1612792 1561012 1280268 1127562 1169140 1152486 1159410 1109325 834258
13351 834258 934647 1304945 1817052 1820476 1757797 1766544 1575950 1467199 1298249 1583292
13341 1583292 1720634 1561279 1490350 1492791 1384891 1511425 1319907 1254029 1173566 1235577
13331 1235577 1393521 1386867 1372995 1341147 1570001 1939228 1794838 1638649 1412032 1346121
13321 1346121 1210604 1267188 1609121 1472915 1257368 1331230 1705519 1766155 1531321 1445325
13311 1445325 1494455 1540253 1602355 1706385 1488732 1370152 1481664 1611712 1503681 1540919
13301 1540919 1747881 1835619 2076115 2303198 2183956 1855555 1718047 1725748 1561869 1794401
13291 1794401 1646204 1546779 1609592 1649557 1535565 1634792 1622064 1637228 1550998 1797312 2018410
13280 2018410 1783517 1722042 1699955 1541252 1542677 1532044 1555342 1675818 1912299 1927024 1737512
13269 1737512 1921763 1862450 1572043 1455029 1607137 1590889 1484721 1668509 1768429 1689072
13259 1689072 1892307 1973119 1821806 1665392 1813992 1948086 1974759 1949628 2014531 1882153
13249 1882153 1729440 2036957 2073788 1887234 1789691 1881254 1950229 1984470 1961611 1852755
13239 1852755 1706116 1651528 1706681 1622795 1445903 1327149 1571149 1513362 1576375 1665045
13229 1665045 1640875 1589466 1884330 1999570 1911817 1745677 1796957 1959213 2221450 2349204
13219 2349204 2225852 1932643 1874789 1885092 2227036 2113606 1991575 1920486 1976439 2160641
13209 2160641 2268711 2121853 1934515 1978919 2132341 2142192 2166654 2187394 2190191 2044755 2030939
13198 2030939 1816439 1529385 1633209 2014836 2154557 1871260 1938794 1983694 1975529 1753551
13188 1753551 1671614 1544097 1454618 1480790 1572885 1549193 1339695 1334692 1574643 1846067 2079833
13177 2079833 2048148 1910036 2025681 2107845 1819359 2060305 2402336 2453551 2594815 2449238
13167 2449238 2149050 2041652 1970224 2170625 2364216 2302839 2191226 1985656 1833225 1748835
13157 1748835 1595740 1604532 1895685 1925094 1986677 2098752 2232593 2339832 2360860 2120071
13147 2120071 2076402 2052463 1951970 1819895 2000581 2206092 2209215 2140495 2261730 2273777
13137 2273777 2256126 2267184 2334782 2210191 2073282 2199561 2344998 2292883 2302162 2146979
13127 2146979 2132526 2459227 2608669 2427587 2256355 2127555 1963149 1989380 2174981 2462502
13117 2462502 2390427 2622645 2603065 2302675 1871127 1653650 1854144 1864959 1582789 1842305
13107 1842305 2193132 2381312 2196061 1884298 2066636 2115987 1999174 1711013 1781047 2015813
13097 2015813 2177980 2114361 2066475 2118528 2270357 2312858 2187008 2091721 2176445 2358215
13087 2358215 2453191 2215191 2311052 2395012 2243463 2029782 2096118 1947003 1994513 2088702
13077 2088702 2105121 2193776 2165060 1890428 1870580 2157038 2419858 2398777 2431464 2494257 2339426
13066 2339426 2170550 2252325 2495494 2497542 2598521 2885623 2691271 2631215 2472791 2395765
13056 2395765 2277922 2054703 1990437 2276399 2387308 2594523 2585991 2668256 2759520 2676133
13046 2676133 2573766 2385569 2432453 2526108 2761926 2789762 2780108 2609439 2386807 2068803
13036 2068803 2132267 2200007 2559923 2636600 2555207 2877052 3076452 2987304 2680754 2425918
13026 2425918 2443529 2602380 2708637 2702919 2893340 2994080 2834670 2950723 2735927 2769020
13016 2769020 3157428 3038339 2884896 2918755 2889774 2792455 2819812 2771707 2727381 2588392
13006 2588392 2715089 2731134 2704673 2750635 2853669 3007752 3000302 2945406 2814704 2722024 2505318
12995 2505318 2392368 2411334 2559677 2510077 2376265 2517619 2650070 2679150 2765173 2820836
12985 2820836 2897663 2899787 3073952 2845760 2699181 2664231 2511213 2717610 3056389 2992046
12975 2992046 2805284 2770761 2721433 2575733 2543441 2832216 3007203 3036621 2925339 3106030
12965 3106030 3179166 3032730 3088356 3048116 3037241 2930471 2918289 2800156 2857697 3027011
12955 3027011 3020541 2838437 2999114 3096708 3173330 3222346 2867161 2672050 2748102 3126466
12945 3126466 3249826 3241569 3163095 2985745 3023966 3054998 3204345 3235346 3179054 3270809 3086112
12934 3086112 2933560 2973099 2859179 2697440 2660691 2781731 2961069 3186942 3082310 3029220
12924 3029220 3067481 3096906 3326594 3438655 3234853 3156291 3227586 3291569 3034899 3010664
12914 3010664 3189784 3126714 3191857 3299786 3177216 3117624 3171985 3224610 3364795 3497125
12904 3497125 3575591 3629604 3500950 3151121 2957062 2971705 2910948 2979091 3234601 3284754
12894 3284754 3163126 2867223 2980761 3211112 3224432 3430428 3322301 3150974 3044833 3216771
12884 3216771 3421650 3373251 3398271 3680784 3664623 3557176 3521838 3567439 3504442 3427792 3501911
12873 3501911 3608033 3486657 3555862 3326244 3382580 3421446 3349553 3279283 3331918 3574907
12863 3574907 3578777 3462001 3317201 3480223 3389337 3638834 3769049 3625804 3432693 3284963
12853 3284963 3258875 3396812 3442992 3455307 3579153 3577775 3385253 3162494 3548794 3827566
12843 3827566 3939079 3720613 3463900 3440942 3277565 3128357 3300379 3373384 3557352 3640452
12833 3640452 3548909 3507014 3508699 3334071 3603268 3588802 3643102 3901976 3907686 3652246 3569557
12822 3569557 3682327 3642535 3463870 3533992 3644354 3791083 3834863 3968979 4030990 4228299
12812 4228299 4117162 4132847 4114985 4073800 4383468 4308471 4178676 4268769 4234411 4085131
12802 4085131 3723163 3919869 3911710 3923099 4090269 4286666 4198823 4126090 4363590 4364399 4174062
12791 4174062 4152426 4115507 4148853 4287781 4187866 4213784 4149901 4138063 4133541 4290380 4613662
12780 4613662 4567568 4295243 4043319 4113485 4099800 3897162 4123363 4430428 4444353 4494558
12770 4494558 4472469 4591516 4435034 4218991 4326296 4438898 4451996 4494531 4397196 4546345
12760 4546345 4651927 4695039 4510534 4480037 4508398 4475330 4435400 4458556 4468621 4644382 4410789
12749 4410789 4370221 4348133 4475638 4510949 4313954 4240539 4305737 4340809 4572752 4521137 4672171
12738 4672171 4776801 4726558 4611386 4710883 4535487 4746561 4770970 4804287 5161716 5156664
12728 5156664 4995920 5012540 4997570 4839010 4850522 4854414 5048565 5095556 5072033 5243865 4963851
12717 4963851 4817255 4585556 4654840 4998916 4931874 4735075 4815040 4685214 4929780 5304621
12707 5304621 5379389 5051336 5000211 5151886 5003978 4876566 4998984 5111071 4969262 4937787
12697 4937787 5119538 5337954 5347322 5307228 5100336 4929615 4803239 4735217 4999565 5034694
12687 5034694 5026949 5151333 4919349 4837204 5012689 5227445 5346640 5453186 5588287 5433421
12677 5433421 5142419 5088875 5135804 5076693 5194785 5014965 4927505 5073792 5371076 5410159
12667 5410159 5501498 5440037 5421123 5410656 5343881 5127728 5112423 5311791 5426135 5389439 5200930
12656 5200930 5199621 5397563 5439636 5408832 5321032 5545019 5559184 5712671 5818541 5657602
12646 5657602 5203373 5252487 5593139 5754978 5823474 6083884 6051670 5928440 5772613 5765183
12636 5765183 5686796 5734241 5951070 6060194 5938928 5925146 5908846 5800443 5845458 5845438 5582454
12625 5582454 5669680 5755958 5584364 5715942 5907193 5946640 5967387 5739439 5919191 5850900
12615 5850900 5844757 6199931 6444114 6563469 6670445 6318880 5912434 5997012 5872850 5775439
12605 5775439 5948958 5986587 6160685 6395250 6520412 6576588 6431857 6315276 6295767 6268172
12595 6268172 6227404 6216578 6135429 6403784 6639125 6530199 6459088 6465087 6543147 6666695 6622972
12584 6622972 6482970 6412337 6626707 6799191 6822090 6639757 6460693 6459840 6793868 7060144
12574 7060144 7010223 7043931 7302791 7288475 7057145 7151716 7218246 7197591 7078708 6967734
12564 6967734 6787828 6792514 6961163 7007604 7012162 6663954 6728264 6925510 6736069 6942345
12554 6942345 6874921 6982404 7097869 7166749 7326629 7259830 7357612 7182774 6999310 6916905
12544 6916905 6799918 6802023 7125213 6931557 6858957 7155760 6983814 6902539 7182606 7289766
12534 7289766 7360863 7494246 7546141 7260673 7150550 7143094 7192704 7327356 7512708 7487277
12524 7487277 7551398 7701257 7437006 7171479 7461960 7691624 7664306 7584077 7588429 7478766
12514 7478766 7609045 7970814 7745353 7576377 7851376 7888898 7833686 8078681 8018685 7704682
12504 7704682 7768267 7650346 7497762 7502657 7392762 7537216 7569092 7490880 7487496 7711970 7950997
12493 7950997 8070204 7842224 7863670 8004799 7912739 7649595 7985915 8271416 8095900 7999134
12483 7999134 8064998 8274417 8482965 8411635 8647834 8509124 8285153 8152325 8219249 8570831
12473 8570831 8630248 8795377 8783831 8719767 8766057 8675070 8712254 8621404 8515124 8586566 8591620
12462 8591620 8583144 8580848 8726534 8350966 8239092 8618967 8914785 8942490 9073969 9203409
12452 9203409 9015931 9208207 9043239 8855922 8753695 8687101 8643986 8898695 9093121 9055867
12442 9055867 8596030 8360058 8682874 8985051 8748998 8859146 9146456 9068304 8973543 8917117
12432 8917117 8839232 9067828 9268039 9420268 9484369 9340145 9413619 9512869 9688024 9759347
12422 9759347 9999052 9972826 9869848 10199032 10310383 10043098 9974247 10007480 10088045 10014448
12412 10014448 9922555 9802751 9890886 10028080 9970018 10112583 10066456 10063267 9947357 9734385
12402 9734385 9899540 10011637 10243189 10209205 10106155 9945496 10194216 10235132 9962462 10119773
12392 10119773 10164522 10035804 9972813 10202295 10316295 10416164 10425881 10406861 10289466 10463943
12382 10463943 10522191 10403485 10149184 10292028 10411658 10542120 10684181 10830360 10871485 10733610
12372 10733610 10676845 10863463 11069004 10973155 11152364 11228467 11005214 10888750 11049611 10883779
12362 10883779 10886452 11061804 11123445 11220826 10979416 10899295 10978815 11239560 11303383 11185412
12352 11185412 11285370 11403565 11473619 11639089 11577729 11604202 11581368 11603209 11568266 11672629
12342 11672629 11913529 11776055 11612873 11605115 11876906 12074749 11948786 11719292 11828467 11975292
12332 11975292 11896331 11732293 11803255 11945329 11816407 11673210 11786483 11982955 11995631 11941447
12322 11941447 11798332 12021439 12145486 12271352 12167677 12124157 12182702 12279155 12587075 12642503
12312 12642503 12653249 12630800 12433706 12350419 12438360 12780946 12788535 12592689 12504859 12327674
12302 12327674 12297842 12364076 12283295 12339051 12310115 12368640 12200805 12437227 12748790 12966123
12292 12966123 12855042 12826851 12758914 12720807 12825812 12739006 12638472 12751005 13067690 13158183
12282 13158183 13265354 13266147 13303221 13368055 13460782 13450415 13415136 13576190 13627947 13507203 13568544
12271 13568544 13516492 13512343 13464038 13501352 13442035 13370998 13439651 13449615 13520531 13412766 13283381
12260 13283381 13572651 13924234 13866296 13682985 13818266 13897863 13860597 13961129 14183484 14149889
12250 14149889 14221830 14062009 14082328 14229921 14362373 14242135 14136538 14092869 14156520 14265939
12240 14265939 14101966 13833780 13802044 14022823 14226945 14266767 14205620 14196822 14265123 14510352
12230 14510352 14627488 14385383 14488891 14533172 14632936 14746106 14644501 14771026 15080683 15323018
12220 15323018 15556517 15603184 15427063 15292456 15215810 14932947 14731961 14796709 14977609 14927520
12210 14927520 14943054 14723016 14770203 15031177 15185564 15311317 15239794 15165394 15062933 15313643
12200 15313643 15549608 15559804 15359034 15373498 15125396 15190666 15180204 15096740 15183834 15211118
12190 15211118 15293073 15456785 15653217 15700832 15834646 15898814 15979284 16000478 16072566 16088688
12180 16088688 15905627 15966971 16211370 16107316 16210452 16098850 15964838 15737292 15653046 15756302
12170 15756302 15858723 15771372 16055140 16154445 16421416 16483538 16360680 16212787 16156455 16240989
12160 16240989 16457717 16729965 16610222 16468646 16368574 16280573 16263986 16307576 16508172 16581558
12150 16581558 16668398 16570181 16536239 16703317 16750326 16696216 16382220 16293724 16256325 16471023
12140 16471023 16540464 16432355 16629502 16553814 16508383 16364588 16304612 16374629 16306703 16371276
12130 16371276 16294058 16320849 16540892 16612489 16672544 16654758 16800172 16700507 16418449 16409251 16677973
12119 16677973 16808972 16618420 16409248 16461365 16529960 16668001 16886323 17065873 16994080 16937245
12109 16937245 16848498 16833372 16578388 16533491 16681305 16964908 16966438 17044421 17003983 16832769
12099 16832769 17042945 17199019 17321961 16975613 16701501 16745667 16825127 16654229 16633277 16872885
12089 16872885 16839850 16925501 17135360 17224803 17182910 17110474 16994633 16938875 16959567 17024294 16939687
12078 16939687 17040359 16988681 16985641 17166264 16970095 16695521 16812791 17097893 17348771 17555183
12068 17555183 17469270 17373689 17385673 17375424 17154304 16988561 17166264 17213720 17236748 17265182
12058 17265182 17003799 16816703 16776877 16541707 16681529 16878127 16758357 16807363 16760414 16742525
12048 16742525 16792060 16847569 16667100 16724176 16713882 16585041 16727045 16789734 16737390 16964786
12038 16964786 17083350 17050174 17029080 17124170 17021389 17003229 16972187 16851294 16514023 16525559
12028 16525559 16493080 16471372 16542116 16582796 16812219 17071200 17070355 16996147 16916242 16698097 16879826
12017 16879826 16963175 16800995 16689948 16429037 16423586 16495826 16326011 16322435 16623999 16472615
12007 16472615 16430541 16470288 16293357 16442134 16395165 16260811 16336579 16447045 16648774 16569507
11997 16569507 16588052 16400752 16119606 15975997 16109921 16005232 16110596 16078538 16112332 16174320
11987 16174320 16306699 16540689 16484175 16257330 16199247 16048005 15869444 15880929 15909924 16079962
11977 16079962 16102571 16227510 16253564 16159397 16071968 16032498 15956631 15914846 15971294 15935212 15891450
11966 15891450 15922216 15834216 15607562 15349049 15345834 15630266 15677451 15620045 15552435 15480741 15559524
11955 15559524 15497247 15531633 15574398 15530312 15438743 15253946 15295830 15324729 15425103 15488095 15408203
11944 15408203 15441717 15296147 15439383 15579047 15767229 15730663 15485818 15203082 15333865 15291437
11934 15291437 15176393 15109196 14961389 14974315 14817666 14886522 14971346 14990039 15082058 15006089
11924 15006089 14969284 15109432 15104617 15002851 15075841 14922072 14642586 14663834 14720640 14648809
11914 14648809 14622956 14690320 14581883 14357542 14175018 14192128 14420260 14308232 14354062 14373535
11904 14373535 14304474 13949716 13780784 13953656 14204905 14041336 13987161 13779218 13899128 13854827
11894 13854827 13894822 13897728 13828850 13716819 13818854 13977015 14023269 13924273 13886762 13840456 13876978
11883 13876978 13778297 13447900 13397597 13576506 13339171 13371181 13447408 13355872 13473243 13730455
11873 13730455 13851852 13878771 13985488 13839171 13569342 13370083 13445645 13331337 13088541 13024927
11863 13024927 12823807 12727879 12792342 12969938 13031175 13202731 13250615 13240187 12853585 12571452
11853 12571452 12764631 12765473 12787666 12744612 12654196 12409152 12198403 12230930 12247906 12236176 12147240
11842 12147240 12260166 12541193 12720358 12777955 12710089 12648517 12712875 12511649 12114156 12072553
11832 12072553 12068849 12255252 12323320 12117413 11886213 11664490 11707955 11710959 11699123 11665985 11689777
11821 11689777 11878045 11833350 11757845 11684019 11746499 11928492 11986511 11613318 11594246 11690920
11811 11690920 11549606 11631457 11666369 11471119 11380421 11559906 11662474 11563407 11425170 11245554
11801 11245554 11363413 11515735 11493923 11390650 11261174 11232241 11308030 11165271 10756918 10620676
11791 10620676 10655992 10708657 10873538 10896860 10664671 10470030 10636180 10650495 10445103 10385216
11781 10385216 10284283 10229536 10730996 10791980 10802168 10561442 10531913 10718105 10638803 10643150
11771 10643150 10562493 10339688 10226110 10321590 10412686 10441875 10479368 10416434 10429584 10274946
11761 10274946 9890978 9844618 9909451 9973737 10124387 10131784 10029319 9913695 9961956 9883699
11751 9883699 9746020 9535370 9631907 9711329 9760754 9842411 9803621 9826985 9833688 9757452 9653958
11740 9653958 9718927 9752701 9670760 9298296 8905233 9282897 9582412 9558072 9414869 9224476
11730 9224476 9204190 9158889 9087313 8854818 8622329 8853232 9062170 9236854 9202364 9088600
11720 9088600 9092334 8944555 8864700 9130571 9155466 9090631 9095520 9035219 9096116 8978320 8898358
11709 8898358 8830335 8628989 8657106 8837608 8792678 8806471 8548090 8380370 8417081 8375016
11699 8375016 8332717 8416140 8416115 8582660 8553534 8415518 8564925 8746476 8753429 8543683 8420805
11688 8420805 8559475 8557755 8377638 8032722 8051037 8038764 8001714 8058656 7956949 7939435 7908094
11677 7908094 7844988 8003589 8026780 7887710 7774827 7718720 7745360 7644003 7876426 7921594
11667 7921594 7738601 7837424 8068457 7786868 7561599 7643726 7553601 7679282 7902490 7986033
11657 7986033 7990210 7816593 7469685 7505121 7350469 7278414 7495944 7411354 7424968 7327414 7348026
11646 7348026 7463410 7064209 6950115 7120653 7165157 7279554 7380310 7210050 7108114 7100284
11636 7100284 7170134 7294493 7179296 7041029 7041719 7041913 7000144 7116296 7153998 7176239 7217165
11625 7217165 7376712 7355185 7064396 6739078 6611834 6597792 6531952 6816874 6768552 6602593
11615 6602593 6654171 6758726 6970556 6996107 6978616 7013131 7009756 6827721 6746486 6560059 6533684
11604 6533684 6375451 6095239 6080353 6057068 6327648 6465483 6357607 6055484 6178265 6487214
11594 6487214 6569653 6473113 6362057 6545980 6702229 6471256 6385755 6524162 6546397 6566834
11584 6566834 6549782 6581794 6661780 6389973 6253574 6157216 6151814 6220013 6166107 6028835 5913346
11573 5913346 5851282 5745790 5726727 5746671 5906302 6142499 6195398 5950818 6091957 6209929
11563 6209929 6125105 5911100 5934332 5983144 6004643 5883885 5919844 5870913 5603730 5533963 5458589
11552 5458589 5530711 5763502 5645220 5664584 5794690 5843033 5605358 5466510 5217205 5296709
11542 5296709 5537861 5554131 5534533 5480980 5486976 5463288 5185844 5065828 4948460 5138824
11532 5138824 5344334 5144962 5196433 5109953 4942983 4864041 5009690 4964520 4711600 4861592
11522 4861592 5209442 5039231 4856591 4840806 4909509 4856012 4852216 4683907 4699278 4836491
11512 4836491 5178200 5290544 4838115 4739253 4977794 5166914 4929985 4623079 4612643 4612482
11502 4612482 4688340 4554170 4503595 4412328 4298390 4558182 4670574 4925778 4910540 4734749
11492 4734749 4445335 4351074 4305149 4173197 4196818 4225444 4154635 4112714 4128707 4238928 4308121
11481 4308121 4362847 4183890 4220079 4235350 4410233 4214314 4083798 4176633 4361087 4628920
11471 4628920 4630905 4605177 4644811 4699878 4719300 4693902 4679162 4421544 4168053 4217244 4452309
11460 4452309 4312800 4171461 4155287 4059477 3821643 3682856 4043715 4415080 4447733 4388080
11450 4388080 4178402 4024233 4106155 3883836 3938588 3912736 3844391 3823088 3846838 3854387 3779470
11439 3779470 3693753 3599849 3625923 3861456 3861802 3916342 4025496 3992807 3844377 3866427 3630484
11428 3630484 3492650 3454837 3553599 3734195 3908129 3978641 4161776 4164135 4149694 3992004
11418 3992004 3867912 3935359 3859883 3850868 3727398 3660029 3627543 3654285 3574673 3493742 3483287
11407 3483287 3403430 3082025 2977519 3203028 3565144 3742073 3816365 3781311 3500257 3331180
11397 3331180 3136651 3228091 3489456 3826018 3895949 3670362 3574995 3681172 3807144 3753856
11387 3753856 3392923 3328495 3368259 3394027 3644245 3523682 3383474 3474596 3954292 3876554
11377 3876554 3825038 3753915 3628151 3487167 3509157 3425947 3326552 3351159 3236270 3292802 3244904
11366 3244904 3619691 3651784 3438951 3223926 3417788 3299035 3238446 2974179 2877913 2904303
11356 2904303 3108909 3113514 3099747 3034968 2849213 2866593 2799443 2812079 2930180 3052504 3023645
11345 3023645 3008055 3063967 3152220 3247370 3090152 2930434 2917413 3069253 3189564 3130523
11335 3130523 3103370 3207689 3066161 2633686 2657674 2829419 2869447 2898228 3148587 3420136
11325 3420136 3381820 3221516 3191159 3578102 3615203 3370113 2891723 2763369 2712881 2764445
11315 2764445 2736166 2598254 2628389 2811588 2791604 2753500 2856120 2879884 3115364 3105689 2929708
11304 2929708 2782742 2762827 2806567 2811829 2768361 2876830 3069861 3121640 2975372 2771435
11294 2771435 2784190 2756376 2778086 2725601 2552473 2481177 2575267 2817743 3199437 3086619
11284 3086619 2913714 2821221 2831139 2814831 2736059 2847074 2825584 2775320 2794339 2561469 2657654
11273 2657654 2738603 2908294 2824641 2593762 2497428 2639835 2584876 2588419 2747680 2800206 3189404
11262 3189404 3263334 2923075 2777998 2677525 2787908 2582727 2342719 2192023 2088777 2255271
11252 2255271 2380541 2384282 2599490 2717810 2765624 2593642 2438274 2508522 2424302 2553440
11242 2553440 2733421 2528864 2454311 2320986 2192312 2129307 2301732 2264682 2284567 2400561
11232 2400561 2569500 2384359 2316840 2344593 2421865 2451004 2374989 2325924 2181434 1947007
11222 1947007 1748008 1908422 2244105 2489669 2375061 2200047 1888704 1720764 1812173 2144338
11212 2144338 2263859 2239304 2236635 2320415 2482659 2372023 2289679 2353696 2202121 2087344
11202 2087344 2093130 2074614 2133806 1960213 1927499 2133593 2358015 2347489 2226036 2207752 2349294
11191 2349294 2123216 2056856 2098914 2227212 2404961 2611548 2592096 2482892 2261547 2338312
11181 2338312 2361720 2400055 2313496 2283778 2129787 1898069 1956948 1892067 1917350 2163828 1973226
11170 1973226 1834906 2000157 2027713 2185802 2234254 2207471 2097145 2144018 2207819 2201303 2269835
11159 2269835 2088217 2408182 2378223 1999855 1799117 2001128 2111739 2001854 1990939 1866232
11149 1866232 1749904 1777285 1799469 1973911 2044834 2040241 1987428 2049017 2043998 2358179 2418314
11138 2418314 2084678 1919611 2069237 2021053 1966316 2050869 2114113 2103574 2086044 1992861 1981681
11127 1981681 1868138 1634786 1629398 1889309 1799892 1819176 2224381 2228122 2130837 2170027 2007524
11116 2007524 1797869 1939024 2084757 2088406 2000763 2014090 2046578 2103125 1960553 1819964
11106 1819964 1621168 1902036 1910913 2024421 1790004 1357476 1410752 1260774 1233195 1336344
11096 1336344 1432450 1597105 1602294 1469958 1534859 1374224 1405167 1684993 1685506 1791202 2190221
11085 2190221 1980632 1650500 1649763 1700128 1862033 2054701 1795034 1640663 1577683 1442359
11075 1442359 1481359 1345857 1325670 1247028 1237092 1218115 1405073 1417034 1262506 1381639 1501003
11064 1501003 1806857 1986776 1976791 1843620 1746570 1770637 1750524 1781430 1694894 1399604 1206711
11053 1206711 1328014 1272778 1299943 1257802 1514227 1753279 1789814 1551073 1634840 1695335
11043 1695335 1621573 1850445 1787398 1580587 1908744 2295420 2249622 1997751 1926254 2036971
11033 2036971 2126674 2324548 2575778 2667767 2674437 3160015 3392851 3497763 3316666 3272854
11023 3272854 3336121 3482228 3110669 2816691 2753113 2762765 3171894 3516792 3814375 4102827
11013 4102827 4120059 4004934 3909579 3572560 3259667 3221030 3151645 2946278 2969649 3082377
11003 3082377 2989493 2775568 2694625 2975858 2875724 2639789 2308013 2413426 2557306 2508245
10993 2508245 2537736 2395692 2161072 2095379 2005427 2046625 1866618 1884372 1909555 1840723 2106094
10982 2106094 1998550 1757785 1587849 1522057 1542407 1699724 1757584 1724780 1741207 1817772
10972 1817772 1640746 1445706 1353779 1423607 1374009 1455020 1626679 1525650 1429184 1656887
10962 1656887 1625474 1392465 1288452 1288331 1341672 1364298 1602353 1706975 1875360 1630520
10952 1630520 1244201 1044998 874383 858039 892584 952577 1113411 1141524 1303253 1268627
10942 1268627 1144105 1281437 1253435 1144182 1206430 1232998 1351963 1295274 1174455 999537
10932 999537 876200 855064 1019078 1399532 1568720 1506346 1262730 1094875 982187 994742
10922 994742 876414 931230 930376 875666 864541 880419 898718 1039363 1152851 876158 754850
10911 754850 950750 1291571 1212005 961958 797733 745587 839210 842212 666121 585529 800767
10900 800767 943320 898968 887575 840960 806866 687531 568514 705236 615392 533140 596010
10889 596010 584649 471345 530697 617054 686394 634767 912063 875682 874470 837776 757376
10878 757376 979670 958591 931259 1189896 984912 945093 971734 905742 1046827 1144594 1157255
10867 1157255 1031167 888489 959660 985971 1033359 1107406 1052308 830385 1041944 1155892
10857 1155892 1165039 1023060 699912 731432 855832 901354 744769 886187 985609 1074525
10847 1074525 903661 982873 1239142 1053921 894285 769252 1085553 1433424 1483007 1458029
10837 1458029 1396752 1481523 1445597 1280585 1215136 1152151 1256963 1431293 1640226 1530623
10827 1530623 1156083 1015506 1264285 1610725 1557627 1596856 1338808 1260445 1182414 1181589 1400695
10816 1400695 1552769 1554974 1472258 1416252 1452138 1176311 875448 915532 1050683 1077310 1249267
10805 1249267 1437164 1760412 1683310 1398205 1183607 1275134 1342084 1272239 1379448 1342022
10795 1342022 1414869 1330746 1312436 1203110 953198 914823 1165259 1395538 1533720 1231757
10785 1231757 953908 722129 717450 807490 774743 791528 839865 906231 1049142 1105237 1026320
10774 1026320 866147 815926 738244 717701 804736 869683 790979 793981 554945 568483 556943
10763 556943 532929 617745 578944 476730 398419 763356 823313 780029 667052 451623 382682
10752 382682 443285 658968 447983 219942 342072 350405 455285 624282 677992 694696
10742 694696 617662 485130 451678 574656 825331 1156942 1288062 1417715 1583115 1738332
10732 1738332 1648490 1681602 1452993 1250207 1264756 1577204 1856062 2098489 2213377 2308184
10722 2308184 2338134 2657728 3048130 3325528 3442755 3048440 2884774 2762886 2890822 2900547
10712 2900547 3123371 3418088 3726776 4134423 4300647 4116545 3838137 3273793 2941714
10703 2941714 2615138 2613092 2776688 3177281 3385865 3652927 3636136 3306291 3072753 2870076
10693 2870076 2533413 2451512 2607882 2608964 2641490 2645597 2504474 2280434 2195653 2134727 1994599
10682 1994599 2056795 1908506 1697399 1535597 1451289 1491473 1339098 1352616 1342253 1513576
10672 1513576 1544093 1609762 1486740 1606117 1677367 1642752 1515657 1543836 1527998 1615677 1513396
10661 1513396 1448794 1405349 1269279 1269090 1433551 1351702 1473875 1640074 1884480 2054890
10651 2054890 2104000 2105760 2233703 2621808 2917087 2786417 3026956 3331437 3702579 3927557
10641 3927557 4041806 4082082 4081863 4058027 3665450 3379992 3424174 3622019 3519395 3849193
10631 3849193 4366179 5051412 5966932 6833768 7960284 9116013 10289158 11384897 12489974
10622 12489974 13370149 14372948 15282789 16284724 17854787 20395543 24086440 29244316
10614 29244316 35851733 44937897 56482687 70539190 86102979 101249619 114306127
10607 114306127 125462446 134204490 139828806 142131355 142610209 145444522 153808511 169649645
10599 169649645 193313347 221488017 248190745 270044443 286571385 297223172 299501784
10592 299501784 291871587 279131033 270375428 272568873 288709975 316544208 349763091
10585 349763091 379938975 402394242 416013347 419424905 408979939 382942227 348861259
10578 348861259 319275220 301608272 297736908 305004574 317233727 327904839 333544458
10571 333544458 333582184 326886043 310684639 284564550 254683034 228382589 210332595
10564 210332595 201090535 197598447 196409591 195125026 192203885 186608751 177899350 165459955
10556 165459955 149465026 132312484 116131124 102769311 92306825 84320893 78107621
10549 78107621 72972888 68688394 65305413 62417450 59679866 57146211 54739703 52488159
10541 52488159 50677448 48856620 47151551 45473587 44041418 42978532 41689120 40526163
10533 40526163 39361780 38547293 37430223 36419227 35596545 34870110 33879807 33027980 32120830
10524 32120830 31302166 30465658 29901904 29245053 28418967 27651995 27081163 26560739 25691752
10515 25691752 24943642 24318216 23837066 23459913 23055165 22515286 21899799 21459364 20896303
10506 20896303 20279628 19932437 19448704 18873850 18468073 18057494 17691966 17266859 16973143
10497 16973143 16469016 16032692 15609303 15307681 15056093 15009408 15012286 14880517 14952280 14566979
10487 14566979 14235015 13911122 13964200 13918798 13692509 13603660 13610456 13556670 13386983 13382234 13222878
10476 13222878 13053941 12810105 12899389 13039158 13044904 12860025 12898165 13066754 13164359 13246975
10466 13246975 13233296 13221247 12881624 12525955 12188270 11952473 12211431 12451452 12650251 12890309
10456 12890309 12870222 12814194 12730587 12429375 11975785 11568261 11206826 11069944 11162680 11031308
10446 11031308 10931568 11173480 11369765 11228830 10859483 10610855 10164694 9544240 8941635
10437 8941635 8695538 8438662 8048671 8287512 8285751 8149757 7997846 7668894 7436171 7057789
10427 7057789 6988121 6787993 6379059 6296084 5997817 5472726 5352266 5457039 5563555 5493172
10417 5493172 5431237 5241552 5336538 5633511 5543498 5229964 4989070 4836071 4555328 4520461
10407 4520461 4889032 4979658 4733293 4561699 4500562 4304671 4130893 3974603 4141744 4297263
10397 4297263 4066330 3975699 3931035 3697625 3457983 3582953 3396216 3183032 3080093 3155202
10387 3155202 3389831 3621242 3763490 3482512 3389486 3363365 3294860 3124330 2677105 2629637
10377 2629637 2545647 2622506 2705995 2900120 2878049 2536768 2195067 2108817 2269047 2233769
10367 2233769 2059568 2068506 2046662 2185387 2257387 2140693 2176531 2213312 2120811 2103426 2167930
10356 2167930 2170767 2017540 2217276 2143879 1894663 2018757 1958031 2031154 2037918 1920182 1924187
10345 1924187 1881984 1828370 1774940 2022239 2067130 1738782 1674557 1821308 1989134 2078912
10335 2078912 2083147 1959863 2145336 2147910 2132207 2224204 2260414 2397662 2753048 2945555 2825043
10324 2825043 2710287 2668640 2407333 1969343 1892595 1719274 1687064 1722376 1821465 1794543
10314 1794543 1771839 1492442 1380931 1260102 1493622 1483373 1508278 1507592 1453265 1660186 1873929
10303 1873929 1573199 1372352 1249866 1272399 1521224 1413508 1290914 1291259 1503782 1734716
10293 1734716 1765515 1620355 1621484 1772222 1752724 1834779 1759301 1545375 1293875 1340951 1141993
10282 1141993 1011449 1020785 1011498 786150 759991 1018272 1160121 1407409 1489151 1579436 1371796
10271 1371796 1279086 1283080 1039611 839569 1020869 920686 835828 895894 1020620 1100064
10261 1100064 1079942 1089704 1131300 1110941 742807 886297 984558 888692 623998 530265 836610
10250 836610 1027786 983042 792588 511446 484019 369669 194412 651094 790878 869194
10240 869194 799610 551063 654687 784482 655616 418531 534071 858727 1017306 888067
10230 888067 899229 724087 642748 540757 645954 687164 550041 522532 421377 611788
10220 611788 842150 801167 692029 544937 349981 259468 409246 503411 396543 376604
10210 376604 497586 448073 427702 394614 600863 707229 861882 863711 670275 578021 762140
10199 762140 884564 697667 620900 450531 428650 602294 516351 362595 208023 385295
10189 385295 612001 671507 529377 463261 603563 698827 780225 602433 710811 621718
10179 621718 515314 577411 837683 1174791 1279501 1264029 1072286 1196920 1352684 1448250
10169 1448250 1521473 1431202 1464604 1537863 1336066 1323480 1343129 1407097 1639697 1821848 2162550
10158 2162550 2245825 2539174 2631916 2440690 2280194 2251780 2309250 2392413 2341686 2616344
10148 2616344 2706469 2694931 2998900 3181666 2961952 2790300 2734905 2510054 2508026 2496458
10138 2496458 2391055 2354337 2517898 2595480 2645632 2442769 2145012 2081426 1964899 1965980
10128 1965980 1799081 1705805 1316935 1207830 1404808 1509051 1367643 1192191 1056788 1002125
10118 1002125 1168743 1353191 1382117 1290566 1041994 1070148 771673 570719 636044 941263
10108 941263 1103367 985485 834090 848723 869884 763222 744853 634851 793528 927272
10098 927272 785805 567077 283104 489639 823465 672160 616539 798025 799163 564277
10088 564277 509882 471179 341637 472433 669475 973947 972828 689062 563695 534071
10078 534071 699950 847809 899625 976934 954419 1111176 999010 554785 406545 371802
10068 371802 424774 234225 366597 683496 849444 894229 702980 332989 173537 30494
10058 30494 -177551 -48176 196962 505716 623891 587243 727205 905283 716502 667265
10048 667265 768398 818463 672219 607798 685396 842324 750792 760820 717567 694434 672435
10037 672435 763641 793896 676285 645344 474978 413459 243958 81512 74279 42020 187359
10026 187359 244365 425423 494837 502211 488235 344699 398849 567175 882924 663692 629621
10015 629621 819235 617192 593229 721954 877554 613618 349097 456838 402972 270487
10005 270487 299853 236946 182573 225475 326797 622025 849109 632841 339065 230661
9995 230661 308745 329775 398856 35927 -23944 73887 69705 -75920 202214 359654 321403
9984 321403 336598 281713 144857 75774 318664 300849 335954 624764 549734 300608 -3072
9973 -3072 68164 9346 132686 343774 213935 66953 56571 102590 93751 240232 269256
9962 269256 331286 288548 238425 426765 457175 511356 584675 544421 524761 427495 215927
9951 215927 240450 366729 373109 351328 440887 387530 192614 174561 5390 -103325 -102166
9940 -102166 -2222 -18644 126128 145360 -96638 93399 203140 30639 71955 109575 235578
9929 235578 462432 415547 203936 14161 148812 83280 128764 361372 421170 270410
9919 270410 227840 284312 340137 380249 227724 326869 467103 540378 570124 656337 855254
9908 855254 856481 591692 486832 175948 -150250 138199 274219 365050 352825 426695 462420
9897 462420 611455 510774 552837 870210 858819 763334 518242 432327 550641 565332 393657
9886 393657 610821 386551 168038 83212 -33510 -107193 29500 234387 453261 462723
9876 462723 332736 235344 -8661 -135336 -63240 67071 134725 33990 -39398 149891
9866 149891 390851 537856 491997 515066 399959 166937 189128 279371 237145 150968 281520
9855 281520 522673 558918 613443 594178 495959 413090 720253 622647 172765 125217 243758
9844 243758 359061 426251 554836 377677 38115 -26489 -14702 279957 602104 322399
9834 322399 151716 125755 130433 267392 88631 99926 344569 357588 266810 -15673 205837
9823 205837 365873 341131 208902 62919 -91412 -151538 -339157 -298294 -172430 -23997
9813 -23997 33574 41700 82819 85304 161864 305104 424636 320636 -51481 -184595 154441
9802 154441 188762 208548 349760 415130 528925 674124 502964 356732 138781 19407
9792 19407 176826 318617 158197 113790 -62812 21634 209039 177826 40489 -72542
9782 -72542 -104533 90220 212417 323314 493263 510052 306242 145203 175838 171078 -142109
9771 -142109 -82797 126171 342294 447082 565187 369647 112726 56367 364400 567077
9761 567077 381733 339306 287012 51136 130690 63229 -150166 25614 286602 411149
9751 411149 429106 382107 455911 331153 276526 336738 188011 190936 198554 514818 823431
9740 823431 696953 410341 457114 426751 444250 273669 198388 229622 344828 454672 577255
9729 577255 564411 416412 250032 422857 587841 650355 789090 677528 581391 564201
9719 564201 544233 523119 335628 249069 141521 94463 -53953 -70981 117870 375746 731399
9708 731399 817349 592758 376970 36630 -51424 268855 365539 344755 306524 188015 343983
9697 343983 533219 651924 430488 1767 74404 39151 27466 74777 337145 375012 271734
9686 271734 229359 122141 119808 113542 -280664 -355231 -193464 102497 290316 308700 220609
9675 220609 126029 43329 39147 271267 408559 83430 67557 80819 -46740 -152364 71642
9664 71642 152138 -23571 19600 300569 240389 142967 240573 350581 342959 359290 241493
9653 241493 284778 276544 -43968 -3222 23611 117221 225026 241252 128038 288648 542862
9642 542862 755773 951761 1211739 1408865 1716148 1719407 1392329 918717 551110 387800
9632 387800 319211 433226 401488 211729 149401 328531 425115 565567 457494 277125
9622 277125 125691 244700 204295 293089 389700 249566 124087 359563 247706 289877
9612 289877 381927 378584 304285 475907 653086 707429 253257 86240 139827 202061 111257
9601 111257 161037 316923 359375 414817 321853 339797 405231 186740 29686 24642 28082
9590 28082 91694 -58339 35883 172615 436250 303312 269032 289995 144188 370400 485380
9579 485380 538824 718074 532588 500218 423812 290521 -3172 113122 318106 192876
9569 192876 103170 81408 119801 199544 142309 218613 59616 72808 158308 317716 544833
9558 544833 536764 605367 546111 504520 380353 283982 108782 102320 207686 7125 -185418
9547 -185418 111010 226430 92150 113003 210480 134620 103659 208445 311006 303009 88898
9536 88898 -45843 99751 17241 162638 -25737 -214912 45304 252888 150737 -58983
9526 -58983 -103716 -293787 -180110 -178663 -218082 -163245 -13763 144883 106077 -257111 -471494
9515 -471494 -414689 -147986 -62890 -76825 192611 274054 102668 66547 -143656 -357316 -268215
9504 -268215 -169317 -284631 -217906 -310239 -109479 170750 414068 227500 109724 218164
9494 218164 224409 232638 214261 208680 60200 41977 114394 218562 254828 238399 184864 408508
9482 408508 389864 327342 264593 121876 105408 102472 -77483 143942 370929 255140 5888
9471 5888 98951 105034 104990 111695 304357 188223 53852 38764 -5691 -10414 287211 395778
9459 395778 264225 -121201 -254333 -218186 -240743 -146211 -14899 -136156 -241013 -330590
9449 -330590 -320151 -49082 276631 158345 -124672 -191311 -24899 19451 -155982 -212804
9439 -212804 -110406 -44738 -24805 -77742 56446 198416 219053 277946 70270 -191939 -149493
9428 -149493 -151356 -159237 16096 14696 48396 154610 69854 -118414 -11433 -72733 -43280
9417 -43280 79220 353942 33800 -51777 238710 420738 390818 173977 -78993 -67914
9407 -67914 55669 115991 49003 183495 166281 113542 213007 291356 203465 319331 378392
9396 378392 276017 232422 57717 -120151 -45492 273166 245785 207353 -39092 -16396 42380
9385 42380 107016 125980 8705 -191117 -31361 212918 103024 36245 -50442 -49944 51446
9374 51446 17561 109184 107865 314869 282959 108099 -176951 -275871 26387 293002 162319
9363 162319 47436 86479 14227 -126330 -197952 -132896 -52674 -157050 -183951 -301314 -160494
9352 -160494 19186 103927 -79346 -288537 -414952 -371107 -26710 140195 -132978 -202852
9342 -202852 -149229 -210517 -216516 -116469 -95316 114424 -92725 -178697 -153478 -113331 -228094
9331 -228094 -448646 -373757 -273515 -304858 -432345 -463611 -53465 -1314 -250379 -243114 -311971
9320 -311971 -250504 97642 140189 25693 205373 394790 342384 140411 54574 55671 164088
9309 164088 236203 271015 252180 434529 623475 712103 482046 406568 258174 86535 -71754
9298 -71754 -239307 -240990 -268765 -277957 -63584 218999 132601 170849 44491 -8853 68512
9287 68512 264015 112375 54161 209521 345401 96963 -144270 -151394 -34606 399590
9277 399590 360875 210398 22900 5685 -110885 34961 -37196 -20991 -116587 58060 36220
9266 36220 -12566 -8521 30294 -32352 -84563 12780 -156674 18374 156294 197645 231684
9255 231684 74877 -5609 -4346 148915 267211 261051 174052 312469 599785 573411 348939
9244 348939 220118 65521 -103667 -165699 -250227 -19336 96708 190505 47807 -84050
9234 -84050 -71828 173524 11727 -289006 -144021 -410563 -556122 -388752 -433766 -513767
9224 -513767 -509997 -547098 -476428 -282882 -270871 -458151 -372547 -13076 168141 56700 66068
9213 66068 186215 98085 -72411 -174434 -55480 106674 349489 162105 2694 101566
9203 101566 118087 101559 104118 48969 60676 89530 70124 -39173 150766 106824 29079
9192 29079 70829 176806 197262 392655 332478 113572 -42925 -97489 -133922 -8698 37566
9181 37566 205083 411155 377452 133701 37133 -171146 -108446 69203 14574 16829 107453
9170 107453 258634 178568 118646 -67514 192870 285077 255595 164380 266990 244979 396447
9159 396447 400119 387969 266546 -56354 -60592 41858 -80447 -205626 -133629 -185748 -120967
9148 -120967 -171075 -317724 -175389 124751 168665 239046 148121 196225 113012 225729 258700
9137 258700 76299 -42205 -61318 -106541 77487 465324 417659 27440 17757 -68485 -284338
9126 -284338 -101288 161641 163009 34728 55834 53551 97661 166077 10012 -6588 -13301
9115 -13301 165379 164312 204261 198513 178455 400487 377708 376475 301993 72356 -174140 -250797
9103 -250797 -130895 -197377 -113599 -87028 250528 497562 463854 303666 360071 273815 347322
9092 347322 349662 -47658 -189705 91782 41022 -117242 -79412 -29281 -79566 -139600 -87945
9081 -87945 173597 233723 165147 73692 73777 -66252 -84026 -54112 -53698 154234 153852 85852 32611
9068 32611 16167 89712 199704 284374 243966 69738 -91931 33738 301847 195657 -61808
9057 -61808 -113563 -17630 69145 26500 38682 -200709 -275612 -157741 123639 366585 250307
9046 250307 119118 -88997 86657 120929 156286 21428 -20509 -45769 -40688 77044 253998
9035 253998 66324 134897 106237 -60445 -336866 -496985 -249448 61510 63284 97719 101742
9024 101742 -36862 -258202 -199215 172493 318795 35953 -6506 183526 280964 350041
9014 350041 232701 61244 28627 -45637 10953 -4539 -301402 -351005 -345138 -468405 -653892
9003 -653892 -533420 -297234 -399908 -555904 -307154 -164109 -344485 -78292 205629 173490
8993 173490 158830 87463 72995 -96242 62018 110559 -28350 140839 181602 191147 84547
8982 84547 72789 -40838 -164312 -96586 -46440 -104682 -305444 -518993 -670346 -383278 -95507
8971 -95507 -41925 102969 70571 -53140 -214575 -130159 -136371 -195561 -198064 1115 -42181
8960 -42181 -277216 -129094 -71440 65612 58857 -113116 -238208 -293426 -406456 -492679 -518686
8949 -518686 -314850 -99444 -242303 -261491 63367 99511 77894 11819 66955 169263 251139
8938 251139 191782 20689 7525 -119817 -117516 -11456 30351 3073 -107545 -63732 -188470
8927 -188470 -185964 -9234 -62228 -1869 55666 37474 18934 77771 -2912 -30923 -59696 -106948
8915 -106948 53283 33548 71168 50680 67140 223854 -14697 12514 -37256 -175183 -106124
8904 -106124 -289684 -254725 -85004 171156 -5887 -270478 -268460 -254239 1749 3781 76731
8893 76731 108236 141839 12581 -392422 -313911 -131379 60688 115326 139493 -83485 -143414
8882 -143414 -193069 -259292 -287571 -54858 331101 185232 71281 -104257 -23186 167475
8872 167475 249992 337993 296909 327097 397338 283214 292002 260934 272834 471166 259330
8861 259330 -31920 -57683 -18403 -43741 -118207 42145 138555 330278 196799 94033 21420
8850 21420 182783 251113 353385 341571 308925 285031 427308 315312 219641 243910 418945
8839 418945 258881 -3427 -317187 -182704 -10369 -39523 -38327 13450 92223 270509 267016
8828 267016 172017 93505 -62949 -333309 -506521 -249084 -88767 -183124 -269292 -419240
8818 -419240 -156005 -61299 -58043 -95973 -216370 -325621 -412148 -140126 -120133 -140522 -319388
8807 -319388 -258726 -73360 90099 87853 -36751 86756 290908 364117 107985 -12050
8797 -12050 202838 216354 321690 280450 64733 -59910 333395 436456 413110 80736
8787 80736 -161112 -68185 122140 361085 220817 231743 150075 -287452 -482155 -314523
8777 -314523 -285462 -455145 -188241 270615 305925 -67310 -198726 -49826 -158677 -179246
8767 -179246 -269692 -195497 -152941 -182478 -232878 -167848 -76328 -117219 -73553 273638 476723
8756 476723 244068 56879 -105984 -9448 -47023 176619 418099 657872 644151 436860
8746 436860 464188 453864 271358 151521 103982 217285 405536 347354 211321 95559
8736 95559 72818 -163182 -238440 -274946 -65625 -88830 -250628 -258038 -160625 -219880 -286012
8725 -286012 -95069 86585 120385 3680 -220571 -159979 181237 465565 340743 170718
8715 170718 183801 144066 333412 387661 367060 140053 163327 199180 214980 149949 -52061
8704 -52061 -229248 -296493 -107070 84618 215843 421294 186581 99569 -48593 36292
8694 36292 -25214 59331 -123526 -222279 -107596 207467 522914 331810 411456 556898 381038
8683 381038 292320 111613 -150243 -118076 33265 -216692 -324647 -276605 -175171 55590
8673 55590 71218 -121386 -136573 -97914 -115965 -153413 -139375 301309 417459 375004 313449
8662 313449 112345 -87965 144376 419418 387873 216498 -63910 -428157 -279367 -121040
8652 -121040 -198001 -214096 -197789 -204910 30034 72444 -12055 -78856 53166 86215 113008
8641 113008 190770 -47238 -119453 -246969 -344622 -338896 -254566 -211713 -174372 -227891 -306016
8630 -306016 -148886 -121762 -76235 81209 254114 -55372 -231928 -201486 -40693 -102848
8620 -102848 -6870 -38947 43053 -177444 -147243 43595 163876 133435 3518 -23084 -77405
8609 -77405 -187187 -154368 -20634 280201 411561 398543 325309 149154 7749 197463
8599 197463 317610 224338 227461 23876 65815 190136 -242915 -490811 -250161 148045
8589 148045 321378 386409 206648 192507 237083 226614 216712 37837 165469 480493 505923
8578 505923 346190 63287 -22632 -34119 -179396 -316683 -53313 370177 206077 150545
8568 150545 148742 69976 -5134 45058 133391 276114 147065 88018 219612 88242 -37523
8557 -37523 -22367 246135 177678 -347246 -392064 -167281 36112 61446 2804 210365 482903
8546 482903 529267 216166 77335 -3220 -1290 -76052 -20080 32728 -1176 47000 70212
8535 70212 69229 -34232 -137487 -179125 4495 112789 153631 34948 -56062 120253 310393
8524 310393 176942 -56846 -139134 169378 290056 349626 401696 159885 -171928 -238727
8514 -238727 -128389 -9351 58307 -10508 -59666 27838 178347 188101 77422 327809 233390
8503 233390 323785 349771 116295 -121282 -161268 -16249 -19572 -44684 133144 -51388 -210639
8492 -210639 -247281 -64443 -10873 -218342 -386698 -331559 -200395 -185688 5731 170236
8482 170236 161215 94517 -57031 8107 -30196 -360386 -429734 -620334 -618554 -332576 -93581
8471 -93581 -233407 -174852 -206003 -256958 -266700 -308343 -448572 -506918 -432284 -189589 -38861
8460 -38861 -28598 50146 -25519 -4956 -35007 57521 134461 193615 173839 -112265 -403158
8449 -403158 -236417 -407027 -673726 -628237 -337441 -140423 132811 -16949 -131788 33917
8439 33917 15617 -81607 30725 -7008 95965 147193 289832 285170 184559 163010 284603
8428 284603 203345 -13751 55700 71739 83504 -98791 -244592 -204988 -4417 30422 -82274
8417 -82274 33987 147858 155261 289153 321831 409592 459033 185977 115530 221072 2716
8406 2716 -95513 -100673 -118876 -10972 23679 -57858 -266408 -294131 -154412 43061 -3609
8395 -3609 -40144 -8118 8652 -90444 -100547 -280086 -468904 -386272 -152008 -319159 -573951
8384 -573951 -612577 -611653 -326257 -42352 -192046 -103721 55998 45128 93527 246757 266956
8373 266956 78936 -209949 -344450 -67492 -106573 2115 46917 158800 231987 356298
8363 356298 173122 -7931 -129690 -267730 -155724 209249 366929 512110 486995 353217
8353 353217 344567 273287 331372 311523 270785 221018 262341 274947 119244 240526 116831
8342 116831 -57079 -102901 -91281 -28570 -67837 -273713 -278290 -207716 -114981 -142190 -226594
8331 -226594 -240542 -312783 -347874 -278629 -87851 126813 -134620 -245621 -119229 150046
8321 150046 55028 -78358 -79313 96256 250049 346840 395511 280712 261788 43376 -145268
8310 -145268 -222380 -215250 160529 183672 206926 451173 541563 135873 -92949 -44226 -41309
8299 -41309 -111633 -91509 47357 389129 388409 202752 133364 78049 -933 -83835 157527
8288 157527 216428 83259 -66813 -187620 -203580 130858 169538 351073 368771 294372 386667
8277 386667 307374 29484 -202878 -217583 5856 38975 -37689 10228 -22896 -77136 -126621
8266 -126621 -31513 146732 17596 -139321 -356625 -403589 -165473 -113811 -178813 -201853 141781
8255 141781 452799 373358 247866 -39315 -88550 -76614 -38513 -69194 -288363 -431617 -325613
8244 -325613 -173555 -61375 105096 49103 -157536 -79528 -89597 -119749 -184347 -251748 -393561
8233 -393561 -296763 -142703 -117846 -187098 -147178 95735 373534 390322 105996 -173561 -194660
8222 -194660 52382 218079 205454 -5220 -198849 -332700 -471840 -159829 -135379 -73865
8212 -73865 -94802 -13774 10374 -111539 -287762 -592231 -471152 -277682 -18557 141564
8202 141564 -88606 -82801 67905 181538 110540 -89370 -167507 82867 184768 -35357
8192 -35357 -88254 -149132 -65871 59501 -107100 -377171 -624292 -583671 -449363 -271179 -180798
8181 -180798 -453812 -502601 -507951 -452991 -342282 -173806 29965 227712 363311 326034 20977
8170 20977 2903 -289889 -304769 -261613 -393338 -352476 -165536 -156846 36977 -104812 -143400
8159 -143400 123323 160078 -47463 83909 204021 151370 189099 165213 26417 -22086 13364
8148 13364 -53398 -28488 31720 -117112 -34375 70480 -120191 -83997 -17185 14339 -16106
8137 -16106 -121534 -145777 -195628 -143757 23500 -161630 -321917 -295057 -268942 -246138 -168545
8126 -168545 13825 80705 187450 -2218 292368 248540 19267 -96092 -38701 -108526
8116 -108526 -103842 -284006 18897 144997 158701 -41836 -143648 -433547 -308070 -158036
8106 -158036 -164005 -38417 246583 186795 156320 89651 183755 77011 15568 -58227 97090
8095 97090 329618 80840 -275537 -218820 -165554 -95218 -47401 25476 -121151 49531 4696
8084 4696 31349 188359 183544 55779 108620 144313 149414 125097 107999 82156 170141 69427
8072 69427 -2801 19251 16597 -17459 -49771 129092 -137276 -361742 -392513 -527923 -414726
8061 -414726 -285362 -358643 -411447 -409468 -500016 -382490 -209191 -203931 -56288 94802 176124
8050 176124 341010 163235 35203 -28524 59324 109510 -121022 -293060 -111171 -169412
8040 -169412 -162092 3162 10624 -214287 -311349 -240564 -124786 16584 -111617 -103205 231536
8029 231536 544820 655613 307991 171542 158910 -82139 -180321 -303128 -78051 162749
8019 162749 -40901 -346753 -287078 -281514 -423688 -567049 -491279 -470050 -333176 -121501 -212720
8008 -212720 -257789 -370451 -239397 -174828 18289 -68110 -163719 -98883 -75814 -41711 -115868
7997 -115868 -20545 73732 103703 170805 -106491 -356075 -151119 -76490 -95899 -347937 -409268
7986 -409268 -402127 -492284 -514160 -123141 171180 97669 -48577 -78530 -280565 -356791 -360630
7975 -360630 -282429 -270352 -388977 -303766 95887 381763 580132 469712 307568 375622
7965 375622 278441 167453 275731 189848 -3790 29692 3176 40000 1225 -20497 48372
7954 48372 73491 118834 214432 120585 209367 43474 -32968 -89650 -124427 -17049 78733
7943 78733 93471 53337 -54925 -58019 6044 -8941 79011 186007 128064 73155 -211702
7932 -211702 68240 100691 59990 200316 55015 -283543 -334455 -497976 -478296 -661877
7922 -661877 -388571 -188533 -180893 -283660 -226141 -3256 80825 -135247 -168107 -98821 -28441
7911 -28441 161531 297401 155451 -5621 -36331 -74676 43145 -90780 -74744 96733
7901 96733 17862 -222277 -198929 -190234 -496943 -553620 -322999 -285659 -154536 -68207 -37723
7890 -37723 -112585 -307780 -293862 -96642 8178 228523 331660 -4538 -71091 -156841 -1084
7879 -1084 101232 -172988 20119 175224 90956 -35329 43553 113813 -5166 -146720 -304139
7868 -304139 -343858 -134660 -241423 -163212 -81018 -332644 -166583 137277 355801 290219
7858 290219 161771 178180 438137 262799 112361 -170220 17216 183625 24295 1529
7848 1529 -129730 -383038 -205792 -149567 -46356 17136 220236 227331 414656 313134 121289
7837 121289 -79574 -182781 -218513 -99469 -182944 -264795 -170494 -157838 -216420 -42290 254239
7826 254239 454482 270598 132296 -69939 -279790 -93968 10775 72029 154451 100676
7816 100676 -151098 -324052 -101582 -180098 -239488 -259019 -248571 9995 -9648 -101278 -203280
7805 -203280 -143610 -262841 -305202 -21947 1275 30678 87554 171092 243743 60691 -157884
7794 -157884 -203639 -293092 -96960 96641 -57791 -213392 -166694 -8849 164782 239509
7784 239509 318281 -64499 -189435 -23653 -80669 -348412 -339499 -190360 -225749 -221148 -144362
7773 -144362 -100323 -74575 -16126 89340 -31051 -42126 -170409 -152823 -87714 5475 -32315
7762 -32315 -92955 100133 117880 33953 -120254 46736 -113076 185036 344308 218452
7752 218452 -84508 -168082 -17093 148136 145116 -31466 -170732 -212121 -196827 -269666 -226981
7741 -226981 -144600 21066 74204 68288 1824 -279935 -423452 -254562 -255450 -117515 -49656
7730 -49656 12291 70868 -40893 -356366 -535036 -427475 -158871 -150441 -95340 190632 345146
7719 345146 584039 550339 364074 309953 276771 283864 263325 -8320 -107751 -90893 -34578
7708 -34578 9337 -72277 -45054 11741 108868 -11749 -131822 101703 130581 104277 128555
7697 128555 -7835 -80755 194666 210620 -72215 -89828 130980 201607 82721 -3157 -193898
7686 -193898 -201758 -157472 16943 -20827 223613 373808 101421 29330 294768 231278 271313
7675 271313 478535 310389 487213 549203 413327 392911 313573 139096 172512 128431 118340
7664 118340 148798 -153150 -211374 -52667 -79293 -199961 -167645 -93354 -527475 -596303 -284557
7653 -284557 -181151 -335394 -254914 -226830 -51203 149535 220193 313419 210965 -117265
7643 -117265 -213149 -237368 -141484 -58770 23120 82168 73418 -5795 -66794 164293 252303 67848
7631 67848 160484 -153906 -333258 -326948 -177873 59712 129569 24134 -89652 -357547 -329985
7620 -329985 -1397 -13145 -59040 -374396 -395681 -432761 -400187 -426776 -488717 -452702 -336951
7609 -336951 -248628 -93746 -331531 -459570 -409941 31510 171399 56089 -140429 -174900
7599 -174900 -323166 -265672 -334692 -517210 -531668 -473727 -419275 -349329 -392427 -389038 -495309
7588 -495309 -283616 -59293 -120868 -166632 -170579 -288367 -514280 -601812 -302362 -67841 -34228
7577 -34228 -57554 280522 361619 333132 43441 3687 7190 15223 -74094 -102031 120783 -324550
7565 -324550 -536313 -589956 -450698 -363033 -275154 -297060 -317482 -326295 6724 340686 232463
7554 232463 24559 -217758 -216655 226151 716679 647000 377262 96782 112233 179702 118457
7543 118457 180246 369415 423384 410823 392567 299109 259397 -53637 -224455 -371039 -252330
7532 -252330 -61280 -72408 11988 13507 121165 215012 116172 206007 225463 101201 75935
7521 75935 -3683 48344 309997 338292 76999 -153287 -155810 -93451 -120573 -158638 -204116
7510 -204116 -114599 -33955 -150249 -267636 -223150 -307492 -369610 -424690 -401845 -303727 -279750
7499 -279750 -275087 -62171 -128029 178114 -79404 -160864 -109076 -108307 23111 109011 111849 173771
7487 173771 241739 210019 99633 12444 72287 79603 90790 292255 218838 317926 314102 -118193
7475 -118193 -258762 -326643 -110954 159968 281556 105397 53294 -106729 -246296 -106778
7465 -106778 64186 -29749 -126401 -153459 -225801 -151659 -81163 -204629 18770 241148 239644
7454 239644 282196 338760 162525 -33006 36796 138910 -133950 -205965 -75727 170105
7444 170105 593571 687870 580623 435987 560686 530780 573226 536735 192489 -245082
7434 -245082 -357018 -149655 -60114 -54137 -28561 182602 316640 353473 258948 -19484 203221
7423 203221 615478 605697 271264 36660 -43401 3993 124442 323516 230691 48310 199340
7412 199340 77615 -34020 -111055 -185884 -148011 -204067 -72425 49222 -197450 -164429 -22188
7401 -22188 -99951 69335 -33945 -258812 -180617 -156135 -126064 -186361 -100866 85935 197861
7390 197861 134004 222371 17764 -31286 -326028 -345060 -404116 -310527 -304405 -59760 92861
7379 92861 40191 -22370 190033 251839 557570 492939 538660 234952 149935 59622 -304673
7368 -304673 -310202 -289114 -269937 -290016 -295209 -114490 144228 78274 84110 179141 87832 -131511
7356 -131511 121934 -21023 -50550 116793 86774 60787 9610 2141 27401 48301 62640
7345 62640 -113979 78377 -30498 -229542 -348681 -442350 -127336 31517 -38932 -219238
7335 -219238 -206620 -433174 -316684 -23334 117807 364346 67913 -108784 45697 380533
7325 380533 207118 -37244 -185763 -35164 67453 110707 -115080 -226372 -238767 -30537
7315 -30537 -160741 -368444 -332383 -153778 -199957 -285556 -379503 -328978 -139079 -3129 -201794
7304 -201794 -471456 -350080 -265880 -74647 89063 120460 220544 155193 22527 -235442
7294 -235442 -109834 -114976 -374867 -95047 76396 28572 -115813 42160 107905 24598 80359
7283 80359 447747 690317 581709 389198 143644 24129 -95956 -48571 -25688 -43066
7273 -43066 -41076 -46252 -180218 -120143 334 -47542 -246268 -398686 -513039 -146260 189033
7262 189033 104984 59717 -148593 -314472 -371873 -188275 -237 118229 58304 -131247
7252 -131247 -139925 -274685 -340001 -138534 -232341 -282005 -373536 -358488 -265182 -24138 98478
7241 98478 112406 88423 163717 108238 -73629 -291392 -298303 -372013 -374558 -160739 67470
7230 67470 45913 9557 -66039 -266952 -206657 -201971 -156177 10426 11563 -43606 -271258 -302188
7218 -302188 -381200 -259380 -77407 -64536 -27634 -65301 -107713 -226757 147907 296218 -20676
7207 -20676 -387947 -509116 -394627 -359780 -395193 -126467 67039 -9679 -2543 33865 51439
7196 51439 -178347 -354871 -197219 -119410 77272 89432 -87866 -382587 -167586 -79646
7186 -79646 -194407 -505831 -400659 -132090 -3590 179530 338756 142226 110763 -45564
7176 -45564 38842 149402 -39093 -298545 -222823 -92062 -251098 -467500 -627587 -395314
7166 -395314 -147014 -8499 -59984 81567 10653 -51265 -118552 -137045 -154401 -342765 -332299
7155 -332299 -237289 -44275 269291 -5887 -182753 -241806 -403407 -285194 -214476 -200033
7145 -200033 -127363 222804 601910 591880 178741 79112 84200 115428 128938 242942 232559
7134 232559 -2387 21301 -27473 -200213 -147618 -51783 -3038 161930 167677 93408 188809
7123 188809 310794 520139 734851 544201 266323 118831 -82723 -121920 -93525 -135731
7113 -135731 -370866 -275785 -104600 -285824 -202434 -95003 -14008 36474 -153044 -269704
7103 -269704 -176331 19610 174251 322696 261996 106235 94814 300115 462048 223485
7093 223485 -73036 -40495 148998 18537 -2326 92869 26796 -145787 -255554 -254038 -265946
7082 -265946 -166714 -244701 -234508 -348838 -499797 -459418 -453180 -270820 107891 -24667 -298519
7071 -298519 -360344 -220540 -103609 -399266 -612726 -693981 -341724 17392 299955 307954
7061 307954 56413 -38492 3406 10486 95181 198282 204995 338424 197925 233967 177549
7050 177549 111609 254866 185847 101543 248601 177904 -99636 -209265 -335098 -435660
7040 -435660 -302155 -158845 -169742 -48643 -10894 -188855 -143802 -172442 -149733 103542 313874
7029 313874 580438 599134 337407 148951 -78111 -201297 -159449 -189515 -136356 10775
7019 10775 -39963 4671 -119763 -434554 -504377 -332585 -185521 117168 43956 -6328 -185291
7008 -185291 -162723 -231670 -266292 -175159 -72975 39257 147420 12105 -159971 25103
6998 25103 -33354 -215779 -113567 -111953 6366 62789 17295 -87168 -248158 -182242 -491155
6987 -491155 -521810 -571367 -646757 -556346 -133150 -149061 -52090 60904 98009 139325 35500
6976 35500 -87521 -130326 91942 213018 -55824 -137542 -178493 -59231 189594 207051 234869
6965 234869 103154 -49427 -140793 -121431 -90943 47815 175063 -143393 -313956 -368935
6955 -368935 -95224 325787 286401 209031 203430 175191 94484 125621 210640 201524 133565 -150067
6943 -150067 -255469 -259489 -295862 -216865 120871 239936 223508 166867 81876 -23238 60133
6932 60133 -141909 -303992 -493718 -353816 107746 212720 95470 139260 167375 209480
6922 209480 223368 305064 400865 465547 334387 104140 -114541 -245167 -239572 -341906 -394577
6911 -394577 -523179 -429458 -181266 -73849 13604 -92453 -100875 -323125 -271487 -157700 -21992
6900 -21992 227892 288208 -15646 -362137 -412854 -290550 -194098 -118241 -362735 -436134 -392163
6889 -392163 -359447 -378634 -315345 -156148 11641 298297 280563 14926 -256439 -409346
6879 -409346 -251486 -85479 -15224 -117390 -105887 -77930 -188940 -67777 50826 216050
6869 216050 46769 -79792 -42454 -9187 11261 114492 23987 -262348 -149564 -38431
6859 -38431 -83170 143011 178009 222047 247659 362856 305017 111141 23669 3687 -7304
6848 -7304 -57950 63277 275662 447553 141496 14817 -12138 51558 17694 -211348 -357705
6837 -357705 -253804 -207277 -63598 22311 146424 114577 157172 -26143 -231551 -350852
6827 -350852 -218848 -124582 -304 263313 158249 284582 447375 633724 325539 90386
6817 90386 24896 -44186 -244842 -176890 -24744 -112292 -86916 -35935 24663 62570 96298
6806 96298 -158778 -37258 58967 189252 74892 -31247 -76253 53713 178850 128333
6796 128333 85463 11328 -18805 23142 34971 -173602 -475833 -454429 -357844 -203190 35315
6785 35315 111928 287647 287195 -64981 -460836 -435757 -195242 -199185 -256863 -670 31578
6774 31578 124404 -34614 -162941 33739 178183 -211041 -104322 136153 188299 297294
6764 297294 209494 141024 16626 76312 -105621 -311642 -375763 -274128 26363 40282 -76335
6753 -76335 -93100 -48859 81921 -112659 -270424 -446338 -560345 -286762 -148755 -187696
6743 -187696 -88170 105350 105284 -231940 -537064 -441376 -308588 -149834 76652 116639 112090
6732 112090 13457 -94912 -171516 -155714 -21965 -201728 -111018 132035 98619 137368 52007
6721 52007 -58848 -52184 36498 128538 301779 169975 41528 -46447 -73899 144975 152491
6710 152491 -144543 -39066 80069 -168890 -277286 -60386 288880 253998 30275 -86063
6700 -86063 -173552 -243181 -50923 240816 211202 88536 -187744 -301485 -183933 -254271 -375376
6689 -375376 -462565 -464987 -602224 -446932 -263720 -172987 -124908 -116204 -90095 189138 269503
6678 269503 251255 177300 137618 175853 196282 126975 -55651 -138420 -357838 -197954 -56765
6667 -56765 8065 181240 28426 111800 229783 288385 385806 417737 376501 250110 180956
6656 180956 185635 -137713 -312710 311 -60496 40575 26634 -28328 -247352 -366458 -338696
6645 -338696 -228201 -311685 -194669 169003 175764 169701 41775 -6299 -120230 -203314 -132219
6634 -132219 -47820 216527 305217 39890 -328555 -285757 -238015 -56578 42413 -124516 70574
6623 70574 82247 18795 105740 136982 108538 -25349 -90873 38392 112404 -106292 10909
6612 10909 71963 378 68407 229950 245050 109374 195247 112135 -22462 -268161 -577808
6601 -577808 -589682 -337399 -212716 -518428 -589631 -455389 -278800 -47634 82300 141483
6591 141483 -40605 -328286 -294967 -44185 -60363 -241358 974 127945 97475 -50611
6581 -50611 -51519 8452 33378 -167950 -218238 -182620 -80876 -91919 -178107 -426546 -261498
6570 -261498 -98113 -159115 -95546 -159142 -285767 -389932 -346747 -163515 23119 187121
6560 187121 181719 -57961 -215615 -455880 -518456 -448552 -156719 -20688 -44080 -193494 -245433
6549 -245433 -252767 -122847 147642 201212 140100 122473 167068 18901 -6729 -535 6860 -93759
6537 -93759 -170917 -165906 -265364 -197358 50370 91562 73371 96016 43463 56953 30997 56572
6525 56572 208230 -96704 -621132 -658858 -289442 -104032 39464 107336 -152024 -324157
6515 -324157 -34972 95815 -62036 6127 -140073 -189817 -170197 -314091 -321589 -197325 -219908
6504 -219908 -160058 -296499 -252618 110743 154284 24952 263747 468756 378677 134128
6494 134128 38411 171821 407831 222513 -86290 10761 122717 39097 -333045 -390969
6484 -390969 -251208 -63458 68645 340341 233987 -165382 -332319 -386520 -480405 -410231
6474 -410231 -379894 -463497 -317380 -158320 -71191 -232435 -314544 -118706 41579 -207523
6464 -207523 -413506 -420893 -443956 -328173 -169685 -12319 88780 -40942 -32584 58192 -50503
6453 -50503 -279409 -437695 -407338 -450579 -449825 -310189 -262239 -556553 -466369 -343088 -287969
6442 -287969 -110677 112974 296917 240914 170680 89487 24519 -183210 28993 89854 89066
6431 89066 -172446 -208363 -190479 -184786 -243340 -487722 -420237 -4712 171366 39918 -162659
6420 -162659 -19229 -92309 -100838 168782 135253 118109 81027 95294 156928 58244 -4769
6409 -4769 -21385 -49954 -167240 -336187 -170435 -99814 -71312 -189115 -391312 -280404 95989
6398 95989 213051 -38769 -94382 15213 108877 84775 -11398 -304517 -428404 -275105 -239627
6387 -239627 15292 56527 151956 5896 56233 72706 -49185 -185654 -110760 -59716 -191040
6376 -191040 -315155 -339098 -367495 -227463 -323532 -255248 -42296 222318 189388 5914 -407320
6365 -407320 -292372 -292346 -219492 -3247 -24008 -153979 -282236 -147794 -164752 -160347 -257823
6354 -257823 -336414 -319463 -328491 -84696 94249 150387 251638 290293 -4888 -240790 -310649
6343 -310649 -319130 -371789 -322229 -201612 -175121 -256510 -227568 -62034 133164 411256 204204
6332 204204 -20109 -65452 -15101 -138275 -190219 -124548 -3416 177506 306779 130550
6322 130550 11748 247001 191004 138781 93120 64111 56666 -110077 85082 164445 -193094
6311 -193094 -285834 -196223 -225200 109385 127645 -169307 -207400 82039 199606 182875 138466
6300 138466 57135 75766 201483 -59263 -439423 -363233 -117951 -56889 116964 278383
6290 278383 141271 -68376 23700 174291 330408 340600 208524 190404 129214 147627 288085
6279 288085 133042 101783 215700 175141 114410 165042 112345 -16872 214380 305253 249881
6268 249881 321122 290688 335675 152545 -72047 -103883 -177521 -76202 -42196 236054 250873
6257 250873 124593 1481 116288 33445 -360 -43468 2407 -34937 -12228 -248259 -422485
6246 -422485 -390089 -246150 -128060 -37874 -44150 -86081 11510 -33317 -146282 -81869 56372
6235 56372 40281 102159 181655 33760 -14321 -69103 123006 421420 178979 31628 -30208
6224 -30208 -65661 -182958 76159 85741 -88167 -138496 -325972 -372333 -380138 -322983 -167495
6213 -167495 80241 69749 -171972 -27286 28363 13557 -145470 -441417 -463701 -335111
6203 -335111 -279356 -92265 10337 -62019 -193251 -197451 -74890 -34238 -311606 -331707 -283071
6192 -283071 -498059 -516680 -324658 -332103 -198103 -150258 -161483 -261831 -258142 -119472 7689
6181 7689 70830 -79378 -119371 -35334 106460 9336 -60559 -21509 -228 86992 -14054
6170 -14054 -302786 -341667 -232556 -121725 -246463 -335187 -252736 -123618 88041 104407 235823
6159 235823 394462 268043 -38763 -76326 -54767 -51728 12170 31624 -193469 -198609 -227166
6148 -227166 -166098 -259558 -312790 99600 183315 72232 62637 -34135 13312 -118955 -186378
6137 -186378 -172639 -82551 -190352 -67941 -154311 -337563 -307749 -151770 -28106 -132580
6127 -132580 -151839 -289363 -54200 43981 -121780 -199801 -321464 -76351 -96730 -63116 89284
6116 89284 -67576 -111968 -187450 -365114 -434972 -441835 -291987 -135521 -189239 -117127 40998
6105 40998 -31598 -198528 -72405 7688 -186124 -366536 -507623 -479990 -390263 -234011 42215
6094 42215 -114001 -26779 76112 -36165 -174698 -92999 -22817 8 -81800 -86407 -123655
6083 -123655 -282402 -328734 -310145 -8756 37739 50459 301758 168525 -42993 -244184
6073 -244184 -257001 -10132 -113716 -320251 -232832 -306932 -324944 45837 191599 -42255
6063 -42255 -215422 -525572 -429909 -203840 -232441 -351630 -305349 -155675 -77024 -11296 -98403
6052 -98403 51193 79475 -46299 76691 270233 189438 47177 -76768 -156983 -180393 -46787
6041 -46787 160307 16917 -59371 102585 274785 195391 -1762 104324 -7720 -161825
6031 -161825 -289520 -230777 -12960 2977 -158051 -342884 -472560 -383087 -234529 -185801
6021 -185801 -223361 -166033 -128019 -88791 -2011 116029 -78609 -274526 -492512 -669945 -843216
6010 -843216 -796668 -537323 -302104 -230499 -248199 -179167 -148359 -137473 -92450 -149250 -239134
5999 -239134 -220379 -81084 -110874 93225 311345 188831 45607 297805 313133 236627
5989 236627 -9872 -94960 -133271 -55637 88484 173769 267376 391347 355888 88329 13638
5978 13638 53460 135958 396780 280828 48296 22822 150901 118612 -183292 -287479 -283902
5967 -283902 -493534 -345315 -86727 -146408 -107965 -121334 -259868 -648687 -581072 -236448
5957 -236448 261731 567173 317938 -124675 -91159 81729 302068 293538 174847 8463
5947 8463 -62183 -122406 -66440 -11305 77991 -160873 -85925 56713 -21363 110413 273010
5936 273010 66428 -219099 -393789 -551366 -522127 -421835 -385049 -279982 -63267 -43304
5926 -43304 -172126 -254723 119220 1969 -227966 -137561 -55453 -169704 -240942 -275709 -256701
5915 -256701 -263335 -45290 33909 12460 -12893 -19687 -83832 -130121 -114815 -22566 138818 242605
5903 242605 160016 127230 -197335 -118308 -196270 -263376 -184880 -136157 -243273 -258472 -18388
5892 -18388 11937 -8702 -43202 -12782 120409 88826 169475 56250 -75775 -110378 -91562
5881 -91562 -54283 31892 -2012 -37000 185805 284275 47843 183850 317845 161835 180510
5870 180510 338585 254252 97730 37618 105992 67448 188623 422978 384996 -25844 -87461
5859 -87461 55875 36229 192919 112771 30699 29746 -35675 -30152 -227531 -326940 -319490 -306076
5847 -306076 -376759 -289599 -251256 -73635 -28591 83439 218852 246904 260850 404634 176816
5836 176816 266245 344869 339932 44227 -259065 -174331 -21253 -101387 -217570 -109793 105300
5825 105300 314631 377883 233211 216630 69103 -254618 -401288 -442723 -374621 -379697 -380480
5814 -380480 -214225 -24018 176101 217754 87369 -63279 -5071 62962 -44113 -220845
5804 -220845 -219402 -172518 -326369 -193012 -33770 24707 -117235 -4801 -92121 -258039 -301714
5793 -301714 -422797 -461156 -350536 -62534 -62656 -167850 -110855 -35636 29272 156096 582194
5782 582194 837130 809212 692335 481024 390822 -85960 -173500 -49150 -179838 -111329
5772 -111329 101946 261771 322893 271515 6494 -568 -154295 -278858 -174878 -344737
5762 -344737 -244231 -344253 -13563 405470 277921 -78645 -84768 101405 218207 40285
5752 40285 -106923 43345 264997 151433 -39508 -212213 -335721 -128636 -210530 -188439
5742 -188439 88200 131896 34297 13092 -38703 -263414 -299802 -173972 87998 81159 -104995
5731 -104995 -85236 -64593 -118010 -238034 -185237 -37389 -68617 -314900 -296177 -187446 -108353
5720 -108353 -16829 -245086 -326764 -136151 -88645 -90270 -113028 -36785 -14466 -61135 -46388
5709 -46388 -75541 -263829 -457060 -271622 -120872 -97073 123600 82777 134127 -21821 -263138
5698 -263138 -434402 -189269 -37894 -375 -212537 -316671 -138919 16316 104935 38228
5688 38228 89106 8668 218671 78554 24828 -15506 -116476 -262146 -319482 -279730 -101787
5677 -101787 142536 209128 95956 83106 -76866 -335737 -547556 -432127 -391363 -470195
5667 -470195 -421751 -182074 86734 202679 79673 -179226 -492199 -679493 -621634 -605705
5657 -605705 -396656 -53229 -7005 -23066 17133 -5850 -109934 -268573 -302621 -183581 -159387
5646 -159387 -233680 -220447 -217624 -125210 -68267 -188245 -155836 22978 81228 -91129 -217779
5635 -217779 -324671 -493790 -497943 -443209 -386182 -285480 137260 315549 155378 107513 69668
5624 69668 216845 -91637 -153987 106179 209749 200460 117058 164640 3510 57706 17894
5613 17894 -200102 -131967 -155544 -204556 -117394 240272 200291 43607 27020 78424 -28050
5602 -28050 -178139 -57348 105182 83939 -47192 -150439 -116774 -2532 115410 168221
5592 168221 161513 186309 124566 232430 264135 160815 -72041 -156174 -34463 13403 220814
5581 220814 269732 231514 -55162 -256291 -283312 -274903 -315128 -368449 -136194 12712 -31551
5570 -31551 -66998 -12263 -61635 -1939 197799 269666 78597 153917 266626 146915 12093
5559 12093 27225 -121914 -348182 -499919 -400309 -512432 -425408 -289908 -542119 -387133
5549 -387133 -96699 -256012 -417318 -421236 -301063 -268044 -364755 -309485 -161790 -105727 -31394
5538 -31394 20829 10751 227365 462091 427754 317555 89215 -131297 -227829 -105619 -37937
5527 -37937 -220536 -113221 -121879 -88681 -160816 -88890 19157 130434 231153 392704 397330
5516 397330 253725 -29627 -257959 -240013 -138981 -135763 -185792 -200593 -56852 53321 -44693
5505 -44693 -253909 -237209 -92493 -197866 -210282 -133560 -100125 5189 190852 83124 -42827
5494 -42827 -84692 -270020 -139356 -157742 -426107 -398271 -349264 -340487 -297127 -15930 -119034
5483 -119034 -380921 -459350 -387883 -244593 -276977 -280003 -1970 121277 13169 -230695 -259024
5472 -259024 -254674 130471 443926 327060 253300 249536 94096 76939 -104805 -252912 -86849
5461 -86849 122970 177424 157001 340171 428975 220630 64159 160170 131462 163043 255598
5450 255598 153804 75475 6859 157320 184069 -31257 59989 386294 372926 227624 174512
5439 174512 307901 360960 452549 582559 651881 870315 743646 304772 -19990 86627
5429 86627 -3311 77541 145026 187622 214569 452284 489214 342441 245197 29278 -281489
5418 -281489 -371098 -89768 -173113 -90006 -2182 200888 178937 208761 137770 -62560 -250039
5407 -250039 -380778 -318894 -162720 -17493 181163 298118 341122 240837 107037 95811
5397 95811 38401 -88978 -228033 -157887 170010 357967 242275 152870 75970 142707 194251
5386 194251 -43322 103942 122730 -141174 -173985 -245707 -255476 -268832 -289971 -138992 -95623
5375 -95623 -204594 -294272 -291824 -236408 -260864 -305175 -233970 -168158 -186608 -127711 -139096 -129702
5363 -129702 -165399 108361 403028 265380 86639 -88889 -46941 -136079 -213489 13274
5353 13274 182131 211347 302062 171962 203858 119760 171566 106132 76375 52185 -64077
5342 -64077 -143893 -99643 69395 166192 -8046 27497 217300 190267 173788 301718 172016
5331 172016 -64833 -44939 -98009 -127928 -16348 260881 410907 254046 49530 -187352
5321 -187352 -339811 -303758 -97058 -62473 -96280 -241760 -175844 165053 263124 -65500 -387290
5310 -387290 -330989 -225963 -220148 -117341 -113793 -164687 2937 -104143 -147879 33610 9412
5299 9412 54525 -18316 -255044 -292625 -117949 -104319 -12461 263331 71839 71099 9845 -113227
5287 -113227 -265792 -127746 67874 130092 48057 203655 55100 6892 -43304 131430
5277 131430 114411 12340 5172 45372 -218270 -391039 -409458 -493415 -271843 -83213 -27158
5266 -27158 66883 93008 -54366 -173951 -207643 -148387 -179923 -250110 -241917 -106068 -149528
5255 -149528 -317751 -491712 -461137 -507141 -399710 -224090 -220826 -170000 32565 -39839 -292464
5244 -292464 -439823 -496599 -391061 -432865 -530383 -520117 -416240 -129425 -7315 -73720 1937
5233 1937 -145813 -360504 -494309 -477614 -303122 -384456 -281259 -536178 -310417 83652
5223 83652 204330 98592 29635 -217626 -364552 -153575 157585 156555 -73684 -99540 50376
5212 50376 34808 -229232 -450128 -186123 -54331 32877 -133770 -407985 -560241 -468813
5202 -468813 -312626 -292948 -381388 -213856 -85599 2973 -65487 -246379 -257574 -279071 -284065
5191 -284065 -166149 -97436 107154 231657 191694 -7549 -169592 -365207 -107817 -3503
5181 -3503 -304 -74862 -169734 -225501 -250224 -367534 -252194 -97413 -264637 -351807 -83964
5170 -83964 152572 181589 362595 146108 29513 148709 377573 393474 179748 126777
5160 126777 210529 60620 -38165 -32803 206731 218809 -57370 7239 112535 47855 -77940
5149 -77940 -209443 -191087 -6536 254159 429665 539547 540625 306169 54472 91283 293877
5138 293877 182045 119673 -56964 35310 -12881 -59178 102981 127052 31594 -189498 -189232
5127 -189232 -82931 -158867 -182975 -107075 -150972 -166831 -179733 -76012 84107 9138 -69343
5116 -69343 -212136 -202261 -290471 -405959 -400492 -359741 -189386 -162031 -148201 83797 105959
5105 105959 -95917 27299 44750 -370986 -499924 -492055 -193638 33941 -7205 -113951
5095 -113951 -23126 91627 204729 223289 191130 166001 148989 339256 358711 273290 235535
5084 235535 144064 225072 66952 -37731 200326 306068 204195 202985 34793 -96548
5074 -96548 -119370 126859 195765 67566 66616 101124 -66213 -391612 -387179 2986 312661
5063 312661 320088 322965 254338 141987 181123 257178 198558 109114 -33719 -133471 -269208
5052 -269208 -361648 -418685 -217707 78856 38436 -65856 166348 214707 156316 419 91637
5041 91637 80756 70665 -97832 -158672 -141913 -25743 38072 -1794 161121 424285 134829
5030 134829 12887 -182130 -136438 217028 268304 110877 -87951 178717 223045 145737
5020 145737 147229 -3927 10902 -12159 180108 427403 179545 -50987 94586 66657 108791
5009 108791 138915 -11725 16963 111337 174990 218243 248950 78447 -84494 -37470 23294
4998 23294 18901 -189860 -88101 -108025 -109181 -69455 -124897 53661 94662 -167042 -273279
4987 -273279 -252130 -373842 -338921 71570 145260 158259 -12327 -22361 -93381 -216162 -258513
4976 -258513 -546265 -539645 -264575 -55531 -205116 -540900 -707485 -599212 -434432 -360327
4966 -360327 -190880 43663 -38412 -181196 -42699 -71239 -135085 -114163 -25673 355453 379449
4955 379449 258010 413978 506507 375382 -52332 -178288 -17305 -55191 -13898 -32512
4945 -32512 -79415 -280799 -296259 -54466 287721 211213 133965 -105718 -190690 14843 172796
4934 172796 259546 172795 -60113 -261458 -500060 -565976 -447225 -355368 -208739 -11050
4924 -11050 -361055 -476606 -306249 -139884 1339 -220203 -119123 110810 33648 -102025
4914 -102025 -393477 -263805 -81519 155124 289078 319666 397043 426803 234424 -68699
4904 -68699 -123536 39568 13322 -219532 -260677 -156871 142494 109933 -128 129764 135758
4893 135758 317366 501723 496403 299509 117551 -51270 -100313 -11208 -100604 -273961 -501171
4882 -501171 -512697 -391320 -289763 -142526 -322718 -197066 104697 311171 140820 -87239
4872 -87239 32973 262610 388197 439686 364722 237078 227755 310325 396118 376589 203632
4861 203632 208415 90065 143202 276101 253784 402953 674352 505578 255120 -73850
4851 -73850 -115813 106959 -7888 -314655 -395562 -502168 -159433 234232 345576 182771
4841 182771 5216 -22107 -95207 -28958 -30921 -34414 -68088 -50768 -130349 124506 245963
4830 245963 215002 323895 391930 364067 429440 250474 -114158 -357616 -253665 41778
4820 41778 363550 288881 171591 225574 380482 319509 367276 184100 -42012 -305513 -379109
4809 -379109 -294488 -207014 -303872 -430942 -453245 -424113 -403889 -209174 -116283 -124943 -131455 -159262
4797 -159262 90239 125666 -23822 -144491 -168133 -99381 -191742 -281276 -271802 -334986 -382221
4786 -382221 -308684 -153182 29340 -28291 -157184 -190482 -298745 -186257 -39628 -141112
4776 -141112 -369967 -460432 -420604 -458576 -316216 -186212 -386353 -234166 26021 82984
4766 82984 84195 -29234 69436 24257 108631 -93505 -290675 -201799 -67477 -158254 -163970
4755 -163970 -63370 157574 255852 468289 378730 313646 317810 146213 -51477 -30656 -61249
4744 -61249 38524 -74663 -145608 47920 188880 5931 -17034 -80028 -180942 -167453 155842
4733 155842 229876 418552 347389 263432 162239 120251 46100 -427985 -445532 89236 246593
4722 246593 -56159 -297762 -344406 -262536 -275339 -498898 -477615 -323529 -331893 -159712 -193107
4711 -193107 -303667 -312575 -243174 -484244 -187947 -69455 -13746 -212556 -242876 -186303 -128036
4700 -128036 -23165 241555 360398 230356 246913 338081 112661 229310 330983 138814
4690 138814 76237 118278 37184 -21111 226867 219641 113107 95173 1754 -37167 -70054
4679 -70054 -162232 -236820 -149702 -218769 -126366 -6612 -12787 -72460 -239214 88181 276436
4668 276436 -8300 -241461 -321753 -208082 -56827 66319 -67383 986 54626 -60749
4658 -60749 -252346 -174575 -33769 -14347 98225 -109552 -218973 -86031 -105353 -234930
4648 -234930 -124510 194803 205381 -156952 7025 -20790 -78560 -97912 17818 185080
4638 185080 5216 49125 57731 -228559 -264643 -237146 -251966 -481069 -512090 -184623 210806
4627 210806 171310 97132 52163 33454 23033 5218 -84928 -227189 -73668 -22377 -50206
4616 -50206 34836 189144 262090 96518 101075 18575 -150036 22674 208358 -38825 -56664
4605 -56664 25445 151652 124700 -18469 -95390 -370852 -403801 -326699 -264486 -204471 -102546
4594 -102546 -158071 -341076 -456687 -439784 -347076 -355256 -408397 -303240 -338505 -191140 -165225
4583 -165225 -114668 -59736 -278973 -309457 -126721 43442 179676 171721 -120078 131063 -24233
4572 -24233 -161996 -168120 -235062 -354555 -99898 11214 -392033 -469449 -501425 -408362 -251243
4561 -251243 -282576 46147 192350 226694 250947 28230 -212455 -172547 -23856 -2259 103957
4550 103957 89974 132549 -110623 -104908 92898 -35059 -212659 -408786 -569834 -559491 -259780
4539 -259780 -133820 -181504 -175328 -287305 -436764 -354421 -97394 -134670 -346 244438 506194
4528 506194 327514 -47434 -211011 57586 -10360 -30075 132101 113546 -325157 -747835
4518 -747835 -600525 -292842 -74874 100788 108415 -84668 -90630 52179 89650 148445 47487
4507 47487 -71209 -124273 -123026 27773 -49170 -130723 -111174 -133160 -206097 -199760 -297570 -252008
4495 -252008 -99679 -197172 -272733 -228613 -68965 -65605 -315380 -519057 -278698 -56733 -111388
4484 -111388 -101059 -60983 -362847 -382115 -38741 83698 -23423 -228866 -218086 -109786
4474 -109786 -86969 -197355 -190532 -162926 -383440 -262386 2670 180994 157528 -23366 -160249
4463 -160249 -223445 -485453 -404391 -440173 -262862 -213953 -154135 -392367 -468691 -251365 96432
4452 96432 -1513 -150814 -97831 -92047 -308191 -494684 -460033 -344311 -374792 -424687 -327894
4441 -327894 -393015 -188975 8074 -69356 126608 -57551 -226194 64772 88680 -45612
4431 -45612 234905 -35088 -236031 -228836 -250857 -103030 13934 123447 64231 78046 49495
4420 49495 145487 -2663 -35750 38606 39046 55903 127870 116820 -37220 -202819 -173421 -178997
4408 -178997 -227646 -186789 -26551 49995 -213501 -320037 -205529 -67890 -164885 -187583 -317446
4397 -317446 -194616 -67041 -113911 -276061 -147680 171135 216141 13274 -83371 -174194
4387 -174194 -313050 -494013 -219829 -143892 -102996 -79086 -11879 62996 237366 321854 198716
4376 198716 173863 249268 576365 651683 442321 229228 227305 126488 203108 8889 62606
4365 62606 422094 524596 507118 292273 120749 215528 427218 368328 327229 362792 174413
4354 174413 201336 417175 618118 648706 403446 175839 305845 523720 256658 205721
4344 205721 196119 285301 181173 210205 207373 -107175 -341178 -256734 -108605 -106175 -254868
4333 -254868 -160701 -44889 50598 -119182 -113092 -3128 163077 62517 2046 85460 189800
4322 189800 183533 253047 17039 -246289 -150331 121575 73585 -40478 -12625 -81248 -341626
4311 -341626 -378602 -260560 -114394 -85049 143433 310879 220796 161332 33745 226984
4301 226984 303916 80556 159248 234247 237991 326785 330622 283381 -119623 -67227 -123608 -272886
4289 -272886 -192945 37415 57362 394582 491760 479583 318950 40129 -199266 -303506
4279 -303506 -346354 -221075 -12940 133847 79910 -150692 -88212 -218406 -212995 -106124 -79422
4268 -79422 -157198 -266472 -515341 -405557 -223843 -35347 14338 -50781 -21819 94915 -72016
4257 -72016 -122692 -44753 71975 33710 -276545 -159417 7834 78079 239644 276098 312396
4246 312396 235871 200742 283054 -155131 -233289 39322 109541 178492 162695 7850 -175924
4235 -175924 -221888 -129208 57120 346209 184265 -142755 -230084 -78442 -116219 -69821 -93896
4224 -93896 -271380 -376778 -524465 -396992 -179350 -28649 -35949 191541 -67957 -217214
4214 -217214 8199 8490 139141 289926 398780 246648 -143349 37101 5513 -199212
4204 -199212 -195577 -107978 -136204 -176210 -111646 -106114 115934 331035 283579 250687 262038 15040
4192 15040 -142519 -130846 -286748 -47855 -41196 -132627 -196690 -31847 158703 -86960 -137416
4181 -137416 -76014 -75423 -151207 172171 151826 -65408 -28655 -113088 -113648 -115672 24584 -1233
4169 -1233 -262878 -304632 -205162 52711 33536 -92227 -204368 -240944 -213948 -302367 -173381
4158 -173381 -42783 -45063 34437 127669 352594 332956 20247 -34762 -39112 3813 -5150 -13356
4146 -13356 11307 68354 8314 -55615 -133109 -147420 -363048 -188584 25684 -37074 -135735
4135 -135735 -98434 133905 53668 -200279 -296657 -188435 -5682 234325 184019 -34135
4125 -34135 -87852 23949 79222 -40163 59654 12089 -820 -206570 -339749 -212850 107674
4114 107674 82958 117833 167479 92801 -27197 -18005 205805 233119 297882 132260 136212
4103 136212 263874 88829 -233955 -361708 -261211 -165780 -152337 -194526 63284 37761
4093 37761 -132834 76216 -50418 -126772 26004 379472 328001 -78968 -306778 -356352
4083 -356352 -171822 108246 140578 407761 350813 149095 166026 239732 190889 301504 135081
4072 135081 16867 -122024 -130098 -224992 -317816 -427548 -318666 -42394 7159 46175 268744
4061 268744 194635 79569 -10137 -287133 -325471 -318066 -343550 -89546 73801 132221 188710
4050 188710 207962 292775 202673 -94583 -88422 -156993 -49522 257175 316179 34046 -16386
4039 -16386 249156 460359 355662 40259 -94253 -73347 -190462 -145816 -8039 71572
4029 71572 190898 110098 120035 2973 -77202 143263 379302 142388 -103977 -205194 -101492
4018 -101492 -82921 -251451 -218254 -289719 -367013 -284897 -224269 47637 46862 39188 120723 136542
4006 136542 -88299 -304029 -329131 24832 97735 147781 258368 203603 24569 -121969
3996 -121969 8877 -133600 -246129 -101469 23593 -104702 -141123 110775 86934 76234
3986 76234 99301 -40591 -228561 -112961 55917 133369 48555 -20842 192648 348536 567323
3975 567323 485897 78459 -126507 -7357 93875 -59429 -9807 86602 86731 24674 -30369
3964 -30369 -32396 -86486 -120086 -345092 -269067 -56473 -34773 -154651 -180419 -311025 -66338
3953 -66338 18987 -212959 -327013 -486097 -512893 -384902 -249105 13061 425097 312259
3943 312259 56473 69363 224041 315716 340756 349191 175377 59697 -5737 -138223 -323516
3932 -323516 -296027 -137784 38666 70159 -193696 -341867 -184036 -273657 -183139 -367280
3922 -367280 -498711 -280452 -319224 -338447 -108642 214892 271788 142321 24222 -336842
3912 -336842 -425232 -294163 -46706 97172 6705 -29482 -14610 45430 -227583 -453294 -351757
3901 -351757 -86348 149666 26474 -7062 -6723 -31828 42064 -53811 -186977 -119851 260557
3890 260557 354331 166582 -155842 -293912 -350908 -410383 -458625 -286455 -298557 -560302 -438459
3879 -438459 -314613 -328993 -379168 -361449 58559 252704 217840 269809 230101 293471 188729
3868 188729 -12732 -46010 -37101 163688 397089 403699 244125 165021 153900 283349 289009
3857 289009 285491 192590 173455 140688 138216 25961 -15137 -85422 -228116 -327384 -449948
3846 -449948 -495568 -425741 -301281 -261365 -108758 -208362 -312700 -368687 2425 457938 489248
3835 489248 567389 582813 334068 129328 -97126 11905 128602 105637 -28880 -48860
3825 -48860 -27988 -113116 -315843 -308219 -316516 -155118 -63938 -98788 -113828 -262627 -315746 -219045
3813 -219045 115684 193670 163840 177696 232410 246030 290057 437606 210182 23251 -124351
3802 -124351 -159750 -320597 -167547 204225 198877 26638 81563 239827 158726 89949 -121283
3791 -121283 -191468 -184472 -107333 121631 249212 146668 154781 349142 129501 17 -98605
3780 -98605 -6631 -123631 -71331 -26577 274951 277323 135738 -163002 -75472 -31119 -50754
3769 -50754 -97343 81302 137407 219811 59048 3637 22884 87119 196808 192977 285615
3758 285615 625389 633632 630254 695005 474395 141975 148802 242710 317185 447377 327732
3747 327732 290409 214329 320981 437545 233405 315987 114811 -195047 -334181 -204213
3737 -204213 -222231 -332550 -223292 -262673 -239672 -106369 83141 115605 -416 -40183 92138
3726 92138 20933 56068 164541 262539 103153 -126625 -94710 -50390 -49315 270631 189366
3715 189366 137854 486379 376606 19509 -18591 134835 48510 -141476 -7721 140279
3705 140279 159720 119845 92426 -189523 -394548 -266795 -212915 -179091 32499 143689 32484
3694 32484 111124 292039 207502 125121 58401 -81740 -104884 -75924 -225401 -120282 327834
3683 327834 274456 44325 246719 -62920 -256983 -269256 -13030 87321 31160 -79533
3673 -79533 -211545 -275640 -24098 -32338 -86433 -116020 29309 40967 192843 335092 246163
3662 246163 197436 447154 345910 153879 -118609 -406470 -417542 -228849 -71633 -52922
3652 -52922 -114502 -26125 46771 4193 -77834 -288184 -525702 -244129 -129029 19434 19787
3641 19787 52712 102253 5709 -68015 -75040 8090 -166843 -274446 -230605 -292507 -172516
3630 -172516 -20042 18612 78973 -136556 -72777 -39760 -76396 -131392 -55153 39834 -43927
3619 -43927 -184780 -110674 25807 87457 -128941 14760 -3079 182396 115543 -199373 -298511
3608 -298511 -213790 -28406 -49273 -36414 -5755 275303 54797 -254073 -111927 -76439 -238559
3597 -238559 -361750 -270178 -333624 -299882 -240138 -213565 39846 -120631 -34552 -15916 11101
3586 11101 -53158 121260 293968 12050 -324915 -425009 -268761 -264512 -15887 -45517 -62598
3575 -62598 187197 264184 248549 70 -232427 -330239 -502946 -605037 -541844 -344692 -185584
3564 -185584 -137603 -128027 -52638 80546 -5739 -37122 82531 41346 -42631 -91743 -179958
3553 -179958 -11626 205031 354921 292642 49722 -197810 -491745 -442322 -272325 -237633
3543 -237633 -92020 130433 240800 344585 392062 347428 65654 -149719 -232164 48372
3533 48372 24184 -42688 89175 50266 277405 215067 -69823 -113388 -3622 1244 -111695
3522 -111695 -402837 -372124 -312749 -195285 -112988 13052 104425 278708 299373 292601 354509
3511 354509 319623 218858 72950 -234254 -460551 -503920 -584134 -411417 -185969 -321006
3501 -321006 -227163 -263189 -441128 -171882 145368 93626 -76461 -289141 -303602 -242950 -90330
3490 -90330 75505 55529 119354 53036 48838 -29474 -88538 -159004 -114789 -164201 -182788 -157936
3478 -157936 -244415 -295491 -336797 -373902 -212207 -153433 -93328 105930 298418 93727 -98039
3467 -98039 -101467 -40707 110070 103148 250316 160609 157393 -38135 -98381 -48239 3025 226526
3455 226526 429511 582429 538877 319158 124629 -110297 -87912 -110713 -88748 160844
3445 160844 259493 205064 -34238 -65101 39348 -37344 105550 89945 126221 96073 -36691
3434 -36691 -110475 -78920 -36703 42666 -148455 -120692 -45389 32765 384153 284824 45937
3423 45937 185648 321365 338901 281080 91501 -136192 -227248 -452515 -458728 -377473 -263366
3412 -263366 -46613 -106534 -101569 -139839 -264284 20743 312628 389213 298559 155825 81544
3401 81544 113744 -36515 -102333 -20249 -373525 -506930 -393902 -246813 -182378 -110796 -220199
3390 -220199 120025 362789 134203 175725 27527 -193869 -66803 -108646 -237917 -18671
3380 -18671 -126210 -71318 118725 47955 -157035 -121218 -70938 31214 -24 69281 189313
3369 189313 -147976 -306797 -254730 -13156 85430 57126 34787 67223 46837 24753 -44932
3358 -44932 -253749 -154226 227987 347509 189979 142577 167978 19296 44119 -14131 -32918
3347 -32918 107537 204338 337230 432069 206893 -91591 -206962 -70595 -127066 -205345 -99508
3336 -99508 -139866 -304962 -298052 -173838 53551 285302 -27629 -135672 -224308 -274897 -208885
3325 -208885 -306904 -478516 -331087 -310116 -420763 -566487 -799445 -734895 -482297 -423599
3315 -423599 -584550 -393121 -151508 -48638 28067 -105988 -263950 -122945 -144658 -226630
3305 -226630 5779 -14955 -10477 163917 317921 495415 447189 236157 -28087 58202 83223
3294 83223 32915 153902 135538 206541 352336 247595 83216 189444 384910 354281 307393
3283 307393 -17757 -178640 -87346 -3362 82611 -79303 -174817 -196800 -90167 6817 158905
3272 158905 323420 409810 108244 -88701 -62700 -23594 167440 220217 162399 -5031 -181018
3261 -181018 -39921 -39992 -64030 27323 188586 52415 -104940 -166857 -109427 -17968 -58707
3250 -58707 -113113 -137929 -143117 -135744 -35473 -133564 -144134 -73506 18086 -47477 -252204 -201481
3238 -201481 78948 245507 264914 26039 -252863 -346495 -282531 -474460 -457795 -166807
3228 -166807 -39906 141209 256698 -30393 -276074 -157171 -22649 -85611 -83210 -220499
3218 -220499 86737 129751 114687 -43429 -79180 -188981 -28478 71293 -48290 2134 88473
3207 88473 143833 366905 324786 355585 378510 485600 460744 164203 -52315 -104445 -112590
3196 -112590 -150611 151178 132633 -20580 -125932 -102096 -77449 -224132 -179718 -313022 -187689
3185 -187689 -109594 -143068 -263995 -160781 -7994 283558 72242 -7421 -378592 -416932
3175 -416932 -365243 -313660 173634 169633 39543 -120136 62937 248178 286932 201619 210590
3164 210590 168921 434618 445059 154590 -78004 -90017 81664 99475 281124 167829
3154 167829 205679 377546 529877 420734 224755 164326 268392 462501 515461 249293
3144 249293 208985 120442 402177 179623 -252300 -79776 190342 204255 10989 -29139
3134 -29139 1553 -4079 194447 133017 53177 190544 162560 -24501 -132148 -222689 -143142
3123 -143142 28824 77667 153508 -214539 -382261 -433185 -446680 -192739 125570 17540
3113 17540 13568 -292316 -436048 -175868 64888 109514 54635 -197867 -296083 -78229 -400
3102 -400 -165050 -168958 52944 128313 245720 80728 -96709 -276496 -259795 -163535 -79849
3091 -79849 -8441 18208 51180 110041 9678 -60896 -48464 -272881 -251612 -121476 53778
3080 53778 -216570 -177279 166 122974 145861 381418 350924 189084 -29620 -221986
3070 -221986 -268312 -68369 190753 438557 214600 123453 112957 36158 -13393 118694 38761
3059 38761 191006 347197 403010 493741 351481 88938 3901 207534 -11630 -126933
3049 -126933 230076 244066 37500 -34806 -53840 48233 45581 -189737 37955 106841 285662
3038 285662 81861 130653 162418 -53505 -96461 -170693 -312167 -437111 -464183 -176360 -44676
3027 -44676 -110388 -21951 -93613 -89182 -228406 -95667 159983 -28013 -140885 6943 -72358
3016 -72358 -354551 -293022 -47278 85414 -135240 -361179 -227421 4999 81907 98328
3006 98328 123602 -57116 -189628 -274273 -366102 -414942 -249430 -269557 -212592 -289396 -129970
2995 -129970 -266658 -196480 147450 240197 57618 116377 -51478 64241 39315 -2789 -266887
2984 -266887 -184156 77250 -33750 -165252 -87660 -136900 -466496 -354371 -204852 -283492
2974 -283492 -209109 -142069 -240410 -63767 22351 131502 -49812 -88652 -40875 18174 145941
2963 145941 310712 56960 -144329 -92195 -29407 90518 187516 133609 77967 225945 70668
2952 70668 204163 236485 179425 98600 523667 464202 419895 69873 -173763 -252657 -143575
2941 -143575 -128616 -222755 -397138 -381805 -220974 -112633 -173830 -32301 53610 68022 -77276
2930 -77276 -150713 112054 259678 -92617 -324628 -279637 -30972 -67353 -310619 -311099 -176251
2919 -176251 -162580 -130833 19539 -8923 25509 319393 357306 177287 52771 235124 145962
2908 145962 222866 111058 -70542 14304 174071 136367 124109 268351 351714 303468 124072
2897 124072 345815 423914 458735 464872 115730 -3039 99662 -25875 -167478 -231246 14270
2886 14270 305397 515299 599327 580123 237643 37594 -120290 -214730 -123029 193470 248381
2875 248381 289473 174258 277314 390304 433853 429616 297257 183051 165035 -175675 -347562
2864 -347562 -279487 -168716 -144445 78004 200319 204246 263960 309150 147626 34407 264219
2853 264219 253532 232548 310350 546529 599182 555463 431817 318929 460377 391179 377701
2842 377701 149444 -173247 -300071 -65685 38527 20237 -15094 34289 5028 -272726
2832 -272726 -272611 -150501 -205901 -308312 -40788 -15420 -187062 -142307 76236 307939 540859
2821 540859 331855 8223 261869 165987 194206 255436 415516 479185 503942 525220 475173
2810 475173 484152 469293 145578 -71873 -9841 9216 180467 186779 86107 -109261 147443
2799 147443 -6496 -160656 -1468 235758 227243 176038 34717 89339 196619 149675 76189
2788 76189 270930 343770 250213 381114 425139 545683 617813 516406 245219 255382 323026
2777 323026 258736 212630 287610 130172 -153883 -489800 -333624 57293 256672 275456
2767 275456 278092 82881 84763 59815 81196 424 -43944 -112243 -94453 -148710 -164846 -79529
2755 -79529 88544 157099 227963 308597 300821 172716 92154 170916 67598 -158185 -160803
2744 -160803 410368 609154 297595 5380 46650 80773 -64467 -5269 -13308 -331260 -247902
2733 -247902 -164014 -167081 -17742 -151210 -359880 -315285 -108374 -63430 -125841 -242380 -277006
2722 -277006 -128576 60951 111137 165185 354773 444152 219913 977 -263175 -536326
2712 -536326 -236821 -90246 -6302 -1701 45997 73537 -143392 -167891 -23210 -24437 -169845
2701 -169845 -119668 -252001 -317166 -232151 50698 348626 265225 76822 32935 -102824 -214189
2690 -214189 -5220 375507 433536 331220 225008 38665 13113 22865 -31143 -138485 -164417
2679 -164417 -361619 -288275 -243892 -355360 -179286 -62557 -4948 128493 165621 141948 75043
2668 75043 -138029 -331989 -80066 24528 -18100 152022 163538 66003 -115193 -100451 -104912
2657 -104912 -213425 -61936 166729 -26387 -67006 119722 74756 186980 413531 337121
2647 337121 154254 157274 206989 170718 127928 252870 149978 -152668 -178555 101677 209148
2636 209148 287282 399394 180035 -127622 -89404 42104 38793 -10136 -4148 -93657 -112058
2625 -112058 -180941 -525328 -400839 -308054 -258449 -1027 303263 419794 52445 117756
2615 117756 116852 -180236 -97703 36339 42991 -122633 -135901 -205227 -78533 -83095 -230801
2604 -230801 -302997 -162481 49416 28890 5721 -137788 9034 88141 160895 128629 2313
2593 2313 -82747 23384 209045 429429 254468 258854 479023 594087 388430 127656 118694
2582 118694 315575 335096 -26791 -215845 -236655 -264663 -98907 -115661 -238146 -12646
2572 -12646 17061 -79784 -58122 -246288 -402657 -240394 123728 114354 45713 220594 192161
2561 192161 91719 17155 138046 216311 -3180 -41736 -115922 -233976 -234674 94852 180569
2550 180569 12844 -86667 -213203 -77283 127538 138292 -3686 -116733 -23213 162780
2540 162780 81067 -177769 -182830 2285 194712 241486 -164920 -512794 -339020 -40530
2530 -40530 16492 134522 212616 137201 213997 289802 373069 123533 -186134 -193747 -73793
2519 -73793 -165031 -30847 -145771 -140346 -254280 68174 146529 266952 49837 117675 217422
2508 217422 149793 331971 388965 209375 61820 -134936 -212332 -173974 -141010 63949 232648
2497 232648 113218 152283 16407 -104193 -91577 126005 233906 304785 383456 181524
2487 181524 361326 339213 388656 215632 -12060 193917 342644 537215 343122 382173
2477 382173 140978 -126850 -5845 337139 327926 180460 72785 124852 -214898 -373831
2467 -373831 -81785 32912 166552 39641 -167638 -387442 -488798 -540180 -284415 -282470
2457 -282470 -105508 287761 277509 179915 108979 -120423 -419613 -572822 -345686 -265201
2447 -265201 -49242 129709 -67132 -338369 -111435 -74333 -61323 -54431 -212535 -205861 -193932
2436 -193932 -190466 -113069 140264 158932 -28881 -313911 -183525 26923 -61692 -73134 -272587
2425 -272587 -190923 -189715 -120987 39462 229651 359322 432994 209483 55577 -102637 -31915
2414 -31915 34381 57717 382187 365793 251470 255402 151531 230783 331993 338730 300529
2403 300529 84864 151977 144896 -124460 -136665 -224436 -101458 116964 285751 410527 406323
2392 406323 375754 92303 30297 -171659 -197523 -251477 -306385 -373549 -301742 -253155 -214168
2381 -214168 44639 201646 148693 -7087 247259 309283 68865 -126515 -32802 25294
2371 25294 -72719 -283296 -131150 -180949 -34148 79456 152406 95766 28573 20416 10021
2360 10021 -50301 -113241 12153 165405 208454 -92604 -153677 -193870 142295 483659 525809
2349 525809 363490 345349 284225 232152 269992 314958 264665 56628 184218 270533 52186
2338 52186 -41057 44033 89787 132390 4477 50208 266397 186810 -111260 -126665 -138304
2327 -138304 -7367 -44845 -104710 203070 404057 425725 625267 554884 447286 452627 181685
2316 181685 33612 151137 273202 90450 120134 209470 235453 111864 -39538 -103083
2306 -103083 -96439 -145449 -233344 -181960 -305459 -230950 -243877 37785 63980 -28826 130368
2295 130368 141803 213119 186313 96586 46985 -196515 -273309 -141765 -182513 -268605 190066
2284 190066 138574 48931 -17838 -151822 -129354 -7066 -91624 -204680 2961 41116 -24533
2273 -24533 -221428 -173612 137150 248734 93692 -100850 -319415 -531919 -454265 -518991
2263 -518991 -361151 -338519 -498926 -418639 -151186 -33137 -178060 6474 176177 139163
2253 139163 97008 62808 -81692 -68764 214806 206830 -26155 13586 -59101 -353059 -433501
2242 -433501 -34950 341911 358586 150031 -67177 24140 114764 124547 4233 -101079 -93945
2231 -93945 38797 -59297 -70788 -16407 4254 75953 -8450 98690 13164 -15858 119942
2220 119942 -159193 -237763 -204492 -19798 -15064 -130718 -257113 -346674 -387688 -359470 -293979
2209 -293979 70347 187584 288877 159072 -102759 -327935 -344306 -380129 -121268 78027
2199 78027 4864 33629 -96353 -229272 -78207 -89045 -238505 -161825 26112 -2245 385966
2188 385966 425277 369871 157637 54716 157980 154651 117620 464700 461564 240916 410259
2177 410259 504477 400866 210617 -117697 -190410 -160768 -252246 -84225 15733 123556 138352
2166 138352 -87436 -156310 -64499 -164977 -110329 81931 -115912 38146 384076 307867
2156 307867 254646 101591 -246323 -226345 -89647 -135410 -124570 174107 218484 -55858 132830
2145 132830 227647 203616 63819 -177854 -246060 -40783 31586 -1013 -164162 -398799 -248917
2134 -248917 -43130 197342 225048 -117929 -85952 -131156 -61319 28840 139173 21072 -107299
2123 -107299 122461 127941 237793 350290 415476 140994 58909 -184283 -86485 158594 115872
2112 115872 -43979 -233534 -24942 149645 119874 137478 193546 83638 108370 186677 224469
2101 224469 156412 254552 219620 24241 21428 235486 331536 291532 339421 447825 406327
2090 406327 320617 197709 62650 67713 318767 494667 550397 297618 -8044 -84423 62722
2079 62722 93917 -21495 100315 179590 278551 375670 212293 -50481 -215973 -267495 -33029
2068 -33029 142203 418773 663579 629303 305505 92628 222802 101463 -15627 172387
2058 172387 196613 380317 538093 243971 66875 114542 114886 68028 99294 367157 446518
2047 446518 275964 84077 -49437 42115 192751 226347 -106022 -46398 153032 328000
2037 328000 178680 152436 -29110 -189666 -323939 -433244 -341500 -234743 -443153 -802539
2027 -802539 -748125 -454550 -516651 -519581 -388890 -249139 -214129 -212044 -152614 -50837 213658
2016 213658 33974 -18192 160494 148544 83776 5324 250886 492701 515461 617453 535281
2005 535281 539313 615354 497283 382858 340248 242762 76498 351053 193804 -40701 -234376
1994 -234376 -187213 152210 302635 31203 -56331 -135939 -15276 307852 436948 393586
1984 393586 306904 308099 175464 23620 216239 303460 140622 -88913 -125798 -28039 -181961
1973 -181961 -465834 -149653 -28883 -310148 -485970 -465506 -167999 -136395 -99610 -151250
1963 -151250 64679 436419 384282 69333 28472 -46653 29569 130888 -104243 -239489
1953 -239489 -136690 -25562 56253 -24925 48215 -3720 108669 -98714 -98117 -160060 -230213
1942 -230213 -324092 -66483 269629 394129 135538 114918 282515 497537 614876 446114
1932 446114 153431 103068 39007 -109589 -194753 -151284 -107973 168112 274505 281130 284454
1921 284454 134797 -28768 -53124 -211942 -475755 -348293 -330071 -453715 -406634 -236023
1911 -236023 -111453 -39206 -26695 49190 101488 -51393 57748 158006 36992 8916 -144278
1900 -144278 -21299 135145 141368 1134 68637 155730 116389 104413 143205 344113 369768
1889 369768 112523 -4278 -4367 152074 22593 -79753 -114104 -91682 61363 95168 93714
1878 93714 154670 -24655 120989 180478 115570 -356312 -419475 -85449 105434 29412 -191180
1867 -191180 -375808 -372810 -485966 -439914 -295492 -254770 -122356 28871 94535 -118334 -68112
1856 -68112 116029 -34320 -211115 -288579 -175956 -140603 -129085 207167 335775 485647
1846 485647 344968 65488 -73620 -122921 29604 -106185 -88139 -4002 -222783 -155479
1836 -155479 -74807 -79113 -241829 -462960 -659168 -317973 -109585 125768 62802 249904
1826 249904 169983 -52649 -11424 26014 -69511 116888 42265 61494 74321 272576 296172
1815 296172 29724 -98710 -29587 189428 390701 224729 -65173 -310 52742 -11299
1805 -11299 -34988 -106900 -188948 -319039 -219448 156885 397590 283032 264913 275976 86661
1794 86661 -124286 -16034 142185 161087 127076 201083 -39034 -252065 -153690 -233333 -152745
1783 -152745 -199737 -236184 -277785 -420818 -379431 -291758 -173696 -111514 -13205 100745 13645
1772 13645 -897 447318 523280 97071 -173429 -91122 104454 248409 217313 87314 243080
1761 243080 248461 49341 -17749 43474 184493 356778 419043 262748 287584 59388 -11175
1750 -11175 -76031 41258 -18267 -115120 58757 246784 430658 345178 104824 -55339 -120290
1739 -120290 76454 20004 -56926 -156620 -114312 23151 49438 -39400 -56463 -84343 -53636
1728 -53636 141602 168928 -139019 -269574 -183728 -102603 38123 -36204 1804 96239 626035
1717 626035 676828 523427 499407 351611 130982 156072 92538 66382 270907 357479 125465
1706 125465 -55744 3696 270106 360184 213732 298490 251341 111711 133053 327215 250348
1695 250348 127159 377577 309568 -84238 -264605 -103639 -18497 -116799 -92657 -39684 182098
1684 182098 -15558 62879 298395 467196 324163 -25950 -154880 -81211 -194213 -224442
1674 -224442 -42220 -69328 115603 152721 14967 357265 424361 252988 61733 186404
1664 186404 280922 191427 88444 66559 -45593 -109716 -151770 188587 37941 63072 171767
1653 171767 183719 69780 -28649 95516 272691 384469 307647 113746 56718 -185276
1643 -185276 -100929 94709 125752 298192 391732 283660 285181 361694 382904 410238 393023
1632 393023 288767 299642 158491 327407 297158 -17340 -58278 -72936 -94531 43510 59193
1621 59193 -47923 -106981 -20150 -3182 -36723 -224709 -456805 -372324 51796 38792 -1489
1610 -1489 191654 344132 367865 243043 300299 221769 154770 -58159 -175348 -124089 13378
1599 13378 181194 -111281 -334246 -228745 -201219 -43236 68669 121577 131470 346508 427362
1588 427362 529394 815506 748847 653522 215445 53476 52381 105999 109242 31739 -23001
1577 -23001 -40755 303153 131940 -140109 -168818 -140132 -106454 -35086 82200 155221 32767
1566 32767 -116770 81448 197363 294606 435777 195674 70698 -22019 -24247 252595 483666
1555 483666 474304 247841 30474 25306 20697 80823 7450 28318 -14841 9511 -30582 -98673
1543 -98673 -201255 -139805 125299 29207 127008 318569 259568 1237 3454 -28417 -39751
$$ [...]
##END NTUPLES=NMR SPECTRUM
##END=
