##TITLE=Analysis number 319040
Compound Code mo 07858
Book Reference 489/8
Project Code adrs
Chemist Name alim
##JCAMPDX= 6.0         $$ Bruker NMR JCAMP-DX V2.0
##DATA TYPE= NMR SPECTRUM
##DATA CLASS= NTUPLES
##ORIGIN= Bruker BioSpin GmbH
##OWNER= nmr
$$ XWIN-NMR		Version 3.5
$$ Thu Apr 27 13:00:27 2006 GMT Daylight Time (UT+1h)  MAYBRIDGE\nmr@NMR_250MHZ
##.OBSERVE FREQUENCY= 250.131544655141
##.OBSERVE NUCLEUS= ^1H
##.ACQUISITION MODE= SIMULTANEOUS (DQD)
##.ACQUISITION SCHEME= undefined
##.AVERAGES= 16
##.DIGITISER RES= 18
##SPECTROMETER/DATA SYSTEM= dpx250
##.PULSE SEQUENCE= zg30
##.SOLVENT NAME= CDCl3
##.SHIFT REFERENCE= (INTERNAL, CDCl3, 0, 16.522)
##AUDIT TRAIL= $$ (NUMBER, WHEN, WHO, WHERE, WHAT)
$$ ##TITLE= Audit trail, XWIN-NMR		Version 3.5
$$ ##JCAMPDX= 5.01
$$ ##ORIGIN= Bruker BioSpin GmbH
$$ ##OWNER= nmr
$$ C:\u/data/dgb/nmr/ADRS/3280/pdata/1/auditp.txt
$$ ##AUDIT TRAIL=  $$ (NUMBER, WHEN, WHO, WHERE, WHAT)
(   1,<2006-04-27 13:00:03.13 +100>,<MAYBRIDGE\nmr>,<NMR_250MHZ>,
      <created by zg, POWCHK disabled, PULCHK disabled
       configuration hash MD5:
       84 BC 41 DB A1 6E 1D 46 DA 25 12 A5 C1 ED C5 3A
       data hash MD5: 64K
       9D 25 EA A2 D6 6B C3 21 1A C7 7C 74 63 32 C8 51>)
(   2,<2006-04-27 13:00:16.76 +100>,<MAYBRIDGE\nmr>,<NMR_250MHZ>,
      <Start of raw data processing
       ef LB = 0.3 FT_mod = 6 PKNL = 1 SI = 32K 
       data hash MD5: 32K
       80 21 B3 07 BF 72 9F D3 F1 01 4C 4F 6B B8 F6 20>)
(   3,<2006-04-27 13:00:18.29 +100>,<MAYBRIDGE\nmr>,<NMR_250MHZ>,
      <apk 
       data hash MD5: 32K
       9E F0 49 3E 03 1C 97 E7 D3 4F 7B 9C F0 74 90 D6>)
(   4,<2006-04-27 13:00:19.02 +100>,<MAYBRIDGE\nmr>,<NMR_250MHZ>,
      <abs ABSG = 5 
       data hash MD5: 32K
       EE 75 34 6E 2F 28 A3 D1 EA C4 AE E3 0A 9F 68 51>)
$$ ##END=
$$ 
$$ hash MD5
$$ B2 42 E3 2D 2A CA 78 97 90 5E 30 7F D0 6E 34 32
##$RELAX= 
##$RELAX= 
##$RELAX= 
##$RELAX= 
##$RELAX= 
##$RELAX= 
##$RELAX= 
$$ Bruker specific parameters
$$ --------------------------
##$DU= <C:\u>
##$EXPNO= 3280
##$NAME= <ADRS>
##$PROCNO= 1
##$TYPE= <nmr>
##$USER= <dgb>
##$AMP= (0..31)
100 100 100 100 100 100 100 100 100 100 100 100 100 100 100 100 100 100 
100 100 100 100 100 100 100 100 100 100 100 100 100 100 
##$AQSEQ= 0
##$AQ_mod= 3
##$AUNM= <au_zg>
##$AUTOPOS= <25 >
##$BF1= 250.13
##$BF2= 250.13
##$BF3= 250.13
##$BF4= 250.13
##$BF5= 500.13
##$BF6= 500.13
##$BF7= 500.13
##$BF8= 500.13
##$BYTORDA= 1
##$CFDGTYP= 0
##$CFRGTYP= 5
##$CHEMSTR= <none>
##$CNST= (0..31)
1 1 145 1 1 1 1 1 1 1 1 1 1 1 1 1 1 1 1 1 1 1 1 1 1 1 1 1 1 1 1 1 
##$CPDPRG= <>
##$CPDPRG1= <>
##$CPDPRG2= <>
##$CPDPRG3= <>
##$CPDPRG4= <mlev>
##$CPDPRG5= <mlev>
##$CPDPRG6= <mlev>
##$CPDPRG7= <mlev>
##$CPDPRG8= <mlev>
##$CPDPRGB= <>
##$CPDPRGT= <>
##$D= (0..31)
0 1 0 0 0 0 0 0 0 0.06 0 0 0 0 0 0 0.0002 0 0 0 0 0 0 0 0 0 0 0 0 0 0 
0 
##$DATE= 1146139201
##$DBL= (0..7)
120 120 120 120 120 120 120 120 
##$DBP= (0..7)
150 150 150 150 150 150 150 150 
##$DBP07= 0
##$DBPNAM0= <>
##$DBPNAM1= <>
$$ [...]
##$SUBNAM7= <"">
##$SUBNAM8= <"">
##$SUBNAM9= <"">
##$SW= 20.6930455092707
##$SWIBOX= (0..15)
0 0 3 0 0 0 0 0 0 0 0 0 0 0 0 0 
##$SW_h= 5175.983436853
##$TD= 65536
##$TD0= 1
##$TE= 296.16
##$TE2= 300
##$TE3= 300
##$TEG= 300
##$TL= (0..7)
0 120 120 120 120 120 120 120 
##$TP= (0..7)
150 150 150 150 150 150 150 150 
##$TP07= 0
##$TPNAME0= <>
##$TPNAME1= <>
##$TPNAME2= <>
##$TPNAME3= <>
##$TPNAME4= <>
##$TPNAME5= <>
##$TPNAME6= <>
##$TPNAME7= <>
##$TPOAL= (0..7)
0.5 0.5 0.5 0.5 0.5 0.5 0.5 0.5 
##$TPOFFS= (0..7)
0 0 0 0 0 0 0 0 
##$TUNHIN= 0
##$TUNHOUT= 0
##$TUNXOUT= 0
##$USERA1= <user>
##$USERA2= <user>
##$USERA3= <user>
##$USERA4= <user>
##$USERA5= <user>
##$V9= 5
##$VALIST= <valist>
##$VCLIST= <CCCCCCCCCCCCCCC>
##$VD= 0
##$VDLIST= <DDDDDDDDDDDDDDD>
##$VPLIST= <PPPPPPPPPPPPPPP>
##$VTLIST= <TTTTTTTTTTTTTTT>
##$WBST= 1024
##$WBSW= 4
##$XGAIN= (0..3)
0 0 0 0 
##$XL= 0
##$YL= 0
##$YMAX_a= 444358
##$YMIN_a= -477335
##$ZGOPTNS= <>
##$ZL1= 120
##$ZL2= 120
##$ZL3= 120
##$ZL4= 120
##$ABSF1= 16.522
##$ABSF2= -4.171173
##$ABSG= 5
##$ABSL= 3
##$ALPHA= 0
##$AQORDER= 0
##$ASSFAC= 0
##$ASSFACI= 0
##$ASSFACX= 0
##$ASSWID= 0
##$AUNMP= <proc_1d>
##$AZFE= 0.1
##$AZFW= 0.1
##$BCFW= 0
##$BC_mod= 0
##$BYTORDP= 0
##$COROFFS= 0
##$CY= 12.5
##$DATMOD= 1
##$DC= 0
##$DFILT= <>
##$DTYPP= 0
##$F1P= 14.0000005364418
##$F2P= -0.99999901652339
##$FCOR= 0.5
##$FTSIZE= 32768
##$FT_mod= 6
##$GAMMA= 0
##$GB= 0
##$INTBC= 1
##$INTSCL= 1
##$ISEN= 128
##$LB= 0.3
##$LEV0= 0
##$LPBIN= 0
##$MAXI= 10000
##$MC2= 0
##$MEAN= 0
##$ME_mod= 0
##$MI= 0
##$NCOEF= 0
##$NC_proc= -4
##$NLEV= 6
##$NOISF1= 0
##$NOISF2= 0
##$NSP= 0
##$NTH_PI= 0
##$NZP= 0
##$OFFSET= 16.522
##$PC= 1
##$PHC0= 171.2992
##$PHC1= 4.480088
##$PH_mod= 1
##$PKNL= yes
##$PPARMOD= 0
##$PSCAL= 4
##$PSIGN= 0
##$REVERSE= no
##$SF= 250.13
##$SI= 32768
##$SIGF1= 0
##$SIGF2= 0
##$SINO= 400
##$SIOLD= 32768
##$SREGLST= <1H.CDCl3>
##$SSB= 0
##$STSI= 32768
##$STSR= 0
##$SW_p= 5175.98343685301
##$SYMM= 0
##$S_DEV= 0
##$TDeff= 65536
##$TDoff= 0
##$TI= <Analysis number 999999
Compound Code 99
Book Reference 9
Project Code 9>
##$TILT= no
##$TM1= 0
##$TM2= 0
##$TOPLEV= 0
##$USERP1= <user>
##$USERP2= <user>
##$USERP3= <user>
##$USERP4= <user>
##$USERP5= <user>
##$WDW= 1
##$XDIM= 32768
##$YMAX_p= 493048574
##$YMIN_p= -344170
$$ End of Bruker specific parameters
$$ ---------------------------------
##NTUPLES= NMR SPECTRUM
##VAR_NAME=  FREQUENCY,     SPECTRUM/REAL,   SPECTRUM/IMAG
##SYMBOL=    X,             R,               I
##VAR_TYPE=  INDEPENDENT,   DEPENDENT,       DEPENDENT
##VAR_FORM=  AFFN,          ASDF,            ASDF
##VAR_DIM=   32768,         32768,           32768
##UNITS=     HZ,            ARBITRARY UNITS, ARBITRARY UNITS
##FACTOR=    0.157963299565203, 1,           1
##FIRST=     4132.6476996994, 0,             0
##LAST=      -1043.33573715361, 0,           0
##MIN=       -1043.33573715361, -344170,     0
##MAX=       4132.6476996994, 493048574,     0
$$ Real data points
##PAGE= N=1
##DATA TABLE= (X++(R..R)), XYDATA
$$ [...]
24711 32514 16227 -12815 -15567 36841 67915 86916 10296 17252 -59176 -34994 53546 64962
24699 64962 83843 -32146 -40882 1175 30469 86306 105221 43609 45694 98413 33854 -2465
24687 -2465 -892 -3830 12484 67834 3746 -33406 -16152 -8767 -70302 -119084 -159969 -71505
24675 -71505 -33737 875 -4517 17375 -16852 -33425 -58466 -93575 -182190 -236222 -186793 -95192
24663 -95192 -47775 -20443 -27531 -20631 -62913 -117350 -77756 13416 -2900 -2575 8578 -1582
24651 -1582 16648 37836 29204 96777 117715 105896 34469 -32661 -91823 -52050 30168 91236
24639 91236 -29147 -81020 -52824 18357 -16777 -76564 -49777 -3187 -46201 -120697 -133906
24628 -133906 -103178 -110888 -104563 -71780 -61235 75307 185259 189915 35997 -12584 -28846
24617 -28846 -33828 -21899 -14162 -36282 -58995 -122659 -106828 -110434 -131837 -108919 -76569 4528
24605 4528 14230 -77008 -58701 -13294 86318 106999 73023 52989 111958 79252 10931 -138796
24593 -138796 -128622 -33356 5370 -50835 -69026 -15279 111569 70880 -19200 -27358 -46295
24582 -46295 -5255 69267 84914 -30256 -82485 42851 21605 -43541 -63662 -37067 41133
24571 41133 116688 77325 -24199 11306 30393 -23787 -51492 -30207 -36766 -27482 -29511 -68947
24559 -68947 -126976 -107493 -130833 -149871 -106140 -35490 49567 95061 145151 119571 86709 146896
24547 146896 123756 68724 10369 -121485 -76186 1482 41016 39402 143156 167137 82761
24536 82761 -26388 -38854 -109303 -111948 -124602 -77903 3784 -2803 -4453 5285 7937 5607 -680
24523 -680 -17080 -42663 -151075 -153060 -54967 13350 1992 43570 71797 61078 24514 39178
24511 39178 40822 87850 79340 922 -53670 -43758 -34293 -58492 -28779 67336 33642 -55453
24499 -55453 -86956 -64594 -67698 -78417 -16908 -55696 -132193 -81976 -157397 -185649 -205274 -188788
24487 -188788 -167306 -109194 -87590 -88537 -128547 -116467 -146448 -105939 -1616 -36941 -25869 27207
24475 27207 49497 1484 -21484 -21508 -57475 -24906 7460 -43246 -80235 -29142 14519 37498
24463 37498 16309 44964 40689 71236 83494 4455 -8356 -24060 -41828 -53993 -136960 -183138
24451 -183138 -144494 -59445 -36735 -31993 18278 3066 58760 124323 106744 -8314 -18094 -3225
24439 -3225 7641 -1886 -86919 -83197 -114860 -135793 -121078 -95422 -77042 -49312 -85445 -95737
24427 -95737 -122684 -133532 -142934 -187670 -74171 -50892 -71798 -58547 -48167 11184 -40987 4591
24415 4591 -24067 -60842 -15040 65207 44533 70171 33742 -9546 -6083 -29114 -42386 -90021
24403 -90021 -30276 23846 58056 43928 -13909 12185 -26162 -56122 -74736 -16333 931 63941
24391 63941 -27431 -76810 -119998 -182726 -116797 -73737 -52240 -60593 -60405 -95780 -92730 -29682
24379 -29682 19690 -25142 -5055 50889 110909 128603 118744 72589 -31340 -32190 -16597 -5929
24367 -5929 64733 78867 42902 -19643 -23270 53853 65090 6049 -49703 22851 -23505 -108614
24355 -108614 -6847 43380 57232 -28055 -21163 32520 -9819 -26246 14703 10285 5424 -40987
24343 -40987 -60613 -92297 -135037 -64392 -59060 -40632 -54367 -59676 5991 51524 133340 121873
24331 121873 75378 103870 64372 7984 21405 79433 51976 52454 50203 -12327 -42441 -51876
24319 -51876 -42282 -43742 -84948 -86995 -100935 -68592 -50681 -52511 -84614 -112720 -41863 -58635
24307 -58635 -47621 -42902 -3850 21296 418 -94198 -133790 -152174 -143465 -91738 37703 90026
24295 90026 125746 143881 93505 76301 160126 180979 119308 99786 147662 135752 69400 -57636
24283 -57636 -118289 -125515 -45346 -25797 -53785 -12573 94377 101176 -17734 -59223 -12678 58736
24271 58736 81838 80475 48732 40630 49892 57382 96577 82066 43010 44488 47802 -38349 -42090
24258 -42090 -43846 -21486 3043 1675 6820 9360 -1573 18627 48675 109604 49164 -60017
24246 -60017 -41995 43249 52586 102936 107365 37096 -43712 -65021 -110715 -154726 -104083 -70813
24234 -70813 -91135 -62194 -33551 28980 89638 102861 93155 58627 73673 -26888 -61311 -120545
24222 -120545 -76530 33204 7058 -3281 -74419 -58409 -53176 -44653 -44432 12934 10877 -19097
24210 -19097 -112651 -168015 -135377 -107777 -121903 -86208 -88192 -130816 -125966 -150493 -45847 -92951
24198 -92951 -79445 763 31232 -50780 -101498 -70219 24768 -9255 -72564 -73302 -5600 -20338
24186 -20338 -47489 -29744 45929 117521 117054 90914 103761 76784 36446 -66371 -74560 -6457
24174 -6457 -35360 -92228 -132406 -120413 -65499 -9468 -66180 -159334 -168522 -143994 -138424 -70399
24162 -70399 14066 56784 37868 -7515 -57614 -102014 -99823 -32628 -1548 19112 90885 37474
24150 37474 12494 26309 19307 -33667 -69862 -88115 -32560 7181 -8003 -118782 -137370 -88190
24138 -88190 -108259 -141012 -141799 -70316 -22148 115327 142449 82357 19642 -86378 -108476 -116481
24126 -116481 -105340 -83599 -69687 -17193 -14632 5350 -8435 -6575 -29051 -20081 -45105 -105840
24114 -105840 -122124 -35302 -38994 -86568 -130756 -112244 -133588 -132138 -117604 -78674 -41874 -69556
24102 -69556 -71591 -97636 -120440 -81540 -28873 -41177 -14062 4221 -56963 -48216 -38077 2740
24090 2740 -49270 -96698 -73253 -56747 -59693 -24684 -22590 -1639 23374 58991 58951 18950 -79191
24077 -79191 -104138 -37353 85724 88837 52295 7776 -98786 -77097 -29690 12823 7319 2631
24065 2631 -21368 6424 49850 15562 -9333 -66281 20953 81348 160549 144887 78267 1965
24053 1965 -75008 -20336 -77220 -150751 -83542 15519 72393 107917 91943 88930 -13783 -61275
24041 -61275 -1800 50269 -24350 -102059 -136245 -162517 -131169 -102636 -101185 -53355 -83039 -147467
24029 -147467 -106632 -140763 -143128 -129963 -139498 -102903 -50108 24192 101468 66528 66260 37843
24017 37843 24891 -23267 -52849 -21888 -69485 -55584 -26882 -40032 -84345 -151954 -142417 -110362
24005 -110362 -69734 -80586 -20254 40667 39199 24111 28352 -3298 -55477 -138162 -150400 -165395
23993 -165395 -134804 -66650 20888 15904 -29637 -63836 29280 42738 81825 127435 40991 1858
23981 1858 20219 98627 33271 54586 44847 -36755 -52291 -6364 2750 -4886 -75189 -45779
23969 -45779 41326 38001 30820 94176 129673 100768 11203 8264 -6778 -28770 76693 104549
23957 104549 104124 51499 90950 118541 162316 193899 117975 7935 21192 121379 140443
23946 140443 10578 -85303 -94619 -42282 -77352 -82460 6221 4275 -54611 -95078 47259 140050
23934 140050 157211 112847 111343 188706 154222 165172 118731 3133 15640 78523 127470
23923 127470 73308 17853 -27480 -44327 -73905 -78211 -86050 -103435 -85301 -50773 -17624 -4063
23911 -4063 -13456 -30598 -18527 22707 -61390 -41096 -3522 -37360 16304 48760 74001 98986
23899 98986 26806 -1360 -12912 -15191 35243 86452 4496 -71282 -117393 -144962 -108433 -69856
23887 -69856 -52836 34266 -17599 15306 -27705 -66598 -87721 -110171 -95929 33296 39228 23772
23875 23772 -29057 -24713 -24225 5595 16091 -14717 -80381 -126110 -46743 46518 20024 -728
23863 -728 -33387 23648 84765 24330 -4821 50019 -51678 -73089 9092 15844 62374 61343
23851 61343 25156 -3378 -51887 76669 86763 34107 33372 27304 34157 7767 -33859 -105537
23839 -105537 -143386 -87903 -45340 -31008 -85685 -142156 -149256 -45528 32542 71656 86672
23828 86672 -59614 -167975 -137747 -97187 -115168 -84554 -109738 -83004 -62517 -39620 -26355
23817 -26355 -47262 -64686 -8269 3216 -25871 -28878 -65212 -81399 -58505 -48604 -18863 -38889
23805 -38889 -50009 -93892 -125532 -31720 -24931 -9750 -7628 33976 119193 82363 39394 -35781
23793 -35781 -76108 -135691 -194421 -127605 -23332 74290 13937 -76466 -13341 46905 72643
23782 72643 51645 -4685 -41840 32704 99488 142600 189864 136848 50477 -64466 -67724 7094
23770 7094 12296 -52203 -49798 -77528 -96462 -111478 -104108 -112749 -84219 -63431 -5841 -36002 -71504
23757 -71504 -127768 -104208 -40589 -34513 -86876 -72960 -3992 -11578 21507 -17100 -100014 -71228
23745 -71228 -11073 32159 36904 41656 44267 12395 -3454 27346 15603 -21620 45921 45520 -35008
23732 -35008 -27958 55646 135186 74754 -37049 -76399 -63996 -5408 61412 19747 117 47270
23720 47270 81874 39093 -32415 861 -69275 -96530 -28418 -21531 -32815 39829 113447 125784
23708 125784 83490 80612 132458 115514 97401 137810 160361 102162 112332 115439 32563 88761
23696 88761 86237 -279 -63331 -125484 -106677 -92373 -95356 -107768 -71638 -27646 -63865 -142196
23684 -142196 -165167 -148637 -175322 -224284 -199875 -126219 -71593 -88327 -123306 -114510 -130626 -228875
23672 -228875 -282815 -266983 -157575 -141632 -168479 -129911 -110535 -91088 -78178 -66482 -48604
23661 -48604 19589 6543 17887 67508 88393 103589 94022 56383 103614 9429 -21353 59512
23649 59512 72218 77307 125774 132642 137435 160409 173930 82942 32456 52069 109222 81969
23637 81969 46976 78916 92787 150573 98043 115981 226944 124916 74989 33572 -9263
23626 -9263 -17322 -4552 66710 48614 847 -76642 -1984 -11234 -54531 -107323 -62345 -38938
23614 -38938 -103570 -104466 -63125 62537 144411 186916 127080 68111 -18149 -118093 -132294 -119077
23602 -119077 -124327 18556 106019 62200 38276 41845 67801 79917 25722 38461 42216 60413
23590 60413 15844 -50079 -107799 -95677 -134728 -150069 -172941 -94955 33484 55116 16621
23579 16621 45571 43234 37123 74092 20250 88864 105734 36023 -26271 -44404 -84769 -6781
23567 -6781 51347 -97965 -78561 -129369 -72442 -56784 -34565 -46583 -17237 78899 76945 61912
23555 61912 44290 45346 55068 53792 56571 119309 85628 78644 64940 45725 71979 127001 78164
23542 78164 51279 29683 69848 95759 44244 20383 79129 107897 143919 50974 -6675 -112192
23530 -112192 -136650 -38169 -51568 -84241 -42369 -82665 -75638 11552 67631 51991 65749 149213
23518 149213 188451 115583 151368 53815 7268 84583 -21546 -141018 -45657 75783 73819
23507 73819 44587 2834 9002 4679 -28912 755 -29904 -105317 -88881 -49675 -38949 -13758
23495 -13758 -16390 12662 34405 -7905 10603 124103 103985 -52175 -84619 -32717 122670
23484 122670 53237 16280 -9248 -35424 -51591 -91659 -112570 -151339 -137823 -99041 -147504
23473 -147504 -132226 -116816 -74800 -46298 -44561 39806 96873 77336 -75435 -218899 -205763
23462 -205763 -144468 -139935 -81808 -11842 555 8199 45537 114650 137933 69011 56655 134523
23450 134523 153425 130268 32140 -101830 -132777 -65225 -47675 29928 84815 104025 162095
23439 162095 155319 133447 67884 140839 122334 98996 -10265 -82990 -102306 -79947 -78569 -95204
23427 -95204 -131524 -197899 -165223 -44522 37910 40083 76464 50127 2891 -24909 49012 123940
23415 123940 137055 74530 59541 86247 18196 -69738 -70621 -79509 -49119 -35594 -10365 -6653
23403 -6653 -33010 -28985 -73270 -115811 -183130 -263012 -221522 -198019 -133400 -70632 -8266 -7481
23391 -7481 -44296 -43174 -7640 23604 17319 4498 -53880 -157026 -115883 -70960 8946 53004
23379 53004 14506 -53243 -54033 -134198 -85776 -7744 -29323 -15534 -38392 -26209 77718 69557
23367 69557 81904 44062 -35631 -73898 -138295 -173447 -171530 -229368 -123638 330 69005
23356 69005 52874 6895 -64600 -125498 -149633 -132176 -125652 47648 155546 40588 -24081
23345 -24081 -33633 -108830 -55018 -4817 91807 98460 20915 -52606 -75585 -41753 -15605 -47748
23333 -47748 -4787 16485 -64542 -44007 96030 127507 79030 64770 21199 63671 146571
23322 146571 169676 60726 133005 151680 124038 126678 43829 12281 -125512 -92115 -82356
23311 -82356 -59398 -31060 64947 83982 9424 -46626 -107169 -85481 14115 72132 -60618
23300 -60618 -111879 -6166 17671 -37197 -96114 -54184 -78962 -15875 85965 107537 68585
23289 68585 81396 18855 -30018 -57638 -101974 -102203 -94797 -119306 -82158 -14864 50814 649
23277 649 -35838 5380 4995 -57027 -126429 -118442 -126075 -122425 -101807 -71000 -65819 -121995 -224839
23264 -224839 -165138 -97407 -58836 70358 90785 -71798 -123014 -62159 11165 26315 52671
23253 52671 93375 31444 -28579 30797 48731 22794 47975 71420 80424 52962 98140 77171
23241 77171 67537 11250 -72199 -110677 -147486 -141643 -108506 -97801 -154285 -151084 -58142 -17324
23229 -17324 -53257 -64845 4941 15221 -121167 -242109 -221913 -118292 -55387 -52140 -40242
23218 -40242 5633 12564 11678 96423 109602 97886 15047 -58209 -83006 -11925 47066 -24746
23206 -24746 -94194 -86228 -6639 24965 -9768 -73922 -168812 -230020 -228939 -134000 -87855 -64656
23194 -64656 -3857 -12020 -59586 -33853 -29274 20116 60025 95614 53538 49244 92776 98797
23182 98797 124076 14044 -58686 -120917 -1221 69489 19662 -62157 -9626 70997 120573
23171 120573 36292 18941 34108 36162 -21892 -55065 -74055 -81837 -80181 -109733 -154335 -165904
23159 -165904 -112364 -84538 -60070 -26796 26973 -25994 -71129 -34307 -48474 -104281 -127886
23148 -127886 -88778 -26606 21204 2988 -74806 -55474 -29581 -30726 -65034 -124810 -113923 -104620
23136 -104620 -18910 1137 -92174 -115506 -97326 -113618 -93867 -112151 -138588 -104755 24979
23125 24979 42269 -51066 -45546 -14560 34414 119661 126955 98326 32168 -42939 -116353 -188879
23113 -188879 -112651 43733 45941 61645 129908 154024 65359 -56932 -127368 -128420 -107555
23102 -107555 -100894 -32353 26740 -43536 -102034 -40136 24479 6566 72177 58672 40127 -4532
23090 -4532 6071 -73342 -137348 -136130 -168960 -86423 -44133 -33146 -32203 -36090 -70992 -38939 -78599
23077 -78599 -92406 -111582 -71021 -23785 -583 -8011 10869 -6518 36231 14661 -22847 -37758
23065 -37758 -92951 -116413 -115030 -165107 -51468 -65098 -122261 -117711 -87850 18673 49452 31431
23053 31431 41903 -23782 1795 25835 81260 49151 73133 65169 -22036 -61416 -75059 -111274
23041 -111274 -74578 -59076 -46911 -44440 27991 66467 34905 25671 50056 29921 -28025 -31291
23029 -31291 -43224 39975 86841 98296 85122 12596 21032 27555 13334 100593 153495 118302
23017 118302 -7767 -51134 -38164 -79371 -52724 4549 -56251 -117502 -15154 61032 56226
23006 56226 -41197 -67693 -2588 10550 94198 97812 77780 100769 20718 -114636 -174889 -151659
22994 -151659 -79290 -28802 61989 102798 137778 101256 11595 -7474 -8207 -14948 -10614 -65002
22982 -65002 -37918 -66257 -111117 -114345 -163695 -118254 -44298 -11958 -42016 -109011 -111196 -25741
22970 -25741 -2311 -3736 33614 56157 67588 99281 33324 -69680 -79072 -55121 25296 166343
22958 166343 141442 119613 148158 139610 47355 31576 76235 15487 -38263 -33513 -38354 19595
22946 19595 -42212 -73876 -1700 9776 -37987 -18939 17209 -56629 -66884 -18061 36657 39729
22934 39729 23460 -57886 -72976 -31093 -49090 -135793 -108318 -18162 71246 50450 -8067 44725
22922 44725 56063 -13630 -25327 -118048 -212793 -209879 -134979 -86177 -54446 -36521 6875 6489
22910 6489 -58104 -18288 -49906 -81474 -160042 -213031 -104242 8929 92031 78471 -27320
22899 -27320 -80756 -33021 -35588 -75360 -62431 3501 1914 -58848 -110488 -57662 -66382 -64564
22887 -64564 -78153 -114374 -70458 36052 110489 71286 -25860 -98630 -146116 -107303 -98978 -48800
22875 -48800 -69755 -38626 -55637 -23684 -63752 -24944 31421 55655 104966 161049 83284 -10760
22863 -10760 -4911 12668 9013 -77850 -72755 41859 59899 61547 -4856 -80616 -40750 -39899 -17914
22850 -17914 7777 78042 98602 41366 -21978 39371 98369 63900 73893 103946 60257 43096
22838 43096 77160 131772 134638 3011 6666 37662 21330 84 -70185 -6625 52464 27191
22826 27191 41490 150944 156227 93716 -8120 16579 95719 27519 921 -25379 -31807 1072
22814 1072 81552 59018 59951 -17074 -50809 32342 -30882 -4562 30065 -24008 -34338 -83536
22802 -83536 -64431 -87027 -137094 -114744 -63037 -69929 -119141 -51077 -81908 -45277 -48563 -61952
22790 -61952 -85461 -47164 11401 44056 1928 -88583 -24830 -75459 -54163 -45682 -111657 -173304
22778 -173304 -117913 -106880 -116724 -144313 -145625 -78230 -58112 -77942 -30790 -21419 -30254 9522
22766 9522 39254 98518 75708 -56328 -113913 -100223 -31566 25380 -82043 -99253 -54547
22755 -54547 -149650 -152762 -71671 -82069 5316 -16395 11358 18380 -17229 -42858 -94018 -52786
22743 -52786 -48073 -44916 -122901 -149388 -143766 -93729 -54381 8334 -933 -18549 -23942 -30192 7465
22730 7465 -63009 -99574 -71187 -40703 -30153 -65460 -149695 -94873 -79321 -82129 -65151 -36135
22718 -36135 -637 -2773 25751 12989 47149 -18302 -107499 -131423 -141868 -171381 -193257 -90079
22706 -90079 -85207 -24283 54547 24585 -50652 -90323 -86883 -105812 -117850 -95311 -60438 8639
22694 8639 -9992 -118 74356 44877 -26179 -93579 -49578 -101726 -113497 -87567 -69428 -31774
22682 -31774 24995 65034 -14230 -43386 8438 -8309 -39016 -35916 -72472 -126386 -70237 19264
22670 19264 36872 -36438 -65691 -32387 -13844 17169 9678 -113371 -111012 9388 42619 4264
22658 4264 -45577 -63163 -10002 -12656 -42920 -86594 -104389 -66604 -87094 -157064 -188720 -154415
22646 -154415 -64571 -42082 -38705 -11735 -50398 -56489 -87555 -54159 -20095 24472 30300 8009
22634 8009 9553 -32879 -104631 -50232 53162 160503 159148 116452 -8401 -144530 -134174
22623 -134174 -20577 -3289 -73004 -56500 -66487 -100402 -26673 2247 -51335 -129593 -133775 -123877
22611 -123877 -38827 12767 -19974 -110334 -176333 -177315 -45370 50989 10638 -97442 -82549
22600 -82549 22236 13723 21082 113466 109211 133803 139137 45991 31646 -7594 -118303 -151995
22588 -151995 -111281 -103170 -124857 -82993 -14130 -20558 -27129 52595 122240 143334 140314 100965
22576 100965 18568 -10836 -37829 -64617 -54773 -28148 -63776 -121624 -30824 -19867 -45499 -30189
22564 -30189 83800 72208 23160 41348 -15070 -12804 63988 91397 23809 -54341 -88150 -43101
22552 -43101 -23808 -66698 -29822 -23872 -33271 -8952 -13637 4582 111171 181293 162000 125435
22540 125435 76257 -4235 115426 74134 -40762 -209269 -214517 -131433 -96734 -33042 -5024
22529 -5024 -24612 -93164 -52013 -83026 -101144 -168584 -87435 -21287 9813 -45501 -37773 1562
22517 1562 1013 58262 108184 127434 79532 67670 106679 137967 111287 34824 -44503 -52474
22505 -52474 -18710 -49800 -17795 17375 79392 59209 80707 78550 25396 13546 44983 126846
22493 126846 141659 113808 100993 121208 85174 927 -43456 -11702 -25283 -24475 -33557 -68528
22481 -68528 -90643 -54400 24508 103130 -13079 -88899 -82221 -46750 -12106 9960 88257 66813
22469 66813 -1188 -9468 85447 113602 126013 54611 -54504 -77702 25283 42375 -33671
22458 -33671 -73933 49363 147621 70395 11875 41207 117957 45062 -56838 -129131 -112661
22447 -112661 -95193 -58740 15341 -28368 59765 64812 38986 87179 85894 -40431 -53 49514
22435 49514 4077 -3759 -43801 -72590 -106695 -79827 -72821 -70548 -12981 46774 -36708 -70024
22423 -70024 -66659 -67972 -28367 43510 188978 213615 107257 1539 -3744 61645 114758 31482
22411 31482 -76148 -149231 -228309 -270609 -207718 -61733 -36192 -20879 -16907 37896 8911
22400 8911 784 -25247 41655 5791 -61459 -117940 -197582 -55923 -1180 29383 51744 135820
22388 135820 126780 44945 67859 77340 56206 14386 11015 10714 48892 118261 169076 154812
22376 154812 64284 34406 -60485 -2972 -19127 -71499 -124451 -188747 -153752 53411 131337
22365 131337 99054 28305 21230 -3339 -65108 -105454 -52364 -3952 -36536 -74861 -19229 17853
22353 17853 33496 41923 50605 11218 -1831 -25754 35664 13414 -20394 -36622 -88733 -73981
22341 -73981 -55012 -61483 -146735 -47586 23858 18725 40674 22351 -79190 -88823 34216 107236
22329 107236 100401 60756 13401 43511 58895 54720 56008 -31705 -142242 -95877 28623 49237
22317 49237 23816 -24031 18572 134439 121873 90831 139 -81095 -101069 -79084 -125542
22306 -125542 -73732 42828 98071 111385 54994 36938 21090 20790 -116719 -140396 -60501
22295 -60501 1421 86502 70573 47516 32339 4891 -104992 -235271 -321976 -306199 -129971
22284 -129971 37892 36058 -19599 -26693 -67077 -69802 12100 70711 -15874 -77217 -156869 -110855
22272 -110855 -120146 -71639 41722 56049 -16179 -61356 -2887 8281 -21375 -42490 -70624
22261 -70624 -67734 -46255 32068 70862 83031 103032 81993 103389 76251 138012 104513 -1496
22249 -1496 3417 55093 28149 19381 72331 41263 34267 53183 16920 -5310 45314 65677
22237 65677 16040 11936 6682 -55499 -111639 -77485 -41992 -69525 -54366 -14225 34874 23350
22225 23350 -9049 -46482 -72389 -89662 -102193 -114133 -97750 -81339 -40834 19660 4560 -58162
22213 -58162 -29057 24889 51384 9094 -33390 -74251 -115001 -81307 7884 22986 59821 12432
22201 12432 -14931 -31847 -134635 -125874 -63311 -40197 -8983 41840 24419 15299 9107 6895
22189 6895 -12633 -6829 32768 38942 -41879 -67484 59392 84579 50852 -41333 -17304 -59975
22177 -59975 -170293 -115334 25191 16103 48153 3503 -102052 -134470 -18590 49707 77403
22166 77403 70993 162210 169355 149137 171615 96030 -47639 -88054 -75636 -119555 -63148 12832
22154 12832 32523 -21714 -53151 -11469 80629 38061 -104819 -156372 -192735 -148648 -142078 -135197
22142 -135197 -100593 -64240 -10601 54587 -51470 -116441 -86925 25526 17873 -40700 1573
22131 1573 71175 37343 -46387 -37612 29744 14153 -7518 -4541 -2678 -9177 38527 -4289 -9347
22118 -9347 55521 53594 -14493 -25647 -26244 -1892 -427 -40437 -66743 -132228 -72461 -28298 -9061
22105 -9061 -24835 -53614 -60445 -110303 -66762 13395 53774 133841 111120 17384 -65054 -589
22093 -589 96635 144628 109724 43455 -45063 -34813 45604 73471 -24170 -46020 -18152 -355
22081 -355 -54602 -145380 -136550 6856 61487 15254 -102809 -146341 -55279 -3151 13161 40634
22069 40634 79679 100520 43437 -13701 -24020 1197 -9553 71051 97109 94448 84789 162103
22057 162103 167647 79652 16272 5957 26092 24589 -20331 -51957 5212 46601 -7523 -79352
22045 -79352 -20903 -6267 9487 26945 69178 49370 -18725 -43789 -65750 -73406 -59740 -38681
22033 -38681 -62217 -58700 -72186 -63908 7134 -4959 42296 130344 145130 116484 72851 49325
22021 49325 -19356 -4443 8178 4760 25160 13809 -36926 -41119 -6863 17347 -35071 -23927
22009 -23927 -21690 -35532 -70176 15762 25085 -91837 -151430 -85891 29048 38961 72047 158879
21997 158879 77850 110681 137357 81682 40814 -18066 9330 18202 -46651 -52794 -27733 -35804
21985 -35804 63687 -4148 -86149 -22046 14768 39820 26196 63823 5085 -25466 -35151 -3428
21973 -3428 1328 -32243 -4761 15317 36551 -34405 -27132 29465 -11938 -58158 -3113 29917
21961 29917 38262 50263 -22553 52570 53224 46632 42562 64904 77319 85209 108571 99564 63481
21948 63481 33952 56389 102818 151866 104644 -5459 -13601 -9553 -34946 -34565 15732 86781
21936 86781 61840 12600 53499 827 -48052 -96745 -103855 -75253 -29211 -15771 53069 50954
21924 50954 5698 11097 27460 4828 51400 11856 -75230 -80896 -44254 -72500 -94209 -76895
21912 -76895 -70171 -46285 32460 36426 -92225 -132265 -100812 -149960 -139214 -146465 -175647 -136134
21900 -136134 -179987 -217565 -184938 -105305 -34325 11708 13709 4078 -31127 -14271 -3734 -53676
21888 -53676 -90618 -8293 22229 31280 41632 23716 27492 40241 -25235 34827 54468 6469
21876 6469 -38069 -79041 -159893 -81976 -55349 -81431 -81050 -61804 -74146 -106280 12644 38709
21864 38709 -54676 -73616 -72817 28805 108477 76006 48465 -50265 -16173 -20426 -94757 -90601
21852 -90601 11820 20891 71829 -302 4004 45360 28385 113405 176369 145151 100165 93279
21840 93279 58379 23861 44310 119194 86355 105056 52209 -82390 -136284 -115394 -80344
21829 -80344 -74793 11309 51831 3202 -111033 -71231 -15839 -21291 -108745 -158248 -85115 -53667
21817 -53667 -67519 -173438 -157771 -206148 -246257 -161363 -98665 -69877 -62300 -704 83107 90103
21805 90103 9243 -4164 1706 25485 46553 126964 163999 125864 162095 141627 130960 102076
21793 102076 118343 125058 49756 -53491 1154 86090 136183 104079 43572 47093 78495 80710
21781 80710 19938 -1965 -48019 -80590 -112263 -99536 -87573 -119932 -121201 -131051 -126557 -25625
21769 -25625 38783 29859 41928 89874 81085 11010 18691 -6170 33782 41458 -59349 -88632
21757 -88632 -52742 -76670 -30648 -22210 -9350 -69372 -190816 -211226 -224286 -216867 -241338 -249546
21745 -249546 -237243 -223438 -150111 -128910 -133525 -161547 -188411 -172172 -51083 111974 139661
21734 139661 64656 -7732 -54687 -93686 -92000 -53743 -88663 -82190 -31768 -11422 -14291 13109
21722 13109 5250 -19610 17314 140506 152936 81458 18639 38179 124968 68275 47996 46002
21710 46002 -43369 -26540 46695 17843 98065 39447 -10396 -13519 -29128 2161 29656 -41668
21698 -41668 -139968 -153833 -129108 -98580 -206092 -173042 -56097 -28527 -87278 -71075 -9057
21687 -9057 97403 111431 65316 -22132 -6765 12432 11274 -51617 -120402 -191422 -117938 -53941
21675 -53941 29425 94091 78365 20683 72586 187294 113408 54136 56218 46930 78513 80871
21663 80871 -12491 -55012 -27855 -14495 -20917 -31271 7728 -38417 -108545 -66595 -91235 -90197
21651 -90197 -33753 38920 -4828 -56735 -47238 -3234 45834 67979 24162 -84493 -218689
21640 -218689 -268777 -203885 -202291 -203739 -117636 -78913 -104580 -110648 -108233 -57963 -72403 -140955
21628 -140955 -213445 -206760 -118429 -103285 -66775 -57606 46436 38005 -28239 -11424 -29791 -16839
21616 -16839 -19861 -72768 -97293 -94653 -127221 -79409 -94134 -63483 8349 52095 28678 -21114
21604 -21114 -69567 -101540 -63607 -39219 -41685 -6790 -13293 -42487 -21605 -18489 -52651 -80869
21592 -80869 -51018 -80109 -123713 -155516 -104758 -126337 -130526 -73671 -7584 16560 25728 19902
21580 19902 76669 107311 129237 104686 67102 48772 44623 99808 68615 39607 75148 42542
21568 42542 -9116 33360 88895 70489 -17248 -70899 -117522 -148986 -94884 -52146 -12454 -30880
21556 -30880 -104632 -91644 -75073 -35194 -23436 8400 -74045 -77749 -54389 8686 19 23753
21544 23753 30419 9127 -28532 -14393 7987 31885 2408 -11290 4120 -17806 -30000 59297
21532 59297 70480 36035 43494 -19384 -37468 -13452 -24822 -144285 -152079 -7857 6400 -86179
21520 -86179 -56198 -10054 -21910 -17421 -54810 -198969 -88955 32886 81541 28847 298
21509 298 -75769 -89482 -53482 -42630 -65039 -86386 -10821 -27234 -9012 6271 33231 51846
21497 51846 13388 -31242 -110051 -79333 34856 45547 12238 -26030 -79534 -114604 -132431
21486 -132431 -73275 -28511 -55497 29130 26283 13284 -83792 -60578 -44305 -31296 -38938 -126849
21474 -126849 -198306 -192224 -67041 -37273 -3822 75223 102920 262198 200862 44208 38169
21463 38169 64507 49091 71189 116754 60649 29295 47649 69856 93538 119037 84639 2683
21451 2683 -32010 -52917 -58546 -59032 9301 88278 20526 -16622 57326 76290 42678 55384
21439 55384 65152 -35051 -70168 -70540 -88602 -123611 -109859 -136983 -103739 -57018 -1107 30877
21427 30877 54651 93724 84258 108864 123030 82116 17945 -18711 -46132 -46107 -68372 -105218
21415 -105218 -84851 -46045 44471 55292 -2792 -34681 -22813 31279 49038 -33150 -67302
21404 -67302 -86354 -74138 3021 -6074 -29701 -68221 -163081 -128743 -15584 22944 3982 75510
21392 75510 157957 98527 131332 149853 163720 215440 190097 217162 119443 38509 33338 31411
21380 31411 44180 -50941 -111281 -74317 -121488 -161819 -80534 33787 -12616 44962 84997
21369 84997 53196 116170 72161 -52017 -95035 -33095 3692 -53276 -139304 -152666 -7207
21358 -7207 98666 18272 -69519 -30578 -6308 -31705 -60170 2741 -16182 -5132 7224 -80128
21346 -80128 -66370 -13212 -68287 -55078 54685 77962 30893 38989 53147 15798 -8290 -38994
21334 -38994 -113983 -35858 -24560 -56435 -29631 -13935 49240 24660 -16174 -21265 -52246 -69163
21322 -69163 -27440 -17445 -1756 -6510 12858 35079 -82384 -87772 83 39177 -16968 -74204
21310 -74204 -88776 -89918 -82987 -22243 33807 -24253 -61855 -46526 -3330 12558 23450 -32314
21298 -32314 -16702 -7170 -14036 -49688 -85339 -59695 -63883 -123005 -58153 54703 72587 19234
21286 19234 -24495 -48659 -93116 -80775 -9385 93196 126340 95170 92985 94432 25594 -38139
21274 -38139 -11984 32378 -9829 -81786 -108710 -134609 -132303 -158171 -73521 -41350 -101567 -124486
21262 -124486 -100062 -83600 -104262 -138720 -119308 -71293 -30787 -34730 -125649 -141895 -57742 14328
21250 14328 13875 24097 8656 -20971 -59659 -75860 -127482 -70345 -61199 33458 59976 -56788
21238 -56788 -92024 -49186 -91060 -162972 -145772 -96790 -21586 -51 47177 8057 33334 62939
21226 62939 13088 84783 146332 76011 80914 21409 19787 22850 -121987 -174913 -231480 -214259
21214 -214259 -128465 -73891 -146164 -133514 -114159 -146195 -119402 -82315 -135707 -145970 -78246
21203 -78246 -69957 -49177 -41203 -123368 -99572 -21713 25724 -57607 -103865 -61575 -92143 -81969
21191 -81969 -40080 78605 114838 65217 51641 62311 77293 28755 64858 72159 36777 38195
21179 38195 125354 94040 8402 -14154 33780 91530 17240 -119181 -121207 -119036 -161359 -78809
21167 -78809 10399 20386 28893 38279 68284 13843 -5405 26299 80297 93696 7450 -10736
21155 -10736 -75922 -90314 -86936 -145681 -199157 -124856 -55622 23533 60619 -5156 -97936 -70731
21143 -70731 62791 121994 67670 20069 4858 75945 151670 72612 25982 26143 27013 -1267
21131 -1267 42723 66307 40609 71143 89961 60803 48129 8947 -118176 -149133 -63973 -49233
21119 -49233 -95488 -66817 -81741 -77996 -45586 -47624 -56788 -60577 -94575 -47860 6265 67973
21107 67973 96567 42814 30442 41143 60905 16692 -31874 -35049 4149 -9406 84396 102038
21095 102038 55005 -55193 -97895 31071 69579 104534 90654 92389 85974 132761 131281 98160
21083 98160 16017 32221 -23883 -37285 -4020 -44012 -48528 -65183 -116511 -68989 -68452 -22708
21071 -22708 -8839 34189 79966 43152 -27344 -776 97018 85567 86978 127021 195987 149152
21059 149152 84600 -31111 -83818 -146860 -142169 -74254 -107544 -103131 -60282 -58465 -35298 19117
21047 19117 -4934 9116 3523 20109 76961 16447 -51390 -23660 5894 -10948 14965 17754
21035 17754 21481 -328 -102311 -107288 -115844 -98584 -63140 22321 -3698 -65234 -86280 -104934
21023 -104934 -66598 -121113 -100614 -23222 3705 35119 38240 -39319 -121598 -76131 -77357 -13250
21011 -13250 -6383 17318 -54682 -83906 56807 50837 41553 52399 -24949 -113091 -66846 83509
20999 83509 41540 453 -67184 -81219 -101646 -160344 -135965 -76678 -79206 -16482 110369 135576
20987 135576 45610 58773 79561 1030 -9367 -68260 -43644 -30815 8987 29334 -67465
20976 -67465 -38117 -11285 22604 69580 57674 16391 58109 97622 54173 92002 58689 41698
20964 41698 55736 -33325 -229351 -226291 -92255 79787 173218 129428 90247 35209 70535
20953 70535 39517 16267 -41526 -90817 -75242 -62553 -40895 -60095 -9133 -49616 -82376 -54992
20941 -54992 -31854 -78152 -25116 85656 149109 95680 68565 28807 14612 16984 -2549 -30194
20929 -30194 -53825 -132180 -100453 -38008 -101919 -19671 -287 -17827 5774 -27778 -29515 -25892
20917 -25892 -49538 -126269 -69887 -11920 -35727 -105058 -122920 -69320 -9445 -8788 -65078 -95289
20905 -95289 -129610 -19489 27240 21769 -51572 -27542 -68822 -151769 -141371 -69785 -93862 -132432
20893 -132432 -41799 -6519 -35741 2479 -62267 -117031 -103096 -33243 22245 56177 83330
20882 83330 19881 -43492 -136441 -119134 -15870 -29278 -65242 -33605 91749 49773 -1431
20871 -1431 -45952 -20808 -2097 13570 -55222 -110618 -22899 95211 121327 122822 19254 -39264
20859 -39264 -5659 33794 -10198 24841 113363 190411 233394 206718 142187 58254 -25170 40792
20847 40792 -27997 -93273 -106443 -147803 -150607 -177088 -224083 -241433 -254821 -193770 -168591 -106902
20835 -106902 -26692 -43357 -67660 18939 41946 99948 52601 2633 -7251 -44268 -36984 -10505
20823 -10505 10256 6753 42032 117171 94902 48207 -32960 -42323 -57797 -96941 -99354 -98713 -161994
20810 -161994 -100561 -38218 8953 -28693 -96748 -86230 -96345 -38208 -25473 -11940 -69536
20799 -69536 -83490 -74700 -61789 -65463 -107456 -75393 7777 -53007 -135606 -110605 -63792 -41674
20787 -41674 82562 123536 72878 28856 -45137 -29043 54430 67293 35586 20400 94032
20776 94032 92872 99144 13555 35284 103168 88210 86088 63860 -21370 -16360 51122 65886
20764 65886 -25119 -89035 -83532 -61167 -5587 69071 31408 -50872 -144204 -166627 -93179 -48320
20752 -48320 -79378 -37882 -13909 -90886 -93446 -136186 -120989 -49107 -44298 15126 -23284 -82704
20740 -82704 -29207 20202 85644 63814 58860 110211 98023 142290 152867 129388 -31128 -145886
20728 -145886 -198638 -110432 -77028 -91895 -51661 -78067 -93083 8072 50562 3639 -7126
20717 -7126 49298 -8319 -107531 -80114 -46661 -38519 19974 -17182 -33107 21635 35264 12969
20705 12969 -4721 89025 102154 13651 -4789 7728 -75373 -33423 -12392 37180 60143 48330
20693 48330 -48759 -52061 7762 100924 43097 -31923 -34964 9594 69142 74081 77750 189063
20681 189063 239046 173251 141239 79979 54215 77846 23785 2608 -10904 -23995 -3093
20670 -3093 -67922 -82681 -115484 -116221 -101544 -28119 -5349 5794 53701 110904 109475 95172
20658 95172 119714 106344 35971 34744 23742 89721 70128 104469 181556 142222 59343 -60757
20646 -60757 -100015 -46464 44056 28169 -12958 33288 55508 54245 113686 152499 106332 89157
20634 89157 125086 95928 107425 115094 73037 70643 -19558 -61361 5693 26134 49564 48282
20622 48282 13062 3850 -11237 32224 113323 102921 68564 -17855 -623 48581 48918 120898
20610 120898 165673 145374 94924 156530 113280 64654 113960 131048 241825 336330 388103
20599 388103 416544 341115 320485 339156 268111 149830 112206 73817 80643 22187 -53851
20588 -53851 -57914 -30537 -30703 24204 89838 71716 175685 198422 16396 -75343 -94882 -66806
20576 -66806 -61809 -22272 555 22189 -20004 -9733 17231 -51950 -57838 34068 114315 82618
20564 82618 47223 73288 2740 -26446 -32624 -52055 -56127 -103658 -95030 -83103 -176753 -303967
20552 -303967 -217710 -189811 -188087 -106500 -88886 -36744 70870 35568 -92126 -152459 -79145
20541 -79145 -82273 -39683 -22491 25336 76960 72768 23438 -58347 -26518 -14343 6352 -59885
20529 -59885 -33005 -44306 -95227 -16102 -4902 -10928 -23861 -33609 -106260 -69029 -22179 -57346
20517 -57346 -124807 -80502 -59869 -86043 -111500 -60459 -57643 -45616 36455 22541 6834 26336
20505 26336 9297 -39600 -68288 -35270 -29773 42763 63721 61355 87060 49800 31585 31504 28764
20492 28764 18323 -18573 1804 53635 108189 117679 102634 -31640 -94409 -73408 -60759 -16618
20480 -16618 29344 150903 22774 -54728 -23900 -41787 -115239 -36793 -22600 -76168 -64590
20469 -64590 -6284 -24420 -10688 54243 46636 -18291 2802 84778 89701 23539 -19004 -80500
20457 -80500 -68766 -9337 16710 -9977 -31361 18574 58887 9845 -51426 13289 1744 -3000
20445 -3000 -39653 -39379 -31196 -16947 35622 21903 -32644 -75955 -109716 -70155 -68290 -69504 -97058
20432 -97058 -80172 -47538 -20198 -5535 44323 -108910 -115541 -59570 -92489 -89777 10078 -23725
20420 -23725 -12867 61267 30191 19042 17019 -21263 18587 40257 14397 -8925 -10977 -50823
20408 -50823 -25892 81262 126011 216526 229058 222784 153064 80176 51522 122497 209370 262465
20396 262465 210901 148312 96776 47513 -34239 -62564 -69102 7801 130921 154191 78431
20385 78431 -5232 110059 146063 130498 67223 11417 37345 47498 2401 31881 72804
20374 72804 38194 -31156 -63024 -13311 -13513 -105404 -181892 -194672 -128471 -100546 -141069 -220185
20362 -220185 -243475 -185173 -180412 -262129 -202657 -41085 -861 -44591 -67236 -93840 -104410
20351 -104410 -90907 43247 17408 -33563 -87567 -123633 -15720 138656 68292 -22002 23047
20340 23047 -55054 -51940 -45289 -38644 -50323 20376 74970 114215 55013 3339 6762 -25430
20328 -25430 -156425 -165159 -122574 -65082 -51748 -115229 -96997 -24789 -123714 -156513 -136411 -77661
20316 -77661 -112431 -68637 -36302 -48586 -81502 -119746 -46509 -24024 -70687 -89162 -22354 56477
20304 56477 31591 -23349 -8542 34243 39019 24043 50885 144661 133970 82371 4506 -65013
20292 -65013 -72916 -97318 -99370 -75314 -70647 -59546 -13832 -5005 -37387 -27930 -14008 5948 -48868
20279 -48868 -61270 -118455 -153828 4458 20057 24621 4304 -48277 7306 104443 142650 58523
20267 58523 26376 53702 82493 1064 -50737 6684 -79780 -33177 45069 76662 59579 21832
20255 21832 23146 71947 114996 -11377 -71668 -26042 58859 55305 69920 35769 -66650 -96617
20243 -96617 -233083 -185249 -84362 -54968 -38044 -32788 -19513 -54262 -123668 -99182 -48752
20232 -48752 -68208 -57420 -53646 -153855 -164751 -183060 -181562 -160466 -94377 -8691 -1212 1573
20220 1573 -4672 -24506 -22358 -171749 -216763 -102134 19175 67099 7243 -44599 -73863 -43501
20208 -43501 -7892 -1936 18118 9589 -59760 -43024 -64580 -21788 -45202 -111450 -54443 25116
20196 25116 26906 -95868 -79057 -34276 -9350 -98922 -141406 -82407 8796 95311 40536 -21093
20184 -21093 -111014 -101517 -113180 -168526 -155543 -66776 -41147 -88064 -43714 -61668 -133499 -85535
20172 -85535 -1291 25240 -15590 -68470 -67030 -7637 -12378 -9995 -3335 -53917 -87532 -91706 -82369
20159 -82369 -125613 -128889 -122847 -61010 8430 16466 10129 40282 78566 43209 63500 116705
20147 116705 21386 -409 -55914 -52733 -20954 -9139 -14743 -98889 -43415 -57440 -186091 -94476
20135 -94476 -102636 -120970 -52645 -39209 -59708 -6269 18825 -21439 -2190 23456 -71332 -116060
20123 -116060 -115649 -71880 -1819 23738 27660 136398 164196 103198 98074 53426 22787 35536
20111 35536 56833 133756 152611 175349 115914 -6524 -137230 -135474 -164250 -150688 -27341
20100 -27341 87064 96349 90648 27713 -21002 -40819 -81261 -90029 -62656 -110393 -112011 -156043
20088 -156043 -124534 -95777 -14012 99012 138787 33085 -5450 -75757 -94134 -93022 -77553
20077 -77553 -37882 76963 109811 50653 66675 -14120 -77761 -70777 -172813 -206295 -122417
20066 -122417 -5567 -18730 -33638 -41033 71025 85085 110719 44968 -19856 -14560 29540
20055 29540 11574 39714 76510 -8555 -79148 -113840 -61391 -108699 -125183 -123616 -146863 -127561
20043 -127561 -114496 -117333 -31748 -19977 -55727 2999 62757 32184 -28223 -36494 -15442 -17363
20031 -17363 17346 -31763 -45952 11283 40190 44069 33002 -53188 -25261 -56819 -50492 -32324
20019 -32324 -40398 -104224 -41298 -7033 -28101 -131360 -117716 3581 40977 38111 60539 118130
20007 118130 48235 13727 -15229 39205 90491 66771 46995 102059 51341 31758 -41467
19996 -41467 -76118 -1674 2625 -98562 -53592 27258 121595 46051 -11035 56138 114713 167821
19984 167821 138128 21292 -32842 -15331 -63243 -83274 -95923 -132928 -154851 -201965 -154013
19973 -154013 -87873 -14924 -58099 -117999 -66049 -27705 2326 -8365 -13098 -18696 12406 19366
19961 19366 6150 57332 88885 88968 73715 45013 61275 55379 1528 -54075 -51338 30049 33924
19948 33924 17800 21284 -50744 -103472 -77718 -15104 -15175 -60638 -90284 -93319 44285 47094 -74109
19935 -74109 -28445 -9684 -26952 -21122 -15578 -140296 -136549 -114848 -80707 -176719 -170617 -146767
19923 -146767 -145787 -137061 -164121 -110632 -58050 -19010 -78916 -128818 -158815 -117393 -68728 -4104
19911 -4104 45609 88716 77052 80524 97038 58968 38114 33176 -16848 -55442 16566 135913
19899 135913 155787 127593 79050 -13162 -47090 16177 52069 -17581 -100078 -51744 8446
19888 8446 -14190 8053 -2515 26075 -2863 -30918 -98247 -124518 -73676 -3977 -17952 -51546
19876 -51546 13674 -13746 -21445 50506 83208 110451 60367 13327 -5514 -68040 -80726 -47438
19864 -47438 -59190 -52709 54918 58125 -81471 -162942 -35171 81233 93304 -22717 -63374
19853 -63374 -8882 -27101 -78818 -126782 -166493 -61266 -44996 -11853 -43392 -37623 25134 25099
19841 25099 -13747 -55245 -45693 -86473 -34296 19113 -416 -9181 6263 -52778 -15410 61783
19829 61783 31769 8507 76128 55694 39755 69255 76466 25716 -54501 -37099 -13117 -64708
19817 -64708 -11581 -8229 -51466 -25939 -32797 -3508 -7435 -68903 -42486 70052 46256 98915
19805 98915 161574 171130 81639 -3940 -27444 18133 15824 -20997 -92800 -45730 9245 62472
19793 62472 83410 90168 12857 -51888 -49427 -64266 -57072 -52083 -46451 93075 130813 4026
19781 4026 1795 19151 -6500 -70373 -114213 -120443 -72721 5802 79436 79561 71993 65758 54437
19768 54437 107195 103367 52432 40065 4017 -23373 -29356 -85187 -76855 -31480 -30286 -7371
19756 -7371 19648 -8405 -42792 -87541 -93749 -65004 -69928 -161155 -178163 -83754 -64978 -103504
19744 -103504 -168147 -145850 -142917 -99767 -8213 54308 100135 93899 113107 169021 167773 65595
19732 65595 -29969 -69097 -68133 9214 88319 170807 111909 39650 44925 105745 120127 152400
19720 152400 155639 176972 135563 134250 137687 144682 149102 108491 107301 60043 7890 70519 112649
19707 112649 84911 137262 171302 158810 142954 146482 82235 69845 117086 49833 49966 47668
19695 47668 94836 74928 59963 92946 101028 44027 34858 41889 45756 18740 -25760 -11024
19683 -11024 -28108 -52696 -24474 -160005 -182718 -119820 -60010 -19332 19046 41231 47112 -28903
19671 -28903 -52681 -67664 -48049 -78177 -117652 -108228 -135655 -136068 -74791 -71423 -42800 -41635 -20335
19658 -20335 -714 -59067 -25766 1598 -51387 -98385 -75512 1320 -13522 -12262 -30266 -69852
19646 -69852 -97613 -70961 -25131 -1948 -52515 -9163 102879 144709 55608 -31248 -9056
19635 -9056 36455 55139 72138 81908 53073 25557 46717 -12623 -133287 -28516 10750 66715
19623 66715 56996 63926 60915 146013 188314 239107 207344 120688 90652 67728 23974 -21830
19611 -21830 25334 52286 -2229 -57142 -61129 26481 110851 141808 82621 47660 109312 132270
19599 132270 108905 129169 92399 -41507 -95057 24990 96821 130923 221896 261217 244216
19588 244216 214957 153201 41374 -23153 -10233 47533 72118 41181 -55838 -117568 -70825
19577 -70825 -65102 -76773 -75936 -95899 -80317 -70977 -69010 -68801 -99779 -26484 -648 117 -75720
19564 -75720 -41751 -1199 2340 -2546 60714 70208 117180 107854 157461 162919 123351 58304 94154
19551 94154 111594 131145 89366 56859 60481 106324 50580 -17506 10725 73517 37964 -56102
19539 -56102 -10035 -19533 -10070 -36033 -37702 -53610 -74839 -117839 -102150 -66342 54702 37486
19527 37486 73440 61538 103474 131850 138257 175892 142085 79346 127849 200345 243192 315357
19515 315357 284245 258170 203766 172775 129526 87400 37189 77668 85839 25483 27532 91307
19503 91307 68832 92094 114777 87262 22138 8814 68413 40005 27877 5383 -8302 -20502
19491 -20502 -21406 -18563 23478 112011 182714 227429 291725 295136 328295 342655 324842 321661 271640
19478 271640 202724 150562 170237 135655 113374 74334 -14791 -85546 -152 83886 122403
19467 122403 96194 73827 29566 -104850 -130054 -142641 -67226 -3333 386 11940 -21962
19456 -21962 -55231 17109 51867 37865 34814 -23197 -41667 -85317 -35904 39406 46884 75655
19444 75655 70101 -472 -53993 -30085 -51768 -16855 63471 78424 3031 -42785 -53769 -53097
19432 -53097 -92775 -24468 59610 66509 -39282 -38338 81742 66427 2405 20627 49221 89033
19420 89033 61421 57042 -7439 -83247 -75174 -32841 -18834 -25466 34114 58897 109340 120438
19408 120438 104668 67725 60174 3916 72629 61538 48305 50273 46430 -39534 -52596 -15176
19396 -15176 -5059 -9440 11696 32961 -34090 -182360 -133975 -81023 8656 86900 156744 110359
19384 110359 83683 58969 71948 62188 29090 62061 51297 20990 30294 54341 72853 139043
19372 139043 144773 101185 33410 43609 1854 -24560 47685 71010 -23694 -60021 -119140 -78608
19360 -78608 -101495 -125028 -60643 -27868 64817 60747 9436 -51271 3817 32638 109952 164408
19348 164408 119863 77187 119178 188290 215029 140009 105949 49045 109917 61464 14550
19337 14550 -18629 13883 37273 103157 170541 159240 183933 253804 179059 140078 57451 90994
19325 90994 137443 111075 111204 157852 239710 229150 127158 55978 77643 71765 129256 51944
19313 51944 71525 135197 181814 213179 230435 197868 59763 -23180 140 -9954 -2863 3411
19301 3411 68330 66992 51163 -9598 -51517 -38311 78987 121602 90565 161167 234116 138489
19289 138489 43047 -33970 -118758 -93404 29694 13423 52696 40746 50912 27131 71712
19278 71712 176896 234735 198869 119307 73102 -20064 -98104 -142085 -74950 -28898 -34943 -1006
19266 -1006 84190 -31877 -143087 -115251 -27087 38350 21943 20082 -31101 -94426 -9942 45894
19254 45894 9502 -16632 -47115 -19632 -31023 -69829 -76378 -90710 -123507 -16103 28991 35793
19242 35793 23372 49068 58908 59246 -23195 -42470 -57175 -66834 -159316 -145487 106802 212292
19230 212292 145231 29125 -4616 58192 140969 191286 144786 69600 67902 69999 47427 95544
19218 95544 100296 46740 72671 91724 42513 10658 65374 118041 117161 22957 -22763 19404
19206 19404 28702 58508 25700 19302 24893 22213 -28172 -7560 -17210 -82012 -68289 -40015 -31547
19193 -31547 19246 48646 20639 9669 48697 13144 79696 100673 26219 -16695 -41306 -13804
19181 -13804 -26081 -143089 -32717 66371 58588 55337 63821 137269 143928 36914 35655 104474
19169 104474 85877 19921 30238 64183 122468 134900 109198 96341 89126 99057 132291 95406
19157 95406 -6429 -9279 33089 98146 48313 -2106 -31792 -124592 -32730 14871 78169 81084
19145 81084 33468 58903 93278 119818 16416 35853 105628 168698 188673 223481 351137
19134 351137 449370 441428 431156 379468 261383 209009 242368 300107 279229 228230 189910
19123 189910 194511 174270 189475 229678 269094 285117 295686 478386 710798 952806 1098706
19112 1098706 1273400 1516761 1604291 1655841 1776779 1724573 1564035 1406731 1241703 1026791
19102 1026791 861237 776616 579088 455484 493064 433921 394052 372403 337897 300478 227298
19091 227298 178892 163279 159970 168619 139754 119835 208396 192107 203166 214334 252918 260389
19079 260389 144296 78238 91504 178081 100357 44390 52777 59967 114535 131030 132027 125719
19067 125719 136390 184357 180306 186038 212810 227576 136706 100087 150862 251538 250355 225843
19055 225843 216408 139046 105149 21833 46451 170767 201000 112508 39434 47032 18412 142817
19043 142817 197572 178434 162041 81696 50610 65510 178237 107751 112066 199054 186306
19032 186306 160993 137699 129877 161451 167730 49803 -79609 -79663 63660 31486 -669 82033
19020 82033 153433 119794 89266 66737 57005 109404 101371 84577 147685 179846 182250 137903
19008 137903 52163 -568 3072 51937 54903 94376 1320 30600 127982 188718 205390 177943
18996 177943 84242 51663 33937 21724 75902 144188 135710 92203 180660 149829 92618 23920
18984 23920 34204 125862 274171 249441 227990 134352 63536 96256 71885 71730 86479 142253
18972 142253 190644 128771 104737 181634 181580 -5866 -15570 78680 85689 70525 45385 84927
18960 84927 95522 108595 167537 86638 37021 100691 179344 164564 160059 179755 117985 94503
18948 94503 -13389 -122168 68210 176485 162878 198501 258061 289235 296823 201300 133279
18937 133279 133841 101866 113713 112185 75247 40129 118557 188887 202679 179560 135118 67934
18925 67934 78364 168896 153916 87480 79830 147672 178216 197834 257722 269792 256165 236955
18913 236955 266186 267497 254460 220327 105987 -8444 -92737 -111044 27785 97234 136197
18902 136197 213713 252398 204968 143325 129852 161700 162906 227824 275334 318528 224158 153982
18890 153982 184120 142683 92627 157777 264668 246193 230417 266088 252629 213780 195404
18879 195404 220771 177768 150853 140327 99037 96076 48175 30618 101476 145992 153055 219983
18867 219983 253438 235701 160899 119715 139895 103671 108469 120865 115393 216746 259975 185563
18855 185563 220337 257860 313501 368449 418903 433121 429410 374885 373712 361464 342357 358537
18843 358537 274165 312009 394074 405197 422861 462286 548614 535498 510654 365799 299342
18832 299342 309521 398601 378863 312295 327566 319023 244292 303691 280271 295239 338727 358304
18820 358304 336127 348619 412847 344767 282509 353196 351994 428272 515702 578774 611491 625557
18808 625557 667716 779921 802907 856095 828130 769700 587675 508143 566217 574766 663469
18797 663469 777148 823683 913945 1033725 1028601 1042454 1076488 1011569 880819 865836 766655
18786 766655 709429 656748 664849 719428 696026 746149 785776 785450 771586 771061 742206 740060 770350
18773 770350 741188 659861 629124 626554 626905 713998 771767 846768 952640 1071884 1063773 1064367
18761 1064367 1206105 1183113 1069262 919166 854000 818910 828341 872478 851958 858791 874135
18750 874135 832118 864661 883211 838992 945542 966451 910890 855834 751419 731191 741433
18739 741433 775359 769409 726727 597640 513716 573789 561183 550130 498404 602327 594190
18728 594190 594436 535998 488769 528140 564582 599880 615057 657786 770558 766941 618448 647996
18716 647996 733584 772933 723543 700684 802473 765594 686086 636448 587986 637425 614962
18705 614962 600500 643898 666092 736260 824190 903910 908552 915061 856207 879463 912874 875782
18693 875782 861481 845327 789614 808813 720050 627571 637852 650100 644605 620205 704086 764229
18681 764229 853028 930203 928858 877262 881109 895079 830195 758207 733899 753968 757746 760771
18669 760771 753436 738061 767627 759423 782982 834256 869791 850867 895245 937972 981713 825279
18657 825279 727742 689865 663612 682671 701521 755674 734059 783211 833190 816300 763739
18646 763739 770838 769816 711340 698866 638729 602982 517370 496640 517621 490904 482621 518084
18634 518084 442417 419040 460643 486644 611205 677120 671983 665440 536920 502315 452541
18623 452541 403557 447577 427675 414704 386238 366667 397907 295489 266192 250369 294128
18612 294128 269008 251160 240197 255454 229045 180461 176950 233768 231378 227138 348392 419211
18600 419211 433739 380627 435188 395405 381466 334769 346936 432755 413604 432158 352311
18589 352311 350271 314855 216978 220952 207868 233934 374283 345106 261939 263932 440740 476522
18577 476522 429976 374653 408140 352451 287173 286254 309319 272699 315597 291419 240726 275722
18565 275722 386241 310372 199413 152407 248155 368867 345964 310751 318277 246869 253449
18554 253449 237509 261561 249639 228785 285137 316614 354881 356907 421841 315359 162555
18543 162555 141613 171682 176805 239681 422301 395089 397512 364186 377843 346802 416245 407219
18531 407219 355540 350764 417182 438828 480394 544030 545871 542658 528756 481678 414345 300186
18519 300186 270958 409583 513674 495140 414346 388567 355801 330644 282461 275411 219207
18508 219207 277011 468969 533850 519009 481534 499224 478603 357649 358497 356908 372032 499371
18496 499371 539812 503906 470258 411544 310184 315758 391823 477048 516161 579681 633385
18485 633385 593035 522698 502469 467239 454311 514820 596981 699636 712234 528356 484289
18474 484289 512851 566239 599348 653608 660437 659023 750638 842032 893199 924699 944530 920346
18462 920346 889612 832035 820531 895150 799946 704602 665902 689911 701511 701493 831052 901242
18450 901242 887213 855941 830666 854596 832244 779952 761497 791415 796597 719595 641858 668900
18438 668900 787040 920876 1045450 1090496 1138476 1204843 1328092 1329578 1294883 1322649 1276288
18427 1276288 1262707 1305423 1328065 1411281 1416003 1406332 1412296 1387065 1322816 1232373 1179243 1142489
18415 1142489 1228225 1298488 1353063 1425197 1439056 1479099 1549112 1638789 1723244 1896190 2119081
18404 2119081 2327529 2505841 2613675 2734628 2878467 2921773 2982737 2981274 3006499 3134105
18394 3134105 3239560 3223468 3280769 3449731 3629111 3695605 3682472 3777389 3866761 3846450 3734013
18383 3734013 3691852 3707651 3776186 3839051 3858634 3821082 3849324 3979289 3929746 3887132 4014837
18372 4014837 4119628 4210650 4333809 4519673 4785778 5228259 6092573 7192154 8244724
18363 8244724 9161254 9990389 10558087 10293024 9394393 8585938 7869878 7148902 6486095
18354 6486095 6078994 6065723 6261427 6685680 7372475 8141337 8838127 9556198 10129735 10183848
18344 10183848 9966517 9801819 10180599 11001269 12196032 13724873 15586472 17696356 19923608
18335 19923608 21651045 22618634 22706848 22120862 20823201 19641492 19314915 20045703 21287031
18326 21287031 22371035 23072043 23229496 22245028 20412768 18682437 17505351 17006446 17254921
18317 17254921 18418343 20465461 23695110 27791211 32147930 37435116 44496864 53839521
18309 53839521 64806719 75566849 83469700 88291749 89781652 85411589 76220968 69283957
18301 69283957 68942654 72567269 77404393 82815825 88435593 92774795 95194273 97019025
18293 97019025 98903871 98842708 94177005 85389737 75242906 65885029 58941052 55009434
18285 55009434 53874449 55024409 58134910 63373808 71547759 84315371 103493084 127898836
18277 127898836 153279766 178316341 202806347 220985501 226064212 223792804 221800731
18270 221800731 218221563 208799685 201429115 201897500 208833356 219893148 236779795 259936426
18262 259936426 285732527 306059244 314653718 312769174 298857550 272271065 244529902
18255 244529902 216989972 185373500 153086457 129929032 117361492 112416839 112995495
18248 112995495 117694910 124719617 131616612 136555943 139542659 139399650 134234194 124533587
18240 124533587 114962515 107067869 100024997 94874739 92832040 93116431 94157365 95235532
18232 95235532 95591848 93915415 90096001 86024873 82706886 79939679 77566651 75580915
18224 75580915 73877031 73010825 74143149 77340336 81902677 88351173 97793223 110558913
18216 110558913 127181235 145412378 160997854 174667654 187606486 194799895 193103372
18209 193103372 187386405 178570088 164933279 150419077 136520747 121920708 109108444
18202 109108444 100695021 95361514 92322995 92435228 96014442 101942695 108629643 115507995
18194 115507995 121926693 126811956 129583606 130352277 128613431 125085886 121160981 116232470
18186 116232470 109937350 103224617 98038112 94898460 92687518 90184497 88025117 86568784
18178 86568784 84766046 81043901 75681254 70819828 66937484 63899103 61806111 60547342
18170 60547342 60781130 62905019 66481593 71673596 78225869 84006729 87976832 90967250
18162 90967250 91845486 88579185 82805366 76661478 69924878 63721499 59666761 57841658
18154 57841658 58161450 60671922 64690562 68642916 71095517 71859401 70925186 66975290
18146 66975290 60799535 54346547 48456206 43156886 38746210 35470442 33256749 31632211
18138 31632211 30305220 29292990 28474386 27845852 27267322 26744227 26382156 25922138 25398942
18129 25398942 24879420 24291840 23469730 22596191 21847857 21131978 20427977 19868255 19431050
18120 19431050 19090523 18728709 18487682 18450460 18606088 19002260 19717615 20739096 22382898
18111 22382898 24890776 29231788 37148789 51870957 74592949 92815408 100292703 106149263
18103 106149263 108793100 90829015 60059162 42045992 33373555 28418502 25197363
18096 25197363 22909688 21291776 20076707 19063743 18294618 17557192 16834996 16207482 15597543
18087 15597543 15090071 14607970 14147071 13740577 13397364 13047044 12688832 12445119 12214560
18078 12214560 11926134 11622912 11340417 11052205 10675925 10397512 10033146 9793348 9524870
18069 9524870 9302035 9169731 9052827 8883431 8619282 8467231 8371795 8282387 8167129 7969349
18059 7969349 7864637 7767172 7594333 7387925 7151182 6958926 6926618 6764171 6588980 6486222
18049 6486222 6407183 6341487 6333661 6279462 6141848 6048854 5972787 6021945 6036967 6034933 5996913
18038 5996913 6045559 6115894 6099779 6172513 6169774 6150299 6250416 6310303 6602538 6967578 7258275
18027 7258275 7558320 7931485 8252030 8443241 8495368 8433289 8240613 7935368 7578937 7335534
18017 7335534 6996584 6622084 6243586 6104450 6061013 6018233 5980464 6079128 6295670 6389553
18007 6389553 6472210 6616939 6691670 6735669 6772794 6682285 6592903 6510523 6494398 6465107 6470987
17996 6470987 6453784 6293316 6062759 5835861 5544356 5365088 5046966 4784022 4666625 4634113
17986 4634113 4616182 4629713 4597234 4625673 4871339 5122682 5378292 5559079 5671690 5813112
17976 5813112 6043080 6117941 5980749 5704041 5485371 5232057 5044379 4855162 4746963 4750386
17966 4750386 4831287 4916906 4926819 4850445 4825271 4833037 4560688 4119584 3829928 3638454 3386248
17955 3386248 3067218 2754243 2472637 2295789 2200714 2217416 2199243 2070752 2029005 2025634
17945 2025634 1997229 1842061 1775301 1861801 1879009 1817411 1832131 1798385 1679246 1632897 1628738
17934 1628738 1666930 1611548 1483130 1423635 1359233 1289360 1260259 1207871 1224543 1197760 1170868
17923 1170868 1157964 1186610 1301962 1305739 1255151 1196088 1099313 1083284 1181013 1114346 945187
17912 945187 877101 860594 882532 867592 920864 931591 794416 733907 776085 790297 856227
17901 856227 872650 861651 786427 779860 831177 856223 752913 679388 656572 602877 588903
17890 588903 664137 731014 671248 637932 697597 721315 607717 615164 603987 488934 452558
17879 452558 559001 674518 684751 605507 509104 487844 528579 628922 610233 538810 462016
17868 462016 467373 496969 510315 511637 373127 338202 394462 419313 458747 441373 486676 566386
17856 566386 540517 511481 517079 486246 391213 383397 350361 345947 338002 360888 370631 282762
17844 282762 340422 398699 419519 455290 474572 499749 563479 549536 504509 495215 458176 479890
17832 479890 542358 613379 732645 759414 791432 796146 690498 550180 532521 501877 485861
17821 485861 486034 483972 466848 421714 463408 526559 527201 537843 602823 582854 551380 556499 551850
17808 551850 524000 475091 455310 471142 488871 400096 402631 427188 494030 578389 621632 724512
17796 724512 791339 742265 801105 727565 678486 707783 821379 962553 962496 919768 876599 740615
17784 740615 656739 647716 570371 422349 500918 683760 763134 797002 881211 934034 936180
17773 936180 928817 930168 880665 796759 724406 619840 511775 486639 566088 593399 586615 571397
17761 571397 603711 552208 488304 533747 577936 639213 607584 533298 567006 581819 648056
17750 648056 689726 752075 689278 666369 795344 941446 955204 909075 949419 940639 904054
17739 904054 885575 836150 807953 890463 833558 739781 683107 657149 704625 660609 562284
17728 562284 523228 575106 560654 596350 606935 659699 684069 664788 695743 769220 867559
17717 867559 909882 868771 749640 712759 706216 694613 636985 721624 752796 791285 814361
17706 814361 799125 787730 875670 887002 883697 873915 873610 787978 801687 848923 790964 833329
17694 833329 737690 641630 673181 650741 700166 815897 779832 695328 684435 599294 468710
17683 468710 383716 444197 551611 570468 527880 437810 432421 533622 559689 606708 617586
17672 617586 649691 672900 657951 560080 503922 580943 730056 818888 808956 634051 584016
17661 584016 617923 659737 623179 595678 610557 567307 460276 408285 430635 503989 417331
17650 417331 364917 362812 371719 397060 379026 337543 339121 421691 468586 425982 406500 362159
17638 362159 329892 365192 345455 170798 165032 267058 254299 237125 273011 223705 153465
17627 153465 149968 183066 227300 230780 104384 122495 169520 199371 154453 114783 29877 33538
17615 33538 44651 90108 167564 277191 323000 303820 234653 179053 89119 49162 125125
17604 125125 229451 257698 203692 190731 209090 244797 323860 290444 214362 167148 92663
17593 92663 80100 112266 124168 137559 159046 103847 58757 81655 154081 127061 97568 126992
17581 126992 167166 156283 150140 141453 161749 265605 307999 254042 165137 119078 222913
17570 222913 294943 204169 154326 135226 70667 18412 -19599 31170 109289 160015 60190
17559 60190 29032 132837 126888 13006 -40628 -8422 -2881 56287 41895 68088 99914 105823
17547 105823 22401 13029 82049 93532 23803 -28943 38697 40750 -3395 -25994 -28577 18662
17535 18662 28824 26506 78037 113928 78345 103744 139536 84929 31462 -18775 4338 -28352
17523 -28352 -9556 78790 16684 -32213 -13080 32617 -4202 -50723 -89641 -76396 -58907 -47975
17511 -47975 -139669 -102024 -30996 36896 55605 62966 90864 119371 55374 -3352 2367 -4159
17499 -4159 -46894 -94500 -27457 -79652 -116167 -81634 26531 54763 20751 19433 5030 116977
17487 116977 109992 28725 81603 41410 12767 -72217 -78276 -34621 4743 40641 22029 44257
17475 44257 35062 28538 47102 -47584 -37883 -28278 -18315 7153 8890 -31025 23658 47925 -53179
17462 -53179 -51147 -77274 -18119 11223 17758 -2528 16633 49052 27320 8683 43525 16373
17450 16373 16447 34929 20053 -27191 -65687 -72883 -57671 70074 218228 349101 446982 432081
17438 432081 478248 527453 471293 325978 195034 137806 69731 73004 61346 25182 78915
17427 78915 87134 86843 -53470 -111475 -33915 49198 11109 -37594 5314 52030 49394 -10987
17415 -10987 -49750 -42270 -47190 81272 50178 38435 55731 52053 64638 52715 77061 137295
17403 137295 160774 162206 106784 67107 78827 149784 208347 193837 173624 94371 2771 -19592
17391 -19592 61207 -38735 -75500 -53076 -54349 -63859 -169838 -196352 -219573 -114771 -39878 -124894
17379 -124894 -100980 30937 80418 20860 758 6341 -40931 -33809 41124 37075 39355 31579
17367 31579 93581 124106 64346 5513 -16457 -61669 -25105 -29252 -15778 -34601 8130 4656
17355 4656 78974 104679 32909 -82024 -52365 16870 86381 59246 72420 3291 -138447
17344 -138447 -198764 -210819 -124882 -106936 -70938 -1319 45909 29023 -23725 59153 186333
17333 186333 115724 69718 35175 23155 -13220 54649 18229 -47494 53217 97265 83356
17322 83356 75197 101901 17038 -35811 -62507 -28938 -26949 -33375 -104167 -130515 -65400 -46007
17310 -46007 -71954 13417 -3826 1169 34938 33504 -56486 -158684 -138822 -104621 -5406 -2571
17298 -2571 2331 -19904 -11859 56 -5749 40430 -49875 -90881 -7023 55095 -6854 -25508
17286 -25508 -61359 -49828 6180 16615 -78069 -152283 -240726 -310339 -196127 -100513 -55007
17275 -55007 -26379 -2734 -83468 -101352 -30995 -35264 -2453 -12220 -3603 53758 149585 153438
17263 153438 94880 22125 -35772 -60147 -83222 -59290 20340 4683 40242 133791 104650
17252 104650 139631 143594 126063 110022 27797 -25106 -106532 -78105 -49425 -67266 -16326 88774
17240 88774 70569 24118 8988 -74217 -124024 -125211 -144734 -145531 -131135 -87307 -18610 -55039
17228 -55039 -122273 -150775 -80831 -56937 -129698 -86892 -152294 -188878 -189960 -134595 21853 91988
17216 91988 26237 -39281 -43219 52764 33594 46679 44960 -6331 18758 -20233 -74844 -71344
17204 -71344 -67149 -39001 -13556 14752 69146 -6589 -127322 -147366 -83341 -112581 -194472 -249617
17192 -249617 -184592 -17798 82918 98173 39614 26885 19285 621 -56493 -107168 -111926
17181 -111926 -74738 1508 47738 53047 -13716 -24844 -63176 -26418 22556 -6648 -56759 -74392
17169 -74392 -49625 -29151 -54678 -27271 22182 71473 51326 -7222 83587 82542 49292 -16259
17157 -16259 -28855 72646 33533 -127219 -130622 -14081 -13897 13604 28397 -1430 38735 -3840
17145 -3840 -49044 -10485 19500 43450 35134 1860 100017 158157 80135 15727 1239 -4480
17133 -4480 -28928 8522 42454 14319 81593 147840 130693 50600 34962 101511 102550 100338
17121 100338 58291 -57559 -78761 26716 86864 32441 -2739 27601 73316 55626 27015
17110 27015 -34965 -91567 967 55635 -32583 -68812 -19372 -120843 -174257 -180756 -163554 -203461
17098 -203461 -244455 -216961 -133166 -54870 -63766 -47422 34322 85214 62779 84224 97916 44028
17086 44028 25686 34685 39174 24539 37668 29298 16713 67065 44571 49826 -35790 -38825 -4045
17073 -4045 -30943 -34567 -24380 -30946 -85854 -107392 -160094 -146633 -115857 -112587 -68306 -113721
17061 -113721 -48830 -2782 -77538 -137202 -72375 -67427 -76046 -94072 -33681 -1749 -2377 85741
17049 85741 136220 112129 80324 130519 73785 -32102 -61838 -49023 -12198 90067 24830
17038 24830 -92704 -87447 -4158 -51674 -130803 -96014 -75156 -90098 -156083 -169673 -87590 -42628
17026 -42628 -96512 -141399 -147669 -143621 -61403 -6300 36996 11904 61593 85834 151132 140626
17014 140626 141662 194273 98870 84263 65141 51319 -6668 -45599 -6462 -60557 -15699 -55098
17002 -55098 -75247 -77690 -101245 -84525 -14346 -51992 -136822 -134508 -29413 -85647 -93867 62136
16990 62136 112376 124617 166906 186174 135806 85661 46202 36233 -21142 -35336 -66508 -59756
16978 -59756 -15050 -54544 -107463 -73121 -75612 -14132 -33677 -13256 -17771 -27255 -35496 -93917
16966 -93917 -138548 -123563 -163707 -189150 -245944 -213641 -118552 -61310 6728 -34931 -51794 -147385
16954 -147385 -289304 -260681 -112718 -27179 -54339 -78721 -80205 -93057 -24141 23686 1634
16943 1634 -26346 -64313 -33554 -1129 24678 -11617 -103419 -58060 -47918 -70710 -51364 -49975
16931 -49975 25442 -8376 30688 43681 3308 63827 68562 77332 73767 73744 22332 16976 43153
16918 43153 62019 58907 16570 1378 -9550 -72757 -67464 -62471 -45052 -4218 28113 120648
16906 120648 187353 140962 75239 -69107 -187292 -165118 -70122 -69389 -109318 -124261 -174566
16895 -174566 -155248 -30128 -47366 -116591 -79945 -82991 -160507 -151152 -45886 14426 -26619
16884 -26619 -30487 -30535 -14654 9584 67961 118043 71462 55755 57133 -13397 -33181 -12192 -17160
16871 -17160 32940 -39078 -31127 -7275 64551 137420 182449 24740 -56167 -61016 -110896 -82157
16859 -82157 8186 -28706 -41303 15378 84512 93356 52682 -8576 -63204 2388 29260 33596
16847 33596 83880 103075 50233 60925 27735 -1456 -8807 24594 121650 59306 19401 -66706
16835 -66706 -109925 -50172 -17376 15885 32880 41084 3271 -12596 -27654 -3469 -30282 -1575
16823 -1575 31086 25120 48806 119388 102795 96554 155559 168019 51834 -8008 -62595 3912
16811 3912 -64851 -68269 -56033 -9586 -30135 -68949 -55881 -105005 -117902 -29345 1399 75509
16799 75509 50033 49161 -3209 23255 81957 81096 81543 49760 66864 40366 -7281 54231 67882
16786 67882 -69637 -80715 -111505 -146606 -108893 -74429 -69007 -54096 -123588 -120279 -132930 -137062
16774 -137062 -91024 -98738 -123887 -56084 -77356 -202253 -152945 -92877 -78178 -20023 -7403
16763 -7403 -41178 -89785 -52894 -16216 -52637 -6188 -68255 -102295 -136005 -161421 -23679 43059
16751 43059 53727 58259 44017 78991 153178 150763 114722 110547 67052 28630 3834 24613
16739 24613 71277 83961 55064 66226 31762 -54316 -74897 -32696 26953 45997 4793 34034
16727 34034 8316 -60539 54087 61140 30535 62795 31662 -8752 -52603 -73555 -20093 -71275
16715 -71275 -147448 -145456 -72447 -2585 24623 26709 -1581 620 27128 -22486 -36698 -22837
16703 -22837 59681 -4448 -97863 -7085 -1037 -25322 -110560 -132243 -32649 -22963 -61995 -33936
16691 -33936 5381 -13480 -29014 -12622 -12049 -5693 20733 39748 -4792 -14303 -94165 -20372
16679 -20372 43204 142755 135031 65985 79809 47444 14049 29777 -6416 388 37667 64930
16667 64930 107878 140564 36253 -26047 -37414 -27223 59231 81871 26406 -5749 36652
16656 36652 117869 74052 -1192 -152 31794 78026 92139 67234 14324 42184 -25848 -55795
16644 -55795 -16643 -5387 -3698 -56063 -158067 -108301 91389 169783 90583 10678 -30534
16633 -30534 13784 3844 -37232 -101442 -76773 -104464 -47702 31717 81150 62385 9128 62527
16621 62527 47796 8194 -79108 -25269 27303 -37923 -59954 -55249 -69209 -59503 -56386 -49984
16609 -49984 -4521 8185 54435 30699 -43430 11430 54961 -59405 -36660 79833 14544
16598 14544 -50346 -75132 -97240 -155101 -101470 -175082 -150596 -126562 -140703 -167103 -168512 -145517
16586 -145517 -67091 171 -25566 -98199 -86347 -77007 -42129 -72587 -78993 28498 30335 -11926
16574 -11926 -59023 -79542 -81431 -119656 -139530 -118402 -111364 -117067 -119293 -60635 4013 83181
16562 83181 75421 -74575 -62886 -7756 11635 230 18925 67261 76802 28596 -25406 55538
16550 55538 141624 99939 1588 -90108 -136618 -129782 -84422 -45304 -17548 6482 -60063 -144362
16538 -144362 -129012 16854 58593 -26028 -66989 -15891 76499 83974 30201 26429 53936 -41435
16526 -41435 -66085 -430 59993 -30375 -60177 59162 119085 92306 78776 58104 45889
16515 45889 48570 55787 58499 78432 42368 53835 30169 -47021 -53386 -53672 19170 36104 12226
16502 12226 -18325 -18650 8521 -96094 -83733 -9035 36564 17796 -11995 22633 67043 31013
16490 31013 53770 50715 33447 28671 81807 52472 -30421 -53965 -67870 -115395 -5515 63801
16478 63801 77880 26254 16040 27696 -100240 -189771 -131408 12280 24453 93420 137727
16467 137727 99413 38801 3300 -56454 -53805 8428 8498 35419 33937 -60129 -56339 1686 -19193
16454 -19193 32850 11263 -65699 -44142 9401 -1469 -38183 36045 82717 79537 -18300 -43807
16442 -43807 17671 110853 129786 92940 104470 97349 73927 80178 4448 -137425 -137957 -133769
16430 -133769 -65980 -30005 -12421 36540 11675 -37120 12452 93071 51817 -71640 -166795
16419 -166795 -165929 -86505 -66287 -4009 67408 22708 55232 -17996 -40780 -36261 -5481 -10107
16407 -10107 18645 37599 92005 29975 6461 -40187 -16763 -94923 -90962 27222 34887 6682
16395 6682 -66179 -125747 -124229 -167473 -129657 -159268 -176485 -94800 6767 35649 10170 -35118
16383 -35118 -78944 -55814 -67178 -34349 91349 144939 148328 147833 158702 109525 92982 129168
16371 129168 116357 91880 56276 67873 105668 111715 111740 138619 169488 137045 134166 131509 18268
16358 18268 -83757 -196545 -124461 1634 -44376 -94880 -127080 -146046 -140762 -112909 16562
16347 16562 53601 47933 26194 -38998 -90432 -99935 -12639 -33319 -63373 15803 34140 -45139
16335 -45139 -91143 -65427 -32699 65639 15395 -12671 47424 39509 65111 154882 151510 128749
16323 128749 42389 -64186 -59447 -20428 -35399 39475 55374 127074 152132 127080 93365
16312 93365 99017 100864 86561 16811 -29408 -91486 -85246 19890 112584 135761 154240 147288
16300 147288 67112 2125 1216 39801 -546 7576 56273 32274 -60062 -30909 11591 15495
16288 15495 6176 -68713 -73299 -43411 -61419 -5776 20765 -8576 21752 -108956 -166077 -78682
16276 -78682 17267 17932 62739 64269 100167 149941 143631 117036 115247 25047 58367 54391 17041
16263 17041 -12825 -13851 56565 91691 62027 -32409 -192228 -219464 -206638 -195414 -105858 2230
16251 2230 -4691 54865 96942 93316 82075 62837 38464 40413 94007 96300 97148 79949 25337
16238 25337 -25632 -51497 -28040 40128 108493 38531 31541 102407 111083 117610 98943 89059
16226 89059 60563 69251 75206 20186 18340 102552 183465 132818 95600 14558 -6725 11742
16214 11742 126125 145175 43168 -29563 -118629 -110584 -68774 -60619 -73270 -136295 -180087 -165407
16202 -165407 -39261 36416 36101 98712 73840 51092 37726 -14063 -49626 -29094 -7170 26991
16190 26991 12032 13695 62421 87723 53180 72346 38731 -20634 -3088 83858 71083 27980
16178 27980 -31639 -21345 97112 156560 68403 120905 132094 107037 119301 67265 32985
16167 32985 -45920 -85271 -104296 -73195 -27716 23800 54591 18965 -94240 -126868 -113602
16156 -113602 -48227 -75070 -33703 65168 104429 58196 15235 6085 -33008 12951 111018 118163
16144 118163 -29107 -141636 -75480 -228 16553 43153 104083 150915 105667 27649 -70686
16133 -70686 -55018 -203 -24491 -6618 23006 53138 133688 75536 -23842 -9514 -16764 -54195
16121 -54195 -27784 -24998 14480 24526 -25566 -48587 -29254 13254 24415 -2846 -122541 -111684
16109 -111684 -39173 -65847 -117749 -126349 -79996 12035 3124 -101681 -76196 -41148 -38205 -38850
16097 -38850 -69546 -43291 -21716 -2312 -48825 -68460 8733 86125 71948 -74034 -102553
16086 -102553 -160160 -233903 -221684 -105599 -60101 -2338 70167 107783 106609 61287 -2557
16075 -2557 -61558 -98788 -66583 -102160 -92806 -32959 46809 41677 -8880 39350 62735 21803
16063 21803 -40609 -40116 63317 53148 -2860 -23705 -42264 -28667 -40712 -54865 -115470 -94359
16051 -94359 -15292 -48177 -33547 -8720 90298 83715 29265 -9224 -59220 -12502 -7415 -70935
16039 -70935 -31998 -42829 -49662 -15711 -4279 43352 -39991 -106846 -176583 -130688 -3288 -47997
16027 -47997 -111694 -27084 41860 13151 -24798 -98985 -75749 -39776 -85699 -79981 -61137 33567
16015 33567 94778 4258 2983 16874 9960 11563 40063 94498 98471 118162 55021 36888
16003 36888 25306 74580 37869 15429 87250 113837 40768 -94651 -133341 -109718 -172559
15992 -172559 -174331 -121412 -66128 -16452 -32088 -13074 78060 35271 -27433 -16074 12874 40133
15980 40133 74027 124648 115807 87118 80265 17285 -12737 57479 171452 174073 157167 147737
15968 147737 135569 110364 93943 31569 -32672 -46664 -2335 13414 10940 2865 -14119 -13874
15956 -13874 -22705 21175 42005 44204 22631 48159 90171 83745 74167 97777 120214 167985
15944 167985 110950 134039 189949 157101 44181 -1615 -3940 -125334 -153550 -79868 -61553
15933 -61553 -46782 -9027 12753 40678 73856 96468 63358 37067 23899 78495 34278 -24534
15921 -24534 -59046 -121314 -126614 -102282 -16485 54829 133499 83204 81040 149838 122816 49896
15909 49896 45422 52681 29497 6653 53964 52536 80738 -38600 -1891 54193 50290 20265
15897 20265 -49304 -71714 -57867 -33839 44802 38440 33168 52309 80834 120998 36767 -78978
15885 -78978 -31294 -14132 -82774 -62928 -140801 -73105 27971 63851 105298 60378 -95380
15874 -95380 -24562 147789 137983 89379 95633 59074 19623 20513 -45888 -103803 -12449 9307
15862 9307 -30829 -12263 15960 87063 123634 55772 58821 9181 -54287 -40706 -43363 -92693
15850 -92693 -80323 -15615 -4049 -27850 -63052 -103904 -68843 29717 44701 10752 -62945 -63835
15838 -63835 28974 57133 -76074 -155141 -170728 -107484 15915 36361 -10109 -56350 26942
15827 26942 52991 44792 -15889 16620 24606 109962 124787 122393 152230 198059 235651 196940
15815 196940 171929 107212 57176 123934 90404 -9038 -48483 -62080 46439 145311 68784
15804 68784 -18789 18033 106824 108808 16379 -41716 -27885 -23380 7069 29614 97763 74653
15792 74653 109025 66840 15027 -23238 -29143 54524 95471 157974 124535 64262 93593 137443
15780 137443 8417 -92933 -88941 -78993 -62886 29019 66183 62921 4481 -7528 65007 107512
15768 107512 265015 343237 330103 339711 419751 337412 248901 203085 143403 121445 112102 133048
15756 133048 105960 35320 31709 -6570 14766 67230 63615 31782 66904 80972 126711 143112
15744 143112 55048 26485 52546 121136 106314 108582 90040 88260 44142 136339 113891 -2517
15732 -2517 -21997 13305 38875 49596 97389 149034 117171 84336 59208 78116 102466 114429
15720 114429 162354 169067 106588 90081 91500 88084 54486 139793 130889 169715 191363 141348
15708 141348 151085 140905 162480 154929 177938 201298 233713 143386 17868 -32632 -56774 -9821
15696 -9821 -13217 -3742 18084 55926 67868 161997 264845 300781 401195 463790 436417 404985
15684 404985 300408 281184 206662 76545 24757 29034 30402 46093 50544 13548 72275 136682
15672 136682 97519 73857 64355 109568 69628 141802 176609 194804 172256 115741 41461 118928
15660 118928 71915 97830 106801 90704 68332 -16380 -63517 -1782 -23499 -76097 14552 -25151
15648 -25151 30772 122958 180655 260771 175227 91507 188358 180921 157675 133165 128738 127768
15636 127768 171589 185811 141444 67796 3263 52323 118913 175364 155020 177430 242605
15625 242605 239337 189308 147821 155849 175044 194688 220934 243071 247249 252117 234646 252002
15613 252002 226270 261184 299238 281989 303118 277355 253995 288859 336996 333077 389433 474872
15601 474872 333587 253294 204728 145339 135626 81211 106221 117162 76266 87334 107971
15590 107971 175299 138878 147922 211471 144596 115767 107684 87570 19281 11187 45400 54468
15578 54468 75899 27177 46781 144368 159073 167896 124506 130686 115507 166566 161010 124643
15566 124643 138113 114603 76885 85007 98405 62453 2378 1361 -34118 11385 30502 71386
15554 71386 125524 90661 81584 43349 17378 107765 106587 123837 97892 130492 114407 217662
15542 217662 196478 144478 99100 147861 149351 132533 80882 -34497 4331 134832 293715
15531 293715 290446 201100 194032 111800 33812 40179 158935 228278 209104 146981 57519 117023
15519 117023 182626 184165 168878 151013 153008 131533 154300 183127 174886 225722 201206 38210
15507 38210 38373 173725 222095 181895 198809 169875 154138 152265 217842 281285 133684 93725
15495 93725 214278 289687 192377 156066 246526 319081 439765 498382 501995 566376 534341
15484 534341 466787 466673 457290 448095 468834 486503 627245 765837 817182 916269 1172598 1396045
15472 1396045 1595811 1908967 2267253 2489297 2619354 2625203 2502778 2291842 2033585 1722008
15462 1722008 1392446 1201375 1025394 845624 754813 726675 608228 424938 299918 311345
15452 311345 369443 375022 370096 397212 513716 517265 418666 328525 370182 359227 376907 363556
15440 363556 361204 404103 426627 351256 309010 308125 344046 378457 406411 359201 403361 392248
15428 392248 376111 322886 281684 230474 162554 56880 236416 224940 206995 209036 152385
15417 152385 134712 133377 123934 166468 230253 259193 252407 246797 318400 390887 342359 307911
15405 307911 289607 313327 326859 274743 184006 146284 174698 172932 90318 177202 279034
15394 279034 237806 125025 21129 34940 30272 1437 67056 89877 154709 124395 141981
15383 141981 213685 292964 332874 314888 244032 187757 190755 184575 205816 210894 207316 149235
15371 149235 146542 164713 232999 283119 286197 256090 250767 202533 184734 162639 125322 80120
15359 80120 81071 102183 204882 243086 248690 184327 153273 131775 193744 288989 323167 293313
15347 293313 195839 108618 54524 64252 177132 202629 203346 177328 181780 174060 169255 209379
15335 209379 164151 76501 122432 157320 133902 140474 105686 119057 85712 73922 159772 131448
15323 131448 68887 157273 127957 82825 36772 16355 18642 102628 113190 70473 38748 166754
15311 166754 223906 166393 142873 194932 161916 209545 250093 266887 167631 151002 177323
15300 177323 261547 256692 158652 183399 256631 344255 309050 185587 110571 4507 134503
15289 134503 266897 266936 199582 204425 232398 281446 331172 276423 207475 250454 313438 367733
15277 367733 365109 318574 319946 380114 399108 328627 307342 311751 338205 359275 268826 328669
15265 328669 327936 319617 266495 189884 170877 202347 207166 212183 270661 296873 226749 200368
15253 200368 126556 209904 284161 243578 232923 188709 221757 227572 205328 173901 163799 159869
15241 159869 132848 52235 80173 172795 236786 235736 273479 298049 289929 301768 309873 325352
15229 325352 281884 224277 275550 388868 414973 449148 479356 450735 462188 407810 334705
15218 334705 445059 539980 577719 645727 699097 841517 854837 784299 761521 643396 551506
15207 551506 482547 390880 323336 276893 317785 330554 322647 382930 392833 339891 361725 311767
15195 311767 334352 349270 369013 404200 342282 390548 357395 269199 233592 250127 246219 308939
15183 308939 310538 269245 175026 111280 150713 218865 160149 153599 156453 136996 108942 146820
15171 146820 146023 165828 269542 195201 188822 264713 291953 311942 397524 549844 846606
15160 846606 1171844 1357386 1542316 1796932 2081319 2470755 2900476 3227191 3490948 3635851
15150 3635851 3719928 3799054 3873220 3866198 3685217 3568072 3451956 3265765 3042189 2764665
15140 2764665 2655184 2490561 2252786 2108864 2069630 1982162 1811326 1602879 1529148 1390982
15130 1390982 1290930 1344958 1352203 1383791 1409918 1363857 1348291 1384309 1324613 1209702 1201819
15119 1201819 1117349 1100115 1175030 1089371 1092697 1180377 1221190 1151639 1095649 1132370 1211853
15108 1211853 1160498 1097206 1140599 1267507 1281534 1290449 1315870 1353912 1404613 1539378 1634195
15097 1634195 1705841 1742144 1901487 1995037 1950079 1914329 1997448 2012009 1915763 1868567 1871077
15086 1871077 1846267 1809321 1785910 1745108 1842419 1986653 1949079 1864573 1919493 2048533 2117438
15075 2117438 2107076 2138729 2257620 2290151 2308786 2406006 2493930 2546320 2619912 2652691 2680593
15064 2680593 2894622 2970437 2992173 2979869 3006016 3069377 3275343 3543301 3781911 3954278
15054 3954278 4146375 4433749 4839779 5246998 5564588 5982455 6538177 7170729 7882477
15045 7882477 8745367 9779518 11050059 12653125 14675192 17108442 19898703 23130540
15037 23130540 26775753 30605842 34710893 39483987 45377934 53241896 64813772 82886891
15029 82886891 110959581 151054043 200941491 259091429 327703939 398198468 450339757
15022 450339757 479476119 493048574 482070068 438555295 379415514 319175864 260969161
15015 260969161 210689053 171274897 141156507 118900065 103813951 93443430 85747270
15008 85747270 79634815 74318686 69471821 64845951 60411162 56425319 52830485 49743220
15000 49743220 47044851 44773381 42964090 41552723 40265407 39044321 37847935 36560269
14992 36560269 35126538 33734876 32365615 30975560 29546851 28173582 26941957 25811265
14984 25811265 24851943 24023912 23149044 22389277 21693855 21009239 20353058 19701277 19022707
14975 19022707 18458981 17897973 17335740 16873338 16418952 15979765 15516607 14961888 14512980
14966 14512980 14196072 13794724 13427525 12967494 12485397 12181095 11923092 11773702 11506157
14957 11506157 11264720 11026403 10757604 10437615 10119334 9798993 9619810 9460242 9142109
14948 9142109 8820340 8627475 8384986 8120006 8050962 7837235 7599873 7426034 7282279 7152928
14938 7152928 6970273 6851775 6722116 6604237 6359034 6168542 6150220 6108268 5972420 5955000
14928 5955000 5915933 5869076 5785275 5627484 5500365 5386362 5325903 5189302 5114506 5058917
14918 5058917 4975163 4894370 4773999 4724370 4757065 4756162 4726934 4685764 4666576 4702797 4612935
14907 4612935 4513816 4554145 4597933 4780223 5058147 5168635 5265782 5436323 5558491 5706096
14897 5706096 5854469 6008575 6033900 6056539 6078481 5983223 5887597 5829540 5663217 5387008
14887 5387008 5107875 4744428 4347739 4075027 3927316 3757470 3672363 3576631 3537876 3525856
14877 3525856 3392656 3335849 3290817 3292894 3190927 3073211 3034127 3080672 3107752 3137714 3149219
14866 3149219 3227533 3283032 3366745 3603881 3722988 3823267 4159426 4765003 5556363 6746220
14856 6746220 8208140 9827132 11625766 13706512 15942280 17576647 18567149 19291548
14848 19291548 19487367 18525558 16521405 14613803 13020207 11369848 9750887 8319663
14840 8319663 7168647 6302721 5635434 5110898 4668025 4287050 3914373 3570883 3305902
14831 3305902 3089382 2918430 2815295 2648528 2512036 2398916 2327563 2233031 2221303 2169440
14821 2169440 2147996 2208901 2139058 1991535 1882070 1825434 1838661 1745840 1680409 1619916 1586217
14810 1586217 1627858 1642346 1657808 1565573 1473357 1444236 1481946 1549766 1548037 1520252 1425145
14799 1425145 1366536 1334145 1351785 1271253 1293611 1275496 1183329 1173976 1219705 1301087 1283167
14788 1283167 1187347 1163555 1198854 1175718 1282428 1405135 1387902 1391503 1374917 1265456 1190636
14777 1190636 1123844 1100729 1062348 1013671 1009467 976806 993757 994246 1024293 1022894 958284 932281
14765 932281 907346 860410 883818 862268 786728 765089 691733 668291 634135 661549 671615
14754 671615 646874 636155 587927 594145 596995 600727 577854 606119 723822 652099 627641 608422
14742 608422 595444 553136 508315 554223 549524 512625 495170 442953 389474 454959 455470 507764
14730 507764 544819 509756 511451 481216 431200 466750 509183 591561 575108 500901 434252 363584
14718 363584 371632 361208 367435 302576 331801 389196 345935 317207 224330 176887 192490 279731
14706 279731 379959 377773 285697 232827 134118 106769 186489 181760 191144 176916 219025 316156
14694 316156 402332 384029 252453 177127 175798 203770 194511 253986 266046 214140 192761 205961
14682 205961 197807 176177 165955 184975 266160 327350 333509 325219 294362 205458 116025 182062
14670 182062 239166 136865 140151 150998 176968 205459 182419 164660 179386 184209 159479 97612
14658 97612 89585 124261 174803 167563 212193 257681 248711 261356 157147 98429 144162 163441
14646 163441 189265 133177 199699 257816 230866 284173 232588 72758 -20269 57944 185193
14635 185193 241353 143610 177994 178922 141773 59387 85208 123556 118467 184630 167484 182390
14623 182390 210994 139753 85183 73942 88516 111108 114472 101822 102460 119824 70953 52857
14611 52857 74678 61314 49165 53765 -27076 -88947 -32829 21374 28401 54871 134001 134558
14599 134558 125581 172763 136813 125008 134555 119691 130110 93330 142965 156820 85992 52091
14587 52091 86469 96167 166020 223880 278686 250245 206979 302667 431773 440554 559004 796416
14575 796416 1061236 1327115 1627137 1866624 2094766 2232332 2372451 2480550 2425581 2217206
14565 2217206 1969567 1772692 1427371 1145231 967652 799044 668800 567483 565507 543410
14555 543410 418052 452851 507248 448716 407600 391346 401907 350319 338698 314937 318833
14544 318833 267903 216915 232226 256035 324446 327311 301505 243381 224603 224491 209078 260953
14532 260953 253428 255418 329008 295947 196335 106349 82164 132774 162015 195635 189783 156995
14520 156995 84284 -2680 55741 102030 82057 172701 176536 179950 120864 116919 83719 84149
14508 84149 124342 167113 133301 72417 96157 104054 46668 31665 73432 55615 58865 113826
14496 113826 107910 137192 220588 287356 233277 114204 72678 137621 168944 143748 142608 131575
14484 131575 60236 113340 163311 164059 86726 37769 113903 159991 219988 147971 138226 200720
14472 200720 135828 119833 116188 131346 161109 241406 213078 156946 275397 422159 517942
14461 517942 617506 720245 870195 919746 894576 704762 580973 497306 391958 271254
14451 271254 181640 173885 92859 96243 180098 262831 283751 255368 235924 232776 251433 220626
14439 220626 141075 102836 163084 172955 229171 252105 211956 228081 152715 104270 155606 99417
14427 99417 82898 62768 58703 38737 72480 121791 131843 120098 69346 34162 123824 123072
14415 123072 -53827 -158105 -133683 -69690 -103992 -108656 -47498 76090 80447 98750 88392
14404 88392 151409 253037 240012 172841 133732 170233 239603 218843 179850 81406 -34004
14393 -34004 89436 224642 255524 136616 50078 89690 139205 147613 113530 89718 71507
14382 71507 -47766 -119321 -71524 -20561 -3585 -7559 -70937 -142971 -130410 -99422 -39644 -33660
14370 -33660 -43607 20814 1638 -34115 -36554 -103343 -108681 -59293 -28223 44087 37420 -14132
14358 -14132 -9509 -84071 -83144 7010 -1215 -68901 -14899 59196 -7429 -10235 47655 7983 -87665
14345 -87665 -61480 -27394 59717 62672 40173 -49944 -96626 -71628 20837 41546 104226 90045
14333 90045 53050 20129 -20258 31032 51046 -63326 -112604 -11494 -15206 -8917 -17074 -72256
14321 -72256 8205 90916 6639 -15500 3862 24915 121119 100404 112133 130502 143320 184140
14309 184140 168530 187153 198944 164742 125861 136902 182102 240107 255379 340745 352605
14298 352605 384310 513407 710879 806514 841036 850657 791273 726486 686667 502220 370462
14287 370462 318801 306230 192276 208435 209660 151664 185460 281999 296615 273261 212182
14276 212182 282730 295871 183170 84057 72281 46222 10398 -16906 5179 91172 76573
14265 76573 38718 41723 76743 74131 65966 104575 126179 104134 102144 60997 63919 93464 185303
14252 185303 232420 237465 228261 234024 214987 104299 15700 -33365 -40221 14960 41888 43068
14240 43068 -9390 -36509 -24619 -12970 96598 129235 101084 -659 -166658 -154914 -112883
14229 -112883 -51148 53488 125260 119156 25264 20291 83393 133093 168358 101517 53157 55278
14217 55278 91015 179988 136280 130272 145247 183332 132279 101252 145080 124150 76548 175
14205 175 57845 71889 79939 38087 43838 13127 -14037 -59314 -49977 10071 1058 11188 26163
14192 26163 56842 32562 8274 -32770 -55434 -98360 -17971 31787 -26330 -1937 79524 14540
14180 14540 -15064 34555 148708 148236 61933 15977 -21785 21320 20333 19490 62818 24570 70277
14167 70277 106876 26493 -79805 -113648 -62011 -19761 -68156 -53142 77341 115667 114778 64795
14155 64795 30586 5161 -31093 36751 88401 52275 30976 43701 -5787 -40996 5282 -63614
14143 -63614 -83695 -136952 -104982 57513 113133 68561 120318 45676 -53156 -29000 -41035
14132 -41035 7877 -29117 -33465 -4645 -95633 -157740 -132276 -114107 -26167 17662 111907 97625
14120 97625 50488 51995 65052 3190 1205 97958 97834 70913 21569 48791 54851 69545 85395
14107 85395 70672 100358 77054 77227 68694 -9310 -2579 -3624 -66220 23578 62441 91397 124952
14094 124952 152914 109458 117036 36686 33581 58826 -18969 15504 94150 128956 116129 95024
14082 95024 108625 23585 -62946 -46427 -30796 -73222 -171659 -157288 -24133 25260 47286
14071 47286 39194 95138 106865 163007 208879 263333 243644 223865 271584 276587 252955 288470
14059 288470 217059 124341 93791 57923 22348 17672 13490 -47129 -25971 -7668 -28570 -41254
14047 -41254 -23931 -31552 -30213 -3090 114748 175905 137641 75007 -41752 -26679 -9171 3261
14035 3261 -15380 89167 103043 25456 27593 60952 26145 71591 82016 118777 188720 105468
14023 105468 -11083 -40673 -126622 -158693 -64169 14237 46747 27768 2529 -56 6341 60526
14011 60526 -49234 -52154 9497 19311 -9989 -18790 -60186 -83464 -146130 -187117 -132541 -30802
13999 -30802 -69048 -121653 -78362 -2173 44919 29473 -3802 39428 46973 32323 101427 122707
13987 122707 17968 -24354 15723 -92582 -124929 -50454 3775 132141 97691 14284 7226
13976 7226 -1540 -9243 -55014 31188 134100 70458 16898 -30100 -34127 -92225 -112045 -57554
13964 -57554 -37352 -9740 -53124 41363 79914 -19777 -95166 -118948 -38113 -30626 -115778 -100754
13952 -100754 -41262 23251 22835 -14474 -37648 13215 80690 109859 110869 118496 57989 -109930
13940 -109930 -98662 46873 -27517 -86986 -6725 8026 -8292 -61990 -109126 -59136 -136766
13929 -136766 -76021 3803 -5524 21204 48537 141520 140784 122146 70322 -15244 27988 32225
13917 32225 32664 14689 -37737 -69735 -106707 -97286 -55481 -94048 -90591 -70771 1820 60529
13905 60529 121479 116874 97960 870 41906 49758 -11570 74998 -9607 -12115 32663 52323
13893 52323 3507 -49471 60190 98690 56886 34034 41510 6875 -28074 -41402 15903 39886
13881 39886 106787 114724 120482 159075 132677 83897 89588 33260 -2251 23272 44823 42422
13869 42422 127928 190042 195779 171301 81542 18215 -10462 -75307 -83838 -75738 -36589 -17317
13857 -17317 -30441 -62865 -124048 -110624 9082 82266 54495 -14996 -3101 29683 40699
13846 40699 79866 163606 150899 31610 6922 -68630 -93361 -92496 -70465 -75875 -97636 -88244
13834 -88244 -122019 -77332 -58857 -54680 -16417 41934 17437 -10808 -27247 -20877 54918 60807
13822 60807 30844 -6377 85268 145908 41017 27434 -22003 -107081 -117299 -139154 -54800
13811 -54800 -140422 -170998 -157130 -166641 -127692 -47205 -101589 -237779 -272109 -117182 -25391
13800 -25391 30827 76061 29071 -10829 -2546 -17631 -2854 27009 40318 23488 13069 132911
13788 132911 179725 176884 91318 25043 22657 24303 60543 85581 142471 97516 33043 -19712
13776 -19712 1175 -17088 34630 34985 -10238 10352 11179 54196 15908 56383 58320 82538 107450
13763 107450 81067 -50994 -73741 -31832 -31051 -21262 13394 38920 29834 -41531 -85521 -89532
13751 -89532 -165518 -127919 -135593 -70126 -53280 -64773 -74076 -52901 24374 22661 -5517 -2113
13739 -2113 131535 172674 169430 204161 233095 221927 204996 224007 248771 171786 112284 3733
13727 3733 -59594 -46222 -69636 -72932 -97321 -109277 -52250 6478 -1659 23719 93915 26409
13715 26409 -110994 -197354 -147531 -74016 -65719 -415 69699 162847 112090 88402 52150 -4477
13703 -4477 -6755 -5270 33739 -12476 -54410 -13532 25992 79640 92734 80853 97423 104758
13691 104758 103782 20218 -12966 33645 111418 148979 63471 36447 57694 -2711 -27983 32488
13679 32488 43312 146817 212402 199403 92623 -33938 -91840 -24171 -9796 -20834 -18917
13668 -18917 -63789 -96930 -94167 -59093 23149 52157 -6341 -39968 -2187 29461 67938 104842
13656 104842 67450 -64807 -101988 -128092 -155869 -122747 -144249 -87691 -20298 -22914 17937
13645 17937 14000 16402 -9421 73117 71746 1462 -71872 -140082 -78511 38319 -5331 -124137
13633 -124137 -33358 24709 75528 78058 106113 82002 97017 83388 59372 53242 39697 -20967
13621 -20967 -194349 -233877 -211197 -168069 -44650 -14900 -52364 51929 12040 -67225 -52678
13610 -52678 -34429 -10259 -20343 -40229 -33983 78118 153556 22620 -115686 -167542 -179206
13599 -179206 -94220 62921 119479 24264 1637 -53750 -61593 -41206 32086 19581 -40206
13588 -40206 -30244 -57193 -18880 -21128 -85887 -169393 -98299 -29307 21006 -29594 -131640 -94113
13576 -94113 4264 46914 -2102 -14922 18962 66805 50577 -5961 23341 -29439 -31999 -25489
13564 -25489 66280 14824 -23864 -84032 -54382 49942 50823 35552 56075 90468 62842 24215
13552 24215 -19985 3854 16320 59139 -5200 -10601 -28738 -29466 -58528 -29761 -67033 -94445
13540 -94445 -75476 -86612 -88248 -115900 -89463 -61154 -61573 -153172 -134274 -92325 -100755 -103887 -2871
13527 -2871 122517 101756 64652 95619 50723 -23467 -14166 51661 63951 40584 -14861 -65888
13515 -65888 -15797 30079 82597 177684 149025 99506 56523 21049 27863 61359 -40005 -91518
13503 -91518 35051 101645 78588 63678 44403 -19686 -106104 -160917 -168844 -130993 -106985 -71128
13491 -71128 -38480 -93364 -75462 -28529 17625 23152 38791 67321 38473 40917 31274 18889
13479 18889 -58952 -90187 -110522 -106505 -110145 -78436 -69483 -73070 -17822 32675 108143 59073
13467 59073 986 75186 27567 -100836 -67274 -47667 -89540 -97223 -85359 -134739 -75387 2360
13455 2360 45672 168310 203120 254646 304722 210394 134485 156009 115449 -3377 -104090
13444 -104090 -134732 -104652 -124848 -136415 -105251 -64247 7030 54536 63198 12241 -72297 -49747
13432 -49747 -24478 -5356 -34323 -82712 -110207 -67048 -14478 14103 91158 81531 3343 -63086
13420 -63086 -94628 -65671 15556 85494 79562 16212 31359 -36431 -66773 -91710 6709 -15721
13408 -15721 -56575 -100095 -90761 -107129 -61964 34027 76535 86630 41427 -26482 -23710 -49787
13396 -49787 -73336 -114616 -92623 -90499 -16473 86156 142525 128407 65277 38211 -23162 -14566
13384 -14566 -14678 -82843 -37731 38484 46479 37660 -37251 -77446 -117064 -88537 20651 -8314
13372 -8314 -57967 -143319 -123008 -99493 -115918 -46251 -50045 -103606 -59895 -8862 86768 84049
13360 84049 38888 -18753 -8733 85582 69232 4965 -33731 -54407 -19274 30867 -7232 -22714
13348 -22714 -68875 -71811 -8044 -25907 -2037 -17717 -3832 -18779 -80835 -180836 -163330 -81493
13336 -81493 -5602 31549 48483 66769 182729 196552 118229 -8451 3800 -792 44948
13325 44948 33414 20634 16882 -13255 -87716 -100193 -84500 -52522 -48664 -50105 -98109 -107474
13313 -107474 -37859 -56438 -63645 -58827 -66635 -92327 -66429 -52471 18199 -24116 -97144 -74554
13301 -74554 -107946 -140264 -154032 -187894 -144648 -133383 -90241 -3532 35948 36803 8964 -27155
13289 -27155 3482 -9508 -59934 -7719 93949 35795 1606 8404 -19330 19542 56380 94254
13277 94254 27911 39552 -30861 -37564 -21334 15404 43043 -6356 -85097 -132215 -181229 -196629
13265 -196629 -142381 -28458 76801 108315 79039 51755 95557 95039 -11813 25467 1083
13254 1083 -63983 -1323 68613 38926 -110980 -126003 -79058 -40151 40093 93244 86659 54066
13242 54066 99010 130554 71858 114600 163090 84267 43306 24191 1225 16401 46977 29115
13230 29115 1301 6517 42072 28456 -77118 -178231 -195994 -96046 -30019 29676 66123
13219 66123 -5083 -59616 -13351 5660 -6002 -81648 -100062 -62389 27010 59055 14670 33382
13207 33382 -19180 -911 10667 54918 101772 64577 118764 212890 195120 119800 57177 6437
13195 6437 -20263 -56424 35572 132021 113388 48909 38070 65910 -4187 -76909 -127631 -118093
13183 -118093 -124669 -139129 -141679 -152297 -69323 93103 136540 153397 110507 55217 37786 93377
13171 93377 189695 194920 156705 170385 151192 111328 83068 94202 98942 64272 10485 36780
13159 36780 81404 135196 156636 166574 169327 121384 62268 16320 79758 94871 26879 -53371
13147 -53371 -13090 59625 101275 152896 181198 132134 102484 123402 143494 70824 7737 -104064
13135 -104064 -125237 -114593 -154707 -120050 2166 74133 13113 -54418 -24352 -9578 -4824
13124 -4824 -58238 -92645 -88631 -5255 58349 -16946 -122661 -109589 19794 86686 58861 101602
13112 101602 118624 103487 65269 37369 64372 66786 36899 -63060 -113250 -45500 -39349 21510
13100 21510 36248 -39556 -12970 11659 35816 -79758 -159014 -196528 -134612 -113020 -150591
13089 -150591 -63189 -50466 -104480 -113555 -77081 -59354 -25100 -82868 -91797 -6218 61979 -37280
13077 -37280 -65160 -1891 -63617 -50085 -5970 -12251 -19578 -44401 -14126 44281 117188 89404
13065 89404 120246 155897 135225 157086 163355 180450 165009 92876 35750 7021 20517 24087
13053 24087 -71982 -49811 -51205 -85124 -109132 -66473 7316 72499 65454 -44320 -98608 -172932
13041 -172932 -161141 -84909 -43248 -94066 -136117 -57862 115334 100624 5252 28260 22957
13030 22957 2755 28495 15407 -8781 29466 98604 94692 111157 133517 95891 72481 77982
13018 77982 142741 101109 -27035 -109451 -78642 -9541 -78887 -103487 -67729 -43811 -42796 -51958
13006 -51958 -10239 23025 -25911 -66844 -82181 -916 45623 -6954 35118 51986 -59032
12995 -59032 -99788 -81311 42472 106019 56134 43758 45840 12214 5316 -74857 -83683 16259
12983 16259 3825 -80538 -64446 -20173 40171 136870 108595 -31940 -58767 -71786 -76291 -98770
12971 -98770 -26976 -25558 -84031 -42686 699 -63806 -8722 -68803 -21436 58157 91315 89905
12959 89905 125474 69731 -1003 -78722 -132760 -86435 -20027 -6746 55719 10215 -93814
12948 -93814 -125693 -77237 -75062 -60334 5604 -23092 -101872 -55694 7229 6083 8161 18253
12936 18253 52219 46605 27397 -2073 20174 26947 -70655 -54063 -52547 -43759 -30360 -33432 41121
12923 41121 79445 48838 72181 66944 27242 23564 77990 106734 4433 -67707 -24352 -4100
12911 -4100 516 -48945 -111757 -117663 -138832 -202196 -227230 -180184 -122623 -195389 -171027 -60283
12899 -60283 16318 -5439 -5065 -55171 -63718 26336 63540 88318 26794 27865 22899 -105334
12887 -105334 -47336 101133 73327 -6301 -8008 -110332 -171404 -129416 15153 73457 63707
12876 63707 10338 4364 90682 128469 93063 19236 13383 19008 -27069 -13691 -6008 -8463 -31326
12863 -31326 -116779 -192176 -209462 -227184 -121483 1535 30497 21677 -96485 -165468 -124446
12852 -124446 -51966 -18422 -41369 57028 146149 138495 167046 112727 48385 27238 24524 -28210
12840 -28210 -59962 20924 121518 60394 32896 -2850 -12473 12240 33271 -46699 -12327 47481
12828 47481 92745 116164 95463 73705 73517 6367 -26679 11962 -49559 -49184 -6747 -62699
12816 -62699 -77729 -22105 26662 38686 -51798 -120564 17495 90343 71705 34294 -17642
12805 -17642 -44796 30116 -14677 -75278 860 -58956 -112080 -118846 -119425 -89676 -83180 -74394 -134828
12792 -134828 -116304 -121897 -97784 -24047 -11209 -76303 -57946 -56281 -117946 -183038 -176286 -205947
12780 -205947 -98892 -71203 -97779 -205228 -117658 -24893 -37422 -20842 -29216 -104225 -69987
12769 -69987 -83554 -148645 -167687 -76652 -6835 -10319 58932 54746 89845 39950 -16388 -25061
12757 -25061 -57687 -66425 -87527 -103030 -80115 -17223 6523 32021 59137 72909 -13865 -43069
12745 -43069 -138738 -184465 -155730 -44481 22720 -27355 -92483 -151650 -59030 -39432 -51787
12734 -51787 -62059 -4748 20396 -27765 -7064 7983 -64084 -16954 -1614 33534 62153 5779
12722 5779 97052 128153 115804 114464 78221 39801 7546 37420 90061 147537 158935 111126
12710 111126 95749 164824 73515 -40678 -27537 21502 -4312 -16516 33551 36935 36739 18209
12698 18209 10729 33018 -57294 -121297 -58567 -29436 -73504 -32433 41335 29146 -2383 -47285
12686 -47285 -112401 -131955 -136802 -87259 -158808 -140032 -139716 -180597 -60993 54553 47106 10711
12674 10711 59022 53003 88431 134177 131738 99481 27696 33352 3742 -34574 -51382 -35816
12662 -35816 -86130 -173427 -112834 -27534 -13871 -155634 -86955 -42939 -52243 38217 78840 113196
12650 113196 102395 76155 84519 127094 128500 21832 -34229 -103439 -138354 -115155 -32928 -11338
12638 -11338 -33579 -45024 -94249 -100205 -42366 -34646 -91814 -106149 -67564 -69511 -67279 -71121 -17770
12625 -17770 31835 -39544 -95517 -106380 -64403 -80555 -118941 -97685 -26547 -54532 -141930 -189538
12613 -189538 -156871 -64586 -45800 -129070 -115505 -52396 -42206 90897 143524 98993 84377
12602 84377 70659 -20650 -10125 52310 129241 149575 202676 191337 106615 163474 112032 72731
12590 72731 59454 44973 39017 -7478 -48789 -44531 -18247 -53752 -30985 -39169 -121383 -102654
12578 -102654 -89785 -28516 17202 50150 78235 -18714 -83038 -79893 -36852 3246 58682 32886
12566 32886 -29534 -56114 -36766 -3246 -21639 -104190 -114243 -60585 19735 44157 31205 46716
12554 46716 56526 48688 -22935 9514 78839 56875 45996 31489 18506 -34262 -59058 -98120
12542 -98120 -24695 110427 185419 170021 90127 21157 -35521 -110858 -33383 -69293 80110
12531 80110 120200 89730 -26028 -51902 21558 100505 103433 38925 -87424 -118421 -90861
12520 -90861 -95552 -178368 -270072 -260400 -188718 -121618 -125539 -151535 -74045 80379 82010 73054
12508 73054 120241 91232 -9052 17450 -1995 -74650 -60200 -27390 -53034 -54509 7843 -11109
12496 -11109 -33879 -67411 -59797 -49211 -64202 -51937 -66645 -32857 -31792 -909 -9760 -87761
12484 -87761 -152182 -158794 -87213 -91691 -148026 -100888 -89677 -79250 -59966 8144 92233 70399
12472 70399 24021 2379 19658 27121 -24129 -84148 25585 131126 80470 65915 62467 67456
12460 67456 21245 20 -759 -27261 -60100 -97420 -62012 -5863 45659 -78488 -120167 -94865
12448 -94865 27563 74564 64880 95982 27416 59206 72239 -53556 -28229 -14056 33543
12437 33543 153624 150555 78678 6095 103385 142111 173790 141319 26271 -17077 26480
12426 26480 120267 141882 75703 -12891 -64697 -78634 -13625 -41555 -154328 -201701 -189277
12415 -189277 -136514 -149955 -198039 -155746 -131291 -158039 -119738 -80196 -101919 -200932 -175009
12404 -175009 -98712 11149 7918 -79609 -186548 -70553 10301 44630 22916 38508 36125
12393 36125 59412 69396 -4705 -10303 57595 90438 18606 3074 34503 74013 118831 114928
12381 114928 1280 -22223 -48862 20265 75331 29482 79081 163198 187168 113487 66687
12370 66687 57509 -1042 44254 85891 73162 114534 129119 108796 145322 107002 78456 51377
12358 51377 77397 7788 -34001 -12034 -51736 -74373 -16280 25505 54864 26727 41535 8449
12346 8449 73246 106706 -2849 -7617 414 -43459 -55964 -54219 -101827 -43686 -146291 -116121
12334 -116121 -116207 -203607 -198739 -128558 -57807 -33552 -87435 -122345 -34001 30839 30048 37934 61482
12321 61482 9465 10898 -40607 40325 42589 -75721 -92854 -116027 -165099 -155855 -118779 -172849
12309 -172849 -156572 -84020 -69704 -117983 -167536 -182884 -178085 -114625 -55772 -136043 -156619 -61253
12297 -61253 -1449 -24314 -10793 77526 119727 102463 3239 10049 -39038 -35702 -108021 -168067
12285 -168067 -128674 -219159 -215055 -155479 -109134 -42165 11236 -4617 -53496 -115687 -134862 -179634
12273 -179634 -220007 -209513 -164308 -83497 -62529 -53321 28024 -25587 -20268 -2672 -16530 -32111
12261 -32111 -37700 -9766 42852 -24795 -128498 -65468 96493 136688 76463 -12248 -92709
12250 -92709 -213062 -235211 -114180 -69936 -64581 -64781 -82714 -61914 -131419 -177882 -166773 -48459
12238 -48459 34974 12148 -14848 45309 201488 131661 78186 53123 13415 80316 90218 37172
12226 37172 35212 47265 60253 136955 152992 125829 133552 11542 -46505 -15427 -78329 -7885
12214 -7885 42310 33713 -33748 75540 109844 90003 32472 81759 71599 44647 25157 -40907
12202 -40907 -55141 -67960 -61594 -61516 -60922 -57970 -92508 -41579 -24063 -46111 -41086 30730 45881
12189 45881 88864 153296 29557 220 -9967 -70414 -64517 44245 106136 106360 135760 155755
12177 155755 136755 133199 97288 44230 32282 12907 -71977 -103242 -133786 -83068 -31200 28736
12165 28736 -5484 -26974 -89811 -65767 24726 78421 37876 45168 35977 61651 -32487 -69957
12153 -69957 -124422 -129912 -164461 -125132 -76560 -182852 -175376 -145937 -96161 -2788 39275 98468
12141 98468 -5527 -84570 -83429 -146358 -114361 8536 -8959 -29712 -26499 -18806 -58689 -83465
12129 -83465 -30005 -62941 -41764 -22182 -11175 33320 96247 73984 24972 -98451 -239287
12118 -239287 -144766 -152008 -205260 -219041 -207721 -181314 -66879 -35124 -92663 -48642 19214
12107 19214 -23936 -37687 -19984 -60984 -65854 -118027 -129644 -108538 23264 2988 6003 50290
12095 50290 136383 190357 149171 90130 -12784 -51457 -66563 -22609 -10146 -27458 13231
12084 13231 13051 1754 22512 -10434 -46433 -31322 -62633 -96391 -44458 -39216 -100817 -130269
12072 -130269 -130241 -183530 -225338 -226278 -237231 -261588 -198925 -154059 -140482 -139759 -111405 -101524 -131938
12059 -131938 -35239 -33846 -65826 -58479 -32199 -18939 -3744 37678 66329 -40626 -122805 -77454
12047 -77454 -72027 -84784 -121140 -120272 -101243 -110269 -60860 -30693 112670 150750 148521 127241
12035 127241 -20116 -129891 -146506 -97866 -74687 79435 188110 170901 141584 126806 -16334
12024 -16334 -72934 -97894 -148914 -92080 9481 -27633 -39631 -61311 -146169 -161856 -67643
12013 -67643 44534 -24126 -130009 -232213 -241343 -130377 -26614 -31489 -24256 -25833 -73916
12002 -73916 -112224 -121581 -58018 61390 56853 -48759 -57951 24745 57432 102341 89806 55601
11990 55601 99653 148895 136303 93387 69823 73477 -29991 -45460 -49514 -25727 32672 52822
11978 52822 59227 92565 1757 -22151 87314 91719 7213 -42267 -29939 -62316 -13078 31483
11966 31483 57989 51953 -20070 27133 89875 34089 -48149 -69633 -57748 15858 39681 22940
11954 22940 20827 -9563 -22380 -31211 -45254 -103908 -149639 -135731 -134682 -112080 -99093 -33846
11942 -33846 51026 61105 -7986 -17684 25660 32381 -35508 -15403 34015 -27673 18911 71777
11930 71777 32832 19545 15076 5403 45487 4739 -144568 -148897 -159058 -135190 -71409 24874
11918 24874 33465 26214 70576 104723 96054 60573 52523 33765 40394 15692 -19877 -95688 -105654
11905 -105654 -17774 -13514 -83861 -93467 -27555 -36420 -55242 -89177 1603 33673 3862 -60020
11893 -60020 -74058 -84347 -67839 -49613 -47210 -52038 -84412 -62881 8757 48808 48929 41848 17909
11880 17909 14602 35892 4054 45879 98494 48647 26230 60574 9427 966 -47888 -152535
11868 -152535 -107902 -66018 -83317 -63383 -41436 -52921 -24489 -8821 -7863 46626 -80029 -136152
11856 -136152 -96768 -64634 45801 60755 15640 -53166 -61181 -63826 -67869 -68040 -54885 -10276
11844 -10276 -33330 -119520 -193278 -125653 -71245 -116987 -122621 -65618 -77574 -58684 -43098 -94747
11832 -94747 -15564 8759 30301 37564 38251 69458 13646 -38426 -108024 -134656 -33094 2141
11820 2141 -45486 -31552 -23415 -64598 -63640 -78740 -105773 -53223 -13237 -30246 21182 52509
11808 52509 64328 71522 67380 95312 93079 165444 112683 22698 44029 -16583 -92072 -83098
11796 -83098 -130138 -114518 -25832 14685 4743 60325 -8021 -35333 -63831 41473 26919 67287
11784 67287 93296 14211 31588 -4579 -49983 -36317 -61820 -71103 -81579 -96883 -27090 -52465
11772 -52465 -102845 -94161 -46901 -53691 -38913 -15542 35103 54944 -18002 -103485 -122010 -113375
11760 -113375 -41761 -62433 -143015 -162644 -157879 -119790 -36933 -32963 36447 129947 97062 87041
11748 87041 52813 -61973 -53951 53013 72735 112736 151285 203345 191182 118012 34912
11737 34912 52458 62438 106993 81259 -31983 -85464 -7245 89562 65210 12882 -81461 -91997
11725 -91997 -55468 -27159 -92816 -152027 -118422 -77804 -125013 -100614 -137977 -105995 -69761 -46884
11713 -46884 -55875 -64390 -40432 10381 -107103 -225215 -283182 -312477 -308597 -252545 -142463 -59556
11701 -59556 16646 -15474 -113824 -154386 -164619 -75162 -63303 -126802 -86224 75274 152430
11690 152430 126680 87726 24635 81287 46982 -32549 22791 60532 111560 155738 53033
11679 53033 -2795 -5988 26479 -2540 -20788 -109928 -128215 52674 146151 154088 117642 85076
11667 85076 49617 69001 35172 22896 -103889 -150639 -99002 -111792 -100844 -149025 -113342
11656 -113342 -18428 -21719 -40880 -127469 -102411 -66796 -10376 -38973 -63137 -99032 -107867 -102307
11644 -102307 -201175 -153363 -136754 -157958 -181282 -157225 -135063 -123967 -154320 -121892 -64227
11633 -64227 -161342 -154838 -35921 53104 106456 -7855 -58910 -75809 -106940 -113935 -29677 32362
11621 32362 11365 31762 51477 3295 -68427 -66343 -89436 -117581 -110053 -97073 -49471 -90906
11609 -90906 -59040 751 62159 106086 78937 27815 74168 17839 -23570 -69745 -95041 -76197
11597 -76197 -102499 -175830 -219030 -166948 -137892 -172786 -190157 -129233 -115293 -42789 -75431 -94384
11585 -94384 -44623 48173 83800 38800 -32222 -105245 -87649 -96656 -113011 -976 28744 16736
11573 16736 -118218 -158214 -67098 -57931 -61430 -81044 -80115 -17606 50917 -18844 -28473 42178
11561 42178 67741 71466 -5094 -48692 -108307 -183277 -104307 -52188 2953 -22146 -91374 -151516
11549 -151516 -46404 -22372 -97044 -108000 -82685 -63778 -86894 -70420 -97681 -103770 -104943 -24752
11537 -24752 55312 106517 223416 174073 115192 114966 52555 42941 4259 -38713 -61338 -55523
11525 -55523 -55514 8281 98919 137347 3125 385 -11325 -84640 -141482 -173208 -142442 -100648
11513 -100648 -77595 -20611 -36816 -104009 -41215 15980 -58211 -87351 -61300 -155416 -167407
11502 -167407 -135423 -119148 -81845 -43432 -53220 -64591 -59621 35157 -16109 -76597 -77012 -98460
11490 -98460 -65029 -51817 -6518 -60608 -28420 -20582 36680 67278 27403 -26546 -128439 -99841
11478 -99841 -101492 -33888 57 -13804 -99887 -68033 -35536 -34374 -92090 -40693 -70817 -95471
11466 -95471 -73201 -5909 120961 84445 46695 20448 -4068 -37795 -137434 -109092 -113001 -137591
11454 -137591 -75760 13094 -47929 -185107 -61592 30398 5275 -12749 -47155 -58534 -105732
11443 -105732 -17497 44492 -32317 -202751 -200573 -149474 -49927 69844 138122 125994 56442
11432 56442 19224 -60699 -83898 -49524 -32428 -71032 -87895 -53459 13001 43499 36884 61577
11420 61577 68168 84611 78915 35386 49147 110423 123173 99996 29840 18620 67834 5267
11408 5267 56952 47572 -41771 -11033 -40761 -105381 -33571 41873 81408 39288 37631 -34335
11396 -34335 7789 6617 -71986 -84855 -63124 -47144 -17091 -12060 -30098 -55829 -138945 -108534
11384 -108534 -29235 -18774 -77114 -72183 -72703 20189 74443 70475 30186 -42168 51378 66889
11372 66889 12614 -27240 -77589 -106561 -125307 -115332 -103132 -47845 -84827 -112415 -33475 -41306
11360 -41306 -66938 15538 22540 -18643 -40578 -30407 -76562 -67298 -52110 21197 -22413 -63998
11348 -63998 -9461 69738 61610 -13854 -90457 -133549 -55664 54122 78849 25356 -12504 7500
11336 7500 64071 39879 -161783 -160835 -91343 -53431 10689 -17105 -15200 12000 -12968 -80684
11324 -80684 -48010 21496 -28421 -12225 -43202 -56943 -42949 -56931 -63798 -41070 -22055 37039
11312 37039 17948 -17835 -45154 -31261 -57098 -77434 -111070 -59486 -17388 -7558 -42999 -21656
11300 -21656 -7347 -12550 -28477 -37098 -41481 -63328 -69667 -19249 -42093 -84338 10462 92630
11288 92630 83989 42421 -55411 -61209 -60474 -65747 -129294 -113036 -116352 -94455 -27029 -62110 -62470
11275 -62470 -330 28794 32948 363 -61914 -59683 5037 8340 -13670 -84766 -33714 55169
11263 55169 45684 32727 156 -64909 -44198 14935 22396 55450 26344 -57312 -58203 -15293
11251 -15293 -33375 -9692 28724 -11464 -94186 -92822 -69655 -33093 8295 15195 2068 -23460
11239 -23460 -83683 -52591 -111015 -143503 -132231 -99842 -38178 -13218 -40687 -26580 38617 167642
11227 167642 155866 42519 -44837 -22820 42855 27174 -40033 -127085 -105878 -23856 53411
11216 53411 93120 -18156 -52896 -43081 -89556 -36279 42970 94379 91419 58963 70891 176013
11204 176013 145681 115247 99564 80745 68152 11302 -37763 -73475 -86262 27289 96141
11193 96141 63289 -41016 -87712 -66248 -80134 -112594 -83016 -43848 -7929 73952 96645
11182 96645 66068 72767 63318 147870 188769 181716 73722 -33437 -89413 -87073 -1996 117057
11170 117057 188758 167151 172705 182218 183310 85400 63540 118264 81413 60835 31828 -25306
11158 -25306 40938 52512 80897 130750 123374 100674 36471 62159 55382 -10570 -90571 -62967
11146 -62967 78672 118008 167346 146804 27755 -8466 -31112 -7660 13364 690 21662
11135 21662 -35895 -41585 3335 591 52134 66776 -11785 31818 87089 60477 -46651 -162082
11123 -162082 -73602 -46230 -12339 30324 35184 41235 -38590 -99961 -62599 -818 -63429 -28557
11111 -28557 -9196 45272 121009 115978 94081 16362 -39603 -32307 -24334 -57781 -102057 -71369
11099 -71369 29636 184068 245474 290496 321087 233543 112442 39487 -69253 -106575 -51093
11088 -51093 -10497 -19296 -27295 28813 55230 16760 6453 -71132 -57454 -41109 -88658 -84656
11076 -84656 -19100 -23625 -22867 -87113 -98734 -38235 -29187 -76268 -93610 -71852 -45838 28479
11064 28479 46856 -19533 -31898 -55063 33589 136246 129643 107171 59046 -35391 -86985 -91301
11052 -91301 -37253 34197 57976 55424 56906 134189 189600 136834 124487 137560 105911 39464
11040 39464 -2192 1929 -31413 -135186 -122547 -86619 -112038 -107414 -22865 26047 -38388 2158
11028 2158 83276 40223 60157 92384 9529 -96803 -125511 -73450 -16052 -18220 25265 63978
11016 63978 49570 8232 16290 24153 195 -72447 -90889 -205358 -182275 -102288 -92253 -133939
11004 -133939 -169216 -165403 -57050 -13039 -68299 -139642 -128697 -117615 -39312 -44771 -42836 -60324
10992 -60324 -50648 -45663 6987 96409 138028 94092 106050 21164 -66198 -138042 -135453 -74383
10980 -74383 -28684 -7144 -44675 -109063 -167019 -144453 -143915 -48618 79289 102225 -19920 -41140
10968 -41140 -3149 71020 38586 -10226 -3305 25994 -7558 2375 94613 125411 39460 -26128
10956 -26128 67476 152779 171014 163251 107385 116770 103749 -4154 -23722 -31234 -40208 -32267
10944 -32267 -46647 10881 22925 57744 84812 67265 100225 81731 48640 9591 287 -72847
10932 -72847 -51128 -80840 -132126 -112339 -66521 -100005 -115782 -157606 -165853 -142564 -87333 -36925
10920 -36925 57049 84700 137759 70998 31372 18916 -3607 -35091 -75241 -37325 28833 45431
10908 45431 131966 119803 153732 183743 124143 82141 64309 46613 113936 127026 124085 12263
10896 12263 -89721 -180261 -90919 45750 58750 -4929 -40658 -48144 -105915 -83643 -22282
10885 -22282 42589 82676 128043 175688 118699 41790 -26586 2864 -856 17983 96638 117149
10873 117149 113157 89481 80697 46517 -16608 -34010 -45166 -106168 -102308 -106636 -54460 -14046
10861 -14046 -42383 -80537 -87491 -62893 14987 -57281 -603 30284 -42950 -35019 16476 57085
10849 57085 -104 -25187 -6212 -33626 10903 28589 22149 60997 142468 142349 26010 -78674
10837 -78674 -78929 -97678 -91193 11987 -1454 -84202 -180066 -165864 -107615 -113559 -114429 -86978 -42625
10824 -42625 -78269 -122035 -88557 -206205 -218342 -160956 -130709 -105019 -108998 -108269 -125167 -220613
10812 -220613 -286826 -163126 -50431 -42691 -132942 -166800 -76239 13851 4197 -88057 -103143
10801 -103143 -47633 25161 -62022 -56893 -44203 -98550 -156319 -61047 -18912 13682 105395 182296
10789 182296 50890 16319 38153 26805 26525 69287 63184 -40759 -30211 11207 4372 -23951
10777 -23951 -20171 35208 96701 49538 -3601 15041 29229 39056 -26923 -53764 -74668 -87866
10765 -87866 -183920 -163414 -105493 -64319 -95376 -101854 -185650 -116418 2032 8012 -46578 -58973
10753 -58973 -38023 -10227 -32717 5104 -27880 -9531 -37425 -86536 -80272 -51499 -62809 -39502
10741 -39502 44214 -19334 -114743 -70959 -10753 -21804 -67318 -34120 47403 47878 16139 -16558
10729 -16558 -12646 35135 14159 -32811 25844 -22831 -58528 -37092 -36402 -44479 -82097 -125754
10717 -125754 -31524 -97194 -144801 -132913 -85932 41926 17122 23592 49182 -14348 -39409
10706 -39409 -32311 -40393 -5379 -23316 -39304 46448 60142 97564 153733 83315 98706 131402
10694 131402 85027 62813 60451 18893 16202 16358 54475 38062 -20127 -26054 -33602 -42087 -33179
10681 -33179 -41950 14378 45395 96326 118452 69699 27108 23826 -188 -23396 -52998 -34696
10669 -34696 20777 104332 70664 75605 61640 34239 -40365 -47172 -42036 -30852 -23682 50471
10657 50471 138687 130613 126458 100943 126286 129817 142663 54529 5238 -940 -12318 61408
10645 61408 79129 18048 16680 45208 50003 92514 159082 124497 108303 75066 113955 149416
10633 149416 104648 111249 81747 89371 110658 28149 28893 59101 -27984 -51720 -48729 -3827
10621 -3827 110314 89779 -21213 -30569 -58106 -121477 -189878 -183023 -125941 -114607 -144962 -210441
10609 -210441 -201128 -112514 -29559 -9028 -14727 6580 37328 32492 18126 -447 56842 55025
10597 55025 96318 28698 49893 53955 50511 -27660 -18302 15083 64948 41500 -8264 -57497
10585 -57497 -5520 -12945 -38671 -99171 -94773 -38801 -69923 -73753 -46043 -24116 32223 -6997
10573 -6997 -47240 -14699 -63316 -63223 -121414 -150478 -73875 -40997 -120976 -124050 -70270 -35011 27536
10560 27536 -74080 -136298 -116943 -83443 -49030 -1465 -21310 -28962 14328 27390 91576 108224
10548 108224 88855 46736 15121 -39668 -93584 -57300 -69485 -159459 -184596 -148655 -123551
10537 -123551 -63625 52592 131538 72601 51769 -11791 15947 23609 -35563 -159879 -177790
10526 -177790 -151962 -137918 -74144 -80535 -162772 -196088 -138846 -111294 -43702 -15390 -27719 -84022
10514 -84022 -73753 -58323 -7562 19539 -3322 -63381 -112714 -76173 50267 73641 -24577
10503 -24577 -49376 64356 148755 125657 76162 6024 -35686 -43729 44012 105361 5913 -33671
10491 -33671 -5925 6709 -6643 -7622 12140 -65075 -93740 -100473 -102528 -157178 -124252 -139310
10479 -139310 -128511 -52661 20272 31908 -80483 -4670 48557 17063 -6865 -87606 -40253
10468 -40253 32471 26145 51502 38411 71128 37306 -33042 -48205 -93571 -68346 -118379 -77229
10456 -77229 -69693 -103983 -60687 22800 43130 25944 5236 -21918 -77332 -89112 -62940 -11119
10444 -11119 13355 467 58248 50533 -613 -13436 -40903 -124753 -171458 -103407 -70945 -55517
10432 -55517 -99880 -154151 -179702 -89030 -32980 -15784 -4124 -33756 -92130 -9670 -18237 -33052
10420 -33052 39611 93632 166831 148667 95807 95960 65333 61411 58059 -18625 -61032 -13279
10408 -13279 -41295 -99899 -101618 -17122 -57271 -145263 -191351 -135314 -45507 -35168 -97699 -193188
10396 -193188 -170355 -146180 -111497 -94682 -91616 -145835 -191906 -177702 -206472 -219249 -113246
10385 -113246 -107235 -6340 66968 8822 -29736 -57333 -23936 -62016 -36002 5779 -74694
10374 -74694 -74072 -29680 -12255 56140 43637 16764 -40914 -96923 -48694 -29583 1554 57792
10362 57792 13688 -32889 -9805 19449 2558 31660 42043 -22287 -76795 -84980 -54906 -62621
10350 -62621 -28990 -7103 -2731 110633 86294 11521 12102 72439 73026 20660 -33695 -55646
10338 -55646 -18407 -12755 12031 52516 62872 131239 85038 36100 62773 46681 -15222 7404
10326 7404 -27118 -79856 27833 98012 94599 45573 -48226 68762 123979 102498 1551
10315 1551 -4894 -35195 -51081 -53679 -73184 -72853 21619 87775 145613 167707 125160 54589 77974
10302 77974 57853 87084 24059 -55094 -1040 72977 164225 198316 111012 69959 83163 156620
10290 156620 173649 134595 65128 13280 -39906 -69685 -97312 -90030 -63207 -94557 -176772 -154506
10278 -154506 -159737 -112664 61331 107860 52375 29620 1314 -24997 55040 61699 -6242 -47600
10266 -47600 -74929 -103166 -136918 -76678 -37080 -37797 -158668 -264825 -271891 -159177 -127962 -124356
10254 -124356 -57402 -75851 -55783 12364 -30361 107 -6909 43665 52088 33912 117805 193767
10242 193767 117544 56100 -107607 -83237 -66563 -166024 -177083 -105273 -88619 -71977 -113971
10231 -113971 -108129 -78148 2139 8753 20339 -32724 37939 -14471 -24629 -5943 29495 56072
10219 56072 41221 44289 -43907 -52057 -30853 616 1196 -14915 -42891 -85498 -76182 -71604 -72168
10206 -72168 -65209 -76365 -48108 -60027 21868 127163 146442 87571 -1587 -13789 7394 33281
10194 33281 70492 112104 175474 94507 889 -28328 62667 104767 143886 91313 69114 133036
10182 133036 115492 109104 81711 -22706 -28085 -10589 317 62554 85154 102661 80772 6358
10170 6358 -30995 -5694 29008 -79501 -64785 -19233 534 -19731 -9852 28950 28831 107140
10158 107140 64967 -74609 -113476 -54045 27595 52948 -17071 5555 -24573 -95623 -67549
10147 -67549 -19807 -20818 15015 -20906 -58062 -97812 -121262 -113936 -114290 -116130 -137931 -85946 115898
10134 115898 133135 42336 -48762 -24966 36923 -51114 -89801 -140510 -104121 -93543 -115025
10123 -115025 -125618 -69941 -20270 -58730 -72172 -98438 -63491 -35973 -42436 -41179 -113620 -141503
10111 -141503 -166107 -116428 -112663 -119341 -133677 -152207 -81664 -30 45259 -12967 14928 44417
10099 44417 14595 358 -16681 63310 73199 88945 67044 86007 31599 17512 32482 -18270
10087 -18270 -92043 -58091 -8774 -10484 -49782 40063 114786 89546 36477 51689 8502 -18309
10075 -18309 -63478 -87049 -75221 21453 134388 125817 75225 74728 148664 165088 150723 94633
10063 94633 25842 -19505 -58412 -57988 -75082 -33304 -10227 -10965 69935 89886 67243 -21191
10051 -21191 -37104 50509 92313 -58771 -156562 -119244 -71022 14576 35236 -48086 -103685
10040 -103685 -6217 45493 65846 12580 4171 -30417 -53078 -55004 35543 59011 99665 102416
10028 102416 3637 -532 102821 36196 48182 88976 41628 -35185 56627 148448 84704
10017 84704 -2930 -61477 -54249 -4190 3126 -13848 -159275 -248315 -252446 -173214 -82139 -119141
10005 -119141 -146668 -171354 -100099 -16138 -23582 -27492 -2020 47950 62970 3301 -149446 -188280
9993 -188280 -69715 -41529 -2981 86322 142411 159379 172920 118125 -26506 -36549 47726
9982 47726 52375 -50380 -56679 -5300 -7965 102615 167859 158263 29511 -41953 15324 50877
9970 50877 12101 15587 -7514 -22949 -69270 -86231 -68789 -24578 29637 99226 30917 -40236
9958 -40236 10319 121398 192393 124781 -10996 -5966 -20197 -15436 1771 -7406 49243 27307
9946 27307 62955 72383 -5185 -69251 -75561 -44614 -5051 -3274 -7912 -6829 10988 29702 11156
9933 11156 63497 59696 28351 19288 20496 82036 76762 -25666 -105476 -31163 2693 34398
9921 34398 -77495 -186071 -109772 -90648 -10682 -20779 8221 -16336 -122631 -70879 -56502
9910 -56502 -51216 -39584 -39967 -70218 -85006 -31080 49341 -12903 -93443 -73246 -53555 -8612
9898 -8612 46948 39551 -38946 40803 101889 182875 128009 75608 76972 27290 -30072 -38726 -31808
9885 -31808 -11887 33336 5772 -102532 -166625 -47838 23930 23089 12485 73359 87570 55414
9873 55414 31782 62782 147569 140851 85369 -18313 -66954 4505 23083 73906 140391 76125
9861 76125 63023 -6927 -48078 -50008 -16684 -16685 27536 74830 79283 123037 124486 149096 274215
9848 274215 471389 639287 678395 593708 524874 432155 280458 272950 219700 181355 139340
9837 139340 134358 97305 85211 67327 72137 204798 213336 101867 84230 91402 43209 -29513
9825 -29513 -53481 -43521 8584 -6380 65697 127528 139590 37591 65487 94406 42965 -7329
9813 -7329 -18053 -44159 -30406 -2186 50645 93021 2959 -75472 -140286 -94498 -78605 -72955
9801 -72955 -67254 -27160 -9937 -10076 13967 -48613 -129458 -115028 -18801 15677 74734 73826 -3327
9788 -3327 -70006 -85460 11798 116064 72467 35659 29557 1002 10882 28946 7546 1552
9776 1552 71530 4790 -37043 -56000 -57901 65448 54370 -32624 -6337 26797 38697 32728
9764 32728 38528 -25748 -145438 -138579 -155195 -187819 -213443 -181860 -89325 -113976 -68727 44143
9752 44143 79825 48780 -14669 55484 17439 -14813 -37132 -88567 -78001 -42632 -79255 -62427
9740 -62427 -31548 -24995 32875 84811 39717 -757 -93106 -101745 -56062 -40827 -42276 21151
9728 21151 50284 35200 -46174 -126802 -134266 -106103 -54799 -8306 -64216 -44589 7850 44248
9716 44248 8083 14186 6101 -17142 -78908 -125886 -116020 -104884 -34960 -45755 -65238 -26812
9704 -26812 -37505 -60040 43369 147481 107739 51814 77916 39286 19292 -2758 -49964
9693 -49964 -118583 -49391 -41008 -117185 -121036 -35051 23399 145439 155175 59249 78971 126621
9681 126621 234015 221869 164363 155 -8448 30415 53298 126763 107043 77525 26318
9670 26318 -52680 34074 54536 48313 82179 89802 144498 76645 47821 30315 57777 -33885
9658 -33885 -128255 -109916 -63145 -108880 -97110 -53053 -3727 17087 -52047 -109765 -173185 -126978
9646 -126978 665 112134 133101 77013 92051 109308 98076 94821 1803 3118 44493 69577
9634 69577 105826 49313 10202 84600 84113 124709 148148 163009 101988 38560 79356 80570
9622 80570 108060 46411 106932 82533 31671 13636 4000 -21886 8336 60122 81926 47361
9610 47361 -83620 -187948 -185656 -78062 40779 114942 161190 87042 -8280 -127816 -78531
9599 -78531 -26790 -48697 -76180 -59697 -79912 -102831 -89086 -96047 -33218 -1523 -44768 -34323
9587 -34323 51209 128102 162483 74618 -82111 -150109 -121002 -90203 -18752 11089 53469 71556
9575 71556 89016 34858 -41956 -76863 -91291 -75535 -3276 73566 179762 197712 180567 147543
9563 147543 146556 112887 81792 104229 93933 27359 31702 57813 75863 70485 55362 5522
9551 5522 -30474 -18325 -30014 -37462 79379 170694 138016 76229 9079 -88739 -97172 14027
9539 14027 71846 65158 -18268 42058 104425 97895 103387 85063 144908 173121 201902 126851
9527 126851 86188 3481 -63831 -11460 81859 65758 -45556 -44873 -5749 62105 91137 -16586
9515 -16586 -73693 -23643 11725 -16236 21258 49379 -14607 -85883 -41741 -17563 -49038 -26960
9503 -26960 46522 -1212 -7687 41584 46749 50776 81296 12060 56617 178390 186359 177233 149688
9490 149688 56658 63896 133488 103743 102777 143677 134807 118735 114767 86566 144561 104835 56558
9477 56558 41029 143121 101110 6559 -84792 -49698 -23600 -81799 -47092 74529 117930
9466 117930 91386 137083 153425 94313 66642 46661 -35799 -58611 -17058 -37386 -41259 43465
9454 43465 107177 128342 223246 155641 47976 -74565 -37481 -1248 24197 -16835 -57537
9443 -57537 -31856 -7776 15653 65824 90950 25695 -38954 56104 87097 60304 7921 5545
9431 5545 62322 107215 34541 -16388 42240 85089 70122 96669 85660 -56949 -175575 -208237
9419 -208237 -142396 -81222 -15595 40984 11839 7535 55893 114366 154630 131291 90428 93847
9407 93847 84546 142458 145318 88096 148814 146245 161994 166082 153658 168261 173656 211567 159274
9394 159274 62846 -7248 6274 30861 89711 78741 22184 43286 90284 122883 132130 162283
9382 162283 158035 170333 83286 174302 222583 135675 72553 67690 128885 191628 183384 145714
9370 145714 78990 64436 -17210 8128 68495 56434 63178 80034 142901 68391 21749 10021
9358 10021 -24944 -4297 22565 96534 231941 237657 211792 159457 18395 -60054 31135 39875
9346 39875 -14700 -45169 44581 51694 186098 249202 233393 205195 278753 306372 212608 130068
9334 130068 168970 252772 257622 186085 218121 218462 177109 166523 199531 223499 121341 43247
9322 43247 1037 59892 137131 132028 192525 147602 152797 160105 194457 105531 114654 187272 155526
9309 155526 211637 257770 302070 357175 279240 289452 338811 224946 168355 186210 101953
9298 101953 139295 289498 343191 274775 221370 247473 296276 341756 350567 326107 400654 427267
9286 427267 419747 422192 423474 351657 355470 365136 362133 382750 433218 459162 384169 369308 419248
9273 419248 423299 350596 388329 400983 455496 409045 367577 499857 463676 441380 455392 485216
9261 485216 505766 438201 384185 421780 525239 550758 523180 538164 564930 590608 544697
9250 544697 557528 601645 671113 596467 542071 468688 406079 496059 658387 749475 819943
9239 819943 870269 899447 870198 784547 775221 785368 794750 895540 837275 818697 862830 970394
9227 970394 977845 901506 934998 1014149 1106379 1121223 1133198 1079555 1083834 1254858 1414983 1501657
9215 1501657 1498914 1506360 1554921 1596294 1566478 1568565 1617127 1726527 1864644 1872086 1842906 1885383
9203 1885383 1932129 2014479 2065602 2118774 2181519 2160888 2225674 2337421 2359846 2465957 2526577
9192 2526577 2621045 2713542 2776666 2780307 2826085 2858119 2919184 3016548 3133356 3158708 3069971
9181 3069971 3027493 3082072 3230359 3315808 3315532 3285808 3239045 3249684 3283998 3270396 3254254 3319957
9169 3319957 3325065 3258365 3261979 3180760 3091427 2956742 2893887 2799631 2750357 2793574 2817028 2783035
9157 2783035 2731604 2748210 2620563 2466381 2503539 2490026 2436579 2426286 2344442 2333234 2241518
9146 2241518 2173632 2099432 2019095 1885777 1827268 1727013 1693645 1720405 1696463 1726000 1766248
9135 1766248 1832173 1849055 1799215 1702318 1593827 1457532 1339260 1303943 1383596 1391876 1375940
9124 1375940 1421438 1358493 1282208 1351456 1290645 1182869 1159822 1112809 1063078 1059553 1064798 1077967
9112 1077967 1123559 1069072 942651 863279 856291 862475 882275 805332 832772 898480 918445 848882
9100 848882 775967 834759 807593 790149 836226 739917 656332 706043 728375 734927 779908 750406
9088 750406 742816 736992 674088 608080 614026 619286 602083 569431 594838 504877 429511 496034
9076 496034 509077 610998 609117 579129 609933 632710 607968 464704 434371 390623 448652
9065 448652 502973 498272 503751 556640 546695 564377 530828 439812 410229 423775 378726 376386
9053 376386 399930 446531 387168 349256 299851 279517 349346 518450 467506 354260 330127
9042 330127 309145 255241 216279 295253 318875 272160 272029 242708 289977 341465 337120 339911
9030 339911 298857 230461 158219 197407 129607 113156 109418 32889 73488 191591 278472 207134
9018 207134 178419 179019 225441 276395 236815 164547 208318 265353 242098 268961 334819 343643
9006 343643 271514 194594 216018 173060 221120 252872 271392 326579 325078 296277 252854 322786
8994 322786 289806 233698 264231 266095 294850 300269 261936 233928 231631 185178 217870 152341
8982 152341 111892 41840 43203 62214 113617 144898 19282 37287 129106 174972 194164 221263
8970 221263 262750 343647 312818 264931 213517 110401 31400 29845 49057 73887 157242 194901
8958 194901 191196 62687 -27057 73179 163968 176390 124011 41203 33822 35767 131225 102323
8946 102323 59653 79721 116599 167537 241011 213109 175997 100431 38339 65441 68361 53063
8934 53063 53381 2376 -24826 29760 45284 56190 147544 150883 136127 105007 60793 63047 101671
8921 101671 177788 190145 70260 5194 37801 63389 94137 122824 150926 222972 224196 125463
8909 125463 -28522 -120652 -112817 -140796 -176860 -186946 -87649 41185 45109 86606 110219 68847
8897 68847 -4394 15695 -1858 1984 -48579 -71578 -41344 -24234 -53179 40964 64956 104916
8885 104916 159552 231238 205993 184800 35477 21543 21510 19208 53617 64629 111450 200509
8873 200509 149030 33483 18694 71992 46350 6471 58670 74637 68103 75471 97323 188608
8861 188608 229896 174909 156082 143277 132778 60067 -13641 21451 22503 86233 58516 27747
8849 27747 60204 159510 130516 148098 189820 177416 128635 174988 73684 21679 -21786 15361
8837 15361 81497 101692 134297 101341 8429 8965 58946 44763 49833 151858 212686 128080
8825 128080 50423 20587 57676 62330 141278 165083 124127 128248 117692 19502 -18867 15245
8813 15245 45570 35462 -26244 -45901 -74491 -141634 -125278 15048 108911 71902 -18014 -11556
8801 -11556 57266 105650 55703 46220 11387 -47191 -57015 -870 -9826 33178 38801 29581 45117
8788 45117 -62029 -134420 -184846 -104519 7790 -19367 -9190 6230 12253 -8675 -7124 48787
8776 48787 65117 -18257 -46843 -80797 -98225 -83935 -52889 4820 -10422 -133162 -56514 -30994
8764 -30994 -45665 -6367 47229 80118 13432 52140 9422 -13560 43547 71392 168406 206452
8752 206452 128861 113680 126232 65901 61623 60674 63507 -7401 -15288 115689 130595 105837
8740 105837 51471 -68817 -59179 -88138 -47420 77290 179730 112123 51354 -10533 21319
8729 21319 79698 119566 60610 19439 16208 107101 133341 148526 226524 213815 90517 115643
8717 115643 164702 107110 101383 6589 4757 -119 -2102 15682 65822 110115 57682 -28760
8705 -28760 -98745 -112573 -106971 -69479 -113305 -127903 -18728 15587 20836 30442 20287 -46960
8693 -46960 48544 83725 101160 47433 61265 91496 36649 -14560 -36134 -83020 -26097 7657
8681 7657 -4856 -31698 106 -11676 -42477 -13079 66829 93156 139086 96029 57357 64569
8669 64569 -23842 -34688 -26762 -41976 -12270 -64643 -186031 -106636 23873 112023 72977 73676
8657 73676 10695 21895 45173 -16240 -135400 -133535 -41387 -12446 -34389 35494 124178 159647
8645 159647 155168 129053 102789 46099 71685 55082 80081 77416 -6956 -35962 36864 61424
8633 61424 37406 41044 13686 21355 -2087 -12044 63572 260954 322855 272009 215637 205294
8621 205294 223477 173803 199726 187675 179773 143695 145287 180530 204608 206891 167420 117820
8609 117820 57587 107664 143160 216254 301845 326685 384482 425039 398277 358765 465350
8598 465350 430425 355275 269547 260817 272158 268405 240501 152953 103888 78360 60847 87487
8586 87487 49020 -24776 2657 55506 5298 162492 209407 177205 216818 175344 21181
8575 21181 44284 59908 93809 119050 95822 72934 117355 122553 145332 133949 53641 42922
8563 42922 108096 116493 117105 94495 92648 138460 119477 81979 104657 104286 43223 54572 55716
8550 55716 1968 23880 60611 11292 17321 92034 170243 186543 120247 37053 -9224 -97240
8538 -97240 -56818 15368 56621 51166 23468 3600 4623 63133 131275 134631 151717 151213 131850
8525 131850 190498 199585 137197 147473 182747 150829 104560 110699 60870 51781 66172 92677
8513 92677 137675 73259 24058 -24236 -51968 -112872 -67517 -42476 -26614 813 -5591 37027
8501 37027 8410 -35187 30510 -6926 -85284 -93360 -46997 1871 56401 97890 120415 57570
8489 57570 76153 96419 34855 -54807 -55744 -36098 -6763 -55662 -48102 20974 19053 31179 5949
8476 5949 -105482 -6021 17491 51425 8681 -21325 -53252 -31568 71054 53182 70677 65337
8464 65337 51244 -64471 -55487 8548 77087 142793 146844 116297 153603 111784 107974 129165
8452 129165 150965 35999 -6120 7459 -6393 23623 50003 52311 89744 135316 87917 49516
8440 49516 -67910 -13342 103319 44630 48602 25278 -4772 11435 -32848 -46834 -14556 49752
8428 49752 31235 27245 46708 -29192 -89730 -40712 -20039 46412 95865 -7742 -37582 11277
8416 11277 70766 51603 52550 28960 4110 862 18996 82366 141516 185745 120101 11529
8404 11529 -2715 25386 11385 -45435 10999 137923 152924 59073 -710 -81432 -78869 -50193
8392 -50193 24269 101899 90551 31356 -26992 -54869 -65295 10047 115108 91983 6710 -35203
8380 -35203 -24322 -42395 -47180 -27102 -3572 65480 152044 115279 6449 -61580 -53376 -42565
8368 -42565 -19551 -28902 -78335 -92263 -98184 -81713 -106173 -39970 47941 21798 -28631 -121851
8356 -121851 -117375 114833 196266 101334 -68233 -70717 32114 101303 42755 -34471 4309
8345 4309 70435 86881 89510 15838 -29366 -28612 -1648 -17835 -88088 5504 76336 -10293 -35730
8332 -35730 -3510 28832 99377 123713 115010 28961 -1014 31170 -5418 43304 87889 81570
8320 81570 49452 33064 -22133 -62845 10789 -24191 -68283 -22879 -43363 -29013 -61643 57582
8308 57582 72250 -555 -49840 292 -36327 -110303 -95836 -168148 -254068 -166249 -82497 4666
8296 4666 87252 105582 70253 -34012 -115556 -53500 -26389 -107058 -118138 -101997 -106304 -147081
8284 -147081 -127943 -36410 -33560 -115986 -188698 -167815 -130601 -65139 -95593 -11473 38734 -41732
8272 -41732 -65921 -58072 -83255 -17808 61555 40350 62964 106035 98488 120548 143869 168106
8260 168106 222404 161174 88744 128067 151127 171110 184503 208695 218938 118790 21920
8249 21920 38090 45925 -605 24221 73749 108733 75624 52255 106507 179524 230786 195956
8237 195956 93167 111672 137756 105011 129773 145432 149679 3381 -85024 -51615 -44758 -67
8225 -67 -48719 -124950 -185712 -122387 -90698 -35943 5955 18496 2861 -60833 -64316 -91932 -61818
8212 -61818 55503 128112 72145 10897 -8441 31291 29038 2959 8639 -42295 84123 149093
8200 149093 199229 225484 159717 46232 -5611 485 20982 -28018 6300 -88207 -122685 -112970
8188 -112970 -151630 -176811 -165281 -185804 -136299 -103401 -22065 13236 24314 -33319 -78882 -78051
8176 -78051 -130409 -171624 -144787 -224765 -197091 -179337 -185681 -141548 -116173 -118055 -130491 -105402
8164 -105402 -76246 -29262 -79101 -17483 36878 -17323 -45324 -64489 -62827 -37026 -34707 -106655
8152 -106655 -53522 -11142 -26057 -7655 -26637 -94182 38893 82193 91930 52623 389 10536
8140 10536 -51273 -59857 -96693 -58344 -10693 -96357 -102081 -70765 -167623 -126290 19251 5769
8128 5769 -129716 -196020 -103792 -56754 -109239 -75738 -57024 -53685 -53788 -28974 68995 23246
8116 23246 73122 151061 52819 3805 -100158 -189782 -204508 -139766 -69864 28335 139735
8105 139735 240796 194912 101524 122638 121730 40684 67277 17417 -12090 -15808 -87408 -7974
8093 -7974 -6902 -100399 -148099 -137282 -148255 -127308 -82274 8252 61688 44307 32969 74860
8081 74860 84386 83941 90304 -598 -7448 6016 2643 36866 91486 104899 40458 1086 68914
8068 68914 57999 95097 112467 26838 -74889 -180467 -104058 12737 -28419 -151474 -137560
8057 -137560 -81303 43022 83960 -27290 -44970 6175 19407 12588 8509 8232 -46631 -34756
8045 -34756 48886 85930 43845 3736 -7517 11828 83089 68992 117675 157727 198934 131875
8033 131875 65253 70875 40238 -27211 66543 58267 43484 141850 172297 114782 97406 187199
8021 187199 138420 103444 178993 116262 114893 130855 168326 178469 95475 139881 138094 126053
8009 126053 81155 26707 11837 56690 107041 170972 221111 208682 164955 180329 206139 154787
7997 154787 192380 133024 48765 158144 148429 89937 112890 158044 112382 103644 150727 105150
7985 105150 68613 47003 91542 132968 150698 86065 1432 -69100 -31207 14029 -7465 98556
7973 98556 110382 157430 218671 106273 118100 139674 212250 239907 157258 68820 129094 142121
7961 142121 84133 93824 193040 179692 41381 -32424 -17299 4470 47014 66881 69510 42005
7949 42005 65990 161023 214971 196398 195522 157908 109727 62733 101718 180471 173317 144821
7937 144821 101902 47287 -6355 -95981 -57363 -43365 -64655 -68278 -70617 17613 105577 136572
7925 136572 47824 -28924 -43394 -6991 -3957 -6393 -63996 -69405 442 62513 107195 191605
7913 191605 155162 156929 126830 94813 56520 87799 91424 84578 133545 80011 20749 -41551
7901 -41551 -53380 -64559 -38885 -18424 -28549 29846 38293 42599 38226 95417 125989 66187
7889 66187 -37276 -125060 -91852 -1678 36912 -34058 -33996 -57053 -23738 20427 76151 85751
7877 85751 30381 64942 21662 -84483 -108444 -26715 -4805 -36802 -60416 -91257 -83848 -132578
7865 -132578 -108218 -12780 -20216 -101051 -91917 -50267 16785 22319 70945 10474 20910 140653
7853 140653 139031 186511 125976 -7651 15288 5 3333 -12279 -8213 45138 37970 35354
7841 35354 83280 -41362 -92994 -116210 -79063 -41576 40015 27820 -68558 -90200 -72047 -51560
7829 -51560 -40087 -39686 -130212 -69710 -84961 -169303 -131470 -50123 48911 145781 50245 -2478
7817 -2478 29377 12321 -3342 16343 20487 -39888 -119292 -29913 25428 40127 -30143 -51375
7805 -51375 -34850 -33757 -23888 -63155 25948 15323 -35915 -12793 -4847 1605 -72077 -119167 -110781
7792 -110781 -137512 -99999 -77287 -139878 -128965 -49672 -59594 -130293 -173027 -165425 -168544 -153533
7780 -153533 -35095 -49898 -84641 -130591 -125460 -116724 -142715 -69743 22256 -10474 -67305 -64133
7768 -64133 -59346 -63923 -22407 -86995 -174644 -144501 -124405 -99606 -45225 -42417 -36457 63471 79355
7755 79355 32968 6717 -29814 20531 63414 4188 -8489 2336 -26712 -15243 16894 88707
7743 88707 94221 110316 63000 99395 77569 2974 -49925 -42192 -55645 -110960 -35840 27663
7731 27663 -5449 -19268 -3756 10703 -56792 -80038 -60422 8200 -4702 -21827 9905 84649
7719 84649 40601 -5958 52865 58901 12548 28920 46780 81599 69090 51992 108010 37096
7707 37096 -35277 11504 -18783 -101943 -94366 -115324 -77660 38335 91013 21062 -25477 -88934
7695 -88934 -112665 -77958 -132956 -164638 -105768 -127049 -198784 -243966 -197771 -110367 -63575 -5340
7683 -5340 14510 3742 122831 146289 -980 -76794 -112343 -105240 -90078 -101647 -95044 -42407
7671 -42407 -17964 -42621 35267 128414 94993 14018 -62928 -92350 -97036 -131521 -140366 -78039
7659 -78039 -126442 -113350 -44815 -31768 -116411 -101287 -47088 -30303 -113658 -229661 -274722 -249352
7647 -249352 -150040 -41413 -49556 -56767 -10642 10495 31110 -50361 -13104 -8790 -84003 -148262
7635 -148262 -189415 -203587 -202726 -92835 -16651 9229 72800 15434 39405 49548 -1114 -35151
7623 -35151 -63994 -47545 -25447 -51477 -21144 40115 14727 23371 77682 85612 -13555 -15579
7611 -15579 53660 52450 89333 76744 202517 234233 109437 8277 20880 54751 -8909
7600 -8909 57809 85303 119407 155933 81223 -61086 -48971 -11931 -61354 -28762 4937 -27126
7588 -27126 -69599 -27444 -31514 11248 42138 -29705 -21338 -67139 -93144 -31317 72850 31697
7576 31697 27894 -16358 14076 109677 85067 34228 36917 -27275 38025 82730 46680 69944
7564 69944 23930 -54071 -67353 -87565 -120465 -37966 -25911 -32040 -41408 -77997 -17652 11292
7552 11292 101821 166517 87754 24038 23428 -47432 -56417 -62586 -60271 -28103 -53277 -38512 -36839
7539 -36839 -75071 -6580 63773 86176 98179 96183 63753 46784 -2001 2584 -10712 -72279
7527 -72279 -85217 -103198 -117884 -32110 -16859 -98147 -69960 -47662 -20358 8042 22233 35278
7515 35278 4593 33095 13892 22261 -9230 27958 -32428 -44175 -64781 -23644 29908 -31682
7503 -31682 -182 26148 27665 -60744 -79673 -69659 -76347 -11596 80652 54005 24245 27404
7491 27404 62910 58971 -4051 -54272 -1056 53590 38205 -64781 -59210 -45297 17412 36975
7479 36975 -3110 -35598 46579 107348 87328 45724 37715 78138 28825 57981 75193 46399
7467 46399 21196 -57316 -136132 -128265 -92159 -50483 -24912 67833 49051 -33875 -40032 -63777
7455 -63777 -47160 -20535 25983 57270 40539 823 -4034 61232 34527 100247 155905 166792
7443 166792 168121 214293 204889 166371 90843 66450 37329 -17141 -82791 -89611 -93127 -11368
7431 -11368 -41936 -57843 -30973 -29929 -75457 -53497 -46613 -129888 -153230 -95375 -68017 -107256
7419 -107256 -130275 -36176 -30973 10616 32874 20416 -9585 -113176 -61328 8004 16072 23297
7407 23297 -15339 -33115 19049 8338 8370 82377 66182 6122 2511 -63263 -77929 -39807 28145
7394 28145 39847 24577 8366 19399 -14770 46765 60948 7333 -23993 -88179 -69591 -82566
7382 -82566 -114025 -154003 -164277 -89936 -36826 -44288 -2184 45825 38230 -16617 -75062 -103191
7370 -103191 -93330 7606 -6093 -43970 -55290 9943 -15471 -79744 -141352 -147695 -107544 -67644
7358 -67644 -77075 -84206 -54156 -66269 -28245 -38816 -54402 -62941 -124171 -99139 -6778 47431
7346 47431 -2652 1811 -49539 -153301 -114403 -59351 22501 48484 -22802 -48746 -13022 -2
7334 -2 41474 27331 79917 124801 120841 23104 -50872 -9535 19327 2765 36807 50767 -21105
7321 -21105 31259 23615 -38688 28836 141630 101179 14584 1235 -39255 -34516 -41284 -83857
7309 -83857 -44588 -13127 -66313 27538 50517 28208 34282 27837 -2486 -22235 -53300 -59942
7297 -59942 -17098 42073 -54268 -95090 -92590 -79868 -88527 -53599 -26441 -61457 -33131 65639
7285 65639 141809 74244 2015 -11061 -33191 24612 76929 35272 1728 23652 48051 16946
7273 16946 -45872 -88454 -81119 -89971 -111059 -58894 9564 53531 65505 77933 54317 46351
7261 46351 -43569 -51558 -28573 -29579 -119832 -108071 -56567 -75231 -45343 -61264 -77429 -59322
7249 -59322 -24526 -2814 34285 45681 7914 -2694 -39590 -90936 -130089 -105011 -98374 209
7237 209 15641 -80145 -61035 -29648 -53002 -33975 4746 -84742 -143636 -58328 33759 -51464
7225 -51464 -140853 -165698 -119917 -124643 -97682 -34025 64957 87821 22785 -21028 -65969 -66545
7213 -66545 -22768 40034 98430 3120 -45894 -40114 -76404 -33030 -3407 -21651 21537 12285
7201 12285 -26111 -88105 -130987 -87516 44696 84294 37345 44217 64994 47447 46711 22170
7189 22170 -50862 -79656 -76775 -39452 -51238 -128263 -148432 -192695 -251884 -193388 -83461 52340
7177 52340 114589 41905 -51994 -101525 -64308 -73962 -107618 -77770 -54885 -79066 -126798 -69306
7165 -69306 -18872 -82676 -120652 -97660 -120653 -35549 -8245 -32372 -77165 -84239 14939 65005
7153 65005 35961 41894 45164 30520 179534 178660 43721 73444 180636 187738 131449 119223
7141 119223 17588 -94519 -5227 15232 70925 120262 19669 -58722 -11089 42740 112631
7130 112631 88881 -32413 -63146 -70907 -65576 32386 -46955 -65820 32083 -16287 -95870 -78072
7118 -78072 -123119 -100815 -8453 38654 -23083 -90171 -97717 -90083 -55207 -38743 -73913 -74129 -39160
7105 -39160 -25573 24762 94006 33227 -11111 -38024 -5589 9065 -53931 -41788 53756 65595
7093 65595 -33398 -122909 -444 88754 87618 130165 132833 120908 94927 90690 51730 17396
7081 17396 -4720 83571 44380 50699 75503 -50519 -101634 -40089 78640 131465 163185 192586
7069 192586 107784 36027 36933 25128 -21192 -65639 -101640 -74471 -50645 -107523 -110642 -77543
7057 -77543 -59368 -33812 -55216 -39918 73014 98107 104661 156836 203268 59813 -13929 63453
7045 63453 127770 95138 13394 -2773 -3741 15285 114204 98312 57283 51680 62164 68981 14571
7032 14571 -40697 621 82625 56890 45396 58459 37139 -49139 -23010 -53073 -83636 -46978
7020 -46978 -6699 -43770 -68667 -22486 -25308 -19361 -17224 16204 109374 211970 176416 121030
7008 121030 54096 9255 145965 117383 24610 90687 140352 145844 117206 120008 91684 44952
6996 44952 97641 144946 95374 -1565 -13491 42670 38493 -9715 -31715 15558 5030 -18818
6984 -18818 -24437 -1152 75828 123521 146079 59445 27140 101877 123475 101377 88174 38716
6972 38716 11388 -13442 7861 19851 44111 8351 -93251 -176846 -148527 -119342 -135243 -77781
6960 -77781 2115 40442 61021 55769 49378 33721 95843 114053 37098 24689 48157 -5881
6948 -5881 -71688 52985 34561 -13058 55173 100918 57783 -36193 6090 21421 -37009 -17071
6936 -17071 48092 63258 16879 -33627 18356 42440 90427 89174 40288 681 -20865 -42418
6924 -42418 -5794 10972 3063 60083 115348 105963 127378 70115 8176 -92963 -36294 85735
6912 85735 68531 -17569 -129724 -113814 42331 84846 51287 38124 57444 65595 86076 24891
6900 24891 -18837 -44962 -747 -64836 -113419 -59242 1547 -1470 -86506 -41810 -771 -9599
6888 -9599 33174 101163 119896 97640 106633 79213 154277 161972 122135 54464 23783 -31265
6876 -31265 -21155 130420 173851 14440 -138442 -177321 -277475 -262017 -174932 -59489 -17461
6865 -17461 -28221 -119149 -201547 -140711 -57041 -2322 18326 31578 70736 58076 23905 54668
6853 54668 46936 125322 64537 -19126 -53461 -45552 -16835 -51177 -83922 -106897 -93812 -105850
6841 -105850 -127260 -143638 -36060 -21054 -44990 -37450 28510 118493 167370 79326 43528 35884
6829 35884 3497 27907 56217 90732 83786 110481 128118 115998 34651 -62591 -138399 -156905
6817 -156905 -125987 -24314 14994 -301 -35487 -4837 36742 48445 64381 55482 -44238 -17291
6805 -17291 19567 76284 114760 131827 57810 50630 9475 3790 47044 75444 30326 -42459
6793 -42459 29942 28379 29681 56838 100795 46418 -49951 -101873 -142575 -59379 -46102 -27620
6781 -27620 -30963 -9407 -46056 -29809 -28671 -24410 45005 75761 66212 9209 -38937 24514 103052
6768 103052 113341 142536 104407 116916 54001 43720 28890 -64622 -31287 2748 4733 37024
6756 37024 50642 64441 6898 -98403 -203434 -183720 -136058 -90544 -40205 8709 2316 -122840
6744 -122840 -168870 -166456 -123446 -40182 29956 28231 -49302 -41999 34262 24517 79817 65438
6732 65438 118877 102015 82687 68899 89379 79596 4118 -27852 -72545 -107660 -91951 -58901
6720 -58901 -32896 5220 58964 75747 38095 32951 21899 28215 3991 -116061 -75454 -128761
6708 -128761 -107440 -19767 10516 -53308 -50954 -88865 34616 22446 -27409 -4478 25249 19410
6696 19410 51459 18862 -13877 -117283 -108321 -78430 -128128 -143196 -100255 -81627 -138501 -178887
6684 -178887 -117272 -22465 -36678 -45054 -65410 -122677 -130492 -122235 -58794 48633 24043 -41647
6672 -41647 -5900 125187 122215 107458 73005 -4273 -82686 -89847 23634 71872 81318 83285
6660 83285 81273 47529 6366 -44357 -75371 -48868 -54044 -19593 -31092 -55034 -89038 -118916
6648 -118916 -111082 -135013 -111405 36098 55435 53378 108609 -31220 -199432 -243054 -104353
6637 -104353 -9471 16217 -39869 -61133 24562 42566 23994 47272 -11770 -35086 -22425 -102049
6625 -102049 -50444 -27971 -89326 -98085 -51367 -32982 -59863 -51179 19289 44472 -56579 -93510
6613 -93510 -79480 -37032 62561 100307 38637 -84009 -101325 -108505 -98434 -8382 22043 -12018
6601 -12018 -3675 -56532 -78791 -39112 -47496 -14377 22157 25415 -52760 -96250 1960 25723
6589 25723 -57779 -85090 -133995 -144641 -133770 -162666 -164275 -104668 -44120 62277 68288 -15385
6577 -15385 -126433 -119401 -43514 28493 18174 -4679 -34606 35415 34597 -15108 16735 25837
6565 25837 -51720 -53942 39921 103447 -4813 -45090 -47287 -28343 -86410 -73129 -71637 6684
6553 6684 23667 -15199 -95190 -125862 -116677 -140587 -137104 -92393 -123466 -53305 77678 37282
6541 37282 136802 164143 66038 -42924 -37970 13453 -27124 -44145 -49794 -129721 -106865 -119131
6529 -119131 -123673 -89868 -37946 -3546 -35558 -56973 -86436 -67755 -81372 -138869 -235489 -344170
6517 -344170 -244245 -105613 -85646 -102587 9167 72536 42165 2032 2839 31516 48601 61772
6505 61772 135911 114153 6369 59748 93234 6870 -76371 -109705 6198 27690 -48436
6494 -48436 -15021 -26757 24873 10703 -13844 -64434 -67330 -68580 -69795 -45280 -18305 32555
6482 32555 38496 60689 59830 -11530 -46555 -37497 -42115 25506 60482 11243 -94357 -127615 -77002
6469 -77002 -47156 24330 69155 66983 81261 93361 165795 220787 126366 -9009 -25647 3647
6457 3647 -53426 -97227 -96485 -57297 26695 40672 894 31258 50931 9795 -51604 -124195
6445 -124195 -113836 12315 37942 18122 -73665 -66169 -76418 -145564 -214021 -312368 -251459 -175001
6433 -175001 -113729 -106382 -3339 16631 -48753 -55625 103927 68951 13171 -65960 -62861 -83699
6421 -83699 -73037 -23529 -129882 -136982 -185725 -200137 -230357 -182109 -155537 -100868 -38566 -72884
6409 -72884 -75284 -17903 -15033 -30982 22239 41902 -152 -24709 -44680 1523 26340 49370
6397 49370 19776 -2431 -5392 -87885 -122287 -43943 32806 6327 -829 18085 76069 115574
6385 115574 28078 97164 99124 74063 2094 -22475 45417 35145 34576 10552 59264 34299
6373 34299 -39522 -16003 2792 3882 -48694 -6365 70483 115286 50464 16474 -11622 -46852
6361 -46852 -24954 52599 -43965 -25475 79707 99900 120716 194233 168859 122575 44236 -28243
6349 -28243 -50204 -31717 38249 84520 96064 11315 -101938 -91803 -34949 -24944 -28635 -18030
6337 -18030 71236 78501 50477 54405 33454 -25306 -38124 81309 49095 69989 139189 180904
6325 180904 120544 138885 199991 178667 128226 137994 170474 66187 -75253 -78141 13341 96389
6313 96389 8113 17681 22028 -40480 -23926 88576 87691 157798 184883 108072 31463 -111357
6301 -111357 -208521 -153412 -33932 -1437 20123 92841 76211 55273 76719 11584 21990
6290 21990 -40679 -81406 -69900 -31559 35361 26450 28782 49406 60901 63113 92032 144307
6278 144307 148356 153511 1221 -148997 -222998 -151427 -97674 -71517 -100398 -96037 -138460 -86869
6266 -86869 -127837 -175010 -222756 -257043 -244903 -116743 -17795 2371 62712 56676 151413 237932
6254 237932 220332 157356 60711 48459 38889 22149 13717 2130 20301 30641 32632 42422
6242 42422 6108 -21343 -48832 -51479 -21546 61278 139398 168139 156937 95532 93539 156575
6230 156575 212507 146435 127644 120810 46683 41246 -25124 -54209 -59790 -57183 -50259 -28233 -133819
6217 -133819 -208966 -142109 16941 26858 -5569 1995 54793 77600 -4318 -53024 -52601 35328
6205 35328 73463 88386 65216 -35224 -127204 -66106 -79694 -49775 -40169 14423 -20376 -23877
6193 -23877 -23265 4545 45376 -41245 -28295 -34088 -82352 -98698 -38544 27326 47736 -25562
6181 -25562 -145375 -162569 -56865 79975 106731 99568 64894 39687 24000 -6221 -33233
6170 -33233 1436 -17613 -66909 -66554 -17450 51833 59972 -36852 -103765 -66556 -48999 -36631
6158 -36631 -23303 62834 96422 126467 56252 -16391 -47720 -157018 -104168 3232 -66805
6147 -66805 -58043 25190 -1296 22050 16671 -24711 -36791 52231 84980 86332 78910 37341 -7513
6134 -7513 -94805 -61362 -55621 -50244 -19925 -6178 6243 60029 57944 3485 -22810 -23595 22263
6121 22263 -17950 10363 52411 6266 -35457 46338 131865 51333 46574 37131 -20339 -48186
6109 -48186 -27691 3350 -1146 -3875 -35248 -49734 -7559 -47894 -142723 -132947 -49322 -83073
6097 -83073 -96507 -99470 -37422 33643 -4287 -69333 -21368 74185 33333 64796 124624 171747
6085 171747 106375 73171 -39641 -52335 -21571 -88780 -173615 -229939 -193517 -113058 -113323 -115161
6073 -115161 -54710 -97162 -125496 -128920 -81235 -27414 61046 -32304 -58549 181 42810 -11330
6061 -11330 -86416 -42665 67523 93482 40637 26879 64361 -53904 -108829 -25231 104884
6050 104884 47120 -62663 -72939 -28571 -766 -17483 34154 -5170 -21602 -7496 3944
6039 3944 99117 85937 56102 56545 71303 -9289 -92443 -92423 -118762 -136245 -145292 -107540 -137673
6026 -137673 -63506 -15667 -63714 -54599 -95860 -147519 -101754 -36177 30327 53723 51060 15360
6014 15360 26687 95334 157778 88676 10184 26413 16542 -4203 -67454 -105113 -192943 -198566
6002 -198566 -127475 -15258 18360 49990 47657 69947 106754 167332 69078 -3735 -6851 8919
5990 8919 -38571 -74700 -149834 -153071 14167 13352 -48532 -55389 -33865 18553 60640 87851 45981
5977 45981 18534 12393 -6130 -44553 -130841 -78648 -62315 -39944 -27215 -14057 -26261 -46247
5965 -46247 -40087 -49692 -78675 -85167 -104253 -6257 29343 32281 57099 10565 13332 74759 83856
5952 83856 95638 99495 106657 76659 -38023 -103759 -84124 -76788 -18432 58402 71425 104721
5940 104721 85472 -5983 -44004 -10765 -78961 -62275 49747 105262 36148 -13200 -137333
5929 -137333 -127629 -107184 -118093 -160943 -159605 -116661 -55954 -84249 -110322 -103850 -22998 7280
5917 7280 10128 1466 28220 28133 -2869 1881 80685 117205 65869 79107 105813 21290 9062
5904 9062 23024 -28312 -145116 -225967 -228818 -119497 -30078 -12662 -14161 3193 -10529 -30068
5892 -30068 -99902 42577 221832 261596 120528 78341 143258 117591 109706 40120 71943
5881 71943 150864 123949 62527 -11515 64287 73759 -6721 88043 154393 137110 120082 25452
5869 25452 -6013 80263 102085 111026 70742 14890 -47212 -54309 24393 49456 139094 123885
5857 123885 48593 55455 59222 -15244 -49604 46793 119051 111563 86466 110921 126541 53236
5845 53236 28107 99838 103378 33159 33697 17358 -59692 -29123 7051 11972 26562 31577 10895
5832 10895 -30328 -108260 -142629 -104754 -14622 -6171 56256 118811 116455 34514 -11618 -33667
5820 -33667 -72787 -48505 3587 14387 -37397 -143403 -91836 -14167 54398 90646 137352 150739
5808 150739 87719 5181 -86035 -73921 -77335 -40081 38461 33489 76833 35721 4784 -13115
5796 -13115 -16577 -1810 35327 132182 66361 -64829 -115502 -90107 -162119 -185311 -161262 -129739
5784 -129739 -88011 -61216 -39183 -45557 32870 112888 177492 148616 45784 10331 -33287 -69194
5772 -69194 -61010 -18065 410 41434 48216 88318 41424 -57936 -38033 18926 4952 -35107
5760 -35107 -70269 -60984 -86989 -64314 19266 113703 99657 39975 -10258 -51955 71888 92561
5748 92561 127859 165716 104326 87139 27395 44623 12962 35486 61029 -13104 48672 48193
5736 48193 -71370 -77200 23667 -17833 3087 29079 46917 -11600 19975 -49794 -37211 -7489
5724 -7489 -37756 -131914 -249682 -153862 -89224 -38092 -19704 -48202 -26007 2037 -78771 -49441
5712 -49441 1438 -11295 44029 67297 9216 31440 58753 26486 -52996 -124125 -123176 -122315 -77206
5699 -77206 4405 4975 18458 -26530 -69187 -75636 -46801 23856 109961 104103 19637 116288 162081
5686 162081 87162 35609 1520 9445 -9055 -34216 -92809 -164923 -123916 -137526 -109313 -79480
5674 -79480 -38090 6916 -6883 52020 38074 34415 52865 42266 64342 -50227 -80808 -71146
5662 -71146 7079 2478 -75629 -145225 -96896 -88494 -18433 37229 34138 882 -56490 -58355 43885
5649 43885 47081 35968 4816 15933 29603 19378 -26007 -44699 -8973 -22240 -64882 -119213
5637 -119213 -35261 -75516 -90808 -77657 -46744 -92339 -76341 -76784 -69565 -41900 60630 145893
5625 145893 13301 -46786 2752 71587 -42478 -120051 -109876 -101258 -25649 26763 37287
5614 37287 65519 92146 68894 28334 125279 128421 61951 -41895 -58080 -82374 -51749 -6589
5602 -6589 -23583 -68053 -35674 -59626 -55356 -47209 -70481 -140418 -204986 -161047 -174092 -213001
5590 -213001 -145497 -135058 -192752 -169499 -130602 -86440 -81601 -117145 -154759 -108071 -55713 -59154
5578 -59154 -581 -76610 11526 65117 25123 -133427 -174353 -163898 -127082 -95719 -122223 -132633
5566 -132633 -135185 -162941 -151061 -93475 -7729 -36933 -28626 -69880 -112090 -71908 -139515 -162435
5554 -162435 -160917 -225654 -172138 -68711 1361 -14954 -69802 -54868 -51551 -119831 -192748 -176778
5542 -176778 -107603 -146428 -149784 -79158 -24404 27204 5074 -67540 -43250 -68510 -60573 -10194
5530 -10194 40500 -22075 -70470 -48309 -33586 -24470 -14053 -5139 -4823 -20380 -362 1610 610
5517 610 46783 21704 2418 -36839 4931 -43437 -3233 -62050 -75035 -103107 -14712 -39060
5505 -39060 -13484 33636 34821 39514 27287 -1027 -44334 -116177 -73421 -121856 -173771 -82407
5493 -82407 -56815 36373 74427 116433 105510 57171 -1088 15717 71979 130414 94085 92943
5481 92943 14048 49007 92134 35057 -30658 -61523 -94787 -93681 -25375 2202 -24884 -39072
5469 -39072 -59215 -118978 -212699 -174618 -83537 -103188 -54225 82953 120237 92419 -11763
5458 -11763 -64590 -49424 -13745 -41667 -44864 -24935 -33766 -33308 51083 92223 36551 -9566 -68651
5445 -68651 -40953 -29514 -20462 -37582 -8245 -27496 10619 -32289 -116358 -105391 -105001 -59145
5433 -59145 -81952 -61666 -98984 -116184 -78695 -25854 55802 24971 28883 46354 -56333 -89838
5421 -89838 14201 74915 -23430 -93588 -51127 -37840 -28801 4246 -24132 -63713 -40860 -90925
5409 -90925 -47984 19606 -11168 -5715 63758 43611 59516 18100 2443 15667 23929 -6268
5397 -6268 -135677 -140045 -38104 -27900 -13206 -16848 -41103 -27458 -33370 -48377 -46555 -43981 -1688
5384 -1688 45906 30130 19768 50967 75038 104947 61188 41939 81005 121197 157702 151219
5372 151219 120240 28371 31734 45030 -7123 -57294 -71262 58065 162131 63974 -20810
5361 -20810 -48846 -39064 -1500 -6114 -18873 -5682 44786 11664 -87092 -86619 -18612 8696 -59972
5348 -59972 -17031 43020 51620 82555 62851 -9784 -63445 -69244 -95262 -109073 -92091 -95280
5336 -95280 -77010 -65346 -90536 19767 -91318 -53704 62196 107792 115788 125088 153509 59276
5324 59276 31760 -41027 -44409 15607 46953 149727 146925 164188 134976 18833 10684 51265
5312 51265 76997 3235 -10258 23931 11756 -1108 -50143 -59034 -35675 23632 6668 -22381
5300 -22381 -14004 -93539 -144251 -121850 -44736 -61702 -140782 -109440 -56982 1340 91254 87963
5288 87963 33269 -16926 -5633 9933 16829 51751 31179 -941 32232 -16021 -84447 -37084
5276 -37084 46316 59216 23421 -7748 42200 40285 73769 32153 -34865 -92337 -100436 -31109
5264 -31109 -26439 -27020 -73809 -121607 -69911 -6558 59757 67167 6614 -63907 -96752 -18350 40501
5251 40501 -21841 -61366 -57907 -17104 -54835 -31875 -119768 -123946 -77796 -59791 -16332 14048
5239 14048 70891 70166 68736 24651 -21542 -14945 31210 95006 194711 235234 189497 146768 163968
5226 163968 148510 158577 128745 94532 101747 105564 73669 -51299 -28546 105704 132210 -12607
5214 -12607 -16212 21398 -49897 -6879 -355 1780 85294 117176 95323 53796 31762 -15847
5202 -15847 -66973 8454 60349 55042 47121 -513 60522 108907 88580 28036 39211 88838
5190 88838 75902 -63140 -96500 -27749 -21992 6487 109031 132643 117285 100754 121156 65347
5178 65347 24829 -49558 -15696 50679 46035 8008 -21196 15087 -15283 12993 -10797 -53216
5166 -53216 -8940 -36422 -112467 -72463 -7638 53242 89499 9385 -48248 -81902 -114895 -69870
5154 -69870 64605 3107 -139287 -174401 -111741 -124319 -147414 -109401 40770 21110 -39478
5143 -39478 -77593 9488 61073 70968 -25629 -81693 -108563 -126609 -46872 31158 65803 -1407
5131 -1407 -41604 -42683 -46861 -53050 -2798 -23276 -125335 -125602 -139814 -190585 -165649 -39132 58259
5118 58259 61120 50781 -7942 -156618 -89752 -53766 -4408 -22593 -41057 -116195 -97758 -3921
$$ [...]
##END NTUPLES=NMR SPECTRUM
##END=
