##TITLE=Analysis number 318384
Compound Code mwp 00006
Book Reference ex 299519
Project Code adrs
Chemist Name stores
##JCAMPDX= 6.0         $$ Bruker NMR JCAMP-DX V2.0
##DATA TYPE= NMR SPECTRUM
##DATA CLASS= NTUPLES
##ORIGIN= Bruker BioSpin GmbH
##OWNER= nmr
$$ XWIN-NMR		Version 3.5
$$ Mon Mar 27 13:02:42 2006 GMT Daylight Time (UT+1h)  MAYBRIDGE\nmr@NMR_250MHZ
##.OBSERVE FREQUENCY= 250.131544655141
##.OBSERVE NUCLEUS= ^1H
##.ACQUISITION MODE= SIMULTANEOUS (DQD)
##.ACQUISITION SCHEME= undefined
##.AVERAGES= 16
##.DIGITISER RES= 18
##SPECTROMETER/DATA SYSTEM= dpx250
##.PULSE SEQUENCE= zg30
##.SOLVENT NAME= CDCl3
##.SHIFT REFERENCE= (INTERNAL, CDCl3, 0, 16.522)
##AUDIT TRAIL= $$ (NUMBER, WHEN, WHO, WHERE, WHAT)
$$ ##TITLE= Audit trail, XWIN-NMR		Version 3.5
$$ ##JCAMPDX= 5.01
$$ ##ORIGIN= Bruker BioSpin GmbH
$$ ##OWNER= nmr
$$ C:\u/data/dgb/nmr/ADRS/1520/pdata/1/auditp.txt
$$ ##AUDIT TRAIL=  $$ (NUMBER, WHEN, WHO, WHERE, WHAT)
(   1,<2006-03-27 13:02:17.37 +100>,<MAYBRIDGE\nmr>,<NMR_250MHZ>,
      <created by zg, POWCHK disabled, PULCHK disabled
       configuration hash MD5:
       84 BC 41 DB A1 6E 1D 46 DA 25 12 A5 C1 ED C5 3A
       data hash MD5: 64K
       98 82 C6 C1 C3 11 BB FE 31 34 91 2D 4D 9D FD 1A>)
(   2,<2006-03-27 13:02:32.54 +100>,<MAYBRIDGE\nmr>,<NMR_250MHZ>,
      <Start of raw data processing
       ef LB = 0.3 FT_mod = 6 PKNL = 1 SI = 32K 
       data hash MD5: 32K
       E0 E3 8A 4D 04 11 F6 D1 E9 86 51 DE 2D E2 29 AA>)
(   3,<2006-03-27 13:02:34.04 +100>,<MAYBRIDGE\nmr>,<NMR_250MHZ>,
      <apk 
       data hash MD5: 32K
       94 54 03 81 F2 DC 5B 72 D9 B5 78 DC D0 5F D2 01>)
(   4,<2006-03-27 13:02:34.81 +100>,<MAYBRIDGE\nmr>,<NMR_250MHZ>,
      <abs ABSG = 5 
       data hash MD5: 32K
       8D 3A 16 19 DB C3 4A DA 04 0F B3 2C EA 9F 40 E5>)
$$ ##END=
$$ 
$$ hash MD5
$$ A1 C9 49 BB 32 38 CB CB 03 7F 55 61 2B 02 73 EE
##$RELAX= 
##$RELAX= 
##$RELAX= 
##$RELAX= 
##$RELAX= 
##$RELAX= 
##$RELAX= 
$$ Bruker specific parameters
$$ --------------------------
##$DU= <C:\u>
##$EXPNO= 1520
##$NAME= <ADRS>
##$PROCNO= 1
##$TYPE= <nmr>
##$USER= <dgb>
##$AMP= (0..31)
100 100 100 100 100 100 100 100 100 100 100 100 100 100 100 100 100 100 
100 100 100 100 100 100 100 100 100 100 100 100 100 100 
##$AQSEQ= 0
##$AQ_mod= 3
##$AUNM= <au_zg>
##$AUTOPOS= <30 >
##$BF1= 250.13
##$BF2= 250.13
##$BF3= 250.13
##$BF4= 250.13
##$BF5= 500.13
##$BF6= 500.13
##$BF7= 500.13
##$BF8= 500.13
##$BYTORDA= 1
##$CFDGTYP= 0
##$CFRGTYP= 5
##$CHEMSTR= <none>
##$CNST= (0..31)
1 1 145 1 1 1 1 1 1 1 1 1 1 1 1 1 1 1 1 1 1 1 1 1 1 1 1 1 1 1 1 1 
##$CPDPRG= <>
##$CPDPRG1= <>
##$CPDPRG2= <>
##$CPDPRG3= <>
##$CPDPRG4= <mlev>
##$CPDPRG5= <mlev>
##$CPDPRG6= <mlev>
##$CPDPRG7= <mlev>
##$CPDPRG8= <mlev>
##$CPDPRGB= <>
##$CPDPRGT= <>
##$D= (0..31)
0 1 0 0 0 0 0 0 0 0.06 0 0 0 0 0 0 0.0002 0 0 0 0 0 0 0 0 0 0 0 0 0 0 
0 
##$DATE= 1143460936
##$DBL= (0..7)
120 120 120 120 120 120 120 120 
##$DBP= (0..7)
150 150 150 150 150 150 150 150 
##$DBP07= 0
##$DBPNAM0= <>
##$DBPNAM1= <>
$$ [...]
##$SUBNAM7= <"">
##$SUBNAM8= <"">
##$SUBNAM9= <"">
##$SW= 20.6930455092707
##$SWIBOX= (0..15)
0 0 3 0 0 0 0 0 0 0 0 0 0 0 0 0 
##$SW_h= 5175.983436853
##$TD= 65536
##$TD0= 1
##$TE= 294.16
##$TE2= 300
##$TE3= 300
##$TEG= 300
##$TL= (0..7)
0 120 120 120 120 120 120 120 
##$TP= (0..7)
150 150 150 150 150 150 150 150 
##$TP07= 0
##$TPNAME0= <>
##$TPNAME1= <>
##$TPNAME2= <>
##$TPNAME3= <>
##$TPNAME4= <>
##$TPNAME5= <>
##$TPNAME6= <>
##$TPNAME7= <>
##$TPOAL= (0..7)
0.5 0.5 0.5 0.5 0.5 0.5 0.5 0.5 
##$TPOFFS= (0..7)
0 0 0 0 0 0 0 0 
##$TUNHIN= 0
##$TUNHOUT= 0
##$TUNXOUT= 0
##$USERA1= <user>
##$USERA2= <user>
##$USERA3= <user>
##$USERA4= <user>
##$USERA5= <user>
##$V9= 5
##$VALIST= <valist>
##$VCLIST= <CCCCCCCCCCCCCCC>
##$VD= 0
##$VDLIST= <DDDDDDDDDDDDDDD>
##$VPLIST= <PPPPPPPPPPPPPPP>
##$VTLIST= <TTTTTTTTTTTTTTT>
##$WBST= 1024
##$WBSW= 4
##$XGAIN= (0..3)
0 0 0 0 
##$XL= 0
##$YL= 0
##$YMAX_a= 420201
##$YMIN_a= -456817
##$ZGOPTNS= <>
##$ZL1= 120
##$ZL2= 120
##$ZL3= 120
##$ZL4= 120
##$ABSF1= 16.522
##$ABSF2= -4.171173
##$ABSG= 5
##$ABSL= 3
##$ALPHA= 0
##$AQORDER= 0
##$ASSFAC= 0
##$ASSFACI= 0
##$ASSFACX= 0
##$ASSWID= 0
##$AUNMP= <proc_1d>
##$AZFE= 0.1
##$AZFW= 0.1
##$BCFW= 0
##$BC_mod= 0
##$BYTORDP= 0
##$COROFFS= 0
##$CY= 12.5
##$DATMOD= 1
##$DC= 0
##$DFILT= <>
##$DTYPP= 0
##$F1P= 14.0000005364418
##$F2P= -0.99999901652339
##$FCOR= 0.5
##$FTSIZE= 32768
##$FT_mod= 6
##$GAMMA= 0
##$GB= 0
##$INTBC= 1
##$INTSCL= 1
##$ISEN= 128
##$LB= 0.3
##$LEV0= 0
##$LPBIN= 0
##$MAXI= 10000
##$MC2= 0
##$MEAN= 0
##$ME_mod= 0
##$MI= 0
##$NCOEF= 0
##$NC_proc= -2
##$NLEV= 6
##$NOISF1= 0
##$NOISF2= 0
##$NSP= 0
##$NTH_PI= 0
##$NZP= 0
##$OFFSET= 16.522
##$PC= 1
##$PHC0= 174.3329
##$PHC1= 4.928415
##$PH_mod= 1
##$PKNL= yes
##$PPARMOD= 0
##$PSCAL= 4
##$PSIGN= 0
##$REVERSE= no
##$SF= 250.13
##$SI= 32768
##$SIGF1= 0
##$SIGF2= 0
##$SINO= 400
##$SIOLD= 32768
##$SREGLST= <1H.CDCl3>
##$SSB= 0
##$STSI= 32768
##$STSR= 0
##$SW_p= 5175.98343685301
##$SYMM= 0
##$S_DEV= 0
##$TDeff= 65536
##$TDoff= 0
##$TI= <Analysis number 999999
Compound Code 99
Book Reference 9
Project Code 9>
##$TILT= no
##$TM1= 0
##$TM2= 0
##$TOPLEV= 0
##$USERP1= <user>
##$USERP2= <user>
##$USERP3= <user>
##$USERP4= <user>
##$USERP5= <user>
##$WDW= 1
##$XDIM= 32768
##$YMAX_p= 473689145
##$YMIN_p= -468272
$$ End of Bruker specific parameters
$$ ---------------------------------
##NTUPLES= NMR SPECTRUM
##VAR_NAME=  FREQUENCY,     SPECTRUM/REAL,   SPECTRUM/IMAG
##SYMBOL=    X,             R,               I
##VAR_TYPE=  INDEPENDENT,   DEPENDENT,       DEPENDENT
##VAR_FORM=  AFFN,          ASDF,            ASDF
##VAR_DIM=   32768,         32768,           32768
##UNITS=     HZ,            ARBITRARY UNITS, ARBITRARY UNITS
##FACTOR=    0.157963299565203, 1,           1
##FIRST=     4132.6476996994, 0,             0
##LAST=      -1043.33573715361, 0,           0
##MIN=       -1043.33573715361, -468272,     0
##MAX=       4132.6476996994, 473689145,     0
$$ Real data points
##PAGE= N=1
##DATA TABLE= (X++(R..R)), XYDATA
$$ [...]
##PAGE= N=2
##DATA TABLE= (X++(I..I)), XYDATA
16418c05394K040m083o976n884j6042K2051K0563J0139M791q961j5429k987o166
16405c12338j8415J3810k654Q402J9262P415j6221L736N61O031k324J3808J2390
16392b66537j0705l2159r193o109j0162k584J683K9598K5543J7882J1119M984
16380b46640j0941k8807j631J7367J638p827j5095L38J7177K534k695n410j667
16367b81659J568r639k810q78n595n527n9l99K6393J8454k30J1141j5870j2561
16353b77671M384J2692P957j796j1028J1972O139p010j2980l135P784N375O956
16340b50361J2278m292r085q716k9560k5278K7836L7152L909K785l84j3791j5690
16327b73197j54J2851J8471j1326K706n905k4894O870j145q859p692J2551J036
$$ y = [-305394, -303354, -307437, -314413, -320297, -336339, -314288, -293725, -283586, -278795, -287756, -303185, -306172, -312338, -330753, -316943, -319597, -311195, -291933, -284518, -300739, -297003, -296442, -290411, -292735, -278927, -266537, -277242, -309401, -318594, -324703, -334865, -337449, -335766, -306168, -280625, -262743, -251624, -246640, -257581, -286388, -288019, -270652, -269014, -276841, -291936, -291598, -274421, -271887, -274582, -279992, -281659, -280091, -289730, -292540, -293418, -299013, -304540, -304599, -304998, -278605, -260151, -260381, -249240, -265110, -277671, -273287, -260595, -252638, -254434, -265462, -253490, -247351, -254361, -267341, -270476, -262692, -257317, -250361, -238083, -242375, -251460, -260176, -289736, -315014, -287178, -250026, -246117, -243332, -243716, -257507, -273197, -273351, -260500, -242029, -253355, -250649, -256554, -281448, -274578, -275723, -284582, -292274, -279723, -278687]
16314b78687K097j303L3080J6124O779j4946J1214n937k132j5700k2709o720j4496
16301b93336K132J2445P201J054j0126r464P19J803j0421Q792J7566l432p426
16288b82493J1497J0003j0227J4162l75j4214j0609o475L576O959O755N912Q053
16275b57476r263q119K7343J3139j5502j3969J0188K172n545j8917J1724K5042
16263b39183J3618l642j4250j7874m273K4778J3170n771k1319j3644J3784j2291
16251b66897J0786K5749m846j6088m687J4375j839k1391N54M665L036j3994J3294
16238b57283J0367r213O91K3257K728q545l747J2293j3361j2351J2722Q028J5602
16225b18812p778j3502r129Q974m439l521J9449L01j5320l935M501J2247o118
$$ y = [-278687, -276590, -277893, -244813, -228689, -221910, -236856, -225642, -231579, -233711, -249411, -272120, -278840, -293336, -291204, -278759, -271558, -270504, -280630, -290094, -289375, -287572, -297993, -289201, -271635, -275067, -282493, -270996, -260993, -271220, -257058, -257433, -271647, -282256, -288731, -285155, -278196, -271441, -265529, -257476, -266739, -274858, -247515, -234376, -249878, -263847, -253659, -251487, -257032, -275949, -264225, -239183, -225565, -229207, -243457, -261331, -265604, -240826, -227656, -233427, -254746, -268390, -254606, -266897, -256111, -230362, -235208, -251296, -255983, -241608, -243447, -264838, -264284, -259619, -256583, -270577, -257283, -246916, -256129, -255438, -232181, -229453, -237998, -241745, -229452, -242813, -255164, -242442, -234414, -218812, -226590, -240092, -249221, -240247, -244686, -248207, -228758, -228457, -243777, -247712, -243211, -230964, -237082]
16212b37082j9109k536L088o813l307J3256J4373N765O239j2856l744J5874j6160
16199b43012j8716R41J2796j4350L084M305L073J2521J6171K0211O698r727l974
16186b09979j3267l393J920q047k5925J8622R088m50j1980L771j1959K6250m942
16173b30291j0008k2272j3455J4291M2853K4631j1404j2853p088n966j1332K0465
16161b22429r169k134J046l1359J3752J627K1476O790K68J1111M842K385j0326
16148b12120r625J02o246j0145n75K5862m350j3642L603K6238J1514j8178l751
16135b11313k094O959K085j328O345J1203j1341l138p73J3890K6486j412O872
16122a57559j9204k3348k327J5401L035j2826P013j6859j8768j2845K2282J505
$$ y = [-237082, -256191, -258727, -255639, -262452, -265759, -252503, -238130, -232365, -226126, -238982, -242726, -226852, -243012, -261728, -260787, -247991, -262341, -259257, -254952, -251879, -239358, -223187, -202976, -196278, -206005, -209979, -223246, -226639, -224719, -232766, -258691, -240069, -230981, -231431, -243411, -239640, -251599, -225349, -230291, -240299, -262571, -276026, -261735, -218882, -194251, -205655, -218508, -225596, -231562, -242894, -222429, -231598, -233732, -232686, -264045, -250293, -248666, -227190, -220400, -220132, -209021, -204179, -201794, -212120, -221745, -221643, -227889, -238034, -238609, -212747, -217097, -230739, -227136, -200898, -189384, -207562, -211313, -213407, -206448, -204363, -205691, -199346, -188143, -199484, -202622, -203395, -189505, -163019, -164431, -157559, -176763, -200111, -202438, -187037, -184002, -196828, -189815, -206674, -225442, -238287, -216005, -214500]
16110b14500p755J3141J3174J001k4004J0256r243j5074J0887L7222q450j5819
16098b09164k0923R370J1002P073O798j686J6381Q7l3022k5288L035K784Q82o495
16084b39166j9469P498J8257K8415m094M8L0907O499k8808k0375k3336j4427L380
16071b54671J8855P317J8363K686m802J3792J8377N391o935K614j1474j5817j6012
16058b22316R531R99r857P188J0054K277J0424O435j9054p749L984M214q31J1272
16044a93429q742J20j737P372j647r88k558j4887j9531J4150J6816N411q991r698
16030b18339L026J2564o791P566M325J9166r201j759n084l194M912k731P289J2194
16016a76057J1132J4857M516J984j3846l9213l8406K7130P076J2645J4021r775
$$ y = [-214500, -222255, -209114, -195940, -194939, -218943, -208687, -217930, -233004, -222117, -184895, -193345, -209164, -230087, -220717, -209715, -202642, -195844, -197530, -181149, -181062, -214084, -239372, -236337, -233553, -232671, -239166, -258635, -251137, -232880, -204465, -208559, -208511, -177604, -171105, -199913, -220288, -243624, -258051, -254671, -235816, -228499, -210136, -207450, -212252, -198460, -180083, -174692, -181627, -179013, -190487, -206304, -222316, -212785, -211786, -221643, -214455, -204401, -202124, -191700, -185265, -204319, -212068, -208084, -203870, -204701, -193429, -202171, -202051, -203788, -196416, -198063, -199051, -201609, -216496, -236027, -221877, -205061, -199650, -208641, -218339, -215313, -202749, -209540, -201974, -197649, -178483, -187684, -189443, -194527, -197721, -192809, -195540, -188251, -176057, -164925, -150068, -145552, -143568, -157414, -196627, -235033, -207903, -200827, -188182, -174161, -183936]
16004a83936p199j3198J1114O918p804J4139p652j187o627k449J876K4311M295
15991a67399n283j0905k176l10L980p49q373j281M56J2128J1003K2228j7669k3527
15977a87877M767m264j5473q574N226J0170n541r733j6199J4263K1134J3521R544
15964a69036P132J530j1885M619j6526l929P515m89k3136N310N686K6052J813
15951a65344J1376J746r762j720n034j0739j7693J2807P536M586J5273p8j7416
15938a74462J2752j0802j3083l851j2511J2371P473N849R725j2268l0695K2412
15926a87090M401j0038J845K4656k149N302J5067j9951m102P655R181j5615R080
15913a61758n737q150J978J4294R742q125n096J871O00j5660J650J1291l994j156
$$ y = [-183936, -191135, -204333, -193219, -186301, -194105, -179966, -187618, -188805, -195432, -197881, -196005, -171694, -167399, -172682, -183587, -185763, -186073, -182093, -182842, -191215, -192496, -192040, -179912, -168909, -146681, -164350, -187877, -183110, -187374, -202847, -211421, -206195, -196025, -201566, -211299, -227498, -213235, -192101, -178580, -169036, -161904, -160374, -172259, -167640, -184166, -188095, -180580, -181069, -204205, -198895, -193209, -167157, -165344, -153968, -152222, -161984, -163704, -168738, -179477, -197170, -184363, -176827, -172241, -156968, -157046, -174462, -161710, -172512, -185595, -189446, -201957, -189586, -182113, -176264, -166539, -178807, -209502, -187090, -182689, -192727, -190882, -166226, -168375, -163073, -148006, -167957, -172059, -164404, -155223, -170838, -161758, -167495, -175645, -173667, -159373, -149631, -157756, -162852, -160981, -160381, -176041, -174391, -163100, -167094, -168250]
15899a68250J400n689k211J7526q12o892q007j3492q200R209j995K0252J3530
15886a53631j1492k0822K2783J5310k167k181j251J0488j3828j4559o414j1440
15874a89204R975J1856J0404j149r785k790j8708j2267J3017J0705K6172k294
15862a54068j6945j3084J0372j877k0344J5927J5707o065p139k1220J3683J0685
15850a74368k0304m110J0526J2872K4066J8264Q790n851n958j2053p317P18J9144
15837a35581Q491j9991j9999R649R516J0481K132m447R514l2247j4653k278r274
15824a88687P110K1031n344j3481K142L1311J3164J7788N56o933n875j0194j7543
15811a54955j2144L637o909r359J7952J1249p233P320o872l55K891k2973N721
$$ y = [-168250, -166850, -172539, -174750, -157224, -158036, -164928, -172935, -186427, -194627, -185418, -187413, -167161, -153631, -165123, -185945, -163162, -147852, -150019, -152200, -153451, -142963, -156791, -171350, -177764, -189204, -179229, -167373, -156969, -158118, -167903, -170693, -189401, -201668, -188651, -177946, -151774, -154068, -171013, -184097, -173725, -175602, -195946, -180019, -164312, -170377, -177516, -198736, -185053, -174368, -194672, -198782, -188256, -175384, -151318, -133054, -124264, -130115, -136073, -148126, -155443, -154725, -135581, -127090, -147081, -167080, -157431, -147915, -137434, -135302, -139749, -130235, -162482, -177135, -179413, -188687, -181577, -160546, -165890, -179371, -177229, -145918, -132754, -114966, -114410, -121343, -127218, -137412, -154955, -167099, -163462, -170371, -179730, -161778, -150529, -157762, -150442, -157314, -157669, -154778, -177751, -172030]
15798a72030J5509L2733J0926m390O408k486N005j4306r056r733n804r731K633
15785a54322r131M815O036J3326Q051l2766k060J4182j48J1950l851j3749J2042
15772a45625l82J2882K5554K137j4843J1981J0758k8109j5674J6702P294l172
15760a20497j2326p161r663q284n130P498K2064J1603j1349J1498L374k746k411
15747a23530J507k0285j0904P334m820M788J3693N188o554j4079J6720N275R137
15734a16530J3035j4011j4001O866J3625j94r443j3061R581M466L550m969p087
15721a28173j187k839j9256j129M805R30Q007j7095J4443k363k2254K878j586
15708a64819J237J0409j2964L060J5817j038j589j0416j6477N781Q162K4531M985
$$ y = [-172030, -156521, -123788, -112862, -117252, -110844, -113330, -108325, -122631, -131687, -141420, -147224, -156955, -154322, -163453, -158638, -152602, -139276, -131225, -163991, -166051, -151869, -152017, -140067, -143918, -157667, -145625, -146007, -133125, -107571, -105434, -120277, -108296, -97538, -125647, -141321, -124619, -117325, -120497, -132823, -139984, -149647, -157931, -163061, -155563, -133499, -121896, -133245, -121747, -118373, -121119, -123530, -122023, -142308, -153212, -145878, -150698, -145910, -132217, -127029, -133583, -147662, -130942, -125667, -116530, -103495, -117506, -131507, -124641, -111016, -111210, -120653, -133714, -124133, -119667, -116117, -121086, -128173, -129360, -132199, -151455, -152584, -147779, -146849, -138842, -155937, -141494, -143857, -166111, -163233, -164819, -163582, -153173, -166137, -163077, -147260, -148298, -149887, -160303, -176780, -170999, -162837, -138306, -133321]
15695a33321n197m36J4816P739Q462j903k1810n92j4556j2289R073K6236O513
15682a17265K373M913j2352k2247J4005O263j2972l565N605K3633P337O110k8950
15669a27112j4858J4103K0829J2186n518J4421J1066k9395j0412m818j3109l691
15657a36308r863J2696L26q199j884L931P619J9253m21o187m987k4967K7482L8232
15643h3277m890n670R891j0612n654o377K211o67j801j0765J7319K5580J4993
15630e9719M675j4859l0043j8080J403P968N066l629j3737P778q982L503O448
15617a12208L397J3288O749j3466J2624q519k2761Q129K1345L669l5368p566l07
15604a30994J2727J3243P121J2374K967r768l32j2406J4052J4833J0309k2716
$$ y = [-133321, -138518, -138954, -124138, -116399, -107937, -109840, -131650, -132242, -146798, -159087, -150014, -123778, -117265, -114892, -109979, -122331, -144578, -130573, -124310, -137282, -140847, -135242, -111609, -104272, -98162, -127112, -141970, -127867, -107038, -94852, -100370, -85949, -74883, -104278, -114690, -119508, -132617, -136308, -146171, -133475, -133149, -141348, -143232, -139301, -131682, -112429, -112850, -119037, -124024, -148991, -121509, -83277, -88167, -93837, -83946, -94558, -100212, -106589, -104378, -105045, -106846, -117611, -100292, -74712, -59719, -55044, -69903, -99946, -118026, -116623, -108655, -103589, -107218, -120955, -113177, -122159, -118656, -112208, -108811, -95523, -88774, -102240, -89616, -98135, -120896, -112767, -91422, -87753, -123121, -130687, -130994, -118267, -105024, -97903, -85529, -82562, -92330, -92662, -105068, -91016, -76183, -65874, -88590]
15592h8590j2812l409N129m512j782o109P695M179J0069M656k815J6376K5879
15579d6046p591l5814k6717p383N035n200k323N532j6571K5144L4572J933K6758
15566d8671k3464l2222Q134J6166M050P490J0446M964J590j0689j1760J2350k1978
15553h3594Q48o391j4832j2789j1665J3863L5713J6094p909l721N959M956K610
15540f0858M002r660Q399N393k757l658j2161R011k4736k4399q286P128J7055
15527i5527K4912m678N890j1270J0400K1364J2440K80j9778j4868j7985j313j8309
15514a08442J6232L4242j5081M191L090j09J4600L541k9092j9037J8711K1814
15502e5340N532l1036k1655k3461J4131j137R397J2907J9895R896L72j1932j8654
$$ y = [-88590, -101402, -104811, -99682, -104194, -105976, -112085, -104390, -100211, -90142, -85486, -88301, -71925, -46046, -53637, -89451, -116168, -123551, -118516, -123716, -126039, -120507, -137078, -111934, -77362, -75429, -48671, -72135, -104357, -96223, -80057, -76007, -68517, -58071, -53107, -51517, -62206, -73966, -61616, -83594, -82746, -89137, -103969, -116758, -128423, -114560, -78847, -62753, -70662, -74383, -68424, -63468, -60858, -56856, -66516, -58117, -52724, -55481, -59139, -71300, -62289, -87025, -111424, -119710, -112582, -95527, -70615, -75293, -69403, -80673, -70273, -48909, -36469, -36189, -55967, -70835, -88820, -90133, -108442, -92210, -57968, -73049, -68858, -65768, -65877, -51277, -47736, -76828, -95865, -77154, -55340, -49808, -80844, -102499, -125960, -111829, -112966, -103569, -90662, -70767, -60871, -60499, -72431, -91085]
15489i1085J9818K1027r246K306j1978J2768K0517K013l4654j6370J565o301j0456
15476a00076P724L9080J415o612M983k680K047J0505j39k548j4115k5105j4746
15463a00267p909J51J9659k4075j934K3065J7540o744J4959l522k5689q925J1133
15450i2558N54J7846J4364J0658q124k8293p945P141M714j674J555R311J6478
15437e5973J3602j5016j8811P412J3055j3904k2487j21J4165j57j0666J0426K913
15424g5562o44j203J4482M894K7935J4144k956n161j6454j424l849j7168j9303
15411h2269n809j6067j7267J7908K0006J3056m256O031J2612n318q067m259m606
15398g8305m951o749n784l214J4147Q33P683l20J3728r447q174J3754j2086j6317
$$ y = [-91085, -71267, -50240, -59486, -57180, -69158, -56390, -35873, -33860, -68514, -84884, -83319, -89620, -100076, -92352, -53272, -51857, -58469, -53486, -56166, -54119, -43614, -43753, -46301, -60416, -85521, -100267, -108176, -108025, -88366, -112441, -114375, -91310, -73770, -80514, -65555, -69077, -94766, -103691, -92558, -92004, -74158, -59794, -49136, -57260, -85553, -93498, -86357, -81643, -83317, -81762, -72451, -55973, -42371, -57387, -76198, -68786, -55731, -69635, -92122, -92243, -78078, -78235, -88901, -78475, -75562, -76206, -77409, -62927, -58033, -30098, -15954, -18910, -24071, -40525, -41949, -45798, -62966, -82269, -88078, -104145, -121412, -103504, -83498, -70442, -74698, -68667, -56055, -61373, -69440, -73699, -78305, -83256, -90005, -95789, -99003, -84856, -84023, -76340, -76660, -62932, -72379, -80553, -66799, -78885, -95202]
15384i5202O426L2377K9209p420l1916l396J2653O531r928k259r344Q349k544
15371f6464r933R041L277o412k0452r020J678O101N003J3341J1931q44J36J4027
15357d8590j036k0772m975N384J4206J463o518R608J7538l566j5086J8824N68
15344c2952j2580n987p260j7271J5321K3133K023j5126k0838L15K0454K809p259
15331e5218j2556J2768j957m836o237J1060j324M769J451j8972l948k2782K1640
15318g6142J6438j061J3427P729j2033K6321K485m4231j9247J0939J5405j3820
15306g3790k1909K1842J911J2320k273m183J5033K8445P832R890k0218k1421p78
15293d7299J1651J1945K006k5794k2401J5151J9806j0040m183m34l723K6374p266
$$ y = [-95202, -88776, -56399, -27190, -34610, -66526, -69922, -57269, -50738, -60666, -62925, -72269, -63920, -66464, -76397, -67356, -64079, -70491, -90943, -99963, -98285, -92184, -87181, -73840, -61909, -62753, -62617, -48590, -49626, -70398, -75373, -69989, -55783, -54320, -60838, -51230, -33692, -37258, -52344, -33520, -32952, -45532, -51519, -58779, -76050, -60729, -37596, -35573, -50699, -71537, -71222, -50768, -47959, -55218, -67774, -55006, -56963, -61799, -68036, -56976, -58300, -53531, -52080, -71052, -75000, -97782, -76142, -59704, -60765, -47338, -39609, -51642, -25321, -22836, -67067, -86314, -75375, -59970, -73790, -95699, -73857, -71946, -59626, -61899, -66082, -51049, -22604, -14772, -4882, -25100, -46521, -47299, -35648, -23703, -21697, -47491, -69892, -54741, -34935, -44975, -49158, -49592, -53315, -26941, -34207]
15280c4207n371n057j99L3357J9135j9255j3400k757o117p165J1015K9154J0174
15267I307m581n299L423k165j307K0089K424j8886j7722j3148j675Q210j5353
15254c6683R92P432J3023p239O150j2538p596j163j4162l777J3959r897M095K6802
15240b0602J8437K436J511j7892l224O378p447l0566M961J4083j3596j1811n6
15227e7388L5714M1107N420k9636j3626J7525L7212j4173m3985J6171J818m296
15215h137R665J1330M026j6496k4529p085L2193N846o256n273j5881j7474l633
15202d1704K2340J5935l0173j76J1991L591o993q227J0804K8918R746k7545r691
15189b1184L98M85R977R3K4333Q55q333K231p398j6914M767l774m255K653P188
$$ y = [-34207, -39578, -44635, -44834, -11477, 7658, -11597, -24997, -27754, -33871, -41036, -30021, -867, 9307, 4726, -573, 2850, 685, -622, 19467, 21891, 3005, -14717, -27865, -29540, -21330, -36683, -35691, -28259, -15236, -22475, -16325, -28863, -36459, -37622, -51784, -55561, -41602, -51499, -47404, -20602, -2165, 271, 1782, -16110, -19334, -12956, -20403, -50969, -46008, -31925, -45521, -57332, -57388, -21674, 19433, 24853, -4783, -18409, -884, 36328, 22155, -21830, -5659, -3841, -8137, 1528, 12858, 16884, 388, -24141, -31226, 967, 6813, 557, -4716, -20597, -38071, -41704, -19364, -3429, -33602, -33778, -21787, -18196, -25189, -33416, -22612, 6306, 16052, -11493, -21184, -20786, -20301, -10324, -10231, 14102, 14957, 6624, 8855, 1457, -15457, -10690, -14464, -18719, -16066, -8878]
15174h878Q469k102j3616j3749j009P136O384k748M008J8636j906l052r073J177
15160a0323M044j0949L475K1292R119P340k3384j5907R163J3752J6512J4235O994
15147D5363J1990K611j3118j319j1882k2819P617J6462o871m553m375k0223j359
15134b476K616O267k135N7j8642k39J8866j3118P857J6899Q720R841m0198j2942
15120a8627r941K0932O679Q875O469j9877L5221L1838m195k0198k2571J0531j812
15107B3324r183Q174p03L782m668l241m180Q863M615n359p214J1773J8660l630
15093D1013p140R327k908j4877j776O425K573M530o879k2164k0518J9518K405
15080I529J0011J2116K786J0315j37r564N950k685K650R952o14J566o073K705
$$ y = [-8878, -409, -2511, -16127, -29876, -30885, -23749, -17365, -20113, -16105, 2531, 625, -2427, -11500, -10323, -6279, -17228, -13753, 7539, 16658, 23998, 614, -15293, -6130, 7622, 24134, 38369, 45363, 57353, 59964, 46846, 45527, 33645, 10826, 18443, 34905, 28034, 23481, 19106, -1117, -2476, 140, 6407, 4272, 4329, -14313, -14552, 4314, -8804, -947, 15952, 24672, 34513, -5685, -18627, -28568, -7636, -957, 7918, 14387, -5490, 29731, 61569, 57374, 37176, 14605, 25136, 23324, 14141, 22315, 21612, 25394, 20726, 17485, 13305, 22168, 26783, 21424, 14210, 25983, 44643, 41013, 33873, 43200, 40292, 25415, 23639, 30064, 32637, 37167, 30288, 8124, -12394, 7124, 9529, 19540, 31656, 34442, 44757, 44620, 35056, 41006, 38321, 40971, 50923, 50309, 51875, 45802, 48507]
15066D8507k340J8977K5782j2991o511m236K0161m330p966J8815J0986k3432l701
15053G7721r272K1982j0238M662j0850j4025K5330P447N388J5299p450j0598m421
15040I0975L696N065K579K904J572J9135J5022J337n2M68K2498K2675n76P302
15026A94600P522J6295J3424L3701J1307k0561K3076Q776K2546J4395L7721J5863
15014C78665L432K5235K1337N7296R1286O7651O8967J14492J26038J69722J16571
15003A240692l57410q43949p77448l84474l225J15947J22809J11325R8731P7046
14993e99956P2832O2821L7753K8902O995K5011J7557J0527M2497L4562n041m253
14981b69793K6873K6026K422k309J7156J5593N017M601L07J3664J9061r203l357
$$ y = [48507, 46167, 65144, 90926, 77935, 71424, 67188, 87349, 83019, 75053, 93868, 104854, 81422, 77721, 68449, 90431, 80193, 84855, 74005, 59980, 85310, 92757, 98145, 113444, 105994, 95396, 90975, 94671, 99736, 102315, 105219, 106791, 125926, 140948, 142285, 142233, 142701, 165199, 187874, 187298, 194600, 202122, 218417, 231841, 265542, 276849, 256288, 279364, 288140, 310686, 325081, 362802, 378665, 382097, 407332, 428669, 485965, 577251, 644902, 713869, 828361, 954399, 1124121, 1240692, 883282, 39333, -738115, -1122589, -1125814, -1009867, -887058, -775733, -677002, -599956, -527124, -464303, -426550, -397648, -390653, -365642, -348085, -337558, -295061, -260499, -265540, -269793, -242920, -216894, -214472, -216781, -199625, -184032, -179015, -174414, -174107, -160443, -141382, -150585, -153942]
14968a53942K1469O097n470l703m975J2126L519p312J1683J2930K1613N752j2419
14955i2632j4268J0858L4832j819k7346Q723N82k711j3570k3145j732L7296L1943
14942e2989j8754j3203p340J3836K957M649l134j8233K040l48P335r93O760j36
14928g7553L5Q211M422O949J2662k382j0395j1392q936L481L25J2785J3453P895
14914d0440O830j2024k4036j2224K6288L3699P590j0600n820j559j5235j2679
14902f0210R300K3878n458m482R059K9683L573q889k0432m802O77J2259q591k3415
14888d7850j964K0337K6705q606k0882k195M403Q133M301R23j6888m083J761K0659
14874a5246K8241lj6624O459l360K106k254k960N570k2197n666J2358j0297q974
$$ y = [-153942, -132473, -126376, -131846, -135549, -140524, -128398, -124879, -132191, -120508, -107578, -85965, -80213, -92632, -106900, -96042, -61210, -63029, -90375, -81652, -81070, -83781, -97351, -120496, -122228, -84932, -52989, -71743, -84946, -92286, -78450, -75493, -70844, -73978, -92211, -90171, -90519, -83184, -84177, -77417, -77553, -77518, -69307, -64885, -57936, -45274, -47656, -58051, -69443, -78379, -74898, -74573, -61788, -48335, -40440, -33610, -45634, -69670, -81894, -55606, -21907, -14317, -24917, -30737, -32296, -47531, -60210, -50910, -27032, -32490, -36972, -27913, 1770, 5343, -3546, -23978, -28780, -28103, -15844, -24435, -47850, -49814, -29477, -2772, -11378, -32260, -34455, -30052, -21919, -17618, -16695, -33583, -37666, -35905, -15246, 12995, 12992, -3632, 2827, -533, 1573, -681, -3641, 1929, -20268, -25934, -13576, -23873, -32847]
14860c2847J9361R036N109O048o983j4025R84Q39j7111Q929j052J0881J141m845
14846a4535L293m117J093L300K3477R046q341j1873j7291q133L8034L3251n838
14833D1366R422j0807j9345j3440Q45J2426J5891l447j5622k8163M151K3924j0229
14820F972k0179j799j6233J7076O184j273m372O138L080k327m420J31j6579P592
14806b0009k126n739K1334K3894P12l323q405L784n617j4968L933J0537R837R161
14792B3005K633j2804q054R161j3054k0435J0571P744j498j2122J8948J2701n667
14779A1129r708k703n115P771Q433K0801k3234j7254L574o660K6681o674j8012
14766a0971l868r99J0401L874K4620O451K897k0945p994P575J0254m394j0961
$$ y = [-32847, -13486, -4450, 659, 6707, -276, -14301, -13317, -12478, -29589, -20660, -21712, -10831, -9690, -14535, -11242, -15359, -14266, -10966, 12511, 21557, 13216, 1343, -15948, -24081, 13953, 47204, 41366, 50788, 39981, 20636, 7196, 8041, 20467, 36358, 32911, 17289, -10874, -6723, 17201, 6972, -13207, -15006, -31239, -14163, -7979, -9252, -13624, -7486, -4406, -6733, -11153, -11022, -27601, -20009, -22135, -27874, -6540, 17354, 18066, 14743, 6338, 10122, 4505, -10463, -6530, 4007, 13844, 23005, 25638, 12834, 4780, 13941, 887, -19548, -8977, -1233, -2731, -14853, 4095, 16796, 11129, 1421, -1282, -6397, 1374, 9807, 30608, 7374, -9880, -6306, -12966, 13715, 7041, -10971, -14839, -15838, -5437, -1563, 23057, 29508, 32405, 11460, 3466, 11041, 21295, 16901, 5940]
14753E940J6405N611j6867J4469J0997j2365J543J5141j8356j2360L633k691O002
14740A7102K2252p008k58M142p679j2128r048M280J0044M24q545P7k7901J0901
14726c345P921J2462P74J5532J248R48Q603J988L333K2077j7941k6075j4903K247
14712A4869Q319J6279Q003r896k2461k662k169J4345J1045j822o885k538M535
14699B8962K962N430j7009p145O304J3668k422l870k501J6621J4732j297n258
14686D9177j2101k4470j1491J1050J8431P427k0589J8644K3620M788o1247j4387
14674a1148L2763J5383M955M921n732n388P872P10p342Q643J4499Q745n396j8685
14660D4800r252R873J3472m678j9580N306P437k9554k0665J0325J4914N34O740
$$ y = [5940, 22345, 27956, 11089, 25558, 36555, 24190, 25733, 40874, 22518, 10158, 13791, 11100, 17102, 39354, 32346, 32088, 36230, 28551, 16423, 7375, 11655, 21699, 22123, 13578, 13655, -14246, -3345, 4576, 17038, 17812, 33344, 34592, 35540, 44143, 46131, 49464, 71541, 53600, 27525, 12622, 14869, 23188, 39467, 47470, 37574, 15113, 12451, 10282, 24627, 35672, 33850, 26965, 24427, 28962, 31924, 37354, 20345, 13200, 19504, 33172, 30750, 26880, 24379, 41000, 55732, 54435, 49177, 37076, 12606, 1115, 12165, 30596, 38023, 17434, 36078, 59698, 64486, 3239, -11148, 21615, 36998, 41953, 46874, 41142, 35754, 43626, 44336, 36994, 45637, 60136, 68881, 63485, 44800, 35548, 45421, 58893, 54215, 34635, 39941, 47378, 17824, -2841, 7484, 22398, 22932, 29672]
14647B9672Q714Q535m69q839j5958l14j2981n367J3476J9760J6813p920k090j2207
14633C0825o416J3105N274j7413j0690N746J001m039Q069K2831J1942J674j2698
14620D9211P827J3000m950N29J782j5644j2599n142l244K645m674J297O731N294
14606D2063j354j3104l565L9K8507o81M563k3513k1415j0474J5163K3489m946
14593C4772J609M921P048j4781M461P56J2992p051M316L2407J7790L91m075j5658
14579G9898j451j1134j8754j0600r029j0909J2043R243K0978k44L092O775n161
14566F4747l1209J9457K2841J6656n446k4023n641r471j0302J4496o531j9851
14554B5723o63J9805J3605O23k177n55j5164Q85J4050m881k717L893m091J6735
$$ y = [29672, 38386, 46921, 46452, 37613, 21655, 21341, 8360, 2993, 16469, 36229, 53042, 45122, 43032, 30825, 24409, 37514, 42788, 25375, 14685, 20431, 21432, 17393, 25462, 48293, 60235, 61909, 49211, 57038, 70038, 65088, 65617, 67399, 51755, 39156, 34014, 30770, 33415, 28741, 30038, 36769, 42063, 40709, 27605, 24040, 24079, 52586, 51905, 56468, 32955, 11540, 1066, 16229, 39718, 34772, 36381, 41302, 48350, 33569, 38030, 38786, 51778, 44727, 49043, 81450, 99240, 99631, 95556, 79898, 78447, 67313, 48559, 37959, 28930, 18021, 30064, 39307, 60285, 60041, 63133, 69908, 64747, 33538, 52995, 75836, 92492, 87046, 63023, 57382, 47911, 37609, 52105, 45574, 25723, 25060, 44865, 58470, 59093, 56916, 56361, 41197, 42082, 56132, 51251, 48534, 52427, 48336, 65071]
14540F5071N282K724P197m734k0655l336k460N852m594K5448N212l052J1176M658
14526I3789j1545J2898q614l2418j3584p49K585N594M914L882l84J5238Q316o364
14512G3558K48j3289k165M865J6673R938J68K4834J3745k0174l5876k4506P874
14499E5893L0577J4793j3573k3127j8290n0J7075J6694J2694j2411l2614J174
14487D8835m076J0952o19J3361L3572L820o344K497L676j5203j0840k83n472J3719
14473H7595p880j7338N992K7100J6903J2185k958l256j3646o604j3784j4585n987
14460F3737J023J9591r592l6R778l21J9601J1872P864j1582r94j4882J2521K374
14446A10954l70j4271Q856J510j4432n843j249o87j8L756m565K437k672m110J6091
$$ y = [65071, 70353, 73077, 80274, 75540, 54885, 51549, 49089, 54941, 50347, 75795, 81007, 77955, 89131, 93789, 82244, 95142, 86528, 54110, 40526, 39777, 42362, 47956, 52870, 56752, 56368, 71606, 79922, 73558, 73806, 60517, 58352, 63217, 79890, 89828, 89996, 114830, 128575, 108401, 72525, 48019, 55893, 86470, 101263, 87690, 64563, 46273, 46223, 63298, 79992, 92686, 80275, 47661, 48835, 44759, 55711, 55092, 68453, 102025, 105845, 99501, 101998, 105674, 90471, 79631, 79348, 73876, 87595, 79715, 62377, 68369, 95469, 112372, 124557, 121599, 118343, 104697, 98093, 84309, 69724, 63737, 64760, 84351, 74759, 74723, 84501, 84180, 103781, 115653, 123517, 111935, 110941, 96059, 108580, 110954, 110584, 96313, 105169, 106679, 92247, 86404, 85155, 84468, 84450, 88206, 83641, 86078, 83406, 79296, 95387]
14431I5387o577n9q314j0817N79J8313O721j0873k757J8637M1170J8238l4524
14418A25124k1082j8089K3020J1765k6505j8911N758J2923l901J2036m346j394
14406I6398j2140o933J0664J7645p958k2495j1153K5568J8492M82q277j0189J1636
14393A01740O976j1870j3445M129j4252o539L5340J6951J9319K411K648p091k3347
14380A12970j4796j3627k9622p244O006J2658N258J8311K4024p099l4074J4166
14368H6931J5275J1581J6901r21k4774j7169l585J4304p622J6240n91j2378J8228
14355A12420J9747N888l7303j5020J3898k6541J5323K3346k894l97K1606j0000
14343A20073k4119j8106J3932L1512J2671k9420j6678J7494L537J704L584l775
$$ y = [95387, 88810, 88751, 80437, 69620, 70199, 88512, 95233, 84360, 81603, 100240, 141410, 159648, 125124, 104042, 85953, 108973, 120738, 94233, 75322, 81080, 94003, 90102, 102138, 97792, 96398, 84258, 77325, 87989, 105634, 97676, 75181, 64028, 89596, 108088, 108570, 100293, 90104, 101740, 108716, 96846, 83401, 87530, 73278, 66739, 102079, 119030, 138349, 140760, 143408, 136317, 112970, 98174, 84547, 54925, 47681, 53687, 66345, 71603, 89914, 113938, 106839, 72765, 86931, 102206, 113787, 130688, 129767, 104993, 87824, 84239, 98543, 90921, 107161, 106570, 94192, 112420, 132167, 138055, 100752, 85732, 99630, 73089, 88412, 111758, 108864, 108467, 130073, 120073, 95954, 77848, 91780, 123292, 135963, 106543, 89865, 107359, 110896, 112600, 116184, 112409]
14331A12409j7370o033K8416J5146j8293l0736J7098m001J5385J4874j134k6088
14319I9673j7237J8055J482q375J1890J8744l369j3360K6577n247l2444l0426
14307F5963M446J0396L4303R621j9177j6428J3517K6877J6690l764r208o585j5151
14294A11500j3125J1284K0988o816j0889l195O376O602q966k609j6441k4581N462
14281G5590L6146L3274j5313j6797j261M370k5378q608J1393J4623P513Q859n657
14268A18754r293R71j2287J2050J010j6182R200j3835M050J0726k712N723n703
14255A02472m850M349k0053L303J7123P305M341n522j9528k373L4692K2226q503
14242A34982j8401L19r397J706l910j6683K5132K2998j8262l9633K5782J8035
$$ y = [112409, 95039, 89006, 117422, 132568, 114275, 83539, 100637, 96636, 112021, 126895, 125761, 99673, 82436, 100491, 101973, 93598, 105488, 124232, 120863, 107503, 134080, 128833, 96389, 65963, 70409, 80805, 115108, 124729, 105552, 89124, 102641, 129518, 146208, 142444, 133236, 126651, 111500, 98375, 109659, 130647, 123831, 112942, 109747, 116123, 122725, 113759, 111150, 94709, 70128, 75590, 111736, 145010, 129697, 112900, 111639, 116009, 90631, 82023, 93416, 108039, 115552, 124411, 118754, 109461, 110432, 98145, 110195, 111205, 95023, 104223, 90388, 94438, 105164, 102452, 108175, 102472, 97622, 101971, 81918, 85221, 102344, 109649, 113990, 108468, 88940, 86567, 121259, 143485, 134982, 116581, 116900, 107503, 109209, 105299, 88616, 113748, 136746, 118484, 78851, 104633, 122668]
14230A22668j9464Q528J1184j2568k7957N791R807j3970J4675p716J1846K0552
14218A23376J52P497K3295P20j147k9193k1360j5150J5263k314M23j721Q346o549
14204A01638J055K3336N111j5195k1568m250N628Q497K2714N064J1359J0J6701
14191A60100K742M015J0336j9960k6132k809J3315j2358j8572Q98j2566j770K871
14178A00110l354J1116K2821J9087j0017R865J345L656P693k1699j1224Q442M425
14165A42266j2710O801Q239k7815N34L6533n060j6411n814P812o458N855j7460
14152A16312J4059O016r960p62n257K7612M28k1627k090Q276Q743j3183j1367
14139A17200R63k85O744J2666l670M804L858j8582j6827j5747k627J7517m923
$$ y = [122668, 103204, 111732, 122916, 110348, 82391, 88182, 97989, 84019, 98694, 90978, 102824, 123376, 123528, 131025, 154320, 155040, 153893, 124700, 103340, 88190, 103453, 101139, 101562, 99841, 108187, 101638, 102693, 126029, 131140, 115945, 94377, 90127, 95755, 104252, 126966, 132030, 143389, 143399, 160100, 162842, 166857, 177193, 157233, 131101, 128292, 141607, 129249, 110677, 111575, 99009, 97239, 100110, 96756, 107872, 130693, 149780, 139763, 149628, 150973, 154629, 162322, 140623, 129399, 137841, 142266, 129556, 136357, 144596, 116781, 117315, 153848, 148788, 132377, 126563, 134375, 127917, 133772, 116312, 130371, 136387, 126427, 125665, 120408, 148020, 148448, 126821, 124731, 133007, 141750, 128567, 117200, 118163, 117878, 124622, 137288, 133618, 138422, 142280, 123698, 106871, 91124, 88497, 106014, 101091]
14126A01091J4950J3820j2976n556j159K6049K5058N845k6986j5453l428j5816
14114A05439j4634J5443J9156J8050J8526k370J5391k861j8549j0508O738J6144
14102A65965n937k2476j3345n251q370l227L782K811K3421J2555l331j5209P869
14089A39257m960R590J0348p344j6142j3575O870p82L0608L1430N179r657l0669
14076A50153J4727J3146j1651l924j2719m042j2663j0612L114o921J2512M524
14064A35644m308J1695Q858J0552K3275P979K853o984N132j3159k397O422J400
14051A86962Q034K0733p89r214j7188k6820o654J7413k5946j2593K0102J3416
14039A67456P957J1443m797j5151j713R11l917n844N47k837K507j0152J985J50
$$ y = [101091, 116041, 129861, 116885, 111329, 110170, 136219, 161277, 167122, 140136, 124683, 121255, 105439, 90805, 106248, 125404, 143454, 161980, 159610, 175001, 172140, 153591, 143083, 149821, 165965, 160028, 137552, 124207, 118956, 110586, 107359, 111141, 113952, 137373, 149928, 146597, 131388, 139257, 134297, 143887, 154235, 146891, 130749, 117174, 124044, 123262, 153870, 185300, 190479, 180822, 150153, 164880, 178026, 166375, 162451, 149732, 145690, 133027, 122415, 125529, 118608, 131120, 135644, 131336, 143031, 151889, 162441, 185716, 193695, 196548, 189564, 194696, 181537, 179140, 185562, 186962, 194996, 215729, 214940, 205726, 188538, 161718, 155064, 172477, 146531, 133938, 154040, 167456, 175413, 186856, 182059, 166908, 165195, 166106, 162189, 156345, 156892, 154055, 156562, 146410, 148395, 148545]
14025A48545K0126P299j6461K557K8325J0373j2761R62j6017j0310J8888O68J9831
14012B02025k743J0349q625j4341n072j210k922j6216R32J0824m12j3663r0M776
13998A63612L170K215L900l097m583N672J2235k4009n710L131J321l218J0440
13985A65079Q546L116Q170j3662R401l993Q663O327j8842J3198j6937j3128J7312
13972A73250p438q352k296M03n027l991J4883J9870J2957K0524K041l2287n391
13959A79146j5743j9622K6790J9829j2353Q001j6642M080N536j014k532q845J3609
13946A80240M103L115m700J3467J7449j285k0013k2864n237J9396Q201P614l145
13933A96341q245l4760j0682K3869J9518q453l458R920j941k1543K150P049r610
$$ y = [148545, 168671, 175970, 159509, 162066, 190391, 200764, 188003, 188965, 172948, 162638, 181526, 182194, 202025, 199282, 209631, 201006, 186665, 181593, 180383, 177461, 161245, 162177, 173001, 172589, 158926, 158836, 163612, 166782, 168997, 172897, 169800, 165217, 170889, 183124, 159115, 153405, 156536, 157857, 154639, 165079, 173625, 176741, 184911, 171249, 180650, 176657, 185320, 191647, 172805, 186003, 169066, 155938, 173250, 165812, 157460, 155164, 155567, 150540, 146549, 161432, 181302, 194259, 214783, 216824, 184537, 179146, 163403, 143781, 170571, 190400, 178047, 186048, 169406, 173486, 179022, 178008, 175476, 166631, 180240, 184343, 187458, 182758, 196225, 213674, 212389, 192376, 169512, 164275, 183671, 191872, 199486, 196341, 188096, 153336, 142654, 166523, 186041, 177588, 174130, 184050, 182109, 160566, 162716, 169765, 160155]
13920A60155N724K8879q577k3299k754J4824Q019k258k1066j2081N240J2796J1172
13907A76774n008O486J0104l608o701j1042P191J4325J5587p70j684O443M281
13894B12378p388O039p258K83o048j4066N042J3422J681L894p112j0877p037p697
13880A75256k2636n267J1221N812J2382Q405Q331K0106L3769j7085k2045k131
13868B06118P480O961l1108j6500J7186K4685N312J9333M557Q350K4388o506l9682
13855B30574j2930o181M921J5780q183j2256j850p33j8489J12O313J210n792M477
13841A96973k323j0672q770L8348K4412j5099l5406k0555q226P249K2379M363
13829A92673O171P460j178q444K8447J9655o455j2130j2915J086K197J8391J1298
$$ y = [160155, 165879, 194758, 186181, 162882, 160128, 174952, 182971, 180713, 159647, 147566, 152806, 165602, 176774, 171766, 178252, 188356, 184748, 178047, 167005, 174196, 188521, 204108, 203338, 201654, 208097, 212378, 204990, 211029, 203771, 204054, 198006, 183940, 188982, 202404, 204085, 207979, 200867, 189990, 182953, 175256, 152620, 147353, 158574, 164386, 176768, 185173, 193504, 213610, 247379, 230294, 208249, 206118, 213598, 220559, 189451, 172951, 190137, 214822, 220134, 239467, 244024, 252374, 276762, 270256, 230574, 217644, 211463, 216384, 232164, 223981, 211725, 209875, 209142, 190653, 190765, 197078, 198288, 192496, 196973, 194650, 183978, 175208, 213556, 237968, 222869, 187463, 166908, 158682, 165931, 188310, 192673, 198844, 206304, 205126, 196682, 225129, 244784, 238329, 226199, 213284, 214370, 216567, 234958, 246256]
13816B46256l7057j5691J997k201j0446K2156P714n587J0641L073M736j1636l3937
13803A80018j5272J3391N358j0739j6494J8887O151j1432J4184J8002q135J17
13791A94036L994J5056K2838J521m140K1501k152l6033j5257K4218Q186Q48J3336
13778B47952r096J941j6631m028J1991m179P816J7312j4905m380J115o781P309
13765B35436K2492M511j6190j5758p770j2667k5740Q981P561J3363J3718n833
13753B22104N309J4057k7379M450J1434j269K0485M636p091j1514J8312p178j0440
13740B35916p218j9400O519J4279J205p456J5692K480k9301J4572R764l872l4647
13727A98533O53J151O947K7852K1363J0538r779j3686r029j6923J988Q528n959
$$ y = [246256, 209199, 193508, 195505, 193304, 182858, 205014, 212728, 207141, 217782, 220855, 225591, 213955, 180018, 164746, 178137, 183495, 172756, 156262, 175149, 181300, 169868, 184052, 202054, 193919, 194036, 198030, 213086, 235924, 237445, 233305, 254806, 252654, 216621, 201364, 225582, 233768, 234616, 247952, 238856, 240797, 224166, 220138, 232129, 227950, 235766, 253078, 238173, 233793, 234908, 228127, 235436, 257928, 262439, 246249, 230491, 222721, 210054, 184314, 193295, 200856, 214219, 227937, 222104, 227413, 241470, 214091, 218541, 229975, 228706, 249191, 253827, 246736, 235222, 253534, 246356, 235916, 228698, 209298, 215817, 230096, 231301, 223845, 239537, 242017, 212716, 227288, 237052, 233180, 198533, 199186, 200337, 207284, 235136, 256499, 267037, 257258, 243572, 234543, 217620, 219608, 228136, 222177]
13714B22177J7578J1771j1719k0557j6021P486Q358J8655J2426J630J2657o989
13702B57452j9857j6687J6288K7350j898k7263k693j9805r991J4150n63j5866
13690B00617M519K1155J4911J5102l313l9670l1473J666L1685K3945L1236o900
13678B63480l1126j7376J1860m833N913q58J3557J1104q241j0182j6158q95P486
13665B23731j568J1539K7957J7649j4649j4380k0868q959J658m595J3410j073
13653B29852K268K2837J6776p72j4065k2194j1767K9119P617l132J2733j0527
13641B58745j4468j0656J6609m960L055J6613j0424l1972r06J8744Q391q771M550
13628B44550M130P322k433j4138J3719l131R960N57R684m736j6975j4280P810
$$ y = [222177, 239755, 251526, 239807, 219250, 203229, 210715, 219073, 237728, 250154, 251784, 264441, 257452, 237595, 220908, 237196, 264546, 262648, 235385, 232692, 212887, 202896, 217046, 216483, 200617, 205136, 226291, 241202, 256304, 252991, 213321, 181848, 183514, 215199, 239144, 270380, 263480, 232354, 214978, 226838, 222005, 227918, 227060, 240617, 251721, 243480, 233298, 217140, 216245, 223731, 222163, 233702, 261659, 279308, 264659, 250279, 229411, 220452, 222110, 217515, 230925, 229852, 232120, 254957, 271733, 270961, 256896, 234702, 222935, 252054, 259671, 256539, 269272, 258745, 244277, 233621, 250230, 245270, 248325, 264938, 254514, 222542, 221636, 240380, 248771, 240000, 244550, 248680, 256002, 253569, 239431, 253150, 250019, 259979, 260536, 270220, 265484, 248509, 234229, 242039]
13615B42039J6440n800j4779r907L2342J9225q599j670J4949N368k1899j7670
13603B50039O788J2322M68k1566n540R412O323r578J996j028k110J5356J1710
13590B74592Q446j8716O299K6382L673j7203j4702l303N334k249L119J6096l08
13577B87460M407R769m806j2139k1855j0352n027J4791p9l4067J7580R832j1144
13564B44370O908L0813m16j3O317n21J0655k2362j6140M015m13l035P759N038
13550B72975O103k226J7437L2226k710j9163k9483l4998R839K0428m36L875m975
13537B68892j3331p389J5059J6243j4133J8967J6677j3716m108O201k4748l2076
13525B32538L1979M2895j789o318P74n121k718j8714j1211O065J0913k213j444
$$ y = [242039, 258479, 252679, 237900, 227993, 260335, 279560, 270961, 269291, 284240, 289608, 267709, 250039, 256827, 269149, 269617, 248051, 242511, 251923, 258246, 248668, 250664, 249636, 247526, 262882, 274592, 283038, 264322, 270621, 297003, 300676, 283473, 268771, 265468, 270802, 268553, 271672, 287768, 287460, 291867, 301636, 296830, 284691, 262836, 252484, 247457, 262248, 262169, 228102, 245682, 255514, 244370, 251278, 282091, 281675, 281662, 287979, 287458, 298113, 275751, 259611, 263626, 263213, 260178, 267937, 272975, 279078, 276852, 294289, 326515, 323805, 304642, 275159, 240161, 250000, 270428, 269992, 273867, 268892, 255561, 248172, 263231, 279474, 265341, 284308, 300985, 287269, 283161, 289362, 264614, 232538, 264517, 307412, 305623, 299305, 300079, 294958, 292240, 273526, 262315, 268380, 279293, 277080, 275636]
13512B75636O994q402k0043J0627o78j1023J1458O822m39n472J3940k1864j279
13499B56277j925Q288Q505P111o462j1532J4003M176O968q110j375k767K870J0526
13485B86553J9012L774K97O158j867p906p588j9086J0987l552j4813l03K167J8871
13471B92704J1512j146j1542j3085J13P730m708M733k524r381J319j590L331N502
13457B82968J0315O850q232k769R782P809j443K4520J0775K507j5677j6971p663
13444C02771J879K1261Q69L719n86J2218p823o6o672j6979j858J976N577O765
13430C23051N965j9090j0341J6577j2141k1580K241k829K1415j1324o596J3707
13418B99055l015N874p975R069L117o981j3912J6594K2570M079p409R598k3544
$$ y = [275636, 282630, 274228, 254185, 264812, 264134, 253111, 264569, 271391, 270952, 265480, 279420, 257556, 256277, 254352, 262640, 271145, 278256, 271794, 260262, 274265, 278441, 285409, 277299, 275924, 273157, 276027, 286553, 305565, 309339, 309636, 315794, 313927, 306021, 298433, 279347, 290334, 286782, 271969, 271666, 273833, 292704, 304216, 303070, 291528, 278443, 278556, 286286, 281578, 286311, 283787, 274406, 275725, 274135, 277466, 282968, 293283, 300133, 291901, 289132, 298914, 306723, 305280, 329800, 340575, 343082, 327405, 310434, 302771, 304650, 325911, 326780, 330499, 329913, 342131, 334308, 334242, 327570, 310591, 308733, 310709, 316286, 323051, 329016, 309926, 299585, 316162, 304021, 282441, 284682, 281853, 303268, 291944, 285348, 299055, 296040, 301914, 293939, 303008, 306125, 299144, 285232, 301826, 324396, 328475, 321066, 330664, 307120]
13405C07120k0609K4525L0172j5606j4049r019J1239J2677L769j4235k6175m025
13393B85784J7372J7670N901k3057Q701J6078K9304k9112k0975o825J995o8j1517
13380B91251P277J8847K9333j6256l3158K56K5263J5599J2396q178j791J8958
13368C59797J9524r171m5652q773J7922O688q154k482O900j199j694J221J8196
13355C53123J8114P646l7681k4292J4473K2912j0870L340n43N323m24k6931j0060
13342C14130J331J0939O737O148k328j2535k932K584j0726J6176m70M331J2526
13329C45911k5196q749P255L679r624j8867K3755K1592O663k3137j2524k519J7847
13316C26086N514l850n253J0020P095K2420K0181J8314N81k1203r401j9819o207
$$ y = [307120, 286511, 311036, 341208, 325602, 311553, 302534, 313773, 326450, 330219, 315984, 289809, 285784, 303156, 320826, 326727, 303670, 312371, 328449, 357753, 328641, 307666, 300841, 302836, 302768, 291251, 298528, 317375, 346708, 330452, 297294, 297550, 322813, 338412, 350808, 342630, 340839, 359797, 379321, 370150, 324498, 315725, 333647, 340335, 332181, 329699, 336599, 335400, 333706, 334927, 353123, 371237, 378883, 341202, 316910, 331383, 354295, 343425, 346765, 346222, 351545, 351121, 324190, 314130, 315461, 326400, 333137, 339285, 336957, 324422, 321490, 324074, 313348, 329524, 329054, 333385, 345911, 320715, 311966, 319221, 322900, 313276, 294409, 318164, 339756, 346419, 323282, 310758, 308239, 326086, 331600, 327750, 322497, 332517, 339612, 362032, 382213, 400527, 401108, 379905, 370504, 350685, 344478]
13303C44478q561J8384J1299k3412l6118P466J2085J1657M733O35j6611k1507
13291C04528m488J4617J524J8771K1631J77q950q268k8564j5191o777P585K5136
13278C21731J4070k583Q213j305P085n995r679k741Q768j2756K6548K300l3801
13265C19855M673N064J1379P602N62j196j7155p763j6245J4961p753j550K9832
13252C42266L191o938j0929R612p48j9399J2436K0299J1391J0500k3762R887R491
13239C67297J0766j6010r381J050J1659j1283O299R11j7401J1205j7805J909J3191
13226C52407k311k1973o397K4533j758J0175P871k729N72p845O237q748j1044
13213C38990J5539N646N520M697j4549l125J2439j1932j460K8198Q12k2781j0417
$$ y = [344478, 335917, 354301, 365600, 342188, 306070, 313536, 325621, 337278, 342011, 342646, 326035, 304528, 300040, 314657, 316181, 334952, 356583, 356760, 347810, 339542, 310978, 295787, 289010, 296595, 321731, 335801, 333218, 341431, 340126, 347211, 341216, 331537, 328796, 337564, 324808, 351356, 353656, 319855, 324528, 329592, 340971, 348573, 349135, 347939, 330784, 323021, 306776, 321737, 313984, 312434, 342266, 345457, 338519, 327590, 337202, 336454, 317055, 329491, 349790, 361181, 371681, 347919, 357806, 367297, 378063, 362053, 352672, 353722, 365381, 354098, 360397, 361308, 343907, 355112, 337307, 339216, 352407, 350096, 328123, 321726, 346259, 344501, 354676, 362547, 359818, 360390, 352545, 358782, 350034, 338990, 354529, 360175, 365695, 370392, 355843, 352718, 365157, 353225, 351765, 379963, 380775, 357994, 347577]
13200C47577J7172k111R591J1321K2059O856j1228l4656r553J5162Q265K4170
13188D04625j709N568K1031k119k7496k6542j466p389o621L532J1749j4934r939
13175C48290J2224L233K7058J1310j1836M96j3127M556o101q814l967J7527J2381
13162C93230J5791o050N725l1445o417r6M199Q30K8209O449j02J8930p286k5228
13148C96739k0121j8658j0420r526J0290K5154J4532j4085J8159p245L430O341
13136C94590Q32Q978P948n041k5178K1761M418o753K0886j0728p282k3563M112
13123C84980L3342K7619l1034j4979O199r428j0455J0091n575L559J1577P253
13111D13149M295J0931J755j1776r357R502j774J3551N413j1345n721k9206j4794
$$ y = [347577, 364749, 362638, 372229, 383550, 405609, 412465, 401237, 366581, 357028, 372190, 380455, 404625, 402916, 408484, 429515, 427396, 399900, 373358, 371892, 364503, 357882, 361414, 373163, 358229, 348290, 360514, 363747, 390805, 402115, 390279, 390775, 377648, 382204, 376103, 367289, 363322, 380849, 393230, 409021, 402971, 408696, 377251, 370834, 370738, 374937, 375767, 403976, 410425, 410323, 429253, 421967, 396739, 376618, 357960, 347540, 338014, 348304, 373458, 387990, 373905, 392064, 384819, 388249, 394590, 395422, 404400, 412348, 407307, 382129, 403890, 408308, 401555, 422441, 411713, 404431, 380868, 384980, 418322, 445941, 414907, 399928, 406127, 396699, 386244, 396335, 390760, 394319, 405896, 413149, 417444, 428375, 430130, 418354, 408997, 418499, 416725, 430276, 435689, 424344, 418623, 389417, 374623]
13098C74623K2196K5366P753O119j2182j1764N057k173j274o850J1787k322o034
13085D10302j861N882j0985j3810j2364r528K6815K3163K3169o585l2574j523
13073D00101J8304k153Q980n63j0278J9735P074k8462k4472J6224J3711P702Q048
13060D33951m304J2180j4298l776j5575k152K277J5637K6934n526N781k645m156
13047D44328o300k416J1961q339l923j9881Q319K4831M248m621j5352K3063J5730
13034D71648j9208j3274j8524J7671O555L284j1894j2249R576J5594j0916l629
13022D34634j2714j2220L712J5685Q336p404j2614j7812N793K6244l558q455R
13009D19636j1683j559K8016J5157j2790j9140k2588n844J1251J1328K2040M877
$$ y = [374623, 396819, 422185, 429938, 436057, 423875, 412111, 417168, 414995, 413721, 406871, 418658, 416336, 410302, 408441, 414323, 403338, 389528, 377164, 367636, 394451, 417614, 440783, 434198, 401624, 400101, 418405, 416252, 425232, 424669, 414391, 434126, 441200, 412738, 388266, 404490, 418201, 425903, 433951, 429647, 441827, 427529, 423753, 408178, 406026, 408303, 423940, 450874, 445348, 451129, 448484, 444328, 438028, 435612, 447573, 439234, 435311, 415430, 423749, 448580, 452828, 448207, 432855, 455918, 471648, 452440, 439166, 420642, 438313, 444868, 448152, 436258, 424009, 433585, 449179, 438263, 434634, 421920, 409700, 413412, 429097, 437433, 430029, 417415, 399603, 405396, 431640, 428082, 419627, 419636, 407953, 406394, 434410, 449567, 436777, 417637, 395049, 389205, 400456, 411784, 433824, 438701]
12997D38701j2241L05J0266K4014J7786R79j4261N388R00l1571k2021K0642J9667
12984D58554Q668J7078q772j8171j4002o097J5085p10j1362K1410M379K638j4227
12971D54471j0916P321q427p185m91m825J0057K0674k101N896J59j1238J2940
12958D66335R877K4180O975J822L649k7029k9565m686J6765K3394k2684l012J377
12945D67398J722K3887m823l914N644j3149j9065P408K7022l106k0290k38K8199
12932D96695l601m974Q795j408p789r604J1226j3508l1808o033J2984L976k082
12919D52869J3645J332n48J035l248k3860q882Q748J5440Q669K0387p054J52K561
12905D81246k0281J5346J5152J3778J1524p474j5687j8124P142j264l818m063
$$ y = [438701, 426460, 426765, 437031, 461045, 478831, 479810, 465549, 470937, 471837, 440266, 418245, 438887, 458554, 467222, 484300, 475528, 457357, 443355, 437258, 452343, 451633, 440271, 461681, 466060, 468698, 454471, 443555, 450876, 442449, 435264, 434773, 429948, 440005, 460679, 458578, 464474, 464633, 453395, 466335, 476212, 500392, 507367, 509189, 512838, 485809, 456244, 451558, 468323, 491717, 469033, 466021, 467398, 469120, 493007, 488184, 484270, 489914, 476765, 457700, 465108, 492130, 489024, 468734, 468496, 496695, 493094, 488120, 496915, 495507, 487718, 478114, 489340, 475832, 444024, 437991, 450975, 454951, 452869, 466514, 467846, 467298, 468333, 465085, 441225, 432343, 441091, 456531, 465200, 485587, 478533, 478685, 481246, 460965, 476311, 491463, 505241, 516765, 509291, 493604, 475480, 482622, 481358, 477540, 473477]
12893D73477o13M056j416j4265N170J6119j7249J5127l147j4333O825j7370n465
12880D46916J7106J3135J2889k264k804j4559j2225M188K2282K3048J6145r546
12868E14311J411Q909J931j9723k0661P292J9798J4710j2219j2419J742j0748
12856D94334j8111m566J0796M389J094K8984P165k710m910J859M246K2636P3l2339
12842E12940k9983j2646K1059K5970Q089k0391l4467P430J1458j6933M443J6962
12830D93931K828J2073r366j2118j0276J0379J8243n987p528O834L91N10M592
12817E04506O793R387O20n734r55n773j8473o635K645J1312J6605J1065j2088
12804E13275K759M773K46K493k0050j0716k389K3341L1610M1624l746j5337j5979
$$ y = [473477, 472864, 476920, 475504, 461239, 466409, 482528, 465279, 480406, 477259, 462926, 469751, 452381, 446916, 464022, 477157, 490046, 487782, 484978, 470419, 458194, 462382, 484664, 507712, 523857, 514311, 515722, 524631, 526562, 506839, 486178, 493470, 513268, 527978, 515759, 503340, 505082, 494334, 476223, 471657, 482453, 486842, 487936, 516920, 524085, 521375, 516465, 518324, 522570, 545206, 545279, 512940, 482957, 470311, 491370, 517340, 525429, 505038, 470571, 478001, 489459, 472526, 476969, 493931, 496759, 508832, 499466, 487348, 477072, 487451, 505694, 499707, 492179, 499013, 499404, 499914, 504506, 511299, 520686, 521306, 515572, 514617, 508844, 490371, 483736, 486381, 497693, 514298, 525363, 513275, 516034, 520807, 521053, 523546, 503496, 492780, 490391, 513732, 545342, 586966, 583220, 567883, 551904]
12791E51904J944Q196n891j1694J1379L69Q100o259j8668J9050J236p251M407
12778E56822j1803P600M278K791J8199P429j8469j4848J662l3873j7220J9333
12766E21901o05r520J0262m713K706J2516O767k114m579l857K634N547J1712L621
12752E52278o680j2219m683P328R474J282N406J0655J2183K392R474j6976l1600
12739E38314n156J4782Q875o940j1223M292K2186r913J0146r962k990l821k697
12726E45893r814Q544l008Q593L214N105J7059o945j4368o920J7315l190k1944
12713E39534J6030J5358j826K3991J4019L432n383j1797j3264J1977j7581p5j8748
12700E55667j4309R786J1132p092J109M903K7679R93J230L255M037j1013k7469
$$ y = [551904, 553848, 562044, 556153, 544459, 555838, 556207, 564307, 558048, 539380, 558430, 559666, 552415, 556822, 545019, 552619, 556897, 559688, 577887, 585316, 566847, 551999, 553661, 519788, 502568, 521901, 521296, 511776, 522038, 517325, 520031, 532547, 539314, 537200, 532621, 528764, 531398, 536945, 548657, 552278, 545598, 533379, 528696, 536024, 545498, 546780, 552186, 562841, 575024, 577416, 586890, 569914, 538314, 533158, 547940, 556815, 549875, 538652, 542944, 565130, 555217, 565363, 555401, 552411, 548590, 545893, 536079, 544623, 541615, 550208, 553422, 558527, 575586, 568641, 554273, 547353, 564668, 561478, 539534, 555564, 570922, 569096, 593087, 607106, 610538, 605155, 593358, 580094, 592071, 574490, 574415, 555667, 541358, 551144, 562276, 555184, 556293, 561196, 588875, 589868, 591098, 594353, 598390, 587377, 559908]
12687E59908m366J0959P603k51K116r788r677K642J8715k985P957N602j3594m881
12673E69960P045J1417N221k0050j1259J6944J234j9196K622R060K737j011j3326
12660E61398K7246N08j8478j6007Q69o95J0290M6938K2744l0895m909q877N767
12647E95899K1975K252q573j6492Q752k905J91o810j650J3042n051M364L2298
12634F37292K013J0921k0078N565J3390m096k5228j908J3776j4153j0692l975
12622F02827j8644n676o150o298J0665O906J7871p208Q568R17J0855J909K249
12609F18791N858K4626n853j4286p85j3365j0825m135l410j4742p205M907p88
12596E78788J4145O196p264k484R035p106J3247K3525o928j8116J9134K6276L462
$$ y = [559908, 555542, 566501, 574104, 573853, 575969, 566181, 556504, 559146, 577861, 574876, 582833, 588435, 574841, 569960, 577005, 588422, 593643, 573593, 562334, 579278, 580512, 561316, 563938, 572998, 575735, 574724, 561398, 588644, 589152, 570674, 554667, 555536, 554841, 565131, 612069, 634813, 603918, 599009, 590132, 595899, 617874, 620126, 611553, 595061, 603813, 600908, 601099, 594289, 592639, 605681, 600630, 604994, 637292, 639305, 650226, 630148, 635713, 649103, 645007, 619779, 617871, 631647, 617494, 606802, 602827, 584183, 578507, 572357, 566059, 576724, 583630, 601501, 594293, 602861, 603778, 614633, 616542, 618791, 624649, 649275, 643422, 629136, 628351, 614986, 604161, 600026, 596616, 581874, 574669, 579576, 578788, 592933, 599129, 591865, 589381, 598416, 591310, 604557, 628082, 621154, 603038, 622172, 648448, 651910]
12583F51910J7731J2578j7872J3007n646n847J69j3903p828j9350R212L1055p019
12570F58197K919P752M737Q842j8964j4588k710M868N13r314R513J4410j3951
12557F52224j1829j5173K1489K3882k218O592j7113r263L1384J6583j7921q207
12545F70430k7105k3518J808M469K4722J5203j6855k322l034q913L36j5894J9598
12532F38925J8585R547M575P232p776l1179R250J8386j1481p789K505J131N784
12519F57695k725p363K4052J0250l476M193J497j0545j446J942o409k382J6672
12506F81955K9088m251k5098k1252j8505M395l813J8380J0421O391J6060J5782
12494G09553m844O203j2791j6307n061M920l853P504Q125J0406k2618j5753J0761
$$ y = [651910, 669641, 682219, 664347, 677354, 671708, 665861, 666030, 652127, 644299, 624949, 634161, 665216, 658197, 661116, 668868, 673605, 682447, 663483, 648895, 646185, 651053, 651566, 642252, 651765, 666175, 652224, 640395, 625222, 646711, 670593, 668375, 674967, 657854, 648591, 679975, 696558, 678637, 670430, 643325, 619807, 621615, 626084, 650806, 666009, 649154, 646832, 643798, 634885, 635221, 619327, 638925, 657510, 667057, 671632, 678864, 671088, 639909, 649159, 667545, 656064, 648275, 650780, 651911, 657695, 654970, 647607, 671659, 681909, 678433, 682626, 684123, 673578, 672132, 674074, 667665, 665283, 681955, 711043, 706792, 681694, 660442, 641937, 646332, 642519, 660899, 671320, 677711, 693771, 709553, 704709, 710912, 698121, 681814, 676753, 681673, 677820, 685324, 693449, 703855, 681237, 665484, 676245]
12481F76245l203m464j1723K3668r77O014J6239K0598j2949j9532p776K1377Q387
12468G11904o317J4862P39J671R327N340l566m089k411p292j5377k2681o233r414
12454F66463O510J5371K1240j07n670J7921J4486J8965m997m498k682Q7J1512
12441G54601N241k0439j0290K0861R256k6164j3322k8447j5768P636l90J2626
12429F95401J2736K7743J2473m346r516M033M5054R717l0470k3167o123p233M073
12416G30375q586N426J0694M218j8188J6881K0171J5588k1193k0334J5138P148
12404G57338r764p90J5027m507r951K934J0372J68k089J9670j72j8728o983N728
12390G58253J8679N633j0333j5784J2211J8134p00j1642j3562M386p063P984J4855
$$ y = [676245, 673042, 668578, 656855, 680523, 679546, 685560, 701799, 722397, 709448, 689916, 682140, 703517, 711904, 705587, 720449, 721188, 722859, 732186, 737526, 733960, 729871, 727460, 720168, 704791, 682110, 675877, 666463, 672973, 688344, 709584, 709477, 703807, 721728, 736214, 755179, 750182, 745684, 743002, 743089, 754601, 759842, 739403, 729113, 749974, 759230, 733066, 719744, 691297, 675529, 683165, 682775, 695401, 708137, 735880, 748353, 744007, 734491, 738524, 783578, 793295, 762825, 739658, 733535, 726302, 730375, 721789, 727215, 737909, 742127, 723939, 740820, 760991, 776579, 755386, 735052, 750190, 757338, 747574, 746784, 761811, 757304, 747353, 750287, 760659, 760827, 758738, 778408, 778236, 759508, 752525, 758253, 776932, 782565, 772232, 756448, 768659, 786793, 786093, 774451, 760889, 765275, 758212, 766196, 781051]
12377G81051n308j0015r19Q673O246J7947R26j8871m620j039J3573k970O683j806
12363G89551P188q645l3406n92K3699L249r56J3839k1812r514k116k741j0715
12350G47029J1439O815m39n559K2935J9859M828j1526J104k374J4732M661j813
12337H11691n313L093l169p757R345J8317J3721j9335j756Q99j6512l577m116
12324G95531J0759P002j0938j8073L455K7507M0878J1900j3353l305j5508Q589
12312H44444r751j0003j5930n057j0945j1566j044N064J5768J0574r263J6870
12300H19161J0743j2206J0450L866p432j4589J2705K6063k471o762o205k515j4382
12287H16426m599K0783J378j4280n951J0838J8732K849o592R083Q869r277j4290
$$ y = [781051, 775743, 765728, 764809, 773482, 779728, 797675, 798601, 779730, 775110, 774071, 787644, 784674, 791357, 789551, 796739, 788094, 754688, 754096, 777795, 781044, 780088, 793927, 772115, 762601, 760485, 757744, 747029, 758468, 765283, 764844, 759285, 782220, 802079, 806907, 795381, 796485, 794111, 808843, 813504, 811691, 806378, 809471, 806302, 798545, 807890, 826207, 839928, 820593, 818837, 819736, 803224, 799647, 795531, 806290, 813292, 802354, 784281, 787736, 815243, 856121, 868021, 854668, 851363, 835855, 844444, 834693, 824690, 808760, 803703, 792758, 781192, 780148, 785212, 800980, 811554, 802291, 819161, 829904, 817698, 828148, 832014, 824582, 809993, 822698, 848761, 846290, 839528, 833323, 830808, 816426, 811827, 832610, 833988, 819708, 813757, 824595, 843327, 846176, 839584, 848667, 857536, 848259, 833969]
12274H33969M416q730K705m132M082J8674Q33j9576j4642N315j656L863J5895
12261H41016P240l69K2090J5317j0820M472j9049K812J2098n860N024O178o74
12248H79475J3864J1503J3777k5744k1757P179K2439J7906m274J9963j5062j5942
12236I03327O310r223L647J3240j0364J3210p085M594n181K243p67j5567k929
12223H95455J2970K4445K2419k1434k4413r446O03K5981J3255p368l72J4019j4902
12210I31212j8731j1200J1021J0901M603k0977O146K3085j6608j8345L231K5595
12198I29933K677R850j3374K41j4388o260P463J5062K0965J1192k51j9060o398
12185I37652o56q612J1553o311L435P690L818k288K350n62j4862J7845J2329q792
$$ y = [833969, 838385, 829655, 832360, 828228, 832310, 850984, 851817, 832241, 817599, 822914, 821258, 825121, 841016, 848256, 847887, 869977, 885294, 874474, 878946, 859897, 862709, 874807, 868947, 873971, 880149, 879475, 893339, 904842, 918619, 892875, 871118, 878297, 900736, 918642, 914368, 934331, 919269, 903327, 909637, 900414, 904061, 917301, 906937, 920147, 913062, 917656, 912475, 914718, 913951, 898384, 895455, 908425, 932870, 955289, 933855, 909442, 899996, 900599, 926580, 939835, 932467, 932095, 946114, 931212, 912481, 901281, 912302, 923203, 927806, 906829, 912975, 936060, 919452, 901107, 904338, 929933, 932610, 942460, 929086, 929327, 914939, 908679, 916142, 931204, 952169, 963361, 963110, 944050, 937652, 936996, 928384, 939937, 933626, 937061, 944751, 948569, 946281, 948631, 948069, 933207, 951052, 963381, 954589]
12171I54589l265l83J5451P461l502R915j8668p183O228R858p247j3603j0679
12158I38972j32J2451m166j2924J936J6271O845P971J2106K733j8948K488l73
12145I65230O483O51J0722O621K0507J2620j3247j5837j11K0586P267j7208j44
12132A004140N002k555K854j5369J4554n076l131m232m173J0672J7317J94r822
12119A010375o962J7059o782n692p258j8324N077K5799J6791n772K932l424o093
12106A017726J0976O874J1418p988j2799j7082o976K1776n481r12M317Q393M051
12093A034293k460K5669J6223j9058j217j8295P077L312J197j1761M321r45J5740
12080A054096N553j0759L4370R055j7693l1142q720R953J6264J8570j294j6667
$$ y = [954589, 951324, 950941, 966392, 973853, 970351, 980266, 961598, 954415, 960643, 970501, 963254, 949651, 938972, 938840, 951291, 947125, 934201, 936137, 952408, 959253, 967224, 979330, 982063, 963115, 965603, 965230, 971713, 972364, 983086, 989707, 1010214, 1022834, 1009587, 993750, 993639, 1014225, 1021492, 1004284, 1004140, 1009142, 1006587, 1009441, 994072, 1008626, 1003550, 1000419, 996187, 992014, 1002686, 1020003, 1020197, 1010375, 1003413, 1020472, 1013690, 1007998, 1000740, 982416, 987493, 1013292, 1030083, 1024311, 1027243, 1023819, 1017726, 1028702, 1035576, 1046994, 1039006, 1026207, 1009125, 1002149, 1023925, 1018444, 1017532, 1021849, 1030242, 1034293, 1031833, 1057502, 1073725, 1054667, 1053450, 1035155, 1042232, 1045544, 1046741, 1034980, 1039301, 1038356, 1054096, 1059649, 1048890, 1083260, 1092315, 1074622, 1043480, 1034760, 1044713, 1060977, 1079547, 1078253, 1061586]
12068A061586R307K2922J9115N653r454p916N612K0306o298m4120j3182J4808
12056A078339J0864J0659j6668L126K3218N589l188l706n798p127O23j475J590
12043A096046J7004O259r98o518L043k98r596n601J3605J2582j039K2025R61k9306
12029A118169J1801L2879P313l1251P270j7542j5051J988J8889m219k0476r953
12017A099817j7533m799J5633N790O907J7413j932p622J5651J1927P295Q739r236
12004A148050k2002m976l852L0397R324k1740M371J7650Q343l580k450j7686j491
11991A140358M6385O20J162N420J9879j2122j3660J0026J3220j7379k4456n707
11979A163746J3599K4484K5822j0502K661N602J881j3130q903o07l5074j6958
$$ y = [1061586, 1070893, 1093815, 1112930, 1118583, 1109129, 1101213, 1106825, 1127131, 1120833, 1076713, 1063531, 1078339, 1089203, 1099862, 1083194, 1086320, 1109538, 1115127, 1111939, 1108233, 1102435, 1095308, 1095931, 1094456, 1096046, 1113050, 1119309, 1118311, 1111793, 1114836, 1114538, 1104942, 1099341, 1112946, 1125528, 1124489, 1146514, 1147475, 1118169, 1129970, 1162849, 1170162, 1138911, 1146181, 1128639, 1113588, 1115576, 1134465, 1130246, 1109770, 1099817, 1082284, 1077485, 1093118, 1098908, 1105815, 1123228, 1121296, 1113674, 1129325, 1141252, 1148547, 1157286, 1148050, 1126048, 1121072, 1117220, 1147617, 1156941, 1135201, 1139572, 1157222, 1165565, 1161985, 1159535, 1141849, 1140358, 1186743, 1187363, 1188525, 1193945, 1213824, 1201702, 1188042, 1198068, 1211288, 1193909, 1169453, 1163746, 1177345, 1201829, 1227651, 1217149, 1219810, 1225412, 1227293, 1214163, 1205260, 1204653, 1169579, 1152621]
11967A152621j7132J5428K1332J9026J5383J0075K8897K7429j869j4355q134K3286
11955A271987p772l158j2935j822M144P603K662N873q766M347M37M96q860j2866
11941A241370Q998P362k0486k2581q031K0030J7972O213n531K1214p966j3231
11929A245333P281k199N369L0047p351k8173j3592o220K3878J3486P851J4047
11917A289757m320J0390N936j2796L08K5245o297l3610K7326J2589k8161L826
11905A290193n676J6147R3m915j392N862J9458J4894J0487l919j932O718O37k1191
11891A325464j0579J2769K101J6152J9247L076k8322n857L7225J8034m6911r727
11879A332672L2683L0569k9588j3466k63J3568J6898q128j3765K3525K3550J0556
$$ y = [1152621, 1135489, 1150917, 1172249, 1191275, 1206658, 1216733, 1245630, 1273059, 1271190, 1256835, 1248701, 1271987, 1264215, 1261057, 1248122, 1246300, 1250444, 1258047, 1260709, 1266582, 1257816, 1262163, 1262600, 1263096, 1254236, 1241370, 1250368, 1257730, 1237244, 1214663, 1206632, 1226662, 1244634, 1250847, 1245316, 1266530, 1258564, 1245333, 1252614, 1250415, 1255784, 1285831, 1278480, 1250307, 1236715, 1230495, 1254373, 1267859, 1275710, 1289757, 1285437, 1295827, 1301763, 1288967, 1289275, 1314520, 1308223, 1274613, 1301939, 1314528, 1286367, 1290193, 1284517, 1300664, 1300757, 1295842, 1294450, 1300312, 1319770, 1334664, 1345151, 1341232, 1339300, 1346018, 1346655, 1325464, 1314885, 1327654, 1329755, 1345907, 1365154, 1368230, 1339908, 1334051, 1371276, 1389310, 1342399, 1332672, 1365355, 1395924, 1366336, 1352870, 1352607, 1366175, 1383073, 1374945, 1361180, 1384705, 1408255, 1418811]
11867A418811J0749O349k2382J0142K0040j9407j9458m085N52l34Q670K21k37
11854A409631J5646n778Q071J038P285K818q209j1504j654J2765N867j0951j886
11841A423139j055L049j1084O129K7604L438q330Q214M868O680Q381J0202n863
11828A475372j1392m246N511K1983N762r928K089l276J828J0057j8431q666j113
11815A465550o283K574K7517L339q66Q845k053n271K6380J3246J8576R49q298
11802A544205R87k5134r191q80j104K7550K2526K485j9253m305J4745O553o051
11789A553133J31K228J140r439k5004p17K0830J5776J2869k532o808j0666j1508
11776A539433n406K5993M686J6021J0169m530K575k0146J1523K1254L817p156
$$ y = [1418811, 1429560, 1435909, 1413527, 1423669, 1443709, 1424302, 1404844, 1400759, 1401311, 1400977, 1409647, 1409868, 1409631, 1425277, 1419499, 1427570, 1428608, 1435893, 1438711, 1430502, 1418998, 1417344, 1430109, 1435976, 1425025, 1423139, 1422084, 1425133, 1414049, 1420178, 1447782, 1451220, 1442890, 1451104, 1455972, 1462652, 1471033, 1481235, 1475372, 1463980, 1459734, 1465245, 1487228, 1492990, 1483062, 1485151, 1481875, 1483703, 1493760, 1475329, 1466663, 1465550, 1459267, 1461841, 1489358, 1492697, 1491831, 1500676, 1498623, 1493352, 1519732, 1532978, 1551554, 1552503, 1544205, 1545192, 1520058, 1510867, 1509987, 1508883, 1536433, 1558959, 1561444, 1542191, 1537886, 1552631, 1559184, 1553133, 1553264, 1555492, 1556632, 1547193, 1522189, 1521472, 1542302, 1558078, 1570947, 1568415, 1561607, 1550941, 1539433, 1534027, 1560020, 1564706, 1580727, 1590896, 1586366, 1588941, 1568795, 1580318, 1601572, 1605389, 1598233]
11764A598233j0870R365L4777L3203N986J0895k112j6496o470J9597j4197J0657
11752A672568J3890j3119p468J0647m456k2605k2854m551K5704J0181o599J2954
11740A664292O791o630j5117k309Q462R590O305l056J3964K0134J4364k0922N344
11727A701212k752j253Q693R927P347K3287J3174n434Q101l880j7541n064J5609
11714A751426j005J0131K378J7329l354q270J1743J7474K2217k719R50Q573r756
11701A817117J2531P162k0962j2636J6478j2538k4054J4322K3987J2210K2826
11690A856443j4031N327J3264j7852q34K125R268J6341j1388L885j7431l005J1217
11677A853329Q899J035n905J9552m33j98j3991r320J3668K9351K4022R031j9750
$$ y = [1598233, 1587363, 1596728, 1631505, 1664708, 1670694, 1681589, 1679477, 1662981, 1656511, 1676108, 1661911, 1672568, 1686458, 1673339, 1665871, 1676518, 1672062, 1649457, 1626603, 1622052, 1647756, 1657937, 1651338, 1664292, 1671083, 1664453, 1649336, 1647027, 1655489, 1665079, 1671384, 1668328, 1682292, 1702426, 1716790, 1695868, 1701212, 1698460, 1697207, 1705900, 1715827, 1723174, 1746461, 1759635, 1754201, 1762302, 1758422, 1740881, 1735817, 1751426, 1750421, 1760552, 1762930, 1780259, 1776905, 1768635, 1780378, 1797852, 1820069, 1817350, 1818300, 1826873, 1817117, 1829648, 1836810, 1815848, 1803212, 1819690, 1807152, 1783098, 1797420, 1821407, 1833617, 1856443, 1842412, 1847739, 1861003, 1843151, 1842317, 1844442, 1853710, 1870051, 1858663, 1862548, 1845117, 1842112, 1853329, 1862228, 1863263, 1857358, 1876910, 1876477, 1876279, 1862288, 1852968, 1866636, 1895987, 1920009, 1929040, 1909290]
11664A909290n028L5471k3587k0415l973p295J0586K855l324r184L9555K6548
11652A951499P007q867N058K216J3913j413q919p559j137J1418J6589L3994K0068
11639B033867n928J0467k9521K831J6128k524R953J524k0630M020R832K799J309
11626B034127L350J4916J1678J7686r409M108p137j0532J4191P621K0565J1298
11614B112462l160j944o426j03j5699O766K8874J3215n685R954J4180P885J5152
11601B175471j871m159o755J829J7991J7791J00r953K233K0807j1886l973K2228
11588B219853K3134L752J0553J702j0795j2057l331J2239N96M314j57k3400J423
11575B227826L1220L5439J4882k1150k2185K6919K4231j945j2234o142J2873K876
$$ y = [1909290, 1904262, 1939733, 1916146, 1895731, 1891758, 1884463, 1895049, 1897904, 1894580, 1885396, 1924951, 1951499, 1958506, 1949639, 1954697, 1956913, 1970826, 1969413, 1960494, 1952935, 1951798, 1963216, 1979805, 2013799, 2033867, 2027939, 2038406, 2008885, 2011716, 2027844, 2025320, 2035273, 2036797, 2016167, 2020187, 2030019, 2032818, 2034127, 2037477, 2052393, 2064071, 2081757, 2072348, 2076456, 2069319, 2058787, 2072978, 2080599, 2101164, 2112462, 2109302, 2107358, 2100932, 2100829, 2085130, 2091896, 2120770, 2133985, 2128300, 2138254, 2152434, 2160319, 2175471, 2173600, 2169441, 2162686, 2164515, 2182506, 2200297, 2200397, 2190444, 2192677, 2213484, 2201598, 2197625, 2219853, 2242987, 2246739, 2257292, 2258994, 2248199, 2236142, 2232811, 2245050, 2245646, 2249960, 2249803, 2226403, 2227826, 2259046, 2294485, 2309367, 2288217, 2266032, 2292951, 2317182, 2315237, 2303003, 2296861, 2309734, 2312610]
11563B312610J481K1829J4488J0551r42j2935P572n41Q08J1931O359P583L4776
11550B415570J4998J3301j8683Q974p515j0572M480Q376J4027J2957O418k321
11538B460010J2139M531M526J793n65J5951N414J2019P943p957r472J1564K0598
11525B538494J7677K1956N747J4333n08K2038L3737K5854M5179K0416j3698k1526
11513B709699j5184r642N232R566J134O085M699L4188K2717P533o572n678K995
11500B766772o336R730J4280N039L7290J9861k041K02K4839K3992Q858J0569j5
11487B913040R57J8722M0157J6543N704J9001L6397J7225p536o700J1700M1542
11475C106752O2975M6581N7256N0138K9334J0427K2543M5010N0323R7999J18921
$$ y = [2312610, 2314091, 2335920, 2350408, 2360959, 2360017, 2347082, 2354654, 2354113, 2354921, 2366852, 2373211, 2380794, 2415570, 2430568, 2443869, 2425186, 2434160, 2426645, 2416073, 2420553, 2428929, 2442956, 2455913, 2462331, 2460010, 2472149, 2476680, 2481206, 2482999, 2482434, 2498385, 2503799, 2515818, 2523761, 2515804, 2506332, 2517896, 2538494, 2556171, 2578127, 2583874, 2598207, 2597699, 2619737, 2653474, 2679328, 2724507, 2744923, 2731225, 2709699, 2694515, 2684873, 2690105, 2699671, 2700805, 2706890, 2711589, 2745777, 2768494, 2776027, 2769455, 2763777, 2766772, 2760436, 2770166, 2784446, 2789485, 2826775, 2846636, 2844595, 2844797, 2869636, 2893628, 2902486, 2913055, 2913040, 2913997, 2932719, 2972876, 2989419, 2995123, 3014124, 3050521, 3067746, 3060210, 3053510, 3065210, 3106752, 3169727, 3216308, 3273564, 3323702, 3353036, 3363463, 3386006, 3431016, 3481339, 3579338, 3698259]
11464C698259J23629J38858J99395J36788j22923o13214q80485p28581l03328
11455A648398K6945J22340J04363J32887J37331Q1053O3549O7775Q2053O3196
11445B529890J4338K2267K3613L6084L1444M5335L9144k3865K999L9345L6613
11434B797207J7180q59K2294L3645K7969K6281m760Q206L6178L3592P816K2294
11422C027043J5983J0966P73n98L4243K5555m077Q370k523j770O155q947J5787
11409C126960K4071J6458K463J6723L0778J9998K0439K2989m603m042L2812K3002
11397C328048J2475L35j843Q529J1980K5737M272K4578r94O680N0917M3471k72
11384C513913q758M827m127P947L1288J9197O469R443K1845J3623J1839K1699
$$ y = [3698259, 3821888, 3960746, 4160141, 4296929, 4174006, 3560792, 2680307, 1951726, 1648398, 1675343, 1797683, 1902046, 2034933, 2172264, 2253317, 2316866, 2384641, 2466694, 2529890, 2544228, 2566495, 2590108, 2626192, 2657636, 2702971, 2742115, 2718250, 2721249, 2760594, 2797207, 2814387, 2813528, 2835822, 2869467, 2897436, 2923717, 2918957, 2927163, 2963341, 2996933, 3004749, 3027043, 3043026, 3053992, 3054765, 3054167, 3088410, 3113965, 3109888, 3118258, 3115735, 3113965, 3120120, 3111173, 3126960, 3151031, 3167489, 3169952, 3186675, 3217453, 3237451, 3257890, 3280879, 3276276, 3272234, 3305046, 3328048, 3340523, 3340858, 3339015, 3347544, 3359524, 3385261, 3389533, 3414111, 3413117, 3419797, 3470714, 3514185, 3513913, 3505155, 3509982, 3505855, 3513802, 3545090, 3564287, 3570756, 3580199, 3602044, 3615667, 3627506, 3649205]
11372C649205K9961R154r799P904J0849L3675K9266J1096J8654K2381L8332K2229
11360C872907K3773p956j3498j710o497M84J1554J6541J4049K7293N197J3226
11348C955363Q512J1780J0925J9357K4579J9317K1818M1765Q658L091M441K2800
11336D152406P835O939K7235L2073K2716J6938K264j1046R084J0311J758J5390
11324D293903K737Q633o65J7839K2321L0605K2835J8320j182K5718L9624L1829
11312D512517K4379L2439L2048m179j08j0833k2716J1472M3873J8972M628M3884
11300D686376N0127J0570j1710p910M0649K7410K7401K2415K0621M9046O829J718
11288D923542K2529L4938M5872L0062M2120K2484Q471L0523L8152K7731q341K1385
$$ y = [3649205, 3679166, 3688320, 3678521, 3686425, 3697274, 3730949, 3760215, 3771311, 3789965, 3812346, 3850678, 3872907, 3896680, 3888724, 3875226, 3873516, 3867019, 3867503, 3879057, 3895598, 3909647, 3936940, 3942137, 3955363, 3963875, 3975655, 3986580, 4005937, 4030516, 4049833, 4071651, 4113416, 4122074, 4125165, 4129606, 4152406, 4160241, 4167180, 4194415, 4226488, 4249204, 4266142, 4268406, 4257360, 4266444, 4276755, 4278513, 4293903, 4296640, 4305273, 4304608, 4322447, 4344768, 4375373, 4398208, 4416528, 4415346, 4441064, 4480688, 4512517, 4536896, 4569335, 4601383, 4597204, 4597096, 4586263, 4563547, 4575019, 4618892, 4637864, 4642492, 4686376, 4736503, 4747073, 4735363, 4727453, 4768102, 4795512, 4822913, 4845328, 4865949, 4914995, 4921824, 4923542, 4946071, 4981009, 5026881, 5056943, 5099063, 5121547, 5130018, 5160541, 5198693, 5226424, 5218083, 5239468]
11276E239468J1709l539K2548K0972L4146K1530M4572M7428K6414K3899J1729
11265E500876K3361L6581K6358L1135M8647L4478L2038K9223L6328L9220J9823
11254E858068K4534K9027L8903J1114K4843O8730O4372N5849P3124Q1844M2229
11243F372637L8561O0535O2799L131r2700j77935j61175n9769L2985R8611J02438
11232F280118P0323N2022M2115N2567P2296M1241K1855O9660O3466L8371M4443
11221F848477M6208N4647N0650P3340O1889N3233N5697K0095K2213M8657O0332
11210G395438M9602J7028P074j3235m4015k3990K5700P1757J26783J06848Q9196
11199G808186Q1972P5426R5153J15243J03919R8864J27010J12259P0711L9115
$$ y = [5239468, 5251177, 5247638, 5270186, 5291158, 5325304, 5346834, 5391406, 5438834, 5465248, 5489147, 5500876, 5524237, 5560818, 5587176, 5618311, 5666958, 5701436, 5733474, 5762697, 5799025, 5838245, 5858068, 5882602, 5911629, 5950532, 5961646, 5986489, 6055219, 6119591, 6175440, 6248564, 6330408, 6372637, 6411198, 6471733, 6534532, 6537663, 6444963, 6267028, 6105853, 6046084, 6079069, 6177680, 6280118, 6350441, 6402463, 6444578, 6497145, 6569441, 6610682, 6632537, 6702197, 6765663, 6804034, 6848477, 6894685, 6949332, 6999982, 7073322, 7135211, 7188444, 7244141, 7264236, 7286449, 7335106, 7395438, 7445040, 7462068, 7469142, 7455907, 7411892, 7387902, 7413602, 7485359, 7612142, 7718990, 7808186, 7890158, 7965584, 8060737, 8175980, 8279899, 8378763, 8505773, 8618032, 8688743, 8727858]
11189H727858j6253k9434k6309l4027K3307P2776P0279M3545K9188J8999L5068
11178H914997O0211P1558J21977J34829J00208P4907J15595J71256J92149J38555
11168A0096242R6606O3786O4317P7313R1162Q9375P0964Q4265R7874O5371Q1374
11157A0978649R0967J20084J39592J46898J29741Q4006R8790J07155J18573J53187
11147A2167642J52415J13500R5339R7125J38312J31117J41406J48563J55865J55823
11137A3497107J70714J60200J37584J61618J79278J94603J99576J79400J91614
11128A5071694J68492J94875J90995K11794K13325J82630J77006K25113K49819
11119A6885743K59574K33739K45036K68448L08709K93340L17235L40612L36866
$$ y = [8727858, 8711605, 8682171, 8655862, 8621835, 8645142, 8717918, 8788197, 8831742, 8860930, 8879929, 8914997, 8975208, 9046766, 9168743, 9303572, 9403780, 9478687, 9594282, 9765538, 9957687, 10096242, 10192848, 10256634, 10320951, 10398264, 10489426, 10578801, 10649765, 10734030, 10831904, 10897275, 10978649, 11069616, 11189700, 11329292, 11476190, 11605931, 11689937, 11788727, 11895882, 12014455, 12167642, 12320057, 12433557, 12528896, 12626021, 12764333, 12895450, 13036856, 13185419, 13341284, 13497107, 13667821, 13828021, 13965605, 14127223, 14306501, 14501104, 14700680, 14880080, 15071694, 15240186, 15435061, 15626056, 15837850, 16051175, 16233805, 16410811, 16635924, 16885743, 17145317, 17379056, 17624092, 17892540, 18201249, 18494589, 18811824, 19152436, 19489302]
11110A9489302L30973L30328L22553L54732L50605L81257M03547M00544M08262
11101B2772103L89722M33570M68473M99950N34320N65088N78912N98181O05543
11092B7445862O59898P06852P47899P67725P74028Q17974Q66083Q71208Q81238
11083C4538767R28162J018036J106091J227622J344500J433437J531837J606079
11075D4734531J755773J969429K186308K382340K395424K133178J870897J981153
11067F1409033K186136K453898L039120L956324M780002N170619N584089O544307
11059I5123528P980135R735054J1771117J4266815J7492459K1852355K7259622
11052B05481085L1851410K6108795j7823017j10119038j65931786j40414735o6625343
$$ y = [19489302, 19820275, 20150603, 20473156, 20827888, 21178493, 21559750, 21963297, 22363841, 22772103, 23161825, 23595395, 24063868, 24563818, 25098138, 25663226, 26242138, 26840319, 27445862, 28105760, 28812612, 29560511, 30328236, 31102264, 31920238, 32786321, 33657529, 34538767, 35466929, 36484965, 37591056, 38818678, 40163178, 41596615, 43128452, 44734531, 46490304, 48459733, 50646041, 53028381, 55423805, 57556983, 59427880, 61409033, 63595169, 66049067, 69088187, 73044511, 77824513, 82995132, 88579221, 95123528, 103103663, 112838717, 124609834, 138876649, 156369108, 178221463, 205481085, 237332495, 263441290, 245618273, 135499235, -30432551, -170847286, -237472629]
11045b37472629j612168K3009961K5495438K2165767J8425472J5407226J3041555
11038a21539378J1106048R224914P336828N874560N140810M900969M566021L790838
11030f9598390L078931K803534K681886K266473J821697J689749J821220J942119
11022e1492781J919345J822926J709043J607908J476121J347412J265897J244447
11014c9099682J225950J186582J147756J052134R83264R28815Q50332P94937P33549
11005c0196363O80191O63588O22366O16526N86662N31018N30684N17791M97729
10996b4949808N19704M91496M74397M29230M39638M06689L59680L81182L95161
10987b1052631L72586L08006K72056K95456K82220K77132K70305K74423K68675
$$ y = [-237472629, -239084797, -216074836, -190579398, -168413631, -149988159, -134580933, -121539378, -110433330, -101208416, -93871588, -87997028, -82856218, -77955249, -73389228, -69598390, -66519459, -63715925, -61034039, -58767566, -56945869, -55256120, -53434900, -51492781, -49573436, -47750510, -46041467, -44433559, -42957438, -41610026, -40344129, -39099682, -37873732, -36687150, -35539394, -34487260, -33503996, -32575181, -31724849, -30929912, -30196363, -29516172, -28852584, -28230218, -27613692, -27027030, -26496012, -25965328, -25447537, -24949808, -24430104, -23938608, -23464211, -23034981, -22595343, -22188654, -21828974, -21447792, -21052631, -20680045, -20372039, -20099983, -19804527, -19522307, -19245175, -18974870, -18700447, -18431772]
10978a8431772K48875K73014K46362K43213K56180K31380K38832K21554K23373
10969a6248989K23253K30067J91743J73608J89281K12763J77533J51897J59418
10960a4539426J57744J33135J31844J33949J27213J49511J55013J84853J63311
10951a3202853J32710J44632J24624J03887J37372J26993J16839J16609J24141
10942a2075046J28513J14729Q7625R3813R8766J07961J20773J31598J10947J01650
10932a0978671J04417J05118Q8333J00589Q5195Q8167N7518K2882L2415N1175
10922a0242862K6038M2917L7854L9102P3273J13428R3284Q4120Q0581M8193J2815
10911i591257L0774Q8226J43628J71875J45806Q4447N3071O9780P7784M2068J4309
$$ y = [-18431772, -18182897, -17909883, -17663521, -17420308, -17164128, -16932748, -16693916, -16472362, -16248989, -16025736, -15795669, -15603926, -15430318, -15241037, -15028274, -14850741, -14698844, -14539426, -14381682, -14248547, -14116703, -13982754, -13855541, -13706030, -13551017, -13366164, -13202853, -13070143, -12925511, -12800887, -12697000, -12559628, -12432635, -12315796, -12199187, -12075046, -11946533, -11831804, -11744179, -11650366, -11551600, -11443639, -11322866, -11191268, -11080321, -10978671, -10874254, -10769136, -10680803, -10580214, -10495019, -10406852, -10349334, -10326452, -10294037, -10242862, -10216824, -10173907, -10136053, -10096951, -10023678, -9910250, -9816966, -9732846, -9652265, -9604072, -9591257, -9560483, -9472257, -9328629, -9156754, -9010948, -8926501, -8873430, -8803650, -8725866, -8683798, -8669489]
10900h669489J0038J9100M8751K7995M6484m179k9417j05O0580R9814J11248J10355
10888h168825R3901P2184P0795O1961O0717M6976K6125M1156O3000N0051K7562
10877g554397K6480L2764L7175M3148M3100J3500K0893L3194K6811K0947J8658
10866g237727M0538N2250J3577J2903k2177Q722O4938J73669K30421J56659R4372
10855f411855J3405K0107R674K0747K0234M959N978J1384J6986L0311L4938L1653
10843f191479K6542L6626M2983L1367J7045R227L2451L4907L9354K1424M1678
10832e857875K4631J7417K3735K4901K3965K4308M0218J6133K3139J2212K2699
10821e604517l984J0170L4858L7548M3452K5436K0568K6554L9561K8921J5947
$$ y = [-8669489, -8659451, -8640351, -8591600, -8563605, -8517121, -8521300, -8550717, -8550822, -8490242, -8390428, -8279180, -8168825, -8074924, -8002740, -7931945, -7869984, -7809267, -7762291, -7736166, -7695010, -7632010, -7581959, -7554397, -7527917, -7495153, -7457978, -7414830, -7371730, -7358230, -7337337, -7304143, -7277332, -7256385, -7237727, -7197189, -7144939, -7131362, -7118459, -7140636, -7131914, -7066976, -6893307, -6662886, -6506227, -6411855, -6398450, -6378343, -6368669, -6347922, -6327688, -6322729, -6316751, -6305367, -6288381, -6258070, -6223132, -6191479, -6164937, -6128311, -6085328, -6053961, -6036916, -6027689, -5995238, -5960331, -5920977, -5899553, -5857875, -5833244, -5815827, -5792092, -5767191, -5743226, -5718918, -5678700, -5662567, -5639428, -5627216, -5604517, -5608501, -5598331, -5563473, -5525925, -5482473, -5457037, -5436469, -5409915, -5370354, -5341433, -5325486]
10810e325486K784K2181M0890K7040J9585K5053J1677p484L0876K9715J9146L2971
10798e071052J0087J8998J5702P813J4563J9588K0034J8556K0409L6868J9469
10787d868965p381J6175K9058J1580m392K7884L5191k436L4243L0226P515L8228
10775d653074K6748J4309K2292m486J307J0232M203J9232J4046K4302J5273J9020
10763d486596J5705m951n643J2766J2572K5259M1889N7828J5366n22o347j4526
10751d337200K5823K4909K4455K3468J0337J8107L78l614K1908L0064J8282J3531
10739d129552L4336M9344L3607k637r964l255r761J4213K4917J8416J7019J2698
10727c950619K199k109J6928J9385L1751O470J5344L419K2223J1483J5571k629
$$ y = [-5325486, -5322702, -5300521, -5259631, -5232591, -5213006, -5187953, -5176276, -5183760, -5152884, -5123169, -5104023, -5071052, -5060965, -5041967, -5026265, -5018452, -5003889, -4984301, -4964267, -4945711, -4925302, -4888434, -4868965, -4876346, -4860171, -4831113, -4819533, -4823925, -4796041, -4760850, -4763286, -4729043, -4698817, -4691302, -4653074, -4626326, -4612017, -4589725, -4594211, -4592904, -4582672, -4578469, -4559237, -4545191, -4520889, -4505616, -4486596, -4470891, -4475842, -4481485, -4468719, -4456147, -4430888, -4388999, -4331171, -4315805, -4316327, -4322674, -4337200, -4311377, -4286468, -4262013, -4238545, -4228208, -4210101, -4209723, -4213337, -4191429, -4161365, -4143083, -4129552, -4095216, -4045872, -4012265, -4014902, -4024866, -4028121, -4037882, -4023669, -3998752, -3980336, -3963317, -3950619, -3948420, -3950529, -3933601, -3914216, -3882465, -3875995, -3860651, -3857232, -3835009, -3823526, -3807955, -3810584]
10715c810584P638K3830j66O797J3115J9021J0142J1914J025P235J6715J5028
10703c678290R422J169K501K7587J3037K4792J7749L487O299J0650p897K2075
10691c547419L8015O644Q614J3353K4475J7424Q437J5548K030O552k932K1459
10679c387800k013J8701J7406N213J5591K6733L9694p648j2282K7354J8565o493
10667c246979k698M183J8338K9488L0960J5326j0546N674K2530J5303J3053M2377
10655c062991L0056K5012J6489L939K6888N0132L8222L5730K6590J8142L4174
10644b757617M6636Q5761O3093P3328J00726R2124J20828J50343J78109J14844
10634a731825j83779o95948q89414o65100k61708M9201J35011J47786J18132R0471
$$ y = [-3810584, -3802946, -3779116, -3779282, -3772485, -3759370, -3740349, -3730207, -3718293, -3717268, -3710033, -3693318, -3678290, -3668868, -3667699, -3665198, -3637611, -3624574, -3599782, -3582033, -3578546, -3572247, -3561597, -3569494, -3547419, -3509404, -3502760, -3494146, -3480793, -3456318, -3438894, -3430457, -3414909, -3412879, -3406327, -3409259, -3387800, -3389813, -3371112, -3353706, -3348493, -3332902, -3306169, -3266475, -3274123, -3286405, -3259051, -3240486, -3246979, -3249677, -3245494, -3227156, -3197668, -3166708, -3151382, -3161928, -3156254, -3133724, -3118421, -3105368, -3062991, -3032935, -3007923, -2991434, -2987495, -2960607, -2910475, -2872253, -2836523, -2809933, -2791791, -2757617, -2710981, -2625220, -2562127, -2488799, -2388073, -2295949, -2175121, -2024778, -1846669, -1731825, -1915604, -2611552, -3500966, -4166066, -4427774, -4378573, -4243562, -4095776, -3977644, -3887173]
10624c887173Q5007R4561O7118O5483M0400L0070K9676N0229M4287J5753N880
10613c358709K9519M1121K418P458K0550J5451j639P833K3388j000L6960K7550
10601c149100Q938K315k720R110Q692J5635K8279J5710J4480l948q74p094L804
10588c056773Q79J3673J9378K3560L1151L8750M0244K5403J6600J1996k5318j6214
10576b876671M433j0294J0106N891K0540j7630k9524o51K0513K8498K6744O937
10564b811108J5574M415J9362K8111K1696k1175j3037k3280K1764J8813J4994
10553b723871R7j487J0280J7672J2024J2456P13Q544J0241J1903o438r359J5840
10540b641385Q017q097P575J1760q169j7844q606N359N697J3971N480J4810Q705
$$ y = [-3887173, -3802166, -3707605, -3640487, -3575004, -3534604, -3504534, -3474858, -3424629, -3380342, -3364589, -3358709, -3329190, -3288069, -3285651, -3278193, -3257643, -3242192, -3243831, -3235998, -3212610, -3213610, -3176650, -3149100, -3140162, -3137847, -3140567, -3131457, -3122765, -3107130, -3078851, -3063141, -3048661, -3052609, -3053483, -3060577, -3056773, -3055894, -3042221, -3022843, -2999283, -2968132, -2929382, -2889138, -2863735, -2847135, -2835139, -2860457, -2876671, -2872238, -2882532, -2872426, -2866535, -2845995, -2863625, -2893149, -2893800, -2873287, -2844789, -2818045, -2811108, -2795534, -2791119, -2771757, -2743646, -2721950, -2743125, -2756162, -2779442, -2757678, -2738865, -2723871, -2723774, -2725261, -2714981, -2697309, -2685285, -2672829, -2672116, -2663572, -2653331, -2641428, -2647866, -2657225, -2641385, -2633368, -2641465, -2633890, -2622130, -2630299, -2648143, -2656749, -2651390, -2645693, -2631722, -2626242, -2611432, -2602727]
10527b602727J7806J0306J2767K4029N429m149J966j82j4797P002K1495K5306
10515b495749p360j4374L642J7891J790j4118J3787K189j6349m737K5495J8687
10503b469206R569L720r694q823M553J3138L984J5064J3583l637j081N751Q983
10490b414096Q116p45r209P173j488k553P257j705k292o359J1623P702l209J515
10476b398270O973q35m840J4397J2517L1496J1198J1886R51J0534j497q81k211
10463b308582n388j6767J6705L6697P038j7893Q584O295R140J3464o618J0149
10451b247176r470P484M368L0623j3617j1260K8855K1911r058j1745j6723k85
10439b226093K8493L2325k2746j600M096M877J2345k146n911M245J630j5348N244
$$ y = [-2602727, -2584921, -2574615, -2561848, -2537819, -2532390, -2536539, -2534573, -2534755, -2549552, -2542550, -2521055, -2495749, -2503109, -2517483, -2513841, -2495950, -2494160, -2508278, -2494491, -2492302, -2508651, -2513388, -2487893, -2469206, -2459637, -2455917, -2465611, -2474434, -2469881, -2456743, -2452759, -2437695, -2424112, -2427749, -2428830, -2423079, -2414096, -2405980, -2406725, -2415934, -2408761, -2410249, -2412802, -2405545, -2407250, -2409542, -2415901, -2404278, -2396576, -2399785, -2398270, -2391297, -2392132, -2396972, -2382575, -2370058, -2338562, -2327364, -2315478, -2314527, -2303993, -2305490, -2306371, -2308582, -2313970, -2330737, -2314032, -2277335, -2270297, -2288190, -2279606, -2273311, -2264171, -2250707, -2257325, -2247176, -2256646, -2249162, -2244794, -2214171, -2227788, -2239048, -2210193, -2188282, -2197340, -2209085, -2225808, -2226093, -2197600, -2165275, -2188021, -2189621, -2185525, -2180648, -2168303, -2170449, -2176360, -2172115, -2170485, -2185833, -2180589]
10426b180589N720N230q952J4156J9154L257j6680j1710K6675L198N151R919K0535
10413b104936J4370J0027L2042p849k0136j1305m591Q161j3230j9224M828K0683
10401b091160K8100o296k1761J407p997l847R758M2165R174q514O386J2178M136
10388b026271J5931K407o475m495j4112J474j3482P550Q89O904N950K1737n424
10375b007417L945j0830j820r988r696K221M811P513j0269K7571K9961J6405l0705
10362a988298k2193M08K1680K2041J0715n130j8088j454J1747J119J8150l162
10350a952465J7933j211J7517q91J115L550J7186M850O255L161n057O748J9294
10337a862015P835q291j6870n165j6095n008K4521J3278J1376j0729o591K2972
$$ y = [-2180589, -2174869, -2169639, -2178591, -2164435, -2145281, -2142024, -2158704, -2170414, -2143739, -2140541, -2135390, -2125471, -2104936, -2090566, -2080539, -2048497, -2056346, -2076482, -2087787, -2092378, -2084217, -2097447, -2116671, -2111843, -2091160, -2063060, -2069356, -2091117, -2089710, -2097707, -2101554, -2091796, -2049631, -2040457, -2048971, -2042585, -2030407, -2026271, -2010340, -2007933, -2014408, -2018903, -2033015, -2031541, -2045023, -2037473, -2036584, -2029680, -2023730, -2001993, -2007417, -2003472, -2014302, -2016122, -2026110, -2035806, -2033585, -2028774, -2021261, -2031530, -2003959, -1973998, -1957593, -1988298, -2010491, -2010083, -1988403, -1966362, -1955647, -1960777, -1978865, -1980319, -1968572, -1967453, -1949303, -1952465, -1934532, -1935743, -1918226, -1919117, -1918002, -1914452, -1897266, -1892416, -1886161, -1883000, -1888057, -1881309, -1862015, -1854180, -1862471, -1879341, -1884506, -1900601, -1905609, -1881088, -1867810, -1856434, -1867163, -1873754, -1850782]
10325a850782K3425J0553j6338n443J0446j088r451J1433M123j976j1j9332M20
10312a844021K5728J1045J518k007k394n657n069J390J4928j3495q773L597J2294
10299a810916j917M351K9902K1588j0261k0618l126N258J2811M021P125J2053
10287a749729m892j470p17J913N009k0279j5230K4017K2254O18j7561L85Q355
10274a747327J9643R959O411n743j7586j2130l495J1542M981J8426J1561l4431
10262a738189l038J0176J9170O058J5994K6425n868q757o622k2639N361L89J1327
10249a690213J9852N747j6290m621J220N369K1242K1480j4859L34k592k9329Q274
10236a674386Q147J4349K543M516k330r079k350o255l57o360J6619J9648J4960
$$ y = [-1850782, -1827357, -1816804, -1833142, -1838585, -1828139, -1829227, -1838678, -1827245, -1823122, -1825098, -1825109, -1844441, -1844021, -1818293, -1807248, -1805730, -1807737, -1810131, -1815788, -1820857, -1819467, -1804539, -1818034, -1826807, -1823210, -1810916, -1812833, -1808482, -1778580, -1756992, -1767253, -1787871, -1790997, -1785739, -1772928, -1768907, -1761782, -1749729, -1754621, -1756091, -1756808, -1754895, -1749886, -1770165, -1785395, -1761378, -1739124, -1738506, -1756067, -1755682, -1747327, -1727684, -1717725, -1711314, -1717057, -1734643, -1746773, -1750268, -1738726, -1733745, -1715319, -1703758, -1738189, -1741227, -1731051, -1711881, -1705823, -1689829, -1663404, -1669272, -1678029, -1684651, -1707290, -1701929, -1701540, -1690213, -1670361, -1664614, -1680904, -1685525, -1684305, -1678936, -1657694, -1636214, -1651073, -1650739, -1653331, -1682660, -1674386, -1666239, -1651890, -1649347, -1644831, -1647161, -1656240, -1658590, -1664845, -1665202, -1671562, -1654943, -1635295, -1620335]
10223a620335k165L363l080n04J6513P578J621j6985j7651n660Q65J6272J3022
10210a607146n496J3977N106j2598k928m11J182j4114q773R875K3599O839o95
10197a591583K54K441j375M325K0942j2059j2727N2J7896J3053J5747j256k2758
10184a567048j1455J3840Q584r591J2440o458O816j0844m827O982p710N515R181
10171a554575J5947P984M842J8767k081j1776p571j0445K5523m342k5010k034
10159a544771K1195J9841p023j887k781m416n716m880K2614J4633k5972j0762
10147a529925K9007J6638P02k583R139n346m390Q362J9373k4782j3266K3313K1806
10134a451952O270K30J2132Q731L068j7861j7923n709q486P151J2590J9930L6744
$$ y = [-1620335, -1622500, -1619137, -1622217, -1622721, -1606208, -1598630, -1597009, -1613994, -1631645, -1637305, -1636440, -1620168, -1607146, -1612642, -1598665, -1593559, -1606157, -1609085, -1609496, -1608314, -1622428, -1631201, -1621326, -1597727, -1590888, -1591583, -1591329, -1588888, -1590263, -1585938, -1564996, -1577055, -1589782, -1589730, -1571834, -1558781, -1543034, -1544290, -1567048, -1578503, -1564663, -1556079, -1565670, -1553230, -1559688, -1552872, -1563716, -1568543, -1561561, -1569271, -1563756, -1554575, -1538628, -1530644, -1525802, -1507035, -1509116, -1520892, -1528463, -1538908, -1513385, -1517727, -1542737, -1544771, -1523576, -1503735, -1510758, -1512645, -1515426, -1519842, -1525558, -1530438, -1507824, -1493191, -1519163, -1529925, -1500918, -1484280, -1483578, -1486161, -1477022, -1482368, -1486758, -1478396, -1459023, -1483805, -1497071, -1473758, -1451952, -1445682, -1445452, -1433320, -1424589, -1421521, -1439382, -1457305, -1463014, -1471500, -1464349, -1451759, -1431829, -1395085]
10121a395085J5116j151k1835k7344m065R31J37j0209j3510J0010j563R289J1928
10108a427351J5367m673L604K0963K0883q625r835K079K2588K1765k7695l751
10096a374681K765J9012p961j5893j029Q612N405j217n424Q257O258O704J0779
10083a338413j3132O398N990j327j055Q959l298j593J4442N807j66K539J2821
10070a302028J5694j185K179m523Q133J231q036J0034K2636J9612J7617L3120
10058a185516O0738P8306N6231m4351k05290k40848j85638p0927L4993N4561L1096
10047a616645M0707L6055L1083K9527K1170o219j236J4517J7498J2268l950R044
10035a416181j599p99J0034J3715K4753J127k5389j5280J0582J3060R634Q792
$$ y = [-1395085, -1379969, -1381120, -1402955, -1430299, -1434364, -1433433, -1433296, -1443505, -1457015, -1447005, -1448568, -1439279, -1427351, -1411984, -1416657, -1413053, -1392090, -1371207, -1379832, -1389667, -1387588, -1365000, -1343235, -1370930, -1374681, -1371916, -1352904, -1360865, -1376758, -1377787, -1369175, -1363770, -1364987, -1370411, -1362154, -1355896, -1349192, -1338413, -1351545, -1345147, -1339157, -1340484, -1341539, -1332580, -1335878, -1337471, -1323029, -1317222, -1317388, -1314849, -1302028, -1286334, -1287519, -1285340, -1289863, -1281730, -1280499, -1288535, -1278501, -1255865, -1236253, -1218636, -1185516, -1124778, -1046472, -990241, -1034592, -1239882, -1480730, -1666368, -1737295, -1702302, -1647741, -1616645, -1575938, -1539883, -1508800, -1479273, -1458103, -1464322, -1465558, -1451041, -1433543, -1421275, -1425225, -1416181, -1417780, -1418579, -1408545, -1394830, -1370077, -1368950, -1394339, -1409619, -1399037, -1385977, -1376343, -1367551]
10023a367551K974n127o125p126K3066K5619K0161n738M541N205j1440j3458R449
10010a325550J4563J4761j7399k6031L716K5493J2467J1364J772k2953j1708L282
9998a316223M093Q094J9109j0587r620j688p611k933j957J0631p140PM0368J8611
9984a256846J141j6782j864K0719j1437j8681J4322J7746r66k7238M369J9830
9972a255687J4017j7688k5229j470J2959j6684q385J6771J3081o928j8234m494
9960a297971N252j624N906J6959J6433j4612L8j584J5314J5961J9514K0165k2213
9947a222462j3437k313J0234p076j0519K786M452o970k2188Q99Q520r19K1358
9934a237635J2465k2037o28J1127L735n057J033J0152r676j0014Q4k880o654k1839
$$ y = [-1367551, -1364577, -1369704, -1375829, -1382955, -1359889, -1334270, -1314109, -1319847, -1315306, -1310101, -1321541, -1334999, -1325550, -1310987, -1296226, -1313625, -1339656, -1335940, -1310447, -1297980, -1286616, -1284844, -1307797, -1319505, -1316223, -1312130, -1304036, -1284927, -1295514, -1305134, -1306822, -1314433, -1317366, -1319323, -1308692, -1315832, -1315825, -1275457, -1256846, -1255705, -1272487, -1274351, -1253632, -1265069, -1283750, -1269428, -1251682, -1252648, -1279886, -1275517, -1255687, -1241670, -1259358, -1284587, -1286057, -1273098, -1289782, -1298167, -1281396, -1268315, -1275243, -1293477, -1297971, -1292719, -1294343, -1288437, -1271478, -1255045, -1269657, -1269619, -1271203, -1255889, -1239928, -1220414, -1200249, -1222462, -1235899, -1238212, -1227978, -1235054, -1245573, -1242787, -1238335, -1245305, -1267493, -1266594, -1258074, -1258993, -1237635, -1225170, -1247207, -1247835, -1236708, -1232973, -1238030, -1236997, -1226845, -1236521, -1246535, -1246451, -1249331, -1255985, -1277824]
9920a277824K3026J2882K1364K518M322j1803O787q49J5302m542o189J8307J8573
9907a178126N007m942j312q819K0977K2934j3453j2854k0980p761P133K0790m58
9894a171864k2502j0318j141J7128j7285l090J5176K4226l488o711n878j2476
9882a198223k2033J1142K3383J6744j0758l790J7650N414R740j2154k4547k099
9870a189531J207J3121J1005k67J328j665J6278J552l903l023J459J4247P404
9857a130788k93k4041l8067j5873M050J7206K4717M675r988L420O423n18J915
9844a157162J2736K4532Q612P213j7630n635j2038n629l85J4010P126J5965m955
9831a113240j1526k4438p241L80M768Q693q706J0586q062K0003J6926j0072J0107
$$ y = [-1277824, -1254798, -1241916, -1220552, -1218034, -1213712, -1225515, -1218728, -1219577, -1204275, -1208817, -1215006, -1196699, -1178126, -1173119, -1178061, -1179373, -1188192, -1167215, -1144281, -1157734, -1170588, -1191568, -1199329, -1192196, -1171406, -1171864, -1194366, -1204684, -1205825, -1188697, -1205982, -1209072, -1193896, -1169670, -1173158, -1179869, -1185747, -1198223, -1220256, -1209114, -1185731, -1168987, -1179745, -1183535, -1165885, -1160471, -1150731, -1162885, -1187432, -1189531, -1188324, -1175203, -1164198, -1164465, -1163137, -1164802, -1148524, -1146972, -1150875, -1153898, -1152439, -1138192, -1130788, -1131081, -1155122, -1193189, -1209062, -1205012, -1187806, -1163089, -1158414, -1168402, -1164982, -1158559, -1159077, -1157162, -1144426, -1119894, -1111282, -1104069, -1121699, -1127334, -1139372, -1145001, -1145386, -1131376, -1124250, -1108285, -1113240, -1124766, -1149204, -1156445, -1156065, -1151297, -1142604, -1151310, -1140724, -1148786, -1128783, -1111857, -1121929, -1111822]
9818a111822L3142j6859j575Q985j490L52k073k77j3267j5063q360N583K264J6818
9804a103642m240r071n626J4972l200j565M506J8987Q590N26m7J0846l435k8997
9790a101396L519J662J0934k6152k0276o633K5802K3110J4649J3155j1543J4125
9778a059044J2838j8550k2413M592j9019K797J5291o854P972K6562L5268J6441
9766a004119j2489j6294j2165j7181l967L668J0741l12N332J1312L952j2118J2251
9753a031389l37O21l6279j2916j252J0468J4764P462J1237K0541l706J2165k011
9740a010632r455J2051o788k819l6697j8509J6114O933Q952K863j3038J0793K6781
9727a013451R832k2864k0757K476J1383M968K6270K2051J5248q100j5265m1397
$$ y = [-1111822, -1078680, -1095539, -1097114, -1088129, -1089619, -1089267, -1091340, -1091617, -1104884, -1119947, -1128307, -1122724, -1120460, -1103642, -1107882, -1116953, -1122579, -1107607, -1110807, -1112372, -1107866, -1088879, -1080289, -1079763, -1079810, -1068964, -1072399, -1101396, -1097877, -1096215, -1085281, -1111433, -1131709, -1138342, -1112540, -1089430, -1074781, -1061626, -1073169, -1059044, -1046206, -1064756, -1087169, -1082577, -1101596, -1098799, -1083508, -1090362, -1082390, -1055828, -1020560, -1004119, -1016608, -1032902, -1045067, -1062248, -1066215, -1062547, -1051806, -1052118, -1046786, -1035474, -1031522, -1043640, -1031389, -1031726, -1031105, -1067384, -1080300, -1081552, -1071084, -1056320, -1048858, -1037621, -1017080, -1020786, -1008621, -1010632, -1020087, -1008036, -1014824, -1017643, -1054340, -1072849, -1056735, -1049802, -1040850, -1037987, -1051025, -1040232, -1013451, -1003619, -1026483, -1047240, -1044764, -1033381, -1028413, -1002143, -980092, -964844, -972944, -988209, -1029606]
9715a029606r174J9046J0050j8398l3631r506N082K5294K5633j0241j5817o602
9703a047870J3150J9242R291M916o457Q487K0314J4685r33j1837j0660N398K970
9690i79304O154J5469J0302j9468j3457j2678p901j3234P082J2482k507J6023
9678i81037m989o453j5359K802K701J090J6944L2m911p575O475K902L322j742
9664i85798Q128m993k6098M41Q513q592J5734J1746j791J5318P431J0563k038
9651i51436q286J4098J48j4396k167J9650j0514l380K5954K3375o04j2953j4795
9638i35306n184Q234o012N00l113j627O991J3840k8144j8132K959j1444l391O05
9624i79224J8464K3437K580j0541n272m068O949J6064J7510j146o010p347Q266
$$ y = [-1029606, -1038780, -1019734, -1009684, -1028082, -1061713, -1071219, -1066137, -1040843, -1015210, -1025451, -1041268, -1047870, -1034720, -1015478, -1006187, -1001271, -1007728, -999241, -978927, -964242, -965175, -977012, -987672, -982274, -979304, -973150, -957681, -947379, -966847, -980304, -992982, -1000883, -1014117, -1007035, -994553, -997060, -981037, -986026, -992479, -1007838, -1005036, -1002335, -1001245, -984301, -984269, -989180, -996755, -990280, -987378, -984056, -985798, -977670, -982663, -1008761, -1008320, -999807, -1008399, -992665, -980919, -982710, -967392, -959961, -949398, -951436, -959722, -945624, -945476, -959872, -962039, -942389, -952903, -956283, -930329, -906954, -907558, -920511, -935306, -940490, -932256, -938268, -937768, -940881, -942508, -935517, -921677, -949821, -967953, -964994, -976438, -979829, -979224, -960760, -937323, -934743, -945284, -950556, -954624, -947675, -931611, -914101, -915247, -921257, -928604, -920338]
9611i20338O809o62J3644J5083k248o768j1068k0083J2823J1073j135n15J4822
9598h88563J0418n161K068L488j0322k9134l6642K592J7771K4212J1056P813k1002
9585i11406j2054J7316K7773p27K502j672L77j3349j0581o630r309k3834n9L4111
9571i07542K8419J1615j8494p085k0220N898R744j0059K7380J317j5937P512Q971
9558h78481j2691j4710j1275j7950P196L8533J7749n76j1243k1747j034L4184
9546h72045L2299j5326L742J9173l4025o449K270J0052J954N01l682K056N1P161
9532h52268L0732L2988k0923L365L206l4195n397O6Q33J599J8651n306k9536R300
9518h46885J2552J2157o460k1599J7190K4167j4989j7969N428J1676j1631l517
$$ y = [-920338, -913529, -914191, -900547, -885464, -887712, -894480, -905548, -925631, -912808, -901735, -902870, -903385, -888563, -878145, -883306, -881238, -877750, -888072, -917206, -953848, -951256, -933485, -909273, -898217, -890404, -911406, -923460, -906144, -878371, -879098, -876596, -878268, -877891, -891240, -901821, -908451, -917760, -941594, -941653, -907542, -879123, -867508, -886002, -893087, -913307, -907409, -897665, -907724, -880344, -879027, -894964, -887452, -878481, -891172, -905882, -917157, -935107, -927911, -889378, -871629, -872205, -883448, -905195, -906229, -872045, -839746, -855072, -851330, -832157, -866182, -872631, -870361, -860309, -858355, -857854, -861536, -859480, -859429, -852268, -821536, -788548, -809471, -806106, -802900, -837095, -842492, -842426, -841593, -839994, -821343, -826649, -856185, -846885, -834333, -822176, -828636, -850235, -833045, -808878, -823867, -841836, -836408, -824732, -836363, -839880]
9506h39880j005J513j191J2771j724o854R2j6918j6333R23J1782j2630J2470P417
9492h49567l464Q845k051N034L0050Q389l94o101j656o930j0110k2970N526Q320
9478h37079R925P759K1370L803k1370r744J0578j757N924j3499J976J402N325
9465h15387Q945J2116J4023k14M75j4157K25j6080j2551J2494j484J4601J3361
9452g83633O73j0161j2833K5200O125k897O126P908r77L02N757k1888j8414N405
9438g93307N499J0391J4457K4154n431k5211k2056K5281K5761o468m085l672o93
9425g55380J4882R54j4427k0678m702L8666J8482j3315j1780k3283o92J2686j2477
9412g71064j2780J6784j3184J918K5498J4343k3747P901j11l616O281J7195k599
$$ y = [-839880, -840885, -839372, -840563, -827792, -829516, -836370, -836278, -853196, -869529, -868606, -856824, -869454, -856984, -849567, -853031, -844186, -846237, -841203, -811153, -802764, -803158, -809259, -810915, -817845, -827955, -850925, -845399, -837079, -827154, -819395, -798025, -794222, -815592, -825336, -814758, -816515, -810591, -824090, -822114, -820712, -815387, -806442, -794326, -780303, -780517, -780042, -794199, -793974, -810054, -822605, -810111, -811595, -796994, -783633, -782960, -793121, -805954, -780754, -774629, -777526, -771400, -763492, -764469, -764167, -758410, -780298, -798712, -793307, -787808, -777417, -762960, -738806, -744237, -769448, -791504, -766223, -740462, -746930, -751015, -754687, -755380, -740498, -739544, -753971, -774649, -779351, -740685, -722203, -735518, -747298, -770581, -771273, -758587, -771064, -783844, -767060, -780244, -778326, -752828, -738485, -762232, -754331, -754442, -758058, -751777, -734582, -737181]
9399g37181R246J600j0594J8740L0667k32k384N258j5222p098L036p105J570j858
9385g11557P050Q73J6327O821o391k4074j3301j74M35K468J3673k358O809l068
9371g06467j758j580m694J3075m209K4427J7218j797J437j1109N65J1567q824
9358f72149k349P571r031J0074J0597L713j0268O457K2060N074k129l2903k9456
9345f92739O486K7664n537j7404j6487P422J3172L230j939j6980K7229K3983j246
9332f43146m589K111q442L687L819L145J7894n113l5040j0968J3195K9534L1383
9319f02530j2429j1002k932Q507N852j9227n755J658M148K221j08M027K411P657
9305f17502N185Q493p02o981M448J7438p26k3984N85J9316K864J2894J0850l75
$$ y = [-737181, -727935, -726335, -736929, -718189, -687522, -687754, -690138, -684880, -700102, -707200, -704164, -711269, -709699, -711557, -704507, -703634, -687307, -680486, -686877, -710951, -724252, -724426, -723991, -721523, -707850, -710208, -703399, -706467, -708225, -709805, -714499, -701424, -705633, -681206, -663988, -665785, -664348, -675457, -674892, -663325, -672149, -674498, -666927, -675958, -665884, -655287, -651574, -661842, -655385, -633325, -628251, -630380, -663283, -692739, -686253, -658589, -664126, -681530, -698017, -690595, -677423, -674193, -676132, -693112, -665883, -641900, -643146, -647735, -645624, -654066, -650379, -646560, -643415, -625521, -630634, -665674, -676642, -663447, -633913, -602530, -614959, -625961, -628893, -620386, -614534, -633761, -639516, -637858, -633710, -631489, -631597, -627570, -625159, -617502, -612317, -603824, -604526, -611507, -607059, -589621, -590347, -614331, -613746, -594430, -591566, -578672, -567822, -568197]
9291e68197m348Q130n663M329R952j2078J2023P668Q200L491K771J999n188j1743
9277e48654k509J3355R925J768l625k3804l089O495m94K5268K9498j623j8926
9264e16415j4491J9723K2279K4091k1464k8471k6058K5321J1659R557n770J7883
9252d82156K2812p244L916J5425L719j5007r075r989m724j4538J3126J3342J3956
9239d56437J5782M995J940L199M770r10Q974o860J2058L3881K9380j2358k317
9226c63903o053n141N139K460j1801N596K6709J5394q56J1589J161j0414J6639
9213c13481J8781j3921J2311J1114k4297m020L1219o34q384j990J0743J0758P703
9200b64098J7497J1672K0291J9107J7101J7225O032K6208J1886R926M983L60J1945
$$ y = [-568197, -572545, -564415, -570078, -565749, -555797, -567875, -555852, -548184, -539984, -536493, -533722, -531723, -536911, -548654, -551163, -537808, -527883, -526115, -529740, -553544, -556633, -550138, -550632, -525364, -495866, -497489, -516415, -530906, -511183, -488904, -464813, -486277, -514748, -540806, -515485, -503826, -494269, -500039, -482156, -459344, -466588, -462672, -447247, -443528, -458535, -467610, -477599, -482323, -496861, -483735, -470393, -456437, -440655, -435660, -433720, -430521, -425751, -426661, -417687, -424547, -412489, -378608, -349228, -361586, -363903, -369956, -375097, -369958, -367498, -379299, -373703, -346994, -331600, -332456, -320867, -319706, -330120, -313481, -294700, -308621, -296310, -285196, -309493, -313513, -282294, -282928, -291312, -293302, -282559, -271801, -264098, -246601, -234929, -214638, -195531, -178430, -161205, -155173, -128965, -117079, -107153, -102170, -101810, -89865]
9187h9865O088r40k944r930J9064K8401L4784K5454K7793R740J1006J9833K3127
9174A01611L4372J6656l776N724J8989L1894J8519L2135K1651J6015K0943K3159
9162C37892L2063L7286L8740M0209L572O584N0559N6647M4045L9703P2297N4900
9150H14497K8917K7377P3436Q6250N8284M5483P8655O7809Q0961O6370O5220Q5948
9138A579207P7757N4123O3055O6160O7192J2306l0161q5865j37102k43703l76529
9127A046440m71781n77268o38381o33890n77991n16349m06910k80821j91283j26923
9117c375157p1222p301K6610L8075N2146O3992R3742P2727O1180Q5085Q5916P5939
9105b798268M2985M4049P4173O9396N9659N8040N4160O8342L7022L6521N8366
$$ y = [-89865, -83777, -84717, -87661, -97591, -78527, -50126, -15342, 10112, 37905, 47645, 58651, 78484, 101611, 135983, 152639, 148863, 154587, 173576, 205470, 223989, 256124, 277775, 293790, 314733, 337892, 369955, 407241, 445981, 486190, 489762, 496346, 546905, 603552, 647597, 687300, 759597, 814497, 843414, 870791, 944227, 1030477, 1088761, 1134244, 1212899, 1280708, 1361669, 1428039, 1493259, 1579207, 1656964, 1711087, 1774142, 1840302, 1907494, 1919800, 1889639, 1803774, 1666672, 1422969, 1046440, 574659, -2609, -640990, -1274880, -1852871, -2369220, -2776130, -3056951, -3248234, -3375157, -3446379, -3453680, -3427070, -3388995, -3336849, -3272857, -3179115, -3106388, -3045208, -2960123, -2874207, -2798268, -2755283, -2711234, -2637061, -2567665, -2508006, -2449966, -2395806, -2327464, -2290442, -2253921, -2195555]
9094b195555L6988K0780L2388M8865M1772P893J1180J6076K6353M7567L9751L4099
9082a831843K4069J0247K8628J5089p428p891K3801N6807K7610M259K0662K3446
9070a612544L628O504Q438L5784K2567J9313J5049K964J3937L4226r010J612o702
9057a464234P261J9609J9368j2527L5956J8660j2379R713J0676l611p482N056
9045a373934M093J2970L3129L730Q239M956J5314J5707L4861q458j6368j6831
9033a282592n750P467K6637J5957K1649r953j1577L539q763K2007J9950j8871
9021a220300j223K8956J8750p250n683Q733J790N792J18n702P433p273l988K080
9007a177767j522K6668J6180j4048m88K4098N591q864j3142K888L428J386L246
$$ y = [-2195555, -2158567, -2137787, -2105399, -2056534, -2014762, -2006869, -1995689, -1979613, -1953260, -1905693, -1865942, -1831843, -1807774, -1797527, -1768899, -1753810, -1761238, -1769129, -1745328, -1688521, -1660911, -1656652, -1635990, -1612544, -1608916, -1602412, -1593974, -1558190, -1535623, -1516310, -1501261, -1498297, -1484360, -1450134, -1459144, -1457532, -1464234, -1456973, -1437364, -1417996, -1430523, -1394567, -1375907, -1388286, -1378573, -1367897, -1371508, -1378990, -1373934, -1369841, -1356871, -1323742, -1320012, -1311773, -1306817, -1291503, -1275796, -1240935, -1249393, -1265761, -1282592, -1288342, -1280875, -1254238, -1238281, -1216632, -1226585, -1238162, -1234623, -1243386, -1221379, -1201429, -1220300, -1221523, -1192567, -1173817, -1181067, -1186750, -1178017, -1176227, -1170435, -1170317, -1176019, -1168586, -1175859, -1179847, -1177767, -1179289, -1152621, -1136441, -1150489, -1150977, -1126879, -1121288, -1130152, -1143294, -1140406, -1136978, -1135592, -1132346]
8994a132346J8372P051o052Q029Q56j1103L0043J4723J544k687L945m482l23J7856
8980a054574L894j2356j0119M099J7652N204K352K340N489q35j7383l9J0843J4014
8966a029419j9432k5446L4231L1859q853K094K0259J476O981l597k2027r49J0324
8953a002499j0135P376L4794k0401l0986J9096j97j8314L473M842j3753J2875
8941a013829J2230K219K3974L1973K74r791p574o474p547K0163J3522J624J1206
8928i28030j0129m101K945K272K4789Q359j6075j1797J0394M206M357j9066j0060
8915i41936R450R041k331k6011q292o298J0502K6881Q094j2728j0768J1878L2214
8902i00304J1076j9891j3065M026J2225J035o298O545q933j3754J748J5163J5097
$$ y = [-1132346, -1113974, -1106923, -1112975, -1104946, -1104090, -1115193, -1085150, -1070427, -1068883, -1071570, -1067625, -1072107, -1072430, -1054574, -1050680, -1063036, -1073155, -1069056, -1051404, -1046200, -1043848, -1041508, -1036019, -1036854, -1054237, -1054276, -1043433, -1029419, -1048851, -1074297, -1040066, -1008207, -1017060, -1014966, -994707, -993231, -986250, -989847, -1011874, -1012823, -1002499, -1012634, -1005258, -970464, -990865, -1021851, -1002755, -1002952, -1021266, -1017793, -1012951, -1026704, -1013829, -1001599, -999380, -975406, -943433, -943159, -952950, -960524, -966998, -974545, -954382, -940860, -939236, -928030, -938159, -942260, -939315, -937043, -912254, -903895, -919970, -931767, -921373, -917167, -912810, -931876, -941936, -932486, -923445, -925776, -951787, -960079, -966377, -955875, -928994, -920900, -933628, -944396, -932518, -900304, -889228, -909119, -922184, -918158, -905933, -904898, -911196, -904651, -913584, -927338, -925590, -910427, -895330]
8889h95330M147K904j4234j2148J8200k43l291J0104N348J3308J0082K6975N910
8876h28268j5465j727j6714p616J1737m712j7555k8859l165J1611J0439R855J2906
8863h67533J3338K201j5228k5836j5665N654J8680K1356P900O034k4345j3923
8851h87367j085q318J472K8352K9417j6886j0200Q278J4516j272k6245j4759N170
8838h78927R114o867J550o60j305j1019K6119J2379M466M63J0658J2778k2915
8825h44166j2873L326N33j0507P636J3653k357L536m286J509J5511J207Q085N259
8811h13934l372j0061L418K4163j1558k0376o266k912P797K1091J3801n250q30
8798h04289J0624j4724o898q927j5199j5843K2215L1596K3529k1449j1842m465
$$ y = [-895330, -891183, -888279, -902513, -914661, -896461, -896704, -899995, -889891, -884543, -871235, -861153, -834178, -828268, -843733, -845460, -862174, -869790, -858053, -862765, -880320, -909179, -912344, -900733, -890294, -880439, -867533, -854195, -851994, -867222, -893058, -908723, -903069, -884389, -863033, -855133, -849099, -873444, -887367, -888452, -896770, -895298, -866946, -837529, -854415, -864615, -856337, -841821, -843093, -869338, -884097, -878927, -869813, -876680, -875130, -875790, -877095, -888114, -861995, -849616, -845150, -844687, -834029, -821251, -844166, -857039, -853713, -853180, -863687, -856051, -842398, -844755, -841219, -845505, -843996, -828485, -827278, -819193, -813934, -817306, -827367, -823949, -799786, -811344, -831720, -837986, -840898, -833101, -812010, -798209, -803459, -804289, -793665, -808389, -815287, -824214, -839413, -855256, -833041, -801445, -777916, -799365, -811207, -815672]
8786h15672j6959L770L976k2024j9685K2809K2370J9192J439n685j1358J0621
8774h07206J0394K6287r418r408j2738r394n940l610l5j860R68J9275o42P696
8760g95631K6469K2595m940j6996j6386o729O984o613m644p579J0761K0681n865
8747g77893J7424J2879j0305j5325L362j407j034j0389R033o446J2524K6942J4644
8734g25991l472j6571R122q788k50o329j5628l925O965J4270N046j099p330l927
8720g57907l903J8578K6403J0177o502p593N389Q344l748j7604j018j9963j407
8707g50754Q521P968l876P846K039N462O312j4142j6440L765P048J4167K2250
8694f99834L27j4982J155l852K2055K4477j5785k3036K850k180J7907l878j3873
$$ y = [-815672, -832631, -828861, -824885, -846909, -866594, -843785, -821415, -802223, -800784, -806469, -817827, -807206, -796812, -770525, -779943, -789351, -802089, -811483, -817423, -821033, -821068, -822928, -821960, -802685, -803327, -795631, -769162, -746567, -751507, -768503, -784889, -791618, -784634, -791247, -795891, -803470, -792709, -772028, -777893, -760469, -747590, -757895, -773220, -769858, -771265, -772299, -782688, -773655, -780101, -767577, -740635, -725991, -729463, -746034, -736912, -745700, -745950, -752279, -767907, -771832, -764867, -750597, -745551, -746650, -753980, -757907, -761810, -743232, -716829, -706652, -713154, -720747, -715358, -707014, -710762, -728366, -729384, -749347, -750754, -742233, -734265, -738141, -730295, -728256, -722794, -716482, -730624, -747064, -743299, -736251, -722084, -699834, -699507, -714489, -713334, -717186, -695131, -670654, -686439, -709475, -706625, -708805, -690898, -694776, -708649]
8681g08649L699k0987J1304l497n320o793R568J3557j750K854k711k2485J1226
8668g19984J973j8742q238J9689R884K490J1615O7o409J4825m427k0891M314M694
8654g09140M777r295Q082P293K4538R249O179j7221M330O680k669Q157J5195m884
8640f48729o842n35L898j2750j8807K6849J8016j5973q388K1243J3226r351n312
8627f43455M96j6543J9387K9102n603j7692k4949m624J5097K1826j2817m73L486
8614f36762q159j8300m899j7031L82J7841K242j832m596L902r425K531J943j4708
8600f86871L421J2924K1038r199r135j9467J8531J6181r01K772m254m1159l2564
8587g28683p2853o6351k8420j1860j9096k5580j7887N978J7583R421J1451K4718
$$ y = [-708649, -704950, -725937, -714633, -718130, -723450, -730243, -720675, -707118, -708868, -706014, -708725, -731210, -719984, -718011, -736753, -744991, -725302, -715418, -712928, -701313, -701246, -707655, -692830, -697257, -718148, -713834, -709140, -704363, -713658, -705576, -698283, -673745, -664496, -658317, -675538, -671208, -664528, -667197, -659040, -643845, -648729, -655571, -656106, -652208, -664958, -683765, -656916, -638900, -654873, -663261, -642018, -628792, -638143, -643455, -642959, -659502, -640115, -611013, -616616, -634308, -659257, -663881, -648784, -626958, -639775, -640248, -636762, -644921, -663221, -668120, -685151, -684769, -666928, -664686, -666518, -671114, -667212, -676637, -674106, -672163, -686871, -683450, -670526, -649488, -658687, -667822, -687289, -668758, -652577, -653478, -650706, -654960, -696119, -728683, -801536, -867887, -896307, -908167, -927263, -952843, -970730, -964752, -947169, -937748, -926297, -901579]
8575i01579q414q950J7875P829J9827N941L152j5268j1734K9097J1437N197j113
8562h46703J0052L5794n50j6679l3803J2678L829R248R55j5673o896J0267j376
8549h38857m889J3382O810J338Q063n585M942R047q128K1397r207k2022l241J9627
8535h07323R83j1251K2158J5103M388O349J5973O869j7862j767k0458k0126J571
8522h05393L0238L2401O215n25k0019K901j986j4646K1090m385N183J8583N718
8509g24625q245m032L062J1956R410n306R474j9662k4071o136M703J2149k224
8496g43547L493j4667k5985K1136J8683N665K902J1704N960q559j7268O567l968
8483g37884k715r086J1978R097j3073j8257N786P421O431L6594K5235J3765m552
$$ y = [-901579, -909993, -918943, -901068, -893239, -873412, -867471, -864319, -879587, -891321, -862224, -850787, -845590, -846703, -836651, -800857, -801407, -818086, -851889, -839211, -835382, -826134, -825179, -840852, -847748, -837481, -838857, -843746, -830364, -823554, -822216, -814153, -819738, -814796, -805749, -813877, -792480, -801687, -823709, -826950, -807323, -806340, -817591, -795433, -780330, -775942, -769593, -753620, -746751, -764613, -766380, -786838, -806964, -805393, -775155, -742754, -736539, -737064, -757083, -754182, -756168, -770814, -749724, -754109, -748926, -730343, -724625, -732870, -736902, -733840, -721884, -712474, -717780, -708306, -727968, -752039, -758175, -753472, -741323, -743547, -740054, -754721, -780706, -759570, -740887, -735222, -732320, -720616, -714656, -723215, -740483, -733916, -737884, -740599, -749685, -737707, -728610, -741683, -759940, -754154, -746733, -740302, -703708, -678473, -664708, -669260]
8470f69260l2617m895j0518j4300j6284O245J7931J1415J780k1285j3342q209
8458g53339O860k0044P441J4834J8915O586p880Q979n467K308J0665J4226N218
8445f90698l225k9694l0511M406j3338L126Q917J6006J6712K8879J0568j8669
8433f97521j7813o546p787J4734L7116Q320R296k2222j5800r259j3623n285K612
8420g23778L135Q815J4908J8060N673o527J1603J2494j8508r557L124K461m599
8407f82696k1949q642j5355j3352J6089J8257K489R582l483J0758j0966j2113
8395g11381J1504M427M729K2060j474j3185j3257J468j7567Q523J8985J5847j564
8382f70885r807j9552j988J0859L2418j1329j9945J1197N003p192O132J6467J0952
$$ y = [-669260, -701877, -706772, -717290, -731590, -747874, -741629, -723698, -712283, -710503, -731788, -745130, -753339, -746479, -766523, -759082, -744248, -725333, -718747, -726627, -717648, -723115, -720807, -710142, -695916, -690698, -693923, -723617, -754128, -749722, -763060, -759934, -751017, -735011, -718299, -689420, -678852, -697521, -715334, -721880, -729667, -714933, -677817, -669497, -660201, -682423, -698223, -707482, -721105, -726390, -723778, -720643, -711828, -696920, -678860, -673187, -679714, -668111, -655617, -674125, -683682, -680558, -678097, -682696, -704645, -713287, -728642, -741994, -725905, -707648, -705159, -695577, -699060, -688302, -699268, -711381, -699877, -695450, -690721, -668661, -670135, -683320, -696577, -695109, -712676, -704153, -685168, -669321, -670885, -680692, -700244, -702232, -691373, -658955, -670284, -690229, -679032, -674029, -681221, -675089, -658622, -647670]
8369f47670K7294L823l0536k1129Q682j3674k055K3043j5670j2566R523O328j2152
8356f76759P377J4971m95j829k713k0192J5402Q399J1119k1236j9722j3745J6354
8343f83069J7524l926o399L670p843k3437P313J1876k239K1904N239n676q02j7171
8329f83036J9813L9153P281j1461k4845k3106J8220J5739J069J4191o28j6014
8317f43624j8798O144j0165k4485O279P491O103n261O351l340p517J7259j8774
8304f82337j390J5481K2621J3521J163m997J1990j0796k3325q132m351q359P169
8291f71742K2900j2293O03R078M310K362k4574M106L034J30R007o559q287P535
8277f60390J5886P190j8275l562j1924O807K2642K966J2787K693J1273k3493j6986
$$ y = [-647670, -620376, -616553, -647089, -668218, -659536, -673210, -675265, -652222, -667892, -680458, -670935, -664607, -676759, -669382, -654411, -654906, -656735, -659448, -679640, -664238, -655839, -644720, -665956, -685678, -699423, -683069, -665545, -669471, -675870, -672200, -680043, -703480, -696167, -684291, -686530, -664626, -659387, -665063, -665865, -683036, -663223, -624070, -616789, -628250, -653095, -676201, -657981, -642242, -641173, -626982, -627610, -643624, -662422, -656278, -666443, -690928, -684649, -677158, -671055, -676316, -669965, -673305, -680822, -663563, -682337, -683727, -668246, -645625, -632104, -630941, -635938, -623948, -634744, -658069, -666201, -670552, -678911, -671742, -648842, -661135, -660532, -651454, -647144, -644782, -669356, -665250, -662216, -662086, -653079, -659638, -667925, -660390, -644504, -637314, -655589, -659151, -671075, -664268, -641626, -638660, -625873, -623180, -611907, -635400, -652386]
8264f52386L156R977j1549k5894m950K2667L5681J0479k3829j4628N628k564j6113
8251f64325Q973k881k195K5888J9579M04j1833l5275q047P640J8975p788j485
8238f52370P826p062r337m940J1013Q626j1952p985J2149M410K070J0112p578
8225f45018j5234o959N539L328N843K0812J4663K755j0067j5713j3566n911K5051
8212f34477P315r950N921k215R860j2649p984n531K87J426K002j760J3386J4009
8198f20360l977J4139L214l962p965j5255J8901K367o47n48L36R841j7226p172
8184f28314J93K5557J7530j760J1914L86j4532o153K6542l289k7833k8001n594
8171f33354J1141p026K484Q125J3659j4441j308J1709J0410j2056p202k93j0047
$$ y = [-652386, -649230, -639253, -650802, -676696, -681646, -658979, -623298, -612819, -636648, -651276, -645648, -648212, -664325, -655352, -658233, -660428, -634540, -614961, -614557, -626390, -661665, -669712, -662072, -643097, -650885, -652370, -644544, -651606, -660943, -665883, -654870, -646244, -658196, -666181, -654032, -649622, -647552, -637440, -645018, -660252, -667211, -661672, -658344, -652501, -631689, -617026, -614271, -624338, -640051, -653617, -659528, -634477, -627162, -637112, -631191, -633406, -623546, -636195, -644179, -649710, -649423, -647997, -645995, -647755, -634369, -620360, -624337, -610198, -606984, -610946, -618911, -634166, -615265, -612898, -613545, -614093, -613757, -603916, -621142, -628314, -628121, -602564, -585034, -586794, -574880, -574494, -589026, -595179, -568637, -571926, -599759, -627760, -633354, -622213, -629239, -626755, -618630, -604971, -619412, -620720, -609011, -598601, -610657, -617859, -618152, -628199]
8158f28199r551l285R540Q605K9299k381L011j2781q098L677K734O597j6872K898
8144f14806K1076K467K513j5380n130P305K734p898J3083Q635k213j5970k8368
8131f31952N447J6160J3483J1960j2445k4074p421K2136m61N51K2411Q333n396
8118e81268n330M265P187o708r71j4144k3825k4282n72j3266L6740J2085r616
8105f19705N017j0363j0711P317p221j1891K4499K9099m893j4469R431N077P962
8092e90851J58J2040J1533j3662J505L968r189j1757m022n65j3392l0945O620
8079f38559L6089L483n216Q750J9996P574J4448k608j26L564J5873j0849j357
8066e48938J2781J118j1392k9727o810K884Q296K1490M955R536k352J855J6121
$$ y = [-628199, -637750, -641035, -631495, -622890, -593591, -595972, -592961, -605742, -613840, -610163, -607429, -600832, -617704, -614806, -593730, -591263, -588750, -604130, -609260, -601955, -599221, -607119, -594036, -585401, -587614, -603584, -631952, -626505, -610345, -596862, -584902, -597347, -621421, -628842, -606706, -607167, -606616, -584205, -575872, -581268, -586598, -582333, -575146, -581854, -582825, -596969, -620794, -645076, -645648, -658914, -622174, -610089, -619705, -614688, -625051, -635762, -628445, -635666, -647557, -623058, -593959, -598852, -613321, -603890, -598813, -590851, -590693, -578653, -567120, -580782, -579277, -575309, -584498, -596255, -600277, -600842, -614234, -645179, -638559, -602470, -598987, -604203, -595453, -575457, -567883, -553435, -556043, -556169, -552605, -536732, -547581, -548938, -536157, -535039, -546431, -576158, -582968, -580084, -571788, -550298, -545343, -535807, -538159, -536304, -520183]
8053e20183n709r393o995j110P163o798M32j1851j2210Q229j781O255k826J1325
8039e45452o521j8896j9032n359J3106J6248r503j697n89j9714m199K3090J9986
8026e58532J4011j4518K51n8j4954p000K4126K2343j3426k6027J6263J1164J1826
8013e34531J9024m409q573K057K6254P894p550m644J30k033m0713m8577l8784
8000f34455m153J1220K344l0271k480L4803K2316m47J0339O022k3038l0957m5313
7987f84070r413K6295J2353n922j3226l707J6904K9027J4585p660L89Q879K49
7974f15317j0136J9349r162p08J4763R794J2673J83m087M674p277j404l764Q76
7960e89543Q474j0111k5405j7641L572j0580k4603j2158P408J1724J3555m782
$$ y = [-520183, -525892, -535285, -542280, -543390, -536227, -543025, -542593, -554444, -566654, -558425, -560206, -553951, -556777, -545452, -551973, -570869, -589901, -595260, -582154, -565906, -575409, -577106, -577695, -597409, -601608, -578518, -558532, -544521, -559039, -558788, -558846, -573800, -580800, -556674, -534331, -547757, -573784, -557521, -546357, -534531, -515507, -519916, -528489, -526432, -500178, -492284, -499834, -504478, -504348, -506381, -547094, -595671, -634455, -638608, -627388, -625044, -655315, -657795, -622992, -600676, -601123, -590784, -584762, -607800, -638757, -684070, -693483, -667188, -654835, -660757, -673983, -677690, -660786, -631759, -617174, -624834, -624445, -615566, -615317, -625453, -606104, -615266, -615974, -601211, -591417, -578744, -578561, -582648, -577974, -585251, -586655, -590419, -589543, -581069, -591180, -616585, -634226, -630654, -641234, -665837, -677995, -670587, -658863, -645308, -650090]
7948f50090l189q939l0552j2858J5685j4409p695K2082L7921L0460k8775K0722
7936f29637k093k481j4550p686J8662J8160r423r020J1143k742p535J0633k99
7923f26868N309r695j4479k774p563n11j8082K884L700o911J2385M035l827P206
7909f55191M438j54J7137P822Q17R098m077j3981j7737J016K1080J9575R379j2970
7895f13748O445j2643j6031J3535K742j5154m435J4819K1936L108j6722k6347
7883f42495j2997l752K3876J8826l95j3403R114O031k321k71j2145k2423L3135
7870f19220L480J1109K0550J6898k1k0992k9605j4062R141k163K134m550j7185
7857f44486O510J348K1639J8249j2250k4990j1165P938J2054q005K4597J093O752
$$ y = [-650090, -653279, -662218, -692770, -705628, -689943, -704352, -712047, -689965, -652044, -621584, -650359, -629637, -631730, -634211, -648761, -656447, -637785, -619625, -629048, -638068, -626925, -629667, -637202, -626569, -626868, -621559, -631254, -645733, -648507, -656070, -656581, -674663, -671779, -668079, -674990, -662605, -658570, -662397, -655191, -650753, -650907, -633770, -625948, -625131, -616033, -620110, -634091, -651828, -650812, -629732, -610157, -600778, -613748, -607303, -619946, -635977, -622442, -619700, -634854, -639289, -624470, -602534, -599426, -616148, -642495, -655492, -659244, -635368, -616542, -616937, -630340, -621226, -615195, -617516, -617787, -629932, -652355, -619220, -615740, -604631, -584081, -567183, -567204, -588196, -617801, -631863, -622722, -624885, -622751, -627301, -644486, -637976, -636628, -614989, -596740, -608990, -633980, -645145, -637207, -625153, -633158, -608561, -607468, -600716]
7844f00716J1028J3926l395o25j7381L760J0791o019n34J4070o830p73J0377k1376
7830e93697k1273l236q899J9922R708j1627J7346n983j1435K0325R421J644J7575
7817e60209q800k1737M781P320j2687j1416J9516J5728j9180j3939n726N506P27
7804f00116o646o652J4220J057M540k892j2811L86r96J953J6627J3246R621q734
7790e77197J23J0051p669O332O833m162p12j5074j5704Q308r479q751J0381j320
7776e98040L656j496k76O584l466J728J5567J7809N363k812m504k3104j0275J2420
7762e80846j5828p311k494O496n111r848J0139J7201P143Q970J1873j295j0973
7749e71884J0775j725m018j2468l307J692l074l7755j8599K0222M3786N960j308
$$ y = [-600716, -589688, -575762, -579157, -579782, -597163, -593403, -582612, -588631, -589165, -575095, -581925, -582698, -572321, -593697, -614970, -618206, -627105, -607183, -597475, -609102, -591756, -597739, -609174, -588849, -579428, -577784, -560209, -569009, -590746, -585965, -578645, -591332, -602748, -583232, -567504, -586684, -600623, -606349, -600843, -600116, -606762, -613414, -599194, -598137, -593597, -596489, -609300, -608914, -609910, -607957, -591330, -578084, -568463, -577197, -577074, -567023, -574692, -568360, -561527, -565689, -566401, -581475, -597179, -588871, -598350, -607101, -596720, -598040, -594384, -595880, -596156, -589572, -593038, -591310, -575743, -557934, -552571, -555383, -559887, -582991, -593266, -580846, -596674, -603985, -606479, -599983, -605094, -614942, -604803, -587602, -580459, -571489, -559616, -560911, -571884, -561109, -562834, -566852, -579320, -582627, -580935, -584009, -621764, -640363, -620141, -576355, -570395, -571703]
7736e71703R907j0472q823p428N376k9170j380K4857K7893r562M826M031l1912
7723e93560k570k905m619N714K328J1624K4090J6044p093j4068O632J0598J903
7710e45882j2277Q826L083O461j869o815r068N188o867J2133J8276j5556r023
7697e53390J1551j3653k77R008r544k126R965J5180j316j4147p764j0827R70p024
7683e73394L699J1221J6885K254j5848M756J9844n826k1320O315J2632M30j0465
7670e48817k8662J4954j0231q719n511J5842O077M726J0064l803o306J2359Q547
7657e39480P475J2254J2299j6477j1561O979j0090l76J2971j940q733k9420j9043
7644e85142p844J5477J3811P842J5043p397j2710j1862L083j572J5526K969k222
$$ y = [-571703, -561796, -572268, -581091, -588519, -583143, -612313, -613693, -588836, -560943, -570505, -565679, -561648, -593560, -596130, -599035, -603654, -597940, -595612, -583988, -559898, -543854, -550947, -565015, -558383, -547785, -545882, -558159, -549333, -546250, -539789, -541658, -548473, -557541, -552353, -559220, -547087, -528811, -544367, -553390, -541839, -555492, -555769, -546761, -556305, -558431, -548466, -533286, -534602, -548749, -556513, -567340, -566370, -573394, -569695, -558474, -541589, -539335, -555183, -550427, -530583, -536409, -557729, -551414, -538782, -538352, -548817, -577479, -562525, -572756, -581475, -586986, -571144, -565067, -560341, -550277, -554080, -560386, -548027, -539480, -532005, -519751, -507452, -523929, -535490, -528511, -538601, -538977, -526006, -527946, -536679, -566099, -585142, -592986, -577509, -563698, -555856, -540813, -548210, -560920, -572782, -569699, -571271, -555745, -552776, -554998]
7631e54998K2896j2961k2392j7205K1076p001L1046J254j0248m858q715k661J274
7618e63493J1104K0508J6878k1747j2517R754p084n63R658J6640j0121n878L452
7605e33409M569p120j9709L904J3580J1062M647k241k7821r107j1122J2346P263
7592e53158p752M062N646J1125k148J8031K1412k2438k7418j7783J920Q545P08
7579e59248R141O332O765L013M408k275l121j0816m258j0814P429J5471n22j0270
7565e48765J229k77O351K0187q847k6251q361l846Q390K6603j070k2341j2059
7552e69057J8993J2558k571J7948P876p064k3277l3980j3120K7933J8601k1272
7540e66432J1781J8123k2899J414K7198l882p311r481N057N562j1622J5664L019
$$ y = [-554998, -532102, -545063, -567455, -584660, -563584, -570585, -539539, -538285, -548533, -553391, -562106, -564767, -563493, -552389, -531881, -515003, -536750, -549267, -539513, -546597, -547160, -537502, -520862, -530983, -536861, -533409, -528840, -535960, -555669, -551765, -538185, -527123, -522476, -524717, -552538, -561645, -572767, -560421, -553158, -560910, -556848, -551202, -540077, -542225, -524194, -502782, -525220, -552638, -570421, -568501, -559956, -559248, -550107, -543775, -537010, -533997, -529589, -531864, -534985, -545801, -550059, -560873, -553444, -537973, -538495, -548765, -547536, -547813, -541462, -521275, -530122, -556373, -564734, -568580, -560190, -533587, -534657, -556998, -569057, -550064, -537506, -540077, -522129, -514253, -521317, -544594, -578574, -591694, -563761, -545160, -566432, -554651, -536528, -559427, -558013, -530815, -534697, -542008, -551489, -546432, -540870, -552492, -536828, -533809]
7527e33809m189R62J167N075K0000n4o603k3353J5934J1681j1900j4548K346M271
7513e33020l447R426J4192q648j2718j7192m349J208J9593J831j9226J3566J7649
7500e21135J1478J1739j125q140k7529l0294j4347J1641J2848N036r51j0548L2468
7487e28859K4910j2874k0975J8414L6665j504j4801k5251o460l312K76k899N824
7474e30846Q152j5005K2779M466J2116o656k0055J7401L614n297k9048k2397O658
7461e54118Q413J0993J7838k217r882R766L496N765J058K2113J8107l880j5982
7448d88530j0033l532j1760M42R747P782K457j8175j4878J8114L495q191K589
7435e10473o335j2273J3740J0012j0214o524n176n589q32K5154m777L811n087
$$ y = [-533809, -537998, -537036, -535869, -530794, -510794, -510848, -517451, -540804, -524870, -513189, -525089, -539637, -537291, -533020, -536467, -527041, -512849, -521497, -534215, -551407, -555756, -554548, -534955, -533124, -552350, -538784, -521135, -509657, -497918, -499043, -507183, -534712, -565006, -579353, -567712, -554864, -549828, -550779, -561327, -528859, -503949, -516823, -537798, -519384, -482719, -484223, -499024, -524275, -530735, -534047, -533771, -536670, -530846, -522694, -537699, -514920, -510454, -498338, -504994, -525049, -507648, -504034, -509331, -538379, -560776, -554118, -545705, -534712, -516874, -519091, -528973, -519207, -515711, -509946, -508888, -486775, -468668, -472548, -488530, -498563, -502095, -513855, -513413, -503666, -495884, -493427, -511602, -526480, -508366, -504871, -513062, -510473, -516808, -529081, -515341, -505329, -515543, -522067, -527243, -532832, -533664, -508510, -513287, -509476, -514563]
7422e14563J735P924M600M24O015L344j5168k1250N179o720r151J2077M512O174
7408e14868l0046m954J0165P543Q549O224lP985K1743l031j0876j5495n679J4766
7394e07977K1064J1561J6938k0259k8607j5245M729P523m753L803J0562q650N070
7381e04241M330L473K578R640p061p194Q851J1169k768k8455j8985k564K6412
7368e04815j2140o938R251K2245J2618r006j7028P246J7526J5753P722j2115n786
7355d75467j96L178m234J0249k3422l0160J8503R684k628K728p943p278l92J7203
7341d90175O719j4775p769q926p230M400P363j0190n089R623J46q83P731J1074
7327d97981K6501J2412k9455k7895l1229p349R487J9296J8739j3560j3339o991
$$ y = [-514563, -512828, -504904, -500304, -499880, -493865, -490521, -505689, -526939, -521760, -528480, -537631, -525554, -521042, -514868, -544914, -549868, -539703, -532160, -523611, -517387, -517390, -509405, -487662, -490693, -501569, -517064, -522743, -507977, -486913, -475352, -458414, -478673, -507280, -522525, -517796, -510273, -515026, -511223, -500661, -509311, -504241, -499911, -496438, -493860, -484220, -491281, -498475, -489624, -478455, -481223, -509678, -528663, -531227, -504815, -516955, -523893, -514642, -492397, -479779, -488785, -505813, -498567, -481041, -465288, -457566, -469681, -475467, -475663, -472485, -476719, -466470, -489892, -520052, -501549, -491865, -494493, -491765, -499708, -506986, -507378, -490175, -483456, -498231, -506000, -514926, -522156, -517756, -510393, -520583, -525672, -516049, -515903, -516786, -509055, -497981, -471480, -459068, -488523, -516418, -547647, -554996, -545509, -526213, -507474, -521034, -534373, -541364]
7315e41364R955M064J0876o836N333j276J8981o097o679K053N296Q80P567k635
7301d99882N021M27r726k2319l328K4061J534K3393l74l404n123j9540K732J10
7287e06418J0201j4326j0345M252Q526j5494M429P004J226J8019J4490o128k0919
7274e05483j2849K054J3741L484k1930j9918K257J6774M155j610L681j1213l424
7261e30281j366K0583J8693j1083j1976J3431J6166J5575k5208j5526l249K5407
7249d88834N581n169P885j6203l322J329J8836J1659k186m266J4968j3706l3138
7236e06566l607j67J413J2636J9407L0474j1230l4611j7757p103K8500K2909k3851
7223d89553r415m152K676k7607L482J6422P333p249j7471P090J5747M60J3185
$$ y = [-541364, -531409, -527345, -516469, -523305, -517972, -519248, -500267, -506364, -513043, -510990, -505694, -504814, -497247, -499882, -494861, -494434, -504160, -526479, -529807, -505746, -504212, -480819, -481193, -484597, -489720, -509260, -506528, -506418, -496217, -510543, -520888, -516636, -508110, -523604, -519175, -512171, -510945, -492926, -478436, -484564, -505483, -518332, -516278, -502537, -499053, -520983, -540901, -538644, -521870, -517715, -519325, -515644, -526857, -530281, -531647, -511064, -492371, -503454, -515430, -501999, -485833, -470258, -495466, -510992, -514241, -488834, -483253, -488422, -480537, -496740, -500062, -498733, -479897, -468238, -470424, -474690, -459722, -473428, -506566, -510173, -510340, -508927, -496291, -476884, -446410, -457640, -492251, -510008, -517111, -488611, -465702, -489553, -498968, -503120, -500444, -528051, -524569, -508147, -500814, -508063, -525534, -518444, -502697, -502237, -489052]
7210d89052Q509j1272j8176P343O775j9067j6117L475K0797J3041Q250j220O348
7197d80366k1871k0618m949M927R584J9380j8008l691J0098J0336O513J0366p633
7184d85932j3893J8298K7927M559j9609L297K3726j6792k7494J1625P926l384
7172d69746n574j1410Q532N119j3252n214r661N932P691J2058J7721l334r874
7159d71012m583k4623o313J3273q580j2127K0247J6746J0070M248M939L6j6754
7146d74433k0843K5364J3663J813J3978J735l3374l5942J6225O757q68J058K1520
7133d63347R339K1732M967j4091p639o321k100j2629l747m034j747J1729r921
7120d77809J0735k329j3773k0205Q393p920r865J0367J2353k839L144j5362k9818
$$ y = [-489052, -480543, -491815, -509991, -502648, -495873, -514940, -531057, -527582, -506785, -493744, -485494, -486714, -480366, -502237, -522855, -527804, -522877, -513293, -493913, -511921, -515612, -505514, -495178, -488665, -478299, -485932, -499825, -481527, -453600, -449041, -468650, -465353, -441627, -458419, -485913, -474288, -466362, -469746, -475320, -486730, -478198, -473079, -486331, -491545, -501206, -495274, -487583, -475525, -457804, -461138, -471012, -475595, -500218, -506531, -493258, -501838, -513965, -493718, -476972, -466902, -462654, -457715, -457679, -474433, -495276, -469912, -456249, -454436, -440458, -438723, -472097, -508039, -491814, -485057, -485925, -484867, -463347, -454008, -432276, -427309, -441400, -449039, -455360, -457460, -470089, -473836, -477870, -479617, -467888, -477809, -467074, -469403, -483176, -503381, -494988, -502908, -512773, -502406, -490053, -492892, -489748, -505110, -534928]
7107e34928J2387L1850P08k340O025R477n214N159J2048J023k1069k5712m991
7094e15577J2020R796P399j0121J0264R411k66N008J9510O10J1062K850j1206
7081d49240o243j6505k6477Q735K2082J4654o976j7681l354K6167J1143R50J3256
7068d29489j0121O914o265j3741R881M449O79n966K1828j9031k3506m845J4178
7055d55035K3568m197j8860N906q574j7964L469m373j6817J1949j1683k991N937
7042d89665l514M533l186J0944K0759N405J9423q773k5711n667k480p364m445
7029d89741J0147J1413J8010l579L888o505k663n749j1493N457k586J587J95j8820
7015d90439J908K7058K6684j7469k1687l261M700m214N655M494K127j527o892
$$ y = [-534928, -522541, -490691, -489983, -492323, -486298, -476821, -482035, -476876, -464828, -463805, -484874, -510586, -515577, -503557, -493761, -486362, -496483, -486219, -476808, -477074, -472066, -452556, -451946, -440884, -438034, -449240, -455483, -471988, -498465, -489730, -467648, -452994, -459970, -477651, -481005, -454838, -443695, -442745, -429489, -439610, -432696, -438961, -452702, -442821, -438372, -437693, -443659, -421831, -440862, -464368, -469213, -455035, -431467, -435664, -454524, -448618, -457192, -475156, -471687, -476060, -492877, -480928, -492611, -495602, -489665, -493179, -488646, -491832, -480888, -460129, -454724, -435301, -444074, -469785, -475452, -477932, -485296, -489741, -479594, -468181, -450171, -453750, -449862, -456367, -459030, -464779, -476272, -470815, -473401, -471814, -471619, -490439, -488531, -461473, -434789, -452258, -473945, -477206, -472506, -476720, -471065, -466571, -464444, -465971, -472863]
7002d72863q910m08J4154L600O043k0002R376L79l984J706J4934P202R264Q78
6988d38631q298j4660k1367r862k4180k4211K9943K6723Q268N274j3934Q922k458
6975d78471j5823P489K5385J9165Q903q863r55r817j4446q542p618l031R27K607
6961d83090J5588J4809K966J2643L843j3772k1299k1911K6721J3393J7060M977
6949d28072q926k4574k9220J6951m256M752r462Q482J2870J6488P116L147K485
6936d32219j741M192J0891L117o954j1951p695P458j1626j3907j6396l110j8799
6923d98740P588j0122j9885K555L7951J7558M304n458M912M307j7656o221n495
6910d84402K8221O280M271M310r14O433J673m30j3405M588q935j5439N13K525
$$ y = [-472863, -481773, -482181, -468027, -464427, -458384, -478386, -469010, -468631, -472615, -470909, -455975, -448773, -439509, -438631, -446929, -461589, -482956, -492818, -516998, -541209, -511266, -484543, -476275, -471001, -484935, -476013, -478471, -494294, -486805, -461420, -442255, -433352, -442215, -443170, -452987, -467433, -475975, -483593, -486624, -485697, -483090, -467502, -452693, -449727, -437084, -433241, -447013, -468312, -490223, -463502, -450109, -433049, -428072, -436998, -461572, -490792, -473841, -478097, -473345, -482807, -474325, -461455, -444967, -437851, -434704, -432219, -433960, -429768, -418877, -415760, -422714, -434665, -442360, -434902, -446528, -460435, -476831, -479941, -498740, -491152, -501274, -521159, -518604, -480653, -463095, -458791, -464249, -459337, -455030, -472686, -478907, -484402, -456181, -449901, -445630, -441320, -442234, -435801, -434128, -434558, -447963, -443375, -452310, -467749, -467236, -464711]
6896d64711J0958K0860j2154p607J5569n165o394r948P335q024j2653L598J2054
6883d56282K143L578J4352k205m082J4976O200J143j0163k1776m562N150j7614
6870d69142M960K2463P529k2714K202Q24p848O731J564j4781p892m476l091K165
6856d81506j444K6887N377N017P727J9985n5j9165j6077L694M427j4173j96J1212
6842d48290j3596N045J9064K117k6622l3018k7505J0716R818K7407K6805j5310
6830d63369J044J4088m231J8553l663L565O242J205m030N993j2127p004q165r143
6816d61042K444r948K890p212k557J8132J2909k487O562j1549J2900L7671P23
6803d00564j5726o148k219j8095j5286K0618J3571q101l220m603J0117M837l497
$$ y = [-464711, -453753, -432893, -445047, -452654, -437085, -442250, -448644, -458592, -451257, -459281, -471934, -468336, -456282, -454139, -450561, -436209, -438414, -442496, -427520, -421320, -420177, -430340, -452116, -456678, -451528, -469142, -464182, -441719, -434190, -456904, -454702, -453878, -461726, -454995, -453431, -468212, -476104, -480580, -483671, -481506, -482950, -456063, -450686, -445669, -437942, -417957, -418012, -437177, -453254, -449560, -445133, -459306, -459502, -448290, -461886, -456841, -437777, -435660, -462282, -495300, -522805, -512089, -502271, -474864, -448059, -463369, -462325, -448237, -452468, -433915, -437578, -434013, -427771, -426566, -430596, -424603, -436730, -443734, -451899, -461042, -458598, -468546, -465656, -472868, -475425, -457293, -444384, -446871, -440309, -451858, -438958, -401287, -400564, -416290, -422438, -424657, -442752, -458038, -437420, -423849, -431950, -435170, -439773, -429656, -424819, -428316]
6790d28316M352R847m517l231r163j5191j0699J6747J6405j6384q611K8376J3921
6777d06464n366r756o28M360n040J0754m565J458j5826j1849n868j587O570J366
6763d42441m005M414K0256j2407j9077p803O287L1396O396k5670j0765J6149Q903
6750d28367n703r237n981J5435O977j9463m382J0344M604K1301K5019L451j1071
6737c97073j3266j4989j7748j3889K525m524Q168J0588J1812j3947p966L186J6588
6724d30535J583L463K4684j0769k0177r159p779j5351M437J8634N161J996k1900
6711d55712J3831K019o159J818j7545j7923j220K611O365K0962K0438J681Q478
6698d20356n634j0749j1701r25j289J7253K867l228j1381j3955J0626J4581Q619
$$ y = [-428316, -423964, -414117, -418634, -421865, -431028, -446219, -456918, -440171, -423766, -440150, -448761, -420385, -406464, -411830, -421586, -422214, -417854, -422894, -412140, -416705, -415247, -431073, -442922, -448790, -450377, -443807, -442441, -446446, -442032, -421776, -434183, -453260, -461063, -454776, -423380, -416984, -442654, -453419, -437270, -428367, -434070, -443307, -449288, -433853, -426876, -446339, -450721, -440377, -435773, -414472, -389453, -386002, -397073, -410339, -425328, -443076, -456965, -454440, -458964, -450796, -440208, -428396, -442343, -450309, -447123, -430535, -428952, -425489, -400805, -411574, -431751, -440910, -448689, -464040, -459603, -440969, -435808, -433812, -455712, -441881, -439862, -446021, -444203, -461748, -479671, -480891, -478280, -471915, -450953, -430515, -428834, -420356, -425990, -436739, -448440, -449365, -450654, -433401, -430534, -433762, -445143, -459098, -448472, -433891, -425272]
6685d25272k3100l4623j8051J2719J9109m779m931L588R976K2283p85Q608Q306
6672d26952K502o83p242p15Q87l239J8322L871L49l41J314l690n336p287j6605
6657d44845p552J7341K1382j680J3621L107k0551j9541j2461j2587L163Q05L290
6644d56508R551J2642n67j2185r924R774J0485j3944m578N954J2716O949k3607
6631d53242J119L892j1770j06J9061L3307L0400l017l3603j6081R860P637J912
6618d10631j0645l365k1333Q783l378R770R918K963j9049m486k859j1027P084
6605d48255L0998O738j1206j9494j8488M469k279J7989N911m328Q872J5043K3652
6592c90378R028j9537k6873j2345r931K308J2673L5858j3802j8416p04k820M061
$$ y = [-425272, -448372, -482995, -501046, -488327, -469218, -473997, -478928, -475340, -465364, -443081, -443866, -435258, -426952, -424450, -425133, -432375, -433090, -432203, -435442, -417120, -413249, -412900, -413241, -411927, -415617, -420953, -428240, -444845, -452397, -435056, -413674, -415354, -401733, -398626, -419177, -438718, -451179, -463766, -460603, -459798, -456508, -446957, -434315, -434882, -447067, -456991, -447217, -436732, -450676, -455254, -449300, -436584, -429635, -453242, -452123, -448231, -460001, -460107, -441046, -407739, -377339, -380356, -413959, -430040, -420180, -412543, -410631, -421276, -424641, -445974, -437191, -440569, -430799, -420881, -417918, -436967, -441453, -444312, -455339, -448255, -417257, -410519, -421725, -441219, -459707, -455238, -457517, -439528, -433617, -437945, -429073, -414030, -390378, -381350, -400887, -427760, -440105, -450036, -447728, -435055, -399197, -412999, -431415, -432119, -434939, -430878]
6579d30878o23k823j754n404M959J4520m443J3546L70K430O499j3709k3525j3712
6565d54547L415L0147K1562m008J6466n990j1403J5215n260p167r88o863k9598
6552d39019j3109n907K6502J0012o778l307j4266j7206K2178k886j7573n128K6371
6539d40116J3349p302n136J1105J3836k652j9717J5160J778p459j2235N322P959
6526d26108l170j1060J475Q799N804J504j2450J3712P756K001j3852J8j235K114
6512d24692r626r636J5315R970M395J7043J3250m776j7876j9413j7045J4862J1695
6499d16534M213K0011J5973l138r116k1190K762P441K0362K107N166J575l0290
6486d00658k2667P25N717J017l881j6723j0425Q469J4592M055n34o279M476J9001
$$ y = [-430878, -431501, -434324, -436078, -441482, -436523, -422003, -426446, -412900, -412530, -410100, -403601, -417310, -440835, -454547, -451132, -420985, -399423, -403431, -386965, -392955, -404358, -389143, -394403, -401570, -402558, -409421, -439019, -452128, -458035, -431533, -421521, -428299, -431606, -445872, -463078, -440900, -443786, -461359, -466487, -440116, -426767, -434069, -439205, -428100, -414264, -416916, -436633, -421473, -419695, -427154, -439389, -434067, -426108, -429278, -440338, -438863, -430064, -424260, -422756, -435206, -421494, -413738, -411737, -425589, -425571, -426806, -424692, -434318, -443954, -428639, -418669, -414274, -397231, -383981, -388757, -406633, -426046, -443091, -428229, -416534, -412321, -392310, -376337, -379475, -388591, -409781, -407019, -399578, -379216, -377109, -371943, -370368, -400658, -423325, -422600, -416883, -415866, -419747, -436470, -446895, -438426, -423834, -419779, -420313, -426592, -422116, -403115]
6472d03115p462k3208m395J2481K7832J2884P149M108p847l5785k9343R48J7676
6459d28077J0953Q720n779O932q246k90j6845k693R565P991J5923Q823N800q557
6445c95780j3929k7841q533m825j240J729J6011K6428J4971P703j5887k3691q468
6432d33352M43J7438j030J2189q794m644J1166K608j6766j3357J574Q851P423
6419d16251n830m427n574K0222o305K833M208J92l524j3847p69n681o781N701
6405d35833K0718r257r602p106j2851K5603L2125j2868L612j3957k0232j1904
6393d51552q35J7894O7L309N223j9517o954o315J1837J3170k771J0978P896j7085
6379d34655j4348K2400J6687l820J2551J126m552j9087j4813R9P66j46P877L044
$$ y = [-403115, -410577, -433785, -438180, -425699, -397867, -384983, -377834, -373726, -381573, -417358, -446701, -445753, -428077, -417124, -408404, -414183, -407251, -415497, -415787, -432632, -435325, -425760, -417769, -401846, -393023, -387223, -395780, -409709, -437550, -446083, -450908, -452148, -450419, -434408, -407980, -393009, -385306, -401193, -424884, -433352, -432909, -415471, -416501, -404312, -413106, -417750, -406584, -403976, -420742, -434099, -432525, -423674, -416251, -422081, -426508, -432082, -411860, -418165, -415332, -411124, -410932, -414456, -428303, -429072, -434753, -441534, -435833, -415115, -424372, -433974, -441080, -453931, -428328, -396203, -409071, -405459, -419416, -439648, -451552, -452387, -434493, -434426, -431117, -425894, -445411, -452365, -458680, -446843, -433673, -436444, -425466, -417570, -434655, -449003, -426603, -409916, -413736, -401185, -400059, -404611, -423698, -438511, -438412, -437646, -437792, -429915, -426871]
6365d26871n564r302J2358R344j2899j2284L206M094L445R290Q545j1959M239
6352d24358N298O068j2433M019M392j0336O425j1479l201j385J5049j795l175
6339d26911J0084J7487o201J2458K1540p975k2770k2624J0343j07n805J551n730
6326d24660L755P89n377N135O074k0392j4446O063J3745K3900j505J5225m735
6313c96429k4651L792J9026l803j2510K1044R881k7629n568j8356j6349k597Q126
6300d46023Q346l613Q502Q632J8700k024l885j925N620L284j6381m425K0307K0561
6286c84324n708L643m0515k3041L653P253Q627J2878O912k669J0381J3883Q8l4006
6272d22945k984J3274J2080J7570j2245O463K0041r82k061j4214j4181N312j1775
$$ y = [-426871, -432435, -441737, -429379, -420035, -432934, -445218, -442012, -437918, -434473, -425183, -416638, -428597, -424358, -419060, -412992, -425425, -421406, -417014, -427350, -420925, -432404, -435605, -436990, -421941, -423736, -426911, -416827, -399340, -405541, -393083, -371543, -379518, -402288, -424912, -414569, -414676, -420481, -418930, -424660, -420905, -420116, -425493, -420358, -414284, -434676, -449122, -443059, -429314, -405414, -406919, -391694, -396429, -421080, -417288, -398262, -402065, -414575, -393531, -383650, -411279, -416847, -435203, -451552, -454149, -446023, -437677, -441290, -432788, -424156, -405456, -407480, -411365, -413290, -407670, -404386, -420767, -425192, -404885, -384324, -390032, -386389, -426904, -449945, -446292, -439039, -430412, -417534, -410622, -413291, -402910, -389027, -388939, -422945, -425929, -412655, -400575, -383005, -395250, -388787, -368746, -369728, -371789, -386003, -400184, -394872, -406647]
6259d06647J2045J1886k565m452J2899R924k5798J3183j1884J031q012j8679r042
6246d26111n181j1775j3454K0987J6070m916J3710k946O621N444l251J558J4406
6233c88838J4175L817J6134m36r657j8240j567k516k0149r122j681J1085O043
6220d00952q854j3439J2003J6665N222k487q419Q003N036P275k565K565o74j6478
6206c97099k5220P015L3642J243r556K21j3189R783j3670m46j3564j971J5604
6193d07207L563p653l869j9564J2557J8631L979j2124r750M076J8241L1992N800
6180c61328k3420j49J1473L413o725j8514l035J2732K6189J6412j1987j6120p919
6167c78978m787j53k017O330O923K6026j3429k8935k1684k83K5049J3881J0170
$$ y = [-406647, -394602, -382716, -385281, -389733, -376834, -366910, -392708, -379525, -391409, -390378, -398390, -417069, -426111, -431292, -443067, -456521, -435534, -419464, -424380, -410670, -413616, -406995, -401551, -404802, -403244, -388838, -374663, -370846, -354712, -355148, -364805, -383045, -384612, -387128, -407277, -416399, -418080, -406995, -400952, -409806, -423245, -411242, -394577, -389355, -391842, -400261, -392258, -387222, -379947, -382512, -379947, -380621, -397099, -422319, -415304, -381662, -380419, -389975, -389754, -402943, -393160, -406830, -407276, -420840, -422811, -407207, -403644, -411297, -415166, -434730, -422173, -403542, -399563, -411687, -421437, -417361, -399120, -367128, -361328, -384748, -384897, -373424, -370011, -376736, -395250, -398285, -385553, -359364, -342952, -354939, -371059, -378978, -383765, -383918, -385935, -379605, -372682, -346656, -360085, -389020, -410704, -410987, -385938, -372057, -361887]
6154c61887q281l8720j0178K3465K7641m072k0438n581J1268j1464p510J5025
6142c90732K206k2619L580O878p687M868J6251N480j6655r534J3424o287Q12p983
6128d07998j3049J5156K866L54j6284k0292K6318J0822M970L2853m290k0622L591
6115c85605O788n349j187J3352p862j2267J0848j4181j4876R475p855j6546j7246
6102d42511K752J2618J3159J8186k764J244J9521R068p027P155N968r722J473
6089c70880q200m829k8562L568K2425J3794M849N232L428j0181k0821j6410J0365
6076c96222K8145O684k8911l7123m597J6974J4801J4801K868r161J53J9137k406
6063c74857k0610o247K704Q975K3664k652Q397N076k1463L676k0721m281N815
$$ y = [-361887, -370168, -408888, -419066, -395601, -367960, -372032, -392470, -398051, -386783, -398247, -405757, -390732, -388526, -411145, -407565, -400687, -408374, -403506, -387255, -381775, -398430, -407964, -394540, -400827, -400015, -407998, -421047, -405891, -403025, -402671, -418955, -439247, -412929, -402107, -397137, -364284, -368574, -389196, -385605, -378817, -384166, -385353, -372001, -379863, -392130, -381282, -395463, -410339, -400864, -408719, -425265, -442511, -439759, -427141, -413982, -395796, -398560, -397316, -377795, -368727, -375754, -368599, -362631, -372353, -370880, -379080, -383909, -412471, -408903, -386478, -372684, -367835, -362603, -359175, -369356, -390177, -406587, -396222, -368077, -361393, -390304, -427427, -432024, -415050, -400249, -385448, -382580, -391741, -391588, -372451, -374857, -395467, -401714, -399010, -390035, -366371, -369023, -360626, -355550, -377013, -373337, -394058, -398339, -392524]
6050c92524j2931m662N073J6565J1345n383m668J4021J0941m412q780L171j1377
6037c83621n205l572m307P24p798r643O607R646J7044k680j4913O272L435J1166
6023c76845R497j2411K825K058j4742P36j6042R630m572k303L127J2497K8793
6010c57752j6910j6194J3170P158k6720j3083r715j4450r22J9958Q086l892K3321
5997c87945J441k5683p46J5558K1346K6251o982k9539l216m924o364m04k4797
5984d26004J1634J0335P022K9510K401k43K1408j286k7792n260K1433k432k8302
5971c87576l3613q967J350P133j4403N863K6021K2189P387j0005m930K3823L36
5958c65392l8989l876J3734M14O018j673O436Q79J075p331J5834K650j1580o816
$$ y = [-392524, -405455, -410117, -405044, -388479, -377134, -382517, -387185, -373164, -362223, -366635, -375415, -372244, -383621, -388826, -392398, -396705, -395981, -403779, -413422, -406815, -397169, -380125, -382805, -397718, -391446, -388011, -376845, -367348, -379759, -376934, -374876, -389618, -388882, -404924, -395294, -399866, -402169, -399042, -386545, -357752, -374662, -390856, -377686, -370528, -397248, -410331, -420046, -434496, -435418, -415460, -407374, -411266, -387945, -386504, -412187, -412933, -397375, -376029, -349778, -356760, -386299, -389515, -394439, -400803, -401207, -426004, -414370, -404035, -397013, -367503, -365102, -365345, -343937, -345223, -373015, -378275, -356842, -359274, -387576, -421189, -430156, -428806, -421673, -436076, -430213, -404192, -382003, -374616, -384621, -389551, -365728, -365392, -404381, -408257, -394523, -394109, -388091, -389764, -383328, -382449, -381374, -388705, -372871, -370221, -381801, -388617]
5944c88617J0739j947k528J0918L2268n763K329o298j06p84k5517n056p25Q472
5930c72615J3223j0765n629j8614j8452K0765L1942J4706j1761j1393J2085J0772
5918c45736n662j9376k6927r8J6392n35P60R056j1536o734n491J0068k930P252
5904c81497J7388L200k9108j2008K6094J9742j2817q800j799K126K2086N648l4595
5891c84340p337p274j1512K530k504Q513N902L312J7023k217m54j9105j0297K3955
5877c83805J4369L955K0241Q286m964J801j1104j8618k6440n711q555J6907P158
5864c86480K548r713M922m559q01P225j1552J5048J3708q237q345J3466N066J5994
5850c51710l267j6578m719Q821P128j300j3866k4617Q556N49m896m939r646J7817
$$ y = [-388617, -377878, -379825, -382353, -371435, -339167, -344930, -342601, -348899, -349005, -349789, -375306, -380362, -381087, -372615, -359392, -370157, -375786, -394400, -412852, -392087, -360145, -345439, -357200, -368593, -356508, -345736, -351398, -370774, -397701, -397799, -381407, -381942, -381182, -372126, -383662, -390396, -395887, -385819, -388749, -381497, -364109, -360909, -390017, -402025, -375931, -356189, -369006, -377806, -379605, -377479, -355393, -349745, -384340, -391677, -398951, -410463, -407933, -410437, -401924, -396022, -392710, -375687, -377904, -378358, -397463, -407760, -383805, -369436, -365481, -345240, -336954, -341918, -340117, -351221, -369839, -396279, -401990, -410545, -393638, -386480, -383932, -393645, -388723, -393282, -394083, -386858, -398410, -383362, -369654, -377891, -386236, -372770, -367704, -351710, -354977, -371555, -376274, -367453, -360325, -361625, -375491, -400108, -391552, -391003, -395899, -400838, -410484, -392667]
5836c92667O27l119M881j5221q751j272L272j213j8278L426K851K0120J4429j988
5822c92903M240O428j4626P86N541r756J7657M23k584m88j0927j4998j2725o28
5808d24560K0564J6048J6760J4701o170n816K172j4731j6469J0037L519l607J0127
5795c77425P917o362j5850Q011J3977J1645O167m556l020M273j82L648j7310k631
5781c71698p04j6381J5808L038k534J2614R062j4687p004n439n639j9061Q484
5768c94141J8626m885P171K4883J749k413k1113N328n36J2242J7786j0275k475
5755c48053M540j5068m533J1395J7274J079k713j6298j806j4353K302J6086J0584
5742c39564J5584P133l2055k4263j9461m755K819K0014M148N583Q111p8J3493
$$ y = [-392667, -392040, -395159, -390278, -405499, -414250, -415522, -412250, -413463, -431741, -428315, -425464, -405344, -390915, -392903, -388663, -382235, -396861, -396075, -390534, -400290, -382633, -382210, -384794, -385282, -396209, -411207, -423932, -424560, -403996, -387948, -371188, -356487, -362657, -368473, -366301, -381032, -397501, -387464, -383945, -387552, -377425, -369508, -375870, -391720, -383709, -369732, -358087, -351920, -356476, -359496, -355223, -355405, -351757, -369067, -371698, -372402, -388783, -372975, -369937, -372471, -359857, -350795, -365482, -372486, -377925, -383564, -402625, -394141, -375515, -380400, -373229, -348346, -346597, -349010, -370123, -364795, -365331, -353089, -335303, -345578, -348053, -343513, -358581, -363114, -351719, -334445, -333366, -336079, -352377, -354183, -368536, -366234, -350148, -339564, -323980, -316847, -348902, -373165, -392626, -397381, -394562, -374548, -370400, -364817, -356706, -356784, -343291]
5729c43291K0914l417j4798k2252N424j3956j6327K7626Q234o854o505r883j0639
5716c85724K983Q24J7100O043j3023j7535J205J0393K7265J0777j1689q062k0691
5703c80134j1442o477n989N712k5165J271n617K9713L2769n334J7529J841q640
5690c59963j2048m45R63o056O180P055M352J0806k3043k0660K3722J5374K5506
5677c28257j158k3058o308k1684l739J7619K2258J521m843J898o690o509l2212
5664c91162j5717L49J1927K7680L420J5153j212j2143j1482j0656k249J4857J0920
5651c60315N691j2062M304Q662j7639P38q398L099J9149O483q751j5235m886L4873
5637c44287n632j5157j0806N554j3842L49j571J4834N850j1650k346J3410P614
$$ y = [-343291, -322377, -325794, -340592, -362844, -357420, -371376, -387703, -360077, -351843, -358697, -365202, -375085, -385724, -382741, -381917, -364817, -358774, -371797, -389332, -388127, -377734, -350469, -339692, -351381, -359443, -380134, -391576, -398053, -404042, -398330, -423495, -422224, -427841, -398128, -365359, -370693, -353164, -351323, -359963, -372011, -372456, -371493, -377549, -371369, -364314, -359962, -349156, -372199, -392859, -369137, -353763, -328257, -329415, -352473, -358781, -380465, -384204, -366585, -344327, -342806, -347649, -345751, -352441, -358950, -391162, -406879, -406530, -394603, -366923, -363503, -348350, -349562, -361705, -373187, -383843, -386092, -371235, -360315, -354624, -366686, -362382, -353720, -371359, -370621, -379019, -375920, -356771, -350288, -359039, -374274, -379160, -344287, -349919, -365076, -375882, -370328, -384170, -383821, -385392, -370558, -364708, -376358, -378704, -365294, -357680]
5624c57680J3950J1270N754j1986p131m270j7879L838l845O48l410p426j6704
5611c94871J1563Q962j03R129q779Q753J8097q616R40K165K296O112j4635k083
$$ y = [-357680, -343730, -332460, -326706, -338692, -345823, -350093, -367972, -364134, -367979, -367331, -370741, -378167, -394871, -383308, -374346, -374449, -365320, -374099, -365346, -347249, -355865, -354925, -352760, -350464, -344352, -358987, -361070]
$$ [...]
##END NTUPLES=NMR SPECTRUM
##END=
