##TITLE=Analysis number 315398
Compound Code mwp 00055
Project Code adrs
Chemist Name stores
##JCAMPDX= 6.0         $$ Bruker NMR JCAMP-DX V2.0
##DATA TYPE= NMR SPECTRUM
##DATA CLASS= NTUPLES
##ORIGIN= Bruker BioSpin GmbH
##OWNER= NMR
$$ XWIN-NMR		Version 3.5
$$ Thu Nov 17 12:21:14 2005 GMT Standard Time (UT+0h)  MAYBRIDGE\NMR@NMR_250MHZ
##.OBSERVE FREQUENCY= 250.131544655141
##.OBSERVE NUCLEUS= ^1H
##.ACQUISITION MODE= SIMULTANEOUS (DQD)
##.ACQUISITION SCHEME= undefined
##.AVERAGES= 16
##.DIGITISER RES= 18
##SPECTROMETER/DATA SYSTEM= dpx250
##.PULSE SEQUENCE= zg30
##.SOLVENT NAME= CDCl3
##.SHIFT REFERENCE= (INTERNAL, CDCl3, 0, 16.4418)
##AUDIT TRAIL= $$ (NUMBER, WHEN, WHO, WHERE, WHAT)
$$ ##TITLE= Audit trail, XWIN-NMR		Version 3.5
$$ ##JCAMPDX= 5.01
$$ ##ORIGIN= Bruker BioSpin GmbH
$$ ##OWNER= NMR
$$ C:\u/data/dgb/nmr/ADRS/12570/pdata/1/auditp.txt
$$ ##AUDIT TRAIL=  $$ (NUMBER, WHEN, WHO, WHERE, WHAT)
(   1,<2005-11-17 12:20:48.90 +000>,<MAYBRIDGE\NMR>,<NMR_250MHZ>,
      <created by zg, POWCHK disabled, PULCHK disabled
       configuration hash MD5:
       62 19 C7 07 E1 42 D1 B7 37 6C 3D D0 77 39 F9 E6
       data hash MD5: 64K
       D8 35 2D 55 0E 3F 0B C1 8B D7 27 E9 19 0C 95 B6>)
(   2,<2005-11-17 12:21:03.04 +000>,<MAYBRIDGE\NMR>,<NMR_250MHZ>,
      <Start of raw data processing
       ef LB = 0.3 FT_mod = 6 PKNL = 1 SI = 32K 
       data hash MD5: 32K
       69 56 6C 21 DE A4 E2 E6 49 E9 65 C4 04 A3 E7 C4>)
(   3,<2005-11-17 12:21:05.65 +000>,<MAYBRIDGE\NMR>,<NMR_250MHZ>,
      <apk 
       data hash MD5: 32K
       DA FC 26 56 E0 1F 46 27 61 85 49 11 86 B9 9F B5>)
(   4,<2005-11-17 12:21:06.37 +000>,<MAYBRIDGE\NMR>,<NMR_250MHZ>,
      <abs ABSG = 5 
       data hash MD5: 32K
       F8 21 EE 2D 10 23 FD 57 8C 98 4F 67 5A 68 F9 1C>)
$$ ##END=
$$ 
$$ hash MD5
$$ 8C 79 D1 D5 EC 34 29 D7 D1 47 00 39 E4 E1 2F E7
##$RELAX= 
##$RELAX= 
##$RELAX= 
##$RELAX= 
##$RELAX= 
##$RELAX= 
##$RELAX= 
$$ Bruker specific parameters
$$ --------------------------
##$DU= <C:\u>
##$EXPNO= 12570
##$NAME= <ADRS>
##$PROCNO= 1
##$TYPE= <nmr>
##$USER= <dgb>
##$AMP= (0..31)
100 100 100 100 100 100 100 100 100 100 100 100 100 100 100 100 100 100 
100 100 100 100 100 100 100 100 100 100 100 100 100 100 
##$AQSEQ= 0
##$AQ_mod= 3
##$AUNM= <au_zg>
##$AUTOPOS= <24 >
##$BF1= 250.13
##$BF2= 250.13
##$BF3= 250.13
##$BF4= 250.13
##$BF5= 500.13
##$BF6= 500.13
##$BF7= 500.13
##$BF8= 500.13
##$BYTORDA= 1
##$CFDGTYP= 0
##$CFRGTYP= 5
##$CHEMSTR= <none>
##$CNST= (0..31)
1 1 145 1 1 1 1 1 1 1 1 1 1 1 1 1 1 1 1 1 1 1 1 1 1 1 1 1 1 1 1 1 
##$CPDPRG= <>
##$CPDPRG1= <>
##$CPDPRG2= <>
##$CPDPRG3= <>
##$CPDPRG4= <mlev>
##$CPDPRG5= <mlev>
##$CPDPRG6= <mlev>
##$CPDPRG7= <mlev>
##$CPDPRG8= <mlev>
##$CPDPRGB= <>
##$CPDPRGT= <>
##$D= (0..31)
0 1 0 0 0 0 0 0 0 0.06 0 0 0 0 0 0 0.0002 0 0 0 0 0 0 0 0 0 0 0 0 0 0 
0 
##$DATE= 1132230047
##$DBL= (0..7)
120 120 120 120 120 120 120 120 
##$DBP= (0..7)
150 150 150 150 150 150 150 150 
##$DBP07= 0
##$DBPNAM0= <>
##$DBPNAM1= <>
##$DBPNAM2= <>
$$ [...]
##$SUBNAM7= <"">
##$SUBNAM8= <"">
##$SUBNAM9= <"">
##$SW= 20.6930455092707
##$SWIBOX= (0..15)
0 0 3 0 0 0 0 0 0 0 0 0 0 0 0 0 
##$SW_h= 5175.983436853
##$TD= 65536
##$TD0= 1
##$TE= 294.16
##$TE2= 300
##$TE3= 300
##$TEG= 300
##$TL= (0..7)
0 120 120 120 120 120 120 120 
##$TP= (0..7)
150 150 150 150 150 150 150 150 
##$TP07= 0
##$TPNAME0= <>
##$TPNAME1= <>
##$TPNAME2= <>
##$TPNAME3= <>
##$TPNAME4= <>
##$TPNAME5= <>
##$TPNAME6= <>
##$TPNAME7= <>
##$TPOAL= (0..7)
0.5 0.5 0.5 0.5 0.5 0.5 0.5 0.5 
##$TPOFFS= (0..7)
0 0 0 0 0 0 0 0 
##$TUNHIN= 0
##$TUNHOUT= 0
##$TUNXOUT= 0
##$USERA1= <user>
##$USERA2= <user>
##$USERA3= <user>
##$USERA4= <user>
##$USERA5= <user>
##$V9= 5
##$VALIST= <valist>
##$VCLIST= <CCCCCCCCCCCCCCC>
##$VD= 0
##$VDLIST= <DDDDDDDDDDDDDDD>
##$VPLIST= <PPPPPPPPPPPPPPP>
##$VTLIST= <TTTTTTTTTTTTTTT>
##$WBST= 1024
##$WBSW= 4
##$XGAIN= (0..3)
0 0 0 0 
##$XL= 0
##$YL= 0
##$YMAX_a= 471138
##$YMIN_a= -434338
##$ZGOPTNS= <>
##$ZL1= 120
##$ZL2= 120
##$ZL3= 120
##$ZL4= 120
##$ABSF1= 16.44184
##$ABSF2= -4.251333
##$ABSG= 5
##$ABSL= 3
##$ALPHA= 0
##$AQORDER= 0
##$ASSFAC= 0
##$ASSFACI= 0
##$ASSFACX= 0
##$ASSWID= 0
##$AUNMP= <proc_1d>
##$AZFE= 0.1
##$AZFW= 0.1
##$BCFW= 0
##$BC_mod= 0
##$BYTORDP= 0
##$COROFFS= 0
##$CY= 12.5
##$DATMOD= 1
##$DC= 0
##$DFILT= <>
##$DTYPP= 0
##$F1P= 14.0000005364418
##$F2P= -0.99999901652339
##$FCOR= 0.5
##$FTSIZE= 32768
##$FT_mod= 6
##$GAMMA= 0
##$GB= 0
##$INTBC= 1
##$INTSCL= 1
##$ISEN= 128
##$LB= 0.3
##$LEV0= 0
##$LPBIN= 0
##$MAXI= 10000
##$MC2= 0
##$MEAN= 0
##$ME_mod= 0
##$MI= 0
##$NCOEF= 0
##$NC_proc= -3
##$NLEV= 6
##$NOISF1= 0
##$NOISF2= 0
##$NSP= 0
##$NTH_PI= 0
##$NZP= 0
##$OFFSET= 16.44184
##$PC= 1
##$PHC0= 76.7598
##$PHC1= 18.94761
##$PH_mod= 1
##$PKNL= yes
##$PPARMOD= 0
##$PSCAL= 4
##$PSIGN= 0
##$REVERSE= no
##$SF= 250.130020048736
##$SI= 32768
##$SIGF1= 0
##$SIGF2= 0
##$SINO= 400
##$SIOLD= 32768
##$SREGLST= <1H.CDCl3>
##$SSB= 0
##$STSI= 32768
##$STSR= 0
##$SW_p= 5175.98343685301
##$SYMM= 0
##$S_DEV= 0
##$TDeff= 65536
##$TDoff= 0
##$TI= <Analysis number 999999
Compound Code 99
Book Reference 9
Project Code 9>
##$TILT= no
##$TM1= 0
##$TM2= 0
##$TOPLEV= 0
##$USERP1= <user>
##$USERP2= <user>
##$USERP3= <user>
##$USERP4= <user>
##$USERP5= <user>
##$WDW= 1
##$XDIM= 32768
##$YMAX_p= 434226836
##$YMIN_p= -283155
$$ End of Bruker specific parameters
$$ ---------------------------------
##NTUPLES= NMR SPECTRUM
##VAR_NAME=  FREQUENCY,     SPECTRUM/REAL,   SPECTRUM/IMAG
##SYMBOL=    X,             R,               I
##VAR_TYPE=  INDEPENDENT,   DEPENDENT,       DEPENDENT
##VAR_FORM=  AFFN,          ASDF,            ASDF
##VAR_DIM=   32768,         32768,           32768
##UNITS=     HZ,            ARBITRARY UNITS, ARBITRARY UNITS
##FACTOR=    0.157963299565203, 1,           1
##FIRST=     4112.59757327136, 0,            0
##LAST=      -1063.38586358165, 0,           0
##MIN=       -1063.38586358165, -283155,     0
##MAX=       4112.59757327136, 434226836,    0
$$ Real data points
##PAGE= N=1
##DATA TABLE= (X++(R..R)), XYDATA
$$ [...]
24206 18683 16556 43914 67305 80744 39949 27211 19345 5670 13583 15341 38084 37628 50023
24193 50023 35736 187 15887 29931 56485 65208 60075 54042 49893 52847 42723 10278 35124
24180 35124 19925 7134 4900 -25276 -54121 -38576 14348 12658 -7332 -22572 -37282 -38439
24168 -38439 -13547 5360 -3218 -8382 14830 31006 15784 13988 5713 -14341 -5380 27691 44033
24155 44033 44913 27014 24295 23925 68858 72217 26164 -7783 22461 5274 -15628 -202 13913
24142 13913 -2841 5277 -14327 -18714 -2172 -15784 -14446 16691 43144 53064 33002 1982
24130 1982 -4672 6246 35104 65937 55091 40027 33391 33465 32662 42681 51752 37950 31272 36885
24116 36885 17221 2130 -12023 -25293 -12500 -34021 -68798 -37819 -7913 20456 46898 68925
24104 68925 86410 79081 36388 22855 36987 28449 4477 -8849 -8518 -7993 5510 13847 63963
24091 63963 60660 40467 6435 -32637 -18653 -13810 -15139 -2348 18874 41007 19077 -4876
24079 -4876 2863 22958 96020 86743 57269 27312 15328 22590 -1356 -703 -10311 -14848 12693
24066 12693 8512 -2737 2881 45623 102729 115607 87479 24957 -9360 422 58585 55122
24054 55122 18592 22282 11118 -6784 2734 12949 17834 45398 52081 41608 14149 -15175
24042 -15175 19140 28465 4022 -13561 -12225 9019 17377 -1383 -20281 -14647 -25706 -41005
24030 -41005 -42934 -72118 -50398 14201 22260 6063 29175 32919 4565 -13546 -12342 3112
24018 3112 32579 -22427 -55029 -26898 42723 31150 24936 -8475 -68 15645 3715 -10622
24006 -10622 4994 4921 -19379 -41344 -15515 21101 54679 56276 33415 -8964 -17071 -30756 -45545
23993 -45545 -21623 -22621 -16146 -34764 -29451 -4972 -8360 -26670 -24879 -6380 -7471 -2806 1125
23980 1125 30760 25906 -30668 -58106 -28909 -5472 2904 12436 34601 16503 -29122 -49010
23968 -49010 -22216 10994 41706 46505 -5747 -15761 -22368 582 -3685 -45453 -69852 -70103 -70712
23955 -70712 -54899 -30753 -10411 2382 -13159 -6379 -14353 -30540 -8680 9777 9327 3044 -26016
23942 -26016 -41167 -26585 -9133 17718 -7643 -32129 -37121 -37544 -12508 1082 -5132 -10688 -16751
23929 -16751 -17190 5839 2646 9573 -12373 -32288 -50735 -68103 -59805 -27831 -47721 -60753 -59241
23916 -59241 -55766 -38518 -57256 -19873 24113 18306 -19355 -30338 -9410 1724 -4909 -6113
23904 -6113 -14947 7643 9621 -6434 -12539 -17006 -39587 -36540 -56082 -70831 -67268 -53384 -23908
23891 -23908 -19986 -29127 10103 6470 17454 14436 5560 -16138 -30477 -48717 1651 34487 57556
23878 57556 56191 28933 -28051 -31237 -15372 -16655 -17320 1626 9394 -7739 -9148 -13686 -10353
23865 -10353 8669 17725 2019 19814 16574 -6738 -15778 -26470 -17146 -30486 -36026 -41059 -25244
23852 -25244 -36642 -54238 -37508 -11579 29633 12910 16158 17477 22157 24470 25004 27901 15249
23839 15249 -2152 -15155 -44623 -38169 -46967 -67892 -14063 -14940 -28432 -7144 13958 18975 -2814
23826 -2814 -26518 -12699 6981 2729 -6688 -20358 -23718 -35362 -19340 17932 46579 51001 53592
23813 53592 66907 67470 60792 34454 17509 5592 -12908 -10468 -2304 1045 -23187 -52935 -71753
23800 -71753 -28952 22478 39906 33297 11047 -3690 -17603 -9715 12674 9056 14532 23114 24650
23787 24650 29448 20866 18494 7302 -396 -15862 12921 50184 47349 33463 17239 -4652 -16005
23774 -16005 11699 -726 -21171 -14542 20350 10994 7275 923 5552 -4790 -33677 -36829 -12509
23761 -12509 26879 40980 10206 4088 26857 3204 -1042 -2164 -11758 -38900 -26973 -24079 -19105
23748 -19105 -6250 3066 22573 24614 11846 19937 52568 68939 70977 84683 79768 55585 15402
23735 15402 -701 14073 28912 22794 -20064 -45671 -13439 2382 -10824 -28112 8863 24506
23723 24506 16810 5291 -4320 -30889 -55222 -48584 -9831 16106 27557 39699 39195 35396 -3139
23710 -3139 -2438 -4394 20504 6150 -15514 -19009 -8394 -9925 -11836 -47473 -56970 -15927 -9479
23697 -9479 -5867 35310 18173 2257 -12240 -22407 -28430 -41062 -35874 -14957 7270 1977 -5918
23684 -5918 -15471 -4878 -32079 -30124 -27263 -54794 -57357 -40026 -38215 -16709 -20593 -34406 -41506
23671 -41506 -60758 -41798 -26882 -32993 -2669 -15503 -38475 -48757 -63794 -74198 -44734 -15485
23659 -15485 2196 21057 15575 -2154 -28957 -46723 -35434 -50276 -37321 -39166 -92359 -71477
23647 -71477 -10848 9507 -1784 -23984 -12295 -26704 -20183 -22548 -9326 -26316 -28869 -41270
23635 -41270 -41505 -55284 -61253 -56819 -30973 -5481 -11691 -13434 -16369 -19368 -27743 -66128 -71640 -45065
23621 -45065 -45764 -32915 -12642 33552 18115 2447 9606 -30621 -11647 26784 50329 62342
23609 62342 45136 752 6537 26428 20563 15263 28548 36971 52700 56855 44835 34382 35962
23596 35962 19294 4104 -3433 117 -14066 -15519 -4655 -17581 -34969 -29033 -18028 6805
23584 6805 28962 39867 33287 681 -32733 -24606 -3244 -9371 -27997 -13626 11451 220
23572 220 -7303 7891 -2455 -12990 -3636 -5270 -3674 9738 13652 7353 -20405 -18073 20811
23559 20811 13698 -7451 -2153 -27427 -39056 -17030 -20065 -7432 15645 8039 -2630 8816
23547 8816 7462 -5682 32010 14673 1825 -6904 -3402 -163 6055 30964 14311 -19491 -26087
23534 -26087 -12363 -1750 1429 -14213 -39615 -44938 -43887 -19186 9986 17352 29007 16056
23522 16056 -31860 -43104 -43263 -22898 -14018 -14951 -16621 -34719 -31745 -4304 12193 -9483 -46213
23509 -46213 -44024 -38925 -46279 -34479 -53722 -42917 78 14193 13705 6690 10123 36449 62354
23496 62354 59599 40497 -6204 -5373 -1109 -16244 -11101 12904 38272 9982 -26727 -3925 -1396
23483 -1396 13569 21497 2596 9590 12618 -11933 -12664 -35596 -47384 -46303 -76455 -79757 -71273
23470 -71273 -37280 -33291 -3686 28206 56546 90881 74988 58396 30041 20501 9906 -6213
23458 -6213 -16272 -2477 6263 5715 23026 48667 58922 54412 36318 37784 27134 15067 -7701
23445 -7701 26506 26348 12240 5759 -25498 -54352 -50712 -58547 -20692 -36300 -5104 19279 19743
23432 19743 -7844 -24342 -13108 -20314 -36464 -52345 -33372 -67297 -57243 -32816 -41577 -41132
23420 -41132 5571 13019 14316 -9497 -34902 -24697 -32885 -25305 -11077 12155 25646 5791
23408 5791 23013 14838 -12952 -2827 31416 25819 18010 19349 45729 65917 44389 16593 13034
23395 13034 33891 44975 22698 31855 35317 33037 48988 52935 49848 18088 11823 11377 -8962
23382 -8962 -13152 23578 42283 19629 -443 1161 20168 45327 62334 52457 54559 40808 14427
23369 14427 2101 19448 27468 22288 -14043 -26836 -7672 -12750 -33010 -9613 422 23352
23357 23352 -14624 -19222 -13918 1448 14139 24822 56630 77920 80322 51530 21549 6963
23345 6963 3103 5256 -4687 21117 22294 17519 22293 18112 28528 -2388 2874 30475 58286
23332 58286 57106 49983 32623 21986 26160 8834 21940 27599 18426 20031 34260 -1821 -23423
23319 -23423 -32350 -21372 -8 191 -20415 2810 12839 20896 35495 19873 6113 -4518
23307 -4518 -35874 -57410 -81414 -86611 -58832 -38763 -46569 -41076 -40005 -50182 -47348 -29822 -41781
23294 -41781 -44385 -32140 -23010 -50492 -39003 -21048 33926 44156 51628 55630 45376 14957
23282 14957 2984 -4467 -25441 -6180 -9363 -45189 -80882 -59366 -6116 15976 11100 5228
23270 5228 -28945 -11757 -3041 -2923 36755 26136 7089 2154 -16658 -14090 5211 6357 5445
23257 5445 10453 50086 80412 73527 45649 2962 -15874 -22475 -18231 -45 17570 8288 -4033
23244 -4033 -7812 27834 61341 65934 44473 36038 12461 -4846 -19993 -65691 -61861 -602 19809
23231 19809 10896 -18472 -29841 -30446 -38885 -6972 -20150 -27972 -16096 -36655 -56402 -68938 -65472
23218 -65472 -74482 -83951 -83709 -51328 -48021 -48755 -27405 -6088 -32292 -59132 -28821 -21959 -11990
23205 -11990 12740 30031 45766 43579 53358 28833 -897 9918 39809 5591 23435 32247
23193 32247 58733 30794 7254 -7060 -35228 -53248 -21751 -27774 -7557 -21011 8946 25222
23181 25222 20667 -4808 2542 22183 29428 20373 -12556 -32869 -48 28448 19285 32925 42187
23168 42187 -4803 -29216 -9276 1860 -4716 -27068 -38168 -7352 2839 -11671 -16729 -18502
23156 -18502 -30645 -46509 -16539 20199 13033 1357 2613 -27637 -33508 -35053 -27249 -18806 -36132
23143 -36132 -41003 -14097 10067 -31015 -51245 -6962 -10642 -33066 -16948 -21621 -7913 -25813
23131 -25813 -51558 -51903 -53645 -13642 16715 30088 49563 18510 -3718 -11980 -16926 22246 21342
23118 21342 -2464 -32171 -45827 -42967 -43172 -2542 -21293 -19575 -7404 -21636 -19945 -8230 20563
23105 20563 29688 26269 26992 13842 35309 22482 -21955 -39694 -25326 -10818 -35052 -40419 -22102
23092 -22102 30721 38317 41765 37824 40415 39944 56773 36901 11553 18557 27595 16747 -27135
23079 -27135 -22516 8229 -5446 -2327 -484 -18318 -72337 -103898 -81933 -26755 29778 31836
23067 31836 13613 -12999 -13504 9250 4651 -1205 -21948 -21477 -17150 4880 6431 -18529 -5668
23054 -5668 34619 34613 8243 4923 39385 34037 7223 -5653 -3739 -8389 -15556 -40104 -48049 -61960
23040 -61960 -53721 -42093 -30329 -15315 -18469 -6013 24199 35671 30934 -802 -15893 -28320
23028 -28320 -21277 -22091 -19394 -33363 -27112 2239 -2820 -50409 -50329 -40597 -52339 -41501 -47374 -37530
23014 -37530 -42113 -57584 -43326 -27059 -21438 5577 11541 -4525 -16237 -18384 -6049 -2525 28716
23001 28716 52170 52932 40461 15762 20208 15671 4658 -4042 -21760 -14750 -9387 -8765 -4286 -2079
22987 -2079 -15449 -4780 24578 21486 17538 5350 -24427 -26515 -13178 -815 -6222 1625 -2369
22974 -2369 -36532 -25698 -11868 9861 21459 35569 44445 28373 21140 4167 -20368 -33482
22962 -33482 -10549 1853 11394 21793 24689 7249 -5438 -11757 8104 2468 -17222 -1140
22950 -1140 6230 -22515 -36752 -8492 -652 -6091 -28617 -53120 -60793 -49611 -12132 24535 61644
22937 61644 50591 41661 59418 54527 53983 39958 54434 26579 20512 15331 27453 62252 91243
22924 91243 52419 43836 26911 -11342 -16749 -16567 -11525 -928 -8825 24227 29419 3055 14045
22911 14045 4384 26600 74722 59477 43837 7570 -17767 -7810 7666 -6369 -14826 1821
22899 1821 -20655 -45960 -19109 -32868 -47900 -10332 19587 24712 15093 34885 49580 53207
22887 53207 75354 60968 62553 30984 -3704 -2017 -11940 -14685 -12160 13070 14376 30963 38131
22874 38131 11573 12536 -789 3734 -15953 -13717 2908 548 -27237 -41038 -58461 -41541 -14304
22861 -14304 -10731 -5731 27977 36421 25127 45485 33827 -14047 -25836 -20101 -30291 -11751
22849 -11751 -19645 -22245 -39011 -49872 -45405 -45228 -24937 12925 14286 18674 -3284 4898 27044
22836 27044 4591 -10884 -19699 -25059 -946 10337 -26758 -5166 51451 30761 9180 26734
22824 26734 41938 31482 24350 -13433 -36308 -41589 -10504 29366 17907 12714 13796 -20660
22812 -20660 -40210 -20920 -34655 -70971 -64046 -40343 -30133 -14631 -30713 -64122 -82778 -45464
22800 -45464 -49182 -62788 -48147 -23440 -6406 -5733 -23267 -59029 -55799 -3125 11281 12469 17509
22787 17509 43538 20598 -5449 -3536 8179 13615 -17589 -56482 -44252 -55155 -32233 14825
22775 14825 20326 39817 23591 12607 -16310 -28355 5195 1805 -27849 6037 26604 56753
22763 56753 43342 19513 18307 18631 28246 20732 15774 22835 9944 -14290 1143 36930 46451
22750 46451 66389 30808 -14588 -38614 -67437 -38607 22327 75180 93516 74695 40865 42875
22738 42875 16223 -9889 -20869 -6602 -12553 -16111 -7336 7799 9043 24908 33280 -2783 2643
22725 2643 31801 12388 -6135 -32795 -57519 -49037 -29639 -29465 -28636 -3615 15207 -4340 -13673
22712 -13673 -17190 -18991 -51209 -46113 -78918 -82863 -73754 -67424 -45003 -26682 -10736 -7495 -1324
22699 -1324 -12171 -22848 1490 -8270 -23539 5152 24505 8237 883 -8069 -32751 -11120
22687 -11120 11296 674 -26087 -40779 -59411 -82586 -60191 9450 14599 24033 31761 18774
22675 18774 -9611 3772 17396 12671 27914 5830 -26658 -38407 -42872 -24526 10168 13280
22663 13280 -17528 -68912 -62778 -52159 -33891 -22114 -26078 8295 10338 -1622 4352 2233 -5039
22650 -5039 13345 -8525 -30686 -35447 -43983 -30295 -11393 -35001 -35917 -52799 -67345 -56668 -33234
22637 -33234 -52265 -37578 -887 7397 -32235 -891 2987 -6338 119 -3253 -24444 -5884 -17672
22624 -17672 -13420 -32859 -50314 -37913 1363 64683 102744 144157 122086 120298 106244 46202
22612 46202 -11842 13831 14339 21778 45053 30647 -8011 -10232 27601 43046 1441 -32378
22600 -32378 -29932 -41641 -75711 -56307 -13090 -28528 -29805 3562 61492 36568 -18478 -49868
22588 -49868 -54888 -26078 -5543 -4432 20856 13848 1351 39587 41132 19431 17641 263 1489
22575 1489 28551 60421 39421 18830 19770 19819 8264 34563 4172 1305 308 -25750 -19895 -11768
22561 -11768 42973 44402 27440 -24572 -26085 -9830 -7422 -19356 -10767 -12095 1552 -16916 6659
22548 6659 1775 -30748 -12599 6404 -9746 -7383 16428 14614 15158 -32965 -63013 -87407 -51527
22535 -51527 -31794 -33919 -32807 -34219 -17831 10670 40007 20655 20237 37914 17970 -509 -18015
22522 -18015 -24910 -24077 -24721 -36049 -15388 1305 11576 22889 23767 48528 81369 107502 94669
22509 94669 72660 59124 54491 58652 21199 -21530 1523 28569 40064 34729 46256 36479
22497 36479 43994 42114 13969 -2622 21528 28197 57280 66002 36374 34323 17434 -11056 -38476
22484 -38476 -51957 -62946 -76887 -64956 -64075 -18295 -25569 17914 41668 29769 37831 20336
22472 20336 15659 9624 -249 -8758 47134 100004 119442 126236 101158 61792 61299 51237 35747
22459 35747 50147 47493 33647 25099 3804 28418 41440 24662 16411 -3957 -35159 -29145
22447 -29145 -20686 -14476 -7066 -29965 -32784 7323 31478 28510 38209 23276 259 -755 10835
22434 10835 14565 42554 82832 50140 997 3061 27877 10481 6334 38242 11963 -10152
22422 -10152 997 31555 22252 55266 44668 5790 15838 18279 32858 13191 -4813 -16119
22410 -16119 -35720 -17715 21817 49781 49395 47170 43999 36165 12647 -20524 -50733 -55213 -8060
22397 -8060 -1447 -8529 9290 25154 65497 92439 45002 -7045 15047 35819 35310 39272 28265
22384 28265 20098 -7788 -28718 -23506 -1640 30112 32600 27177 1996 -15065 -20224 -32629 494
22371 494 -13529 -29065 -39332 -25976 -33901 -8108 -14639 -33054 -31618 -58271 -28454 -5569 -5556
22358 -5556 -23 118 33684 52252 30510 23161 -26645 -47261 1049 12544 6041 -8899 -17689
22345 -17689 -21485 -19455 -10417 -31805 -29151 -15093 -25668 -16052 -23631 -19465 1066 16317 1072
22332 1072 -8269 -31863 -31487 -54154 -57086 -47086 -19004 -35624 -38394 -44688 -5388 32133 39083
22319 39083 64124 46231 17818 -2027 16877 40340 43985 25352 35782 21960 -10635 -55960
22307 -55960 -8995 -1146 -2912 -12259 -15255 -5318 158 -27466 -23141 252 12167 -3365 11736
22294 11736 10237 -43307 -62117 -61989 -74247 -82640 -66555 -49129 -10422 2408 -5853 -26811 -68665
22281 -68665 -69337 -32906 -37095 -32905 17652 41360 29685 55860 79865 55694 14035 887
22269 887 38430 47713 30239 41190 24893 -7834 -22723 -5965 -19937 -45821 -68498 -41789
22257 -41789 -20107 3737 9740 6696 33487 56988 48533 18666 -9437 -2766 5025 7176 11600
22244 11600 943 25767 32499 57416 63377 49940 45771 32969 33223 15593 4738 -14582 -29353
22231 -29353 -64599 -66864 -37836 -22628 3089 21563 22227 10555 -1680 -15981 -12567 -16994 -46993
22218 -46993 -11798 5416 -8913 -25315 -28022 -16037 -34480 -29852 -33943 -23855 -14032 7209
22206 7209 9412 -6015 -23754 -8198 2582 -37925 -16339 -27082 -30040 -10344 7934 31598
22194 31598 49860 31189 16163 17324 38322 25733 -8904 -29183 5073 4778 1515 8279 11772
22181 11772 8497 -15832 -19395 -30055 -37321 -56234 -55270 -64116 -59248 -34789 -18294 2027 8682
22168 8682 11547 -4783 793 23209 38331 2150 -36864 -26816 9005 6254 -3894 8141
22156 8141 14722 37678 35141 -6983 -12453 21117 35426 9034 -17246 -8457 37875 54011 48043
22143 48043 48208 41594 -3366 -31630 -21236 -57417 -33581 -26419 -18287 16980 26454 -172 -20588
22130 -20588 -18590 -2774 -18906 -4894 -1067 -35357 -39279 -3149 -6311 -11509 -19732 -27542 -5331
22117 -5331 19735 19979 -26398 -44501 -52893 -21243 41258 14635 -2959 34262 22834 10536
22105 10536 -4814 -3131 -29717 -63470 -50830 -13384 -19011 -39191 -1075 16115 23150 23837 -17212
22092 -17212 -49759 -92477 -81833 -73991 -88325 -107398 -92814 -67549 -30062 -57484 -54032 -18117
22080 -18117 8057 -7577 -27770 -24877 -15347 -14747 -5760 13103 7417 24165 1540 -37189 -43675
22067 -43675 -37550 -41303 -43412 -10694 1506 -22232 5995 13613 15511 30321 1575 860 -7129
22054 -7129 15779 27163 -22321 -27424 30635 67779 82364 72250 47097 34132 31019 20653
22042 20653 21910 50053 37848 23246 -19504 9947 13543 -25708 -39679 -39708 -44831 -40809 -16284
22029 -16284 7502 27280 -6742 -6619 -1414 23609 29349 177 -20201 -2448 19657 20252 12047
22016 12047 -19936 -18964 17786 -1557 -21738 4499 -4793 -12585 -26476 -39116 -24884 -10227
22004 -10227 -11978 -8567 -38586 -9295 -10130 -25988 -25862 -35008 -19269 5648 11077 -19774 -47721
21991 -47721 -69637 -42485 -10030 -17183 -5326 21264 19018 24739 -11152 -53747 -39562 -37798
21979 -37798 -18840 -3131 7986 468 23561 21345 -12400 -15075 12238 -3849 -26755 -7778
21967 -7778 -29016 -7017 17074 16540 7237 12981 21301 18344 -538 3169 24333 43772 37795
21954 37795 7638 -14041 -3455 3873 7653 -22930 -45621 -9286 8271 -17399 -27059 8369
21942 8369 44868 31808 30906 19852 18571 44038 52925 53651 59136 71023 41093 39342 60164
21929 60164 62200 67499 46836 44925 47912 22130 12773 -11759 -10827 -5668 29584 45923 30025
21916 30025 10952 7953 -9451 17517 41674 22268 -19738 -23734 -897 -4620 21936 4842
21904 4842 -3129 -4673 -14096 -37393 -59716 -33534 -3865 -378 -29851 -35381 -29684 -8618 36081
21891 36081 33664 24308 13068 -9665 -21465 -17455 244 1249 -1912 -26584 -50638 -34219 -12989
21878 -12989 -11019 -41370 -23792 -10205 -27820 -31799 -23571 -38630 -24265 -22056 -39413 -31494 -2762
21865 -2762 9879 38214 49011 -3431 -23096 -1017 -12388 -38592 -58859 -59993 -58489 -42772
21853 -42772 6818 -20485 -7861 -15963 -6676 -4699 -18676 -2047 54414 54219 36295 16355 -14425
21840 -14425 -14814 -26343 -5361 10 7514 1180 -17186 -27225 -53323 -77275 -54906 -7603 23726
21827 23726 35813 44237 63508 45541 20086 -7998 -19370 -30825 -42634 -44587 -17963 6876
21815 6876 21538 5675 -10263 -26206 -47323 -34708 -1680 -6508 -19572 -10001 10460 -6255
21803 -6255 -35816 -9111 -25572 -20614 4149 8543 20184 13105 9628 -9241 -28545 -19174 -14936
21790 -14936 -13772 -12084 -34556 -28023 12884 14544 12641 -11171 -22215 8621 12565 5159 16545
21777 16545 10467 -10183 -12046 15872 22163 11600 28352 34161 9389 5491 20768 25933 19133
21764 19133 -6368 -29490 -42283 -34222 -25789 -18736 -44841 -45579 -48266 -45200 -70962 -65374 -58396
21751 -58396 -73243 -89472 -75702 -81676 -93500 -78488 -25833 -16508 -49805 -35396 -14725 -15649
21739 -15649 -16826 -20735 -29094 -6145 57172 116196 79070 19802 -32316 -31835 -13400 5262 11921
21726 11921 21579 9563 -3155 8036 45981 39130 -9736 -32760 -30984 -20220 6254 3306
21714 3306 41908 59226 55412 49809 11689 -22450 -43922 -6636 15268 -10322 -14992 -11492 -11721
21701 -11721 19352 76768 108816 91972 90509 56650 11477 -2878 -26020 -50080 -39142 -28962
21689 -28962 -28274 -2913 8104 8059 26277 -2275 24627 34966 5355 925 23269 36021 42892
21676 42892 11570 -1082 -11759 -6764 11533 27537 20572 -7205 -11743 -2418 -38111 -35760 -1951
21663 -1951 -8436 -11053 -17928 12795 19044 28154 46803 38289 6640 -25952 -19431 6498 6594 -14173
21649 -14173 -29302 -35610 10319 4920 27944 38582 18393 28727 11201 -28754 -35188 -25796
21637 -25796 -7964 47277 81615 50796 35479 16664 6035 -29658 -58861 -38236 7889 36462
21625 36462 26173 33655 13566 7792 8463 29256 47352 47775 23215 4598 -26395 -43593 -27769
21612 -27769 7074 9300 -899 12686 45939 28309 -2929 -25089 -5135 11140 -11703 -10512
21600 -10512 -23483 -26543 -14481 -21827 -41390 -50058 -52549 -39019 -2937 -4139 -4201 -35920 -49065
21587 -49065 -48084 -51111 -61665 -26830 -18315 -58604 -67446 -20267 456 -19986 -35262 -16254 9282
21574 9282 -4373 -2739 -12573 -27280 -26688 -45901 -34778 8841 9498 -15024 7737 48689 38732
21561 38732 49822 60125 33735 20399 33738 45499 23922 -10281 -19172 -20625 -39295 -39296 -37526
21548 -37526 -15964 4045 -18401 -10281 -29426 -34424 -8362 -2992 48950 50773 63771 45022
21536 45022 44964 31817 -5699 -6736 -10522 -8582 -14599 -67273 -91068 -71900 -9204 21262 16459
21523 16459 15073 3321 -31974 -42979 -21624 -12159 -39548 -63774 -40673 -22744 16482 54475
21511 54475 56683 47244 62833 35414 7080 -17511 -9724 2071 -3471 -4691 18895 29372 -6714
21498 -6714 -19667 -9370 449 12703 13595 51720 36915 8293 12276 18642 9263 18393 7971
21485 7971 487 -27181 -43742 -25900 -2588 8304 -22862 -61336 -37901 -8867 -21705 -58298
21473 -58298 -47394 -36065 -21104 1693 24050 36963 30933 34353 50505 56428 53116 43386 6269
21460 6269 -23449 -46928 -45064 -49112 -40649 -37624 -17273 12915 35450 33567 42940 62174 95814
21447 95814 94860 47680 -3355 14640 27314 -5001 -20289 -44245 -23113 -31260 -51629 -28761
21435 -28761 -23540 -30947 -24382 -30647 -48277 -63350 -97516 -85163 -66751 -36275 -10836 -1681 13579
21422 13579 -5985 16 -12925 -41668 -33757 7415 21341 42057 26027 28128 24366 37591
21410 37591 53671 56204 4776 -24121 -23727 -31763 -6643 -6599 -32873 -26431 6171 7853 7519 37769
21396 37769 53371 55238 50685 33339 27341 24749 8384 -7796 -18369 5100 10600 -6985 -1932
21383 -1932 -4260 -12698 -26447 -20693 -5848 3070 8524 40561 14383 -39758 -46294 -12512 13968
21370 13968 27984 45988 46335 22629 -2869 -17565 -18458 -29651 -26947 -36579 -67811 -56255 7633
21357 7633 7471 -602 -15611 -35951 -50559 -45684 -41464 -25154 -33990 -19851 -20306 -51920 -54176 -37030
21343 -37030 -39023 -57296 -89507 -87190 -67968 -65592 -37336 -28000 -31833 5723 12611 -25040 -25817
21330 -25817 -24786 -5162 -8123 1324 16528 20240 17466 8083 6417 2919 -2990 96 24518 30129
21316 30129 14086 7373 -57 12177 36176 8650 -30910 -34356 -13483 -24361 4390 41954
21304 41954 40989 13923 29239 7611 -16154 -33585 -18725 -9918 -6511 -1443 21524 23971 -78
21291 -78 -17716 -17797 2154 -35475 -50887 -50861 -43488 -24702 -28745 -18042 -26376 -16555 56578 39471
21277 39471 31070 7887 -17548 -6524 2287 -27260 -22376 26570 63884 53556 41530 14430
21265 14430 2021 -218 -17577 -45949 -7851 1389 -22690 -17890 14924 9010 -7347 -9457 11162
21252 11162 3198 -7835 6382 -11464 -28607 -13090 -12372 -16128 -24707 5770 3223 8724 -30434
21239 -30434 -76664 -38643 28682 48421 14782 -7988 -10350 11318 23213 23022 -10588 -37235
21227 -37235 -41566 -45311 -62693 -55488 -29847 -20106 9938 -24013 -41530 -14758 14764 24921
21215 24921 2988 -9819 -32775 -24469 -37875 -37389 -29320 -29710 -26683 -24969 -6843 -2258 25460
21202 25460 22395 -6701 -9957 19810 27792 37678 31125 -14448 -52514 -70943 -53986 -18780 -23063
21189 -23063 -37714 -18903 27465 8300 26000 65355 44374 -13692 -30485 -33445 -50227 -24866
21177 -24866 -17387 3548 -16524 -49678 -23163 2788 -15058 -8940 16661 72465 80213 47756
21165 47756 4786 1697 -5862 -26572 -15012 9875 31462 37213 28018 19448 34742 60658 74567
21152 74567 62603 54392 53119 31704 14541 17544 45696 54294 8216 -15758 -17039 -12003 -1584
21139 -1584 2404 21167 3687 -12851 8707 10878 188 2261 13030 31468 38264 16118 4424
21126 4424 -4202 -12498 -41879 -66725 -56635 -65587 -53432 -26670 2335 -6024 -1616 -1921 11915
21113 11915 7734 16294 13795 24435 25965 9996 16149 -9693 -23637 -12599 -3040 -41248 -36462
21100 -36462 -26549 -34763 -35833 -37886 -46475 -54874 -16448 15346 16415 19893 34779 42848 33058 14792
21086 14792 28606 10362 -9307 15942 18750 32996 28196 -2938 -15498 -4791 -6635 9795
21074 9795 19348 25694 21988 -14964 -2798 7020 18109 21231 36731 20229 -734 18593 -4501
21061 -4501 -11263 -19800 -66 37062 59027 41454 5344 -1529 15990 12264 -15568 15045 35070
21048 35070 1049 -26332 5090 -10055 -7581 21673 5650 24529 28413 23515 -17815 -26456
21036 -26456 -20616 2106 23247 -4829 15701 25730 36834 17501 -13381 -8339 10141 15539
21024 15539 -245 -29351 -26634 -30941 -52289 -52750 -41380 -21090 -19045 -32881 -14307 -40092 -59219
21011 -59219 -52657 -21784 -33868 -23665 -16933 -13302 -10467 -38457 -47913 -26099 2610 23594 20548
20998 20548 26826 64903 67611 26688 7743 2660 -29958 -33036 1943 6091 -11297 -18008 24675
20985 24675 76659 58490 51097 62036 112587 93207 47708 16652 1787 21149 4919 -17858
20973 -17858 -27810 -2538 -12025 -48640 -62961 -28816 -20527 -40994 -29628 26471 74979 60411
20961 60411 40882 18412 -2238 -11372 -46895 -23933 18180 56865 50425 35471 -5802 -36770
20949 -36770 -38081 -31946 -21744 -10079 -11996 -13654 -40984 -47584 -23352 -8748 -5407 -3889 -14351
20936 -14351 -26716 -11055 -27058 -41905 -51158 -57574 -29583 -6642 -22812 -12076 -452 -13431
20924 -13431 -21981 24455 29249 34762 42384 42360 11368 -4113 -18242 -52341 -73053 -70293 -52960
20911 -52960 -30459 9512 20793 49538 43462 -1916 9336 8593 -4680 -35264 -20370 -4627
20899 -4627 959 411 36851 31922 -27401 -79859 -89448 -61129 -26260 -7318 -1581 9649 47437
20886 47437 48227 27297 14679 -279 -49438 -41564 -3478 -18327 -13899 -1912 11099 16946 -15662
20873 -15662 -23274 -3687 -15740 -39663 -25711 -28008 -5127 2330 -14056 -14640 2914 35374 44106
20860 44106 35272 19147 3924 29158 75050 43926 37397 27306 21657 2380 -15754 4095
20848 4095 12990 -5112 -9988 -913 36316 48040 29642 53729 69641 20947 7039 -7107
20836 -7107 -21866 -10197 -26583 -26056 -12849 -16276 1682 -32613 -13254 1501 10911 23840 10961
20823 10961 10687 7554 -25449 -30425 -1084 16554 31231 -7634 -33058 1325 -7557 -31036 -9473
20810 -9473 -15737 -6774 16980 6224 1935 -34320 -38172 -8532 5585 28395 29530 10252 46724
20797 46724 92147 70428 41107 37275 51730 42164 5980 -23230 -47368 -30827 12340 -6416
20785 -6416 -5149 -4977 -19544 -14392 -20202 -19104 -9205 -8712 17577 41990 31428 13548 2979 5456
20771 5456 984 18373 28577 12738 -545 15318 -2 -23506 -28413 3052 25312 44381
20759 44381 40891 47836 31862 16497 12661 13840 48872 54780 63611 57819 17054 -22929 -35140
20746 -35140 -39849 -14410 -5193 -18803 -38358 -15474 19366 -26808 -40250 -21922 -13145 -7396
20734 -7396 6842 33520 65854 94270 81883 34219 -2184 10961 26132 15199 6905 -16269
20722 -16269 -24740 -269 31028 40334 53867 59994 28336 33398 23738 27096 56246 65104 59004
20709 59004 34820 36010 36360 41506 38234 19208 5200 -14675 -9515 28061 61920 81213 66725
20696 66725 30950 58551 70582 26587 11202 19131 33033 1369 23015 52686 42205 36800
20684 36800 31327 12914 1982 -17753 -36181 -17062 -24176 -13182 12114 32720 62110 38565
20672 38565 35537 9022 -5647 -24195 -16693 1995 35541 35637 64116 84436 70727 47109 52381
20659 52381 48050 63511 58860 52834 24045 -23662 -36201 -15434 24034 6041 -27654 -44708
20647 -44708 -38323 -34251 -25330 -597 38431 13784 -8615 -8123 -272 -11418 -21938 -31732 -54226
20634 -54226 -45219 -49890 -35282 -29597 -36152 -27384 -28372 -21369 -20638 -22076 27991 52825 54370 38138
20620 38138 -521 -5778 10771 -22196 -24660 -35123 -26863 -20021 -21710 -12847 21518 39784 25750
20607 25750 15846 31034 10002 22949 1245 17333 26089 -1012 17397 34089 23275 31991
20595 31991 21043 34827 43986 41310 38127 7546 24735 54067 77326 58346 19359 26474
20583 26474 16443 -12664 -22102 -23834 5591 3926 -9241 15844 26774 51083 27451 25425
20571 25425 4730 -16447 -734 20801 8003 -2180 -45567 -58042 -13638 17682 20231 21502
20559 21502 19608 28976 19587 9348 -8679 -48076 -15850 22307 28322 33710 35271 28345 15363
20546 15363 9794 -15652 -53744 -65352 -44359 -48784 -58431 -15958 12045 25204 21221 24148 44691
20533 44691 79484 88583 55930 12587 10721 17786 20298 -1884 -10159 -20739 -849 36870 38597
20520 38597 -3992 -16840 -3496 6738 12275 2416 14592 24428 -9743 -15164 23708 25770 39719
20507 39719 34760 -18852 -55160 -40839 -30898 5090 47286 53415 15582 7141 29083 25072 38123
20494 38123 81129 99580 81056 58116 28535 22825 14854 14780 -9843 -51838 -51969 -39155 -41454
20481 -41454 9704 84039 107506 74306 39544 10218 -9504 21539 52239 66352 60689 71226
20469 71226 35761 7142 -19926 -14828 -5489 -6372 -27704 -32248 9313 18784 16333 19425 8182
20456 8182 11050 14105 -18111 -64404 -58794 -54620 -34711 -20190 -1011 327 -14951 33108 49699
20443 49699 31725 28362 53299 38644 7014 20366 14053 1615 13148 26698 37670 19099
20431 19099 23369 34637 25142 13367 21321 53270 26068 35336 8089 -27811 3492 35828
20419 35828 59725 23915 -19241 -20879 -4483 38747 32032 40917 38973 24639 32788 41332 22685
20406 22685 36083 27470 -14257 192 20689 39467 77460 72052 58725 102300 87147 122489
20394 122489 122658 93441 94226 102029 91236 97364 82051 40212 27154 16036 7116 17630 22293
20381 22293 11250 290 -33042 -40722 -20819 13609 42329 47438 51835 62603 42652 28137
20369 28137 32325 43262 8525 -26310 -17149 -10853 9801 33337 36247 7688 -20252 -12117 -12564
20356 -12564 -18665 -19349 -14281 4881 5828 27168 65231 106275 87695 47497 20883 7695 17933
20343 17933 34415 43442 8677 -2436 6419 7813 -23492 -2256 31108 48234 54396 37976
20331 37976 39444 43229 42976 42944 44120 31375 21523 21365 17525 1212 -6003 -9734 -10899 -19664 6404
20316 6404 58000 37015 42820 35053 36955 41512 33544 9535 14273 -4074 -23436 13962 19690
20303 19690 27594 38341 -8581 -16245 28249 37273 42498 13146 -20155 -48973 -17275 22529
20291 22529 69309 75034 68070 62505 18147 -19239 -17041 -29013 -52129 -26572 12649 17928 15521
20278 15521 9054 22394 37586 12510 -12984 -40958 -39751 -31369 -36586 -15600 7155 15400 22105
20265 22105 23995 14086 -8407 19027 46337 32196 -5737 -18745 -6087 -20180 -38337 -25320
20253 -25320 9637 14852 11980 -1102 17628 41905 39815 13639 16458 2213 9147 780 3503
20240 3503 -14663 -24718 -4478 -11481 -16637 -39017 -41471 -2418 13666 26760 22912 31934 50309
20227 50309 32401 31909 62953 36943 -6035 -1197 33829 42623 30350 25944 30684 29855 43215
20214 43215 77669 57805 56686 50643 59047 75814 62576 14331 10076 42576 44581 23841 16488
20201 16488 5474 14950 11198 4235 29462 75511 65162 88537 98496 82051 51882 65680
20189 65680 77359 52755 18675 23041 29012 51548 72896 96685 80802 86184 114598 120594
20177 120594 74603 20675 16131 17389 24093 19187 -1791 -5330 27827 59413 79549 60231
20165 60231 51139 56027 57982 37004 12054 5704 -15824 4064 7061 16667 26105 44437 16617
20152 16617 18543 51380 81302 62456 24515 27336 28318 50012 54464 45186 66752 74372 64822
20139 64822 51153 41418 52930 59068 47384 47100 65625 14168 -13224 12108 31402 22915 25327
20126 25327 57196 71421 83781 108469 111966 105607 96955 82777 79406 72581 50189 28831 41965
20113 41965 80528 61448 55000 71192 88029 109330 114324 100185 102614 93171 88530 96200 81792
20100 81792 75925 80550 89341 110372 141042 153230 125562 153811 152628 115351 103255 135825
20088 135825 146150 158121 137740 130646 150368 124949 132884 146286 133806 117810 99983 98542
20076 98542 132077 165668 164750 133642 113622 130708 117414 84248 91719 84811 77035 92108 105265
20063 105265 102018 92491 55528 55797 58022 36078 22484 10085 21833 36260 28922 18659 54534
20050 54534 40199 44972 44803 27210 51669 68710 61821 29363 10915 22698 38246 37151 26013
20037 26013 -11366 -22478 -15055 -11492 -29583 -20414 23667 64351 89715 102606 84010 61960
20025 61960 43833 63387 86457 108767 86328 32548 24685 21571 -3998 -41661 -17818 17932
20013 17932 19181 30222 49232 24215 19948 54939 37757 35216 32478 29681 -7601 -27204 26320
20000 26320 50988 65091 72986 93412 90704 50906 28294 44478 68708 55256 54719 9142
19988 9142 -15870 -30073 -31884 -38951 -49667 -32455 5472 14300 25707 36739 68729 45106
19976 45106 23745 45608 54973 42540 19158 -9534 -18776 13517 33865 16481 -33917 5159
19964 5159 63113 65228 80127 83510 33645 7567 -3080 -9284 3470 18740 17480 6864 48519
19951 48519 77906 69326 39817 29004 17030 2373 -17488 -802 21294 35392 21486 37801
19939 37801 30084 20478 -10660 -35119 -38846 -11489 70809 72807 65047 77723 61598 30437 22029
19926 22029 -3298 1694 -6550 -36979 -27432 -4335 5507 -4829 -1118 11510 17754 22230 7044
19913 7044 17425 30865 28303 32745 5859 797 9236 19006 385 -2134 -31409 -48605 -39116
19900 -39116 -55794 -30229 -1966 -4148 12978 -4176 -7931 -9255 -17510 -25109 -30498 -15288 -12229
19887 -12229 -32551 -32783 12192 36037 51651 60507 72724 81560 97108 73606 51668 89736
19875 89736 75487 43212 51850 53445 66164 58245 35014 31703 48518 50600 68588 65616 35446
19862 35446 40240 37350 13357 30962 36000 33360 22920 19673 9755 17913 21352 8830 25600
19849 25600 63295 44940 53124 75916 70482 26051 -24697 -40001 -3041 20076 67208 152196
19837 152196 163418 154691 144646 154999 134062 101881 115192 122873 109812 113660 131998 117481
19825 117481 84116 61212 59896 48554 19204 -9540 -4135 34771 42119 34499 35418 49841 46740
19812 46740 29609 59040 74018 50521 33370 70228 71830 43676 26933 6426 -2270 -10055
19800 -10055 -44481 -31866 -15941 13075 14357 28986 43358 26670 35425 -785 223 183 -6742
19787 -6742 -2929 -3498 -15861 3513 -2756 -21411 -46581 -40297 -1106 21336 26809 26231 1282
19774 1282 -32017 -19221 -35444 -8462 29475 44029 39529 -12159 -15498 -36027 -44070 -31225
19762 -31225 -41839 -34145 2393 -8909 -10543 -15122 -32080 -15672 14949 8609 2680 15628 13526
19749 13526 -2219 14375 43558 43832 26537 8725 1626 33950 51269 99198 82194 57532
19737 57532 57782 59760 63222 103236 128566 135192 131865 115071 72968 45621 77624 64466 61673
19724 61673 60078 47808 52288 88884 75451 45027 46649 59105 77544 95175 97576 98512 87498
19711 87498 90999 65121 56224 84370 99284 96158 86541 107691 133012 92542 38446 38781 38804
19698 38804 37628 76755 100929 93150 74841 78002 55957 64854 77912 74343 51402 6655 -4170
19685 -4170 13697 46896 77583 87713 42439 13256 -5249 25869 45991 64696 64342 51444
19673 51444 18233 -1607 4015 34236 39788 77661 55592 8841 14354 33679 40715 27986
19661 27986 11226 -16682 14432 36213 45696 38856 50594 53978 50201 42520 40053 41256 28876
19648 28876 47734 36890 55844 93876 61241 40143 30467 46770 25143 5802 7488 26043
19636 26043 28737 36505 48782 40841 7326 2315 -6656 21804 36030 11848 41389 91951 105540
19623 105540 111823 110429 71294 82396 120669 129858 146628 179364 205608 288144 409619 513400
19611 513400 541413 559747 641971 678922 603835 496973 442090 400126 365970 375891 426394
19600 426394 504993 566370 582863 619276 664154 636291 557971 470896 394063 287533 170802
19589 170802 92417 60737 75268 92351 82792 60726 91822 129002 161267 138103 95251 89756
19577 89756 98197 78073 87577 89065 112428 126774 142650 123495 119816 112209 87598 65187 66964
19564 66964 83760 53414 49251 69663 64513 83780 59035 56995 48128 54010 54493 59292 87654
19551 87654 105121 65468 51512 44893 47330 51581 82611 61334 -4916 8371 72827 82277
19539 82277 60023 62661 50384 38977 21123 15562 31957 54922 110403 105902 85197 92177
19527 92177 67771 43256 71408 66308 57751 52951 63841 85961 78310 57822 54142 96333 151078
19514 151078 196025 236509 256902 255257 253007 220416 190711 168454 177396 151586 176090 189801
19502 189801 200577 218046 258241 284511 244689 179270 161545 142786 151983 123449 133677 161432
19490 161432 132714 105211 92936 81386 74983 112066 121964 120135 123664 135695 133146 146966
19478 146966 151614 129595 117177 74874 78044 113161 135070 146984 112644 101031 122724 124111
19466 124111 162804 309362 446616 521090 553297 595996 620399 573434 508463 411925 303538
19455 303538 185080 145212 146582 150744 137893 129474 155830 109766 56489 37987 103524 135451
19443 135451 156822 139284 135993 155537 156528 126114 120036 138120 144671 94336 89682 95549 96431
19430 96431 108745 148954 123783 89223 119722 136323 123381 109830 103162 121216 168618 183304
19418 183304 143945 117648 159639 177466 185040 208838 252643 350882 453406 589458 618439
19407 618439 661957 760022 800649 678717 570380 478135 357601 267328 205710 167068 127010
19396 127010 105096 77081 63400 83775 54652 52985 84396 109571 140285 139124 125379 117743
19384 117743 132443 127695 116960 77324 36108 63456 76722 61714 62152 69375 75548 60608
19372 60608 46617 65995 84908 71479 37605 40078 77804 80667 105590 150605 112786 94764
19360 94764 63418 50873 62745 28003 3732 27574 47356 71796 103114 94062 90922 119288
19348 119288 133413 120129 150638 149449 151631 144331 159003 178929 155146 128489 114427 133352
19336 133352 139400 174615 176382 163566 165986 181671 166130 147167 144890 119775 105178 129818
19324 129818 157826 129897 143459 141475 132727 98645 72071 73199 101646 101872 118036 141103
19312 141103 151598 149125 165741 160793 153442 135530 134834 152181 142815 126256 114891 109212 98915
19299 98915 102463 87305 86241 80468 63047 91889 112591 94147 78642 74933 65634 57798 82294
19286 82294 67585 42778 37545 59067 42963 48900 89396 117273 181944 204195 210206 215612
19274 215612 198506 211344 189505 168990 135598 123963 136542 179906 191788 196259 207535 231127
19262 231127 215725 217052 198885 196939 207373 203292 226707 225183 220015 184696 163564 194494
19250 194494 189355 186919 162113 168011 167995 136150 129299 129163 164055 159639 172744 191129 178768
19237 178768 194377 202668 225407 223676 219072 215751 255111 243370 225970 229909 225195 224272 215250
19224 215250 216750 241451 253500 289183 367163 426591 410125 410770 362076 286396 262225 250411
19212 250411 235535 239593 298451 350432 392282 422423 450198 436736 410284 388120 375479 341894
19200 341894 323009 353773 376711 364224 348933 319232 329266 306473 287529 270888 251104
19189 251104 232567 244616 278527 238426 220351 236093 235427 250037 313158 332544 326636 306246
19177 306246 301277 326028 339574 319622 295470 323679 328532 346564 357174 314672 321807 331862
19165 331862 319939 316825 338481 340577 360826 377907 370825 417913 462567 557000 659549 791854
19153 791854 932590 1064974 1179421 1226245 1265166 1298273 1258948 1167019 1124664 1092605 1037984
19142 1037984 948505 866191 799203 745938 711298 661558 649423 663140 661173 683945 739974
19131 739974 800912 884953 927984 880127 857585 859482 897553 924411 944379 1003350 1056067 1121262
19119 1121262 1211665 1300694 1408121 1566185 1777613 1963368 2099071 2252672 2369701 2451075
19109 2451075 2621648 2848120 3078699 3346162 3767043 4345175 4958261 5522979 6149959
19100 6149959 6906717 7789385 8865016 10467061 12966312 16865617 23339503 35074550
19092 35074550 55563623 80273293 96184646 103362111 113044943 118068196 107296837
19085 107296837 87493211 70289702 56849706 48202484 46809092 55114262 74706163
19078 74706163 96290119 107452993 112413404 120433624 119572445 102883281 80525124 61198502
19070 61198502 44726058 31927753 23352975 18063986 14749177 12490941 10866174 9746509
19062 9746509 8826151 7940818 7204570 6580986 5961329 5345850 4836608 4432614 4092087
19053 4092087 3796348 3511943 3299044 3118709 2887071 2585549 2361650 2172045 2037439
19044 2037439 1877192 1784288 1726763 1643999 1575505 1493058 1429953 1351708 1246134 1184191 1115179
19033 1115179 1051301 983634 939201 933665 898437 829771 797197 760546 693422 682152 673236 680526
19021 680526 711139 726110 710132 727256 745729 724919 704528 667209 623058 560093 477692
19010 477692 464677 491893 503609 503606 501699 513216 522028 557800 542848 549645 560922 569767 546941
18997 546941 539796 565745 587402 631933 649641 680193 715750 761783 811903 883695 941703 969865
18985 969865 962478 956778 955703 949348 978082 1050676 1190495 1373206 1407770 1462974 1575790 1588374
18973 1588374 1470412 1348761 1313438 1318518 1325950 1389472 1540548 1818825 2123777 2247122
18963 2247122 2389251 2587572 2652573 2586143 2585737 2676600 2759075 2964707 3319111 3775727 4405942
18952 4405942 5352150 6693747 8663704 11548113 16007998 23851030 38760462 64657899
18944 64657899 88436317 90432656 95695945 109708335 105094150 82517753 65046844
18937 65046844 50406577 36413057 25600629 18482593 14067800 11287603 9367798 7960635
18929 7960635 6943772 6156664 5578236 5216749 5063164 5033926 4928408 4743308 4717761 4688732
18919 4688732 4404158 4049649 3824992 3677726 3494009 3364922 3378706 3547074 3820975 4069865
18909 4069865 4273096 4621357 4863716 4806978 4683875 4567379 4460825 4467141 4643817 4992245
18899 4992245 5583405 6506128 7878034 9900848 12856808 17153583 24239947 37468965
18891 37468965 62232564 95483365 107810080 108593996 122596383 130687166 108698109
18884 108698109 84511949 66630271 49465654 34794827 24521536 18012686 13912097
18877 13912097 11191221 9260265 7814830 6772328 5990415 5360542 4857010 4571220 4375075
18868 4375075 4103907 3846843 3747717 3595792 3314150 3000293 2731648 2501199 2282374 2140928
18858 2140928 2044535 2067348 2186666 2184444 2190656 2211817 2108389 1935347 1810892 1666963 1454404
18847 1454404 1296079 1169877 1070352 1012366 975617 950609 948124 899446 843732 836395 833482
18836 833482 790375 762578 754957 788656 786286 811308 830604 876355 980815 1059910 1094235 1106887
18824 1106887 1135253 1078215 976575 885552 848491 815344 776680 783066 868305 957286 986698
18813 986698 1010285 1030068 950221 824869 737825 648346 568713 521538 467794 439207 424177
18802 424177 415035 408250 441556 492666 493860 493134 514621 507561 530501 547305 547992 567107 568574
18789 568574 557390 553083 599272 666027 650994 637271 637206 646958 593464 552364 534896 552741
18777 552741 542005 553905 566906 631863 741764 787074 790088 844274 836099 766964 740216 807502
18765 807502 974429 1147196 1215018 1160243 1080266 1019217 942189 849414 787075 714877 635653
18754 635653 584221 583417 571264 620991 686204 706756 698288 700170 660142 623203 608165 580328
18742 580328 556471 552707 563089 577561 597385 590557 590691 597524 626032 678809 751176 798037
18730 798037 800204 809390 850228 798987 741225 674589 613883 558572 530538 532015 531551 522893 541057
18717 541057 544616 557987 581849 604973 597195 616827 631587 659882 681911 695226 695575 700956
18705 700956 684826 655903 619040 608486 632699 635972 623745 639081 682802 765405 803192 828228
18693 828228 872693 888581 813823 767525 754461 758155 734179 692560 681787 651049 642202 615667
18681 615667 590426 634075 699724 752964 839198 876475 935558 1000272 996306 924668 824346
18670 824346 761677 696390 661448 621112 611506 608725 610397 593940 578973 568442 573580 589785
18658 589785 639819 681514 697329 687123 697832 710516 706503 674680 665070 649546 623714 600470
18646 600470 571155 552733 575695 588869 585311 584064 590824 619586 640915 640673 630012 640802
18634 640802 622259 620232 636473 655276 644849 673743 736810 786170 825381 851202 869959 890697
18622 890697 900936 869866 881657 915154 914411 961781 1003146 1032243 1055450 1057246 1062214 1073326
18610 1073326 1109280 1180304 1304811 1425717 1552360 1723778 1907080 2130515 2360772 2571991
18600 2571991 2757261 2960108 3157947 3318844 3477695 3679965 3889687 4072458 4282125
18591 4282125 4617431 5024965 5450858 6003679 6740263 7708160 8910802 10547223 12898937
18582 12898937 16408533 21914589 31171619 45311231 60982762 76443178 96724482
18575 96724482 124240195 147015105 156896527 163725261 173779547 172654860 155806173
18568 155806173 136116865 119608808 101067906 79955942 61482188 47531536 36672696
18561 36672696 28398292 22571255 18565190 15681849 13488676 11821472 10554223 9561515
18553 9561515 8741474 8099288 7683839 7264935 6801258 6390151 6065838 5638504 5175051
18544 5175051 4790532 4417432 4058181 3721167 3377049 3099156 2825332 2553624 2344641
18535 2344641 2207486 2057408 1954114 1865915 1813164 1751321 1639760 1525633 1465543 1440012
18525 1440012 1366170 1299840 1250874 1183363 1131113 1072664 1028379 1010113 1006863 995234 955218
18514 955218 937006 947551 971219 927351 917404 930559 894091 845238 862978 870674 889715 890450
18502 890450 852327 859792 828825 753003 689139 670253 717981 775907 784022 806082 817435 807174
18490 807174 741216 671855 673962 661632 669656 666363 676634 698059 722643 709222 680442 648690
18478 648690 628688 642465 653774 642498 636198 641029 624864 606644 580417 560308 562407 577881
18466 577881 594482 606750 604154 603851 619421 639837 637317 649553 637391 661683 685752 661615
18454 661615 656602 680077 669502 669536 653519 649098 683314 697951 702238 718337 671580 612112 612948
18441 612948 601942 626187 662230 650587 654576 645649 676350 654331 651930 685514 701707 698460
18429 698460 710438 708166 707335 774403 869511 974189 1041173 1050681 1041743 1044943 1053806 988168 944209
18416 944209 921065 890885 827894 786409 730697 726219 727182 713004 724368 723101 766480 782239
18404 782239 764481 768698 776676 805029 783967 732427 725807 746432 746209 724225 721220 735102 750514
18391 750514 736580 701087 681059 648418 608259 586735 570286 612319 692039 710243 743019
18380 743019 792584 827344 808430 768731 794110 864235 934924 988173 1036203 1150658 1325488
18369 1325488 1538384 1621962 1655465 1729693 1794532 1709801 1569937 1489342 1372660 1233258
18359 1233258 1202378 1144564 1116192 1083015 1076358 1066237 1055768 1045213 1054334 1037320 995986 979491
18347 979491 982512 975250 958107 940895 949252 1007003 1072687 1113882 1146113 1258360 1329377 1337998
18335 1337998 1394165 1381411 1348839 1355340 1359256 1330383 1342752 1418591 1531173 1728198 1941753
18324 1941753 2142669 2318883 2490407 2616621 2699445 2791888 2963075 3263167 3664533 4197480
18314 4197480 4893819 5923028 7486119 9809802 13508754 20082892 32003795 48745551
18306 48745551 57752918 60518206 67826700 68837975 57231622 46190248 37498657 30284289
18298 30284289 26039395 25732656 30390832 41671431 55944124 60499196 62831897 68844780
18290 68844780 64846833 51565534 40472701 31021902 22815787 16814485 12997732 10649428
18282 10649428 9082953 7982175 7159043 6449046 5864679 5420258 5078208 4766087 4560150
18273 4560150 4415220 4286386 4253957 4197530 4146612 4157479 4172138 4111486 4049446 4033586 4136941
18262 4136941 4336847 4697915 5190573 5832810 6833684 8380128 10799599 14950987 22684933
18253 22684933 35700604 47581564 50338871 54766853 59894283 53473345 42948604 34911657
18245 34911657 28086536 23189761 21372862 23314595 30298311 42569353 50729283 51725366
18237 51725366 56289016 58264696 48642797 37952910 29491007 21806270 15763939 11705199
18229 11705199 9236782 7630207 6512879 5721430 5125519 4640278 4273064 4005593 3757084
18220 3757084 3520739 3395626 3284064 3084697 2868330 2654542 2483724 2374913 2288467 2139171
18210 2139171 2045599 2037252 1982886 1907441 1879652 1903033 1893761 1801391 1694761 1603681 1509608
18199 1509608 1390568 1290159 1252480 1160436 1109719 1034837 985057 974550 953150 916722 883881
18188 883881 864074 863740 830417 843136 862411 867708 835285 801130 811912 814081 772268 758540
18176 758540 773390 768041 737899 715199 713923 727496 753129 772497 787407 804521 871992 914875
18164 914875 925547 905023 875529 888821 884152 861476 836960 821409 796969 803616 798955 841065
18152 841065 868795 880710 891065 848327 815706 793653 833243 845355 834247 821522 811204
18141 811204 800840 763461 762905 755654 764128 758232 765079 800079 830401 867834 868188 911406 958565
18128 958565 959410 993635 1037396 1132441 1246382 1354563 1478481 1569752 1688014 1807974 1970072
18117 1970072 2259871 2616648 3059615 3717487 4634343 5935415 7883302 10999916 16348530
18108 16348530 26600004 48074375 83529446 94133903 74448917 58042016 41838740
18101 41838740 27453993 17876090 12413580 9281591 7323379 6067804 5204427 4553686
18093 4553686 4019129 3514562 3072051 2756209 2482599 2277646 2120173 2018652 1879314
18084 1879314 1725617 1622073 1613048 1566916 1479630 1428308 1385921 1325669 1271207 1246203 1240725
18073 1240725 1213371 1229711 1264837 1267724 1261103 1206737 1149825 1108184 1077483 1000968 937889 910171
18061 910171 868513 812243 788974 738583 689383 677006 677800 642340 588415 590463 589819 517364
18049 517364 514023 530931 530298 553641 577938 590746 612397 655631 642717 662103 616182 585748
18037 585748 561820 543094 514039 508892 500835 536096 508130 484231 489900 479428 499331 483236
18025 483236 503603 485791 458612 444117 453994 444979 459261 451706 429560 411580 395625 406735
18013 406735 406253 403584 414672 417015 430592 454558 467875 483708 518310 550334 553764 532578
18001 532578 525836 531442 533960 551327 561776 540308 579296 675131 734119 808638 969327 1109367
17989 1109367 1189494 1265200 1313957 1336848 1287439 1163981 1067833 967402 910066 803751 677936
17978 677936 597228 507367 469901 421143 383596 359071 356738 368696 366618 351015 318821 299491
17966 299491 293390 281436 255013 269199 280029 287202 264779 240669 260289 277316 297472 313260
17954 313260 303990 310977 337098 336447 384328 399677 385761 363699 367397 373935 352656 355059 340795
17941 340795 347423 336140 317442 292005 300543 305106 299903 276018 265801 269006 261626 245703 224095
17928 224095 214789 266271 291362 291169 239359 247151 241942 223431 191073 146209 161835 214973
17916 214973 254675 250418 264527 285769 268055 271735 313915 397711 432962 449240 465526 482797
17904 482797 466806 453398 468586 480764 518304 569522 592844 642120 664674 670110 646370 616277
17892 616277 612760 634032 596131 557353 540526 532854 512700 458037 447435 428165 383458 388727
17880 388727 421722 439780 407020 402081 398130 420394 399965 388408 392045 377345 354874 326375
17868 326375 313035 316585 362060 354639 354182 371688 383398 364546 359569 367562 334322 308145 308689
17855 308689 327533 352047 364731 355322 326003 289682 259912 265464 313866 321197 325472 342161
17843 342161 374791 373404 358460 360453 373515 395558 391492 402204 371299 380530 376830 380654 362955
17830 362955 373765 407116 395321 377546 367866 353308 347606 358853 373365 381091 372844 371629
17818 371629 380997 371415 367984 376440 360260 344858 347009 313925 331117 386174 401239 407124 386268
17805 386268 359121 380401 391345 392896 429370 431738 416897 371444 365280 379003 342970 338274
17793 338274 343345 342275 378697 378141 388746 404181 415758 407968 397125 388351 386573 383637 374189
17780 374189 376815 419563 457587 536161 647097 679247 729928 746101 744249 696386 671072 634379
17768 634379 599896 548549 524814 552954 641390 741613 761579 755125 770076 766162 716759 630413
17756 630413 540775 484682 460586 423961 417805 419610 433453 485107 517137 539590 554625 560131
17744 560131 522260 470807 424831 423481 411129 388409 350851 334153 335969 307920 318541 349898
17732 349898 322084 318213 330696 313003 327516 362451 401281 396148 400728 441725 530058 584426
17720 584426 621581 644721 658682 585714 547527 516424 462415 429023 419479 415270 430614 481997
17708 481997 557975 572929 599534 581571 499675 464657 417927 398396 365247 315480 303078
17697 303078 305962 285316 284337 341894 352789 377305 365917 338836 320583 307595 307739 304214 293110
17684 293110 261646 257392 282146 289791 293032 289278 269570 276807 288136 303702 307625 313061 297955
17671 297955 290021 321496 315791 317937 302392 282737 274789 270148 260213 252501 263138 273633 267683
17658 267683 288187 273493 223813 226219 246454 250065 243155 236914 225234 226836 231314 238716 292893
17645 292893 266248 227726 204970 231526 240989 282412 312920 289344 270733 285434 281001 258868
17633 258868 258547 243836 251353 253300 266334 286822 253605 203527 214513 219851 232552 228287 223696
17620 223696 219039 210268 201489 193845 212908 230323 230049 218326 216763 209019 242322 254927 246764
17607 246764 247903 225784 206748 190171 204608 265577 305793 286505 253350 252443 268762 279635
17595 279635 292202 301379 334385 314727 311494 306311 327465 298193 274933 245284 257739 312730
17583 312730 291779 260697 239994 222910 216631 231412 241464 251613 301873 307282 285129 266971
17571 266971 283131 286124 235745 236677 280199 276156 274746 271465 313569 340765 405976 510318
17559 510318 545359 575933 603343 615865 566349 516194 486003 440847 348362 303890 292281
17548 292281 289460 261960 211544 229032 250357 250652 269864 289997 269874 237186 243008 234033
17536 234033 207767 201542 206296 212459 216132 217502 231380 209107 194858 230776 261405 275749
17524 275749 314247 311397 320935 322760 262724 245632 247563 254092 260945 255369 244503 231740 216456
17511 216456 220688 233933 247765 240804 226173 221408 217580 196479 232147 234417 236651 261682 249560
17498 249560 213105 222973 226903 225812 243480 243547 202135 174282 160406 151549 189812 233558 206459
17485 206459 188112 207986 195726 183982 180152 197152 192510 178816 179978 199054 188798 130195
17473 130195 136979 152750 199315 211703 209908 211262 218257 226377 206825 151651 144814 190332 226232
17460 226232 216107 191086 179960 174691 172171 159729 152882 182212 202627 169335 154860 159407
17448 159407 145016 142160 155510 198264 213202 243128 273215 376253 545291 619513 526371
17437 526371 449908 395577 326250 271509 236745 249071 255145 229663 230713 211519 199099 191379
17425 191379 170135 160939 145094 132492 114654 104117 122125 132118 107165 106674 121232 145368
17413 145368 174971 195520 187562 183676 150253 131455 125429 128310 135901 139166 142862 157715 162947
17400 162947 147571 138040 148451 173630 168469 125671 138269 155011 168554 190651 172234 152533
17388 152533 160878 125543 109261 101933 103488 83957 103572 130112 124975 110436 106542 102446 113199
17375 113199 85601 56052 70485 74838 81732 91036 111218 138332 122579 109320 105215 86818
17363 86818 99520 142369 146984 154818 158965 171601 154450 140833 111470 100954 103624 108585 107878
17350 107878 116928 126462 158549 141074 113191 107954 90609 79416 82914 90041 58456 61269 76443
17337 76443 77255 94626 86692 55133 28272 35635 69965 106270 75978 71336 52285 34405 22100
17324 22100 165 10219 69697 107959 97567 78207 60767 55996 62588 69694 48778 67344
17312 67344 110190 84206 84150 78131 67571 59726 88334 104892 93025 93505 103168 116926 89428
17299 89428 93341 97463 90357 95315 73925 62667 45570 39577 46282 108317 108275 107345 64401 60436
17285 60436 65160 82602 87559 81753 90827 67701 70720 101577 85227 68479 74951 59954 58315
17272 58315 94113 115531 116946 87519 67770 92915 106483 123709 103081 74049 58179 47204
17260 47204 36123 52176 45195 38399 59844 78449 56096 28911 41029 77293 81150 60441
17248 60441 27705 15214 26761 35596 62798 128020 156287 148147 145030 128288 108809 105539
17236 105539 76395 80140 67857 74671 95360 135853 160416 116476 86885 70335 76154 76567
17224 76567 55073 77637 92762 82491 105488 85937 65790 55243 77895 87150 112599 102740
17212 102740 100790 41329 30098 35637 25573 52056 93163 99083 77894 40322 21661 22728
17200 22728 38428 74364 110800 101129 90493 53630 53684 70176 49424 47011 39114 81576 132705
17187 132705 127674 89460 65016 73340 74005 62739 52335 79111 96784 65923 54354 54595 83170
17174 83170 100856 123148 111045 85647 109162 130370 114437 108540 113696 103899 69322 65433
17162 65433 61028 49416 54605 56575 74550 87166 75825 41658 33512 54905 30020 2396
17150 2396 19519 39742 38916 36649 31083 42053 61299 75350 53541 33864 19407 2380 -2433
17137 -2433 53980 62580 21254 24869 23429 11378 42353 43499 53864 65921 59691 28258 42259
17124 42259 62290 42889 4959 9204 66382 121183 111752 122636 119504 79062 67563 86887
17112 86887 98002 97856 71545 73859 82346 75160 81908 81405 77467 38248 1398 -13404 -14590 44590
17098 44590 68448 72773 72181 79306 80619 88170 63326 18327 -18937 -24650 5921 25843 52296
17085 52296 62163 65932 46090 22613 41293 37808 19755 27596 41699 14941 10525 24572 -14084
17072 -14084 -33797 -8893 -14956 -10757 -23451 -43544 -38346 -32552 13127 28563 27618 27955 22799
17059 22799 20094 -7318 -21386 12700 33067 42384 39451 20446 -1307 18030 63214 51097
17047 51097 62887 75427 33296 4519 -9634 -24175 14640 18871 -21289 -38954 11032 21148
17035 21148 36667 51798 71350 81616 78692 63435 38316 40890 74901 62455 46816 -8991
17023 -8991 -14165 25912 -4533 -22633 -9524 -8200 26570 58160 39996 17082 1432 16708
17011 16708 54183 59564 47926 72001 70594 46773 -152 -16989 -8906 3035 -5996 4398
16999 4398 -10381 -29052 -48123 -25632 -6761 17915 19077 -19048 5131 55226 39385 46184
16987 46184 31489 7213 4967 11457 32300 32980 42807 70422 60415 37884 25488 50492 69424
16974 69424 77253 61265 18775 -7703 6869 9436 21581 21952 52666 67431 58048 58449 54502
16961 54502 56959 49575 45393 43418 65222 64858 42651 37909 4409 -28887 -38534 -21487 -25974
16948 -25974 -6889 6075 -5304 -20111 -14028 -34975 3302 24234 33499 15509 16391 24248 24998
16935 24998 32229 26184 16001 5172 -18497 -17758 20694 42468 25627 10985 17264 24013 -31834
16922 -31834 -46037 -28047 -35370 974 22595 17943 -13501 -5309 25661 28670 16410 11458 17311
16909 17311 -7711 -13671 -29086 -13391 2610 -3141 -1150 11893 -4002 -17084 -23738 -36478
16897 -36478 -16817 -18735 -48495 -31098 13298 14931 -19441 -29020 -39243 -28926 735 13526
16885 13526 22741 -147 11174 41933 20607 9584 9284 -16169 -23600 -43730 -17477 -15297 -7294
16872 -7294 25570 -21201 -20643 -19078 -10443 -29524 -47761 -66144 -51757 -53616 -900 40177 47121
16859 47121 47889 42267 18253 -3301 -15454 8093 30855 22130 20110 9771 3559 37229 45718
16846 45718 23914 -1294 -12313 -20833 -23254 -2519 -15262 -51350 -28603 -5891 -2192 1075
16834 1075 -11461 -38037 -74411 -50816 -19914 -18591 -12144 5291 2252 18761 25945 -4327 -32530
16821 -32530 -32199 -40031 -16044 -11337 9949 -11632 1608 16225 27035 27976 28327 -4772 8145
16808 8145 21800 1282 -59239 -79353 -26993 -1773 -1246 -24236 -26350 -13403 -140 803 -17675
16795 -17675 -45884 -40638 -26326 -42099 -35028 -29995 -21242 -53404 -51249 -69462 -63361 -43225 -32624
16782 -32624 -28560 -1861 -11977 -24379 -25360 -5135 7195 8923 45254 25892 -164 13890
16770 13890 17437 39597 73811 94008 68250 28063 -6822 8065 46489 58581 48940 7411
16758 7411 -29277 -38973 -9456 -9127 2029 20224 17413 11054 -10150 -62216 -72006 -86321 -77769
16745 -77769 -75938 -70425 -72128 -56312 -43756 -16073 -9619 -19772 -65721 -48712 -30143 -26242 -18146
16732 -18146 -58758 -58846 -39168 -12298 -3687 -22369 -41516 -29921 14229 14201 -11836 -11141 -24085
16719 -24085 -42103 -51058 -49714 -56264 -9875 16675 -14147 -21819 9374 25094 18915 20161 31638
16706 31638 41559 3919 -13742 -1342 18581 28869 27921 15803 1934 1145 -6965 12930 26697
16693 26697 52833 50052 42885 31338 -3050 -16877 -19952 -22841 -19853 -19887 -2134 5008 336 15418
16679 15418 40296 74969 88340 73778 55743 32136 -16507 -12239 18392 10926 12989 13104 -11245
16666 -11245 -10177 -14212 11181 57582 36660 18 -3422 -35005 -50446 -21848 26085 56437
16654 56437 29058 13911 28843 4009 5595 -3547 -5719 385 -12251 -23258 -10790 -1832 -860
16641 -860 -8181 -27665 -23357 -11899 -26282 -11153 -9869 9784 -27743 -22475 -42378 -69511 -94519
16628 -94519 -77096 -48082 -6905 -28023 -39584 -41320 -32312 -203 19131 25286 15506 12324 -22071
16615 -22071 -9983 -24807 -38310 -21141 -8330 10148 57009 48798 12888 -4825 -24543 -32980
16603 -32980 -19407 -26952 -27596 -3245 21179 25307 30707 33868 23419 -29404 -49127 -11594 -8355
16590 -8355 15506 38825 -20232 -78744 -50259 -11793 -15773 -24843 -40540 -34851 -23048 -36340
16578 -36340 -36341 -65978 -57773 -46374 -4901 -381 -1556 -6529 20315 20093 23459 -1356 1171 14257
16564 14257 -26357 -42907 -27472 -61205 -85830 -52805 -24402 24303 48098 6772 -25968 -20934
16552 -20934 -17379 -43903 -65739 -49375 -13636 9333 5 -39313 -81869 -87460 -69119 -58273
16540 -58273 -44908 -43259 -19989 9211 27566 5660 -40852 -55108 -57101 -35100 -17178 -19157
16528 -19157 -22135 -30301 -22937 -26639 -24420 4374 -8549 -15168 -10533 -32103 -39249 -38610 -25753 -19333
16514 -19333 -17607 -13927 8551 38305 22534 -6781 -14446 -1259 2951 -44403 -53874 -12044 16202
16501 16202 6752 23353 38346 58189 52622 9936 24683 37671 34698 47358 25369 -8832
16489 -8832 -35594 -38522 -41423 -15816 29496 21029 -31324 -55069 -44642 -38198 -41197 -47088 -50301
16476 -50301 -7741 -19926 -17843 4356 -3513 -9068 -15298 -11733 -43566 -38668 -51038 -66490 -48862
16463 -48862 -52535 -49858 -42610 -26949 -15320 -31622 -28764 14962 13983 -19394 -11436 -4849 -3290
16450 -3290 -9972 -21768 -16498 -26064 -43943 -45172 -32128 -13697 12851 41886 32526 22573 32738
16437 32738 15859 6946 13752 34231 21183 -6374 -4832 2544 11323 244 -4041 -4462 -1821
16424 -1821 -6336 -37236 -67768 -89267 -92257 -78355 -45466 -35515 -50225 -49858 -47716 -79950 -81218
16411 -81218 -48799 -33111 -38793 -74767 -99312 -50997 -10680 -7156 -36092 -44833 -40059 -4760
16399 -4760 19017 6608 -20364 -24420 -32630 -40873 -44661 -41657 -20289 -26665 -39815 -24362 -1830
16386 -1830 519 30940 54005 42565 26203 -11216 -34313 -64982 -77239 -61942 -63611 -88978
16374 -88978 -92083 -84402 -49487 -18429 8316 21133 -16260 -23700 -25711 -44541 -68453 -66466 -24859
16361 -24859 -14182 -1696 15614 22035 19710 -15648 -31118 -39219 -47628 -36830 -28065 1707 14625
16348 14625 8379 -17993 -37202 7692 36434 33765 3404 19995 2799 -18649 -28188 -32345
16336 -32345 -31665 -35026 -20740 13272 -12169 -4492 43340 68199 21460 8112 44875 29823
16324 29823 13952 7771 5526 -16522 -15000 2874 -30172 -26632 -21916 -5042 7625 13951 13927
16311 13927 -28010 -47811 -42732 -30720 -8413 -21451 -3388 20094 18484 10850 2309 6659 -6915
16298 -6915 -12857 12448 8 -15527 -9693 -11146 -42123 -68711 -48890 -26919 -64372 -70981 -45343
16285 -45343 -20689 -14435 -11886 -16895 -29064 9005 24936 98 -24676 -44158 -31584 -33338
16273 -33338 -69640 -61556 -48594 -57348 -49075 -37954 -23932 -37448 -64976 -56216 -52577 -32405 -21283
16260 -21283 31 -8176 -2457 7140 -2513 -20905 -36163 -41227 10003 11522 2152 3743 -16449
16247 -16449 -31675 -27497 -38839 -37949 -38807 -30901 7665 16480 -9301 8502 4707 -2658 -31543
16234 -31543 -34875 -39212 -48846 -51720 -52354 -45400 -50348 -38028 -10416 44857 12274 -5977 17011
16221 17011 57194 54244 15813 5658 23195 46342 29726 37837 28319 3572 17439 58491
16209 58491 61162 66528 10605 -45611 -58418 -38757 -29224 -36994 -70685 -86376 -85084 -85511 -61138
16196 -61138 -32819 -9930 -45235 -75290 -86764 -64851 -38334 -21931 -58396 -85413 -65790 -59871
16184 -59871 -60941 -58927 -42826 7459 1177 -7680 6000 2345 17648 20518 -14044 7141 23881
16171 23881 24962 17468 -13787 3901 9235 2808 6924 761 -18760 -9543 -33717 -53335 -34628
16158 -34628 -3700 11157 60401 86605 89114 50441 13219 7693 3878 -19765 -48355 -52303
16146 -52303 -30302 3953 -2250 -6500 -1600 13035 -1048 13536 50347 23440 17711 4627
16134 4627 -1271 -9613 -16990 -32246 -40378 -41302 -59384 -55765 -46509 -29406 -37807 -60047 -43837 -50045
16120 -50045 -21826 31601 38357 19711 21332 9802 5133 11946 1162 -20499 -7870 11813
16108 11813 731 -15333 -46651 -53259 -50566 -33496 -34347 -53399 -50009 -28463 -24820 -57078 -47127
16095 -47127 -1096 18592 -6814 -22677 -66172 -88042 -57314 -24894 -39399 -32508 -11346 22465
16083 22465 34459 21168 11966 27425 26926 5155 -44133 -49857 -30230 -62755 -58066 -47891 -28896
16070 -28896 -9654 17536 23417 1340 -20392 -14522 420 39315 33453 -23212 -3978 2125
16058 2125 29199 16086 -18358 -44282 -16626 -23475 -36161 -34035 -22501 -10970 6196 -2940
16046 -2940 -184 20975 31095 42081 34363 17612 -10834 -22163 -3255 -14928 -12177 -15902 -3455
16033 -3455 -7944 -5884 10430 -27610 -10125 19320 30148 16182 -538 -913 4952 -7146 -18527
16020 -18527 -3133 171 7054 8045 679 16115 4807 4809 7090 28851 13585 -20383 -32525 -51919
16006 -51919 -41561 -46498 -27364 -5018 3912 15714 23243 -4584 -14327 -3787 13 -18071 -57768
15993 -57768 -91996 -59119 -37853 -25216 -31440 -16356 19039 29306 22615 8710 22148 47638
15981 47638 60999 54858 45705 20599 -3099 1018 1428 -14747 -5597 1985 34069 30170 18207
15968 18207 18633 17814 -1950 27166 26074 32629 9468 -28091 -22730 -32738 -19153 -25312 -29347
15955 -29347 -12194 -16930 -20663 -6424 12182 10041 4310 -29626 -78063 -68657 -56204 -22142 -444
15942 -444 24146 27476 1260 15 19451 20428 1212 -30889 -40070 -46865 -31253 -21310 -12543 -5056
15928 -5056 4000 3320 -21166 -59003 -54585 -39992 -40475 -27622 1382 -25139 -42540 -37333 -28467
15915 -28467 -37579 -49189 -18168 -17543 -30808 -12641 -28294 14 991 -25734 -26859 -10562 4997
15902 4997 12875 1908 -1652 15607 7083 333 -12371 -21621 -39910 -25451 -28719 -32300 -18916
15889 -18916 -10962 -3122 -13277 -1380 -1048 14375 4331 -5749 11135 5620 25129 11344 -27537
15876 -27537 -49590 -64912 -70319 -53342 -30599 -43100 -13179 19610 -13248 -77311 -91910 -79034
15864 -79034 -76852 -65280 -55140 -48985 -33930 -25492 -23849 -24826 -462 20953 34859 10846 -48222
15851 -48222 -45238 -42264 -61856 -48825 -16720 -35991 -51679 -27004 -22488 -52469 -34815 -25871
15839 -25871 -20869 -38160 -26114 -26818 -56836 -63021 -38360 -19828 -6751 19816 29615 32488 7574
15826 7574 4320 1766 -31960 -47870 -47077 -56679 -48984 -28474 -39227 -42632 -47036 -27550 -23825 -39741
15812 -39741 -72868 -68336 -77204 -98059 -76932 -60516 -68865 -53274 -49361 -66328 -77217 -72488 -58536
15799 -58536 -51046 -45406 -57727 -45761 -18071 -43320 -31106 -8551 -8074 -6343 -5048 15094 6893
15786 6893 7971 28523 -19629 -34861 19185 32652 26816 12081 -3731 -18528 -32507 -34876
15774 -34876 -45608 -41464 -45588 -52412 -34962 -10081 -20764 -14935 28221 37574 23073 -4091 -37350
15761 -37350 -49971 -27300 35032 63687 27149 24332 36079 4197 10078 -12045 -19192 -6139
15749 -6139 -15599 -9101 33110 17624 -4944 5956 -17629 -29146 -16708 -3730 -20736 -20080 -4228
15736 -4228 -20090 -49279 -40880 -50034 -82847 -72290 -56351 -28233 -14279 -6325 3412 24480 13988
15723 13988 -8926 17519 45940 39705 -8961 -34856 -32631 -22751 2415 7229 7849 3009 12797
15710 12797 -22835 -64802 -25630 -24835 -47059 -51473 -15939 -28176 -53501 -46064 -38632 -43220 -52294
15697 -52294 -47565 -43573 -57518 -83414 -78202 -80842 -54626 -51563 -53844 -43850 -23518 -12169 8546
15684 8546 7796 -11302 -18674 -15166 -1524 10341 -87 -10462 -8547 -14515 -28313 -37654 -49893
15671 -49893 -31136 -11513 -30141 -49542 -52052 -25027 2754 28732 20130 7008 29060 22690
15659 22690 -10079 -32021 -38406 -50633 -50614 -31102 -51101 -56536 -72657 -59705 -43534 -35375 -8394
15646 -8394 -21238 -13310 11821 -8055 -33551 -42892 -31558 -11240 -23818 8489 33841 22672
15634 22672 23928 68665 45001 15832 21048 18624 -2959 19586 23323 7535 -46836 -44441 -19111
15621 -19111 -3029 -17951 5947 27984 -18473 -50852 -8435 9206 2132 -41175 -71468 -56444
15609 -56444 -35509 5878 10223 2005 -4204 -18961 -21757 -28189 -20918 -13575 -33870 -52570 -32023
15596 -32023 -43797 -47361 -35080 8157 31855 43348 29504 -16037 -28490 970 17629 5715
15584 5715 -24252 -17244 -15802 -35993 -76907 -63631 -3809 12386 -14112 9652 36571 33938
15572 33938 3491 -20510 -40968 -42273 -30577 -5351 -413 -19296 -39778 -32123 -15427 -11985
15560 -11985 27471 16719 -427 -27852 -36641 -40254 -49518 -68250 -83210 -92659 -99771 -83445 -59834
15547 -59834 -46186 -20038 23514 51401 43286 8251 20359 10598 -8095 11214 21671 -268
15535 -268 -44711 -49475 -38727 -30493 -50017 -74803 -84223 -86843 -92114 -81359 -32416 -41418 -43813
15522 -43813 -77970 -72478 -56388 -65693 -41417 -44140 -62675 -75242 -86235 -70116 -87282 -73926
15510 -73926 -23770 1450 -4449 -26390 -55884 -68443 -30290 -30001 -49241 -33507 -24156 -53488
15498 -53488 -65928 -49461 -50625 -60381 -50566 -50258 -30844 -39419 -64719 -83493 -87222 -56274 -42245
15485 -42245 -52150 -61420 -67009 -62398 -28931 -4546 -19975 -8572 25366 14980 -27725 -12103
15473 -12103 -817 -24876 -51251 -46558 -49858 -51338 -44714 -21072 -13109 -46314 -24219 -4429 -386
15460 -386 2918 -29376 -60443 -51836 -30430 -14817 -32018 -25220 -21606 -40644 -58152 -38544 -33105
15447 -33105 -34974 -55498 -100901 -77882 -60618 -41165 -29634 -29516 -26200 -34525 -61279 -63686 -73908
15434 -73908 -88162 -19516 36660 48044 38702 43549 56402 67019 73801 50711 31247 14975
15422 14975 19767 -11410 -4054 -3327 -15412 -30233 -15742 14948 25467 25810 27778 40603 5538
15409 5538 -24816 -10757 12143 6068 -28840 -43915 -90395 -83370 -60336 -72723 -38219 -3754
15397 -3754 -20183 -51956 -72378 -76272 -46664 -28394 88 -8009 8622 29527 27927 12708
15385 12708 -9051 -4786 6045 -27548 -52389 -61047 -86418 -91504 -119623 -108172 -74384 -40527
15373 -40527 -7334 7880 11927 -26904 -49174 -26282 -54029 -95239 -68066 -45777 -70502 -72463
15361 -72463 -77646 -34100 -2507 -8327 -11075 17620 436 -29146 -28430 -44509 -48823 -66016 -52809
15348 -52809 -36822 -3722 -19731 -48180 -71271 -94304 -69402 -51479 -38024 -41199 -43465 -37418
15336 -37418 -33062 -22434 -49231 -37273 -9529 -11367 -18542 -16288 -27446 -40962 -43192 -33003 -19368
15323 -19368 -61740 -56979 -23452 -4043 29189 47827 21393 19811 5869 -5823 -11506 -11285 -53333
15310 -53333 -67248 -31521 -13190 5078 33650 20719 10554 16656 33249 32494 4868 -22785
15298 -22785 -19731 -12436 3799 -6942 -65526 -95380 -85142 -78250 -34698 4145 8107 -4609
15286 -4609 -23868 -41708 -65943 -87416 -68919 -56799 -61684 -48797 -43878 -61106 -49232 -61407
15274 -61407 -49554 -64477 -54576 -36370 -43963 -53502 -61416 -60783 -43324 -40512 -68694 -104429 -117274
15261 -117274 -65445 -2249 22258 14488 -6113 -3514 -25067 -27662 -19141 -3700 -10982 -18358 20869
15248 20869 22463 -22639 -23061 -11830 -19960 -59560 -103419 -83812 -53330 -55559 -40447 -24640 -29465
15235 -29465 -14782 -2872 -30051 -34410 -39073 -39695 -53728 -49530 -69951 -52897 -34731 -27876 -32355
15222 -32355 -12074 5007 6974 9353 -18802 -22159 -34804 -75743 -87077 -88559 -93328 -62366 -69779
15209 -69779 -72268 -77707 -43933 -58887 -43786 -29456 -18349 -37512 -46770 -636 -1511 -20736 4798
15196 4798 30005 19874 -19357 -47405 -49430 -46367 -45112 -49640 -75467 -56573 -55250 -44074 -9944
15183 -9944 7770 -25729 -57707 -87896 -66065 -60227 -52910 -46121 -18482 -15568 -2984 27943 51160
15170 51160 29197 24213 -3295 -24118 -44094 -53796 -81031 -83456 -50564 2825 10805 1732 17385
15157 17385 -138 4238 -4609 -9509 -4284 -2719 1312 -10569 2068 16216 11861 -1205 -4159
15144 -4159 -6936 -22589 -30427 -44493 -34446 -39906 -59769 -100490 -101039 -83884 -61269 -13684 -5237
15131 -5237 -36951 -34657 -26851 -29574 -61447 -78102 -93266 -80234 -80070 -72470 -34599 -14690 -30755
15118 -30755 -23953 -8915 -43584 -61215 -26977 4673 1200 3448 -37092 -72468 -68479 -49407
15106 -49407 -68728 -40161 -15456 -7730 8046 21916 -17278 -43967 -40419 -47584 -43640 -57930
15094 -57930 -84965 -92759 -77657 -58056 -32821 5047 42028 31314 -28275 -43806 -37272 -34265
15082 -34265 -13981 12138 36684 9315 -17278 -19571 -42090 -38930 -35105 -15855 -34567 -69613
15070 -69613 -66365 -61966 -59196 -64916 -45257 -21573 -19003 -33679 -64125 -85549 -24277 -5305 -9457
15057 -9457 -2948 -23150 -30582 -46146 -78640 -99621 -110871 -61692 -22248 -11474 -60192 -65914
15045 -65914 -64913 -103563 -105828 -33052 -15171 -16418 2272 12366 -3935 -16234 1124 338 -6278
15032 -6278 -5160 -2099 -7923 -2875 -41370 -68182 -69075 -27198 -23359 -26870 -71789 -88830 -59931
15019 -59931 -48790 -28262 -39741 -36256 -14480 9791 -10099 -3140 -10249 -12687 -17741 -18668 -8168
15006 -8168 -11400 -13549 -22594 14013 15916 1695 17651 10044 -10212 -26549 -57706 -105804 -69601
14993 -69601 -47112 -61294 -36843 -29328 -32148 2805 7423 -15224 -44859 -38500 -44475 -73739 -93829
14980 -93829 -45561 -31048 -66966 -62932 -37302 -33640 -46402 -43506 -80145 -126320 -127285 -58326 -7348
14967 -7348 -9891 -29967 -45298 -37804 -64225 -61201 -77702 -61678 -40287 -9047 5124 -2162 3731
14954 3731 -37433 -65577 -67508 -65796 -52022 -64961 -34672 -4724 -9225 -18940 -11 3380 -3752
14941 -3752 -25346 -52885 -77264 -53985 -30749 -39528 -72643 -50880 -29362 -43289 -31520 -25707
14929 -25707 -20251 3983 -28989 -51954 -67981 -64825 -60918 -71624 -67750 -92599 -87609 -49455 -41246
14916 -41246 -56501 -34077 -40046 -45650 -64451 -67764 -73635 -44974 24406 -24083 -51313 -38955
14904 -38955 -15203 14007 19445 16650 -8009 -28510 -18546 9398 32713 42799 -8545 -32533
14892 -32533 -13922 -26132 -51602 -66779 -35902 17680 36357 29700 1166 -37380 3319 19785
14880 19785 -13458 -22667 -21611 -9073 -6035 13437 -2654 12225 17150 9975 43246 21488 18516
14867 18516 11708 26092 25621 20022 22258 14721 -4835 -48562 -35783 40051 66908 56149 37147
14854 37147 19535 -2085 -8606 4818 38894 60251 82759 60060 -2160 -37982 5532 30601
14842 30601 44735 43787 49735 48697 41339 69396 64529 52233 42786 70980 84317 72213 117750
14829 117750 178801 202030 175537 134277 89263 98310 98485 100458 99036 121156 158402 183385
14817 183385 177214 158236 146856 167832 167223 167020 159138 146859 118160 135290 146250 162210 179825
14804 179825 179123 166589 189232 172453 199696 174577 124404 87869 92052 141532 132175 91737
14792 91737 65283 60180 65892 67975 37155 29645 36412 -3944 13141 28351 13946 4407 15061
14779 15061 27242 20651 22227 34160 34061 14134 5998 14592 23466 -4264 -13043 -6010 -15863 4616
14765 4616 1841 9733 14500 22159 13271 -10343 -29199 -11043 3532 -8864 22186 31921 23775
14752 23775 45401 57277 54632 43038 -16532 -38292 -22447 4622 11942 -6854 -39855 -36984
14740 -36984 -8086 5961 -12593 -3455 7587 15593 -10369 -13880 23488 16396 -941 20043
14728 20043 26558 40747 29335 4049 -5135 -16372 -67732 -83385 -34581 -19265 -40443 -66113
14716 -66113 -74678 -55411 -35484 -33843 -52993 -76949 -92051 -83376 -69887 -56860 1010 -3692
14704 -3692 -9281 -15113 -23813 -44156 -9042 8472 -36477 -30304 -24473 -41708 -38862 -47166 -31571
14691 -31571 -19013 -21806 -26411 -36157 -45341 -46592 -44019 -35740 -12583 3460 -3828 -12205 -20636 -17166
14677 -17166 -17704 3921 49547 26778 -20589 -13439 8009 12429 -4413 13285 -1246 -12855
14665 -12855 -20400 -24549 -24293 -38446 -56924 -71480 -47951 -60689 -85024 -82876 -78111 -58564 -48631
14652 -48631 -46362 -64367 -63524 -49110 -19444 -27032 -32017 -23067 -47971 -57877 -95968 -104587 -99396
14639 -99396 -117928 -146453 -113747 -74059 -84679 -69800 -85306 -80132 -31031 2993 -8337 3530
14627 3530 -27699 -44343 -31830 -17270 -26681 -15168 -44066 -35447 7013 11807 -730 -31686
14615 -31686 -43483 -16552 5164 15862 -19691 -43488 -27089 -18888 -2688 6582 1699 -16643
14603 -16643 5701 12476 33169 25058 -40028 -68114 -37928 -26924 -15641 -17133 -21936 -10505
14591 -10505 -26407 -25555 -8425 -28195 -30613 -61699 -72818 -34108 -23571 -44864 -62912 -67649
14579 -67649 -72664 -94271 -100012 -78811 -59615 -48759 -8295 17788 35389 7004 -27978 -60154
14567 -60154 -99481 -97775 -54403 -26131 -8509 34676 67638 51390 22955 9196 26678 60579
14555 60579 59512 25961 35873 65422 78364 91546 103683 137931 215988 321885 442753 672615
14543 672615 1050154 1519337 1777280 1859739 1977932 2136521 2118030 1799212 1445176 1155032
14533 1155032 852631 599260 418614 332031 297932 247996 195760 189419 197884 177651 151342
14522 151342 144479 131571 116761 71865 89857 91717 27750 -18181 -46750 -42748 -30718 24830
14510 24830 15987 -7926 -20724 -35277 -35824 -6898 -20827 -27771 -39451 -47093 -28622 -23782 -16917
14497 -16917 -9459 -3490 4140 -37672 -43145 -36670 -56606 -101142 -81499 -56888 -72141 -47961 -36006
14484 -36006 -5348 9747 27020 22011 -13754 -24376 -58995 -59730 -2885 7153 -14647 -37894
14472 -37894 -38478 -47374 -45431 -39232 -21184 -32068 -5505 12685 -10459 -42056 -62223 -62853 -58574
14459 -58574 -69283 -78508 -89350 -83601 -91426 -61410 -48032 -69798 -81359 -89251 -64487 -34419
14447 -34419 -6512 -28662 -41557 -35971 -38892 -32015 -303 2792 -36354 -29419 -12859 -10786 -33987
14434 -33987 -64075 -37229 15832 10973 5894 -26564 -24327 -15419 -24146 -52187 -56754 -8633 23434
14421 23434 15115 15158 -13734 -36926 -9349 8422 -5426 -43905 -37401 -5989 8770 21890 41540
14408 41540 36518 26682 66302 62235 17829 -2613 -27511 -6488 28589 52176 57836 29087
14396 29087 38547 66578 72821 60111 83869 117790 109178 101549 140888 126695 134944 126455 94161
14383 94161 61324 65531 33105 11331 4062 -57047 -60967 -46203 -57486 -6732 36462 35802 34549
14370 34549 50949 113977 184216 194846 165640 143047 132296 109797 57346 4996 -38373 -121302
14358 -121302 -163539 -184691 -149811 -126781 -131173 -128002 -151890 -152660 -109617 -98611 -111800 -92340
14346 -92340 -72436 -80257 -54378 -53887 -61357 -99275 -101708 -68155 -33509 -18185 -29289 -63583 -75763
14333 -75763 -79630 -90248 -95362 -79039 -46862 -43296 -44202 -28828 -41256 -59889 -117099 -130386 -119650
14320 -119650 -74642 -58782 -32305 -32384 -27817 13908 80896 97711 98514 131287 174324 181636 195283
14307 195283 161116 90239 28007 11073 30797 22128 -14818 -26874 -56174 -67372 -55490 -66877
14295 -66877 -98520 -100467 -102383 -109058 -110117 -119695 -126345 -111445 -114575 -138563 -142339 -128890 -138684
14282 -138684 -137010 -105984 -114273 -140737 -131061 -140313 -101816 -88692 -101558 -126646 -122651 -136513
14270 -136513 -183287 -151857 -119211 -139895 -141885 -157621 -168313 -180638 -189107 -214084 -215110 -213704
14258 -213704 -179315 -166072 -198974 -217046 -208349 -234775 -239281 -239154 -239465 -277301 -283155 -218238 -104620
14245 -104620 2984 64679 122237 219667 264359 257150 221018 181240 117238 37745 -12734
14234 -12734 -47031 -89995 -141354 -159898 -162672 -164122 -132713 -105382 -52876 -37648 -14154 -3947
14222 -3947 38457 99303 102859 88820 70777 43701 22874 -21073 -28241 -24234 -30510 -63179 -58856
14209 -58856 -74489 -89337 -94761 -85062 -72138 -97854 -104214 -55868 -16110 13457 17333 30301
14197 30301 27488 35629 28077 -15541 -28999 -31519 4522 81269 136797 189113 250029 340796
14185 340796 429161 418317 356559 334734 284684 235585 169121 103586 42146 43584 49852 14951
14173 14951 -5841 393 -19279 -11610 -11841 -51522 -38339 -36644 -24150 -4733 -29737 -19066 -29222
14160 -29222 -57477 -76216 -96247 -78278 -87451 -105288 -113929 -78579 -26718 8811 14169 -19687
14148 -19687 -61641 -80552 -108681 -96508 -110483 -161532 -132404 -141880 -161197 -153632 -119224 -88206
14136 -88206 -102640 -127489 -108641 -122609 -149194 -123746 -125194 -158369 -150985 -170202 -181746 -177941
14124 -177941 -184279 -162081 -124140 -120912 -133131 -151188 -123568 -118417 -108673 -108710 -95261 -97382 -85197
14111 -85197 -23140 26318 67198 88569 105667 138999 163048 217323 247366 246103 241119 215391
14099 215391 204818 230971 244013 248414 259257 337056 439996 503864 587160 709305 819443
14088 819443 946341 1077452 1215405 1354484 1516921 1762339 2051796 2345522 2724093 3272476
14078 3272476 3944360 4799124 5650166 6369396 7237658 8409616 9852553 11431422 12970874
14069 12970874 14501104 16066522 17768509 19974294 22933520 27034094 33003510 42644228
14061 42644228 58608434 86060086 135927371 222732430 323865831 360325955 360570724
14054 360570724 390650710 434226836 415490196 340260139 273206934 213407102 157195962
14047 157195962 113144782 83543387 65147888 53655185 45613060 39427968 34887689
14040 34887689 31645513 28780652 25937019 23459630 21173936 19026335 17344820 16097404
14032 16097404 14751075 13279951 12040585 10891880 9887284 9049627 8318731 7719046
14024 7719046 7158694 6654035 6231675 5874231 5548729 5252484 4946242 4705184 4512984
14015 4512984 4336981 4132119 3878096 3679755 3502665 3354862 3185648 3051081 2944242
14006 2944242 2810056 2651652 2501235 2369411 2269717 2183046 2119893 2087118 2049143 2030002
13996 2030002 1988811 1946441 1930362 1892899 1848977 1825480 1787034 1730998 1674997 1634626 1582481
13985 1582481 1554259 1549783 1594109 1672757 1791156 2010916 2318086 2417748 2207882 2019954
13975 2019954 1826565 1602130 1448579 1306303 1207699 1144352 1081711 1001359 989424 1005853
13965 1005853 985290 946457 901236 896992 877111 849858 814853 765309 758791 748103 777311 762059
13953 762059 751767 779194 739812 697414 682151 663008 630393 607816 610138 588117 603225 610671
13941 610671 603061 601684 599700 578209 578989 608443 608545 601704 619400 667459 685393 687954 643243
13928 643243 606147 578869 568043 504086 429784 370111 320841 282908 284153 347552 358610 340481
13916 340481 334875 329879 341850 394379 379700 365847 371088 360906 340476 317561 317813 386459
13904 386459 402854 377974 354174 372398 391456 403503 369678 318673 309456 306457 306990 295322
13892 295322 305179 322738 329388 333179 324835 298161 302360 316594 333711 321586 310251 340021
13880 340021 346696 381027 398896 415767 435937 419628 398950 344255 275963 194599 132800 92886
13868 92886 46086 20835 33453 90707 138629 203511 305990 369464 404488 419632 411448 397802
13856 397802 392451 433153 455421 457655 442319 416585 424103 421464 397473 382943 363651 363240 352706
13843 352706 326373 322741 331695 352531 343973 319443 305870 309786 299048 295858 324916 328316 311843
13830 311843 306329 301506 305744 274214 280976 314105 291839 325072 387700 360248 279265 276573
13818 276573 287630 291179 300141 271990 227172 215334 248390 237378 257600 293586 279895 256774
13806 256774 263246 300475 293936 292453 279239 281464 272976 281800 290742 266263 278493 310335 314918
13793 314918 329948 298856 298406 297979 327859 328242 318462 324847 332321 298929 272002 282249 271298
13780 271298 261447 283052 290051 255143 255905 265119 245603 262535 266784 218496 205508 202055 218280
13767 218280 257725 268150 296442 294983 271818 271707 290834 305978 319657 310743 282196 300731
13755 300731 319198 346452 363692 365660 335165 323926 304502 228303 122663 79203 34481
13744 34481 38258 30523 -946 16706 76077 105199 130475 162360 174278 196360 183111 172517
13732 172517 203164 254525 253350 217084 208691 220970 218528 210655 198811 193526 197412 205566 180717
13719 180717 164552 152008 159976 154704 170704 192017 206741 214821 208651 202874 224036 187102
13707 187102 144943 195410 210603 194660 202667 196870 205600 230375 252340 243463 221501 206721
13695 206721 208576 209663 184218 185435 189138 206887 185842 190328 245064 266971 236275 251417
13683 251417 257499 282020 272349 220594 199377 172492 149812 175320 226547 220169 194618 208475
13671 208475 236053 243650 247236 242344 244952 256602 289999 317911 299282 253859 246358 226790
13659 226790 248043 274030 244720 238760 218624 238502 295984 296396 288583 272458 259787 248289
13647 248289 236618 240711 216076 172267 173176 212861 211007 243341 244404 210075 225375 259131
13635 259131 263727 236522 224643 234103 238685 244544 261799 288564 295979 364300 434209 453789
13623 453789 550918 646549 720640 820651 928179 961740 948229 946062 948219 970969 1016820
13612 1016820 1025430 975545 875432 791402 668130 574007 506764 428127 348824 314578 362322
13601 362322 413380 422797 398969 375613 377989 380291 331537 312117 310126 319346 329977 354957
13589 354957 317463 302979 323449 304309 278776 328675 343579 327961 344308 350831 338170 332543
13577 332543 363253 398036 431047 454254 430820 486823 534029 582016 675004 840409 1095087
13566 1095087 1482504 1916967 2165705 2211862 2293497 2447219 2398494 2030615 1678298 1373745
13556 1373745 1085723 888509 776155 674397 587439 530736 505762 480940 492289 471216
13546 471216 420093 383753 358377 347361 305853 298971 271572 282198 295630 298483 321382 292981
13534 292981 258209 281679 293566 332628 356539 351332 326202 316233 328726 311600 339770 356130
13522 356130 373326 381126 365296 351493 343232 334139 337193 336622 345064 367354 364230 403743 399034
13509 399034 393963 388247 382035 381740 415723 432072 420691 404954 418214 432530 421922 411468
13497 411468 383200 366927 331870 299185 333971 379108 372315 391823 370856 392106 423577 430422
13485 430422 423305 455189 472719 465367 457995 477605 494787 460630 460020 487788 495530 503129 516927
13472 516927 494598 507851 537511 553346 565615 568086 603675 607935 599077 606827 653935 660548
13460 660548 599664 578967 601768 605297 602069 609124 655681 666871 629971 606905 619591 612392
13448 612392 596082 582903 632998 616327 575691 550761 565125 549882 558322 592427 583342 585479
13436 585479 594191 568717 562206 568884 581203 587267 609518 606331 610428 613745 596195 623240 690761
13423 690761 730404 702032 691558 696003 714126 733768 764426 773747 782185 773972 765024 745065
13411 745065 758405 732677 681489 687609 731891 735386 697200 694628 700559 714080 683501 649370
13399 649370 657076 691994 701999 724401 749101 745104 712064 729107 710987 714303 761898 798351
13387 798351 796936 815446 820336 806021 829578 813914 777947 778015 749934 705647 689867 705807
13375 705807 713525 717887 713424 708768 676378 671115 673746 674458 649638 667382 691530 706237 699481
13362 699481 673212 668252 680292 708717 725524 723162 716356 714013 709934 709161 684196 689971 683013
13349 683013 701022 711473 731677 747735 752657 769816 743649 708973 703816 706530 694121 703509
13337 703509 698238 690040 700597 706266 701151 699443 697627 696687 699525 711202 757934 773464 729230
13324 729230 692894 662093 641135 655369 663818 690178 726403 738636 735753 719561 703520 684224
13312 684224 674751 698687 727617 729393 687078 663860 683942 674294 664532 672236 682945 708466
13300 708466 716377 655832 617868 595524 581647 590604 601118 619270 627348 625830 640162 648104
13288 648104 635298 605009 615306 623307 607753 624585 664040 662939 626629 645945 667777 676484
13276 676484 675608 691793 711305 695000 647691 627985 636214 639931 641268 626363 603499 614686
13264 614686 602612 615206 635744 618163 618024 616107 609461 646807 672067 660779 673407 679220
13252 679220 696374 686025 674177 662672 647808 655623 636490 619528 605634 623491 629010 646565
13240 646565 612741 592499 627567 656472 639031 617041 630427 661384 671472 684979 686540 669247
13228 669247 626064 619076 614940 582492 591310 597227 596151 628243 661726 650311 649470 669216 667437
13215 667437 682833 664672 671778 626398 596333 623315 627456 634686 636836 620887 585569 583054
13203 583054 580333 564512 550478 541418 535348 528268 515813 527137 525066 502842 511385 539079 547531
13190 547531 547273 550206 530593 527274 524788 504436 478836 441052 458127 505337 520338 541900
13178 541900 541374 527039 523469 514806 474432 451554 436840 427205 446475 488877 525218 489359
13166 489359 489886 522027 505437 482947 521761 537355 545638 524691 534005 529810 499095 499636 489649
13153 489649 490451 506673 518873 497053 484277 479821 472655 449934 450098 478139 514865 516259 486565
13140 486565 497417 510530 485480 458526 416613 442426 471468 459491 457691 459323 456337 471639
13128 471639 477886 454720 444363 440285 419355 405199 400348 431434 438093 430659 394709 408097
13116 408097 427300 419454 413072 411164 412812 438706 428661 437774 464186 425383 377332 367327
13104 367327 391172 395691 362646 387501 396180 398088 414404 415175 396940 404804 397026 368671 369944
13091 369944 375337 372693 375943 391747 354412 345461 365332 383653 406137 414307 432946 414554
13079 414554 389088 375946 398307 401033 414368 430084 430241 423437 434854 391945 359785 398004
13067 398004 419143 364941 324963 349174 371130 414814 417166 404574 403297 413321 397043 384673
13055 384673 394319 362928 374876 422297 400099 366624 331363 347992 365732 384558 379723 371389
13043 371389 377525 375549 365475 348714 353971 329549 326822 342450 343718 322961 277236 304763
13031 304763 353296 347266 332324 316048 326752 307744 326962 343855 370029 361555 337454 321220
13019 321220 337127 355840 318510 315979 316182 290739 268725 281674 280079 271513 288694 301734
13007 301734 293824 308539 328991 346176 322090 290828 283752 329228 341149 334566 324956 337689
12995 337689 349979 326038 309120 297550 280288 291017 301108 290418 282146 261692 266059 272707
12983 272707 275129 299439 331647 322270 289502 294785 300270 296959 301379 294433 279162 264701 248813
12970 248813 271342 271384 287547 299246 297888 262874 242847 241688 243698 224544 227766 238006 250185
12957 250185 252044 236385 229907 246355 269869 258805 267025 280063 298955 273894 269446 241284
12945 241284 270790 330164 308376 260818 246910 233870 220423 225632 231805 242322 250909 261325
12933 261325 248844 239526 213369 193844 177573 185495 204004 216481 215182 181572 205086 247681
12921 247681 240887 242927 243291 263665 252092 251524 256998 257968 240389 237671 218735 221942 247786 260363
12907 260363 273912 267238 275223 288931 294725 248120 245873 237800 225849 221534 214573 212301 218716
12894 218716 230900 218168 203805 217615 240968 212876 202254 238902 233717 212595 223107 185679
12882 185679 195728 220938 221131 251192 258482 255278 260121 250841 281497 295033 267992 241925 228602
12869 228602 223373 254307 245870 224276 244737 247135 242094 231991 222450 228461 226946 229965 272842
12856 272842 291825 274529 238380 248856 248292 209346 165230 155448 178955 200630 189099 164477
12844 164477 181611 192263 184876 216485 206056 205937 216273 193925 168103 182083 220216 224811
12832 224811 196637 211812 222703 234005 243361 274074 305112 335592 359630 324640 295844 281305
12820 281305 264059 213604 199770 212170 185951 182365 205739 192664 185711 197262 174139 154435
12808 154435 194907 231586 226706 226758 204007 186059 175976 221623 246262 236091 234601 233720 217880
12795 217880 168973 135538 138618 137689 160886 207402 228520 182392 197219 236107 235811 229320 224836
12782 224836 237812 207970 158394 127768 104246 106538 88940 87538 119101 128336 125022 163995
12770 163995 186022 182600 173453 186346 175197 159290 174686 140134 100302 106655 157415 182817
12758 182817 161164 172386 201179 190013 182436 174201 139520 109470 130330 147795 165688 172498
12746 172498 153033 136492 154099 188627 174588 157143 170912 128781 122546 139742 157895 173340
12734 173340 204529 213424 213215 185368 189372 187287 193872 194878 186039 127034 96227 106138 122146
12721 122146 149290 156201 133069 97320 116021 137128 148653 156768 129618 117219 131870 105945
12709 105945 87159 85875 101588 84143 80764 114834 136894 165744 139797 125729 92359 90908
12697 90908 120486 138591 163951 168784 188463 183693 146216 137175 143688 195339 242967 218959
12685 218959 168553 167108 188962 200495 176450 127201 131061 172564 199119 139746 112795 129586
12673 129586 127486 149200 145584 153801 188999 185933 162780 132640 80635 109088 135249 100724
12661 100724 95192 119860 135304 165631 168275 160260 140764 126891 118788 117681 135898 128407 124051
12648 124051 163273 157149 153244 173205 158846 132433 123414 99784 75038 75624 58822 61257 74806
12635 74806 108392 109718 96496 69778 53513 49890 81816 72723 86357 58260 44133 26824
12623 26824 51332 73453 83019 93117 76238 74331 81435 76670 77919 66866 65088 92098 125361
12610 125361 119781 113316 76983 55207 67643 56078 43207 82543 134513 128401 157785 158166
12598 158166 112942 114302 98188 94313 69102 92118 99493 96351 99907 92546 94541 85770 83272
12585 83272 79787 91654 153368 180026 130014 127160 118157 123961 154376 140715 116505 122569 126543
12572 126543 127637 101366 96344 78871 76589 47812 32820 31385 41596 39018 73933 79822 69484
12559 69484 77967 75622 115682 140739 140005 139960 125866 109197 79490 83436 118007 123001 134479
12546 134479 132261 112313 107942 75502 70300 116502 146450 160005 122982 117526 127849 103491
12534 103491 89566 95056 113355 110190 94984 103617 115063 114627 101816 72940 61442 89662
12522 89662 89483 101527 105088 72154 56706 93316 115161 120194 103858 116899 145975 150110 130634
12509 130634 138105 166652 165742 147601 123124 124978 125027 111371 89865 57064 75816 93598 97876
12496 97876 103458 64625 78209 107706 112590 130251 153378 178627 189239 177683 159928 133405
12484 133405 120094 102564 123706 137098 126910 130803 131595 148751 154696 154783 140876 130581 123540
12471 123540 128687 161486 142212 142381 139991 161615 162111 132662 144468 163754 160181 177647 186636
12458 186636 171532 170642 170352 139840 135446 149131 142868 159829 181663 179057 156943 162507 197241
12445 197241 210823 202428 220292 214181 268248 277135 255129 262012 273891 245728 242258 221093
12433 221093 228252 249879 240086 264914 282208 257964 223403 236695 252232 270047 273643 274110
12421 274110 282476 309596 306945 295707 309329 334615 351555 390063 383972 371954 395505 372551
12409 372551 350289 379642 360226 374151 392184 377377 368734 393150 406295 393616 387585 395741
12397 395741 361197 350824 360485 400152 459737 468292 469630 465151 456962 436852 425865 414225
12385 414225 428236 444256 413818 405950 409556 406984 430767 458508 495747 502373 508368 493299
12373 493299 465061 463020 434863 417694 449927 460954 463306 466809 442269 444303 445982 438735 460163
12360 460163 481564 451653 416655 411855 410785 431558 437486 398476 372748 411829 454200 432029
12348 432029 401157 383034 396297 380465 369517 379401 376061 342992 349865 349733 332191 301773
12336 301773 272094 260884 265208 263624 265869 263728 252271 220256 226881 256701 301396 297005 274876
12323 274876 263545 259389 245939 238657 254251 249452 239812 217991 213956 243545 245931 228039 263559
12310 263559 303444 289979 256101 251231 234628 244816 239820 247854 249423 237360 228349 201180
12298 201180 173975 171666 169168 172892 200451 176564 161793 168371 191515 164318 155120 191548
12286 191548 183798 177749 173814 175585 151969 145420 159886 181510 182423 145440 122585 127436 146313
12273 146313 178214 173162 147992 143297 134670 132193 125409 115698 91126 69401 72846 90974 71667
12260 71667 66940 67728 41355 63950 120649 129123 113726 116732 103307 129761 139854 136203 130314
12247 130314 97855 85632 76413 86141 109212 127471 155113 147067 98731 99415 114350 134030
12235 134030 144762 126234 110980 75434 69165 61625 43589 38298 5111 -973 36983 93032
12223 93032 122123 147252 140287 122450 88319 68631 92775 116880 92085 78663 87047 97799
12211 97799 79225 71399 75883 84227 85176 92724 126651 139678 163875 140168 127078 122233 100060
12198 100060 137530 153244 148906 126985 94067 89902 75516 101948 96954 101519 91255 124064
12186 124064 123339 90549 87469 87384 87853 78260 86217 63838 83711 86527 52688 48628 53195 50731
12172 50731 41872 51627 64349 53276 57767 94916 103593 89407 73460 54952 84836 95329
12160 95329 74551 62528 44264 52123 63814 61685 79532 75219 78816 69811 36188 55421 42461
12147 42461 8895 25340 29728 23428 38263 60647 51460 37527 49489 54856 47582 51338 68234
12134 68234 61873 46162 12784 25276 40521 38253 67501 90750 122505 106537 84110 72340
12122 72340 75886 62116 21258 30252 60289 74938 46036 10126 38452 34400 52444 77069
12110 77069 93077 110625 111268 97264 95856 80701 70380 60984 77800 51835 39833 16909
12098 16909 9989 53036 61103 29327 12171 23155 52442 32940 54589 92739 83959 106572
12086 106572 88797 47599 10612 31830 27227 22515 40086 89106 74749 20779 38014 54944
12074 54944 40638 20595 19299 29961 4446 -826 24344 33572 43861 68923 66334 49669
12062 49669 66502 97152 73654 104275 72881 38777 31150 15221 6389 -10406 30117 64730
12050 64730 57844 47998 58837 73940 77518 61091 36024 34869 33727 20872 32881 31638 46442
12037 46442 57848 67130 80001 82242 63292 50285 78905 83391 86613 80579 73622 60052 62999
12024 62999 88161 80407 57954 13360 6096 253 13526 38705 36544 57093 91773 64256
12012 64256 47465 55252 46186 1635 6093 3530 30950 45021 51765 50068 75596 39068 30083
11999 30083 2146 -22555 -8876 7744 18234 49987 84658 125355 142672 134022 116876 96870
11987 96870 52894 41473 76699 63999 69122 59686 19731 11909 32049 22130 6251 423 -14665
11974 -14665 1352 51169 66465 59218 19184 6713 -4302 8818 24482 27937 -11537 -2652
11962 -2652 19332 25137 33130 51596 77253 57687 39528 20996 17130 27207 26600 20468 16409
11949 16409 44590 52474 21137 17459 34642 22915 20706 -22173 -26484 -19405 -5426 19557 20321
11936 20321 37112 35230 61429 34773 13706 2293 -22166 3941 48933 84739 107423 132043
11924 132043 139190 112795 71039 25803 14687 -1476 856 -479 1098 28602 64849 34356
11912 34356 24724 33195 46307 50162 30489 22760 24353 16980 40986 58508 72838 73393 70036
11899 70036 58997 55593 35097 28798 38403 32573 29485 4918 -11151 -9534 -17463 123 -12985
11886 -12985 -42019 -31870 -11593 -20283 -27912 -12131 -25339 -32716 -19189 -34480 -20982 12071
11874 12071 -15133 28383 47784 54818 51932 31696 20229 39383 37638 21027 -11102 1350
11862 1350 33078 15572 4983 41128 58468 -414 -1535 -8137 -30016 -4329 39898 39826 32191
11849 32191 34967 56956 48467 4518 -3028 -27097 -52021 -42002 -6444 -9020 9939 20019
11837 20019 42109 30508 36415 52366 55428 69368 38813 -4480 -5050 -9182 17072 23804 35957
11824 35957 81271 93718 57541 27945 24424 53044 30578 36587 -5347 -14410 5031 46571
11812 46571 68232 36275 21559 17643 37465 36655 51047 82004 65710 45244 41016 48722 35698
11799 35698 19862 -7086 -974 -2142 -14340 -36217 -15963 -7623 -4811 5168 9540 -6198 -916
11786 -916 -2055 -4922 -42477 -40509 -30450 -29574 7891 8650 3977 18745 32445 24953 -3767 14135
11772 14135 19482 19288 9123 15927 18046 21079 26865 5877 4235 14697 48001 54368 27296
11759 27296 12991 -17082 -15993 -8784 9660 39619 58671 40332 1352 15809 51260 45277
11747 45277 38869 31928 34570 15495 -13323 -35112 -36599 -18311 16801 6047 12599 35164 77505
11734 77505 114839 120100 91547 37979 41193 68038 76999 58423 27593 28299 58478 90673 100559
11721 100559 71784 51600 36131 40370 47234 54581 26075 -14090 -3298 24671 33429 26196
11709 26196 26344 39556 23183 7395 9136 1903 43497 70600 44015 -3370 9221 32016
11697 32016 37986 40146 46274 9951 -6161 220 -19582 -13300 22476 37580 33963 28551 44384
11684 44384 25210 23973 27 -8224 4640 -7535 -17897 -16174 -20935 424 -1980 13537 25822
11671 25822 9063 -9764 -5966 -4502 -20868 -10084 16312 44901 54967 53527 46237 35312
11659 35312 27399 23934 31494 11782 14853 -5128 16338 42501 66567 62379 26817 33562 42835
11646 42835 43834 43793 53250 89025 99045 113827 124805 149238 177794 198800 197987 168797 136523
11633 136523 97583 107707 145800 129771 113858 90275 87012 95043 109910 108110 99102 109708
11621 109708 103778 94818 98723 88466 59891 90086 115065 96027 78023 90333 92060 110505
11609 110505 185036 250022 284364 292996 282853 267341 264259 237814 173913 154328 182116 203855
11597 203855 224334 244390 347384 470856 609124 728832 769745 724286 651743 577188 484440
11586 484440 384767 296840 255859 236227 223764 200828 200606 186263 154078 137844 128028 134079
11574 134079 145165 117085 115470 133753 152131 162011 187531 224418 253449 282503 378708 501463
11562 501463 648941 753774 767396 728980 651756 579710 526104 429035 361424 347562 347843
11551 347843 352116 370695 432820 521598 637741 727464 782693 758366 700317 605168 520673
11540 520673 457136 380234 307923 272186 230723 197525 166072 134445 133075 150237 128820 100270
11528 100270 121793 154180 182236 162028 146395 135772 174928 237335 262049 276104 330131
11517 330131 434775 536953 682904 795848 792153 737432 673936 572699 468187 367145
11507 367145 334504 294873 268311 240970 242469 261979 291392 314045 339204 360483 342348 308301
11495 308301 263978 212068 161633 160323 152093 139377 109853 76009 67647 64966 59161 59171 106745
11482 106745 127677 103366 125349 142513 123306 123668 86562 72173 118200 142857 165939 166028
11470 166028 179084 236303 286280 308842 298301 288384 276533 206366 159167 142772 133946 120304
11458 120304 106195 88854 85991 102472 103566 80051 49265 53169 44732 24976 4726 28630
11446 28630 54936 58416 54096 46929 56159 86802 67383 35040 9355 -215 -11435 22490 38749
11433 38749 58699 99225 71273 25659 -22152 16541 41566 24699 24551 6140 -3746 -326
11421 -326 3525 -680 -299 130 24151 14770 27157 52796 59990 65343 38069 23285 33542 -21211
11407 -21211 -20919 740 -4080 31316 107811 121130 113701 94411 34893 28322 25308 54529 38438
11394 38438 10223 27404 35335 262 -12813 12109 60335 99406 77393 70586 56959 24323
11382 24323 15689 16192 6615 27260 30706 59142 25166 -5823 -26644 -17405 22975 25041 31418
11369 31418 12592 9785 26885 -8575 -41679 -32403 -516 27145 36828 22479 26404 17928 -10156
11356 -10156 -39015 -29800 -4897 7028 287 -9306 17421 27841 23746 2848 -13355 -29520
11344 -29520 -16569 2529 -9959 -17552 -29558 -1368 14572 28682 48920 60650 34692 -4888
11332 -4888 4343 12707 12122 -12758 3150 9995 -4864 -3207 -7028 10647 8865 19153 28501 42241
11318 42241 67305 29513 -277 -7111 -9253 -30185 -22772 -16801 24896 36259 50704 65520
11306 65520 48352 26355 14405 -7233 -22792 -28712 -16272 40942 53035 25971 34381 6363
11294 6363 2623 12102 23137 34907 50073 60117 73377 59345 56012 43233 14540 44611
11282 44611 49939 17881 -9577 -12136 -40839 -29611 -10741 -4557 19257 39277 25150 9431
11270 9431 -11180 -27921 -23437 -10729 12198 29945 44022 49910 69924 76550 31723 -16701
11258 -16701 -9603 -23577 -31369 -10727 -12399 9527 40549 49691 16074 -1096 -5520 -14785 -8553
11245 -8553 -9549 -16171 2698 14903 64444 101412 75095 39492 -15614 -5149 18841 17686 4104
11232 4104 8450 17798 19949 55561 100912 48842 -28200 -25371 5401 5682 21542 10348 12150
11219 12150 -20834 -33204 -21765 3999 9872 41429 32930 8110 -14365 -11249 17684 56635
11207 56635 55486 -5109 -43127 -30219 -19598 1388 5472 -19177 1097 43586 54400 41804
11195 41804 11172 14031 39804 34206 62463 26545 -6529 -6825 -30252 5120 37230 21242
11183 21242 1009 -10955 17792 39807 35282 28735 -14084 -20686 -27640 -58655 -30658 -30731 -31888
11170 -31888 -6756 29596 13862 15715 16542 28457 3824 18427 10945 -14679 -40815 -57420
11158 -57420 -47474 4190 32246 15205 7224 -4547 -17951 6907 26908 -8159 -27420 -22771
11146 -22771 -18533 -4507 -6498 13432 26679 28195 3540 -16150 -18540 -808 12410 37389
11134 37389 73227 95884 51921 1113 -24824 -10994 29636 25246 22099 20584 10364 21602
11122 21602 32329 28248 15697 16241 1760 -7146 -7362 -31031 -44632 -33693 13313 18720 24411
11109 24411 18907 3359 3592 -8183 15009 28490 24313 48846 38611 -13581 -43844 -19366
11097 -19366 7208 348 -13746 -9591 -34008 -57206 -26496 -1681 12825 45114 81626 97671
11085 97671 68778 22721 13408 6281 -10556 5457 15241 12719 -5810 14738 35725 5358
11073 5358 -39576 -44268 -40178 -15173 -17815 -16193 -10839 -4654 -16818 3064 48943 58288 41164
11060 41164 24722 -18247 -51940 -64924 -77621 -66133 -35936 -27360 4645 -7454 -12030 31126
11048 31126 33537 26687 26840 14127 -33524 -72081 -49791 -20041 10477 10335 -29687 -49966 -27462
11035 -27462 -3509 16546 50169 52432 21156 -18241 -47720 -61465 -72626 -82174 -65355 -35010
11023 -35010 -5248 23807 53696 53418 16083 12925 10869 16186 -6027 -2372 45855 31550 -3121
11010 -3121 -34480 -41580 -56036 -80917 -41180 7526 22630 45135 26986 25628 58066 79233
10998 79233 51561 29577 37596 27856 -7872 -34414 -58059 -15460 43938 30276 16998 18819
10986 18819 -8933 -13891 -5214 38402 34505 27321 52461 59745 47668 831 -14546 -10452 -15579
10973 -15579 -33182 -37276 -23645 -28134 -13328 298 2216 21613 16387 -10958 -19250 -23922 -12162
10960 -12162 17131 20813 29188 31521 42852 47867 55878 67673 51239 46254 62089 59391 48799
10947 48799 46906 584 -9009 210 21611 28729 -213 9865 20883 58809 83000 56397
10935 56397 66499 82031 42035 16618 -11689 -21443 -14891 -560 -11744 -34020 -570 -21032
10923 -21032 -29655 -8609 19949 54790 42513 44846 62729 17746 -19104 -26104 -7097 -16064
10911 -16064 -5326 9601 -5602 14503 16324 14691 7029 29451 41162 20508 7112 12260
10899 12260 12832 49015 66874 35367 -8657 -67091 -63259 -35387 -34188 -23005 -34800 -51389
10887 -51389 -34869 -26381 -28855 -37965 -42960 -33994 -26316 -7788 9653 -13159 -36056 -24817 1901
10874 1901 15413 46947 26024 10213 5329 14789 -1337 -30357 -6071 -22049 -48206 -18956
10862 -18956 20839 28138 23447 23112 1369 -15839 -486 -6074 12718 39553 28413 19641 -4590
10849 -4590 -36323 -36520 -35797 -44573 -23628 -37763 -24357 -19441 -26611 -40164 -22891 25853 31162
10836 31162 29752 27420 -12194 -3757 11191 4763 -13025 -6769 13518 8483 1402 16358 20304
10823 20304 5007 -28059 -26662 -22862 3419 17480 29113 37370 13062 1451 -5371 2034 6761
10810 6761 14929 14879 -14844 -52886 -46793 -21371 2954 24301 60442 69617 48004 24648 16162
10797 16162 -16907 -29156 -49331 -50035 -50050 5018 -3327 -25858 -58067 -42322 -8197 -10982 14685
10784 14685 49956 81967 57877 52046 74564 78911 66560 78514 44226 19426 30476 29781
10772 29781 42182 63332 30157 -14489 -20800 8902 17336 10073 2298 26880 12537 -10137
10760 -10137 6557 19177 20379 36820 71631 58642 48835 39956 45399 46055 27051 -13117 -14248
10747 -14248 -13958 -28113 -27940 -10066 35219 54265 18165 6114 4606 1954 -21226 4219 54840
10734 54840 55557 -1055 -32989 -15000 -11597 10882 28961 8174 51231 60953 27364 22369 46365
10721 46365 39546 21182 29488 12167 -15818 -5026 30061 14409 -31369 -36775 -32327 -21690
10709 -21690 -27613 -28840 -29366 -15836 -5417 15495 -3136 -7973 8147 -19237 -27528 -7403 6695
10696 6695 -28547 -33265 15282 31995 29451 28768 56852 85162 107311 139230 104853 79059 89091
10683 89091 73384 44485 2551 -10001 -18377 -9500 14772 3542 -2819 8182 19727 18403
10671 18403 -4930 -2159 -6896 2228 20027 42494 38500 16581 12639 2187 16732 40385 13985
10658 13985 -18094 -11626 6261 16063 -10200 11351 19236 16251 18282 -21893 -24048 -25050 -38116
10645 -38116 -53782 -51681 -26490 -11056 -426 4714 -10207 -7313 17663 11008 12203 -10985 426
10632 426 6440 -10913 5311 44864 64568 53138 25860 4575 -11198 -17954 -28522 14324
10620 14324 31343 30321 -13485 -13793 -3430 25608 19413 20236 42858 68375 73649 57735 19015
10607 19015 17313 47181 55246 39778 12819 -4626 -33199 -7355 -19559 -26919 -24447 -25857 -46011
10594 -46011 -34172 6006 -10728 -7523 42423 35058 -14961 -39556 -58053 -20953 -6191 3135
10582 3135 6545 -3770 5374 28638 -13296 -15166 9809 1478 4234 3308 -12247 -24243 -18619
10569 -18619 -30300 -36289 -53206 -16649 -3780 20803 53653 49264 33047 64856 72601 58909
10557 58909 44610 30064 -4191 -28986 -14127 -4216 40421 127657 147326 151133 125720 102102
10545 102102 60321 40308 14825 -30471 -51434 -39656 -22739 -14950 13920 29967 8946 15976
10533 15976 54337 60507 43176 34732 8478 19627 47631 48608 12727 21140 -11897 -42075 -15763
10520 -15763 14152 40490 57263 49413 17420 8022 -6428 -53239 -78724 -83909 -95305 -62308
10508 -62308 -54852 -41452 8905 -7639 23403 38719 24761 4565 1437 18826 16621 23668
10496 23668 17340 17993 2232 -23304 -25277 22245 35510 35795 4969 -8241 26559 48357 25920
10483 25920 35687 26153 33618 23237 11403 -6488 9982 41809 38656 5203 -21441 11382
10471 11382 -11923 -3608 28308 29549 37720 52960 46036 35293 17183 -1271 13068 10151 39864
10458 39864 70605 62846 49428 23990 -2643 -8085 -13589 11905 46363 46255 8257 14426 11840
10445 11840 49957 85745 128262 132887 123831 119541 113258 97561 111313 108764 135740 172873 294894
10432 294894 479515 685651 764692 690932 615598 527752 473188 492505 638931 822924 774922
10421 774922 664641 570039 485189 369007 287894 208918 145280 136229 127901 119952 92394 55643
10409 55643 25342 26438 26133 50630 68225 100506 89216 70664 65334 64452 78632 79538 97876
10396 97876 103207 101553 100357 100527 84367 78307 112802 104838 116234 102212 56869 23314 32027
10383 32027 49217 49079 58509 81111 115303 143670 140100 113551 97254 139502 151773 118203
10371 118203 118908 125958 121992 103040 56279 60305 45226 38238 45769 17415 16719 18142 -1130
10358 -1130 22478 67510 82278 62798 42899 33443 51354 77550 105704 132593 141618 128538
10346 128538 134518 140252 150826 140378 130338 124847 101104 95803 80587 59853 35230 14347
10334 14347 28286 10267 -37471 -31838 10039 -11009 3009 57522 74713 61562 46157 26313
10322 26313 42326 37536 55802 78957 103817 103713 83484 54067 1801 -40862 -25829 -77
10310 -77 -8935 -23777 3026 21392 15492 25220 33377 59017 47474 15238 23869 64182 72703
10297 72703 82143 71673 54017 2272 -2955 4376 -13900 -29175 -34911 -14281 33879 76144
10285 76144 90766 93695 55426 50291 64197 38957 38535 42118 68676 84205 93442 92489 55333
10272 55333 55091 57398 35731 43642 42940 39586 39599 55810 86714 88806 95897 83115 67266 76649
10258 76649 99225 108489 102610 109494 82202 77109 48610 45308 11881 23756 68243 79556 45307
10245 45307 8406 13421 1583 -10644 4202 7151 4209 -30512 -32625 -23875 -4599 56469 68020
10232 68020 57475 51488 10953 -12176 7155 48015 89574 99225 107808 111095 93887 50276
10220 50276 40306 87114 102392 90792 53776 18618 10328 10222 9114 11499 -17294 -16178 -10295
10207 -10295 -1661 31061 54700 55498 50939 10915 27479 60560 48782 31004 28049 44064 58049
10194 58049 31284 33498 45213 16330 19226 32469 14319 -3013 28394 87555 102079 90547
10182 90547 60162 60380 60534 72696 47235 34190 57312 70304 49848 53435 40664 40825 53302
10169 53302 48470 74253 86571 79957 71327 62282 75008 84237 84649 81994 73526 51969 97225
10156 97225 109317 82548 52575 50577 45729 45299 47314 46896 57601 36163 2133 -36551 -48046
10143 -48046 -48576 -34984 -14643 756 43062 34268 14014 -5325 3848 30888 56988 19119
10131 19119 3218 16775 13127 13860 19741 22764 16797 10538 -24283 -20526 20447 17789 13584 5550
10117 5550 -13356 -26791 -15235 -1453 -16713 -6884 -6443 17995 5723 1362 -8666 -447 14633
10104 14633 -18822 -48113 -29404 21847 15636 14701 39339 43516 29627 29024 44600 16912 24453
10091 24453 14225 26318 28067 33726 47915 56826 15997 -4157 28383 51177 61047 53511 29909
10078 29909 33429 23804 25576 23268 23368 4643 17122 29944 35097 9393 7949 -15375 -37096
10065 -37096 -28571 -37209 -30324 10784 40721 10843 26443 64052 106433 197640 318922 592432
10053 592432 823537 691096 561628 462734 334379 236983 149306 116829 81050 68833 35921
10042 35921 35002 24208 24647 49357 58383 70294 53060 25079 30697 21173 26666 -8926 -23147
10029 -23147 -17763 -36717 -41871 -27637 -21444 -20496 -11026 -13892 3828 -24614 -44253 -35668 -188
10016 -188 11572 40952 54351 33550 -1991 -6277 51647 98788 71003 40648 -1856 13336
10004 13336 33516 59641 83207 75386 61173 20345 16491 32518 19112 47455 31932 15788
9992 15788 28512 -21563 -20365 10500 45308 1120 -44429 -26925 -25811 -27443 -6588 -14318 -17525
9979 -17525 1461 16500 965 -14716 -14311 22254 27960 22330 38459 41788 14546 -13837 24205
9966 24205 79613 65227 27379 3697 23424 45741 71457 80218 83203 75483 76763 81715 41304
9953 41304 -1895 -2713 42778 48367 40095 88805 116282 69660 66327 92649 79006 50541 51442
9940 51442 58938 47980 6031 -17916 -4765 -3764 -23918 -2122 11423 33392 31859 38938 13326
9927 13326 6295 16520 21165 1234 -11825 -18184 -40300 -70267 -67095 -37188 -24333 14713 34193
9914 34193 15133 -23379 -39312 -29885 -74746 -92938 -80361 -39834 -36807 3831 47106 37931
9902 37931 15728 12778 35442 61079 63495 84074 90851 42210 5291 -18399 -17757 -7781 -33479
9889 -33479 -47371 -31032 -5137 42585 51860 20033 28555 21253 30990 64034 55109 25217 27864
9876 27864 33250 21628 9838 -1410 52916 45283 27437 36254 45485 33671 33856 49949 39013
9863 39013 30803 62587 82929 106759 101783 141613 161439 124555 60147 48706 36172 50296
9851 50296 31450 36333 20160 17219 31710 31296 49420 26400 14532 -19653 -51397 -8409 25507
9838 25507 16158 6329 19304 28778 8675 2169 26539 49716 31243 12737 17523 16735 18734
9825 18734 46968 50993 34994 27018 36520 58385 65831 35894 9079 1075 32802 51305 49906
9812 49906 49099 31853 32586 28991 21924 45268 25211 1360 -11688 -14944 -1864 30046 9813
9799 9813 -15494 -15531 -34037 -22557 22701 48954 32841 55127 80389 62488 23031 3490 16520
9786 16520 75111 40846 -12124 -8731 -22421 -49989 -76761 -72273 -37560 -3834 -23010 -14364
9774 -14364 23789 24051 12089 -6916 -17499 659 3510 18534 22800 -6320 -9653 -12101 -23185
9761 -23185 -27910 16509 54184 21984 48636 53049 20043 5923 30118 47620 19920 -17191
9749 -17191 -16638 5214 18824 -14557 -35908 -30644 -43119 -41411 -4817 -1743 2618 22691 10316
9736 10316 -13212 -24803 -1921 -7608 -52407 -21853 -11344 -23604 -44110 -38472 -30497 -50322
9724 -50322 -64512 -42683 -37608 -29518 -29757 -8427 -4596 -36947 -59035 -34737 -28947 -27215 -25556
9711 -25556 -21215 -1790 1035 -21346 -33154 -10585 11059 -7504 8426 35513 39561 14632
9699 14632 4555 -6149 -11379 -6535 15638 12358 -11350 -4149 -17541 -39120 -32549 -28477 2150
9686 2150 -2388 10598 2927 -35755 -71908 -84977 -60825 -11585 -2543 -21128 -44961 -56300 -40915
9673 -40915 -27584 -32926 -13861 -21581 -46244 -55926 -16004 -25244 -25687 -17552 -11028 4126 -2873 -1982
9659 -1982 -13644 -39391 -47411 -40584 -16806 3208 12640 -5102 -12170 -21590 -14279 -3450 2362
9646 2362 3268 11375 11306 -1005 11721 31678 10347 -2604 -19275 -51432 -62750 -37829 4005
9633 4005 29953 47401 38512 37937 36961 -12950 -29803 -16472 -29109 -33271 -26476 -7126 34140
9620 34140 49137 29975 935 4627 8717 11033 4553 9963 2479 -6534 -19074 -28123 22501
9607 22501 42703 44190 81365 77763 26799 -1332 -1407 7010 2806 -11574 15628 10491 -3408
9594 -3408 -18684 -2051 30009 40752 42295 32858 31465 7215 -46371 -69414 -53602 3197 61944
9581 61944 71927 62995 52609 17426 -25132 -20289 -22609 -33725 -33499 -27560 -61491 -29633 17566
9568 17566 19967 -744 -20711 -11297 -10237 -20398 -17096 1358 19696 1637 -29009 -43936 -24088
9555 -24088 -57653 -51664 -26646 -31781 -23241 -51301 -20712 -20197 -12015 28050 61270 42214 32255
9542 32255 7539 -5502 24107 2965 2984 47940 59072 91519 82480 22559 39196 41814 27228
9529 27228 25191 29756 13119 8950 34004 26127 19455 -85 -29577 -37978 -19182 -18514 -37698
9516 -37698 -39613 -4366 45419 67071 65053 28157 23445 31572 37668 36357 24274 5339 -17206
9503 -17206 -12240 -2671 -4229 -32807 -64734 -36256 -12005 -37000 -44377 -29814 -19598 -27771 -36705
9490 -36705 -20870 -27299 -44513 -20829 -24468 -28675 83 13799 15124 4128 -20541 -31416 -6095
9477 -6095 -18344 -17258 -26729 -23647 -33016 -40717 -1386 22552 20881 4112 12277 -8494 -35002
9464 -35002 -22738 -11371 -9916 -17332 -5846 -14538 -14555 17332 24735 -662 -11101 -24300 -30137
9451 -30137 -44030 -38881 -4499 -25457 -14882 23835 55835 21315 -23886 -36250 -64295 -84893
9439 -84893 -45545 -19310 30894 42893 38619 6193 14250 24198 6312 18094 15848 1486 32066
9426 32066 30231 -4076 -7028 4087 5587 12585 2293 -6540 -4954 -18171 17282 17469 12740 43112
9412 43112 23969 -13116 3660 26789 18654 7855 -17295 -17662 4590 17555 28642 45599
9400 45599 50454 27777 47704 18263 -5679 -10965 -12652 -4196 21230 58229 86075 78049 55087
9387 55087 72154 110567 133911 169279 227484 236948 187547 120372 88489 42782 4469 -13130
9375 -13130 -25639 -37954 930 22592 -21715 3094 22702 23577 29260 5063 2757 -3657 14856
9362 14856 32718 41029 42455 69788 39081 13321 -12250 -19397 -53341 -77440 -66082 -59540 -69413
9349 -69413 -64912 -85391 -31093 -19625 -30164 -27920 -12231 -1714 13150 34001 23964 -8925
9337 -8925 -43414 -11271 -12706 -24473 -36041 -22064 -41758 -28214 -17861 -14513 31414 6732
9325 6732 9199 6017 -11920 36071 69044 50285 -17591 -51195 -44368 1737 29782 26276 16007
9312 16007 20949 -9130 -17739 -24559 -11578 -12043 -10059 -29717 -46107 -60434 -30596 -1066 -7665
9299 -7665 3245 -3175 -17470 1334 4041 62534 97482 99174 74773 64238 43807 27911 3051
9286 3051 -11688 -18845 10819 22496 85831 79559 55035 38302 48604 22100 14929 23676 1518
9273 1518 -51938 -10402 50482 63225 47295 26169 9465 -5682 -33330 5352 36419 9193
9261 9193 2330 18898 3418 -13329 -4750 8526 27131 39439 33172 23953 13107 25447 34831
9248 34831 15179 27523 71413 73176 69853 43415 42339 38008 37299 30942 62368 55126 15719
9235 15719 35 39406 36369 22428 18779 24238 41392 17992 17765 -13203 2863 6347 17014
9222 17014 12917 26131 29479 37455 14010 396 48 16609 10214 30166 29280 46086 45888 60400
9208 60400 77913 76033 69941 80959 90874 111162 91181 43838 37231 16436 38166 43767 15250
9195 15250 29154 62085 64002 113134 73320 76825 107262 102839 99358 67677 73624 77027 96659
9182 96659 95081 62973 28475 62384 100378 90223 106979 110569 161113 179610 155126 126647
9170 126647 141247 176657 155569 127382 154487 162526 137022 135596 123971 141348 139833 125375
9158 125375 136057 138022 151486 132869 143998 149157 169267 202469 204799 204444 199997 191884 189734
9145 189734 209472 215585 208896 200720 221106 246052 266084 242098 232197 197574 189707 211781 258680
9132 258680 277314 286501 285897 309662 315680 299336 298202 325765 338161 364080 381330 360519 360171
9119 360171 404135 390863 438769 484710 487095 528375 579936 588564 588065 594028 642122 657616 650938
9106 650938 713076 788507 818396 848712 891998 930381 975860 1052943 1119345 1195081 1296879
9095 1296879 1340650 1410310 1512056 1608312 1672281 1743266 1833593 1936089 1996885 2056141 2128098
9084 2128098 2243046 2359190 2414953 2525880 2580695 2626018 2639025 2680348 2742001 2751900 2735801
9073 2735801 2722395 2700487 2684193 2590269 2485377 2401894 2304514 2188917 2118083 2065577 2010991
9062 2010991 1880445 1783184 1737913 1688344 1632763 1553566 1418694 1322736 1289709 1256336 1190690
9051 1190690 1142043 1072726 1030051 979561 939508 893095 845678 820900 797666 769380 749436
9040 749436 733112 710885 681137 644907 639392 625909 612777 579137 578469 560303 519833 486759
9028 486759 483590 466462 415799 432187 409619 376051 350400 351598 380644 390673 387303 384943
9016 384943 360300 376620 377072 340127 279668 274020 256480 237484 240005 256092 268822 253739
9004 253739 238360 215048 233964 241769 234089 196095 226194 229104 230063 236176 250344 273604 290953
8991 290953 286561 277147 277825 265522 292867 304527 281326 281159 241454 202264 197262 238316 275477
8978 275477 282807 249783 260983 334349 356121 346902 331692 270057 284935 324111 334416 344284
8966 344284 347973 367764 395282 395446 395316 389749 400160 418239 431270 401089 378258 425385 479261
8953 479261 492033 511314 585875 619899 635015 643860 673518 737523 799761 891251 977632 1133475
8941 1133475 1402968 1698749 1950586 2076723 2083598 1985117 1820099 1618523 1420634 1259667
8931 1259667 1149988 1087465 1019616 986226 1002504 986029 909986 866094 845993 845431 856205 862694
8919 862694 886361 890880 916885 930960 927207 935958 924232 928755 932275 951483 959269 969677 996815
8906 996815 1030713 1043495 1029407 1051281 1050220 1055944 1142561 1222070 1304246 1502538 1794638 2213365
8894 2213365 2786585 3387402 3780523 3825333 3614739 3242062 2838759 2397064 2020534 1700794
8884 1700794 1465028 1295045 1188533 1115349 1003745 953622 916851 868700 843442 802257 790028
8873 790028 763045 719523 671999 670901 673337 637539 638175 632516 613128 613023 611849 605132 574245
8860 574245 530099 502467 508508 507445 480844 519419 527115 562189 591958 679062 812006 971767
8848 971767 1187553 1430334 1644131 1753731 1727045 1556657 1366277 1169995 946483 794906
8838 794906 679822 626448 541904 493078 447899 415595 374788 351166 353381 303906 281531 292185
8826 292185 294499 265708 274485 297678 279480 246980 218469 188558 194768 164966 148517 141497
8814 141497 129601 146609 139897 114721 127851 182693 184540 188610 183862 137407 108893 107951 134106
8801 134106 133254 93184 91023 103451 100666 90386 69950 92538 81472 98912 104121 87911 83499
8788 83499 103258 112879 90989 90048 88832 114435 137298 120033 129171 130815 129836 107931 54184
8775 54184 41553 87543 100768 64938 56645 87564 92040 94779 107699 107346 105167 95055 116504
8762 116504 122508 78360 66682 47335 36080 62452 67632 101690 95508 83160 77310 79390 62708
8749 62708 55642 66951 98842 127164 120665 90971 51020 57375 67517 74041 77247 76987 88844
8736 88844 112229 125077 92845 82676 74411 82791 90711 93749 88775 85402 108155 149763 129974
8723 129974 102810 120641 79606 47237 49668 68563 39228 51522 47462 33942 52298 105825
8711 105825 61735 35662 32334 58158 102339 95305 42782 2716 15950 61112 75834 89783
8699 89783 70942 70319 80318 63824 53832 44041 32071 20463 27814 64370 108923 94561 120518
8686 120518 138048 93368 65549 69128 76847 68356 60421 25021 15008 13745 34633 87122 115791
8673 115791 126595 119304 91556 62872 69597 39460 1473 -14048 41567 58563 82733 100454
8661 100454 73966 51894 21733 25798 55577 77365 116615 133667 116728 104971 104711 69507
8649 69507 62315 82475 75564 93945 153683 157323 116926 97053 135855 146737 174774 173626 130764
8636 130764 102481 114814 136834 115306 154603 141415 127890 121425 166015 204605 205536 190423
8624 190423 171248 182853 203478 203649 180208 187498 225720 260687 234971 231538 264661 295858
8612 295858 288362 304665 341347 365455 395418 461608 520044 523701 548125 600688 679410 754405
8600 754405 789586 796924 817225 798783 732388 622793 540128 503089 443708 385658 360318 327931
8588 327931 317582 275104 232614 202583 214914 216607 210935 205908 172303 152898 122996 111035
8576 111035 147264 135761 75488 55111 51003 109025 116027 93806 87048 69672 99831 147287
8564 147287 117721 120215 128267 119859 123492 75720 99451 134157 119331 98663 70233 54351
8552 54351 84408 100385 86752 116268 90255 74944 75653 72642 73491 56099 39000 23955 31209
8539 31209 38973 18400 31318 36247 -293 29293 46881 29254 9913 28388 65886 58976
8527 58976 54706 80270 105214 89612 51537 41418 30470 53754 71227 64205 55198 52496 77148
8514 77148 70094 48946 63263 75655 92572 64155 42933 29761 19756 12630 4837 10972 69127
8501 69127 99428 95669 119800 148343 118367 84840 59023 29809 7780 -32995 -55730 -36583
8489 -36583 -19178 -10683 13948 34166 55269 88536 83118 34100 -14242 -2733 5652 19668
8477 19668 67846 84361 52866 12115 -277 21238 8888 -28572 -36844 -31675 -21481 -1499
8465 -1499 27820 35667 42393 54354 35200 30231 10902 -12327 -16669 14406 27894 12424 17360
8452 17360 50040 59893 62131 33048 33446 41574 51320 41188 45188 61222 76273 78786 71434 87236
8438 87236 72832 51891 40294 37960 55498 45673 44908 23414 43726 100760 137170 110436 71375
8425 71375 45053 77147 94783 65264 67638 87444 91877 91066 77480 63353 50279 40800 46521
8412 46521 39807 38372 44295 34628 42678 33863 51799 38054 21934 23642 37671 56354 54606
8399 54606 36765 25541 52473 54110 52964 61020 45150 26330 21991 17294 -2032 18295 8777
8386 8777 -34483 -35601 -54092 -48079 -40206 -9583 33936 41492 1105 -17238 -779 -10950 14043
8373 14043 8024 -1305 -23375 -50729 -20042 10612 33013 39732 23153 13958 -12950 -20036 -22870
8360 -22870 13316 19350 -2137 -14643 -58674 -3669 29264 12034 -18643 -16516 13371 16822
8348 16822 33511 35747 20961 75413 90378 117247 127440 98258 95850 77464 89226 81596
8336 81596 49812 19034 -4793 6732 34036 61926 39881 308 -5617 -23510 -27159 18986
8324 18986 13843 -3228 15528 16473 -9007 -25822 -10343 6149 -2651 -1034 21975 40439 38005
8311 38005 24731 -9575 10132 -2453 -41633 -30626 10587 45079 28039 34182 23270 -45023
8299 -45023 -80274 -39980 12192 20925 56239 73844 69317 71698 64787 49383 55671 49147 53592
8286 53592 77026 76474 43679 7638 20889 21965 17257 47811 63794 62705 55561 55028 54811 55434
8272 55434 65056 44451 -9509 1119 47563 72589 69977 53672 43203 14994 20483 54275
8260 54275 30371 52604 60532 62900 55923 29367 25500 70450 70291 23801 26497 49513 61654
8247 61654 70709 66028 48250 41900 22522 4650 38976 35917 7241 -8091 -6772 8557 19383
8234 19383 -1889 -32957 5331 30942 21655 8409 38881 23746 23018 8414 17476 1017 -23224
8221 -23224 -14445 3361 32813 40716 9634 -5743 -36592 -55334 -54306 -11011 -14244 -25655 -16222
8208 -16222 -29252 -12280 -27942 -26695 32070 21084 5142 39460 54454 15393 -3884 -37622
8196 -37622 -10692 11050 -6884 -27168 -34658 -14744 25717 -5496 -19780 11638 12133 40288
8184 40288 51075 56766 23283 12624 28914 20041 -10523 21013 45253 79598 68034 46078
8172 46078 12256 28724 28825 6168 264 1404 -12178 15099 16934 27652 44860 33406 7190
8159 7190 -13856 -15545 -12027 -41649 -19202 -7044 12090 2369 -20142 -21069 475 -9749 -25978
8146 -25978 -8097 11049 26486 -10702 -5354 25902 5012 10114 52820 65703 41623 2201
8134 2201 44317 76521 50241 20934 16504 19520 9721 -16922 10389 35514 8083 -17109 -26302
8121 -26302 -44564 -32142 337 -4353 19805 28593 23461 2565 2907 32143 45453 47208 57438
8108 57438 85544 96556 102110 77814 73114 76768 58406 23281 22819 30015 22100 -3212 710
8095 710 -55480 -76774 -55290 -27455 -27008 -30764 3803 -2400 -19145 -8129 -24104 -47894 -30226
8082 -30226 -38880 -25094 -48894 -14237 29377 16738 -7813 -25337 -1342 15624 21586 24453
8070 24453 30753 2621 -28439 -12906 -4202 4481 35834 46284 42562 34004 51766 42092 42910
8057 42910 45288 45808 55013 56795 53760 42184 55054 46185 50756 73007 90679 94586 63313 51215
8043 51215 10724 2015 -5530 6714 18744 16132 15035 11314 1526 -35257 1198 43543 73077
8030 73077 68699 84814 93934 101480 71556 38847 32976 25288 39439 14909 26944 50747 26464
8017 26464 55674 79492 104888 108835 95777 94752 89829 103546 133388 155715 175051 154938
8005 154938 115115 71281 41940 61434 96577 129133 113173 107866 95616 62685 45163 36863
7993 36863 19771 43819 42371 41584 38260 24405 21580 24507 54265 96281 72669 93519 103729
7980 103729 99820 94258 95538 101816 87993 63207 23655 15745 55708 67825 49645 45737 71847
7967 71847 79418 89410 113777 107135 88842 98253 132911 134644 149010 158701 107126 72314 52825
7954 52825 66417 109349 138391 132984 100439 81690 56875 50295 45775 60413 82786 64013
7942 64013 10093 -15192 -6183 25648 51076 69240 56126 89418 114564 146564 182459 189351
7930 189351 170249 153844 166424 170520 163297 177889 198641 186680 166594 128959 103647 103802
7918 103802 115506 93929 56224 24056 23621 73265 94616 100265 116562 137277 154359 171996
7906 171996 175077 161693 161066 158971 121429 90426 85641 114759 99395 89381 54914 40619 55064
7893 55064 71600 78535 67359 91415 92558 75524 50142 19115 33444 12187 31797 38782
7881 38782 11209 41407 48696 35456 8533 3805 -5890 -5991 4660 11340 19092 29811 39383
7868 39383 60377 62883 75656 56137 26994 54205 60312 29198 23170 32856 39269 25096 40764
7855 40764 43341 68189 74275 40580 38460 46236 30591 16264 32516 36770 33773 4718 5029
7842 5029 19385 -4510 13964 26903 25568 24906 34681 -1514 -9083 -15512 4943 37855 43541
7829 43541 28297 -6585 -15889 -8076 -34577 -34393 -25902 -18377 17869 22056 6913 23098 38275
7816 38275 22916 21989 48733 33827 29253 29600 52907 43113 10119 6126 3780 -8129 8294
7803 8294 34256 49851 58082 51638 42089 10779 9249 19534 10857 151 8184 23797 -7450
7790 -7450 -10839 -5657 -29238 -24190 -20041 4756 49777 80465 44857 23779 -7500 -19086 6106
7777 6106 18099 5686 22648 -3701 -17540 14700 38703 52051 68779 13878 -4363 -19680
7765 -19680 -32229 -24634 -8418 -2615 -13074 1843 -22595 -33264 -9003 -2691 141 -5635 -504
7752 -504 16045 9524 -4212 -16643 -16236 5094 24236 40761 9787 -13974 -31843 -51633 -26461
7739 -26461 -7935 10029 4388 -37884 -50770 -37116 -22023 27134 47167 49731 19121 8661
7727 8661 -22388 -37254 -39857 -49141 -9295 -14604 230 -18729 -26762 -6988 -5718 8136 22630
7714 22630 27997 -8050 -23123 8880 18699 -3336 8894 -27823 -49979 -50905 -4239 44410 11507
7701 11507 -12182 3183 20115 16672 11994 20803 4949 -2167 -34857 -48794 -54409 -31426 -31908
7688 -31908 -22263 -27379 -11036 -7976 2814 13499 45202 32300 19079 30164 -2504 -18906
7676 -18906 9712 14949 -31177 -59309 -62734 -53081 7577 31155 24469 19886 32876 54499 20072
7663 20072 -20859 -33682 -51055 -35565 9064 31505 30157 -4613 -6175 -4664 3227 -7258 2084
7650 2084 -23953 -16499 -7744 -28472 -79561 -64638 -44361 -47489 -32807 -1813 -4223 -22643 -63607
7637 -63607 -46811 -25197 7744 -5727 13783 -346 -11802 3959 3304 -28719 -59619 -65794
7625 -65794 -47362 -25934 -28117 -550 -7166 -7020 31544 23682 4392 11463 27706 14396 -11218
7612 -11218 -4386 21658 -19713 -52886 -56150 -59880 -37486 -32682 -22721 -5322 33572 15659 -8
7599 -8 10605 4176 -21801 -22059 10269 11285 1168 13556 13398 -11280 -36921 -25767 27399 37289
7585 37289 -195 -26265 -17218 -5130 -9736 -16012 -5891 -12181 -16909 -38918 -86805 -104621 -59148
7572 -59148 -27664 -9543 -6075 -25969 -14302 -19338 -1559 -24590 -36005 -22053 -13124 -6008 -3657
7559 -3657 19794 28870 42936 34811 13784 8677 14836 22430 4461 -9864 -23488 -16380 -44188
7546 -44188 -59112 -28011 -12695 4042 35767 43827 12421 -11525 -7944 8702 9499 52202 59034
7533 59034 44492 36904 58634 52035 43768 48044 27296 38694 38226 14902 24262 48959 65751
7520 65751 47774 25508 29800 8023 -19388 -37403 -8161 16478 18879 17934 27696 32047 967
7507 967 -27723 -49397 -57595 -51301 -59756 -48683 -25330 1413 14529 -7331 -12063 -51601 -43387
7494 -43387 -22245 -16857 -8596 -16870 -35481 -29574 6442 7886 -21516 -21720 36411 53561 21885
7481 21885 1388 8865 37165 35598 -1932 -31957 -51881 -33382 -34181 -6674 -12134 -33401 -55264
7468 -55264 -49615 -31485 -52317 -9899 11907 1696 3524 21196 10334 6122 5506 -11676 -33731
7455 -33731 -32427 -37608 -29051 -49592 -36702 -14866 -23727 -46992 -43017 -11215 35010 41493 -5732
7442 -5732 -40890 -41324 -12698 7728 -647 -34619 -13321 -25498 6004 40697 9771 1759 6602
7429 6602 1304 -4213 -12740 -5762 8680 26734 31615 -4849 3301 -399 -16223 -13877 -34345 -28238
7415 -28238 -472 -8961 -38054 -67721 -50363 -23945 -29835 -60680 -74956 -22264 -40956 -44879
7403 -44879 -31663 -19643 -12532 -17642 -21687 -9066 8131 28099 15874 18674 5671 -12705 -11897
7390 -11897 -26949 -64648 -64402 -39196 -26797 -21906 -27942 -39224 -10145 15942 33681 17188 45203
7377 45203 41456 70000 71101 14581 299 21171 20046 29767 10510 -743 8436 -5050 -26621
7364 -26621 -30410 -27044 -6835 -3942 10855 -13481 5288 11654 749 -16843 1016 11066 28376
7351 28376 58891 22627 -597 22222 40777 -10773 681 3602 -18183 -14301 -2314 -18828
7339 -18828 -29607 -31861 -53443 -30916 -47158 -6967 35801 38019 19620 -20459 -25514 -20800 -16012
7326 -16012 -14453 -18101 174 7777 -4875 -5602 -14058 -3731 25702 21336 -8642 209 -6720 -11035
7312 -11035 -31484 -33353 5878 26354 20728 -2923 -10337 11056 44685 63704 52614 15543
7300 15543 -9467 -31614 -70735 -69854 -44787 -40148 -26652 -7065 9269 25204 11822 -8681
7288 -8681 20809 29995 -7044 -686 39509 27343 860 -8850 -22442 -22066 5605 1131 -14777
7275 -14777 -9209 -34256 -61708 -39650 -16527 20289 16929 25131 27470 -4216 -24830 -63239 -83848
7262 -83848 -79201 -53844 -26325 8514 -22910 -63259 -63246 -24555 -43483 -41043 -39171 -38424 -21949
7249 -21949 -19698 -62054 -62018 -40605 -26332 -57493 -80809 -50705 -67172 -65188 -71972 -71306 -68477 -53559
7235 -53559 -6248 24425 -2382 -13512 12853 6976 10066 9912 -10141 -15314 -29648 -14132 20259
7222 20259 34262 30705 -16013 -30113 -6684 -16049 -13345 -188 -26672 -38935 -50128 -50518 -72865
7209 -72865 -60303 -69713 -68268 -58594 -58560 -61797 -69524 -70823 -64882 -49810 -17065 -29366 -43452 -20833
7195 -20833 -10740 -15991 13601 -3808 6183 25251 12631 6159 17740 9865 9135 3843 -10144
7182 -10144 -29614 -10948 -21224 -35463 -31811 -3285 31636 27281 -5215 -32945 -19586 -11735
7170 -11735 2225 -9601 148 -36859 -67412 -42898 -33725 -31123 -9198 186 -33039 -52413 -27073
7157 -27073 -31008 -31853 -42824 -30068 -12815 18920 13149 2696 32275 32063 -21179 -56692 -73884
7144 -73884 -53672 -26202 -31202 -21116 -60910 -34660 -18031 -46194 -41235 -33133 -37066 -37965 -9302
7131 -9302 39850 78404 53847 191 -27181 -11448 16954 35720 37412 38827 22171 -5361
7119 -5361 -18683 -12474 20221 59084 64333 7779 4864 17321 17223 -29397 -31167 -53645 -43141
7106 -43141 -25775 -45756 -41020 -46478 -31523 -27123 -4242 703 -22584 -36573 -10931 -18603 -14610
7093 -14610 -43439 -49632 -42184 -30432 -19164 -22721 -36220 -52737 -29486 3589 -360 6343 2177
7080 2177 -7613 -29472 -37285 -30006 -19536 -9325 -11917 -19930 -12828 -13380 -32647 -23039 -16395 3910
7066 3910 10293 -20486 -54269 -69298 -41511 -36095 10253 23565 45467 59316 40689 13407
7054 13407 13481 1950 -21010 -23936 -23953 -26705 -1912 -8867 -21860 -6625 -22370 -27592 3440 2581
7040 2581 18877 20327 3404 -11570 467 31132 49263 47020 -7317 -5574 1827 -5204 13513
7027 13513 17569 18452 27023 -45553 -69180 -35602 -30252 -15273 -16590 -32299 -27780 -51276 -53243
7014 -53243 -28819 -22146 -69880 -49786 -21503 -18297 -7349 -16401 2155 -19899 -52506 -85526
7002 -85526 -72025 -50161 -13162 -7865 -27485 -30325 -10699 12894 -1626 -5220 5919 8455 -17877
6989 -17877 -56006 -31463 -20426 -45834 -40719 -62500 -70808 -77328 -86270 -53586 -53474 -71476 -30210
6976 -30210 5314 -13694 -30776 -37944 -36529 -1984 6365 -7673 12781 5466 16222 22691 -18830
6963 -18830 -58008 -60161 -27593 -21436 -40272 -76687 -72811 -39683 -15774 -33741 -59930 -34171
6951 -34171 -10580 -15062 -10418 -2911 -24115 -23549 9660 -9999 -28789 -14997 1602 27326 -12762
6938 -12762 -43254 -58994 -39253 -38965 -47447 -60361 -61538 -40184 -43706 -83680 -75754 -10573 -23127
6925 -23127 -11871 -9979 -12334 -34538 -6799 15807 14641 -615 -18933 -31628 -26474 -29945 -19629
6912 -19629 -11433 -7851 -35632 -8573 22932 59383 47079 23952 -13383 -46183 -42803 -10179
6900 -10179 4184 -14648 -39616 -73808 -59504 -46765 -55033 -29289 -1219 -11625 -14529 -37530
6888 -37530 -42213 -44863 -15370 -31070 -57914 -74691 -67784 -44290 4741 -3315 -14206 4405 -808
6875 -808 -9272 -5343 736 -15201 -14284 14581 8539 -42771 -53112 -42406 -6116 6658 -621 -7310
6861 -7310 -19107 12656 38861 18925 3260 7747 24078 17458 6040 29646 9471 8840 7913
6848 7913 42238 34151 23380 54138 63387 47203 -3440 -46680 -62236 -38032 -37359 -9918 1898
6835 1898 182 -6679 -1322 -6730 -15559 -8363 17721 25292 5538 -8156 -27746 -36312 -32881 10388
6821 10388 27536 -8679 -25622 -13007 -14568 -64878 -86438 -70704 -68258 -82179 -64617 -32797
6809 -32797 -9127 16612 13622 17169 27953 37200 27006 -28659 -33805 -6070 21598 -1565 -19480
6796 -19480 12635 10793 -24625 -60834 -58040 -25985 -9346 -23764 -53421 -27404 2693 190
6784 190 -27232 -34841 -44621 -42040 -46779 -56792 -67323 -47625 -2621 21245 4729 15331 -5167
6771 -5167 -8337 -3431 -17593 -17331 2683 -18885 -56422 -61753 -18010 -21129 -39175 -62543 4973
6758 4973 60125 77561 124183 124802 113105 83954 43278 63628 86377 104804 120571 129525 138622
6745 138622 106405 127010 163102 220373 237116 275783 363101 519722 763399 1149807 1719651
6734 1719651 2701778 3997942 4500349 3870688 3003363 2160263 1500103 1059588 790591
6725 790591 612202 506692 457827 389177 317323 258202 231475 193030 144887 140817 169827
6714 169827 161632 110841 71422 99903 170921 237398 195727 133494 94718 88545 51788 16944
6702 16944 16080 33188 53306 26179 50584 64366 45746 38387 38071 41929 13748 903 -13971
6689 -13971 -9251 10873 13990 11314 24459 37046 18893 15974 26803 28814 -10886 -17388 4162
6676 4162 30998 35707 8357 1537 3758 -6191 2694 32070 47924 36928 2155 7341 12464
6663 12464 43110 -2312 -29523 -33096 4152 2161 17593 27833 31286 22467 16479 21641 29749
6650 29749 15541 59804 60105 47156 44417 48716 23300 -699 -23908 -24399 12038 -12452 -26801
6637 -26801 -15160 -20214 -388 13993 18355 31996 21226 30397 37502 8690 9398 20918 34806
6624 34806 50009 46397 49900 43174 45103 58022 26377 -19456 -33175 -28039 -578 41768 44039
6611 44039 9178 -5800 -22593 -24776 -4972 -4991 3317 16224 13493 11484 6022 -11770 -16469 -34020
6597 -34020 -53061 -45938 -37986 -4374 17917 51286 30364 9923 1793 3743 19652 -1640 -1475
6584 -1475 -15532 -5253 -6727 -41744 -58667 -24197 -40834 -27661 19617 26619 -4153 -17397
6572 -17397 -20307 -15344 -4153 -10842 -8055 14712 31866 48748 48910 61091 44417 38628 21175
6559 21175 26114 24481 6207 -21800 -52272 -69729 -45172 9837 67395 61895 56702 34566 38290
6546 38290 30024 20501 2535 -7187 -15142 -37534 -66409 -57573 -26224 -23449 -14998 -2321 23300
6533 23300 42467 52502 51134 54819 29915 27008 17069 -12033 -21996 -4143 -19695 -20968 -29351
6520 -29351 -19951 -18264 -7954 -19036 -28721 1347 27295 19136 -2114 -127 3456 -18337 -17806
6507 -17806 -8022 19880 33693 28571 21920 -6588 -9583 -19400 -40710 -20475 1329 26644 26654
6494 26654 16618 24165 15069 416 23730 35364 -2105 -34460 -48977 -59286 -42478 -4653
6482 -4653 -21345 -29297 -12751 5444 32179 27054 32914 40977 28354 26463 47633 55482 -18394
6469 -18394 -17143 714 -1440 -23633 -33601 -32044 -36628 -24006 -66370 -66673 -32425 -33664 -38266 7529
6455 7529 23844 28437 31252 24949 24072 6918 11145 27700 23232 26178 36220 72238 66273 -6063
6441 -6063 -23674 -40656 -14876 2665 -39405 -15982 -1961 -34311 5146 -18141 -24507 -58994
6429 -58994 -71622 -45231 -4579 -3253 -12433 15983 60429 39274 12160 14875 -1067 7299 17136
6416 17136 -13629 -17193 -4265 -7677 -5993 -3726 -2507 -678 -19248 -71800 -64831 -28703 -39168
6403 -39168 -12417 9133 -2619 19432 55695 90777 77537 23264 21507 21150 6009 -20305
6391 -20305 -4552 21478 36396 41562 -4396 -36177 -40528 -25496 -26664 -25216 -42079 -38316 -1558
6378 -1558 -4098 -16350 -30186 -4595 10378 -6657 -7819 -13240 -37220 -34588 -20511 -13505 -20478
6365 -20478 -19213 -11358 -7324 6500 21371 10735 44 16911 38848 28754 17257 -1604
6353 -1604 -4122 10408 1443 -7061 -19113 -43686 -13638 -3893 -5489 -15026 14293 14247 34747 27890
6339 27890 24990 8879 3660 7846 -9032 -2752 16076 17239 16257 -21544 -33565 -12293 25822
6326 25822 29299 20401 -25467 -32400 -18776 -526 5938 -5937 -21353 -12890 5165 45957 22261
6313 22261 15415 -10507 -24659 -24588 -27011 -17750 -19568 4923 3837 26139 37291 -12099 -34943
6300 -34943 -22680 19987 31314 12023 11865 26057 22408 33481 32094 -8889 -36370 -27965 -9206
6287 -9206 -7526 -29745 -22125 -12587 1479 -25220 -15828 -2284 10032 12306 22351 23413 -7530
6274 -7530 -45160 -18527 -5868 29506 15046 -1304 -9991 -22343 -21650 -8661 -21521 -29595 -1739
6261 -1739 -10024 -37717 -35881 -45285 -38616 -21153 -37043 -44298 -30686 -25636 -17855 5562 18069
6248 18069 10164 -15678 -25945 -4963 19281 15901 26685 23383 55074 59286 19737 7746 44706
6235 44706 13495 -23891 -30772 -14345 -3629 18989 10006 -30328 -11202 -30736 -23244 -10100
6223 -10100 -18601 -24375 -49510 -45053 -1883 11458 28498 4504 -11703 -7537 -10077 -29499 -25641
6210 -25641 -11095 -32815 -43932 -29893 -6714 -15588 -42820 -61750 -53446 -47260 -45432 -36513 -21949
6197 -21949 -11287 -5944 -13220 -23445 -22762 -19073 -10299 14594 35958 49875 21956 -11976 -22382
6184 -22382 -40816 -2896 10303 18420 52144 19121 -8601 -25325 -10278 -1215 -8259 -11153 -22044
6171 -22044 5708 54854 25099 -38682 -52620 -50270 -39662 -16220 -27105 -12135 -28400 -15766
6159 -15766 25860 27557 21259 42733 34272 2698 -34904 -49955 -33358 -33540 -56327 -74816 -53662
6146 -53662 -28617 -44432 -33408 -50924 -36945 -26497 14183 41659 22127 8169 22712 45484
6134 45484 62232 58878 52275 35342 4822 540 28209 38847 44493 31846 -16546 -40079 -2991
6121 -2991 1004 -1897 6971 17670 12323 10106 -7925 -35250 -23902 23222 31412 18669 2546
6108 2546 1878 22530 8277 4949 27734 12791 -10661 -19088 -1180 3313 18402 10258 21034
6095 21034 19587 12861 -3364 -25005 -34608 -16858 -1323 -20334 3913 1468 -6493 -6341 -18464
6082 -18464 -8873 -18386 -5918 -18164 -13758 21195 27721 28390 -13843 -25068 -7368 23748 17083
6069 17083 7261 8645 -32175 -42838 -33128 -25041 6173 17354 6096 1790 24816 11676 31565
6056 31565 29361 -5448 -15903 27987 39410 18510 -9404 -25739 -8150 -6023 -5395 -2931 -20813
6043 -20813 -38146 -13770 -29360 -46150 -54822 -38292 -21140 -33496 -54866 -35812 -63159 -27089
6031 -27089 -12167 -2660 -9210 -34570 -42235 -23430 -20484 -7022 18768 26345 26252 -6817 -41928
6018 -41928 -23193 -8227 3600 -2812 -31252 -36466 -26341 -21083 -13391 -19505 -25141 -43116 -48540
6005 -48540 -66413 -64433 -33873 31075 50060 51296 45784 46598 47704 -4259 -42540 -64707 -78070
5992 -78070 -45360 2965 27474 2888 -3999 15010 -10881 -32074 -3108 51649 30703 -18388
5980 -18388 -32255 -32626 -3571 26323 12130 -5126 -32852 -39288 -35656 3047 17267 -9059 -37687
5967 -37687 -19693 -9741 -25589 -9028 13265 14535 -7308 -37281 -24816 929 -14385 -17833
5955 -17833 19542 9776 -34698 -46690 -52002 -53476 -39068 -54775 -58075 -37140 -3076 26709 43009
5942 43009 15226 12380 13115 31269 25855 23308 23991 -11582 -27870 23564 13465 16041 -13227
5929 -13227 -10569 -4271 -18852 -44559 -65543 -46237 -16623 -22543 -14395 -26275 -28914 -34692 -41523
5916 -41523 -25176 -29164 -67168 -89569 -66699 -24030 -28237 -23126 -4949 -20067 -41575 -8264
5904 -8264 17320 25724 26021 -7192 11435 -10593 -6145 -1925 20871 33985 37113 27356 45274
5891 45274 43721 35942 6119 -12076 -5291 -12696 -24367 -26818 -23970 -3084 -13814 -5477 4907
5878 4907 9521 -15410 6995 15800 -9123 -4098 40201 64651 42706 31970 21642 -145 9052
5865 9052 8689 17740 6090 -21152 -15794 -19337 -16171 7399 53774 39199 -17642 -38836 -52028
5852 -52028 -51823 -35053 -14579 -26591 -3121 -18579 -51966 -34440 -14944 -15284 -7937 11962 35125
5839 35125 33388 31749 -5357 -30802 -21796 8484 31819 22169 16640 25452 33045 12908 5079
5826 5079 15015 -25524 -24620 -31958 -49075 -40200 -57997 -38017 -24026 -6894 -13055 -3620 -5062 -26678
5812 -26678 -16217 9025 -10215 -58435 -62899 -57147 -41068 -4352 14762 -3722 -15505 -18686
5800 -18686 -46460 -48310 -21723 10208 1545 -5801 -37672 -26784 -17545 -23156 -32337 -26295 -38668
5787 -38668 -7111 12622 13381 -15878 -27238 -7656 15228 16290 -23950 -33947 2833 -6893 -25400
5774 -25400 4047 -6724 14662 40903 20321 -13280 -18855 -18497 -26865 -20608 13739 10742 -1454
5761 -1454 -13642 -6034 -40823 -82416 -82959 -54710 -35667 -35042 -44495 -35304 -9009 -31205 -42656
5748 -42656 -13450 -1287 4774 -2204 -27191 -6501 18802 -2688 -20683 -13392 24209 30036 35950
5735 35950 35029 38639 46540 57524 10647 273 8388 17295 -16621 -22473 -29567 -42449 -45912 -11630
5721 -11630 -17704 -19111 -6890 -13461 -16665 11395 12189 -22214 -30773 -25690 -17263 -27923 -32684 -3007
5707 -3007 1898 942 7732 25310 12000 16424 39259 37991 14848 -2654 -31594 -46614 -28586
5694 -28586 4550 33690 22401 23223 22307 -2462 -21004 18334 56236 36526 32512 65655 87371
5681 87371 84163 46635 14331 23348 27242 30586 11577 3075 -12497 -22219 -8216 17941 25390
5668 25390 6137 -16169 -24018 -4691 16705 6180 -15738 -8392 -5446 -5401 12459 -5457 -4437
5655 -4437 1232 -12868 -21870 -21580 -441 -14282 -36296 -18406 4464 9118 -29860 -23793 -45795
5642 -45795 -67086 -47968 -12670 -37747 -35626 -42776 -27525 -28171 -20751 -11647 -26165 -15843 23875
5629 23875 52419 57000 83001 86336 56283 1949 -14893 -37841 -52167 -37434 -12749 8995
5617 8995 -7285 -378 4898 17324 31936 9320 -29365 -37876 -40980 -45625 -26318 -29293 -13483
5604 -13483 19984 -3993 -34688 -47391 -30479 -43845 -8916 -6 -14884 -36878 -19244 5500
5592 5500 -2350 -148 17072 17019 -17652 -17972 -19660 7373 20944 16710 19611 23686 39466 26557
5578 26557 -2188 -6511 9628 15443 -4468 -24977 -52187 -15947 11133 29137 21215 -1770
5566 -1770 -11053 -18164 5100 32055 22688 -17515 4911 21823 11182 46494 48845 19287 11740
5553 11740 -8109 -50890 -79440 -52643 -25596 6046 -1399 -14949 -27090 -18856 -14993 -40458
5541 -40458 -75429 -41506 -28895 -44697 -38775 -4654 4803 9418 -1334 -27903 -23932 -8042 -12558
5528 -12558 -18795 -29394 -46181 -61177 -55964 -26997 -20173 -18334 -42791 -76445 -63267 -16787 18439
5515 18439 22549 30852 9731 -15825 -21323 -22825 -36975 -29888 -7229 -3687 -20961 14820 38779
5502 38779 18287 12432 30429 37033 38277 39778 10614 -10230 -34689 -6127 3673 -7345 -19822
5489 -19822 -29947 -48386 -63080 -35640 37058 47439 6302 -30738 -26679 -31038 -63868 -48458
5477 -48458 -38936 -22757 -24895 -14880 10062 -25993 -40230 -23246 -23277 4094 3889 -19006 -18874 -5554
5463 -5554 37211 50956 50157 1364 -23868 12821 17546 38485 36736 -6150 -34289 -12611 21526
5450 21526 38299 52361 29444 31580 53958 55428 8721 -11881 -11482 -31576 -34355 18256 37439
5437 37439 31479 2333 -37709 -52247 -72448 -54302 -25375 -5147 20085 22662 50340 43492
5425 43492 58229 -3430 -27612 -35460 -19216 -6819 -15643 -38382 -37690 -42267 -46572 -57333 -43513
5412 -43513 -39845 -46327 -49361 -6555 -7676 -6239 -12585 -6167 -11433 -4802 -22063 -61421 -25566 -7335
5398 -7335 3645 32426 30983 11544 -3318 -9658 7078 -32493 -29286 12707 49357 37000 61555
5385 61555 55453 44116 60559 24422 -5182 -8126 4328 -17523 -36871 -26402 -42654 -17393
5373 -17393 10084 -15148 14500 4918 1845 51358 36057 17637 10350 20580 8605 -28657
5361 -28657 -28088 -13669 965 -5833 -33447 -55082 -28168 -35105 -33852 -40842 -64831 -38585 -21552
5348 -21552 -13424 -8163 8550 -29838 -43450 9458 15382 6856 -15380 -8690 -33615 -51967 -17658
5335 -17658 -16056 -32675 -40992 -48774 -67725 -49785 -5101 7406 -10189 -41188 -51144 -72564 -77893
5322 -77893 -36138 2647 45496 40318 44586 14480 5979 3505 -24554 -32309 -16501 -11376 4323
5309 4323 33913 23709 -2452 17024 32187 3465 11175 43861 55875 5612 -11670 52773
5297 52773 53651 65341 35778 -8069 6343 11360 20691 4846 -20033 -29163 -28706 -31965 -59218
5284 -59218 -33387 -6378 -11943 -7782 -11499 -45792 -60382 -29576 14405 37677 22261 15542 41242
5271 41242 37524 15831 12865 20166 14408 7443 21369 31163 6685 9634 14283 -15674 -60092
5258 -60092 -75076 -79361 -37082 8663 44329 49004 6376 -22512 -7027 7819 3005 27383
5246 27383 26341 28398 42283 33370 -15892 -29596 39788 102637 126559 131600 112319 64060 33997
5233 33997 16442 16996 23528 39274 35929 9616 23162 28004 21518 26192 -10546 -32294 -32337 -46312
5219 -46312 -65613 -57167 -20052 -4745 -55186 -94963 -83351 -60115 -85024 -77427 -39590 -25502
5207 -25502 -40037 -22507 15878 37933 25088 -8543 -15979 -16239 2171 -17179 -9160 20253 -6866
5194 -6866 -8845 -13657 -17218 -13490 -8950 -9321 -18478 10244 -6855 -4978 8790 -84 -13241 -12882
5180 -12882 -10003 -38494 -68967 -80990 -85061 -68884 -38429 -26014 -68824 -92436 -104669 -81274
5168 -81274 -51541 -33042 -24532 -42811 -31747 -14765 -6749 -3494 -7552 -5910 -28840 -7294 -5126
5155 -5126 -38000 -53316 -23189 -10756 -10449 -25813 -22724 15563 21448 -25292 -8842 661 -2945
5142 -2945 -12434 4305 -1671 -9570 -2737 -2313 -25020 -5820 19339 27747 29771 14254 42082 41657
5128 41657 39068 49865 33336 -1549 -6546 12542 -1925 7076 12210 -23413 -39051 -15356 -24792
5115 -24792 -63419 -64105 -34007 -13100 -36203 -13193 12269 -25137 -47019 -56095 -67685 -23714
5103 -23714 -39821 -51526 -26612 11260 30206 33321 25504 32495 44186 22160 13548 4839 4310
5090 4310 -6422 -33840 -47056 -34999 -24506 7394 7662 -12665 -8920 22883 -10488 -21043 -2596
5077 -2596 -2054 -22670 -8544 -18081 -12068 -11176 15996 20876 -10135 -23814 -4249 -15998 2255
5064 2255 -7904 -8018 3426 5482 -929 36558 37715 27028 5796 -10656 -6778 7175 -21458
5051 -21458 2486 11832 -4721 -15207 -28377 -30091 -40356 -63878 -45858 -28189 -40066 -31332
5039 -31332 -8173 -12184 6220 1277 6417 22303 27321 41473 30902 2269 -14752 -2538 -16753
5026 -16753 -1003 14828 36745 40892 54544 51222 61880 46701 13734 106 1592 5332 -37974
5013 -37974 -14618 14477 16077 6648 -2367 -58954 -60021 -34566 -18966 -20641 -11087 -26933 -35335
5000 -35335 -8927 -32373 -49580 -45906 -8466 -13459 -29096 -23851 -14448 -13452 -466 4424 879
4987 879 6739 13460 10748 29146 39225 24178 -25341 -49608 -20658 16726 -36065 -46136 1984
4974 1984 745 -33077 -46638 -14013 36201 39180 1227 -32395 -36391 -36218 -16452 11072 38049
4961 38049 25741 14457 34155 43121 44945 30553 -1113 4331 2652 941 26797 25433 7428
4948 7428 -7574 -43954 -53600 -13875 -6157 -3577 -6353 -61912 -17014 38879 38629 14585 -14720
4935 -14720 -68813 -82450 -35571 6428 -10104 -12616 11022 5301 1442 7265 -14397 -47981 -42900
4922 -42900 -21984 23138 41440 10795 1500 27830 27567 4286 28820 33138 35307 56114 24415
4909 24415 -14212 -30154 -36127 -27921 -25454 -44773 -30974 -46389 -71440 -60733 -44922 -36343 -21697
4896 -21697 -7098 7853 578 -14262 -1337 8983 -10258 -10353 -18239 -49821 -24702 18539 -1906
4883 -1906 -15966 -21559 3817 -7318 -24432 -13912 653 -8018 -50800 -25277 -1009 -11630
4871 -11630 -15220 -19076 -16395 2957 39737 56731 51645 41701 38481 48561 25820 -4382 15145
4858 15145 58671 47949 32473 26540 54865 33136 15209 -2779 -27403 -18288 -1114 35300
4846 35300 20026 36911 31014 11362 -32033 -10498 10892 -21 -8662 12390 -1908 -6830
4834 -6830 22540 30598 6123 16598 4042 -3186 17047 29429 5267 -55074 -44977 -37669 -12318
4821 -12318 24898 35985 64284 30615 -4660 14655 -11506 1042 8295 -6128 -7064 -1357 -6377
4808 -6377 -11083 -4020 3062 -7227 -295 3979 -130 18399 4744 -5742 -8613 13250 23650
4795 23650 12430 -11105 -57816 -43833 -8935 -9994 2345 20891 -2446 -9358 -35490 1749
4783 1749 38633 6593 -21089 -37314 -21083 -19547 375 255 13165 7001 911 -27944 6087
4770 6087 43031 70034 59281 14789 422 -12608 -13471 -8720 12694 10939 -7856 -47309 -48003
4757 -48003 -75811 -73856 -37717 -16142 -32435 -41934 -7788 19993 121 -31927 -39930 -14630
4745 -14630 -9341 -1703 -8064 -14377 -12334 -20729 -14369 9702 11657 -16873 -12710 -5992 6856 22951
4731 22951 28425 5734 7698 19039 32580 29831 23437 71696 33119 15689 40349 28200 -12028
4718 -12028 -16494 -1642 -393 -13811 3546 -1578 24764 1329 -22964 -31483 -19278 -6454 11746
4705 11746 37 -26177 -22700 -15904 -34283 -44722 -32411 -29775 -16314 -14203 -11631 -19432 -36141
4692 -36141 -60443 -26527 -12004 -27156 -6930 -13136 -34549 -23777 -4376 -19232 14556 56051
4680 56051 49947 30874 4254 -21430 -40549 -24040 6615 3861 7861 21214 -12341 -36755
4668 -36755 -22171 -20216 -51026 -47080 -54987 -73299 -44457 -8353 -905 -54266 -64044 -47533 -52987
4655 -52987 -60479 -24562 9333 15808 15014 24391 17388 -16570 -27504 6047 12332 14399 13594 -29250
4641 -29250 -36987 -6964 18247 12520 -11453 -3012 10719 9899 22665 11230 2759 -2957 -23318
4628 -23318 -14136 -20903 -25403 2760 23871 -13601 3280 33144 26511 -5117 15491 30487 -8933
4615 -8933 -57661 -64914 -52066 -48618 -16821 22208 -6359 -27289 4235 11702 12228 14538 -5919
4602 -5919 -932 22439 17659 12540 23159 27847 42009 23648 16298 28068 19801 31554 35960
4589 35960 45171 58497 39664 15233 15471 1569 -29197 -40013 -33965 -22054 -28435 -13878 -18817
4576 -18817 -4652 467 -51059 -87560 -82017 -69947 -37211 -29642 -22179 -945 9754 14084 11670
4563 11670 -14428 9916 10166 18824 25051 30583 26392 59682 76519 61899 44303 14783 2395
4550 2395 22647 31539 55660 27700 -33930 -55546 -34862 -3379 5282 2327 17589 34917 -1810
4537 -1810 -30230 -29258 8981 3553 -7893 -16133 -51976 -20322 14781 28330 15137 -4890 -17605
4524 -17605 -15368 1222 16461 13742 -26131 -33068 -3475 22523 31009 14057 -7876 -10068 -34576
4511 -34576 -53661 -51874 -26319 -15238 -3592 5233 48378 51266 -4891 -35224 -11986 20491
4499 20491 31650 29600 -5854 -28081 -42071 -69898 -62792 -7171 -9284 4319 -11279 -42062
4487 -42062 -70261 -54120 -40600 -73663 -59398 -24580 -4384 -14274 -40568 -62316 -57902 -62642
4475 -62642 -66594 -39683 -19576 -2847 -19950 -817 7479 3869 -1633 -5162 -7700 -21897 -29625
4462 -29625 -35752 -16096 -18406 -13594 12072 18531 -1325 -29614 -19905 -27584 -58266 -66163 -77129
4449 -77129 -83773 -71110 -57629 -20889 16834 22055 4238 22389 -2554 21590 28859 2018
4437 2018 1089 10599 -2238 -15146 14503 18310 -16819 -40090 -49228 -13003 745 42240 45522
4424 45522 1456 -31285 -50343 -25064 -15596 -11580 9818 18804 9722 -17028 -55803 -10570 23803
4411 23803 649 -12266 -9249 15350 24359 2657 24906 48909 66000 63543 69041 51948 10849
4398 10849 -33742 -50843 -48550 -36357 -11643 7551 -4389 5135 13794 19806 35986 23270 -26791
4385 -26791 -57564 -104587 -96408 -83367 -51870 3378 18631 3046 -5377 -33527 -14803 7674
4373 7674 -17733 -11660 6069 14910 -4055 -46419 -47640 -17658 -10563 -20914 -15110 -31735 -36257
4360 -36257 -10931 2865 -24829 -14030 -11334 -34027 -21031 -6083 22218 17922 -23685 -29272
4348 -29272 -34137 -20521 -36968 -82680 -90576 -86281 -64780 -67220 -57839 -41626 -51877 -32858 -14769
4335 -14769 -36032 -49347 -34810 -20484 -27247 -31258 -26580 -1036 32680 -4685 -10729 -20150 -21299
4322 -21299 -15920 -15897 -34495 -44687 -6062 20086 19599 9698 7744 -36445 -54996 -1806 41848
4309 41848 36178 -3529 -27240 1689 2764 -10563 -5827 7239 -3646 -43030 -80301 -71085 -66884
4296 -66884 -41386 7668 20766 -15804 -65942 -66390 -37910 -27557 -30041 -46935 -62056 -71094 -61800
4283 -61800 -58176 -51821 -44821 -43656 -28468 -38567 -55336 -45803 4110 28023 12728 26516 14895
4270 14895 2945 -8361 2854 -15515 -30187 -6608 -2125 18052 28461 26700 -22390 -65152
4258 -65152 -34675 -26140 5296 12581 -3645 -38360 -12518 -11821 -29205 -29358 -11791 -20632 -69125
4245 -69125 -87412 -76296 -48693 -23934 -33961 -10617 -28440 -19176 11425 -11594 -17635 -4624
4233 -4624 -32130 -42422 -61803 -46440 -25376 -13478 -45247 -30997 8895 12042 16132 3243
4221 3243 27840 34242 21750 14730 13346 17500 43353 37247 22868 19913 21118 30947 30492 40137
4207 40137 64855 57978 9854 -14423 -38745 -31209 -14123 -4394 -13158 -1006 11798 -13096 -7588
4194 -7588 -8601 -28017 -27012 5362 -14284 -49393 -48511 -4707 2624 13251 -4161 -31757 -52001
4181 -52001 -49704 -35811 10531 30705 34412 11807 12101 -2672 5263 25632 17832 -8764 -31510
4168 -31510 -25057 -2123 2956 16763 35684 35732 12913 -16064 -10061 27027 27539 9004 -18822
4155 -18822 8780 3689 -27710 -12290 -8005 -15762 -16449 -42531 -76388 -54086 -43578 -28732 -17510
4142 -17510 -2465 -20757 -31763 -20739 -4175 2378 -8150 -41777 -66790 -65608 -70068 -51220
4130 -51220 -16490 -914 13509 2234 -57476 -54164 -35212 -56252 -62096 -61950 -57886 -51901 -18193
4117 -18193 13585 1712 -27171 -56270 -42438 -17391 -22424 -14511 10483 2652 -13730 1924
4105 1924 15327 -8470 -34548 -38237 -26778 -29125 -14358 5931 37139 6532 -4902 -4826 -501
4092 -501 -2777 -10007 -16714 -34567 -62550 -70999 -61867 -45166 -26397 -5726 9992 18378 3881
4079 3881 -24583 -43393 -22806 -13007 -40887 -24652 -13677 -19789 -9064 12876 22716 24956 36940
4066 36940 59042 29423 20400 3356 27513 47264 37699 7462 2158 9290 -7113 -31019 -67658
4053 -67658 -52797 -45353 -12546 19200 -16462 -76585 -66075 -60590 -11990 25106 32117 34917 2423
4040 2423 14178 44189 69114 54258 41156 24945 -18045 -15183 19123 20235 36206 53359
4028 53359 46017 30916 92 17158 19262 37531 48267 63327 59307 17381 21038 33166 17473
4015 17473 17754 -23328 -60992 -76646 -77114 -48087 -24432 -21478 -25541 -24554 4052 26537 35211 9139
4001 9139 -490 -9368 -1425 9122 6184 397 11827 9670 27023 3909 -31586 -26527 -30714 3076
3987 3076 21761 7382 -20017 -27621 -34319 -50943 -56776 -35566 -51793 -47022 -27664 -21801 -8842
3974 -8842 4275 -19305 -29868 -11250 27196 49164 44575 12278 -16680 -5480 14777 22371
3962 22371 30682 29049 27467 28022 31534 37885 18117 32192 36078 19301 -33279 -52514 -12376
3949 -12376 1154 3539 -3963 -17647 -19712 -23550 -30847 -41848 -34282 -1451 37294 46614 36949
3936 36949 42352 31456 21777 28426 23362 -21865 -33497 -43805 -18698 -4889 9072 -4452 -27887
3923 -27887 -44117 -48582 -53087 -56975 -53200 -65297 -39111 -8435 -15006 -23452 20327 21488 4079
3910 4079 -20045 11606 2718 -18155 6700 24494 34618 21876 10725 -23771 -5239 18186
3898 18186 20812 -17894 -38589 -45380 -56019 -47374 -48491 -19220 -490 -5873 -42747 -54148 -50020
3885 -50020 -40237 -75729 -74592 -59275 -25367 328 -21123 -25833 -42148 -39749 -34548 -18491 -32806
3872 -32806 -46635 -34375 -44032 -43049 -25244 -14466 -29721 -47042 -39533 -16220 -36533 -44298 -35333
3859 -35333 -32224 -20575 -1234 16345 42417 20213 10049 -26478 -40684 -36391 -31034 -31480 -39539
3846 -39539 -50706 -16562 26128 24448 -12827 -33396 -41116 -58573 -48366 -39870 -8770 13910
3834 13910 10049 -10956 -27309 -11699 -23956 -15284 -1495 -92 -32583 -6431 31217 49208
3822 49208 33313 19935 10444 -8438 -3645 13159 19143 -1546 -9500 -36443 -20845 -30662 -38685
3809 -38685 1038 11533 -13692 -1809 3720 -8926 -37300 -24758 -6026 30019 19474 21824
3797 21824 10869 8847 4298 -2814 -12190 24734 20096 21284 53812 55633 32876 32832 35205 151
3783 151 -4449 -20569 -28294 -20079 -31977 -49660 -59978 -70429 -70299 -39870 -52163 -66677 -67577 -61808
3769 -61808 -25620 2183 -4177 9535 16926 14537 -4682 -60365 -72643 -44623 -53364 -34989 -35219
3756 -35219 -30708 -18097 -31711 -43499 -48645 -19840 7369 -13333 -37340 -14045 -16362 -25523 -27302
3743 -27302 -22476 -13901 -8118 2676 -124 15435 32105 29178 21548 32944 45996 30353 3369
3730 3369 12006 1675 -5810 -16479 -38130 -40539 -30495 -26059 -43967 -30861 2512 -7268 -16914
3717 -16914 -37198 -56689 -52584 -23171 -1185 -3452 -11117 937 -25214 -49639 -36116 10900
3705 10900 10533 -5508 -37460 -14627 7841 -21805 -38857 -23584 -19025 -18523 -42626 -18465 3276
3692 3276 32393 54417 54075 14479 -28239 -4194 -3690 -23870 1263 29743 20123 4 805
3679 805 23202 59911 57925 38053 -91 -15768 -9248 32045 40975 40716 27851 -1265 -16273
3666 -16273 5293 35089 54632 25454 26999 30936 -393 -7007 -15141 -23949 2557 -1010 -9489
3653 -9489 14982 26950 27886 38663 35576 37467 20878 35735 47047 48681 66990 51713 43394
3640 43394 33538 19302 25234 -2646 5694 14263 23631 1138 -53837 -58528 -45677 2386 37568
$$ [...]
##END NTUPLES=NMR SPECTRUM
##END=
