##TITLE=Analysis number 318290
Compound Code nrb 00907
Project Code adrs
Chemist Name fudan
##JCAMPDX= 6.0         $$ Bruker NMR JCAMP-DX V2.0
##DATA TYPE= NMR SPECTRUM
##DATA CLASS= NTUPLES
##ORIGIN= Bruker BioSpin GmbH
##OWNER= nmr
$$ XWIN-NMR		Version 3.5
$$ Wed Mar 22 15:37:15 2006 GMT Standard Time (UT+0h)  MAYBRIDGE\nmr@NMR_250MHZ
##.OBSERVE FREQUENCY= 250.131544655141
##.OBSERVE NUCLEUS= ^1H
##.ACQUISITION MODE= SIMULTANEOUS (DQD)
##.ACQUISITION SCHEME= undefined
##.AVERAGES= 16
##.DIGITISER RES= 18
##SPECTROMETER/DATA SYSTEM= dpx250
##.PULSE SEQUENCE= zg30
##.SOLVENT NAME= CDCl3
##.SHIFT REFERENCE= (INTERNAL, CDCl3, 0, 16.4516)
##AUDIT TRAIL= $$ (NUMBER, WHEN, WHO, WHERE, WHAT)
$$ ##TITLE= Audit trail, XWIN-NMR		Version 3.5
$$ ##JCAMPDX= 5.01
$$ ##ORIGIN= Bruker BioSpin GmbH
$$ ##OWNER= nmr
$$ C:\u/data/dgb/nmr/ADRS/1200/pdata/1/auditp.txt
$$ ##AUDIT TRAIL=  $$ (NUMBER, WHEN, WHO, WHERE, WHAT)
(   1,<2006-03-22 15:36:56.57 +000>,<MAYBRIDGE\nmr>,<NMR_250MHZ>,
      <created by zg, POWCHK disabled, PULCHK disabled
       configuration hash MD5:
       84 BC 41 DB A1 6E 1D 46 DA 25 12 A5 C1 ED C5 3A
       data hash MD5: 64K
       0C 85 0D 57 2B 29 22 51 1F DC 5A 80 4E 13 FC 37>)
(   2,<2006-03-22 15:37:07.49 +000>,<MAYBRIDGE\nmr>,<NMR_250MHZ>,
      <Start of raw data processing
       ef LB = 0.3 FT_mod = 6 PKNL = 1 SI = 32K 
       data hash MD5: 32K
       FC 0B 78 5A DB 14 A7 CB 53 39 76 F1 22 D5 D3 8E>)
(   3,<2006-03-22 15:37:09.19 +000>,<MAYBRIDGE\nmr>,<NMR_250MHZ>,
      <apk 
       data hash MD5: 32K
       57 66 1B 3E 94 C0 9E 49 6C 47 EF 14 30 5C A2 45>)
(   4,<2006-03-22 15:37:09.90 +000>,<MAYBRIDGE\nmr>,<NMR_250MHZ>,
      <abs ABSG = 5 
       data hash MD5: 32K
       DD 2F 43 C5 85 CE DC EC 4B FC 1A 56 55 A7 2A 65>)
$$ ##END=
$$ 
$$ hash MD5
$$ D4 C0 AE F9 63 13 EF 12 EF 3A E3 04 06 51 58 72
##$RELAX= 
##$RELAX= 
##$RELAX= 
##$RELAX= 
##$RELAX= 
##$RELAX= 
##$RELAX= 
$$ Bruker specific parameters
$$ --------------------------
##$DU= <C:\u>
##$EXPNO= 1200
##$NAME= <ADRS>
##$PROCNO= 1
##$TYPE= <nmr>
##$USER= <dgb>
##$AMP= (0..31)
100 100 100 100 100 100 100 100 100 100 100 100 100 100 100 100 100 100 
100 100 100 100 100 100 100 100 100 100 100 100 100 100 
##$AQSEQ= 0
##$AQ_mod= 3
##$AUNM= <au_zg>
##$AUTOPOS= <48 >
##$BF1= 250.13
##$BF2= 250.13
##$BF3= 250.13
##$BF4= 250.13
##$BF5= 500.13
##$BF6= 500.13
##$BF7= 500.13
##$BF8= 500.13
##$BYTORDA= 1
##$CFDGTYP= 0
##$CFRGTYP= 5
##$CHEMSTR= <none>
##$CNST= (0..31)
1 1 145 1 1 1 1 1 1 1 1 1 1 1 1 1 1 1 1 1 1 1 1 1 1 1 1 1 1 1 1 1 
##$CPDPRG= <>
##$CPDPRG1= <>
##$CPDPRG2= <>
##$CPDPRG3= <>
##$CPDPRG4= <mlev>
##$CPDPRG5= <mlev>
##$CPDPRG6= <mlev>
##$CPDPRG7= <mlev>
##$CPDPRG8= <mlev>
##$CPDPRGB= <>
##$CPDPRGT= <>
##$D= (0..31)
0 1 0 0 0 0 0 0 0 0.06 0 0 0 0 0 0 0.0002 0 0 0 0 0 0 0 0 0 0 0 0 0 0 
0 
##$DATE= 1143041815
##$DBL= (0..7)
120 120 120 120 120 120 120 120 
##$DBP= (0..7)
150 150 150 150 150 150 150 150 
##$DBP07= 0
##$DBPNAM0= <>
##$DBPNAM1= <>
##$DBPNAM2= <>
$$ [...]
##$SUBNAM7= <"">
##$SUBNAM8= <"">
##$SUBNAM9= <"">
##$SW= 20.6930455092707
##$SWIBOX= (0..15)
0 0 3 0 0 0 0 0 0 0 0 0 0 0 0 0 
##$SW_h= 5175.983436853
##$TD= 65536
##$TD0= 1
##$TE= 294.16
##$TE2= 300
##$TE3= 300
##$TEG= 300
##$TL= (0..7)
0 120 120 120 120 120 120 120 
##$TP= (0..7)
150 150 150 150 150 150 150 150 
##$TP07= 0
##$TPNAME0= <>
##$TPNAME1= <>
##$TPNAME2= <>
##$TPNAME3= <>
##$TPNAME4= <>
##$TPNAME5= <>
##$TPNAME6= <>
##$TPNAME7= <>
##$TPOAL= (0..7)
0.5 0.5 0.5 0.5 0.5 0.5 0.5 0.5 
##$TPOFFS= (0..7)
0 0 0 0 0 0 0 0 
##$TUNHIN= 0
##$TUNHOUT= 0
##$TUNXOUT= 0
##$USERA1= <user>
##$USERA2= <user>
##$USERA3= <user>
##$USERA4= <user>
##$USERA5= <user>
##$V9= 5
##$VALIST= <valist>
##$VCLIST= <CCCCCCCCCCCCCCC>
##$VD= 0
##$VDLIST= <DDDDDDDDDDDDDDD>
##$VPLIST= <PPPPPPPPPPPPPPP>
##$VTLIST= <TTTTTTTTTTTTTTT>
##$WBST= 1024
##$WBSW= 4
##$XGAIN= (0..3)
0 0 0 0 
##$XL= 0
##$YL= 0
##$YMAX_a= 444819
##$YMIN_a= -424135
##$ZGOPTNS= <>
##$ZL1= 120
##$ZL2= 120
##$ZL3= 120
##$ZL4= 120
##$ABSF1= 16.45161
##$ABSF2= -4.241562
##$ABSG= 5
##$ABSL= 3
##$ALPHA= 0
##$AQORDER= 0
##$ASSFAC= 0
##$ASSFACI= 0
##$ASSFACX= 0
##$ASSWID= 0
##$AUNMP= <proc_1d>
##$AZFE= 0.1
##$AZFW= 0.1
##$BCFW= 0
##$BC_mod= 0
##$BYTORDP= 0
##$COROFFS= 0
##$CY= 12.5
##$DATMOD= 1
##$DC= 0
##$DFILT= <>
##$DTYPP= 0
##$F1P= 14.0000005364418
##$F2P= -0.99999901652339
##$FCOR= 0.5
##$FTSIZE= 32768
##$FT_mod= 6
##$GAMMA= 0
##$GB= 0
##$INTBC= 1
##$INTSCL= 1
##$ISEN= 128
##$LB= 0.3
##$LEV0= 0
##$LPBIN= 0
##$MAXI= 10000
##$MC2= 0
##$MEAN= 0
##$ME_mod= 0
##$MI= 0
##$NCOEF= 0
##$NC_proc= -3
##$NLEV= 6
##$NOISF1= 0
##$NOISF2= 0
##$NSP= 0
##$NTH_PI= 0
##$NZP= 0
##$OFFSET= 16.45161
##$PC= 1
##$PHC0= 181.8898
##$PHC1= 0
##$PH_mod= 1
##$PKNL= yes
##$PPARMOD= 0
##$PSCAL= 4
##$PSIGN= 0
##$REVERSE= no
##$SF= 250.130017604081
##$SI= 32768
##$SIGF1= 0
##$SIGF2= 0
##$SINO= 400
##$SIOLD= 32768
##$SREGLST= <1H.CDCl3>
##$SSB= 0
##$STSI= 32768
##$STSR= 0
##$SW_p= 5175.98343685301
##$SYMM= 0
##$S_DEV= 0
##$TDeff= 65536
##$TDoff= 0
##$TI= <Analysis number 999999
Compound Code 99
Book Reference 9
Project Code 9>
##$TILT= no
##$TM1= 0
##$TM2= 0
##$TOPLEV= 0
##$USERP1= <user>
##$USERP2= <user>
##$USERP3= <user>
##$USERP4= <user>
##$USERP5= <user>
##$WDW= 1
##$XDIM= 32768
##$YMAX_p= 315057096
##$YMIN_p= -178896
$$ End of Bruker specific parameters
$$ ---------------------------------
##NTUPLES= NMR SPECTRUM
##VAR_NAME=  FREQUENCY,     SPECTRUM/REAL,   SPECTRUM/IMAG
##SYMBOL=    X,             R,               I
##VAR_TYPE=  INDEPENDENT,   DEPENDENT,       DEPENDENT
##VAR_FORM=  AFFN,          ASDF,            ASDF
##VAR_DIM=   32768,         32768,           32768
##UNITS=     HZ,            ARBITRARY UNITS, ARBITRARY UNITS
##FACTOR=    0.157963299565203, 1,           1
##FIRST=     4115.04164028535, 0,            0
##LAST=      -1060.94179656766, 0,           0
##MIN=       -1060.94179656766, -178896,     0
##MAX=       4115.04164028535, 315057096,    0
$$ Real data points
##PAGE= N=1
##DATA TABLE= (X++(R..R)), XYDATA
$$ [...]
16514E2324l0253j0466L2440m612k3008j7403N162J3460k8384J4719J3394l414
16502A3959O449o5992K4010J6972O056R923o852J7549j0317m0853R482J1723J006
16489f885k0434O2184L5087r811l9062L0157L2750k3967j9921k482m720J1814
16477D4710J2030L018k1404k81j3357m4018k9557j6182L9574K764m6954q518L5348
16464d2827N2621J1294r045j3181j4816k360L3451J5388K4185k1619L626n190
16452C1527m2399R704r796o63L65M0985M571n2403k8224O0456L7852j8682O400
16439C9693l6004j5836J9464l464j6831J949j2354N247R838j0060j3924k2661
16427e4943M550L5332L317l7518L9907j1074k1247m456J1863N9551j558J8726
$$ y = [52324, 22071, 11605, 44045, 39433, 16425, -978, 4184, 17644, -10740, 3979, 17373, 13959, 20408, -45584, -21574, -4602, 1454, 11377, 4525, 22074, 11757, -29096, -19614, -7891, -6885, -27319, 34865, 69952, 60141, 21079, 51236, 83986, 60019, 40098, 37616, 32896, 44710, 56740, 59758, 38354, 38073, 24716, -19302, -48859, -65041, -25467, -22703, -69657, -78175, -42827, 9794, 21088, 12043, -1138, -15954, -18314, 15137, 30525, 54710, 33091, 36717, 31527, -10872, -1168, -10964, -11627, -11262, 29723, 34294, -18109, -46333, 14123, 51975, 33293, 39693, 3689, -12147, 7317, 3853, -12978, -11029, -23383, -18136, -8298, -18358, -32282, -54943, -50393, -15061, -11744, -49262, -9355, -20429, -41676, -46132, -34269, 25282, 23724, 42450]
16415D2450j0850r392k8708P861J6487K0428q600p141J64l5659l1113R035J5539
16402a9499K7728m1485K2914N4862L771j2791M1914j5129k8057l7451K4529K0320
16390D1626k02J8817K2501k1855j2987M4307M6621n862k0154m4889k4703j2294
16378C0926m2837l6146L4733M42r960J112K7794L889K0845K8267k0476l2970q022
16365b403P425k8983n6624m740K9112j33n779j7849O0515N1870k7009j5178K0784
16352A1008M6420l294N25K7958k0649l2142k7420k274j4226K842K7513n344j3004
16339b087R800J4933J7664j8688k3377k4438L5304K3881Q168m474k1240k2942
16327g496J0781j2862J7188k2228k5300J3006J321M381K6186K3341k3729J1143
$$ y = [42450, 31600, 22208, -6500, 1361, 17848, 38276, 29676, 22535, 22699, -12960, -44073, -35038, -19499, 8229, -33256, -10342, 44520, 48291, 35500, 77414, 62285, 34228, -3223, 21306, 41626, 41424, 60241, 82742, 60887, 47900, 92207, 138828, 132966, 112812, 67923, 43220, 30926, -11911, -48057, -13324, -12882, -22842, -21730, 6064, 9953, 30798, 59065, 38589, 5619, -2403, 5022, -23961, -80585, -85325, -56213, -56346, -62125, -79974, -19459, 32411, 5402, -9776, 11008, 57428, 54134, 54659, 82617, 61968, 29826, 2406, 132, -14094, -11252, 16261, 10917, -2087, 7713, 22646, 40310, 21622, -1755, -26193, 9111, 32992, 41160, 36686, 15446, -7496, 3285, -9577, 7611, -14617, -39917, -26911, -25590, -21209, 4977, 28318, 4589, 15732]
16315A5732J3438L2529m1193p117n596K0770J3080j5355R954J9160j5400l4048
16303E954O647O463K2330K9933n4839o063j8797j4081j1785L343J1658m197j5457
16290c8891K6433k5938p343R324M6006j7721n0153j6833J0464J3441M553k91K0245
16277b6704M9628l198n0972p569j8219L1108J0419J0400L2151j4770l26K2361
16265C4309L4108k959p9049Q415M2062O2664k669j4953q929l8151n7360m779L5581
16252H290K9327K5572j2108J0792m2317J4097N4806l3040n3228r617J3678k5748
16240a9496j4686j8863K9020L8341k5867l0573J8922k5134l6937J7659K2776L6224
16228h614P075k5712J6763K2282N329j1459L8214K7821J9041r123o641j9402j38
$$ y = [15732, 29170, 61699, 20506, 13389, 7793, 28563, 41643, 26288, 36242, 55402, 40002, 5954, 12601, 19064, 41394, 71327, 16488, 10425, -8372, -22453, -34238, -30895, -19237, -23434, -38891, -12458, -38396, -45739, -36415, 9591, -8130, -58283, -75116, -64652, -51211, -46658, -46949, -26704, 22924, 19726, -31246, -38815, -57034, -25926, -15507, -5107, 27044, 12274, 11948, 34309, 68417, 65458, -13591, -5176, 36886, 99550, 96881, 81928, 72999, 34848, -22512, -27291, 8290, 37617, 63189, 51081, 61873, 19556, 33653, 88459, 55419, 2191, -7426, 6252, -19496, -34182, -53045, -24025, 14316, -11551, -42124, -23202, -48336, -85273, -67614, -44838, -8614, -1539, -27251, -10488, 11794, 17123, 5664, 43878, 71699, 90740, 81617, 74976, 55574, 55436]
16215E5436n3917k0314L6289L4396j1068m0709O068l5990n126K8722O157J882
16203A826r404j2902P900K4158m1511l3377p556P4239L1750o1508n0978K4996
16191e2367M6595o798k1927L4285L2996J440j3240m9373k2060N601K3686L8290
16179A7128k7343n0494p740K3508l3110n686K940j5733J7726N4525K4000m7265
16167d7544q801J8001j58J6790J5473L0221L016L536l3011j7756J0014j8604K883
16154b5940j7614j7596K6406K0317n768K9942k0015l6859p779L1516J7281M6288
16142D0179K5897K8469J846j7174m1796j2706J0971j8026K5249M0939J2181l4565
16130F1464k5514j0250J9072l9381K0559M3989n7025k5103j1695l9786l194N5539
$$ y = [55436, 1519, -18795, 17494, 51890, 40822, 113, 6181, -29809, -34935, -6213, -56, 1826, -7578, -20480, -12580, 11578, -29933, -63310, -70866, 3373, 35123, -26385, -77363, -52367, -5772, -12570, -34497, -212, 32784, 34224, 20984, -28389, -50449, -44848, -21162, 17128, -10215, -60709, -68449, -44941, -78051, -83737, -80797, -96530, -78804, -24279, -279, -47544, -56345, -38344, -38502, -21712, -6239, 23982, 26998, 30534, -2477, -20233, -10219, -28823, -25940, -43554, -61150, -34744, -14427, -20195, 9747, -10268, -47127, -54906, -23390, -6109, 40179, 66076, 94545, 96391, 79217, 37421, 24715, 35686, 17660, 42909, 83848, 96029, 61464, 35950, 25700, 44772, 5391, 25950, 69939, 12914, -12189, -23884, -63670, -66864, -11325]
16118a1325K5496M175o4480j7065j0364p413J5798K3218J4074j6286j9305O4165
16106F88p967k0939J3342N2289k5563j102q167p525L1067l9348J927L1984N5135
16093G5821K6386n8472m5729k1354m400q747m8665p124O5816Q56m2635m098L9715
16080c2630k443j6232L3169K1825N500M1037J6299m3844m1841l0452K3912N0737
16068B5037O155m0078o2197k1234M2031N2551K1562j4896p316K5824l3035j7929
16056b3525j4520j3527K0393M0788K3958J2897j1607j271L2058o0799n1805K4437
16044b2523J6508O325L7201L686n053Q54l701k4742k4657R683j1305M1222Q91
16031B4389k8581k4274N972L4125K0863R386n8367l4579n190J7635J593m2181
$$ y = [-11325, 14171, 18346, -46134, -63199, -73563, -80976, -65178, -41960, -27886, -44172, -63477, 688, -7279, -28218, -14876, 37413, 11850, 10748, 2581, -4944, 26123, -13225, -11298, 20686, 75821, 102207, 43735, -1994, -23348, -27748, -36495, -85160, -92284, -26468, -25612, -68247, -72345, -32630, -35073, -51305, -18136, 3689, 9189, 50226, 66525, 22681, -19160, -49612, -25700, 25037, 31192, -8886, -71083, -92317, -50286, 2265, 23827, 8931, 1615, 27439, -5596, -23525, -38045, -51572, -31179, 9609, 33567, 46464, 34857, 33586, 65644, 4845, -46960, -22523, -6015, 310, 37511, 41197, 36144, 36998, 33297, 8555, -16102, -6419, -17724, 23498, 24389, -4192, -28466, -22494, 11631, 32494, 41880, -16487, -51066, -56256, -38621, -37028, -79209]
16019g9209j9461L0633L5753k0644j5320K1469N6732J9676j2674R400k3985m7507
16007d5137l764j5012n941J7517K7525J8225L2731l5029k6113J3800J6537o159
15995a0820K0338j2044n8409M279P4822M326J499J3682m913J685M294l8588r104
15982h953K6914M90J757J6193K621P558j341o9613j1645J8242K5299k6874K4443
15969E091J2145j5552J775p886M510j5878k4651J3659K1771N2786N150j7848j8296
15956A6776l4780Q597J0133r405j058m2645j3053O151L3523K2653l8105j2068
15944e3281Q1316j6686k2859j8318q68J8885L216K9543m5081l9988j2396J6680
15932e9837O6857M9929j404j8498m7788L7205M5077k2400l6806m0373l9729J5341
$$ y = [-79209, -98670, -68037, -32284, -52928, -68248, -46779, 9953, 29629, 16955, 26355, 2370, -45137, -48901, -63913, -69854, -52337, -24812, -6587, 26144, -8885, -34998, -21198, -4661, -10820, 9518, -2526, -60935, -56656, 18166, 22492, 23991, 37673, 32760, 34445, 38739, 151, -8953, 17961, 18451, 20208, 36401, 39022, 46580, 45239, -24374, -36019, -17777, 7522, -19352, 5091, 17236, 1684, 3459, -4427, 83, -15795, -40446, -26787, -5016, 47770, 52920, 35072, 16776, -18004, -9407, 726, -8679, -9737, -52382, -65435, -59284, -25761, -3108, -41213, -53281, 28035, 11349, -11510, -29828, -30696, -11811, -8595, 20948, -24133, -64121, -76517, -59837, 7020, 56949, 55545, 37047, -10741, 26464, 71541, 49141, 12335, -28038, -67767, -52426]
15920e2426M1702J2799m1481K144N7666J0009j4722K7554l087K2211j1582K3780
15908G4567m4857l2539j984K4052P80r544j7971m1745n7739N3432M7969l0394
15896c5973J7431L3463M14k842k9816q894o904q994O467M8675L3868k9225K566
15883B0236J1879n214K5467n2085o4229M216M8707k4738k4262O41m726K6086j5319
15870e3341J3198Q969m0045j3102K4459M0419M186R636L8598k1069Q20j8375l4990
15857d0637O573r404k6528l7413N2652L0781q63K4468J7185k8454j1822N533k5886
15844d3815O122L6176j8213j4129P585O515k9185j6807J8133j5115K6317R37J2757
15831b2722k6875m125Q175j2678N202j1045k0157L5640k3784L6134K3181o207
$$ y = [-52426, -10724, 2075, -39406, -37262, 20404, 30413, 15691, 43245, 40158, 62369, 50787, 74567, 29710, -2829, -4813, 19239, 20019, 10475, -7496, -49241, -106980, -53548, -5579, -35973, -18542, 14921, 15335, 12493, -17323, -26217, -33121, -42115, -35648, 13027, 46895, 17670, 20236, 32115, 26901, 52368, 283, -63946, -59730, -11023, -35761, -60023, -59382, -64108, -38022, -53341, -40143, -31174, -71219, -84321, -59862, -19443, -15257, -5621, 32977, 11908, 12728, -5647, -40637, -34064, -43468, -69996, -107409, -54757, -23976, -24839, -371, 16814, -11640, -23462, -17929, -43815, -37693, -1517, -19730, -33859, -26274, -19759, -48944, -65751, -47618, -62733, -36416, -35479, -22722, -49597, -53722, -45547, -58225, -53023, -64068, -84225, -48585, -72369, -36235, -13054, -19261]
15819a9261K4961j0122r421j9360j0322l2566J1393n610M4211L4731j0815k5470
15807b7651l2576l672K793k9899K5730M2011L6233o47l536n85O22q048K2067K0928
15793D3770l7814q147j2330J0386K1509J6570K9811j9730j8074J0070J8422l3348
15781B1095j7391L1356L6673l4265k7374J2107l978L7976p47m9461j9510K501
15769a1018J731L8895j0778k9623j4122K0238P886L998K416k2292M474k648R439
15756a404k637j6847k2694J4603L1689M963Q84n7066j9968K0494N4533M6426Q631
15743F1607m652R387j3255l4372l3179J9016j2814o238J1258k336J928K0442J6326
15730C3118r026j812K1494n517m0552m8117n65L621J7323K8726J8324Q840J6938
$$ y = [-19261, 5700, -4422, -13843, -33203, -43525, -76091, -64698, -70308, -26097, 8634, -2181, -27651, -60227, -63899, -61106, -91005, -65275, -23264, 12969, 12322, 8786, 8201, 8823, 775, 22842, 43770, 5956, -2191, -14521, -4135, 17374, 33944, 63755, 44025, 25951, 36021, 54443, 21095, 3704, 35060, 71733, 37468, 10094, 22201, 18223, 56199, 55452, 5991, -13519, -11018, -9287, 29608, 18830, -10793, -24915, -4677, 3209, 7207, 9623, -12669, -8195, -10843, -1404, -4041, -20888, -43582, -28979, 2710, 7673, 8557, -48509, -68477, -47983, 6550, 52976, 61607, 56955, 66342, 53087, 18715, -14464, 4552, -8262, -14500, -3242, -5578, -3650, 16792, 33118, 24092, 22280, 43774, 38257, -2295, -50412, -50977, -47356, -30033, -1307, 17017, 25857, 42795]
15717D2795m086L9305l1479l2832l640L7970j613j5664N974k1778l0767j7214
15705c3029Q338K2549q777l724p88l0373j7170l0360K8956K8292l1785K8337J9333
15692b0201K1256m48R043j1989k4111n855K9794P259K1389l356J0481n1602m2483
15679f0823M9767K7588L7922m379l5540R257q700O280k2463K6948r411Q413p58
15666B4101j7100n6460j938K6149J5230K6051K3496k2607l8817K3385j9259J2375
15654e394J4320n715j0875J5446k743J8937k9088k8376M4417l5722l4238L9044
15642a9987J1373j8416L5912M6088n4549l8119N2402j6966k8998N444k0317K5032
15630b1101N4355R304j8905K7225K3815P060j6276J8478Q033l3776q3569p4124
$$ y = [42795, 38709, 78014, 46535, 13703, 10063, 48033, 46420, 30756, 36730, 14952, -15815, -33029, -24691, -2142, -10919, -14643, -15431, -45804, -62974, -93334, -64378, -36086, -67871, -39534, -20201, 1055, 607, 9650, -2339, -26450, -32305, -2511, 4748, 26137, 22781, 33262, -18340, -60823, -11056, 16532, 54454, 50075, 14535, 23792, 15092, 21372, -1091, 25857, 16446, 24859, 24101, 7001, -49459, -51397, -25248, -10018, 16033, 39529, 16922, -21895, 1490, -17769, -5394, 8926, 3211, -7664, 7782, 5039, 23976, -5112, -33488, 10929, -24793, -59031, -19987, -8614, -27030, 8882, 54970, 421, -37698, 14704, -2262, -31260, -25816, -46133, -21101, 33254, 42558, 23653, 50878, 74693, 81753, 65477, 83955, 91988, 58212, -25357, -99481]
15618i9481J4045N8151j2625J8874P9168J7917m9705N462l629n9187K9301l1102
15606c2811J0547J9585Q432k9226k2632K4774J4448j609J3881K0942m2506j3412
15594b9587J2841k8773j0313K8508r866l6619q609M3836K3630J5939R050r160
15582H77j7705k327o908j4J0417k4248k902J0946J5187p550l8349l595J6985L8413
15568a0773k7523j6357o4k126K1235J0582K5088j017j804j6138j3169M0227J3561
15555B1722k9203m9803K7966l108k8966j0769K526J5885M2451l636Q212j8438
15543b5161l7228k955K1487K6181N7330J4790l9011j8201M0336L3233n1068m6531
15531b6798l4397L5345N6188L3189j7979m0889j6772L0120k7732N139J220K720
$$ y = [-99481, -85436, -27285, -39910, -21036, 58132, 76049, 26344, 31806, 28177, -31010, -1709, -32811, -22264, -2679, 5753, -23473, -46105, -21331, -6883, -8492, 5389, 26331, -16175, -29587, -16746, -45519, -55832, -27324, -37190, -73809, -82418, -38582, -14952, 987, 10037, 877, -16828, -19155, -26063, -26077, -15660, -39908, -42810, -31864, -16677, -24227, -62576, -66171, -49186, -10773, -38296, -54653, -54717, -56843, -35608, -25026, 62, -955, -2759, -18897, -32066, 8161, 21722, -7481, -57284, -29318, -32426, -61392, -72161, -69635, -53750, -11299, -14935, -6723, -25161, -62389, -65344, -43857, -17676, 39654, 54444, 15433, -2768, 37568, 70801, 19733, -26798, -61195, -25850, 30338, 63527, 45548, 4659, -12113, 18007, -9725, -4586, -3366, -646]
15519f46Q858m8092j2909K3074L5982j5215P512K5962K133j3570J764l3093p638
15506b5878M2724k5725k286L45l9939k7328N1546M7150O863j8775L085j5472J8059
15493A4369k2270J8868J706L4812j9535L7663l4704l0832j6399O774k3833m5712
15481g9093l4684K1515l6413K3838K7027L9094K7483K9057k9011o562O041N869
15469e839k8753l7575L193J4598M0133O0456K1243l2226l6752j0606M515j8955
15457b6568M2183J097o434j4295l0961m055r531O9812k8892m8445j5431k8908
15445a00428J3294K6509J6973K8379k15k0574j7437K4464K8537J3375o488J0621
15433A7010K1721M387k2244l296l7284O819m9193k0955J6853J2519J6075N476
$$ y = [-646, 8212, -39880, -52789, -29715, 6267, -8948, -1436, 24526, 26659, 13089, 14853, -18240, -25878, 16846, -8879, -11165, -10820, -50759, -78087, -26541, 20609, 27472, 8697, 11782, -3690, 14369, -7901, 10967, 12673, 47485, 27950, 65613, 30909, 77, -16322, -9548, -33381, -79093, -113777, -92262, -128675, -104837, -77810, -38716, -11233, 17824, -11187, -17749, -11708, -5839, -34592, -72167, -68974, -54376, -14243, 46213, 67456, 35230, -1522, -12128, -7613, -26568, 15615, 16712, 10278, -4017, -34978, -39033, -48564, 21248, -7644, -56089, -71520, -100428, -87134, -60625, -43652, -15273, -15488, -36062, -53499, -29035, -498, 12877, 6389, 17010, 38731, 43118, 20874, 17578, -19706, -12887, -62080, -83035, -66182, -53663, -37588, -32112]
15421c2112K4912j504j7357K3223K8359j9254r965m438K582j826r451l3917k6730
15408g7478J6625j0453p988J5463K5961k3376P316J4898N303J3720J3531m1620
15396d8098k1981L604r076P898J9260j0406k0875k6384J4827L2433m389N3472
15384i715j2028k8443K2635J3895r553O876j760K8269K2240r757R057l0414l0359
15371b9057J330N1386K7668Q54K0024J8030l7121k903k7138l8325l3188r252K4133
15358c3559M4050l080k9644M3352p25l4587k749L8734N0285J8947r4846j9237
15346b3059L9436r878k6705M1185J0811l3090l8465k6638J5503N215J3110j7622
15334e0197j0123L7810o598j3931j405l4693m1720J8846M0732K847Q448K3212
$$ y = [-32112, -7200, -8704, -26061, -2838, 25521, 6267, -3698, -8136, -5554, -7380, -16831, -50748, -77478, -60853, -71306, -79294, -63831, -37870, -61246, -53930, -39032, -33729, -20009, -6478, -48098, -70079, -66475, -75551, -67653, -48393, -58799, -79674, -106058, -91231, -58798, -63187, -9715, -21743, -50186, -27551, -13656, -23209, -16333, -18093, 10176, 32416, 22659, 31716, 1302, -29057, -27727, 23659, 51327, 52181, 72205, 90235, 53114, 50211, 23073, -15252, -48440, -57692, -33559, 10491, 7411, -22233, 21119, 20394, -14193, -16942, 21792, 72077, 91024, -3822, -23059, 16377, 6499, -20206, 20979, 31790, -1300, -39765, -66403, -50900, -45685, -32575, -50197, -60320, -22510, -29108, -43039, -44444, -79137, -120857, -102011, -61279, -58432, -49984, -26772]
15322b6772K9623j7950k5261J6137J1985j6773J2494M6744k9460k3416k4776p353
15310e4778J8047L7039J7841L1238M0424n0240k1624k5332P998M4408o0932m3743
15298e9654L5161L734P642M5799r795q683j3687j7230k11q499Q466L3403j495
15285A4951m4646j8414K3691j4457j0239M6928q638k8717k6067J031K6082P987
15273c0508K968M240k4815L2379K4304k6876L71J0463j8302K4885K5845K7470
15261E2424P618j24J2315k0446o1226n928J4991q521n879L1734L7875J8788o099
15248F7522n001j0858o415J077o612j6162j60M935n753K3447L0092K3636k2086
15235G7662m1042o590O954J0549J3753K4042j5250j9965J764o687k6548J253o103
$$ y = [-26772, 2851, -15099, -40360, -24223, -12238, -29011, -16517, 30227, 767, -22649, -47425, -54778, -36731, 308, 18149, 49387, 89811, 39571, 17947, -7385, 613, 45021, -15911, -59654, -24493, -20759, -13117, 32682, 22887, 14204, 517, -16713, -16924, -25423, -16957, 16446, 14951, -29695, -48109, -24418, -38875, -49114, -2186, -10824, -39541, -65608, -64577, -38495, -30508, -27540, -23300, -48115, -15736, 8568, -18308, -17937, -7474, -25776, -891, 24954, 52424, 60042, 59918, 72233, 51787, -9439, -15367, -376, -8897, -14776, 16958, 54833, 73621, 67522, 62521, 51663, 45248, 46325, 39713, 23551, 23391, 28326, 22573, 46020, 76112, 99748, 77662, 36620, 30030, 36984, 47533, 61286, 85328, 70078, 50113, 51877, 45190, 18642, 19895, 13792]
15222A3792n0371k937K4128j4006J4111l721J9032M2125L4461J1986k2214l4734
15210C1652l5060l6049o09m551k9572j5081K8818O0268L1162k5906o8469k7937
15198i1334K984L8712L9653K5799R186K5448j410k1166n288l1716k2885n548J8366
15185a9199K9199m3309j9284N1453K3228k857J6130N66j8163k6825j8811n1859
15173g9731L7355K6523m983n640j1382Q452M1361J9285K0814N948m3019j1693
15161C290q829P904J0015m4073o424O5181k6604o3920k7827J9366Q255K8738L824
15148c1104J8902L4715K2682N047K0165j8697j1376j392o437L9244k7173J7399
15136F1975l1440l9851n529l830J6464K6742k3179J6045L0307J8164j4743l1025
$$ y = [13792, -36579, -39516, -15388, -29394, -15283, -19004, 28, 42153, 76614, 88600, 66386, 31652, -3408, -39457, -40066, -44617, -74189, -89270, -60452, -184, 30978, 5072, -63397, -91334, -88350, -49638, -9985, 15814, 25000, 50448, 49038, 27872, 22584, -9132, -32017, -37565, -19199, 10000, -33309, -52593, -1140, 22088, 19231, 35361, 35927, 17764, -9061, -27872, -79731, -42376, -15853, -20836, -26476, -37858, -29406, 11955, 31240, 52054, 58002, 14983, 3290, -5539, 2365, 12380, -31693, -38117, 27064, 460, -63460, -91287, -71921, -63666, -34928, -31104, -12202, 22513, 45195, 50242, 70407, 51710, 40334, 38942, 32505, 71749, 44576, 61975, 30535, -9316, -14845, -18675, -2211, 24531, 1352, 17397, 47704, 65868, 51125, 20100]
15124B0100k1385l2796J3181q981o206O1044N404n427j9989K9053p793l0247m1484
15111d5526J5476j7261n616L773j7281j6071N3467O4439K4124n051q828K6816
15099G2461l772l5402k4466l58j0442l0219l7955J4594K8779K52Q468o141K353
15086b1848K4203j745L1904J4521k5724k3725J6098K2453n6436Q882O0306j2190
15074C6699l818M110P172j5907j0597J5241K31m521p2870L3226K330l288j4524
15061b6516P648K5412J2617J9217L5489l9303P400J4242r313K4830j574q798n237
15048E6114m1656l2758K415K845j8642J9892M1386K3184l5671n2138J3298l1275
15036e3006O003J7945j853K4445L7755o230k3715K212J7749M9846O609n0159m3099
$$ y = [20100, -1285, -34081, -20900, -29881, -36087, 24957, 30361, 24934, 4945, 33998, 26205, -4042, -45526, -30050, -47311, -52927, -49154, -66435, -82506, -29039, 35400, 59524, 54473, 45645, 72461, 68689, 33287, 8821, 8463, -1979, -32198, -70153, -55559, -26780, -26528, -18060, -24201, -21848, 2355, 610, 32514, 47035, 21311, -2414, 13684, 36137, -20299, -11417, 48889, 36699, 32881, 36991, 44163, 28256, 17659, 32900, 33131, 28610, -44260, -11034, -8704, -11992, -26516, -18868, 6544, 19161, 38378, 73867, 34564, 41964, 56206, 46893, 71723, 70149, 61351, 56114, 14458, -18300, -15885, -13040, -31682, -11790, 29596, 52780, 17109, -35029, -21731, -53006, -47003, -29058, -30911, -6466, 31289, 25059, 1344, 3556, 21305, 71151, 77760, 27601, -15498]
15023a5498R057O6177j9255l8422j3890J0948M5161k871l324l1551J4831j2548
15011H815l2673l4493K8814M6142k6824K9883Q289Q979L4814K808k4567l6317
14999A3670l208J3650r919K109k168L790N2270j4296k1992Q094j5628k5399l9929
14986c8956j4120j5728N1397L5171k9480q258m981k3998j4226L19j8887L1838
14974d9909L4768J1745n4390q549N8920M4029k1213m0361q219n5998k452M8941
14962d2688L7587K019J7046L9414l3048k5345J3316J4070m3292m2397L6752L9051
14950A2485L7314m79j1556j7390M835m837l2542j8157j8353J7890J5786L6318
14938B1314j3417l929J107J1608k7987Q906M3391K6165k0025l5949J7687Q649
$$ y = [-15498, -6441, 59736, 40481, 2059, -11831, -883, 44278, 41407, 38083, 6532, 21363, 8815, -23858, -58351, -29537, 16605, -10219, 19664, 27953, 36932, 71746, 74554, 49987, 13670, 10462, 24112, 14193, 16302, 14134, 17924, 70194, 55898, 33906, 42000, 26372, 973, -38956, -53076, -68804, -17407, 17764, -11716, -19974, -24955, -48953, -63179, -62860, -81747, -49909, -15141, -3396, -57786, -66335, -7415, 36614, 15401, -24960, -33179, -89177, -91629, -42688, -5101, -3082, 13964, 53378, 20330, -5015, 8301, 22371, -20921, -63318, -26566, 12485, 49799, 49320, 37764, 20374, 25209, 20372, -12170, -30327, -48680, -30790, -15004, 21314, 7897, 3968, 5075, 16683, -11304, -2398, 40993, 67158, 47133, 11184, 28871, 37520]
14926C7520j5236J3054K6292q14j3166j8392P779r670n2783m166J6167J9470m1829
14913c5774L803N5693o220j2588L739R290Q730k1539l8101K6388K7401k3902k9104
14900c2184m897j5133r615n957J6518J1702K2464K1120K484Q313J4868l0432j5281
14887a6030K2494l1689K8971M5715n144k2408l5345k2586l9255P07R628N7092
14875g850J4777j0824M199M431j692P05P9019k991j5051Q79o4758j965J7192L2269
14861D8340K6348L132j8799k8358J5999j1875p4933m0459K5041J5460L3025k6531
14849c3610L212M1026L1088j4701k8845m7235K8990N7185j3032j1994L4364O3822
14837A10270j3544l1624j6921K9413n0800J1230N1789l165l5232m3910l1887J2414
$$ y = [37520, 22284, 35338, 61630, 60816, 47650, 29258, 37037, 27367, -25416, -29582, -13415, 6055, -35774, -31971, 23722, 17502, 4914, 8653, 17943, 26673, 5134, -32967, -6579, 20822, -3080, -32184, -37081, -52214, -61829, -67786, -51268, -39566, -17102, 4018, 6502, 14815, 29683, -749, -16030, 6464, -25225, 3746, 49461, 44317, 21909, -13436, -36022, -75277, -74570, -64942, -7850, 6927, -3897, 302, 4733, 3041, 3746, 82765, 79774, 64723, 65602, 844, -1121, 16071, 48340, 74688, 77820, 59021, 30663, 46662, 34787, -40146, -80605, -55564, -40104, -7079, -33610, -30398, 10628, 41716, 27015, -1830, -49065, -20075, 37110, 24078, 12084, 46448, 110270, 96726, 65102, 48181, 77594, 26794, 38024, 89813, 86648, 51416, 7506, -24381, -11967]
14825a1967K7118L0302J284l2234r394N261p837j9267k6857K880K4899M1249L731
14812B9168m6686k6470Q644k2779r376L0059J0709K9325P975K0585l0145n349
14800d340J562j3640m4559K5682L4475J7493p106p1146j1822J6022j4068O715
14788f4732L4704M2021k4246K6238J1647k8053o6850k2748n330k1252M9340J5553
14776e3708j2317J8563J0509J7239L045N0347J3526r500K1848L648k9624k8850
14764D726n3447N7131M8300j9872O198L8493k4833l2193k1406j8634K6601N366
14752A6430q238N086n2212r649N899J8346o258J5677l0524l477J35Q591K6641
14739a3553K9511J2812O517k2378l7357k2851L0276K6005j7023j2577M5653O206
$$ y = [-11967, 15151, 45453, 46737, 14503, 5109, 10370, 2533, -16734, -43591, -40711, -15812, 25437, 29168, -17518, -43988, -35344, -58123, -67499, -37440, -26731, 2594, 10569, 31154, 1009, -4340, -2778, -16418, -60977, -35295, -820, 16673, 9567, -61579, -73401, -57379, -71447, -64732, -30028, 11993, -12253, 13985, 25632, -2421, -69271, -92019, -97349, -118601, -69261, -53708, -66025, -47462, -36953, -19714, -16669, 33678, 47204, 37704, 59552, 63200, 33576, 4726, -48721, 8410, 56710, 36838, 43036, 81529, 56696, 24503, 3097, -15537, 11064, 16430, 8192, 13278, -38934, -48583, -42684, -24338, -30596, -14919, -45443, -48920, -48785, -40194, -13553, 15958, 28770, 35287, 12909, -24448, -47299, -17023, 8982, -8041, -20618, 25035, 31241]
14727C1241K350p172k4303p402k719k9489n4448L3414O623N219J7113K5676P41
14714c156m9532j0094J8688k3157K554K2424L1755L0758k350J2965q893L438q321
14701A7079K8108N5598p307l5272q507k699j2898j4535l9163r273N2094l2899
14689i674j2437J2686R790N6775k6478o0295r311J2199J6934J0362k2814M032
14677a8231l0407J3997L8329l345j7115m376n922p60K4316j2130j5311N8667O747
14664C4459k543r657M714j5757m004k2485J6348J4014K0098j5086M3520n016n4494
14651D111m4719J73N7073k4014k7810j7363j9054k3577N131K2137J145p943M0373
14638c4337j8982j9899p55q795l889J1732J1001M3090L2873J0025k0679n2314
$$ y = [31241, 33591, 26419, 2116, -5286, -8005, -37494, -91942, -58528, -51905, -46686, -29573, -3897, -3156, -52688, -62782, -44094, -67251, -64697, -42273, -10518, 20240, 17890, 30855, 21962, 25400, 17079, 45187, 100785, 93478, 58206, 49699, 47000, 34102, 19567, -19596, -28869, 23225, -9674, -22111, -9425, 365, 57140, 30662, -29633, -38944, -26745, -9811, 551, -22263, -18231, -48638, -34641, 3688, 343, -16772, -21148, -27070, -27830, -3514, -15644, -30955, 27712, 34459, 31916, 22259, 26973, 11216, 7212, -15273, 1075, 15089, 35187, 20101, 63621, 58605, 4111, -40608, -40435, 16638, -7376, -35186, -52549, -71603, -95180, -90049, -67912, -66767, -74710, -34337, -53319, -73218, -73973, -82768, -86657, -74925, -63924, -20834, 12039, 22064, 1385, -50929]
14626e0929l2555O2667J3938N5035J0211l3507K856K9955P856n0022l8826P309
14614a6012L2021R46k6750J7842N937k1634j9941j9201J3933k947k4614k3781
14602h4201j9705L9782P2992N4105k2031l5206J2343K8733j662r623j7014Q558
14590B7071p982o949O519n569j8754J4989l768k0193j0744l0758M253L0969j7837
14577c8753k7456L201L6149L8386J2988P684q24J2604K2285o196k4001k799K3424
14564E6692l4670M606j5930j3275K3773J1140R690O608l2436m0149j7061J7367
14552b3645N2200N820j8300K0453K413J7522O190m2782r82K4324m695m539k9395
14539D584p601N79m0744J9890j6910O200j1854K039k4138M1234r849l8194N26
$$ y = [-50929, -83484, -20817, -6879, 48156, 58367, 24860, 27716, 57671, 65527, 15505, -23321, -16012, 16009, 16955, -9795, 8047, 13984, -7650, -27591, -46792, -32859, -35806, -60420, -84201, -103906, -64124, 8868, 62973, 40942, 5736, 18079, 46812, 45150, 35527, 18513, 27071, 19089, 12140, 18659, 13090, -5664, 9325, 5557, -14636, -25380, -56138, -51885, -20916, -38753, -66209, -63008, -26859, 11527, 24515, 32199, 31375, 43979, 66264, 60068, 36067, 33268, 56692, 22022, 26628, 10698, -2577, 21196, 32336, 42026, 48634, 16198, -23951, -41012, -23645, 28555, 34375, 16075, 36528, 38941, 56463, 62653, 19871, 18889, 43213, 38518, 33979, 4584, -3017, -2438, -43182, -23292, -40202, -34002, -45856, -43817, -67955, -26721, -36570, -74764, -74238]
14526g4238M2942j4274K9971P3890J4763l5184j6902n370k6276j5560M4306J5472
14514C3540J7356o768m0861J4276q831j7033M451J7424q607J604O433M534r429
14501H089l2209N1726m742l5439J5272p882m3475k6063j3396K9617J3108O554
14489c8840M8560K6140Q035k4221k8053K7336k168m1781l0537O066L8426N0687
14477C9650l2363m3334K9948J041O996M070j3250p575K1252L1201J02m0713l2296
14464c5271K559M6873J2706J8190l6753j9838j4884j239q735J8728P092k212L0951
14451A8167M0079j8191o960k1803l5618J9959O5846O853l894j9603L50M468j7788
14438C1865k1671l2516K2256R23m5793k8827K4711O648J0678J303O302k4894J816
$$ y = [-74238, -31296, -45570, -15599, 58291, 73054, 37870, 20968, 15598, -10678, -26238, 18068, 33540, 50896, 44128, 3267, 17543, 8712, -8321, -3870, 13554, 4947, 6551, 12984, 17518, 8089, -24120, 27606, 22864, -12575, 2697, -5185, -48660, -74723, -88119, -58502, -45394, -38840, 9720, 35860, 43895, 19674, -8379, 18957, 16789, -24992, -55529, -49463, -11037, 39650, 7287, -36047, -6099, -5058, 1938, 6008, -7242, -14817, 6435, 37636, 37738, -2975, -35271, -32712, 14161, 26867, 45057, 8304, -11534, -26418, -27657, -36392, -17664, -10572, -12784, 18167, 58246, 40055, 33095, 11292, -24326, -4367, 61479, 68332, 64438, 44835, 45185, 49653, 31865, 10194, -22322, -66, 857, -44936, -73763, -49052, -42404, -31726, -30423, -24121, -49015, -47199]
14425d7199N2746J0185K487P268K1642n2564k1125J5943l5384j3130K4925J2885
14413b1321L3026q535l3235k0952K5736n740j3567J8373L6727n174j5613k4844
14401c5119j5823l128J7430J5987k3086k7269O327R641M3315N6992M4135k4844
14389F4558l051k5024m6194j9495o533n207j7762L8214Q5795K305j3748m4507
14377I351l2749p644K6331J8149K1431k307l6181J1935j0382L5128J4283j521
14365D5824k0453l3335j3685j4414L682j4714l490M044J6983p376q263l4337N952
14352g3582K3127M3943l906R220N5569n145j7300j7406l3835k2251j4433m727
14340f0726J0254L7654L9366J5977R694P68k2276J9929r616j9865M5O185j2177
$$ y = [-47199, 5547, 15732, 18219, 25487, 47129, -5435, -26560, -10617, -46001, -59131, -34206, -21321, 11705, 3170, -30065, -51017, -25281, -31021, -44588, -26215, 10512, 5338, -10275, -35119, -50942, -54070, -36640, -20653, -43739, -71008, -64681, -55040, -11725, 45267, 89402, 64558, 61507, 36483, -9711, -29206, -35739, -40946, -58708, -20494, 65301, 67606, 53858, 9351, -23398, -31042, -4711, 13438, 34869, 32562, -3619, 8316, -2066, 33062, 47345, 45824, 25371, -7964, -21649, -36063, -32381, -47095, -50585, -46541, -29558, -36934, -45197, -79534, -73582, -50455, -6512, -10418, -1198, 54371, 49226, 31926, 14520, -19315, -41566, -55999, -60726, -50472, -12818, 26548, 42525, 52219, 52987, 30711, 50640, 41024, 21159, 21204, 27389, 15212]
14327A5212j1059K6076J5341M807J8453J1715J5762L1240k9307l4861k4474O141
14315D5046j5903j9166K9823L3139o2045j5417J9479J6189L9522k0907q1441Q783
14303b2898L4446K9217m460k0284k7103Q852k2436k5701J0533l884L0877M198
14291h643N15J3473O040M688j8961Q366n763n031K7743j444l5772k9982m6810
14278i1581J3288N2098K2875k867j6894J405P445K6874r283l1458k2358j1487
14266f1943J5184N6092N5072j2606l6100j3220M266J7340L805l1743j6166J5340
14254d679P1904k363k9075J9578k4880O291L061l2130O792k1591j5154R823r038
14241b1461J630M6079J3902J8275j6552n5224k0234L6074L5733m084k7707J027
$$ y = [15212, 4153, 30229, 45570, 50377, 68830, 80545, 96307, 127547, 98240, 63379, 38905, 45046, 29143, 9977, 39800, 72939, 10894, -4523, 14956, 31145, 70667, 49760, -31681, -22898, 11548, 40765, 36305, 16021, -11082, -2230, -24666, -50367, -39834, -43718, -12841, -8643, -8128, 5345, 11385, 16073, -2888, 5478, -285, -5316, 22427, 20983, -14789, -44771, -91581, -78293, -26195, -3320, -6187, -23081, -21676, -14231, 12643, 3360, -28098, -50456, -61943, -46759, 9333, 64405, 51799, 15699, 2479, 6745, 24085, 27890, -3853, -20019, -4679, 67225, 64862, 35787, 55365, 30485, 36776, 39837, 7707, 14499, -7092, -22246, -12423, -21461, -19831, 26248, 40150, 58425, 41873, -13351, -33585, 2489, 38222, 34138, 6431, 7458]
14229G458N2363M1930l4040n6694R578j6884K387N4778J8462k8272m602J2511
14217E8975J1805j3688j3249L691m0280j1221M095M320J6645L1060l098k6072
14205B2983j7761Q215M9051k5147J7414M344j1396K7407J170J1818L6026k4846
14193I9278p4174k146K7870l1069k5562K1133J0042m1614k7842K463K0985K8321
14181G685P793p575J4680J2271l5619k492Q363J7426p61K3572k8130j6299M0925
14168D1839K5216m757J8045p273l7156j8075j203j9483j0934j0272K4681L6178
14156C6806L5386j3284q354k858J7702j71l027m9368k0025K5554L374l132M9034
14143F7637L0524p0209j9549l9895K562P972q055J3181j8533J991L0055k1637
$$ y = [7458, 59821, 101751, 67711, 11017, 20595, 3711, 6098, 60876, 79338, 51066, 46464, 58975, 70780, 57092, 43843, 47534, 7254, -3967, 128, 4448, 21093, 52153, 49055, 22983, 5222, 13437, 62488, 37341, 54755, 59099, 47703, 75110, 76280, 88098, 124124, 99278, 25104, 22958, 50828, 19759, -5803, 15330, 25372, -16242, -44084, -41621, -20636, 7685, 15478, 7903, 22583, 34854, -765, -3257, 5106, 22532, 21771, 45343, 17213, 914, 41839, 67055, 62298, 80343, 73070, 35914, 17839, 16636, -2847, -13781, -24053, 628, 36806, 72192, 58908, 50554, 47696, 65398, 65227, 62200, 12832, -7193, 18361, 21735, 18603, 67637, 98161, 27952, 8403, -31492, -28930, -20958, -29013, -15832, -34365, -32374, -2319, -23956]
14131b3956l4396J3144J5560K7136M4676k174l5377q368J7918R850j6877l5957
14119b8821R404R124o781L2601J2558l8256j5237O516r812K6535J3680K9992J5932
14106E7435k2765R457k1184M990K5761j2901J5772k3198k3367O781l059k5608
14094a1886J8939L7259M0147J3523k7138o6123j7896J65m836R77L1043J2921j2825
14081A4270l250M1445L1034m332q31j2675m9505k7824N508j0326R120J2735J9107
14068B4476m256J6328L0238j5095l2817r36J5390j1446m578n2604m4793j2621
14056i2714K4942K4233M3045o069l8568J7637K395J8971K5209K6743L92M792j4757
14043C6251k4473n653j3519j9944L1205p804j8263k8996N627p438N81K5361Q650
$$ y = [-23956, -58352, -45208, -29648, -2512, 42164, 39990, 4613, -3755, 14163, 24013, 7136, -28821, -19417, -10293, -17074, 15527, 28085, -10171, -25408, -18892, -28704, -2169, 11511, 41503, 57435, 34670, 44127, 22943, 27933, 53694, 40793, 56565, 33367, 10000, 16781, 13722, -11886, 7053, 44312, 84459, 97982, 70844, 4721, -13175, -13010, -17846, -16869, 14174, 27095, 14270, 11020, 52465, 83499, 79167, 78336, 65661, 16156, -11668, -6160, -16486, -7366, 5369, 24476, 20220, 36548, 66786, 51691, 18874, 17938, 33328, 21882, 17304, -35300, -80093, -92714, -67772, -43539, -494, -6563, -45131, -27494, -25099, -6128, 19081, 45824, 46216, 51008, 36251, 11778, 6125, -7394, -27338, 3867, -3937, -22200, -51196, -45569, -53007, -52426, -27065, -18415]
14030a8415L2001k9474M656m269j0601K3129K3164j7696j5138R021N3734j2944
14018C7168j6978k272j4253J4290P369j7937K2958k0235l3006r539J2048J7890
14006b497j5322N143M412J6344K4706k4860q012P382J8890J9081r968r165N164
13993C1298l848J9791k0394j7685K522K4521j431j5496J6878k3929k7795j5462
13981c1030k2464n97K216K9567J7540r293l1271J1856N855k8738R793M759l813
13968d5620j6817J928K7648J3082n619J7371Q1460L1605p0833k4693K0596k1309
13956H799J905J2544M494l493l235k0746j9076J116J4791j7103l0189k3323N5853
13943a7663O0345j2758K959J8812J9334j2896k0814k4499R768J3937o0230J6389
$$ y = [-18415, 13586, -15888, -11232, -15501, -26102, -2973, 20191, 2495, -12643, -3622, 50112, 37168, 20190, 17918, 3665, 17955, 25324, 7387, 30345, 10110, -22896, -32435, -20387, -2497, -17819, -12676, -8264, 8080, 32786, 7926, -86, 7296, 26186, 45267, 35299, 26134, 31298, 27450, 47241, 26847, 9162, 11684, 36205, 34774, 19278, 36156, 12227, -15568, -31030, -53494, -54091, -51875, -22308, -4768, -14061, -45332, -33476, -27621, -56359, -46566, -41807, -45620, -62437, -60509, -32861, -19779, -25398, -8027, 73433, 105038, 34205, 9512, 30108, 8799, 10704, 23248, 27742, 24249, 21014, 268, -18808, -17692, -2901, -20004, -50193, -73516, -17663, 42682, 29924, 32883, 51695, 71029, 58133, 37319, 12820, 22588, 36525, -23705, -7316]
13931g316J9503j9582J7747J4443O107n0179m5494K2890K8224l981j3660q063
13919c9361J3151K7425J6345R030j163k2955j3600m566j4465j665n700J4467M0813
13906A7756j7333J9607J0693j3461K893j1445N64J1889K0821K8428k4598k1041
13894B4773P688j4184l4970k1406M9403L3409l6872m8873J1540J1980L3658j892
13882A4254j4249J7310M0163l191J3317R920J715j2117k9903l7977M6774k753
13870D3263k5461o5227j4314O2669j3l7173J2775K5721R939k3025n1272l40k2965
13857h5423L8359K2927l4221P915K1006K3644J6486J8163l4983l1433n016J977
13845d0599K3353M3458k006m3069P351J7716K2229k6875j4323L3297M462k365
$$ y = [-7316, 12187, -7395, 10352, 24795, 30902, -19277, -64771, -41881, -13657, -17638, -31298, -39361, -26210, 1215, 17560, 26590, 25427, 2472, -11128, -15694, -30159, -31824, -37524, -23057, 17756, 423, 20030, 30723, 17262, 20155, 8710, 9274, 21163, 41984, 70412, 45814, 24773, 32461, 18277, -16693, -38099, 11304, 44713, 7841, -41032, -29492, -17512, 16146, 14254, 5, 17315, 57478, 54287, 67604, 77524, 79239, 67122, 37219, -758, 46016, 43263, 17802, -47425, -61739, 930, 917, -36256, -23481, 2240, 12179, -10846, -62118, -62458, -85423, -47064, -24137, -58358, -50443, -29437, -5793, 10693, 28856, -6127, -37560, -42576, -40599, -17246, 26212, 24206, -18863, -11512, 6204, 28433, 1558, -12765, 20532, 24994, 22629]
13833B2629l1118j2322J7748Q047l0749M6618J1649k5436J5729j3404O719p390
13821H720o4340R429L9304j9128R463K4783j7541k3110M880k8332J5357J2761
13809b7754k7958J7395M8322J9478r519j7123k1833p813O66N657J1789L0353K0508
13796D2168j0173J0870p63k9472K3115J4769J3373j9988l319n0538k2728M1778
13784I092M1840k807n4502o1780L1835M8783P013N038M5781Q11l5706j9527J2980
13771B8851k447R881K4708m4851m0142k5128J8287K3819n256J3382k3266k0618
13759d2780M087k1073M6143Q001j2689l109L2502K3269J6666K499m3670j2752
13747b906L0694l726o7165N459R235L9392L1218J9620k6410q078j2561j5590m321
$$ y = [22629, -8489, -20811, -3063, 4984, -25765, 20853, 32502, 7066, 22795, 9391, 16110, 8720, -55620, -46191, -6887, -26015, -16552, 8231, -9310, -32420, -27540, -55872, -40515, -27754, -55712, -38317, 10005, 29483, 19964, 2841, -18992, -26805, -26139, -20482, -8693, 21660, 42168, 31995, 42865, 42102, 12630, 35745, 50514, 63887, 43899, 40580, -9958, -32686, 9092, 50932, 48125, -6377, -68157, -36322, 12461, 19474, 24512, 70293, 71104, 35398, 15871, 28851, 26404, 36285, 60993, 16142, -24000, -49128, -30841, -7022, -12278, 1104, -22162, -42780, -38693, -59766, -13623, -5622, -18311, -21420, 11082, 34351, 51017, 53516, 9846, -2906, 27788, 24062, -43103, -37644, -28409, 10983, 42201, 61821, 35411, 27333, 14772, -818, -5139]
13734e139K1828N3972j7773k4010j1078k7350J6227K5367J4381o1489j3103Q348
13722a9819K2856l5539J606K6384J5624O530k1194R876N1504N902j2535R697l012
13709E7880n0910o9276o207l13N5692M9325j1487l9727j9964J420K4161K4541
13697A5135O689q791J9146K941j8996K7745P194J2250j8331l4645j2991r493K3470
13684A1323k769k7357k6504l3671J6138L4257L9256J6780J1214l5256j8200m2210
13672e6999R804M3534K997j4211O078J5109J0434L150m4920L2280L3014k4498
13660A5772J9376K1224n8382k5138O9064L2064J256Q874M23l0853N538K6380L942
13647H9540j938j4821o4850J9920J9420j8631r453K8876J9185j4420k2423k8522
$$ y = [-5139, 16689, 70661, 52888, 28878, 17800, -9550, 6677, 32044, 46425, -15064, -28167, -19819, 3037, -32502, -30896, -4512, 11112, 17642, -3552, 6324, 57828, 63730, 51195, 60892, 57880, 6970, -62306, -68513, -68826, -13134, 36191, 24704, -15023, -34987, -33567, -9406, 15135, 21824, 13033, 32179, 35120, 16124, 43869, 51063, 63313, 44982, 10337, -2654, -12147, 11323, 8554, -18803, -45307, -78978, -62840, -28583, 10673, 27453, 38667, 3411, -14789, -56999, -47195, -3661, -664, -14875, -8797, 6312, 16746, 19896, -25024, 7256, 40270, 15772, 35148, 56372, -2010, -27148, 41916, 73980, 75236, 84110, 84533, 53680, 59218, 85598, 89540, 87602, 72781, 7931, 27851, 47271, 28640, 19187, 48063, 67248, 52828, 30405, 1883]
13635A883l9271k558O4736M9421k1261l7594N959k535j7648L1028j1639l0296
13623i775J342J7172P379m4851r887l7099M968J5926M6923k0156m044L2018K2116
13610B2032q550k4664n913K8294r153p551l320O706k9350m59J697o427k3027p174
13596f6859M043J6430L7499J1188k5010k4041J7502M5728M6755j6788k9168l7740
13584b0461j1072j00N1928L1708P456k0820m63K0634j3907j8419k1981m305J7145
13571A7343p576K4426M3316j3618l3543k5239m307m207j6976R951J7444p721L8805
13558C8098J7884K006J9230j0286p456m107k2104j9312M1898j3733J5798m479
13546E3437M725J252p202j4553k1820K3997J9545j8434j9861P673J5507k3577
$$ y = [1883, -37388, -39946, 24790, 74211, 52950, 15356, 21315, 18780, 1132, 32160, 20521, -9775, -8433, 8739, 16118, -28733, -38620, -75719, -70751, -54825, -7902, -28058, -32102, -84, 22032, 13482, -11182, -17095, 11199, 2046, -5505, -8825, -2119, -31469, -31928, -30231, -36658, -59685, -66859, -62816, -46386, -8887, 2301, -22709, -46750, -29248, 16480, 63235, 46447, 17279, -20461, -31533, -31633, 20295, 52003, 59459, 38639, 38176, 58810, 44903, 26484, 4503, 198, 17343, 9767, 34193, 77509, 63891, 30348, 5109, 802, -3405, -20381, -10430, 7014, -707, 38098, 55982, 57988, 77218, 66932, 59476, 55369, 33265, 13953, 55851, 42118, 57916, 53437, 58162, 59414, 52212, 37659, 15839, 39836, 59381, 40947, 21086, 28759, 44266, 20689]
13534B0689j6056J9258P010q643l755K0416M00j6057l113K1165J2566K3861k1918
13521E5823l9353J1409K1410j7781P75O524J8850j010K0501j3182l8273j6341
13509I352K9050N0409K3616j9431O542o2974o677O2644k5253m9142k3318K4770
13497A9588J9918k455L782k0291j7497q615N342O1994P4598O996q9664l9724k8179
13484a4207L7516l5004j714K2971L4989l979k8022l6039N348K7792M8314J0741
13472F8706k2208j3834K6034N024j2862j2719j8487k8310M84L909L8169k117K410
13459C4199J7437l3377n732l6682K202J0236n3j9219j7263M4870O3051k2986n0193
13446a3510o2835Q943N4049l4277K1459J5842J3737j7849j6382K3961o307N006
$$ y = [20689, 4633, 23891, 30901, 22258, 18503, 38919, 39319, 23262, 20149, 41314, 53880, 77741, 55823, 16470, 27879, 49289, 31508, 32283, 38807, 57657, 56647, 77148, 63966, 25693, 9352, 38402, 88811, 112427, 92996, 99538, 36564, 29887, 92531, 67278, 18136, -5182, 19588, 39506, 37051, 40833, 20542, 3045, -5570, -228, 61766, 136364, 143360, 53696, 13972, -14207, 23309, -11695, -13409, 9562, 44551, 40572, 12550, -23489, -18141, 9651, 57965, 68706, 46498, 32664, 58698, 63722, 50860, 38141, 19654, -8656, -8172, -4263, 33906, 31789, 34199, 51636, 18259, 12527, -24155, -21953, -11717, -11770, -30989, -48252, -3382, 59669, 36683, -13510, -76345, -67402, -13353, -47630, -26171, -10329, 3408, -14441, -30823, -6862, -13169, -8163]
13434h163k5649J0884L1148J5633k6605k7681K5966L4739k1163J2553K0318j7264
13422B4716j8031m0224K245r1n058n947J3470N882J6378O576K8703K4521N519
13409E8659m630j4721p349K2178l105j9074l3871J8956K1266J2853M890j3330
13397D2722k1600N981J1967P502P276L577j0818P419j4661j8649k0487Q500l1463
13384b2734j933R926K9598N9236R1J0818l8567j3923j2791j238m569J3987q752
13371A9149L3952L3580M996l913k3798l2933P942M5982r979k3985l2316k0836
13359b159J8278K0889J7446l3991l6813J3336K8329j3653j518L5090J4440j9744
13347C9930J8897j4876l9457k5894J5465J4026k5317l625k6092j2573K5736j0651
$$ y = [-8163, -33812, -22928, 8220, 23853, -2752, -30433, -4467, 30272, 9109, 21662, 41980, 24716, 6685, -33539, -31294, -31385, -36443, -42390, -28920, -23038, -6660, -84, 28619, 53140, 58659, 54029, 39308, 31959, 54137, 51032, 31958, -1913, 17043, 38309, 51162, 56052, 42722, 21122, 27103, 39070, 46572, 53848, 57425, 46607, 54026, 39365, 20716, 229, 8729, -22734, -24667, -14741, 14857, 74093, 74184, 85002, 46435, 32512, 19721, 18483, 13914, 27901, 19149, 53101, 86681, 91677, 87764, 63966, 31033, 38975, 84957, 74978, 50993, 18677, -2159, 16119, 37008, 54454, 20463, -16350, -3014, 25315, 11662, 10144, 45234, 59674, 39930, 58827, 43951, 4494, -21400, -5935, 8091, -17226, -20851, -46943, -59516, -33780, -44431]
13335d4431J9242k776j8307j5998R100L1469J3496R112J6095N0003L7753m9571
13323E5187n5536J4997L7747r964l0731l256J7455P901n612j9330j4452L3241
13311B7647k2448o360J4320N8540m7005l4789M4197k3419k4329j1579J8344m68
13299g349J0848Q53K2927j8538L3848K0832L9252L413l3349k5618J5093k5464
13287C6748n0719m688N1356K3738j3102n387M571k867K0063K896k6233l4637q116
13274f377n815N367J5755L5116J3696j4675l7203l0939o242K2560J8521M7151
13262E6915k0476j4986J3501l6588r776R560J4069O67k939L204M2650j6521n128
13249C4152K124P021O207j1048j6946j7656J33k7923N4963L0894j2003r643l4853
$$ y = [-44431, -25189, -27965, -46272, -62270, -53170, -21701, -8205, 907, 17002, 67005, 104758, 55187, -349, 14648, 52395, 42431, 11700, 8444, 25899, 33800, 28188, 8858, -5594, 27647, 5199, -1161, 13159, 71699, 24694, -10095, 34102, 10683, -13646, -25225, -6881, -7349, 3499, 4352, 27279, 8741, 42589, 63421, 102673, 106086, 72737, 47119, 62212, 36748, -13971, -18659, 32697, 56435, 43333, 37946, 42517, 39650, 59713, 62609, 36376, 1739, -6377, -12192, -6825, 8930, 44046, 57742, 43067, 5864, -25075, -31317, -8757, 9764, 56915, 36439, 21453, 34954, -1634, -11410, -1850, 12219, 12886, 9947, 13151, 55801, 39280, 34152, 36276, 43297, 49504, 38456, 21510, 3854, 3987, -23936, 31027, 61921, 49918, 40275, 5422]
13236E422j4406Q696J0631J9133L1850j7824k3496J3866J8557l857j1999L2089
13224F8662q939l2072n3149K7675O4781p410n6233J9631M339k0778k7447K3776
13212B836K9029l86r132j6379l2548J6572R8m414k1878K7760K3364m745N11J5300
13198B5988J0022K5491K658J8704m4674k2501J211j2144k8147o083j6185K3558
13186b2102K6016J9384r190j9370j0663L7821L621j1039r889m3787j3087N690
13174d6595J7658N0981M2834m1784k7672L272L082k3509K518r800N6565J082j2443
13161A6189J0219J5963j3885j6030M085J5112J0808P609j2320K2193K9526L3371
13149A22840j3866k1762p33k4191l0578k2602o581j6907o263o069J1493j1496
$$ y = [5422, -8984, -288, 10343, 29476, 61326, 43502, 20006, 33872, 52429, 48572, 36573, 68662, 59723, 27651, -25498, 2177, 66958, 59548, 3315, 22946, 27285, 6507, -20940, 2836, 31865, 31479, 22347, 5968, -26580, -10008, -9910, -14324, -36202, -8442, 14922, 10177, 10688, 25988, 36010, 61501, 64159, 82863, 38189, 15688, 16899, 4755, -23392, -29475, -45660, -22102, 3914, 23298, 14108, -5262, -15925, 21896, 25517, 14478, 4589, -39198, -52285, -46595, -28937, 22044, 64878, 23094, -4578, -1306, 1776, -21733, -19215, -29015, 27550, 28632, 16189, 26408, 42371, 28486, 12456, 16541, 31653, 42461, 50070, 37750, 59943, 89469, 122840, 108974, 87212, 86479, 62288, 31710, 9108, 2527, -14380, -20643, -26712, -15219, -26715]
13137b6715K7006o094L012O085L7467K1337l2179R34K8386m252p7510n4832K6347
13124e1008O6512J6651j3301J979L1914J3943n7429l438j0288K3598K4735j9260
13112B4608K839R047j8486J1045K7186l4636k5043O3278J6502n2467j4773L907
13100A3007j730Q985j6234J4302J9249J6482J6417k9416m3413k6351O832J1594
13088a0276j7510k4488J9090K9112J3046j2004K8606L368J3489L4845j016j2729
13076F3533m6289n157J588k5247p201J1441J6200L3684J6207k2025j150J4492
13064E0076J8896k0889j3756K110j399j5176j4519j9476L9698J2195m6526o747
13052a5513J0600k8001l500l427k4440J7526M7094J8146L6036K8308J3081R990
$$ y = [-26715, 291, -5803, -2791, 3294, 40761, 62098, 29919, 30853, 59239, 54987, -22523, -77355, -51008, 15504, 32155, 18854, 20833, 52747, 66690, 9261, 5823, -4465, 19133, 43868, 24608, 27447, 36494, 18008, 29053, 56239, 21603, -3440, 59838, 76340, 23873, 9100, 13007, 11277, 20262, 4028, 18330, 37579, 54061, 70478, 41062, -2351, -28702, -21870, -10276, -27786, -52274, -33184, -4072, 8974, -3030, 25576, 28944, 42433, 77278, 76262, 63533, 17244, 12087, 13675, -11572, -18773, -7332, 8868, 42552, 58759, 36734, 35584, 50076, 68972, 48083, 34327, 36437, 35038, 19862, 5343, -14133, 25565, 37760, -8766, -15513, -4913, -32914, -36414, -39841, -64281, -46755, 339, 18485, 54521, 82829, 95910, 105900]
13040A05900l3307j7188j577j6952N4076K6973l3992j0343m1309l4670N513m881
13028a757J4077o420j4580R543L8732M1122P312O267P605p1565j0971M0745J7510
13015G7620k864O807K1140j2229k2974K038O0209K2670o1739j237o9605J5661
13003C5497J6075l0726l152M4782k9789l6847J5143K3748o152K722k7275j0022
12991e996k1723l6367P789P3146N8855Q836j5474n2240K9630N8266j9598M894
12979I0018r606m7004j1955P365n4135r117L0957M0635K572l6950r992l778l2176
12966d3166Q503K8430K4949J5126K7104P510J9179m6177L623N9511K7213j2726
12954A19079l3938k1812l0895M633L3875J1358j9689l2778l3788K3351P798j0345
$$ y = [105900, 72593, 55405, 53828, 36876, 90952, 117925, 83933, 73590, 32281, -2389, 3124, -1757, 12320, 5900, -8680, 863, 39595, 80717, 88029, 94296, 101901, 30336, 19365, 60110, 77620, 74756, 81563, 102703, 90474, 67500, 69538, 129747, 152417, 90678, 89441, 19836, 35497, 51572, 20846, 17694, 62476, 32687, -4160, 10983, 34731, 28579, 31301, 4026, -5996, -27719, -64086, -56297, 16849, 75704, 84540, 69066, 16826, 46456, 104722, 85124, 90018, 80412, 33408, 21453, 28818, -25317, -34434, -3477, 37158, 39730, 2780, -7212, -10990, -43166, -34663, -6233, 18716, 33842, 60946, 68456, 87635, 41458, 45081, 104592, 131805, 119079, 85141, 63329, 32434, 37067, 70942, 82300, 62611, 29833, -3955, 19396, 27194, 16849]
12942A6849J9669J92j0527J861l7723M258K0866P736M868k526M2847J8359p035
12929G9694o0227J8978j516m1008r194q16K630J3582r364o859K6006L0763n8192
12916a5523k7098L10J9015L4696K9410m2339J1169K6574J3505p197q832n7817
12904b4127K1239K7395k866j0537l5314J6508K5510j9924l4008K9391K2719j7982
12892a996k7109M2412K1185J1876Q154O505j2374m5k0857k4139l8953n143K6472
12879a4012J2119L7682K5648k0344k1296j5734l9627j8599L4714N4622J3702M1011
12867H9886K7337p2106l5453P020m732Q54m706j0931M977j9902k004K2810K3517
12854B6567J8941j0978m8374K0085M577j745L9144L1500l3422n4779L0403N8435
$$ y = [16849, 36518, 36710, 26183, 28044, -9679, -5421, 15445, 23181, 28049, 25523, 68370, 86729, 79694, 19467, 38445, 36929, -4079, -13273, -14089, -11459, 2123, -7241, -14100, 11906, 42669, -15523, -42621, -42311, -23296, 11400, 40810, -1529, 9640, 36214, 49719, 42522, 33690, -24127, -2888, 24507, 21641, 11104, -24210, -7702, 17808, -2116, -36124, -6733, 15986, -1996, -29105, 13307, 34492, 46368, 54522, 61027, 48653, 48608, 27751, 3612, -35341, -40484, -14012, -1893, 35789, 61437, 41093, 19797, 4063, -35564, -54163, -19449, 35173, 48875, 89886, 117223, 45117, 9664, 16684, 11952, 12806, 8100, -2831, 2146, -17756, -19760, 3050, 26567, 45508, 34530, -13844, 6241, 10818, 9073, 48217, 79717, 46295, -8484, 21919, 80354]
12842H0354j8730J6013l9336J5163J6477o688p686j2961k8423m077J7967j0584
12830A7489j9481N08l924m5588J3478L5030r510q577L667L5645q202l1094j1683
12817c2242J7922L3167j2996k1836J0994L0424j9403N672k8869r839K4119o33
12805c520n0874o783J2776j0065L3455K1373q177N945K2650Q582O4576K0272n1274
12792E8936k5917j7563k3044J2615K8240P221n8579n168P696j4761J8434J1359
12780e31K0826J996J5505r7p0181L6452J02173M4612j9408j7183N70j6939o765
12767I1030k9847L6779j7758m5815l5516J2203L03j5524J6513K7446n3057J6174
12755B931K6122J5880p185K3665r081j1585J0563L3967o246k9537J1532K2472
$$ y = [80354, 61624, 77637, 38301, 53464, 69941, 63253, 55567, 42606, 14183, 10106, 28073, 17489, -1992, -1484, -5408, -50996, -37518, -2488, -11998, -20575, -16908, 18737, 10535, -20559, -32242, -14320, 18847, 5851, -15985, -4991, 25433, 6030, 11702, -17167, -27006, -2887, -3520, -54394, -61177, -48401, -58466, -25011, -3638, -11815, -5870, 16780, 25362, 89938, 110210, 58936, 33019, 15456, -7588, 5027, 33267, 40488, -18091, -23259, -15563, -30324, -11890, -531, 20295, 22291, 37796, 37699, -32482, 3970, 106143, 150755, 131347, 114164, 114734, 97795, 91030, 61183, 97962, 80204, 34389, -1127, 11076, 11379, -4145, 12368, 39814, -13243, 2931, 29053, 44933, 37748, 61413, 52332, 40747, 51310, 85277, 79031, 49494, 61026, 83498]
12743H3498p640j9287k7201n0145P81M2559n975k7976k3778k050K0868J6262j1559
12730a1643L1872L1138J0656R93m339K153K1546l5692n8667K0088M2789j4100
12718C6794m2283m4563o191N130N7892P926J7138l9826l9061J3690J279J1630
12706b0445k1041J4083K4384L5638M0196M425k0867o1130n665q574L6604j6707
12694I01n852O834L063j2602R462k4401M333M1489K3699k3318K0454J2271K9337
12681H5670o521l2915q620j9035k6985k460R87n97m5014l6026l567M4128M3074
12668g881J0085j4406l220j285N5168N7936o414k4888j2081J2917K2994j4877
12656G4048l94l19j7603j1538M285O690K37J6625q552o6114l4395j9142R022O0840
$$ y = [83498, 75858, 56571, 29370, -20775, -19994, 22565, 16590, -11386, -35164, -37214, -16346, -84, -11643, 20229, 51367, 62023, 63016, 58677, 60830, 82376, 46684, -11983, 8105, 50894, 36794, -5489, -50052, -56243, -51113, 6779, 14705, 31843, -7983, -47044, -33354, -32075, -20445, -41486, -27403, -3019, 32619, 72815, 77240, 56373, -4757, -10422, -18996, 17608, 901, -4951, 1883, 4946, -7656, 1806, -22595, -18262, 23227, 46926, 23608, 44062, 56333, 85670, 79149, 46234, 37614, 18579, -8406, -10866, -9879, -10476, -55490, -91516, -95083, -50955, -7881, 2204, -12202, -15422, -16707, 38461, 96397, 89983, 65095, 53014, 65931, 88925, 74048, 73654, 73335, 55732, 44194, 48479, 55169, 55406, 72031, 63479, -2635, -37030, -56172, -47150, 13690]
12642A3690N0759J6583r081o7631j9057K2346L3411R84j5315k555O495j4732K2064
12629C7961j6242N968j8164j4870l972O979L0567k863k1951J2611L091K7344O9581
12616A16040J2253j9453k2554n7818j2419M2404J2481p593k2932K8950K4534Q417
12604A02310J1411l1405k0505J3471o378k8268R774J5077L0597j4738k3695M965
12592F2616j6546L304J5189n836p345m298K4803j9760K6605K5637N155k2414n0446
12579C6664m0084L005j887L9537K9169K2247q794l268l843m2852j6187j5034K0571
12566A9244K9301Q627L203K0522O974j9835k2444n4279k0979J082P6494J035k6426
12553B2519L9873O926k1767l6580M7821L659n1284o1542l7027K0862N2233J385
$$ y = [13690, 64449, 81032, 71951, 4320, -14737, 7609, 41020, 42004, 26689, 24134, 30629, 15897, 37961, 21719, 27687, 9523, -5347, -9319, -2340, 28227, 25364, 3413, 16024, 19115, 46459, 116040, 128293, 108840, 86286, 28468, 16049, 58453, 70934, 63341, 40409, 69359, 93893, 102310, 113721, 82316, 61811, 75282, 68904, 40636, 50410, 65487, 96084, 81346, 57651, 62616, 46070, 49374, 64563, 58727, 51382, 47084, 71887, 52127, 78732, 104369, 109524, 87110, 36664, -3420, -415, -2302, 37235, 66404, 88651, 79857, 76589, 72746, 29894, 13707, -1327, 19244, 48545, 57172, 60375, 80897, 87871, 68036, 45592, -8687, -29666, -28584, 47910, 48945, 22519, 62392, 69318, 47551, 10971, 58792, 62451, 11167, -50375, -87402, -66540, -14307, -12922]
12541a2922J5758N2570L1369K785j9575m521K1040l5618m4709N510K8721K74N841
12528D6523l8034m0059Q340Q3230L3250J1108k2020m763L08k1562p310M042O569
12515E9622M7878K9397j8040p0371m3464q200K0163j8215j9164M2287M2196M5530
12503A09619J4240l2809j6122k1406Q21l9805j7045K5519J0933k5668N668M2105
12491E6050L1760L1688p171p199n4253l7303J338J9793k8739K6312M6219L9498
12479A17993l1248j5637m463l6757j1205k9954K5179L5131l891N674P875L1975
12467I0672J1560k4895j0414J5581L873n1700k0735j5479J1782M7326J1699K5673
12455I4943M3506K2972j4776n5920N055r246O031j2845Q359l9098l1022J6371
$$ y = [-12922, 2836, 55406, 86775, 89560, 69985, 65464, 86504, 50886, 6177, 11687, 40408, 40682, 46523, 8489, -31570, -23230, 60000, 93250, 104358, 82338, 77575, 77883, 56321, 49011, 53053, 59622, 107500, 136897, 118857, 48486, 5022, -3178, 16985, -1230, -20394, 21893, 64089, 109619, 123859, 91050, 74928, 53522, 54343, 14538, -2507, 23012, 33945, 8277, 13945, 56050, 87810, 119498, 112327, 105128, 50875, 13572, 14910, 34703, 5964, 32276, 78495, 117993, 86745, 71108, 66645, 29888, 18683, -11271, 13908, 49039, 45148, 50822, 58697, 90672, 102232, 77337, 66923, 82504, 86377, 34677, 13942, -1537, 10245, 57571, 69270, 94943, 138449, 161421, 146645, 90725, 95780, 86534, 92565, 79720, 88079, 48981, 17959, 34330]
12443C4330p552l6883n8251L556k736R330M5363K6976J2910N959j8264k2770P917
12430a15K0480N106k898j9885K7983J8276J9695N424j4435j7597o160o441Q601
12417C8034P29K1987L1364m876l5959n2751m7191M588M5978M8988j0905m6356
12405f370j4981M7522N1944k4540m5663J6180k8890j9198J2016J7855K3482k156
12393B7201K1847L356k8522k4548J4215P369K3857k2770n096m115l232L8811K0423
12380F8796O816j7025r355r156n5544N2931N5913k4068j8865K0974l1035J430
12368D1812M547L4488l4628j7905R652K3817m2355M126j5030o65j0081J0222M8807
12355E6807k876l3765m1156l0788J2039O5075j2429n4226L8266M2155N844k7609
$$ y = [34330, 26778, -10105, -68356, -64800, -67536, -58206, -12843, 14133, 27043, 33002, 14738, -8032, -115, 20365, 25471, 22573, 2688, 30671, 48947, 68642, 74066, 59631, 42034, 35874, 29433, 38034, 38763, 60750, 92114, 87238, 51279, -1472, -48663, -44075, 1903, 50891, 39986, -6370, -21351, 26171, 78115, 53575, 7912, 24092, -4798, -23996, -11980, 5875, 29357, 27201, 49048, 52404, 23882, -666, 13549, 20918, 44775, 22005, 16909, 12794, 9562, 48373, 68796, 75612, 58587, 49232, 40076, -15468, 37463, 93376, 69308, 50443, 71417, 40382, 41812, 46359, 80847, 46219, 28314, 37966, 61783, 19428, 23554, 8524, 7859, -2222, 8000, 56807, 53931, 20166, -20990, -51778, -39739, 25336, 12907, -41319, -3053, 39102, 44946, 17337]
12343A7337j9264M3132K4918K5825J865n3802k6756m129O546K8624n8324K075
12331a1953L9618L1972j8990k5379M487K6889o460N5387k670K7693J2683m6912
12319H6365m7391m8239K1782L4408L3727Q357l9022k337M175k1003j2967j3352
12307D503O313K6372n185m881N938M412Q735j7083J2401J0723j8150K0872j5232
12294C9738J749J9023Q574O844K9966l2634n7099l2373r03O554P1362J9951k7
12281H0725m1884m450M0065J0532m787k4463j1661M8152M933m1750o858L7307
12269H5861R085J4850l922j4365j210j6808M767J4187J6627k5662m831Q746k0733
12256F6592J5669J6029L2452n0789l1378J5275n45k4385K3315P506J9793O747
$$ y = [17337, -1927, 41205, 66123, 91948, 93813, 40011, 13255, 9126, 15672, 44296, -14028, -11953, 27665, 59637, 40647, 15268, 19755, 46644, 40184, 95571, 92901, 120594, 133277, 86365, 38974, -9265, 12517, 46925, 80652, 89009, 49987, 47650, 51825, 30822, 17855, 4503, 10816, 37188, 32003, 27122, 33060, 37472, 46207, 29124, 41525, 52248, 34098, 54970, 39738, 41487, 60510, 69084, 75928, 105894, 73260, 16161, -16212, -17115, -10561, 60801, 80752, 80725, 38841, 34391, 74456, 84988, 80201, 55738, 44077, 92229, 97162, 55412, 48554, 85861, 94946, 109796, 105874, 91509, 90299, 73491, 78258, 92445, 109072, 83410, 78579, 87325, 66592, 82261, 98290, 130742, 79953, 48575, 63850, 63305, 38920, 62235, 69741, 89534, 96281]
12244I6281l582J2855m2587k2777l2102m0012K9529j2023j2385N169k3863J6047
12232b9450K7095r854j6918L8982L7770k225k5587P926J5303j066J7245J3207
12220G2428Q519m6732O946J553L7529m175j894K0692k8540m193K2519j686j6811
12207F6155J9130p465k5883p30K8456K5428J0536N4221j0567m9597k3237L4903
12195A21350j8521l7494k449k7744q605p721m417J0959k8543L247L2732M1739
12183G4533J5346M7334k3747j2275k2469l8141J93j481l4134p313L2415J1086
12171D1347k6163L0251r767r924M1403K9878j1003q229o020k5354n719p000M05
12158C4105k2325N007J0341K2184L4697j1846k9643L9611k3516Q415O3413j9121
$$ y = [96281, 92699, 105554, 62967, 40190, 8088, -31924, -2395, -14418, -26803, -21634, -45497, -29450, -2355, -12209, -29127, 9855, 47625, 45400, 19813, 27739, 43042, 41976, 59221, 72428, 80947, 34215, 41161, 42714, 80243, 76068, 74174, 94866, 66326, 62133, 84652, 82966, 66155, 85285, 77820, 51937, 51207, 79663, 105091, 115627, 169848, 159281, 109684, 86447, 121350, 102829, 65335, 62886, 35142, 26537, 18816, 14399, 25358, -3185, 62, 32794, 74533, 89879, 137213, 113466, 101191, 78722, 40581, 40774, 39293, 5159, -2154, 30261, 41347, 15184, 45435, 35668, 25744, 67147, 97025, 86022, 77793, 71773, 46419, 40700, 33700, 34105, 11780, 16787, 27128, 49312, 84009, 72163, 42520, 82131, 58615, 67030, 130443, 111322]
12146A11322n2797j7819m9537n8462M0591J9616M5191L4729n352K9824j8367m5267
12134C3672j8687q261j4500O4206M3385J5951N482j497p402k8282K2121M1933
12122A48121l9778o7982n673j6388L6021K7408l0995j0285R100j047l5518n33
12110A2451L2770L1793k797o596M417P977K684p63k3218o2433k4760O1328L8301
12097G1154p770O532o4686k1068J02635O0720m0443l1034p432M631K5173K3482
12085A21894l1509j1594j5102P490J5770K7750n901J127j9486R511k3117O261
12073H3094J4594n571p394k5667J1360N587J6171j2840k3647l3309N433J737L402
12060C2950q027K5585L6411l0266k1415l685N644K370j4944K8519K5963J8382
$$ y = [111322, 58525, 40706, -8831, -67293, -26702, -7086, 38105, 72834, 67482, 97306, 78939, 33672, 14985, 6724, -7776, 56430, 99815, 115766, 121248, 119751, 112349, 84067, 106188, 148121, 108343, 40361, 34688, 18300, 54321, 81729, 50734, 40449, 49549, 48502, 12984, 12451, 45221, 77014, 74217, 67621, 72038, 80015, 82699, 81936, 58718, -3715, -28475, 32853, 71154, 63384, 69916, 5230, -15838, 86797, 147517, 107074, 76040, 68608, 73239, 98412, 121894, 90385, 78791, 63689, 71179, 86949, 114699, 108798, 109925, 90439, 99950, 76833, 83094, 97688, 92117, 84723, 59056, 70416, 76003, 92174, 79334, 55687, 22378, 27811, 29548, 32950, 24923, 50508, 86919, 56653, 35238, 31553, 37197, 39567, 24623, 53142, 79105, 97487]
12048I7487j9850j595l216J1251j5412p0463l3493J7301q166p51o63J1975M7852
12035C2257N2688k6018j6553M8435J3842m2176K1242M0028k2862L3045Q224m3310
12023I8842p442j3366L632l8905k6217k7671j1182O7155M5141k6212k385k2986
12011C8404j7383K3532L3236R777o966j1166L2547J2090L1364M916p9660j3633
11999E7058k5210k5545N0120M1579n0976n6223N560M5733K3869N9710k1842l4889
11987F8944n4657J6023K9580Q377j2746k0409m6987o418K1932M0439K7713K5362
11975I7153l289K8912k9762n9158r948L6908L0385Q795K5570j889n721J3507j9290
11962A12173j3379j1393N2953J7153j2936j9637j3955J4001k04L91R802m5595
$$ y = [97487, 77637, 76042, 72826, 84077, 68665, -1798, -35291, -17990, -26156, -26907, -27570, -15595, 32257, 84945, 58927, 42374, 90809, 104651, 62475, 83717, 123745, 100883, 133928, 142152, 98842, 91400, 78034, 81666, 42761, 16544, -11127, -22309, 44846, 89987, 63775, 61390, 38404, 21021, 44553, 77789, 87566, 80600, 69434, 101981, 114071, 145435, 150351, 70691, 57058, 31848, 6303, 56423, 98002, 47026, -9197, -3637, 42096, 65965, 125675, 103833, 68944, 14287, 30310, 59890, 68267, 55521, 35112, -11875, -18293, 3639, 44078, 71791, 97153, 93864, 122776, 93014, 33856, 23908, 60816, 91201, 99996, 125566, 123677, 117956, 131463, 112173, 98794, 87401, 140354, 157507, 144571, 124934, 110979, 124980, 124776, 125167, 134969, 89374]
11950H9374j6866j9316o154L6912K9640l8540n634J1531j4241J3350K2471m7682
11938E4845J7055J3779k48k6212K9285M3729K6095l7771k4667k0048J1715J3895
11926A01452K4735K4302k5462m2092m5203j8501L3783j6274p624L0479n934P300
11914F0961j4011j6302K2435k0524L7959J5313J3653k7512l6611J4794L0681L6605
11902A17441K9303m223m1968r368k9355j7729l0821j3991M0013L4744J4270J1647
11890I9963j2822k2627K2175L230k8208K4194L573P663J1630k4131K5488J803
11878A11931j4122k2858L174K9086J7813L9297M0243n6728n7778K1757o6778O755
11866E1792P0727J1556J4033K610j9748L6397L150j7680o330n716n2615m3902
$$ y = [89374, 72508, 53192, 47038, 83950, 113590, 75050, 69416, 80947, 66706, 80056, 102527, 54845, 71900, 85679, 85431, 59219, 88504, 132233, 158328, 120557, 95890, 75842, 87557, 101452, 126187, 150489, 125027, 82935, 37732, 19231, 53014, 36740, 29116, 59595, 53661, 60961, 46950, 30648, 53083, 32559, 70518, 85831, 99484, 71972, 35361, 50155, 80836, 117441, 146744, 142521, 100553, 91185, 61830, 44101, 13280, -711, 39302, 74046, 88316, 99963, 87141, 64514, 86689, 89919, 61711, 85905, 89478, 97141, 108771, 84640, 110128, 111931, 97809, 74951, 78125, 107211, 125024, 164321, 204564, 147836, 90058, 111815, 45037, 51792, 122519, 134075, 148108, 150718, 130970, 167367, 170517, 152837, 146507, 140791, 88176, 44274]
11854D4274L1625Q87r677K7296K0067l274J820M5791j9664j59j7131l7987m072
11841G9796j1630j3544J8590L5216l692O579J2368k2272k8300O446N6835j1581
11829A24811j9107m5019K062K6750j8643q121L2668J4582K5736L567L7186K6298
11817B02770l8007K455o7605j1552l1971J013M1082M0643j3435n8594N8538L2244
11805A57581n010q115j8541k0940J4457R036m328n395R978l0938l8258O16K5527
11792H5670k5298L4232j0447k6030K0524L4643K9277K3144j5510k3795j6310l2837
11780G7263M4986M5142j1517k7741J898O700q406J9306j7120j7676k4432k9626
11768E8777J3684L0621K4483K4367o89j7488J0804O1891j2757j9532m7111m1291
$$ y = [44274, 75899, 76786, 67109, 94405, 114472, 111198, 113018, 158809, 139145, 138986, 121855, 83868, 79796, 68166, 54622, 73212, 108428, 104736, 111315, 123683, 101411, 73111, 79557, 136392, 124811, 105704, 60685, 62747, 89497, 70854, 62733, 95401, 109983, 135719, 139286, 176472, 202770, 164763, 167218, 99613, 88061, 56090, 57103, 98185, 138828, 125393, 66799, 125337, 157581, 152571, 144456, 125915, 104975, 119432, 128468, 124140, 118745, 128723, 97785, 59527, 60143, 85670, 60372, 94604, 84157, 58127, 78651, 113294, 142571, 165715, 150205, 126410, 110100, 77263, 122249, 167391, 155874, 128133, 130031, 136731, 128325, 147631, 130511, 112835, 88403, 58777, 72461, 103082, 127565, 151932, 151243, 133755, 144559, 206450, 193693, 174161, 127050, 85759]
11756H5759J6979k1054K8173N813l3444o2146N8804N6820J7846k8229p4613K2473
11744G3181L2605J113J1313m859K2581J2205J8175L3695m5540k5957j2250K1606
11732A37868M45J6572M7946j0845l4037m925N768J0636J3939j2943r748j2455
11720A48221j4589K0641M218l3508j515O603M5837K2878r439n1661k5224L1407
11708A43869J0914j2944J3381J5709K845k0154j0762k3712p968k1814Q216J4719
11696A12299K1322N3248K1669j459k1442k4070M3724N208l3368l3335m7702k847
11684I3247L2557L520L6615M9878L3086k5426k6699n2194L0388M5526j3847p6606
11672A30045l0102J4695L7710l6471k8854j299l0544l9464M7937P7224O1887R226
$$ y = [85759, 102738, 81684, 109857, 115670, 82226, 20080, 78884, 135704, 153550, 125321, 50708, 73181, 105786, 106899, 118212, 113353, 135934, 148139, 166314, 200009, 154469, 128512, 116262, 137868, 138313, 154885, 202831, 191986, 157949, 153024, 158792, 169428, 183367, 170424, 160676, 148221, 133632, 154273, 158491, 124983, 123468, 130071, 175908, 198786, 189347, 137686, 112462, 143869, 154783, 141839, 155220, 170929, 173774, 153620, 142858, 119146, 111178, 89364, 97580, 112299, 133621, 186869, 208538, 207079, 185637, 161567, 205291, 210499, 177131, 143796, 96094, 93247, 125804, 129324, 165939, 215817, 248903, 223477, 196778, 144584, 174972, 220498, 206651, 130045, 99943, 114638, 152348, 115877, 87023, 85724, 55180, 15716, 63653, 140877, 202764, 211990]
11660B11990K8732k4118p4508K8352L8950Q365r301j46J2786J6724L9171m4034
11648B32963n3015m0779j98k7994L4570M7831j4559n5675k0681L6281J7181j0327
11636A45598k2371r735L4363R327j657p77J3656k4615j114k3105j2796K5112K1916
11623A53802J7683J6093L4248l3948l8955O60N4479K8984K598m398k5398J0291
11611B16139j1023l2473M3294K2155M3095j741q1230k7168j4749K2661M9719n114
11599B23565j108k0314o2244m882N1448J9055j8703M0384r385n7711L185j779
11587A61511M3519K187R357j3562m8586j8586K0530j5975K5250l2580K0970L6960
11575A90995R1322L5396L591n5717m2070j7924l9771n0946j7723L0848N577J8500
$$ y = [211990, 240722, 216604, 142096, 170448, 209398, 217763, 208462, 208316, 221102, 237826, 276997, 232963, 179948, 139169, 138971, 110977, 145547, 193378, 178819, 123144, 102463, 138744, 155925, 145598, 123227, 113492, 147855, 157182, 155525, 154748, 168404, 143789, 142675, 119570, 106774, 131886, 153802, 171485, 187578, 221826, 187878, 148923, 149583, 204062, 233046, 235644, 231246, 205848, 216139, 205116, 172643, 215937, 238092, 281187, 279446, 198216, 171048, 156299, 178960, 228679, 223565, 222457, 202143, 139899, 135017, 186465, 205520, 186817, 227201, 217816, 160105, 163290, 161511, 205030, 207217, 216574, 203012, 154426, 135840, 156370, 140395, 165645, 133065, 154035, 190995, 282317, 317713, 321304, 265587, 223517, 205593, 165822, 114876, 97153, 128001, 133578, 152078]
11563A52078M1078J8392j8210n3904j550K2692L1146J9025j8018n527Q325p748
11551A87779l8671K7098l5870l0177M1921M5806j5323P549o538R30j5594j5688
11539A53222M232k902K6381J3735P6298J3725k2829j2691p430m3089K1n9220k481
11526A36972M2839L2050P2854J235p3638m0016K3614j1411J2590R796l1337J2585
11514A88133j7013J3425J8126K5209J7435k0630l0438n3370l549L7190K6133K3843
11502B24494n631Q546o978j4840Q688P061j6284k7551j3817K5915K3147m198j5755
11489A92797k7804l0974M413K2846L4889K7607L7043P488k6631k4241k2275j1734
11477A83424K4233O238J3328q301P951Q806m7863K7207p333q836K8395j1625L2262
$$ y = [152078, 193156, 211548, 193338, 139434, 137884, 160576, 191722, 210747, 192729, 187202, 195527, 187779, 149108, 176206, 140336, 110159, 152080, 197886, 182563, 190112, 183574, 184504, 168910, 153222, 157454, 154552, 180933, 194668, 270966, 284691, 261862, 249171, 241741, 198652, 198673, 139453, 136972, 179811, 211861, 284715, 285950, 212312, 172296, 195910, 184499, 197089, 206885, 175548, 188133, 171120, 184545, 202671, 227880, 245315, 224685, 194247, 140877, 137328, 174518, 200651, 224494, 218863, 227409, 220431, 205591, 214279, 221340, 205056, 177505, 163688, 189603, 212750, 208552, 192797, 164993, 134019, 138432, 161278, 196167, 223774, 260817, 268305, 241674, 217433, 195158, 183424, 207657, 213895, 227223, 218922, 226873, 235679, 187816, 215023, 207690, 198854, 227249, 215624, 247886]
11464B47886L4027n545J1274m0894l4674j5337l852J769L7036p17K0959K5720
11452B77652R878J4007k2928o5334K068J3113j2932j5340J9028K9340J2975K084
11440B63611n866K2845k9742n6688P271j5071J7160K952J5570M3919o02m1421
11428B23938l6762l07J6849m905M3005j7577J0705J6578L4473k6436L622M3238
11416C06421j6823l6332Q97j5694P40j7378k4766M1631j507J5061M292n4077l5773
11403A66692j6747m35K3065l345r627J0146J5302L2277Q680j1682j6286j9584
11391A78456k3092L5576K9318L2660K7742J8238m7964n4565j3587L3174J7805
11380B33761o943l0308M5703L4041o707l3044l3557j7834j3651K9024l69m0180
$$ y = [247886, 281913, 276368, 287642, 246748, 212074, 196737, 192885, 194654, 231690, 230973, 251932, 277652, 287530, 301537, 278609, 213275, 215343, 228456, 215524, 200184, 219212, 248552, 261527, 263611, 257745, 280590, 250848, 194160, 201431, 186360, 203520, 206472, 222042, 265961, 265359, 223938, 187176, 186869, 203718, 198813, 241818, 224241, 234946, 251524, 285997, 259561, 263183, 306421, 289598, 253266, 254163, 238469, 239209, 221831, 197065, 238696, 237189, 252250, 256542, 202465, 166692, 149945, 149510, 172575, 169230, 159603, 169749, 185051, 217328, 226008, 214326, 198040, 178456, 155364, 190940, 220258, 252918, 280660, 298898, 250934, 196369, 182782, 215956, 233761, 226818, 196510, 242213, 276254, 269547, 236503, 202946, 185112, 171461, 200485, 200116, 159936]
11368A59936M822M8172L6740M9957k621l6590n6764L2373m629k817J4639K2077
11356B65295J2649K7797j1850m0229J1391j1680l7690j8745M8208J1064J617O998
11344B64825m748j61j1689J8899J4951l9468o0880j4818K6994L9251J8600j584
11332B50172J1688j6858l5919l3849K6969Q493O615N644J1090J6375K9934j630
11320B78724j6299l5923k3684J0613J0349K4813Q551j154p858k1766N8713Q450
11308B93529l843k7494P374l303Q653K4039L7651k0644l3324j5611j6433k3062
11296B27532K1718N1543R942n1952j2727J6005N7016j3128m8070J201M8849n1635
11284B56294n6674j1670N8025N9880j4379m7263j2459L7065J0902q676j1604N552
$$ y = [159936, 164758, 212930, 249670, 299627, 297006, 260416, 203652, 236025, 231396, 228579, 243218, 265295, 277944, 305741, 293891, 253662, 265053, 253373, 215683, 196938, 245146, 256210, 257827, 264825, 260077, 259916, 248227, 267126, 282077, 242609, 181729, 166911, 193905, 233156, 251756, 250172, 261860, 245002, 209083, 175234, 202203, 210696, 217311, 222955, 234045, 250420, 280354, 278724, 262425, 226502, 202818, 213431, 223780, 248593, 257144, 255990, 248132, 226366, 285079, 293529, 289686, 262192, 269566, 266263, 274916, 298955, 336606, 315962, 282638, 267027, 250594, 227532, 249250, 300793, 310735, 258783, 246056, 262061, 319077, 305949, 257879, 259080, 307929, 256294, 199620, 187950, 245975, 305855, 291476, 244213, 231754, 268819, 279721, 271045, 259441, 264993]
11272B64993J8957l1084n1410j3205J1506J1075L0990Q69J3257L3845M3801m1613
11260B91981L2914J7000m6057k6372L1167j0903o7813o0841J2358O1912J1946
11249B47292j7604k4367m233K6268K5109L1143k0212j8133j3581R007K0628J8970
11237B80287J3761l983n6458k8238m170J7680J0875J5939K918j8502J0746M30
11225B41285J3060K039L5818J4700m5832k0125j0563o942n472J5447R869K0862
11213B64146j6295k3588K7471K3007R052k5387j565K5073J6583j1998j4538R543
11201B81504J4761l8449p135K210j128J0889Q425P76o168l9594m9932L659O178
11188A85996K5933K4595j9090J555K8687J2019K7020M211M4076j148m4254k5260
$$ y = [264993, 283950, 252866, 201456, 188251, 199757, 210832, 241822, 242691, 255948, 289793, 333594, 291981, 324895, 341895, 295838, 269466, 300633, 289730, 221917, 161076, 173434, 235346, 247292, 229688, 205321, 201088, 227356, 252465, 283608, 263396, 245263, 231682, 240689, 261317, 280287, 294048, 290065, 233607, 205369, 201199, 218879, 229754, 245693, 248611, 230109, 240855, 241285, 254345, 256384, 292202, 306902, 261070, 240945, 230382, 223440, 217968, 233415, 243284, 264146, 247851, 224263, 251734, 274741, 283793, 258406, 256841, 281914, 298497, 286499, 271961, 281504, 296265, 257816, 250681, 252891, 251763, 262652, 271077, 271853, 265685, 226091, 176159, 179818, 185996, 211929, 236524, 217434, 218989, 247676, 259695, 286715, 290926, 335002, 333854, 289600, 264340]
11176B64340j7450M1183K7403j0514m6884k0430J1778N11L5185j2692l6401l3458
11164B02571L056M3202J8391j5239r245o836L3705J3997L65k37j2153n724L7066
11151C02919j268l243m04j3535M1K2909j5590j4020o801l0697nK5045K5907j327
11137B89931N164J1914J8960j0543k6534j6359k8285L200q766J6320j0859n8542
11125A85601J1814M3213j8064m2065O450o251j890j6123K7287k9467L2647K0753
11113B13905o239R975K1149N243l1964k4230J2912k039K7119L4990q837o866m7262
11100A97856O201k6072k9515L8021K9013k6313m2016J2725O668M141K4130J9263
11088B14102o429O327l2487K872L2193r878n622R829j7486R61J7267J9266K1693
$$ y = [264340, 246890, 288073, 315476, 304962, 258078, 237648, 249426, 249937, 285122, 272430, 236029, 202571, 205627, 248829, 267220, 251981, 242736, 235900, 269605, 283602, 283967, 283730, 271577, 265853, 302919, 301651, 298408, 298004, 284469, 284510, 307419, 291829, 277809, 271008, 240311, 240306, 265351, 291258, 289931, 295095, 307009, 325969, 315426, 288892, 272533, 244248, 247448, 238682, 255002, 244143, 185601, 197415, 240628, 222564, 180499, 186949, 180698, 178808, 162685, 189972, 160505, 193152, 213905, 207666, 217641, 238790, 244033, 212069, 187839, 200751, 198712, 225831, 260821, 251984, 245118, 197856, 204057, 177985, 148470, 186491, 215504, 189191, 147175, 159900, 166568, 170709, 194839, 214102, 207673, 214000, 181513, 184385, 216578, 206700, 201078, 210907, 193421, 194382, 211649, 230915, 252608]
11075B52608O98M824Q714l1199j3010J0442m0882J5992o394J7702j6841k7092
11063A75562L450J8436N3638L3557M142k1807j1140k26M4785L4685k4437k5661
11051B84984J1525L8570O0865L9455q050J9398O2469j1537N0949O2385N7400R2683
11039G61096J43244J94156K18403K46632J63594J12017L8814n0953l768P803J3490
11028A844528k2482j49898k08861k69515j81263j77917p8593o2243m1739j1742
11018F40275p176p233k3905l0617j0381l0559k3149N351J7608K4408l1605l9132
11006D83885J6640k9760r664k0622l2680J1973j0469m3233l112l149O888o544
10994C60153q62J2112O094j6654j7786o615J0649p134o933l5022L911J2538K4479
$$ y = [252608, 253306, 258130, 266844, 235645, 222635, 233077, 192195, 208187, 201793, 219495, 202654, 175562, 179012, 197448, 251086, 284643, 288785, 266978, 255838, 255612, 300397, 335082, 310645, 284984, 296509, 335079, 395944, 435399, 427349, 446747, 509216, 497679, 548628, 611013, 668413, 761096, 904340, 1098496, 1316899, 1563531, 1727125, 1839142, 1877956, 1827003, 1823235, 1831038, 1844528, 1822046, 1672148, 1463287, 1193772, 1012509, 834592, 755999, 693756, 652017, 640275, 633099, 625866, 601961, 571344, 560963, 530404, 507255, 512606, 530214, 554622, 523017, 483885, 500525, 470765, 461101, 440479, 407799, 419772, 409303, 366070, 362958, 359809, 366697, 360153, 359291, 371403, 377497, 360843, 343057, 336442, 347091, 339957, 333024, 298002, 301913, 314451, 338930]
10981C38930J838j1206m626k2098K2626k5279J7706k0559K0407n3875q1623k5656
10969A56585L8222O4153J5135o141P108r680J4574K6320K0711P195k2930R485
10957C20737k032l605Q800J8805K0260j1055k6466J0742k027m012o707J5818K6597
10944C65855J9476q116Q28p008J4112J0060l6419m4014n816J9259K1844k4804
10932C25257o1972K1124N2899k004k2915k4445o0102L132Q9842j587l0623K242
10920B90848M5864O914O750j6662R877J3436K2987P508J0307m9640p0547k745
10908B74897L4867N741K4799K7957j7088k1855j5479L0869J2129k4242J7854L8122
10896C88571J9451J6733J2557O388J5603P888K9620L8019N7870K9034M0732K8275
$$ y = [338930, 340768, 329562, 324936, 302838, 325464, 300185, 317891, 297332, 317739, 263864, 182241, 156585, 194807, 258960, 274095, 267954, 275062, 265382, 279956, 306276, 326987, 334182, 311252, 320737, 318705, 315100, 323900, 342705, 362965, 351910, 325444, 336186, 334159, 330147, 323440, 339258, 365855, 385331, 377215, 378043, 371035, 385147, 395207, 358788, 314774, 308958, 328217, 350061, 325257, 263285, 284409, 337308, 335304, 312389, 287944, 227842, 230974, 320816, 319229, 288606, 290848, 336712, 343626, 350376, 333714, 343591, 357027, 380014, 387522, 397829, 348189, 277642, 274897, 309764, 315505, 340304, 368261, 351173, 329318, 313839, 344708, 356837, 332595, 350449, 388571, 408022, 424755, 437312, 443700, 459303, 467191, 496811, 534830, 592700, 621734, 662466, 690741]
10884F90741n081R02J760l6832j2799k5376n1219k9763k7521R355n7683l2003
10872D24481n1120n5118k542L9122L8000L2308p581j555o001k285j2104l2665
10860C62940l7115P780K7813J0622l1247K790N3574Q606j8482K5345q649R02L7951
10847D42830o0133n4480L7094j508J1304Q53m3301k6317O435M1702O2348L6126
10835D52953j3424l1120j0893k6568K4065o02n203K1546M1498P18j0501m8748
10823C93721k2416k325j8256o969K7521J6029j1564k9778K2401J2190k0430j2909
10811C47215L2482r858K7007N2153K7009j5175p445m6689k6063J3599M8261M604
10799D47100L554j0428q156r348p288K338J8290K5857M4310k5056k0944K7497
$$ y = [690741, 685660, 686562, 688322, 651490, 638691, 613315, 562096, 532333, 504812, 514167, 456484, 424481, 373361, 318243, 315701, 354823, 392823, 425131, 417550, 415995, 409994, 407709, 395605, 362940, 325825, 333605, 361418, 372040, 340793, 343583, 397157, 405763, 387281, 412626, 403977, 404879, 442830, 382697, 328217, 365311, 363803, 375107, 375960, 332659, 306342, 312777, 354479, 416827, 452953, 439529, 408409, 397516, 370948, 395013, 394411, 389208, 410754, 452252, 452970, 442469, 393721, 371305, 368980, 350724, 343755, 371276, 387305, 375741, 345963, 368364, 380554, 360124, 347215, 379697, 369839, 396846, 448999, 476008, 460833, 453388, 406699, 380636, 394235, 442496, 447100, 450654, 440226, 432070, 422722, 415434, 417772, 436062, 461919, 506229, 481173, 460229, 487726]
10787D87726N223l7818M2881P0520k0749n905k318M1025J9637L932N2475L1982
10775F88611J9596L4934P534j5219K894O517M209L1958L5667L1344N6340j0430
10763H93955l0958k970k8613k640j3723k7685l53L2164P43q353o5466n0113J0808
10750G06796k0857M675j0215j9018l2410J7093J6402k5794j034J296j6737j4657
10738F05540P676K3864N8749N3255L0461l838P292M0944J0463L2812K2433k0924
10726H68727J0339J4584j4960j9705J5739O1203R3664l713J7037M5406j3319k7513
10714A047489M1832J2246K1924M1878P6164m1353k3216L6597N7178K5291j8907
10703A277123L4311p803J3126N4066K4850J6024O7574L3784j4956j4053q300R676
$$ y = [487726, 492949, 455131, 498012, 568532, 547783, 541878, 539560, 580585, 600222, 604154, 656629, 688611, 708207, 743141, 750675, 735456, 738350, 744867, 749076, 781034, 816701, 848045, 904385, 893955, 862997, 860027, 831414, 828774, 815051, 787366, 787013, 819177, 819920, 811567, 746101, 695988, 706796, 685939, 690614, 680399, 661381, 628971, 646064, 662466, 636672, 635638, 636934, 620197, 605540, 613216, 637080, 695829, 749084, 779545, 775707, 782999, 823943, 834406, 867218, 889651, 868727, 879066, 893650, 878690, 858985, 874724, 935927, 1029591, 1025878, 1042915, 1088321, 1075002, 1047489, 1089321, 1101567, 1123491, 1165369, 1241533, 1200180, 1176964, 1213561, 1270739, 1296030, 1277123, 1311434, 1303631, 1316757, 1370823, 1395673, 1411697, 1479271, 1513055, 1498099, 1484046, 1475746, 1485422]
10691A485422K9319K4010J8321K5546L6999K8603N3142O0602O2464O6041N6027
10680A946496P9564P3606O2274N0557Q0052Q4465L7402P9232Q9766P9709P2289
10669B735412Q4028J04007Q7495J26103K09656J46942J86043J93142K34028K72089
10659D378945L47727L47667L32616L97534M79652O00960O75390Q62175J110354
10650I533020J288985J471565J423043J430734J591548J749014K059835K595628
10642B3143372L271860M061773N108904O438150Q278570J0881536J4575312J9630531
10634I5390008K6339819L4779942M3615064M8451463M2633924K3721581J25295
10627C15057096j3200834r827674K59374K103250r379543k8008303m2984183m6048761
$$ y = [1485422, 1514741, 1538751, 1557072, 1582618, 1619617, 1648220, 1701362, 1761964, 1824428, 1890469, 1946496, 2026060, 2099666, 2161940, 2212497, 2292549, 2377014, 2414416, 2493648, 2583414, 2663123, 2735412, 2819440, 2923447, 3010942, 3137045, 3346701, 3493643, 3679686, 3872828, 4106856, 4378945, 4726672, 5074339, 5406955, 5804489, 6284141, 6885101, 7560491, 8422666, 9533020, 10822005, 12293570, 13716613, 15147347, 16738895, 18487909, 20547744, 23143372, 26415232, 30477005, 35585909, 42024059, 50302629, 61184165, 75759477, 95390008, 121729827, 156509769, 200124833, 248576296, 291210220, 314931801, 315057096, 301856262, 292028588, 292287962, 294391212, 285011669, 257003366, 214019183, 167970422]
10619A67970422l8330873k6903385j7795899j2039089q393495o120456m693916
10612E3693309l736912l015361k443546j835515j502119j551513j768434k013423
10604C5826486k040370j955186j839711j831217j871087j923484j842112j688516
10596B0834803j541252j423543j281788j100903j005767r98515q78043q06316
10588A1798676p59241o83759o39203o00568n64684n92178n01800m04811m22658
10579F629774m52838m13171l66418l37759l02632l01522k79626k60192k35621
10570C679995k29780j86571j65851j51756j45884j27285j78789k13604j50221
10561B130254j01407q8791r7987q1340o0990j24081r9602l7106q1399r6835n4490
$$ y = [167970422, 129639549, 102736164, 84940265, 72901176, 64507681, 58387225, 53693309, 49956397, 46941036, 44497490, 42661975, 41159856, 39608343, 37839909, 35826486, 33786116, 31830930, 29991219, 28160002, 26288915, 24365431, 22523319, 20834803, 19293551, 17870008, 16588220, 15487317, 14481550, 13483035, 12604992, 11798676, 11039435, 10355676, 9716473, 9115905, 8551221, 7959043, 7457243, 7052432, 6629774, 6176936, 5763765, 5397347, 5059588, 4756956, 4455434, 4175808, 3915616, 3679995, 3450215, 3263644, 3097793, 2946037, 2800153, 2672868, 2494079, 2280475, 2130254, 2028847, 1940056, 1842069, 1760729, 1699739, 1575658, 1476056, 1438950, 1357551, 1260716, 1206226]
10550A206226l8190l9810n3567j05548k8583k7918m2188l1350m7871p9916n5741
10539F55544k1419k8419n1688m5757J017l1385Q85j1112j1795l0830n8150n0203
10527C16688k5877l3788J958n844N477N952K1107P345l4275k9378O976J8902j3824
10514B41419K6108L3918J4669k5612j2215M7901P5786P22m6468j297l2441J2359
10502C34849M716o5098p1022n7687L833M8084k0588k9900n5044m7277k8972R004
10490B4898K3413m1711p6673l752L205j021P261l2689n371M6728r68l9441J3293
10477h2828R257p178j2231L0432N0345K5528j1479N0397N5501M1260J7517m3812
10465A22709r792N1714P232J4935j4352J8624N4328k0995k0034l604M638j9973
$$ y = [1206226, 1168036, 1128226, 1074659, 969111, 940528, 912610, 870422, 839072, 791201, 711285, 655544, 634125, 605706, 554018, 508261, 509278, 477893, 478778, 467666, 455871, 425041, 366891, 316688, 290811, 257023, 258981, 253137, 258614, 264566, 285673, 293018, 258743, 229365, 236341, 255243, 241419, 267527, 301445, 316114, 290502, 278287, 326188, 401974, 402696, 356228, 354931, 322490, 334849, 339565, 274467, 203445, 145758, 149591, 197675, 177087, 147187, 92143, 44866, 15894, 24898, 48311, 6600, -70073, -73825, -70620, -71641, -64380, -97069, -102440, -55712, -56680, -96121, -82828, -73571, -80749, -92980, -62548, -12203, 13325, 1846, 52243, 107744, 149004, 166521, 122709, 112917, 164631, 171863, 186798, 172446, 191070, 245398, 224403, 204369, 200765, 205403, 185430]
10453A85430J2579M0184k719K1968o642o4064p3955J3159J4632P912k0805N1548
10441A79227K7743o21O450k5959l6581l6054r676Q603j8595J0559J1592k1077
10429I5611j9146J3111j9029n7495l6961O267L2422K5041M3982m106k6001q238
10417D5458k4907k5213J7527R1K9585n6864j8420K6955k3226n341J1748k2406
10405d5013r24j868K8033j2418M261L197m5746J3770K8869K3284R260J3196K0374
10392C8275M3867J4319N839l1638m2992l5266O6641M5701m3036q290k518j4340
10380C6562L7382K854j4444L7419Q55l6699j8862O326J0373m7975j3174M1692
10368D2309j150r6146k3781j7860L5567L0933m165J5308l1042l0560o3242j904
$$ y = [185430, 198009, 238193, 235474, 257442, 250800, 186736, 112781, 125940, 140572, 148484, 127679, 179227, 206970, 206349, 212799, 186840, 150259, 114205, 104529, 113132, 94537, 105096, 116688, 95611, 76465, 89576, 70547, 13052, -23909, -17642, 14780, 39821, 83803, 79697, 53696, 45458, 20551, -4662, 12865, 12956, 42541, -14323, -32743, -5788, -29014, -34355, -22607, -45013, -45937, -47805, -19772, -32190, -27929, -24732, -70478, -56708, -27839, -4555, 4705, 17901, 38275, 82142, 96461, 102300, 70662, 27670, -7596, 59045, 104746, 61710, 53420, 50902, 36562, 73944, 76798, 62354, 99773, 100628, 63929, 45067, 51393, 61766, 13791, 617, 42309, 41159, -54987, -78768, -96628, -61061, -30128, -34293, -18985, -50027, -80587, -143829, -145733]
10356a45733O6429K1635j2204j5846m825J7480l078j1136j293J8782L858J6515
10344d9416J8819L351k4333k2355l926L4281J426j259p3927p956N7666M7969K1891
10331B231l0707j5353j9359k2740L466J6211L7646N4833j6474o7588j0469P063
10319f1240p18K1943O450r099l8723J9899L6542j6772j7937o040M9230l8969o9258
10306a24692K4804L389J9282j3163P896L153L8332K2777j1885M4034p366j6281
10294i720J5849l130k8779l2490k1088O877L682K9227J3118j1486K140K7109J7010
10281H319K1861m2589l5129K025L1835J8584J4722k2573j9775Q633K285N231j2465
10268a9036r892j3016J0991L2264K9066l6150O617j4517p25J0192j6306J1347
$$ y = [-145733, -79304, -57669, -69873, -85719, -90544, -73064, -76142, -87278, -88571, -69789, -65931, -49416, -30597, -27246, -51579, -73934, -77860, -43579, -42153, -43412, -117339, -125295, -67629, -19660, 2231, -28476, -43829, -63188, -85928, -82462, -66251, -28605, 26228, 9754, -57834, -68303, -61240, -61958, -40015, -33565, -42664, -81387, -61488, -24946, -41718, -59655, -65695, -16465, -55434, -124692, -99888, -96499, -77217, -90380, -82484, -79331, -40999, -18222, -30107, 13927, 6561, -9720, 6129, 2999, -25780, -58270, -79358, -72481, -68799, -39572, -26454, -37940, -35800, -8691, 8319, 30180, -12409, -47538, -45513, -13678, 4906, 19628, -2945, -22720, -14087, -11802, -6571, -19036, -28928, -41944, -30953, 1311, 30377, -5773, 844, -13673, -14398, -4206, -20512, -9165]
10256i165j3189L5983j3091m6288L1456J154K0989m5112l3655k651K8386N7249
10244A2066K2834m253m2028K4375r24j6273P469J5811k1429J938K9744J2973M5565
10231H7868K2107j8855j71Q7020R3080P4564J19220J58993J63284J73656K35920
10220A196686K30112J65567P465n8970l3447q191N4188m237j42587j89492k47606
10209I69488k88923j69088p0799m6547l1407o9853n8502q79M33k1326j9330j0846
10197A82421n065r104R840L5484j6937l2255j6260l6423n1814J315M1158j2528
10185H9832r808J3279J599l0785o2515N601O4190R863l1606K7276q853R117J7506
10172I4696m2553k5661p102J4793j2459J9850q698P557L2259K2479o1951o5792
$$ y = [-9165, -22354, 13629, 538, -45750, -14294, -13140, 7849, -37263, -70918, -73569, -45183, 12066, 34900, 30647, -11381, 12994, 12070, -4203, 3266, 19077, -2352, -414, 29330, 42303, 87868, 109975, 91120, 90949, 177969, 271049, 345613, 464833, 623826, 787110, 960766, 1196686, 1426798, 1592365, 1599830, 1540860, 1507413, 1499222, 1553410, 1549173, 1406586, 1217094, 969488, 680565, 511477, 440678, 394131, 362724, 292871, 234369, 233490, 233923, 212597, 193267, 182421, 177356, 168252, 178092, 213576, 196639, 164384, 148124, 111701, 59887, 61202, 102360, 89832, 80024, 93303, 94902, 64117, 1602, 7203, 71393, 81256, 49650, 76926, 68073, 77190, 94696, 52143, 26482, 19380, 34173, 21714, 41564, 32866, 40423, 72682, 95161, 33210, -32582]
10160c2582K9700K1143J7496L5047j3904p3240o3676m13o907J9659K2623J6657
10148b8397j6442l2171K0223K477J9428N616j306j4038l1374k3756M1068K3839
10136c4833O926r236k4829j5214j947K4416N708n1011L412L2650k3476n134J7368
10123g5200k8115P261L6600J9112L1655l8488m0692J27j1689j0894k332M3570
10111f9085O131j8283m8776j454K2766L6502J7719q027l0500j0992P011l2186
10099a29174j1630P817J6573M4076m444l1857k5548J0544K5664N138l3023K0734
10087a05130K2550j9508J3417K3131L7522j6030Q210j6459n9000P964K5576l8960
10075a16717j567L5805l110Q103L3505K6828j05r554m4907L9988O3617L1119k4211
$$ y = [-32582, -2882, 18261, 35757, 70804, 56900, -16340, -80016, -80429, -87336, -67677, -45054, -28397, -44839, -77010, -56787, -54310, -34882, -29266, -30572, -44610, -75984, -99740, -58672, -34833, -27907, -37143, -61972, -77186, -79133, -54717, -49009, -100020, -96608, -63958, -87434, -92568, -75200, -103315, -96054, -59454, -40342, -8687, -47175, -87867, -87740, -99429, -110323, -112655, -69085, -62954, -81237, -130013, -131467, -108701, -72199, -54480, -62507, -93007, -103999, -96988, -129174, -140804, -132987, -116414, -72338, -76782, -108639, -134187, -123643, -97979, -92841, -125864, -105130, -82580, -102088, -88671, -65540, -28018, -44048, -35838, -52297, -111297, -103333, -77757, -116717, -118284, -82479, -85589, -77486, -43981, -17153, -17258, -26812, -71719, -31731, 31886, 63005, 38794]
10062C8794k2685m1514J0086K5796j5617n1434M1022N8611p827J5101K5928K2089
10050I8350l8439o594J7643j055k9163j7077L0388N2430P1759N8031j1496p2801
10038A51976q1539l2097j0716l4969n5793q472j1232L7714J806j9966M7956O3716
10026D8384n558m2758k3007Q759j2987k2337M3423L2141K2221J3950J787l943
10014F0075m6282p8825k792K3007M7090n15l0078N663j1122l1221N792K8670J9152
10001a1386m871n909N907j6853J6430K2222j6478k3150O286j1775P852p378j808
9988d0911R235M590k1354k7876j0067R694l0085j6495J5300o467L8758k2181R097
9975h8762K1461O149K5270R71l0940J3379j0543M3468L0701r656m020l2914k627
$$ y = [38794, 16109, -25405, -15319, 10477, -5140, -56574, -15552, 43059, 35232, 50333, 76261, 98350, 59911, 53317, 70960, 69905, 40742, 23665, 54053, 106483, 178242, 236273, 224777, 151976, 70437, 38340, 27624, -7345, -63138, -71610, -82842, -45128, -43322, -63288, -15332, 48384, 42826, 68, -22939, -14180, -27167, -49504, -6081, 26060, 48281, 62231, 64018, 60075, 13793, -65032, -67824, -44817, 2273, 1758, -28320, -22657, -33779, -65000, -59208, -30538, -11386, -16257, -22166, -16259, -33112, -16682, 5540, -10938, -34088, -27802, -39577, -31725, -39103, -40911, -31676, -27086, -48440, -76316, -86383, -76689, -106774, -123269, -107969, -114436, -75678, -97859, -88762, -67301, -61152, -35882, -34911, -65851, -52472, -63015, -19547, 11154, 1498, -2522, -35436, -38063]
9962c8063K5961L9830R470M3152J0214N420Q102Q115J2389J6012m0114q4437j8382
9949b331K5749L7710j6121K8210J3537K6205o480n5016R709j3908L865j8572P568
9936D0125r516k0008m0302j6516K7608p717j0792L9461n446j4616l0873j0877
9924e9469O627K8822j9080m136J039L6235K9591j778q394K542n643J914l4642
9911b6372j7299L9305O553l0090j3948M0513p425L3957o533j822l791k4774q541
9898b0267J4883n0380k3827J0917j3427o469k0765L6747R231k367J1117K0898
9886c3709M7741L5425j2422n0225n3172K4852O147k8869J3397k1230j2194M9570
9874c4689J3603j434j981k4404L2649J8043m1552j8152J356K3140j3184K3685
$$ y = [-38063, -12102, 27728, 37198, 80350, 90564, 95984, 104086, 112201, 124590, 140602, 100488, 16051, -2331, 23418, 61128, 45007, 73217, 86754, 112959, 106479, 51463, 61172, 47264, 51129, 32557, 40125, 30609, 10601, -29701, -46217, -18609, -26326, -37118, 2343, -3103, -17719, -48592, -59469, -52842, -24020, -43100, -47236, -46197, -9962, 19629, 17851, 9457, 11999, 6356, 8270, -26372, -43671, -4366, 2187, -27903, -41851, -1338, -8763, 25194, 18661, 16839, 13048, -11726, -20267, -5384, -55764, -79591, -68674, -82101, -88570, -109335, -72588, -63357, -65724, -54607, -33709, 14032, 49457, 37035, -13190, -66362, -41510, -35363, -64232, -50835, -72065, -84259, -34689, -21086, -22520, -24501, -48905, -16256, 1787, -39765, -57917, -56561, -33421, -46605, -22920]
9862b2920j5119k0187J4806M2691K9927J2079n150l9444j1684k7084O780L5447
9850A42L4457K9815L3579L6435J7905M8168K3408m137l5881Q70m704l5599l0092
9837A14366m6924k2968j59l4996L422P3630q327n0731m5740j0411J2806k4163
9825d0195n7728j6432M8782M414M647M3936l644k8592l6796l175M161J1067P172
9812f2383m457p637L566J8121L9979L7602K2360k3006L6982n47M604l4097l8937
9799g850k5428J6703K0514N6968K2419j4277j1061l9153k5215K7052m013j4181
9787B478m3545l4994r239R884J2378L3890N783r488J3975k8325K797N413k1030
9774f0023J3934M654j4860r555m7268l9529M1652m609K0779N7156j7261j0088
$$ y = [-22920, -38039, -58226, -43420, -729, 29198, 41277, 36127, -3317, -15001, -42085, -35305, 142, 34599, 64414, 97993, 134428, 152333, 200501, 223909, 219772, 183891, 184761, 180057, 144458, 114366, 67442, 44474, 44315, 9319, 12741, 86371, 78044, 27313, -18427, -28838, -16032, -40195, -97923, -114355, -65573, -61159, -56512, -12576, -16220, -44812, -81608, -84783, -80622, -69555, -62383, -66840, -74477, -70911, -52790, -12811, 24791, 47151, 24145, 61127, 60580, 65184, 31087, -7850, -33278, -16575, 3939, 60907, 83326, 69049, 57988, 18835, -6380, 20672, 16659, 2478, -41067, -76061, -85300, -75416, -63038, -29148, -23365, -32853, -18878, -47203, -44406, -38993, -60023, -46089, -41435, -56295, -65850, -113118, -152647, -110995, -115604, -94825, -37669, -54930, -65018]
9762f5018l2118J6422J1370N566K1294J2407l7437n673L3404j3170j2796J2525
9750e3224j276j2915J2840l4647J6143J2609J7915j8584O527m0515R78K2783o896
9737g8262k492k6533L8974O5900O980j9295m8542J9724N496q970M5273J2287Q3
9724A0623q148l0958j6903r279j1520J8296j0822L2432J9982k9283k8004j7492
9712h1076k7781J9842L3887J7899K1566j6981k1975m7183K531N6349K0624M349
9700a7949K2997J9327k2613l1937r489k0679O923j2278j8777L519M618O128O550
9687f3660L7131K6777R106P547m9081o5811J6570N8078k162j9040j9978l5322
9675i9845P858J6723l4561N2857M5584R822L1442j5933N481l7277r108J3697K0085
$$ y = [-65018, -97136, -80714, -69344, -63778, -42484, -30077, -67514, -73187, -39783, -52953, -65749, -53224, -54500, -67415, -54575, -89222, -73079, -60470, -42555, -61139, -54612, -95127, -94149, -71366, -78262, -80754, -107287, -68313, -2413, 4567, -14728, -63270, -43546, -38050, -47020, -1747, 10540, 10623, 2475, -28483, -45386, -54665, -66185, -47889, -58711, -26279, -6297, -35580, -63584, -81076, -108857, -89015, -55128, -37229, -15663, -32644, -54619, -101802, -99271, -42922, -22298, -17949, 5048, 24375, 1762, -30175, -39664, -60343, -53420, -65698, -84475, -80956, -76338, -70210, -63660, -26529, 248, 9354, 16901, -32180, -97991, -81421, -23343, -25505, -44545, -64523, -99845, -91987, -75264, -109825, -56968, -11384, -1562, 29880, 13947, 19428, -17849, -26957, -13260, 6825]
9662F825J6574j8575l0051L0821n459k0591n560J8122m113l4633l9233M0427L7147
9649h299k4339j3626l7161L3366K7227K9292K5232L791k9638k4579m0272o188
9637f5194o851Q258Q569J1845j1358K2250j3856K743l5218k2358J2708P354K019
9624g9089l0943r190J6102N3226O316L0767K2349M908K419j5801K2825J6818m8588
9611g881j0263K5719j1173k4240K7157J6800p7148j4420N8756L7454J1690j4655
9599A7796O90p9449j8624K254L1056L5526P551J1799Q971n3084J2202m4278L7826
9586b9764O2206j7590j8355l7312N5767r223p2556k6742j7299J5205L7288n058
9574f3433R786K3028O686J673l2596J4519M487L04J7050j4518p063J7534K2866
$$ y = [6825, 23399, 4824, -25227, 5594, 135, -20456, -26016, -7894, -12007, -46640, -85873, -45446, -8299, -32638, -46264, -83425, -50059, -22832, 6460, 31692, 35483, 5845, -18734, -59006, -65194, -72045, -63787, -55218, -43373, -54731, -32481, -46337, -43594, -78812, -101170, -88462, -81108, -79089, -110032, -119222, -103120, -49894, -43578, -12811, 9538, 14446, 16865, 1064, 23889, 40707, -7881, -18144, 7575, -3598, -27838, -681, 16119, -61029, -75449, -16693, 20761, 32451, 17796, 18486, -60963, -79587, -77333, -46277, -10751, -3200, 8599, 17570, -35514, -23312, -67590, -29764, 32442, 14852, -3503, -40815, 14952, 5729, -66827, -93569, -110868, -95663, -58375, -63433, -53647, -30619, -23933, -22260, -54856, -40337, -35850, -35546, -18496, -33014, -40077, -22543, 323]
9561C23j3037k4858j0057o831n219M5416K7288K9919J9138J6792l4580k5614l4192
9548a5512N927o571k7737j1553Q1403L5058m8417k5387l5567k7477J5420K8239
9536c2174p666o378M509K8797M5766J6092l8877k835k874L2058J1773n7954k0770
9523c0533L1562M2037J9570k2208n0116J7662p727M292J6730l2459O447K2604
9511A7861k8842M991K237l1029l2083J2791J6085L2536J7706j5244k0524L2233
9499H718k8565p867j1529m1858j4322M0611L5331M736j9636q613k8837K6441N2036
9486F646M2734j536k082l8744k8645N469j8829k0582N6166K7203l0160l3664j713
9473c7737M945J6314R98l5364m4450k3434K0509M8537J6641L1139J8864J8028
$$ y = [323, -12714, -37572, -47629, -54460, -59679, -14263, 13025, 42944, 62082, 78874, 44294, 18680, -15512, -9585, -16156, -43893, -55446, 25957, 61015, 12598, -12789, -48356, -75833, -60413, -32174, -39840, -46218, -41709, -12912, 32854, 48946, 10069, 7234, 4360, 36418, 48191, -9763, -30533, 1029, 43066, 62636, 40428, -9688, 7974, 247, 4539, 21269, -11190, -4743, 17861, -10981, -5990, -3753, -34782, -66865, -54074, -37989, -5453, 12253, -2991, -23515, 8718, -19847, -27714, -39243, -81101, -95423, -54812, -19481, -14745, -34381, -42994, -71831, -45390, 6646, 49380, 47844, 45762, 7018, -21627, -16158, -34987, -55569, 597, 27800, -2360, -36024, -37737, -32792, -16478, -15480, -50844, -95294, -118728, -98219, -49682, -33041, -1902, 16962, 34990]
9461C4990p106m7777J5973K5482j426n693m9104j0685k980J9546M3989J8932j6673
9448A7468j1766J484J727k7550j0192K8703j4948j7125O74O71l607j8908K9441
9435b3928L941k1949j5607J6406N6476n144m2180n10L1664K0584m6482j4876q045
9422d9650m450k8062r663P514P411K1111M4843N56O946M0589k8685o5680j9122
9409g6342N5306J0954l1939j2605M7681r736l3207J3728J8665L42J9255p788m991
9396a0677l204j0544J9299k5538j5200N135N5495m818L4503j7782n2456J21P3376
9383D7710k927l2196L937p372P843k4607J6988M1487j594k089l6215o0719n335
9370e5089M0673K5119l2029j0578N802J022k9549J7439k3898O565M5382J4351
$$ y = [34990, 27884, -19893, -3920, 21562, 20136, 14443, -34661, -45346, -48326, -28780, 15209, 34141, 17468, 5702, 7186, 8913, -18637, -28829, -126, -15074, -32199, -31525, -30854, -34461, -53369, -23928, -19987, -41936, -57543, -41137, 15339, 10195, -31985, -32495, -831, 19753, -26729, -41605, -49650, -54100, -82162, -91825, -84311, -76900, -55789, -10946, -10390, -3444, 37145, 8460, -57220, -76342, -21036, -10082, -42021, -54626, -6945, -16681, -49888, -36160, -17495, -17153, 2102, -5686, -10677, -13881, -24425, -5126, -30664, -45864, -40729, 14766, 9948, 44451, 26669, -25787, -25666, 47710, 44783, 12587, 16524, 9152, 16995, -7612, 9376, 50863, 49269, 47180, 10965, -49754, -55089, -14416, 10703, -21326, -31904, -26102, -25080, -54629, -37190, -61088, -54523, -9141, 5210]
9358E210j5625k9067o848J8597K8649j5678j5722J1491l1719K3376q263M5201
9346I602M902l6603k8522J3314K6388P038l1296l4781k8864J3495K4695J1047
9334d9585P625J3491J8068P011l560p331l8712j8877J0691k7213j0753M5445J4198
9321c9502K894k0555J4856J3878J5570R226m9157l7859r520J3802M6329M8981
9309H943K7206m3280m7094L1082K3913j9241j3419p151K9946L82k8416j5081K1666
9296c0544j9923p376J6412R036l3921m7242J5092K8064K6106k6822J3478J4720
9284d2920K0695L720p737Q273l3840l8323J8513L2235P081m4105K347J8147N3874
9271b040M9439K8625j9668n65m4185q699k1150J3871Q914O333l3561q962l751
$$ y = [5210, -10415, -39482, -46330, -27733, 916, -14762, -30484, -18993, -50712, -27336, -35599, 9602, 14504, -22099, -50621, -37307, -10919, -3881, -35177, -69958, -98822, -85327, -60632, -49585, -41960, -28469, -10401, -3390, -6950, -14281, -52993, -71870, -61179, -88392, -99145, -53700, -39502, -36608, -57163, -42307, -28429, -12859, -3633, -52790, -90649, -100169, -86367, -40038, 8943, 36149, -7131, -54225, -23143, 770, -18471, -31890, -39041, -9095, -8713, -37129, -52210, -30544, -50467, -57843, -41431, -32395, -66316, -113558, -98466, -70402, -44296, -71118, -57640, -42920, -22225, -18505, -26242, -17969, -51809, -90132, -71619, -39384, -32303, -76408, -74061, -55914, -2040, 47399, 76024, 56356, 55791, 11606, 2907, -18243, -4372, 4542, 10875, -22686, -31648, -35399]
9258c5399k3805o321O392j0836p689K4092j5235l1581L8315L7873j6878J1660
9246b9412l451N170O647J3644k680O295m1798m1294O717K8328M9706r387k8740
9233d0255J967J4382K2695j5275k4333L530k9810m3858j4627L3369L8886J7275
9221c6054l1444l666K5697K5143k227p596J8032J6403j5761o347L9828j5888k0022
9208a3902r484M3730M922k2499k1396j9966k5347P457M3282K2111R618k4832k2470
9195b8776K5043L2015L5668j6925m8868Q550k4412k8876K2220M53j2545N616p044
9182c7881k4029k0091j0423L3729k5434L3830L0228M670K0226L4050j9165N524
9170B5234L014q5L5993J7132k9845k7022m8925q043M4680j0395q660j1616K1649
$$ y = [-35399, -59204, -65525, -59133, -69969, -77658, -53566, -68801, -100382, -62067, -24194, -41072, -29412, -32863, -27693, -21046, -7402, -10082, -3787, -45585, -86879, -80162, -51834, -2128, -11515, -40255, -38288, -23906, -1211, -16486, -40819, -37289, -67099, -110957, -125584, -92215, -53329, -36054, -67498, -71164, -45467, -20324, -22551, -30147, -12115, 4288, -11473, -17820, 22008, 6120, -13902, -23386, 20344, 25266, 2767, -18629, -38595, -63942, -56485, -13203, 8908, 18526, -6306, -28776, -3733, 28282, 63950, 47025, -1843, 6707, -17705, -46581, -24361, -23908, -36453, -30837, -37881, -61910, -82001, -92424, -58695, -84129, -50299, -20071, -15401, 4825, 38875, 19710, 25234, 28248, 28163, 64156, 81288, 51443, 24421, -24504, -32547, 12133, 1738, -6922, -18538, 3111]
9157C111M3407K3015m2124K606o566m1379k3673j075J9866J3969J3188J9858m756
9144A9447k8986m501l908J4690L0772r324j9270J5567N9745N1667l6384m1175
9132D8340J910K7221O0444k2908m8736k8094j6247L714l99o733K4267k0639n6910
9119c4770M5890J8339n5987k094K963L2492J4726K4012q811j6260O744j2276j943
9106A3025o3586k0296N1840P4631K9662l4988j5015K1829N157o973j3911L336
9094D4711M478j9099N492J9073J5681l6j4199M318K822k4702p9790k9834M6224
9081b4861J8416J8104M350r221j956N792J0499M0596J3157p092n5816K8335J0614
9068E0917m420j9451j715j1383L1204m488j1479j5717k5348O437l7092m2503O722
$$ y = [3111, 46518, 69533, 27409, 30015, 23449, -17930, -41603, -42678, -22812, -8843, 4345, 24203, 19447, -9539, -14040, -17948, -3258, 27514, 18190, -1080, 14487, 74232, 125899, 89515, 48340, 50250, 77471, 137915, 115007, 66271, 38177, 21930, 25644, 25245, 18512, 42779, 22140, -34770, 11120, 29459, -26528, -28622, -25659, 6833, 21559, 45571, 36760, 20500, 27244, 14968, 13025, -50561, -70857, -19017, 55614, 85276, 50288, 35273, 57102, 62259, 55286, 41375, 44711, 49189, 30090, 35582, 54655, 70336, 70300, 56101, 60419, 63241, 38539, -41251, -71085, -24861, -6445, 11659, 16009, 6788, 4832, 10624, 21123, 61719, 74876, 67784, 11968, 40303, 50917, 46497, 27046, 25331, 13948, 45152, 40664, 29185, 13468, -11880, -5443, -42535, -85038, -78316]
9055g8316L2480J7792O0533O6831K343l5438o713l8632o1821N019J2822K6467
9043C367N7734n522m5006J3370K0305j0394j0531N2416K1073R622n1485j9562
9031C5387n0401J8551K6047J4296k8420n6368K3847N0922j9934r799m2547j4204
9019e2623L5676O578J3149M3786J0139k3207j8021m9020j0876J1260j6914K5553
9007b4520M1704J3648J152r752R124M1690N736K1752k7837l9263r058J5976J2834
8994E3186j5817j836j5748O833M2481O630n2928k102n558m1792j8777L0661L6547
8981B1780j0086J8465K6880K963n6805o978P593J0609R456J6467j9450Q317j12
8968B9099q615L768j0549k9161M495O941P431j3880l167j6997j2118l561l2284
$$ y = [-78316, -45836, -28044, 32489, 99320, 101663, 66225, 59512, 20880, -40941, -35922, -23100, 3367, 61101, 55579, 10573, 23943, 44248, 33854, 23323, 75739, 96812, 106434, 54949, 35387, -15014, 3537, 29584, 43880, 15460, -40908, -17061, 33861, 13927, 4128, -38419, -52623, -16947, -10369, 2780, 46566, 56705, 33498, 15477, -33543, -44419, -33159, -50073, -24520, 17184, 30832, 31984, 22232, 31356, 73046, 78782, 100534, 72697, 33434, 24376, 40352, 53186, 37369, 35533, 19785, 26618, 69099, 75729, 22801, 20699, 15141, -26651, -45428, -14767, 21780, 11694, 30159, 57039, 60002, 3197, -3781, 3812, 14421, 23877, 40344, 20894, 29211, 29099, 20484, 24252, 13703, -15458, -10963, -4022, 3409, -10471, -13638, -30635, -42753, -46314, -78598]
8955g8598J7235K2038o53M2308J0856p249j4974K8356K3408l6763p8141K8130
8943d4047L7750J5878r27k5745j2536K0274N4513P132l2694J4115k9876k4110
8931b0273k0136N3033M5298j030k0017o205k268O220q882k8036j0032J8325L748
8918I745j8435O397o650M050N9962l0205r684J1569L4168k470l8873j454K1053
8905C9173M250N801N3611k1297k1123n0960l6112P651L0657J763k994k9539k452
8892b1571J8028L7824J3793K64Q927l5250n0534l5712O382k5569r304K3738N633
8879f3351J13J8618Q290j093k1174k105M4652J9576m6729j1358J2182N5491M5021
8866E8133O159k9637k6139m2699l7479K0824K5065J042L0829k0393m0612k5904
$$ y = [-78598, -61363, -39325, -39978, 2330, 13186, 5937, -9037, 19319, 42727, 5964, -72177, -44047, -6297, 9581, 8654, -17091, -29627, -9353, 45160, 52292, 19598, 33713, 3837, -20273, -40409, 12624, 57922, 56892, 36875, 30670, 28402, 34622, 25740, -2296, -12328, 5997, 9745, -8690, -2293, -8943, -4893, 55069, 24864, 15180, 26749, 60917, 58447, 19574, 18120, 39173, 43423, 49224, 102835, 81538, 60415, 9455, -26657, -19006, 11651, 13414, 10420, -19119, -21571, -3543, 34281, 48074, 48338, 57265, 22015, -28519, -64231, -57849, -83418, -92722, -68984, -63351, -63238, -44620, -36330, -37423, -58597, -60702, -16050, 3526, -43203, -54561, -42379, 13112, 58133, 64292, 34655, 8516, -34183, -71662, -50838, -25773, -24731, 6098, -14295, -54907, -80811]
8854h0811L1812O5866r083k9587J8196K7671j2574R485J5566k0398j8815K6971
8842B4299O968J901L4995j357l8204l0898m1255l0359j9284N0131O4033k509j3700
8829D761j1155k104J9899J4862K6767K1915p505l5519m167N7566N654J185l3389
8816E8770j656K5753M9671k1552K578N6540m7000l0410k0281m957m7306l9170
8804a9020j4204k3743P724m281O6864L7238k2641m9411k3483L8618R178j4245
8792a1406k5221J5400L6430j2322k0806O739R411k921j2298k8961J2492K1669
8780a1794k0639p664K3366N377p159J2600J9444j9707j8951j1429k1696Q685j0980
8767f0547J2299n671j4568o838L1107O3323J7115K4214j0056j6133L082m965P74
$$ y = [-80811, -48999, 16867, 7784, -21803, -3607, 24064, 11490, 20975, 36541, 16143, -2672, 24299, 31267, 33168, 68163, 66806, 28602, -2296, -43551, -73910, -93194, -43063, 20970, 18461, 4761, -6394, -8498, 11401, 26263, 53030, 74945, 67440, 31921, 27754, 85320, 90974, 92159, 58770, 57114, 82867, 132538, 110986, 113564, 170104, 123104, 92694, 72413, 67456, 20150, -19020, -33224, -56967, -49243, -53524, 13340, 50578, 27937, -21474, -44957, -6339, 2839, -11406, -36627, -21227, 15203, 2881, -17925, -11186, -1775, -4696, -16994, -45955, -33463, -11794, -32433, -40097, -16731, -11354, -18513, -5913, 13531, -6176, -25127, -36556, -58252, -49567, -60547, -48248, -53919, -68487, -75325, -44218, 19105, 36220, 60434, 50378, 34245, 37327, 32362, 33136]
8754C3136o877K6744l558l4684j7985M2772K797l7457N487R710R715J2351l6138
8741F013l2129L6692M7487l061k7170R692J3911J5441J2157j6554l8383k7390
8729c294K6279J4919n0084j4848K6644M6628M7813J330K5719m3818r073k853q486
8716E6876n638J6002K7701m168j0423l7497n663m669m334l02J4441K6989o759
8703F2556j8271n785k6170r60j2212k095K0683O396J0291M0010O351M4075m601
8690A20268m8657J3259k6187J3194L08L3374J4976K590k246k395n1997j2407N6161
8677A10241L1219k9151l4908K3331M7317L1733K7053j2039o8993m0044m648k41
8665H0870M5999L3331L78j8028P621k9341j5337J408k8807j610o673M6908L9063
$$ y = [33136, 26259, 53003, 49445, 14761, -3224, 39548, 42345, 4888, 10375, 20085, 29800, 42151, 6013, -26116, 10576, 58063, 55002, 27832, 37524, 51435, 66876, 79033, 62479, 24096, -3294, 22985, 37904, -12180, -27028, -384, 46244, 94057, 95387, 121106, 77288, 68215, 65362, 56876, 51238, 67240, 94941, 90773, 80350, 42853, 37190, 32521, 28187, 27885, 42326, 69315, 62556, 44285, 38500, 12330, 11370, -842, -2937, 17746, 24142, 34433, 74443, 80794, 124869, 120268, 71611, 84870, 58683, 71877, 72185, 105559, 120535, 123125, 120879, 118484, 66487, 54080, 110241, 141460, 112309, 77401, 100732, 148049, 179782, 206835, 194796, 125803, 85759, 81111, 80870, 126869, 160200, 160578, 142550, 150171, 120830, 105493, 106901, 78094, 76484, 69811, 116719, 155782]
8652A55782L8595j0954j4659j5685m2666j5490R863L5226M4893M1861K5630j0452
8640B41944J9339j5218o7613k3258q320L62M6895L3302j9059k8725k063M169N5868
8627B37623J2635r238j7775m0660M438k914K0166K858K6254L0911N4277R1947
8615D10522N5121l0988j6266J6629j0617o373J755n886j0796K8082J4574l573
8603D42184J6037k3411M514N8898K6710O742L4440K3162M7321K734l1109p34J9222
8590F26710l0465L6556N371l3215j5629l6582l476K3411l9954p4606o9176o083
8578C82862p2520j6030p45j7047m9598L780M133j0712O159j267k5599r174r300
8565A84942J2472m841l2595o1649j0973K1777M1059L1878K1590m3213L753L2359
$$ y = [155782, 194377, 183423, 168764, 153079, 110413, 94923, 104786, 140012, 184905, 226766, 252396, 241944, 261283, 246065, 178452, 155194, 146874, 147236, 194131, 227433, 208374, 179649, 177586, 181755, 237623, 250258, 241020, 223245, 182585, 187023, 184109, 204275, 207133, 233387, 264298, 318575, 410522, 465643, 434655, 418389, 435018, 424401, 418028, 419783, 413897, 403101, 431183, 445757, 442184, 458221, 434810, 439324, 498222, 524932, 531674, 566114, 589276, 636597, 639331, 608222, 607488, 626710, 596245, 632801, 638172, 604957, 589328, 552746, 549270, 572681, 532727, 458121, 388945, 382862, 310342, 294312, 293567, 276520, 226922, 230702, 234835, 224123, 230282, 229015, 203416, 194242, 184942, 197414, 192573, 159978, 98329, 87356, 109133, 150192, 182070, 203660, 160447, 164200, 196559]
8553A96559k5595j2201j0964k3891R072n078J2408Q659P581O388k6313k0092k0583
8540I5950j8824k5550K0138M3995j0393p120J5802J7263J2293o3871l7777J0971
8528E2877j8739K515K1900Q910K9639j069p2024l1716K1752K3878j1619J1137
8516C7441k39j7473P405O944l3648R888J7426L7457l0459l2406m107J971K6271
8503B6471L1521j7800M750r150m7747K0727J6451j2202m351J7825j0668o278K8565
8490C8114k8066j2319K4964k9704n251n395L3678l0608J4638l214m7181r709P774
8477e2279J8948J6398J1702N3497M3510j7838n9656k1460L5315J6312J1156j2412
8465D3193l4752j4359J3354j0453m577M202J444L1761P6601m5465o3481j0591
$$ y = [196559, 170964, 158763, 147799, 123908, 132980, 127902, 140310, 148969, 156550, 162938, 136625, 116533, 95950, 77126, 51576, 71714, 115709, 105316, 98196, 113998, 131261, 143554, 79683, 41906, 52877, 34138, 36653, 58553, 67463, 97102, 96033, 24009, -7707, 14045, 37923, 26304, 37441, 37202, 19729, 27134, 34078, 430, 10318, 27744, 65201, 34742, 2336, -1771, 200, 26471, 57992, 40192, 44942, 35792, -11955, 8772, 25223, 13021, 8670, 26495, 15827, 9549, 38114, 10048, -2271, 22693, -7011, -12262, -17657, 16021, -14587, 51, -3163, -50344, -60053, -52279, -33331, -16933, -5231, 48266, 91776, 73938, 14282, -7178, 28137, 44449, 55605, 43193, 8441, -5918, 7436, -3017, -7594, -3392, -1948, 29813, 106414, 60949, -2532, -13123]
8453a3123o972j168L3599K2161P256j8087K3631K80l2777l1075K3559L9974K0295
8440F7553j9659l0948L153R866q680M2015L0041k9293n8631j5149R296k547K00
8427b783J4872N2361J7026j1356j7340l1254j025l106K8097J8252n9038j8643
8415a3937J7454K7038L7616p823k083J1217L0599N528J239L9624r830m8508k0898
8402F7236j9675K856j4387l4019m5489q627J3425O467J6044K2743Q464K9811j1812
8389C3037j6353M3226R469l0751K1360P066l12j3533N7291q97j4919k7214J2848
8376H0318J6980k7782L651N1277l9353n0778L915L8715j4974K961J5441l7158
8364D3213j8937J3525K1617J5823k5737k2493K5586P952j5631j858k8218j1892
$$ y = [-13123, -20095, -21263, 12336, 34497, 41753, 23666, 47297, 47577, 14800, -16275, 7284, 47258, 67553, 47894, 16946, 20099, 29965, 21285, 63300, 93341, 64048, 5417, -9732, -436, -2983, -2783, 12089, 64450, 81476, 70120, 52780, 21526, 20501, 17395, 45492, 63744, 4706, -13937, 3517, 30555, 68171, 60348, 58265, 69482, 100081, 105609, 106848, 146472, 136642, 88134, 67236, 47561, 50417, 36030, 2011, -43478, -52105, -38680, -32213, -16169, 6574, 15038, 44849, 33037, 16684, 59910, 69379, 38628, 59988, 67054, 66742, 53209, 110500, 109603, 94684, 67470, 80318, 97298, 69516, 73167, 124444, 85091, 34313, 38228, 76943, 61969, 64930, 80371, 43213, 24276, 37801, 59418, 75241, 49504, 27011, 52597, 60549, 44918, 43060, 14842, 2950]
8352B950j3495L408K353k4843L2192M0405J1650k288P537l1351k1034j661l958
8339A865j0661J1267n198k8980R147Q8074N619k9691L498l0722J901j9709L8004
8326C4414J0024q620j8349j3436J3226N887k4577k6993J435J9499l986K341M6512
8313C7377L3L838j7004R899K9329m209r2760k1502K7450K0940k5010j5139K8042
8300a8716M0504k9271k6230m310N6341q083k1707J2465N0298J2237l4899j1686
8288A6943J1408l64K2546K8301m4752m6543J656K3538j5558j7749K2971j908J0588
8275A1077K4310L3462R262n328L8237J0696j2611p4375l2810L0852j8319o820
8263G633j3506K8052L6518l3682k8836m156l63J6009n25n685q650j5822J2662
$$ y = [2950, -10545, -7137, -4784, -29627, 2565, 42970, 54620, 52332, 59869, 28518, 7484, 5823, 1865, -8796, 2471, -2727, -31707, -22560, 65514, 71133, 41442, 44940, 14218, 16119, -3590, 34414, 44438, 35818, 17469, 4033, 17259, 23146, -1431, -28424, -26989, -7490, -11476, -9135, 37377, 37410, 41248, 24244, 34143, 63472, 59263, -33497, -54999, -27549, -6609, -31619, -46758, -18716, 21788, -7483, -33713, -38023, 18318, 10235, -11472, 993, 51291, 63528, 28629, 16943, 28351, 27987, 50533, 78834, 34082, -12461, -10805, 12733, -2825, -20574, 2397, 489, 11077, 35387, 68849, 78111, 72783, 111020, 121716, 109105, 34730, 1920, 32772, 14453, 7633, -5873, 22179, 58697, 25015, -3821, -7977, -8340, 7669, 7144, 1459, -7191, -23013, -10351]
8250a0351J727j3720J4165j7419N3672O2342L4261m7920n5564l0275J2877k0824
8238a7029l617L4790k1472n7130m746L5300k6623l938L0583L8412J3875j7145
8226A260k3782L2053L1862J8531J139l7747m4511K2967o447L597l8057n4733J8491
8213g5377L8154j8791N293O721k617M5081O81K6571l0659k664o455L0256L5813
8200E2007P378n8200k3568L2219o75o1969J9947L9985l7085k2120J6648K7740
8188g693K5446k4124L788L5202J5855k047k0890P440k2932l6472L507j2458l0725
8175f6103M0285J0819j356q800l5538n2916j0883L2240L2242N006J793M1974L1613
8162B0376r07k5112j3154J8106m329J1369J781j6223N204M4477j381J1012L0699
$$ y = [-10351, -8624, -22344, -8179, -25598, 28074, 90416, 124677, 76757, 21193, -9082, 3795, -17029, -20646, 14144, -7328, -64458, -69204, -33904, -60527, -64465, -33882, 4530, 18405, 1260, -22522, 9531, 41393, 59924, 61063, 23316, -21195, 1772, -4675, -1078, -39135, -93868, -75377, -37223, -56014, -50721, -44000, -46617, -1536, -855, 25716, -4943, -7607, -14062, 16194, 52007, 59385, 1185, -22383, 9836, 9161, -52808, -32861, 7124, -29961, -52081, -35433, -7693, 17753, -6371, -2583, 32619, 48474, 46427, 25537, 32977, 10045, -26427, -22920, -35378, -66103, -25818, -14999, -16355, -25155, -60693, -113609, -124492, -92252, -60010, -55004, -53211, -11237, 20376, 19469, -5643, -18797, -691, -5020, 6349, 8130, -8093, -2889, 41588, 40207, 51219, 81918]
8149H1918P514r438L850k0291j4576J045j0375j4380Q626Q612k7908k7573j4557
8136b7533J6439k1524o960K3976j3265M2576K4755l4577m7932k3461L1550L7427
8124A471M3113n620l6305k891j9652k029K0894K7301J9321l6541p078l0097N360
8111b2753L8446L1242J2086M572k1529j7805j3287k8554J6180K2771L6438J1173
8099F8980n7622n0682k094p599j6895L8747K1043K6124L9022K0658k6389l1690
8087B1603J1828o998l4946k2866p402k244L5713J5749J3163j2049j9195J4663
8075G019j9465j1940r147l6268L3527K5028j0503r083J2311K3607L15j4471L0143
8062B1073J9251m612K1818M1743P369O075k5363j212m0367L5341O5490j0912n4331
$$ y = [81918, 89432, 79994, 83844, 63553, 48977, 50022, 39647, 25267, 33893, 42505, 14597, -12976, -27533, -11094, -32618, -39578, -15602, -28867, 13709, 38464, 3887, -44045, -67506, -35956, 1471, 44584, 38964, 2659, -232, -19884, -21913, -1019, 26282, 45603, 9062, 1984, -28113, -22753, 15693, 46935, 59021, 63593, 42064, 24259, 10972, -17582, -1402, 21369, 57807, 68980, 11358, -39324, -41418, -49017, -65912, -27165, -6122, 20002, 59024, 79682, 53293, 21603, 33431, 26433, -8513, -31379, -38781, -41025, -5312, 10437, 23600, 11551, -7644, 7019, -12446, -24386, -33533, -69801, -36274, -11246, -21749, -30832, -18521, 5086, 5401, -9070, 21073, 40324, 35712, 57530, 99273, 106642, 112717, 87354, 86142, 45775, 81116, 146606, 135694, 81363]
8049H1363n6364K947R276p024M3645M9917L3342L135k7441k6292J8887M3311m827
8036A63875O905K3836j2193q618j8068K8651L1054k3548L491J608k8872J9696
8024A87817j7570m617L4515k6104p9273l0236M0590K4848N101J1659M0247J4307
8012B01284j460J3056J301J122J9226L8136k0725M3799Q3829P3492O4491K1135
8000E38686N1860N0787M6453k2978o6022l4322p0901M260K4153O882L7817L1920
7988E98595P1041Q2173M2802R670j19421j21461j13065r2057n9097k6986j9595
7977B52599k0428k661K3450L5853J9654k0664l9327K8504L1739j8706o6444j3310
7965B10259K7566L9679N3089L4607J1927R587L4068J0932P4556J15597P7462O9494
$$ y = [81363, 24999, 27946, 37222, 30198, 73843, 123760, 157102, 160237, 132796, 106504, 125391, 168702, 163875, 170780, 194616, 182423, 173805, 155737, 184388, 215442, 191894, 195385, 196993, 168121, 187817, 170247, 165630, 200145, 174041, 94768, 64532, 105122, 129970, 135071, 146730, 186977, 201284, 199824, 212880, 214181, 215303, 234529, 272665, 251940, 295739, 379568, 453060, 517551, 538686, 590546, 641333, 687786, 664808, 598786, 564464, 493563, 497823, 521976, 528858, 566675, 598595, 669636, 751809, 794611, 804281, 684860, 563399, 450334, 358277, 299180, 272194, 252599, 232171, 229510, 252960, 288813, 308467, 287803, 248476, 276980, 308719, 290013, 223569, 210259, 237825, 277504, 330593, 365200, 377127, 386714, 420782, 431714, 506270, 621867, 699329, 768823]
7953G68823N7571l8413n7973l518R195j5601l049L7978K7951L880j8533j03513
7941F64798j22933q5546o5065n5530k9746o625J7470o5771k4591J4393l4396n998
7929B00460j0349J3820K3596k3380m8356J2674K4660n067o157M3707J4992J3749
7917B54349q62K4294L7154L2656K365J8596j7474l4294K633L681R980n3371l2815
7904B46892j9242o026p398k8723n1605l7361K8532J8010r522J1299L3607m0961
7892A37502o9836l2753N0989M9353q700k4923j1885j3799K9057j5621p2612O69
7880A7441J504j1153j3699j0282m918L3415L4185j8295k3039L907P439p0662L2493
7867b1664O2181R694j7225K5894k0276m6243j2850L2411L2773K0904l1365m2026
$$ y = [768823, 826394, 787981, 730008, 726490, 735685, 720084, 717035, 755013, 782964, 786844, 768311, 664798, 541865, 456319, 391254, 335724, 305978, 299353, 316823, 251052, 226461, 240854, 206458, 200460, 190111, 203931, 227527, 204147, 155791, 168465, 193125, 188058, 181901, 225608, 240600, 254349, 253487, 277781, 314935, 347591, 349956, 368552, 351078, 316784, 319417, 323098, 333078, 279707, 246892, 227650, 221624, 214226, 185503, 133898, 96537, 125069, 143079, 133557, 144856, 178463, 137502, 67666, 34913, 85902, 135255, 126555, 101632, 89747, 75948, 105005, 89384, 16772, 17441, 18945, 7792, -5907, -16189, -21107, 12308, 46493, 28198, 5159, 9066, 16505, -54157, -21664, 40517, 50211, 32986, 58880, 38604, -7639, -20489, 11922, 44695, 65599, 34234, -7792]
7855g792n3030j8997J2156j680J4425k6680n372K1009Q188R600l772l611M1937
7842a3619L0945J381L139k4394j1066J2951j1931j376K6969N7889L0698m466j9106
7829G8014k1476k009L1808Q191m6135o6613j9766J3829J8433J7894Q282J528R107
7816C1087J8029k454l5078j705j6038k5798Q600J0006R067j3502N513L4981j8757
7803C951O219N1587j67k6380j5780J0442L8618k59n5776k9618k3712J2262K7808
7790h05k3206P139K6385P1789J6062n582k5271m2133k1092J0194k9367l5022K0910
7777b9999Q116k7794l3717k654k1938L2448L7315K1055Q726j6524m374l922k7129
7764f0391M9364O610J3151k9743j2535k907m642L440K4893K345K4820R246m9645
$$ y = [-7792, -60822, -79819, -67663, -69343, -54918, -81598, -86970, -65961, -57773, -48173, -51945, -55556, -13619, 17326, 18707, 21846, -2548, -13614, -663, -12594, -13970, 12999, 70888, 101586, 97120, 78014, 56538, 54529, 86337, 94528, 48393, -18220, -37986, -24157, -5724, 12170, 20452, 21980, 31087, 49116, 46662, 11584, 9879, -6159, -31957, -23357, -13351, -4284, -17786, -12273, 22708, 3951, 10170, 61757, 61590, 35210, 19430, 29872, 68490, 68231, 12455, -17163, -40875, -28613, -805, -24011, -16872, 9513, 81302, 97364, 91782, 66511, 24378, 3286, 13480, -15887, -50909, -29999, -21883, -49677, -83394, -86048, -107986, -75538, -38223, -17168, -8442, -24966, -29340, -33262, -60391, -11027, -4417, 8734, -21009, -33544, -36451, -41093, -37653, -12760, -10415, 14405, 23651, -25994]
7751b5994m6586l201J9880M8372J885n954j1832l188j2115n276J018P734J9401
7738a5856J3447q84J2715k8095l8260K2438J7746j6428r649m868R943L1146k712
7725i317l832k2482J5269m0785J8821L6805K2991l1891m003L629J9802L0249R487
7712D4743o3234M4853K8497j732p98n4662n0857p107J0967L829M3051J7254K1098
7699C5902K1102l1923k8739j6617j6752J0420L8398k2190k7257n4105l6005J211
7687a26555N5579L440k8810M7246L8567m317L8333J8959J3044l4888n952k2359
7675g713j7412J1770J4315m973m8764j8445O459M2437j4622n7988l1034O3158
7663f2812K5248l856J6390K11J5160j9890J0946J8831P132L5439M018j4657k9187
$$ y = [-25994, -72580, -75781, -55901, -7529, -5644, -11598, -23430, -26618, -38733, -44009, -42991, -35257, -15856, -2409, -3293, 9422, -18673, -56933, -34495, -16749, -33177, -42826, -47694, -37751, -6605, -9317, -13149, -35631, -20362, -61147, -42326, -5521, 17470, -14421, -18424, -14795, 5007, 35256, 44743, -18491, 26362, 54859, 53127, 52329, -2333, -53190, -60297, -49330, -45501, -2450, 14804, 35902, 57004, 25081, -3658, -20275, -37027, -26607, 11791, -10399, -37656, -91761, -127766, -126555, -70976, -67536, -96346, -49100, -10533, -14850, 23483, 42442, 55486, 20598, 14646, -7713, -25125, -13355, 960, -4013, -52777, -71222, -64763, -22326, -36948, -94936, -125970, -62812, -37564, -41420, -25030, -24819, -9659, -29549, -18603, 228, 7360, 42799, 46817, 32160, 2973]
7650B973j9669M904R100k6302L9330J5733o8641J644o868J9169J0480k0985k95
7637c9427J8943L7668o948n249K2496J1633k3499k8831j0531J5171J9278l2471
7625b1767l2571K5727J8635K1166N0429K3912m6252m0755q376n176k4153n407
7613d4588o658q994n758J8975K4872m8805j5407L5770M0782M1342J3929p5Q266
7600E3651j2762J5331L0878n793n5752k4168p758K0378j294o0689k635J0220p940
7587d8333k0498r202K3995M2526K8082K312M765K7638K1207j6441p188r067M535
7574D4331J3258m9028r647n5007m9175L7433L9514o965l5611R843Q424j0027K8757
7561c3900m891l0336M193o613K667q490j2097k687J1246J6876N723k3177J8381
$$ y = [2973, -16696, -11792, -2692, -28994, 10336, 26069, -42572, -40928, -47796, -28627, -18147, -39132, -39427, -20484, 17184, 10236, 4987, 27483, 39116, 15617, -13214, -23745, -8574, 10704, -21767, -54338, -28611, -9976, 11190, 61619, 85531, 39279, -1476, -9852, -15028, -39181, -44588, -51246, -60240, -65998, -47023, -22151, -70956, -86363, -50593, -9811, 31531, 45460, 45385, 53651, 40889, 56220, 87098, 81305, 25553, 1385, -6373, 14005, 12711, -47978, -50613, -40393, -48333, -68831, -78033, -54038, -11512, 16570, 18882, 23647, 51285, 72492, 56051, 48863, 39796, 44331, 57589, 8561, -1086, -56093, -105268, -67835, -28321, -35286, -70897, -61054, -52630, -62657, -33900, -38791, -69127, -64934, -71547, -68880, -77370, -89467, -92154, -80908, -64032, -58309, -81486, -63105]
7548f3105P1400K6318n208J2235M348k6694R677K1650n014m2730K7283J6142o490
7535C9812n344k185l6895r351K3222q104j1083L4888J8791j2566o08l896K063
7522B8744k2816J0949l7509j9777K2964N7806L5322l2712j4277N855k682J2295
7510D4162k0668p327K1829K7788K7640o2323o9323m973J8403O319J1448J6840
7498I815l0077o276m4633J0402K641K1776M5021k212R279n8206q187K0797k4351
7485e4211K8179M2763m0516k5063L9199Q74j7029J9323P946L9976k4669k5769
7473h997J940J8641R993l7193k8941K5977J135j4353M9211n80m3605m3717q71
7460g1360M3446J7999j0549M3016M2785l7060m7725R352K2522J1191L4765R020
$$ y = [-63105, 8295, 34613, 29405, 41640, 45988, 19294, 28971, 50621, 45607, 2877, 30160, 46302, 39812, 34468, 32283, -4612, -13963, 9259, 1155, -9928, 24960, 43751, 31185, 30577, 26681, 28744, 5928, 16877, -20632, -40409, -17445, 40361, 75683, 42971, 28694, 34549, 31867, 44162, 23494, 16167, 37996, 65784, 93424, 31101, -38222, -43195, -24792, -18473, -7025, 9815, -20262, -26538, -71171, -60769, -58128, -36352, 8669, 6457, 15736, -42470, -50657, -29860, -54211, -26032, 16731, -23785, -48848, -9649, -8775, -25804, -6481, 1465, 41441, 16772, -8997, -7057, 11584, 21577, -15616, -44557, -18580, -17445, -31798, 17413, 16833, -26772, -70489, -71360, -27914, -9915, -20464, 22552, 65337, 28277, -19448, -10096, 12426, 23617, 58382, 67402]
7448F7402l3821l7063n2503q610L3758M1229K6626p08k101p227l0904j261J6435
7435A1252j1334l8004J9120L1712L765l5029j6420L0596J48P4m4690k0442J9582
7422d9670J4776O19J3086l2508m171l499k1948k390J6444o386K7259N356j7957
7409f0989M5019L1224L3989J5591p550n6039j2460J738j8232j1905K721k5164
7397f2057k1141K113m993J6408M3626P4544J8829l9474l8303l8947n5862k189
7385a07446K8439K7366L1483r383l2942j6469K7164J2316l4441j3524K158j0810
7373i6089K7229K9846j0903k16J5024J7237k27k3654Q813m5814n541L9924K0045
7360b4326J0393l6471k262J074J3008J7686J956J1772j8675o0236L2320M7452
$$ y = [67402, 33581, -3482, -55985, -64595, -30837, 10392, 37018, 36310, 34209, 26982, -3922, -5183, 11252, -82, -38086, -18966, 12746, 16511, -18518, -34938, -4342, -4194, -4120, -48810, -69252, -49670, -34894, -34275, -21189, -53697, -57868, -61367, -83315, -85705, -69261, -75647, -48388, -43032, -60989, -15970, 15254, 49243, 64834, 57284, 1245, -11215, -9477, -27709, -39614, -36893, -62057, -83198, -81085, -86078, -69670, -26044, 48500, 67329, 27855, -10448, -49395, -105257, -107446, -79007, -51641, -20158, -29541, -62483, -78952, -51788, -39472, -73913, -87437, -85279, -96089, -68860, -39014, -49917, -50133, -35109, -17872, -18099, -41753, -32940, -78754, -84295, -44371, -24326, -13933, -50404, -52666, -51592, -38584, -20898, -18942, -7170, -25845, -86081, -53761, -6309]
7348f309j2172j7428L0502M082l2555M9081p241j2245J8070N824j2246J4381k1438
7335C06l7691K7472N1215J9023k3643m3709n033k5133L9050K3857M109L0687K1289
7322H1799k3235K35j279J6646L229j3117m34j7785j6169m0691O858k7772j3886
7309d5601L824P212n68l1953P110K1276K9744N207j0431j6799m8655l873k3669
7296a07176K9681l75M0687J1460K6469J6206P508k1501k7828k0755L5807j692
7284a1509k389K2581L4232m4904K2018N8881j6078k3251L178k9658j8953O911
7272A059k7301O81K7472k8774J6252K8973J0945R038m6006o0953J757j7467K7761
7259e6563K1796R313N884L833J2980j8577N695J4362n7016l2295k5762L103O0112
$$ y = [-6309, -18481, -35909, -5407, -1325, -33880, 15201, 7960, -4285, 13785, 19609, 7363, 21744, 306, -37385, -9913, 41302, 60325, 36682, -7027, -12060, -37193, 1857, 25714, 29823, 60510, 81799, 58564, 58799, 57520, 74166, 77395, 64278, 63844, 46059, 29890, -10801, -3943, -31715, -45601, -41777, -34565, -35133, -67086, -59976, -38700, -8956, -3749, -14180, -30979, -79634, -83507, -107176, -77495, -77870, -37183, -25723, 746, 16952, 24460, 2959, -24869, -45624, -9817, -11509, -13898, 8683, 42915, -1989, 20029, 78910, 62832, 39581, 42759, 13101, -5852, 1059, -26242, -25561, 1911, -26863, -10611, 18362, 29307, 38345, -7661, -68614, -66857, -84324, -56563, -34767, -25454, -19570, -15737, -2757, -21334, -15639, -1277, -58293, -90588, -116350, -113247, -53135]
7246e3135J3084o280j3575j6757L1269L1395J5747k5489P86J6668n284q193j5060
7233c4824j255k8188J0924L2659K0214l6879L7865K6769k1213j1338k55J8883
7221A3362q305m0988K1370o957j9571j569m286j431r492J4634K9735j6779j6836
7208d7113O5109P082k0067L0438J5821k0995m1645l1590j4823L9079j394k125
7196b2223j9740J5617o192J0965J7746J454M1954K8180l4250l0972j3094j748
7184a2303m939K5926L7090j7790r905P278q70m7137q255J0083j5030M0684J580
7171F412q763J9507n739O004l8696J8695K7798k4215l1233K7143K9379n1536K4495
7158g49k7962k4417l6349J6464M771L0469L1254m0465K7313R977m1341O627J4034
$$ y = [-53135, -40051, -46331, -59906, -76663, -45394, -13999, 1748, -23741, -22955, -6287, -11571, -19764, -34824, -36079, -64267, -53343, -20684, -470, -37349, 516, 27285, 6072, -5266, -5521, 13362, 5057, -35931, -14561, -21518, -41089, -42658, -46944, -48375, -57867, -43233, -13498, -30277, -47113, 17996, 25078, 5011, 35449, 51270, 30275, -11370, -42960, -57783, -18704, -20098, -22223, -41963, -26346, -32538, -21573, -3827, -2373, 39581, 67761, 33511, 2539, -10555, -12303, -17242, 8684, 45774, 27984, 18079, 25357, 24487, -22650, -30905, -20822, -35852, 4832, 6412, -2351, 17156, 11417, 17421, -21275, -2580, 25218, 1003, -30230, -3087, 26292, -25244, -749, -28711, -53128, -89477, -73013, -68242, -37773, -6519, -46984, -19671, -9694, -51035, -44408, -30374]
7145c0374M5975j2673j3570L622K6517l2206l3453K3205K6236l9621k0775j7812
7133g4929L886N51K4819m36O106K7198L1312l1988n5166j151L5303K8958k3774
7120b9311l4728O706o908j4659J9666K7997K3460k0189k0703J7191J5354j3442
7108b9566M1621L4780k7893j848m7922P550J0084K3519J423j9578m3461J1037
7096d0254K1468R283K2099L1396o424M0941r696l813J3458m1380o9569l9208o944
7083g8643K1987M7934j9637q213N2180J9077m2813j0841m153R901J3082j7830
7071a7969J1601j502P118L480J406J810L3645l98l6827n9325P11K7974K3419K4284
7057A9427L088m2761j6469j0786k4020j8743L6196J9900j2342L1350J7216L0158
$$ y = [-30374, 15601, 2928, -10642, -7020, 19497, -12709, -46162, -22957, 3279, -36342, -57117, -74929, -71043, -70492, -45673, -46109, -40003, -12805, 18507, -13481, -68647, -69798, -34495, -5537, -29311, -64039, -57333, -64241, -78900, -59234, -31237, -7777, -27966, -48669, -31478, -16124, -29566, 12055, 46835, 18942, 17094, -30828, -23278, -13194, 10325, 11748, -7830, -51291, -40254, -18786, -9503, 12596, 43992, 37568, 78509, 68813, 65000, 78458, 37078, -32491, -71699, -78643, -56656, -8722, -28359, -36572, 15608, 34685, -8128, -18969, -23122, -13221, -139, -17969, -6368, -7870, -752, 2728, 4134, 5944, 39589, 39191, 2364, -56961, -56250, -28276, -4857, 19427, 22515, -20246, -36715, -47501, -71521, -90264, -54068, -34168, -46510, -15160, 2056, 32214]
7045C2214L262o3638l3333M1261K4266K027K4634m723l7207n9517m4133k4M0632
7032g4279L5554k5908j1739N2043L7730k9313l1398J2585K1754K4063j94l2443
7020b1545K1170j7285j902J3871l3093j7723J7403K3944J4252k1901j9511K6139
7008a6181J9671l091m5981m9708O0055M0620r510m9056k2528K7490O5156Q344
6996B5281l9162l2403J531j0736k6909K465M2869K1489P249r436k0980J873r113
6983d5982M7000J3640j7472P841K4816N361o167K539p9180j1953M3365J5644k2549
6970b3097J386L946J2902J8099J0578K7374J2266j8097m5923l4999l3504K2177
6958d6892O3386J3912o038k996J4721M589k1625O117l7132J4384M399j6488m077
$$ y = [32214, 35476, -28162, -61495, -20234, 4032, 6059, 30693, 25970, -11237, -70754, -114887, -114911, -74279, -38725, -64633, -76372, -24329, 13401, -15912, -47310, -34725, -12971, 11092, 10898, -21545, -375, -17660, -19562, -5691, -38784, -56507, -39104, -15160, -908, -22809, -42320, -16181, 3490, 399, -45582, -95290, -35235, 5385, -4125, -53181, -75709, -48219, 16937, 25281, -13881, -46284, -44753, -55489, -82398, -79933, -37064, -15575, -8326, -17762, -38742, -36869, -45982, 1018, 14658, -2814, 5027, 29843, 35204, 29037, 31576, -47604, -59557, -16192, -548, -23097, -21711, -17765, -4863, 13236, 23814, 51188, 63454, 45357, -566, -35565, -69069, -46892, 16494, 30406, 24368, 21372, 36093, 40682, 19057, 25174, -11958, 2426, 6825, -9663, -13740]
6945a3740p267K534K2618K0042l6505p405J7058k6151l4951k582j0364Q8893M4679
6932E6859n2315K3245k784m3194J3758M4083N138k1135l8686K8596M854j8141
6920B78Q177L9833J7813k0508o9360m3221L775M5135k3007k728j6375L5568O3
6907b4557p934j509j4312k0244N9295K5429n0o5554O405p557K4276M4822j5332
6894C178m5431r853k4244K9898j1042J5580P857J0565L7272J1461l8976r865J4626
6881h974J6532L0893k6633o268o288K656j9090o385J3475J0845l5844j6565k4917
6868g6563M2529J4159J1549J5490J904j6504K556j790j0871L7898M0797J9557
6856H0711n0106n7577j7872M7942L5883J9886k1755j0190Q222J471N2814J1919
$$ y = [-13740, -21007, -18473, 4145, 24187, -12318, -19723, -2665, -28816, -63767, -66349, -76713, 12180, 56859, 4544, 27789, 25005, -18189, -4431, 39652, 44790, 23655, -15031, 13565, 18419, 278, 8455, 48288, 66101, 45593, -23767, -66988, -63213, -18078, -41085, -43813, -60188, -24620, -24557, -32491, -34000, -48312, -68556, -9261, 16168, 16118, -49436, -43031, -50588, -26312, 18510, 3178, -42253, -52106, -76350, -46452, -57494, -41914, -34057, -23492, 13780, 25241, -13735, -23600, -8974, 7558, 38451, 11818, 5550, -738, 1918, -17172, -23557, -10082, 763, -35081, -51646, -76563, -34034, -19875, -8326, 7164, 9068, -7436, -4880, -6670, -17541, 20357, 61154, 80711, 30605, -26972, -44844, 3098, 38981, 58867, 37112, 26922, 35144, 36615, 89429, 101348]
6844A01348k2554l9621k850k1188j9186j8838k4142k6929N875O7174M9828q113
6832D0804j6498J2094m246k0516L0900o918J3604N0047Q745l7116o0754r101j8339
6819a7294J5366J9426J7229j0988j0852j7994r013J8377L0952k7700n380o251
6807d122n1597L2748L7650k1393k3228k491K4609K8120j2363k1970k0128l564
6795c7729J154j536q350k2787K9977K2451O265P149j4718k198M3902L0389p713
6782D6256l7613n0294k6352J1859O3675L8312m0633n964L5843J435m4820j076
6770i372j1972L2593K4253o661m361j8697k4197l0351m3633K5420n095K5718J1138
6757c5217K1776J6593O981O118j1547J9142J9208j9293p2294j9106j0786J5882
$$ y = [101348, 78794, 39173, 36323, 15135, -4051, -22889, -47031, -73960, -68085, -911, 48917, 40804, 24306, 36400, 32154, 11638, 42538, 35620, 49224, 99271, 108016, 70900, 10146, 1045, -17294, -1928, 17498, 34727, 23739, 12887, -5107, -14120, 4257, 35209, 7509, 2129, -4122, -55719, -22971, 14679, -6714, -29942, -32433, -7824, 20296, 7933, -14037, -34165, -37729, -36575, -38111, -46461, -69248, -39271, -16820, -10555, -3406, -18124, -20322, 23580, 53969, 46256, 8643, -41651, -68003, -56144, 7531, 45843, 5210, -754, 35089, 36524, -8296, -9372, -21344, 11249, 35502, 28841, 24480, 5783, -18414, -48765, -92398, -66978, -72073, -46355, -35217, -13441, 3152, 10133, 16251, 4704, 23846, 43054, 23761, -48533, -67639, -78425, -62543]
6745f2543M0701j17J6408P1161J5971l0354O705Q860J6402m3123m0097j0027J0705
6732F52K3184K4403M2967O579j0637L2729J7557j962J426M1071J5375N3584J03876
6719C50804R6221Q2442P0134o048j30032j35048q5571m0130n0424k3237j9269
6708A09842l2131L200j7591o404j4473l1693k1128l9011m9588K5779L6489q338
6696d5047k1887m069J4326N9204J9645n4986p4732j666K6201K0063L1686K5976
6684e286J2697J426j3025n264J1925K8695K8207m1732M844M4218k322K661m1700
6671B5344L350l4148Q528j9422q498K4492j7692l5413l2632J9644L5259M6114
6659A4926j5528n301J8169l9584K3756K6768m4708j3646Q129n283j9636j2412
$$ y = [-62543, -21842, -21959, -5551, 65610, 81581, 51227, 57932, 66792, 83194, 40071, -26, -10053, 652, 23836, 48239, 91206, 97785, 87148, 119877, 137434, 135472, 136898, 177969, 193344, 246928, 350804, 447025, 529467, 599601, 593553, 463521, 328473, 242902, 202772, 152348, 129111, 109842, 77711, 80911, 63320, 56916, 42443, 10750, -10378, -49389, -98977, -73198, -36709, -45047, -66934, -71003, -56677, 2527, 22172, -32814, -107546, -109212, -83011, -62948, -31262, -5286, 7411, 8837, -4188, -9452, 2473, 31168, 59375, 17643, 22487, 66705, 64383, 67044, 25344, 28694, -5454, 3074, -16348, -24846, -354, -18046, -53459, -86091, -66447, -31188, 14926, -602, -5903, 12266, -27318, -3562, 23206, -21502, -35148, -27019, -32302, -51938, -64350]
6647f4350K591j5622J6881K4638j7075K0358N3106K4035q891k6901K9309J006
6635C9085l3048k4774N727L6912r874j1007K0035L031p949L524m9358l2893l090
6622f3679O7940L2243M076J4654M0968M9056L5018k7286q9585o2042J4728L2389
6610D8480P043l5121j2664K2615Q753k2434k5714k2672j0867n706K0668j6956
6598d4575j7103R858k71j630j0748J5464L5520J1535P656n2974P837J8278L7255
6585A6102p22j1390N224R242k0807k0791k590k0840Q465k374j4023l1482K5081
6572f0905O3238M0169j4310j9529J1237n60j1505l132k0281l1673j042M627J6894
6559b6772J8679O911n719m2030M9007L4183K953n1921k3066q281J5508R586M3814
$$ y = [-64350, -61759, -77381, -60500, -35862, -52937, -32579, 20527, 44562, 35671, 8770, 38079, 39085, 6037, -18737, -13010, 23902, 14028, 3021, 23056, 26087, 18138, 21662, -27696, -60589, -63679, 4261, 36504, 40580, 55234, 96202, 145258, 180276, 152990, 63405, 1363, 16091, 48480, 55523, 20402, 7738, 30353, 39106, 16672, -9042, -31714, -42581, -48287, -27619, -44575, -61678, -51820, -52091, -53721, -64469, -49005, -13485, -1950, 5706, -47268, -39431, -21153, 16102, 15380, 3990, 9214, 18456, -2351, -23142, -25732, -46572, -38107, -40481, -54504, -85986, -60905, 2333, 42502, 28192, 8663, 19900, 19340, 7835, 4703, -15578, -47251, -48293, -43666, -26772, -8093, -1182, -6901, -48931, 76, 34259, 37212, -14709, -37775, -46056, -30548, -20962, 22852]
6546B2852j6822l7585k2852J5591O1343K1123q192m143l1016K1133L0812Q310
6534F0554K8784l0571P828j7469j0383O317k2372l1713m0317M3834J4267K439
6522A1198J8654k063l675n394k489K115m1638p125O819k0149k379J4684K5088
6509f354O0404K5961m4683m3341m4287K633L8687L7777o082O57K8308p624K2345
6496F4401J9953K2484n6843m0468j8144j3816J6155Q635J1525k6812m5478K5754
6484c2654J8205p729n0125N395J6658M8801J8162j2836k3765m157m130n364k0499
6471e4038O0991K8025n3115k43m0489l1296J4125J8658k3062K6796N169J580J8289
6458b8610k2958l6867K2888O4361J072J390K6563j8132m8371J5760J5448J8776
$$ y = [22852, 6030, -31555, -54407, -38816, 22527, 43650, 35458, 31315, 299, 21432, 52244, 60554, 89338, 58767, 66595, 49126, 38743, 45060, 22688, -9025, -49342, -5508, 8759, 11198, 29852, 27789, 24114, 18720, 16231, 18346, -23292, -30417, -23598, -43747, -46126, -31442, -6354, 54050, 80011, 35328, -8013, -52300, -49667, -10980, 26797, 20715, 21372, 49680, 42056, 64401, 84354, 106838, 49995, 9527, -8617, -22433, -6278, 2357, 13882, -12930, -58408, -32654, -14449, -22178, -72303, -66908, -50250, -1449, 16713, 3877, -19888, -24045, -28175, -33539, -54038, 6953, 34978, -18137, -18380, -58869, -90165, -76040, -57382, -80444, -53648, -48479, -46899, -28610, -51568, -88435, -65547, -1186, -114, 1276, 27839, 9707, -38664, -22904, -7456, 11320]
6446A1320o470k445r4334k6071J2736L7491k1360L3862j0644l7523L039J6828
6434h3571J3730n083M9385M8789L691m597O389k455N849l358J0537k2608l4829
6421a8131m0405O952r053p525R868P7863M6973r101j0776k1157k0773K4614O675
6408C6024L801K1326j4323l6356j7733n1799o888M8821J1155J3006k2619K19K794
6395a2572k9637L7553K4345n6025L434l652o477l5618J9041j7268R787K3911j8491
6382f1669j5175K9608O1452O0459j8853m6537j45J7081n574L0133m5535l2746
6370b7501O203m5946o7562j1559M8266N4874r934j9992J5592K6681O607j6233
6358d0504j1035N4374l8229n1636l5435p671N6665N972m6179J3681N8342m168
$$ y = [11320, 4850, 2405, -91929, -118000, -105264, -67773, -89133, -55271, -65915, -103438, -100399, -83571, -69841, -74924, -25539, 23250, 26941, 22344, 28733, 26278, 32127, 28769, 39306, 16698, -18131, -58536, -51584, -60637, -68162, -58294, 19569, 66542, 57441, 46665, 25508, 4735, 29349, 36024, 39825, 61151, 46828, 10472, -7261, -59060, -65948, -17127, -5972, 7034, -15585, -15366, -12572, -42209, -4656, 19689, -36336, -32902, -36554, -43031, -78649, -59608, -76876, -67089, -43178, -61669, -76844, -47236, 14216, 74675, 55822, 9285, 9140, 26221, 20647, 50780, 5245, -27501, -21298, -67244, -134806, -146365, -98099, -43225, -53159, -73151, -57559, -30878, -24271, -40504, -51539, 2835, -35394, -87030, -122465, -130136, -73471, -67499, -113678, -99997, -41655, -45823]
6346d5823r571L2195M0982k2748O038r676k6656j2124K9820j6514j2309N4475
6334H089J8386j8238R020K7132J0328L955n5355n6662J8001J8362N0381L4522
6322F7921J8281m9050k3465l9817J4339M1616m1897l7309K0752K2821m770k0214
6310c0792L9417M2059J1834M686j3910r632m7044k1620L2390J8896l702j4822
6298G760j3686L3330K6952J0491k4778l6194P176k6659q230L5607l396K5841K3945
6285E8159J1201l0462J2942L598n3354K339r989J0093J6843q263J7521q720j5228
6272F680J011l2275r540K9614J5899j3723J4105L535l3481j3677j5324N7875N1859
6259F2558m5097m1333J2343N3452K6417J7084l1569k658l33p788l6928q507k6060
$$ y = [-45823, -55394, -23199, 17783, -4965, 1073, -8603, -35259, -47383, -17563, -34077, -46386, 8089, 26475, 8237, 17257, 44389, 54717, 58672, 3317, -53345, -35344, -16982, 33399, 67921, 86202, 37152, 13687, -26130, -11791, 29825, -12072, -49381, -28629, -5808, -10578, -30792, 8625, 50684, 62518, 67204, 53294, 43662, -3382, -25002, 7388, 26284, 22582, 7760, -5926, 27404, 54356, 64847, 40069, 3875, 11051, -15608, -23838, 11769, 8373, 34214, 58159, 69360, 38898, 51840, 55438, 2084, 4423, -5566, 4527, 21370, 13107, 30628, 21908, 6680, 7691, -24584, -34124, -4510, 11389, -2334, 11771, 15306, -18175, -31852, -47176, 10699, 62558, 17461, -23872, -11529, 41923, 68340, 85424, 53855, 51197, 50864, 43076, 6148, -2359, -28419]
6246b8419k1944K7638J6876j0665m049P773j0283k1949l3174j6574K7972K6770
6234d0028M0292k621n987R822J0736J0431J1217J789l7266j428J7664J952P983
6221B4556J3547k9294L0630M6220m2857m8777j2909M493j4150l5282l3123M0229
6209e6717N0386K8669M331k6981R625j1547m09K8912k1929J2695l446j4244l1403
6196c2058m482K3743N0024L0069j2248O589N434l4162j607j5358k3845k2043L4280
6183D336R916O661O9282P590m1480m7595q988J2431M294Q684J0875n4436k7089
6170d5519M0535K2991k6679M0497K7965K4907k4540j030J8197k3973j647k087
6158D9617J5865k7866J3217K1593o8372j8390O945J7640L92k14K5066k3135L6621
$$ y = [-28419, -50363, -22725, -5849, -16514, -20563, -12790, -23073, -45022, -78196, -94770, -66798, -40028, 264, -2357, -8344, 1478, 12214, 22645, 33862, 35651, -1615, -3043, 14621, 16573, 24556, 38103, 8809, 39439, 85659, 42802, -5975, -18884, -14391, -28541, -63823, -96946, -56717, -6331, 22338, 26669, -312, 9313, -2234, -2643, 26269, 4340, 17035, 13589, -655, -32058, -36540, -12797, 37227, 67296, 55048, 61637, 67071, 32909, 31302, 15944, -7901, -29944, 4336, 14252, 20913, 90195, 97785, 56305, 8710, -278, 12153, 16447, 25131, 36006, -18430, -45519, -4984, 18007, -8672, 31825, 59790, 84697, 60157, 59127, 77324, 53351, 51704, 49617, 65482, 37616, 50833, 72426, 4054, -14336, -7391, 10249, 10641, 10427, 35493, 12358, 48979]
6145D8979L4329l1747l489j787l7710j4280M1421j4395k8808k5512p614K8750
6133a1863N1145m0154o977N37L482L6328n551j5383l889J7894Q217l127m6242
6120a5583l7681p966K5060L2995L6218Q662m198m426m281j5088N5678j5654n8400
6107d664m2700K4524J5708K6593j0139o0928m6108n522L890M5193J4139M177Q376
6094b7461J9825K5610R549j7484j3933J9091Q715l6226m8426N189M1940k3978
6082c7589K425N1491J6916p026k3675m8403k3124j572L1692L1469N0616j9740
6070B3480r679l510M0516l2050l2345j6430k4540j324J3439Q155j2313J3676N2918
6057A9993L9688J8673j9453j7831m5567k6042q1n293M5807J8054l1236r689J9149
$$ y = [48979, 83308, 51561, 48072, 46285, 8575, -5705, 35716, 21321, -7487, -32999, -40613, -11863, 39282, -872, -7849, -7312, -3830, 32498, 26947, 11564, 7675, 25569, 33786, 30659, -15583, -53264, -61230, -36170, -3175, 33043, 41705, 37507, 33081, 28800, 13712, 69390, 53736, -4664, -47364, -22840, -7132, 19461, 9322, -51606, -97714, -103236, -99346, -54153, -40014, -35837, -27461, -7636, 17974, 27523, 10039, -3894, 15197, 23912, -12314, -60740, -55551, -13611, -37589, -35164, 16327, 33243, 26217, 2542, -45861, -68985, -70557, -38865, -7396, 43220, 23480, 13801, 10291, 50807, 18757, -13588, -30018, -54558, -55882, -42443, -34288, -46601, -32925, 19993, 59681, 78354, 58901, 41070, -4497, -30539, -30620, -35913, 9894, 27948, -3288, -12977, 6172]
6044F172K1675j4062n5021J7073L3194M7098j132o7741m0762p167M9956O921l9894
6031d3690j8640Q646n650j0060M484N2570j4971q278J06j8271L165K9963K8332
6018G706k0062k3321K7302Q340m8371k1389R756L2759J0640k2217L0732L4004
6006B5879J8398P223m9008J1473J7875L6004K9320O683O409n8105k5256L391j4763
5993A5523j9977o1086k4546J3228k498N363l4028Q614j3549K9992L4497p3O2594
5980A4054M8924O694o346m826l4174m1180j3073l7753k9666J6510J6603J3320
5968e0913K6475P2368J3332j0315j6151l0398k5135L6134o426j6775j6738k0340
5956d4882q4o095J2545O83K8180J8861M391j1419p464J2055o590Q919j3903k3277
$$ y = [6172, 27847, 13785, -41236, -24163, 9031, 56129, 54997, -12744, -53506, -60673, -10717, -3796, -43690, -62330, -53684, -59334, -69394, -64910, -12340, -27311, -35589, -35483, -53754, -50589, -20626, 7706, -12356, -35677, -8375, -35, -48406, -69795, -60039, -27280, -16640, -38857, -8125, 25879, 44277, 51500, 2492, 13965, 31840, 67844, 97164, 103847, 110256, 52151, 26895, 30286, 15523, -4454, -65540, -90086, -76858, -79356, -73993, -108021, -99407, -112956, -82964, -48467, -48540, 14054, 62978, 69672, 63326, 58500, 24326, -16854, -29927, -67680, -97346, -80836, -64233, -50913, -24438, 47930, 61262, 50947, 34796, 4398, -20737, 15397, 8971, -7804, -24542, -44882, -44966, -51061, -38516, -37833, -9653, 9208, 13599, 2180, -5284, 6771, 181, 9100, -4803, -28080]
5942b8080k6606j7000Q780L1978L2833r680l0782k0070k5795N748J4093L3880
5930c0701L0118L8575j6221k5693P445r209k8157K8068J9582J3171j0788k1752
5918e562q641K0742K6752k7346r334J0064K0705J7745k3845k547L2447n183l203
5905D2794l6555l7634q810m2968K0186O3302J281j856M3568M321j8542Q014j6475
5892B0626k8706k6387L003M240o192J8561M3754j3417l8476J5699J6078L6660
5880D5443m275j8816m938k2923k5495k4045j5027J5720J6747k7439l5314L173
5868i7189k31L1625J6661K0585K8523K0316q179O756j4378j4138J7576K6257M4473
5855G8657N629o830o0002k0665O0863l634l9246m5993j8768M0960k887L0173J5231
$$ y = [-28080, -54686, -71686, -62906, -30928, 1905, -7775, -38557, -58627, -84422, -78674, -64581, -30701, -583, 37992, 21771, -3922, 3523, -5686, -33843, -5775, 13807, 26978, 16190, -5562, -14203, 6539, 33291, 5945, -3389, 6675, 27380, 45125, 21280, 18733, 51180, 45997, 42794, 6239, -31395, -40205, -83173, -62987, 315, 1596, -260, 43308, 47629, 29087, 37101, 20626, -8080, -34467, -31464, -27224, -33416, -14855, 28899, 15482, -22994, -7295, 8783, 45443, 41168, 22352, 17414, -5509, -31004, -55049, -70076, -54356, -37609, -65048, -100362, -97189, -97420, -65795, -49134, -28549, -26, 20290, 12111, 18867, 4489, -9649, 7927, 34184, 78657, 84286, 77456, 17454, -3211, 57652, 54018, 14772, -31221, -49989, -9029, -11916, 18257, 33488]
5842C3488n220k092K875j1450K1293K758o4093k5468K829J3250M648n081L2160
5829a03k4133m095K0044K7079o00k2704K8222l600l0287q2027k6521L6623K3899
5816e8203k0594L9851K4805K2378K1719R660k2999k4214K056K9183j97l490k469
5803A7486N83Q428K1216m3082k5706O363J4373L0990m2441j5857n943M5043K3582
5790C5035K1738M624Q471j6904j5724K3275n867n3451m1069M2574J0133m1406
5778b8571j2504J1788J3937p060J356k5679P110J1719o699l8905j3977J0156M3612
5765c3717O0279L0632j7215k7775l6437k3906o481l7840M1344j5781J1783M5792
5753i322L6606j5630n9511r033K5700K2692J9687l0009k1139m552K3686N5684
$$ y = [33488, 28268, 26176, 29051, 17601, 38894, 41652, -22441, -47909, -45080, -31830, -27182, -32263, -103, -24236, -28331, -8287, 18792, 18192, -4512, 23710, 20110, -10177, -92204, -118725, -82102, -58203, -78797, -38946, -14141, 8237, 29956, 39616, 16617, -7597, -5541, 23642, 23445, 19955, 17486, 18069, 26497, 47713, 4631, -21075, -14712, -339, 30651, -11790, -27647, -33590, 11453, 35035, 56773, 61397, 69868, 52964, 37240, 60515, 54648, 1197, -39872, 2702, 12835, -28571, -41075, -29287, -15350, -22410, -21054, -46733, -39623, -27904, -34603, -73508, -87485, -77329, -33717, 26562, 57194, 39979, 12204, -24233, -48139, -54620, -92460, -51116, -66897, -55114, -9322, 27284, 11654, -47857, -56890, -31190, -8498, 11189, -18820, -39959, -44511, -20825, 34859]
5741C4859j9481k3770M161k9646k756L7994J3210r511k1404K3813J3978l75Q003
5728B9075L401j4955J0380O249J2669M3655j6329m3726m4892k3518K4307J8569
5716D885m1510l2426q620J9281K5255M405L1691N4816J4559m4990l2827j3770
5704a9251r742l0047J233L3676L736j1974K622l62q954j0082J9748J5700j1805
5691b5502n252K1624k2584k1773q76K9911j491m946K542K2762K9753K219n6650
5678c0263l0389q187J5640N3218j738L3891K6409j9155M425k0333l3950m6711
5666e7143J2638O4552J3925j5656j649j5438j9478j1532L4788K827j4434k4736
5654c1336m0323K1103P5884j1094k3904j9645l0130l1926L8324O8533k5129j3301
$$ y = [34859, 15378, -8392, -4231, -33877, -36633, 1361, 14571, 5060, -16344, 7469, 21447, 21072, 29075, 32476, 17521, 27901, 34150, 46819, 90474, 74145, 30419, -14473, -37991, -13684, 4885, -36625, -69051, -77671, -58390, -33135, -28730, 2961, 57777, 72336, 27346, -5481, -19251, -28993, -59040, -57807, -24131, -20395, -32369, -29747, -30109, -39063, -49145, -29397, -13697, -25502, -30754, -9130, -31714, -53487, -54363, -24452, -25943, -30889, -28347, -5585, 24168, 26387, -30263, -60652, -68839, -53199, 19, -1719, 32172, 58581, 39426, 43851, 23518, -10432, -57143, -44505, 20047, 33972, 18316, 16667, 1229, -18249, -29781, 5007, 7834, -6600, -31336, -71659, -50556, 25328, 14234, -9670, -29315, -59445, -91371, -53047, 15486, -9643, -22944]
5642b2944M946K2873k3544j847K3511j0413k2615O462j2647p645K7476K9024j7649
5629e012l0515r191m273j7387K0574J1680j4110J7612L0213K1570j8384m2703
5617c9926k210J2443J2392K127j1998K4380l0303j7264m4389j5701N2262O8411
5605A0224L3112k412j7085K5293K6720m418k2250k8884n4975q393J8360k0141
5593d4849k7072K4500Q534l518K475m333M4088K3867j458K9400J7044j9459J3167
5580F2386o9189m2320J1465j2177j725j4713j9588L8999L5783P373L200j3282
5568a3788J3835J9548J6491l5280J7392J0261j2849m962K588j5672j9883m562
5556b6881j5523L1360k937K1453J7303l1177k7489L9413K5286k3555j3592O2283
$$ y = [-22944, -17998, 4875, -18669, -20516, 2995, -7418, -30033, -23571, -36218, -43863, -16387, 12637, -5012, -35527, -44718, -48991, -66378, -45804, -34124, -48234, -30622, -409, 21161, 2777, -39926, -42136, -29693, -17301, -15174, -27172, -2792, -33095, -50359, -94748, -110449, -58187, 10224, 43336, 40924, 23839, 49132, 75852, 71434, 49184, 20300, -34675, -43068, -24708, -44849, -71921, -47421, -38887, -42405, -39930, -44263, -175, 23692, 22234, 51634, 68678, 49219, 62386, -6803, -49123, -37658, -49835, -51560, -66273, -85861, -46862, -11079, -3706, -506, -13788, 47, 19595, 36086, 806, 18198, 28459, 15610, 10648, 13236, -2436, -22319, -26881, -42404, -11044, -13981, 7472, 24775, -6402, -33891, 5522, 30808, 7253, -6339, 55944]
5544E5944J0981k3995n1978j9642Q569j1714N5202N3855p712K0023n901m9348
5532C4284l5040o8481J137O5534M1353n869j9277K7128L1313O561l6596k3583
5520A8464j2525k4750j1711M0854r268J4651R387l9351l7375j9981L1185K1207
5508a9213M695J8970m851j8455J5805K8514J0947j7751m1817j4508Q785J4361
5496a4518J7554L2980n5354k0718R490L8183M6784l620L0774l1164l5472o558
5484H361r799n65q007k1284k620M0781M1072l0362P75K3689J8960k8931k5011
5471G059k0011l5821J6946r789P183O5371Q1641J5809p1020j6862l8619L45J0370
5458A2602L2694k3385J7377J6417j8114k1075k2018j9304k4869J7503M3383j3132
$$ y = [55944, 66925, 42930, -9048, -28690, -20121, -31835, 23367, 77222, 69510, 89533, 83632, 34284, -756, -69237, -68100, -2566, 38787, 32918, 13641, 40769, 72082, 78643, 42047, 18464, 5939, -18811, -30522, 10332, 1064, 15715, 25102, -14249, -51624, -71605, -40420, -19213, -14518, 4452, -399, -18854, -3049, 25465, 36412, 18661, -23156, -37664, -28879, -14518, 3036, 36016, -19338, -40056, -30566, 7617, 54401, 50781, 81555, 50391, 14919, 8361, -1438, -2003, -10010, -31294, -33914, 6867, 47939, 17577, 18352, 42041, 61001, 32070, 7059, -12952, -48773, -31827, -41616, -34433, 30938, 112579, 128388, 57368, 40506, 1887, 2232, 12602, 45296, 21911, 39288, 55705, 37591, 16516, -5502, -24806, -49675, -32172, 11211, -1921]
5446a921J1859J6134K9199j5979m7980k3408k917K7561Q824J1135L2379J4660
5434E9546k975Q778K2303K3183l719k1620m2298j0911j9470l6662j2292L4263
5422a874j6719N184m338q155K0596P362J1004l5400l6728O674M498O7180j8970
5409C14J5387j4673L57j9500M90l4490o379J323L2742m517k1605J4427k620j046
5395c9790J8438P7R086j3575m42M3764k12k9305m4733k2979J1244L9075J3541
5382a5811l0467n0330J8340N6181M0694j404K5983o793m1611J9603K1284K5567
5370F1236m6471j0720L6390j0524k131J052K954N316n698k4751m087M9931J77
5357E2674m6427n8671j7291K3897L7526K303O3204J5239k3638k7652o3234n9052
$$ y = [-1921, 9938, 26072, 55271, 39292, -8688, -32096, -35013, -7452, 1372, 12507, 44886, 59546, 56571, 65349, 87652, 110835, 107116, 85496, 43198, 32287, 12817, -23845, -36137, -1874, -18593, -13409, -17747, -25902, -5306, 2056, 13060, -22340, -59068, -52394, -47896, 19284, 314, 15701, 1028, 1385, -18115, -17625, -52115, -58494, -57171, -24429, -28946, -50551, -36124, -38744, -39790, -21352, -21275, -12189, -25764, -26206, 17558, 17346, -11959, -56692, -79671, -68427, -29352, -15811, -46278, -96608, -78268, -22087, 18607, 17203, 43186, 36393, -5218, 14385, 35669, 61236, 14765, 4045, 40435, 29911, 27780, 28832, 31786, 37102, 31404, 6653, 2566, 52497, 52674, 6247, -52424, -69715, -45818, -8292, -5989, 57215, 72454, 48816, 21164, -42070, -101122]
5345a01122J5236J5782J3091j1790j6985L48j9622k0913K2896J1953P4702N07
5333a5917k7035N885R144P456k4581o8536n1994K6272O5301M8064J835K259L8820
5320A6973j2886N251J7904m2642o987M1828l4936k8491K9904J0147k1579P624
5308a7890o609K4360K2703L0213m026j9260R720l4843J3612M680O232l5767k3811
5295c0686m58o052K9354j5202K7718j1844R551L3199o7183n115M5696J8553k3258
5282D273j8932P536J203J462M9777j0663L6267j3839k4001m7769n7025j6837J2391
5269g6157M6973J8778K3068j3078J4406L4402J7967l4340o9478l4573L2027J6443
5257b3562L3626J4774k1427j0391j0820O776l1782j1661P0865K476m1608l7093
$$ y = [-101122, -85886, -70104, -57013, -68803, -85788, -85440, -105062, -125975, -103079, -91126, -16424, -15917, -42952, -37067, -27923, -20467, -45048, -113584, -165578, -139306, -74005, -25941, -24106, -21847, 16973, 4087, 9338, 27242, -15400, -22387, 19441, -15495, -43986, -14082, -3935, -25514, -17890, -24499, -139, 22564, 52777, 48751, 29491, 39211, 4368, 17980, 22660, 28892, -6875, -30686, -31144, -37196, -7842, -23044, 4674, -7170, 2381, 35580, -31603, -36718, 8978, 27531, 4273, -14659, -7123, -5920, -4458, 45319, 34656, 70923, 57084, 33083, -14686, -71711, -88548, -76157, -29184, -10406, 12662, -416, 13990, 48392, 66359, 32019, -37459, -72032, -40005, -23562, 10064, 24838, 3411, -6980, -17800, -11024, -42806, -54467, 16398, 18874, -22734, -59827]
5245e9827k5215j7173J6681K1550n611J1965O1639M379j1078n4376j0199K4013
5233d3252J4626j5825L6667J4936k6446K9226J1599K7606P488K5251j3943j2056
5221E5877n9252o104k7050M254m1479N181L7123M3192J1582n088j2941k3115K6172
5208H352M870j8374J0371M357Q186J6031l0644k5726L262M0848J7735L2876J8814
5195I0958n512l3754k9092J8782m2069k4586L3088M696J2935M3185L174l0914
5183D0891j2417j1490L9703m3433k4045l9523q655L9880N4036p838l6747L0592
5171B0954K4346k8544j6927J916K4371j2959j2482j5235K3429j0373L249N2028
5159E3773K5070k3318n1478k4867M2148p541l2332L2588J6140k7207j5308k4240
$$ y = [-59827, -85042, -102215, -85534, -63984, -69595, -57630, 4009, 8388, -2690, -57066, -67265, -43252, -28626, -44451, -7784, 7152, -19294, 9932, 21531, 49137, 56625, 81876, 67933, 55877, -3375, -9479, -36529, -32275, -73754, -68573, -31450, 11742, 23324, 18236, 5295, -17820, 8352, 13222, -5152, 5219, 9576, 17762, 33793, 3149, -22577, -19315, 21533, 39268, 72144, 90958, 85446, 51692, 22600, 41382, -687, -25273, 7815, 12511, 25446, 68631, 71805, 40891, 28474, 16984, 56687, 13254, -10791, -50314, -58969, -19089, 34947, 27109, -9638, 20954, 45300, 16756, -171, 1745, 26116, 13157, 675, -14560, 8869, -1504, 1745, 53773, 78843, 55525, 4047, -20820, 21328, 13787, -18545, 14043, 30183, 2976, -12332, -36572]
5147c6572J5898k3572J5401L4943J8698L7030k0821j5386j6412k0330o877j3512
5135c1512j0969K551K14K4522l162J6024M6226L889k5062n887j3632o739N7158
5122E3621j5281k0988M4717l0019n9745k7870q576J2526L5768N3016K456j011
5110C8614l0524j7889J4825J9292J1430n966l6015k9428j5858n17R940j7122K5617
5097c3601R765M9167K3694m7931n9238k6502q84j4161K1787L3556K7907p503K5903
5084A959L9191J9997j6890J9155K1660J669l7303o1656j2461j734J5560j4618
5072b5471j6399m597m2634j3783J2228L8494M7380j363p32q161J1043K185J5287
5059A3477n076j0364j9578k619k5121Q196N7051L8702L4463L052n6905k4320J6517
$$ y = [-36572, -20674, -44246, -28845, 6098, 24796, 61826, 41005, 25619, 9207, -11123, -18000, -31512, -42481, -39930, -39716, -15194, -18356, -2332, 43894, 47783, 22721, 16834, 3202, -3537, 53621, 38340, 17352, 62069, 32050, -27695, -55565, -64141, -51615, -15847, 37169, 39625, 38614, 8090, -9799, 5026, 24318, 35748, 29782, -6233, -35661, -51519, -52036, -42096, -59218, -33601, -23836, 25331, 49025, 1094, -58144, -84646, -85530, -99691, -77904, -44348, -16441, -23944, 1959, 41150, 61147, 44257, 63412, 85072, 86741, 49438, -12218, -24679, -26413, -10853, -25471, -41870, -46467, -89101, -102884, -90656, -52162, -4782, -6145, -6877, -15038, -3995, -1810, 13477, 8401, -1963, -21541, -24160, -49281, -41085, 15966, 54668, 89131, 92183, 35278, 10958, 27475]
5046B7475J1319o189q727J0633j7847j0589l2300m971j67J5907K0985Q202k6132
5033a2401j1273j5071M0867L0940m5309m8755r929P0514J2807j7384J641r068
5021a2421q271m677k9754K5869R240r345L998M513M7198j3422l2350l7553J7323
5008c9652K9953J3341N5096l990l2720l2725l872L977J2330J2251k3336K0336
4996A0989L7846k7623l4499L3582j2035j9722p271J5398K2623Q915l1394j0143
4984a3334K8510L1832l1652J8457K819j2057j160L966O563k7609L8581r663l6730
4971a477O794J6036K4047J611j1258n0804m6148J1687N8156j1202O7O6615K9157
4958I3281K779j4184J9341O061l2458p1028n454k2780K9834K6403J232j5663r69
$$ y = [27475, 38794, 32605, 23878, 34511, 16664, 6075, -26225, -31196, -31363, -15456, 5529, 13731, -12401, -23674, -38745, 2122, 33062, -12247, -61002, -70931, -417, 12390, -4994, -3353, -12421, -20692, -25369, -55123, -29254, -20014, -29359, -25361, -20848, 26350, 12928, -19422, -56975, -39652, -9699, 3642, 58738, 54748, 22028, -10697, -14569, -10592, 1738, 13989, -9347, 10989, 48835, 21212, -13287, 20295, 8260, -11462, -18733, -3335, 19288, 28203, -3191, -13334, 15176, 47008, 15356, 33813, 36632, 24575, 23415, 27381, 33944, 6335, 44916, 35253, -1477, 5317, 21353, 45400, 47011, 35753, -15051, -61199, -49512, 8644, -2558, -2491, 64124, 93281, 96060, 81876, 101217, 107278, 74820, 3792, -1662, -24442, 5392, 31795, 33027, 17364, 16395]
4945A6395k6337j6626r56K0402j2485m4999P363R197L912N302j158j9513l35k227
4931f2065j815J5674M1880L0025p749l7977j993j5302k511O650r104Q192j376
4918c7471J0527K4247J0489L7128N0656n518m7807o7662J9738J8166J3698R202
4906C5393m4107j2523r50K7288k6263m3053K2073N0538k2938j3532M1216K8407
4894D1549K6907L578K6765K4078k100n5276q7758k1812j4232K044M6760M2124
4882C2627j3704r291l5734n400L8266M1257J2955m2351k0854p206K5076j7282
4870a641q913J6357L9154K4671n770k6379l2403J3555n527r250l693O350k1836
4857a5325J3386J3978r325j5783j0669l323M4740J1568n3058k8810N5710N2101
$$ y = [16395, -9942, -26568, -27524, -7122, -19607, -64606, -57243, -48046, -44134, -38832, -39990, -59503, -59838, -62065, -63880, -48206, -6326, 23699, 15950, -22027, -24020, -39322, -41833, -35183, -44287, -36095, -37471, -26944, -2697, 7792, 44920, 95576, 90058, 42251, -25411, -5673, 12493, 26191, 35393, -8714, -21237, -22187, 5101, -21162, -64215, -42142, 8396, -14542, -28074, 13142, 41549, 68456, 72034, 98799, 122877, 120777, 65501, -22257, -44069, -58301, -56257, -9497, 32627, 18923, 9632, -26102, -31502, 6764, 48021, 60976, 18625, -2229, -9435, 15641, -1641, -10554, 5803, 44957, 69628, 63858, 37479, 5076, 18631, 13104, 3854, 161, 6511, -15325, -1939, 12039, 2714, -13069, -23738, -27061, 17679, 29247, -23811, -52621, 3089, 55190]
4845E5190j2468L0823J6096j7189l1257j2892k3715p2932n0385K0838L6954K3204
4833c7733l4744l804M8831N1719j6582l3423R962J76K0938j4225K2608q839l6266
4820c1382k3269J4122L3994K7316o373R927j6528o548p924J46p882j5063j7351
4807d6815j9194Q628M6383j8755J2025k4386J9559n154m6751J8727M4032K4141
4795A2440l641k2237J2206Q594M432O084K7208P156r529n384k1775J1359j1173
4782A5740l2599Q738J7631O780j0647j6051N5828Q512k7990l2987l2352k2131
4770f1528K0144p432L1026M9358j6697P238l9263j0097K6406J2101P31k9553R86
4757a6580J4806K5437p143m9049j3417K1968L2375K0066n544R25k5933l7499P212
$$ y = [55190, 42722, 73545, 89641, 72452, 41195, 28303, 4588, -68344, -118729, -97891, -60937, -37733, -72477, -76281, -27450, 24269, 7687, -25736, -15774, -15598, 5340, -8885, 13723, 4884, -31382, -54651, -40529, -6535, 20781, 14408, 24335, 7807, 1259, -6665, -6519, -14401, -29464, -46815, -66009, -57381, -10998, -29753, -17728, -42114, -22555, -27709, -74460, -55733, -11701, 12440, 8799, -13438, -1232, 7362, 11794, 17878, 45086, 52242, 42713, 37329, 15554, 26913, 15740, -16859, -8121, 9510, 16290, 5643, -10408, 45420, 53932, 25942, -7045, -39397, -61528, -41384, -48816, -17790, 31568, 14871, 22109, -17154, -27251, -845, 11256, 11987, -17566, -16580, -1774, 23663, 16520, -32529, -45946, -23978, 8397, 28463, 22919, 23844, -2089, -39588, -32376]
4744c2376K8621l462L0807K4567j1399m8222k6403J9490O325L0717J384m328J8772
4731C4493K1647o0017L00O448P010K109K3114L1668k2737j9144j5602j482j7038
4718i231k268L9116M4293l4941j9141l931m445K4507k041k693m6458m3419J5397
4705d5255j0512o158P981M2254M9070J0156R456j5121j3504k7229j8788L685Q872
4692e093k7837q693k3507J7440L6843K5899K3773Q591k8660l539q544L239J4998
4679B4910j0605k1078j4281K6358k1633l0602K1987K6513P384k3189k0803K4271
4667a0768K7551j4695j2310O738L4291J7435k4372n9452m6492K0672J9531p831
4655d9702K3254N2730J7137l4268J8973J1057j1086l1471q607P294K9641K1521
$$ y = [-32376, -3755, -7217, 23590, 48157, 36758, -11464, -37867, -18377, -12052, 18665, 20049, 15721, 34493, 56140, -3877, -3577, 2871, 9881, 11990, 35104, 66772, 44035, 24891, 9289, 7807, -9231, -11499, 27617, 71910, 36969, 17828, 13897, 9452, 33959, 31918, 29225, -17233, -60652, -45255, -55767, -61925, -53944, -11690, 37380, 47536, 56992, 41871, 28367, 1138, -17650, -13965, -5093, -32930, -41623, -65130, -47690, -10847, 15052, 38825, 47416, 18756, 15217, 6673, 9912, 24910, 14305, -6773, -21054, 5304, -16329, -46931, -24944, 1569, 8953, -14236, -35039, -10768, 16783, 2088, -10222, -3484, 30807, 48242, 23870, -35582, -82074, -61402, -41871, -49702, -26448, 26282, 43419, 9151, 28124, 39181, 28095, -3376, -11983, -4689, 24952, 46473]
$$ [...]
##END NTUPLES=NMR SPECTRUM
##END=
