##TITLE=Analysis number 313950
Compound Code nrb 00999
Book Reference 461/6
Project Code adrs
Chemist Name toml
##JCAMPDX= 6.0         $$ Bruker NMR JCAMP-DX V2.0
##DATA TYPE= NMR SPECTRUM
##DATA CLASS= NTUPLES
##ORIGIN= Bruker BioSpin GmbH
##OWNER= NMR
$$ XWIN-NMR		Version 3.5
$$ Fri Sep 30 07:45:54 2005 GMT Daylight Time (UT+1h)  MAYBRIDGE\NMR@NMR_250MHZ
##.OBSERVE FREQUENCY= 250.131544655141
##.OBSERVE NUCLEUS= ^1H
##.ACQUISITION MODE= SIMULTANEOUS (DQD)
##.ACQUISITION SCHEME= undefined
##.AVERAGES= 16
##.DIGITISER RES= 18
##SPECTROMETER/DATA SYSTEM= dpx250
##.PULSE SEQUENCE= zg30
##.SOLVENT NAME= DMSO
##.SHIFT REFERENCE= (INTERNAL, DMSO, 0, 16.5142)
##AUDIT TRAIL= $$ (NUMBER, WHEN, WHO, WHERE, WHAT)
$$ ##TITLE= Audit trail, XWIN-NMR		Version 3.5
$$ ##JCAMPDX= 5.01
$$ ##ORIGIN= Bruker BioSpin GmbH
$$ ##OWNER= NMR
$$ C:\u/data/dgb/nmr/ADRS/10050/pdata/1/auditp.txt
$$ ##AUDIT TRAIL=  $$ (NUMBER, WHEN, WHO, WHERE, WHAT)
(   1,<2005-09-30 07:45:16.29 +100>,<MAYBRIDGE\NMR>,<NMR_250MHZ>,
      <created by zg, POWCHK disabled, PULCHK disabled
       configuration hash MD5:
       62 19 C7 07 E1 42 D1 B7 37 6C 3D D0 77 39 F9 E6
       data hash MD5: 64K
       AB 43 4B A3 50 16 6B 8B 35 48 76 66 FE E4 FC 99>)
(   2,<2005-09-30 07:45:34.38 +100>,<MAYBRIDGE\NMR>,<NMR_250MHZ>,
      <Start of raw data processing
       ef LB = 0.3 FT_mod = 6 PKNL = 1 SI = 32K 
       data hash MD5: 32K
       30 78 63 7B A9 84 8E 29 51 44 BC E1 35 1A B1 5C>)
(   3,<2005-09-30 07:45:39.76 +100>,<MAYBRIDGE\NMR>,<NMR_250MHZ>,
      <apk 
       data hash MD5: 32K
       92 8A 11 51 49 D0 BA 3A 14 0A 21 17 63 C2 D6 B6>)
(   4,<2005-09-30 07:45:41.45 +100>,<MAYBRIDGE\NMR>,<NMR_250MHZ>,
      <abs ABSG = 5 
       data hash MD5: 32K
       96 29 84 62 4F 65 1B 43 D6 02 2A 72 DB B7 42 5B>)
$$ ##END=
$$ 
$$ hash MD5
$$ 47 C4 94 F0 72 66 2C 8F 62 81 F0 A3 C1 B3 8B DF
##$RELAX= 
##$RELAX= 
##$RELAX= 
##$RELAX= 
##$RELAX= 
##$RELAX= 
##$RELAX= 
$$ Bruker specific parameters
$$ --------------------------
##$DU= <C:\u>
##$EXPNO= 10050
##$NAME= <ADRS>
##$PROCNO= 1
##$TYPE= <nmr>
##$USER= <dgb>
##$AMP= (0..31)
100 100 100 100 100 100 100 100 100 100 100 100 100 100 100 100 100 100 
100 100 100 100 100 100 100 100 100 100 100 100 100 100 
##$AQSEQ= 0
##$AQ_mod= 3
##$AUNM= <au_zg>
##$AUTOPOS= <2 >
##$BF1= 250.13
##$BF2= 250.13
##$BF3= 250.13
##$BF4= 250.13
##$BF5= 500.13
##$BF6= 500.13
##$BF7= 500.13
##$BF8= 500.13
##$BYTORDA= 1
##$CFDGTYP= 0
##$CFRGTYP= 5
##$CHEMSTR= <none>
##$CNST= (0..31)
1 1 145 1 1 1 1 1 1 1 1 1 1 1 1 1 1 1 1 1 1 1 1 1 1 1 1 1 1 1 1 1 
##$CPDPRG= <>
##$CPDPRG1= <>
##$CPDPRG2= <>
##$CPDPRG3= <>
##$CPDPRG4= <mlev>
##$CPDPRG5= <mlev>
##$CPDPRG6= <mlev>
##$CPDPRG7= <mlev>
##$CPDPRG8= <mlev>
##$CPDPRGB= <>
##$CPDPRGT= <>
##$D= (0..31)
0 1 0 0 0 0 0 0 0 0.06 0 0 0 0 0 0 0.0002 0 0 0 0 0 0 0 0 0 0 0 0 0 0 
0 
##$DATE= 1128062714
##$DBL= (0..7)
120 120 120 120 120 120 120 120 
##$DBP= (0..7)
150 150 150 150 150 150 150 150 
##$DBP07= 0
##$DBPNAM0= <>
##$DBPNAM1= <>
$$ [...]
##$SUBNAM7= <"">
##$SUBNAM8= <"">
##$SUBNAM9= <"">
##$SW= 20.6930455092707
##$SWIBOX= (0..15)
0 0 3 0 0 0 0 0 0 0 0 0 0 0 0 0 
##$SW_h= 5175.983436853
##$TD= 65536
##$TD0= 1
##$TE= 294.16
##$TE2= 300
##$TE3= 300
##$TEG= 300
##$TL= (0..7)
0 120 120 120 120 120 120 120 
##$TP= (0..7)
150 150 150 150 150 150 150 150 
##$TP07= 0
##$TPNAME0= <>
##$TPNAME1= <>
##$TPNAME2= <>
##$TPNAME3= <>
##$TPNAME4= <>
##$TPNAME5= <>
##$TPNAME6= <>
##$TPNAME7= <>
##$TPOAL= (0..7)
0.5 0.5 0.5 0.5 0.5 0.5 0.5 0.5 
##$TPOFFS= (0..7)
0 0 0 0 0 0 0 0 
##$TUNHIN= 0
##$TUNHOUT= 0
##$TUNXOUT= 0
##$USERA1= <user>
##$USERA2= <user>
##$USERA3= <user>
##$USERA4= <user>
##$USERA5= <user>
##$V9= 5
##$VALIST= <valist>
##$VCLIST= <CCCCCCCCCCCCCCC>
##$VD= 0
##$VDLIST= <DDDDDDDDDDDDDDD>
##$VPLIST= <PPPPPPPPPPPPPPP>
##$VTLIST= <TTTTTTTTTTTTTTT>
##$WBST= 1024
##$WBSW= 4
##$XGAIN= (0..3)
0 0 0 0 
##$XL= 0
##$YL= 0
##$YMAX_a= 381313
##$YMIN_a= -476854
##$ZGOPTNS= <>
##$ZL1= 120
##$ZL2= 120
##$ZL3= 120
##$ZL4= 120
##$ABSF1= 16.51421
##$ABSF2= -4.178963
##$ABSG= 5
##$ABSL= 3
##$ALPHA= 0
##$AQORDER= 0
##$ASSFAC= 0
##$ASSFACI= 0
##$ASSFACX= 0
##$ASSWID= 0
##$AUNMP= <proc_1d>
##$AZFE= 0.1
##$AZFW= 0.1
##$BCFW= 0
##$BC_mod= 0
##$BYTORDP= 0
##$COROFFS= 0
##$CY= 12.5
##$DATMOD= 1
##$DC= 0
##$DFILT= <>
##$DTYPP= 0
##$F1P= 14.0000005364418
##$F2P= -0.99999901652339
##$FCOR= 0.5
##$FTSIZE= 32768
##$FT_mod= 6
##$GAMMA= 0
##$GB= 0
##$INTBC= 1
##$INTSCL= 1
##$ISEN= 128
##$LB= 0.3
##$LEV0= 0
##$LPBIN= 0
##$MAXI= 10000
##$MC2= 0
##$MEAN= 0
##$ME_mod= 0
##$MI= 0
##$NCOEF= 0
##$NC_proc= -6
##$NLEV= 6
##$NOISF1= 0
##$NOISF2= 0
##$NSP= 0
##$NTH_PI= 0
##$NZP= 0
##$OFFSET= 16.51421
##$PC= 1
##$PHC0= -81.22012
##$PHC1= 17.29434
##$PH_mod= 1
##$PKNL= yes
##$PPARMOD= 0
##$PSCAL= 4
##$PSIGN= 0
##$REVERSE= no
##$SF= 250.130001947681
##$SI= 32768
##$SIGF1= 0
##$SIGF2= 0
##$SINO= 400
##$SIOLD= 32768
##$SREGLST= <1H.DMSO>
##$SSB= 0
##$STSI= 32768
##$STSR= 0
##$SW_p= 5175.98343685301
##$SYMM= 0
##$S_DEV= 0
##$TDeff= 65536
##$TDoff= 0
##$TI= <Analysis number 999999
Compound Code 99
Book Reference 9
Project Code 9>
##$TILT= no
##$TM1= 0
##$TM2= 0
##$TOPLEV= 0
##$USERP1= <user>
##$USERP2= <user>
##$USERP3= <user>
##$USERP4= <user>
##$USERP5= <user>
##$WDW= 1
##$XDIM= 32768
##$YMAX_p= 420434758
##$YMIN_p= -902020
$$ End of Bruker specific parameters
$$ ---------------------------------
##NTUPLES= NMR SPECTRUM
##VAR_NAME=  FREQUENCY,     SPECTRUM/REAL,   SPECTRUM/IMAG
##SYMBOL=    X,             R,               I
##VAR_TYPE=  INDEPENDENT,   DEPENDENT,       DEPENDENT
##VAR_FORM=  AFFN,          ASDF,            ASDF
##VAR_DIM=   32768,         32768,           32768
##UNITS=     HZ,            ARBITRARY UNITS, ARBITRARY UNITS
##FACTOR=    0.157963299565203, 1,           1
##FIRST=     4130.69931626018, 0,            0
##LAST=      -1045.28412059283, 0,           0
##MIN=       -1045.28412059283, -902020,     0
##MAX=       4130.69931626018, 420434758,    0
$$ Real data points
##PAGE= N=1
##DATA TABLE= (X++(R..R)), XYDATA
$$ [...]
23755a57918n4079P0084M0885J86989K42268o6187j92035l5183J40256J2166j54761
23744C2485M0558K4057J2531J0396k5127k78842j2033J35953R0274p2578n9884
23733a02210J95485q5787k24517l21688j39486l6930P3941J92797J8164o4275
23723d94506K64331j7674j10803R428J37884P0195J52697j35334R4259K43808
23713B14285L7800O4480o7274l7388j02405K46190j28511r8036K02287N1026n0392
23702C32062j65373j31108J60233n2589J40160j52241k80394M81K97070R582r9385
23691E8498m5251j26032L347K84080O6793j85107j12319P9123K99k14145p8703
23680b69417R0761J11372m5088r2750P591J1388Q2237J63535J82493l62810j44920
$$ y = [-157918, -211997, -141913, -101028, 85961, 328229, 262042, 70007, 34824, 175080, 187246, 32485, 73043, 97100, 109631, 120027, 94900, -183942, -195975, -60022, 30252, -42326, -102210, 93275, 7488, -217029, -538717, -678203, -715133, -641192, -448395, -430231, -494506, -230175, -247849, -358652, -349224, -211340, -141145, 11552, -123782, -29523, 214285, 252085, 316565, 249291, 211903, 109498, 355688, 227177, 129141, 331428, 382454, 332062, 166689, 35581, 195814, 143225, 283385, 131144, -149250, -148769, 148301, 157883, 58498, 13247, -112785, -109438, 174642, 241435, 56328, -55991, 23132, 23431, -190714, -269417, -178656, -67284, -112372, -205122, -197531, -186143, -103906, 59629, 242122, -120688, -265608]
23669b65608J27990K48137J48876j149k8921K9059k15257n2182J50440o463J0351
23658A45273q0376m1401r1767K76210o2263p8374m2054J14292j31893L9564j381
23647D5830q681j75087l2298J57631m7877R5862n9230R1015n5508K4743K7217
23636F3617j4053j07880k1780J82283Q4252K5792k66020j90810j06038M9865r4605
23625c95377k75923J35956K83735K38378K05708j36469Q8728N4824J55045m2890
23615C11715j8028j27420K1409j03709r872Q5465J48888q1229j21207P4241N5261
23604B35514j35937M1130N3727p0198j47241k17656k54293J56651J96687N1575
23594i0041P336O2175j79287Q9477Q5851m9874P3291j82374J54469J79341k7746
$$ y = [-265608, -137618, 110519, 259395, 258246, 229325, 258384, 43127, -9055, 141385, 134922, 145273, 64897, 23496, -68271, 207939, 145676, 67302, 25248, 139540, 7647, 47211, 45830, 37149, -137938, -170236, -12605, -60482, 35380, -23850, 67165, 11657, 36400, 63617, 49564, -58316, -80096, 102187, 186439, 212231, -53789, -244599, -350637, -300772, -395377, -671300, -535344, -251609, -13231, 192477, 56008, 144736, 199560, 354605, 311715, 293687, 166267, 187676, 83967, 74095, 159560, 308448, 227219, 106012, 180253, 235514, 99577, 140707, 194434, 124236, -23005, -240661, -494954, -338303, -141616, -90041, -82705, -20530, -199817, -110340, -24489, -74363, -1072, -183446, -28977, 150364, 122618]
23583A22618j99656j13167R8944K6741K90566J66819k14117p0047N3252K19241
23573C81194m1288j26158k33057j26649J27954J7475J72858l656m3575J0032l4653
23562A00477j21152N8252j17117o9508J55251j93763m8645J84838j8849Q9312
23552A9096j04850j71559l0846K44724J86801q0761o0906k58314j54283O653J00820
23541c03425K77541q045J10600n7691J54998N2428P5167K84854J82132n0467l95850
23530C22242l40495k5804J53109j06998j78088J36373N4294J79684l0383k07043
23520d3109J7105q8928K75778o3048k64231k4134K61532J02546j37103j43584
23510a07176N0033n8103j6550P0238j35176j4405J81749L0864K0008K33210R3183
$$ y = [122618, -77038, -190205, -91261, -64520, 226046, 392865, 178748, 108701, 161953, 381194, 339906, 213748, -19309, -145958, -18004, -529, 172329, 168673, 125098, 135130, 100477, -20675, 37577, -79540, -149048, 6203, -187560, -236205, -51367, -70216, 19096, -85754, -257313, -288159, -43435, 143366, 62605, 1699, -256615, -410898, -404245, -303425, -25884, -33929, 76671, 18980, 173978, 226406, 301573, 586427, 768559, 718092, 322242, -18253, -44057, 109052, 2054, -176034, -39661, 14633, 194317, 163934, -43109, -26004, -114932, 160846, 97798, -166433, -190567, 70965, 173511, 36408, -107176, -57143, -115246, -131796, -61558, -196734, -211139, -29390, 1474, 21482, 254692, 347875]
23499C47875q6567j62471q1416j57443j53524M3542m1637K148K76206J52027j8423
23488A20317o7294O5940j77776k16653r3929J80499L10816J5714j50045L3027
23478B0616Q9106P8659J06902J28061j2539n8777J1755l5877K2844N2869l3623
23467C69996J66802j91256j40680j83303p1201j16789m5364L474J39194k6634
23457i5761q6328q3939q993j31552J94039J16946J88340k8030J28910J2381J43522
23446C49535j67320j68661p6372K5742L8837l19804j15875O0274J04769P0008
23436a98867J05436j1819j22252L1914L2317J15655n6542k56474k17207J97941
23426c79898J32991J11428Q0927k5325j39251J75873J82401l8327j05521j13393
$$ y = [347875, 261308, 98837, 17421, -140022, -293546, -250004, -291641, -289493, -13287, 138740, 120317, 53023, 118963, -58813, -275466, -369395, -188896, 121920, 137634, -12411, 20616, 109722, 188381, 295283, 423344, 410805, 352028, 363783, 327906, 350750, 403619, 369996, 536798, 345542, 204862, 21559, -49642, -166431, -211795, -208321, -69127, -95761, -182089, -266028, -275021, -406573, -212534, -95588, 92752, 64722, 193632, 206013, 349535, 182215, 13554, -62818, -37076, 1761, -318043, -433918, -373644, -268875, -198867, -93431, -105250, -227502, -195588, -163271, -47616, -104158, -360632, -577839, -379898, -246907, -135479, -54552, -79877, -219128, -43255, 139146, 100819, -4702, -118095]
23416a18095p9825J63312l2485l8620k735J63337K17936j21957K3013n0185k8255
23405I5441M6087k82167r2721J04964K96125j4867j5107J75337J86137j8404r6478
23394C84347k59775q5730Q0627p0519j51032J2307J7754n4473o7942J50507N0598
23383F669j0946J10929O8735r6100Q9506o7609j24846j52243o9633m1611j46158
23372d33307J810Q3596k9119J55586K31140J83039q6165o4577P3942k05777n0554
23361a40386J59285J67057K19280m4579m47715j11359p8117J15984J63199J09801
23351A12450o1335j06966J48761J5307J02594k2091o0689J04886Q1654k38115
23341G6456j72634m3481K9246J78962j7281j37271r9193j8378q2192m2576m673
$$ y = [-118095, -197920, -34608, -67093, -105713, -108448, 54889, 272825, 150868, 173881, 123696, 95441, 141528, -140639, -233360, -128396, 167729, 152862, 137755, 313092, 499229, 480825, 384347, 124572, 38842, 119469, 48950, -102082, -89775, -72021, -126494, -194436, -43929, 6669, -4277, 106652, 175387, 79287, 168793, 101184, -23662, -175905, -245538, -287149, -433307, -431497, -347901, -377020, -221434, 9706, 192745, 106580, 42003, 115945, -89832, -140386, 18899, 185956, 405236, 360657, -87058, -198417, -276534, -160550, 2649, 112450, 51115, -55851, 92910, 108217, 210811, 188720, 128031, 232917, 314571, 76456, -96178, -139659, -110413, 68549, 51268, -86003, -185196, -203574, -285766, -328342, -333015]
23330c33015k00113J05127P4953J16913J39394r9374K47952j68N9573l474J24348
23319B32116j55591p0915k43711l2239L03330m7762j96370n6762P9889q1091J26406
23308a42700O1052l4148j52089K15111L64792q6389P509J07867m3510j9498k91575
23297a3578n9210l6327o2928J32927r5500j46352m7589R5756K25793j29867q7054
23286b23929J21722n5343O0109K56579k3892q4238k8452J49364J01036j29602
23276A43354J32743J11283j29853k10559J07087l4655j38830M8539R340J96953
23266B35402k7254P524M7151l68802j88705N8979K6089J80342m6978k92987M4219
23255c25020j78725R4204J25347J33824R5961K44653j21141k92581j05860M35737
$$ y = [-333015, -533128, -428001, -353048, -236135, -96741, -196115, 51837, 51669, 111242, 107768, 232116, 76525, 5610, -238101, -270340, 32990, -14772, -211142, -267904, -188015, -269106, -142700, -81648, -115796, -267885, -52774, 312018, 225629, 233138, 341005, 297495, 277997, -13578, -72788, -109115, -172043, -39116, -134616, -280968, -328557, -232801, -7008, -136875, -223929, -102207, -157550, -97441, 159138, 135246, 51008, 22556, 171920, 272956, 143354, 276097, 387380, 257527, 46968, 154055, 119400, -19430, 29109, 38449, 235402, 208148, 215672, 262823, -105979, -294684, -235705, -209616, -29274, -76252, -369239, -325020, -503745, -409541, -284194, -150370, -54409, 190244, 69103, -223478, -329338, 106399]
23245A06399j10137l11766j43176J47740L5217J03734M1894j4559J69402M9523
23235G4271j39023J80070l8656r1926J33233K8372n8448Q3469K12211o4425j94990
23224A24158j87243j21594K63406K66172j54894k77113p8699j09018Q1374L30909
23214A37458l0564k4490l9166k15434K7612J4762k2950m5012j69769K4717J00026
23203b42810K65888j75419j56297J14919k8361O7702k3076m7234j4821J62637
23193g6872J85491L6589j65546K9643j16411L4243o9096M6747K37260jJ72807
23182C14854j75617l92152j65182O8590K1047l1922K82490R000k03031m2564Q8088
23171b26399K38516K94252O6745j22026k63184j90360j30091j88910P9740Q4750
$$ y = [106399, -3738, -315504, -458680, -310940, -275723, -171989, -130095, -144654, 24748, 74271, -64752, 115318, 76662, -15264, 117969, 146341, 87893, 171362, 383573, 319148, 124158, -63085, -184679, 78727, 344899, 190005, -87108, -165807, -274825, -193451, 137458, 106894, 82404, 43238, -172196, -144584, -129822, -152772, -197784, -367553, -342836, -242810, 23078, -152341, -308638, -193719, -222080, -154378, -177454, -224688, -239509, -76872, 108619, 145208, -20338, 9305, -107106, -72863, -141959, -95212, 142048, 142047, 314854, 139237, -252915, -418097, -349507, -328460, -360382, -77892, -68892, -271923, -314487, -226399, 12117, 306369, 373114, 251088, -12096, -202456, -332547, -521457, -441717, -356967]
23161c56967p5996l678O2861J73472k1177K39280K91103j3584k78009m1287K9474
23150E492j60242K5724L3427k42352M4903J56159J4895J32889K7867L18450Q626
23139C65838p6292l26660K1849M0898j15182K0201p3048r5880K39953L28097j51079
23128A78695p1948m4171N6888J81867j57362j34975l4479K42559o1598j77553
23118b2077K61715M2537K10744P8976k8065k74180q7948l7701q1866j19215N323
23107e1757J40183j2099j76192J34727L5371m6670J15923r8803j11948k5895j4682
23096a11842J36618K09722l1435j26344M288j27413j17754R0963Q0898j63332
23086a55631l4193J73389J13632J67006j8119r5228J01486r395q3554l2130p9138
$$ y = [-356967, -432963, -436641, -373780, -200308, -221485, 17795, 308898, 295314, 17305, -23982, 5492, -154750, -129026, -95599, -337951, -293048, -136889, -121994, 10895, 38762, 357212, 365838, 289546, -37114, -15265, 25633, -89549, -69348, -142396, -238276, 1677, 329774, 178695, 106747, 62576, 119464, 301331, 143969, 8994, -25485, 217074, 155476, -22077, 239638, 282175, 492919, 571895, 543830, 269650, 181702, 144001, 62135, -57080, -51757, 88426, 76327, -99865, 34862, 70233, 23563, 139486, 40683, -71265, -97160, -111842, 24776, 234498, 203063, 76719, 81007, -46406, -164160, -73197, 7701, -155631, -189824, -16435, 97197, 264203, 246084, 150856, 252342, 242947, 159393, 127263, 48125]
23075D8125n5497j75610o2532L94458Q8955q1488j8838m9838l3761M6682j83784
23064h3128J09454L0607m8751J49060l8025k81693J07572N14280l7203k98958
23054A23215k58339k40931O89J55587K77688L1762N9156o8777j38250k9289P638
23043g9851j52436n8330k5246J45585J06629L7573l4852k79254J06566O3889K31453
23032F1726R4784k56070l23703p561J71374l3637J70503j2190o6544p6446M8143
23021b29621O3440k49137J24993J86519J16303L6821K16423M2045k19635j19034
23011c0883l6747j06787J46274J35210Q3730M1263j00090k06474j23153P307Q4321
23000a06029n9037k37064j247j3703K47552K41969j78849n4179k25681k2837j9290
$$ y = [48125, -7372, -182982, -245514, 148944, 237899, 156411, 137573, 87735, 53974, 100656, -83128, 26326, 56933, 8182, 157242, 119217, -162476, -54904, 459376, 422173, 123215, -135124, -376055, -375366, -219779, 57909, 89671, 148827, 80050, -58200, -87489, -79851, -232287, -290617, -315863, -170278, -63649, -26076, -60928, -340182, -233616, -169727, 61726, 156510, -99560, -423263, -430824, -259450, -293087, -122584, -134774, -201318, -277764, -229621, -166181, -415318, -290325, -103806, 12497, 49318, 265741, 307786, 88151, -30883, -67630, -174417, -28143, 107067, 190797, 232060, 131970, -74504, -197657, -190350, -106029, -165066, -402130, -403377, -417080, -169528, 72441, -106408, -160587, -386268, -409105, -428395]
22989d28395J76688N2116N9719J65545J93639r4425j03933k0455J69294o4232
22979A05561j6313K200K05855J24013k03141k22759J15315m3841l20719k47926
22969e01755K30729K23310j02221N0463j56455j7178n2539o1944J84677P5943
22959a26970n0325P3999p7336M791o107P3593J72984j25370o6771j53380K80967
22948G5R0983J2498J16597J37857j02891l03419k81344J19165J77482K80993j3645
22937B34351j53993N4977j20033j24081k43626k7830Q7040K67062M4917m54686
22927d35902j81127L01577K11466L9275m6163p9158n6953R0018J49588p6005M7507
22916c5877j13401j3452n2448Q278J33246j50787q9156J60618n6277j3182K21942
$$ y = [-428395, -251707, -199591, -139872, 25673, 219312, 124887, 20954, 499, 169793, 105561, 89248, 91448, 297303, 421316, 218175, -4584, 110731, 66890, -253829, -501755, -271026, -47716, -149937, -99474, -255929, -273107, -325646, -387590, -202913, -126970, -177295, -103296, -180632, -175841, -181948, -108355, 64629, -60741, -127512, -280892, 75, 91058, 103556, 220153, 358010, 255119, -48300, -329644, -210479, -32997, 247996, 234351, 80358, 135335, 15302, -108779, -352405, -380235, -293195, -26133, 18784, -435902, -617029, -315452, -103986, -64711, -110874, -190032, -246985, -156967, -7379, -83384, -35877, -149278, -162730, -215178, -206900, -73654, -224441, -313597, -152979, -209256, -222438, -496]
22905d96K8492q6775m08K6171j33578m4035k04435k07172K62393N29374R5595
22894B65126k40395k23537k80813K38030Q6440R7416l0390R704K71685P4773N8874
22883C26913j85552k42492m1319j91240j63309L24135J99497K42654j03923m6984
22873A18380k48968m09730K32558J6705J25493J75102m1381j31094J63283J83354
22863A83702k52590M9941K03196l1979l4078p7824r7629o6166K70282K60706j8371
22852C89190j76949j75008R6071J32997J8089j84681N439O4161l9036j57567p1771
22841i9065J37872j04289j83946J6593L35990J04841j30522R8580k20217j1708
22831e5871N9191l7680L6108J07972j26878m7242J96683Q2400J31693j32057n5743
$$ y = [-496, 27996, -58779, -59187, -33016, -166594, -210629, -415064, -622236, -359843, 169531, 265126, 24731, -198806, -479619, -241589, -155149, -57733, -88123, -78419, 193266, 268039, 326913, 141361, -101131, -142450, -333690, -496999, -172864, 26633, 269287, 165364, 118380, -130588, -540318, -307760, -291055, -165562, 9540, -31841, -162935, 348, 183702, -68888, -18947, 184249, 152270, 118192, 40368, -57261, -123427, 146855, 407561, 389190, 212241, 37233, 133304, 266301, 284390, 99709, 105148, 169309, 130273, -27294, -99065, 38807, -65482, -249428, -232835, 103155, 207996, 77474, 176054, -44163, -55871, 3320, -34360, 1748, 109720, -17158, -64400, 132283, 214683, 346376, 214319, 158576]
22820A58576j24174p4811J25605O2095O8040q2428o6177Q6517P4810J03761j11253
22809B20561l33222o2850J1744j29450J35866O2053k48256J907J05722J92146
22799d3779l8468J58383j04560k48245J40786N5920l9498r6506J37698J60452
22789H2183J60513J63101n2633q8660q3810j22301k7809j56598r8325J85210J29594
22778I0465n0785O7937p156l2424q7759j75148J55322L31789j31879K5256n1920
22767A33698l2113Q3871R3402P8622k3166k03017l51420j17151J22189m2984k643
22756b60712Q0552j8828j52443K0393J63060J42281j5624J14751j19121j20743
22746a66434j22409K8948j1309J00292K81061O7497p2350J35710J75798J11508
$$ y = [158576, 34402, -40409, 85196, 147291, 215331, 132903, 66726, 153243, 228053, 331814, 220561, -112661, -175511, -163767, -293217, -157351, -95298, -343554, -341647, -235925, -43779, -82247, 76136, -28424, -276669, -135883, -79963, -119461, -215967, -78269, 82183, 242696, 405797, 353164, 264504, 180694, 58393, 30584, -126014, -224339, -39129, 90465, 39680, 107617, 100461, 68037, -19722, -194870, -39548, 292241, 160362, 185618, 133698, 101585, 185456, 278858, 357480, 334314, 131297, -220123, -337274, -215085, -258069, -260712, -180160, -198988, -351431, -331038, -167978, -25697, -41321, 73430, -45691, -166434, -288843, -259895, -271204, -170912, 110149, 177646, 105296, 241006, 416804, 528312]
22736E28312k43321j46614P2935N5393N5626j92169N6351l0685P1090p3889j23780
22725B9249k2622Q5555j13325J64876o6855L065J8161k61416l9468J05126J6045
22714h1609J91828Q3798k9378j53578o4638j01454O8157k8522p2444o4742k6130
22703b78712J36601P8551K121j34964N1138k17317j02676L74870K14071L4712
22693A58395j3602k1455J2967J92915M0853j69788M129J54716o2041j32078J15158
22682B80169K2653k7728Q0166k6221n725p9329k00962p9969P6310j02590o506
22671f9732K9436q7443o148R1561j19391r3084R153j24464Q2895J05858j43982
22660c25341o8075M4628J5794K27916N2648n8246q9242J4426Q3973j7152K05716
$$ y = [528312, 284991, 138377, 211312, 266705, 322331, 130162, 186513, 155828, 226918, 153029, 29249, 6627, 92182, -21143, 143733, 76878, 79943, 98104, -163312, -202780, -97654, -81609, 110219, 194017, 164639, 11061, -53577, -155031, -86874, -115396, -187840, -252582, -278712, -142111, -63560, -61439, -196403, -145265, -362582, -465258, -90388, 123683, 158395, 144793, 123338, 136305, 329220, 370073, 200285, 204414, 359130, 297089, 165011, 280169, 302822, 275094, 355260, 329039, 323314, 243985, 43023, -36946, 39364, -63226, -69732, -40296, -127739, -133887, -42326, -161717, -254801, -245648, -370112, -287217, -181359, -325341, -393416, -348788, -332994, -105078, -52430, -110676, -199918, -185492, -101519, -118671, 87045]
22649H7045P5506l67752J7393j1998l0725J15318j45732k5166J54307k0845J3794
22638a38855J71306L60033j30301p6215r5645L2745j66734j56505L4746k5675
22628a91100K31302r526o6980k39938J05161K11018K26671k09488q798j45030
22618i6708j78586J76458K48442K22547m9639l1360K6294j28108j43346O5787
22608A11781J02771J02269k22923j42791j43984j13350N9336r5173o5000q7707
22598d94771J42222P1485K76445N0055K26520j227J1834j58235q0511o1407k4133
22587d1723j01879J52108j448j25537J21671L3413j21694k06335J23989Q8511
22577g8924R3661l6005j26582K9041J38824j8540J29711L61l9499m341k17112
$$ y = [87045, 162551, -205201, -187808, -199806, -230531, -115213, -260945, -286111, -131804, -152649, -138855, 32451, 392484, 262183, 185968, 90323, 123068, -43666, -200171, -165425, -191100, 40202, 30676, -36304, -276242, -171081, 39937, 266608, 57120, 48322, -96708, -275294, -98836, 149606, 372153, 322514, 291154, 317448, 189340, 45994, 111781, 214552, 316821, 93898, -48893, -192877, -306227, -246891, -342064, -407064, -494771, -352549, -281064, -4619, 45436, 271956, 270729, 282563, 124328, 43817, -17590, -41723, -143602, 8506, 7058, -118479, 3192, 36605, -85089, -291424, -167435, -78924, 14737, -21268, -147850, -118809, 20015, 1475, 131186, 131547, 92048, 87707, -129405]
22566a29405k46371j85056L6200K32121M21272K01139o4553j88215J54533O9129
22556C00794k66970j0520J24484j43763O4102R0806o8318k8253j43499p2579k3170
22545a76886J8097R8244o1742J84660j56992n6558L4603n4024L9210j14486j29165
22534c75039j1582O0130J84468J49859n0254J90435r9804j14107j23663j44464
22524c34021J91059J59948J30381j31132j98199N3122J02817K08208L128l17748
22514a32437m1904j9359j36984j45296K00657J9324K81028J10952o4303j03502
22504c1824j7067o5220K80217K71649J40509J7482j36659k37830j10351k092l8970
22493F9844Q581n3842q2087r2879M1133l81670M3940L47212L09472J12063k63257
$$ y = [-129405, -375776, -560832, -524632, -292511, 128761, 329900, 265347, 77132, 231665, 300794, 33824, 23304, 147788, 4025, 68127, 158933, 90615, 62362, -81137, -153716, -176886, -158789, -60545, -122287, 62373, -94619, -151177, -116574, -170598, -131388, -245874, -375039, -386621, -326491, -142023, 7836, -42418, 148017, 48213, -65894, -189557, -334021, -142962, 16986, 147367, 16235, -181964, -128842, -26025, 182183, 185311, -132437, -174341, -193700, -330684, -475980, -275323, -255999, 25029, 135981, 71678, -31824, -48891, -114111, 166106, 437755, 578264, 595746, 459087, 221257, 110906, 108814, 69844, 78425, 24583, -57504, -150383, -109250, -490920, -446980, -99768, 209704, 321767, 58510]
22482E8510j9213l137Q4420n6338r2500l23063o0421K97580J58914J52395J43373
22471C40520j51451j12515r8043k18543J67359M081q8078n9046o2250K15740K7252
22460c4974k59916k81347k4866J52987J07328J03273n5401J70256N2924k36158
22450c05894o1453n9128J08966M5868K4228k6134o8619K832q7595J17360L13534
22439C965L87399J6428l16329j76729L087k315Q2737j66084j56067L69476J02315
22428A47883j61966R8355K07161j97635k7912j13521J03531j6241r9784j37855
22418a97984K5259j65961O5535J16789J99195J89589K9455j43469n7668N6997
22408A17737q3057k39546k4801j00298K79178m4822j97738J75493j36675k71875
$$ y = [58510, 39297, 36160, 120580, 64242, -28258, -351321, -411742, -114162, 44752, 197147, 340520, 189069, 76554, -21489, -240032, -72673, -68592, -156670, -215716, -277966, -62226, -34974, -294890, -576237, -601103, -448116, -340788, -237515, -292916, -122660, -69736, -305894, -367347, -426475, -317509, -271641, -247413, -273547, -342166, -339334, -426929, -309569, 3965, 391364, 407792, 91463, -85266, -82179, -84494, -1757, -167841, -323908, 45568, 147883, -14083, 84272, 291433, 93798, 65886, -47635, 55896, 39655, -60129, -197984, -172725, -338686, -273151, -156362, 42833, 232422, 261877, 118408, 60740, 117737, 34680, -204866, -229667, -329965, -50787, -95609, -293347, -117854, -254529, -526404]
22398e26404r166J70418j1781P7128K4515J18159J48440J17656Q7420N9501l33053
22387g7167m0094K44138p4386r0300k20877J10633J53617j16396k04259q377J67055
22376a56413J7604p0135p350J35222J02430p3834o1398R7798j494R7761l8097
22365D2094r4878j08895K76940Q920k8838K48633R7138N8442l70821k56688J71861
22354D3908K5316j17692r660j34084K06906p8877q2498J27584p0373P483R4185
22343A2198j8494J08059j12640j82351L8765J41074J40072j7559k10035k15187
22333c16098l2081K69096m0001M3400J37788m3693n6345Q2189J59687N0279j68415
22322H5806r3736j4182j41872n6300J23208l3020j0016J74724J9198k25021j68423
$$ y = [-526404, -535570, -365152, -376933, -299805, -275290, -157131, -8691, 108965, 196385, 255886, -77167, -117261, 126877, 52491, -37809, -258686, -148053, 5564, -110832, -315091, -323468, -156413, -138809, -208944, -216294, -81072, 21358, -52476, -113874, -16076, -17570, 80191, 42094, -52784, -161679, 115261, 124181, 95343, 343976, 441114, 499556, 128735, -127953, 43908, 69224, -48468, -58128, -192212, 14694, -64183, -146681, -19097, -89470, -81987, 12198, -6296, 101763, -10877, -193228, -154463, -13389, 126683, 109124, -100911, -316098, -348179, -79083, -119084, -75684, 62104, 18411, -37934, 44255, 203942, 254221, 85806, -7930, -22112, -163984, -220284, -97076, -130096, -140112, 34612, 53810, -171211, -339634]
22311c39634j2813j55482k1167L54617O6961j40087J22462M4841J13922k25246
22301a91626p914J46060l07k27708J39410J92320J67483k48010j00722j48092
22291b79106j58438J06819K47625K63334J07855k66181P7520J37663j6575l0581
22281A89935p8816n6833L0717j67226r6923k17343j31055P6524J81161r779J5537
22270b64101J04809P7848K62667l7228k37708p9589j79165J53363K77813J69229
22260B47938j23263k60420J19548Q6807j45636j31512k02899j141q980j61690
22250e81248N5921J16574K48185J59201r0099j62749Q7448l9591j6327P5392l3109
22239a80402P2223j03252k93819j52739N3518J90599J00973M6179M4069j86153
$$ y = [-339634, -352447, -507929, -529096, -174479, -107518, -247605, -125143, -80302, 33620, -191626, -199540, -53480, -53787, -281495, -142085, 50235, 217718, -30292, -131014, -279106, -437544, -330725, -83100, 180234, 288089, 21908, 99428, 237091, 220516, 189935, 111119, 54286, 85003, -82223, -179146, -396489, -527544, -451020, -269859, -279638, -264101, -159292, -81444, 181223, 143995, -93713, -173302, -352467, -199104, 78709, 247938, 124675, -135745, -16197, 70610, -75026, -206538, -409437, -410578, -419558, -581248, -525327, -408753, -160568, -1367, -91466, -254215, -166767, -206358, -222685, -147293, -180402, -108179, -211431, -505250, -657989, -604471, -413872, -312899, -266720, -222651, -408804]
22229d08804q4447K68618K66249k26283j05495R5025J18410l09756p5312M10980
22219e0815K78703J08335P5328o8309l61422r7073O8507o255M6254M337j20235
22208a22645J49010M1372r4716J30743J69014j2262J07546K3659K2546l6150k62784
22197A15333j30623m996j41372J53807J22826J81307n658p3525k53709j49988
22187a86598o3141j00827J00652M0513q5443L13872J16217n7290R4356k0796n1415
22176A00100Q2517Q7566L6557j29728q9638L8330j00652j68625p902j08438j33659
22165c93572O9515K30369J18547j5041J3302K1048j90277r7783K21676L45714
22155C23498m0779j22129o5754o4250j93893r710o6533K2207J57287j99988L6184
$$ y = [-408804, -493251, -224633, 41616, -184667, -290162, -195137, -76727, -386483, -461795, -50815, 227888, 336223, 411551, 343242, -18180, -115253, -46746, -53001, -6747, -2410, -122645, 26365, 67737, -26979, 103764, 272778, 260516, 368062, 391721, 414267, 378117, 115333, -15290, -20286, -161658, -7851, 114975, 296282, 290624, 217099, -36610, -186598, -249739, -350566, -249914, -209401, -294844, 19028, 135245, 77955, 172311, 151515, 100100, 182617, 270183, 306740, 177012, 87374, 125704, 25052, -143573, -151475, -259913, -393572, -324057, -93688, 24859, 9818, 23120, 44168, -146109, -243892, -22216, 323498, 282719, 160590, 94836, 30586, -163307, -173017, -239550, -217343, -60056, -260044, -223860]
22144b23860J04372J45701j89610O3116K05060J40319Q1498k12924j03145J28505
22134A39032j55131m465r9867P3586O4744L4242J7706N09J37119M1228P4923J26719
22122D50345p5689n61978M6442O8598j64722r8029J00665J45712M6634r8383o9692
22111b10097M2474j23856N2043J92518p4395M19161K93255p9045l86980l85496
22101b60418Q7868J35498J12539l9060J7140p9660m8763M7090r6622m8671R2499
22090h0560l2434m3725j84661m1645L06988J68312M1184m3376j17247q5493N2407
22079f0250n6562J37248K62343m676k344J2935j61461k19641M0808R9162J07687
22068A55249J26028k24714k18092o9117J13322J6690M039m2411O61J02684L08045
$$ y = [-223860, -119488, 26213, -163397, -100281, 104779, 245098, 326596, 113672, 10527, 139032, -16099, -20564, -120431, -46845, 17899, 52141, 69847, 70356, 207475, 248703, 323626, 450345, 374656, -187322, -140880, -72282, -237004, -335033, -234368, -88656, -42022, -140405, -210097, -167623, -291479, -239436, -46918, -121313, 297848, 591103, 512058, 125078, -260418, -172550, -37052, 75487, 36427, 53567, -26093, -74856, -27766, -124388, -173059, -80560, -112994, -156719, -341380, -383025, -76037, 92275, 133459, 90083, -27164, -112657, -60250, -116812, 20436, 282779, 278103, 275759, 288694, 127233, -92408, -51600, 47562, 155249, 281277, 56563, -161529, -230646, -117324, -100634, -96595, -139006, -138345, -35661, 272384]
22057B72384j24418j83419n4925j50438M8658p1130j0994J1547m708J4956K40961
22046a1526J14820j12397j7647j93748K66840R45k51708R668K03731q8608k66710
22035c46340q7599R8660L3508J63768J14947j13920l47544p4290L4775J56851
22025c67184J04323k2255O6101J78648K99739J01454o8830l09431r7321j12893
22015b27649n33K13960K86191Q680j48484n1189j64507K2891j45456n2088K7603
22004b30581l5129L4006J47320K5959j68930j5965J22894K7448j4187k27493k95
21993c34953J49374k4320j37005J34509K08882k3092J01457M1815j08445j72463
21983a64241J53910J08608Q6694r0811j943j35302k88744R2507K6438J18659j1027
$$ y = [272384, 147966, -35453, -90378, -240816, -192158, -263288, -274282, -262735, -267443, -252487, -11526, 103294, -9103, -26750, -220498, 46342, 47287, -204421, -194753, 8978, -79630, -346340, -433939, -335279, -301771, -138003, -23056, -136976, -484520, -558810, -524035, -367184, -262861, -285116, -219015, -40367, 259372, 360826, 291996, -17435, -114756, -227649, -228182, -14222, 271969, 280649, 132165, 80976, -83531, -60640, -206096, -258184, -230581, -265710, -231704, -84384, -58425, -227355, -243320, -120426, -92978, -107165, -334658, -334953, -185579, -209899, -346904, -212395, -3513, -26605, 74852, 116667, 8222, -164241, -10331, 98277, 184971, 94160, 92217, -43085, -331829, -239322, -212884, -94225, -105252]
21972a05252R1932K2787k59211N123q960Q7375j90929r3233J12510J53850R6082
21961h7926r8705j84006L800O9317L8272j20958J88050J24126l9204L4643L1370
21950d1221N6277R2543P632N0005k6808O5283j37461j03852q1021J07018J74056
21939A62451j44164k08619o074L3568J14423J5087j5900q6586J50109n6373p6586
21928a18664j09371M042K54405J08534j92883p4057K2165J43634K2021Q6877k69401
21917a22698k06251K5643R65K0080J23598k1424j6845J70531m7489J5929j6949
21906g4910Q8496K65671R3337n6492J35599j2198k22155k94871L7793k00997k37156
21895d77883n7640K82742L94789K60912J15606l52423l79356j82402k0943J52714
$$ y = [-105252, -13320, 9467, -249744, -244621, -253581, -166206, -357135, -450368, -337858, -184008, -87926, -186631, -370637, -366837, -297520, -259248, -380206, -192156, -68030, -107234, -72591, -41221, 15056, 107599, 115231, 165236, 138428, 203711, 66250, -37602, -118623, -11605, 162451, 18287, -190332, -196406, -162838, -48415, -33328, -49228, -135814, 14295, -42078, -118664, -228035, -223993, 30412, 138946, -53937, -127994, -105829, 37805, 59826, 146703, -122698, -328949, -303306, -302341, -282261, -158663, -180087, -196932, -26401, -73890, -57961, -74910, 13586, 279257, 372594, 316102, 451701, 439503, 217348, -77523, -39730, -240727, -477883, -535523, -252781, 142008, 402920, 518526, 166103, -213253, -395655, -416598, -263884]
21885b63884J12674R4955J24316j2902M4564k12027l89106L3573O7061n8247l9141
21874d98164Q4307M6775j4047k4835n6680r7905Q1424L4131J03829J0379l825
21863c34611N6488j05363J457q8586K6849j4092J07038m2810r6794J23862J21392
21852b45170M5248K6619k3353j32783N4536P8784k4371j2518J85857J26202k14940
21841a35889k45342j41958J94507K01411k2725K37820L5900J18749k69259j067
21831b7853J5393J06102j59763l67460P1526J82385l4039N1492J30265K253J62128
21820A32429o6470r6965j56013r24L70129J98175N1252k01648k44623J21573M5498
21809A52413k25376m8518N6287j50411p1303l9900K42117K72537j02506j80663
$$ y = [-263884, -151210, -56255, 68061, 55159, 99723, -112304, -501410, -467837, -400776, -459023, -498164, -413857, -367082, -381129, -405964, -462644, -560549, -479125, -444994, -341165, -330786, -334611, -278123, -383486, -382029, -470615, -443766, -457858, -350820, -393630, -490424, -366562, -245170, -199922, -173303, -196656, -329439, -274903, -196119, -220490, -233008, -47151, 79051, -135889, -381231, -523189, -328682, -127271, -149996, 87824, 123724, 242473, -26786, -27853, -12460, 93642, -66121, -433581, -362055, -179670, -213709, -162217, -31952, -29699, 132429, 65959, -31006, -187019, -187943, 182186, 380361, 431613, 229965, -14658, 106915, 152413, -72963, -121481, -65194, -215605, -286908, -326808, -84691, 187846, 85340, -95323]
21799i5323j9430j80832k38598L9044O56258O9390j56161J37869M9188j04881
21789A56524k4415k52121j93203j34581M6977L13913J55164j15848K9375J41820
21779A23605O2227J67206k0520l03173l39503J11084J12452J23352J64656P9323
21769B80709J01698r5248K2008k07179l8022J7740M7179K31521j33029o3022J15808
21758B80163n6735r6572p3163r5796L3414n5195K1692o8936j28477P0991J49170
21747a9444K8491N7745j06493l0812m7580l0847j11242K08645N8238j06980M2182
21736e8097Q4782q1182Q158J33377J1842j98054j80382K58152J22479Q1753o6718
21725A16110l86489j73838J35671J36857Q7956J2591Q1942J8033o3861p3527m0521
$$ y = [-95323, -114753, -295585, -534183, -495139, 161119, 230509, 74348, 212217, 261405, 156524, 132109, -120012, -313215, -447796, -400819, -86906, 68258, -47590, -18215, 123605, 185832, 353038, 332518, 29345, -310158, -199074, -86622, 36730, 201386, 280709, 382407, 287159, 309167, 101988, 63966, 81706, 128885, 360406, 227377, 164355, 280163, 223428, 126856, 53693, -42103, -8689, -63884, -42192, -111128, -239605, -168614, -19444, 9047, 66792, -39701, -70513, -118093, -148940, -260182, -51537, 6701, -100279, -58097, 26685, -54497, -46339, 87038, 98880, -99174, -279556, -21404, 101075, 182828, 116110, -270379, -444217, -308546, -171689, -83733, -71142, 10800, 28833, -35028, -108555, -149076]
21714a49076j81645m3166J36806K61375J91416K02533k25082j47880r1226o8416
21704a14361k19235K3593j70265K19153J08769j42481J16675O8003J26438L0759
21694D7048j66897o334P6345P8106M3702m5354k3690J13790l5520k59572j46930
21683c25306J63439J28214R8649J401p7704r6295J25272J7516p8321K55325J25810
21672C38000j43709j58112Q0559j93868p2749l6263j29817Q9271K96789J79807
21662B49908O3485p9129j07288o100J9719m00436j14074J80099M7182k43358n5809
21651d45801Q1317L1156M6233J81606R6588m4998J20239p7830m6785l8341K89055
21640A92439J57811k01170k95605L47N7819L16011J13778q5086j02955j546k78259
$$ y = [-149076, -330721, -373887, -237081, 24294, 215710, 418243, 193161, 45281, -45945, -114361, -333596, -310003, -480268, -261115, -152346, -294827, -178152, -110149, 16289, 47048, -119849, -126183, -49838, 28268, 71970, 26616, 2926, 116716, 81196, -178376, -325306, -161867, -33653, 64996, 66397, -11307, -107602, 17670, 35186, -43135, 212190, 338000, 194291, 36179, 116738, -77130, -149879, -186142, -315959, -226688, 70101, 249908, 313393, 234264, 126976, 120876, 140595, -259841, -373915, -193816, -146634, -389992, -445801, -364484, -333328, -287095, -105489, -8901, -53899, 66340, -11490, -58275, -96616, 192439, 350250, 149080, -146525, -146178, -88359, 227652, 341430, 256344, 153389, 151843, -126416]
21629a26416n9134N1009j43917M1198J89396l9047O5013L24287j06239l24958
21619a28808q6455j93732n4265N7896P2605J7942j83152J04028K93725n3786j17204
21608b71206Q0313j9354r915K11831J62658n7241l56427j78048R5626o3730L1069
21597c74424K14089K71669P2279j2859p2110j21860m5968J60796n9858k85705
21587b53951j32836k9470L6800L61717K01740j6957j95704n9640k0992O2766j1483
21576e8010K25531J77207P9682m48900M4781K00734q7793m976o2686j53265n3349
21565a41044m53544L2750l6850L1698J31576j26817J25783L71486K65156n7166
21555A43028k14844j92938j42080J06436R8246O2401J19853j06044K40748m9849
$$ y = [-126416, -185550, -134541, -278458, -237260, -47864, -86911, -21898, 302389, 196150, -128808, -215263, -408995, -463260, -405364, -332759, -314817, -497969, -393941, -100216, -154002, -271206, -190893, -210247, -220162, -8331, 154327, 97086, -259341, -437389, -341763, -405493, -374424, -160335, 111334, 183613, 170754, 98644, -23216, -69184, 91612, 31754, -253951, -386787, -416257, -379457, -17740, 184000, 167043, -28661, -88301, -109293, -46527, -58010, 167521, 344728, 424410, -24490, 20291, 221025, 133232, 128256, 65570, -87695, -141044, -594588, -561838, -598688, -566990, -435414, -562231, -436448, -64962, 200194, 143028, -71816, -264754, -406834, -300398, -202152, -139751, -19898, -125942, 114806, 64957]
21545F4957j84534j44038j39618K47483J64325M7695J9831l8169k5371j21104
21535a08543P6028P3666P8704j8028K4084k43793j72314L1302K49389J60737k20663
21524f9431l10896n2736M6550j09489L49139N9335k88123O6135n0284K24366K94772
21513A59338K78789m1376k18206q0665m73J85823Q9627n4285n1292k04007o4825
21502a552J04917p2830R8818R741j17156r4156m0876j34738o3425l3382Q2791
21491b61848K75346M3035j12327Q320J24584N7860k09902l3230J84137j24460
21481d8485j67715l0342K0512j92828j15850K42682J25817J11819L7720r9147
21471a15817o4714K78242n3669J29110R4299n2774j03574k2641j40393m7855O4121
$$ y = [64957, -119577, -263615, -403233, -155750, 8575, 56270, 76101, 37932, 12561, -108543, -32515, 41151, 119855, 101827, 125911, -117882, -290196, -258894, -9505, 151232, -69431, -380327, -433063, -386513, -496002, -146863, -87528, -375651, -309516, -359800, -135434, 159338, 438127, 396751, 178545, 97880, 97407, 283230, 372857, 318572, 267280, 63273, -1552, 103365, 30535, 129353, 139094, 21938, -72218, -113094, -247832, -311257, -344639, -261848, 13498, 56533, -55794, -47474, 77110, 134970, -74932, -108162, 75975, -48485, -216200, -246542, -226030, -418858, -534708, -292026, -166209, -54390, -16670, -115817, -180531, 97711, 44042, 173152, 267451, 214677, 111103, 88462, -51931, -99786, -35665]
21460c5665j02690k31021j09264J75427J74943O5212J12845j31872L0823l4737
21450h5999K6678J70391k25715k14760K7286r1531j02298k1029j4976J36287K71454
21439a24212J35393L0469j66240R005r8909j49877k39044P2446K75180J41993
21429a13796n691l2477K0610k95696J4098K80071J85481k12338k41300J28922
21419b72116J8510J85347J6312p5163r1822m5059P2522r157K27263K53372j11607
21408A68402j23158j8942Q4039l8520j13577N8907K04445j56443j26994j35770
21398a97611M9829J83152j35754k38312J4460N9180J15998Q1747o2664q4439J55002
21387e9412Q7736k4543r2379l05528Q204K07302L6350J00144J03852J19299l5054
$$ y = [-35665, -138355, -369376, -478640, -303213, -128270, -63058, 49787, -82085, -51262, -85999, -59321, 111070, -114645, -329405, -302119, -393650, -495948, -516977, -531953, -395666, -124212, 11181, 41650, -124590, -115585, -214494, -364371, -603415, -530969, -255789, -113796, -119487, -151964, -131354, -427050, -412952, -132881, 52600, -159738, -401038, -272116, -253606, -68259, -51947, -127110, -218932, -263991, -191469, -200626, 26637, 280009, 168402, 45244, 26302, 110341, 71821, -41756, 17151, 221596, 65153, -61841, -197611, -147782, 35370, -100384, -338696, -324236, -265056, -149058, -67311, -129975, -214414, -59412, 28324, 3781, -88598, -394126, -385922, -178620, -142270, -42126, 61726, 181025, 145971]
21376A45971k15885J29356J34271J19053K30873j16201k73991j68243k18315L3748
21366a99363J48978K02711J18430j86755k07427k55652K08801K19367P1563R8670
21356B19323M0455j02253l28334n5020J49971J55690J15284j53666J21614J73338
21346C36402N2000p7752k45782m3695J0974p7313r8704j66133L2726P8623J09610
21335h9044K17598o8448k20319J02902R5830O08J75150L6892o2147j47942k95514
21324b54434l599J05725p7440j21212R6604J71637Q1394k31412R653J62694P2553
21313A2163J89531N5217L5762K4223J6019j45464j32565r6174J1615K21983k3798
21302A68512l52437j04675J54510J24659o0518l9982q6273P1807n1548j22254
$$ y = [145971, -69914, 59442, 193713, 312766, 543639, 427438, 153447, -14796, -233111, -199363, -50385, 152326, 270756, 84001, -123426, -379078, -170277, 49090, 120653, 219323, 259778, 157525, -170809, -225829, -75858, 79832, 195116, 41450, 163064, 336402, 388402, 310650, 64868, 21173, 32147, -45166, -143870, -310003, -277277, -198654, -89044, 128554, 60106, -160213, -57311, 38519, 39127, 214277, 251169, 189022, 41080, -254434, -258033, -152308, -229748, -350960, -254356, -82719, -1325, -232737, -223084, -60390, 12163, 201694, 256911, 292673, 316896, 332915, 187451, 54886, -41288, -29673, 192310, 168512, -183925, -288600, -134090, -9431, -69949, -109931, -196204, -124397, -175945, -298199]
21292b98199p997o025J55417l3332p3644R049l4798j31351K17368J18600r9846
21281a84758o7609J58648K12596L61317L9335l67294j48905J4875l3928j88236
21271b03959K2683N0685O8504L4225p0939o1030k3496N0693K5102R9709r7259
21260a05082K9301k61581j81199L54709K25581j71168k6548J60432J19790k26253
21250h2018k66492o0635J7667P7440k3632J33791J42915M754K8367J08626j86739
21239a05956k28472J04298K30819J14279P7756k1107j01934j8637m1455n7230
21229d7639N4778N0230N6517J2979J88238l416k5075j50252m40425O0147O1481
21218a82437L2612P4222j21664K3850J24026J61885K95223R3828m35031j28384
$$ y = [-298199, -306196, -312221, -156804, -190136, -263780, -254731, -289529, -420880, -203512, -84912, -184758, -252367, -93719, 118877, 480194, 519529, 152235, 3330, 18205, -15723, -203959, -181276, -130591, -62087, -27862, -98801, -159831, -183327, -132634, -107532, -7823, -105082, -75781, -337362, -518561, -163852, 61729, -109439, -135987, 24445, 144235, -82018, -348510, -409145, -391478, -314038, -337670, -203879, -60964, -56210, -27843, 80783, -105956, -334428, -230130, 689, 114968, 192724, 171617, 69683, 51046, 9591, -47639, 7139, 57369, 113886, 126865, 315103, 311687, 286612, 136360, -304065, -243918, -182437, -149825, -75603, -197267, -173417, -49391, 112494, 407717, 501545, 66514, -61870]
21208f1870l8784l20279j08130J09077J01762K22844K144j51181q149Q001N9802
21197a84763P3285R645L7822j44962L10K7617j50869K68186m7751P69m8022K23362
21185F4629J75851l2714J07117N4138j89425L6242l51497k81999K03909M37651
21175B23902p0402j48520N3337K37928k27667p8016J11935j96296r7336K00843
21165I708p5013L0171l5361j93028j92678J48446J40116L7245o1695k35694k08108
21154f35891K46402K45256j40238n0858M126K33728k9626j36795K08730M12391
21144C57225p4456p7166k23012j36509j05770O4322J40744K87362l7113j72237
21134B3390k29183j39212K1686Q0005J83292Q8416J9456j13328j90022O8655j5958
$$ y = [-61870, -100654, -420933, -529063, -419986, -318224, -95380, -93236, -244417, -252566, -244565, -184763, -111478, -101833, -64011, -208973, -208663, -181046, -331915, -63729, -111480, -110711, -158733, 64629, 240480, 207766, 314883, 369021, 179596, 215838, -135659, -417658, -213749, 223902, 153500, 4980, 58317, 296245, 68578, -9438, 102497, -93799, -191135, 9708, -65305, -35134, -70495, -263523, -456201, -307755, -167639, -130394, -192089, -427783, -635891, -389489, -144233, -284471, -335329, -331203, -97475, -127101, -263896, -55166, 357225, 282769, 205603, -17409, -153918, -259688, -195366, -54622, 232740, 195627, 23390, -205793, -345005, -323319, -243314, -60022, 28394, 47850, -65478, -255500, -186845, -202803]
21123b02803n7114J96690J2256J49260J73736j73409n2169J16022j51071k40826
21113b29428r482k62160k1232J97593M9255J88631r5935j65117m5504J22850J60837
21102a09692K2244j00570J20575j40689k72725J64348J91731J36933J46848J42233
21092C01236o0624j57629k8660m257l6632J23075J5687m3062q9448j51173j58774
21081b90261j34797J07701K00194Q2507k43495J4551L5291N129n888K07719n1126
21070g2475j28211P6041J16534n9096j37776J47202L23521p6944j65864l4391
21060a1459J946k07161n8242P3930J29499r4431j574j41041n4516Q4819o1788
21049c40018j54450k4767J61554K70027J03023p8096k686m8251j35008j02945
$$ y = [-202803, -259917, -63227, -50971, 98289, 272025, 98616, 46447, 162469, 11398, -229428, -238910, -501070, -522302, -324709, -275454, -86823, -182758, -347875, -393379, -270529, -109692, -87448, -188018, -67443, -208132, -480857, -316509, -124778, 12155, 159003, 301236, 240612, 82983, 54323, 50066, 13434, 136509, 152196, 109134, 19686, -131487, -290261, -425058, -317357, -117163, -34656, -278151, -263600, -228309, -223180, -229068, -21349, -72475, -200686, -124645, -8111, -67207, -204983, -57781, 265740, 188796, 22932, -11459, -9513, -216674, -274916, -200986, -71487, -165918, -167492, -308533, -363049, -278230, -340018, -494468, -519235, -357681, -87654, 15369, -62727, -65413, -113664, -248672, -351617]
21039c51617n0276O0503M5610J6960r327p1836k49171j33605J70201N0020O1328
21028d61210J69466R9333r5040J50987K71743j15372N6952M0807k64808q4555
21018b31697k220o2942M6584K77986J68601l0478k31072j5270J79654k20486k45661
21007c67001q4538L59073J13859m265j74880q4778N559O733p4240l7626l4780
20996c76884J23587J30554J38073l2028r0136r6082K5868o8643J16567J33513
20986D389Q1118N9465j51969J79168j02473k36447p9873j65267j20815p8086J17782
20975d93008K64103J64034n1717k97165j25852L26768J13498k43804p8650P4995
20965c46798j14004R7928J98178K17910J50167l2461M1778j72163j16490k42535
$$ y = [-351617, -401893, -341390, -295780, -278820, -288147, -359983, -609154, -742759, -572558, -522538, -461210, -291744, -192411, -287451, -136464, 135279, 19907, 76859, 117666, -147142, -231697, -233917, -296859, -250275, 27711, 196312, 165834, -65238, -80508, 99146, -121340, -367001, -451539, -92466, 21393, 17128, -157752, -242530, -236971, -230238, -304478, -342104, -376884, -253297, -122743, 15330, -16698, -106834, -202916, -177048, -245691, -129124, 4389, 85507, 144972, -6997, 172171, 69698, -166749, -246622, -411889, -532704, -610790, -493008, -228905, -64871, -116588, -413753, -539605, -212837, -99339, -343143, -421793, -346798, -460802, -362874, -164696, 53214, 203381, 170920, 212698, 40535, -75955, -318490]
20955c18490J5815J168J54932n8242J25313J49692l0842p6742K7770M33582r7407
20944C26549Q0334k06422p3573j50700l13926J41766M3049J18539M3691p7784
20934f8477q2363q2368l2192p3067K5316J87779J12995O7073N303R2753L9877
20923A92629Q4442J38455L3188k55577j10544O8499k16899j12132r7184J03799
20913a71324J59056K56214J82277j71304j05064P1489J79213j5976j50345j7342
20903B16894m4095R7564q3699l8603l14825k49990p5774L11692L8454k03751k8263
20892c74396K24504J64227m0315j77315k05075j71218K34060K26130q6488k01889
20882d07775k5615K43495Q9308J78927R5082j19524j20388J29528m6444o8455
$$ y = [-318490, -302675, -301507, -146575, -204817, -79504, 70188, 39346, -37396, -9626, 423956, 326549, 406883, 200461, 126888, -23812, -337738, -195972, -152923, -34384, 9307, -68477, -150840, -233208, -265400, -338467, -313151, -125372, -12377, 54696, 59999, 152752, 192629, 277071, 415526, 448714, 193137, 82593, 151092, -65807, -177939, -275123, -171324, -12268, 243946, 426223, 254919, 149855, 221344, 400557, 384581, 234236, 216894, 172799, 270363, 186664, 148061, -166764, -416754, -492528, -180836, -142382, -346133, -374396, -149892, 14335, -25980, -203295, -408370, -579588, -345528, -119398, -205886, -407775, -433390, -189895, -100587, 78340, 173422, 53898, -66490, 63038, 16594, -51861]
20872e1861m0848J04926l2311L5896n4273j38885J35781q2446r286o3633L481
20861a93459k1000r693J35976J52440N7452J06322p992p594L2389o7134n3501
20850A24206M4935j66402l77805n7512K39015R9155O1482M9662q5793k54966j39689
20839d63712o5395K14400K38432Q0104J0321p6758M4166J19163k8845O7751q6512
20828E3115n9579j6355j31587l9654J08577N5984r3390M6912J43488j38575j72334
20817b43398N8924N7770R5258j50684J6533J88514J07584k23679l8430L75012
20807B43404J77281Q481j8030k44229q2527O0533k15643m0576J8899J15231j3332
20796I492j91158j18376J93352L80r4323o5851R8998J23811Q7479k64035N509
$$ y = [-51861, -92709, 12217, -20094, 15802, -38471, -177356, -41575, -124021, -133307, -196940, -193459, -214459, -224152, -88176, 64264, 121716, 228038, 220046, 212452, 244841, 177707, 124206, 169141, 2739, -375066, -432578, -193563, -94408, -32926, 16736, -69057, -324023, -463712, -529107, -314707, -76275, 3829, 14150, -62608, -18442, 100721, 71876, 139627, 53115, -6464, -22819, -154406, -194060, -85483, -29499, -122889, -75977, 67511, -71064, -243398, -184474, -126704, -31446, -182130, -165597, 22917, 130501, -93178, -131608, 243404, 420685, 429166, 411136, 166907, 84380, 144913, -70730, -111306, -92407, 22824, 9492, -181666, -300042, -106690, -106310, -200633, -266484, -167486, -43675, 43804, -220231, -214722]
20785b14722J53934p0305j19810r894J45408k62554j48417K51706K65009J31839
20775A22194q5173m6476j29790J18855r1836k2605J54232R4563P6687K19533k14063
20764A96121k01371L49854q0620j81836J02835k90745l08633k529o726Q7013J25004
20753b11633l10818L556L99196L2535j9376o8605r3675j62559j78783J31561j65733
20742f44334J07172K03044J96994M7957J36697o9059l32261r1557m0264L9834
20732d45777j13455L4927J01183J05857L1086J5218m59P795K14451J69048K81555
20721D01429M9061l04811j94702j21386l1706J77095O5552j09582O2381M5872
20711C9203K15300n665k40302J8817L93954l0156o28923k41419J68311J62042
$$ y = [-214722, -60788, -131093, -250903, -260797, -115389, -377943, -526360, -274654, -9645, 122194, 37021, -9455, -139245, -20390, -112226, -134831, 19401, 113964, 190651, 410184, 196121, -5250, 344604, 263984, 82148, 184983, -105762, -414395, -416924, -423650, -336637, -211633, -522451, -518895, -119699, -87164, -106540, -175145, -268820, -431379, -610162, -478601, -644334, -537162, -334118, -137124, -89167, 47530, -21529, -353790, -445347, -485611, -445777, -559232, -524305, -423122, -317265, -286179, -270961, -271420, -263625, -49174, 119874, 401429, 450490, 145679, -49023, -170409, -202115, -25020, 40532, -69050, -6669, 39203, 254503, 248838, 8536, 27353, 421307, 391151, -237772, -479191, -310880, -148838]
20701a48838K90720o3494j74265J17406J30835n1046M0722R9023j43868k37875
20691a40680k95840L184p7764o0434j26726r95J91811K75559K70947L79557p1609
20680C47010k30311p3219k24088J36749q853q3751J25720l9740Q7979m2953k29670
20669b35127q382L3614j7601j0232P933J703m1296J92696J97262J27110j24991
20658A22689n2451r7112j63606Q1751Q8068L0651K60344J91026j91248m97450
20648b27338k3951P6571J66355j0855M636L2565j5438L5969Q6442o9432j24751
20637f9227k02260o8336p6861M0145o2816l0334J16069R1648K7930k425R0218
20626a46249K06002N9474r6275n7121P385j67006r9304n8780K2795J06714Q7971
$$ y = [-148838, 141882, 78388, -95877, 21529, 152364, 101318, 142040, 241063, 97195, -140680, -436520, -433336, -511100, -571534, -698260, -699255, -507444, -231885, 39062, 418619, 347010, 116699, 43480, -180608, -43859, -52712, -136463, -10743, -50483, 37496, -5457, -235127, -243509, -209895, -227496, -237728, -229795, -228092, -269388, -76692, 120570, 247680, 122689, 70238, -26874, -190480, -108729, -20661, 9990, 270334, 461360, 270112, -227338, -251289, -174718, -8363, -19218, -14582, 17983, 2545, 38514, 124956, 55524, -69227, -271487, -339823, -416684, -376539, -439355, -469689, -353620, -261972, -234042, -236467, -146249, 59753, 119227, 22952, -34169, -26784, -193790, -293094, -351874, -329079, -222365, -134394]
20615a34394K49642N7828N6296l08241k08973j41461J20460p2495N1365J77720
20605a52253j7792q4126J28261j6406J48572k3527P6705k40345l17961K4314J47938
20594c26620K47655M0030M1757n7126j13515n5313J36698K36630m6830P6168K07337
20583C86871o8038j20410l09321r8107M00972J35088k94203n5501Q4051k11304
20573a49902k07146K20454K91853J24107l9622L9650J50881J29365k14169k99919
20563D5552j23926l66430R1530M54264M8759j90248k04461l3103l4571o0677K84282
20552h9029k01920l53757J36033l4534J07141M02574K28883r2094k23381j25206
20542b45290J88938J67455j20578q5060j10138N953K17481J32283j26758q8818
$$ y = [-134394, 115248, 173076, 229372, -78869, -287842, -429303, -308843, -381338, -329973, -152253, -170045, -254171, -125910, -142316, 6256, -17271, 59434, -180911, -498872, -474558, -326620, -78965, -38935, 2822, -54304, -167819, -223132, -86434, 150196, 103366, 179534, 386871, 318833, 198423, -110898, -209005, 191967, 327055, 32852, -22649, 61402, -149902, -357048, -136594, 155259, 279366, 239744, 279394, 430275, 559640, 345471, 45552, -78374, -444804, -353274, 100990, 149749, -40499, -244960, -278063, -312634, -373311, -89029, -290949, -644706, -508673, -543207, -436066, -33492, 195391, 103297, -120084, -245290, -56352, 111103, -9475, -94535, -204673, -198720, 18761, 151044, 24286, -64532]
20532f4532j74985K19088Q2805L4597j04853j05073J27545P1828j14865j58086
20522a86531p5478J07667q6083l59802J11679J95136n364j87171j33583K98993
20512c20537J0174m0541O6298o417j21282J57040K85148J26392o0402L4584J97206
20501C27663m7799k32531j73377J80940K32476k40498k01680m2492q6964J15073
20491a69189J78605M5112r0208L9542k33590j87786R7803L06979j00366j28011
20481b41109k6164j20770K25663L6160j37168J49599r128K0954j52179O5108J63401
20470b5633j39834m6465J3791l7348Q8159q0653p8244j45794m2076J2165J54601
20459c27331J10358O4361K10514O642L5391J11626K06792k51835j38634J10328
$$ y = [-64532, -239517, -20429, 62376, 96973, -7880, -112953, 14592, 86420, -28445, -186531, -262009, -154342, -240425, -600227, -488548, -293412, -298776, -485947, -619530, -320537, -310363, -350904, -284606, -291023, -412305, -255265, 29883, 156275, 95873, 130457, 327663, 279864, 47333, -126044, 54896, 287372, 46874, -154806, -197298, -284262, -169189, 9416, 54528, -35680, 3862, -229728, -417514, -319711, -12732, -113098, -241109, -267273, -388043, -162380, -126220, -263388, -113789, -122917, -101963, -254142, -189034, -25633, -165467, -211932, -198141, -235489, -147330, -227983, -306227, -452021, -494097, -481932, -327331, -216973, -152612, 57902, 64544, 99935, 211561, 418353, 166518, 27884, 138212]
20449A38212J75602J0072J14165k34692m02807K2249O1501r45J74985O8286l7588
20438H9040J88815K1524r5988j87765J29984P2476k024j61411n0663k84003O7474
20427b12541l7694J97031L98145R2942j51488k01527o1344L1343Q191O0573k77645
20416a54014k6216J03079j93802m3431M6118K6330k07845J34010J06060l0636
20406b40347J01995J98486p7919R864J14479j02302N1401k2244j04320r7315l31752
20395d99974l7377J32866K5333K37478k0488j82458l4612p8495O1815K03634l8154
20384b30432o1544J85534l5646K39018K6054l51621R9605q470J5579J9661n6410
20373a58672o4235O9044R9765j39813J8878J57587J29913j74756n4872k98363
$$ y = [138212, 313814, 323886, 438051, 203359, -199448, -177199, -115698, -116643, 58342, 126628, 89040, 277855, 299379, 203391, 15626, 145610, 218086, 216062, 54651, 3988, -280015, -212541, -250235, -53204, 344941, 437883, 286395, 84868, 23524, 54867, 63058, 123631, -154014, -180230, -77151, -270953, -314384, -268266, -241936, -449781, -315771, -209711, -240347, -138352, 60134, -17785, -7921, 106558, 4256, 55657, 33413, -70907, -168222, -499974, -537351, -404485, -379152, -141674, -162162, -344620, -379232, -457727, -395912, -192278, -230432, -291976, -106442, -142088, 96930, 122984, -228637, -129032, -137502, -121923, -102262, -158672, -222907, -153863, -54098, -193911, -175033, -17446, 112467, -62289, -117161, -415524]
20363d15524p9247K84331K29385K90351L4979r2108r5009Q6293k3909j23192j8862
20352G7488l4563j9926j7141M6369J88243N3049K7916r5345J37582j93397m64155
20341b93880j1078J11652k1704J14980K3673N5273m7384R7229m7340j54609n082
20330a78270K46597K49304Q1459K7621l31308L0161r0325q2916N1278l7549K749
20319c1199K24053r5835j68694j70248K1768K26810q5309l88436j7335K39264
20309b45161n7103J3807K37088J15259L7401j5883j6818J25334J16466j45334
20299A65056J20574n1232k85531J00693J45382j68804m4865J65370p6217N9958
20289A30384J73151J71298M681j74664r5137k92609O6235J44650J43510l36730
$$ y = [-415524, -494771, -210440, 18945, 309296, 344275, 252167, 157158, 243451, 219542, 96350, 77488, 42925, 22999, 5858, 52227, 240470, 293519, 321435, 226090, 363672, 170275, -293880, -304958, -193306, -215010, -100030, -76357, -21084, -68468, 28761, -18579, -173188, -178270, 68327, 317631, 399090, 426711, 95403, 125564, 35239, -47677, 3601, -33948, -31199, 192854, 97019, -71675, -241923, -220155, 6655, -78654, -467090, -484425, -245161, -302264, -288457, -51369, 63890, 101291, 85408, 68590, 193924, 310390, 165056, 285630, 234398, -51133, 49560, 194942, 26138, -18727, 146643, 70426, 130384, 303535, 474833, 479514, 304850, 209713, -82896, -16661, 127989, 271499, -65231]
20279f5231j14346l6681k50572M7306n7051L85301L25243J53738j47038j93511
20269D7158J00026j22618r8417n3332J84414J97667l0341k82612j31511J62232
20259b7334K63074r3110J4405j6690n4844M560l1477j27839o9796L3681R916K7139
20247f8315j56902r7950j03139J37560K0471q039J02083K1191L008m325j39679
20236b94036j52645j43604J70495J04333j19184L02870J40629J27667J17622j05302
20226A48845k13870j01118L39407K03063k25476l29856R519J19832m0411j22401
20216b12466M7158R5256O1324J80133q1508k25197k0986J11055n9586j05570Q8299
20205a22088p300J01497N9368j3072M6646K78441j44472j08050Q9724j00771M9987
$$ y = [-65231, -179577, -216258, -466830, -419524, -476575, -91274, 233969, 387707, 240669, 47158, 147184, 24566, -73851, -127183, 57231, 254898, 224557, -58055, -189566, -27334, 235740, 142630, 157035, 140345, 85501, 90061, 58584, -69255, -139051, -105370, -95454, -68315, -225217, -323167, -426306, -288746, -268275, -276314, -174231, -153040, -150032, -154357, -294036, -446681, -590285, -419790, -315457, -434641, -131771, 8858, 136525, 254147, 148845, -65025, -166143, 173264, 376327, 150851, -179005, -169486, -49654, -90065, -212466, -165308, -70052, -8728, 171405, 89897, -135300, -156286, -45231, -104817, -210387, -122088, -129388, -27891, 31477, 18405, 65051, 343492, 199020, 90970, 180694, 79923, 129910]
20194A29910L07371k8939j96737k21913n1251M9973J58995k6760q3442j21061
20184h3854j7853J99119K52095J98281m0537l35239j96098r4584q3038p358N591
20173b03475R1652K55001K79373k39057j17860r8722q0287N8799N0908L4592J55282
20162A86206K51894O3404j06545j22033k22087l51557O4491o8233J30753N687
20152a68020N0439M9320j04226N7133K59694P0368N0179l05137j40540O7163j43582
20141b57209J70422J15997r920o9457k4770J02685N1184k58530k1317J94093J72560
20130A65738N4642O579k6678k62129j35633J5486l8594r2792R6545L4300J04535
20119g8001j43672r1231Q4801p2015L7663J02870J28752O4307j82347k16777p3536
$$ y = [129910, 437281, 408342, 211605, -10308, -61559, -11586, 147409, 120649, 37207, -83854, -101707, 97412, 349507, 547788, 507251, 172012, -24086, -118670, -201708, -209066, -203475, -111823, 143178, 422551, 183494, 65634, -33088, -113375, -54576, -3668, 30924, 186206, 438100, 501504, 394959, 272926, 50839, -300718, -236227, -304460, -173707, -168020, -117581, -68261, -172487, -115354, 144340, 214708, 264887, -40250, -180790, -113627, -257209, -86787, 29210, 19290, -50167, -74937, 27748, 78932, -179598, -200915, -6822, 165738, 220380, 226959, 200281, -61848, -197481, -181995, -220589, -313381, -216836, -182536, -78001, -221673, -312904, -228103, -300118, -262455, -159585, -30833, 33474, -148873, -365650, -439186]
20108d39186q6629n9768J27925K6481J4060O0923m1796n9557R0595M02649J02639
20097A38336n5818n4943q0508n3716k23834p2028Q4728j0477q9811j11361j04084
20086f33516O8943P2175R1696J22943J53177M9846q0451j74140P188o1639M1599
20075c42179J59346J23445J86197k15781r9177O0165K78436j60946j99515j28097
20065c38106K58734o9048k25935Q4308J02674q6372M3370K5484J9471j4529q0471
20054b80420n1649J27713J01502M3061j04103J06639o307j09446Q8455J04355
20044A9800L5720Q3237j26617j22821k9825j00335L11966K47403m201j08492j44215
20033F1620J61876J16712M1042P8843j46152j50186n3082k2264L7857j65446j06713
$$ y = [-439186, -525815, -585583, -457658, -431177, -417117, -356194, -397990, -457547, -366952, 35697, 138336, 82518, 27575, -52933, -106649, -330483, -402511, -317783, -328260, -418071, -529432, -633516, -564573, -492398, -400702, -277759, -124582, -74736, -155187, -329327, -322139, -383778, -342179, -182833, -59388, 126809, -88972, -188149, -127984, 150452, -10494, -210009, -338106, -79372, -148420, -374355, -290047, -187373, -273745, -230375, -204891, -185420, -199949, -280420, -332069, -204356, -102854, -59793, -163896, -57257, -63564, -173010, -84555, 19800, 55520, 138757, 12140, -110681, -140506, -240841, 71125, 318528, 314327, 205835, 61620, 223496, 340208, 381250, 460093, 313941, 163755, 110673, 88409, 126266, -39180, -145893]
20022a45893K03402m7653j21657J48441O7527j04551j17924J85793o5547r6013
20012i4075J1010J61744K56849j14698l12532j8719K91749M0638M5508l06262
20002c8788l7012J55571M4313j63335L8946k6946k25741J05973M8518P6291L20438
19991B98228K8669k36851j83794O1772J55073j58067k66894K58611K74551O9636
19981C00934n8156j81966k42463j68369M4560m6200J24783j26194r1870J24995
19971c19946K56094L316N6716r9268o1755J18207M05413J87617l01082k74913
19961b9601n0922o0980n7494J46298J56184q6641q2687N5965j3250J08575J17791
19950B03238k4542P6225q1146R3402k48969R1606r265j20641J1162M1906r1026
$$ y = [-145893, 57509, 9856, -111801, 36640, 104167, -384, -118308, 67485, 1938, -94075, -83065, 78679, 335528, 220830, -91702, -110421, 181328, 221966, 267474, -38788, -75800, 79771, 124084, -39251, -305, -27251, -252992, -147019, -98501, -22210, 298228, 326897, 90046, -93748, -31976, 123097, -34970, -301864, -43253, 231298, 300934, 242778, 60812, -181651, -350020, -305460, -351660, -226877, -353071, -444941, -319946, -63852, -60536, -3820, -103088, -164843, -46636, 358777, 546394, 245312, -29601, -80523, -141503, -198997, -52699, 103485, 16844, -65843, -9878, -23128, 85447, 203238, 178696, 254921, 173775, 267177, 18208, 109814, 100549, -20092, -8930, 32976, -58050]
19939e8050j20367k4533r6711j26378n6681K66435K17003P0100n6447j43778M1064
19928h8343M2394o049P0127J91599j26028n1049r2443J3234J39494j30839j44624
19917a82527J62668J5615Q2385o1769k2119J2761k9909R2180J78301N0810k77282
19906B1114J27632L4568j61427l56404k1636J17136K48423O2917O3818Q3494O0879
19895B80514j1464K3098k9659j23529J59738J14792o3497j58537p9511k04081
19885i2136o550J72808L5208o2107K04500L2025j0210J1117r7091j22685Q3049
19874A47928N9707j78013k9306K51183J74553J1125Q5446k05987k28413q2322
19864E901K9867Q1047o8305j07332k10558j04349J42912L34676m5902L5936J57770
$$ y = [-58050, -178417, -202950, -299661, -426039, -482720, -216285, 718, 70818, 14371, -129407, -88343, -45949, -51998, 18129, 209728, 83700, 32651, -59792, -46558, 92936, -37903, -182527, -19859, -4244, 78141, 16372, -5747, 7014, -22895, 69285, 247586, 298396, 21114, 148746, 183314, 21887, -334517, -356153, -239017, 9406, 72323, 136141, 219635, 280514, 269050, 292148, 262489, 138960, 298698, 413490, 349993, 191456, 111945, -92136, -98686, 74122, 109330, 47223, 251723, 283748, 273538, 284655, 187564, 64879, 147928, 207635, 29622, 316, 251499, 426052, 437177, 522623, 316636, 88223, 5901, 35768, 116815, 48510, -58822, -269380, -373729, -230817, 103859, 57957, 93893, 251663]
19853B51663l72404K673M1148R5749n6827L1602n2946k0365K74843J03305k10393
19842H8048k6032K09676L5960j3526p5881R1680m9943k16505K3677j48300r039
19831i0185L37428n8310j3388J29599M2980m5948q6693J90150j60267l01454k8122
19820h4210J2363j20314m3628O5856L4124J24130R7684J949r2897k07007J76762
19809c5188l6403j32295j03973R4875J49996o4013j58267L7383K47024Q294p1938
19798f4505k9462j23340j19896K42602O6566r6265j03056N8487l2043J7366L3197
19787a50349l1171P727k0805j20657j9595K07277K21077J12493j38799r6180j12036
19776a41018L0217k24246k45970J46672J86689J08107P3775m684Q0223J97285
$$ y = [251663, -120741, -118068, -76920, 18829, -37998, -6396, -59342, -79707, 195136, 298441, 88048, 62016, 271692, 307652, 294126, 218245, 309925, 259982, 43477, 67154, -81146, -90185, 247243, 188933, 175545, 305144, 348124, 302176, 215483, 405633, 245366, -56088, -84210, -71847, -192161, -235789, -169933, -135809, -11679, 86005, 87954, -4943, -211950, -35188, -71591, -203886, -307859, -212984, -62988, -127001, -285268, -247885, -861, 7433, -64505, -93967, -217307, -337203, -94601, -28035, -124300, -227356, -168869, -200912, -183546, -150349, -181520, -173793, -194598, -315255, -334850, -127573, 93504, 205997, 67198, -28982, -141018, -110801, -335047, -581017, -434345, -247656, -139549, -65774, -70458, 9765, 207050]
19766B07050J70661j38234N0702J05753q9627O162j22147k02445j0413J84028
19756A61490l7352k22978k46192J54777K81953K57513q544k41867o9381J57761
19746A87180J74269P1877m381j91036k59540j81222p9427k44302R6608J06144
19736c23830L7081J31470m7866M6000j95076j40571J25340J84532J50387j13780
19726a46313k18493K10565M3254N6958r7502J36604R2924l29282k42282K74043
19716b19524J56730k21285j8844j65799J52304j63486q0657j8399r0821L7236
19706f32545K08750k7045L1990j04019k3655J56398N3841L8397J5122M3322j3087
19695b52531K16989j0872l54805j36832L29427L65351K8866k1333p0969m3881
$$ y = [207050, 377711, 239477, 290179, 395932, 306305, 312467, 190320, -12125, -22538, 161490, 124138, -98840, -345032, -190255, 91698, 349211, 340667, 98800, 29419, 187180, 361449, 433326, 428945, 237909, -21631, -202853, -282280, -526582, -429974, -323830, -286749, -155279, -203145, -157145, -352221, -492792, -367452, -182920, -32533, -146313, -364806, -154241, -110987, -54029, -151531, -14927, 77997, -251285, -493567, -219524, -62794, -284079, -302923, -468722, -316418, -479904, -560561, -578960, -669781, -632545, -423795, -450840, -418850, -522869, -546524, -390126, -336285, -297888, -282766, -239444, -252531, -35542, -46414, -401219, -538051, -208624, 156727, 185593, 164260, 93291, 49410]
19685D9410k9743J2862K1434m1107p4859R5164k7881J27184j11772j5669K68445
19674B73468N584K8137j61344j11628J50047K10185l185j88206r1289j96571q1565
19663a66367n8014J04596J36127q7217j28717K2470J7288N1754P3598j9948J0628
19652d3802N1231K5825j30930o9971k63987j28118Q7315Q8458L33885k2379N6125
19641a6348j46334K4937L6314J58762J13053p3872O6005m06444j19087K52393
19631a10621j006N7158J38867j15266k51213j38233L7626K12139J11990k4773
19621h3332K7898R5582k89219p1318J93822K10360K35646J24515k39620j13521
19611I0813j36087k06241K41026O7104j63016K5232J2688K14572M0469j07455
$$ y = [49410, 19667, 32529, 53963, 12856, -62003, 33161, 5280, 132464, 20692, 5023, 273468, 279052, 307189, 145845, 34217, 184264, 394449, 391264, 203058, 111769, -84802, -166367, -224381, -119785, 16342, -70875, -199592, -177122, -159834, -108080, -34482, -54430, -43802, 7429, 33254, -97676, -167647, -431634, -559752, -472437, -383979, -50094, -72473, -16348, -162682, -137745, -101431, 57331, 170384, 96512, 162517, -243927, -363014, -110621, -111627, -54469, 84398, -30868, -282081, -420314, -382688, -170549, -58559, -83332, -55434, 40148, -249071, -320389, -126567, 83793, 319439, 443954, 204334, 90813, -45274, -251515, -10489, 56615, -106401, -81169, -68481, 146091, 186560, 79105]
19601G9105m5186K921K4262k2289l4002O0028K74133m1496k10926P0001J62451
19590C19002j54451k28429N4228J66299q5896l17043q4004O5616p6595M50K31305
19579a09518j02378K8840K24045l2224j74371k12830J04137p9888o242K07888
19569a52541J50613j48411P7304P554K36924J29635p3112k6283K7308J17724Q8512
19558D35227j23035j56180j06250J75255J91917m7130R9512l5477l13745j72148
19548e2054K23101r9337k53408p1524K17931M3126M323j737j2329O3846Q9057
19537A50995l7549J03933L16756m8372l12178j28948k647l5421k92157R534R9579
19526a76475k01383j03807L59542N29367J72895r3390p8360l57858J10459j67253
$$ y = [79105, 33919, 36840, 61102, 38813, 4811, 64839, 338972, 297476, 86550, 156551, 319002, 164551, -63878, -9650, 156649, 70753, -246290, -330294, -264678, -341273, -340823, -109518, -211896, -183056, 40989, 8765, -165606, -378436, -274299, -354187, -360429, -152541, -1928, -150339, -73035, -65481, 171443, 301078, 227966, 201683, 228991, 346715, 435227, 312192, 156012, 49762, 225017, 416934, 369804, 469316, 433839, 120094, -52054, 171047, 71710, -181698, -253222, -35291, 7835, 12158, 10421, -1908, 61938, 150995, 113446, 217379, 534135, 485763, 173585, 44637, 41990, 6569, -285588, -276054, -176475, -377858, -481665, -122123, 407244, 580139, 486749, 408389, 50531, 160990, -6263]
19516f263k56442k26909J81578K21514L2603n6852J7042K12924n7799K833J23739
19505A87968K791k4383J21509J0963k99725o0271J13772L2152j33728j17989j06360
19494b73301o5449J28808M08221j35422k5075M3353l7650K18065l0385r5516P2225
19483B07874j10029n7292k14600L4621J84906O4303j12805q7425Q4625L9936J35070
19472A69184j08138M1749j57677j04695p6998N0288M2428l0356J21868K37102
19462A84755K5818L738K7890q6477j04100j16730J82433J6133N6532J41730j42169
19451A89553j42873j67982J68014J58937k891j77726j39106R484j2020j36844
19441b53454J70651j82070o0175L47997K26796j74803L9954N4923j83063J16052
$$ y = [-6263, -262705, -489614, -308036, -86522, -53919, -110771, -93729, 119195, 61396, 64229, 187968, 190759, 166376, 287885, 298848, -877, -61148, 52624, 84776, -48952, -166941, -273301, -338750, -209942, 198279, 62857, 37782, 81135, 43485, 261550, 231165, 135649, 207874, 97845, 40553, -174047, -139426, 45480, 109783, -3022, -90447, -5822, 34114, 169184, 61046, 102795, -54882, -159577, -236575, -186287, -143859, -174215, -52347, 184755, 210573, 214311, 242201, 155724, 51624, -65106, 117327, 133460, 189992, 331722, 189553, 46680, -121302, 46712, 205649, 202758, 25032, -114074, -104590, -116610, -253454, -82803, -264873, -325048, 22949, 249745, 74942, 114896, 169819, -13244, 102808]
19431A02808j23098j92970k4067K43297K39909K3540N8375n5201q7971k7871k33475
19420g6724j48771K42481J90872j20921N443K63850J12870p9900n3320K2293l07805
19409E0368j87602r334L5117N2932L9526L4822J33266N013j11320R0319l668R0569
19397B20008K25433o542j53016l00466m5845j06644p7378L1485k6404K03750N7212
19386B1593l6903K29007K03913J76537p22q4189q3199M2145Q8826j18682k69368
19375A68958l9910K105j51765K3667J557r2876K26681J7038O3664m8379k4096
19364A46644k18449j06155P9026m41j28101J15133K641J44833p6895l20711J2619
19353c49856L05956Q4099J55951l871k97907q6310k8091L2048K37861L41958n983
$$ y = [102808, -20290, -213260, -237327, 5970, 245879, 269419, 327794, 272593, 184622, 156751, -76724, -225495, 16986, 207858, 86937, 92380, 356230, 469100, 389200, 335880, 358173, 50368, -137234, -146568, -111451, -58519, -18993, 15829, 149095, 154108, 42788, 133107, 129439, 220008, 445441, 438899, 285883, -14583, -60428, -167072, -244450, -212965, -239369, -35619, 21593, -15310, 213697, 417610, 594147, 593425, 509236, 426037, 468182, 557008, 438326, 168958, 129048, 131153, -20612, 3055, 4612, -88264, 138417, 155455, 219119, 170740, 146644, -71805, -177960, -98934, -99375, -227476, -112343, -109702, 35131, -41764, -362475, -349856, -43900, 40199, 196150, 192279, -105628, -191938, -220029, -187981, 49880, 391838, 385855]
19342C85855Q5241j62246j37806K05194n5056p4531j88823M3660J18875m6969
19332A73394j28209P9725J78886M580m8367j14869P9961o9544o1798Q121L6076
19321A37956K88288K8603k86989k79209Q7291M01779j71345j00417m4781j9070
19311D2106j62824k8038J18582N5157N5655J50555K92900j08128j83251N9228
19301B91942j09025k34371L5139j07747J45354J37021J4850N2882j14762Q3259
19291A94542J12317n397j38409k07762j07610J22987J62352K6855O2790P6243
19281B98908l5780o7575j42187j37216J43246L5431j62873K744J12654M7495n3533
19270D1314J50114K37753J84083k72003l97487j42085K14585P3237K33491J12162
$$ y = [385855, 471096, 308850, 171044, 376238, 321182, 246651, 57828, 101488, 220363, 173394, 45185, 124910, 303796, 308376, 260009, 145140, 225101, 155557, 93759, 101880, 137956, 426244, 454847, 167858, -111351, -24060, 377719, 206374, 105957, 61176, 42106, -120718, -148756, -30174, 24983, 80638, 231193, 524093, 415965, 232714, 291942, 182917, -51454, -16315, -124062, 21292, 158313, 173163, 226045, 111283, 194542, 306859, 301462, 163053, -44709, -152319, -29332, 133020, 159875, 222665, 298908, 263128, 195553, 53366, -83850, 59396, 94827, -68046, -65302, 47352, 94847, 41314, 191428, 429181, 613264, 341261, -56226, -198311, 16274, 89511, 323002, 435164]
19260D35164o3202J8489J46191Q4151k06998j80405R9819r1475K72199J25769
19250F39702J0268j94713k26614j35045l3829J16185j0063L845k7558o1345J96969
19239B77802l51N9745j38291j41099m5494J27508l5400n7221J35501L5729j29636
19228H8793k43941K4441R0477N7575m16l2772J4781o3568j15071p2344K25598
19217b6447K05577J20023N7844j82768m1630N9624Q7466J5926K70054j34733l17063
19206A13873j5093K48879Q5483j31315k9218j9600j5834m0729j52399m58406J2081
19195d02278L73952K18705Q8033N4405J24795O4449j27190j71468k06815K3289
19185C9877J71582m0089j86393N9196J25747K31625J45691o5158K7881j91229
$$ y = [435164, 371962, 390451, 536642, 620793, 413795, 233390, 333209, 241734, 513933, 639702, 649970, 455257, 228643, 93598, 59769, 175954, 165891, 169736, 142178, 80833, 277802, 277451, 337196, 198905, 57806, 12312, 139820, 104420, 47199, 182700, 218429, 88793, -155148, -130707, -40230, 17345, 16929, -15843, -1062, -64630, -179701, -252045, -26447, 179130, 299153, 356997, 174229, 132599, 192223, 279689, 295615, 565669, 430936, 113873, 98780, 347659, 433142, 301827, 272609, 253009, 237175, 196446, 44047, -414359, -402278, -28326, 190379, 278412, 332817, 457612, 522061, 394871, 223403, 16588, 39877, 211459, 171370, -15023, 44173, 169920, 401545, 547236, 482078, 509959, 318730]
19175C18730O5139K59398j61610k34712Q6116Q513j04519j14782J51184m0321
19165B33136J20751Q2183J26026p1831N0688J39731J85528M48274j5903j37469
19155A161114N08943M27765m999j04155J76211j40789m21389k82822l47318j49676
19145H22885j86634l70169j7589L9600p0801m8463k3277J19327j0743n6306q9168
19134A08662M8250M14249m1166R462k6958j94873k56065L4999J76612j80312l5914
19123E6946p2328n3720j22436j20258K89053L80898K38524k2414j00079j13293
19113C60893j22272j96965n002J3325K79904L19410j1836J25863K08810J17013
19103A089143K99579J90978j42306J16143M77770M16242q6317k97870l04815j05693
$$ y = [318730, 383869, 643267, 481657, 246945, 333061, 341574, 237055, 122273, 273457, 233136, 353887, 436070, 562096, 490265, 540953, 680684, 866212, 1314486, 1298583, 1161114, 1670057, 2097822, 2092823, 1988668, 2164879, 2024090, 1602701, 1319879, 972561, 822885, 636251, 266082, 248493, 288093, 217292, 168829, 145552, 264879, 254136, 197830, 108662, 156912, 571161, 529995, 539457, 512499, 317626, 61561, 96560, 273172, 92860, 56946, -15382, -69102, -191538, -311796, -22743, 358155, 596679, 574265, 474186, 360893, 238621, 41656, 36654, 49979, 329883, 649293, 637457, 763320, 972130, 1089143, 1388722, 1579700, 1437394, 1553537, 2031307, 2447549, 2361232, 2063362, 1758547, 1652854]
19093A652854q1075j27649k50926l38395j14777J8332j73087P144k48226j43939
19083B00256R4034n7411j56493K19903L40533k77092l3433K89184r5290r3829
19073D30362J35470k0982j00354l74339R9852J16041O9051J37851k61965j53560
19063G7427K77508Q1450j3724R3375l3228O169j26316R1450j67666K9429L74774
19052F90648k7324n3889o7636k49570n2093m6310p5857K32670J8351j9918R2978
19041D42050Q0187J92085q530o2300j48113j24705O6639J96835l7234k45298M3638
19030C95254Q3100j03236j44411k69266L9984J6490j52361m9337K42735K82051
19020C41003N3858j24970r4796j46792m9141j35184k543M1967n9889M8060Q1691
$$ y = [1652854, 1571779, 1444130, 1193204, 854809, 740032, 758364, 585277, 592421, 344195, 200256, 294290, 236879, 80386, 300289, 640822, 363730, 330297, 619481, 524191, 430362, 565832, 544850, 444496, 70157, 170009, 286050, 355101, 492952, 230987, 77427, 354935, 436385, 422661, 516036, 482808, 488977, 362661, 454111, 286445, 315874, 690648, 663324, 609435, 541799, 292229, 240136, 193826, 117969, 350639, 368990, 349072, 442050, 522237, 714322, 705792, 643492, 495379, 370674, 437313, 634148, 596914, 351616, 395254, 478354, 375118, 230707, -38559, 1425, 17915, -134446, -183783, 58952, 341003, 394861, 269891, 175095, 28303, -20838, -156022, -158565, -116598, -176487, -128427, -46736]
19009d6736L33178K78304j58901J27285k8617r5949o6753r800N0856k6631p5362
18998B80874q9147p18K6568r574J43849P9846n6319j81595J48483K29492k02858
18987C68901k6775O3494j80570k48220L7723L39888J98629O469o2012o8771Q6224
18976E14980o7939j9108o2941o3098J5102K00717K00303L4430k09016j23318m6965
18965C73147j99736j6833K97592p2968Q1387j1431m9453l9329j496L3121J56175
18954E50176o3917P0394J73627m5936j49288l36256k81411j39230L07667K92034
18944C77860j04531L8679N4667p6604l1304j62563J13629L1646K6847P9944r8321
18933B49949P8904M3005L9099j6301J47984O5951J7625l2419r2883j37118k18719
$$ y = [-46736, 286442, 564746, 405845, 533130, 504513, 408564, 341811, 332011, 382867, 356236, 280874, 191727, 191009, 217577, 208003, 351852, 431698, 375379, 193784, 342267, 571759, 368901, 342126, 405620, 225050, -23170, 14553, 354441, 553070, 559539, 497527, 428756, 514980, 447041, 427933, 364992, 301894, 316996, 517713, 718016, 752446, 543430, 420112, 373147, 173411, 156578, 454170, 381202, 462589, 451158, 401705, 362376, 360880, 394001, 550176, 486259, 556653, 730280, 684344, 535056, 198800, -82611, -221841, 85826, 377860, 273329, 312008, 366675, 290071, 258767, 96204, 209833, 241479, 268326, 348270, 249949, 328853, 371858, 410957, 394656, 542640, 608591, 626216, 593797, 500914, 363796, 145077]
18922A45077J4859J28729l0209k23244k9817K06087J06926K37274M675J28028
18912F88385J50755k19004j05838j9036j18744j35868K6606K23902J92870k12942
18902D71086q3107M13363o4093m39905l2509K67425L6992j66763L0696p2217k495
18891C58473O2720j36387p261J12502j05105k74363k17670L90525M42889n4024
18881E72299j94389p0224K74349J57436J89525j08092k46789o5301K58198P7942
18871H44954J9126L7587R7732l28820n5059R8876J14296O3565j45445K18993Q6619
18860A052424j19492k2922P102j20369J38187J14520k974K754j8312j08028J6946
18849I39836J79902P0252J45422o3483l63665j3171j9438j3814J8481j59287j25335
$$ y = [145077, 159936, 288665, 258456, 35212, 5395, 211482, 318408, 555682, 560357, 688385, 839140, 620136, 514298, 495262, 376518, 240650, 267256, 491158, 684028, 471086, 387979, 801342, 737249, 297344, 264835, 532260, 569252, 402489, 433185, 360968, 358473, 421193, 284806, 277545, 390047, 284942, 10579, -207091, 183434, 626323, 572299, 377910, 307686, 582035, 739471, 928996, 820904, 574115, 508814, 767012, 844954, 864080, 901667, 999399, 670579, 615520, 714396, 828692, 892257, 746812, 965805, 1052424, 932932, 910010, 917112, 796743, 934930, 1049450, 1046476, 1049230, 1030918, 922890, 939836, 1119738, 1189990, 1335412, 1271929, 908264, 895093, 875655, 861841, 880322, 721035, 595700]
18838E95700j91325j56358K69919K58170O030p9239n8506L5814n3424k99267j55411
18827A72103N60868J01819p2398J00206K4695P3471q0024j80356k30192m7229
18817D22963J7031J94918k973q3878k20157j4015P6735m2437j0640K07177K49049
18806G93773k93368k65353J21393L25734O8148N8546J90434n1753l05024q1846
18796E60684J04428R1414m8640m644L3927J6895p7987o7574J96863k1794m0263
18785G43309l0884j21421q492J8911k84512j54708J32064Q0920P8702Q1831J23811
18774F59531L00860m2667k75302k75128k0443K97672M3554L15664L56447j34898
18764A225290k55848k20797J03194j2853j2269M9681l09331m0887L16728L03576
$$ y = [595700, 404375, 248017, 517936, 776106, 782136, 702897, 644391, 680205, 626781, 327514, 172103, 732971, 834790, 762392, 862598, 887293, 960764, 880740, 700384, 470192, 422963, 439994, 634912, 631939, 548061, 327904, 313889, 390624, 348187, 337547, 544724, 793773, 500405, 235052, 356445, 682179, 750327, 808873, 999307, 947554, 642530, 560684, 665112, 756526, 707886, 703242, 737169, 754064, 676077, 608503, 805366, 783572, 743309, 712425, 591004, 582512, 601423, 316911, 162203, 294267, 375187, 453889, 535720, 659531, 960391, 917724, 642422, 367294, 346851, 644523, 688077, 1003741, 1360188, 1225290, 969442, 748645, 851839, 838986, 826717, 876398, 567067, 526180, 842908, 1146484]
18754A146484J03827j69428J3334J04170L5686J14780R8268j75391j77409K3464
18744A117785J26713j1071M4971K48310J06343K1449N5198n6016o9987L92780
18734A976475L89474j93521P7875j4380J0088p3386l65045k31420l58008J28281
18724A346433J46564j9723K1239P478J79091J21117m8957p1395J62335k37752
18714A606430l8808N2714J50777L8894K15733p6872P9076J89727P5471K15739
18704B508881L02284m0327m2281J56738L02978J37400r713J14717M876L06710
18694C742263L28772L35681K10109L072M74161L54614L96614M26687M46654Q76119
18684G594746Q78264M08290L97387N28049O20618P63209N23939N09298R76548
$$ y = [1146484, 1250311, 1080883, 1094217, 1198387, 1234073, 1348853, 1447121, 1271730, 1094321, 1117785, 1244498, 1233427, 1278398, 1526708, 1633051, 1654500, 1709698, 1653682, 1583695, 1976475, 2365949, 2172428, 2250303, 2235923, 2246011, 2172625, 1807580, 1576160, 1218152, 1346433, 1492997, 1473274, 1494513, 1501991, 1681082, 1802199, 1753242, 1681847, 1844182, 1606430, 1567622, 1620336, 1771113, 1810007, 2025740, 1948868, 2027944, 2217671, 2293142, 2508881, 2811165, 2770838, 2728557, 2885295, 3188273, 3325673, 3315960, 3430677, 3435553, 3742263, 4071035, 4406716, 4616825, 4619897, 5094058, 5448672, 5845286, 6271973, 6718627, 7594746, 8473010, 8881300, 9278687, 9806736, 10427354, 11190563, 11714502, 12223800, 13200348]
18675A3200348P79224N97802R23184J101486J300490J747304J996025K545714
18667B4191577L687030M556784N746096P327953R302509J3088823J8718961K5938231
18659A12557964L5781315M6743600N6951190O0570052N2156254L0412850k08903
18652C94964322l0031324n0547162n8386964n5409266m6223017l5511286k5950641
18645I2904662j8915885j3942523j0289235p583787o114225m888159l710257k843438
18637B4617153k084413j529751q81822p20977n68754m52725l72362j92637l06793
18628A7506919k79383n694m783n467K31846N85678K83257K09770M18552O62954
18618A9603649P58516J152072J780003K065315K484509L407777M312955N791565
$$ y = [13200348, 13979572, 14577374, 15500558, 16602044, 17902534, 19649838, 21645863, 24191577, 27878607, 32435391, 38181487, 45509440, 54811949, 67900772, 86619733, 112557964, 148339279, 195082879, 252034069, 312604121, 364760375, 395173225, 394964322, 364932998, 314385836, 255998872, 200589606, 154366589, 118855303, 92904662, 73988777, 60046254, 49757019, 42173232, 36059007, 31170848, 27460591, 24617153, 22532740, 21002989, 20121167, 19400190, 18831436, 18378711, 18006349, 17813712, 17506919, 17227536, 17221842, 17217059, 17211592, 17443438, 18029116, 18312373, 18522143, 18940695, 19603649, 20362165, 21514237, 23294240, 25359555, 27844064, 31251841, 35564796, 41356361]
18610D1356361P462320R801491J3766430J9502111K7347464L7658784M9346270
18603B06241231N9922003O4090000N5742529L3201727J237268l1354283n3935306
18596C35145169o2598042n9574809m9901978l8769893k8566562k0696787j5038242
18589E9998856j1055687q391920o294303n056960m182527l159469k468213j901226
18581A7488551j479057j503018j370670r07269j039376j215172o30714p34797
18573H608478m87191k02111p9062m44746o17291o16219m45205l44728m14896n99539
18563D357490k20462k54664n11232m58799o6810k42314n2215M3740j44150n73137
18553A877447l23099M3069K42940o0181k50976j18597L32177j2508k4343r0917
$$ y = [41356361, 48818681, 58620172, 72386602, 91888713, 119236177, 156894961, 206241231, 266163234, 330253234, 385995763, 419197490, 420434758, 389080475, 335145169, 272547127, 212972318, 163070340, 124300447, 95733885, 75037098, 59998856, 48943169, 40551249, 34256946, 29199986, 25017459, 21857990, 19389777, 17488551, 16009494, 14506476, 13135806, 12228537, 11189161, 9973989, 9343275, 8608478, 8121287, 7919176, 7840114, 7395368, 6778077, 6161858, 5716653, 5371925, 4957029, 4357490, 4137028, 3882364, 3371132, 2912333, 2845523, 2603209, 2550994, 2594734, 2450584, 1877447, 1554348, 1597417, 1840357, 1780176, 1529200, 1410603, 1742780, 1730272, 1705929, 1615012]
18543A615012l55387j73127k63748K03433K5090Q6929J3756j34030q3350L8824
18533I73402J02900J14220j10158o207J29565R1393o4546p9270j17120Q443j6007
18522A026615l17512o6993j1149R5489k3249j6671j51361J56210P9832l13959
18512D57252j47634r0452R3152L0846Q7874N936o2796j52627j49158j32569N00910
18501D40734N12693k72052k66112k81549o7105Q2397J77107J63633j08142J03308
18491D84912K8700n9925J27486J10699L8788k1897j70381j59756N083j47739p831
18480B28139J87045J28891K2268J08152P6804J35626o6036m31458j92038k1957
18470A75436L1826N8231R5412k56768r2629R0134q7881k06255l6192k7345R5204
$$ y = [1615012, 1259625, 1086498, 822750, 1026183, 1051273, 1138202, 1151958, 1017928, 934578, 973402, 1076302, 1190522, 1080364, 1074157, 1203722, 1295115, 1230569, 1151299, 1034179, 1042622, 1026615, 709103, 642110, 630961, 726450, 703201, 686530, 535169, 691379, 771211, 457252, 309618, 219166, 312318, 343164, 431038, 436974, 374178, 221551, 72393, -60176, 440734, 953427, 681375, 415263, 133714, 66609, 149006, 326113, 489746, 381604, 484912, 513612, 453687, 581173, 691872, 730660, 708763, 538382, 378626, 383709, 235970, 228139, 415184, 544075, 566343, 674495, 751299, 886925, 820889, 389431, 197393, 175436, 207262, 265493, 360905, 104137, 11508, 101642, 13761, -192494, -228686, -256031, -160827]
18459a60827J58717O7576R6398k44174O5615J26355J30660R1984j16151j51725
18449F4428j91989J17459P2166Q5465q7405j67368J6608J33367n8835j63772j79829
18438c59705r5205J32969J22922J23304J71403L0479j84250M5134J19684L00606
18428D07341k95540j87542n4322K38249J75643k29591k04960j10995j05447L0163
18418c37001K81890L69799j75866j33936k97126o7211Q6486J56741k4862j14449
18408b55535j54431l27729l6464M52832J61358k13235j27107Q844J8821J85189
18398b87457L80768J66720j33332l43389j05789r6015J15509J21254J70517O8476
18388E7262J48891N9665j00008K7831R7k55610J21519j92935r6847J27274k3384
$$ y = [-160827, -2110, 65466, 161864, -82310, -16695, 109660, 240320, 332304, 216153, 64428, -127561, -10102, 62064, 147529, 60124, -107244, -90636, 42731, -16104, -179876, -359705, -454910, -321941, -199019, -75715, 95688, 126167, -58083, -12949, 106735, 407341, 111801, -75741, -130063, 108186, 283829, 54238, -150722, -261717, -367164, -337001, -55111, 314688, 138822, 4886, -292240, -359451, -272965, -116224, -141086, -255535, -409966, -737695, -774159, -321327, -159969, -373204, -500311, -491467, -472646, -287457, 93311, 260031, 126699, -216690, -322479, -418494, -302985, -181731, -11214, 57262, 206153, 265818, 165810, 193641, 193738, -61872, 59647, -133288, -230135, -102861, -126245]
18377a26245J79183N6708q6393m3844L85J01312k33275J1490N6521J96468j947
18366A10363j56828j44252j21056j66172L5703N0885J70312M66060J43551m0684
18356C47882r0123q9739L6865k54796J9412J52476k75096M662J09143j81705k04428
18345d25447K26201K86491j43876j14247j44107j6193j22680J13226M5076J1344
18335b84212n6464j6602K8980j28130R8376J70480J69036J85285j28254K8010
18325F6505P8223m5541j6906j00586k02260J71614K30089j48900j49832J55371
18315C7777l3270k20154J08850o2881P9900J14861K12172k020o6305p6478k474
18304H9978j22747k02840p6341L391M44309J88520n2945k95276l35268K74791
$$ y = [-126245, 52938, 109646, 23253, -20591, -20206, 81106, -152169, -140679, -84158, 112310, 110363, -46465, -190717, -311773, -477945, -442242, -391357, -221045, 245015, 388566, 347882, 257759, 168020, 204885, -49911, -30499, 121977, -153119, -148457, -39314, -221019, -425447, -199246, 87245, -56631, -170878, -314985, -331178, -453858, -340632, -295556, -284212, -340676, -357278, -328298, -456428, -358052, -187572, -18536, 166749, 38495, 66505, 144728, 99187, 82281, -18305, -220565, -48951, 181138, 32238, -117594, 37777, 4507, -215647, -106797, -169678, -89778, 25083, 237255, 235235, 168930, 92452, 89978, -32769, -235609, -311950, -308559, 135750, 324270, 271325, -23951, -359219, -84428]
18294h4428M7236m8941P5394k13045k44845k06344K65214K46272N616L6462j50590
18283b71999J42342N7323j76408j68493M8726J8672J10008R6713q2898l8136M1357
18272b22793L28798J22040j84583n939K49336L0510j37854J05597L3304O8519
18262C86935M9222j31151K1440j71353j28732J56175j29465k43864k3718J77890
18252c6621K40725J71839J08238n6770k1464R0716k55333k19475l63395j8834
18242c60374J44626J61887k5796n8480k95094k71174O7669K85568J68716L26167
18232A43715j15180k9106J87452l6763q3526J21834k258n8326M5551j15727k58606
18221b00940q2774O635K71702K80134l9976Q3679j81453j53561p6220M506J49957
$$ y = [-84428, -37192, -86133, -10739, -223784, -468629, -674973, -409759, -163487, -157871, -121409, -271999, -129657, -72334, -248742, -417235, -368509, -349837, -239829, -143116, -226014, -264150, -222793, 106005, 228045, 43462, 37523, 286859, 317369, 179515, 285112, 318416, 386935, 436157, 305006, 326446, 155093, 26361, 182536, 53071, -190793, -214511, -36621, 204104, 375943, 484181, 427411, 405947, 496663, 241330, 21855, -341540, -360374, -215748, -53861, -79657, -138137, -433231, -704405, -636736, -351168, -182452, 143715, 28535, -571, 186881, 150118, 66592, 188426, 186168, 127842, 173393, 57666, -200940, -283714, -277079, -5377, 274757, 234781, 318460, 137007, -16554, -92774, -88268, 61689]
18210F1689J62070k07720j60398K0713J12085K63191p0407k92162k34557k46R0222
18199b55520J45887k10539K0080N3233m2374J26274O4268j53569j94784N3170
18189c93874J0716J22558j32394j38780J17887M36738m8893J97136J88939n8218
18179C01815n8816M522N6713J47496p852j06885K4165L1431J09394O2003k33847
18168C30139j51114K12184M0577o3334j01479N9330J30634o4929j25422r6311
18158A70275K92460L12530k7581J26096J32255P0683o1145N47733M93323J30747
18148B187376k07881j90241j74741k57830l14539j30641j90622l64556m16932
18139f0607p5941M7728j47369p6812p2338q3598J01600K65689K64890J4852j49350
$$ y = [61689, 223759, 16039, -144359, -123646, -11561, 251630, 181223, -110939, -345496, -345742, -255520, -109633, -320172, -300092, -246859, -289233, -162959, -98691, -252260, -447044, -393874, -383158, -260600, -392994, -531774, -413887, 22851, -26042, 171094, 360033, 301815, 242999, 247521, 304234, 451730, 443878, 336993, 361158, 392589, 501983, 563986, 330139, 179025, 391209, 431786, 368452, 266973, 326303, 456937, 392008, 266586, 170275, 462735, 775265, 747684, 873780, 1006035, 1076718, 1015573, 1563306, 2056629, 2187376, 1979495, 1789254, 1614513, 1356683, 1042144, 911503, 720881, 356325, -60607, -136548, -88820, -236189, -313001, -385339, -468937, -367337, -101648, 163242, 178094, 28744]
18128B8744K94065K2807k17406j3113r7500m2843L51359J30583r4138j66686j57408
18117C8464J7327L64566p5762q8099j13919k35401o5719J56427O8886M45243J02848
18106F14861J7052r4960O147K65310L2031N9423J20788N6992L69000K24744J33957
18095A805345J62018k87443k53653o4133j44231k37813k3225j46777l59629k11090
18085B39369J523K06996J03643n5558J28434j4599o1378j34415J51945J06608
18075F72568k67409k31853j81328j29111N8664n0246j12782n1482K55456k9199
18065f6722J55388k56594k52447J21334J63731K6383p0513K21804R5575P0441
18055B08380r329J9463j80898r3149n6834q4085Q7411j55837k7220O1734m6622
$$ y = [28744, 322809, 345616, 128210, 115097, 17597, -25246, 326113, 456696, 362558, 195872, 38464, 55791, 420357, 344595, 256496, 142577, -92824, -158543, -2116, 66770, 512013, 614861, 631913, 536953, 543100, 808410, 840441, 899864, 1020652, 1077644, 1446644, 1671388, 1805345, 1967363, 1679920, 1426267, 1362134, 1217903, 980090, 956865, 810088, 450459, 239369, 240892, 447888, 551531, 495973, 624407, 609808, 548430, 414015, 565960, 672568, 405159, 173306, -8022, -137133, -78469, -128715, -241497, -292979, -37523, -66722, 88666, -167928, -420375, -299041, -135310, -108927, -179440, 42364, 137939, 208380, 199051, 218514, 37616, -55533, -112367, -196452, -109041, -264878, -292098, -230364, -276986]
18044b76986j18700j63939J25049J18893j65516j21562J13582R0880m0914L8626
18034d00587J7717K02462K17752J2830p9642O6038K35169k5330r8249k25984j08658
18023a86482r6459J06393p7526J27161J67386m2606o0104J37374k01589J01198
18013b5254J65058o585k8827j19693j7908P6479m9505j48570K30531j58156j28962
18002b11392J94778m0438j68052Q5414L47483J63736m7623l47841o5518k8141
17992a17594q6425N3460L6843j87150k27788k9211M00179J05401Q9791J58565
17982A96071j61267k07601M80592K09223j92531j96922n6640R2655N1026q7566
17972A27040o6539K3974j98576Q1056J60666l0079k777J57772J86282j57801k37943
$$ y = [-276986, -395686, -559625, -434576, -315683, -481199, -602761, -489179, -398299, -439213, -400587, -382870, -180408, 37344, 50174, -29468, 36570, 271739, 246409, 148160, -77824, -186482, -282941, -176548, -254074, -126913, 40473, -2133, -62237, 75137, -126452, -25254, 139804, 133219, 104392, -15301, -33209, 43270, -6235, -154805, 75726, -82430, -211392, -16614, -57052, -225104, -139690, 207793, 371529, 323906, -23935, -89453, -117594, -204019, -150559, -113716, -300866, -528654, -557865, -157686, -52285, 37506, 196071, 34804, -172797, 307795, 517018, 324487, 127565, 70925, 163580, 214606, 127040, 60501, 84475, -114101, -33045, 127621, 97542, 94765, 252537, 438819, 281018, 43075]
17961D3075Q1787O4041J19061j81029J4411r4098P1499J62395n0121L2081L3235
17950B96337j75529j04236M8256r7987j22590L56910L06695K7498m0459k85676
17940B09219j38105j06219n0828O916J90474L31378p9036q7217O0471R3072j67145
17929B62980j69997j44652j09479N0208O1338J43994K82111k8249L1355N5575
17919D35184M8190j72331n2290o149q9207J4568k71771M4857K12751J2008o7528
17908A08282j90343k54317J74134J81685R0009J93140J06367j21642j04942P8321
17898B60694N012l72945r7611K5260J56483M6829J9408o3810j7475L83965J2250
17887C58060j1746K905r0656K29351j11714r8575k11250o0230J922j856o8063
$$ y = [43075, 124862, 188903, 307964, 126935, 141346, 47248, 118747, 281142, 231021, 263102, 296337, 120808, 16572, 64828, -33159, -155749, 201161, 507856, 535354, 494895, 209219, 71114, -35105, -85933, -79017, 111457, 442835, 363799, 276582, 337053, 430125, 262980, 92983, -51669, -161148, -110940, -49602, 94392, 376503, 348254, 379609, 435184, 483374, 311043, 258753, 252604, 163397, 177965, -93806, -48949, 163802, 175810, 108282, -82061, -336378, -162244, 19441, 109450, 302590, 408957, 287315, 182373, 260694, 265706, -107239, -204850, -179590, -23107, 23722, 43130, -20680, -38155, 345810, 358060, 346314, 349219, 258563, 487914, 376200, 277625, 66375, 6145, 8067, 6211, -61852]
17876f1852R4794k6102K9651K4617L26994P6766n8448O8859j55048l57207j49766
17865a86742J77718J50566R2036J43882J31201J49735j80447k64418j21180j77881
17855h5530J52883n1789K0693K57159J58586j70956j55389j20902m2919Q665r6131
17844a25630N8962Q7632K24746J061p3068j99013k89313J29933L62361m7544k17335
17833h7208k52184J11892J99863N8558J21569k68216j00087R997K19785O8554
17823H2523K8642J0812r2258n9680j6023N2760O0457r2084J23433o3139j95410
17812a59967J11510J58370j08309k35072K17623K02145j7838j30535k42398j47859
17802c52330J18817M00660L38459m8509k24284m6343J085R1103j66325k27395
$$ y = [-61852, 32942, 6840, 36491, 61108, 388102, 464868, 406420, 475279, 320231, -36976, -186742, -9024, 141542, 233578, 377460, 508661, 658396, 477949, 213531, 92351, -85530, 67353, 15564, 36257, 293416, 452002, 281046, 125657, 4755, -38164, -29499, -125630, -66668, 20964, 245710, 246771, 173703, -25310, -314623, -184690, 177671, 130127, -87208, -339392, -227500, -27637, 30921, 152490, -115726, -215813, -205816, 13969, 82523, 111165, 121977, 29719, -29961, -45984, 6776, 67233, -24851, 98582, 35443, -159967, -48457, 109913, 1604, -233468, -15845, 186300, 168462, 37927, -204471, -352330, -233513, 167147, 505606, 457097, 232813, 186470, 187555, 278658, 112333, -115062]
17792a15062J43905J92286k27855j06561J72331J61077j45446k82539L0885J27287
17782d9692K36282p358J04954N6275q9045n9838q2064P1958K983J64202j64059
17771A84598q8542j7125Q3581q5476K3269J21231J6662j41641k7007j41143q700
17760h0293k52801M6989L31529O328j38579N1449J07577j51560j30262L89840
17750A80217O5119l5193j40613o7988j518J9906J1137J17485n9119O8130K24421
17739C81984K591j18010l03480j70387J98556J01963N0028j60709o7148J44717
17729F0105P9508M4055r4119j62640J30607J35945J00238k15958R9677P1374j55397
17718I3395k00245K5999K21146N3520m0373J26843j82756j60682P462O6941p5558
$$ y = [-115062, 28843, 221129, -6726, -113287, 59044, 220121, 74675, -207864, -176979, -49692, 186590, 179232, 284186, 340461, 251416, 191578, 109514, 181472, 184455, 348657, 184598, 96056, 78931, 162512, 77036, 100305, 221536, 238198, 96557, 69550, -71593, -80293, -333094, -286105, 45424, 51752, -86827, -35378, 72199, -79361, -209623, 180217, 245336, 210143, 69530, 1542, 24, 19930, 31067, 148552, 89433, 157563, 381984, 384575, 266565, -36915, -207302, -8746, 93217, 143245, -17464, -84612, 60105, 139613, 183668, 89549, -73091, 57516, 193461, 293699, 77741, 177418, 248792, 93395, -106850, -80851, 140295, 193815, 153442, 280285, 97529, -63153, -55691, 11250, -64308]
17707f4308Q9037K15210J44774j5600K7724k6010l66945j58584J93079K35338
17697B73715j03589j29431m3253j53808L9248P4273J27322K33839J85364P792
17687E11472n7489j82937k45167K681J0226K3064J0421j99063M256J47461J94167
17676B19092l644l9159j12796m3104p8670J25236R5336j35956N6726Q1792k12589
17665d7736k08291j21011K6581K47236K31384J29287l7700j56450M6545K83699
17655C93544m7593j23087Q4917k84729Q0731j48538k0943J47241r5345j98842
17645b12644k7108J28385K74144N2615k25844M9355J34313L71523K20780j46038
17635F19481L3475j31200q8821j27523k86341j05629Q1292R4844J25485o3217
$$ y = [-64308, 24729, 239939, 384713, 369113, 396837, 370827, 3882, -154702, 38377, 273715, 170126, 40695, -2558, -156366, -117118, -42845, 84477, 318316, 503680, 511472, 453983, 271046, 25879, 28560, 38786, 61850, 72271, -126792, -122536, 24925, 219092, 215448, 176289, 63493, 20389, -58281, 66955, 162291, 26335, 83061, 164853, -47736, -256027, -377038, -350457, -103221, 128163, 257450, 219750, 63300, 109845, 393544, 345951, 222864, 307781, 23052, 103783, -44755, -65698, 81543, -13802, -212644, -239752, -111367, 162777, 215392, -10452, 38903, 173216, 544739, 765519, 619481, 652956, 521756, 432935, 305412, 19071, -86558, -5266, 89578, 215063, 151846]
17625A51846K875L0077J9008O050k0192q5366L8597J40347j46477j19894k18659
17614b01788j23121J89754m2359R7513K83006O2420r8988K2682r0690j36067m6944
17603h4582K60265L82764R4237j95986k76445o4451P9318J43381j81250j79819
17593b2568n0833K68007K22590q0504j85754J0259J22357m27M08145L60463j77176
17582H74559l10297j27403k0745j04694j40080k01818K14225r525R7556K28092
17572D99870J18290Q049J74922m52661k81644N9235K2582N9384K4971q9618o3853
17561G9527q4669L3863N0986K12900R4082j8495j87624L1534J93377j02475J00275
17550D03281j842n6737J36234m0839J28667J00122j5741j65638k71605j45953
$$ y = [151846, 154721, 184798, 203806, 209856, 189664, 104298, 142895, 283242, 136765, 16871, -201788, -324909, -135155, -177514, -80001, 203005, 265425, 166437, 189119, 98429, -37638, -84582, 175683, 558447, 652684, 456698, 180253, 115802, 195120, 338501, 157251, -22568, -73401, 194606, 417196, 336692, 150938, 161197, 283554, 283127, 691272, 1051735, 874559, 564262, 436859, 416114, 311420, 171340, -30478, 183747, 174222, 271778, 499870, 618160, 626209, 801131, 348470, 66826, 126061, 148643, 208027, 232998, 143380, 79527, -5142, 28721, 79707, 292607, 386689, 368194, 180570, 212104, 405481, 303006, 403281, 401439, 344702, 480936, 440097, 568764, 668886, 653145, 487507, 215902, 69949]
17540F9949M1554j6180J7309L34468j26108j86910M2097Q6870k04528Q8659L92213
17529E39393M312k79982n2711j3558J08431J28889r7431M3937N7629j33449K4130
17518C29590J09868K89145K2269M1485L6494k49800j21684k51909J23040K00633
17508E29131J30234L8475L7853K2681q908O7734k43481k38894J2200J99654J63814
17497G10493n1112k3224k492J64958M3252N2878k520j7825m8184p2436j70480
17486E83308j53528J09113N7833k0136R7824Q0653j95887M954K75402J10087k63733
17475F85890L8822L8900j69064J48778j26410o0303J72317r1349l0076R221N4613
17464F71339M9269o9628r5428J32688l02121m1781J99302K96628N6627j78459
$$ y = [69949, 111503, 95323, 112632, 447100, 320992, 134082, 176179, 263049, 58521, 147180, 539393, 543705, 263723, 211012, 197454, 305885, 434774, 337343, 381280, 438909, 305460, 329590, 439458, 728603, 750872, 792357, 828851, 579051, 457367, 205458, 328498, 529131, 659365, 697840, 735693, 758374, 749466, 817200, 573719, 334825, 347025, 546679, 710493, 659381, 636157, 633665, 798623, 841875, 894753, 892233, 874408, 826224, 753788, 583308, 429780, 538893, 596726, 576590, 674414, 755067, 559180, 564134, 839536, 949623, 685890, 724712, 763612, 594548, 743326, 616916, 556613, 728930, 637581, 607505, 616726, 671339, 720608, 650980, 555552, 688240, 386119, 344338, 543640, 840268, 896895, 718436]
17454G18436L2567K45480P560j09163n0796j777K5904L02758o9359k29678j22005
17443G49927L9400J1075M559o3451l03259m2658K53634j31797j75713J3763J62784
17432E18264K51890j59666k99712K207K15473j69973j27885j22878l778p3735
17422C0207K54747K45803r9584j65733R190P8003j93042O2182J05689j94231j21566
17411A1665p7954Q6512j54591j50068J68286J20116L1276K24227j7253k31958
17401A0258J09886K46514M6809n1655J8047o587J75318M7264n5261L4008j33104
17390D41497j18030N5741J02850J03171J23781N6819m6477j87123j39319J28450
17380E21360J61798j70340l10664j19735K44595L09771P2561j72794R0399p0277
$$ y = [718436, 751003, 996483, 1004043, 894880, 844084, 842307, 868211, 1170969, 1101610, 871932, 749927, 789327, 800402, 804961, 741510, 438251, 395593, 649227, 517430, 341717, 355480, 518264, 770154, 610488, 310776, 312983, 528456, 358483, 230598, 107720, 103942, 30207, 284954, 530757, 431173, 265440, 274630, 352633, 159591, 221773, 327462, 133231, 11665, -66289, 20223, -134368, -284436, -116150, 3966, 35242, 259469, 242216, 10258, 120144, 366658, 413467, 361812, 379859, 373272, 548590, 595854, 540593, 574601, 441497, 323467, 379208, 482058, 585229, 709010, 765829, 719352, 532229, 392910, 521360, 683158, 512818, 202154, 82419, 327014, 636785, 709346, 536552, 626951, 556674]
17370E56674j37399P3054j09799j78011o8729L06125Q8359j31597N9705J89127
17360F47509J21850n2528j6023K91794P4916K79838J87127k12252k82594p9967
17350I59670J83413J64648q6135j77306K3978J82790J51259k3067J68821j05948
17340A442123n2344o0225k02989j7262R8691k9081j23163k82115l333K11464k79784
17329G01982L6591Q4883J74578o8415K3115j01696k6726j87919q3969r906j22008
17318D20510j56535n5658Q0969M0848L9970K20418j07115m0848P151m6581k997
17307D00132J92026K27018L41445O6793j87854j19494J87401J50567k7046k5240
17297A205748K70518m7973l22856K4201P4693m3375p7666j85543j7550K68821
$$ y = [556674, 419275, 492329, 382530, 204519, 135790, 441915, 530274, 398677, 458382, 647509, 769359, 716831, 700808, 992602, 1067518, 1347356, 1534483, 1322231, 1039637, 959670, 1143083, 1307731, 1221596, 1044290, 1068268, 1251058, 1402317, 1379250, 1548071, 1442123, 1389779, 1329554, 1126565, 1109303, 1207994, 1178913, 1055750, 773635, 770302, 981766, 701982, 738573, 823456, 998034, 929619, 952734, 851038, 824312, 636393, 552424, 542518, 420510, 263975, 208317, 289286, 330134, 370104, 590522, 483407, 442559, 449710, 403129, 400132, 592158, 819176, 1160621, 1227414, 1039560, 920066, 1107467, 1258034, 1230988, 1205748, 1476266, 1428293, 1105437, 1129638, 1204331, 1160956, 1083290, 897747, 880197, 1149018]
17287A149018R2452j62090J62257O4118j98257j60331k3119O3288j32942j4991
17277H39403n8598k70046Q6068o1486k39161L64493J60904j03687k81671j01889
17267C34330L3010K36232M8569l5808k14786o8338p7958O2031l5133k22043k10630
17256a50524K52601J37298J28847J54524L2604p6438J28818J02491l48853q2364
17246B79004J94242P7934M8037j0128k2995j89886J06006L21632n2956q4791l2697
17235F33402J07650j81442k21237N1347K27906P0725j49359O9513l4713j34782
17225D39010m8647m0953J03701J02273q8962j58585o1681p4392K3340o343k8776
17214A59985L8173P9694J52849J49839M3998k25422K5711m845l45916R956J31211
$$ y = [1149018, 1241470, 1079380, 1241637, 1305755, 1107498, 947167, 924048, 987336, 854394, 839403, 780805, 510759, 596827, 535341, 296180, 660673, 821577, 717890, 436219, 334330, 367340, 603572, 652141, 616333, 401547, 333209, 255251, 317282, 282149, 60106, -150524, 102077, 239375, 368222, 522746, 555350, 478912, 607730, 710221, 361368, 279004, 473246, 551180, 599217, 589089, 566094, 376208, 482214, 803846, 750890, 666099, 633402, 741052, 559610, 338373, 389720, 617626, 688351, 538992, 608505, 573792, 439010, 390363, 349410, 453111, 555384, 466422, 307837, 246156, 171764, 195104, 188761, 159985, 198158, 277852, 430701, 580540, 624538, 399116, 424827, 419982, 74066, 84022, 215233]
17203B15233R6147Q567J09675J29702M5544j3874j93457P1306K52710p5715J2297
17192F58135j2134K5743M9955N7756j40403l90162j64063l3731o7344O0248J80816
17181B24816P708O5634O2026M1310M2486j34975L8168J23916K6368J1553m0567
17170D68443J72795L9041k51961j9464K9140L2970L3332Q7892k8146j28398m7109
17159C88535J05889j5246j4433o8852K0761J62199O2164J68714J76065K03926
17149A189722R6691K75562K85620j8693r2423j45614j7712j23142q027K18595
17139A660579L22675o2264m1681J09628j00172M4545K37220K16922k06544K0149
17129B201057p1952Q6316K00894N9349M8090j22856J52861J08153l63117k12512
$$ y = [215233, 311380, 319947, 429622, 559324, 604868, 590994, 397537, 468843, 721553, 645838, 658135, 646001, 671744, 721699, 779455, 639052, 248890, 84827, 51096, -16248, 44000, 224816, 232524, 298158, 360184, 401494, 443980, 309005, 347173, 471089, 497457, 509010, 468443, 641238, 680279, 428318, 408854, 437994, 470964, 504296, 592188, 564042, 435644, 388535, 494424, 479178, 464745, 395893, 416654, 578853, 641017, 809731, 985796, 1189722, 1286413, 1561975, 1847595, 1828902, 1736479, 1590865, 1573153, 1450011, 1441984, 1660579, 1983254, 1920990, 1879309, 1988937, 1888765, 1933310, 2170530, 2387452, 2180908, 2201057, 2129105, 2215421, 2416315, 2475664, 2523754, 2400898, 2553759, 2661912, 2298795, 2086283]
17119B086283j57521l92787l28951k32189R0813j00316j13700K09039J13743j3585
17109A160829j99466r6149N9268o8184m0264k03188l68196K03046L48621j889
17099G94428R2888K16542J20636R987m4902m01632k40846k27170J58446J5126
17089D93503M3031K24763K1520j93641J48386K69108P7975p8871k01630j34909
17079F69235j05927k7627L6530M398L1196N0074j0947j54882K177J05282J27007
17068G26516R7773J79632J86354J7438l8136k13872P6091L17052j00363j062P7458
17057A324881m058j73807m08023J11251J51222J14038j15572J6106q5777J40649
17047A070910j8917K7760N0002o5448q3436p6528q0116o336K31458J7810r0611
$$ y = [2086283, 1928762, 1535975, 1207024, 974835, 1065648, 965332, 851632, 1060671, 1174414, 1160829, 961363, 865214, 924482, 856298, 816034, 612846, 244650, 447696, 796317, 794428, 887316, 1103858, 1224494, 1234481, 1189579, 787947, 547101, 319931, 478377, 493503, 536534, 761297, 782817, 589176, 737562, 1006670, 1084645, 1005774, 804144, 669235, 563308, 535681, 572211, 576609, 607805, 657879, 646932, 492050, 494227, 599509, 726516, 824289, 1003921, 1190275, 1207713, 1169577, 955705, 1031796, 1348848, 1248485, 1247423, 1324881, 1320823, 1147016, 738993, 850244, 1001466, 1115504, 999932, 1016038, 930261, 1070910, 1051993, 1079753, 1129755, 1064307, 980871, 904343, 824227, 817891, 1049349, 1067159, 976548]
17036I76548J6483p5593O2726j1175J88076P4533m0683j23605k1178j28530l4013
17025H83589o3740K93164K89783j66546k16991O4446J42871L9937P3831k00015
17015A140329O8587L05661J61828o828k84286k5162J32162l37774J48546K31454
17005A534517J03678N3462k30644j18369O9229J70717Q6452J70114K04815K46577
16995B290548o3263l03762j48086j63870j3869K3360K20243j33819k80001J69670
16985A597151Q1271j32939L0370k08603k4744J26985J02446J93557J97888q2728
16975A880654m9083Q9518n4299l16291j05964O9245L6899K54425J03071j58265
16965A749910k61277p5769J12269J05799L18029K95614k586k51027n0530J35k98040
$$ y = [976548, 993031, 917438, 980164, 968989, 1157065, 1231598, 1190915, 1067310, 1046132, 917602, 883589, 819849, 1113013, 1402796, 1236250, 1019259, 1083705, 1226576, 1266513, 1340344, 1140329, 1208916, 1514577, 1676405, 1669577, 1385291, 1360129, 1492291, 1154517, 1303063, 1534517, 1638195, 1691657, 1461013, 1342644, 1411873, 1582590, 1669042, 1839156, 2043971, 2290548, 2227285, 1923523, 1775437, 1611567, 1597698, 1621058, 1841301, 1707482, 1427481, 1597151, 1678422, 1545483, 1575853, 1367250, 1342506, 1469491, 1571937, 1765494, 1963382, 1880654, 1831571, 1921089, 1866790, 1550499, 1444535, 1513780, 1550679, 1805104, 1908175, 1749910, 1488633, 1412864, 1525133, 1630932, 1948961, 2244575, 2241989, 1990962, 1940432, 1940567, 1642527]
16954A642527j38852j02045K05597L52320L6580l18201m6183J18088j16731Q5977
16944A719077K75402J25823j18462q0854M3861P1997k31160K0074J3448k11076
16934A628130J77373J50243K9605M4626J97318j53938m4953j89760l4283J63458
16924A967819q061p9702k08908J12582M08956l5672j47435k9951K48553K99166
16914B527347Q505R7787O5584k22977J2735R6306J36869J91200K57104K37156
16904C407616j31334k42155j23472K81995K82363K01756L46520q998j3855O7979
16894D068415k26053J86567j26484J83724k736j4046j4005M23123L08058M57849
16884E244412L73211K84606J38374J77425L90816N09500M08609M49534N43046
$$ y = [1642527, 1503675, 1401630, 1607227, 1959547, 1996127, 1677926, 1631743, 1749831, 1633100, 1719077, 1994479, 2120302, 2001840, 1920986, 1964847, 2036844, 1805684, 1825758, 1839206, 1628130, 1805503, 1955746, 1985351, 2029977, 2227295, 2073357, 2028404, 1838644, 1804361, 1967819, 1959758, 1880056, 1671148, 1783730, 2192686, 2157014, 2009579, 1979628, 2228181, 2527347, 2535852, 2633639, 2699223, 2476246, 2488981, 2585287, 2722156, 2913356, 3170460, 3407616, 3276282, 3034127, 2910655, 3192650, 3475013, 3676769, 4023289, 4014291, 4000436, 4068415, 3842362, 4028929, 3902445, 4086169, 4083433, 4069387, 4055382, 4478505, 4786563, 5244412, 5617623, 5902229, 6040603, 6218028, 6608844, 7118344, 7526953, 7976487, 8519533]
16875H519533M24732N93043O68894O70744J138707J067776J224325J320679J515170
16866A7143603J841822K486504L221381M124033N687382P466709R798692J3337118
16858F5107244J7787885K2315143K5615974K6844894K3813510J5944147M251656
16851B01680453p461225j5314044j8707427j7465909j3442025p383508l01637
16844A21604678O947076J3818712J9659226K3082633K2683150J6227111M568743
16837B28591329r046243k1017398k7727801k9422001k7182131k2883973j8305779
16830G3006003j3986585j0332259p434574n659966m449023l265566k343080j695059
16822B3839891j204131r24234n38159n64698k91410j54012J42242M24389O99541
$$ y = [8519533, 8944265, 9537308, 10206202, 10876946, 12015653, 13083429, 14307754, 15628433, 17143603, 18985425, 21471929, 24693310, 28817343, 34504725, 41971434, 51770126, 65107244, 82895129, 105210272, 130826246, 157671140, 181484650, 197428797, 201680453, 194219228, 178905184, 160197757, 142731848, 129289823, 121906315, 121604678, 128551754, 142370466, 162029692, 185112325, 207795475, 224022586, 228591329, 219545086, 198527688, 170799887, 141377886, 114195755, 91311782, 73006003, 59019418, 48687159, 41252585, 35592619, 31143596, 27878030, 25534950, 23839891, 22635760, 21711526, 21173367, 20608669, 20317259, 20163247, 20305489, 20729878, 21429419]
16813B1429419R47822J146999J546971K241618L199402M470753O366983Q474767
16805D9824734J1882337J5948538J9902038K3240080K4706025K2364163J4668305
16798A82536220L746618o516369j3806831j7101110j6198586j2351354o668804
16791A13639784n5356O966001J3627591J9473523K2888356K2599574J6448303
16784B15587776N399543q488561k0456761k7538379k8855971k6631219k2592511
16777H6423917j7860731j3815162j0456449p727778n790674m417708l686450k965850
16769A9703115k229254j768887j256271r35845q42385q98572o80400n83000m62450
16760A0046051q02501r58427p40472n47740k46196l98401m89431j18500j42281
$$ y = [21429419, 22377241, 23524240, 25071211, 27312829, 30512231, 34982984, 41349967, 49824734, 61707071, 77655609, 97557647, 120797727, 145503752, 167867915, 182536220, 186282838, 179766469, 165959638, 148858528, 132659942, 120308588, 113639784, 113584428, 120550429, 134178020, 153651543, 176539899, 199139473, 215587776, 220987319, 212498758, 192041997, 164503618, 135647647, 109016428, 86423917, 68563186, 54748024, 44291575, 36563797, 30773123, 26355415, 22668965, 19703115, 17473861, 15704974, 14448703, 13512858, 12670473, 11771901, 11091501, 10508501, 10046051, 9243550, 8285123, 7544651, 6996911, 6750715, 6352314, 5862883, 5744383, 5602102]
16751E602102k15846k53216k78003k51713N1183l2294K1928j21616M9971K14784
16741D787280j52707l04997j77714M7115j31660j33643K2350J44392j65977j63778
16731C770661J11805P6423Q2373J77434q1598j66175Q7245J3068N8041p6611k30749
16720C821917k29931L0J92647P5731J59814K63825K07614q714N7621J79794j00083
16709D620265Q1186k29205r1183P2619N9394j68975l6708k2816Q7959K67836k3215
16698D617157P1867O6512k3473J10127K48527K81726J09361R3952K17301L86742
16688F179799L14085N39468J92246J14675K64510L21571M58062K52858M86689
16679I123963Q07900P23003M30413M79285O51532J055018J056081J309260J393428
$$ y = [5602102, 5386256, 5133040, 4855037, 4603324, 4654507, 4622213, 4644141, 4522525, 4572496, 4787280, 4634573, 4329576, 4151862, 4198977, 4067317, 3933674, 3956024, 4100416, 3934439, 3770661, 3882466, 3958889, 4041262, 4218696, 4137098, 3970923, 4058168, 4071236, 4129277, 4052666, 3821917, 3591986, 3592016, 3784663, 3860394, 4020208, 4284033, 4491647, 4482933, 4540554, 4720348, 4620265, 4701451, 4472246, 4381063, 4453682, 4513076, 4344101, 4307393, 4284577, 4372536, 4640372, 4617157, 4689024, 4755536, 4732063, 4842190, 5090717, 5372443, 5481804, 5575756, 5793057, 6179799, 6493884, 7033352, 7225598, 7340273, 7604783, 7926354, 8384416, 8637274, 9123963, 9931863, 10654866, 11085279, 11564564, 12216096, 13271114, 14327195, 15636455, 17029883]
16670A7029883J467872J517579J830001K090954K508896K981268L208839L763906
16662C6399198M767343O074479P770157J0225527J3504828J7000423K0613746
16655A16355701K4189206K6307934K7063899K7565460K8773386K9855982K8667182
16648C08778750K3591020J3802866J703838q213983j3261960j2765229r119724
16641C04515578n817480m252282l782963j949246J149600M973945P703962O625014
16633C09166128P53632q205508j7355240k3025576k5348227k5026260k4091816
16626A86867133k3502818k2947484k1928371j9815486j6942316j3600316j0776406
16619E7353936q216071o669043n432905m048621l187157k861166k323818k245731
$$ y = [17029883, 18497755, 20015334, 21845335, 23936289, 26445185, 29426453, 32635292, 36399198, 41166541, 47241020, 55011177, 65236704, 78741532, 95741955, 116355701, 140544907, 166852841, 193916740, 221482200, 250255586, 280111568, 308778750, 332369770, 346172636, 347876474, 339662491, 326400531, 313635302, 304515578, 298698098, 294445816, 290662853, 288713607, 289863207, 294837152, 302541114, 309166128, 309919760, 301714252, 284359012, 261333436, 235985209, 210958949, 186867133, 163364315, 140416831, 118488460, 98672974, 81730658, 68130342, 57353936, 49137865, 42468822, 37035917, 32987296, 29800139, 26938973, 24615155, 22369424]
16611B2369424j721241j760717j840223j403053j543349r23778p42064p13520
16603A1721479q34001q51417n76879l57760n79896m59685m71544l62637j63527
16594G064133l90670m12551k39555m1906k24064N4178j08419p701j22006m72913
16584E098526k38820N8125Q1352J05015k01416j15339q1841j82633l6252j15288
16574D371429o2438L7419J76961K01912j35816j19897m8888j50908q6888J56954
16564D339840R3252m9096k15707n54134j71249J73646L79508o4827o0398q014
16554C862821P7002p0692l46285j6088J01874q7280J78451O7655j27003j67098
16544C473357j22536J08646m8813k72659J01965J495j6201K08687K33873o5831
$$ y = [22369424, 20648183, 18887466, 17047243, 15644190, 14100841, 13177063, 12434999, 11721479, 10887478, 10036061, 9459182, 9101422, 8521526, 8061841, 7590297, 7227660, 7064133, 6673463, 6260912, 6021357, 5979451, 5755387, 5809565, 5701146, 5693445, 5571439, 5098526, 4859706, 4917831, 4999183, 5104198, 4902782, 4787443, 4705602, 4522969, 4486717, 4371429, 4308991, 4346410, 4523371, 4725283, 4589467, 4469570, 4420682, 4269774, 4182886, 4339840, 4433092, 4383996, 4168289, 3614155, 3442906, 3616552, 3996060, 3931233, 3870835, 3862821, 3939823, 3869131, 3522846, 3506758, 3608632, 3521352, 3699803, 3767458, 3640455, 3473357, 3350821, 3459467, 3410654, 3137995, 3239960, 3241455, 3225254, 3433941, 3667814, 3601983]
16534C601983l65653p0668K96685J49579K21922J12059M3825j23252r0663P7271
16524C853088j29433j89706L6829K08601j6132J1617J27045M5113l4742J4306
16514C926586k8917J08503k9635j44500q496J30104J78956k60045M3619J37870
16504D054045j11711J11438J7237k3532q1639m2726J9254m0297k41528J09357
16494C769898r0603P9479J0452N3800l8869J382J61311O9212P7784j53862k811
16483C937173L26473J60961j78923K53239J78818N9489j05947j11929j53603j18116
16473D247635j9444j01049j49653J6087m0973K09333J71086m5104M207N9313j8678
16462D332760J61416J0869o1299k7687P618N6292j54854j36757l5286k9812J78715
$$ y = [3601983, 3236330, 3165662, 3462347, 3611926, 3833848, 3945907, 3989732, 3866480, 3775817, 3853088, 3723655, 3533949, 3570778, 3779379, 3763247, 3774864, 3901909, 3947022, 3912280, 3926586, 3897669, 4006172, 3976537, 3832037, 3823541, 3953645, 4132601, 3872556, 3916175, 4054045, 3942334, 4053772, 4071009, 4047477, 3965838, 3923112, 3942366, 3902069, 3660541, 3769898, 3679295, 3758774, 3769226, 3823026, 3784157, 3785539, 3946850, 4016062, 4093846, 3939984, 3937173, 4263646, 4424607, 4245684, 4498923, 4677741, 4737230, 4631283, 4519354, 4365751, 4247635, 4228191, 4127142, 3977489, 3993576, 3952603, 4161936, 4333022, 4287918, 4292125, 4351438, 4332760, 4494176, 4505045, 4443746, 4416059, 4423677, 4479969, 4325115, 4188358, 4153072, 4123260, 4301975]
16451D301975p2034P2806R2524m9246J7957K88748q268N1025o0142J44286O3285
16440D842916J827r4570N0134J48273J52198J25039n0016J46440p7394j89595
16430E055252J26842J13752Q293J50882M0900J61608q4407K0862J15733N2407
16420E762124j46658j82100L35958J32563N2040J17239M6011j3401q9157K06033
16410F220652M4146p232P1884J1392K12781M3887q605l4977j69610j1117J0021
16399F383222Q9943K27673l612J20410N8524J23768J95527M5088l5225K25201
16389G430519Q9905O9218l8132o9332M7014j38766j61278R0615K76002M07604
16379H003369J84939M6070J20310k4958j87562J65795N2418k8500J39432J61533
$$ y = [4301975, 4229941, 4302747, 4395271, 4346025, 4363982, 4652730, 4644462, 4695487, 4635345, 4779631, 4842916, 4844743, 4750173, 4800307, 4948580, 5100778, 5225817, 5175801, 5322241, 5244847, 5055252, 5182094, 5295846, 5304139, 5455021, 5495921, 5657529, 5573122, 5593984, 5709717, 5762124, 5615466, 5433366, 5769324, 5901887, 5953927, 6071166, 6117177, 6103776, 6014619, 6220652, 6264798, 6257566, 6329450, 6340842, 6553623, 6597510, 6588905, 6553928, 6384318, 6373201, 6383222, 6473165, 6700838, 6697226, 6817636, 6876160, 6999928, 7195455, 7240543, 7205318, 7430519, 7520424, 7589642, 7551510, 7482178, 7529192, 7390426, 7229148, 7319763, 7595765, 8003369, 8188308, 8234378, 8354688, 8329730, 8142168, 8307963, 8360381, 8331881, 8471313, 8632846]
16369H632846J77912J83144n333M4801J93851R0000K51100L45192J02673N8090
16359A0074276R4823K12172N6589K9504M836k0547J84316K67866K40012L80862
16349A1524709L10798O8063k38724J10320J88945J47886M15900k7082j0842O7839
16339A2557812J08748J49662O1155J17400M39663M34242K36410K79997J7263P3169
16329A4475521J81790J55389K00794K35944J01532J43500K03627K4559k8157o7957
16319A5626542m8132K61900J61311L71650J73858M6985J72898J43913J54626L36514
16309A7402065O00431M57036J54740J15649J80854L52018M03626J88449L42696
16300B0197564N98323M89107J52290K78933M28684L28756J70007M11272N48342
$$ y = [8632846, 8810758, 8993902, 8988569, 9033370, 9227221, 9317221, 9568321, 9913513, 10016186, 10074276, 10169099, 10381271, 10437860, 10467364, 10472200, 10451653, 10635969, 10903835, 11143847, 11524709, 11835507, 11903570, 11664846, 11775166, 11964111, 12111997, 12527897, 12500815, 12489973, 12557812, 12666560, 12816222, 12877377, 12994777, 13434440, 13868682, 14105092, 14385089, 14402352, 14475521, 14657311, 14812700, 15013494, 15249438, 15350970, 15494470, 15698097, 15722656, 15694499, 15626542, 15578410, 15840310, 16001621, 16373271, 16547129, 16594114, 16767012, 16910925, 17065551, 17402065, 18002496, 18459532, 18614272, 18729921, 18910775, 19262793, 19666419, 19854868, 20197564, 20795887, 21284994, 21437284, 21716217, 22144901, 22473657, 22643664, 23054936, 23603278]
16291B3603278L97439N10004O00310K76461K01541K85148N19798M16595K26865
16282B7037439L76193P68728O14096M00831O30031O63825N24150L16501K76444
16273C1608238M51220L64603Q35890N06923L88031M05029M15696N84142P17946
16264C6277718Q33431P75231O20521P65867P78058O69298P05841O83266R12978
16255D3022209R31477P59143O83082J071009J057029Q08549P75792R82949R91172
16246E1082411J119985R58993J108405Q31643J135426J280089J188035J322725
16238F0027712J286795R28735J257073J037614J070648J712335J603644J328636
16230G0253192J314972J339146J305392J493612J640834J631101J520388J618647
$$ y = [23603278, 24000717, 24510721, 25111031, 25387492, 25589033, 25874181, 26393979, 26810574, 27037439, 27413632, 28182360, 28796456, 29197287, 29827318, 30491143, 31015293, 31331794, 31608238, 32059458, 32424061, 33259951, 33766874, 34154905, 34559934, 34975630, 35559772, 36277718, 37111149, 37886380, 38506901, 39272768, 40050826, 40720124, 41425965, 42109231, 43022209, 43953686, 44712829, 45395911, 46466920, 47523949, 48332498, 49108290, 50091239, 51082411, 52202396, 53161389, 54269794, 55101437, 56236863, 57516952, 58704987, 60027712, 61314507, 62243242, 63500315, 64537929, 65608577, 67320912, 68924556, 70253192, 71568164, 72907310, 74212702, 75706314, 77347148, 78978249, 80498637, 82117284]
16222H2117284J741657J548399J490824J498527J646432J770277J630213J522588
16214I4966201J746838J817174J916422J757933J640703J559342J568908J451364
16206A08424885J358165J540168J588698J620800J707080J342008J243319J422679
16198A20247802J276967J339205R96241R38810R17921J088328J002198O80316
16190A28487788N68573O12849L64696K35044L89946J99926J5576n7720n3593l12325
16180A30450760k42441l89050m73040o85900r18438p53869p77858j171961r65368
16171A24072835r78990j003835j251430j503630j306780j562598j371841j129403
16163A13964328j211423j498521j615328j398570j489644j577579j226783j239939
$$ y = [82117284, 83858941, 85407340, 86898164, 88396691, 90043123, 91813400, 93443613, 94966201, 96713039, 98530213, 100446635, 102204568, 103845271, 105404613, 106973521, 108424885, 109783050, 111323218, 112911916, 114532716, 116239796, 117581804, 118825123, 120247802, 121524769, 122863974, 123860215, 124799025, 125716946, 126805274, 127807472, 128487788, 129056361, 129669210, 130033906, 130268950, 130658896, 130858822, 130874398, 130816678, 130763085, 130450760, 130208319, 129819269, 129346229, 128660329, 127741891, 126988022, 126210164, 125038203, 124072835, 123093845, 122090010, 120838580, 119334950, 118028170, 116465572, 115093731, 113964328, 112752905, 111254384, 109639056, 108240486, 106750842, 105173263, 103946480, 102706541]
16155A02706541j657035j777895j498311j367593j356170j463034j744485j829700
16147I0012318j701947j694384j505749j391491j597393j615580j476459j527032
16139G7502283j288730j299811j259917j450163j464484j311209j355463j258556
16131F6813950j391267j251753j364606j431531j422819j300872j123377j117553
16123E6410172r79772r49968j192335j497729j094853o43113p40875o81364j179760
16114D7450403r39694o69270p28741p79714r16200p69391o66422p72142p64267
16105D0444562q27605m72295o32881p29589o00856m65029m96743o74330q08628
16096C4736606r35621p13164p11067l71033l22445m16858l61940n26991n29414
$$ y = [102706541, 101049506, 99271611, 97773300, 96405707, 95049537, 93586503, 91842018, 90012318, 88310371, 86615987, 85110238, 83718747, 82121354, 80505774, 79029315, 77502283, 76213553, 74913742, 73653825, 72203662, 70739178, 69427969, 68072506, 66813950, 65422683, 64170930, 62806324, 61374793, 59951974, 58651102, 57527725, 56410172, 55430400, 54480432, 53288097, 51790368, 50695515, 50052402, 49311527, 48630163, 47450403, 46510709, 45841439, 45112698, 44332984, 43416784, 42647393, 41980971, 41208829, 40444562, 39616957, 39144662, 38511781, 37782192, 37181336, 36716307, 36219564, 35545234, 34736606, 33800985, 33087821, 32376754, 32005721, 31683276, 31266418, 30904478, 30377487, 29848073]
16087B9848073m16844l81151j78516o09306o40376n19344k17835j79932m68099
16078B6236670l94947m20126n18313m42443j14951m16931k11315k96923m26773
16069B2993948m46373l12574k66296l10589k01455l39118k56890l02177m66343
16060B0092133l87668k46421j35809p1141k84291j96916k18335k79602l85691
16051A7886259r2191l11250l56632k37275l17844k56942o8527k92202l69655j87126
16041A5396615j60211l3705k9524N176k45276r3962l7833k12186m54498j57083
16031A3977513j47208N6867k89126o4444K8179m88352m78767m5743p7307l2442
16021A2439170P2089p0234j74610p6876j80632k51188k34859L5451k22037j64275
$$ y = [29848073, 29431229, 29050078, 28871562, 28262256, 27621880, 27102536, 26884701, 26704769, 26236670, 25841723, 25421597, 24903284, 24460841, 24345890, 23928959, 23717644, 23420721, 22993948, 22547575, 22235001, 21968705, 21658116, 21456661, 21117543, 20860653, 20558476, 20092133, 19704465, 19458044, 19322235, 19251094, 18966803, 18769887, 18551552, 18271950, 17886259, 17794068, 17482818, 17126186, 16888911, 16571067, 16314125, 16245598, 15953396, 15583741, 15396615, 15236404, 15202699, 15173175, 15178351, 14933075, 14839113, 14801280, 14589094, 14134596, 13977513, 13830305, 13887172, 13598046, 13533602, 13561781, 13073429, 12594662, 12548919, 12471612, 12439170, 12511259, 12441025, 12266415, 12189539, 12008907, 11757719, 11522860, 11558311, 11336274, 11171999]
16011A1171999k52796l03396j00249O5440K59320j16657o0711j97615k83102l39550
16001I842683R929J81360k87861j90270p6731o085M3306r1616L8431J48493l18841
15990I292798n50264j19406q9898J08695K4806j45357k53195l22813J16430K15184
15980H276980P9008k28557l73801j00294P4068k36327P2486K38170M1692k54070
15970G589355j38494l9052m28667k26863J25831K95321N0360k60517j36852J04803
15960F935225J77949k1327q4279k02945k74800j51164l72R5026r0541l28145J13260
15949F167887K31259l0012o5071j53518n8236L1319K3898q8634k13610l08017
15939E537265J29772J57702Q9455Q578k02576j14367Q1621j70766l7772M5083
$$ y = [11171999, 10919203, 10615807, 10515558, 10580998, 10840318, 10723661, 10662950, 10465335, 10182233, 9842683, 9852612, 10033972, 9746111, 9555841, 9479110, 9473025, 9516331, 9424715, 9463146, 9611639, 9292798, 8742534, 8623128, 8533230, 8641925, 8666731, 8521374, 8268179, 7945366, 8061796, 8276980, 8355988, 8127431, 7753630, 7653336, 7727404, 7491077, 7563563, 7801733, 7843425, 7589355, 7450861, 7411809, 6983142, 6756279, 6882110, 7177431, 7227791, 6967274, 6830422, 6935225, 7113174, 7091847, 7007568, 6804623, 6529823, 6378659, 6378287, 6473313, 6382772, 6054627, 6167887, 6399146, 6369134, 6304063, 6150545, 6092309, 6123628, 6147526, 6058892, 5845282, 5537265, 5667037, 5824739, 5914194, 5922772, 5720196, 5605829, 5687450, 5516684, 5478912, 5523995]
15929E523995j6585K03819Q979j68662q412k62869j50972K72142n6575k64883
15919E079977K0506k52819k67853P8126k1932Q2330J17828J59538J08274j29089
15909D974886j80685k6821m8635j77091J4640j6649J49739l8910k02733K04875
15899D652616K10761p7128o4653k46809K6094k38096k1046l8488J83510n9564
15889D327197m0210k60429j45804j3190k22083j84981q9407J63372K55927K42221
15879D032613j03220j94375R927K611L9990o7422L1570j42990j51832O5119K25198
15868C747189K32775j19094k06558n4287L9966j23039k71466p2589J60078n866
15858C327109k3823K375j1091k10159l771r1007j77396Q7695K43633L8560k0370
$$ y = [5523995, 5507410, 5711229, 5720208, 5551546, 5543134, 5280265, 5129293, 5401435, 5344860, 5079977, 5100483, 4847664, 4579811, 4657937, 4636005, 4718335, 4836163, 4995701, 5103975, 4974886, 4794201, 4767380, 4718745, 4541654, 4556294, 4539645, 4689384, 4650474, 4447741, 4652616, 4863377, 4786249, 4721596, 4474787, 4500881, 4262785, 4241739, 4203251, 4386761, 4327197, 4286987, 4026558, 3880754, 3867564, 3645481, 3460500, 3371093, 3534465, 3790392, 4032613, 3929393, 3735018, 3744945, 3747556, 3787546, 3720124, 3751694, 3608704, 3456872, 3521991, 3747189, 3979964, 3860870, 3654312, 3600025, 3639991, 3516952, 3245486, 3172897, 3332975, 3327109, 3303286, 3305661, 3294570, 3084411, 3080640, 2989633, 2812237, 2899932, 3143565, 3182125, 3161755]
15847C161755k07806n0568k10704J99616L18192J32915k67561m9527J46296L4342
15837C206950J25116j31490l79605l90770j26711J36490q8735M7378J46902n9598
15827B485927J12446R2917J3215j21276o9058j08981q9482j9227o9482J60210
15817B387209J06089K26632j8955r0101o6994L1328k08863k25550l9944L3332
15807B134183N0528j42793K3872J85319J88026J47534K022j54020k55834R6062
15797B274899p7877J15883j54290l53814m6464J82925m2225k21899k682K95601
15787A970057J10593J2836k51906J9909p2399J82395K19349K28968k26025k33744
15777A960033P8815J9190p2958J708R2263J61334O4940q8442j61699m1812J60457
$$ y = [3161755, 2953949, 2903381, 2692677, 2892293, 3210485, 3343400, 3075839, 3026312, 3172608, 3206950, 3332066, 3200576, 2820971, 2430201, 2303490, 2439980, 2351245, 2398623, 2545525, 2485927, 2598373, 2691290, 2704505, 2583229, 2514171, 2405190, 2315708, 2296481, 2226999, 2387209, 2493298, 2719930, 2700975, 2610874, 2543880, 2575208, 2366345, 2140795, 2100851, 2134183, 2184711, 2041918, 2065790, 2251109, 2439135, 2586669, 2588691, 2434671, 2178837, 2274899, 2197022, 2312905, 2158615, 1804801, 1758337, 1941262, 1899037, 1677138, 1674456, 1970057, 2080650, 2093486, 1841580, 1861489, 1789090, 1971485, 2190834, 2419802, 2193777, 1960033, 2038848, 2058038, 1985080, 1986788, 2079051, 2240385, 2305325, 2216883, 2055184, 2013372, 2173829]
15766B173829j2164r6551l25237l34044N0194L55587j14623J2888J03403K60435
15756B073717L9634p5603k02027j31458k9991J34440J94553j16745J30735P9078
15746B096333K1957R5562j19723j6706k45360k45656j67038l24780J16946K06951
15736A418486M1725J26264j93931J2413K93094J97584m2785l6828L3925J56626
15726B006573o1358k39152k71067j23503k72892M452K65078K18989j2681J99104
15716A713543J75312j32935l57352j33744P6577J86422m5622o932L9787R4791
15706A609847k27251o4086j56435o4504P5J63709j67724L5699J95859J8999J91636
15695A535824j8703Q8073j0751j27374j51573r1228K14009J78666n9692m3631
$$ y = [2173829, 2161665, 2065114, 1739877, 1405833, 1456027, 1811614, 1696991, 1709879, 1813282, 2073717, 2113351, 2037748, 1835721, 1704263, 1674272, 1808712, 2003265, 1886520, 2017255, 2096333, 2118290, 2213852, 2094129, 2077423, 1832063, 1586407, 1419369, 1094589, 1211535, 1418486, 1460211, 1586475, 1392544, 1404957, 1698051, 1895635, 1852850, 1816022, 1849947, 2006573, 1945215, 1706063, 1434996, 1311493, 1038601, 1043053, 1308131, 1527120, 1514439, 1713543, 1888855, 1755920, 1398568, 1264824, 1341401, 1527823, 1482201, 1475269, 1515056, 1609847, 1382596, 1318510, 1162075, 1097571, 1097646, 1261355, 1093631, 1129330, 1325189, 1344188, 1535824, 1517121, 1605194, 1594443, 1467069, 1315496, 1224268, 1438277, 1616943, 1557251, 1513620]
15685A513620l82167k06287n749R1641J66091j29020m2639J25524l7P8902J21896
15674A331775q1315k03121k507j1238K05867J83724J45277N9799p6796q8469O8072
15663A531068K31501k13088j67251j89349k40046k8202J7817J35830M88516k5688
15653A541108j91529k14279Q7453P575j19908J33098J12547j49584j12894p3278
15643A020309j0861K80936J08423r4665k0903r3685L6535N3865j80882j55895
15633I43177L1660p5148l7478j50388J4513M8276Q6720k9622N3245N6870K7051
15622I68876j13688N4091L50474L663k50276j62283L9060M4391k416R6127J94619
15611A222638m9839p9072L3683m1657k28638J58617Q715j10104O1495L8051O0648
$$ y = [1513620, 1131453, 925166, 919417, 1011058, 1177149, 1048129, 1005490, 1131014, 1130977, 1209879, 1331775, 1250460, 1047339, 1044832, 1033594, 1239461, 1423185, 1568462, 1628261, 1551465, 1462996, 1531068, 1762569, 1549481, 1382230, 1192881, 952835, 924633, 942450, 1078280, 1566796, 1541108, 1349579, 1135300, 1222753, 1230328, 1110420, 1243518, 1356065, 1206481, 1093587, 1020309, 1009448, 1290384, 1398807, 1304142, 1283239, 1189554, 1226089, 1279954, 1099072, 943177, 974837, 899689, 862211, 711823, 726336, 774612, 861332, 831710, 884955, 941825, 968876, 855188, 909279, 1259753, 1263416, 1013140, 850857, 889917, 934308, 931892, 1028019, 1222638, 1172799, 1093727, 1127410, 1085753, 857115, 1015732, 1024447, 914343, 975838, 1013889, 1074537]
15600A074537j41208l4443j54805r1786n1691k08262j01011L5902J30105L16190
15590G73528r255j77256l34980r2661K66175J60359l9885K49860K99281j19494
15580I75672j47378M2458J04928r9939k968p5773P0964m6429M0179P528J0081
15569H79323j68543J0635J58754k52507J70158Q8741j12465j07313N5224Q5136
15559H07143K23573p0822J20958m3528k04825p2420j66624j01461L2773J64663
15549F89430O9743m1245j23198j23576N8012K8350o4710r3307q9144K11639L41732
15538H63726p3992M4756J60581J99272M5781l65940k15984P5838J3699j49626
15528E98111J9685L0008J03810j10056j33614J8947K4975j48258J13563L20658
$$ y = [1074537, 933329, 898886, 744081, 652295, 600604, 392342, 291331, 327233, 457338, 773528, 764273, 587017, 252037, 159376, 425551, 585910, 546025, 795885, 1095166, 975672, 828294, 870752, 975680, 875741, 872773, 797000, 867964, 821535, 861714, 869242, 879323, 710780, 721415, 880169, 627662, 797820, 886561, 774096, 666783, 722007, 807143, 1030716, 959894, 1080852, 1037324, 832499, 760079, 593455, 491994, 524767, 689430, 759173, 717928, 594730, 471154, 529166, 557516, 492806, 399499, 310355, 521994, 863726, 789734, 834490, 995071, 1194343, 1240124, 874184, 658200, 734038, 747737, 598111, 617796, 647804, 751614, 641558, 507944, 526891, 551866, 403608, 517171, 837829]
15518H37829j23944j04691o9334j86242Q7457K14749K19567Q0950q7443j304o2763
15507H04831r8239N2238j01736O2050J07043j76740J50290J76377l05123j38965
15497E32026K2651K67542k2322j86654P5278P6486j15138j67888k67764k10538
15487C679R1637R1753P1697J52480Q2318k4700J79232M1289N8618k356K9478r420
15475G65705K6975J40907j5965Q6276k94386j36909Q530j83663q6589J67934J48437
15464F27252j72284j25676j08665J33125K92065o8375l33598J0878J26861K6437
15454D08020l36024j66347M7476L26875O7406M7523k61663J04178J99541J29887
15444E66872k8517J50130K6059L9241j6083k02883l45995Q0667L06522r5449q2282
$$ y = [837829, 713885, 609194, 539860, 353618, 441075, 655824, 875391, 956341, 868898, 867594, 804831, 706592, 758830, 657094, 719144, 826187, 649447, 799737, 976114, 670991, 532026, 554677, 822219, 799897, 613243, 688521, 765007, 649869, 481981, 214217, 3679, 95316, 187069, 258766, 411246, 493564, 468864, 648096, 689385, 748003, 745647, 775125, 765705, 792680, 933587, 917622, 1003898, 709512, 572603, 581133, 397470, 310881, 478815, 627252, 454968, 329292, 220627, 353752, 645817, 577442, 243844, 254722, 381583, 408020, 71996, -94351, -46875, 280000, 347406, 394929, 133266, 237444, 436985, 566872, 538355, 688485, 714544, 753785, 737702, 534819, 188824, 269491, 576013, 480564, 398282]
15433C98282J45918m4922k30016R8704P76J35869k27658P3146J65258j7059m6372
15422D51926j84508J18977J6333k59460k05613R5115K07789J42119K8128J15707
15412E26513l7010k09118j05908l2983J14183r871J68143j820L5932m9871O0952
15401D59142j80223L3655K938j8742q9611K8971M3130J36259o9851J21021K03757
15390F70446m6408L4598k66616j45397l4170J2850o3015n3812K77954J21577p5909
15379D32098O8057P3256J1854p1472j19537m964K26807J01095J1464J4640q4704
15368F58594j98288J61121K27372j62760j96580J01960J54467N6135q4694l19499
15358C97828J8011l1553q3928j7848p5887K6562k95936r4209K17884J18154J40213
$$ y = [398282, 544200, 499278, 269262, 367966, 368742, 504611, 276953, 350099, 515357, 498298, 451926, 267418, 386395, 402728, 143268, -62345, 32770, 240559, 382678, 410806, 526513, 489503, 280385, 174477, 141494, 255677, 245806, 413949, 412129, 448061, 398190, 459142, 278919, 312574, 315512, 296770, 207159, 236130, 279260, 415519, 345668, 466689, 670446, 624038, 658636, 392020, 246623, 212453, 225303, 162288, 108476, 386430, 508007, 432098, 500155, 573411, 585265, 513793, 394256, 389292, 616099, 717194, 728658, 743298, 658594, 460306, 621427, 848799, 686039, 489459, 591419, 745886, 802021, 717327, 397828, 415839, 384286, 300358, 282510, 206623, 233185, -62751, -156960, 60924, 179078, 319291]
15347C19291J10925J31465p8460n3126K58236Q8665j3525q7131j7597Q1083p7292
15336F62534l17350j31537J37650Q914j70055O1443J80185O7707n0961j37165
15326C11365l292P1266K47130J93253o1261j78514k048j49985j33902j37770r4874
15315F1368n7280K74820J06343M373K20389J29167j64357R2258l90287l1209k367
15304B43218k0103J56070N6529j53832j16692J83538K82162L8179L5176K3952
15294G28197k1769n0576j26509o3436j54197J13021o5142j10443K82970J02534
15284F34650k18841j1034J17571j16484k07657O7084J06502K36584J91918J54243
15274I54536P9626n28550k88312J02609N3052p0320k63427K02213K99519J41072
$$ y = [319291, 430216, 561681, 483221, 430095, 688331, 776996, 763471, 676340, 658743, 739826, 662534, 345184, 213647, 351297, 360211, 190156, 251599, 431784, 499491, 448530, 311365, 308073, 379339, 626469, 819722, 758461, 579947, 577899, 427914, 294012, 156242, 61368, 4088, 278908, 385251, 389624, 610013, 739180, 574823, 667081, 276794, 245585, 243218, 223115, 379185, 435714, 281882, 165190, 348728, 630890, 669069, 704245, 728197, 706428, 655852, 529343, 465907, 311710, 424731, 359589, 249146, 532116, 634650, 415809, 404775, 522346, 405862, 198205, 265289, 371791, 608375, 800293, 954536, 1034162, 505612, 217300, 319909, 372961, 302641, 39214, 241427, 540946, 682018]
15264F82018M0806m430N6939q3423n7686Q3758j6181K95501j92449l44833J41321
15253F01341Q6510N5361j12775q398R7824l0682j63130p0419j04082J14069j79589
15242B86030j07585J6276N6843J14139m2711j46706l3455L14835L02116P3765
15232H33547k5694P5629J62231p5721m68656k14355K8405J34716R427j23900K70781
15221F06410K56998j05835l00243j01026q8804J71263J59287M431j08685R8162
15211E91958q3655l73032L4953J63873J732J78341L1465k59898r4219o4264k4355
15200A02899j6440M3307J28732J49948L5512Q1597k40519j28303J25833Q3663
15190C66229J29308j91001k14414J21329K38734Q1737N511j31337q5029k1915
$$ y = [682018, 722824, 718394, 775333, 691910, 634224, 717982, 701801, 997302, 804853, 460020, 601341, 687851, 743212, 630437, 622039, 719863, 689181, 526051, 455632, 351550, 465619, 286030, 178445, 194721, 251564, 365703, 322992, 176286, 142831, 457666, 759782, 833547, 807853, 883482, 1045713, 969992, 501336, 286981, 315386, 450102, 459529, 335629, 606410, 863408, 757573, 457330, 356304, 267500, 438763, 598050, 602481, 493796, 591958, 508303, 135271, 170224, 334097, 335829, 514170, 545635, 285737, 191518, 127254, 102899, 86459, 129766, 258498, 408446, 443958, 525555, 285036, 156733, 282566, 366229, 495537, 304536, 90122, 211451, 450185, 531922, 537433, 406096, 321067, 299152]
15180B99152j57412n2343J464K40188O0074k98762j63115J36680J13182n6666
15170A22442k0605Q1819L80393J27499j71074k04338l6428j93512K3877j91116
15160h1043K337q6517J90569K07333J34973J13987j41554j5582n3371K9154n1822
15149B48464j50202p4991N0264R7264J05340M2411q743j90785J17487j33397j88601
15138h5489O8130O5571k936j5157J22427K50507q3669o7238j64861k5864J26769
15127A88190j8900k27244O1968J58466o720J25136J13972l0819j34569j89359
15117D0121o9812J35947j04176j05625r7032L5256P742J31896J34860o0201j83817
15106a34841P0962L23369L1333j72490j33969R2003L8007n1199p9495J05829Q8382
$$ y = [299152, 141740, 89397, 90861, 331049, 391123, 92361, -70754, 65926, 179108, 122442, 101837, 183656, 564049, 691548, 520474, 316136, 279708, 86196, 110073, -81043, -78706, -165223, 25346, 232679, 367652, 481639, 340085, 324503, 271132, 300286, 248464, 98262, 23271, 73535, 170799, 276139, 318550, 309807, 119022, 236509, 103112, -85489, -17359, 48212, 45276, 30119, 152546, 403053, 319384, 252146, 87285, 61421, 188190, 169290, -57954, 4014, 162480, 155760, 280896, 394868, 364049, 229480, 40121, -29691, 106256, 2080, -103545, -200577, -165321, -157579, -25683, 109177, 48976, -134841, -63879, 259490, 290823, 118333, -15636, 76367, 114374, 63175, -16320, 89509, 177891]
15095A77891K02913J9645k75317j20059O0207M5468J40235k6472R98O0385j38738
15084A47156n0304n337j27140J39256L9591K1662N7659n986q1669o8125j03939
15073c7176p2843K7992j27602j38375Q5130j79039l3676n84M8291Q8445J46928
15062a92509k6098M9800K25363J77831r2113k35845R9454L69423k3267K00962
15052E53001J63m33414l65136K3283J89550K17874K15181j14883j77415r8983
15042I221p42n0328Q2776K30958K5511j58935l26246n4022L96495R1739k23429
15031B2998k19610J7595K93205K12512j52509j63398k50638k06374j5950J38120
15021c24049l954j36480K04378n7611k21874K05077k9073K21762j188R7884p251
$$ y = [177891, 380804, 400449, 125132, 5073, 65280, 110748, 250983, 224511, 225509, 285894, 147156, 96852, 91515, -35625, 103631, 143222, 164884, 222543, 216557, 134888, 66763, -37176, -110019, -82027, -209629, -348004, -262874, -441913, -475589, -476173, -427882, -339437, -192509, -218607, -168807, 56556, 234387, 142274, -93571, 5883, 375306, 352039, 553001, 553164, 119750, -245386, -222103, -32553, 185321, 400502, 285619, 108204, 9221, 8479, -41849, 40927, 271885, 297396, 138461, -187785, -241807, 154688, 246427, 22998, -196612, -179017, 114188, 326700, 174191, 10793, -239845, -446219, -462169, -324049, -328003, -464483, -260105, -317716, -539590, -334513, -363586, -141824, -143012, -45128, -52379]
15010e2379j11963l5566k69909N068L40724J66323O2569n4270J14291l8787k36144
14999a10043k90286N5818K84984J62586L190l17517q3236J96026J64399K7644
14989I3565m7086K6600m2409n0333q2700M5631l5481R3052K04282M5702K7057
14978B77880R9526n8620j99572j12105p6250N1233n316J47985J87858K41854J12331
14967F66804k85485l196J3928k41868j22806K39977R5293J22808M5046j03135
14957D27366p9080n0434R7379l6348j98029J448M4931R340K507k44089j15889
14946a40898l248J6079K57281J99791K4577k24893J17425l2505j96883k36651
14936b19925J60382R6380P6437O4700j322r3268j80702Q6315R667Q9541K22401
$$ y = [-52379, -164342, -199908, -469817, -464749, -124025, 42298, 104867, 50597, 164888, 126101, -110043, -400329, -344511, -59527, 103059, 106249, -211268, -294504, -98478, 65921, 93565, 46479, 73079, 30670, -19663, -102363, -56732, -92213, 839, 205121, 250823, 277880, 377406, 318786, 119214, 7109, -69141, -17908, -23224, 124761, 312619, 554473, 666804, 381319, 378123, 392051, 150183, 27377, 267354, 362647, 485455, 530501, 427366, 348286, 297852, 395231, 358883, 160854, 162302, 207233, 216573, 219080, -25009, -140898, -144146, -128067, 129214, 329005, 353582, 128689, 246114, 213609, 16726, -219925, -59543, 36837, 113274, 177974, 176652, 83384, -97318, -11003, -1336, 88205, 310606]
14925C10606O7488k0764j04448m8347Q1600j19765r0035l1647m953j30374j84805
14914b75444R583r2512Q7669N9176N8362j06334k13954J07212J70708J91903K00912
14903A97281J5954l0335J51284m31491j57394L10698K838j04232o9008k110M44428
14892C27913l2073j02976j43205j73160J8137P101r0863M40308R7982k9283j90850
14881A29031j87718Q7051M23556Q3905l5339j68692l47244k50990J7051K20297
14871b9092J35559J5685j54591l56j01890J68954P7363K4069j05330k91406N6451
14860b04584R3907J05334J56725O3532r6011p8981J84587R0103j97462q2591P0017
14849A04576K31913j15493P7887j93460l55849N5446J73779J20087N9752J0344
$$ y = [310606, 378094, 357330, 252882, 204535, 286135, 166370, 76335, 44688, 39735, -90639, -275444, -265861, -358373, -270704, -211528, -153166, -259500, -473454, -366242, -195534, -3631, 197281, 213235, 182900, 334184, -97307, -254701, 55997, 58835, -45397, -114405, -116515, 327913, 295840, 192864, 49659, -123501, -105364, -98263, -189126, 251182, 349164, 319881, 129031, -58687, 28364, 451920, 535825, 500486, 331794, -15450, -266440, -249389, -29092, 106467, 122152, -32439, -32795, -134685, 34269, 111632, 135701, 30371, -261035, -204584, -110677, -5343, 151382, 214914, 118903, 39922, 224509, 314612, 117150, 34559, 104576, 336489, 220996, 298883, 105423, -250426, -194980, -21201, 98886, 158638, 168982]
14839A68982J21920n651j66379P0282Q6134p405j11900j35124J02330r8028n1059
14828b5898J32847j10574q1089J26890k24667m5867Q2800L778J04520J56354J77362
14817B96456j73718J38679o8417l43174j72283M7175j55237j83855K88626K56087
14807f9661L8519o6226j11381M6047q421r6363L8750J25090L32127R1847J8227
14796C38555R9592l05742j85893O7780j43870o3313K19925M6346k50985M4699
14786a32906J48893L02180k9261k97918o4648k16172o2884K4471K53124K24827
14776A49706l4927l0603p1333N3818J477k5282K46273L7161j70445j80223m9811
14765g4189O7572j66419M8797J2624J45465J34762o2497J3293Q2293O246j10447
$$ y = [168982, 290902, 285251, 118872, 189154, 275288, 267883, 155983, 20859, 123189, 25161, -25898, 106949, -3625, -84714, 42176, -182491, -228358, -145558, -141780, -37260, 119094, 296456, 122738, 261417, 193000, -150174, -322457, -275282, -430519, -614374, -325748, -69661, -31142, -97368, -208749, -162702, -171123, -267486, -228736, -103646, 228481, 320328, 338555, 438147, 132405, -53488, 14292, -129578, -192891, 27034, 73380, -177605, -132906, 15987, 318167, 288906, -9012, -73660, -289832, -352716, -328245, -75121, 149706, 114779, 84176, 12843, 66661, 68138, 42856, 289129, 326290, 155845, -24378, -74189, -6617, -173036, -124239, -111615, 33850, 168612, 106115, 119408, 201701, 207947, 97500]
14754I7500J76469j4022l00085k42986K4839j93404l9710J65403K94489J75334
14744A43827p5498l83463j54852J02761j1224J61682K4232J94389K59514j19723
14734A41645k38996j27358m6554m5359J78789J18213J31701L1911R0864k42283
14724g427n8365J7326J72960j75102k37053m5958j9342J17998M1529K54891o4075
14713b618j11261k37361q3239K5018q0189J5233J10100o8524L4810J78952K13112
14702e967R5634N5302J17794K24486M706j54752l91649j00221j65264N1059K19160
14691d9712J54733M3135j2099K449Q5984p2269j37088r4547k09701O000R9644
14680a83471Q1980J17772m4747q7762o3117J57245j59561k3038K33378r3740m9112
$$ y = [97500, 273969, 259947, -40138, -283124, -258285, -451689, -491399, -325996, -31507, 143827, 68329, -315134, -469986, -367225, -378449, -216767, -192535, 1854, 261368, 141645, -97351, -224709, -271263, -316622, -137833, -19620, 112081, 143992, 234856, -7427, -65792, -48466, 124494, -50608, -287661, -333619, -352961, -234963, -193434, 61457, -2618, -113879, -351240, -434479, -409461, -489650, -474417, -364317, -432841, -398031, -219079, -5967, 89667, 144969, 262763, 487249, 491955, 337203, -54446, -154667, -319931, -268872, -49712, 105021, 148156, 136057, 138506, 224490, 152221, 15133, -79414, -289115, -283115, -183471, -101491, 16281, -28466, -116228, -179345, -22100, -181661, -204699, 28679, -65061, -114173]
14669a14173j20940K6128j59517o262j5676k55986p2743J58728K23842j5090J4684
14658c37005j82358Q3539J19249K34359O7088l5882k4684r7034Q8886k07973k53269
14647e45084J14453O7435N1555K92630j0266P7995J6571k9319m681N3106k0844
14636F3551j61079K18069o0043j20131k3744P8991J34137J24549J67550o1539
14626C60311k58401j18509J05524l04841k3174j00288r3653n8353j40268m8335
14616f79987J13830K52729K3019J10264m8081p9292j35936q054n8428k3779O7722
14605d65993J71919K19305l7139R8509K24498J22494p4798j26243k15336p2962
14595a55746K8187j73634n2500J29408J02551L6475k61243n2198L17107Q1794
$$ y = [-114173, -235113, -208985, -368502, -374764, -390440, -646426, -719169, -560441, -336599, -351689, -337005, -519363, -435824, -316575, -82216, -15128, -51010, -75694, -172728, -83842, -291815, -545084, -430631, -363196, -311641, -19011, -29277, 48718, 65289, 35970, 31289, 84395, 63551, -97528, 120541, 60498, -59633, -83377, -4386, 129751, 254300, 421850, 360311, 101910, -16599, 88925, -215916, -239090, -339378, -433031, -491384, -631652, -679987, -566157, -313428, -290409, -180145, -228226, -307518, -443454, -451508, -509936, -533715, -465993, -294074, -74769, -111908, -13399, 211099, 333593, 258795, 132552, -82784, -155746, -127559, -301193, -353693, -224285, -121734, -85259, -346502, -398700, -81593, 201]
14585B01j51830j01530J20995K26647M7390p2251q2437j14379K24100N853M0468
14574A43227J21735M0421j18315q4633r3044j32120L6533K17641q8824j56179
14564a13558J52633J5828p0927j39833J08877n1685O8228j8993J87994l5430k74346
14553a71212J35764L84754l7882N9165K582m09279k30242L0232j0157m0153J27124
14542a59304q5937r5781l1845J46750J47739p6041K9199K23044M9970J58914O7549
14531C74257j58600k98276j53824R4153M6462j4186J2844l20446l9510M8628K49765
14520a58733J23895m8882K60236J03705j05045J1362J5506n4674n0713N6410L7076
14509A90143N1027j53654j59966j10398j72996j44173N1776J49142K77637J13327
$$ y = [201, -151629, -253159, -132164, 94483, 141873, 69622, -12815, -127194, 96906, 102759, 143227, 264962, 305383, 187068, 102435, 9391, -122729, -86196, 131445, 42621, -113558, 39075, 54903, -16024, -155857, -46980, -98665, -30437, -49430, 138564, 103134, -171212, -35448, 349306, 311424, 370589, 373171, -36108, -266350, -236118, -246275, -286428, -159304, -245241, -341022, -372867, -226117, -78378, -154419, -125220, 97824, 147794, 306708, 374257, 215657, -82619, -236443, -142290, -95828, -110014, -97170, -417616, -457126, -408498, -158733, -34838, -83720, 176516, 280221, 175176, 186538, 202044, 147370, 96657, 153067, 190143, 241170, 87516, -72450, -182848, -355844, -500017, -448241, -299099, -21462, 91865]
14499I1865j20668n7484j94682k34117J90104J89512q8370q9641J96024N5757
14489f1700M7555j4499O0252o8024j56595K2343j40233O982J07703K20313m4135
14478b0038r8191J82996Q7659k6859j76264J06984j9577j02569q3853J670j5414
14467a63456K70630q3316k57225j12215J6411m1305J65352K72377l4181n7104
14457b4032J29285q7787j39429K69262J15224k5121m7565j93888j25300N6064
14447g3287j22159q5599J13558K8952J45524J07480k74435k025n9895K564J19890
14436i9432j38448J12029r10L9781P275k48633j11101K25704L36801j50485j44916
14425a72335q7927J09844P6347J12151k7284j20031j81777j40244N2289k0718
$$ y = [91865, -28803, -86287, -280969, -515086, -324982, -135470, -223840, -313481, -117457, -61700, -14145, -28644, 31608, -36416, -193011, -170668, -310901, -303919, -196216, 24097, -20038, -118229, 64767, 152426, 125567, -50697, 56287, 36710, -65859, -149712, -148042, -163456, 107174, 23858, -233367, -345582, -329171, -370476, -205124, 67253, 33072, -24032, 105253, 17466, -121963, 147299, 262523, 237402, 189837, -4051, -129351, -73287, -195446, -281045, -167487, -138535, 6989, 114469, -159966, -161991, -221886, -219322, -99432, -237880, -125851, -126761, -86980, -79705, -328338, -439439, -213735, 123066, -27419, -172335, -260262, -150418, -74071, 38080, 10796, -109235, -291012, -431256, -378967, -399685]
14415c99685j37807K78010M9407l10729J51723L12341j20171j95547J07275L349
14405b61834R4421J31996K96713N7431j08651N7678K04487l13451k9450m7634
14395H1706o9400j14705k90262Q9842Q4666j76591j53596O098K45366J03457Q8759
14384a04660Q1563R9398J41801Q4874j62545J904K2681k8680k90500j17517m1722
14373c13403l84911j15070J18600K77000K43567l4266O9918R4311R5447J04959
14363A56152j07539k77247L0010J33225K42401J39570j67616j2528o6321L400
14353G3507j31974j72921K5071j22141l2685J33334J48635J82233j50241J88313
14343A41131j48845R1711Q1136O3317q1206o7625R6635j92403K7642L3617M3962
$$ y = [-399685, -537492, -259482, -210075, -520804, -369081, -56740, -176911, -372458, -265183, -261834, -167413, -35417, 261296, 318727, 210076, 267754, 472241, 158790, 129340, 81706, 12306, -102399, -392661, -302819, -218153, -394744, -548340, -542242, -296876, -193419, -104660, -23097, 76301, 218102, 302976, 140431, 142335, 165016, 136336, -154164, -271681, -313403, -698314, -813384, -694784, -417784, -174217, -208483, -138565, -44254, 51193, 156152, 48613, -228634, -198624, -65399, 177002, 316572, 148956, 136428, 70107, 73507, -58467, -231388, -206317, -328458, -361143, -227809, -79174, 103059, -47182, 141131, -7714, 83997, 165133, 228450, 147244, 79619, 176254, -16149, 11493, 45110, 89072]
14332H9072j63449j51818J66363K46415O7355l24572o3443j0000J660m6072j42717
14321c31206o1377P7654k67824J09372L57831J74761J41445p7698k91511k06465
14311c75018J19911J26171l36173M9156K09519L41251J79983M9294M6305q8073
14301C22326q3877k7045j11940K9299J47956o1601j11716m7097j30171J49121
14291G5255L4948L8262j86283j01444j75131k11306J33228K04179Q9635l101L9971
14280f1787p0849p5107Q4686J94891m2276l02120J25704N3609k7747J18202J3957
14269A1163j18130r0743K4014j11039j58639r948J45827j5414q9439j50886J20319
14258d42915K67139L22701j16279Q684k9317K6438M3965N5578R0933j45523k54876
$$ y = [89072, -74377, -226195, -59832, 186583, 253938, -70634, -134077, -144077, -142417, -188489, -331206, -392583, -314929, -582753, -473381, -115550, 59211, 200656, 122958, -168553, -375018, -255107, -128936, -465109, -415953, -206434, 134817, 314800, 364094, 410399, 322326, 238449, 211404, 99464, 128763, 276719, 215118, 103402, 56305, -73866, 75255, 110203, 148465, -37818, -139262, -314393, -525699, -392471, -188292, -98657, -101758, -61787, -132636, -207743, -123057, 71834, 29558, -272562, -146858, -93249, -120996, -2794, 11163, -106967, -197710, -173696, -284735, -443374, -453322, -307495, -322909, -412348, -563234, -442915, -175776, 146925, 30646, 39330, 10013, 36451, 80416, 135994, 226927, 81404, -173472]
14247a73472J3356j20543O9932j3088m1780J89583R7461P1732J51985J94140P3401
14236E12707l20439M6558L1294j40522k64567J50320j44825r2287l68198p1402
14226f61361O4521m6478K04869J79069m4324J59859Q2666J4033M0309L7818j11253
14215h0272J53225j0006j52968J43072J84642J34707p7535l84056k7714J12255
14205d650j53570K3002J65341K10905q360j59140j09400p8325j42860M7210O8352
14194a41495K69292j05805j91723J69198J91408J17167k49062k43349j18265J73456
14184a29178j71389K4731J26382q2714j72600j13547K3985J14221J78023O0517
14174a41569J48644L8998j14376L0724J0564K806O9751n242j36957j43869M6685
$$ y = [-173472, -160116, -280659, -210727, -223815, -265595, -76012, 21449, 93181, 245166, 439306, 512707, 192268, 238826, 270120, 129598, -134969, 15351, -129474, -221761, -589959, -661361, -596840, -643318, -438449, -259380, -303704, -143845, -61179, -47146, -6837, 30981, -80272, 72953, 62947, -90021, 53051, 237693, 372400, 294865, -89191, -116905, -4650, -158220, -135218, 30123, 241028, 232668, 73528, -35872, -114197, -257057, -209847, -141495, 127797, 21992, -169731, -533, 190875, 308042, 58980, -184369, -302634, -129178, -300567, -275836, -149454, -232168, -404768, -518315, -494330, -380109, -202086, -141569, 7075, 46073, -68303, -37579, -27015, -24209, 45542, 40300, -96657, -240526, -193841]
14163a93841j46877j09998J74347L19343J16225j55199k38698m4696J86700M4361
14153d8333j38043j81221j1885J22995K9815m146J7334M5193J09163j11710p6343
14142b47181K01569K46412k80432k36082P6695L1291J55905J49118k6173j5387
14132E5735j69765k91778R0625O4600M3344j7737k79355j05288l0424O9455J39539
14121d31049J39797K657Q7757o0862m855J0903O5820J98672J63804j70125l04892
14110c02373l0333o580O6389j373Q6648l7156o9092L0917j18138P8692M4889j01118
14098c58628k14589J49478M9673J07902P7848P1913R179K14999n1833l59027J14090
14087a88995Q9298O218J38376o1796p5641l39640P9412M673k79604J35303L47223
$$ y = [-193841, -340718, -450716, -276369, 42974, 159199, 4000, -234698, -279394, -92694, -48333, -186376, -367597, -379482, -256487, -226672, -230818, -213484, -168291, -59128, -170838, -247181, -45612, 200800, -79632, -315714, -239019, -207728, -51823, 97295, 71122, 55735, -114030, -405808, -315183, -250583, -207239, -224976, -504331, -609619, -640043, -570588, -431049, -291252, -288595, -200838, -261700, -266555, -255652, -189832, 8840, 172644, 2519, -302373, -332706, -339286, -272897, -274270, -187622, -224778, -293870, -262953, -381091, -302399, -257510, -358628, -573217, -423739, -374066, -266164, -188316, -116403, -107224, 107775, 55942, -303085, -188995, -99697, -93479, 44897, -16899, -92540, -432180, -352768, -348095, -627699, -492396, -145173]
14076a45173k57539j24175L33973Q3132N2117l40787j89270O9574K76284O0015
14066a81849j02568k06284M0352J81708K72242K60282L40P6907l6315k85049j81033
14055a61267p345J2342J38582p127q3651J75197J32168J68368k42524k29924k0922
14044a26103l4713O0124j6288P2927p2240j10012J35506K73106N6934k02114j8396
14033A8731p5382k2014J57095l7914j21305r2355J2242M1401j93984k25038M4478
14022d94045K12023k5593P5926N7836N7972J1327J5775L060j29508m4367j55114
14011d14708r594J52956K73752M05001L6801k03974r5429k07734j23583J480n0586
14000b35618J4391L008J30857j07907q9387Q8469j0722k48840J81725J62669o8130
$$ y = [-145173, -402712, -526887, -192914, -109782, -57665, -398452, -587722, -518148, -241864, -181849, -284417, -490701, -450349, -268641, 3601, 263883, 264223, 341130, 304815, 19766, -161267, -168612, -156270, -17688, -24815, -108466, 66731, 198899, 367267, 124743, -105181, -126103, -160816, -100692, -116980, -44053, -116293, -226305, -90799, 182307, 239241, 37127, 18731, -56651, -78665, 78430, 40516, -80789, -173144, -160902, -119501, -313485, -538523, -494045, -282022, -307615, -231689, -173853, -115881, -104554, -88779, -85719, -215227, -259594, -414708, -424302, -271346, 2406, 407407, 444208, 240234, 144805, -62929, -186512, -185032, -235618, -221227, -218219, -87362, -195269, -284656, -196187, -206909, -455749, -274024, -111355, -179485]
13989a79485k6373J36076O0007j99028O4154M2156Q2342J14275o1942K3925k37754
13978a81647j2957R0792R949j37660R1506J61346J80753J50743M2852j55883k31422
13967H372j05911K20706m1893k98748m2773J3946j81196K95723J84407j68566
13957a15933J15030j45126j44620j45368J80054K19125K05966j37893l39853k2369
13947c30987M0137J03183M311n7949J560J4808M9197o3001M6514j51201L94J15142
13935b27892j03489M8357J29140j44054j63739K10611r0815J37621K04157L898
13925C795J8039j5938j62133o0471j66436j4288o7139J55521l7372k5567K80217
13914i1772J97566P0034n7003q2317j61118k8632J6416J28839R8676j66679j1948
$$ y = [-179485, -205858, -69782, -9775, -208803, -144649, -102493, -20151, 94124, 32182, 56107, -181647, -194604, -103812, -93863, -231523, -140017, 21329, 202082, 352825, 395677, 239794, 8372, -97539, 123167, 81274, -217474, -260247, -246301, -427497, -131774, 52633, -115933, -903, -146029, -290649, -436017, -255963, -36838, 169128, 31235, -308618, -330987, -290850, -187667, -183356, -241305, -239745, -224937, -175740, -238741, -192227, -343428, -343034, -227892, -331381, -283024, -153884, -297938, -461677, -251066, -341881, -204260, -103, 3795, 21834, 5896, -156237, -216708, -383144, -397432, -464571, -309050, -346422, -371989, -91772, 105794, 175828, 118825, 36508, -124610, -153242, -136826, -7987, 90689, -75990, -87938]
13903h7938M9001j75000l25118p1948J13461K36276p965j92485R6756R8564J6849
13892b49547M8716J42416K8447Q8477J5612j54002J01545N5746j14695k78118
13882c15403J19195J47040k6001j70303j02029L94783K7616k96797j5852R3894
13872a43857J9960m2692K44775M7262J8005j80507r4498J16448m1267j46835J45592
13861e7614L77857k8406q3572j2720K915j21739j44826j83581K3506M131O3382
13850a60667N7122m1093l3171q4388k21188J858l0742l257K62074O1758m1060
13839b32754q5658J92102P0863Q163J91996q7640o9334J82324j3709j0074k43859
13828i7580j09640K93058K40298j31590j56298p8802L2135P6862k73057j68738
$$ y = [-87938, -38937, -213937, -539055, -611003, -497542, -261266, -269231, -461716, -364960, -266396, -249547, -200831, -58415, -29968, 58509, 74121, -79881, 21664, 77410, -37285, -315403, -196208, -49168, -75169, -245472, -347501, 47282, 74898, -221899, -237751, -143857, -123897, -166589, 78186, 125448, 143453, -37054, -131552, -15104, -56371, -203206, -57614, 320243, 291837, 208265, 195545, 198460, 76721, -68105, -251686, -228180, -224049, -160667, -103545, -144638, -177809, -262197, -483385, -481527, -512269, -515526, -253452, -191694, -232754, -318412, -126310, -55447, -47284, 144712, 57072, -12262, 170062, 156353, 146279, -97580, -207220, 85838, 326136, 194546, 38248, -40554, -8419, 68443, -204614, -373352]
13818c73352J86013J51044R3075J79635k92530j13744J10330N7381q4217k37394
13808c23759k53930K1105K48497J74128J26691r949P2388j80136r5581q5117j29242
13797d34905q7937J40481N3687Q0951Q3441k12754k97065o1164L32664K09300
13787a93301R5334J43551R6325j81717k34887m5173R3647J0443j1306j80752K05195
13776b02641J40977m9981k3602N978n7818j0743J24068r1137j8704o2909L47901
13765A01389K83931l11125j69339j99487J8141L3346k5233j62132k47335N7792
13755f20052J56814L00103J79680M3542j70676J58176j23287l7463L1592q7485
$$ y = [-373352, -187339, -36295, 56780, 236415, -56115, -169859, -59529, -2148, -86365, -323759, -577689, -556584, -308087, -133959, -7268, -17217, 55171, -124965, -220546, -305663, -434905, -522842, -382361, -328674, -247723, -164282, -377036, -674101, -735265, -402601, -193301, -97967, 45584, 141909, -39808, -274695, -319868, -226221, -215778, -227084, -407836, -202641, -61664, -111645, -135247, -129269, -187087, -197830, -73762, -164899, -183603, -246512, 101389, 385320, 74195, -95144, -294631, -276490, -243144, -268377, -430509, -677844, -620052, -463238, -163135, 16545, 60087, -110589, 47587, -75700, -113163, -81571, -169056]
$$ [...]
##END NTUPLES=NMR SPECTRUM
##END=
