##TITLE=Analysis number 316042
Compound Code rdr 03816
Book Reference 382/148/1
Project Code adrs
Chemist Name simons
##JCAMPDX= 6.0         $$ Bruker NMR JCAMP-DX V2.0
##DATA TYPE= NMR SPECTRUM
##DATA CLASS= NTUPLES
##ORIGIN= Bruker BioSpin GmbH
##OWNER= NMR
$$ XWIN-NMR		Version 3.5
$$ Wed Dec 14 13:27:10 2005 GMT Standard Time (UT+0h)  MAYBRIDGE\NMR@NMR_250MHZ
##.OBSERVE FREQUENCY= 250.131544655141
##.OBSERVE NUCLEUS= ^1H
##.ACQUISITION MODE= SIMULTANEOUS (DQD)
##.ACQUISITION SCHEME= undefined
##.AVERAGES= 16
##.DIGITISER RES= 18
##SPECTROMETER/DATA SYSTEM= dpx250
##.PULSE SEQUENCE= zg30
##.SOLVENT NAME= CDCl3
##.SHIFT REFERENCE= (INTERNAL, CDCl3, 0, 16.522)
##AUDIT TRAIL= $$ (NUMBER, WHEN, WHO, WHERE, WHAT)
$$ ##TITLE= Audit trail, XWIN-NMR		Version 3.5
$$ ##JCAMPDX= 5.01
$$ ##ORIGIN= Bruker BioSpin GmbH
$$ ##OWNER= NMR
$$ C:\u/data/dgb/nmr/ADRS/13820/pdata/1/auditp.txt
$$ ##AUDIT TRAIL=  $$ (NUMBER, WHEN, WHO, WHERE, WHAT)
(   1,<2005-12-14 13:26:49.77 +000>,<MAYBRIDGE\NMR>,<NMR_250MHZ>,
      <created by zg, POWCHK disabled, PULCHK disabled
       configuration hash MD5:
       62 19 C7 07 E1 42 D1 B7 37 6C 3D D0 77 39 F9 E6
       data hash MD5: 64K
       6E 21 22 E8 EB 7D A9 81 B8 69 E4 DA B2 27 90 0C>)
(   2,<2005-12-14 13:27:02.60 +000>,<MAYBRIDGE\NMR>,<NMR_250MHZ>,
      <Start of raw data processing
       ef LB = 0.3 FT_mod = 6 PKNL = 1 SI = 32K 
       data hash MD5: 32K
       A0 46 88 BA 1D CD B7 88 8E 79 DD C2 D8 3D B0 CC>)
(   3,<2005-12-14 13:27:04.46 +000>,<MAYBRIDGE\NMR>,<NMR_250MHZ>,
      <apk 
       data hash MD5: 32K
       CF 38 48 7D 86 84 BB 54 85 DB 36 E4 8E D3 86 BE>)
(   4,<2005-12-14 13:27:05.21 +000>,<MAYBRIDGE\NMR>,<NMR_250MHZ>,
      <abs ABSG = 5 
       data hash MD5: 32K
       DD 2F 70 87 51 13 7C DA 85 E2 55 D1 B4 62 7B EA>)
$$ ##END=
$$ 
$$ hash MD5
$$ 66 8D 20 3C 6F 1C 3A 21 70 58 77 EE AE 0E 29 4B
##$RELAX= 
##$RELAX= 
##$RELAX= 
##$RELAX= 
##$RELAX= 
##$RELAX= 
##$RELAX= 
$$ Bruker specific parameters
$$ --------------------------
##$DU= <C:\u>
##$EXPNO= 13820
##$NAME= <ADRS>
##$PROCNO= 1
##$TYPE= <nmr>
##$USER= <dgb>
##$AMP= (0..31)
100 100 100 100 100 100 100 100 100 100 100 100 100 100 100 100 100 100 
100 100 100 100 100 100 100 100 100 100 100 100 100 100 
##$AQSEQ= 0
##$AQ_mod= 3
##$AUNM= <au_zg>
##$AUTOPOS= <29 >
##$BF1= 250.13
##$BF2= 250.13
##$BF3= 250.13
##$BF4= 250.13
##$BF5= 500.13
##$BF6= 500.13
##$BF7= 500.13
##$BF8= 500.13
##$BYTORDA= 1
##$CFDGTYP= 0
##$CFRGTYP= 5
##$CHEMSTR= <none>
##$CNST= (0..31)
1 1 145 1 1 1 1 1 1 1 1 1 1 1 1 1 1 1 1 1 1 1 1 1 1 1 1 1 1 1 1 1 
##$CPDPRG= <>
##$CPDPRG1= <>
##$CPDPRG2= <>
##$CPDPRG3= <>
##$CPDPRG4= <mlev>
##$CPDPRG5= <mlev>
##$CPDPRG6= <mlev>
##$CPDPRG7= <mlev>
##$CPDPRG8= <mlev>
##$CPDPRGB= <>
##$CPDPRGT= <>
##$D= (0..31)
0 1 0 0 0 0 0 0 0 0.06 0 0 0 0 0 0 0.0002 0 0 0 0 0 0 0 0 0 0 0 0 0 0 
0 
##$DATE= 1134566808
##$DBL= (0..7)
120 120 120 120 120 120 120 120 
##$DBP= (0..7)
150 150 150 150 150 150 150 150 
##$DBP07= 0
##$DBPNAM0= <>
##$DBPNAM1= <>
$$ [...]
##$SUBNAM7= <"">
##$SUBNAM8= <"">
##$SUBNAM9= <"">
##$SW= 20.6930455092707
##$SWIBOX= (0..15)
0 0 3 0 0 0 0 0 0 0 0 0 0 0 0 0 
##$SW_h= 5175.983436853
##$TD= 65536
##$TD0= 1
##$TE= 294.16
##$TE2= 300
##$TE3= 300
##$TEG= 300
##$TL= (0..7)
0 120 120 120 120 120 120 120 
##$TP= (0..7)
150 150 150 150 150 150 150 150 
##$TP07= 0
##$TPNAME0= <>
##$TPNAME1= <>
##$TPNAME2= <>
##$TPNAME3= <>
##$TPNAME4= <>
##$TPNAME5= <>
##$TPNAME6= <>
##$TPNAME7= <>
##$TPOAL= (0..7)
0.5 0.5 0.5 0.5 0.5 0.5 0.5 0.5 
##$TPOFFS= (0..7)
0 0 0 0 0 0 0 0 
##$TUNHIN= 0
##$TUNHOUT= 0
##$TUNXOUT= 0
##$USERA1= <user>
##$USERA2= <user>
##$USERA3= <user>
##$USERA4= <user>
##$USERA5= <user>
##$V9= 5
##$VALIST= <valist>
##$VCLIST= <CCCCCCCCCCCCCCC>
##$VD= 0
##$VDLIST= <DDDDDDDDDDDDDDD>
##$VPLIST= <PPPPPPPPPPPPPPP>
##$VTLIST= <TTTTTTTTTTTTTTT>
##$WBST= 1024
##$WBSW= 4
##$XGAIN= (0..3)
0 0 0 0 
##$XL= 0
##$YL= 0
##$YMAX_a= 269303
##$YMIN_a= -248305
##$ZGOPTNS= <>
##$ZL1= 120
##$ZL2= 120
##$ZL3= 120
##$ZL4= 120
##$ABSF1= 16.522
##$ABSF2= -4.171173
##$ABSG= 5
##$ABSL= 3
##$ALPHA= 0
##$AQORDER= 0
##$ASSFAC= 0
##$ASSFACI= 0
##$ASSFACX= 0
##$ASSWID= 0
##$AUNMP= <proc_1d>
##$AZFE= 0.1
##$AZFW= 0.1
##$BCFW= 0
##$BC_mod= 0
##$BYTORDP= 0
##$COROFFS= 0
##$CY= 12.5
##$DATMOD= 1
##$DC= 0
##$DFILT= <>
##$DTYPP= 0
##$F1P= 14.0000005364418
##$F2P= -0.99999901652339
##$FCOR= 0.5
##$FTSIZE= 32768
##$FT_mod= 6
##$GAMMA= 0
##$GB= 0
##$INTBC= 1
##$INTSCL= 1
##$ISEN= 128
##$LB= 0.3
##$LEV0= 0
##$LPBIN= 0
##$MAXI= 10000
##$MC2= 0
##$MEAN= 0
##$ME_mod= 0
##$MI= 0
##$NCOEF= 0
##$NC_proc= -3
##$NLEV= 6
##$NOISF1= 0
##$NOISF2= 0
##$NSP= 0
##$NTH_PI= 0
##$NZP= 0
##$OFFSET= 16.522
##$PC= 1
##$PHC0= 89.78202
##$PHC1= 5.977517
##$PH_mod= 1
##$PKNL= yes
##$PPARMOD= 0
##$PSCAL= 4
##$PSIGN= 0
##$REVERSE= no
##$SF= 250.13
##$SI= 32768
##$SIGF1= 0
##$SIGF2= 0
##$SINO= 400
##$SIOLD= 32768
##$SREGLST= <1H.CDCl3>
##$SSB= 0
##$STSI= 32768
##$STSR= 0
##$SW_p= 5175.98343685301
##$SYMM= 0
##$S_DEV= 0
##$TDeff= 65536
##$TDoff= 0
##$TI= <Analysis number 999999
Compound Code 99
Book Reference 9
Project Code 9>
##$TILT= no
##$TM1= 0
##$TM2= 0
##$TOPLEV= 0
##$USERP1= <user>
##$USERP2= <user>
##$USERP3= <user>
##$USERP4= <user>
##$USERP5= <user>
##$WDW= 1
##$XDIM= 32768
##$YMAX_p= 383827081
##$YMIN_p= -313027
$$ End of Bruker specific parameters
$$ ---------------------------------
##NTUPLES= NMR SPECTRUM
##VAR_NAME=  FREQUENCY,     SPECTRUM/REAL,   SPECTRUM/IMAG
##SYMBOL=    X,             R,               I
##VAR_TYPE=  INDEPENDENT,   DEPENDENT,       DEPENDENT
##VAR_FORM=  AFFN,          ASDF,            ASDF
##VAR_DIM=   32768,         32768,           32768
##UNITS=     HZ,            ARBITRARY UNITS, ARBITRARY UNITS
##FACTOR=    0.157963299565203, 1,           1
##FIRST=     4132.6476996994, 0,             0
##LAST=      -1043.33573715361, 0,           0
##MIN=       -1043.33573715361, -313027,     0
##MAX=       4132.6476996994, 383827081,     0
$$ Real data points
##PAGE= N=1
##DATA TABLE= (X++(R..R)), XYDATA
$$ [...]
21006 -12122 -10574 -63871 -29152 3778 10704 20033 -35467 -22740 -86767 -81013 -37273 9323
20994 9323 30548 31689 -7767 5627 50750 80923 16083 62854 91482 124677 138677 92294
20982 92294 50190 -66075 -105290 -63848 -44090 -22613 -34511 -100758 -72786 -51280 -127709
20971 -127709 -115935 -69146 -44976 -10301 34238 35485 -38189 -52696 10280 8342 16645 6484
20959 6484 4742 -17429 26737 51186 -39596 -71968 -35114 -14949 -638 10368 18546 6218
20947 6218 -52531 -66468 -5594 17329 72570 17917 -4555 32440 31492 69669 136779 175719
20935 175719 160234 150939 156350 134390 28479 -41682 -45985 -13394 26277 11512 73839 76946
20923 76946 -35913 -158299 -101925 -13085 7322 -10866 -47014 -102132 -100750 -66343 -58218 485
20911 485 72013 34888 10893 49917 15650 -3551 45222 72436 95035 115639 95147 66550
20899 66550 40150 -2053 77648 59595 -33062 -18093 62596 42054 -2246 -86059 -61916 -28084
20887 -28084 8353 -81 -23768 -63850 -50361 -25317 25778 -46388 -79761 -58098 -63141 -86961
20875 -86961 -58042 -18848 1586 -35151 -7830 32417 31657 34352 -33942 -56726 -117815 -130221
20863 -130221 -121339 -95387 -108892 -69544 8639 -23444 61982 75684 8605 -14697 35018 17225
20851 17225 -41050 -21638 -20477 5443 24135 57693 48426 82640 161147 194937 186396 173263
20839 173263 117771 11219 -52375 -45619 13471 -35851 -139452 -168131 -91004 -36300 62627
20828 62627 102997 55252 53417 11202 -13094 14010 23908 24039 21589 22388 82029 43729 -5205
20815 -5205 -19516 -6914 21694 28869 34487 102790 84087 40136 20494 7095 21109 -15232
20803 -15232 -26910 -62114 -77348 -122940 -99927 -32298 -32447 -16942 6400 9850 -25654 -64567
20791 -64567 30547 62707 24187 7173 66925 2257 -39905 -26603 -3933 82751 100285 113346
20779 113346 83101 64974 64471 71820 77573 73059 61522 -30195 -34077 -26101 40059 35033 -80658
20766 -80658 -120021 -43861 16569 17889 73215 106324 114064 50945 32348 34065 22203 -8342
20754 -8342 20979 107287 69305 -37510 -43824 -364 24272 52987 73020 47327 -20457 -14606
20742 -14606 14951 69280 33414 39339 83719 56971 37219 28881 64846 6232 -14308 20583
20730 20583 21746 40029 75584 82385 115114 167103 205402 97102 28843 52284 41707 19830
20718 19830 -4481 -22007 28029 70000 112897 135508 147895 117603 115740 162748 138343 103422
20706 103422 89154 7318 -34857 -43527 41057 122744 140665 154134 170546 154723 149561 151671
20694 151671 226974 299748 312295 378437 399072 413128 407859 435271 478404 539667 571614 585926
20682 585926 624348 626731 645856 700733 741263 790447 825355 898994 986758 977668 1027304 1092981
20670 1092981 1160154 1230392 1346381 1482024 1615735 1842624 2183306 2544628 3001130 3639986
20660 3639986 4424696 5634045 7579675 10635250 14496751 17207513 17951688 18063944 18782220
20651 18782220 20611320 22635206 23064677 22007386 21168083 21603850 23262348 24553352
20643 24553352 23834412 22205425 21388626 21827854 22885556 23074553 21341074 18852596 16614018
20634 16614018 14631341 12559203 10627317 9420296 8975251 9308607 10524574 12921151
20626 12921151 16516995 19397771 20147021 20000568 20471294 22010116 24070507 24873238 23827024
20617 23827024 22690213 22696469 23928908 25136414 24634226 22958265 21758144 21752717 22706542
20608 22706542 23189135 21655504 18829946 16119086 13798102 11397853 8967642 6960049
20600 6960049 5588846 4643972 3941954 3442661 3045171 2720773 2534942 2360263 2162405
20591 2162405 2090642 1954702 1873406 1736126 1654687 1523413 1449274 1371543 1213251 1127911
20581 1127911 1066772 1043293 1061124 980557 917784 847800 751240 660905 636432 565898 540782
20570 540782 469555 473715 454057 414029 436625 443314 391751 330608 331835 362372 409517 453360
20558 453360 463433 386146 332079 349606 346746 394196 339663 309087 348831 376911 376437 350056
20546 350056 323532 352181 394860 371361 372322 355868 274791 285365 316695 343060 250978 206388
20534 206388 175143 141536 103693 131879 133960 171829 178338 98004 114339 170039 229286 220015
20522 220015 225236 280762 234014 134234 129922 163561 184971 215230 251205 279366 293799 254793
20510 254793 160800 125029 154997 126192 84607 97510 73655 21238 81932 174443 212434
20499 212434 288833 289143 178569 115918 87443 60048 100048 121425 120262 99979 63592 177990
20487 177990 129116 112979 202582 199781 182413 162511 147618 160942 215878 251191 217413 145646
20475 145646 103823 68695 26471 34557 85349 104230 12973 -9661 30047 36603 24274 36982
20463 36982 47539 99559 117415 28579 18446 73179 65812 104690 89030 -5149 -43924 -5436
20451 -5436 43269 58575 58035 21513 -50373 -60845 2658 -43895 -55823 -40439 -22043 16054
20439 16054 51607 40091 31818 18260 47310 49852 58634 49803 61639 99596 84119 50071
20427 50071 40165 11346 -73053 -90817 -23013 71686 159620 146421 102119 117888 104426 143280
20415 143280 153880 91318 154216 189878 162518 155764 122414 27199 -37812 -1133 -34695 -85885
20403 -85885 -69477 -47078 -11082 -24300 -65723 -74274 -75913 -27058 2030 20702 35577 25508
20391 25508 76858 92283 86584 68884 51812 -63808 -102898 -59654 -26103 35774 58922 34623
20379 34623 61886 161584 134700 31458 -26434 -27395 33417 104994 122002 63285 46546 -2599
20367 -2599 -25247 -20959 2697 75456 54786 53590 1841 16096 -9027 13554 -70 -5310
20355 -5310 30545 68127 69577 -1229 -22104 16264 65667 99994 58650 68079 -3956 -6232
20343 -6232 -19495 4452 -14590 -69319 -100531 -92848 -16561 -6251 -61983 -112516 -91602 -35013
20331 -35013 59812 104893 136512 114998 82455 89371 100993 97645 100781 101817 71749 53605
20319 53605 60125 42656 80080 139179 166229 153614 175397 147661 80467 59819 107736 101999
20307 101999 97595 48118 6262 -40049 -38653 -2274 -11151 -52475 -70573 -41941 9198 38343
20295 38343 -11819 -34111 -31632 11960 73227 107859 68986 100899 95220 73342 45128 22881
20283 22881 89708 93249 37509 -16848 -52196 -37970 9510 35764 74729 154884 85586 46470
20271 46470 1497 18480 -6863 -18805 -1864 -7441 -15093 -25005 -62163 -69157 -20057 -37187
20259 -37187 21404 32311 61502 63472 54913 66823 38030 58241 8098 -15582 8335 -3527
20247 -3527 32455 42171 10152 -41615 14994 93120 39412 5139 -64039 11144 35664 49363
20235 49363 43373 30024 -59049 -93701 -80980 -39271 -10176 16900 -46046 -61996 23153 3340
20223 3340 -23960 59817 107855 15866 -70019 -43211 5107 -32491 -81945 -109246 -138450 -120016
20211 -120016 -54452 30546 95991 110107 100198 101794 43842 11283 -7666 -8371 93060 94741
20199 94741 71484 30654 31191 16557 33037 155242 204672 167263 144427 134740 -5989 -13655
20187 -13655 23420 41439 7292 -21479 -17461 -46001 -56825 -19867 -31810 -72548 -21875 -37707
20175 -37707 -99356 -78211 -83211 -95869 -91827 -94784 -30753 -9715 26277 107432 82949 53281
20163 53281 61520 59234 24282 32745 -16967 -26451 12825 40212 27611 15935 31474 15747
20151 15747 8869 -3747 -75841 -79765 -15256 -44954 -31533 1223 -3270 -23008 5244 38910
20139 38910 49320 47995 40979 3585 498 31716 67452 42846 25191 127726 164976 39983
20127 39983 -47318 24245 107650 210642 248989 270947 260424 285030 259317 234931 216887
20116 216887 206647 248103 246260 251129 287767 387847 412724 423816 440086 442077 450886 496167
20104 496167 541969 562755 540327 590318 673210 725525 781806 825487 956859 1139537 1267267
20093 1267267 1332951 1478543 1722159 2000972 2373792 2845722 3452348 4434603 6020166
20084 6020166 8583705 12777015 17206256 19128700 19375709 19922504 21963582 25672511
20076 25672511 29805026 32797166 33536945 31556102 28861793 26761090 25620792 25478485
20068 25478485 24289769 21148648 17796980 15163507 12752025 10040369 7630581 5985647
20060 5985647 4848222 4083319 3551479 3216858 2971297 2752435 2554069 2435510 2317598
20051 2317598 2237325 2258864 2256715 2225253 2229292 2245741 2266870 2339579 2458256 2543911 2654617
20040 2654617 2876204 3119665 3527766 4102539 4926320 6241972 8505007 12176815 17302515
20031 17302515 21086261 21800615 21778874 23145697 26407844 31151092 35215285 37221687
20023 37221687 36264781 33356309 30463452 28432678 27825213 27514600 24964523 21095542
20015 21095542 17773445 14998766 12188580 9263936 7042210 5581948 4562019 3850332
20007 3850332 3441135 3037054 2697294 2421412 2238251 2061913 1848767 1657511 1477881
19998 1477881 1365470 1336292 1287827 1218337 1150109 1107170 974320 871619 792667 756745 724779
19987 724779 675327 622715 564076 499170 431585 404093 438819 442179 429847 389007 371118 362982
19975 362982 310216 294499 303330 286241 268918 260864 245734 206115 201665 255851 254994 179203
19963 179203 142309 149728 146715 186392 202099 141723 109245 163980 140572 133323 128773 47607
19951 47607 49495 36044 88334 90163 174049 202012 124983 55553 86111 153893 127836 91343
19939 91343 91306 137500 136093 36478 -19034 -13082 -1284 84300 91714 47528 -22696 -7262 388
19926 388 4178 51320 7914 -28088 34807 79644 87762 4257 -54205 -88350 -92246 -15291 9169
19913 9169 10260 52064 125285 155364 52509 -21374 -47310 13009 72801 88397 25285 -17348
19901 -17348 -36629 -16294 40362 102192 145106 205109 213734 144202 98950 73837 87201 24124
19889 24124 13348 89391 119055 141161 129502 144610 140107 103765 101518 65872 59256 112009
19877 112009 204825 193598 161885 118379 87562 22627 50265 131637 144952 109924 88771
19866 88771 132493 163440 179536 157135 156009 68083 55533 62282 68012 54921 54664 48111 54726
19853 54726 35777 -14010 -57689 -73077 -22898 24627 24440 15526 -54881 -66654 -43112 -26609
19841 -26609 -1935 21660 -4701 -89715 -125536 -118357 -126130 -76697 -36923 10665 139 22995
19829 22995 42861 -10671 -46019 -17363 9533 33563 20827 -6964 -56415 -48894 29116 71099
19817 71099 81638 55624 32923 37095 60597 51277 54024 45313 3344 -5535 32267 -17240 -40922
19804 -40922 -11481 24137 5238 -14883 -58558 -32929 -124856 -138611 -65931 21981 -13944 -30652
19792 -30652 -29385 -42035 -24775 15542 98200 91487 92885 87519 9097 -50948 -35573 -9559
19780 -9559 -6236 821 12178 38963 10061 -57142 -75576 -69645 -69364 -28243 -58938 -42431 -18675
19767 -18675 15403 -6903 43009 98084 128404 104468 60663 83362 122706 84889 34974 131122
19755 131122 175715 131965 139299 120428 20002 6198 69850 102769 78696 49355 -22217
19744 -22217 -76515 -125073 -70090 -50940 -28281 -55797 -32163 13143 22843 13223 16832 -21530
19732 -21530 20258 -25480 -53452 -28828 8215 30813 42896 30040 -2695 -54145 32289 86113
19720 86113 108771 75457 55802 65869 52091 8755 -63262 -79029 -110383 -91246 -70906 -42029
19708 -42029 -35158 -79497 -42255 -31143 -46015 -48490 -50644 -15031 -19347 -46707 -13279 39
19696 39 27961 62432 96183 77658 30858 16075 41821 -23997 -59434 -27037 24975 93759
19684 93759 52878 38028 9695 21980 -7184 13281 48116 -7714 -43885 -50520 -83900 -28168
19672 -28168 60391 53961 10338 -55495 -81614 -87868 -49830 -4505 49377 48139 49781 58353 46656
19659 46656 38066 71378 34025 -9835 -9128 -27536 -7558 -25286 -36955 -47359 29302 -839
19647 -839 37626 88395 71450 46316 -22671 -48825 -45354 -51901 -41442 -98305 -137804 -5282
19635 -5282 76433 57317 20160 40703 31449 -1077 -28695 -25786 -11351 -67471 -92291 -20568
19623 -20568 5598 50540 110946 10583 -32905 37656 121216 116403 51640 72623 97392 72198
19611 72198 48482 9629 9876 -6971 35138 20770 2984 14168 4767 -123428 -99544 -92216
19599 -92216 -86309 -57732 -100566 -99655 -70998 -18011 -22391 -73546 -39431 5068 -2989 24602 38248
19586 38248 32962 50498 122759 158134 134149 135518 140903 218687 178954 84394 39431 106912
19574 106912 203636 218768 195947 165282 114616 64738 73620 86807 20487 -15554 -55335 -153110
19562 -153110 -116332 -62968 -30012 2030 68708 85056 107599 127761 95588 99515 123995 119137
19550 119137 78548 99064 174880 208157 248874 272784 285251 222439 155426 138010 174805
19539 174805 232663 211380 171458 66506 41571 53262 -543 -44191 -13537 63335 80101
19528 80101 60983 23814 -6109 -27722 -36010 11073 25301 9317 -2920 -4140 42878 54593
19516 54593 70728 52631 -1212 -45451 -15849 -7880 -23623 -95649 -100825 -60032 -18796 100815
19504 100815 93958 58557 84964 68102 171931 222456 203208 195425 243174 260498 209226 174228
19492 174228 124367 141948 172999 182821 305170 362264 256652 159844 63574 -36660 -18555
19481 -18555 100225 141931 90505 71713 67709 43207 73766 52640 -52858 -107854 -78126
19470 -78126 -55666 -68203 -46259 -15860 -106017 -190997 -99756 -86800 -49888 -4724 21138 29633
19458 29633 -55299 -41760 53673 57834 81108 75701 51031 7307 7908 63656 122176 91142
19446 91142 10699 -49940 1890 59463 80064 60399 61941 49128 91309 94585 22888 -40837
19434 -40837 -43767 -59604 -34189 -15896 13062 40983 -23178 -25669 -31891 -50803 -66722 -86307
19422 -86307 -101304 -27290 -19857 -37947 -3896 42254 126592 115534 90557 66220 9899 4782
19410 4782 -5807 48659 66838 65530 71684 26811 79243 82131 58559 28893 -12089 18563
19398 18563 16644 -13946 -39911 -77514 -90545 -34159 37961 107349 165306 131316 77247 88147
19386 88147 36347 -27786 -5771 19309 -1746 29388 54440 6810 -12367 34521 44697 108760
19374 108760 98731 113819 124193 106607 39956 -24601 -83883 -55524 -58791 -108166 -103453 -113156
19362 -113156 -52031 -36503 -41928 -41012 -44477 8227 52175 25023 -36397 -74486 -63491 -33814
19350 -33814 -30486 -14863 88584 128109 76998 78825 87304 40860 21051 34992 68461 99965
19338 99965 140221 177535 147018 91793 23014 -62168 -51521 -21032 8958 -42074 -15481 39400
19326 39400 15420 19553 -30444 -41172 32521 111676 80635 52587 22265 -26954 -39894 -2070
19314 -2070 -10256 -9813 1144 51024 97330 74166 76120 90776 69254 70033 75892 141305 188062
19301 188062 166226 124197 56787 57122 66749 20351 747 26088 5912 -78875 -71294 -1699
19289 -1699 16775 21341 -2578 39505 42937 27275 49995 44175 20940 4802 -8412 39845
19277 39845 45359 -43964 -23329 83455 55992 -14367 -23204 6848 -1532 2239 11592 11666 -8679
19264 -8679 16311 37129 82826 102022 -16122 -73766 -10456 22139 37480 -36638 -82958 -85414
19252 -85414 -46980 -406 79465 92671 51305 7427 -45989 31582 90949 104989 68122 39600
19240 39600 3268 -52023 -183898 -206243 -85621 -10054 13109 -5533 4742 9792 -32470
19229 -32470 -85204 -94437 -123943 -134001 -61158 -80109 -112593 -69982 607 16907 -39321 768
19217 768 54554 39048 89206 76646 90682 64978 62695 18411 -38630 -92677 -30375 14080
19205 14080 58350 63151 3959 14251 71061 86427 35923 -52018 14675 49594 -52332 -89465
19193 -89465 -99456 -106444 -90167 -15803 -27007 -15592 -38249 9845 25954 -2030 -27731 -23369
19181 -23369 1583 54905 66454 137139 99188 -19427 -36974 -36981 -28115 51124 102130 121078
19169 121078 121563 139171 147552 146878 42043 34666 5288 85344 161237 193196 170015 193419
19157 193419 164247 121778 148007 147448 131562 175748 209649 119128 102051 148008 176266 187439
19145 187439 224875 239672 306256 428525 475043 445844 415298 428936 435135 407529 387812
19134 387812 478391 551110 540684 642169 848416 1040362 1200822 1358558 1533789 1778603
19124 1778603 2142988 2801896 3827306 5353876 8087738 12367809 15842266 15992898 14367469
19115 14367469 12897479 11627066 9917485 8164055 7274032 7435744 8841169 11885142
19107 11885142 15723966 16921976 15374936 13424987 11749660 9815068 7449000 5563276
19099 5563276 4298957 3501258 2962725 2596000 2314673 2215067 2191044 2119289 2035885 1915274
19089 1915274 1814612 1725067 1758451 1863785 1884061 1964164 2108683 2266488 2391664 2581967
19079 2581967 2796570 3086261 3497253 4149360 5068152 6509852 8859500 12770476 18714640
19070 18714640 24211055 27175520 29059593 29049438 26522902 23036163 19909092 17668558
19062 17668558 16290598 16729593 20000197 24769395 27747580 29315195 29663650 27394669
19054 27394669 23383107 19115506 15375958 11933619 8973539 6951725 5582203 4645861
19046 4645861 4026240 3592839 3385414 3144666 2902886 2651002 2405222 2271882 2182078 2109414
19036 2109414 2004646 1916159 1940574 1997828 2082810 2095185 2060185 2070361 2197781 2358815 2727780
19025 2727780 3310769 4098719 5287973 7422200 11198605 15709109 17390231 16048591
19017 16048591 14267716 12835461 11180473 9252298 7908050 7557318 8386397 10727783
19009 10727783 14681259 17400663 16700163 14559327 12667680 10856238 8451474 6056819
19001 6056819 4464848 3480449 2867625 2413396 2090880 1847610 1643738 1462378 1346721
18992 1346721 1134762 1004332 994983 991978 971576 911663 813937 867890 815722 681508 637128
18981 637128 605500 516626 481404 468536 407933 371613 427091 367142 302934 296269 269087 254861
18969 254861 251292 230974 228009 236899 180303 140494 177912 191107 216859 207532 195344 202463
18957 202463 234829 212806 149188 96096 86733 56230 36618 85930 156305 151284 89450 95200
18945 95200 107932 116735 143654 106819 -3417 -62576 -53220 -27100 -12323 4624 -13127 11726
18933 11726 62538 99622 84021 97561 65177 76345 149161 197442 236890 239373 231759 203380
18921 203380 256104 251927 196907 169079 227110 254702 213604 168097 175400 212160 161168 65305
18909 65305 32524 17127 73832 95243 85296 74086 127399 151067 86609 103261 131148 68938
18897 68938 113944 162579 85136 67418 60894 76018 123756 151716 152695 153439 183474 173180 109752
18884 109752 73806 85147 101266 124112 170171 178091 121676 77922 80308 132131 184048 256466
18872 256466 252685 177602 129438 89943 130683 153241 103817 106091 95384 26396 -32193 -952
18860 -952 40058 9778 -70295 -121522 -163785 -97345 -79522 -44886 2213 -10194 10873 68940
18848 68940 98651 83472 103312 173017 127901 22490 4182 37988 127962 209271 161678
18837 161678 52107 57685 50140 96632 106526 62725 84841 134912 102100 16686 -9894 -18735
18825 -18735 -38722 1864 94662 131036 128536 109224 117589 81290 23749 -21750 -21180 6687
18813 6687 53043 76018 42186 72630 52501 -33307 -87996 -35495 30814 45827 54735 46275
18801 46275 -36888 -24104 -21589 -26795 -88503 -90386 -41110 -33732 -39926 -10715 -31325 -47022 -18741
18788 -18741 -41128 -42908 -20058 4495 -5452 -53858 -78663 -2943 -31995 -71657 -57187 46027
18776 46027 30145 5394 -26049 -29024 -52210 -30187 19079 101932 169465 242807 291722 438615
18764 438615 617474 587311 497854 443373 411234 333021 206824 152563 24154 -46725 -47439
18753 -47439 14246 57809 17977 -22562 32931 38550 46142 28312 -31064 -10291 -15806 1231
18741 1231 -8632 64625 78988 14922 -3906 -14100 -20282 -59926 -92616 -83800 -39921 -29406
18729 -29406 64404 80458 52628 50496 -1054 -61231 -1975 45766 53990 50870 35773 40684
18717 40684 104249 54877 5858 55565 12705 17672 -7433 -50627 -24975 56902 99785 111448
18705 111448 24044 -58860 -110356 -81998 4933 54056 88855 23819 49300 50880 81412 83089
18693 83089 53078 -2939 -34646 -21515 -10126 -61711 -89522 -51307 -76357 -79430 -21178 9971
18681 9971 -1443 32960 -6484 31803 101397 59392 -45335 -61106 -100991 -85691 -75067 -10730
18669 -10730 -3043 -32154 -97184 -43046 44240 143330 71848 -607 22395 96107 71497 29984
18657 29984 69060 122483 111836 70005 24686 -17966 -1452 27078 21939 2637 33124 17039
18645 17039 -12516 -63706 -81768 -76556 -50751 -667 5284 -13237 -49640 -53431 3391 6810
18633 6810 -10573 22986 68569 128399 98718 66228 90562 34547 -6485 38523 58370 74919
18621 74919 72264 29863 9433 -24867 -38818 37431 62323 66220 73765 54135 18143 -4687
18609 -4687 -23955 -22732 29396 54842 10082 36416 14064 44347 16893 40505 67999 14580
18597 14580 29468 97403 54589 30588 30302 61343 48554 61682 38796 -1360 17430 54112
18585 54112 77698 57510 25652 19591 51787 70570 31299 4393 25218 46982 32964 -12271
18573 -12271 6205 58992 30099 50375 13783 7259 -3618 -22433 -39846 -26832 919 56406
18561 56406 79941 94530 199555 132466 108877 78674 90740 63427 91622 233928 279133
18550 279133 255044 211001 230169 163114 153650 202226 229348 183656 92622 70639 169078 216289
18538 216289 256811 174489 180547 147738 137007 173596 157412 115968 72950 34769 63606 -341
18526 -341 -32576 38477 74842 15022 -41623 -73975 -19455 -618 -50045 53842 65147 22173
18514 22173 15025 64563 61329 -12610 30773 77448 158550 185528 187511 174356 185560 220906
18502 220906 203335 171350 179893 193699 176127 108188 74868 131529 122648 117555 48482 75250
18490 75250 132531 151890 146102 215069 224309 205740 106899 36164 14588 112868 138100 130376
18478 130376 112718 166964 202408 263694 217656 195088 166924 161412 129343 107671 101951 114914
18466 114914 94292 71027 13235 57982 91364 87760 53131 26482 52495 94819 155713 151303
18454 151303 89710 52876 78063 134054 196361 253038 206727 181443 156412 101472 75601
18443 75601 121374 137906 148022 122153 175530 199401 212266 259840 268203 316160 384571 449045
18431 449045 483051 457855 517362 559966 575594 637941 698038 887727 954583 1017181 1144086
18420 1144086 1295244 1504920 1764047 2092447 2515754 3239330 4268792 5924625 8728042
18411 8728042 13213081 17568093 18649059 17581112 16500603 15836034 15545386 16319879 18991383
18402 18991383 20806132 19432037 16828490 14738281 12676439 10028579 7500234 5876429
18394 5876429 4855143 4154434 3758482 3560690 3490894 3493345 3547708 3640480 3959070 4491913
18384 4491913 5323672 6763365 9116706 12982654 17431006 19265187 18422792 17231768
18376 17231768 16596568 16323658 16691030 18977123 21300675 20608607 18325615 16364226 14697065
18367 14697065 12796274 11173765 10710711 12013665 15256266 18476330 18864639 17522275
18359 17522275 16410908 15730574 15272268 15757448 17815699 19039156 17663463 15405335
18351 15405335 13453406 11556722 9208080 6983460 5500254 4597585 3908682 3535852
18343 3535852 3258920 3127135 3102231 3102394 3151803 3422110 3968914 4709794 5906582 8027985
18333 8027985 11606765 15590540 16872984 15895920 14737010 14120327 13650837 13939780 15888201
18324 15888201 17619852 16716286 14477883 12551837 10736777 8507633 6307150 4619619
18316 4619619 3559521 2841589 2388560 2140256 1934873 1728988 1571666 1475832 1351200
18307 1351200 1159648 1100198 1046162 991954 899325 870631 801502 687632 627004 583037 501573
18296 501573 499533 492761 501619 529263 474424 436166 379898 332235 352803 399277 356146 278318
18284 278318 282752 281742 242330 170183 155454 146743 97034 74294 126873 179847 168811 122330
18272 122330 127681 204255 270489 190676 146566 221114 204283 188213 159903 114340 144433 171969
18260 171969 190272 141335 126331 88587 121681 127135 99510 112920 101674 36259 64905 138133
18248 138133 171207 142979 105793 60478 61734 75368 60383 115635 177793 102692 -15702
18237 -15702 47010 35443 -81285 -63345 36154 25078 -29447 26471 55235 494 88866
18226 88866 131041 123088 178103 180223 166645 141903 116891 64885 72900 63595 82707 69789
18214 69789 83783 70994 76837 121559 146532 141563 121153 107537 117594 84955 152244 206088
18202 206088 192553 108271 84393 62893 90769 96691 88756 78785 98741 132598 126254 137535
18190 137535 114253 57386 97016 96148 83484 57548 74356 97119 61601 97210 91148 123483
18178 123483 140952 114065 84430 51108 62720 100715 64768 64727 122462 167843 147998 88687
18166 88687 24625 55725 115448 130565 120656 130250 154894 140983 175158 214512 231057 248345
18154 248345 185577 169100 215498 199039 197217 217783 248718 274527 271875 356035 351283 376464
18142 376464 443390 440190 499041 473700 400932 347189 403198 439452 528891 624719 688881 718499
18130 718499 791565 865289 926594 1012226 1137414 1204814 1339763 1549182 1738231 1984965
18120 1984965 2271261 2665214 3096933 3581767 4179275 4976715 6064541 7583567 9810496
18111 9810496 13056825 18127672 26857997 43524598 74523337 104446912 104724438 89402653
18103 89402653 76610298 66368646 51597920 34463078 22686439 16067579 12262943
18096 12262943 9895823 8251267 7012002 6126338 5338557 4646525 4113299 3772675 3430352
18087 3430352 3092731 2834402 2581817 2331193 2083194 1901576 1815144 1659822 1585101 1520249
18077 1520249 1397797 1293890 1227206 1237610 1237683 1125161 1001409 904911 777165 741864 791963
18066 791963 743261 717302 698581 609321 506122 427210 447868 477060 426075 373580 371800
18055 371800 313521 311870 347811 361948 376656 341530 301740 251151 224592 191689 149709 124105
18043 124105 215060 271673 190568 201999 218195 193887 162697 208828 201257 190791 188900 182453
18031 182453 152065 143100 186826 180564 145662 151587 173174 159986 127943 251946 277109 231584
18019 231584 261354 257356 204511 170815 122037 110961 64774 91174 71033 -17472 -18221 -38422
18007 -38422 -23632 -6806 -6852 -23417 18220 95468 108436 88263 84035 38689 61036 114540
17995 114540 97353 56705 8156 23102 31838 79063 159650 146667 146243 144580 73314 73383 33542
17982 33542 76609 128672 89046 90196 97727 103550 121857 90679 80813 75828 81914 78418 61808
17969 61808 21192 -845 -28848 -43640 -21920 67850 34321 -58311 -90560 -901 40746 59897
17957 59897 103756 99920 41387 41627 37501 49433 34760 26742 -7692 -12475 32366 46959 104308
17944 104308 137803 158306 145096 146237 77246 53068 -3961 -46771 -51273 -20128 -25851 -37316
17932 -37316 -81529 -95224 -158882 -137487 -134461 -93906 -2704 695 44823 -8284 9508 -8037
17920 -8037 42215 134990 103272 47667 -20496 -58738 -23059 4692 21880 46433 7836 -33410
17908 -33410 -71072 -4555 -19551 26262 70303 98831 111058 131701 150889 209368 170445 39296
17896 39296 13056 24465 26202 80349 149458 139379 99389 37657 72015 123017 125282 87532
17884 87532 133563 158941 132292 54392 91200 106425 115751 112074 100308 58688 75764 70628
17872 70628 -41673 -85673 -29759 -46905 -57504 -76073 -142589 -45332 66236 71833 75176 91647
17860 91647 73291 52849 71659 82829 141587 201328 181528 160505 151300 128468 123014 86782
17848 86782 107069 138967 179389 137001 36819 -31410 -2107 53719 67147 112299 75194
17837 75194 54866 10392 23760 33320 102392 145628 148483 114726 149791 169264 140135 171207
17825 171207 150148 83116 69192 102229 112921 170536 122177 91448 26972 -16467 -20026 51100
17813 51100 105442 51103 96801 190270 174148 62955 47811 108942 141914 117919 117011 110734
17801 110734 121165 83267 89609 71438 84659 23325 42008 85538 29071 -31883 -68627 -30957
17789 -30957 -64705 -29579 -2969 8372 -21485 -13536 43943 63553 -40197 -91030 -104744 -86845
17777 -86845 -55416 -58919 -53932 -58946 -70129 -91160 -83712 -82555 -43287 -44335 -33468 -43008 -63403
17764 -63403 -105661 -77669 -14456 -27625 -52292 -82257 -3943 31138 67475 73974 9227 -70551
17752 -70551 -75846 -74812 -73834 -34490 -4879 -18157 -16311 8979 -22196 -54788 -11952 77959 115081
17739 115081 -6834 -36789 -65455 -75938 9492 23181 48369 48474 6652 35982 72553 84850
17727 84850 20454 6969 28372 -38776 -111888 -132394 -64175 -56440 -59839 -32798 -34643 -60493
17715 -60493 -61086 -16610 12127 3033 -51844 -51013 -60795 -1277 80477 110436 80589 70585 50884
17702 50884 43145 -83697 -182960 -134099 -94118 -21306 -6749 -70498 -60891 -42665 42747 16467
17690 16467 -17943 -110616 -166404 -102204 -19838 39217 35089 -28665 7890 30058 54694 86043
17678 86043 71610 -12448 -116888 -59250 -27986 -1896 55315 25517 33088 -26990 -8134 -34989
17666 -34989 -18565 22985 78613 60036 25574 14800 14931 -736 42500 79076 79326 57512
17654 57512 -30486 -67710 -96258 -84867 -31635 -65226 -48489 -80110 -51133 -47231 -17179 -39386
17642 -39386 -23459 59595 97622 1094 1902 56837 62737 19353 5741 16059 51974 33784
17630 33784 46573 79305 12607 -43005 -81420 -137143 -159803 -116021 -11422 -3675 -5364 3625
17618 3625 -3540 -67777 -51233 -10332 47525 80100 28609 -29221 -58874 -74039 -139778 -76273
17606 -76273 27980 2762 -4111 2060 33336 59537 29546 -8155 -6656 18618 -26995 -57103
17594 -57103 -92327 -164658 -147779 -129648 -34470 29183 52788 39320 -35236 -50122 -22798 90182
17582 90182 99249 67238 15099 -24304 -41004 -9374 9086 -41616 -51369 -46279 -41145 -97419
17570 -97419 -88820 -35799 20523 38645 81509 101042 31939 31065 9123 -27711 -45843 -71630
17558 -71630 -73036 -48747 1939 -62368 -80354 -55426 -47312 -43044 -38404 -19737 -442 2185 -54310
17545 -54310 -108264 -149641 -151676 -101632 -61733 -99193 -89861 -79699 -38076 -51052 -79725 -118979
17533 -118979 -16810 25090 9150 -6535 -44561 -89984 -124889 -96153 -46056 -32419 -64444
17522 -64444 -59136 -62445 -3211 69691 71073 92017 94902 51833 73844 112853 60317 -4230
17510 -4230 -90223 -92671 -86544 -131059 -96468 -41194 -51481 -38893 -1751 3683 33553 -25393
17498 -25393 -39082 -18835 -44444 -78997 -70257 -97221 -79842 2168 61276 86405 111054 27655
17486 27655 58339 49757 -16509 -35156 -11152 -44563 1058 14383 -3887 34669 16680 1155
17474 1155 64033 118878 161773 156372 120469 118145 150855 116002 80632 118362 99573 90390
17462 90390 91949 117073 109243 146304 152348 120779 58828 -45343 -108318 -106981 -35607 -24642
17450 -24642 -43340 -39129 66209 97967 90453 140842 111517 133442 228809 344807 485864
17439 485864 564196 535991 459505 374970 236450 142545 142124 111219 77095 78788 74697 70740
17427 70740 21740 -37532 -52087 -88833 -86871 -54954 -11283 7786 -44913 -47527 -1439 -8998
17415 -8998 -87993 -58698 -6824 -39953 -2696 20774 -29996 5672 35804 22020 -21149 -44511
17403 -44511 -8330 49168 66310 49719 -15763 -29618 16370 46277 93558 137313 128240 45148
17391 45148 -10302 30687 38153 8016 10625 -8275 -25705 1304 48416 -7547 -21898 7670
17379 7670 -44276 -104661 -56200 -42634 -11216 35809 50487 26651 29438 -2835 5780 61322
17367 61322 32822 -15054 -54318 -39166 40059 45887 -28927 -117468 -159746 -67757 -24681 -43000
17355 -43000 -38758 -30496 -57061 -140163 -174422 -158511 -81582 -12718 1399 47676 81891 59793
17343 59793 40273 -11713 12176 21084 -347 -44356 -35941 13238 85971 93856 94428 44320 -47236
17330 -47236 -120345 -102848 -41474 18261 29872 -23606 -5964 6919 34464 -109695 -173005
17319 -173005 -141086 -124570 -43836 15287 70362 110914 52354 -19315 -17897 -24603 -37539 -40925
17307 -40925 -16044 -448 76427 117193 79654 90481 62678 64830 67113 3044 -25658 20159
17295 20159 3587 5053 -104948 -197338 -176911 -68527 -13260 -47418 -53438 -61954 -41170 42634
17283 42634 83651 97768 78197 49811 10598 -28720 -73615 -62544 -20615 25516 69981 26477
17271 26477 41270 15030 29399 -11302 -26243 5630 37926 17224 19027 10568 47748 7696
17259 7696 -37053 -68866 -55777 -71333 -53291 -26823 46011 49041 61676 64336 45482 -4872
17247 -4872 -31143 -83584 -74046 -41797 21641 12751 25891 -24187 -16474 4107 -29951 10869
17235 10869 3651 -39469 -13234 -14622 -97011 -139763 -99373 18390 53707 -29042 -113056 -124266
17223 -124266 -74716 -56689 -70399 -39721 -23953 56267 42575 12338 22402 61030 25087
17212 25087 -28840 -43869 -27711 39068 80206 79389 58023 27285 13443 -11609 -5103 34008
17200 34008 -2498 31458 2589 -34096 -48062 -69772 -50467 -44601 -51166 -105396 -118279 -160696
17188 -160696 -107295 -57745 -116420 -178981 -108983 -51132 -57171 -59250 -89614 -95937 -6603 16054
17176 16054 -25917 -71441 -36985 61203 15417 -50078 -60680 -79242 -75091 -3946 -192 -77182
17164 -77182 -62259 -64839 -79177 -103681 -100932 -50842 -36086 -12844 -25582 -50303 -31348 -79701
17152 -79701 -67529 -59553 1302 65566 25466 51871 86492 95386 90958 45677 35469 18350
17140 18350 5301 21066 77 -5940 3712 7976 -15009 -14521 9417 47221 7204 -42816 -68947
17127 -68947 -21 29971 -35725 -77276 -81531 -42653 -6041 -9556 4510 65785 109244 100242
17115 100242 142543 115835 45064 -20614 -20827 -16597 907 -59938 -64950 20351 774 -5531
17103 -5531 -66962 -121210 -129802 -183509 -188315 -77124 -27454 -56920 -34667 -22396 -14019 46221
17091 46221 40223 -65887 -130054 -26151 -38845 -72935 -87993 -70757 -66756 -54956 -21435 -31168
17079 -31168 -8488 -38473 -72199 -60036 -6007 1174 6440 31611 8940 -54355 -44260 -13717
17067 -13717 13103 25884 9246 -56392 -129526 -83509 -57399 -34936 -12145 11164 1588 -4203
17055 -4203 -81498 -92047 -62815 -50175 -44371 -1692 85610 157936 101908 11382 -60240 -44299
17043 -44299 -45102 -5049 -33585 -86812 -60075 -115246 -142267 -80335 6480 37852 7584 -59984
17031 -59984 -60372 -92236 -77920 -10968 13030 1859 -43765 -56172 -69555 -130863 -63230 -121186
17019 -121186 -173986 -164526 -116314 -121692 -191110 -189689 -150433 -171747 -111040 -114259 -132761 -115138
17007 -115138 -101944 -59749 -17450 -76985 -51319 -33791 9014 34588 44070 48466 24155 -11665
16995 -11665 -8390 -40458 -25870 22178 20502 -45015 -72186 -83886 -100893 -103067 -112835 -138595
16983 -138595 -159251 -113411 -53848 28714 52864 34981 13331 -415 3390 -2263 -7675 -74822
16971 -74822 -65913 -40190 -81616 -47638 14409 48310 121946 148506 75865 18652 30116 64977
16959 64977 107637 63212 -346 -60135 -153209 -120125 -175402 -206503 -165283 -58332 -4192
16948 -4192 -25633 28916 21147 -4837 1126 30270 -12353 -23382 7667 27358 -16114 21757
16936 21757 -15764 -89677 -105283 -137203 -65721 -11797 -17797 -61006 -131836 -141254 -94664 -75526
16924 -75526 -48149 11481 46537 -11539 1556 32909 58817 78669 110247 50305 2205 24647
16912 24647 -4740 26565 -2166 19156 95427 116702 109619 9670 5636 22346 10146 -7743
16900 -7743 -47437 -36366 -75517 -38584 -25612 -29118 -19168 37489 8501 -51364 -17871 -31904
16888 -31904 -63791 -78440 -84541 -48089 -10068 -32771 -23261 -70412 -76026 -66242 -18147 -16135 -44197
16875 -44197 -44457 -20555 13126 16827 -66530 -132456 -58674 -9321 -54400 -47023 -762 -11235
16863 -11235 -86226 -20719 4152 -25887 14888 22586 23726 -2204 -32565 20299 10029 -46079
16851 -46079 -43301 5714 6555 -16300 -92413 -11363 16368 -32488 -123935 -116287 -75962 -64117
16839 -64117 -22802 -51756 -81555 -58471 -56033 -37702 -84130 -95084 -28745 12908 -36852 -90888
16827 -90888 -61363 -48993 -72007 -62597 4055 14771 12854 23117 29037 -3231 -45210 -65513
16815 -65513 -65882 -47050 -112264 -131369 -126001 -58698 -23775 -15039 -53769 -48176 -27557 -55997 -12286
16802 -12286 11636 -977 20194 14478 19275 39407 13634 22955 23778 16248 2262 -73704 -150703
16789 -150703 -62621 27247 107060 70415 38798 -6119 -21569 25973 24763 22140 -7666 -48025
16777 -48025 -57108 -12055 44844 76372 25405 7488 27078 52941 34361 87290 84444 68521
16765 68521 51278 -43565 -66819 -104465 -121833 -53902 -57142 -66691 -53338 -4718 -5453 -22871
16753 -22871 8123 -14405 -44508 -74499 68451 55659 19609 -57574 -61691 -19412 19203 55536
16741 55536 19046 -31810 41088 44295 9868 -48164 -86629 -116496 -60622 -16107 8698 36053
16729 36053 50127 66338 -4116 -50148 -69059 -40491 -16112 14321 50507 51472 51957 11437
16717 11437 -37766 -9740 20677 38950 53021 72087 10720 -12282 72409 79632 49387 36502
16705 36502 44615 68033 -19760 16909 49292 -17071 -9558 -708 -3432 -30363 -90608 -80676 -61415
16692 -61415 -15918 29937 66949 126866 102751 66560 69707 66204 69588 29405 -21576 -89923
16680 -89923 -121251 -52711 -36552 -57 24505 37229 65837 93282 144161 143417 119043 122384
16668 122384 97999 16811 -27620 -43411 -70479 -82738 -55387 -601 7059 -40667 -54956 -2175
16656 -2175 13839 39895 26239 17510 -7508 -40642 4212 64458 58822 343 -29049 -56138
16644 -56138 -63350 -44588 -1812 -40995 -26219 -15096 -41813 -39062 -34971 55648 50170 17704
16632 17704 -14125 10545 -16817 -53429 -86381 -50220 -29305 -11553 -557 17304 33407 11326
16620 11326 47978 63657 9664 4874 40476 60059 21358 2277 40740 77079 61126 87372
16608 87372 5299 -10595 5031 -14370 -61742 -74526 -10339 23561 -3538 -44909 -80665 -110471
16596 -110471 -101048 -71108 -38112 -68803 -89649 -57379 -67679 -25626 -22681 24905 -29500 -84449
16584 -84449 -51743 -99411 -153545 -155411 -71304 -35630 -28122 35892 61353 55021 64600 28584
16572 28584 21855 -13858 -58667 -40105 -24111 -44265 -62285 -29610 18861 -44616 -12747 33389
16560 33389 60973 68969 78267 112499 48936 -9028 -32462 -78835 -78916 20991 80940 56587 35304
16547 35304 35518 96244 56203 23545 45496 32032 14044 42765 59152 15425 -4647 67321
16535 67321 50512 49972 21596 26234 71571 58051 29695 65893 73460 -2971 2969 80829 42300
16522 42300 -61025 -64334 -61582 -25452 33781 84377 18596 -23821 -22143 -39886 20450 164599
16510 164599 197166 102601 2859 6783 -5779 18263 7068 -59616 -29317 57762 54176 43640
16498 43640 64061 28539 2552 -33964 -75497 -19679 41727 64951 55396 5663 -31341 -20092
16486 -20092 -14130 -17467 -20399 20282 20878 -16858 -41313 -59819 -37153 -74269 -35664 -63051 -75534
16473 -75534 -48823 -72175 -23248 -57978 -102851 -200613 -199715 -104904 -32158 -35899 -37738 31847
16461 31847 -2932 42990 6118 -44256 -40440 -55384 -107429 -108325 -117882 -78057 -12492 27894
16449 27894 36035 66594 67488 -21213 -38348 -45757 -9761 -5670 21506 45672 19951 -27832 3797
16436 3797 60298 -4889 -22549 -12433 -106 -56362 -18840 12083 -1930 -27696 -57532 -4636
16424 -4636 33844 43451 16225 -44060 -46107 23531 40104 5925 -54546 -49905 -40517 -44334 -88315
16411 -88315 -101657 -160039 -139992 -93376 -54870 21263 13437 -54852 -52324 -43894 -68472 -46554
16399 -46554 16967 45989 -9945 -17008 52647 144989 148823 33369 -63400 -111001 -9382 24403
16387 24403 -59829 -51909 -8789 12376 -55409 -10762 24879 3668 -37509 -93782 -125308 -145096
16375 -145096 -84152 -1805 -42601 -63622 37912 56487 10180 -54620 -72755 -80738 -49425
16364 -49425 -38309 -29358 -42092 -39480 -41723 -23915 22666 67966 38215 702 -44891 -57079
16352 -57079 -56785 28330 3945 -26171 -20582 -32922 -13503 -2927 -767 17217 40301 69465
16340 69465 45539 10327 17201 30659 16586 -12598 2464 5025 -42834 -3804 -10830 38188
16328 38188 43250 -38263 -25144 24044 8126 -86741 -105499 -89696 -99994 -76725 -52060 -13131
16316 -13131 68744 10946 -5706 -7780 3697 -7276 -14956 -83337 -105510 -91812 -42903 -3484
16304 -3484 51588 79106 128947 17297 -45988 -104831 -65391 -80942 -80034 -50582 -53199 -47859
16292 -47859 -10100 2926 -45974 -22968 -3210 -24392 29688 99223 57146 40805 27155 42083
16280 42083 44664 59419 21951 -71262 -86200 -8122 40850 41822 103375 143546 121161 47310
16268 47310 10551 13078 33523 -27536 -106104 -190121 -166390 -87402 5888 55261 102214 133871
16256 133871 62925 14590 112311 105500 21744 39372 26992 64284 12186 -4522 30526 45854
16244 45854 -7263 -83327 -112422 -196655 -145399 -137082 -121993 -84312 -78346 -81561 -40718 -73432
16232 -73432 -31256 6469 -30860 50471 99883 106323 65599 41938 15615 -28250 -83011 -71705
16220 -71705 -83783 -92052 -92117 -86016 -52862 62579 128796 86245 -10390 -54076 -66314 -75072 -66561
16207 -66561 -24038 -54582 -63840 -20034 -50951 -86066 -81890 -57534 3633 -11169 -45230 -93113
16195 -93113 -85395 -62694 -82540 -41263 -46981 -58872 -76583 -85192 -10325 -18080 -124835 -183336
16183 -183336 -154495 -136713 -114645 -44536 7164 49339 61324 46231 37760 39835 15180 2292
16171 2292 5970 -51445 -142113 -152071 -106043 -38765 -14895 42145 59539 -10742 11830 25603
16159 25603 -620 -32193 -88907 -127666 -66336 -27560 -7147 31166 25868 -26794 -32377 -56190
16147 -56190 -49565 -12194 -14739 -55746 -111577 -139506 -158249 -105684 -97202 -50155 -63485 -33311
16135 -33311 -32051 -824 20868 44978 40946 59140 37561 61976 66314 17366 -118899 -138810
16123 -138810 -131515 -58445 7376 25409 31308 -5430 6927 -34219 -15446 37941 110024 54426
16111 54426 10018 -43470 -125643 -161904 -88040 -101966 -69737 13547 24616 -43499 -87431 -73311
16099 -73311 -58193 -69042 -38357 6063 -2593 -18331 41770 132756 62427 -805 -14193 50323
16087 50323 81537 73786 30939 -3061 42176 52784 43525 18709 26460 64009 57576 24048
16075 24048 10121 -1300 -11780 -5062 16566 61962 70918 44805 -31582 1887 46426 71515
16063 71515 83057 17599 -66077 -19598 20646 21293 16113 7500 -44110 -48022 -24184 50388 -19685
16050 -19685 -43034 30889 40358 24950 48085 81880 84248 58443 16236 -27106 -19158 -26421
16038 -26421 8356 5427 -23751 -85653 -111179 -88552 -84073 -94047 -59851 -71788 -99428 -56983
16026 -56983 -20967 30658 157670 143339 77439 -29390 -108835 -39841 -30680 24573 49112
16015 49112 81555 -35206 -23486 10109 59397 91183 109777 77265 40884 51498 75432
16004 75432 76035 27710 -42799 -68053 -76488 -55781 -4960 26382 17296 48051 -14471 -34504
15992 -34504 1983 5174 8901 20505 42922 -48702 -101124 -98762 -81906 -5198 45631 22267
15980 22267 -4889 16146 -1901 -78631 -104632 -32056 75555 104412 -38114 -42224 9243
15969 9243 -32452 -59888 -63399 -21157 14136 -9918 -50256 3675 24480 37992 26870 14042
15957 14042 37590 26380 21218 -31117 -28297 44983 71783 82915 42173 -5544 34891 23700
15945 23700 38224 -26332 -68960 -57869 7197 -43168 -44689 -33412 12606 55266 29971 17345
15933 17345 6081 55908 76917 59882 97622 51041 -8767 6432 16927 -2894 -68116 -19849
15921 -19849 25290 13891 -26677 -60645 -25723 49013 -6309 -22921 45112 80722 8608 1585
15909 1585 -29387 65527 83957 48970 54257 91993 78038 83527 84371 61351 54221 18250 18469
15896 18469 -3273 -92021 -127181 -142399 -124394 -81601 -71971 -46974 29405 111766 78656 31566
15884 31566 -8471 32324 76293 45451 -45402 -42696 -44777 -85805 -123846 -125680 -69273 -59847
15872 -59847 -74279 -50001 -61297 -62238 -56705 -109878 -108886 -23972 -54429 -58630 -86211 -124869 -79844
15859 -79844 -45318 -79209 -32972 -16279 -71760 -139718 -123822 -71640 -15908 21052 68935 62761
15847 62761 400 -44448 -70939 -105144 -68117 -89598 -107240 12624 65133 55700 33417 42575
15835 42575 32515 45558 64839 81321 100194 6548 -122812 -123681 -116351 -53291 -45012 2152
15823 2152 -5974 -7936 -50031 -64238 -40909 -52177 -64796 -18677 83703 49792 74115 65552
15811 65552 74174 78750 70443 45805 75174 124358 112293 127289 106655 74990 93589 -18046
15799 -18046 -117294 -118060 -123514 -137486 -90155 -42040 -35912 10745 13834 -18874 -61337 -68440 -90533
15786 -90533 -106380 -114818 -86578 -40710 -21940 -75048 -63880 -35774 -47420 -55749 -82622 -31126
15774 -31126 18653 31893 731 6744 11941 42454 115203 104735 75643 82806 16509 -8411
15762 -8411 26216 33985 -11441 -64697 -34388 26042 83169 51784 -16713 -24049 46197 64367
15750 64367 57775 42310 57811 107661 100559 150586 165935 85058 23378 -104914 -52235 25302
15738 25302 -68823 -118285 -117153 -102568 -103284 -84549 -74674 -96012 -89324 -152547 -235970 -232755 -174486
15725 -174486 -147305 -122319 -62790 -48015 -51596 -80283 -116597 -162953 -131859 -19675 -13502 41692
15713 41692 58982 31675 28670 48004 73504 -59235 -53983 -15656 -6157 5048 26712 72563
15701 72563 68515 95320 84624 89255 34454 -20632 -56702 -34941 -14706 -67797 -85272 -69920
15689 -69920 -67492 27345 60073 37696 43103 -43791 -56308 3347 57305 54972 -42162 -39313
15677 -39313 -6867 -65001 -65569 -34104 -108999 -111205 -9106 -5435 16718 46098 32374 49794
15665 49794 81930 61016 29876 54715 32128 -38695 -70619 4632 -2692 -46498 36561 96203
15653 96203 83863 48093 92921 63629 49106 -6320 -26662 -7607 15444 -3387 11623 32925
15641 32925 -3355 -104555 -137114 -100972 -103235 -112143 -55067 -61562 -91777 -75255 -133874 -134487
15629 -134487 -108775 -104468 -124982 -74519 -72121 -11788 43145 44660 36700 44353 51981 7590 -18662
15616 -18662 -7012 9075 -92154 -96012 -38030 -4714 -41465 -70693 -78425 -8216 60772 -547
15604 -547 -96134 -85408 -117713 -65815 -58974 -64550 -69636 -9834 62180 -33763 -44260 12544 58580
15591 58580 74146 119860 42738 16591 21179 -12102 -66437 -69374 14 78534 26442 -65201
15579 -65201 -114652 -57230 14164 8582 40183 33574 -50780 -74732 8980 73990 65878 34320
15567 34320 -10484 -14255 -35286 -20083 58269 11431 40939 91157 100850 75398 42073 86586
15555 86586 82277 37355 51004 25988 7376 10772 16820 -23130 -42637 -53731 -107240 -57623
15543 -57623 -49022 -105100 -67345 -57631 121 46854 -26415 -2912 56061 115367 45158 -15206
15531 -15206 -2105 48630 59112 -8942 4033 42447 66761 54526 78532 95810 15164 24067
15519 24067 55291 4435 -21406 -15478 452 50542 104448 25698 -70105 -56217 47458 53832
15507 53832 31751 65489 91492 74537 35883 696 34250 53768 46001 15089 1970 4980
15495 4980 -12826 -37019 -49299 -10507 -8713 -10656 -41131 -81015 -132458 -87685 -25100 -22907
15483 -22907 8254 80611 32110 -70113 -79440 -53433 6671 43817 93140 159440 90270 15944
15471 15944 22253 31753 9947 -71584 -60533 47864 61318 -20005 -52734 17011 57681 77837
15459 77837 106160 40922 -23527 2182 -5245 22549 46057 -4089 -41430 -99913 -89141 -70684
15447 -70684 -22381 5791 46 -34837 -14472 -2222 19518 55218 42624 58529 88871 79048
15435 79048 48226 -2247 -28794 -93942 -134326 -141923 -109136 -91488 -85533 -38189 -13687 -17212
15423 -17212 23170 4425 36733 27453 40817 38433 42008 29209 7230 25082 34615 -33323
15411 -33323 -84583 -17720 -44892 -121111 -115501 -53478 -36422 -45366 43545 58139 31460 9872
15399 9872 1178 43345 -4481 -45073 -52208 -85570 -88665 25245 13554 -1856 2637 40873
15387 40873 65075 132506 80443 63636 61547 71803 64230 -15836 -57819 -60648 -71588 -24912
15375 -24912 40920 73838 33676 -24874 -868 51593 34502 69417 69910 5123 -80523 -71733
15363 -71733 -77143 -63655 -64579 -23520 19333 -4187 -6233 55426 73891 63472 8015 -27517
15351 -27517 -69228 -60224 -7204 5566 75071 64416 -4792 -69515 -77431 -76897 -103455 -82880
15339 -82880 -47784 -5337 41548 -553 21212 -28441 -80218 -83803 -36083 -307 -12446 -11911
15327 -11911 -10075 19166 18469 84030 50627 31034 75627 1862 -29760 -15308 53824 26916
15315 26916 -8674 18268 47020 18203 72059 146814 91981 20075 -4063 31691 78572 76135
15303 76135 106215 117179 87517 79961 65873 47412 -33799 -75909 -107781 -92859 -27131 1771
15291 1771 6471 -29526 -49853 -41903 -19889 -59940 -50842 15001 22648 30209 -3184 -53255 -81470
15278 -81470 -124050 -127445 -84880 -50155 -82998 -59679 -48828 -20891 44062 -16933 -92127 -6630
15266 -6630 17360 43610 64865 35746 20585 66781 23614 40040 18673 50381 57016 72878
15254 72878 57783 75553 120438 119653 67091 37776 33147 19829 23550 -16139 -37961 -44974 -47323
15241 -47323 5301 21463 8395 37838 27485 32093 30087 -53147 -114028 -91689 -40147 -64883
15229 -64883 -93405 -116415 -58383 -13903 -10639 6858 34889 69236 54281 -2746 -3689 26099
15217 26099 73567 90882 129298 92108 130837 141835 96963 19042 -44434 -88423 -87491 -36185
15205 -36185 27294 2257 -32839 -4068 -69076 -43805 -40181 -28959 44198 38335 -27960 -35917
15193 -35917 -52926 9122 60833 11560 -65523 -49781 -11460 -7505 13834 20790 11547 40045
15181 40045 7333 3586 59146 76285 74709 57525 8846 -14949 -8907 77766 104488 62095
15169 62095 27027 34598 4038 96067 105393 62476 -38517 -114029 -36864 16972 61314 80717
15157 80717 47288 25500 -455 20925 105804 115276 63185 28587 23242 17710 64513 80383
15145 80383 26490 -69276 -110466 -59923 -5719 -43218 -37545 -40540 -136889 -174898 -182560 -195195
15133 -195195 -153850 -67273 -46473 -89717 -107622 -27881 -53683 -96601 -136159 -97249 -14299
15122 -14299 -28610 13281 10221 -14822 -15602 31753 -15550 -129959 -143830 -123556 -90076 -127308
15110 -127308 -85725 2825 50026 30373 32737 27498 -16116 -16493 -38846 -61327 -75409 -91258
15098 -91258 -39850 5011 -5 9683 53161 58512 3598 -4392 -129009 -153112 -68085 -4673
15086 -4673 -63448 -107050 -97888 -99097 -103344 -76851 -48768 -19357 -18829 -1694 -24039 -51476 -47317
15073 -47317 -55009 -44122 -56305 -113448 -79545 -10682 -11710 68929 67513 25362 -41408 -69958
15061 -69958 -45260 -13182 28381 36485 -19191 -11178 60157 99158 14183 -8589 -20706 12308
15049 12308 22490 -4989 26700 80483 79597 71178 78097 57016 24022 -1602 99890 83295
15037 83295 92970 67276 -15622 -41932 -7193 24275 -6915 -61622 -71537 -38253 -2673 10045
15025 10045 50159 5041 -66301 -105856 -109428 -59441 8721 82012 115605 131391 72786 63946
15013 63946 44865 24497 -24799 -26934 20467 105809 133797 139675 63925 30063 40188 22916
15001 22916 6695 21680 -14885 31409 38950 51146 15594 -2795 5472 14069 13229 -15563 60475
14988 60475 51330 -3047 -28926 41838 18095 52565 55805 57205 42028 41787 -3684 -50030 -29474
14975 -29474 -44056 -10841 -31770 7278 30069 45743 37761 -12664 -11250 -6526 -50168 29817
14963 29817 57758 50676 10364 -4963 34842 32512 13653 14946 -6839 -18785 -66651 -84480
14951 -84480 -49611 -18124 -15828 -39908 -22177 15281 65602 -27929 -125464 -31489 45156 12343
14939 12343 1157 24351 1658 -20677 -13823 21304 4543 -25361 11519 7734 16850 23465
14927 23465 18593 28496 -42348 -48698 86745 145485 164994 143109 116037 59424 60916 24942
14915 24942 -14134 -24651 -2021 -41194 -68984 -80783 -37237 -55982 -52801 -64220 -108281 -119235
14903 -119235 -120562 -111608 -26738 41164 18877 68004 35619 -52799 -76071 -33448 37007 43829
14891 43829 25958 -9015 -34673 -15737 -12387 -44980 -63757 -8787 28912 26491 -38548 -17834
14879 -17834 10577 -43788 -68535 -75586 -94496 -59977 2928 556 -8828 -70337 -19879 -19700 -48047
14866 -48047 -95811 -131506 -118726 -31797 19085 45391 95780 124168 -1343 -76482 -50915
14855 -50915 4212 11884 10732 170 -72066 -59885 27718 27437 68459 99997 74204 3728
14843 3728 -5449 31474 33098 64469 2951 -26660 1600 -2173 -3424 15579 40016 147899
14831 147899 168366 122493 75423 72300 79828 62903 65068 39904 34062 9347 9841 -70132 -114823
14818 -114823 -135139 -109723 -80687 -99425 -74657 -19359 84976 141620 93745 48458 -7401
14807 -7401 -11685 33738 21063 5165 32198 -6240 -52633 75345 64060 19941 74856 24220
14795 24220 8911 10553 45549 105847 110898 23679 -17213 -10833 -57779 -44672 20733 -50765
14783 -50765 -70088 -69907 -56941 -61762 -28467 -54571 -59336 -51159 -71305 -65884 -49660 -61955 -70254
14770 -70254 -95093 -79247 8571 2885 -9858 -65972 -100864 -52667 15029 10956 86477 48055
14758 48055 -52260 -49282 -27443 -75688 -121615 -121238 -33421 2264 -64929 -87765 -64113 -35775
14746 -35775 -41446 -9030 -21477 27009 -12321 -40994 -44088 -23351 -9717 8936 -60932 -125470
14734 -125470 -103126 -82590 -68379 -70293 -52891 -35543 -55642 -100947 -122830 -99377 -63155 -1176
14722 -1176 10627 -59647 -67305 -106170 -74456 -55400 -110619 -81346 -83074 -32311 29096 68431
14710 68431 55400 -3285 -10791 -84949 -100324 -78236 -107625 -68030 -45940 -26476 51973 58684
14698 58684 119177 162125 80617 -9933 -21933 -27219 -38388 156 36712 102932 81381 37626
14686 37626 -5604 -14336 8586 55163 22373 -29682 -13484 20516 4710 -8603 38325 36841
14674 36841 38842 69583 84137 91802 65333 -8145 -12563 -4351 35504 52113 53417 92794 117268
14661 117268 97304 75217 36074 19585 -29635 -43024 -23115 -20714 -40402 -53054 -67908 -71859
14649 -71859 -85751 -110896 -133096 -56611 20283 46352 8261 -56666 -123646 -130081 -75488 -33615
14637 -33615 30312 109109 94810 88310 113860 69302 54298 73837 95772 75539 45673 38353
14625 38353 65482 34831 74882 64608 -27548 -64534 -22925 22634 20323 55318 55772 38536
14613 38536 -46303 -78332 -55566 -6908 6838 -4329 -19060 50676 67668 -48172 -50313 -58702
14601 -58702 1563 39219 23631 -10706 -67645 5540 3577 -9730 -419 30776 -20335 -63307
14589 -63307 -36235 -10584 -16735 67291 84050 17856 -38156 -34780 -22957 11196 16653 -2545
14577 -2545 -29506 -8770 92933 56593 37089 7573 20183 42898 -25911 -11505 -3102 -96912
14565 -96912 -111414 -48241 39357 55857 13990 15388 84212 78210 48674 32288 -16208 -53953
14553 -53953 33407 81331 62455 15316 -9576 -13013 12501 16521 -1640 -37091 -74786 -89799
14541 -89799 -124486 -51765 8403 29239 -17251 -8265 -2811 -79243 -92194 -76071 -73577 3275
14529 3275 1633 -9178 57220 25219 -23166 -62674 -11776 -8710 57664 147917 132481 130516
14517 130516 146691 139466 140407 112406 141348 123287 7322 -80406 -102625 -80871 -34607 10409
14505 10409 70931 73300 33237 34946 -19226 -80992 -133515 -223754 -186957 -121038 -30588 2271
14493 2271 11869 46143 16281 -1389 37898 58166 99112 127179 64925 100109 76018 78937
14481 78937 67917 50588 13496 -15418 43978 101316 61562 47106 7407 -25146 -20179 -24298
14469 -24298 -15018 32823 22678 -14785 -7361 9075 -42083 -28689 -1815 -27637 47109 95893
14457 95893 141363 174456 127619 78849 13899 -58954 -121222 -130373 -91752 28618 102548 99414
14445 99414 92121 24979 -43345 -111149 -36227 14223 36408 62908 1146 -3897 -12176 -25417
14433 -25417 -31900 -29588 -21754 71000 96528 135834 127943 142574 93361 -3983 -29277 22941
14421 22941 55219 58515 33688 70198 -9063 -47732 -41510 -50785 -64219 -40212 -3439 9164
14409 9164 22358 -6774 -26675 -20771 26530 74334 5386 -68944 -47760 -61335 -64522 -48797
14397 -48797 -95981 -87797 -19569 -34785 -61769 -55932 -56317 -25246 38904 46336 54081 -8507 -35298
14384 -35298 -31485 -63925 -592 39299 10610 -4572 -2453 -16088 -39584 -73024 -79060 -26583
14372 -26583 -15884 -26884 7937 -4531 -81104 -78570 -17679 25514 -22531 -22139 44053 101927
14360 101927 154183 120304 113904 29499 6491 40890 73718 81168 98062 79361 53442 12272
14348 12272 -4830 -39315 -82922 -134238 -94022 -83535 -87887 -39204 -28767 22776 79847 98631
14336 98631 87261 14652 -59553 -72226 -46943 35108 63869 44123 21297 -18781 -38477 18016
14324 18016 37188 49714 -6885 -36700 -116008 -165005 -176811 -158051 -65525 -24721 41278 71931
14312 71931 79915 43033 -11789 -20407 -28323 -10904 10659 10987 -30094 -49066 -42990 50567 134915
14299 134915 100630 42517 -11351 -39163 -33814 -35349 -76505 -87274 -87603 -42236 -65580 -42345
14287 -42345 28359 -20871 -97442 -133618 -138959 -155313 -146354 -111214 -67383 -48523 -101316 -124196
14275 -124196 -66957 -1732 28468 -24624 -91680 -27523 -55355 -119071 -92917 -75994 -58827
14264 -58827 -46825 -9916 -26057 -16937 2306 12115 -3993 48537 37435 35879 85642 101440
14252 101440 60772 9617 25120 106593 111726 60232 3675 -7315 -66567 -71010 -32774 -3261
14240 -3261 4214 -6800 -13814 12073 -16363 16474 38628 11041 61535 77163 43489 34748
14228 34748 4590 -13026 25455 77514 104920 86166 112557 136753 -4300 -105281 -115083
14217 -115083 -135829 -151823 -160537 -106791 -68922 -30966 -76397 -30135 -39782 -10900 42493 121979
14205 121979 69846 -7023 28923 46527 27571 59082 151491 145116 34612 -71893 -99496
14194 -99496 -44938 -25826 10108 -4340 12404 17073 34118 72873 36431 -9313 -56555 -28030
14182 -28030 88624 210166 181492 109373 49439 -5832 -45939 13474 50898 8462 -41652
14171 -41652 -25516 -51465 -65869 -60663 -33174 -19379 11186 109666 122110 90786 55067 63226
14159 63226 17877 5446 1681 62667 73751 13302 6905 74075 106722 77737 -5247 -42839
14147 -42839 -57124 -55457 -37919 -68082 -51411 -88350 -93583 -71480 -52023 -28379 -31376 -12098
14135 -12098 -8901 -31633 -37439 39399 44517 20436 48258 8057 -20997 -52683 -24049 2815
14123 2815 1788 45292 83867 80250 112141 121146 25920 -12802 -33931 -20207 -40922 19479
14111 19479 46075 42984 100322 36799 10126 -22293 -40568 -73528 -135036 -138845 -90855 -53699
14099 -53699 1911 33961 32799 16409 17242 23338 -21130 -47084 -20977 43715 46487 32247 -37033
14086 -37033 -13809 -23707 -21164 2499 7225 -83945 -121331 -64609 31082 67969 62256 7706
14074 7706 25591 84380 93954 68100 78595 120226 145352 85356 82199 110107 163157 163850 89188
14061 89188 59686 -11274 13581 -20203 -56287 8583 55071 33075 -19586 -69296 -116557 -112573
14049 -112573 -56529 -29667 -51956 -38336 -10718 -86365 -41527 -10429 4120 -8450 49028
14038 49028 43533 7919 -70928 -79320 -5400 8914 24428 60431 102742 110761 96749 104620
14026 104620 56310 18175 54259 97209 89473 14805 -79300 -127812 -143963 -66726 14096 30824
14014 30824 12581 8338 -1879 -13393 -34546 -26417 -7402 18391 34211 79328 104718 42925
14002 42925 -14502 -26365 -59643 -3356 5010 -34057 -30169 -106575 -105088 -71830 781 38675
13990 38675 73435 64741 78343 51344 122935 100327 32614 7098 52100 48280 -6458 -4542
13978 -4542 19893 -10513 -54590 -87278 -21989 51735 80787 88408 87381 67226 9275 13811
13966 13811 6897 -47913 -50932 -70050 1395 75508 90835 96311 69219 71947 94229 140279
13954 140279 149357 116420 100135 51045 33802 15291 14075 -35893 -98865 -87348 -75563 -62695
13942 -62695 3246 -17555 -39962 -43135 -79585 -91480 -94821 -101392 -97859 -68236 -24644 27954
13930 27954 49416 11032 -3199 -36350 -53105 -60286 -101498 -97344 -62874 -20266 652 -17440
13918 -17440 -46084 -21375 8828 81760 99344 36463 9610 46983 58757 93377 101980 35037
13906 35037 -29137 22410 35029 38115 -6449 -38820 -48826 -57123 -105876 -75210 -45639 -83772
13894 -83772 -97244 -54566 -23084 -23632 -9655 -17044 -52166 -65567 -135606 -201970 -87738 -2054
13882 -2054 30916 -15599 -79605 -31296 -14130 -15492 32494 85486 67705 89964 67179 13016
13870 13016 -8519 -20073 -51308 -53659 -23380 -19754 -53103 -18836 42146 34406 70620 -24138
13858 -24138 -107372 -82732 -93941 -80636 -65753 -65215 -14492 -21038 -67455 21923 37192 19943
13846 19943 -12840 -32643 -59270 -37780 22442 39080 21466 -38034 -69019 -110524 -101079 -18381
13834 -18381 5967 -67228 -62049 -17597 -8533 81015 73525 56245 18847 7611 -20375 -29288
13822 -29288 12238 53503 18433 91118 56639 8878 11613 2346 -68127 -81892 -120898 -144656
13810 -144656 -84719 -56338 -6457 57954 11310 25791 82405 103069 118747 61655 -39973
13799 -39973 -14810 32867 52613 35221 -29986 20825 55200 57472 7965 -41072 -103635 -116785
13787 -116785 -70020 -21993 -12051 -26134 -15978 -9272 30467 33722 75341 95972 88076 35432
13775 35432 -1615 14231 -11139 -18333 -48218 -25569 -112920 -135910 -39227 26241 -41248 -44634
13763 -44634 -31106 -7962 -26647 -48628 210 46226 14112 -72445 -91173 -13154 -88726 -82119
13751 -82119 -87260 -51856 83341 128964 83801 64872 74534 86514 36590 18580 33924 26595
13739 26595 -51005 -65161 -89333 -39876 8963 44537 71041 60935 77444 18062 -2275 23911
13727 23911 53186 43575 2508 12633 -7261 -8568 -6720 9404 11000 36093 -18490 732
13715 732 19704 26992 15055 46970 56928 75826 -16179 -6544 -49922 -52195 -21211 -48173 -27257
13702 -27257 30548 3234 -65421 -70536 -35008 -3536 1297 50248 36684 -89253 -68133 -14715
13690 -14715 72524 66964 37997 77360 62620 56235 73928 100279 42796 -18778 -61346 -53745
13678 -53745 37702 67530 4247 -6383 -31816 -135201 -116893 -41787 -9644 25486 99315
13667 99315 116053 42846 8425 -82042 -164389 -182863 -113456 -83407 -70935 51425 59461 14635
13655 14635 77259 94296 144908 173807 44213 -87216 -139152 -152876 -105077 -24040 50896
13644 50896 36005 -19915 6347 76730 -9140 -50979 -28358 -18523 -24954 -85467 -69672 205
13632 205 -15540 -38698 -72258 -70646 -82593 -33377 -8706 -39545 -31507 -46369 -98536 -152250
13620 -152250 -97914 -20035 2019 23079 29303 13385 -14848 -40130 8117 30594 27584 0
13608 0 -62815 -84847 -79923 -35965 -41011 25832 11605 -38271 -11153 -54617 -41222 -22643 -5309
13595 -5309 -6544 2121 20638 39200 118045 83595 17849 -26468 -9574 -18094 -39877 -105507
13583 -105507 -163764 -108759 -85661 -67863 -74661 -96469 -48092 734 26405 -14992 -60167 -92842
13571 -92842 -39262 -48704 -28935 17160 41057 245 52622 49742 61125 963 -19597 37321
13559 37321 66998 147059 144999 52355 -9027 -86340 -162464 -189911 -137350 -80183 -100340 -98405
13547 -98405 -116181 -93048 -33365 -21931 -43222 3590 -23148 -4871 67517 91719 57149 -29903
13535 -29903 -71852 -78239 -109646 -62867 -31289 26430 72664 -14732 26039 122262 126402 62953
13523 62953 51939 18601 69757 102691 95933 36270 15271 21575 20155 7173 23762 63636
13511 63636 101825 87065 26388 -7907 -42626 -32630 -32140 -34851 -63131 -114568 -121008 -99011 -82278
13498 -82278 -76281 -79240 -29808 -9346 -45357 -43187 -25194 -23398 -19035 -97805 -146369 -122542 -126854
13485 -126854 -150199 -76089 -17419 1512 -94050 -120778 -132290 -150522 -68136 -18194 30363
13474 30363 2990 -58538 -45992 -12687 45470 70246 16322 18608 53902 45050 -6353 -10718
13462 -10718 -7279 42968 20351 84454 132935 108237 117334 29973 -16932 -24416 -74817 -60706
13450 -60706 -107416 -36249 63614 84816 44807 62834 12483 24661 30604 -65657 -114059 -132398
13438 -132398 -168928 -215041 -215537 -149511 -112378 -51684 -36517 -62871 -27258 48072 95559 49396
13426 49396 45475 83934 56267 -3196 56036 29215 34706 -3517 -61464 -99583 -107207 -81226
13414 -81226 -43644 -10386 60176 -16148 -21704 18358 47770 70508 149297 126992 97482 10712
13402 10712 -81267 -115377 -113210 -88229 -73957 -15046 64909 34953 -26178 -40675 -14036 23126
13390 23126 23357 64162 79612 27973 6400 26508 -27154 -24476 72013 63644 12988 43576
13378 43576 30503 -9873 -32304 67030 164037 160856 137374 6620 -97442 -58977 -37216
13367 -37216 -16396 -31699 -32739 22134 79276 47001 54729 34955 31317 48276 19961 -15199
13355 -15199 -7323 -45415 -24121 13826 -5733 -57530 -102981 -114653 -103998 -74682 -18609 -49010
13343 -49010 -116524 -105958 -11417 -16775 21185 20598 11543 8559 724 -19881 -7848 15380 -2637
13330 -2637 16010 20132 40152 82369 104097 111278 47302 -6399 59571 86259 68844 65180
13318 65180 2540 -19078 3843 30961 -1357 33459 64729 17900 -23887 -64127 -39390 100881
13306 100881 97205 18334 -4054 -64951 -25593 48692 64490 72123 65734 48972 28917 37118
13294 37118 48948 46410 -40170 -87561 -101006 -55513 -1168 5325 50801 -4980 -15460 -19202
13282 -19202 -62491 -62738 -30354 -29816 -33139 -28643 -88729 -119343 -130067 -125418 -72830 -31517 -49290
13269 -49290 -123177 -116129 -55013 -26491 -18822 -86149 -107044 -100821 45889 55186 -17311 -64404
13257 -64404 -57039 -23073 11991 9743 -34038 -36604 47271 60585 1347 -4973 55113 111366
13245 111366 136944 127489 143041 73703 29809 27291 18122 -39728 -98459 -80423 -47230 -25228
13233 -25228 -1247 -32002 -48002 -85448 -54754 49178 153741 125883 73113 -106332 -162016
13222 -162016 -129298 -114754 -42676 -14890 -57941 -73747 -76198 -41586 -133251 -143160 -68741 -33959
13210 -33959 19052 5633 -89900 -111559 -103055 -61320 -19189 5707 -74131 -77042 -39202 -17914
13198 -17914 50875 62257 134110 139406 76813 10943 -13003 3067 44400 16947 22927 -41430
13186 -41430 -32183 -35448 -4614 19457 -32768 -28597 43562 18980 -10453 31837 34106 52484
13174 52484 53343 90971 82338 -729 -104884 -59216 -11531 18684 36732 25480 48036 68768
13162 68768 21449 60103 99344 103589 111673 52030 12145 -21326 -33442 -55836 -74809 -27819
13150 -27819 -49208 -54096 -11518 61911 88125 152528 97854 11528 38897 35979 -20754 -63421
13138 -63421 -62578 -7491 24577 108496 105006 62336 40599 96648 48858 15359 7833 -11878
13126 -11878 -15554 -25717 15550 68594 59568 -38786 -75708 -133420 -159843 -97573 65069 76301
13114 76301 38193 -10744 -64021 -80852 -51072 37308 82491 101764 69952 13360 -65293 -119483
13102 -119483 -135625 -120753 -123266 -115408 -79130 -40013 -14188 -44453 -29143 -90503 -77098 -77397
13090 -77397 -75217 -2953 19220 -16267 -71113 -75434 -17277 -28723 -149399 -201776 -112399 -23910
13078 -23910 -72693 -44080 -28618 -113432 -129955 -76889 -57590 -64806 -67849 -77528 -90723 35212
13066 35212 6322 -49525 -103775 -153425 -107114 -85119 -97715 -73776 62874 166461 163987
13055 163987 99746 141878 148792 144114 63625 36481 62345 -9623 -23098 18206 60660 115217
13043 115217 68770 -39640 -4207 42925 24640 -31332 -65155 -35797 -12300 -48058 -40136
13032 -40136 -88530 -57369 80825 201082 105683 -6452 -65461 -89675 -31460 60966 34086
13021 34086 92143 92735 9955 -52045 -48442 -48671 -59455 -55374 -37921 -58201 -11945 84438 71626
13008 71626 13365 -56806 -24618 43277 27613 -34446 -10453 -4011 -26915 -15512 -23453 -30845
12996 -30845 -1586 -23329 -28874 -63150 -60715 -19325 10686 34315 105777 171213 82856 -16432
12984 -16432 -43350 -50732 -69235 -158172 -152127 -168054 -139402 -121197 -81762 -52686 -372 50868
12972 50868 -15866 -60055 -79266 -60500 -24035 34070 -552 -12589 -32146 -10049 6644 10287
12960 10287 5313 -33450 -32822 32568 23564 -2409 53370 113241 104890 38516 -13535 -13277 -28971
12947 -28971 9525 58607 -681 -13562 23540 54728 11502 697 -98880 -121126 -26507 14202
12935 14202 87688 92050 64926 76193 15664 -84527 -117089 -116146 -126823 -85130 -38107 13981
12923 13981 22988 21664 -7535 4725 71409 83646 18872 -29184 10068 15884 11380 -48795
12911 -48795 -39990 -56031 -50899 -89346 -135953 -105410 -22098 -4020 -32382 -51132 -66186 -36124
12899 -36124 -36196 -23543 23542 -23383 -61411 -50082 -69285 -92520 -109036 -164955 -162565 -107773
12887 -107773 -29006 -53023 -97815 -74847 -34866 -3868 81993 87948 26041 -17083 -8309 34430
12875 34430 4936 -54088 -74986 -81746 -97594 -73150 10392 50934 86438 68031 5410 -21334
12863 -21334 15964 4373 -388 -59775 -51956 -79061 -82728 -19120 19912 58990 44585 2846
12851 2846 111929 53324 -11007 -75847 -39972 14825 -4096 98908 194812 123346 71299
12840 71299 -5297 -85974 -54344 -104693 -106437 -29588 13747 -2457 -31690 -46881 -44224 -52404
12828 -52404 -38459 62762 42087 27728 10544 -50219 -57166 -81909 -40771 -12553 39023 127956
12816 127956 126191 62527 -37722 -74211 -13544 33479 27498 49810 -12816 -71984 -108051 -94374
12804 -94374 -48762 -27973 -79947 -158046 -98876 49691 68122 -9815 -49315 -50209 -74557 -54786
12792 -54786 -7190 16422 39370 81458 33866 -62428 -60907 -11255 -32333 -49895 24725 -7683
12780 -7683 -14595 55872 80080 34550 -16138 38048 100487 3043 -28751 21520 25380 -64021
12768 -64021 -88333 -94095 -38557 -58354 -88408 -47792 4288 21307 -45580 -83905 -52122 -44240
12756 -44240 -60647 -119416 -81306 -117559 -143173 -113941 -46740 -49108 -130194 -105576 -61640 13624
12744 13624 42260 91735 98520 103765 73692 663 -17273 -50509 -129587 -127821 -30298 -5002
12732 -5002 -18205 -42108 -79761 -39851 11633 34924 34591 41095 7342 -3902 23958 72286
12720 72286 14020 -27281 -67973 -75456 -44692 -19690 -2736 -6136 -63902 -90186 -62940 -45976
12708 -45976 -88081 -121618 -85296 -83063 -10434 -11022 -34957 -50551 -55403 -94152 -81108 -133516
12696 -133516 -65964 33653 74979 22145 -115750 -65318 44823 58007 39526 7186 42431
12685 42431 68400 61279 49858 -8528 -56685 11069 33538 -10780 -78285 -65002 -97904 -101155
12673 -101155 -32026 28618 18485 7343 7281 45819 58837 41603 21438 -9600 -28850 -54594
12661 -54594 -71529 -77613 -26890 3135 -8658 -30587 -45819 -36260 3749 -15895 -36541 -20620
12649 -20620 31686 1220 -45883 -4599 20977 53279 53296 -13919 -59224 -22903 -74377 -43844
12637 -43844 -6345 12390 38196 24191 -3464 -6909 -93468 -33458 34310 5215 13113 40751
12625 40751 66657 95567 50263 40857 1846 9224 25670 -34679 13470 -44994 -79398 -77767
12613 -77767 -100658 -8251 61243 101304 25464 57658 47786 75399 106635 73959 72288 79312
12601 79312 67369 -5606 -9560 11630 60901 52385 -38089 -25077 31417 -14919 -34520 -48065
12589 -48065 -49138 -24528 -71949 -64654 -17897 43834 43796 35178 -4240 10115 17621 25371 49879
12576 49879 54006 17001 13931 -39299 -32953 -83327 -58515 -32494 -19492 28515 51280 25757
12564 25757 -29017 -11000 7256 -44518 -41545 -15718 -47749 -35061 9300 88161 107142 114189
12552 114189 103668 -59638 -95804 -37954 -26958 -10512 63993 71177 32398 9725 -35754
12541 -35754 -113692 -117500 -91678 -82070 -84774 -83324 -61908 10269 22719 4439 -1039 -9576 -79884
12528 -79884 -129098 -87915 -61509 -75856 -104367 -67905 -61533 -61660 -63843 -44627 -74000 -56594
12516 -56594 -17046 -58241 -59404 -14078 -4190 -35828 4629 41220 42445 60715 108266 89511
12504 89511 26224 11097 22346 16935 8628 -5857 -30720 -30930 -36567 -12635 40520 47322 -9813
12491 -9813 -41409 -89637 -88654 -80160 -14575 96365 153297 90422 38917 18790 7001 -39449
12479 -39449 -40749 26826 -20594 -52494 -74910 -117342 -110128 -64570 -32990 -43035 -65466 -98949
12467 -98949 -154524 -115481 -69606 -68528 -37968 -4780 -7948 -21582 2805 95739 95579 26837
12455 26837 -40365 -69876 -51265 -56186 14757 51161 54122 23999 -57902 -60968 -84813 -99485
12443 -99485 -103169 -96353 -52702 -13113 -2266 3904 94555 168649 209531 229465 174587 121455
12431 121455 47163 -1831 -56483 -52144 -66990 -40028 -77551 -108635 -104122 -62162 -19791 52735
12419 52735 21289 -73037 -76021 9269 57634 11199 -22944 -26620 -11700 -9752 54461 45841
12407 45841 -28928 23335 61394 16898 -1389 24761 41252 -7411 7292 -3152 -110501
12396 -110501 -131166 -73514 18966 25968 -13896 13869 20616 97522 114452 96607 68209 75001
12384 75001 36787 -26232 -50858 -4870 25593 42823 3105 -102037 -153559 -130483 -63329
12373 -63329 6098 51506 62278 10947 -73721 -77812 2847 79313 134937 127681 105754 42875
12361 42875 42898 23478 -19130 -77690 -111249 -107157 -103920 -132466 -99115 -31717 28918 26889 54548
12348 54548 -28298 -65683 -54522 -52982 -58231 -18656 -40791 -41098 -6920 42292 2155 -60284
12336 -60284 -58998 -17835 1189 21973 44948 97194 94090 59939 29366 -41439 -84725 -67631
12324 -67631 19991 19290 -55233 -30475 -63469 -79834 -31300 -3198 -13014 -1065 -12338 -29878
12312 -29878 17234 87530 91094 71189 15077 -4939 4936 16835 36871 46306 68150 3436
12300 3436 -37330 -90890 -85196 -69072 -112506 -123082 -38580 18899 39992 25919 3266 -39938
12288 -39938 35260 139852 59160 -48537 -127006 -57600 -4295 1883 -19204 9022 37922
12277 37922 89015 85500 9379 -55821 -37929 10698 1886 -46486 -54196 -35258 -16191 -16774 -20223
12264 -20223 77547 73303 -23156 -5256 -58733 -103275 -75338 -40113 -70126 -77698 -53757 -72524
12252 -72524 -85555 -125704 -137190 -85618 -54805 35129 31026 13105 35967 30634 53784 142050
12240 142050 109781 75368 59647 -8901 -22564 -3649 26913 30109 6552 -26604 7532 6419
12228 6419 108535 154404 104462 117847 114797 74228 14466 11622 61468 88301 70465 57266
12216 57266 26828 -22109 -60842 1265 40729 93202 102008 12310 -956 65514 103672 51493
12204 51493 23318 103341 108660 47710 -2594 -29720 -78595 -34202 5855 31018 -7723 -33982
12192 -33982 -28927 -21896 -12824 25107 21978 -12978 12137 -13803 -23008 -90984 -31306 82482
12180 82482 35198 -14264 -82852 -123893 -130126 -133815 -128060 -49130 12862 44985 39249 69088
12168 69088 17766 -65176 -146864 -145589 -72183 -98101 -57559 20858 55534 39058 38937 -29888
12156 -29888 -25673 -77316 -103557 -47930 21010 -3637 -31295 -26065 -81643 -104099 -79153 -99912
12144 -99912 -125016 -81103 -45868 12217 23582 -18053 -55949 -67500 -78786 -84142 -99305 -75930
12132 -75930 -33906 9674 19718 -33526 4766 67514 46259 -41568 -87637 -53093 27849 30593
12120 30593 13805 -32157 -62893 -3845 8406 76641 78439 51485 119125 114046 78678 73991
12108 73991 75622 38389 6434 69764 65917 65369 24488 9077 -39774 -73983 -89380 -55087
12096 -55087 -9200 16440 36228 57398 61620 65156 59809 4908 -4879 -41463 -86442 -55424
12084 -55424 -3987 38137 65412 36372 32843 86991 48914 87056 160898 144530 158075 211705
12072 211705 193972 142189 155112 158175 128881 83596 63272 54289 19442 -25660 -10462 15681
12060 15681 9022 42335 7878 -34880 -50027 -44574 -50706 -71992 -71441 -42273 570 -31831 -99870
12047 -99870 -120326 -132682 -122925 -141191 -69356 18581 91108 84410 41491 84459 97594 -27275
12035 -27275 -15017 5119 -29882 -35562 -76897 -67191 -27404 -88555 -72046 -114486 -11643 76242
12023 76242 -10131 -66258 -17016 -17860 -67543 -70344 -33040 -15385 26944 67798 68579 74538 64160
12010 64160 -18403 -52405 -86385 -101233 -44917 -14219 -123463 -202959 -215192 -120066 -25790
11999 -25790 -22359 -12485 2862 -25109 -29830 -18728 1659 -33788 -28032 30782 155314 157981
11987 157981 93991 1144 38423 109679 70940 8391 -74202 -47427 2925 -54432 -66678
11976 -66678 -34939 -48391 -100500 -63824 439 40329 112078 105180 31196 181 -79549 -120892
11964 -120892 -80306 -97969 -146486 -90311 -143651 -139060 -100384 -75067 -91392 -25962 13544 -17130
11952 -17130 -16057 -9062 20862 12281 9355 12091 54375 40202 47212 28465 38140 31523 59724
11939 59724 6955 -23696 -20171 -40650 -60569 -16103 -13419 69778 103153 77330 20762 -29676
11927 -29676 4960 5173 3530 -15167 -4486 84825 127172 103441 41324 19764 11124 -30873
11915 -30873 -33516 4223 11210 95165 128255 180103 198831 159977 188389 198838 160202 125549
11903 125549 104869 101059 16878 -3919 -2056 13783 59060 61954 33363 64422 71613 -13186
11891 -13186 -5221 27706 45373 49504 18746 -35983 -1937 19593 8314 18889 32874 44551
11879 44551 38292 4379 -336 -17450 -29331 12157 37577 -26357 -69132 -19874 -74003 -101761
11867 -101761 -121170 -73133 18871 22921 26572 -30629 -27622 -39054 -42675 24291 50815 68871
11855 68871 77429 49649 -22537 -57192 -28547 5079 -36529 -26255 -39894 -25968 23186 61931
11843 61931 13600 -63173 -74753 -106699 -109132 -77395 -107970 -40032 77402 138026 81933 -620
11831 -620 -9063 51121 130710 51032 -38083 -36179 15427 33108 2362 -12039 13762 22883 11333
11818 11333 16551 3093 -27109 -71034 -77429 -36120 -37436 -63619 1074 86281 119049 52221
11806 52221 1495 17455 29402 -26967 -8889 7992 -34749 18470 17156 20093 44814 16508
11794 16508 -12149 36427 32568 11455 -41029 -52856 -15984 -93269 -51600 -10578 -51542 -54858
11782 -54858 -58449 -24280 66592 101270 97589 57059 16384 -34690 -77202 -122270 -99423 -58919
11770 -58919 -72593 -115661 -163097 -119511 -31479 85111 73299 35556 58312 104189 114591
11759 114591 56352 -24023 14489 76798 46997 27690 17918 28856 51492 38807 18453 -5829
11747 -5829 32162 70148 56593 50513 37192 28292 36583 -4368 -46680 -68739 -6689 35939
11735 35939 57093 73565 24900 13454 16068 53541 49857 76156 58896 16860 19526 31830
11723 31830 32137 39588 -13748 -17808 21671 130503 163187 142619 36097 -22602 -52206 -24244
11711 -24244 45866 53454 33466 85945 65449 90845 103796 81912 28550 3213 -20803 -34577
11699 -34577 -40961 -26171 61084 48596 -21477 -101638 -56563 3874 62273 69913 29367 -48054
11687 -48054 -6299 46450 30331 61823 80331 117573 82788 105038 133054 109014 88645 88315
11675 88315 103047 108529 159385 113592 48400 14861 16113 -3860 -2745 -38782 71604 106804
11663 106804 56859 -13737 -49485 13944 14229 -35555 -78931 -43052 -80412 -72835 -69483 -31064
11651 -31064 10654 7465 -38811 18508 8280 -23079 -833 52339 83051 66627 -41885 -19182
11639 -19182 5601 14841 -2692 -10191 -49081 -47303 18458 -7852 -117809 -179175 -137838 -86149
11627 -86149 5797 25538 21572 -30812 -41928 -21553 -16457 45429 -14099 -90615 -71500 -59595
11615 -59595 -11993 -31744 -39772 -37574 -35101 -19972 26737 -423 55183 -9948 -63659 -30769
11603 -30769 -22668 -1403 46663 93128 105917 99174 71148 87870 89184 63013 -36916 -104754
11591 -104754 -111064 -47440 -19357 -48614 -54811 -67369 -55616 -2660 -700 -16429 3597 4031
11579 4031 -3249 -2252 -40996 -31926 14166 44411 101532 97511 86251 66463 19836 3166 19719
11566 19719 7824 -28696 -73882 -38208 29362 82337 33354 35950 39237 25883 -32977 -41260
11554 -41260 4700 82913 63078 -46112 -75110 -89866 -50949 -21085 -69273 -95396 -94013 -25324
11542 -25324 92521 94817 -1245 -59323 -10089 51660 143591 106346 22446 21840 30340 26439
11530 26439 -76576 -107480 -27868 -6070 84501 109979 83777 108952 48016 -4304 59849
11519 59849 53413 -3686 2165 22364 23446 -24173 -36934 -31179 46655 52719 14015 26406 25205
11506 25205 -28395 -33028 -18688 10319 17409 25676 -7732 -1481 83980 43137 3553 -12008
11494 -12008 -22397 -4305 -15605 -44228 5285 -5455 -21737 -61649 -99126 -66249 -107791 -143722
11482 -143722 -76106 -12525 -55472 -37500 36261 -34938 -49898 -45400 -41795 -61 -13636 -44736
11470 -44736 13313 83453 84062 50069 64196 132602 126658 64806 68484 94677 113392 150152
11458 150152 194633 235736 237811 276299 358043 428778 603240 864802 1299283 1864942 2115357
11447 2115357 1951746 1647389 1507337 1264017 964184 686907 482918 380662 284980 261748
11437 261748 235222 194356 144494 70441 51156 81722 94248 94007 103482 62387 -36613 -25758
11425 -25758 33549 18353 -10581 -6946 -35015 -3419 1769 -40112 -43644 -90640 -57190 -51598
11413 -51598 -91420 -144568 -112706 -145834 -214617 -177154 -146557 -77328 42421 37819 -33212 -72019
11401 -72019 -84677 -39635 -77765 -50521 -50351 -61660 -131289 -93731 -36607 -23278 37922 59949
11389 59949 34576 39886 72859 70981 47891 1379 18823 26352 31060 -8783 -41903 -72474
11377 -72474 7784 13028 60902 99707 77687 90880 70761 74797 37949 43563 26825 71768
11365 71768 41146 38458 -2380 -51535 12708 -1722 -61883 -57587 -40694 -30279 49426 91891
11353 91891 121371 126470 164373 164060 66518 17310 55447 -26958 -125385 -72300 -36698 5623
11341 5623 27209 16914 71965 142689 70160 51975 30105 82770 117628 100591 71113 120670
11329 120670 50004 -7396 7948 9267 61188 51171 78559 78994 15540 -54377 6070 7955
11317 7955 67092 128127 113192 26413 18751 60405 60776 43442 -28094 -58954 -48652 -13216
11305 -13216 48415 75785 68542 70683 114050 173389 271977 263289 226935 192262 227525 245635
11293 245635 282476 275448 260001 191244 92841 79714 105801 83340 86267 80940 48874 77736
11281 77736 52855 57301 94484 73385 12095 9783 20804 65679 27096 7336 -28506 -12242
11269 -12242 37906 74531 53580 108667 118896 127198 139814 84734 40114 34739 12694 36788
11257 36788 21143 45539 50309 48386 79944 89378 105595 111137 76498 34357 -21797 23058
11245 23058 9287 43691 38711 -1938 -685 32964 76355 121490 122979 56855 83257 95801
11233 95801 83962 119291 137432 127966 95275 58860 22556 21425 12002 -53366 -100679 -79027
11221 -79027 -59936 -68170 -84987 28504 80539 69915 23932 13244 -32411 -92406 -88610 -23870
11209 -23870 73404 100743 50599 95487 182046 167746 77410 4815 -4973 28631 82242 124469
11197 124469 174191 160428 127874 31716 -2470 42832 98260 124216 180385 181683 154570 81486
11185 81486 -47037 -87796 6861 87414 120678 148711 102768 73400 101291 148038 185758
11174 185758 143512 146486 79805 -21251 -41577 -89063 -94263 -73622 -26683 56625 178958
11163 178958 232544 160485 160270 206351 207077 168009 40051 -11010 33913 42596 93426 77546
11151 77546 48475 95737 112530 92330 115363 147303 108981 100186 152792 202334 195355 256551
11139 256551 290386 235812 152116 149521 165849 150050 177854 134773 166000 186724 219808 266125
11127 266125 288613 297692 193851 139545 143749 152973 160132 141483 67227 97421 167670 141375
11115 141375 152378 193411 181212 168317 249142 290128 340136 390523 444443 395382 338520
11104 338520 348982 419455 506594 500622 478578 466225 485275 525783 544030 602499 726189
11093 726189 906287 931696 883353 898740 930013 952041 959810 996394 1002038 1040076 1070550 1166162
11081 1166162 1270603 1391780 1485517 1577387 1621129 1711543 1853918 1968790 1984423 2029260
11071 2029260 2137528 2316989 2488292 2672268 2932017 3236009 3681467 4295467 5088053
11062 5088053 6013391 6821852 7272515 7564596 8024857 8805605 9865470 11361467 13385348
11053 13385348 15474973 17597325 20207106 23696452 28195865 34354403 43267053 56529507
11045 56529507 77509810 112983580 176816917 282155329 377640955 383827081 336837336
11038 336837336 291266999 250859937 197433972 137973504 94458310 68331510 52746884
11031 52746884 42845887 36120116 31436149 27715574 24272298 21336717 18941951 16963434
11023 16963434 15300486 13938060 13027999 12543846 11979322 10974667 9996182 9166242 8386666
11014 8386666 7604081 6852028 6229103 5771307 5336230 4898878 4496967 4166509 3765890
11005 3765890 3456702 3275537 2982361 2818197 2713462 2500239 2309792 2118027 1993419
10996 1993419 1926783 1822677 1764025 1686269 1585184 1476506 1350760 1269061 1309062 1248631
10986 1248631 1171133 1152330 1146304 1111476 1101990 1093036 1029661 994683 950385 870656 804924 831210
10974 831210 833586 796901 805834 828720 841099 832618 828197 794263 756053 749983 768469 793670
10962 793670 766406 663401 604389 581097 591486 562828 526017 548735 439246 348501 306569
10951 306569 373462 428306 434452 454710 394337 341378 363636 420254 466046 463651 468311 420271
10939 420271 401588 335214 297256 307981 345445 328011 244423 214948 296980 311412 305003 321332
10927 321332 340381 326049 339459 307176 258406 231295 281065 253087 330321 375089 405758
10916 405758 452240 427337 514144 608453 635881 552068 480633 394436 308608 207260 214834
10905 214834 226546 154458 120128 75789 85388 132717 96669 138592 151905 141462 155533 159082
10893 159082 180883 222672 214306 161148 161596 145031 72206 74665 149411 267989 331685 277037
10881 277037 280713 197139 133822 142192 138167 137994 126893 15609 -6315 37018 -16560 -4363
10869 -4363 69320 70202 54976 62010 -12373 -789 13612 51949 38721 18869 49951 123850
10857 123850 101601 94415 101325 137078 127991 53187 7458 27311 18886 31435 61496 33958
10845 33958 -26218 -7309 -13547 -3019 67651 65850 90890 135841 164178 321890 435992 468118
10833 468118 495199 462431 380681 324474 227137 212290 229060 165555 87550 101424 129922
10822 129922 36737 -26847 -53007 -70554 -42704 -9111 71188 192184 216929 187937 152287
10811 152287 199510 204396 136624 78504 67871 12876 17618 -717 39387 21926 53086 80663
10799 80663 104158 59147 14481 17568 20030 -22222 -47064 -65317 7596 66931 101733 83381
10787 83381 64178 62883 46407 47839 97470 101184 18428 13883 85489 131561 96351 96169 54948
10774 54948 54430 36149 42867 43773 -2456 10581 72437 17646 -48813 -81821 -46645 -72496 -28064
10761 -28064 36866 55711 40127 103320 140115 124006 61935 37589 75561 115046 40024 -29604
10749 -29604 -25122 28504 53863 40531 27177 1617 19558 19727 -2817 -21644 33676 76471
10737 76471 94535 123601 96084 48775 102078 104135 137659 154006 79671 82753 103570 148651
10725 148651 116991 83352 78966 127244 75389 14285 10205 79384 67499 56641 62812 66800
10713 66800 55385 36015 35798 32277 50857 18387 -48358 -39302 -3342 45586 51465 32674 47470
10700 47470 74502 55835 -37495 -6723 -5493 46341 68731 46033 -9040 -64995 -62271 -4492
10688 -4492 -33406 -18311 -4011 47910 1155 23432 90894 136274 108007 11470 -53749 -75193
10676 -75193 -74518 -8607 87339 92670 51958 -8124 -37108 -22382 3806 -28639 240 50317
10664 50317 53747 28646 6210 11658 7051 29747 48040 45391 44265 52495 126604 94674 79997
10651 79997 58551 -37898 6185 71303 61151 117330 191898 217193 207675 178985 216859 216534
10639 216534 197428 143741 99584 132141 166982 223129 354726 521904 688312 956932 1485058
10628 1485058 2005743 2098024 1819541 1578647 1403862 1131251 825741 591167 434991 332840
10618 332840 235618 190381 190174 179129 158261 180402 159631 148449 100404 106341 90069 19471
10606 19471 48281 64603 54579 124340 122770 103459 74071 18050 -42224 7179 47657 164993
10594 164993 215384 197218 186700 186166 236462 226418 212028 198019 187588 111704 101950 70290
10582 70290 20304 11700 41790 110953 163152 178959 189262 176853 87898 -7886 -76206 -84675
10570 -84675 -65084 -4713 46011 26354 29232 -6987 -8672 -19172 54805 103084 112318 86698
10558 86698 51310 107797 63869 -50643 -25290 31551 27671 -79318 -134890 -110779 -52262
10547 -52262 -48348 -40177 18949 6076 12037 44988 36718 -33104 -102001 -161858 -120869 -82059
10535 -82059 -9028 45081 -813 -8150 -42064 -82803 -85215 -44604 -69564 -26155 14127 70159
10523 70159 40073 -31851 40302 32213 15769 30912 18716 26928 3751 -29560 -44726 31270
10511 31270 61107 39912 -12971 1183 26666 -5699 -46168 -53222 -46914 -22505 -5810 -12605
10499 -12605 -3992 33284 103491 82401 58326 61693 87416 106526 47476 -18916 -46553 -30745
10487 -30745 -21585 -43846 -17246 23042 66970 -10686 -4340 33386 46497 95481 47584 9203
10475 9203 99794 187170 182392 111129 26055 43481 79936 95382 83548 80253 83164 80100 58790
10462 58790 50183 51976 57467 100096 128955 161780 115712 93327 11600 -28893 -54546 -56473
10450 -56473 -24118 -3497 -71747 -20784 14728 32543 35215 46530 2535 -1212 48949 68537
10438 68537 79149 27591 30308 56264 47658 7224 22559 39540 35824 4553 30695 89087
10426 89087 161077 227289 336472 378935 434772 388437 299601 270971 267697 285664 223622 198549
10414 198549 167472 163703 170011 151769 49084 25569 28605 74996 99755 94918 77983 54023
10402 54023 12251 54554 24626 50717 24880 -21754 36021 35797 31617 -10791 -14926 24554
10390 24554 51337 98112 34679 -47694 -27755 -58790 -657 50090 54492 92562 74466 51944
10378 51944 6048 -23377 -62327 -97152 -47278 13166 -33447 -59602 -83312 -73147 -14876 28315
10366 28315 -33637 -84936 -61838 -25510 7483 34785 83508 98080 48954 66977 118372 53302
10354 53302 -55244 -78336 -105511 -55979 -19032 -15196 50258 -6569 -23648 29314 -33520 -19634
10342 -19634 40952 -1160 -50174 -88247 -79945 -88831 -114587 -77631 721 43388 34476 39485
10330 39485 51862 63104 -17469 -5123 13531 10076 84389 58292 25522 27225 -6422 25671
10318 25671 45817 52783 38076 47497 85634 75678 8458 41422 88848 86116 79264 78105 85881
10305 85881 80820 67792 54246 62134 84991 95039 96074 59226 21351 78702 116864 37166
10293 37166 -30167 -71333 -80108 -86786 -81392 -92121 -43662 24475 70527 57928 -5100 -25427
10281 -25427 -8775 19147 -26458 -43058 -48889 -69040 -83603 -62702 -36645 -76823 -66156 -60653
10269 -60653 -50551 -17835 -56176 -11409 19685 69862 39537 -8782 -18 -3099 7743 -32090
10257 -32090 -108345 -118639 -78899 -72846 -86905 -91396 -61547 -52927 -13083 -11159 -22910 24311
10245 24311 -47390 -109539 -87827 -12245 40475 34686 -1858 -2938 -40564 -586 -33013 -4192
10233 -4192 32035 -3391 -64351 -99821 19701 80556 95669 17909 17475 -20049 -30957 -89246
10221 -89246 -90309 -33738 33965 18661 68371 66621 59446 67133 4338 4582 -4449 943 -30136
10208 -30136 -62250 -1035 68466 52039 63425 102023 76787 87819 78884 100634 112429 61631
10196 61631 -5186 -17462 -16786 -18800 -146984 -137873 -55441 -58714 1200 36207 -81181 -121710
10184 -121710 -91675 -77175 -3038 -27348 -35849 -30618 5461 67885 101181 59867 52175 64151
10172 64151 149011 134782 71128 50841 55363 42722 -14599 -16171 48390 75398 56841 82210
10160 82210 128182 113039 130190 98100 -12082 -26033 -59775 -102179 -76223 -31853 -77183
10149 -77183 -78109 -16902 -44 15939 25436 40111 -2309 -66490 -36174 8505 17103 -32943
10137 -32943 58065 111926 48919 58520 66174 52538 -22725 -67125 -60964 2331 -3649 8573
10125 8573 -18602 -26083 25648 -23192 -71098 -100572 -47226 -19748 -4585 24943 28818 18909
10113 18909 7877 -32814 -20234 33465 63037 53900 32831 3113 -40946 -36651 11754 22437
10101 22437 45493 110816 149004 184083 153313 87941 1383 4270 1222 -25487 -6401 29475
10089 29475 35260 5993 -32240 -15171 17806 17757 10212 562 4736 15412 -11408 -42094 19153
10076 19153 19292 -16646 65542 116779 74515 -20547 -55797 -116761 -111093 -126169 -104247 -59237
10064 -59237 -9166 18144 32887 -9052 1759 -23727 -34140 -30922 -10641 21538 -30261 -14857
10052 -14857 77366 32286 23451 24765 11327 -1846 25046 11420 38329 -3717 -17844 47600
10040 47600 111440 53582 -43745 -31182 43480 69745 154256 126946 90304 76551 103309 116340
10028 116340 65019 -8412 -43180 -24198 -6925 46128 98755 130384 45545 13665 40441
10017 40441 63110 55508 17218 -18039 -1785 55377 28041 2971 -100956 -138520 -108764 -72258
10005 -72258 -31334 -21192 -34689 -69328 -1 4374 -12772 -2820 -34905 -34345 -35888 -53168 -32793
9992 -32793 -30232 -100329 -50048 -50158 -97149 -107154 -48300 -45499 -11137 24795 -21809 -82743 -94610
9979 -94610 -78696 -69703 -69117 -57658 -105358 -137094 -65655 -62116 -8945 7379 -30893 -104640 -139079
9966 -139079 -85874 -61526 -92999 -78909 -29420 42689 -30422 -46037 13653 35662 -14708 -5248
9954 -5248 12622 23961 19484 59879 1360 -20966 -15966 23758 57472 42346 -48821 11614
9942 11614 128298 137956 32033 72242 81780 51586 8838 32502 54755 35121 18761 -1147
9930 -1147 -33708 5743 67397 22086 -16786 -5305 66524 58059 36710 71113 61038 67404
9918 67404 104781 38596 -16533 22311 74535 91537 83509 52320 -35756 -85636 -54660 17087
9906 17087 47849 -3894 41244 79650 92596 7772 -33596 -49865 -66350 -28756 -9705 -31283
9894 -31283 1280 11705 -9532 49799 108011 69809 103526 112424 47952 -24266 -100041 -148457
9882 -148457 -74041 -78956 -22308 -4070 -59579 -63953 -23481 -63068 -75653 -29410 61729 51125
9870 51125 56633 66595 53467 28160 -32625 -74138 -82606 -44749 -21007 -17070 -8194 -22531 -27127
9857 -27127 -18530 -5920 -2625 -25945 -22532 -26273 -9632 46574 56885 31934 30854 3737 17263
9844 17263 -48599 -93818 -103711 -37775 -106605 -117988 -22122 60444 78334 64433 100179 86083
9832 86083 89495 109952 73223 58722 98566 117605 127734 116314 66972 22630 -39981 -21895
9820 -21895 -14866 -55727 -1732 72911 77181 67438 146000 158535 124362 80134 28433 13161
9808 13161 -63280 -70477 -4959 -41132 -97025 -49511 6030 20782 52117 85957 74838 64776
9796 64776 100809 56849 31749 3854 -3441 -56707 -32806 -22282 12720 81380 112259 109520
9784 109520 84353 85464 59633 40872 27115 51479 28708 46526 30906 -17122 49735 61972
9772 61972 47692 112855 102696 19176 -59009 -136149 -157954 -151959 -114126 -12309 -2564 -1899
9760 -1899 87589 69267 -14793 -16370 -35773 -2824 37675 -1824 -102547 -117602 -79502 -50193
9748 -50193 43643 114467 73330 96857 92767 117831 97462 70946 7099 -75087 -75580 -79553 -63641
9735 -63641 5677 807 -57689 -96775 -56453 -53849 -63809 13871 20623 49740 -92 17852 -5643
9722 -5643 -39900 -27811 23643 101298 162184 70179 13338 13278 -8994 -48725 -9379 30498 67290
9709 67290 88736 62304 -23899 -4915 28539 -1814 -39103 -41020 -51858 -69825 -66087 636
9697 636 66775 -870 14695 42685 -15609 -63821 -37215 4214 66435 73756 13814 -25252
9685 -25252 27236 25871 6991 55504 93287 107087 102172 -1834 -24646 -32850 -45759 -72407
9673 -72407 -12046 41999 -9125 71354 151756 190334 133255 85628 57785 83561 57690 -6458
9661 -6458 -62988 -145032 -124893 -100535 -115168 -80815 -41812 -7096 -25250 -24882 9178 -10346
9649 -10346 20043 13303 68949 98433 -7067 -82755 -58662 -72960 -98452 -32442 18471 16411
9637 16411 -30218 44404 21371 -10758 -103855 -113364 -116954 -90542 -95565 -31037 -32967 -83008 -138348
9624 -138348 -81055 13766 16346 49801 68384 -46941 -53225 -22195 -20089 12462 -12447 -25628
9612 -25628 -12697 -16732 -35941 34281 117841 59008 -49388 -92493 -86401 9722 -1238 -29313
9600 -29313 29740 125384 93358 100183 113339 95012 97102 120544 68168 70380 84017 44472
9588 44472 50659 74263 110081 100709 80798 64263 101630 29891 -59366 -65426 -20817 23108
9576 23108 -12710 -56754 -77055 -47393 -42635 -71437 -20628 31964 86598 79006 111002 148385
9564 148385 116477 -22140 -41743 28841 106167 -915 -103066 -87865 -119305 -106175 -54791
9553 -54791 -10696 17157 10474 44244 66030 21496 -16543 -62273 -82873 -16405 -20232 -20455 -21613
9540 -21613 -68199 -64762 -27485 37352 96704 102516 86179 68000 9172 -35523 -120696 -147791
9528 -147791 -75941 -21809 -7596 -29680 15050 -20151 -50173 -51822 31685 30517 -16312 6975
9516 6975 51039 56321 31026 31415 36947 28406 -10683 -54585 -48120 -46774 -42166 -4148 -28497 -93546
9502 -93546 -21719 100685 140613 96514 67362 16637 30563 44122 59121 24509 24149 -9765
9490 -9765 -51241 -31155 24993 64832 -19730 -14070 -41892 -67106 -92760 -48248 -17458 60061
9478 60061 -2953 -22682 29605 17267 -10472 34188 58177 -29296 -94396 -69783 -5666 23148
9466 23148 30380 2900 -35367 -9898 1512 -26938 -82755 -76561 -46379 4810 34710 -1891
9454 -1891 45472 94483 148948 213785 209174 178746 119142 17231 -2151 64065 81938 126850
9442 126850 108014 146516 125528 75443 68663 40798 71393 42316 59712 63195 6246 -6168
9430 -6168 21790 43404 -45673 -57755 -542 28690 7004 -37829 -75988 -8660 139 -29280
9418 -29280 -21238 70342 76551 58440 87512 78352 76334 43386 11255 -24621 49458 105617 99838
9405 99838 55304 7740 -33279 -104588 -100928 -31223 -103629 -128058 -66587 6540 -48244 -36479
9393 -36479 10722 66643 111458 80783 45182 39706 2210 38448 74149 28716 18590 28486
9381 28486 45544 -13717 30335 3065 -57972 -67609 -21965 2228 35433 36380 -17159 -73217
9369 -73217 -1473 18802 -47139 -62487 -54874 -28643 46779 24115 24379 25960 -39587 -43058 -13750
9356 -13750 -15879 -24064 -62929 -65476 -18773 8984 -9665 -36352 -36879 -66109 -127991 -108528 -71016
9343 -71016 -8856 24887 86720 45423 82803 73588 82208 84383 122166 140451 138110 73743 42656
9330 42656 53825 92080 107838 45219 36250 64292 14185 -50097 -33593 28339 87617 52596
9318 52596 18150 85394 106695 102973 54450 -11964 -22843 -78555 -61827 -74435 -90308 -103975
9306 -103975 -45858 -5437 15042 41624 69174 94767 170280 113799 109959 161112 234743 210987
9294 210987 177054 194828 188124 150161 170715 70270 415 -62799 11910 130756 167843
9283 167843 124128 115151 118491 84577 51684 56865 163964 128367 138061 166586 198304 208157
9271 208157 186392 90727 30737 97964 238568 198207 135021 120510 112546 56256 55261 91422
9259 91422 68997 4075 39695 66626 -3532 -14830 47261 60155 49164 88418 89057 42632
9247 42632 39570 46668 51585 60449 46980 93341 81105 100024 140614 177790 253878 259756 247263
9234 247263 167221 131046 130955 196297 213067 188662 230852 278017 297064 303984 291732 270512
9222 270512 269640 240860 212159 176608 129215 100944 118512 105471 108006 204878 269485 270636
9210 270636 290808 313814 288939 298765 304583 356964 325232 320053 328233 409316 492524 542121
9198 542121 597185 546983 476071 479128 601598 613072 570041 528546 565154 554807 596004 657842
9186 657842 733360 798349 847815 896578 926903 953936 1001736 1072269 1063199 1131812 1243159 1310512
9174 1310512 1275028 1326270 1363016 1454108 1520645 1601961 1670787 1811910 1995246 2120370 2276194
9163 2276194 2367627 2443517 2695052 3003082 3264543 3529628 3764158 4144057 4639955 5037372
9153 5037372 5302874 5658291 6162231 6700914 7209559 7766165 8371594 8893160 9409928 9967044
9143 9967044 10407486 10711615 10970332 11060738 10942395 10723149 10454236 10081962 9612279 9108957
9133 9108957 8626812 8062358 7544878 6989369 6495342 6036572 5579136 5192058 4817020 4446151
9123 4446151 4070114 3730042 3494117 3237595 3008137 2859921 2700099 2501986 2373191 2242150
9113 2242150 2069933 2008039 1945052 1793023 1675307 1643041 1611000 1528018 1480252 1370673 1234436
9102 1234436 1109639 1049985 992559 946896 898639 917047 875620 812212 800068 868860 820053
9091 820053 741491 704393 725075 671418 608061 576703 513670 434010 416357 426774 423925 461623
9079 461623 469373 496493 446809 390709 339387 281760 265454 305520 319131 357210 310838 216989
9067 216989 241158 262726 213122 191412 201905 201307 208298 188828 247607 289363 279840 209057
9055 209057 175529 223813 276744 340709 292289 218762 198055 208552 221745 191900 171263 211160
9043 211160 128009 72473 99225 87033 43049 74610 98449 69881 51739 23159 52570 122488
9031 122488 86532 41076 78841 81004 140670 139386 184620 209768 188829 102115 66615 74973
9019 74973 132745 125416 126477 189302 194331 97381 -10148 10873 94653 89580 112289 187071
9007 187071 169421 87737 26828 105723 177360 152953 95725 133149 67836 21372 20172 42949
8995 42949 46541 150030 231236 166923 98732 146186 140927 90100 27986 -15762 49364 129403
8983 129403 148824 99940 29069 -21732 -4842 -23012 -19734 -5932 49975 23356 -18372 -55751
8971 -55751 -94098 -83761 5036 -24262 -13967 -15811 -43446 26988 58013 60672 50879 40391
8959 40391 29539 40970 5492 -25292 -38045 -38424 27577 177494 226626 180849 160830 136790
8947 136790 121593 91461 59099 95525 128200 146846 133565 80909 38505 62328 18816 -27781
8935 -27781 -27166 111306 181364 144123 141478 108033 30299 -16674 64143 68191 58994 105187 90505
8922 90505 113075 92530 -12965 -16096 31278 39480 79584 90755 64217 70384 74051 48927
8910 48927 93243 105115 98408 110534 100320 69719 55973 108711 119723 83186 92701 101300
8898 101300 71473 52865 -37866 -122321 -97571 -287 -3806 6245 -15375 -75 -43669 -69243
8886 -69243 -17547 -126 14550 11418 -462 5891 27556 34295 46046 148782 182411 94492
8874 94492 45682 -12148 -31718 -99729 -104993 -45147 -37604 -61107 -14993 44352 81999 -25786
8862 -25786 -58904 -49197 -18938 -16137 7803 10549 2952 -11449 -15560 22887 132020 174505 109389
8849 109389 140026 88783 -12507 -73238 -44808 -54642 -49612 -32699 50112 80719 137479 59250
8837 59250 46929 67728 118629 86892 13300 3559 25414 -33031 -38829 -33100 -84217 -66567
8825 -66567 10076 -11438 -24239 -43430 -34268 -4990 -4122 8539 19790 21047 40708 84078 13097
8812 13097 -69225 -85070 -62642 -19037 -8720 5671 50891 35177 11962 45683 9584 62797
8800 62797 71197 30710 35451 40011 72440 9553 -61423 -76458 -61532 -75298 -20858 9067
8788 9067 -49893 -14733 62972 35044 20933 20232 56478 65592 31308 26541 -14489 -9376 -70960
8775 -70960 -90023 -72823 13573 29828 25177 5805 -76387 -60125 22964 58394 96392 65227
8763 65227 -4743 -40278 -43962 5648 50856 19407 -27115 -6759 2660 75175 100081 37294
8751 37294 33492 18585 -8536 -17639 -33638 -42441 -22588 13645 80199 46327 51346 50737 490
8738 490 19371 83946 57229 36835 1961 52660 61143 70110 10919 9620 12358 -7292 -56711
8725 -56711 18444 70586 46875 6535 -41089 -106631 -104763 -85893 -37245 -11677 -66188 -27173
8713 -27173 13420 5924 13136 54448 13677 30453 19360 -18206 3629 90322 119088 72192
8701 72192 5625 688 -4442 -46465 -64821 56838 41985 -16004 -72693 -59494 -23701 -13197
8689 -13197 2823 15529 -25714 23513 78534 79602 41359 -4295 -38 10149 61111 92789
8677 92789 129672 129254 60485 405 -13047 99346 165402 101193 92012 149427 196507 172833
8665 172833 138631 39346 -1889 28447 72466 34300 -4281 -57807 -53217 -18246 -44430 2999
8653 2999 29483 -18288 -88251 -110883 -63107 21361 -961 -63699 -104398 -97054 49260 96346
8641 96346 119400 126223 78910 12883 15141 54740 284 13177 -7559 -51395 -8980 3925
8629 3925 5086 59066 51769 111066 97955 13586 -9073 9509 -4370 39114 20582 15063 7681
8616 7681 540 -31936 -93868 -55952 31120 20436 -72973 19172 112428 49252 -18521 1175
8604 1175 21347 71302 115926 108704 85642 61691 57735 83887 67050 54291 35918 61759
8592 61759 44166 21479 13026 18625 37124 53318 5765 -63032 -8630 17247 6292 11946
8580 11946 68818 40565 -24166 -13376 23501 33495 10106 9174 5359 14960 2707 50365 105157
8567 105157 130629 48414 -22779 -20465 19359 30172 31340 39131 41036 25244 -10752 -49559
8555 -49559 1225 12546 -49978 -171092 -153854 -124692 -27714 -18055 -19242 1603 -54693 -45238
8543 -45238 -25073 -38717 -19626 29434 32723 71595 70266 87893 108346 86168 105171 121697
8531 121697 101047 158353 202376 129957 107668 22805 -18822 19729 -11808 2908 -23811 -46704
8519 -46704 -387 35589 -19677 -88466 -101043 -58401 1514 8004 -4417 -5598 -14410 3657
8507 3657 -36310 30951 186684 198442 78144 43275 50714 34725 -5429 355 11329 22715
8495 22715 46360 65217 24582 -4771 -27011 20349 12896 11038 -17189 -42994 -1359 2668
8483 2668 14077 8793 -74839 -17741 89184 74917 23450 17092 446 -17079 -38369 -41613
8471 -41613 12441 -19445 -20632 -60166 -71917 2195 49344 22290 -19824 -80978 -51408 -95106
8459 -95106 -140202 -91727 -54450 -56176 21289 -12152 -5287 36918 111924 76843 2045 -5101
8447 -5101 -5197 -28912 -11605 8251 14254 -5173 5744 26849 -6803 -33231 -9944 15171 27097
8434 27097 52891 55509 1849 -80690 -124504 -86093 19258 5555 -75186 -84956 -80934 -75886
8422 -75886 -54021 -43081 -38564 -49738 -101258 -130495 -39791 -32100 -37682 -68835 -46313 10184
8410 10184 6091 38453 88782 84331 103308 106431 54116 -7806 -49888 -70881 -76306 -60747 -56701
8397 -56701 -41405 -77905 -41857 16252 9829 -7014 -18317 14907 -24309 -69605 -69355 -73737 -40078
8384 -40078 -40858 -52991 -8845 65250 105269 141970 148184 76620 59097 37069 21886 18662 35832
8371 35832 16839 -53660 -80891 -43180 -55138 -57072 -71201 -75405 -88056 -105924 -31622 -24262
8359 -24262 -12317 45349 82811 86744 61339 6690 -27905 -31215 8810 24520 16913 -27076
8347 -27076 -39512 -83096 -104543 -64581 -30774 14291 49941 85723 90290 33331 -44053 -54599
8335 -54599 -64430 -52896 15496 34247 -32816 -109869 -106917 -90660 -41676 -14496 -17800 -26070 -40770
8322 -40770 -59720 -10874 39969 -4252 -41619 -66752 -46728 20625 91044 91765 34342 87333
8310 87333 106484 8636 71202 113190 118803 63917 18853 -24428 -74980 -35509 28068 23586
8298 23586 52707 60377 98799 105098 66126 79573 58569 70382 82032 1934 -40991 -4493
8286 -4493 33517 70217 20601 -20748 -48505 -16592 -7906 28005 43047 45274 -41043 -41080 13575
8273 13575 744 -26380 -78500 -116489 -118098 -106084 -93835 -129016 -135959 -74098 -35345 -1682
8261 -1682 8221 -56802 -109066 -128291 -121340 -126520 -83386 -78162 -24490 -16657 -18857 38108 103915
8248 103915 95205 40977 -62536 -102957 -139854 -42732 31563 63873 26706 -15728 -49338 -81207
8236 -81207 -80849 -9182 28128 50884 44698 61043 20815 -13249 -79839 -100858 -89778 -65089
8224 -65089 -102000 -88882 -70697 -14649 -2530 -25803 -865 27762 23759 -66346 -61003 -2557
8212 -2557 11030 40322 -9753 -31682 -61495 -58571 -79373 -58588 11258 24482 22005 -55965
8200 -55965 -25965 9525 78423 106380 30245 -41116 22550 -49735 -7597 39626 59671 44842
8188 44842 -32494 -102216 -99892 -85312 -26102 50215 93061 84357 30127 16326 2832 -46259
8176 -46259 -75655 -74931 -89195 98 88628 111107 102947 52643 103491 108622 66415 36421 38219
8163 38219 107415 95223 24297 72203 62116 90767 102338 139441 99785 54043 257 -4565
8151 -4565 -6382 -29692 -80308 -76758 25220 77840 64392 25457 7077 -3163 -29338 -46553
8139 -46553 -4590 50856 95238 -460 -43734 -29293 -36964 -30572 -38821 -23196 13483 20760 51455
8126 51455 -50826 -124120 -168842 -162029 -92311 -85392 -38807 -15883 -14531 -28466 -38008 -39707 -32764
8113 -32764 -26488 -33042 -94760 -59067 12427 5970 45454 56076 61518 -30541 -94576 -93191 -80541
8100 -80541 -61739 -8203 39159 950 -26445 -9355 -2423 -44532 -70878 -60559 -92467 -72923
8088 -72923 -5656 69333 150109 101533 76597 53373 34380 62128 -38850 -55060 -136109 -167851
8076 -167851 -157868 -148418 -174418 -151019 -104462 -125338 -72413 -34253 37777 51439 66708 36047
8064 36047 1950 10405 25607 7669 28193 34588 -24905 11503 90997 65728 -12425 -17424
8052 -17424 20885 35577 -3031 7775 -736 12915 27696 -2759 -4035 20159 10132 -72387
8040 -72387 -75499 -55205 -75459 -85947 -93718 -24666 -564 -28132 52996 74796 59225 35879
8028 35879 -26258 -34786 20934 -424 -55445 -66757 -81472 -100275 -66221 -60627 -38792 -36695
8016 -36695 -54649 -75521 -27715 53117 129788 143999 86998 96083 184618 161258 118780 120888
8004 120888 42433 -6889 1399 37485 -11149 -2815 14448 -13630 -10807 31819 72576 54879
7992 54879 55511 -63901 -110193 -69736 -24743 45763 31669 -4248 -51787 -24051 -55759 -8337
7980 -8337 31808 83675 131295 166433 156179 155434 123809 82817 32990 -22361 -59638 10109
7968 10109 56814 103995 70124 138159 138334 52556 42106 31106 41621 -6254 57891 108954
7956 108954 136621 90060 67240 47532 43748 76670 74322 91199 126253 85813 66577 18154
7944 18154 -7281 19175 34970 6142 10080 -581 -15644 -30884 -8097 -37219 -79042 -59101
7932 -59101 -27304 -21353 15747 32251 -15204 -37712 6543 55432 57368 76805 75226 83293 75033
7919 75033 29253 12197 55140 61163 65894 125091 149206 28232 -50508 -29721 38831 62395
7907 62395 15040 -17651 -9538 32888 112163 154424 107165 47977 41744 4979 -21078 37571
7895 37571 17576 46392 21453 -28000 -20822 -26358 -80067 -85137 2192 83977 60293 48701
7883 48701 11746 4135 4055 -36172 -81104 -63915 -30306 9041 65614 60455 117724 199669 197070
7870 197070 145283 123190 127206 127714 64623 69283 54138 98275 90143 61254 14746 36455 116480
7857 116480 95664 113536 128329 60986 73019 -8085 -19343 72019 95212 51763 19153 -46139
7845 -46139 -72008 -31970 26800 17556 -45402 -71962 -24127 -17608 -52431 -52297 -57785 -38298 -42997
7832 -42997 -45778 5776 25615 72254 97065 72951 69631 -5229 -42886 -97984 -107311 -77695
7820 -77695 -70562 -27831 14333 27097 49605 67034 102428 68991 35722 61757 47337 4013
7808 4013 -25163 -92481 -57047 -35203 -63635 -52941 -2901 28624 40433 37209 9714 41515
7796 41515 36081 -49364 -67636 -40423 -23323 -5469 -21065 -1130 -30443 -69622 -63084 -48160
7784 -48160 -18233 45799 -41141 11311 85192 104233 62659 82662 160486 116553 53205 -48482
7772 -48482 -12671 41058 -68911 -70772 -827 -8566 -56288 -96697 -82978 -102581 -97669 -65723
7760 -65723 -94203 -144137 -93453 -47993 55283 99993 113994 77456 24780 -1687 -19323 -54851
7748 -54851 -33930 20820 77460 47974 -18379 -9147 16701 22576 3855 -35713 -38750 -8536
7736 -8536 39184 25098 19927 34999 92014 121560 136437 74258 -40836 -33097 27876 -34341
7724 -34341 -39485 12420 23996 55917 111380 138187 99904 45034 8201 44913 61390 119669
7712 119669 86716 126068 72845 -6093 -94556 -59130 -11822 34486 45205 17658 -4607 30114
7700 30114 80205 133280 104467 86315 29855 47709 41256 8059 -20891 11108 10561 -49169
7688 -49169 -56259 -31027 -27531 -66604 -68947 -47415 -74795 -11388 -21080 -30369 -21548 -14182 -11396
7675 -11396 -41817 -10634 53230 27465 26105 59031 66439 78262 95708 10167 -56548 -67146
7663 -67146 -68630 -41930 -125400 -77769 -19058 40981 90435 43330 34502 129337 74220 3657
7651 3657 -59649 -50861 -84861 -71036 -19717 29056 43671 48027 -22065 27215 -38317 -84395
7639 -84395 -50973 -45880 -59613 -68615 -1606 -15264 -49867 -66588 -36578 -52715 -115385 -94373
7627 -94373 -100437 -123854 -73708 16013 -27771 -26363 7095 18830 -6298 -40128 -117971 -94851
7615 -94851 -120521 -165503 -132149 -83046 -78625 -74367 -75249 -40410 34359 39703 49655 23634 22842
7602 22842 -11806 -30563 -14738 -1406 -11757 -15352 15625 -25236 -65415 -116410 -136377 -129680
7590 -129680 -137602 -91011 -52083 -44202 -57563 -42192 -8973 -5324 3438 31249 103309 89208
7578 89208 36091 -8906 -22823 -16638 -32322 -121602 -94191 -68974 -9355 25409 41051 368
7566 368 -17211 -10272 20522 58632 64734 43617 118466 79424 15563 -9319 -39150 -6615 43161
7553 43161 65579 52356 7895 -35289 -16618 -13017 -84925 -110402 -105853 -59956 -64574 -41000
7541 -41000 -19175 20963 33250 -5997 30023 59646 48323 107488 135974 127375 98820 61697
7529 61697 37608 30176 -5473 -54519 -103869 -40690 -1128 28608 60804 24220 8691 -55254
7517 -55254 -61508 22048 27176 -36515 28622 71679 -13654 -71329 -126986 -83386 21690 31083
7505 31083 14553 51579 27023 -8338 26157 31882 31629 67688 92370 70318 8075 -12921
7493 -12921 -13130 -21849 -22909 -53474 -12784 -53591 -52447 -57869 -42921 -69821 -39606 -45130 -12129
7480 -12129 21906 -13316 -7210 -5550 34645 44320 115004 87021 14611 -63497 -123350 -94722
7468 -94722 -89867 -118264 -108892 -58402 -54544 -15769 59927 65340 83906 86384 56020 30689 34643
7455 34643 6272 16576 10672 -40171 -106610 -122056 -80938 -83049 -99425 -101037 13570 14591
7443 14591 43916 121819 25636 -27013 -55115 -49848 28791 39139 43962 32731 53606 76002
7431 76002 74719 32200 47835 -6308 -93407 -52956 -42594 -88309 -22541 42328 -31137 -77302
7419 -77302 -83760 -19742 -20060 -42516 -58920 -106190 -93858 -69132 -57147 -58970 -49676 -51659 4164
7406 4164 90491 65074 8058 31242 140367 132620 29930 -80844 -66889 -70523 -57361 -20730
7394 -20730 3999 -10920 -29121 -44042 -34989 -51538 339 92499 67690 -5370 -58423 -85767
7382 -85767 -78179 -80418 -40765 -2467 -10056 3917 -16933 -20353 16907 26280 -62516 -94541 5048
7369 5048 33369 33453 33375 12100 5591 25089 56955 84003 107538 56345 53858 53912 -78728 -76390
7355 -76390 25768 32665 58273 15715 -9469 -981 24222 35034 12683 -40017 -26709 -42769
7343 -42769 -22485 -81895 -67934 20946 95604 130860 60399 33645 20095 35851 75406 99592
7331 99592 138412 149945 95686 -18358 1106 86323 42914 -20431 35985 124815 128948 78709
7319 78709 -7847 -9258 -45939 -37524 -85364 -83117 -7058 14432 92556 76410 100258 42687
7307 42687 67668 48071 50407 71204 86516 -8244 -59025 -12851 48347 64536 72381 68387
7295 68387 34691 -17161 -60861 5967 21771 19699 32279 -6759 -47538 -63918 -48268 -20581
7283 -20581 24474 16483 62868 25514 9613 33774 -601 -5045 -24688 -35958 -33152 -55268
7271 -55268 -56717 -38163 -48326 -61766 -102892 -91124 -68501 -70558 -98301 -107991 -173906 -179821 -191075
7258 -191075 -231582 -220003 -173435 -98763 -80056 -61202 -37288 -57573 -69780 -34365 6579 -1651
7246 -1651 8517 -70067 -83887 -75623 -120859 -63128 -28727 -16656 -7276 -56642 -53108 -39305 -49054
7233 -49054 -66465 -102330 -108799 -52621 -14998 22167 21329 -48725 -138259 -171115 -160284 -99423
7221 -99423 -126056 -132723 -44302 -25847 -51201 -52618 -48172 5346 -14044 54400 61419 2220 -7181
7208 -7181 22028 100420 120198 116512 94743 57486 62318 86472 97668 113288 87650 90529 126411
7195 126411 122144 72119 62658 21952 -26103 -11482 68056 73107 38511 40334 -487 -49506
7183 -49506 -74862 -66336 -4326 5224 -26950 -72630 -39449 23663 79469 25499 -38623 -98770
7171 -98770 -78011 -128678 -110629 -54210 -86270 -108315 -91640 -75021 -140361 -138345 -29888 47270
7159 47270 34064 -629 -17313 -19284 -36735 -100146 -64675 -16280 68113 57262 46080 17326
7147 17326 -12252 -15860 272 38248 37682 16607 47541 48312 -42526 -38338 -3269 -27942 -112953
7134 -112953 -73137 -64169 -68772 -56971 -48300 17977 23110 19093 30449 11623 -20671 -49973 -58238
7121 -58238 -44937 29741 67339 60258 90877 114234 85129 92075 129545 33370 -55601 -57866
7109 -57866 -50523 -40314 -16396 -2289 -44947 -57838 -52019 -71408 -8182 84728 126749 105573
7097 105573 104678 139184 188220 197094 157989 91406 9056 -20248 -18977 4446 -41764 -59319
7085 -59319 -3306 14236 -27093 -15695 68555 41741 25242 11208 4417 -14271 -31747 -34901
7073 -34901 -47208 -136960 -117019 -110009 -62073 -76364 -22302 32746 88868 105452 45710 22244
7061 22244 -13637 33480 38084 114627 68991 55798 3951 -56383 -16288 5208 57163 55608
7049 55608 -25067 -2854 10917 -13983 10657 4202 -53877 -77664 -47441 -67248 -44202 -65845
7037 -65845 -39036 -39712 -85776 -65537 -22459 -32964 21348 91103 57146 29175 -46238 -63016
7025 -63016 -73302 -22362 -13769 -41854 -73460 -32482 -2469 -19580 41544 108764 82890 57132
7013 57132 92786 109671 113382 112285 69757 106883 111027 72174 -5979 -46464 -42068 -40932 18194
7000 18194 91440 39978 48541 4677 -49838 -79203 -69630 -81203 -95112 -132315 -159301 -83018
6988 -83018 -68273 -54893 -87232 -132183 -132197 -93270 -70128 -6663 7542 34073 57791 51603 74199
6975 74199 26750 -64173 -63273 -9054 -23499 -64666 -40378 -84612 -95369 -76869 -65240 -61258
6963 -61258 -55714 -66810 -91502 -134378 -92874 14502 32240 -18968 -16203 -24883 -8940 41780
6951 41780 72604 105213 122613 40649 -27413 -81198 -93597 -79847 -66368 -105804 -65334 6830
6939 6830 -7640 -1888 37296 22761 -7401 13484 53525 44082 34290 55682 49540 -65968 -65997
6926 -65997 -73021 -76271 -125317 -196454 -186655 -81016 35085 153296 120357 48358 -6645 -46775
6914 -46775 -35508 -26512 -17833 -18315 -12488 -46791 -39830 -2711 -38718 5870 14259 22828 -43909
6901 -43909 -61341 -66234 -55062 -75752 -59880 -86277 -115814 -123995 -78327 -3016 18881 -6797
6889 -6797 567 -90844 -158718 -156767 -176667 -216879 -105939 -28839 -14723 -15575 -23810 -104257 -103932
6876 -103932 -39207 51048 71948 1289 -47405 45728 52785 38481 27109 40436 90823 79953
6864 79953 35000 17164 -16326 -49720 -99836 -34559 438 20396 63028 63765 95309 123695
6852 123695 106395 105063 53298 -16739 -7370 42799 70365 19091 -14608 296 4621 4082 71983
6839 71983 91285 168759 119934 34429 -6006 23759 44903 -85460 -74000 28368 68272
6828 68272 61891 47564 1186 -11116 14736 -8234 72 -8351 -33843 -55200 -98003 -70847
6816 -70847 23271 69803 54113 -28663 -125076 -122478 -83378 -33770 6703 -19765 -76080 -18664
6804 -18664 3572 -20942 -2530 3305 4775 9807 35138 59457 42264 54328 49842 49971 59324
6791 59324 111414 143544 110662 46471 -14550 -63861 -97998 -63309 4633 46096 45028 37431
6779 37431 -1033 4948 28028 -8677 -56663 -65083 -27376 -23708 -59414 -37683 58838 32647
6767 32647 -35291 -65682 -79473 -29850 -16264 -60480 -44155 -77768 -130901 -118143 -46397 18152
6755 18152 -7692 -22884 -36782 -34008 -55151 4363 128241 150066 150698 151013 86574 60264 77107
6742 77107 112376 33312 -81252 -61943 -34290 60181 88359 78707 7355 -88888 -131456 -98081
6730 -98081 -40104 -4693 68929 98106 72578 17561 10534 17296 41004 67761 8538 -47232
6718 -47232 -103584 -127395 -140137 -67373 -62567 -55935 -16821 119732 133812 86359 62115 53539
6706 53539 52350 9479 41932 36955 -25883 -61921 -8616 -66085 -59061 -24100 -5957 22075
6694 22075 -36896 -45798 17064 12140 -86070 -75988 6047 42082 -32965 -64946 -74298 -74576 -29572
6681 -29572 -13326 -9978 21861 25674 -43309 -100141 -82864 -50961 -34063 -641 13587 73858
6669 73858 77609 5805 -51500 -109387 -144645 -98863 -39590 -7198 39922 -20855 -33237 16789
6657 16789 41025 19150 26448 -384 -57360 -92225 -98669 -24493 28781 31982 17245 -3598
6645 -3598 -2043 -16415 -116696 -111360 -81580 -47151 -42347 443 6789 6639 22950 69612 39569
6632 39569 -7319 -67144 -65443 -52377 -31730 11087 9831 49254 96954 97671 54123 31616 20058
6619 20058 1160 30699 40374 70089 -32457 -36587 -17586 -36358 -23483 7508 1884 -43596
6607 -43596 -66036 -4067 16738 64820 121746 88011 30415 -25864 -33743 -21534 9269 67776
6595 67776 30151 4019 -4926 -16308 -66304 -26657 -16666 -1029 61931 27401 -42393 -83745
6583 -83745 -130876 -120152 -54302 -1735 -48491 -35866 -18314 14417 32936 -58471 -119796 -168938
6571 -168938 -78313 49624 54988 -20722 -62976 -93494 -100054 -37194 -22610 -55220 -623 -10887
6559 -10887 -103626 -45745 18387 31328 -31825 -86710 -108005 -60006 -4916 -66349 -115614 -109694
6547 -109694 -112572 -85527 -69370 1325 -43368 -46580 -41467 -89319 -126129 -56903 13884 5904
6535 5904 -31580 -12747 -10246 -10958 -43215 -32939 -40656 -105129 -103423 -153138 -136234 -57357 -28193
6522 -28193 -64807 -43932 -67698 -95379 -59571 -59230 -46307 -104143 -132304 -101063 -68173 -51467
6510 -51467 -15768 -49782 -14664 6285 -2900 44818 68555 3877 58291 59135 62849 60834 26821
6497 26821 70592 95533 93554 24985 7053 10331 5373 -31604 -76110 -110300 -140632 -133499 -43109
6484 -43109 95404 102216 69109 83883 61318 23765 71897 111519 36916 -31759 -43366 1952
6472 1952 14534 5237 11600 -16936 -61455 -92715 -95728 -96661 -96749 -114738 -69342 -53585 -38309 -33479
6458 -33479 10077 36625 4753 31738 80684 25271 29534 48325 49221 33661 -15570 -8718 -33460
6445 -33460 -21476 9755 4264 16730 17351 -57626 -106740 -62992 -799 70147 76616 -2175 41871
6432 41871 40697 -13487 -18399 -5206 -6421 -42348 -30360 9076 85736 80938 59793 30527 -40211
6419 -40211 -77111 -44601 -5687 12751 -8298 -37744 -23218 -40010 -87707 -78173 -121978 -85907
6407 -85907 -65373 -75525 -62601 -2 94608 28525 -17435 -100819 -112165 -30898 46209 55171
6395 55171 97764 46491 -13627 -49416 11478 5791 78942 94645 133334 175746 139958 53579
6383 53579 42354 142849 148379 134468 92045 17272 48527 107866 91898 40892 -66289 -58068
6371 -58068 -52866 -43488 -102126 -187066 -132459 -37936 -70850 -55265 39107 86672 30992 -84989
6359 -84989 -97540 -59373 -29489 -39313 -61947 -62157 -23832 28184 18835 -19033 -61315 -67889 -67263
6346 -67263 -60421 -70754 -59088 -7923 15837 8796 -69789 -62407 -37442 -78452 -95153 -104755 -60839
6333 -60839 -47199 -85659 -109283 -109820 -101272 -66570 -82284 -33763 49842 35551 8454 36500
6321 36500 82401 65786 -2204 -75267 -34516 -7695 84570 58296 -29651 28764 40200 -58034
6309 -58034 -54692 16787 -3062 -87905 -46970 -6838 31096 33585 29333 59866 29535 631
6297 631 -67506 -127659 -101449 -34088 10966 15945 20255 23464 184 3998 6602 39466 70591
6284 70591 69335 94750 110049 140533 94548 63352 44425 31758 -56 -20534 97538 107048
6272 107048 63782 69650 118460 47339 16076 11823 -36176 -30195 8511 -17921 -66227 -19024
6260 -19024 16890 -17612 -53101 -32640 54709 49739 44968 8269 41138 45737 47528 89224 82863
6247 82863 -1429 -48843 -56728 -4937 63396 25905 -40926 -90730 -85620 -51366 8606 38699
6235 38699 18916 30288 26664 -104985 -109917 -10358 402 -13752 -766 -22456 -65615 -60694
6223 -60694 -54652 8864 83810 63517 -20872 -99603 -105111 -98503 -78099 -58937 -96603 -66863
6211 -66863 -20840 15349 -65035 -28689 -32274 -35252 32772 14782 7544 19077 43862 -40881
6199 -40881 -24339 1058 -42843 -118550 -124713 -106376 -82805 -59625 -42219 -6437 -28281 -44982
6187 -44982 -38154 10716 -4060 29672 69091 45123 -2802 -19719 -77096 -93926 -26657 -36520
6175 -36520 -24691 17024 18235 -30702 -60263 -45573 2770 -67804 -46505 70734 165822 139494
6163 139494 99055 43003 41841 665 -6891 14254 11120 30735 -12164 -29449 -37755 -49448
6151 -49448 -23932 -49147 -62410 12337 -12216 61851 190202 164263 100831 -172 -33728
6140 -33728 -64177 -32563 114639 142620 114021 90775 82195 109614 134060 110799 80277 -1924
6128 -1924 -10172 12712 6241 -55935 -37249 363 23148 29339 -8169 -32244 -104991 -140867 -154277
6115 -154277 -173475 -115454 -65312 -52253 -93953 -94553 -67726 -16010 18591 334 -46426 -40706
6103 -40706 -3351 -38451 -42740 -21282 14632 55329 82590 53361 68217 4454 -37224 -12320
6091 -12320 46953 20537 -4017 -58035 -14555 -43900 -17645 12509 40536 -7708 -20910 53519
6079 53519 62700 35583 61225 40837 19269 28147 77609 73158 80367 34162 -37453 -98602 -147147
6066 -147147 -142036 -101576 -34426 -18022 -65831 -35296 -53262 -46455 23204 -11937 -35482 -47587
6054 -47587 -35443 -14142 -4329 40327 54761 41380 64087 84365 123651 144735 85489 51625
6042 51625 34890 -15288 -35669 -79825 -57367 -37905 -79386 -54729 -10837 -24464 10013 13142
6030 13142 75748 88124 3384 16093 54434 95655 89081 25823 -38388 -31881 -39583 -82320
6018 -82320 -123170 -136770 -103225 -135001 -95115 -33346 -50973 -79815 -44797 -42982 -39851 -41391
6006 -41391 -15643 45601 19169 -14334 43831 34663 -65663 -102027 -40577 -47835 -29347 -12601
5994 -12601 -59412 -54161 -69711 -51694 -1491 61584 54617 3299 -63089 -36283 9854 -3664
5982 -3664 -16603 -70866 -106137 -63496 -101898 -122752 -91554 -79928 9414 2246 -86165 -111478
5970 -111478 -97607 -101276 -43734 508 -26035 -27864 -65727 -125072 -65508 2977 -25578 -50354
5958 -50354 -68892 -88109 -88713 -102085 -10642 21380 -12233 -112239 -141845 -75705 -58432 -19184
5946 -19184 27162 33599 49171 11411 -40964 -83214 -106189 -45391 -78505 -92771 -27666 -38864
5934 -38864 -87832 -78954 -25574 -67274 -63312 7201 -6326 -658 -55400 23445 43778 58135
5922 58135 70959 57643 92462 108148 143461 139997 97926 82133 105551 72701 -10072 -19725
5910 -19725 -33978 14511 31454 22157 -22012 -35542 -92818 -104432 -83221 -129416 -125139 -112283
5898 -112283 -132751 -169594 -108239 -24651 45266 112060 101001 89832 27385 -16279 -27347 -68200
5886 -68200 -47081 -2484 -4143 -32804 -69571 -99261 -147099 -83342 -101259 -84562 -61604 -93395
5874 -93395 -3463 18591 -33995 -57252 -46587 -31852 -39703 -37550 -32055 -43930 -45820 4581 36568
5861 36568 53888 13156 29185 121207 120671 121400 172853 107580 102040 132261 135424 115715 71177
5848 71177 7984 -3482 8114 47926 17102 -10957 -86000 -70795 14826 69118 56403 -29675
5836 -29675 -74410 -68402 -28758 -58959 -67695 -2462 38832 68863 54260 77294 62919 38987
5824 38987 30803 17568 -7428 -40787 -92812 -79656 -90416 -124249 -118241 -105360 -45350 -72741
5812 -72741 -177206 -144818 -84698 -29682 -45218 -70359 -30459 -44057 -72411 -79181 -69604 -37316
5800 -37316 -53758 -104768 -112947 -101394 -106098 -93247 -39241 -43411 -76846 -103118 -143190 -98294
5788 -98294 -9612 15337 6803 17210 23208 -8572 -40235 -56802 -57583 -82810 -23165 -1215 -56969
5775 -56969 -157876 -243963 -197395 -115471 -63375 -36868 12270 35174 19772 57798 163302
5764 163302 99066 -24440 -16472 2799 56445 14471 10401 84114 108082 52895 -48854 -21726
5752 -21726 -30499 -92320 -165937 -152467 -156733 -155023 -45683 -48744 -63825 22569 1871 25224
5740 25224 27562 -8579 12096 8901 -30661 -50845 -86207 -87786 44066 123694 23640 -78327
5728 -78327 -103682 -28601 14742 31045 -10298 6495 55693 50088 21978 33568 -7182 -19648
5716 -19648 3162 48727 94664 77111 227 -61340 -26043 61932 25936 -41736 -30741 -25370
5704 -25370 -25694 -19058 -58894 -90070 -22971 16269 56849 53460 -24211 -24017 -38092 -18724 -28847
5691 -28847 -76244 -78023 -90970 -100178 -131107 -134166 -68095 -9427 26538 -57816 -81118 -83428 -131338
5678 -131338 -167226 -107177 -61534 -23289 39414 84065 73602 65085 54130 116863 103791 28292
5666 28292 -13431 5524 -10419 -36961 -66816 -4867 7298 -37813 -75066 -47656 -44477 -15431
5654 -15431 9406 -15083 -2222 5537 11899 51480 90688 96240 112658 83358 83343 116237 43860
5641 43860 23227 69304 64267 55562 -24802 19826 -16352 -61892 -98543 -90558 -96135 -109003 -54009
5628 -54009 -17371 -42718 -2742 6928 51135 32897 10494 -15496 20923 -6977 2797 84361
5616 84361 162391 118589 84086 58182 338 23539 65214 33840 62222 130259 101182 81516
5604 81516 111682 133951 99260 22190 50399 84506 106329 76552 46056 -63154 -126832 -169114
5592 -169114 -149216 -41844 27157 15304 -58610 -341 35866 71878 51019 8948 9560 -34061
5580 -34061 -98709 -22839 122313 172286 116191 105570 121272 92975 -5150 -56060 -34752 -27419
5568 -27419 23937 64897 82749 49691 73444 66642 35199 55194 28603 4712 19829 23069
5556 23069 -33803 -10398 52292 3049 1957 29616 10237 -96124 -115078 -55641 1281 13840
5544 13840 22396 18164 -26330 -25604 -5696 -20356 -19971 -8127 21465 16207 -41416 -32957 48608
5531 48608 60785 56841 -20670 -101625 -59697 11514 -3528 7032 56463 84431 83473 91822 75181
5518 75181 72428 78799 109923 127297 88301 87871 58103 22650 -42064 -36527 52308 76438 100891
5505 100891 16138 -48692 -77521 -32199 32797 81883 82341 76008 -40521 -83542 -60644 7287
5493 7287 13382 10497 28962 25903 -14548 -81540 -80798 -78644 -17511 36207 112037 92798 51060
5480 51060 84199 110677 165737 98890 79237 121002 87136 8661 8644 49568 90111 62823
5468 62823 19999 47940 118763 102527 130813 95838 42165 23377 45225 -11001 3264 89922
5456 89922 147979 104383 73979 45659 19462 27886 61882 68335 33265 85659 105734 149318
5444 149318 111641 13024 -101666 -148259 -103352 -78903 -131213 -99184 -105288 -152628 -149295 -116241
5432 -116241 -33516 -6850 -11883 176 18353 6839 -44575 5813 11569 -15501 -91950 -169998
5420 -169998 -122695 -63629 -8944 52934 78927 51102 -33102 -100641 -36060 -42806 -44886 -17099
5408 -17099 23948 18003 28104 -43034 -70859 901 38586 42271 55585 85941 50375 126242
5396 126242 153962 136105 49023 47687 28552 43760 35766 46705 11984 -23579 -31356 -26968
5384 -26968 -39097 -23682 1072 -111506 -112591 -76395 -64859 -19658 -48445 -128984 -122385 -104296
5372 -104296 -105979 -73225 -56581 -52529 -44164 -55607 -37776 58 -19716 -40765 -44403 -64633
5360 -64633 -90924 -58846 -28031 -31609 13195 31692 -31083 -31611 -75557 -32513 50905 110467
5348 110467 36942 5798 34358 37124 -59634 -129832 -119523 -68198 -58196 10078 71452 16050
5336 16050 -58657 -77361 -31452 2719 -9888 -27770 2050 -28720 -47295 -73233 -38181 -30143
5324 -30143 -49428 -102458 -121458 -158352 -133946 -95302 -45298 -133443 -133583 -71742 -38964 -17618
5312 -17618 -41993 -84378 -92594 -41104 19964 57373 -7208 -106614 -113180 -32705 -2822 -7204
5300 -7204 -96272 -118796 -93890 -85970 -100170 -46259 2815 56616 86320 71559 28880 -73841
5288 -73841 -96077 4023 -8213 -39621 16285 15180 34840 18686 -21333 -120836 -89168 -29332
5276 -29332 -68988 -63384 11827 59095 41153 -12348 -45911 -36628 -25912 12158 109226 105390
5264 105390 50530 -17345 21558 12297 -19315 -20630 25617 22313 -16293 -2746 70233 77978
5252 77978 69393 15929 15626 107553 175561 180208 174636 60452 29355 27587 57156 45324 15809
5239 15809 -10000 53578 34497 -23365 -47612 -62851 -25787 28529 66877 37552 41886 42590
5227 42590 -16817 -74199 -49112 44132 114514 90538 73815 87702 95767 39857 -3099 -42788
5215 -42788 -80026 3319 104508 123731 6004 -61768 -38330 -55965 -65233 -34889 37854 96379
5203 96379 68798 81674 55520 -34637 -42209 -85895 -54603 -53457 -29781 -43329 -86012 -68922
5191 -68922 15433 -2182 17158 88559 80095 66564 50417 37124 -51976 -38541 -61371 -112563
5179 -112563 -177494 -156313 -152641 -163611 -134098 -51838 -49365 -121475 -91692 29706 55613 -21758
5167 -21758 -32791 -112731 -102705 -12579 -24535 -68446 -51973 7204 71442 12583 46647 79326
5155 79326 55920 49773 -4773 -85431 -39118 -5119 -40009 -17974 -55423 -47971 34057 30150
5143 30150 43620 50025 116422 90994 81394 -203 -26134 -39501 -75068 -76528 5083 37095
5131 37095 4098 18257 93099 111831 127164 72090 34365 14777 -12829 18825 -27027 -31466
5119 -31466 -64877 -15151 15655 32041 -54499 -114829 -92134 -94989 -86801 -66594 -71564 10706
5107 10706 56233 -12060 -18304 -29648 -53657 -64628 -66202 41842 35045 11372 -11022 -11321 -37587
5094 -37587 -64623 30368 127369 113446 39424 -47409 -28986 20488 47730 83721 56593 25659
5082 25659 9819 -9524 44465 4325 -21721 -35550 17070 75605 73160 46223 -36070 -132016
5070 -132016 -134690 -82527 -124957 -96076 -92797 -59127 -17890 -45741 -112655 -51751 -7240 50682
5058 50682 59682 20378 -40842 -33632 -36026 -42888 -13015 -3869 -616 16397 43750 60894 52682
5045 52682 86714 111929 69612 15591 -45454 41127 11211 -38094 24844 72227 11619 -87023
5033 -87023 -88446 -20954 -64515 -116068 -40472 21545 -19651 -17544 20769 38027 -4044 -73161
5021 -73161 -71024 -40296 -58382 -5488 -2071 31515 63034 50299 55243 63085 60618 122113 108312
5008 108312 64401 54615 36273 56620 60764 3975 -30521 -2519 44432 49285 28389 35440
4996 35440 61067 73370 75843 -5823 -8130 104955 135012 124650 88982 40979 50507 70550
4984 70550 92992 93216 93293 44243 51382 46672 16983 -27088 -18961 -25991 -34600 -78540 -71336 -42600
4970 -42600 -17780 37786 71198 9964 -65987 -28952 12835 48834 64147 37920 18728 -23749
4958 -23749 -18206 -15635 -63946 -63478 -28666 -84692 -105976 -98554 -21918 -18910 -72479 -63057 -49689
4945 -49689 -57931 -4380 28777 55329 67510 54334 37718 57820 33053 36656 21239 -67688
4933 -67688 -99316 -14335 7702 13817 56079 -1920 -54573 -88803 -41824 62141 118629 106095
4921 106095 40055 2016 41387 28039 -17488 -58835 -153665 -199808 -128489 -137097 -71194 -3776
4909 -3776 -50852 -46441 -2365 18099 -36358 -56118 -28071 14367 19865 -37919 -101070 -55265
4897 -55265 15336 94595 62109 9669 -87265 -89343 -15621 -68793 -72205 -42273 -6969 -23936
4885 -23936 -49212 -44201 -7501 19723 104208 109724 87749 6424 -19886 18229 82425 79491
4873 79491 25739 -58243 -115013 -27524 90744 145662 123014 64156 16475 38468 44038 20214
4861 20214 -5516 80993 160326 82586 17041 -74035 -99518 -94518 -95723 -20760 29004 13198
4849 13198 -5674 -56712 -18545 -37876 -3384 51207 24411 -36825 -90374 -58326 -16446 97898
4837 97898 168917 61407 -21362 19668 -22058 -28582 -46304 -3453 -55326 -97172 -36428 51106
4825 51106 49211 23924 56621 59484 -13560 -49116 -57421 -41906 -52069 9311 17844 9929 -22200
4812 -22200 21394 29967 -28849 -3246 28472 13973 -17884 6460 -39523 -6700 -6439 -33615
4800 -33615 -47458 21964 22818 47450 66625 90596 135684 73867 7672 -23295 -36826 -75113
4788 -75113 -84671 -28798 -15724 1030 -4328 42346 79787 59920 14411 44180 59518 46740
4776 46740 53670 14958 -8477 -12569 -19838 -74818 -112389 -77634 -74914 -77796 8797 7794 11310
4763 11310 -18418 -47135 -61031 -2942 -14934 13771 29579 3428 -7797 -45099 -35845 -9595
4751 -9595 19033 -8900 3033 -42281 -107140 -60845 6584 41487 43491 70150 36156 -33115
4739 -33115 -38592 -15327 10014 74727 28884 -26012 -22548 13656 10410 67138 37608 15920
4727 15920 44170 5007 -50854 -60573 -48613 -12277 -10912 -26798 -38122 -40562 -32817 21612 32839
4714 32839 32173 67985 6641 -15187 -29445 -29085 -41931 20837 -15357 -92640 -153393 -32071
4702 -32071 58872 -1919 -1342 725 48035 12870 41729 86873 36632 50231 15272 20070 38356
4689 38356 17628 -40190 -31872 12173 33741 45278 27390 -33514 -23574 -44651 -41115 -51759
4677 -51759 -139279 -184637 -137828 -111959 -122431 -99206 -121193 -130990 -121268 -82791 -44765 114281
4665 114281 144545 103243 98155 81380 31576 -46346 -43932 4172 16425 14680 -12308 727
4653 727 29861 -10039 -44764 -428 -10086 -43942 16324 44147 64829 6343 35968 8564
4641 8564 -33667 -4697 16554 -12182 29687 26313 65881 55212 -8875 -31568 30970 -2145
4629 -2145 -87808 -138134 -74472 -21742 16121 -23340 -127199 -111821 -9769 58731 79930 87803
4617 87803 41170 -7408 -8540 -58979 -91517 -79781 -57289 -56723 -112347 -87607 -37202 -6320
4605 -6320 17821 35964 14785 -14989 -1314 -45835 -50855 -56859 -67895 -124811 -139869 -35427
4593 -35427 69322 57746 4445 -3120 21705 5821 -38682 -15345 -5864 -41098 -53379 -97986
4581 -97986 -88811 -32670 23927 -25130 -33195 -85574 -90076 -117462 -102892 -37590 55756 18006
4569 18006 -9078 -28401 -33851 -73820 -8281 53786 12111 -31575 -62394 -97910 -159510 -144809
4557 -144809 -83163 -59182 -112424 -153463 -92769 -48033 -47759 14475 131756 149742 98478 81197
4545 81197 83293 53959 51507 111632 72337 134363 94563 -6679 -81511 -150101 -106804 -58307
4533 -58307 -2109 35312 -7814 -74286 -29565 -43000 -42951 -10527 17250 -33685 -57667 -98615
4521 -98615 -56215 10502 75924 90036 85032 59926 38808 42770 51159 70861 54359 -27468
4509 -27468 -63962 -59891 -16093 -19780 -29591 -32743 -16348 -7005 -11157 -19617 -42445 -123597 -125900
4496 -125900 -100730 -41196 -24730 1293 48808 54285 29521 -36570 -85222 -108686 -98382 -86397
4484 -86397 -32830 -16461 95398 74918 36445 16233 -31587 -101704 -58501 3329 62252 -8919
4472 -8919 -44908 25754 72044 58957 12023 1111 -14548 -84052 -131932 -35699 3707 -17620
4460 -17620 -27568 -126036 -140704 -88222 -10894 41209 45033 18679 9117 54261 19043 -52820
4448 -52820 -104721 -38245 3029 28348 16360 49634 87858 28675 24088 2402 48644 19387
4436 19387 9792 27150 16488 -38287 -55464 -53437 -31661 -16560 18267 7162 -11904 -67649
4424 -67649 -28056 31490 -23162 -101588 -117990 -136060 -116513 -69898 -65825 -100282 -63159 -91122
4412 -91122 -97813 -66417 -84202 -92839 3204 74329 119788 41413 -46082 -18320 974 -11687
4400 -11687 -53084 -60838 12690 6222 35091 76321 59256 29296 63776 33653 50879 8986
4388 8986 -8064 32478 49647 48457 101140 76569 22069 -5875 -10267 -46669 -57005 -37232
4376 -37232 -38414 -66169 -64809 -31207 -14744 -9527 -40304 -43104 -72074 -51597 53921 45325 90455
4363 90455 49706 10282 -738 4653 -16365 -12004 37593 88364 21654 -47069 -7039 4571
4351 4571 -21318 -48171 -97465 -78346 -17429 -7005 -48211 -22647 -3559 -11751 -1155 41014
4339 41014 69703 145537 144408 112339 64248 52200 112202 74521 -22086 -32121 57682 41026
4327 41026 -32062 -24674 29157 -6312 -89351 -100882 -72578 -65042 -48800 -38149 3287 -41680
4315 -41680 -70273 -37101 75102 132706 80974 61099 36130 -46972 -56374 -81986 -45111 -72746
4303 -72746 -82940 -77800 -49488 -44469 -16317 22186 72702 93472 60891 61884 56618 70977 57476
4290 57476 84827 57388 -32990 -90689 -61932 -74794 -42407 18501 -21808 -72370 -75146 -35825
4278 -35825 28250 32107 -13272 -11555 -39026 -34422 -33065 -21204 55427 -3783 5217 62444 41653
4265 41653 -671 12644 101190 143707 100931 87131 21457 8375 19097 4230 -9300 -38870
4253 -38870 -79723 -120459 -112418 -60324 17239 -11675 -17283 -19194 -4287 -46197 -57771 -99093
4241 -99093 -91399 -93392 -92790 -125514 -148010 -102884 -126028 -157684 -97694 3106 120329 162970
4229 162970 109507 23036 3216 -76581 -94158 -121748 -131074 -126621 -94484 -57778 21270 75775
4217 75775 121464 155839 72079 -45971 -97739 -40976 -23568 22032 66034 2307 16300 66307
4205 66307 47882 71006 54314 20476 40982 -11121 -31276 -4241 23616 101913 157390 104261
4193 104261 51960 88387 138121 118435 51509 58592 73735 52833 44685 -3358 -22967 1887
4181 1887 7000 -7838 39913 17503 -40616 -43910 802 -56120 -22235 -12761 -2221 20746 55724
4168 55724 121547 116401 81886 62454 86254 68317 -6626 -57222 15862 -12034 5364 -20233
4156 -20233 -55455 -30687 -37619 -21709 -21529 -22587 -26286 20058 -521 10106 -25054 -35395 -18423
4143 -18423 2437 10983 -11942 -23230 -63962 -62661 -45531 -39973 -53881 16006 35838 30540 -5074
4130 -5074 3212 19360 22981 60547 35966 13540 17531 87 -58418 -60974 5399 85164 126835
4117 126835 113159 17290 -52351 63845 48677 -30327 -41482 -22456 43488 86811 12152
4106 12152 -37038 -91334 -47959 15883 30467 17724 4272 40280 49935 54161 21920 -32533
4094 -32533 -74799 -45285 -18652 -4622 2572 10559 -69714 -74489 -86974 -135844 -91148 -20012
4082 -20012 -2834 -30910 -128378 -167671 -134967 -86305 -134616 -7704 74075 42354 -2351 11589
4070 11589 25105 87147 79813 78668 13843 -12537 5164 -31869 -55651 -53100 -39582 -31851 -64824
4057 -64824 -62749 -45691 -29758 21709 32142 -16120 -53987 -73638 -98676 -93486 -2960 62684
4045 62684 54926 31206 -22892 -95239 -100838 -69521 -44493 -22845 -29574 -50149 -66436 12151
4033 12151 58751 84648 125527 84847 71416 66538 83692 82125 73201 76754 54522 -21150 -86715
4020 -86715 -65349 -15895 51214 82756 63956 81196 65916 89611 102673 100181 84168 40927
4008 40927 32650 -295 -15890 -44873 -60850 -58762 -41102 10241 31123 3493 -30890 6111
3996 6111 -16706 -40039 -3854 54474 14251 17391 16594 -33978 676 18262 21666 -63602 -53248
3983 -53248 -28790 -72813 -86790 -84311 -62604 -10867 22433 41526 69202 97458 46459 57074
3971 57074 31772 -18896 -75791 -57872 20235 63056 9185 -64045 -64377 -73078 -75922 -32771 -2144
3958 -2144 -25323 -31672 42266 69108 14138 -6374 -9826 33706 82946 57279 -6835 47254
3946 47254 50422 4248 -301 10599 16756 -20770 -18754 -38460 -35051 21930 52199 44985 35043
3933 35043 -34926 -55652 6095 -13508 -17199 -40584 -63111 -57174 -22380 -15286 -83082 -146978
3921 -146978 -96230 -9600 5666 -53767 -7002 1524 -19626 -51792 -22123 20687 110779 155044
3909 155044 170611 179171 171356 130597 68360 82125 124113 30274 -32061 -28028 -13380 29415
3897 29415 51031 59431 34431 17262 55621 43676 -23442 -79109 -116075 -132143 -97069 -103146
3885 -103146 -108783 -99132 -72155 -13544 -8791 26876 -38868 -5154 -5896 13918 12821 1053 -15620
3872 -15620 -65535 -57225 -52103 -16539 -24592 2105 67651 3994 14563 42139 28557 -27945
3860 -27945 -129466 -166398 -144481 -71931 -9494 40986 26632 58560 72736 158816 125129 108560
3848 108560 76085 101604 119329 25176 -12701 -31800 -830 -36944 -40992 914 34452 39596
3836 39596 44148 15038 -23917 20691 38579 -10029 -53500 -4035 -62652 -46549 -9219 -17580
3824 -17580 -3390 -67348 -155815 -200815 -100935 -29735 1498 -85256 -68454 17937 21563 -36461
3812 -36461 -27640 -26544 26222 6976 -12876 -65411 -45071 -48786 -76137 -67354 -95001 -134277 -59013
3799 -59013 -49268 -37568 -43121 -50142 -63335 -26291 -19046 21259 39496 71351 60035 6559 -33052
3786 -33052 -16416 20918 22098 -22623 -50915 -90922 -43254 -15455 -60099 -39322 -23958 -20570
3774 -20570 6726 46293 86506 94008 78557 70470 60599 -20618 -32684 -21349 -32828 -97059
3762 -97059 -121691 -35717 27059 -12082 -78740 -43400 9332 41872 69068 3072 -16006 51820
3750 51820 52634 -10096 -40386 -22180 3687 40583 -12583 616 51767 40940 48205 35161
3738 35161 63777 124546 34008 6984 17756 16864 -21636 6127 69839 76368 83237 63260 66821
3725 66821 72095 20107 -39427 -21632 -26961 -10332 15441 69829 80164 6399 -839 -45842
3713 -45842 -29270 9432 73814 46663 51194 41479 24402 -5473 13056 67413 110915 64206
3701 64206 16098 -50150 -95986 -76647 -55612 -19450 -7865 82282 66662 61407 71180 78628
3689 78628 77907 48742 19280 77491 75414 52412 30004 -4636 -49287 -84819 -19764 18897
3677 18897 -12513 -8204 55318 37577 11718 -59984 -98314 -105436 -15232 -2431 -74846 -35215
3665 -35215 40560 15777 35216 13202 -52664 -53100 -13134 -19980 50853 95136 92324 -14035
3653 -14035 -73716 -71566 -5168 23514 -2583 45692 20338 -43381 28618 55469 35582 -20175
3641 -20175 -79639 -75267 -68603 -100742 -64888 -32113 -14375 -59792 -55093 9267 -11522 16337
3629 16337 93847 123781 124246 59510 -13700 -37460 -35511 -30686 -50409 -37052 -4165 -15457 9684
3616 9684 12305 1122 -29323 -24319 34600 32439 51424 78582 70831 7337 -3443 32633 7484
3603 7484 -51732 -6326 40413 39927 31693 60020 61875 92561 38150 -72760 -24689 27216 -23409
3590 -23409 -21619 33845 28193 31895 -23345 -25209 -55329 -44820 -37040 -7326 -48537 -51479 -23015
3577 -23015 -32325 -43400 -56621 -14626 -5366 -39798 -26952 26916 59435 12618 -74507 -70727
3565 -70727 -75587 -95646 -34837 27624 45614 54018 120018 100363 83482 61443 101302 153524
3553 153524 170398 86276 39033 19900 20573 -21432 -31328 -24712 -47266 -31067 29962 14713
3541 14713 24875 37038 20387 3780 20603 78783 55891 25666 -1495 5583 -25191 -236
3529 -236 30485 23439 -31536 -21021 -19422 -27077 -51008 -10298 65851 88005 161505 146946 131696
3516 131696 92754 139816 157158 113848 48020 -18885 -29431 -20511 -12288 -5359 22813 -11253
3504 -11253 9128 -29316 -66256 -118103 -125290 -86039 -62167 -21714 -4775 -20765 -14244 131093
3492 131093 159714 44368 -6624 -12965 42187 27597 -13222 -77384 -92638 -54609 -55812 -29627
3480 -29627 24871 3120 -52966 -5649 33538 44170 3088 -40614 -62702 -34424 36349 62904
3468 62904 129283 98808 74290 39592 3830 283 -101181 -175400 -151868 -137112 -87595 -42923
3456 -42923 -44810 -52301 60854 51687 36935 15111 -49363 -31110 -40192 -26375 -37400 -21015
3444 -21015 26605 33094 44087 15880 -22729 -33280 -20316 -17748 4086 -25195 -30803 -11719
3432 -11719 67554 114151 49310 116837 167908 157862 144661 90754 54842 18455 -11843 27133
3420 27133 27891 -21688 13437 55607 113428 128908 41885 -19081 -11763 3644 20018 31195
3408 31195 -3634 -66875 -21157 13390 47274 -989 -28063 -37190 -14047 36596 119 14554
3396 14554 23683 31881 21439 8596 10293 49338 50593 63081 -12898 -19055 43186 39894 13106
3383 13106 -24158 -26631 -40468 19887 76577 84509 69187 -1410 -21210 -91775 -58767 3868
3371 3868 16190 32311 -1441 -20085 -16840 -7285 -16667 -41638 39043 79397 20705 -8244 21880
3358 21880 74138 125193 66053 30085 41402 56322 36703 17196 46784 43283 60007 20280
3346 20280 -20158 -62804 -73989 -36251 19469 -3746 2098 62675 86331 86223 90471 88510 90289
3333 90289 98387 29076 5480 11668 5308 5623 64760 54855 36217 49351 -2473 -48205 -59543
3320 -59543 -27186 47299 90181 122217 130650 -2995 -42065 -10266 24366 -13236 -109692 -83254
3308 -83254 -50065 -80238 -100909 -39299 16092 15812 65919 64258 43631 -15352 -53316 62132
3296 62132 47555 53436 75302 48556 10957 -22405 -17255 37659 117727 143623 115611 64954
3284 64954 -13604 7363 61141 147815 117501 122333 140115 148937 111899 28563 -4853 75394
3272 75394 100214 40489 97329 131033 41734 -24678 -44865 -11094 35753 52048 103264 107185
3260 107185 105342 56580 -63233 -133464 -102654 -83340 -36061 -57434 8434 65246 89904 48424
3248 48424 55237 4124 -68928 -115232 -74698 -90759 -36202 14626 -20903 -53812 -26623 -21020
3236 -21020 -24516 31983 107532 150979 73914 50879 56201 43484 -42192 -24811 -77234 -111380
3224 -111380 -115930 -55124 53355 82415 59070 9657 -9212 -33477 -47634 -50459 4554 71637
3212 71637 58604 54082 -19474 23606 81953 35165 32196 -30422 -45721 2138 23288 -32846
3200 -32846 -93198 -121621 -53457 -19793 -30547 -102096 -156102 -114918 -58528 -54408 -116759 -128184
3188 -128184 -85755 3566 12411 -37532 -77870 -56081 -26742 13678 -62416 -119218 -83600 -86885
3176 -86885 -134239 -91160 -73222 -25370 8024 106681 71638 4152 -29349 -64957 -386 66678
3164 66678 54219 60411 66281 13347 32225 73317 15962 -62920 -71524 -36492 52764 52786 27489
3151 27489 872 60779 97356 75582 45041 7120 -13857 -23854 51913 60353 62589 86534
3139 86534 63324 6068 -41051 -18980 27023 8751 -12314 -55785 -8337 -2418 -7153 32381
3127 32381 31403 58556 149829 80866 -3366 -39220 -40203 -67213 5876 92278 23134 -33543 -23108
3114 -23108 -51701 -76486 -16833 74237 26217 -42950 13242 61068 69715 93667 57429 57109
3102 57109 37073 55847 40912 -17368 50303 -9637 -27766 -19285 30293 28133 49883 61539
3090 61539 27646 -1471 34751 3066 18080 44541 72508 79253 26424 7042 -8993 -74388
3078 -74388 -61924 -63805 -70481 -29825 -14848 31936 17633 -33419 -75747 -61539 -24122 -15597
3066 -15597 -19310 -27501 -76658 -78638 -67725 -16389 65014 75744 49752 68332 83778 -24190
3054 -24190 -80511 11150 58535 50741 -1026 19093 1301 39351 72123 34654 52132 15144
3042 15144 18319 3356 -12465 5389 10909 -15577 -51623 -15702 35224 -54589 -85482 -57859
3030 -57859 -3424 56333 95557 96837 61184 125434 174346 177851 174260 52223 -45785 -65550
3018 -65550 -86028 -39541 30287 25063 -32117 -66765 -40083 54219 104116 54981 17800 -3154
3006 -3154 -78101 -24003 -11227 18427 25152 618 -43571 -13016 27054 19476 -31681 18559
2994 18559 3171 -15152 -16493 13724 39196 14002 6080 -39750 -41134 3352 49439 50535 -48922
2981 -48922 -43189 -32058 -60260 7527 60345 71553 -9935 -27107 -83602 -133486 -160033 -80987
2969 -80987 -37519 -89316 -90512 -92791 -81661 -87899 -91669 -71332 -136974 -170940 -91524 -13789 -75916
2956 -75916 -157864 -120512 -91758 -61634 -76314 766 85241 57031 6468 -22973 -32731 -72441
2944 -72441 -28662 -18077 -65760 -92348 -20469 3113 65242 99906 75033 72278 911 -9119
2932 -9119 6907 -16562 -26167 12944 44430 48084 38477 47185 70884 85959 25888 -36940 46255
2919 46255 104242 59858 47352 19986 -1105 -8937 -17701 -7373 -62053 -103453 -89311 -62261
2907 -62261 -27388 26690 19531 16602 23525 46111 18385 -60716 -86930 -86348 -105773 -62088 -1107
2894 -1107 26333 17318 68080 17459 -26442 -69216 -80574 -52912 -42878 -35653 -9079 -27071
2882 -27071 -63690 -22968 5928 66968 136627 104595 71855 89211 102086 145779 115518 115167
2870 115167 57331 12175 -24097 -42902 -26514 11037 5438 55330 116952 52238 -64073 -9142
2858 -9142 66919 -21225 -23488 -38309 -75334 -114748 -77045 -50551 -21217 -16619 11334 -4272
2846 -4272 4076 -24703 -74709 -73001 -25319 -31787 28780 71945 9933 -29804 -59243 -69330 -103274
2833 -103274 1492 42260 31883 76130 65768 79698 53890 28736 -16232 17856 -28474
2822 -28474 -53494 -4426 8280 -43349 -35705 916 -28985 20759 10985 32858 28598 14973
2810 14973 5527 6385 37211 69297 72083 87348 116132 115709 50391 -18252 -89658 -87687 -33154
2797 -33154 23956 51389 2998 -60182 -18672 -55122 -105426 -47014 -18492 -1217 6521 22408
2785 22408 52749 8683 6073 -84297 -95126 -51423 -56720 -10685 37484 32568 71295 81673
2773 81673 53000 12049 -78170 -72686 -47520 -8801 -73419 -67722 -67815 -53025 -50444 -72930 -67402
2760 -67402 -21174 -991 -32086 -44254 -18003 28643 -12367 -46925 -30747 5264 -68344 -110707
2748 -110707 -102988 -76031 -46637 -55620 -41348 5607 -7694 -4961 -30596 -36396 -2372 62889
2736 62889 117330 106334 56715 56428 39400 -4709 -21139 14879 -14483 35895 88422 101044
2724 101044 100847 146771 143015 89114 130959 149721 136916 81896 -13685 -72969 -116636 -61868
2712 -61868 -10981 -39693 -81625 -152690 -218815 -143353 -54340 -115677 -186935 -135080 -12490 35317
2700 35317 -390 -36279 -64453 -78217 -82086 -102826 -88075 -47852 -20495 -73264 -2438 -6545
2688 -6545 -53964 -55209 -79712 -81726 -60831 -7841 -31136 -106801 -151906 -54630 -17946 -75639
2676 -75639 -43089 4514 59827 7415 20104 51689 55890 58640 16286 18961 34020 35548 2476
2663 2476 -43554 -21051 -6704 -7771 -12119 3031 1918 32215 49983 -220 -7426 40477 123520
2650 123520 110864 82035 17754 -26541 -23216 39538 50699 2411 -9348 4135 -74467 -113503
2638 -113503 -29446 13638 8159 -38670 -67023 -111953 -146402 -117143 -43564 -19024 -78148 -53215
2626 -53215 -3752 34282 86512 66195 50968 58095 71912 78794 46621 45432 7552 -25231
2614 -25231 78435 71010 22973 38870 84269 96756 81062 135326 141196 130950 97299 78136
2602 78136 73265 -12423 -1024 -28151 -79362 -15055 45113 63410 -1410 -26897 -40157 -18345
2590 -18345 -7999 -31354 -34676 15907 -2565 -53096 -46342 -30697 -18670 -49307 -19131 72587
2578 72587 96560 25365 -15984 -60849 -38029 2135 42825 52555 11768 -49466 -91695 -51636
2566 -51636 -50330 -20160 -50751 -102972 -104582 -45268 -23314 35636 66563 38275 8236 -1581
2554 -1581 -23600 6603 24022 -6081 -51254 -21858 801 42439 91382 103216 108504 91171
2542 91171 6647 -19897 49360 49344 -22056 -58265 -36974 20812 84309 15174 -5926 58428
2530 58428 66305 24841 -36779 -97096 -44558 39096 2896 -43935 18579 35529 -28260 -72308
2518 -72308 -29044 69361 71860 53884 44617 2223 -37725 18214 93778 67542 17227 -48946
2506 -48946 -94668 -49072 -71977 -36790 29683 40225 -52215 -23620 9010 9842 17224 34260
2494 34260 26237 21356 -2833 -32914 56192 79012 68415 -59082 -171719 -167963 -144735 -103650
2482 -103650 -115342 -100768 -73441 -13696 -3133 46740 77828 113187 64620 -2183 11491 -19567
2470 -19567 -35950 -27622 -7724 -7079 4227 28565 15936 -26990 -76055 -113406 -169143 -64207
2458 -64207 -14148 -118545 -143163 -106028 -81237 -86885 -47770 28238 22867 -17420 -98410 -132790
2446 -132790 -89816 -28822 -46091 -11456 -9960 3055 3345 -52166 -82144 -34127 -59904 -51568
2434 -51568 -23903 7069 -49990 -68296 -82103 -33219 36719 61802 91427 15799 -75033 -66908
2422 -66908 27511 50940 36592 -9773 -461 3571 -67867 -55464 -63565 16449 79585 71577 39673
2409 39673 -22737 -30625 -44857 -79332 -83248 -69629 -57894 -42898 -38085 -12284 -39375 8526
2397 8526 30823 23847 26466 31914 18299 1474 -3721 18958 5286 -1984 22917 60080 68593
2384 68593 108916 139982 101079 42806 -9290 -3914 4362 -22853 -55844 -18521 46808 -7474
2372 -7474 21643 -733 -19063 23593 40864 49009 38517 -14019 -29904 -28213 -1376 33280
2360 33280 6309 3291 13923 -19452 -86199 -58870 -1545 74876 143915 150470 93273 11916
2348 11916 -67496 -96537 -105856 -31777 1144 1116 47239 27469 -2544 28052 70801 53122 -50571
2335 -50571 -94609 -23149 -51190 -46075 -58408 -63215 -36535 57299 107091 108170 -26250 -40624
2323 -40624 -55545 -11440 -11508 -17184 -1124 1804 16549 31451 65836 68294 37028 -77443 -67347
2310 -67347 -7520 21710 11952 -7312 23898 -26601 -77398 -57463 25888 64252 38749 -38708
2298 -38708 -98327 -73217 18443 131571 116077 99422 126712 24201 -19925 10720 -1143
2287 -1143 73854 102590 108904 30967 38463 124391 138118 115673 -4461 -62915 -54653 -55134 -35934
2274 -35934 -22666 -16672 -62250 -58768 19949 90878 115717 30718 -42644 -85206 -66888 294
2262 294 57565 10886 -35224 -10904 -21161 -8067 -29348 -107724 -87707 -29873 -17690 -76583
2250 -76583 -95077 -135379 -96563 9207 97231 96546 65087 28919 -42808 -80925 2143 21429
2238 21429 -32183 -40283 -25400 -13066 -74097 -82777 -106106 -130791 -157467 -87146 -15600 -39714
2226 -39714 -27912 50681 53438 62609 101690 107266 120341 117153 48030 9262 89745 47586 19857
2213 19857 27741 27805 29404 64231 20475 12971 -63297 -77035 -32045 32011 103666 86945 98164
2200 98164 69714 27934 3425 18027 52381 33843 17286 19716 -20176 31284 98424 54965
2188 54965 57103 36084 473 49756 30775 57363 29788 -7808 36826 40898 25684 2393
2176 2393 15505 13741 9785 33737 7075 -58519 -75258 -25112 35154 17530 -113178 -143808
2164 -143808 -63565 5296 3846 -49181 -25926 -23064 -17816 -37417 -25451 -21495 -60143 -39294
2152 -39294 10711 -8526 -59323 -21786 48109 -10246 -30135 -50865 -41629 -56401 28475 74880
2140 74880 -11889 -74334 -53611 68032 106652 51078 37541 119046 74424 -4083 -54191 -32854
2128 -32854 -38321 -53697 -42516 47564 54344 32286 65116 269 -57566 -81714 -16150 15058
2116 15058 21020 -8277 -28256 -29952 -35122 -56280 -71952 -65742 -30862 -14847 -55999 -50254 -35584
2103 -35584 -28391 -15204 -26510 -11207 16922 30537 -73336 -45542 53703 172984 222553 190415
2091 190415 122444 91529 74160 111470 124641 113104 115413 102359 96065 84554 20608 15213
2079 15213 13320 41403 114360 137085 39476 -29076 -56417 -64476 -86963 -115059 -100439 -19538
2067 -19538 39396 26960 -60065 -87638 -28387 -41012 -66028 -72052 -58477 -19715 -30818 -38890
2055 -38890 -32241 -56133 -66064 -30468 -20640 26484 1607 -29661 -14237 -82117 -121067 -93511
2043 -93511 -121625 -145055 -59189 -2921 26341 54926 37598 -2342 -59840 -59588 -92871 -95629
2031 -95629 -93949 -69890 -45847 -23925 -102339 -52007 30769 65818 117404 125904 55297 -91734
2019 -91734 -111639 -49205 -24465 -7538 -8559 -56411 -88415 -116872 -120874 -78944 -20723 56997
2007 56997 182956 141009 126596 112382 52599 5989 63767 75634 80846 127592 102624 44797
1995 44797 2675 25112 22473 -28963 15992 47811 91425 33952 27705 82288 63732 24140
1983 24140 65579 277 -4097 87675 63277 -7672 53822 1463 1940 41028 69279 83532
1971 83532 96766 63698 26288 21967 18965 -29767 -35180 37905 20085 38922 23190 -6213
1959 -6213 -37521 -18921 -46904 41267 111043 99878 29703 19533 68839 -9141 -106395 -102728
1947 -102728 -23529 -29615 -90818 -70398 -7575 367 41415 50384 14788 9875 13861 10905 -31177
1934 -31177 -93705 -26907 80127 75302 -25484 -47158 7018 28764 98114 174754 177238 105246
1922 105246 103723 130284 114201 109763 149687 102896 26435 797 -3512 -20758 -15879 -8351 8008
1909 8008 2490 -56672 -95201 -55698 -45869 -31910 -14511 -50858 7743 57412 -25622 -66112
1897 -66112 -52290 -87537 -96003 -40638 -8308 59401 57170 60392 67146 71439 44695 62752 47605
1884 47605 29469 -93841 -88280 -26222 21082 37517 48823 57824 8131 2717 46237 94332
1872 94332 54394 1009 1100 -6571 6331 -9139 -59072 -54792 -55353 -38026 -54893 -2720 -23302
1859 -23302 -15059 -22212 -57458 -86477 -101874 -75073 6318 64900 29262 64012 35325 -12499
1847 -12499 -20664 -37720 -41465 -12946 6670 7780 52387 55216 -8367 8957 5275 10063 64981
1834 64981 61951 54789 3882 -60547 -133561 -122089 -40819 20382 42221 23954 -18804 -52512
1822 -52512 -49632 -71123 -98286 -90329 -20581 -19487 -4597 -20229 -91097 -113427 -76897 -7731
1810 -7731 -21365 -83522 -54560 -60751 -60744 -32512 -2224 32556 9950 4036 2116 -61328 -130301
1797 -130301 -179189 -155517 -69634 30769 31021 23804 107310 125839 94116 71650 6142 30716
1785 30716 77367 31678 -6981 47436 36259 -29336 -52281 -38683 20373 68361 102493 52285
1773 52285 101044 104085 39234 56884 116115 37695 -37838 -30057 -16743 63127 110297 77364
1761 77364 101173 109837 103178 78735 46537 89248 83234 105961 82590 17899 35096 23635
1749 23635 -7893 -62679 2021 -27115 -14560 5007 91481 82519 138951 129549 146366 89235
1737 89235 15813 11330 -3104 6112 83909 75443 -15491 -44731 -34869 3663 -334 -38706 -83665
1724 -83665 -50670 14459 62884 133700 145399 57173 11291 17425 32273 19244 -51462 -56116
1712 -56116 -73872 -78454 -49848 -24762 6210 -27285 7629 57984 63380 133307 144008 46512
1700 46512 48404 7521 -26439 81988 55728 12064 39671 89668 72710 82811 43352 33890
1688 33890 3349 -22592 32946 27221 77615 23040 22732 33627 -15019 -26446 -16217 -43556
1676 -43556 -24704 28371 50207 30752 77127 105359 86814 76669 83980 70426 65901 95979
1664 95979 44285 82609 71556 20214 32971 45128 52585 17701 2451 -17660 -38376 16835
1652 16835 36874 25282 57369 56874 13976 36579 30133 21655 1043 -39171 -56031 -19793 31662
1639 31662 31021 -2141 -55291 -78274 -86070 -75223 -64542 17784 -8351 2496 6652 55954 45472
1626 45472 60917 52690 52011 96422 71612 43133 49710 63220 -29659 -101944 -78684 -52783 -62728
1613 -62728 -50612 -23762 -16056 24955 50172 93073 97652 72596 60179 14362 16193 33196
1601 33196 -28946 9851 29003 67058 25236 16472 31129 71644 93476 49230 -8515 -34063
1589 -34063 -50787 -18810 -8901 70968 66267 -45418 -55958 -51069 -6048 26296 13886 -58354
1577 -58354 -154534 -185321 -181709 -138922 -46204 -31550 31034 -1411 7450 25082 76539 18964
1565 18964 74422 165947 157451 115529 42095 29961 67300 56689 77176 676 -61960 -71940
1553 -71940 -118265 -89321 -113169 -165093 -161244 -118046 -40330 -38301 -107801 -92369 -80558 -85510
1541 -85510 -13180 25546 35764 31684 -8104 -3631 16759 99198 108210 63268 36249 -16148
1529 -16148 29288 106776 71145 11428 -25828 -51104 -60031 -27007 16734 27295 18776 -27814
1517 -27814 -88190 -40138 76189 168344 225643 159868 101227 85253 65479 45031 6833 47598
1505 47598 30513 10536 -118 -24166 -10396 -38921 -31660 78137 78975 61581 56260 20103
1493 20103 14241 7434 -28007 -63704 -66479 -70435 -9945 13377 66950 77594 40562 34026 28982
1480 28982 44970 6752 60251 40810 -1336 -34912 -38764 -10355 -9273 -21707 -41300 -10694
1468 -10694 -9984 36105 15741 -32787 -42890 -29925 11845 -44878 -115210 -72159 -2108 95316
1456 95316 145061 131323 94527 157417 182472 111751 72032 58408 38592 22989 16842 24338
1444 24338 -7334 10913 -29739 -44915 -44652 41577 51962 -32811 -36108 49792 40478 42208 58649
1431 58649 76513 17365 12627 -4803 30795 45409 101934 16979 -65981 -47833 -7986 -63603
1419 -63603 -86720 -71032 -90262 -93071 -124371 -66322 -30208 -31350 -32228 -39645 24914 60863 37096
1406 37096 7779 28125 77053 68786 33920 -1917 -15176 20836 45386 38788 125608 141384
1394 141384 104006 39244 -8945 -8223 23264 23479 56605 -7837 -65322 10102 34866 83129
1382 83129 47589 84285 88822 61452 2725 56142 84930 161120 127228 110989 156733 161721
1370 161721 123290 52530 -39063 -94861 -122758 -19909 45996 105056 14099 -15368 -6281 -124396
1358 -124396 -87297 -41466 -28769 -8108 17369 571 -24798 -63476 -4301 6240 -26366 8373
1346 8373 68845 45117 38481 50007 27037 28398 69414 105307 130193 153045 127398 50128
1334 50128 -68373 -83097 -54961 -70567 -41700 -57816 -102324 -56713 42215 59764 -8929 -71043
1322 -71043 -111806 -79743 30725 44584 16345 -14342 -6441 -39231 -19509 35532 34455 -4051
1310 -4051 -64207 -20925 -66413 -55849 21026 51628 110008 90789 -50795 -140437 -147888 -128791
1298 -128791 -126258 -89728 -39551 -23634 -46786 -46161 -8309 -72252 -106217 -99902 -99160 -50773 -81133
1285 -81133 -73974 3582 10617 -36787 -77797 -91066 -34190 960 -5359 -69856 -111506 -125131
1273 -125131 -38274 -73758 -113316 -121450 -123880 -90353 -64838 -72926 -37055 -66150 -80446 -95779
1261 -95779 -92571 -20958 19887 -54878 -61072 -42519 -47467 -14003 -64350 -61702 -52803 -90774 -13822
1248 -13822 -16770 -11763 -18981 -31636 -18562 30830 -19073 -100791 -125295 -72759 -21012 9187
1236 9187 17254 70774 105433 43708 23210 6965 -21046 -24890 -2580 68866 70573 6047 18533
1223 18533 -7251 -57385 -68607 -18778 38683 104543 130614 142211 113581 120530 179197 234341
1211 234341 205850 86207 60142 26958 -53750 -96047 -55316 -4660 35392 1883 -41219
1200 -41219 -20828 -31720 -79768 -30628 33424 30557 7298 -11145 -55188 -42412 -71455 -40730
1188 -40730 -12825 6057 -16234 -21176 -36863 -20283 7796 -13779 -48217 -80566 -48840 -8040
1176 -8040 -57764 -59816 -89034 -73588 -76979 -49212 9972 -71292 -63731 -20186 9571 82274 -4043
1163 -4043 -23233 36931 124571 122086 89468 59205 42216 74075 81391 575 -32077 4317
1151 4317 34455 34855 26863 -56863 -123550 -77694 -18634 -6972 26951 81289 69290 99331 113600
1138 113600 39377 -2301 -68857 -27357 28351 -2511 -59473 -75806 -94027 -125269 -174812 -155865
1126 -155865 -105591 50103 128956 78836 53955 64387 -18770 -59818 -9106 -37612 -67438
1115 -67438 -77274 -122641 -86308 -2771 -50888 -50069 -26739 -62193 -30939 11804 8856 -26470 -18399
1102 -18399 44645 66017 -13339 12082 53400 44903 23822 26238 2326 -35675 -91073 -117213
1090 -117213 -124490 -96566 -32683 -5100 32727 -15085 -56871 -108153 -118193 -113625 -111303 -112141 -42604
1077 -42604 58754 42418 48957 19950 -74039 -116999 -151009 -124761 -73235 2391 59345 126544
1065 126544 166289 49626 72930 107213 109985 4820 -118572 -172932 -31180 49576 92746
1054 92746 79712 29375 -91677 -142567 -115110 -39891 -41633 -51031 -35626 17568 37430 34458
1042 34458 -23824 -68168 -15891 14444 -12351 -53107 -74975 -92022 -80580 -83999 -95982 -75722
1030 -75722 -40936 4299 -23172 -46181 -17110 13918 -15473 -25638 3982 -23237 -43925 2046
1018 2046 -24780 -19912 58005 124917 86633 50973 46299 19880 -12265 -28300 -16974 30038
1006 30038 42049 57142 12281 -8300 59164 94564 118818 171352 109852 37660 4258 19712
994 19712 41699 73633 143850 170437 97163 37292 30223 59462 88880 76218 -8072 -20573
982 -20573 4186 85814 124198 87495 31505 22765 91877 56842 27354 13011 22572 -2258
970 -2258 -22844 20095 -1443 -69004 -42500 -34405 -72750 -50005 13079 -3557 -85674 -110875
958 -110875 -65968 -51991 -24428 36418 58456 38925 86969 100009 34750 -23132 10648 19838
946 19838 18709 -33184 -20364 65496 118415 113404 96088 48895 51097 24738 -52132 -85352 -71620
933 -71620 8890 19033 -39072 -79576 -84648 -78930 5847 89640 51216 15882 -32348 -60114
921 -60114 -44871 8387 25003 77211 84178 72303 26732 -26772 -11422 -8679 -14457 52122 77900
908 77900 77521 92125 48075 -21242 -28161 -11880 29478 43234 -13925 -18243 -7898 -12552 39377
895 39377 87047 86903 33051 4084 6903 77303 -6634 13032 58891 30097 -19751 -3737 66937
882 66937 31178 25943 37754 56714 121261 146243 138224 46068 66896 90789 155474 203228
870 203228 150325 89742 46523 38207 -22602 -35682 -10245 -37472 11612 -2495 -8944 38902
858 38902 29321 15019 -11248 -58243 -19187 -10415 18535 -29191 -107331 -109543 -56095 32093 59785
845 59785 10090 -33334 -1393 27864 51380 48197 18044 -4710 -10377 -38865 13470 11950 -43739
832 -43739 1805 31887 53352 55173 93049 79032 66459 88519 96135 53494 14641 -48059
820 -48059 -58403 -46158 11063 7269 -13813 -67343 -51569 39890 23715 -31696 -59914 -85916
808 -85916 -94950 -91120 -79592 -86328 -27233 -3371 -66430 -46257 4210 9390 -75476 -74075 -20712
795 -20712 -40911 -22908 25912 29070 39113 321 -59836 -76124 -57177 -29421 9680 33724
783 33724 58164 60506 51600 -1641 -12824 14564 -15733 -50826 -60278 -69526 -71546 -111783 -104880
770 -104880 -71949 -41655 6687 8569 -12344 34505 73345 41431 22467 49711 26542 6430
758 6430 71201 54274 40476 -4711 -74169 -17479 -30986 -91438 -69041 -12112 37095 37839 68474
745 68474 -28222 -47344 -70690 -60903 -51449 -5953 -23164 24792 92016 48263 -6782 -55640
$$ [...]
##END NTUPLES=NMR SPECTRUM
##END=
