##TITLE=Analysis number 318973
Compound Code rf 00380
Project Code adrs
Chemist Name fudan
##JCAMPDX= 6.0         $$ Bruker NMR JCAMP-DX V2.0
##DATA TYPE= NMR SPECTRUM
##DATA CLASS= NTUPLES
##ORIGIN= Bruker BioSpin GmbH
##OWNER= nmr
$$ XWIN-NMR		Version 3.5
$$ Tue Apr 25 17:54:45 2006 GMT Daylight Time (UT+1h)  MAYBRIDGE\nmr@NMR_250MHZ
##.OBSERVE FREQUENCY= 250.131544655141
##.OBSERVE NUCLEUS= ^1H
##.ACQUISITION MODE= SIMULTANEOUS (DQD)
##.ACQUISITION SCHEME= undefined
##.AVERAGES= 16
##.DIGITISER RES= 18
##SPECTROMETER/DATA SYSTEM= dpx250
##.PULSE SEQUENCE= zg30
##.SOLVENT NAME= CDCl3
##.SHIFT REFERENCE= (INTERNAL, CDCl3, 0, 16.522)
##AUDIT TRAIL= $$ (NUMBER, WHEN, WHO, WHERE, WHAT)
$$ ##TITLE= Audit trail, XWIN-NMR		Version 3.5
$$ ##JCAMPDX= 5.01
$$ ##ORIGIN= Bruker BioSpin GmbH
$$ ##OWNER= nmr
$$ C:\u/data/dgb/nmr/ADRS/3170/pdata/1/auditp.txt
$$ ##AUDIT TRAIL=  $$ (NUMBER, WHEN, WHO, WHERE, WHAT)
(   1,<2006-04-25 17:54:19.26 +100>,<MAYBRIDGE\nmr>,<NMR_250MHZ>,
      <created by zg, POWCHK disabled, PULCHK disabled
       configuration hash MD5:
       84 BC 41 DB A1 6E 1D 46 DA 25 12 A5 C1 ED C5 3A
       data hash MD5: 64K
       B7 B3 61 7F B2 00 F3 E7 85 D2 5F C9 D6 2C F1 2D>)
(   2,<2006-04-25 17:54:34.20 +100>,<MAYBRIDGE\nmr>,<NMR_250MHZ>,
      <Start of raw data processing
       ef LB = 0.3 FT_mod = 6 PKNL = 1 SI = 32K 
       data hash MD5: 32K
       23 31 FB 85 53 89 87 8E FD 6E C8 4B D4 64 12 65>)
(   3,<2006-04-25 17:54:35.81 +100>,<MAYBRIDGE\nmr>,<NMR_250MHZ>,
      <apk 
       data hash MD5: 32K
       5D EC 60 D6 25 AC CC F1 85 0B 59 DD 18 5B 77 7A>)
(   4,<2006-04-25 17:54:36.56 +100>,<MAYBRIDGE\nmr>,<NMR_250MHZ>,
      <abs ABSG = 5 
       data hash MD5: 32K
       97 28 FF 3B 8A 37 9F 5C DF FA 35 83 03 AA EA 53>)
$$ ##END=
$$ 
$$ hash MD5
$$ 33 C9 0F 70 0F 42 A3 9F 9A BA 0C ED A9 EB F1 9F
##$RELAX= 
##$RELAX= 
##$RELAX= 
##$RELAX= 
##$RELAX= 
##$RELAX= 
##$RELAX= 
$$ Bruker specific parameters
$$ --------------------------
##$DU= <C:\u>
##$EXPNO= 3170
##$NAME= <ADRS>
##$PROCNO= 1
##$TYPE= <nmr>
##$USER= <dgb>
##$AMP= (0..31)
100 100 100 100 100 100 100 100 100 100 100 100 100 100 100 100 100 100 
100 100 100 100 100 100 100 100 100 100 100 100 100 100 
##$AQSEQ= 0
##$AQ_mod= 3
##$AUNM= <au_zg>
##$AUTOPOS= <10 >
##$BF1= 250.13
##$BF2= 250.13
##$BF3= 250.13
##$BF4= 250.13
##$BF5= 500.13
##$BF6= 500.13
##$BF7= 500.13
##$BF8= 500.13
##$BYTORDA= 1
##$CFDGTYP= 0
##$CFRGTYP= 5
##$CHEMSTR= <none>
##$CNST= (0..31)
1 1 145 1 1 1 1 1 1 1 1 1 1 1 1 1 1 1 1 1 1 1 1 1 1 1 1 1 1 1 1 1 
##$CPDPRG= <>
##$CPDPRG1= <>
##$CPDPRG2= <>
##$CPDPRG3= <>
##$CPDPRG4= <mlev>
##$CPDPRG5= <mlev>
##$CPDPRG6= <mlev>
##$CPDPRG7= <mlev>
##$CPDPRG8= <mlev>
##$CPDPRGB= <>
##$CPDPRGT= <>
##$D= (0..31)
0 1 0 0 0 0 0 0 0 0.06 0 0 0 0 0 0 0.0002 0 0 0 0 0 0 0 0 0 0 0 0 0 0 
0 
##$DATE= 1145984058
##$DBL= (0..7)
120 120 120 120 120 120 120 120 
##$DBP= (0..7)
150 150 150 150 150 150 150 150 
##$DBP07= 0
##$DBPNAM0= <>
##$DBPNAM1= <>
##$DBPNAM2= <>
$$ [...]
##$SUBNAM7= <"">
##$SUBNAM8= <"">
##$SUBNAM9= <"">
##$SW= 20.6930455092707
##$SWIBOX= (0..15)
0 0 3 0 0 0 0 0 0 0 0 0 0 0 0 0 
##$SW_h= 5175.983436853
##$TD= 65536
##$TD0= 1
##$TE= 295.16
##$TE2= 300
##$TE3= 300
##$TEG= 300
##$TL= (0..7)
0 120 120 120 120 120 120 120 
##$TP= (0..7)
150 150 150 150 150 150 150 150 
##$TP07= 0
##$TPNAME0= <>
##$TPNAME1= <>
##$TPNAME2= <>
##$TPNAME3= <>
##$TPNAME4= <>
##$TPNAME5= <>
##$TPNAME6= <>
##$TPNAME7= <>
##$TPOAL= (0..7)
0.5 0.5 0.5 0.5 0.5 0.5 0.5 0.5 
##$TPOFFS= (0..7)
0 0 0 0 0 0 0 0 
##$TUNHIN= 0
##$TUNHOUT= 0
##$TUNXOUT= 0
##$USERA1= <user>
##$USERA2= <user>
##$USERA3= <user>
##$USERA4= <user>
##$USERA5= <user>
##$V9= 5
##$VALIST= <valist>
##$VCLIST= <CCCCCCCCCCCCCCC>
##$VD= 0
##$VDLIST= <DDDDDDDDDDDDDDD>
##$VPLIST= <PPPPPPPPPPPPPPP>
##$VTLIST= <TTTTTTTTTTTTTTT>
##$WBST= 1024
##$WBSW= 4
##$XGAIN= (0..3)
0 0 0 0 
##$XL= 0
##$YL= 0
##$YMAX_a= 520421
##$YMIN_a= -519910
##$ZGOPTNS= <>
##$ZL1= 120
##$ZL2= 120
##$ZL3= 120
##$ZL4= 120
##$ABSF1= 16.522
##$ABSF2= -4.171173
##$ABSG= 5
##$ABSL= 3
##$ALPHA= 0
##$AQORDER= 0
##$ASSFAC= 0
##$ASSFACI= 0
##$ASSFACX= 0
##$ASSWID= 0
##$AUNMP= <proc_1d>
##$AZFE= 0.1
##$AZFW= 0.1
##$BCFW= 0
##$BC_mod= 0
##$BYTORDP= 0
##$COROFFS= 0
##$CY= 12.5
##$DATMOD= 1
##$DC= 0
##$DFILT= <>
##$DTYPP= 0
##$F1P= 14.0000005364418
##$F2P= -0.99999901652339
##$FCOR= 0.5
##$FTSIZE= 32768
##$FT_mod= 6
##$GAMMA= 0
##$GB= 0
##$INTBC= 1
##$INTSCL= 1
##$ISEN= 128
##$LB= 0.3
##$LEV0= 0
##$LPBIN= 0
##$MAXI= 10000
##$MC2= 0
##$MEAN= 0
##$ME_mod= 0
##$MI= 0
##$NCOEF= 0
##$NC_proc= -1
##$NLEV= 6
##$NOISF1= 0
##$NOISF2= 0
##$NSP= 0
##$NTH_PI= 0
##$NZP= 0
##$OFFSET= 16.522
##$PC= 1
##$PHC0= 168.8961
##$PHC1= -2.012386
##$PH_mod= 1
##$PKNL= yes
##$PPARMOD= 0
##$PSCAL= 4
##$PSIGN= 0
##$REVERSE= no
##$SF= 250.13
##$SI= 32768
##$SIGF1= 0
##$SIGF2= 0
##$SINO= 400
##$SIOLD= 32768
##$SREGLST= <1H.CDCl3>
##$SSB= 0
##$STSI= 32768
##$STSR= 0
##$SW_p= 5175.98343685301
##$SYMM= 0
##$S_DEV= 0
##$TDeff= 65536
##$TDoff= 0
##$TI= <Analysis number 999999
Compound Code 99
Book Reference 9
Project Code 9>
##$TILT= no
##$TM1= 0
##$TM2= 0
##$TOPLEV= 0
##$USERP1= <user>
##$USERP2= <user>
##$USERP3= <user>
##$USERP4= <user>
##$USERP5= <user>
##$WDW= 1
##$XDIM= 32768
##$YMAX_p= 435156602
##$YMIN_p= -282900
$$ End of Bruker specific parameters
$$ ---------------------------------
##NTUPLES= NMR SPECTRUM
##VAR_NAME=  FREQUENCY,     SPECTRUM/REAL,   SPECTRUM/IMAG
##SYMBOL=    X,             R,               I
##VAR_TYPE=  INDEPENDENT,   DEPENDENT,       DEPENDENT
##VAR_FORM=  AFFN,          ASDF,            ASDF
##VAR_DIM=   32768,         32768,           32768
##UNITS=     HZ,            ARBITRARY UNITS, ARBITRARY UNITS
##FACTOR=    0.157963299565203, 1,           1
##FIRST=     4132.6476996994, 0,             0
##LAST=      -1043.33573715361, 0,           0
##MIN=       -1043.33573715361, -282900,     0
##MAX=       4132.6476996994, 435156602,     0
$$ Real data points
##PAGE= N=1
##DATA TABLE= (X++(R..R)), XYDATA
$$ [...]
##PAGE= N=2
##DATA TABLE= (X++(I..I)), XYDATA
24699B43035M244m380K078N302O735n00k324k923k133m782o559K205J0986L579
24685B54563M99L173N999J493j034j1397k360l432m822j783M112J280K056J166
24671B49513J273K280M038L942J477P2k701n463j014J627L289K71n70m351O92
24656B54375L0r323k447o72N030L944j504M574k126o50O16J991R077n861j3148
24641B43906M541m080m635m293l746M379O708L029R851P140n053j846O848K212
24627B64961K479m343P39O261l098j3608k227J262N253l274L856l212K7K722j54
24612B57644j683K452O508l47J001K705m728K018K510O232j120j592j776J634
24598B71458m557k740n853q906J539K547N573M963r826r64L879p730j734L096
$$ y = [243035, 247279, 242899, 244977, 250279, 257014, 256514, 254190, 251267, 249134, 244352, 237793, 239998, 250984, 254563, 255062, 258235, 264234, 265727, 264693, 253296, 250936, 247504, 242682, 240899, 245011, 246291, 248347, 249513, 250786, 253066, 257104, 261046, 262523, 262595, 259894, 254431, 253417, 255044, 258333, 258604, 258034, 253683, 254375, 254405, 245082, 242635, 241963, 246993, 250937, 249433, 254007, 251881, 251231, 251847, 253838, 262915, 257054, 243906, 248447, 244367, 239732, 235439, 231693, 236072, 242780, 245809, 255660, 262800, 257747, 255901, 262749, 264961, 267440, 263097, 263836, 270097, 266999, 253391, 251164, 252426, 257679, 254405, 258261, 255049, 255076, 257798, 257644, 255961, 258413, 264921, 264574, 265575, 268280, 263552, 265570, 268080, 274312, 273192, 271600, 269824, 271458, 266901, 264161, 258308, 249402, 250941, 253488, 259061, 264024, 254198, 253234, 257113, 249383, 247649, 250745]
24584B50745k102j014J1552L329n685m448J651j968J647R322R290r934j419L353
24570B64319p659n558J990K900R41p977p38l461m287R725Q254K608j488R1p22
24555B58938j0914m977J1354n45k714J416q74O376R058l005q817N14J11q329J209
24540B48801J4073N123l865n549K415P757M283K60q476o964J1213L619r097l403
24526B60190j0347k4O239R320M02P991N623m235o431m320J439J262m439j299M964
24511B66335K816P09n257K099Q047L141n509K39L099p183j0666n250J3738J240
24497B67598r367L41L639n790j369O76M815J956O198N816o095r940k036j978K340
24482B56804N769k886J35J331n30k953k01J0006N01K055k994l922m437j039m54
$$ y = [250745, 248643, 247629, 259181, 262510, 256825, 252377, 254028, 252060, 253707, 263029, 272319, 262385, 260966, 264319, 256660, 251102, 253092, 255992, 256933, 248956, 248218, 244757, 240470, 250195, 258449, 261057, 259569, 259660, 258938, 248024, 243047, 254401, 253856, 251142, 252558, 251684, 258060, 267118, 264113, 255296, 255810, 255921, 247592, 248801, 262874, 267997, 264132, 258583, 260998, 268755, 273038, 273298, 264822, 257858, 269071, 272690, 263593, 260190, 249843, 249819, 256058, 265378, 265780, 273771, 279394, 275159, 268728, 264408, 265847, 267109, 262670, 261371, 266335, 269151, 269860, 264603, 266702, 274749, 277890, 272381, 272620, 275719, 268536, 257870, 252620, 266358, 267598, 258231, 258572, 262211, 256421, 255052, 255728, 260543, 262499, 268697, 274513, 268418, 258478, 256442, 254464, 256804, 262573, 259687, 259822, 261153, 260623, 257670, 257469, 267475, 267976, 270031, 267037, 263115, 258678, 257639, 257185]
24467B57185j035m120O475O637j4065P7O968P988M842j109j802M077K276l444
24453B70950K143J896j038j334O17K491k265k411K89m363j4994k840Q10K151N636
24438B57738L820M154l130q05K18j132L251J1909k542j080q938l342j831K104
24424B60394N5N602J807p594K62N599K450o671j067L20L419K742j843M997M315
24409B74787j845p908r266M185m081k004K773n475L745M662R268M081q911p062
24395B56949o19q251O555Q259Q422j808p411k026N455R714K030j759Q85m359n961
24380B66075l26j005n951K926L123j091K506K261J926l210L22j0988N746J20j679
24365B60755l71j173N540L730j376O492n392O53J605l854l937O052m88m319O320
$$ y = [257185, 256150, 252030, 258505, 265142, 251077, 251154, 258122, 266110, 270952, 269843, 268041, 272118, 274394, 270950, 273093, 274989, 273951, 272617, 273234, 275725, 273460, 271049, 271338, 266975, 251981, 249141, 249951, 252102, 257738, 261558, 265712, 262582, 261777, 261995, 260863, 264114, 276023, 273481, 272401, 263463, 260121, 258290, 260394, 260449, 266051, 267858, 260264, 260526, 266125, 268575, 261904, 260837, 261157, 264576, 267318, 265475, 270472, 274787, 272942, 265034, 255768, 259953, 255872, 253868, 256641, 251166, 254911, 259573, 268841, 272922, 264011, 256949, 256330, 248079, 254634, 262893, 271315, 269507, 262096, 260070, 265525, 275239, 277269, 275510, 276395, 272036, 266075, 265749, 264744, 258793, 261719, 264842, 263751, 266257, 268518, 270444, 267234, 267556, 256568, 262314, 262434, 260755, 260384, 259211, 264751, 268481, 267105, 273597, 268205, 268858, 270463, 266609, 262672, 268724, 268236, 263917, 270237]
24350B70237J908l603j612J763M502j687n693L046M700o44r30j109O23J837O214
24335B79552J980k024l336j3566N588N369J159n714p350L182N648N768N30m554
24321B72232j0609K926L578q189r17N580P010N608K35J557m764q881o725p86P53
24306B58608o33N249J93N364M835l087j596o085N55k658K298J0630m36p03J640
24291B74174Q823K407l759p71r114l451M000p732l357r76R277j773O82M308L455
24276B76193l791j307K092R32P53k861P834R57o12M83J438j059K646L86j1137
24261B72947o063j913k930n777P643N579J018n44P58K146N560J531p322n736l547
24246B63350M157K358k749O940O338j196K855j620J335K938n280j577k105K331
$$ y = [270237, 272145, 268542, 266930, 268693, 273195, 271508, 265815, 268861, 273561, 272917, 271987, 270878, 271501, 273338, 279552, 281532, 279508, 276172, 262606, 268194, 273563, 274722, 269008, 261658, 264840, 270488, 276256, 276786, 272232, 261623, 264549, 268127, 259938, 259021, 264601, 271611, 277219, 277454, 279011, 274247, 265366, 258641, 257855, 258608, 257975, 263224, 263417, 268781, 273616, 270529, 268933, 262848, 263403, 260745, 263043, 273673, 273237, 272534, 274174, 282997, 285404, 281645, 280874, 271760, 268309, 272309, 264577, 261220, 260244, 269521, 267748, 268430, 272738, 276193, 272402, 271095, 273187, 274119, 274872, 272011, 279845, 280802, 280190, 280673, 282111, 281052, 283698, 284084, 272947, 266884, 264971, 262041, 256264, 263907, 269486, 270504, 269960, 270718, 272864, 278424, 279955, 272633, 266897, 263350, 267507, 269865, 267116, 274056, 280394, 279198, 282053, 280433, 281768, 284706, 279426, 277849, 275744, 278075]
24232B78075m804j612k751Q1L812O095j598J807O686J0944L539p742o431l507
24218B82594k714n388k78M349m544p240N852j8p001k299N95Q48q22K01Q080J13
24202B72328l570M48N460Q710M919N66j2300k0999k071P854j148J154P803p08
24188B68446P034N146n319m287j579N485j368k121N790J5198m701p185j161m708
24174B74670q182M973q05k909R958K924r70K670N525l717m142k368P51J683r306
24159B70755p208p878K943M497L423J2586R454J2208k179q394p079p976m261J006
24145B71897P399O324l704m423K034O474P696k782o765m07k367k117N580L804
24131B88643j2750l23r36j0788J052O238J595r08N835k02M532k586n454n264J1883
$$ y = [278075, 273271, 271659, 268908, 268989, 272801, 278896, 277298, 279105, 285791, 296735, 300274, 292532, 286101, 282594, 279880, 274492, 274214, 278563, 274019, 266779, 272631, 272613, 265612, 263313, 263908, 264756, 263934, 264135, 272215, 272328, 268758, 269206, 274666, 283376, 288295, 288861, 276561, 255562, 253491, 261345, 260197, 261351, 269154, 268446, 275480, 280626, 275307, 271020, 269441, 274926, 273558, 271437, 277227, 292425, 287724, 280539, 279378, 274670, 266488, 271461, 270656, 267747, 277705, 280629, 279659, 282329, 287854, 284137, 279995, 277627, 278378, 280061, 270755, 263547, 255669, 258612, 263109, 266532, 279118, 288572, 300780, 298601, 290207, 283128, 275152, 270891, 271897, 279296, 285620, 281916, 277493, 279527, 286001, 293697, 290915, 284150, 283743, 281376, 279259, 284839, 288643, 275893, 275570, 274634, 263846, 264898, 271136, 272731, 271823, 277658, 277456, 281988, 279402, 273948, 268684, 280567]
24116B80567R805p851r56l800j71P003K165n028j019K436J413j559N01j89O211
24101B89528R29n427J815j494l159n017o398J103P193q36m503O14l781O499K370
24086B79436L311L182o39l076m588K560l271K749l468q538Q575K720k803j942
24072B74208J193J0861Q226j629q048J5q69q067q991O653n993j112R546k644J3817
24057B87166R548N687o81m088l123m972m323p699k290K944k105q926O067M633
24043B77838l640O591P880k751L465K771j851P42K193J326l760l509n524m185
24029B77586M084Q957M12l790R5m965m531P71O505L991K902L905o903j0056L03
24014B79266P45K745J191m750l114N34R284p87O9K384K651M06o746k046J094L947
$$ y = [280567, 290372, 282521, 281565, 277765, 277594, 284597, 286762, 281734, 280715, 283151, 284564, 283005, 283506, 283317, 289528, 290457, 285030, 286845, 285351, 282192, 277175, 270777, 271880, 279073, 278237, 273734, 274348, 270567, 277066, 279436, 282747, 285929, 285290, 282214, 277626, 280186, 276915, 279664, 276196, 267658, 276233, 278953, 276150, 274208, 275401, 286262, 294488, 292859, 284811, 284826, 283957, 275890, 266899, 273552, 267559, 266447, 275993, 273349, 287166, 296714, 302401, 301720, 297632, 294509, 289537, 285214, 277515, 275225, 278169, 276064, 267138, 273205, 277838, 274198, 280789, 288669, 285918, 289383, 292154, 290303, 291045, 293238, 294564, 290804, 287295, 281771, 277586, 281670, 290627, 291039, 287249, 287344, 282379, 277848, 278619, 285124, 289115, 292017, 295922, 289019, 278963, 279266, 280011, 282756, 283947, 279197, 276083, 276617, 285901, 285114, 285183, 287567, 290218, 290624, 283878, 281832, 282926, 286873]
23998B86873L756J283q96L959P798o935m969l349P67L319q081j0375N832J009
23984B79991J071N052j260l76j969K394P302k582p026M360J514R9J267N577j503
23969B93911j009N056p422q470J0246K60p270K078M048J630n749r671M976N439
23955B88053R725j673l989j806m230K323O827o151P57O027n785l745L931j309
23941B88955O14J415K139q724l230L590R756K122n058m247j2667P614P134p515
23927B81898n48R952R996P313l145j170M930K683k937k96l417j4937p203k455
23913B80664L31j567O437L748J791j707o301N225J1715N03K54m325l410L184P040
23898C03582L364p18n616n439o992j934N346k828k938K75K931J0362J731p574
$$ y = [286873, 290629, 291912, 291016, 294975, 302773, 295838, 290869, 287520, 288287, 291606, 283525, 273150, 278982, 279991, 281062, 286114, 284854, 284478, 282509, 284903, 292205, 289623, 282597, 286957, 288471, 288570, 289837, 295414, 293911, 292902, 297958, 290536, 282066, 292312, 292572, 285302, 287380, 291428, 293058, 287309, 277638, 282614, 288053, 297778, 296105, 292116, 290310, 286080, 288403, 295230, 289079, 289836, 295863, 290078, 286333, 290264, 288955, 289569, 290984, 293123, 284399, 281169, 284759, 294515, 296637, 291579, 287332, 274665, 282279, 289413, 281898, 281350, 291302, 301298, 308611, 305466, 304296, 309226, 311909, 308972, 308676, 305259, 290322, 283119, 280664, 280995, 279428, 285865, 289613, 291404, 289697, 283396, 288621, 300336, 300839, 301093, 296768, 293358, 296542, 303582, 306946, 306228, 300612, 295173, 288181, 286247, 291593, 288765, 285827, 286102, 289033, 299395, 301126, 293552]
23884B93552o399O291R054l989n759k236m666Q71m478L772J2522Q318p772j820
23870B97261J756k738p764n047R852J800J819J134J790l832M113m1j364j81J048
23855B99606N86m230K858K822r693n806P76J1896K988q000r93P902M004k727q595
23840B93394J380K949o466J044J276n883L028P109l038J403K086l518J998N801
23826C02563k742o700O245J1812M2j3316n564q003R44M303J1705L033m880k924
23812B96518m747l61Q549L943l336O717o116k39O612m783m669o897j105n99J1353
23797C00840K438o21J058L710P63n261o586J19O063K852N500O55k026q048n347
23782B96109o314l993M906N537O770L80q88K100j858q834N762j372l963l091L636
$$ y = [293552, 287153, 293444, 302498, 298509, 292750, 290514, 285848, 286719, 282241, 286013, 298535, 306853, 299081, 297261, 299017, 296279, 288515, 283468, 293320, 295120, 296939, 298073, 299863, 296031, 300144, 300103, 298739, 298558, 299606, 300192, 295962, 298820, 301642, 291949, 286143, 286919, 298815, 301803, 293803, 292810, 300712, 304716, 301989, 293394, 294774, 297723, 291257, 292301, 293577, 287694, 290722, 297831, 294793, 296196, 298282, 294764, 296762, 302563, 299821, 293121, 299366, 311178, 311220, 297904, 292340, 284337, 285281, 289584, 301289, 304322, 299442, 296518, 291771, 291410, 299959, 303902, 300566, 307283, 301167, 300928, 307540, 302757, 298088, 291191, 290086, 289487, 300840, 303278, 302657, 303715, 307425, 308188, 302927, 296341, 296460, 302523, 305375, 310875, 311530, 309504, 301456, 296109, 289795, 285802, 290708, 296245, 303015, 303395, 302507, 304607, 302749, 293915, 299677, 298305, 294342, 291251, 294887]
23767B94887J2748R337o168j268p599m56K431q203k674R07M843J1481j05j2548
23753B97613K840m24p688m755N885Q682L261K335J97M149P487J299r144p582m281
23738B99874Q67j795Q524L455r780J868J473k516m38k333o084R002N080N224n137
23723C07284j219o529O678O710m784j622L98L432j179m080l301J09O43j407K141
23708C03274M567l652J094N287L225k179k041k850k716L269J864O534n124n600
23694C04952j042M171K829m430r86J589j775k671K663J1168R240n907o513l805
23680C09483q87n581j0089k456L377L854J251r85J974K091Q210N518j1780n706
23666B98274J343N42n75K332j894j1246P583R434Q438l87J594N174k780j3588
$$ y = [294887, 307635, 316972, 310804, 309536, 301937, 301481, 303912, 295709, 293035, 293942, 298785, 310266, 310161, 297613, 300453, 300029, 292341, 287586, 293471, 302153, 305414, 307749, 307946, 312095, 319582, 320881, 311737, 304155, 299874, 300741, 298946, 307470, 310925, 301145, 303013, 304486, 301970, 301532, 299199, 293115, 302117, 307197, 312421, 307284, 306065, 299536, 306214, 312924, 308140, 306518, 306916, 310348, 309169, 305089, 301788, 301897, 302540, 301133, 303274, 307841, 304189, 305283, 310570, 313795, 311616, 309575, 306725, 304009, 307278, 309142, 315676, 310552, 304952, 303910, 308081, 310910, 306480, 305494, 307083, 305308, 302637, 305300, 316468, 325708, 319801, 313288, 309483, 308596, 303015, 292926, 290470, 293847, 297701, 298952, 297967, 299941, 302032, 310242, 315760, 303980, 298274, 299617, 300159, 299584, 301916, 300022, 288776, 296359, 305793, 314231, 313844, 315438, 320612, 317832, 304244]
23652C04244m763J1681O926o764k330R24l960P48O172M572o887q363l672R53r638
23637B89843J36N360J0759P941R571p900p249p608Q060O336p275o851k265Q096
23623C06954p37p148L501J3099P194k023m640j041j186m753k16N306K065j868
23609C14507p814j2428m577K77M493N565Q212P028k816L858k891L446k116l28
23595C14416m20j654n29O100k377K542j060m0l707k902L882L237m70j76o35p003
23579C09204o400J777L63Q74N146N004m993N703m453j396q64K091q804o274P316
23564C04294R339r653q598P956j429J685J4449L043n097l53p758j641J0064R236
23550C25537k396j0680l231P380p776m368l687O922m179K797o22L867k662n259
$$ y = [304244, 299481, 311162, 318088, 311324, 308994, 309918, 305958, 306706, 312878, 317450, 310563, 302200, 298528, 299481, 289843, 289979, 295339, 306098, 314039, 323610, 315710, 308461, 300853, 308913, 315249, 307974, 301123, 298858, 306954, 306217, 299069, 302570, 315669, 322863, 320840, 316200, 315159, 313973, 309220, 309004, 314310, 316375, 314507, 306693, 294265, 289688, 289965, 294458, 300023, 308235, 315263, 312447, 316305, 313414, 316860, 314744, 314416, 313996, 312342, 311813, 317913, 315536, 318078, 317018, 316978, 313271, 310369, 314251, 317488, 317018, 316842, 316207, 309204, 302804, 304581, 304944, 305818, 310964, 315968, 310975, 316678, 312225, 310829, 309965, 312056, 303252, 296978, 304294, 313633, 303980, 295382, 303338, 301909, 303594, 318043, 321086, 315989, 315636, 307878, 306237, 316301, 325537, 323141, 312461, 309230, 316610, 308834, 304466, 300779, 307701, 303522, 306319, 305697, 309564, 306902, 301643]
23536C01643K741J677n49o75j074N706M485n69M751q89k290n997r522l284M169
23521C00323K231K204K48j737K666O054K74l570J917J0109O14k668K999j825o069
23506C13770l913M669M131N7l260K025O551L318J298N920j3097r525M545J831
23492C18320o511m094O994R996R907K434j634r41n740k548L751p85r853q739l056
23477C07501P42O738M847L671O561m993r855O848m110m978J3475R519m625m197
23463C27144k694n153L224L572p150J462P800M015L84j029l573k72O80l770q53
23448C23787l468r791M119m98m500Q604N749j712M723M772n808m551l556J415
23434C19285J2554q23K353J518p21J909O328k548K668l021p257J597j188m068
$$ y = [301643, 304384, 306061, 305512, 304837, 303763, 309469, 313954, 313385, 318136, 317247, 314957, 308960, 299438, 296154, 300323, 302554, 304758, 305006, 303269, 305935, 311989, 312263, 308693, 310610, 320719, 321333, 318665, 321664, 319839, 313770, 309857, 314526, 318657, 318714, 315454, 317479, 324030, 327348, 328646, 334566, 321469, 311944, 316489, 318320, 311809, 307715, 314709, 324705, 334612, 337046, 335412, 334471, 328731, 326183, 329934, 329149, 319296, 310557, 307501, 308243, 314981, 319828, 323499, 330060, 325067, 315212, 322060, 317950, 312972, 326447, 335966, 331341, 327144, 324450, 319297, 322521, 326093, 318943, 320405, 328205, 332220, 332604, 331575, 328002, 327730, 328410, 324640, 323787, 320319, 310528, 314647, 314149, 309649, 318253, 324002, 322290, 327013, 331785, 325977, 321426, 317870, 319285, 331839, 331016, 333369, 334887, 334166, 336075, 342403, 339855, 342523, 339502, 332245, 333842, 332654, 328586]
23420C28586n45j00M194j261k275q043o540p421J639J295N014R327R865j1045
23406C22690j1584j414K275K900O265M908K725J195j320J468n549n743o39o674
23392C11503l006m456P781M891R286j666k769J1348R864m684r456p910q906l811
23378C08009J748J0269M450N150J759m180M720M91n476l673k638J836J710O797
23364C30972P610R8n132k142k934N046J816l059k783m226P359K010n924J686K747
23349C33144n367n363Q586L406m35p485p323J849K661M215M422Q3k099n32M047
23334C33809l36p002J412M644K749l499j1844j380M474n327O769l511P882j47
23320C28693n91N796K104p368l339N991n45n45L457J0418K336m126j491m482m618
$$ y = [328586, 328041, 327941, 332135, 330874, 328599, 320556, 314016, 306595, 308234, 309529, 314543, 323870, 333735, 322690, 311106, 309692, 311967, 314867, 321132, 326040, 328765, 329960, 328640, 330108, 324559, 318816, 318177, 311503, 308497, 304041, 311822, 316713, 325999, 324333, 321564, 332912, 342776, 338092, 328636, 320726, 311820, 308009, 309757, 320026, 324476, 329626, 331385, 327205, 331925, 332416, 326940, 323267, 320629, 322465, 324175, 330972, 338582, 338680, 333548, 331406, 328472, 333518, 335334, 332275, 329492, 325266, 332625, 334635, 328711, 330397, 333144, 327777, 322414, 331000, 334406, 333971, 326486, 319163, 321012, 323673, 327888, 332310, 332393, 330294, 329762, 333809, 333473, 326471, 327883, 332527, 335276, 331777, 319933, 318553, 323027, 317700, 324469, 320958, 328840, 328693, 328102, 333898, 336002, 328634, 325295, 331286, 330741, 330196, 333653, 344071, 346407, 342281, 340790, 336308, 331690]
23305C31690M607Q48q05j447N44k139L160O254N017n568r518r789j158k818K535
23290C21413K379J227M194K498k645M018P649J1217J329j2889j7731k845K539
23277C22353N111R995p32L633L902n475n661m63M98P365L022l963o463m297O33
23262C29458Q43k621J962m036J354l468N931L270m338K823N181K158N90L913r658
23247C33362j223K816l791M120N978Q73o518k600L868L574P920o488r340k749
23233C29802M58J281M079J0258L433l149l816j33K70M500K561K090P31K598O209
23218C61172q789k564j0491l461j242J860J3413P876K020n186n21J481q507j083
23204C45978L639l951K917k321p666K694j266o378L631j100O760M220j723P098
$$ y = [331690, 336297, 337145, 336340, 334893, 335437, 333298, 336458, 342712, 347729, 342161, 332643, 322854, 321696, 318878, 321413, 323792, 325019, 329213, 331711, 329066, 333084, 340733, 351950, 353279, 340390, 322659, 319814, 322353, 327464, 337459, 336727, 340360, 344262, 338787, 333126, 332663, 333161, 340526, 343548, 339585, 333122, 328825, 329458, 330301, 327680, 329642, 325606, 326960, 323492, 329423, 332693, 328355, 331178, 336359, 338517, 339107, 343020, 333362, 332139, 334955, 331164, 335284, 341262, 342135, 335617, 333017, 336885, 340459, 348379, 341891, 332551, 329802, 330260, 331541, 335620, 345878, 349311, 346162, 342346, 342213, 342483, 346983, 349544, 351634, 352365, 354963, 361172, 352383, 349819, 339328, 335867, 334625, 336485, 349898, 357774, 359794, 354608, 354087, 355568, 347061, 345978, 349617, 345666, 348583, 346262, 338596, 341290, 340024, 333646, 337277, 336177, 342937, 347157, 345434, 352532]
23190C52532J768l73n292l380j293q419N482J0439n527n461K642q6J405O942O31
23175C52010l411M27Q322J648k556p429j1867l896k460P170L650k49l515K539
23161C40383P939o80p155p341J993L478J212Q328J059L491K392j2002j472p92
23147C40833q364q143O540J0748J755K30q51N441M647r82K060Ko112j92k613j938
23131C43061R05R128K077q603j0728m562O780L779J593N13m792k100M29J971O089
23116C45540m043M66N426q96q698k854O915M521j045M099n212j052J231J519J148
23101C47065P263q30p018k793J518j613l482l40N633N118p489N783O582J467o117
23086C50747K716L570o774o10J201L441J53J249p124o140P993J0112L814O661
$$ y = [352532, 354300, 353927, 348635, 345255, 343962, 335543, 341025, 351464, 345937, 340476, 343118, 343032, 344437, 351379, 352010, 348599, 349026, 357348, 358996, 356440, 349011, 337144, 333248, 330788, 337958, 341608, 341359, 337844, 340383, 348322, 347642, 340487, 333146, 335139, 338617, 339829, 348157, 349216, 352707, 355099, 343097, 341625, 340833, 332469, 324326, 330866, 341614, 343369, 343599, 342748, 348189, 352836, 351854, 353914, 353916, 347804, 347612, 344999, 343061, 343966, 353094, 355171, 346568, 335840, 331278, 338058, 341837, 343430, 343943, 339151, 337051, 337480, 339451, 345540, 341497, 341963, 347389, 346493, 337795, 334941, 341856, 346377, 345332, 349431, 344219, 343167, 344398, 345917, 347065, 354328, 353498, 346480, 343687, 345205, 343592, 340110, 339770, 345403, 350521, 343032, 348815, 355397, 356864, 350747, 353463, 357033, 350259, 349649, 350850, 354291, 354444, 355693, 348569, 342429, 350422, 360534, 364348, 371009]
23072C71009o566n401m397r493K426J592q886j845J232Q341M041k341n00K050
23058C51262J038l777K088r38K116k38j974l119K813M754n629n333P350j468Q38
23043C49783K219K718O873M066o012R500R385n015M55p922j1023o768m75R221
23029C57005P113p593j815n061l996j1320j390L767o524K740P773L093L236J534
23015C48562J394K847m906l562J192K412n452k855Q569M826M136l595m490j927
23001C47151Q84P125p49n540o027j258R485L143Q65J639j279l664N863K211m276
22986C55573r23p336Q676L303Q508l164m77J437K730k014j5025j01J2484K43o600
22971C57314l983J962J319l128j362P245K467l218q298K023R236O09J030O881
$$ y = [371009, 364443, 359042, 354645, 345152, 347578, 349170, 340284, 338439, 339671, 348012, 352053, 349712, 349212, 351262, 352300, 348523, 350611, 349673, 351789, 351551, 349577, 346458, 349271, 354025, 348396, 343063, 350413, 348945, 349783, 352002, 354720, 361593, 365659, 359647, 369147, 378532, 373517, 373972, 366050, 355027, 348259, 347784, 357005, 364118, 356525, 354710, 349649, 345653, 334333, 332943, 336710, 330186, 332926, 340699, 343792, 347028, 348562, 349956, 352803, 347897, 344335, 345527, 347939, 342487, 339632, 348201, 353027, 357163, 353568, 349078, 347151, 348035, 355160, 354411, 348871, 342844, 341586, 351071, 354214, 355079, 356718, 355439, 351775, 357638, 359849, 355573, 354650, 347314, 355990, 359293, 367801, 364637, 364160, 365597, 368327, 366313, 351288, 351187, 363671, 363914, 357314, 353331, 355293, 356612, 353484, 352122, 359367, 361834, 358616, 350318, 352341, 361577, 362186, 363216, 370097]
22957C70097M194l839j0391j1794J101j691P678N671M45O082N531n288J291K32
22943C69319n114j1498k99O838P107Q23o912j0466j147K366P974Q546j496j2177
22929C53864O63N146J1394k202l240O774j777p916J470M696J768J271j998l116
22915C66797n617J62n538o873N280J415J298J1099J664n820o82p16p8k047K518
22900C62862L039q340k333n077J985m117o721J548R845K839M514J992K2P062J829
22885C70949n489j275N742J3767j453p701m314J928M714j999m090k311L630k185
22871C69913M7P470O521p124q682m434n611L732l00K710N526J020M49N443K12
22856C76892R92p714r225n09k792J3821O027p765m509L325L4l901l389R6J197
$$ y = [370097, 374291, 370452, 360061, 348267, 349368, 347677, 355355, 361026, 361471, 367553, 373084, 367796, 369087, 369319, 364205, 352707, 352408, 359246, 366353, 367176, 360264, 349798, 348651, 351017, 358991, 367537, 366041, 353864, 354527, 359673, 371067, 368865, 365625, 372399, 370622, 362706, 364176, 368872, 370640, 371911, 369913, 366797, 361180, 361342, 355804, 348931, 354211, 355626, 356924, 368023, 369687, 363867, 363185, 362469, 362391, 360344, 362862, 365901, 357561, 355228, 350151, 352136, 348019, 341298, 342846, 352691, 355530, 360044, 362036, 362058, 369120, 370949, 365460, 364185, 369927, 383694, 382241, 374540, 370226, 372154, 376868, 374869, 370779, 368468, 372098, 369913, 369960, 377430, 383951, 376827, 368145, 363711, 358100, 361832, 361532, 364242, 369768, 370788, 371237, 376680, 376892, 377884, 370170, 360945, 360436, 357644, 371465, 377492, 369727, 365218, 368543, 368577, 364676, 361287, 361383, 362580]
22841C62580K231j037l931J531R506N274J769k385J639p171k677J0499K876J68
22827C80872K248n857m621Q410M931l947k187o607j411Q26L65P960O887r257o35
22812C77977R51j0451k538K337m58L461k34k511L909j757K184J303J976O05Q91
22797C77645K141k409R744M91l695k158N622n959o522k192j664l715m774j679
22783C60876J1842O554M223M713j1414L067j164l039R26J838j068L077l226q645
22769C68560o882K284m3Q874Q123l049n657M991L758Q20m554J603J058J576k391
22754C79071n16m04L929j228q67j164m491m834J045M580j852m376M509J3743P856
22739C95001j6695r649L117K939M650j843N552K55m684m105k671j364Q745K523
$$ y = [362580, 364811, 363774, 359843, 361374, 370880, 376154, 377923, 375538, 377177, 370006, 367329, 377828, 380704, 380872, 383120, 377263, 372642, 381052, 385983, 382036, 379849, 373242, 371831, 372657, 373022, 380982, 387869, 378612, 377977, 378928, 368477, 365939, 368276, 367818, 371279, 371045, 368534, 372443, 370686, 372870, 374173, 376149, 376754, 377645, 379786, 377377, 387121, 387612, 383917, 381759, 387381, 381422, 374900, 372708, 371044, 367329, 362555, 360876, 372718, 379272, 383495, 388208, 376794, 379861, 378697, 375658, 376584, 378422, 377354, 380431, 377205, 368560, 361678, 363962, 363919, 372793, 380916, 377867, 372210, 377201, 380959, 381779, 377225, 378828, 379886, 381462, 379071, 378555, 378151, 382080, 380852, 379985, 378821, 374330, 369496, 370541, 375121, 373269, 368893, 373402, 387145, 395001, 378306, 368657, 371774, 374713, 379363, 377520, 383072, 383327, 378643, 374538, 371867, 370503, 379248, 381771]
22725C81771J156O88l643n54J162k067q403N776L437R050L147o620m045k507m543
22710C73805m868K215M656M66j874q87J733N860N673r19k527q204L157J1775N89
22695C90650J26k595j876M884J323n93j2762n313L190n519k183N702Q235j14j587
22680C81568O252m022o056J1503N517j2144l260J0339M99L234o184m552n357P573
22666C84910Q696L263N859m266n848k633r64o21J352J984Q02N179M768M81l810
22651C99152k833m253K662m193K084O138j586j1325j5393m569N229K380K373J1241
22637C87107P800N219n228M620P51j2823j2831P536m622l548o39O848Q068L617
22623C91875P081O055o281N49N433n755m929m085J0968J455o726n943N13M204
$$ y = [381771, 382927, 383615, 379972, 379418, 380580, 378513, 370110, 375886, 379323, 388373, 391520, 384900, 380855, 378348, 373805, 368937, 371152, 375808, 376274, 374400, 373513, 375246, 381106, 386779, 385860, 383333, 375129, 378286, 390061, 390650, 390776, 388181, 386305, 391189, 392512, 391919, 379157, 373844, 377034, 371515, 369332, 375034, 383269, 383155, 381568, 387820, 383798, 377742, 389245, 394762, 382618, 379358, 389697, 390196, 393430, 387246, 382694, 377337, 384910, 393606, 396869, 402728, 398462, 392614, 389981, 389017, 388396, 389748, 391732, 392534, 397713, 402481, 402962, 399152, 396319, 392066, 394728, 390535, 392619, 398757, 397171, 385846, 370453, 365884, 371113, 373493, 375866, 387107, 394907, 400126, 394898, 399518, 400269, 387446, 374615, 382151, 377529, 373981, 373342, 380190, 388258, 391875, 398956, 405011, 398730, 399279, 404712, 398957, 394028, 389943, 400911, 402366, 395640, 389697, 390210, 394414]
22609C94414q616K823N59j880O917M528N511R99l072l921J163O010m824m344p50
22594C95517j882j597P860j396Q77K617m693n265L859J0424R33l089n385o41n470
22579C92669l879m43m82O800m170L025J42l237M831R239M174m733q701l752L84
22564C91867k471J065J0704r18k795Q64M123K093j040l749p569O034j613m306
22550C92289K259N76R83m230l572K207N159j0212L328N919j3Q977L93j279L189
22535D05973k999k320N642O149k473m693o250J156Q98p98n48J458L795p107j254
22520C96629O674L615k684Q77p725L004O567j2987J178O094j726q181m84Q664
22506C99515J4433J908J178n985q190l709P502J2189P28p968o101K659O920r854
$$ y = [394414, 385798, 388621, 389180, 387300, 394217, 398745, 404256, 405255, 402183, 398262, 399425, 405435, 400611, 396267, 395517, 393635, 392038, 399898, 398502, 399379, 401996, 397303, 392038, 395897, 406321, 407254, 404165, 398780, 398139, 392669, 388790, 388347, 387865, 394665, 390495, 393520, 393662, 390425, 395256, 404495, 408669, 403936, 395235, 391483, 391867, 389396, 390461, 401165, 400247, 397452, 398316, 402439, 404532, 403492, 399743, 392174, 398208, 396595, 392289, 394548, 395124, 396107, 391877, 388305, 390512, 395671, 385459, 388787, 394706, 394693, 403670, 404063, 402784, 405973, 402974, 400654, 406296, 412445, 409972, 405279, 399029, 400185, 401083, 400285, 399737, 401195, 404990, 397883, 396629, 403303, 406918, 404234, 405111, 397386, 400390, 406957, 393970, 395148, 401242, 399516, 391335, 390851, 399515, 413948, 415856, 417034, 411049, 402859, 399150, 406652, 418841, 419569, 411601, 405500, 408159, 415079, 405225]
22492D05225q731n138m325N541J0750L202J9n938j609P816K678o566n027M472
22478D02369J0239J10j0432k40M117L813K932K85L526R07k001K638J340l644m119
22463D11840r2m482l317K090M018M067N209R635J435q263j0928m168N621O31j669
22448D11627O45J389N753J889l427r488M415n535l331k443J0996R499l795N603
22434D23797K553j001k651n615L329K756n698j572k54j372K33j248J836J322p175
22419D09240Q61k324M627M759l354k530m037m235L616M276J614N627J051k142
22405D17049L655j220o248N058k138j0014n167P171P760j693L185J037o44m637
22391D13154N583P564p92q708k529k807j052M539m370m745M980m291J245k851
$$ y = [405225, 396494, 391356, 387031, 392572, 403322, 406524, 406543, 400605, 398996, 406812, 409490, 402924, 397897, 402369, 412608, 412718, 402286, 402046, 406163, 409976, 412908, 413193, 416719, 417626, 415625, 418263, 419603, 415959, 411840, 411748, 407266, 403949, 406039, 410057, 414124, 419333, 428968, 430403, 422140, 411212, 407044, 412665, 413296, 411627, 412272, 413661, 419414, 421303, 417876, 408388, 412803, 407268, 403937, 401494, 412490, 421989, 418194, 423797, 426350, 425349, 422698, 417083, 420412, 423168, 417470, 415898, 415644, 414272, 414505, 413257, 415093, 416415, 409240, 410101, 407777, 412404, 417163, 413809, 411279, 407242, 403007, 406623, 410899, 412513, 418140, 419191, 417049, 420704, 419484, 413236, 418294, 416156, 406142, 400975, 408146, 415906, 414213, 417398, 418435, 417791, 413154, 418737, 426301, 425509, 416801, 414272, 411465, 410413, 414952, 410582, 405837, 410817, 406526, 407771, 404920]
22377D04920m437J667M292O455M325k89M440K096r517n168J652J155k87l536l435
22362D04333K92L929R541l35O656O29p623k263J843j3080L909L639J595j050P660
22347D19675N103M036k927m31J312j265J556l713p696m267m99N705Q210O327M150
22332D35276M8j651m428l699N613M781o423p656l778Q832K602q06m08j034M921
22317D32190O82l948j916j061m238N011J664N219m97j1279j1283L006q6J1261
22303D24725p93l9J008M756N495Q90r12J697n710K456Q26o587m56k235k283L464
22287D26302J0013M664K530R95j6102j725P508M618l264J656k607r781j112Q594
22273D32289R318K769m124P78j491K766j934n341j154k867J650J0284R758k147
$$ y = [404920, 400483, 402150, 406442, 412897, 417222, 416933, 421373, 423469, 413952, 408784, 410436, 411591, 411304, 407768, 404333, 404625, 408554, 418095, 417760, 424416, 425045, 417422, 415159, 417002, 403922, 407831, 411470, 413065, 412015, 419675, 424778, 428814, 425887, 425456, 426768, 425503, 427059, 423346, 415650, 411383, 410884, 416589, 424799, 431126, 435276, 435324, 433673, 429245, 425546, 431159, 435940, 429517, 421861, 418083, 426915, 429517, 428711, 428303, 427269, 432190, 432872, 428924, 427008, 425947, 421709, 426720, 428384, 433603, 433106, 421827, 410544, 413550, 413464, 424725, 423932, 423893, 424901, 429657, 435152, 436042, 435130, 436827, 431117, 433573, 434399, 427812, 427356, 425121, 422838, 426302, 436315, 440979, 443509, 444504, 428402, 426677, 434185, 438803, 435539, 437195, 434588, 424807, 423695, 432289, 441607, 444376, 440252, 441030, 439539, 442305, 440371, 435030, 433876, 431009, 432659, 442943, 452701, 450554]
22259D50554j4941o566M725N723L674l474l51P85k68n284j188R35j903M357L213
22244D39991k124L847j86Q3n923J325j810J285J624l648l430j258n779Q77N049
22229D29923J560o5K102J680m621q22J0937J4639k759j2616p974J707R607l009
22215D40289l77P519J51o392O41j58L603o060n388K390K071k584k379M902M879
22200D43107J1675N6q672l114N559k175j0421K595P448R55l496o479o042M551
22186D35547O161r899M297R215l478l748r274j4263j856J1288R104K614O283L952
22172D45943j922P843j23K235n149p826K398L006p55m244l776N629K071q727L251
22157D39854P912j083l067n774k048J095L380k557L484J376l379l765l389M262
$$ y = [450554, 435613, 429047, 433772, 439495, 443169, 439695, 439344, 440129, 439861, 434577, 433389, 434324, 432421, 436778, 439991, 437867, 441714, 441528, 441611, 435688, 437013, 435203, 436488, 438112, 434464, 431034, 429776, 423997, 424874, 429923, 431483, 431418, 433520, 435200, 430579, 429757, 440694, 455333, 452574, 439958, 431984, 433691, 443298, 440289, 439912, 447431, 447582, 441190, 441831, 441673, 445276, 439216, 433828, 436218, 438289, 435705, 433326, 438228, 443107, 454782, 454838, 446166, 443052, 448611, 446436, 436015, 438610, 446058, 447013, 443517, 437038, 430996, 435547, 441708, 431809, 436106, 445321, 441843, 438095, 428821, 414558, 412702, 423990, 433094, 435708, 441991, 445943, 444021, 451864, 451741, 453976, 448827, 441001, 443399, 446405, 445650, 441406, 437630, 443259, 445330, 436603, 439854, 447766, 446683, 443616, 437842, 435794, 436889, 440269, 437712, 441196, 442572, 439193, 435428, 432039, 436301]
22143D36301P567O374q33j1274q4O355K816K026j406M414M335J954p614m757O365
22128D52539M860n399j3104P065Q104M610N26m882l171J269o37l621k961k70L926
22113D48854Q163P073L258q45J0J175j571k268m153n413j431L34P696O813n670
22098D62025n444r358Q619L035m276K210q254p331N249K107N168K777Q652Om780
22083D60405J554J0516j486k253p653j796n8R289n571j081l629k038N974K083
22069D64256j098J953l170j997J923L253K469r34j297p623o804k198M467n110
22055D48090J475P356N752k02n094P0m143k500J1292K982r682L565K50O008m11
22040D64808l461L094J982N525k308L178j815o982J27O177n006j886m094l94P437
$$ y = [436301, 443868, 450242, 449409, 438135, 438051, 444406, 447222, 449248, 447842, 452256, 456591, 458545, 450931, 446174, 452539, 457399, 452000, 438896, 445961, 454065, 458675, 459201, 454319, 451148, 452417, 451780, 448159, 445198, 444928, 448854, 457017, 464090, 467348, 466503, 466513, 467688, 466117, 463849, 459696, 454283, 452852, 453186, 460882, 467695, 462025, 456581, 447223, 455842, 458877, 454601, 456811, 448557, 441226, 446475, 448582, 453750, 456527, 465179, 465185, 460405, 461959, 472475, 470989, 468736, 461083, 459287, 459229, 468518, 462947, 461866, 458237, 456199, 462173, 464256, 463158, 465111, 461941, 459944, 461867, 465120, 467589, 466655, 465358, 457735, 450931, 448733, 453200, 448090, 449565, 456921, 462673, 462471, 457377, 457447, 453304, 450804, 462096, 465078, 455396, 458961, 459211, 465219, 464808, 461347, 464441, 466423, 471948, 469640, 472818, 471003, 464021, 464148, 470325, 465319, 463433, 459339, 458945, 466382]
22025D66382K842k205L188O315m42n815K725J80p284j820Q46m538J265P359K789
22010D71787r768M511J2334o250l704o978L058J694l445L579k890N1Q51N351M394
21995D74575R213K058o908L1m338M520L463r692R64R931k097j809l678k730L161
21980D76664L230K453L78l513k645j3281n83P461N11J054N022j612o531r188N914
21965D65334n713M621P997J017J585K317K785m290j0160O754k78k500K91l92k70
21950D69098j961j851Q159Q705K219l115R523O020o992m885J361l142l829k670
21936D76640p606j804J063K425O600L864M256k778n050m699J606L834Q365L272
21922D89988m237p560j0755R25r72N727M281L8Q31k26K723N115n352L46L847P459
$$ y = [466382, 469224, 467019, 470207, 476522, 476080, 470265, 472990, 473170, 465886, 464066, 464912, 460374, 461639, 468998, 471787, 462019, 466530, 478864, 472614, 468910, 461932, 464990, 466684, 463239, 466818, 463928, 463979, 464830, 470181, 474575, 483788, 485846, 478938, 478969, 474631, 479151, 482614, 472922, 473886, 483817, 481720, 479911, 476233, 473503, 476664, 479894, 482347, 482725, 479212, 476567, 463286, 462703, 470164, 470675, 471729, 476751, 475139, 468608, 459420, 465334, 459621, 464242, 472239, 473256, 474841, 477158, 479943, 475653, 465493, 472247, 471969, 469469, 469760, 469368, 469098, 467137, 465286, 473445, 482150, 484369, 481254, 490777, 496797, 489805, 484920, 486281, 483139, 479310, 476640, 469034, 467230, 468293, 470718, 477318, 481182, 485438, 482660, 477610, 472911, 474517, 478351, 486716, 489988, 485751, 478191, 467436, 468361, 467389, 473116, 477397, 477435, 478266, 478040, 480763, 485878, 480526, 480872, 484719, 492178]
21906D92178m127L954o00o161P92n90k034N415m007m23J0306K039J0213J89L653
21891E10797J160N521r043P04J3539j327q515j2017j1912k109J756N664q061k234
21877D83923M350n25l594Q955L615n719o982q967Q26L295N13J182L068J3683k515
21862D95108m625L839Q266J907o855j0550K327P058k806m193n340j295M582O731
21848D94154L690j076J294M050P171o218M037P245q867L860Q0j1417l934K349
21834D96418n863L591k18k335P777l411p062j154R509R37k348J904O102J0570
21820E14417M45q40j1010L685q6l709p300j2117P555M192M475q9N585M505M83
21805E10191l794j2408J783O463O763m524M14j532K385P078m421l701l465r3P232
$$ y = [492178, 488051, 492005, 491405, 485244, 486036, 485446, 483412, 488827, 484820, 484397, 494703, 496742, 506955, 507144, 510797, 511957, 517478, 508435, 509139, 522678, 521351, 512836, 500819, 488907, 486798, 488554, 494218, 486157, 483923, 488273, 487748, 484154, 493109, 496724, 491005, 484023, 475056, 475882, 479177, 479690, 480872, 483940, 497623, 495108, 490483, 494322, 502588, 504495, 497640, 487090, 489417, 496475, 493669, 489476, 484136, 482841, 487423, 494154, 497844, 496768, 498062, 502112, 509283, 503065, 507102, 514347, 505480, 509340, 509420, 498003, 494069, 496418, 490555, 494146, 493928, 491593, 499370, 495959, 488897, 487743, 497252, 498189, 495841, 497745, 503847, 514417, 514862, 514022, 503012, 506697, 506611, 502902, 495602, 483485, 491040, 495232, 499707, 499618, 505203, 509708, 510191, 506397, 493989, 495772, 502235, 508998, 504474, 504888, 503356, 505741, 512819, 508398, 504697, 501232, 501139, 508371]
21790E08371j808N813k447q1K477o773l861k436m7J1680J550n687J926m365m647
21775D99665K856L522K181l567m79r93M972L053k715M830J105o910J370L151K07
21760E12248P708m01k851k221p66J092m618K817J0417N261o854j82P886l464k740
21745E23332l395n603K111q222j5173m596L594J553L496K813L909N883n88n092
21731E04022k630Q670M928M905m166M049k695j197J228J415j249j420k548p298
21717E06014n372l448J7346R779n461j392j433L553K501l917K742m809j474j644
21703E12985r03n13m949k876K455J1251K994j180J1430l225k875l662J232m403
21689E17761j846O345O118J84K028m40k367q380P98K59K087J656j085l402m388
$$ y = [508371, 506563, 512376, 509929, 509848, 512325, 505552, 501691, 499255, 499208, 510888, 512438, 506751, 508677, 504312, 499665, 502521, 506043, 508224, 504657, 504178, 503185, 508157, 511210, 508495, 513325, 514430, 507520, 508890, 512041, 512248, 519956, 519555, 516704, 514483, 513717, 514809, 510191, 513008, 523425, 528686, 521832, 521650, 529536, 526072, 523332, 519937, 514334, 516445, 508223, 493050, 488454, 492048, 493601, 497097, 499910, 503819, 509702, 509114, 504022, 501392, 510062, 514990, 519895, 515729, 519778, 517083, 515886, 517114, 518529, 517280, 515860, 513312, 506014, 500642, 497194, 514540, 524319, 518858, 517466, 516033, 519586, 522087, 518170, 520912, 516103, 514629, 512985, 512082, 511569, 506620, 503744, 506199, 517450, 520444, 519264, 530694, 527469, 524594, 520932, 522164, 517761, 515915, 522260, 528378, 528562, 530590, 530150, 527783, 519403, 520201, 520460, 522547, 524203, 523118, 519716, 515328]
21674E15328l91P651Q640M685K734j09l368j3889k824J831O637j792j190R466
21660E33409L099M308k21l874J88P846l275m085n040j699N824O486m132J884o537
21645E34181l686N45r469j403L094k831j747n52P365P333j169J1995Q045l382
21631E48319j084j421q176m740n31J1484j026r728J117K459L721L945k133q72
21617E41334l263J2903Q316n169k321J556P58R27k793J530J14q657l426Q67q333
21602E34343M875o069M072L543j0071k189N282J449O507O027M399K113p908j721
21588E44652l90j744J489Q743o234m014q0n51J815J865K678L285l369q16n824
21573E41505K953N650J669N382J988j915N675q436k841m202m920N89N859P319
$$ y = [515328, 514937, 522588, 531228, 535913, 538647, 538538, 535170, 521281, 518457, 520288, 526925, 525133, 523943, 533409, 536508, 540816, 540595, 536721, 536909, 544755, 541480, 537395, 532355, 530656, 536480, 542966, 538834, 540718, 534181, 530495, 531040, 521571, 520168, 523262, 520431, 518684, 518132, 525497, 532830, 531661, 543656, 551701, 548319, 547235, 545814, 537638, 532898, 532367, 543851, 542825, 533097, 534214, 536673, 540394, 544339, 542206, 541334, 538071, 550974, 559290, 554121, 551800, 553356, 554114, 555041, 552248, 553778, 553892, 545235, 541809, 542676, 534343, 539218, 533149, 537221, 540764, 530693, 528504, 533786, 535235, 541742, 547769, 552168, 554281, 546373, 544652, 544262, 542518, 544007, 552750, 546516, 542502, 542422, 541871, 543686, 545551, 548229, 551514, 548145, 547329, 541505, 544458, 550108, 551777, 557159, 559147, 557232, 562907, 554471, 551630, 547428, 542508, 543097, 548956, 556275]
21559E56275M605q392m260m544L837k992o111Q406O973m983J705L663j450L12
21545E53044K926k592k779l251K976J3325K783p741p162m361k894m921N753J324
21531E46430l066L716Q640M875k279o640l32j248M103L361L503M494Q513K507
21517E76577l936r591k421n880o65k662N18R131r560P70R73M825K303K950j318
21502E62014N099j1356M35L724p58O692j111N201m018l323j950J036L494N972
21488E71151j407j3708n016L338K261J6064P017K266J156n125q731k52j55M245
21474E73104L814k65L154Q691l00j3543j1384l732Q47j479J68m223L687l801q20
21459E53918M386P950R304j76N054K302l497p059j294L195Q72K759l202j3304
$$ y = [556275, 560880, 552488, 548228, 543684, 547521, 544529, 538418, 546824, 553797, 548814, 550519, 554182, 552732, 553044, 555970, 553378, 550599, 547348, 550324, 563649, 566432, 558691, 551529, 547168, 544274, 539353, 545106, 546430, 543364, 547080, 555720, 560595, 558316, 551676, 551344, 550096, 554199, 557560, 561063, 565557, 574070, 576577, 572641, 563050, 560629, 554749, 554084, 551422, 551940, 561071, 551511, 552281, 553254, 558079, 560382, 563332, 562014, 567113, 555757, 556192, 559916, 559158, 565850, 564739, 569940, 565922, 562599, 560649, 561685, 565179, 571151, 569744, 556036, 551020, 554358, 556619, 572683, 579700, 581966, 583122, 577997, 569266, 569014, 568859, 573104, 576918, 576653, 579807, 588498, 588198, 574655, 563271, 559539, 560386, 558907, 559075, 554852, 558539, 554738, 553918, 558304, 566254, 575558, 575382, 580436, 582738, 579241, 572182, 570888, 574083, 574955, 577714, 574512, 561208]
21445E61208k838O595J1016K796M055J642K450J165j0038o883o164L914Q525R315
21431E86758J713o660l51N023R08l931n880J114M066K793J686N453r401m643N53
21416E79201J887k276Q10n711j244M660n90M665o817p208J1O993J0836L682o67
21401E88232k711l117j103j712r160K263O171m612j31J903J075R598O250N239
21387E98185n275k858m485j34P861J973O881K680p508o162P00K425J091k678p355
21372E85341J976P39n315L970L074l088j608M890P439R511q21o339r044l546P159
21357E94338l27o12N04M944m676j487p153j121L600O408K883M045N017m37p899
21342E98027m295n222P961R295N68p881J0175K343q008o35M647m634P516J260
$$ y = [561208, 558370, 564965, 575981, 578777, 582832, 584474, 586924, 588089, 578051, 571168, 565004, 568918, 577443, 586758, 588471, 581811, 581460, 586483, 587391, 583460, 577580, 578694, 582760, 585553, 587239, 592692, 583291, 578648, 579201, 581088, 578812, 579622, 573911, 572667, 577327, 576737, 581402, 574585, 567377, 567388, 574381, 585217, 588899, 588232, 585521, 582404, 581301, 579589, 570429, 572692, 578863, 574251, 574120, 576023, 577098, 586696, 592946, 598185, 592910, 590052, 585567, 585433, 593294, 595267, 602148, 604828, 597320, 591158, 591858, 594283, 595374, 592696, 585341, 587317, 588056, 582741, 586711, 589785, 586697, 585089, 589979, 597418, 606929, 606108, 599769, 590725, 587179, 594338, 594011, 593399, 593903, 598847, 594171, 592684, 585531, 584410, 588010, 594418, 597301, 601346, 606363, 605926, 598027, 593732, 588510, 596471, 605766, 606334, 598453, 608628, 610971, 602963, 602328, 606975, 602341, 609857, 611117]
21328F11117k454j172p4m095k10k524q378L23R517N373l797o158O977R938L250
21313F17633N705m499j5499j296j724K498r20L042M173N824M494K323K612n154
21299F19212k503K025j348N487O664l625n462l974O84j1032r997r34K152J6885
21285F14234J2285k993J42o548j0042j139J451N198M341p510m834J380O100m18
21271F11647O749N223P999P680p33l626n149j040l600j352O824l745k13M685N147
21256F36496n470p843o558K9K475o997o14Q287N446K775j061j456m91q732L976
21241F20262J583L504Q20o291n01J957P8O659Q313J0127j4406j595L068j175k704
21226F29699k382M548p87k835L516J413L069J176N388Q33r068m922L603M440l011
$$ y = [611117, 608663, 607491, 607417, 603322, 603112, 600588, 592210, 592533, 602050, 607423, 603626, 597468, 604445, 614383, 617633, 623338, 618839, 603340, 602044, 600320, 602818, 601898, 604940, 609113, 614937, 619431, 621754, 624366, 619212, 616709, 618734, 617386, 622873, 629537, 625912, 620450, 616476, 617160, 606128, 596131, 595197, 597349, 614234, 626519, 623526, 623668, 617120, 607078, 605939, 607390, 612588, 616929, 609419, 604585, 605965, 612065, 611647, 618396, 623619, 631618, 639298, 638565, 634939, 629790, 628750, 625150, 623798, 630622, 626877, 626664, 631349, 636496, 631026, 623183, 616625, 616654, 619129, 612132, 611518, 619805, 625251, 628026, 626965, 625509, 625018, 616286, 620262, 621845, 625349, 626169, 619878, 619377, 621334, 621412, 628071, 636384, 646511, 632105, 630510, 633578, 632403, 629699, 627317, 631865, 631078, 628243, 631759, 633172, 636241, 637417, 642805, 643638, 634570, 629648, 633251, 637691, 634680]
21211F34680o457m01j622R05M941l499j656o382j270P395J1112L713n347p875
21197F28237l19o45n50m411r390P324P604k041J949m996J29L393K298P047Q659
21182F44288j81j854p22M72o738N049N600j570k602j363K872k737m335J161m6
21167F37294j34K509N635M090K670j734j565l48l395L740K542j0062m245K895
21153F39892M465L310j0196k412M780Q46R799k475J240L793K65m336k680L456
21139F49747R70J112O501n363K68J114N724L630k74q871M5K933l292N841k246
21124F57839j808N889j0736m638O746j757K186O214Q16K170M796J127n408j831
21110F61605O426M885K117J440j1560j0977n382L323J323Q278J1825N109N297
$$ y = [634680, 628223, 627822, 626200, 627105, 632046, 628547, 626891, 620509, 619239, 626634, 637746, 641459, 636112, 628237, 627918, 627273, 626723, 622312, 612922, 620246, 627850, 625809, 627758, 622762, 622891, 626284, 628582, 635629, 644288, 644107, 642253, 641531, 642003, 635265, 640314, 645914, 644344, 641742, 640379, 643251, 640514, 636179, 637340, 637294, 637160, 639669, 645304, 649394, 652064, 650330, 648765, 648417, 645022, 648762, 651304, 641242, 636997, 639892, 644357, 647667, 637471, 635059, 639839, 640685, 650484, 648009, 649249, 653042, 653307, 648971, 646291, 649747, 650717, 651829, 658330, 652967, 653235, 654349, 660073, 663703, 663429, 654558, 654603, 657536, 654244, 660085, 657839, 656031, 661920, 651184, 646546, 653292, 651535, 653721, 659935, 660751, 662921, 667717, 668844, 663436, 661605, 668031, 672916, 675033, 676473, 664913, 653936, 648554, 651877, 653200, 661478, 673303, 678412, 683709]
21097F83709m632l098K059K740p482P54j479j0211l240Q00l808k263P312L964
21083F65125L28K813M680M209q938K779j034Q4P174N561l16J703L537l587p791
21068F76327M881N54q23J059o67q474J287L709n426j471R987L982j408R447j553
21053F91411p579L490J405j1857m710J1774J45M412k011K836L423N99O16j516
21039F92438j5018M092O373R050j916n642K006k388q023N415Q929L882M676k390
21025G01484n751n371l823P0Q482L080k116p006r777M115P845M754M953m067j986
21010F94886J833O378m33p570M036O988l042N796L995p525j5578L769P866k973
20996F98426k679j446l2O724M199l77N840N816Q346k580p220q273r68Q183N258
$$ y = [683709, 679077, 675979, 678038, 680778, 673296, 674050, 672571, 662360, 659120, 659920, 656112, 653849, 661161, 665125, 665453, 668266, 672946, 677155, 668217, 670996, 669962, 670046, 677220, 682781, 682465, 684168, 687705, 684118, 676327, 681208, 681762, 680939, 681998, 681331, 672857, 674144, 677853, 672427, 670956, 680943, 684925, 683517, 692964, 691411, 683832, 687322, 688727, 676870, 672160, 683934, 684079, 688491, 686480, 689316, 692739, 693338, 693954, 692438, 677420, 681512, 687885, 696935, 695019, 689377, 691383, 688995, 680972, 686387, 695316, 699198, 703874, 701484, 695733, 690362, 686539, 686609, 695091, 698171, 696055, 689049, 679272, 683387, 691232, 695986, 700939, 696872, 694886, 696719, 703097, 702664, 695094, 699130, 706118, 703076, 708872, 712867, 705342, 689764, 693533, 701399, 698426, 695747, 694301, 694269, 700993, 705192, 704815, 710655, 716471, 724817, 722237, 715017, 706744, 705776, 713959, 719217]
20981G19217j2135K481J1470l653o302l461N99N116J853k238l948m106M303R217
20967G18413M28m14R6N378N313j741J968o87K480m200m154L44o556K686N005j717
20951G22642m980l035l939P603K76P77O088R94l98N505Mp777N500L884l517K633
20935G32260J888l083j0649n57L732R125l508n82j418R41l110L322N564l213M26
20920G31138K92k347l541P967J737J044Q755l979k514J1130K069p365j1312K646
20906G35720L412J109M447m793k865m870l625l503K921J935P745k399M060J247
20892G40541j5242n72P588J770J960l37K101o968o59J5449o6j530l168K747j033
20877G42581j001K142l340k495k896L34M268L274L321p422K318L903N702K779
$$ y = [719217, 707082, 709563, 721033, 717380, 711078, 707617, 708216, 713332, 715185, 712947, 708999, 704893, 709196, 718413, 718841, 718427, 718523, 723901, 729214, 727473, 729441, 728754, 731234, 727034, 722880, 723224, 716668, 719354, 724359, 722642, 717662, 714627, 710688, 718291, 718567, 719344, 725432, 726426, 726028, 731533, 731537, 723760, 729260, 733144, 729627, 732260, 734148, 731065, 720416, 719859, 723591, 732716, 729208, 728626, 727208, 728149, 725039, 728361, 733925, 730712, 731138, 731430, 729083, 725542, 733509, 735246, 736290, 745045, 741066, 738552, 749682, 751751, 744386, 733074, 735720, 739132, 740241, 744688, 739895, 737030, 732160, 728535, 725032, 727953, 729888, 737633, 735234, 739294, 740541, 725299, 724727, 732315, 734085, 736045, 735708, 737809, 730841, 730182, 745631, 745565, 744035, 740867, 743614, 742581, 741580, 743722, 740382, 737887, 734991, 735325, 739593, 742867, 746188, 738766, 741084, 744987, 750689, 753468]
20863G53468k195L717l383L136M898K31k397N470o4l784r631J23m406p4K101J2266
20847G59476k671p927m602J634K508J752K126J1388q58Q43O104K352l304k509
20833G66312J750J2008J0960j73j4557q937l582N168J787K845L410k554R9r033
20819G65503n584M118j048K678M009P539q107j519J636L948R50j544l146n070
20805G64363L844Q986o858j278M767m038k681M710J54Q39J354K587O761N987l538
20790G85959m013N175J32m172L989P43l139M9o03l266l032N397M226N56k358J306
20774G86949k734M538M896L248K833L060M228N710m961L01o162q930K703J0p432
20759G88257M826Q424n896j681O535j393j2871r846o70J0973K053L760J3128N686
$$ y = [753468, 751273, 754990, 751607, 754743, 759641, 759872, 757475, 762945, 762881, 759097, 749466, 749589, 745183, 745109, 747210, 759476, 756805, 748878, 744276, 745910, 748418, 750170, 752296, 763684, 762826, 763669, 769773, 772125, 768821, 766312, 768062, 780070, 791030, 790857, 776300, 767363, 763781, 768949, 770736, 773581, 776991, 774437, 774536, 765503, 759919, 764037, 762989, 765667, 769676, 777215, 769108, 767589, 769225, 773173, 774123, 772579, 769433, 764363, 768207, 777193, 770335, 769057, 773824, 769786, 767105, 771815, 771969, 772808, 774162, 776749, 783510, 789497, 785959, 781946, 787121, 787253, 783081, 787070, 787813, 784674, 784723, 784120, 780854, 777822, 783219, 787445, 788001, 785643, 786949, 784215, 788753, 793649, 796897, 799730, 802790, 807018, 812728, 807767, 808068, 801906, 792976, 795679, 795689, 788257, 793083, 801507, 795611, 793930, 800465, 799072, 786201, 776355, 775685, 786658, 788711, 792471, 805599, 811285]
20745H11285N060J063n805j253K140k405l422J568k150j179K655Q88N789M136
20731H18370O574j540n069l835K19k063J098J0837n69m064o824M41o54J180l392
20716H10709N23P41n351q956m165L141P046P567M540j961J383o94R81P171p114
20701H15561q901j600N004K348j450O185P763J713o32m171P448N746R72P3K620
20686H38679P491j188j2263m235M987K503J627l792Q304R879O57n872j080m918
20672H40779k001n811J313r60j388J0934L986L187j014n58n048m590M097J0614
20658H53540N395o289k772p23p281j0075p63P578J0058J76o474J839K88l025q34
20643H40638Q508Q24L259L001m595L217M560o215o311M739l73m567L95P089L158
$$ y = [811285, 816345, 817408, 811603, 810350, 812490, 810085, 806663, 808231, 806081, 804902, 807557, 808445, 814234, 818370, 824944, 823404, 818335, 814500, 814719, 812656, 813754, 824591, 824022, 819958, 813134, 813575, 812921, 814101, 810709, 811232, 811973, 806622, 797666, 793501, 796642, 803688, 811255, 815795, 813834, 815217, 814523, 815504, 822675, 815561, 806660, 805060, 810064, 812412, 810962, 817147, 824910, 826623, 825991, 821820, 829268, 835014, 835986, 836059, 838679, 846170, 844982, 832719, 828484, 833471, 835974, 837601, 833809, 842113, 851992, 852649, 846777, 845697, 840779, 838778, 832967, 834280, 833320, 831932, 842866, 846852, 850039, 849025, 848467, 843419, 838829, 842926, 853540, 858935, 852646, 849874, 849151, 841870, 831795, 831032, 838610, 848668, 848844, 842370, 844209, 844497, 841472, 840638, 849146, 849970, 853229, 856230, 851635, 854852, 859412, 853197, 846886, 851625, 851252, 846685, 847080, 854169, 857327]
20628H57327J075L413J701N196M88j5415o418R402J2819J1464M767m814M890n028
20614H80867l14o49o785l730n987p739N499N189J924K126M952M536M225o6J23
20599H84171o583n961J799O243M087J461M710j832j0199m451P462n237l315N765
20585H78120O815J3993P753k1180j3500K120J0970Q168J398O29q208j1268j413
20572H74397O617J3216R411N252n067M458n717P03j1076r152j953o242J802N860
20558H82509J4257M578j1326P066K248p398m685O976P705k002m401O937J76k777
20544H99863l833N393j082j385L750J069L541K957o118M261K232l942L182J517
20530I11405L861O357L157K983N047q69j0294k794m065j569N311N038P329N98
$$ y = [857327, 858402, 861815, 863516, 868712, 869200, 853785, 847367, 856769, 869588, 881052, 885819, 881005, 885895, 880867, 880553, 879904, 873119, 869389, 863402, 855663, 861162, 866351, 868275, 870401, 875353, 879889, 884114, 884048, 884171, 877588, 871627, 873426, 879669, 883756, 885217, 889927, 888095, 877896, 873445, 880907, 875670, 872355, 878120, 884935, 898928, 906681, 885501, 872001, 874121, 885091, 893259, 894657, 895286, 887078, 875810, 874397, 881014, 894230, 903641, 908893, 903826, 908284, 902567, 903270, 892194, 883042, 881089, 874847, 876649, 882509, 896766, 901344, 890018, 897084, 899332, 891934, 887249, 894225, 901930, 899928, 895527, 902464, 902640, 899863, 896030, 901423, 900341, 898956, 902706, 903775, 907316, 910273, 904155, 908416, 910648, 906706, 909888, 911405, 915266, 921623, 924780, 927763, 932810, 931941, 921647, 918853, 914788, 913219, 918530, 923568, 930897, 931495]
20516I31495o697l494M45m07n29Q339K636p163n062Q08l196m250L635L682J539
20501I21781O587K517j689m221N418l00j057j693K521Q998l14n50R036K198L72
20486I49604l063Q137J379j1035j0185m527M552M380j198N247P267J972k299J919
20472I52150l136j01O654K507M017L078K295j528m501p710K234l725q74M352N986
20457I61698j247L748R483m078k27k244q467J448K846J0059p532m371q255J099
20443I53960M67J4595J2497K605n608o002k492K02J104J061R540p6k284r292Q59
20428I71136K557K439l035J879O930O613J121K903M619L108p033k180J224k310
20414I89971m533l272J785J2499J506n156o908R98P280K39m23K915k330q46n395
$$ y = [931495, 924798, 921304, 921749, 921342, 920813, 929152, 931788, 924625, 919563, 920371, 917175, 912925, 916560, 920242, 921781, 928368, 930885, 929196, 924975, 930393, 930093, 929036, 927343, 929864, 938862, 938548, 937998, 947034, 949232, 949604, 946541, 954678, 956057, 945022, 934837, 930310, 934862, 939242, 938044, 943291, 950558, 952530, 950231, 952150, 949014, 948913, 955567, 958074, 962091, 965169, 967464, 965936, 961435, 953725, 955959, 952234, 951360, 955712, 961698, 960451, 964199, 973682, 969604, 969377, 967133, 958666, 960114, 962960, 973019, 965487, 961116, 952861, 953960, 954427, 969022, 981519, 984124, 978516, 972514, 970022, 970224, 971328, 972389, 981929, 981853, 979569, 970277, 971136, 973693, 976132, 973097, 974976, 981906, 988519, 989640, 992543, 997162, 1000270, 993237, 991057, 992281, 989971, 985438, 982166, 983951, 996450, 997956, 992800, 985892, 986890, 994170, 994409, 993986, 996901, 994571, 993725, 988330]
20399I88330J87K780P737K611L124j641q854k957K72J968L382J428n839k037N022
20384I95513N231L473J6080L157n564O54K024k200k008L022k65o310N72J048O38
20369A015065J040J628j1185j766K794J4874Q323K548k207j998n69O233m175L20
20355A030925M059k990N100K115l164k771O54m125M528K289M46p90l148j2191
20341A020937o992M155J1481P897L776Q581N066M633n084K514k166J942J401m491
20327A053650m496J185K885j939L192L130P504P9q675l026L288K308J357p514
20313A052928J210J1240O031N49m17N240P872p571J507K119o706J792N030n11
20299A080313n070L200j72r36m572o219L427J0665M305P483J218l915J193L710
$$ y = [988330, 988517, 991297, 999034, 1001645, 1004769, 1003128, 994274, 991317, 991589, 993557, 996939, 998367, 992528, 990491, 995513, 1000744, 1004217, 1020297, 1023454, 1017890, 1018544, 1020568, 1018368, 1016360, 1019382, 1019117, 1012807, 1013379, 1014427, 1015065, 1016105, 1017733, 1006548, 1004782, 1007576, 1022450, 1030773, 1033321, 1031114, 1029116, 1028547, 1034780, 1030605, 1030925, 1034984, 1031994, 1037094, 1039209, 1036045, 1033274, 1033928, 1029803, 1034331, 1036620, 1037066, 1036276, 1033128, 1020937, 1013945, 1018100, 1029581, 1037478, 1041254, 1049835, 1054901, 1059534, 1054450, 1056964, 1054798, 1056740, 1058141, 1053650, 1049154, 1050339, 1053224, 1051285, 1054477, 1057607, 1065111, 1065190, 1056515, 1053489, 1056777, 1059085, 1060442, 1052928, 1054138, 1065378, 1071409, 1071958, 1071541, 1076781, 1084653, 1077082, 1078589, 1080708, 1074002, 1075794, 1080824, 1080313, 1075243, 1078443, 1078271, 1077335, 1072763, 1066544, 1069971, 1080636, 1084941, 1092424, 1093642, 1089727, 1090920, 1094630]
20285A094630j672j613N827k65N537l395p944O20K671K995m793m926J0338O079
20271A104089m457M75p6P269O927o32m22q24K087J181n495K922l245L9M30j435
20255A108833o231P875J5324M267J508j1391r622j654O20L966J2632j495o895
20242A117737J469l76k327J164Q65J0018Q74N604J732J0354k704r207j370O002
20228A139835j191R240J228n245Q729Q687P79l818J188J758L259k253O919o29
20214A168486l376j306l533j628K290l80k046M420j818o2P410M409n380l047K763
20199A167202k687j690J030M408M090R79P21m64m1L359M735K903P825k549p832
20184A181989p98L896p5O029n53J671J207L919N299J423j852j2668r599O446M702
$$ y = [1094630, 1092958, 1091345, 1097172, 1096907, 1102444, 1099049, 1091105, 1091725, 1094396, 1097391, 1092598, 1087672, 1098010, 1104089, 1099632, 1100107, 1100031, 1107300, 1114227, 1113595, 1113173, 1112349, 1114436, 1115617, 1110122, 1113044, 1109799, 1109838, 1110268, 1108833, 1102602, 1110477, 1125801, 1130068, 1131576, 1120185, 1110563, 1108909, 1109529, 1113495, 1126127, 1124632, 1117737, 1119206, 1118830, 1116503, 1117667, 1118532, 1128550, 1129424, 1135028, 1136760, 1147114, 1144410, 1135203, 1133833, 1139835, 1138644, 1147884, 1149112, 1143867, 1152596, 1161283, 1162062, 1158244, 1159432, 1161190, 1164449, 1162196, 1169115, 1168486, 1165110, 1163804, 1160271, 1158643, 1160933, 1160553, 1158507, 1162927, 1161109, 1161047, 1168457, 1172866, 1167486, 1164439, 1167202, 1164515, 1162825, 1163855, 1168263, 1172353, 1173332, 1174053, 1173589, 1173548, 1176907, 1181642, 1184545, 1192370, 1189821, 1181989, 1181191, 1185087, 1185012, 1191041, 1190488, 1192159, 1193366, 1197285, 1202584, 1204007, 1202155, 1189487, 1179888, 1186334, 1191036]
20169A191036P647J4035N759M775j4748p214M144m029p168j763O98M161j919K944
20155A198358J2886J1256M134o540k444K408k324q055o183J0607J6118L865k134
20142A231952m928K967l561j827k416O336N097L397L514P097o012J324O307L328
20128A252575L533k807n563n903k261Q935O971K994L62j74J523p617l322M414
20114A253660R225m64J119J4349m549n719p355r891j265J1958J0922J69J896L022
20100A277077n2L244Q323m000o180m996j0518p720P053J4095O813j609j664M192
20086A284058M904q448J698L971l427O074L754M330k915N330J3746l222J517O677
20072A318047N09r81k656L875M957p655o469N938L453k865j300m897O303K248
$$ y = [1191036, 1198683, 1212718, 1218477, 1223252, 1208504, 1201290, 1205434, 1201405, 1194237, 1192474, 1193172, 1197333, 1195414, 1198358, 1211244, 1222500, 1226634, 1220094, 1217650, 1220058, 1217734, 1209679, 1203496, 1214103, 1230221, 1234086, 1231952, 1227024, 1229991, 1226430, 1224603, 1222187, 1228523, 1233620, 1237017, 1240531, 1247628, 1241616, 1242940, 1249247, 1252575, 1256108, 1253301, 1247738, 1241835, 1239574, 1248509, 1255480, 1258474, 1258836, 1258662, 1260185, 1252568, 1249246, 1253660, 1262885, 1262421, 1263540, 1277889, 1273340, 1267621, 1260266, 1250375, 1249110, 1261068, 1271990, 1272159, 1274055, 1277077, 1277025, 1280269, 1288592, 1284592, 1278412, 1273416, 1262898, 1255178, 1262231, 1276326, 1283139, 1281530, 1279866, 1284058, 1288962, 1280514, 1282212, 1286183, 1282756, 1288830, 1292584, 1296914, 1293999, 1299329, 1313075, 1309853, 1311370, 1318047, 1318556, 1317575, 1314919, 1318794, 1323751, 1316096, 1309627, 1315565, 1319018, 1316153, 1314853, 1309956, 1316259, 1318507]
20058A318507J1109L983j514J465n780j1822L75R954Q658L398j401q266j59J587
20044A330094J0335P085k455j388K983j315k048K574R274R993j480N58J865j41
20030A365934R10M959J824k255o789j0510o188L816J3887J3969o981j1338K432
20017A363670Q565J2018K424q41q84p12K474L901k564j054k104J011M171K243
20003A392318j069m84J974k69O66O445J696k773k193O903J2397M476k573P960
19989A425474r15p650l763Q98R99K041J0771M704k294q178M503R257L649k477
19975A437019q43O756J531O22p25Q333N370l476K758j181L466J557m272L098Q807
19960A468820o5O26J320M553k683o748j243K900o65R182Q335n003L446N179J235
$$ y = [1318507, 1329616, 1333599, 1332085, 1333550, 1327770, 1315948, 1316323, 1326277, 1334935, 1338333, 1336932, 1328666, 1328507, 1330094, 1340429, 1347514, 1345059, 1343671, 1346654, 1345339, 1343291, 1345865, 1355139, 1365132, 1363652, 1364210, 1366075, 1365934, 1366844, 1371803, 1373627, 1371372, 1364583, 1354073, 1347885, 1351701, 1365588, 1379557, 1372576, 1361238, 1363670, 1372235, 1384253, 1386677, 1385836, 1384952, 1384240, 1386714, 1390615, 1388051, 1386997, 1384893, 1385904, 1390075, 1392318, 1391249, 1390765, 1392739, 1392470, 1393136, 1399581, 1401277, 1398504, 1396311, 1403214, 1415611, 1420087, 1417514, 1425474, 1424559, 1416909, 1413146, 1414044, 1415043, 1417084, 1427855, 1432559, 1430265, 1422087, 1426590, 1435847, 1439496, 1437019, 1436176, 1442932, 1444463, 1445085, 1444360, 1452693, 1458063, 1454587, 1457345, 1456164, 1459630, 1461187, 1456915, 1460013, 1468820, 1468755, 1469381, 1470701, 1475254, 1472571, 1465823, 1464580, 1467480, 1466815, 1475997, 1484332, 1479329, 1482775, 1487954, 1489189]
19945A489189J1668L188K889o575J586O680j968l634n030N30P013l40k405Q412
19931A511203J7644Q748q503k315n928n383Q578M798K662q975j621K12P631N814
19917A534565l136M910N528J941O588J0357m374m631p132k34N871P587L601n058
19903A556383l230K226k030n015J3242K4743J394k414p340j941Q593M299j242
19890A587668n08l10j317Q879N882k124n62r27p894l03j538R813J427M231J31
19875A602548K795L507P202M117N297J960P409n058K593O665q816m838O006N859
19861A637246j088J410m910o656J1379P456K680L401L705k77J291K794Q115j704
19847A664842K616O253L540NK721j989l075R49M186m24J4296J1324j76k191o435
$$ y = [1489189, 1500857, 1504045, 1506934, 1500359, 1501945, 1508625, 1506657, 1503023, 1497993, 1498523, 1505536, 1505196, 1502791, 1511203, 1528847, 1537595, 1529092, 1526777, 1520849, 1515466, 1524044, 1528842, 1531504, 1522529, 1520908, 1521120, 1528751, 1534565, 1531429, 1536339, 1541867, 1543808, 1550396, 1560753, 1556379, 1551748, 1544616, 1544382, 1550253, 1557840, 1561441, 1556383, 1553153, 1555379, 1553349, 1548334, 1561576, 1586319, 1587713, 1585299, 1577959, 1576018, 1584611, 1588910, 1587668, 1587160, 1586850, 1585533, 1594412, 1600294, 1598170, 1597608, 1596681, 1588787, 1588484, 1586946, 1596759, 1598186, 1602417, 1602548, 1605343, 1608850, 1616052, 1620169, 1625466, 1627426, 1634835, 1629777, 1632370, 1639035, 1630219, 1625381, 1631387, 1637246, 1636158, 1637568, 1632658, 1626002, 1637381, 1644837, 1647517, 1650918, 1654623, 1654346, 1655637, 1658431, 1666546, 1664842, 1667458, 1673711, 1677251, 1677256, 1679977, 1677988, 1674913, 1675862, 1680048, 1679624, 1693920, 1705244, 1705068, 1702877, 1696442]
19832A696442l285P560M376N252J849J064j100j887j510L172J0478M778L024m325
19818A725888q249J0702J1445J329M173K829Q909P648m038l23j505K481Q38N916
19804A768043j367L096N103j364K395P227M628j608p023P219L386L703l97J481
19790A794522k774j257L648J782M894K237N80j765M315O555l293N844J4222P473
19776A836983J790l827q237O684J2148K456O457M905P119j2488k130K934O124
19763A860918N349P341O550k25J285O438O17p926m996P154J2725J918k907O499
19749A900740l335M996M938J371N567P012K659k024k835J777J0248O494k350j793
19735A933465L686O534P62Q797J4371O57J529J0448R63l908m734K139O808m91
$$ y = [1696442, 1693157, 1700717, 1705093, 1710345, 1712194, 1713258, 1712158, 1710271, 1708761, 1711933, 1722411, 1727189, 1730213, 1725888, 1717639, 1728341, 1739786, 1741115, 1745288, 1748117, 1757026, 1764674, 1760636, 1760313, 1758808, 1761289, 1762127, 1768043, 1766676, 1769772, 1774875, 1773511, 1775906, 1783133, 1787761, 1786153, 1779130, 1786349, 1789735, 1793438, 1793041, 1794522, 1791748, 1790491, 1794139, 1795921, 1800815, 1803052, 1803632, 1801867, 1806182, 1812737, 1809444, 1815288, 1829510, 1836983, 1838773, 1834946, 1826709, 1833393, 1845541, 1847997, 1854454, 1859359, 1866478, 1853990, 1851860, 1854794, 1860918, 1866267, 1873608, 1880158, 1879933, 1881218, 1887656, 1888273, 1880347, 1875351, 1882505, 1895230, 1897148, 1894241, 1900740, 1897405, 1902401, 1907339, 1908710, 1914277, 1921289, 1923948, 1921924, 1919089, 1920866, 1931114, 1937608, 1935258, 1933465, 1937151, 1943685, 1944447, 1953244, 1967615, 1968272, 1969801, 1980249, 1981212, 1977304, 1972570, 1974709, 1981517, 1981026]
19721A981026J289R770L724O36O823Q538n226j0687Q007J624J602K558M383O059
19707B020126K042K167P110J0724K788L202k653L316J3503l24J603M75O507n15
19693B070071L081K367L891L697Q94O839O647O139K887K521L681N557J2493J1459
19679B142224n85l577m049o40j623N982J2713N904J0J3048P063l159k940M026
19665B174397M978O096J1961J1888J7105R944j855m165j0989r039N855J1754K379
19652B230309L802O002L95N809N858O406O358J4235J3564L454k66j721L68L653
19638B298226J2575R432K29M477M927P001M566J220J0105J7197J6657P941Q461
19625B403014N408J0490J6506R477R848J5644K326J3935J7720J9315J0723P528
$$ y = [1981026, 1982315, 1992085, 1995809, 1996445, 2003268, 2011806, 2006580, 1995893, 2003900, 2005524, 2007126, 2009684, 2014067, 2020126, 2022168, 2024335, 2031445, 2042169, 2044957, 2048159, 2045506, 2048822, 2062325, 2062001, 2063604, 2064079, 2070586, 2070071, 2073152, 2075519, 2079410, 2083107, 2084001, 2090840, 2097487, 2103626, 2106513, 2109034, 2112715, 2118272, 2130765, 2142224, 2141639, 2138062, 2134013, 2133373, 2131750, 2137732, 2150445, 2156349, 2156359, 2169407, 2176470, 2173311, 2170371, 2174397, 2179375, 2185471, 2197432, 2209320, 2226425, 2236369, 2234514, 2230349, 2219360, 2210321, 2216176, 2227930, 2230309, 2234111, 2240113, 2240508, 2246317, 2252175, 2258581, 2264939, 2279174, 2292738, 2296192, 2295926, 2294205, 2294573, 2298226, 2310801, 2320233, 2320462, 2324939, 2329866, 2336867, 2341433, 2342653, 2352758, 2369955, 2386612, 2394553, 2403014, 2408422, 2418912, 2435418, 2444895, 2454743, 2470387, 2472713, 2486648, 2504368, 2523683, 2534406, 2541934]
19613B541934J7918J8132Q833K6346K7630L0477L8210M6513M2718N2497O4015
19602B915223R2650J01392J00076L0683j27888l12064m00004j20133R6903J50894
19592B527732J33261L6457j36274l43255m32514j41290N4510P7528O0927N2102
19582A889184N3115L4183L4035L9098K7801K9381K3413K3732J5977J0065J1268
19571B191252K731P833J9606J6117R309J7039M080Q683R918J1528R359N825R844
19558B323124N436N300O756J4212Q891M180P456J4304L316N99L366M378J5147
19545B416465j602P828J9823N485N477J0413O820Q726m874L693J283K984R450
19532B491971J4781L872J529J2865J8721R252P510J58M76J2489J0283N580O700
$$ y = [2541934, 2559852, 2577984, 2586817, 2613163, 2640793, 2671270, 2709480, 2755993, 2798711, 2851208, 2915223, 3007873, 3109265, 3209341, 3240024, 3112136, 2800072, 2400068, 2279935, 2376838, 2527732, 2660993, 2697450, 2561176, 2217921, 1785407, 1644117, 1698627, 1776155, 1837082, 1889184, 1942299, 1976482, 2010517, 2049615, 2077416, 2106797, 2130210, 2153942, 2169919, 2179984, 2191252, 2193983, 2201816, 2221422, 2237539, 2246848, 2263887, 2267967, 2276650, 2286568, 2298096, 2307455, 2313280, 2323124, 2328560, 2333860, 2340616, 2354828, 2363719, 2367899, 2375355, 2389659, 2392975, 2393574, 2396940, 2401318, 2416465, 2414863, 2422691, 2442514, 2447999, 2453476, 2463889, 2470709, 2479435, 2474561, 2478254, 2479537, 2482521, 2491971, 2506752, 2510624, 2512153, 2525018, 2543739, 2552991, 2560501, 2560659, 2561135, 2573624, 2583907, 2589487, 2596187]
19519B596187J0466j10j053O7l614J9431J9722L183j595M406M621O633N694m446
19505B659592n82n872J519Q879J3226K8438J5229k87j566J4512J5085J1842J0560
19492B770575Q007l400J0064J4791J2571P761J6186N167o261K653O297J0843K554
19479B857808R647J1393J0468M940m46R222L397J0107m002Q286j287l363J1653
19466B927823J8174K4158O001j1636J1809N998M80m808J0581J2139R705J6112
19454C026536K3363K3187K1699J7779K4741P70j5054n091J54M115J8008R819P963
19441C157989M261J3636J0247M320N373R374J5285J3964K244n247L831J577O776
19428C243630R65j171N101J8880J9631P755L840J3658J1492L767N182J0084J1543
$$ y = [2596187, 2606653, 2606543, 2605490, 2605557, 2601943, 2621374, 2641096, 2644279, 2642684, 2647090, 2651711, 2658344, 2664038, 2659592, 2659010, 2653138, 2654657, 2663536, 2676762, 2705200, 2720429, 2720142, 2718576, 2733088, 2748173, 2760015, 2770575, 2778582, 2775182, 2785246, 2800037, 2812608, 2820369, 2836555, 2841722, 2835461, 2838114, 2844411, 2855254, 2857808, 2867455, 2878848, 2889316, 2894256, 2893810, 2903032, 2906429, 2916536, 2912534, 2920820, 2919533, 2916170, 2927823, 2945997, 2970155, 2976156, 2964520, 2976329, 2982327, 2982807, 2977999, 2988580, 3000719, 3010424, 3026536, 3049899, 3073086, 3094785, 3112564, 3137305, 3138075, 3123021, 3117930, 3118084, 3122199, 3140207, 3150026, 3157989, 3162250, 3175886, 3186133, 3190453, 3195826, 3205200, 3220485, 3234449, 3236693, 3231446, 3235277, 3236854, 3243630, 3244595, 3243424, 3248525, 3267405, 3287036, 3294791, 3298631, 3312289, 3323781, 3327548, 3332730, 3342814, 3354357]
19415C354357O756N471O524R935O20R420J2259J3952N485J0626J0689J2506J5841
19402C474441J0997J3173J0396K793r675R456J8216J8063J0112K619J3846J0007
19390C584444J4786R030M287R673K5530K0911J4914J1891O367O997J2381N504
19378C726715O480M369J6176J2349K050R876Q148K623J7586J0197J4114J784N623
19365C838090J8890J3660R814J2528R138J5839J6221P732J0417Q171J2654J9794
19353C992948K2255J8912J5615J4756R151L135P839K1478J1075J3182J0583J1161
19341D152090K3119K2397R979J5424K7974J8723J2295O637J0358J3267K682P140
19329D322085J9012K8406J3794J0830J8477J0734J1821K1767K2746J9694K4138
$$ y = [3354357, 3361113, 3366584, 3373108, 3383043, 3383663, 3393083, 3405342, 3419294, 3424779, 3435405, 3446094, 3458600, 3474441, 3485438, 3498611, 3509007, 3511800, 3502125, 3511581, 3529797, 3547860, 3557972, 3560591, 3574437, 3584444, 3599230, 3608260, 3612547, 3622220, 3647750, 3668661, 3683575, 3695466, 3701833, 3708830, 3721211, 3726715, 3733195, 3737564, 3753740, 3766089, 3768139, 3778015, 3786163, 3788786, 3806372, 3816569, 3830683, 3832467, 3838090, 3856980, 3870640, 3880454, 3892982, 3902120, 3917959, 3934180, 3941912, 3952329, 3960500, 3973154, 3992948, 4015203, 4034115, 4049730, 4064486, 4073637, 4076772, 4084611, 4106089, 4117164, 4130346, 4140929, 4152090, 4175209, 4197606, 4207585, 4223009, 4250983, 4269706, 4282001, 4288638, 4298996, 4312263, 4314945, 4322085, 4341097, 4369503, 4383297, 4394127, 4412604, 4423338, 4435159, 4456926, 4479672, 4499366, 4523504]
19318D523504J3103R500O042J5783J9192J3459N084K13J2143K4023J9733R426
19306D671205J0949K5183K3677K5901K2000K7909M1255L8613L2662N354j6841
19295D907867P862M196K0366K1994J0083N744n032j3257l9867q685L2612M1337
19283D985220L1546L6229L8125M1525L6841L6284L4864K1571L1232M190K323K6704
19271E326654K8589K1709K3205K6788L0881K6780J1148J8289M8834M7326L5291
19260E645494L5036L6591L2509L4745M0575K9552L4989M8667N0407M7655P4136
19249F110356J07238J37688J58882J82806J26289k8100j57255l53678k39625m2748
19239F001853Q524K0846L8431L6548K2655L6005N4385N6616N1741M3605K6640
$$ y = [4523504, 4536607, 4546107, 4552149, 4567932, 4587124, 4600583, 4605667, 4605880, 4618023, 4642046, 4661779, 4671205, 4682154, 4707337, 4731014, 4756915, 4778915, 4806824, 4848079, 4886692, 4919354, 4924708, 4907867, 4915729, 4919925, 4940291, 4962285, 4972368, 4978112, 4973080, 4959823, 4919956, 4911271, 4943883, 4985220, 5016766, 5052995, 5091120, 5132645, 5169486, 5205770, 5240634, 5262205, 5293437, 5297627, 5299950, 5326654, 5355243, 5376952, 5400157, 5426945, 5457826, 5484606, 5495754, 5514043, 5562877, 5610203, 5645494, 5680530, 5717121, 5749630, 5784375, 5824950, 5854502, 5889491, 5938158, 5988565, 6036220, 6110356, 6217594, 6355282, 6514164, 6696970, 6823259, 6795159, 6637904, 6284226, 6044601, 6001853, 6010377, 6031223, 6069654, 6106202, 6128857, 6164862, 6219247, 6275863, 6327604, 6371209, 6397849]
19228F397849K8167L6458n316q178N3615L2059K6050L4670M2057N0703M3387L3218
19216F764739M3581M7305M6179M6654L3388K9715M1750M8201N5661N3217M8547
19205G258937M0688L5963K7130K6224M5106N9809N9130O0359N7618N0209L4817
19194G755990M0961O2493N4166O5010Q3322N0361M5630O6006O1692N9340N9713
19183H404684P4491Q6575Q6958P9855O6200P7242P5520P2576R0799J06332R9115
19172I320347Q4039R4773J19606J51268J64392J77452J96017J75916K480l12645
19162A0173645l80989l50560k03336L2807J22623J35743J16762R8285Q0398P0433
19152I895811N2811M8107Q3556Q2713J06221J09106J01456J05345J05844R4688
$$ y = [6397849, 6426016, 6462474, 6457158, 6448980, 6502595, 6534654, 6560704, 6595374, 6637431, 6688134, 6731521, 6764739, 6808320, 6855625, 6901804, 6948458, 6981846, 7011561, 7053311, 7101512, 7157173, 7210390, 7258937, 7299625, 7335588, 7362718, 7388942, 7434048, 7493857, 7552987, 7613346, 7670964, 7721173, 7755990, 7796951, 7859444, 7913610, 7978620, 8061942, 8112303, 8157933, 8223939, 8285631, 8344971, 8404684, 8479175, 8565750, 8652708, 8732563, 8798763, 8876005, 8951525, 9024101, 9114900, 9221232, 9320347, 9404386, 9499159, 9618765, 9770033, 9934425, 10111877, 10307894, 10483810, 10486290, 10173645, 9792656, 9442096, 9238760, 9271567, 9394190, 9529933, 9646695, 9744980, 9825378, 9895811, 9948622, 9996729, 10080285, 10162998, 10269219, 10378325, 10479781, 10585126, 10690970, 10785658]
19142A0785658Q6267J01426J06915J15397J28722J38439J06087Q5210J05729J15113
19132A1874963J12863R6010R1868R9016J07385J21788J39006J66465J81845J53570
19122A3144779J36371J32265J66286J88336J92107J89337J81521J54952J29946
19113A4615900J50174J75107J89941K09860K04462K02368J78555J79961K17274
19104A6323602K33292K42293K40564K57008K75864K84354K61550K51511K73095
19095A8643133K95042L23112L51584L22807K91074L08872L37902L67309L68164
19086B1608999M19778M64251M65943M49219M44334M56648M86582N28777N54888
19077B5879419O29630O48015O98703P13466P49039P79730P54452P59054Q48560
$$ y = [10785658, 10871925, 10973351, 11080266, 11195663, 11324385, 11462824, 11568911, 11654121, 11759850, 11874963, 11987826, 12083836, 12175704, 12274720, 12382105, 12503893, 12642899, 12809364, 12991209, 13144779, 13281150, 13413415, 13579701, 13768037, 13960144, 14149481, 14331002, 14485954, 14615900, 14766074, 14941181, 15131122, 15340982, 15545444, 15747812, 15926367, 16106328, 16323602, 16556894, 16799187, 17039751, 17296759, 17572623, 17856977, 18118527, 18370038, 18643133, 18938175, 19261287, 19612871, 19935678, 20226752, 20535624, 20873526, 21240835, 21608999, 22028777, 22493028, 22958971, 23408190, 23852524, 24309172, 24795754, 25324531, 25879419, 26509049, 27157064, 27855767, 28569233, 29318272, 30098002, 30852454, 31611508, 32460068]
19068C2460068Q90193J000455J201909J282578J250400J331102J520749J759806
19060D2697260J926478K001758J937401J844690J903402K137738K267677K149662
19052E8866066K081901L154562M331714N015544N437033O364846P878218R718916
19044A02848800J1958734J5038281J9399056K5196778L2409223L4490734O855322
19037B48196928o0777739j34969158j92748090o3254252K0248134K6324622K0428645
19030a36550910J7047036J4311961J1462551Q896396P349440O252801M837662
19023f6393063L537358L048345K875972K520963J905685J570519J970725J796932
19015d7166564J574828J616011J658854J368863J206516J157982J115814J121797
$$ y = [32460068, 33350261, 34350716, 35552625, 36835203, 38085603, 39416705, 40937454, 42697260, 44623738, 46625496, 48562897, 50407587, 52310989, 54448727, 56716404, 58866066, 60947967, 64102529, 68434243, 73449787, 78886820, 85251666, 93129884, 102848800, 114807534, 129845815, 149244871, 174441649, 206850872, 241341606, 248196928, 187419189, 52450031, -140298059, -203552311, -183304177, -156979555, -136550910, -119503874, -105191913, -93729362, -84832966, -77483526, -71230725, -66393063, -62855705, -59807360, -56931388, -54410425, -52504740, -50934221, -48963496, -47166564, -45591736, -43975725, -42316871, -40948008, -39741492, -38583510, -37467696, -36345899]
19007c6345899R54691Q31553P75347P09798P32955P14964O61067O56085N95373
18998b9714066N47069N13554N05011M92120M75892N00393N19252M97136M83966
18989b5179673M62076M18154L53903L11629L15354L13411L06820L11075L36090
18980b2051161L17021K85014K68662K49054K16235K32585K51797K53404K24196
18971a9753193J99851K24632K22654K05376J98699K16648K27147K14627J93153
18962a7850406J77313J82033J93085J97808K29052K20393J96471J62436J37070
18953a6154745J45962J49648J59293J73404J66511J25491J01902R5982J14496
18944a4922056J36783J53940J59677J47740J50199J51671J51340J65641J48366
$$ y = [-36345899, -35391208, -34559655, -33784308, -33074510, -32341555, -31626591, -30965524, -30309439, -29714066, -29166997, -28653443, -28148432, -27656312, -27180420, -26680027, -26160775, -25663639, -25179673, -24717597, -24299443, -23945540, -23633911, -23318557, -23005146, -22698326, -22387251, -22051161, -21734140, -21449126, -21180464, -20931410, -20715175, -20482590, -20230793, -19977389, -19753193, -19553342, -19328710, -19106056, -18900680, -18701981, -18485333, -18258186, -18043559, -17850406, -17673093, -17491060, -17297975, -17100167, -16871115, -16650722, -16454251, -16291815, -16154745, -16008783, -15859135, -15699842, -15526438, -15359927, -15234436, -15132534, -15036552, -14922056, -14785273, -14631333, -14471656, -14323916, -14173717, -14022046, -13870706, -13705065, -13556699]
18935a3556699J29475J08761J05114J16764J19422J28278J30505J27676J23958
18926a2466746J12932J11611J12368J15746J28179J46352J55967J73330J70646
18917a1239615J73496J95353K03791K22583K64083K08118r736l22854m90247k73387
18907a1068415m2414N5799Q6125O8797O7545R2234J02410J15221J04097Q8883
18897a0329718O7754O5192N9125N3310M7050M6800M2229M0756L9846M1963M9424
18886i776269M8840L7620L3560N0052L8609L6289N0843J1588J3507M9162O8159
18875i338040N1740L2232L3609L9489L3387M5769O4447P0268O5940N5255N6208
18864h789696M7413L4552M2381N1438N0687N3055M6903L5117M5482N1149M4695
$$ y = [-13556699, -13427224, -13318463, -13213349, -13096585, -12977163, -12848885, -12718380, -12590704, -12466746, -12353814, -12242203, -12129835, -12014089, -11885910, -11739558, -11583591, -11410261, -11239615, -11066119, -10870766, -10666975, -10444392, -10180309, -9972191, -9981927, -10304781, -10795028, -11068415, -11110829, -11055030, -10968905, -10900108, -10832563, -10740329, -10637919, -10522698, -10418601, -10329718, -10261964, -10196772, -10137647, -10084337, -10037287, -9990487, -9948258, -9907502, -9867656, -9825693, -9776269, -9727429, -9689809, -9656249, -9606197, -9567588, -9531299, -9480456, -9468868, -9455361, -9406199, -9338040, -9286300, -9254068, -9220459, -9180970, -9147583, -9101814, -9037367, -8967099, -8901159, -8845904, -8789696, -8742283, -8707731, -8665350, -8613912, -8563225, -8510170, -8463267, -8428150, -8382668, -8331519, -8286824]
18853h286824N0795L7424L0834M8847N7532L7102L3527N8155M8450O3853M1337
18842g778968M5059M6023K7506O321Q131K4601L5693L4271N417J1843N4896J56334
18830g322873K62474L67918M21197M3920j04017p0583p7695m7661j6358J192J1673
18819f530813J9280K4492K7474J2603J2683J7605K7403K3106J3832Q939J6221
18808f327175K2092K6871M0603M1413K7055J8554K4426L9557L8793K7340K8157
18797e992314L8133K3228J5815K4071K3995J5724J0611J4484K0934L7965L6375
18786e730979J8965K8718K8786J1743m977m546J375N475N986J9047J01200O9652
18774e449555K7378K3969K8028O434m471J1569L2079K3736K9531K5129L570J417
$$ y = [-8286824, -8236029, -8198605, -8167771, -8118924, -8061392, -8024290, -7990763, -7932608, -7884158, -7820305, -7778968, -7733909, -7687886, -7660380, -7654059, -7645928, -7621327, -7585634, -7551363, -7545946, -7534103, -7479207, -7322873, -7060399, -6692481, -6271284, -6227364, -6331381, -6401964, -6479659, -6527320, -6543678, -6542486, -6530813, -6511533, -6487041, -6459567, -6446964, -6434281, -6416676, -6389273, -6366167, -6352335, -6343396, -6327175, -6305083, -6278212, -6237609, -6196196, -6169141, -6150587, -6126161, -6086604, -6047811, -6020471, -5992314, -5954181, -5930953, -5915138, -5891067, -5867072, -5851348, -5840737, -5826253, -5805319, -5767354, -5730979, -5712014, -5683296, -5654510, -5642767, -5647744, -5652290, -5650915, -5645440, -5639454, -5620407, -5519207, -5449555, -5422177, -5398208, -5370180, -5363746, -5368217, -5356648, -5324569, -5300833, -5271302, -5246173, -5242603, -5241186]
18762e241186O934J9161L3515K6859K4749K6638K4262K0906J9586L1598J3335
18751d993643Q420Q708J0441J3388K2325K6109K6134K2148J9255L0008K2613K0209
18739d763885J8780R327J1897J6185J5365J0613J6801J4465J6334J2504Q585J8997
18727d594032J894k18K1467M0591L8773K6799K8919L788L11O844K2588J5541J3306
18714d373429K3560J9595J5050J5836J4694J1089K5685K1293R449J6010J7777
18703d183391J8731L2470L2265K3444J5483R938k405j7096k9259k16J6769J6029
18691d067238K0210K4890K9027K0160J0178N682P368P291J4222J5120J4843Q963
18679c889284J9748J0886J3273M128K334J2370L2367J9474J2016R455M623J4316
$$ y = [-5241186, -5234252, -5215091, -5181576, -5154717, -5129968, -5103330, -5079068, -5058162, -5038576, -5006978, -4993643, -4985223, -4976515, -4966074, -4952686, -4930361, -4904252, -4878118, -4855970, -4836715, -4806707, -4784094, -4763885, -4745105, -4735778, -4723881, -4707696, -4692331, -4681718, -4664917, -4650452, -4634118, -4621614, -4613029, -4594032, -4592138, -4592356, -4570889, -4530298, -4491525, -4464726, -4435807, -4432019, -4431708, -4424864, -4402276, -4386735, -4373429, -4349869, -4330274, -4315224, -4299388, -4284694, -4273605, -4247920, -4226627, -4217178, -4201168, -4183391, -4164660, -4132190, -4099925, -4076481, -4060998, -4051060, -4053465, -4070561, -4099820, -4100036, -4083267, -4067238, -4047028, -4022138, -3993111, -3972951, -3962773, -3957091, -3949723, -3942432, -3928210, -3913090, -3898247, -3889284, -3869536, -3858650, -3845377, -3841249, -3838915, -3826545, -3794178, -3774704, -3762688, -3753233, -3748610, -3734294]
18667c734294J4846J0472J3478P59J0227Q045J5511J7152J9881J7391Q432N596
18655c592504J5475J2200J1141J0329R523O344J1017Q365K0437J3614R140J1012
18643c453907Q522J8807N964J1369R403Q771M172Q967Q408R191R799J3308J2342
18630c324884J0062P271J4764J5427J5284J6749K2776K4369J1824Q638J190o064
18618c182594P757O328n011K736J0838J5458P294M670J523J0956J1187J857K908
18605c104093J7870J2625J0139R319K476R723J3595O817J2683K2571J4581P804
18593b963890N788K469N993J3434Q040k248J4080M253L424R177J4270O947J1453
18580b866810J6817M399M103J0868J0583O953Q400K158m585r844n704M371J6333
$$ y = [-3734294, -3719448, -3708976, -3695498, -3694739, -3684512, -3676467, -3660956, -3643804, -3623923, -3606532, -3598100, -3592504, -3577029, -3564829, -3553688, -3543359, -3533836, -3527492, -3516475, -3508110, -3487673, -3474059, -3464919, -3453907, -3445385, -3426578, -3420614, -3409245, -3399842, -3391071, -3386899, -3377932, -3369524, -3360333, -3350534, -3337226, -3324884, -3314822, -3307551, -3292787, -3277360, -3262076, -3245327, -3222551, -3198182, -3186358, -3177720, -3176530, -3182594, -3174837, -3168509, -3173520, -3170784, -3159946, -3144488, -3137194, -3132524, -3131001, -3120045, -3108858, -3107001, -3104093, -3086223, -3073598, -3063459, -3054140, -3051664, -3041941, -3028346, -3021529, -3008846, -2986275, -2971694, -2963890, -2958102, -2955633, -2949640, -2936206, -2928166, -2930414, -2916334, -2912081, -2908657, -2899480, -2885210, -2878263, -2866810, -2849993, -2845594, -2841491, -2830623, -2820040, -2813087, -2804687, -2802529, -2807114, -2816958, -2822662, -2818291, -2801958]
18567b801958J9693J3384J1460P448L666J4109J5878J3929Q994J3153J5865J0515
18555b653864J6747R563M991m941N64J2263J5600M840J3567K2678Q738K080Q271
18542b538903J543R777J7310J4684J3338M427J2406K3537J6003K458J6756K0324
18530b386340J9379Q811Q851K1094K6498K3470K5629L3962L5189M2527N7443P2870
18518b010617J01896J09631N6018j15410l35730n39796j93014O0137P9391O9852
18508b717642O2381N2571M2712K7827K6741L4911K3907J4404J9810L1446K9610
18497b351322K1660K6155K5719J3764Q882J0948K6810L6617M4567K9355K6618
18486b080227M8318N2789N6644O3894Q6866J10719J07317K9520j37270l33400
$$ y = [-2801958, -2782265, -2768881, -2757421, -2749973, -2746307, -2732198, -2716320, -2702391, -2693397, -2680244, -2664379, -2653864, -2637117, -2627554, -2622563, -2627504, -2626940, -2614677, -2599077, -2594237, -2580670, -2557992, -2549254, -2547174, -2538903, -2537360, -2527583, -2510273, -2495589, -2482251, -2477824, -2465418, -2441881, -2425878, -2423420, -2406664, -2386340, -2366961, -2358150, -2349299, -2328205, -2301707, -2278237, -2252608, -2218646, -2183457, -2140930, -2083487, -2010617, -1908721, -1799090, -1743072, -1858482, -2194212, -2734008, -2927022, -2866885, -2787494, -2717642, -2655261, -2602690, -2559978, -2532151, -2505410, -2470499, -2446592, -2432188, -2412378, -2380932, -2351322, -2329662, -2303507, -2277788, -2264024, -2255142, -2244194, -2217384, -2180767, -2136200, -2106845, -2080227, -2031909, -1979120, -1922476, -1858582, -1771716, -1660997, -1553680, -1524160, -1661430, -1994830]
18476a994830m03300j02001Q6867J34696J26523K7345j52906l40192l76097r8831
18466c092726N3537P9010P2856O1770N0041M0001L1393L3224K8205L1632J1251
18455b599806R685K2545R350J4850J1809J5491P338N470R763M010J3131J4416
18443b461948J2477M426J7519J2876Q991Q684J5015M883O019P927N844J596J1957
18430b343734J8493O337N817j496L318P770R424n577M673R111M035K150K457M232
18416b272990K3500J8615J6511N381j711Q4P462M759m603J0857K060Q391L830
18403b177854o90J1447K0947J0095M583K536K861l25J067K263J184K590K706Q219
18389b108371J714N895P143J3116Q368K608J2280N413m64k643J4749J3133J78
$$ y = [-1994830, -2398130, -2500131, -2413264, -2278568, -2152045, -2124700, -2277606, -2617798, -2993895, -3092726, -3039189, -2960179, -2887323, -2825553, -2775512, -2735511, -2704118, -2670894, -2642689, -2611057, -2599806, -2590121, -2567576, -2558226, -2543376, -2531567, -2516076, -2508738, -2503268, -2493505, -2489495, -2476364, -2461948, -2449471, -2445045, -2427526, -2414650, -2405659, -2396975, -2381960, -2377077, -2371058, -2363131, -2357287, -2355691, -2343734, -2325241, -2318904, -2313087, -2314583, -2311265, -2303495, -2294071, -2299648, -2294975, -2285864, -2281829, -2279679, -2277222, -2272990, -2249490, -2230875, -2214364, -2208983, -2210694, -2210610, -2203148, -2198389, -2202992, -2192135, -2190075, -2181684, -2177854, -2178544, -2167097, -2146150, -2136055, -2131472, -2128936, -2126075, -2126400, -2125333, -2123070, -2121886, -2119296, -2116590, -2108371, -2106657, -2100762, -2093619, -2080503, -2072135, -2069527, -2057247, -2051834, -2052298, -2054941, -2040192, -2027059, -2026881]
18376b026881L604k007J09P902P692K150n580M25N911J1346L140j997O796Q217
18362a979173R705K055O366M223j259Q060J4183K047o390J615M934K012p099o503
18348a945224R553J1647j573Q929Q196R274J6299q59l176Q983K805q23n79O802
18334a869746K001K465Q609Q110J7975K587o290l010K285R23K863k357R194J3549
18320a810842M12L955R643R562N291O627M947j49K357J245m285o064N341M520
18306a767440q14L899P233M546L247L723J3361M369l390M329n114J1040K117L95
18292a718499J771j23J1982Q834J3172Q766N48n287n017M596P811O364n7J225
18278a663914m87o35O587N517k716P246J0731Q331O158k218l694k047n26J0379
$$ y = [-2026881, -2023277, -2025284, -2025175, -2017273, -2009581, -2007431, -2013011, -2012586, -2006675, -1995329, -1992189, -1994186, -1987390, -1979173, -1969468, -1967413, -1961047, -1956824, -1958083, -1950023, -1935840, -1933793, -1940183, -1938568, -1933634, -1931622, -1938721, -1945224, -1935671, -1924024, -1925597, -1916668, -1908472, -1899198, -1882899, -1883758, -1886934, -1877951, -1875146, -1875969, -1876548, -1869746, -1867745, -1865280, -1856671, -1848561, -1830586, -1827999, -1834289, -1837299, -1835014, -1834091, -1831228, -1833585, -1824391, -1810842, -1810430, -1806475, -1796832, -1787270, -1781979, -1775352, -1770405, -1770554, -1768197, -1766952, -1771237, -1777301, -1771960, -1767440, -1768254, -1764355, -1757122, -1752576, -1749329, -1745606, -1732245, -1727876, -1731266, -1726937, -1732051, -1721011, -1718894, -1718499, -1716728, -1716851, -1704869, -1696035, -1682863, -1674097, -1673549, -1678836, -1683853, -1679257, -1671446, -1665082, -1665139, -1663914, -1664401, -1665036, -1658449, -1652932, -1655648, -1648402, -1637671, -1629340, -1623182, -1625400, -1629094, -1631141, -1631667, -1621288]
18264a621288N208J983m6J1881O755J1058J3659L008P43q267L630J1738N084N552
18250a549302J1888k403P339J233m61N30j967P212J0447J0316K62O723K857K554
18236a492772J2066J1721J4023K726m891j0831o995k566O97O228k232J4017J5292
18223a443517J151J966L257k442Q716J763k092m80N949M45K672J3605M150J3429
18209a391428J4434J3597N353r014j1181R14J0841J5175M787J795N968l064O074
18196a335749L250J5803J7845K670m795J040M243J995N684O496J4284K629M691
18183a259914P868M491R211N99J0151Q230J8708J4254R28R63K017R798J2736J0251
18169a149709J2294N195R214J5235q06M267M551R627J5517J3712m039k474K610
$$ y = [-1621288, -1616080, -1614097, -1614143, -1602262, -1595507, -1584449, -1570790, -1567782, -1567039, -1575306, -1571676, -1559938, -1554854, -1549302, -1537414, -1539817, -1532478, -1531245, -1531706, -1531176, -1533143, -1525931, -1515484, -1505168, -1504906, -1498183, -1495326, -1492772, -1480706, -1468985, -1454962, -1452236, -1457127, -1467958, -1474953, -1477519, -1476822, -1470594, -1472826, -1458809, -1443517, -1442366, -1440400, -1437143, -1439585, -1430869, -1429106, -1431198, -1431678, -1425729, -1425284, -1422612, -1409007, -1404857, -1391428, -1376994, -1363397, -1358044, -1367058, -1378239, -1377325, -1366484, -1351309, -1346522, -1344727, -1338759, -1341823, -1335749, -1332499, -1316696, -1298851, -1296181, -1300976, -1299936, -1295693, -1293698, -1288014, -1281518, -1267234, -1264605, -1259914, -1252046, -1247555, -1238344, -1237745, -1227594, -1219364, -1200656, -1186402, -1185474, -1184511, -1182494, -1172696, -1159960, -1149709, -1137415, -1132220, -1123006, -1107771, -1108577, -1104310, -1099759, -1090132, -1074615, -1060903, -1064942, -1067416, -1064806]
18156a064806R207K1772J8900L147J4803R955J4022K2216J0025J7844J5477J3255
18144h94183J5524J4455J7304K5427K2296K2763K1345J1228L0230L1969L7997
18133f43645L1649K8348L2615M4194N2252M7672M6085M7415M8447M5277P2180
18122a47511O8719P5073Q9187R9288J17813J45235J61686J84846K19718K75486
18112A289540L40406M43189N88044Q06017R95107O52641q76675l019717n113384
18103c894832k843597K47398P65899O61573N03084L93011L06358K32522J85694
18094c442890J57627J39412J01374P3650O6024P1131P4228O7356N7419L8989M7252
18083b548428M2597M4595L5629K9898L0735K9445K5341K3946K9010K8892J6035
$$ y = [-1064806, -1055599, -1033827, -1014927, -1011780, -996977, -987022, -973000, -950784, -940759, -922915, -907438, -894183, -878659, -864204, -846900, -821473, -799177, -776414, -755069, -743841, -713611, -681642, -643645, -611996, -583648, -551033, -506839, -454587, -406915, -360830, -313415, -264968, -219691, -147511, -78792, -3719, 85468, 184756, 302569, 447804, 609490, 794336, 1014054, 1289540, 1629946, 2073135, 2661179, 3467196, 4462303, 5114944, 4238269, 1218552, -3894832, -6738429, -6491031, -5725132, -5063559, -4560475, -4167464, -3861106, -3628584, -3442890, -3285263, -3145851, -3044477, -2970827, -2904803, -2833672, -2759444, -2692088, -2634669, -2595680, -2548428, -2505831, -2461236, -2425607, -2395709, -2364974, -2335529, -2310188, -2286242, -2257232, -2228340, -2212305]
18072b212305J1085J7433K1344J7337Q772J2183J7098J8650J5622J5835J2235
18061b044711P983J0877P655O103J6065K1443O573J7064N921J2221J6277Q597
18049a907932L663K59K409J2499J6115J0359J2385J1914L531M109L143J1088J614
18036a814844o695P913J4719J0519P674Q145n94J1741N549J0958K630P644J2782
18023a721859k576p014m291J211O585J6882O874L758Q364M419M357N818n73O63
18009a677382J5405M517o231J0022J2902K224q13M107Q244O813n508p38P154j302
17995a620586Q013P436Q369K188o248O870P910P985O612L271M519J1286J4965
17982a537410O538L988O077n833j1761j2218k351M438L820M580m211P773J0425
$$ y = [-2212305, -2201220, -2183787, -2162443, -2145106, -2136334, -2124151, -2107053, -2088403, -2072781, -2056946, -2044711, -2036728, -2025851, -2018196, -2012093, -1996028, -1974585, -1968012, -1950948, -1945027, -1932806, -1916529, -1907932, -1904269, -1904010, -1901601, -1889102, -1872987, -1862628, -1850243, -1838329, -1834798, -1830689, -1827546, -1816458, -1814844, -1821539, -1813626, -1798907, -1788388, -1780714, -1772569, -1773163, -1761422, -1755873, -1744915, -1742285, -1734641, -1721859, -1724435, -1731449, -1735740, -1734529, -1727944, -1711062, -1704188, -1700430, -1692066, -1687647, -1683290, -1677472, -1678045, -1677382, -1661977, -1657460, -1663691, -1653669, -1640767, -1638543, -1639356, -1635249, -1627005, -1620192, -1625700, -1626438, -1619284, -1620586, -1612573, -1605137, -1596768, -1594580, -1600828, -1593958, -1586048, -1578063, -1571451, -1568180, -1563661, -1552375, -1537410, -1530872, -1526884, -1520807, -1526640, -1538401, -1550619, -1552970, -1548532, -1544712, -1540132, -1544343, -1536570, -1526145]
17969a526145M48K452N612L258K912N644j665N123N852K396J458j0626N163J8020
17955a480098M888j6181J705O784L189j915J0206L446J0092O089r644J241l608
17942a463806o286K786J368L043Q719P621Q89K715N842R358J585n397m085J536
17928a434112P430N058L035m801o858N408J1768R972J898l361J568R384l035J547
17914a395099J615Q537Q549J037j133k891j980k164K184J2963L642r614n397l757
17900a383508J2751K0539P761P905k054k924J971l910O252N528J564K008J198
17887a324919j0507l714J8627O783o020m164q177j042Q563P216o117n793M744
17874a324520J748q716J2650J3855J559Q92J0366k29l799M850R467L738l149k038
$$ y = [-1526145, -1525697, -1523245, -1517633, -1514375, -1511463, -1505819, -1507484, -1502361, -1496509, -1494113, -1492655, -1503281, -1498118, -1480098, -1475210, -1491391, -1489686, -1482902, -1479713, -1481628, -1471422, -1467976, -1457884, -1451795, -1461439, -1460198, -1463806, -1470092, -1467306, -1465938, -1462895, -1454176, -1446555, -1445666, -1442951, -1437109, -1427751, -1426166, -1431563, -1435648, -1434112, -1426682, -1421624, -1418589, -1423390, -1430248, -1424840, -1413072, -1403100, -1401202, -1404563, -1402995, -1393611, -1396646, -1395099, -1393484, -1384947, -1376398, -1375361, -1376494, -1379385, -1381365, -1383529, -1381345, -1368382, -1364740, -1374354, -1379751, -1383508, -1370757, -1350218, -1342457, -1334552, -1336606, -1339530, -1337559, -1341469, -1335217, -1329689, -1328125, -1326117, -1324919, -1335426, -1339140, -1320513, -1313730, -1319750, -1323914, -1332091, -1333133, -1324570, -1317354, -1323471, -1329264, -1324520, -1322772, -1331488, -1318838, -1304983, -1303424, -1302532, -1292166, -1292395, -1296194, -1291344, -1281877, -1278139, -1281288, -1283326]
17860a283326k411L522n790Q13o09l489Q288O386M881J0556L193j1344k448M750
17846a267028N432j813M285K465J378j824j0628R104O124O65k15j809M146j2056
17832a261774m025P196P438K880p485N385J1706N197L934j442j2316J774J0359
17819a231173J544M985n79j148P311j535L601Q943m799r230K083j837K278K140
17805a217416q0l634M208R177M598L736J949o048n478k730N885O837k274P279
17791a193991M356j035j799J574Q112p64m401r21R59J1123J0030K009K558o120
17777a168310m315M235k387m744L439r17n796j130J0870J0882O671j077n183J79
17763a157583P90K148K739M151L038O718L404k817l239o007L254Q318P785K692
$$ y = [-1283326, -1285737, -1282215, -1288005, -1287192, -1287801, -1291290, -1283002, -1276616, -1271735, -1261179, -1257986, -1269330, -1271778, -1267028, -1261596, -1263409, -1259124, -1256659, -1255281, -1257105, -1267733, -1258629, -1252505, -1251840, -1252055, -1253864, -1249718, -1261774, -1265799, -1258603, -1251165, -1248285, -1255770, -1250385, -1238679, -1233482, -1229548, -1230990, -1243306, -1241532, -1231173, -1229629, -1224644, -1225223, -1226371, -1219060, -1220595, -1216994, -1208051, -1212850, -1222080, -1219997, -1221834, -1219556, -1217416, -1217496, -1221130, -1216922, -1207745, -1203147, -1199411, -1197462, -1203510, -1208988, -1211718, -1205833, -1198996, -1201270, -1193991, -1189635, -1190670, -1192469, -1190895, -1182783, -1183547, -1187948, -1188869, -1187910, -1176787, -1166757, -1164748, -1162190, -1168310, -1172625, -1168390, -1170777, -1175521, -1172082, -1172999, -1178795, -1179925, -1169055, -1158173, -1151502, -1152579, -1157762, -1157583, -1156793, -1154645, -1151906, -1147755, -1144717, -1137999, -1134595, -1137412, -1140651, -1146658, -1143404, -1135086, -1127301, -1124609]
17749a124609r591l786N935J360o641o152L475r11K396J753k705Q484Q03o33L155
17734a127667L940j067J0503O58m945k987Q214Q494k043n010M55O025k981L430
17720a104981K485n817l776K22J044m284o3M158M589o565M685P429l557P66K347
17705a101318M825n278l119L818l602N744M829R68O570L521N419k84q70L630N969
17690a069178J2006o89l191K136K84l026k423J772O196n45j1786l232N493O30
17676a065553L886R863k291k698k571O026Q468J246l913p747k722K056J2267J284
17662a042399j1121q24O756O096L101O2K571k027O03j573k546L548k622j181L870
17647a037686O172Q080J798k09J21j500k932j354K27L01M300L92J047N692r20
$$ y = [-1124609, -1134200, -1137986, -1132051, -1130691, -1137332, -1143484, -1140009, -1140920, -1138524, -1136771, -1139476, -1130992, -1130189, -1130822, -1127667, -1123727, -1124794, -1114291, -1113633, -1118578, -1121565, -1113351, -1104857, -1106900, -1111910, -1111455, -1105430, -1108411, -1104981, -1102496, -1108313, -1112089, -1111867, -1110823, -1115107, -1115170, -1111012, -1106423, -1112988, -1108303, -1100874, -1104431, -1103665, -1101318, -1096493, -1101771, -1104890, -1101072, -1104674, -1098930, -1094101, -1093133, -1086563, -1083042, -1077623, -1077907, -1078777, -1075147, -1069178, -1057172, -1057861, -1061052, -1058916, -1058632, -1061658, -1064081, -1062309, -1056113, -1056658, -1068444, -1071676, -1066183, -1065553, -1061667, -1051804, -1054095, -1056793, -1059364, -1053338, -1044870, -1043624, -1047537, -1055284, -1058006, -1055950, -1043683, -1042399, -1053520, -1054344, -1047588, -1041492, -1038391, -1038329, -1035758, -1037785, -1037182, -1038755, -1041301, -1037753, -1040375, -1041556, -1037686, -1031514, -1023434, -1021636, -1021845, -1021724, -1023224, -1026156, -1027510, -1027283, -1026982, -1022682, -1022290, -1021243, -1015551, -1016471]
17632a016471l727k786m839J0715R745N723L682j938o100j30m810M743O225l850
17618a003818O224K704l283j714M85o865m88l269M241O615K220L574k82m949j0515
17603a009120k060N91J0821J2392O721j555j057q552k080M789L116m037k493K429
17589i90095m003k387J0974K351l806R02L177P34K315n928k855J1524J927j02
17575i75272N175n415j1219L634O373N751N75K227m896m645m802J228j692K064
17561i80914J0188J2897M533r518K474J345O520o406L753Rk867J480k85O132o290
17546i56949J809R081R602m309j4587J086J262K658N099N311k662O012L372P27
17532i32488Q92q745k274J564k907N489P972m632j7699K255R163J389J0792M40
$$ y = [-1016471, -1020198, -1022984, -1027823, -1017108, -1007363, -1001640, -997958, -999896, -1005996, -1006126, -1010936, -1006193, -999968, -1003818, -997594, -994890, -998173, -999887, -999402, -1006267, -1006755, -1010024, -1005783, -999168, -996948, -993374, -993656, -998605, -1009120, -1011180, -1010589, -999768, -987376, -980655, -982210, -983267, -991819, -993899, -989110, -985994, -990031, -992524, -990095, -994098, -996485, -985511, -983160, -986966, -986064, -982887, -982153, -979838, -985766, -988621, -977097, -975170, -975272, -970097, -975512, -986731, -983097, -976724, -970973, -970398, -968171, -973067, -977712, -982514, -981286, -982978, -980914, -970726, -957829, -953296, -962814, -960340, -958995, -952475, -958881, -955128, -955119, -957986, -956506, -956791, -950659, -956949, -955140, -946059, -936457, -940766, -955353, -954267, -953005, -950347, -945248, -939937, -942599, -936587, -933215, -932488, -931596, -940341, -942615, -941051, -943958, -938469, -930497, -935129, -952828, -950573, -941410, -940021, -929229, -928789]
17518i28789j4317m795P749L841J008J460J605L609r31l290L51J113N63J931o195
17503i35087k378L71M39Q365M781P429J732k00N37j188n034L775j537L000J0253
17488i04742K439p487n861N284O759n260o636p831J4061Q963K108k908k25r67
17474i02303n716M618m0O734N42o86P1J1728M990k141K659k853j277j2432o867
17459i02973O245P650P452N927r652o981M461N233k780k839M688k16L609J3446
17445h66730M980L263P852N444p21J325j1944k5889l4265o945P488J7562J2825
17432h85755N481M141k134l732r416m524l685K824K672R260J3801M470j0815j1364
17418h88776j259K880M037J1001L279k955R68N04l989q55R976P285k552j164J249
$$ y = [-928789, -943106, -947901, -940152, -936311, -935303, -933843, -932238, -928629, -929560, -932850, -932499, -931386, -930823, -928892, -935087, -937465, -937094, -936655, -928290, -923509, -916080, -914348, -914548, -914011, -915199, -920233, -916458, -917995, -914995, -904742, -902303, -909790, -915651, -910367, -903608, -908868, -915504, -923335, -909274, -900311, -898203, -901111, -901336, -902303, -908019, -903401, -903441, -896707, -896165, -896851, -896780, -885052, -880062, -882203, -879544, -882397, -883674, -896106, -902973, -896728, -889078, -881626, -875699, -885351, -892332, -887871, -882638, -885418, -888257, -883569, -883785, -880176, -866730, -861750, -858487, -850635, -845191, -845912, -844587, -856531, -882420, -916685, -923630, -916142, -898580, -885755, -880274, -876133, -878267, -881999, -891415, -895939, -899624, -896800, -894128, -884868, -871067, -866597, -877412, -888776, -890035, -887155, -883118, -872117, -868838, -871793, -870825, -870321, -874310, -875165, -865189, -857904, -860456, -861620, -860371]
17403h60371R18k240M383N88k066j886L059J992M403k237N81l649j385N658K521
17388h49731J777N03n190p54K755M704l946o484j504M38M428L985M335O978r63
17373h38669k90j075L237O802N069m820m532j524o080L10M261Q62m314L93j255
17358h41625o487J005Q824J217M830R608m384k638l642j389m933L066K574m49
17344h34423o08O675J0772j112J503k570m245m989k885M977L523l598O588J0347
17330h10045m81O691m846j7070j957N925n77p16k778M59o15L385R876m664l438
17315h20851K893O399O217M403j2005r429J773N725J0532L162m59J022K020o996
17301h05594p136L639m21P93k804N428N717N332J3501O419j0535n345m546m947
$$ y = [-860371, -859453, -861693, -857310, -856722, -858788, -860674, -857615, -855623, -851220, -853457, -852876, -856525, -857910, -852252, -849731, -847954, -847451, -852641, -853395, -850640, -845936, -849882, -856366, -857870, -857432, -853004, -849019, -844684, -837706, -838669, -838959, -840034, -836797, -829995, -824926, -829746, -834278, -835802, -841882, -841572, -837311, -836449, -840763, -840370, -841625, -848112, -847107, -838283, -837066, -832236, -822628, -827012, -829650, -833292, -834681, -839614, -836548, -833974, -834423, -835031, -828356, -817584, -818696, -817193, -819763, -824008, -828997, -831882, -826905, -823382, -826980, -820392, -810045, -810526, -803835, -808681, -825751, -827708, -821783, -822360, -823076, -825854, -825395, -826010, -822625, -812749, -817413, -820851, -817958, -811559, -805342, -800939, -812944, -822373, -820600, -814875, -804343, -801181, -801640, -800618, -798598, -805594, -812730, -809091, -809512, -808719, -811523, -806095, -800378, -795046, -781545, -775126, -785661, -791006, -795552, -800499]
17287h00499P39m055q410q43L186J1877M051J08j332L527L770L779m757R80J6
17272g87863o205Q458j229n107n30Q931j337r079N894J897Q176J352j731K756
17258g75617l389m110k324k593J1539M92k621p760m325J2063M191K925l732l746
17244g79007L280o31L914p59j028K52l394m761p08l048K314R668O198L863J817
17229g62030l688K071Q82o854M771J748q940N436L364J714L182K531j501m166
17215g61480n023M669K661l53r41R55J380p8O230k771j2771K522J0374N217K281
17200g47128l478j1850M036J0847K414o366j847M452K382J284R898J005j4891
17187g49242m455K036k24o864q030L713O039J579N615k704n231l856l071P965
$$ y = [-800499, -799760, -803815, -812225, -813068, -809882, -798005, -793954, -793846, -795178, -791651, -787881, -784102, -788859, -787879, -787863, -794068, -785610, -786839, -791946, -792476, -783545, -784882, -793961, -788067, -786170, -777994, -776642, -778373, -775617, -779006, -783116, -785440, -788033, -776494, -776002, -778623, -786383, -790708, -778645, -774454, -771529, -775261, -779007, -775727, -776358, -772444, -773203, -774231, -773979, -777373, -782134, -782842, -785890, -783576, -773908, -767710, -763847, -762030, -765718, -763647, -762765, -769619, -764848, -763100, -772040, -766604, -763240, -761526, -758344, -755813, -757314, -761480, -766503, -761834, -759173, -759526, -760467, -759512, -758132, -758210, -751980, -754751, -767522, -765000, -754626, -749409, -747128, -750606, -762456, -758420, -747573, -745159, -751525, -753372, -748920, -746538, -745254, -735356, -734351, -749242, -753697, -751661, -751885, -758749, -766779, -763066, -757027, -755448, -749833, -752537, -757768, -761624, -764695, -756730]
17173g56730K693l50J6558k742m759L188j43L285j21p325O74P501O369o93K293
17158g30302k772m724N76K75K681K864j218k431J34o988m23P766K465Jk412L661
17142g30847j947L656l233n830k125K681J909J788j3009j749M700R759J0929q648
17128g31966q279q53M689O304Q457k714n531j597J300q86N126J0448K762j5832
17114g28572K147k170m074m30Q324P709m472P416o806p852M630J844Q299J0520
17100g03487K455k534P96k115K656k686o321o612J159J2608L632o515k059M749
17086g04274M378L252k937M1M71K048r233n782K013o051K811P298N941O754P2
17071f93198k467l083m761j795M870K8n456p61K662M181L947O063l519o461r617
$$ y = [-756730, -754037, -754387, -737829, -740571, -745330, -742142, -742285, -739000, -739121, -746446, -745772, -738271, -731902, -732595, -730302, -733074, -737798, -737222, -736947, -734266, -731402, -732620, -735051, -734917, -741905, -742328, -734562, -732097, -732096, -734508, -730847, -732794, -729138, -732371, -738201, -740326, -737645, -735736, -733948, -746957, -748706, -744006, -734247, -723318, -731966, -740245, -741098, -736409, -730105, -721648, -724362, -729893, -731490, -730190, -731076, -725950, -715502, -712740, -728572, -726425, -728595, -732669, -733099, -724775, -717066, -721538, -714122, -720928, -728780, -724150, -722306, -714007, -703487, -701032, -703566, -702770, -704885, -702229, -704915, -711236, -717848, -716689, -704081, -700449, -706964, -709023, -704274, -699896, -696644, -699581, -699540, -699069, -697021, -706254, -712036, -710023, -716074, -713263, -705965, -700024, -693270, -693198, -695665, -698748, -703509, -705304, -700434, -700406, -705862, -706623, -703961, -699780, -695833, -689770, -693289, -699750, -709367]
17056g09367n862O195R467N759l669p062J0418N201M654j981n909r024J782Q730
17042f90668K907o547k565O339j858k001j909m938Q2K357p54k224R733M520P599
17027f79927M527j4279r757J463M481M051N795N511m699j885P837m031n695j0510
17013f97118p088N344M912P788J822o649J440N15K310Q421k980k536O694J611
16999f75514j775j2246L146J1865K242q60M893j799j0016n56J368K10n231r60
16985f85233K490J755j434P951O963l408j742l280p347k192O046K396o024M349
16971f78710P671P87M654M284p114p595J0337j65m535R241M917o408M945q95K18
16956f58368o531o902J28P596K353P086K968q112k511k73K482k5L904J0097L981
$$ y = [-709367, -715229, -709034, -699567, -693808, -697477, -704539, -694121, -688920, -684266, -686247, -692156, -701180, -699398, -690668, -687761, -694308, -696873, -690534, -692392, -694393, -696302, -701240, -701158, -698801, -699555, -701779, -692046, -687526, -679927, -675400, -689679, -699436, -697973, -693492, -689441, -683646, -678135, -682834, -684719, -676882, -680913, -686608, -697118, -704206, -698862, -693950, -686162, -684340, -690989, -689549, -689034, -686724, -678303, -681283, -683819, -677125, -675514, -677289, -689535, -686389, -674524, -672282, -673142, -668249, -670048, -680064, -680620, -679252, -679042, -684273, -685233, -682743, -680988, -682422, -674471, -667508, -670916, -672658, -675938, -683285, -685477, -679431, -677035, -683059, -678710, -671039, -670252, -665598, -661314, -668428, -676023, -665686, -665851, -670386, -661145, -656228, -662636, -657691, -658586, -658368, -664899, -671801, -671673, -664077, -661724, -654638, -651670, -659782, -662293, -662566, -660084, -660109, -656205, -646108, -642127]
16941f42127j4R69L636N328j298j2454p143n559j0131J632K252J641L256O233
16927f53779j193l568j046k259q37N920q48q121Q502N016L737K841m674l483r964
16912f63756L682Q296Q251L747k786j3675K200P104j075r985K532J0333K113q577
16898f51596k334J0165M236P355K828j195n990l273Q1j921K847o13J981Q122K140
16883f27167K889m141j1516k363j045J660L794K629L869l795J743j589k641k195
16869f39868j27J5562J156j0381l883J89j660N7j377K25P0o70Q027L254L261M217
16853f21948N988p174q510j332J219J6Q266L867J868J055j1831M122M709p812
16839f27497J934j418L26l340Q12J63J378j842k415l881K957j722J527M829O111
$$ y = [-642127, -642141, -641172, -637536, -632208, -633506, -645960, -653103, -658662, -668793, -667161, -664909, -663268, -660012, -653779, -654972, -658540, -659586, -661845, -662682, -656762, -657610, -665731, -657229, -652213, -648476, -645635, -650309, -653792, -663756, -660074, -651778, -643527, -639780, -642566, -656241, -654041, -646937, -648012, -657997, -655465, -645132, -643019, -651596, -653930, -643765, -639529, -632174, -629346, -630541, -636531, -639804, -639723, -641644, -638797, -639410, -637429, -629307, -627167, -624278, -628419, -639935, -642298, -643343, -641683, -637889, -635260, -631391, -635186, -633443, -635032, -637673, -639868, -639995, -624433, -623277, -633658, -637541, -637352, -639012, -638955, -640332, -640107, -640037, -640707, -632680, -629426, -626165, -621948, -615960, -623134, -631644, -632976, -631757, -631741, -623475, -619608, -617740, -616685, -628516, -624394, -619685, -627497, -625563, -626981, -626655, -629995, -629183, -629020, -627642, -629484, -631899, -635780, -632823, -634545, -633018, -628189, -622078]
16824f22078L211R428L973J944q26o319n569k337m79n064p5L05k398j351m770
16809f32405j166N681M412q58N029L970j911N940l878j134L161M648q96j27k599
16794f12133N39m25M556M42j822n336L46m827r40L980O768J2192m872M981P90
16779e95761R556m60j4621m884m326n204K814P997M506k523j50m43m031q368j746
16764f17644O533K334J78K391K007m623m070N733J3959K443l056j325k597P245
16750e90492L691r721r192k116M704N611p47L359K087J690O860j244q315q578
16736f02403m988n598J1229K658l887l957l47M920O10P076J153o316J995K367
16722e95488r153M356J1467k689l963k082m62r939l325M115O361P018j606n956
$$ y = [-622078, -618867, -609439, -605466, -603522, -604348, -610667, -616236, -618573, -619052, -624116, -624191, -623886, -626284, -627635, -632405, -633571, -627890, -623478, -624336, -619307, -615337, -617248, -611308, -615186, -616320, -613159, -608511, -609407, -609534, -612133, -611594, -612019, -607463, -607021, -608843, -614179, -613833, -618660, -619600, -615620, -608852, -596660, -601532, -596551, -595761, -586205, -586665, -601286, -606170, -610496, -615700, -612886, -604889, -600383, -602906, -603056, -603499, -607530, -615898, -617644, -611111, -608777, -608599, -606208, -604201, -608824, -612894, -607161, -593202, -590759, -593815, -595140, -597737, -590492, -586801, -596522, -605714, -607830, -603126, -597515, -598262, -594903, -592816, -591126, -584266, -585510, -593825, -602403, -607391, -612989, -601760, -599102, -602989, -606946, -607293, -602373, -601763, -594687, -593534, -599850, -597855, -595488, -604641, -600285, -588818, -591507, -595470, -597552, -598014, -607953, -611278, -607163, -600802, -593784, -595390, -601346]
16708f01346K041p53J113k501k652K505O225P172K623j023J062r191M584J870
16694e88271K319k315m79K196K557M393k415P551P671K436o766J60j1179m171
16680e86313M51O82j149m290p563M139J1543Q973K369q6j949m052k764j960J457
16665e80512o24L348l22n64L132K892m65l485q81J316o200q77N428r07l332N369
16649e76684M498K365N437O227J815k320m487q433M23n193K106K384J401M301
16635e66160M250k178N455m987q982k372L549k050K174Q782K8L213O600N957o270
16620e52991n268J797J351M817m220r102n130q764R619k975k514L894P956L64
16606e61166N5m388m192l017Q72j028k760M810M957j2069M500P216K417P483K374
$$ y = [-601346, -599305, -600058, -598945, -601446, -604098, -601593, -595368, -588196, -585573, -586596, -585534, -594725, -590141, -588271, -585952, -588267, -588746, -586550, -583993, -579600, -582015, -574464, -566793, -564357, -571123, -570963, -582142, -586313, -585862, -585180, -586329, -590619, -598182, -594043, -582500, -573527, -571158, -571244, -573193, -577245, -580009, -581969, -580512, -581136, -577788, -578110, -578674, -575542, -572650, -573115, -576600, -577481, -576165, -582365, -583242, -577814, -578721, -582053, -576684, -572186, -569821, -564384, -558157, -556342, -558662, -563149, -571582, -571159, -576352, -574246, -571862, -570461, -566160, -561910, -564088, -558633, -563620, -572602, -574974, -571425, -573475, -571301, -562519, -562491, -559278, -552678, -546721, -552991, -558259, -556462, -555111, -550294, -554514, -563616, -568746, -577510, -567891, -570866, -573380, -569486, -561530, -561166, -561111, -565499, -569691, -572708, -571836, -572864, -575624, -570814, -565857, -577926, -573426, -566210, -563793, -556310, -553936]
16591e53936j197j056N029M137J460o873r49N05J0034l451l083p121k429J81q35
16576e59584K207M774J1094K049j489j388k391k181K553m412J000P873O223K660
16562e31012l216M769m557n381J464j1646p042l204P40L288m340p342K484m413
16548e69408j721N172L979K521R247P4l533j219O676O878N159O693J289j997l234
16533e33424l133k745k7p7l082o094J055P646m223k272k376q112N245O079j166
16518e46706J1915Q521j092J078k963q095o576L355l467k960K968k132M248J554
16504e40352k221M498L42n54L191L401M403J309o296o737j220N179M446m11m811
16489e35833l493k600o042J0664N545k388l699N283r87j019j488j1808L460M017
$$ y = [-553936, -555133, -556189, -551160, -547023, -545563, -552436, -553385, -552880, -542846, -546297, -549380, -556501, -558930, -558749, -559584, -557377, -552603, -541509, -539460, -540949, -542337, -544728, -546909, -544356, -548768, -547768, -539895, -533672, -531012, -534228, -529459, -534016, -539397, -537933, -549579, -556621, -559825, -559085, -555797, -560137, -567479, -564995, -569408, -571129, -565957, -561978, -559457, -550210, -550136, -553669, -554888, -548212, -541334, -536175, -529482, -528193, -530190, -533424, -536557, -539302, -539329, -539406, -542488, -548582, -547527, -539881, -544104, -546376, -548752, -556864, -551619, -545540, -546706, -534791, -526270, -527362, -526284, -529247, -537342, -543918, -540563, -544030, -546990, -544022, -546154, -541906, -540352, -542573, -538075, -537733, -538287, -535096, -531695, -527292, -525983, -532279, -539016, -540236, -535057, -530611, -531022, -535833, -539326, -541926, -547968, -537304, -531759, -534147, -537846, -532563, -533550, -534569, -536057, -547865, -544405, -540388]
16475e40388o613l210P497L946q57L61n162r2k761K852N525P604L007k731l70
16460e31392K420k152n10L519K182J613k360o114O620J380j834L043O085O088
16446e11412n978j2813l866K439J3365N24o003k922q826n86N329P316K003P054
16432e14376K284K626M207p993k210k973J931N115K00L274m127o464l734L319
16418e18921M919O81K069J033M114L54M503k909j4311p336K408N775j456j098
16404e20175M254k434l168k794O361J044l698J747L433O827M868j0019l38N212
16390e08880Q377Qp131l213n797k027M140O016j684l215J684l151r402l938j69
16375e28382K02Q890N182K318j132o964p233k193J0903J1458N288J407m011O74
$$ y = [-540388, -547001, -550211, -542714, -538768, -539625, -539264, -544426, -544518, -547279, -544427, -538902, -531298, -528291, -531022, -531392, -528972, -531124, -531634, -528115, -525933, -524320, -526680, -532794, -526174, -524794, -526628, -523585, -517500, -511412, -517390, -530203, -534069, -531630, -518265, -517741, -523744, -526666, -535492, -536078, -530749, -523433, -521430, -514376, -512092, -509466, -505259, -513252, -515462, -518435, -516504, -511389, -511189, -507915, -512042, -518506, -522240, -518921, -514002, -513321, -511252, -510219, -506105, -505751, -501248, -504157, -518468, -525804, -523396, -517621, -519077, -520175, -515921, -518355, -521523, -524317, -517956, -516912, -520610, -518863, -515430, -508603, -503735, -513754, -514092, -508880, -500503, -500495, -507626, -510839, -516636, -518663, -514523, -508507, -510191, -513406, -511722, -514873, -524275, -528213, -528382, -528180, -519290, -514108, -511790, -512922, -519886, -527119, -529312, -518409, -506951, -501663, -500256, -504267, -503593]
16361e03593J989q802p512o35j19Q729N048K193k117o303N886K232J84J898M197
16346d96725p835q495q011R367L531j912O625r007n903J2247K252M315j067J239
16332d99379L978K126N97l729j170j942k797L00m539P683p2J569k123Q19O507
16317d92172L436M108K284o196l301j000n719L217K55p291k880N769o242M490
16303e01242J0438j16k461l493p480K318j836L41Q057L561r57k331o49O091M324
16288d85435J034K409M93n954n666k89n396R98J435M189R65Q308N642p553l569
16273d88389N656n956K119p714O201P535j0257r769J73j969P998Q888O39l314
16259d88159j609J425K360K640O837o789r908m663L023M748q56m244M598L281
$$ y = [-503593, -501604, -510406, -517918, -518553, -518672, -509943, -504895, -502702, -504819, -511122, -505236, -503004, -502820, -500922, -496725, -504560, -513055, -521066, -511699, -508168, -510080, -503455, -512462, -518365, -506118, -503866, -499551, -500618, -499379, -495401, -493275, -492678, -496407, -497577, -499519, -502316, -502016, -506555, -498872, -498944, -497375, -499498, -498679, -492172, -488736, -484628, -482344, -488540, -491841, -492841, -498560, -495343, -495088, -502379, -505259, -499490, -505732, -501242, -490804, -490920, -493381, -496874, -504354, -502036, -503872, -503531, -495474, -491913, -492870, -495201, -495850, -489759, -485435, -484401, -481992, -481499, -487453, -493119, -493408, -498804, -497806, -496371, -492182, -491217, -482909, -477267, -484820, -488389, -482733, -488689, -486570, -494284, -488083, -480548, -490805, -500574, -500401, -502370, -494372, -485484, -484845, -488159, -489768, -488343, -485983, -483343, -476506, -483295, -493203, -497866, -494843, -490095, -490951, -495195, -490597, -487316]
16245d87316M510J3j992J2186k852n345m284n254M51q001k987R969O989j769O785
16230d78897M573o411j808N153m554k262R87L215m382J733o5L220n439K926P624
16215d74387N096k022q158r679M410O139J899m201j4718j00K417N176O999N126
16201d76003J244n564o112P91O235m424r73m044L363J057L890m302L332J885o807
16186d86432p591j391L465Q167J378O065J2695M862m294q405n234n725P912L600
16172d70928P742l040m079J94k422L874J484j3868J74P521K831N390K116K62J820
16157d60929p056n994L576l827m730J733N802m036k188N726N926m438j624J1166
16143d60893L032K636n087o116j366J589o750L872j578M419J386p87j842m991
$$ y = [-487316, -482806, -482793, -484785, -472599, -475451, -480796, -485080, -490334, -489883, -497884, -500871, -490902, -483913, -485682, -478897, -474324, -480735, -482543, -477390, -481944, -484206, -483219, -480004, -484386, -482653, -482718, -479498, -484937, -482011, -474387, -469291, -471313, -479471, -489150, -484740, -478601, -476702, -480903, -495621, -495721, -493304, -488128, -481129, -476003, -474759, -480323, -486435, -485644, -479409, -483833, -484806, -488850, -485487, -484430, -480540, -484842, -481510, -479625, -486432, -494023, -495414, -491949, -483782, -482404, -476339, -463644, -458782, -463076, -471481, -476715, -482440, -474528, -470928, -463186, -466226, -470305, -470111, -472533, -468659, -467175, -481043, -480869, -473348, -470517, -465127, -463011, -462749, -460929, -467985, -473979, -470403, -474230, -478960, -477227, -471425, -475461, -477649, -471923, -465997, -470435, -472059, -460893, -457861, -455225, -460312, -466428, -467794, -466205, -472955, -469083, -470661, -466242, -464856, -465643, -467485, -472476]
16129d72476L465J5355J365J88m00o598k548j1767L703M498L511k706l79K850
16115d61939j924l647l967k021L47M304Q382N902j336p184J910J1824J060k536
16101d50825p085K279m101m161K834m946p302k44P33m668M102J552M595N422L769
16086d58046O46L360j0l754N08k962J232j396k396K038k721p49K489m622P458
16071d58925L532L025M288l309r736l381L818p625l947O447J446M655R504L935
16057d46273J264l166o920j1043o806Q612j166J587j448J137J730k349O178R589
16043d49074j301o182j280K272k153q27l736R968m383l093L67J560O654K935N9
16028d48214L032j40p50o990j019N890J0986m661m665L528L572k104j930m225
$$ y = [-472476, -469011, -453656, -452291, -452103, -452503, -459101, -461649, -473416, -469713, -465215, -461704, -464410, -464789, -461939, -463863, -467510, -471477, -473498, -473151, -468847, -460465, -454563, -455899, -463083, -461173, -449349, -448289, -450825, -457910, -455631, -459732, -463893, -461059, -466005, -473307, -473551, -472818, -477486, -473384, -471832, -467237, -461815, -458046, -457400, -454040, -454050, -457804, -457296, -460258, -459026, -460422, -462818, -460780, -463501, -464250, -461761, -466383, -458925, -455393, -452368, -448080, -451389, -461125, -464506, -460688, -468313, -472260, -465813, -464367, -459712, -450208, -446273, -445009, -448175, -455095, -466138, -472944, -464332, -465498, -463911, -465359, -464222, -462492, -464841, -458663, -449074, -450375, -456557, -457837, -455565, -457718, -458545, -462281, -452313, -456696, -459789, -459422, -457862, -451208, -448273, -448214, -445182, -445322, -446072, -453062, -454081, -448191, -437205, -441866, -446531, -443003, -439431, -441535, -443465, -447690]
16014d47690M929K890L483M167m913p76J45m148r29j015l691k386L574L399j385
15999d44346j077K439O126M307j081j0965r404Q605J2872r617l307P575j931j508
15985d41312J0046j730j57M20q237k230J851n891k272N217N480m504j903J0625
15971d34597O111J862N177j200o222Q97p99m642q121k597P461Q381k987o871J336
15956d36811j348l589M932N076p92L296K584n096J608R985K404n904j2370r613
15942d45638j062o71J819J550P212N007P601L239j0262l065M66L068M268K274
15928d24194L00o307L320R812n52m336n365L842k204l596N619k414K969Q901p680
15913d21885j690J232J792n236q609J652L426k503J21M733j3k051l23L634O120
$$ y = [-447690, -442761, -439871, -436388, -432221, -437134, -437910, -437765, -441913, -442842, -443857, -447548, -449934, -446360, -442961, -444346, -445423, -442984, -436858, -432551, -433632, -444597, -454001, -445396, -432524, -442141, -445448, -437873, -439804, -441312, -431266, -432996, -433153, -432733, -440970, -443200, -441349, -447240, -449512, -444295, -438815, -443319, -445222, -434597, -428486, -426624, -421447, -422647, -428869, -427972, -428771, -433413, -441534, -444131, -436670, -428289, -431276, -438147, -436811, -438159, -441748, -436816, -431740, -432532, -429236, -426652, -431748, -430140, -420155, -417751, -423655, -436025, -445638, -446700, -447371, -445552, -444002, -436790, -431783, -424182, -420943, -431205, -434270, -433804, -430736, -426468, -424194, -423894, -430201, -426881, -417069, -417621, -421957, -427322, -423480, -425684, -429280, -423661, -426075, -423106, -414205, -421885, -423575, -422343, -420551, -425787, -434396, -432744, -429318, -431821, -431700, -426967, -426980, -429031, -429354, -425720, -419600]
15898d19600r515m840n572l435K582R449J894j4037n794j459N096J1222O686k227
15884d29550p371p94O925L77M761K65j390p176r65n075m906P288N107P593j925
15869d26836r108P81M628N587l565k741K79j842J554J880J678K823k137K341J038
15854d23640L156n791Q074p55o648m666j940J015M363L385R80J543N93m180Q356
15839d16155n167n257L931J1274j018J969n77o222J615L119L870K021m125k865
15825d13587j184k77k805M700q29j4163J819L567K031j0799q55J519L848j454
15811d28469J875J1678N915p960M891m61q624j0508O197M083L717K609J424K580
15797d11053K944J80L80j450j559q234Q82P821o222m054n015l226R155Q445L574
$$ y = [-419600, -429115, -433955, -439527, -442962, -440380, -430931, -429037, -443074, -448868, -450327, -445231, -434009, -427323, -429550, -436921, -437715, -430790, -430413, -425652, -425387, -426777, -433953, -434918, -439993, -444899, -437611, -432504, -424911, -426836, -435944, -435163, -430535, -424948, -428513, -431254, -430975, -432817, -431263, -429383, -427705, -424882, -427019, -424678, -423640, -420484, -426275, -418201, -418956, -425604, -430270, -432210, -431195, -426832, -423447, -422467, -420924, -420331, -424511, -416155, -421322, -426579, -422648, -411374, -412392, -410423, -411000, -417222, -415607, -412488, -408618, -406597, -410722, -413587, -414771, -415048, -417853, -413153, -413982, -428145, -426326, -422759, -420728, -431527, -432382, -430863, -427015, -428469, -426594, -414916, -409001, -416961, -412070, -412531, -421155, -431663, -425466, -421383, -417666, -415057, -413633, -411053, -408109, -407929, -407549, -408999, -410558, -418792, -417910, -410089, -416311, -420365, -425380, -428606, -419451, -411006, -407432]
15782d07432j186k675n218j251k234K65p324P73k844M75J575P224R673J228J871
15767d07080M383M239o094Q07n549j5137k25N729O680l73Q147M037l255k068n28
15752d06287n15M247J607l739o314m410O948l799j418r30j479r098J733Q605N111
15737d09738k12l002N326m60K504K767M002r659o151P817Pm840p97m314l958O598
15721d14110P429J132O994J0244K543j240p106n554j310J182n569m984N955M706
15707c99688O419J999N825n572m037m409n456l614Q858N900k336p376K966L831
15693c96690N159%j1518n344l997j439L475P865N272k41n344K078j518q066k693
15678d13001J411N54o60P798L762m750j921o21j19O494M274L409J796k093n478
$$ y = [-407432, -408618, -411293, -416511, -417762, -419996, -419731, -427055, -426282, -429126, -428651, -427076, -419852, -410179, -408951, -407080, -402697, -398458, -404552, -403745, -409294, -424431, -424656, -418927, -412247, -412620, -404473, -400436, -403691, -405759, -406287, -406802, -402555, -400948, -404687, -411001, -415411, -408463, -412262, -413680, -414610, -416089, -425187, -423454, -414849, -409738, -409950, -412952, -407626, -408086, -405582, -402815, -398813, -408472, -414623, -406806, -406799, -411639, -412436, -416750, -420708, -414110, -406681, -405549, -398555, -388311, -385768, -387008, -394114, -399668, -400978, -399796, -405365, -410349, -404394, -399688, -393269, -391270, -385445, -391017, -395054, -399463, -404919, -408533, -399675, -393775, -396111, -403487, -400521, -396690, -391531, -391531, -403049, -408393, -412390, -413829, -410354, -402489, -397217, -397458, -402802, -400724, -402242, -410308, -413001, -411590, -411036, -411696, -403898, -400136, -404886, -406807, -407428, -407547, -401053, -396779, -393370, -391574, -393667, -399145]
15663c99145k849j821L090K487O395m594j2699J958P138o355O061M262K86k415
15649c98201P525L837l954k942R4n398J944P835R94n875j902O899k856J649N446
15634c84905j172q328k47N924n473n344P920m362p582n294O434J4115J5425k485
15620c75374m265k850L527L439L147n699m853p093k820j620J571m603n702N386
15606c97809J16P803j640j578L686P56Q618j631p047o611l417J440p053M520L800
15591c96047O255j186j2591J598N049j078M522J115j935n023K254P758k036Q737
15577c82608m88J135k017p570m633K113N533J131O62L526l496m147j484N391N329
15562c81623n228K678L996r088j2296L509P947P097j536j4759l348Q002J56N018
$$ y = [-399145, -401994, -403815, -400725, -398238, -391843, -396437, -409136, -407178, -400040, -406395, -400334, -396072, -395786, -398201, -390676, -386839, -390793, -393735, -393641, -399039, -397095, -389260, -388266, -394141, -396043, -389144, -392000, -390351, -384905, -386077, -394405, -394652, -388728, -394201, -399545, -391625, -395987, -403569, -408863, -402429, -388314, -372889, -375374, -379639, -382489, -378962, -375523, -372376, -378075, -382928, -390021, -392841, -394461, -392890, -397493, -403195, -397809, -397693, -389890, -391530, -393108, -389422, -388666, -380048, -381679, -388726, -395337, -398754, -397314, -404367, -399847, -396047, -389792, -390978, -403569, -401971, -396922, -398000, -393478, -392363, -394298, -399321, -397067, -389309, -391345, -382608, -383096, -381961, -383978, -391548, -396181, -394068, -388535, -387404, -386742, -383216, -386712, -390859, -392343, -386952, -381623, -386851, -384173, -380177, -389265, -401561, -398052, -390105, -383008, -384544, -399303, -402651, -394649, -394493, -389475]
15548c89475L955N962Q679o20k647k457l525n466L134K801l107J906O596j113
15534c75377J867K628L972J144l88o807j584n544o928q44j323j1470q051j19m050
15519d12874Q369J2560R08j2075N562P623R762n569m230M090M305P850j413j0473
15505c85605K033J574N297P166l236j1750k430L847L581l384q15K727j078n77
15491c82650J952j340K626Q9K24q73K55L222N642J086O092k49j225m904o310p694
15475c84057n382l510K985o160P456Q068O365K033L72q297q794N384O999P77m293
15460c80054j2338O29P795Q8L479o916o34J0517K695n533p644N204L848J437L96
15445c77031M005N357j346J0746K999r409l271q202m430J5120M177J783p35q646
$$ y = [-389475, -385520, -379558, -370879, -371499, -374146, -376603, -380128, -385594, -382460, -379659, -382766, -380860, -374264, -375377, -373510, -370882, -366910, -365766, -366154, -372961, -374545, -380089, -387017, -387861, -389184, -400654, -408705, -408824, -412874, -404505, -391945, -391037, -403112, -397550, -389927, -380165, -385734, -389964, -385874, -381569, -373719, -375132, -385605, -383572, -381998, -376701, -369535, -372771, -384521, -386951, -383104, -379523, -382907, -383722, -380995, -382073, -382650, -380698, -382038, -379412, -379323, -379099, -379972, -379717, -376495, -370853, -369767, -363675, -363924, -365149, -370053, -376363, -384057, -389439, -392949, -389964, -396124, -388668, -380600, -374235, -372202, -371830, -380127, -388921, -383537, -376538, -375761, -380054, -392392, -391763, -383968, -383880, -380401, -387317, -387951, -377434, -374739, -380272, -387916, -382712, -378864, -377427, -377031, -373026, -367669, -369015, -358269, -355270, -364679, -367950, -376152, -380582, -365462, -361285, -359502, -360237, -368883]
15431c68883o555M44M482K721k928O034O403q723k204Q56m1P667k155k270l414
15416c68566m686Q444K880M946M903p408l188m57J709J205L28n635n30K690L613
15401c59752p791j2502K986O605P79l309p496k948N724M346K427m72J295m721
15387c74829M921j094n528n6n78R439M811L982k916j479p39n338k475p948j023
15372c80850N599O729M43K97L624P188l983r345j034M119j217J638j196N153O884
15357c55951M482j459R88K194l290k839j446J563N81j590L74j289J2125O500j1579
15342c50636j1671k060R840N435q968k032k34R48N678R61j1960l85p61J047n649
15327c70447J103Q072O170N79r65q092l845O269K439L806k622l367j073O667J388
$$ y = [-368883, -375438, -374994, -370512, -367791, -370719, -364685, -358282, -367005, -369209, -368353, -368394, -360727, -362882, -365152, -368566, -373252, -364808, -361928, -356982, -352079, -359487, -362675, -363132, -361423, -360218, -359890, -365525, -366055, -363365, -359752, -367543, -380045, -377059, -370454, -369675, -372984, -380480, -383428, -377704, -373358, -370931, -371403, -370108, -374829, -369908, -371002, -376530, -376586, -377164, -367725, -362914, -358932, -361848, -363327, -364066, -369404, -371879, -379827, -380850, -375251, -368522, -368079, -367782, -364158, -356970, -360953, -370298, -371332, -367213, -368430, -366792, -367988, -362835, -355951, -351469, -352928, -351940, -349746, -353036, -355875, -357321, -355758, -355177, -356767, -356393, -357682, -345557, -339057, -350636, -362307, -364367, -354527, -349092, -358060, -360092, -360326, -359378, -353700, -352739, -364699, -365084, -365845, -364798, -370447, -369344, -361272, -355102, -354523, -355488, -363580, -367425, -361156, -358717, -354911, -357533, -360900, -361973, -355306, -353918]
15312c53918n144N847l681j1444j711l409L276N856N539m64l174k043o480N865
15298c65085O787L158R959L904m570M054N552q284o534j1314k055P486N03P79
15284c55660j15k582K336L418J639L850Q682m091j5583M259J0803M83P90l090
15270c44861j845m624p318L270l184r074m301N054q119K288L842N122M714O024
15256c53012k062o818m489J1687Q457n59q11N7L222o992r900o80R135O358L288
15241c43119l100J504j539l564j941j984J34k879l959P200L142N952L975K878
15227c37300j430N39N822l944j0185j2268Q15O5K687L356N718l914J525l146k17
15212c51877l72K558L757N96L191r857K361R655k097j2086L003P451j2454M596
$$ y = [-353918, -359062, -353215, -356896, -368340, -370051, -373460, -370184, -364328, -358789, -359253, -362427, -364470, -370950, -365085, -358298, -355140, -345181, -341277, -345847, -341793, -336241, -344525, -351059, -362373, -364428, -356942, -356439, -355660, -355775, -358357, -356021, -352603, -350964, -347114, -338432, -342523, -358106, -353847, -343044, -342561, -341771, -344861, -346706, -351330, -358648, -355378, -358562, -367636, -371937, -366883, -375002, -372714, -368872, -363750, -359036, -353012, -355074, -361892, -366381, -354694, -346237, -346796, -347607, -347550, -344328, -351320, -361220, -361900, -352765, -346407, -343119, -346219, -344715, -346254, -349818, -351759, -353743, -353609, -356488, -360447, -353247, -350105, -344153, -340178, -337300, -338730, -338191, -332369, -336313, -346498, -358766, -357951, -357886, -355199, -351843, -346125, -350039, -348514, -351660, -351877, -352249, -349691, -345934, -345338, -342147, -352004, -349643, -339988, -342085, -354171, -351168, -343717, -356171, -351575]
15198c51575O328q671l247Q737K127J176L918K27L969P932L565j673m087j888
15184c33162l00r501j2200O042p26m180l755N877n68n462K295L418N875R529L056
15169c33762n870j2283k904O92m06Q507l279m381L98K21J0668L968j2743m13r93
15154c52580n389J1413P248J590p053r949n138p528R352N248j423M149L646K465
15140c43949j559r0l411o390k676J477K80M730J3665p80k990K240n711m161o421
15125c55746n883n468J5581N962J621M655R234O80m665l613n91j360m659n410
15111c49662L8J0272O748m578n030k830k516j827P70P798L48j860L593Q95q738
15096c46579j349k019M452Q677J721j0297n876K191N865l33m160L968M50n297
$$ y = [-351575, -345247, -353918, -357165, -348428, -346301, -345125, -341207, -340980, -337011, -329079, -325514, -327187, -331274, -333162, -333462, -342963, -355163, -349121, -349847, -354027, -357782, -351905, -352473, -357935, -355640, -352222, -346347, -336818, -333762, -339632, -351915, -354819, -354127, -354533, -346026, -349305, -353686, -353288, -353067, -342399, -338431, -351174, -351587, -352580, -357969, -346556, -339308, -337718, -344771, -354720, -359858, -367386, -358034, -352786, -354209, -350060, -346414, -343949, -345508, -345598, -349009, -355399, -358075, -356598, -356318, -351588, -337923, -338703, -341693, -339453, -345164, -349325, -355746, -361629, -367097, -351516, -345554, -343933, -339278, -330044, -329364, -334029, -337642, -338233, -339593, -344252, -349662, -349624, -339352, -332604, -337182, -342212, -345042, -347558, -349385, -348615, -340817, -340469, -342329, -338736, -337841, -346579, -347928, -349947, -345495, -336818, -335097, -345394, -351270, -349079, -343214, -343547, -347707, -343739, -343289, -348586]
15082c48586L528JJ296J0805Q454Q469J619j4317p542p80M845N33M216j434l20
15067c29213L864J477m025j0483P41O187k556n711j903L752j277q93N829J270
15053c32941n153j1628k074J649J066N719n648L68J0443R66N530r09n17o948j653
15038c41730k234j416R17o802q83J194j304P082N953j202r936Q30o799R146J3421
15023c33763K152M116J798k606K75r008m240O676N114M999M738N945l030n680
15009c22514l612m237N544p65k577L896j665J855O98Q262J791k219M503j577j4831
14994c27448m355R63M828L693j483J405J131L092J68l513l969o197J527Q062N385
14979c16711j741o688k098k599N168N22p54n553o105M853M088N746M233J388L104
$$ y = [-348586, -345058, -345057, -343761, -332956, -324502, -316033, -314414, -328731, -336273, -337053, -332208, -331675, -327459, -328893, -329213, -325349, -323872, -327897, -338380, -337639, -331452, -334008, -339719, -341622, -337870, -339147, -340040, -334211, -332941, -338094, -349722, -351796, -350147, -349081, -343362, -349010, -348642, -338199, -337233, -331703, -332612, -333129, -340077, -341730, -343964, -345380, -344463, -351265, -352148, -350954, -352258, -345176, -339223, -340425, -350361, -349531, -356330, -347184, -333763, -331611, -327495, -325697, -328303, -328028, -337036, -341276, -334600, -329486, -324487, -319749, -313804, -316834, -322514, -326126, -330363, -324819, -325584, -328161, -324265, -325930, -324075, -323377, -315115, -313324, -315543, -311040, -312617, -327448, -331803, -330840, -326012, -322319, -323802, -322397, -321266, -318174, -318006, -321519, -325488, -331685, -330158, -322096, -316711, -318452, -325140, -327238, -329837, -324669, -324147, -324901, -330454, -336559, -331706, -327618, -321872, -317639, -316251, -313147]
14964c13147J247o990p242j478K115j1004n598m681Q7M698P067M684k270k864
14950c35376k421L060M027o75J709l695J271J448k637j0612j57N790O97l295N732
14935c35134O221J249M927L759j222j879k621m164k128R64N86R86P603P40j551
14920c21664K26K41o764j063l83j308l886J693m495M481M966k633M814R70K13
14905c24592J035K749k303K841p291k247n49k929P196M899r198p521Q370M020
14891c25520r996k513O335Q296L64j643n156J491M576P423m953J900R116L4k358
14876c12604L000r878n290L702n46m982j100K519L58j422P125J1720k559O36M129
14861c05192j854n525L46o058k869p071L986l404l354J3003O681n271n157q51
$$ y = [-313147, -311900, -318890, -326132, -327610, -325495, -336499, -342097, -346778, -346691, -341993, -334926, -330242, -332512, -335376, -337797, -334737, -330710, -331385, -329676, -333371, -332100, -330652, -333289, -343901, -344058, -338268, -337571, -340866, -335134, -328913, -327664, -322737, -318978, -320200, -322079, -324700, -328864, -330992, -330028, -329442, -328456, -320853, -320113, -321664, -321438, -321197, -327961, -329024, -329407, -330715, -334601, -332908, -337403, -332922, -327956, -330589, -325775, -324805, -324592, -323557, -320808, -323111, -320270, -327561, -329808, -330357, -333286, -326090, -321191, -330389, -337910, -329540, -325520, -335516, -338029, -331694, -323398, -323034, -324677, -329833, -328342, -323766, -316343, -321296, -319396, -310280, -310246, -312604, -309604, -319482, -324772, -321070, -321616, -326598, -327698, -325179, -324821, -326243, -319118, -307398, -309957, -309321, -305192, -307046, -312571, -312225, -318283, -321152, -328223, -324237, -327641, -330995, -317992, -311311, -316582, -321739, -322590]
14847c22590l045N655n674l130L791L185n435K86j986q472j708J545O258j989
14833c33309R207R587N818p27q331k813j771m25m167j711Q734J0498L546K157
14819c03707L9j2582j550L015n017j364J1514j61k068k608j0927j0559N8Q114
14805c27803j0437M45J7488J3924O846p431r535Q45l050K458O198k927p991L748
14791c17222K291N11m2Q47P51K604K982P74L906l455o176m390L85l075M662M881
14775c09766M108L343k89l832r262l721j3401L781L802J403M462M030J605r188
14761c22925k927j247R167N6O31P371O42K239K903J389n106j5162n956k194N70
14746c30549P366J0093Q236J704m805q838k281Q12K15q216n743L016N417Q905
$$ y = [-322590, -325635, -319980, -325654, -328784, -324993, -321808, -327243, -326957, -328943, -337415, -339123, -337578, -331320, -333309, -324102, -314515, -308697, -309424, -317755, -320568, -322339, -322764, -326931, -328642, -319908, -309410, -305864, -303707, -303668, -316250, -317800, -314785, -319802, -321166, -309652, -309813, -311881, -314489, -325416, -335975, -335917, -327803, -338240, -337795, -320307, -306383, -299537, -306968, -316503, -315658, -318708, -316250, -310052, -312979, -320970, -317222, -314931, -314420, -314462, -313615, -312864, -310260, -307278, -306504, -302598, -306053, -312229, -316619, -316234, -319309, -314647, -309766, -305658, -302315, -302604, -306436, -315698, -319419, -332820, -329039, -325237, -323834, -319372, -315342, -313737, -322925, -325852, -327099, -317932, -317876, -317245, -309874, -309232, -306993, -304090, -302701, -307807, -322969, -328925, -331119, -330549, -323183, -313090, -304854, -303150, -307955, -316793, -319074, -318262, -318047, -326263, -332006, -328990, -323573, -314668]
14732c14668M623P039Q308N304q327l613L218o444q516L107M798j773r010R60
14718c14994o244K587P713N225M11o975K580j994K741Q215K545J655k188j1604
14704c10327J324Q14m535M06j180M329J859m070L342J142l722k147j53j915o311
14689c21144p170j255N4L90O20K317K591K693K051M754L839M09N438m116j4557
14674c23086m128J0223K340N167M107m813m801Q61J0938l546m170o564L664J094
14660c12714J767J182Q114m661j823L744n29n81j426J731M591K84K313j47J794
14645b96361j121m623k856N87R100L364K321k465r6J890p582k209M974l569n415
14630c04061l793q49O136M066M290r503j0668L412k988k567L39M384Q116J9587
$$ y = [-314668, -310045, -303006, -294698, -289394, -297721, -301334, -298116, -304560, -313076, -309969, -305171, -306944, -315954, -314994, -321238, -318651, -310938, -305713, -305302, -312277, -309697, -311691, -308950, -300735, -298190, -296535, -298723, -310327, -309003, -308189, -312724, -312318, -313498, -309169, -307310, -311380, -308038, -306896, -310618, -312765, -312918, -314833, -321144, -328314, -329569, -329515, -329125, -328505, -326188, -323597, -320904, -318853, -314099, -310260, -309851, -304413, -308529, -323086, -327214, -316991, -314651, -309484, -305377, -310190, -314991, -314130, -303192, -306738, -310908, -317472, -313808, -312714, -310947, -309765, -301651, -306312, -308135, -304391, -304920, -305501, -306927, -305196, -300605, -300321, -298008, -298155, -296361, -297482, -302105, -304961, -304374, -295274, -291910, -289589, -292054, -292150, -290260, -297842, -300051, -295077, -298646, -304061, -307854, -308703, -302567, -298501, -294211, -303714, -314382, -310970, -313958, -316525, -316186, -311802, -303686, -284099]
14616b84099J021m185k170q123j604k640m272R474J017n126n191o633J23J0977
14602c01431J090q646o39J799O401n675J372j801M217o687k543l812K079J7909
14588b96367J0722K20p54l852o513p895l56P474o168L562K376j186o887M433P239
14573b93952O79k530n554K004p52p479k124j516j389O425N390J0147K538l159
14559b91272K959P935j753j599P629K58o870l892q548l022O181l818K117M758
14545b88937j71J0407M376j2178q377O347P053m645j2033Q05Q448l229n664N136
14531b92662k155o53q948m610L706k597J346J0563O111J642o2j637L546m215j1469
14516c02094r237j2937R305M721J034O079M365K671N239K918p46N746k69l827
$$ y = [-284099, -283078, -287263, -289433, -297556, -299160, -301800, -306072, -296598, -295581, -300707, -305898, -312531, -312408, -301431, -300341, -308987, -309626, -307827, -301426, -307101, -305729, -307530, -303313, -310000, -312543, -316355, -314276, -296367, -285645, -285425, -286179, -290031, -296544, -304439, -304795, -297321, -303489, -299927, -297551, -298737, -305624, -301191, -293952, -293273, -295803, -301357, -299353, -300105, -307584, -309708, -311224, -312613, -306188, -300798, -290651, -288113, -291272, -288313, -280378, -282131, -283730, -276101, -275843, -282713, -286605, -295153, -298175, -291994, -295812, -293695, -288937, -289108, -278701, -274325, -286503, -294880, -288533, -281480, -286125, -298158, -297353, -288905, -292134, -297798, -292662, -294817, -295470, -304418, -309028, -305322, -307919, -306573, -296010, -289899, -288257, -288319, -289956, -286410, -290625, -302094, -311331, -324268, -314963, -310242, -309208, -303129, -298764, -296093, -290854, -287936, -288682, -282936, -283205, -287032]
14502b87032l287l666J2537n505o291m886m520m802l486k027p74K687J577R85
14488c08490M501J6404r83p422j624J064j984L632L073o583J90Q286M999l711
14474b88648o681K813N137P765j189L182K084J750r494j0684J184M45Q816K406
14460b81114k776n437L675L642j508J357K384J663o242j9946j2963L173J3943
14447c00149J6726J439K085K405p1j0051r734K1P0l069O178R5n545j50L92R131
14431b90227M955j518R10o852J173L641j556l945N843J0388o390o052O393j05
14417b83342J927J2002p8j0129L445J737J782k36j363n512r796r253j232L278
14403b96770n0j176L207K653O127k943j1277k308P652L954O128L49o955p07j140
$$ y = [-287032, -290319, -293985, -281448, -286953, -293244, -298130, -302650, -307452, -310938, -312965, -313739, -311052, -309475, -308490, -303989, -287585, -288568, -295990, -297614, -296550, -298534, -294902, -291829, -298412, -298222, -289936, -284937, -288648, -295329, -292516, -287379, -279614, -280803, -277621, -275537, -273787, -283281, -293965, -292781, -292336, -283520, -281114, -283890, -289327, -285652, -282010, -283518, -282161, -279777, -278114, -284356, -304302, -317265, -314092, -300149, -283423, -281984, -279899, -277494, -277565, -287616, -297350, -297329, -297259, -300328, -294150, -294055, -299600, -299750, -299358, -290227, -285272, -286790, -285880, -292732, -291559, -287918, -289474, -293419, -287576, -277188, -283578, -289630, -283237, -283342, -281415, -269413, -269491, -279620, -276175, -274438, -272656, -272892, -274255, -279767, -289563, -298816, -300048, -296770, -296820, -297996, -294789, -292136, -286009, -288952, -300229, -302537, -294885, -290931, -284803, -284454, -291409, -292116, -293256]
14388b93256j0336p763M855K328K645M913O878K717j030l560O000N71o454M732
14374b86760O811p560k288m84M697J0450j0185j4144k721M804l88Q681N569k381
14360b85899J524O713L536n850o720n062L864J0045N094j719p684L7M416k130
14346b79835p438k728J609L433l248r612l094J1053N912m213R06K380j57n97q861
14331b94490L625M47j313K594k167r304N47O328M492J902N825K930k625J170p2
14316b80111n038m917M13K463R642k436m894K054M748j357l095l799J783m47Q070
14301b76921K871J129R5j724o98k093j382l877n791j0537l11O635r16O607P798
14286b79115q029j983M959N355l630K349N737J208J956n827n740n956N448L068
$$ y = [-293256, -303592, -311355, -306500, -304172, -301527, -296614, -289736, -287019, -288049, -291609, -285609, -285038, -291492, -286760, -279949, -287509, -289797, -290281, -285584, -275134, -285319, -299463, -302184, -297380, -297768, -289087, -283518, -285899, -284375, -277662, -274126, -279976, -286696, -291758, -287894, -277849, -272755, -274474, -282158, -282121, -277705, -279835, -287273, -290001, -288392, -284959, -288207, -297819, -300913, -289860, -283948, -288161, -287255, -284875, -285032, -285629, -294490, -290865, -290418, -291731, -289137, -291304, -300608, -300061, -293733, -289241, -287339, -281514, -278584, -281209, -280039, -280111, -285149, -290066, -289653, -287190, -277548, -279984, -284878, -282824, -278076, -279433, -282528, -286327, -284544, -284991, -276921, -274050, -272921, -272826, -274550, -275248, -277341, -278723, -282600, -288391, -298928, -299239, -292604, -293520, -286913, -279115, -287144, -289127, -284168, -278813, -282443, -280094, -274357, -273149, -271193, -277020, -282760, -288716, -283268, -280200]
14272b80200m153L506N12r196o403L117M068L788M985R251N183P98p360o399L229
14257b75274J3633P370L06q187r487r184n495N935K753o069k661O943K937Q13
14243b75667n919l124q335m92L807j781P400J767k228M058O968K930l995j975
14229b76586N633O484l86j1877r071M200R923J477K109j692m75q533j768l930
14215b84492k711O403O57l558r44K06O114J00O96L448O064k596k251J155L628
14200b68081O910o019j328o425P36K433M511k959L616n261j3517o854o61M051
14186b88848K877M050J454K100j033r679l813P762J4468j289o536q347K49R45
14172b85640m340K137K680L12J935j56N501K510L411k141K425O037m501j139m935
$$ y = [-280200, -284353, -280847, -280335, -289531, -295934, -292817, -288749, -284961, -279976, -270725, -265542, -264744, -272104, -278503, -275274, -261641, -254271, -253965, -262152, -271639, -280823, -286318, -280383, -277630, -283699, -286360, -279417, -276480, -275667, -281586, -284710, -293045, -293537, -289730, -291511, -284111, -282344, -284572, -280514, -273546, -270616, -274611, -276586, -270953, -264469, -264855, -276732, -285803, -281603, -271680, -270203, -268094, -269786, -270261, -278794, -280562, -284492, -287203, -280800, -280143, -283701, -284645, -284439, -278325, -278225, -277529, -274081, -268017, -270613, -272864, -271709, -268081, -261171, -267190, -268518, -274943, -274207, -271774, -267263, -270222, -266606, -271867, -285384, -292238, -292899, -288848, -285971, -281921, -280467, -278367, -279400, -289079, -292892, -285130, -270662, -271951, -278487, -286834, -286585, -285640, -289980, -287843, -285163, -284851, -282916, -283072, -277571, -275061, -271650, -273791, -271366, -265329, -269830, -270969, -275904]
14157b75904j04M208j117l209m124J784O938M491K671L50L2N544n838N577J1382
14142b47319k875j1198k982K382j566j557L714k298n423K871l910r038M221O215
14128b68763L598J319M75l951j0067L59j014J483Q037K756l47l399M238n086n150
14113b75512K319j96o948N307K555o465L937R769n91l216l63L14N809Q462n787
14098b60606j550Q47r250j649j680n767P125j744J509J185r2J696L034j2634q16
14083b80392J1705N525L608N37k788j460j333k579Q615P666l574m203L46L37m891
14068b62881l184n42n702m540P730K896K616M726k799L841N141n124o380o748
14054b70950l39N084K487J02n64K791K378m055n507j985N951P831P469q259k283
$$ y = [-275904, -276008, -271800, -272917, -276126, -280250, -278466, -271528, -267037, -264366, -264016, -263984, -258440, -264278, -258701, -247319, -250194, -261392, -264374, -261992, -263558, -265115, -261401, -263699, -269122, -266251, -270161, -279199, -274978, -268763, -265165, -263846, -263371, -267322, -277389, -277030, -278044, -276561, -268524, -265768, -266115, -269514, -265276, -270362, -275512, -273193, -273389, -280337, -275030, -272475, -278940, -275003, -265234, -265825, -269041, -269404, -269090, -263281, -254819, -260606, -262156, -261309, -270559, -272208, -273888, -279655, -272530, -274274, -272765, -271580, -271672, -269976, -266942, -279576, -280392, -268687, -263162, -259554, -259017, -261805, -263265, -264598, -267177, -258562, -250896, -254470, -258673, -258327, -257990, -262881, -266065, -266607, -272309, -276849, -269119, -266223, -263607, -258881, -261680, -257839, -252698, -257822, -264202, -270950, -271289, -266205, -263718, -263616, -264180, -261389, -259011, -263066, -268573, -270558, -264607, -256776, -249307, -257566, -259849]
14039b59849q25k683N232L281l502l89L570j148j4235o343N501J3644O838J412
14025b49496m632j1262j434P346J837l278p637M015K415k424p750P711L544O573
14011b54472N296k648j2115n718L998M394P373M167o848k206R191L084l282n6
13997b49842l206J232L816K683m50p263m07N560j47j3365j25L465K485o901L956
13982b58509P112j876K288Q095M108q817r137q415L278L324J483M222l590L685
13968b52749N107l537n163j0698N323K654p972l57k94J240k58J736J0191L126
13954b51651m689n38k53R76l17j116O863p0k580N756J471L962j3524p409K357
13939b60762N982J4740J859r300o103J344p484m655L216J0625N751r000n503j815
$$ y = [-259849, -260674, -263357, -258125, -254844, -258346, -258735, -255165, -256313, -270548, -276891, -271390, -257746, -250908, -249496, -254128, -265390, -266824, -259478, -257641, -260919, -268556, -264541, -262126, -264550, -272300, -264589, -261045, -254472, -249176, -251824, -263939, -269657, -265659, -261265, -253892, -249725, -256573, -258779, -249588, -246504, -249786, -249842, -253048, -251816, -248000, -245317, -245767, -253030, -253437, -247877, -248024, -261389, -261514, -258049, -255564, -262465, -258509, -251397, -253273, -250985, -242890, -238782, -247599, -256736, -265151, -261873, -258549, -257066, -252844, -256434, -252749, -247642, -251179, -256342, -267040, -261717, -259063, -267035, -267392, -267686, -266446, -266704, -264968, -254777, -251651, -256340, -256878, -257131, -256155, -256472, -257588, -250725, -250795, -253375, -247619, -246148, -242186, -255710, -263119, -260762, -254780, -240040, -238181, -247481, -253584, -252240, -259724, -264379, -261163, -250538, -244787, -253787, -259290, -261105]
13925b61105l56K639M716n663O213N090L893p181J250m855M419L062o036l741
13911b57655o041k187n800P24k973l001K314J0207N986m457j80n21n904l199q202
13896b80889m042R607J3577j146j1598J008j24n779L576J3120K387m368Q288N591
13882b50792O283j817m329m141O913J383O428m229o175m038p709r217L103L127
13868b65210P203M681M861o448k056m15O840O795j237j421k917o087J674K050
13854b51687n623j8k476K436J789l356N18j41l933m042N340J321N028J0081M427
13839b40336L715m760r66k454j0784m130M476K918m035l708o480K104K917L332
13825b58191n58J471K010R2R05O270k985j475n196J229Q239M316L822l82p047
$$ y = [-261105, -261461, -258822, -254106, -259769, -253556, -248466, -244573, -251754, -250504, -255359, -250940, -247878, -253914, -257655, -263696, -265883, -271683, -270959, -273932, -276933, -274619, -264412, -258426, -262883, -263063, -263584, -269488, -272687, -280889, -284931, -275324, -261747, -262893, -274491, -273483, -273607, -279386, -275810, -262690, -260303, -264671, -256383, -250792, -244509, -246326, -250655, -254796, -247883, -246500, -240072, -244301, -250476, -254514, -262223, -271440, -268337, -265210, -258007, -253326, -248465, -254913, -256969, -257384, -250544, -243749, -244986, -246407, -249324, -255411, -253737, -251687, -257310, -257328, -259804, -257368, -255579, -258935, -258417, -258558, -262491, -266533, -261193, -259872, -254844, -244763, -240336, -236621, -241381, -242347, -244801, -255585, -259715, -255239, -252321, -256356, -260064, -266544, -264440, -261523, -258191, -258749, -257278, -255268, -255176, -254271, -248001, -250986, -252461, -257657, -256428, -248189, -243873, -240051, -240433, -247480]
13810b47480J151J205P41r378n840O043K313O369K68q210j996K133j863m115k378
13795b61037O584L578k985j52K822M77k501O465J0425K431j982k298l846k161
13781b44180N145k617m945p320k519M572Q543j2760j0645K710m941O145J4297
13768b48515P435M349m35o943R240r29q330j293l254P611M311L921R52j643l316
13753b36839j1867n95J0769J610M89j552p172J871K36K700M44n9m593K255j212
13738b43515N49P582q826j1951p683n857n086j78M582M82j638P312N499l074o598
13723b68400K928L359L368M237n473L117J454K314l081l619L671q692m89O633
13709b58673p87M542Q660K712n255o105M410L193l860M9k97q729M087M661M872
$$ y = [-247480, -246329, -245124, -244383, -253761, -259601, -253558, -251245, -244876, -244608, -252818, -254814, -252681, -254544, -258659, -261037, -254453, -250875, -253860, -254012, -251190, -250713, -253214, -246749, -236324, -233893, -235875, -238173, -242019, -244180, -239035, -241652, -246597, -253917, -256436, -251864, -243321, -256081, -266726, -264016, -268957, -262812, -248515, -241080, -236731, -237166, -244109, -234869, -235798, -244128, -245421, -248675, -241064, -236753, -232832, -231880, -233523, -236839, -248706, -249301, -238532, -236922, -236433, -237985, -245157, -243286, -243050, -240350, -239906, -239965, -244558, -242303, -243515, -242966, -235384, -244210, -256161, -263844, -269701, -274787, -274965, -270383, -269901, -271539, -264227, -258728, -261802, -268400, -265472, -262113, -258745, -254508, -259981, -256864, -255410, -253096, -256177, -259796, -256125, -264817, -265306, -258673, -259460, -254918, -246258, -243546, -248801, -254906, -250496, -247303, -251163, -251114, -251411, -260140, -256053, -251392, -246520]
13694b46520P081L949j489q369j069J579l928o00J762p286J739R755l856p211
13680b54463q291N918M932P900Q037Q02l814o359N423j605k761R0P98L789L265
13665b36339m111l502M497k52P59J735j178j424J305L818o270m492n520l666J68
13650b54472R515q836k300N177n81k660j082O200N186J0964K861l709Q798J279
13636b23660q276j875O06j4701j0924j50L03L208R770K837J56m081p604J541J450
13621b51400N042K106k604j049J640n09r528m282M39j1786Q625L644K651j248
13607b58259K638K464M118M153J5413k959j0053k376J123k615l815j942j334O649
13593b46795R301J207k105J171k074M016j040R597K877p2n339j3483j5102J704
$$ y = [-246520, -239439, -235490, -236979, -245348, -246417, -244838, -248766, -249366, -247604, -254890, -253151, -243396, -247252, -254463, -262754, -256836, -251904, -244004, -235967, -235165, -238979, -245338, -239915, -241520, -244281, -244191, -243393, -239604, -236339, -240450, -243952, -239455, -239707, -238948, -237213, -238391, -239815, -238510, -234692, -240962, -245454, -250974, -254640, -254472, -244957, -253793, -256093, -250916, -251497, -254157, -255239, -249039, -243853, -232889, -230028, -233737, -224939, -223660, -231936, -233811, -233205, -247906, -258830, -258980, -258677, -255469, -245699, -242862, -242706, -246787, -254391, -252850, -251400, -246358, -244252, -246856, -247905, -246265, -246774, -256302, -260584, -260145, -271931, -263306, -259662, -257011, -258259, -255621, -253157, -249039, -244886, -229473, -232432, -242485, -244861, -243738, -246353, -250168, -252110, -253444, -246795, -237494, -236287, -238392, -237221, -239295, -235279, -236319, -226722, -223845, -223917, -229256, -242739, -257841, -256137]
13579b56137P978N830J116n669K049O72N89N406j951k928m456p063n824L187l92
13564b57593J690r7k168Q066R582K272n010j5148m821Q944R870j615k074n630
13550b53732k980O244O236L367q051K96P51O939J0563j919j0320q144m914p749
13536b63413R86O949K936L58N083n101j1877R28J3626J1140r04M900P188m147
13522b31348q242k441l253M953N020K607J447o033j2115j191M628k237J1736M744
13508b31725j326q504j434J0912J308k692k772J572J804n065m097O081J182O375
13494b28381L201r619O49o877l748r07o47N425O10j8559J511M533J995J3162J2726
13479b24926q82m247m731R96L37p860k422N815P277L560j0461K100j565k542n479
$$ y = [-256137, -248159, -242329, -241213, -246882, -244833, -244161, -243572, -238166, -240117, -243045, -247501, -254564, -260388, -257201, -257593, -255903, -256000, -258168, -250102, -240520, -238248, -243258, -258406, -263227, -254283, -244413, -246028, -248102, -253732, -256712, -250468, -244232, -240865, -248916, -248620, -247869, -240930, -230367, -232286, -242606, -250750, -255664, -263413, -262427, -255478, -252542, -252184, -247101, -252202, -264079, -263151, -249525, -238385, -239289, -234389, -227201, -231348, -239590, -242031, -245284, -240331, -235311, -232704, -231257, -237290, -249405, -250596, -245968, -248205, -236469, -231725, -233051, -241555, -242989, -232077, -230769, -233461, -236233, -234661, -232857, -237922, -242019, -235938, -234756, -228381, -225180, -234799, -234150, -241027, -244775, -245682, -246329, -240904, -240294, -258853, -257342, -252809, -250814, -237652, -224926, -225808, -230055, -234786, -233790, -233453, -241313, -243735, -237920, -230643, -227083, -237544, -235444, -237009, -239551, -245030]
13464b45030N45M653n957n222o007K626P180K072l163J486K760M521L456J750
13450b34330N16K869J124J143O575K375l381j0796J864m116q15j787n522k296
$$ y = [-245030, -244485, -239832, -245789, -251011, -257018, -254392, -247212, -245140, -248303, -246817, -244057, -239536, -236080, -234330, -233814, -230945, -229821, -228678, -222103, -219728, -223109, -233905, -232041, -236157, -236972, -238759, -244281, -246577]
$$ [...]
##END NTUPLES=NMR SPECTRUM
##END=
