##TITLE=Analysis number 315779
Compound Code rf 01049
Book Reference 382/148/1
Project Code adrs
Chemist Name simons
##JCAMPDX= 6.0         $$ Bruker NMR JCAMP-DX V2.0
##DATA TYPE= NMR SPECTRUM
##DATA CLASS= NTUPLES
##ORIGIN= Bruker BioSpin GmbH
##OWNER= NMR
$$ XWIN-NMR		Version 3.5
$$ Thu Dec  1 14:12:10 2005 GMT Standard Time (UT+0h)  MAYBRIDGE\NMR@NMR_250MHZ
##.OBSERVE FREQUENCY= 250.131544655141
##.OBSERVE NUCLEUS= ^1H
##.ACQUISITION MODE= SIMULTANEOUS (DQD)
##.ACQUISITION SCHEME= undefined
##.AVERAGES= 16
##.DIGITISER RES= 18
##SPECTROMETER/DATA SYSTEM= dpx250
##.PULSE SEQUENCE= zg30
##.SOLVENT NAME= DMSO
##.SHIFT REFERENCE= (INTERNAL, DMSO, 0, 16.522)
##AUDIT TRAIL= $$ (NUMBER, WHEN, WHO, WHERE, WHAT)
$$ ##TITLE= Audit trail, XWIN-NMR		Version 3.5
$$ ##JCAMPDX= 5.01
$$ ##ORIGIN= Bruker BioSpin GmbH
$$ ##OWNER= NMR
$$ C:\u/data/dgb/nmr/ADRS/13260/pdata/1/auditp.txt
$$ ##AUDIT TRAIL=  $$ (NUMBER, WHEN, WHO, WHERE, WHAT)
(   1,<2005-12-01 14:11:42.47 +000>,<MAYBRIDGE\NMR>,<NMR_250MHZ>,
      <created by zg, POWCHK disabled, PULCHK disabled
       configuration hash MD5:
       62 19 C7 07 E1 42 D1 B7 37 6C 3D D0 77 39 F9 E6
       data hash MD5: 64K
       36 CF BE D6 DA 44 17 38 6A B0 DC 97 D3 35 02 5A>)
(   2,<2005-12-01 14:11:55.38 +000>,<MAYBRIDGE\NMR>,<NMR_250MHZ>,
      <Start of raw data processing
       ef LB = 0.3 FT_mod = 6 PKNL = 1 SI = 32K 
       data hash MD5: 32K
       77 88 9A 3B 71 84 3F 4F 73 B2 38 42 14 A1 8F C8>)
(   3,<2005-12-01 14:11:57.30 +000>,<MAYBRIDGE\NMR>,<NMR_250MHZ>,
      <apk 
       data hash MD5: 32K
       F7 33 77 E1 E6 C0 7B 19 A3 77 64 54 AC 94 48 9D>)
(   4,<2005-12-01 14:11:58.07 +000>,<MAYBRIDGE\NMR>,<NMR_250MHZ>,
      <abs ABSG = 5 
       data hash MD5: 32K
       AC 8F 1E 40 68 A0 71 BE 8C E1 37 96 9E 26 A4 B0>)
$$ ##END=
$$ 
$$ hash MD5
$$ 0A B2 3B D8 01 10 43 F5 FB 56 11 90 A8 56 61 77
##$RELAX= 
##$RELAX= 
##$RELAX= 
##$RELAX= 
##$RELAX= 
##$RELAX= 
##$RELAX= 
$$ Bruker specific parameters
$$ --------------------------
##$DU= <C:\u>
##$EXPNO= 13260
##$NAME= <ADRS>
##$PROCNO= 1
##$TYPE= <nmr>
##$USER= <dgb>
##$AMP= (0..31)
100 100 100 100 100 100 100 100 100 100 100 100 100 100 100 100 100 100 
100 100 100 100 100 100 100 100 100 100 100 100 100 100 
##$AQSEQ= 0
##$AQ_mod= 3
##$AUNM= <au_zg>
##$AUTOPOS= <22 >
##$BF1= 250.13
##$BF2= 250.13
##$BF3= 250.13
##$BF4= 250.13
##$BF5= 500.13
##$BF6= 500.13
##$BF7= 500.13
##$BF8= 500.13
##$BYTORDA= 1
##$CFDGTYP= 0
##$CFRGTYP= 5
##$CHEMSTR= <none>
##$CNST= (0..31)
1 1 145 1 1 1 1 1 1 1 1 1 1 1 1 1 1 1 1 1 1 1 1 1 1 1 1 1 1 1 1 1 
##$CPDPRG= <>
##$CPDPRG1= <>
##$CPDPRG2= <>
##$CPDPRG3= <>
##$CPDPRG4= <mlev>
##$CPDPRG5= <mlev>
##$CPDPRG6= <mlev>
##$CPDPRG7= <mlev>
##$CPDPRG8= <mlev>
##$CPDPRGB= <>
##$CPDPRGT= <>
##$D= (0..31)
0 1 0 0 0 0 0 0 0 0.06 0 0 0 0 0 0 0.0002 0 0 0 0 0 0 0 0 0 0 0 0 0 0 
0 
##$DATE= 1133446296
##$DBL= (0..7)
120 120 120 120 120 120 120 120 
##$DBP= (0..7)
150 150 150 150 150 150 150 150 
##$DBP07= 0
##$DBPNAM0= <>
##$DBPNAM1= <>
$$ [...]
##$SUBNAM7= <"">
##$SUBNAM8= <"">
##$SUBNAM9= <"">
##$SW= 20.6930455092707
##$SWIBOX= (0..15)
0 0 3 0 0 0 0 0 0 0 0 0 0 0 0 0 
##$SW_h= 5175.983436853
##$TD= 65536
##$TD0= 1
##$TE= 294.16
##$TE2= 300
##$TE3= 300
##$TEG= 300
##$TL= (0..7)
0 120 120 120 120 120 120 120 
##$TP= (0..7)
150 150 150 150 150 150 150 150 
##$TP07= 0
##$TPNAME0= <>
##$TPNAME1= <>
##$TPNAME2= <>
##$TPNAME3= <>
##$TPNAME4= <>
##$TPNAME5= <>
##$TPNAME6= <>
##$TPNAME7= <>
##$TPOAL= (0..7)
0.5 0.5 0.5 0.5 0.5 0.5 0.5 0.5 
##$TPOFFS= (0..7)
0 0 0 0 0 0 0 0 
##$TUNHIN= 0
##$TUNHOUT= 0
##$TUNXOUT= 0
##$USERA1= <user>
##$USERA2= <user>
##$USERA3= <user>
##$USERA4= <user>
##$USERA5= <user>
##$V9= 5
##$VALIST= <valist>
##$VCLIST= <CCCCCCCCCCCCCCC>
##$VD= 0
##$VDLIST= <DDDDDDDDDDDDDDD>
##$VPLIST= <PPPPPPPPPPPPPPP>
##$VTLIST= <TTTTTTTTTTTTTTT>
##$WBST= 1024
##$WBSW= 4
##$XGAIN= (0..3)
0 0 0 0 
##$XL= 0
##$YL= 0
##$YMAX_a= 466901
##$YMIN_a= -427862
##$ZGOPTNS= <>
##$ZL1= 120
##$ZL2= 120
##$ZL3= 120
##$ZL4= 120
##$ABSF1= 16.522
##$ABSF2= -4.171173
##$ABSG= 5
##$ABSL= 3
##$ALPHA= 0
##$AQORDER= 0
##$ASSFAC= 0
##$ASSFACI= 0
##$ASSFACX= 0
##$ASSWID= 0
##$AUNMP= <proc_1d>
##$AZFE= 0.1
##$AZFW= 0.1
##$BCFW= 0
##$BC_mod= 0
##$BYTORDP= 0
##$COROFFS= 0
##$CY= 12.5
##$DATMOD= 1
##$DC= 0
##$DFILT= <>
##$DTYPP= 0
##$F1P= 14.0000005364418
##$F2P= -0.99999901652339
##$FCOR= 0.5
##$FTSIZE= 32768
##$FT_mod= 6
##$GAMMA= 0
##$GB= 0
##$INTBC= 1
##$INTSCL= 1
##$ISEN= 128
##$LB= 0.3
##$LEV0= 0
##$LPBIN= 0
##$MAXI= 10000
##$MC2= 0
##$MEAN= 0
##$ME_mod= 0
##$MI= 0
##$NCOEF= 0
##$NC_proc= -2
##$NLEV= 6
##$NOISF1= 0
##$NOISF2= 0
##$NSP= 0
##$NTH_PI= 0
##$NZP= 0
##$OFFSET= 16.522
##$PC= 1
##$PHC0= 76.36631
##$PHC1= 5.591736
##$PH_mod= 1
##$PKNL= yes
##$PPARMOD= 0
##$PSCAL= 4
##$PSIGN= 0
##$REVERSE= no
##$SF= 250.13
##$SI= 32768
##$SIGF1= 0
##$SIGF2= 0
##$SINO= 400
##$SIOLD= 32768
##$SREGLST= <1H.DMSO>
##$SSB= 0
##$STSI= 32768
##$STSR= 0
##$SW_p= 5175.98343685301
##$SYMM= 0
##$S_DEV= 0
##$TDeff= 65536
##$TDoff= 0
##$TI= <Analysis number 999999
Compound Code 99
Book Reference 9
Project Code 9>
##$TILT= no
##$TM1= 0
##$TM2= 0
##$TOPLEV= 0
##$USERP1= <user>
##$USERP2= <user>
##$USERP3= <user>
##$USERP4= <user>
##$USERP5= <user>
##$WDW= 1
##$XDIM= 32768
##$YMAX_p= 287221348
##$YMIN_p= -157339
$$ End of Bruker specific parameters
$$ ---------------------------------
##NTUPLES= NMR SPECTRUM
##VAR_NAME=  FREQUENCY,     SPECTRUM/REAL,   SPECTRUM/IMAG
##SYMBOL=    X,             R,               I
##VAR_TYPE=  INDEPENDENT,   DEPENDENT,       DEPENDENT
##VAR_FORM=  AFFN,          ASDF,            ASDF
##VAR_DIM=   32768,         32768,           32768
##UNITS=     HZ,            ARBITRARY UNITS, ARBITRARY UNITS
##FACTOR=    0.157963299565203, 1,           1
##FIRST=     4132.6476996994, 0,             0
##LAST=      -1043.33573715361, 0,           0
##MIN=       -1043.33573715361, -157339,     0
##MAX=       4132.6476996994, 287221348,     0
$$ Real data points
##PAGE= N=1
##DATA TABLE= (X++(R..R)), XYDATA
$$ [...]
$$ plain form
16672 -13099 -3417 16491 8660 -7683 -4355 4273 -16054 -31301 -9912 12293 -5574 -27885
16660 -27885 -19271 -5376 -6454 -15165 1655 -2328 -7155 -10127 8700 3993 -7150 -20029 -3312
16647 -3312 10097 5476 3378 7110 -8867 -41293 -32986 5608 15073 -6574 -33983 -50283 -41704
16634 -41704 -41512 -50183 -44575 -34993 -34813 -28520 -26699 -9282 2143 -1419 -2785 7703 23188 21965
16620 21965 8964 5945 12983 -10373 -52637 -48960 -36477 -25018 -20444 -2879 -1632 3286 8120
16607 8120 12226 530 -7658 15131 24847 11429 -5401 3411 6922 13108 4869 7100 11407 8322
16593 8322 8977 5967 -14833 -24875 -14444 -19444 9201 25448 30644 20525 11395 15133 22942
16580 22942 24097 23293 12102 -26838 -45587 -30149 -8911 -9960 -4402 3124 1875 5317 13905
$$ packed form
16672a3099R682J9908p831j6343L328Q628k0327j5247K1389K2205j7867k2311
16660b7885Q614J3895j078q711J6820l983m827k972J8827m707j1143j2879J6717
16647c312J3409m621k098L732j5977l2426Q307L8594R465k1647k7409j6300Q579
16634d1704J92q671N608R582J80O293J821J7417J1425l562j366J0488J5485j223
16620B1965j3001l019P038k3356m2264L677J2483J1459M574J7565J247M918M834
16607H120M106j1696q188K2789R716j3418j6830Q812L511O186q239K231M307l085
16593H322O55l010k0800j0042J0431n000K8645J6247N196j0119r130L738P809
16580B2942J155q04j1191l8940j8749J5438K1238j049N558P526j249L442Q588
$$ plain form
16567 13905 20189 4347 -2299 -3562 -761 24887 32301 15109 -4983 3707 9191 21636 28247
16554 28247 22571 21273 7307 -4466 -24822 -36725 -19217 -15859 -4050 14169 8698 4705 9320
16541 9320 22621 11662 8301 14221 30797 15553 -4426 -11145 -17416 -42249 -53831 -49116 -40321
16528 -40321 -37292 -32876 -13555 -14093 -5853 -9265 -16956 -17032 -12318 9505 16440 22262 12570 -1554
16514 -1554 8934 15032 702 144 11976 13268 -5892 -9476 -9877 11081 28050 9471 -1246
16501 -1246 -9004 -16029 -4974 -5360 9091 20501 17656 -1076 -2625 -5718 18543 16731 8653 11879
16487 11879 12996 -3914 -28644 -36517 -10791 -9972 -3160 -18407 -38146 -52014 -37019 -25634 -30785
16474 -30785 -26357 -7429 10790 19689 7677 7566 7761 1816 -423 -2267 5740 25738 28055 17266
$$ packed form
16567A3905O284j5842o646j263K801K5648P414j7192k0092Q690N484J2445O611
16554B8247n676j298j3966j1773k0356j1903J7508L358J1809J8219n471l993M615
16541I320J3301j0959l361N920J6576j5244j9979o719o271k4833j1582M715Q795
16528d0321L029M416J9321n38Q240l412p691p6M714K1823O935N822r692j4124
16514a554J0488O098j4330n58J1832J292j9160l584m01K0958J6969j8579j0717
16501a246p758p025J1055l86J4451J1410k845j8732j549l093K4261j812q078L226
16487A1879J117j6910k4730p873K5726Q19O812j5247j9739j3868J4995J1385n151
16474c0785M428J8928J8219Q899j2012j11J95n945k239j844Q007J9998K317j0789
$$ plain form
16460 17266 444 -23569 -30551 -11669 -2197 -9867 2743 -14633 -31404 -19104 -19073 -24678 -26044
16447 -26044 -18170 -17883 -24369 -6982 11571 2895 -7072 -20846 -33480 -33853 -12267 -3017 3781 15901
16433 15901 11243 31866 20057 8886 -16414 -28158 -27547 -27835 -24345 -8083 -1545 5763 -10313
16420 -10313 -18697 -7555 5543 -8286 -19708 12320 9435 -9408 -21977 -38121 -45363 -33830
16408 -33830 -15151 22775 19642 14568 23675 23983 30312 24825 26111 27698 19942 10426 10344 9125 7092
16393 7092 10785 -11669 -38409 -41764 -22042 -11404 -16224 5436 24242 3791 -4231 2928 -6842
16380 -6842 -17509 -3305 4735 -5422 -9052 -11072 -4597 2065 10039 -6300 -12439 -18717 -20472 -18301
16366 -18301 245 -586 -15882 16146 25746 22560 13947 17458 23126 29476 23266 16489 10209 18707
$$ packed form
16460A7266j6822k4013o982J8882R472p670J2610j7376j6771J2300L1n605j366
16447b6044P874K87o486J7387J8553q676r967j3774j2634l73K1586R250O798J2120
16433A5901m658K0623j1809j1171k5300j1744O11k88L490J6262O538P308j6076
16420a0313q384J1142J3098j3829j1422L2028k885j8843j2569j6144p242J1533
16408c3830J8679L7926l133n074R107L08O329n487J286J587p756r516q2j219k033
16393G092L693k2454k6740l355J9722J0638m820K1660J8806k0451q022P159r770
16380f842j0667J4204Q040j0157l630k020O475O662P974j6339o139o278j755K171
16366a8301J8546q31j5296L2028R600l186q613L511N668O350o210o777o280Q498
$$ plain form
16352 18707 14330 12212 33753 26229 4753 -12886 -34117 -38344 -25785 -3382 5743 16413 23715
16339 23715 5931 2965 14409 20022 15077 6567 1002 -433 -12101 -24039 -11311 -13727 3382
16326 3382 7834 8696 2372 -18985 -18939 -1795 3625 -3370 -6116 22753 13610 -33564 -60656 -57480
16312 -57480 -38486 -28482 -7807 566 -16732 -28644 -31117 -58750 -24935 -10037 -5493 -8178
16300 -8178 4449 -2287 -5022 -2911 -9387 -4039 -22608 -28146 -12164 -3502 -5721 -8234 -3357 12679
16286 12679 11413 7429 -529 -9303 -10602 -5800 -8262 -22469 -19892 -9196 6523 24580 39333
16273 39333 15189 12714 15829 9673 -8530 -5840 -4891 2031 -10934 -1095 2085 9321 24396 21364
16259 21364 6011 -1690 -678 -8272 -21496 -43473 -33562 -2745 5139 -8730 -18984 -16155 -14401
$$ packed form
16352A8707m377k118K1541p524k1476j7639k1231m227J2559K2403R125J0670P302
16339B3715j7784k966J1444N613m945q510n565j435j1668j1938J2728k416J7109
16326C382M452Q62o324k1357M6J7144N420o995k746K8869r143m7174k7092L176
16312e7480J8994J0004K0675Q373j7298j1912k473k7633L3815J4898M544k685
16300h178J2627o736k735K111o476N348j8569n538J5982Q662k219k513M877J6036
16286A2679j266l984p958q774j299M802k462j4207K577J0696J5719J8057J4753
16273C9333k4144k475L115o156j8203K690R49O922j2965R839L180P236J5075l032
16259B1364j5353p701J012p594j3224k1977R911L0817P884j3869j0254K829J754
$$ plain form
16246 -14401 -12597 544 11283 10117 5147 15232 18609 -4005 -7200 2626 -14053 -15252 -16149
16233 -16149 -19604 -5987 5391 -2892 -18855 -15662 9245 7138 2262 11377 1728 -4009 1385
16220 1385 7455 -3230 -17408 -33220 -26411 -13203 10243 -4106 -22694 -48963 -56081 -41098
16208 -41098 -29085 -42427 -38838 -35462 -28796 -21181 -42393 -56111 -38816 -16166 -2245 -4497 -15920
16195 -15920 -3691 14043 8306 -2322 -11509 -12577 -11496 -689 8305 2518 -4842 5606 11365
16182 11365 3404 -8148 -30771 -26389 -4745 -26857 -32437 -12002 -2583 20452 18989 10416 -19258
16169 -19258 -40815 -24188 -11312 -25708 -47731 -65410 -44084 -43707 -37555 -5972 3724 5369 -22764
16156 -22764 -3102 17115 -16934 -31506 -17764 -10292 -8075 -810 8859 -14703 -15550 -29510 -43046
$$ packed form
16246a4401J804J3141J0739j166m970J0085L377k2614l195R826j6679j199q97
16233a6149l455J3617J1378q283j5963L193K4907k107m876R115r649n737N394
16220A385O070j0685j4178j5812O809J3208K3446j4349j8588k6269p118J4983
16208d1098J2013j3342L589L376O666P615k1212j3718J7295K2650J3921k252j1423
16195a5920J2229J7734n737j0628r187j068J081J0807Q994n787p360J0448N759
16182A1365p961j1552k2623M382K1644k2112n580K0435R419K3035j463q573k9674
16169a9258k1557J6627J2876j4396k2023j7679K1326L77O152L1583R696J645k8133
16156b2764J9662K0217l4049j4572J3742P472K217P265R669k3562q47j3960j3536
$$ plain form
16143 -43046 -33883 -8316 4013 -1382 -8183 2152 6203 -2671 -12530 -1905 12015 12529 16718
16130 16718 13339 -4230 -16835 -30326 -39376 -12069 -1431 27738 32512 27897 21158 -3265 20985
16117 20985 38099 30993 24082 13829 -16622 -21716 -1974 5635 -26545 -26857 -12772 -23304 -14722
16104 -14722 -10440 3108 134 -5630 392 1850 -25316 -39981 -27314 -21844 -27875 -34167 -30676
16091 -30676 -29623 -27894 -12537 -13791 -17486 -12348 -1905 7517 -4157 -13602 -1047 -182 -14046
16078 -14046 -13362 -19674 -33148 -37613 -29174 -10310 -9957 -27173 -26811 7328 8832 3983 -6418 -22227
16064 -22227 -20017 -12360 -17300 -12065 -5819 -29385 -34084 -44033 -45433 -32978 -40404 -18287 -13753 -10995
16050 -10995 -9024 -2787 -812 -7194 -24882 -36149 -59084 -41430 -24917 -24827 -23826 -35659 -40647
$$ packed form
16143d3046R163K5567J2329n395o801J0335M051q874r859J0625J3920N14M189
16130A6718l379j7569j2605j3491r050K7307J0638K9169M774m615o739k4423K4250
16117B0985J7114p106o911j0253l0451n094J9742P609l2180l12J4085j0532Q582
16104a4722M282J3548k974n764O022J458k7166j4665J2667N470o031o292L491
16091c0676J053J729J5357j254l695N138J0443R422j1674r445J2555Q65j3864
16078a4046O84o312j3474m465Q439J8864L53j7216L62L4139J504m849j0401j5809
16064b2227K210P657m940N235O246k3566m699r949j400J2455p426K2117M534K758
16050a0995J971O237J975o382j7688j1267k2935J7654J6513R0J001j1833m988
$$ plain form
16037 -40647 -26214 -15507 599 -6509 -16629 -28370 -30262 -20949 -23655 -34039 -27309 9170 31505
16024 31505 36600 31791 20516 1811 2920 -6215 -11502 -7982 235 -2757 -23917 -45925 -45036 -44354
16010 -44354 -31136 -3583 4524 -583 2471 -1546 -1384 -6499 -1415 -6570 -2461 -6295 -4686 1335
15996 1335 -9374 -35779 -45776 -24384 3846 -2140 -6191 -6282 -10030 -4534 -3242 -11959 -29530 -41871
15982 -41871 -18776 -5392 12020 16723 -6440 -10225 -7010 -7587 762 -1465 -9385 -1513 -19309
15969 -19309 -32795 -41545 -36664 -23542 -14629 -10708 -17366 -24190 -30992 -35974 -16982 -12524 -7819 -21300
15955 -21300 -14927 4033 -3818 -6211 7831 13571 9624 4137 -2019 -2360 -213 1137 -9209 -10050
15941 -10050 -21239 -36563 -42314 -57671 -44244 -16315 -26168 -21112 -18794 -4227 5396 -330 -16899
$$ packed form
16037d0647J4433J0707J6106p108j0120j1741j892R313k706j0384O730L6479K2335
16024C1505N095m809j1275j8705J109r135n287L520Q217k992k1160k2008Q89O82
16010d4354J3218K7553Q107n107L054m017J62n115N084n155M109l834J609O021
15996A335j0709k6405r997K1392K8230n986m051r1l748N496J292q717j7571j2341
15982d1871K3095J3384J7412M703k3163l785L215n77Q349k227p920P872j7796
15969a9309j3486q750M881J3122Q913L921o658o824o802m982J8992M458M705j3481
15955b1300O373J8960p851k393J4042N740l947n487o156l41K147J350j0346q41
15941a0050j1189j5324n751j5357J3427K7929r853N056K318J4567R623n726j6569
$$ plain form
15928 -16899 -39785 -40204 -27111 -13126 2538 19250 23244 -13919 -17804 -14012 -28278 -36982 -34944
15915 -34944 -28126 -4157 14033 10794 1745 -18327 -36408 -36927 -23384 -14445 -398 9492 -11327
15902 -11327 11343 19439 1738 -3354 12273 11897 -8574 -30519 -29312 -33289 -33978 -16419 -2297
15889 -2297 -19957 -3970 17537 1001 15173 33503 35073 25020 -11640 -16562 -24881 -8543
15877 -8543 9129 9851 3420 -2352 10704 22207 28900 13914 -5939 1602 -9966 -9541 2682
15864 2682 12388 -1778 -18048 -28913 -11568 -29254 -36470 -27889 -17690 -8316 -23457 -21906 -12547
15851 -12547 -21235 -24832 -17115 -1264 2445 14965 20093 9347 4338 3337 3763 15131 2316
15838 2316 -4975 -9548 -17748 -14996 -14883 -28212 -33401 -19491 -11786 -4874 -12771 -31365 -28082 -11487
$$ packed form
15928a6899k2886m19J3093J3985J5664J6712L994l7163l885L792j4266q704K038
15915c4944O818K3969J8190l239r049k0072j8081n19J3543Q939J4047R890k0819
15902a1327K2670Q096j7701n092J5627l76k0471k1945J207l977o89J7559J4122
15889b297j7660J5987K1507j6536J4172J8330J570j0053l6660m922q319J6338
15877h543J7672P22o431n772J3056J1503O693j4986j9853P541j1568M25J2223
15864B682R706j4166j6270j0865J7345j7686p216Q581J0199R374j5141J551R359
15851a2547q688l597P717J5851L709J2520N128j0746n009j001M26J1368j2815
15838B316p291m573q200K752J13j3329n189J3910P705O912p897j8594L283J6595
$$ plain form
15824 -11487 -14719 1616 25540 22573 13862 -10983 -27827 -36096 -30446 -43221 -42077 -45567 -45707
15811 -45707 -19118 -13468 -25818 -28300 -11013 -3390 -18413 -20339 726 27237 29960 28438 21741
15798 21741 30193 20043 25117 16492 -250 -5927 2440 12198 -7548 1505 11315 20002 2357
15785 2357 -13448 -12575 4295 -9200 -10877 -17372 -7780 13010 36910 26132 8610 22734 33029
15772 33029 -72 -15256 -30986 -38747 -43965 -28206 -19344 6247 6695 2164 -9648 6221 3030
15759 3030 -14930 -27872 -34958 -29424 -21952 -7613 -27995 -40719 -26566 -31706 -23593 6748 18326
15746 18326 6920 1670 7356 11553 -6722 -1047 1342 -14281 -10390 -10381 -23039 -35477 -16845 1635
15732 1635 -1031 10315 -6394 -23138 -7088 5774 16427 -16809 -30777 -962 5271 22468
$$ packed form
15824a1487l232J6335K3924k967q711k4845j6844q269N650j2775J144l490j40
15811d5707K6589N650j2350k482J7287P623j5023j926K1065K6511K723j522o697
15798B1741Q452j0150N074q625j6742n677Q367R758j9746R053R810Q687j7645
15785B357j5805Q73J6870j3495j677o495R592K0790K3900j0778j7522J4124J0295
15772C3029l3101j5184j5730p761n218J5759Q862K5591M48m531j1812J5869l191
15759C030j7960j2942p086N534P472J4339k0382j2724J4153n140Q113L0341J1578
15746A8326j1406n250N686M197j8275N675K389j5623L891Rj2658j2438J8632J8480
15732A635k666J1346j6709j6744J6050J2862J0653l3236j3968K9815O233J7197
$$ plain form
15720 22468 19567 6603 2030 -7903 -14852 877 17660 10345 -5744 -6238 -9841 -15802 -34405
15707 -34405 -55445 -42797 -18247 -18839 -17014 -15377 -21778 -23374 -7566 2114 -17194 -22796 -20130
15694 -20130 -20270 -19539 -17201 -19385 -7484 5084 8832 -2144 -13986 -3478 -5850 -1749 -25588
15681 -25588 -28012 -9623 -16884 -5083 9354 -8421 -19806 -19757 -16189 -1739 24668 19228 8157
15668 8157 -590 -3946 -7729 642 13785 5844 -7868 -18538 -25385 -45342 -43287 -31206 -22700
15655 -22700 -12786 -5601 -15202 -4119 5904 16650 -6535 -11194 739 -9218 -10714 -14647 -13354
15642 -13354 -17191 -9177 -16542 -15783 -3633 -26162 -38437 -13370 -10140 1926 15109 7952 14856
15629 14856 32558 18868 13690 7889 14291 19705 26060 11800 2910 -16757 -28571 -30156 -26040
$$ packed form
15720B2468k901j2964m573r933o949J5729J6783p315j6089m94l603n961j8603
15707c4405k1040J2648K4550n92J825J637o401j596J5808R680j9308n602K666
15694b0130j40P31K338k184J1901J2568L748j0976j1842J0508k372M101k3839
15681b5588k424J8389p261J1801J4437j7775j1385M9L568J4450K6407n440j1071
15668H157q747l356l783Q371J3143p941j3712j0670o847j9957K055J2081Q506
15655b2700R914P185r601J1083J0023J0746k3185m659J1933r957j496l933J293
15642a3354l837Q014p365P59J2150k2529j2275K5067L230J2066J3183p157O904
15629A4856J7702j3690n178n801O402N414O355j4260q890j9667j1814j585M116
$$ plain form
15616 -26040 -15835 -4129 -19886 -34696 -23563 -27999 -29352 -34928 -49228 -62163 -47637 -13235
15604 -13235 13133 15704 581 4966 9653 19303 40138 56680 67078 55843 40463 38914 17983
15591 17983 -1556 -10644 -21846 2209 7847 7776 2191 13235 13058 3674 -21258 -30205 -26755 -31182
15577 -31182 -17030 -6115 -1062 -6836 -15826 -15897 -16285 -22937 -15568 -26490 -24179 2387 9855 -12640
15563 -12640 -27469 -22776 -14613 -17715 -21302 -1796 12912 8826 11929 -3280 -9830 -19995 -13043
15550 -13043 -16972 -17055 -21420 -15605 -19427 663 9767 11066 5798 -12078 -767 -1073 3360 -2105
15536 -2105 -13123 -29423 -24443 -24516 -26268 -42149 -44083 -45011 -46243 -30363 -26134 -31327 -48734 -67226
15522 -67226 -40675 -6415 -1956 -12562 -20503 -22835 -9664 -28401 -51344 -33114 -16418 -12868
$$ packed form
15616b6040J0205J1706j5757j4810J1133m436j353n576j4300j2935J4526L4402
15604a3235K6368K571j5123M385M687R650K0835J6542J0398j1235j5380j549k0931
15591A7983j9539r088j1202K4055N638p1n585J1044j77r384k4932q947L450m427
15577c1182J4152J0915N053n774q990p1l88o652P369j0922K311K6566P468k2495
15563a2640j4829M693Q163l102l587J9506J4708m086L103j5209o550j0165O952
15550a3043l929q3m365N815l822K0090R104J299n268j7876J1311l06M433n465
15536b105j1018j6300M980p3j752j5881j934r28j232J5880M229n193j7407j8492
15522f7226K6551L4260M459j0606p941k332J3171j8737k2943J8230J6696L550
$$ plain form
15510 -12868 -27516 -13721 -5913 -4999 -11452 -30631 -23876 -15621 -17585 -4577 11526 14768 19507
15497 19507 -12872 -19820 -6718 27954 25876 18806 14583 12569 5621 -1845 -10100 -27760 -28889
15484 -28889 -14844 -29501 -45621 -52929 -47919 -32791 -28896 -13209 -1727 -27383 -22263 -21058 -10459
15471 -10459 -3714 -145 1358 -9189 -3145 14689 31897 20263 12629 -9090 -14125 -29123 -20109
15458 -20109 11060 14577 -12635 -34419 -22819 -22791 -12052 5841 -2521 -9305 -9552 -10338 -24390 -19622
15444 -19622 1107 4201 -17404 -33035 -40449 -29627 -15160 -2194 1097 4700 16121 -2427
15432 -2427 -26807 -42891 -54397 -33966 -15573 -20128 -27691 -18118 -17808 -36982 -29235 -21248 -26952
15419 -26952 -21763 -7532 5215 17692 22233 -5617 -12402 -8572 -11178 -18376 -19202 1625 15183
$$ packed form
15510a2868j4648J3795P808R14o453j9179O755Q255j964J3008J6103L242M739
15497A9507l2379o948J3102L4672k078p070m223k014o948p466q255j7660j129
15484b8889J4045j4657j6120p308N010J5128L895J5687J1482k5656N120J205J0599
15471a0459O745L569J503j0547O044J7834J7208j1634p634k1719n035j4998R014
15458b0109L1169L517k7212k1784J1600K8J0739J7893q362o784k47p86j4052M768
15444a9622K0729L094k1605j5631p414J0822J4467J2966L291L603J1421j8548
15432b427k4380j6084j1506K0431J8393m555p563R573L10j9174P747P987n704
15419b6952N189J4231J2747J2477M541k7850o785L830k606p198q26K0827J3558
$$ plain form
15406 15183 -4428 -18735 7707 16804 -12993 -30946 -29666 -3235 4175 6211 978 7326 11245
15393 11245 8661 10093 800 -12469 -26513 -25679 -14692 3434 11564 15981 7606 17859 1543
15380 1543 1414 3450 1597 1643 19340 452 -1906 6293 8921 -6028 -16680 -5201 -4761 3192
15366 3192 -2443 -1569 -3329 8086 11806 19906 11242 7229 -14803 -16508 -7151 -8063 -24524 -22764
15352 -22764 -9745 -11647 -25988 -24823 -21583 -13169 -12176 -9033 -5027 -16770 -10377 -11349 -22200 -11458
15338 -11458 -11343 -20890 -5603 -1618 -11269 -7421 709 3098 -1254 4588 -7751 -10700 -1081 4939
15324 4939 19026 27948 17841 7808 -13510 -19845 -15621 -22438 -15304 -19693 -25701 -26225 -15068 -17782
15310 -17782 -8279 4105 5347 -11611 -23920 -7288 -9606 -7492 -4278 -6800 -16354 -11888 -6483
$$ packed form
15406A5183j9611j4307K6442R097k9797j7953J280K6431P410K036n233O348L919
15393A1245k584J432r293j3269j4044Q34J0987J8126Q130M417q375J0253j6316
15380A543j29K036j853M6J7697j8888k358Q199K628j4949j0652J1479M40P953
15366C192n635Q74j760J1415L720Q100q664m013k2032j705R357r12j6461J760
15352b2764J3019j902j4341J165L240Q414R93L143M006j1743O393r72j0851J0742
15338a1458J15r547J5287L985r651L848Q130K389m352N842j2339k949R619O020
15324D939J4087Q922j0107j0033k1318o335M224o817P134m389o008n24J1157k714
15310a7782R503J2384J242j6958j2309J6632k318K114L214k522r554M466N405
$$ plain form
15297 -6483 5682 21020 10243 3403 -7968 -21667 -10762 -21364 -14694 -3407 877 -9684
15285 -9684 -17828 6634 -2897 -1689 -315 -13545 -28553 -32497 -40297 -59464 -64426 -30430 1182
15272 1182 1375 -20007 -23648 -26944 -16507 -17799 -22929 -20016 -21726 -10729 -5957 -37126 -49313 -38776
15258 -38776 -27583 -9374 -7407 -9564 -2075 8224 -761 -8100 -18874 -24929 -15655 -4143 -3302
15245 -3302 -13778 -7236 -13592 -8028 7054 1106 -4382 -18591 -28487 -24976 -9224 3419 15620
15232 15620 26808 18919 28123 36366 28914 15152 5946 17500 9703 2227 2418 -5424 -6108 -17278
15218 -17278 -29621 -25933 -14626 -10796 -18821 -12463 -11191 -12228 -14906 1949 9533 2456 -2267 -5040
15204 -5040 -218 -1082 9399 -6109 -16265 -16101 -22605 -20948 -20382 -18017 -22418 -12912 -12252 -5228 3568
$$ packed form
15297f483J2165J5338j0777o840j1371j3699J0905j0602O670J1287M284j0561
15285i684q144K4462r531J208J374j3230j5008l944p800j9167m962L3996L1612
15272A182J93k1382l641l296J0437j292n130K913j710J0997M772l1169j2187J0537
15258c8776J1193J8209J967k157P489J0299q985p339j0774o055R274J1512Q41
15245c302j0476O542o356N564J5082n948n488j4209r896L511J5752J2643J2201
15232A5620J1188p889R204Q243p452j3762r206J1554p797p476J91p842o84j1170
15218a7278j2343L688J1307L830q025O358J272j037k678J6855P584p077m723k773
15204e040M822q64J0481j5508j0156J64o504J657N66K365m401R506O60P024Q796
$$ plain form
15189 3568 -4993 342 -13833 -7088 -8531 -16530 -17457 -18664 -29806 -34782 -35729 -34897 -30507 -26674 -8724
15174 -8724 -17253 -14235 -25836 -27523 -306 7798 22591 27654 17727 18960 19119 24281 24091 34814
15160 34814 34873 32303 24853 -6582 -22472 -20899 -8345 -11438 -14360 -3996 18229 31138 23663
15147 23663 14148 22446 18662 5850 3541 22610 10897 -7384 -16427 -3079 8297 3818 -18947
15134 -18947 -11515 -15193 -7457 8246 7499 -5959 14251 25370 12557 -4270 -10915 -9440 -11324
15121 -11324 -17560 -41231 -59558 -53218 -28673 -48457 -57652 -46657 -17154 -15597 -19850 1468 390
15108 390 5629 13981 23349 18027 -15841 -25226 -20849 -4926 14216 20117 8623 8403 12131 -2175
15094 -2175 -3303 11046 2390 -11656 -16595 -26030 -33267 -20528 -22100 -29850 -11870 5208 14844
$$ packed form
15189C568q561N335j4175O745j443p999r27j207j1142m976r47Q32M390L833J7950
15174h724q529L018j1601j687K7217Q104J4793N063r927J233J59N162j90J0723
15160C4814N9k570p450l1435j5890J573J2554l093k922J0364K2225J2909p475
15147B3663r515Q298l784j2812k309J9069j1713j8281r043J3348J1376m479k2765
15134a8947P432l678P736J5703p47j3458K0210J1119j2813j6827o645J475j884
15121a1324o236k3671j8327O340K4545j9784r195J0995K9503J557m253K1318j078
15108C90N239Q352R368n322l3868r385M377J5923J9142N901j1494k20L728j4306
15094b175j128J4349q656j4046m939r435p237J2739j572p750J7980J7078R636
$$ plain form
15081 14844 297 -27965 -55738 -66401 -38712 -13699 -2772 -8860 2112 6104 -4782 9111
15069 9111 12169 1301 -1406 -13456 -9265 -28220 -30798 -25632 -24596 -20102 -23079 -24951 -3884 9693
15055 9693 10439 17109 18833 18132 4255 -4754 -11230 -6683 -6032 -7111 -8131 -16799 -27148 -31706 -33144
15040 -33144 -16824 -12963 -12027 -29726 -34568 -41628 -53758 -50092 -41654 -47165 -54846 -59475 -47024 -46070
15026 -46070 -65409 -66038 -46943 -28043 -18584 -10881 -6423 -8739 -20493 -29978 -35116 -18057 -11629
15013 -11629 -9513 -12600 -17036 -8742 -582 -2014 7196 18913 23587 11647 11593 9556 5513 9787
14999 9787 10579 -392 -9509 12542 19473 8449 -228 -10159 5577 19210 14745 8339 5556 -1348
14985 -1348 -12789 615 -5495 -13722 -14970 -25618 -30435 -14087 -13335 -7951 11851 9159 955 -1617
$$ packed form
15081A4844j4547k8262k7773j0663K7689K5013J0927o088J0972L992j0886J3893
15069I111L058j0868k707j2050M191j8955k578N166J036M494k977j872K1067J3577
15055I693P46O670J724p01j3877r009o476M547O51j079j020q668j0349m558j438
15040c3144J6320L861R36j7699m842p060j2130L666Q438n511p681m629J2451R54
15026d6070j9339o29J9095J8900R459P703M458k316j1754r485n138J7059O428
15013a1629K116l087m436Q294Q160j432R210J1717M674j1940n4k037m043M274
14999I787P92j0971r117K2051O931j1024q677r931J5736J3633m465o406k783o904
14985a348j1441J3404o110q227j248j0648m817J6348P52N384J9802k692q204k572
$$ plain form
14971 -1617 8114 20026 13684 22857 14942 3060 4531 8316 3416 17881 1590 -10503 1287
14958 1287 -6691 -21478 -23314 -23704 -17415 -10303 -3210 20416 15040 -1683 -18579 -25157 -20863 -12087
14944 -12087 -4702 5244 3162 -14839 6585 15847 -14547 -20447 -5368 6222 5827 -5683 -5804
14931 -5804 1630 7826 -10460 -10449 -4938 -12835 -36095 -33060 -10938 -6962 -24440 -32710 -20352 -13375
14917 -13375 -5210 12328 24929 31072 37940 27843 30225 56298 53000 39116 18288 -4373 -10460
14904 -10460 13375 12686 -2438 -15093 -509 9800 2592 -7944 -15700 -13699 -28885 -39241 -24486
14891 -24486 6393 12790 21604 8732 21723 39967 48239 36756 31165 14783 -1094 186 3639
14878 3639 -4867 3986 2346 -13482 -15694 -20543 -16191 -21755 -19696 3544 35538 37601 42568 37000
$$ packed form
14971a617R731J1912o342R173p915j1882J471L785m900J4465j6291j2093J1790
14958A287p978j4787j836l90O289P112P093K3626n376j6723j6896o578M294Q776
14944a2087P385R946k082j8001K1424R262l0394n900J5079J1590l95j1510j21
14931e804P434O196j8286J1N511p897k3260L035K2122L976j7478q270J2358O977
14917a3375Q165J7538J2601O143O868j0097K382K6073l298j3884k0828k2661o087
14904a0460K3835o89j5124j2655J4584J0309p208j0536p756K001j5186j0356J4755
14891b4486L0879O397Q814j2872J2991J8244Q272j1483n591j6382j5877J280L453
14878C639q506Q853j640j5828k212m849M352n564K059K3240L1994K063M967n568
$$ plain form
14864 37000 13530 18574 29587 -4055 -22739 -12625 15701 16925 14859 -3795 -15219 -14095
14852 -14095 -17257 -6320 11077 -4425 -17965 -26684 -27130 -37410 -46422 -20551 -7248 -773 12582
14839 12582 4794 5338 3280 -7465 -304 -4740 -9287 -11421 -35845 -40434 -29196 -11636 -6161 -9777
14825 -9777 3167 -3232 -27749 -17495 -1870 -6422 -3253 -6335 -5849 -19712 -22819 -7485 -10121
14812 -10121 -37551 -49300 -32005 -9920 -9397 -12590 1424 -3373 -7595 19367 17315 7603 5911
14799 5911 -4580 -15524 -23041 -215 7394 3565 -10566 -26469 -21012 -7709 132 -3179 -19424
14786 -19424 -7146 -2265 4661 -6446 -6330 6680 10752 10159 5133 -9978 -28375 -39864 -34569
14773 -34569 -28264 -19648 -21087 -15433 -29826 -35862 -14271 -12604 -11364 -12096 1091 11411 -9481
$$ packed form
14864C7000k3470N044J1013l3642j8684J0114K8326J224k066j8654j1424J124
14852a4095l162J0937J7397j5502j3540q719m46j0280r012K5871J3303O475J3355
14839A2582p788N44k058j0745P161m436m547k134k4424m589J1238J7560N475l616
14825i777J2944o399k4517J0254J5625m552L169l082M86j3863l107J5334k636
14812a0121k7430j1749J7295K2085N23l193J4014m797m222K6962k052r712j692
14799E911j0491j0944p517K2826P609l829j4131j5903N457J3303P841l311j6245
14786a9424J2278M881O926j1107J16J3010M072n93n026j5111j8397j1489N295
14773c4569O305Q616j439N654j4393o036K1591J667J240p32J3187J0320k0892
$$ plain form
14760 -9481 -16255 -23851 -34001 -35359 -26633 -33644 -35462 -49821 -51036 -57806 -27127 -5462 4430 4072
14746 4072 6804 7712 9404 5710 17172 -629 -15639 -4309 -17101 -14866 5955 15564 7030
14733 7030 -15545 -27235 -11160 -21582 -31012 -24917 -31248 -33784 -1598 10 -2286 -21107 -7904
14720 -7904 6291 14423 12899 1690 -1635 15349 23688 12782 26457 21074 17560 -3885 -25263
14707 -25263 -20497 -22386 -25067 -13849 -5153 -7246 -12497 -24023 -14355 -6012 2353 -20228 -25773 554
14693 554 923 10517 28737 9660 -19181 -26674 -21655 -32054 -28696 -16468 -30375 -34196 -24735 -23982
14679 -23982 4440 27180 14417 6525 18602 27475 15559 9303 4097 264 7806 905 -4317
14666 -4317 -33680 -40742 -46134 -44012 -34377 -31060 -8063 15766 21163 9280 1186 -11255 -22312
$$ packed form
14760i481o774p596j0150j358Q726p011j818j4359j215o770L0679K1665R892l58
14746D072K732R08J692l694J1462j7801j5010J1330j2792K235K0821R609q534
14733G030k2575j1690J6075j0422r430O095o331k536L2186J608k296j8821J3203
14720g904J4195Q132j524j1209l325J6984Q339j0906J3675n383l514k1445k1378
14707b5263M766j889k681J1218Q696k093n251j1526R668Q343Q365k2581n545K6327
14693E54L69R594J8220j9077k8841p493N019j0399L358J2228j3907l821R461P53
14679b3982K8422K2740j2763p892J2077Q873j1916o256n206l833P542o901n222
14666d317k9363p062n392K122R635L317K2997K3829N397j1883q094j2441j1057
$$ plain form
14653 -22312 -22233 -23914 -2054 14717 24005 17130 6454 -2601 -10620 -2134 2066 -14068 -6854 -12777
14639 -12777 -10650 -15784 -20839 -44591 -40805 -24157 7511 18229 12489 26619 27075 33255 19418
14626 19418 25418 33383 27538 5841 3190 7066 -10553 -22852 -6407 -19297 -25946 -23960 9352
14613 9352 23668 27073 31685 19316 6381 1284 -14900 -25426 -32540 833 23833 3353 741
14600 741 6010 5211 -3183 9813 19312 8126 17478 15317 3203 8529 -1575 -25544 -16739 -15511
14586 -15511 -2899 16006 9210 -753 -4339 -5644 -32369 -24918 -696 -14733 -4048 7284 4680
14573 4680 -10505 -15325 2440 -108 -11888 -14406 -11880 4971 -7479 1582 14645 14360 -6658
14560 -6658 -14283 -10265 5102 -8968 -28293 -36521 -27027 -11381 4904 4482 2406 7177 14998 21063
$$ packed form
14653b2312P9j681K1860J6771R288o875j0676r055q019Q486M200j6134P214n923
14639a2777K127n134n055k3752L786J6648L1668J0718n740J4130M56O180j3837
14626A9418O000P965n845k1697k651L876j7619j2299J6445j2890o649J986L3312
14613I352J4316L405M612j2369j2935n097j6184j0526p114L3373K3000k0480k612
14600G41N269p99q394J2996R499j1186R352k161j2114N326j0104k3969Q805J228
14586a5511J2612J8905o796r963l586j305k6725P451K4222j4037J0685J1332k604
14573D680j5185m820J7765k548j1780k518K526J6851j2450R061J3063k85k1018
14560f658p625M018J5367j4070j9325q228R494J5646J6285m22k076M771P821O065
$$ plain form
14546 21063 34246 23542 16197 12896 1405 -6736 -3235 13883 18488 -8613 -13544 -2423 19679
14533 19679 20480 17821 5069 -13800 -14224 7616 18426 21980 13523 591 -11985 -16691 -16609 -10377
14519 -10377 -10823 -19796 -18615 -6564 -4897 -12205 -11207 -8887 -1050 1378 -1205 -6475 -8468 -19667
14505 -19667 -21554 -25078 -19106 -2307 17291 11181 -13276 -25518 -24278 -13414 -10335 -3998 5329
14492 5329 12150 28759 43698 23679 -17372 -34741 -16661 725 10600 2106 -4101 -11256 -8820
14479 -8820 6059 12727 9869 -10308 -9575 9372 4719 -6572 3570 12742 14587 20017 11939 6439
14465 6439 1465 5812 -1339 5431 11835 8121 -2430 -12594 -10049 -2959 407 20356 17456 15117
14451 15117 11809 34354 30823 111 -17074 -26486 -16434 -19887 -29539 -54131 -47780 -42270 -35412
$$ packed form
14546B1063J3183j0704p345l301j1491q141L501J7118M605k7101m931J1121K2102
14533A9679Q01k659j2752j8869m24K1840J0810L554q457j2932j2576m706Q2O232
14519a0377m46q973J181J2051J667p308R98K320P837K428k583n270j993j1199
14505a9667j887l524N972J6799J9598o110k4457j2242J240J0864L079O337R327
14492E329O821J6609J4939k0019m1051j7369J8080J7386R875q494o207p155K436
14479h820J4879O668k858k0177P33J8947m653j1291J0142R172J845N430q078n500
14465F439m974M347p151O770O404l714j0551j0164K545P090L366J9949k900k339
14451A5117l308K2545l531l0712j7185r412J0052l453r652k4592O351N510O858
$$ plain form
14438 -35412 -22125 -24880 -21494 -31804 -16539 3782 14058 4130 -10705 -2108 17245 10977 -3254
14425 -3254 2668 731 -81 23042 29737 18697 18693 13998 13 5587 7158 -1026 -1765 5742 -5749
14410 -5749 -8372 -8669 18206 8781 2987 -21555 -17066 -5653 14967 25380 18130 -17 -1616
14397 -1616 -7568 -22416 -13048 2313 11987 8122 13135 25355 37694 38977 34204 9508 16343
14384 16343 20425 11546 4163 -1339 7322 14456 -1138 4933 24090 29721 35172 35932 21013 23442
14370 23442 19118 14689 2019 1401 18235 13869 -3019 -4746 4288 5405 -2804 -19237 -20807 -31884
14356 -31884 -32461 -22460 -16200 -4653 -1851 -22109 -37372 -46444 -37999 -25503 -7224 4523 10310
14343 10310 -6481 -809 13440 -21513 -30151 -3902 447 -13112 -12983 -9270 -16586 -8071 -10890
$$ packed form
14438c5412J3287k755L386j0310J5265K0321J0276r928j4835Q597J9353o268j4231
14425c254N922j937q12K3123O695j1040mm695j3985N574J571q184p39P507j1491
14410e749k623k97K6875r425n794k4542M489J1413K0620J0413p250j8147j599
14397a616n952j4848R368J5361R674l865N013J2220J2339J283m773k4696O835
14384A6343M082q879p383n502Q661P134j5594O071J9157N631N451P60j4919K429
14370B3442m324m429j2670o18J6834m366j6888j727R034J117q209j6433j570j1077
14356c1884n77J0001O260J1547K802k0258j5263r072Q445J2496J8279J1747N787
14343A0310j6791N672J4249l4953q638K6249M349j3559J29L713p316Q515k819
$$ plain form
14330 -10890 -5643 2104 -7381 -8403 -723 25744 7816 2195 17643 6230 -6480 -12590 -13288
14317 -13288 -10778 -687 3865 12351 16169 22060 21942 41741 39332 17037 7968 -2385 -7200 -3997
14303 -3997 735 -3502 -6797 -12559 -33254 -31411 -37895 -33039 -10196 -2052 8623 15362 3112 -5819
14289 -5819 -18027 -12048 4743 -10376 10395 38704 25011 3805 -4706 14134 8102 -12855
14277 -12855 -24620 -32227 -32619 -15122 -11183 -36105 -28507 -25257 -16596 -3415 -552 -12064 -18564
14264 -18564 -20681 -6368 5397 10902 27704 33614 34491 33173 24244 8894 -10152 -7969 -466
14251 -466 21128 11976 8306 -11820 -26575 -26435 -22427 -1015 1842 -8721 -21473 -1101 14414
14238 14414 9343 16266 21258 -11574 -32806 -36415 -18207 278 3675 2304 5305 4519 -7835
$$ packed form
14330a0890N247P747r485j022P680K6467j7928n621J5448j1413j2710o110o98
14317a3288K510J0091M552Q486L818N891j18J9799k409k2295r069j0353m815L203
14303c997M732m237l295n762k0695J843o484M856K2843Q144J0675O739j2250q931
14289e819j2208N979J6791j5119K0771K8309j3693k1206q511J8840o032k0957
14277a2855j1765p607l92J7497L939k4922P598L250Q661J3181K863j1512o500
14264a8564k117J4313J1765N505J6802N910Q77j318q929j5350j9046K183P503
14251d66K1594r152l670k0126j4755J40M008K1412K857j0563j2752K0372J5515
14238A4414n071O923M992l2832k1232l609J8208J8485L397j371L001p86j2354
$$ plain form
14225 -7835 664 -3059 5982 14 -20329 -13339 -20489 -39986 -46529 -50591 -45360 -27689 -22407 -9895
14211 -9895 -1532 8883 499 -18283 -41348 -42469 -38060 -24554 2211 11432 4273 1283 96
14198 96 -10980 -35103 -22551 -12145 -27093 -27654 -24343 -37116 -31639 -25109 -38189 -35631 -33340 -9184
14184 -9184 -3288 2889 13718 -5182 -20236 -10954 4398 -10059 -40366 -47245 -20834 -23944 -4251
14171 -4251 8587 -3123 9753 6906 2506 -2992 -23330 -26747 -23429 -47028 -33279 -9448 5825
14158 5825 11577 18233 36169 1008 -14926 -10102 -22277 -10851 -1512 6186 -1127 8089 7478 13220
14144 13220 9251 -4417 -18660 -25587 -13967 9094 22436 19914 13564 2448 -15387 -24115 -25751
14131 -25751 -21460 -5275 -8614 -24396 -25782 -18911 -1655 17971 12974 27265 40078 40245 30357
$$ packed form
14225g835Q499l723R041n968k0343O990p150j9497o543m062N231J7671N282J2512
14211i895Q363J0415q384j8782k3065j121M409J3506K6765R221p159k990j187
14198I6j1076k4123J2552J0406j4948n61L311j2773N477O530j3080K558K291K4156
14184i184N896O177J0829j8900j5054R282J5352j4457l0307o879K6411l110J9693
14171d251J2838j1710J2876k847m400n498k0338l417L318k3599J3749K3831J5273
14158E825N752O656J7936l5161j5934M824j2175J1426R339P698p313R216o11N742
14144A3220l969j3668j4243o927J1620K3061J3342k522o350j1116j7835q728j636
14131b5751M291J6185l339j5782j386O871J7256J9626m997J4291J2813J67r888
$$ plain form
14118 30357 36603 24113 22277 21571 34107 36805 17546 -4716 -2297 2074 10202 6043 18771
14105 18771 26540 14879 7693 2820 -9659 -14347 4712 15876 7299 -8053 -9180 12239 16464
14092 16464 23562 5187 -11887 -20884 -11995 -13022 -6552 -1484 10827 3204 -25147 -23659 -4877
14079 -4877 -3131 3225 1911 971 17027 9349 -12244 -13604 2958 12362 13102 4592 -2831 -6661
14065 -6661 8044 13288 4740 294 1986 14447 4209 -20064 -23638 -43780 -54554 -48274 -17309
14052 -17309 -22941 -6242 -1875 -2224 -713 -16248 -12089 -13590 -12554 -15012 -3639 14028 5989 -4508
14038 -4508 -16418 -30250 -29917 -31538 -22298 -9838 -11556 -8583 -1596 10437 35113 31897 37888 31051
14024 31051 31207 16771 -16766 -20271 -19618 -10195 -16377 -12828 -6019 3046 80 9380 23024 30698
$$ packed form
14118C0357O246j2490j836p06J2536K698j9259k2262K419M371Q128m159J2728
14105A8771P769j1661p186m873j2479m688J9059J1164q577j5352j127K1419M225
14092A6464P098j8375j7074q997Q889j027O470N068J2311p623k8351J488J8782
14079d877J746O356j314r40J6056p678k1593j360J6562R404P40q510p423l830
14065f661J4705N244q548m446J692J2461j0238k4273l574k0142j0774O280L0965
14052a7309n632J6699M367l49J511j5535M159j501J036k458J1373J7667q039j0497
14038d508j1910j3832L33j621R240J2460j718K973O987J2033K4676l216N991o837
14024C1051J56j4436l3537l505O53R423o182L549O809R065k966R300J3644P674
$$ plain form
14010 30698 27470 16626 15145 11651 20064 20874 13880 20641 13917 12491 1129 743 3314 3408 19741
13995 19741 26821 17822 13039 14664 11739 20151 26150 44068 39586 30786 18337 20590 22544 26554
13981 26554 6813 -22298 -26879 -29734 -34092 -26787 -11773 9394 15408 2829 -12129 -30112 -43598
13968 -43598 -48002 -38261 -18245 -13929 -17587 -21305 -20314 -20467 -30785 -29826 -35839 -36481 -26242 -19339 -23118
13953 -23118 -9577 -9920 -7259 1355 -1265 -880 4947 9129 11594 29243 24487 -2953 -45853 -61476
13939 -61476 -25808 -13533 4774 22632 32855 9590 27758 28182 14684 22087 11637 20741
13927 20741 10911 8844 8762 1651 -17619 -20692 -30847 -17665 -18311 -15637 -3433 -6895 -8600 -21
13913 -21 7252 -2608 -18733 -13498 -17880 -10645 -17811 -24917 -25802 -26346 -5853 169 -9139 4193 14634
$$ packed form
14010C0698l228j0844j481l494Q413Q10o994O761o724j426j1362l86K571R4J6333
13995A9741P080q999m783J625k925Q412N999J7918m482q800j2449K253J954M010
13981B6554j9741k9111m581k855m358P305J5014K1167O014j2579j4958j7983j3486
13968d3598m404R741K0016M316l658l718R91j53j0318R59o013o42J0239O903l779
13953b3118J3541l43K661Q614k620L85N827M182K465J7649m756k7440m2900j5623
13939f1476L5668J2275J8307J7858J0223k3265J8168M24j3498P403j0450R104
13927B0741r830k067q2p111j9270l073j0155J3182o46K674J2204l462j705Q579
13913b1P273r860j6125N235m382P235p166p106q85n44K0493O022r308J3332J0441
$$ plain form
13898 14634 18171 27258 35023 15385 34329 49367 30613 11585 4308 11990 15179 -10744 -8975
13885 -8975 -3042 -7761 -11778 -9016 3201 10727 23927 43657 41901 28032 8660 -8243 -31585
13872 -31585 -37308 -40213 -28707 -22550 -19568 -22354 -36958 -30941 -36509 -45004 -39099 -13104 12651
13859 12651 32222 21775 18027 -3919 2952 -9094 -9078 -2500 419 5714 9452 12890 -968 -16283
13845 -16283 -3472 16724 -5382 -11938 -2528 5717 16965 12224 -111 2735 14488 26010 20153
13832 20153 1303 667 13398 22219 14658 480 -6454 -3333 -21096 -22686 -27231 -13779 584
13819 584 12691 7949 8633 26359 43621 50431 32835 9583 18601 6932 -7564 -9268 -14815
13806 -14815 -1906 22879 5010 -20480 -23144 -11427 5033 2496 -16260 -18707 -19286 -4420 11886
$$ packed form
13898A4634L537R087P765j9638J8944J5038j8754j9028p277P682L189k5923J769
13885h975N933m719m017K762J2217P526J3200J9730j756j3869j9372j6903k3342
13872c1585n723k905J1506O157K982k786j4604O017n568q495N905K5995K5755
13859A2651J9571j0447l748k1946O871j2046J6O578K919N295L738L438j3858j5315
13845a6283J2811K0196k2106o556R410Q245J1248m741j2335K846J1753J1522n857
13832B0153j8850o36J2731Q821p561j4178o934L121j7763j590m545J3452J4363
13819E84J2107m742O84J7726J7262O810j7596k3252R018j1669j4496j704n547
13806a4815J2909K4785j7869k5490k664J1717J6460k537j8756k447n79J4866J6306
$$ plain form
13793 11886 10886 20348 26417 10571 -7550 3588 20469 20426 4739 6792 -7662 -3588 3067
13780 3067 -2550 435 -17627 -27621 -44048 -44398 -24583 5117 25999 9420 -3729 4851 19785
13767 19785 -15046 -2413 12029 4047 -11076 -5813 3520 7007 8236 12616 2655 13026 8858
13754 8858 249 1260 -13312 -33007 -50408 -40333 -23489 -28552 -14664 -28561 -36875 -55357 -42798
13741 -42798 -901 18272 29075 28959 22028 -8334 -9371 -18288 -16965 -3276 -8769 -16855 -10070
13728 -10070 -15730 -35553 -39845 -16700 -21389 -21658 -31185 -24082 2426 23249 13437 -12102 -24718
13715 -24718 -19242 -30376 -37614 -22760 5384 4404 -18832 -8486 -756 -20036 -27995 -30774 8526
13702 8526 31510 8671 -16292 -27862 -35706 -37018 -9867 8404 30830 18031 2344 12353
$$ packed form
13793A1886j000R462O069j5846j8121J1138J6881m3j5687K053j4454M074O655
13780C067n617K985j8062r994j6427l50J9815K9700K0882j6579j3149Q580J4934
13767A9785l4831J2633J4442p982j5123N263R333L487J229M380r961J0371m168
13754H858q609J011j4572j9695j7401J0075J6844n063J3888j3897q314j8482J2559
13741d2798M1897J9173J0803j16o931l0362j037q917J323J3689n493q086O785
13728a0070n660j9823m292K3145m689k69r527P103K6508K0823r812k5539j2616
13715b4718N476j1134p238J4854K8144r80k3236J0346P730j9280p959k779L9300
13702H526K2984k2839k4963j1570p844j312K7151J8271K2426j2799j5687J0009
$$ plain form
13690 12353 3075 -2267 -4561 1918 15477 27026 4262 -26125 -21702 -1893 15540 13339 10106
13677 10106 3360 -1481 10976 30262 14718 65 -4374 4390 15265 17621 32591 22949 12351
13664 12351 25950 7703 -3066 6821 24713 8995 11042 28473 40056 22319 9030 12630
13652 12630 -5326 -40422 -34487 -9632 11859 14172 27911 16475 14005 -634 -15754 -6899
13640 -6899 -6965 -10181 -9140 -10081 -16478 -19118 -37830 -53104 -53634 -31092 -24652 -25969 -15784 -16887 -18486
13625 -18486 -28069 -24913 -18989 -10758 -2552 2308 -6743 14407 20528 10182 4368 -12577 -48158
13612 -48158 -63900 -49000 -27629 -21928 -1230 27297 38051 26837 9078 -32376 -48692 -33029
13600 -33029 -24324 -22394 -20006 -16195 -15197 -22334 -6587 -2542 233 2348 8795 13470 9843 -2986
$$ packed form
13690A2353r278n342k294O479J3559J1549k2764l0387M423J9809J7433k201l233
13677A0106o746m841J2457J9286j5544j4653m439Q764J0875K356J4970r642j0598
13664A2351J3599j8247j0769R887J7892j5718K047J7431J1583j7737j3289L600
13652A2630j7956l5096N935K4855K1491K313J3739j1436k470j4639j5120Q855
13640f899o6l216J041r41o397k640j8712j5274n30K2542O440j317J0185j103j599
13625a8486r583L156N924Q231Q206M860r051K1150O121j0346n814j6945l5581
13612d8158j5742J4900K1371N701K0698K8527J0754j1214j7759m1454j6316J5663
13600c3029Q705J930K388L811R98p137J5747M045K775K115O447M675l627j2829
$$ plain form
13586 -2986 12076 21904 29766 36281 49322 44932 21951 6689 -6295 4738 8719 5527 -23906
13573 -23906 -16997 6081 17047 20821 24257 -6862 -19480 -15335 -15569 -12737 2799 28926 15508
13560 15508 10871 2163 -28550 -46722 -39501 -36146 -48072 -49463 -52393 -26178 -18719 -28958 -30419
13547 -30419 -21705 -15957 -17051 -30558 -30171 -20674 -3330 -2993 -18554 -9618 -8629 -2361 5348 9975
13533 9975 8263 2977 -8095 -7418 5610 16929 12685 -1203 6420 19642 23430 22834 21138 42692
13519 42692 35918 21535 15159 17770 7839 -14143 -18565 5144 29970 26094 30822 18780 19163
13506 19163 14473 -248 -9334 -5143 -15127 -21119 -17407 3953 2550 -3887 -11973 -24922 -12597
13493 -12597 -20176 -20347 -13981 -240 6872 -4713 -23080 -29774 -39253 -24943 8324 -2440 -8922
$$ packed form
13586b986J5062R828P862O515J3041m390k2981j5262j2984J1033L981l192k9433
13573b3906O909K3078J0966L774L436l1119j2618M145k34K832J5536K6127j3418
13560A5508m637q708l0713j8172P221L355j1926j391k930K6215P459j0239j461
13547c0419Q714N748j094j3507L87R497J7344L37j5561Q936R89O268P709M627
13533I975j712n286j1072O77J3028J1319m244j3888P623J3222L788n96j696K1554
13519D2692o774j4383o376K611r931k1982m422K3709K4826l876M728j2042L83
13506A9163m690j4721r086M191r984n992L712K1360j403o437q086j2949J2325
13493a2597p579j71O366J3741P112j1585j8367o694r479J4310L3267j0764o482
$$ plain form
13480 -8922 3202 8482 6022 962 -2971 13882 35272 5946 -20448 -20726 -26540 -17846 -33822
13467 -33822 -30371 -22343 -24931 -17079 -20646 -5011 -7838 8940 14083 -4685 -12980 1818 8168
13454 8168 26571 20761 35167 9554 5835 383 -8201 -19768 -29791 -23705 -29960 -32976 -44513
13441 -44513 -23336 2515 -7234 -28353 -29292 -11279 -6050 -7265 11406 22014 14247 5833 -6626
13428 -6626 10218 23675 -8391 -19547 -29881 -40093 -42295 -40983 -35538 -29676 -24944 -22054 -15872
13415 -15872 -24110 -23046 -30969 -12915 -5129 15784 11761 20074 14933 19925 16233 12234 5591 1845
13401 1845 15226 7197 1795 -3599 -7591 -6132 -577 -17549 -17445 -14381 -6942 -8523 -23681 6062
13387 6062 -764 -33310 -40981 -22934 -12539 12977 26205 25333 19869 16391 20793 13883 2405
$$ packed form
13480h922J2124N280k460n060l933J6853K1390k9326k6394k78n814Q694j5976
13467c3822L451Q028k588P852l567J5635k827J6778N143j8768q295J4798O350
13454H168J8403n810J4406k5613l719n452q584j1567j0023O086o255l016j1537
13441d4513K1177K5851r749k1119r39J8013N229j215J8671J0608p767q414j2459
13428f626J6844J3457l2066j1156j0334j0212k202J312N445N862M732K890O182
13415a5872q238J064p923J8054P786K0913m023Q313n141M992l692l999o643l746
13401A845J3381q029n402n394l992J459N555j6972J04L064P439j581j5158K9743
13387F062o826l2546p671J8047J0395K5516J3228q72n464l478M402o910j1478
$$ plain form
13374 2405 -2088 -1029 -1177 -5394 14686 36191 22057 10086 19143 44067 28409 8149 -1038
13361 -1038 -27073 -30866 -33784 -19940 7637 37001 19256 28566 44148 36421 32415 36248 46517
13348 46517 53311 39768 30623 42316 25877 15788 18756 -1310 11418 41618 65656 58794
13336 58794 54121 11708 -34320 -48979 -41360 -30431 -22146 1289 27924 20019 6147 -11791
13324 -11791 -15372 -12149 -4325 2918 11996 34243 25981 -1164 -19587 -16002 -13969 -2808 14106
13311 14106 17349 14573 20696 9148 2752 -5453 -5231 12432 15684 13048 7204 -9159 -16274 -14959
13297 -14959 -4094 -11324 -7061 -8284 64 85 -4292 -5799 -4106 3665 -14590 -18899 -22220 -21606 -15897
13282 -15897 -30121 -31890 -11381 15149 19459 16358 -18966 -29794 -42484 -34254 -12068 4714
$$ packed form
13374B405m493J059j48m217K0080K1505j4134j1971R057K4924j5658k0260r187
13361a038k6035l793k918J3844K7577K9364j7745R310J5582p727m006L833J0269
13348D6517O794j3543r145J1693j6439j0089K968k0066J2728L0200K4038o862
13336E8794m673m2413m6028j4659P619J0929Q285K3435K6635p905j3872j7938
13324a1791l581L223P824P243R078K2247q262k7145j8423L585K033J1161J6914
13311A4106L243k776O123j1548o396q205K22J7663L252k636n844j6363p115J315
13297a4959J0865p230M263j223Q348K1m377j507J693P771j8255m309l321O14N709
13282a5897j4224j769K0509K6530M310l101l5324j0828j2690Q230K2186J6782
$$ plain form
13270 4714 11210 -6728 -3107 -16354 -43134 -47231 -55973 -52622 -30913 4520 6455 -17768 -23468
13257 -23468 -30592 -44868 -24238 -2826 -6573 -5870 -2728 -4291 489 -4931 -2189 10897 31225
13244 31225 34224 28160 22413 27010 17787 12578 7977 173 -16947 -24688 -32061 -21497 -16028 -20348
13230 -20348 8751 10703 -5235 -27210 -28460 -35792 -39973 -57881 -40805 -30403 -33024 -40042 -24559
13217 -24559 -17457 512 14082 13768 25729 15508 -6460 -13873 -14404 -18890 -1452 15486 4972
13204 4972 -16621 -30201 -17465 -20064 -29312 -20907 -24495 -29390 -14928 -10550 3917 30154 21899
13191 21899 20333 22762 5621 -6461 2898 -9226 -20179 -15998 -12599 -23798 -13618 -13327 -26022
13178 -26022 -3611 11313 3967 -11758 -25785 -16216 -6874 935 -332 8731 19541 25906 23404
$$ packed form
13270D714O496j7938L621j3247k6780m097q742L351K1709L5433J935k4223n700
13257b3468p124j4276K0630K1412l747P03L142j563M780n420K742J3086K0328
13244C1225K999o064n747M597r223n209m601p804j7120p741p373J0564N469m320
13230b0348K9099J952j5938k1975j250p332m181j7908J7076J0402k621p018J5483
13217b4559P102J7969J3570l14J1961j0221k1968p413n31m486J7438J6938j0514
13204D972k1593j3580J2736k599r248Q405l588m895J4462M378J4467K6237q255
13191B1899j566K429j7141j2082R359j2124j0953M181L399j1199J0180K91j2695
13178b6022K2411J4924p346j5725j4027R569R342P809j267R063J0810O365k502
$$ plain form
13165 23404 5568 -16584 -15045 1663 187 -6762 -5054 -3148 -13399 -19986 -19736 -20792 -6391
13152 -6391 2492 3097 -9254 -34977 -48941 -41273 -31694 -13972 4427 12595 14849 11882 -3205
13139 -3205 -11084 -11750 -36460 -55689 -50293 -34767 -21514 -15055 -10555 -24345 -15956 4710 11220
13126 11220 20689 30131 11486 14147 14500 21116 2139 -1220 24852 22067 4694 1724 628 4693
13112 4693 12605 -2453 -8681 5122 8111 10566 11469 6039 11495 -18396 -45263 -30505 -15492
13099 -15492 -12325 -5324 8192 17794 37869 42527 30296 -1904 8107 16312 11420 483 -2344
13086 -2344 7166 11327 18545 10912 -2468 -10819 -13722 -5923 -4773 -2360 5376 -9816 -3119 -1463
13072 -1463 10738 -2116 -10447 -19796 -17820 -39725 -37942 -23230 -7583 1540 13743 8248 -12760
$$ packed form
13165B3404j7836k2152J539J6708j476o949J708J906j0251o587K50j056J4401
13152f391Q883O05j2351k5723j3964P668R579J7722J8399Q168K254k967j5087
13139c205p879o66k4710j9229N396J5526J3253O459M500j3790Q389K0666O510
13126A1220R469R442j8645K661L53O616j8977l359K6072k785j7373k970j096M065
13112D693P912j5058o228J3803K989K455R03n430N456k9891k6867J4758J5013
13099a5492L167P001J3516R602K0075M658j2231l2200J0011Q205m892j0937k827
13086b344R510M161P218p633j3380q351k903P799J150K413P736j5192O697J656
13072a463J2201j2854q331r349J976k1905J783J4712J5647R123J2203n495k1008
$$ plain form
13059 -12760 -22676 -16692 -28825 -28756 -33731 -38925 -39468 -28372 -32022 -17247 -9573 -6189 -10535 -16196
13045 -16196 -22294 -25188 -29320 -24854 -17861 -20092 -28146 -21915 -21067 -20269 -21257 -19621 -29304 -10702 -3422
13030 -3422 -7792 -10356 -4138 -6956 6786 7690 11194 17009 -13506 -22895 -24529 -22348 -2569 9149
13016 9149 30792 6532 -13217 -17469 -15000 -10499 4997 19084 38814 51095 40314 30958 25680
13003 25680 14268 20867 23672 20069 9504 10830 9491 -8584 -6797 -2625 17184 26848 8029
12990 8029 18921 16567 3835 -10740 -26839 -24045 -10936 -19598 -8166 -6005 -2553 -8612 -13757
12977 -13757 1140 -7481 -20238 -19443 -12742 -12501 -23811 -16001 -11928 -17789 -12572 -12143 1294 1652
12963 1652 -69 141 -22152 -22186 -3179 6510 7529 4225 7812 1672 -2805 3680 15573 25560 30844
$$ packed form
13059a2760r916N984j2133O9m975n194n43J1096l650J4775P674L384m346n661
13045a6196o098k894m132M466O993k231q054O231Q48P98r88J636r683J8602P280
13030c422m370k564O218k818J3742R04L504N815l0515r389j634K181J9779J1718
13016I149K1643k4260j9749m252K469M501J5496J4087J9730J2281j0781r356n278
13003B5680j1412O599K805l603j0565J326j339j8075J787M172J9809R664j8819
12990H029J0892k354j2732j4575j6099K794J3109q662J1432K161L452o059n145
12977a3757J4897q621j2757P95O701K41j1310P810M073n861N217M29J3437L58
12963A652j721K10k2293l4J9007R689J019l304L587o140m477O485J1893R987N284
$$ plain form
12948 30844 23844 -10102 -11544 5901 21827 13423 -659 -10709 163 17273 7833 -4086
12936 -4086 8498 26184 6111 -19984 -16434 4187 20742 21145 4610 -385 361 14182 4596
12923 4596 -2598 8136 12297 17162 16160 17906 19017 10601 -15332 -15637 -17826 -18635 -13954 -13987 -1519
12908 -1519 15001 7614 11476 8493 8538 -7173 -13966 -4951 8487 7214 -5320 -22155 -21861 -5589
12894 -5589 -6318 -1164 -2839 2864 13237 8867 -6017 -21098 -3331 994 -12053 -15262 -11978 -26863
12880 -26863 -47901 -39661 -36213 -49337 -50438 -59825 -62569 -63539 -56085 -37165 -11417 -12217 -36180 -36431
12866 -36431 -27530 -37303 -38359 -20509 -14588 -33021 -6002 -9280 -7227 12199 3106 -7910 -3500
12853 -3500 -13030 -16685 -16263 -14565 -10104 -22750 -19811 -2955 11361 2916 2597 -5718 -11748 5583
$$ packed form
12948C0844p000l3946j442J7445J5926q404j4082j0050J0872J7110r440j1919
12936d086J2584J7686k0073k6095L550K0621J6555M03j6535m995P46J3821r586
12923D596p194J0734M161M865j002J746J111q416k5933l05k189q09M681l3J2468
12908a519J6520p387L862k983M5j5711o793R015J3438j273j2534j6835K94J6272
12894e589p29N154j675N703J0373m370j4884j5081J7767M325j3047l209L284j4885
12880b6863k1038Q240L448j3124j101r387k744r70P454J8920K5748q00k3963k51
12866c6431Q901r773j056J7850N921j8433K7019l278K053J9426r093j1016M410
12853c500r530l655M22J698M461j2646K939J6856J4316q445l19q315o030J7331
$$ plain form
12839 5583 27607 33413 -556 -15318 -21683 -23236 -20193 -23603 -15240 8003 29532 20632 4117
12826 4117 4172 10805 6003 -6102 -22819 5091 17730 18684 16342 -8892 -13478 5028 15122 3740
12812 3740 -7283 1664 -21665 -29289 -527 6519 9193 10370 10520 2272 21693 20494 20100 16768
12798 16768 16113 18004 13013 6746 1902 6560 18474 10756 12243 31547 20806 42951 51522 27921
12784 27921 10926 -13006 -18242 -10444 -4736 2584 5515 9893 9174 -5013 2541 8066 -14460 -36614
12770 -36614 -7650 24512 -2719 -14597 -22962 -23929 -9744 -15649 -16970 -28041 -25578 5444 9613
12757 9613 3085 -13464 -13031 -4648 -8229 -13096 -16180 -6516 -14680 -20058 2578 19630 29732 23647
12743 23647 13110 -2218 -17856 -3756 17371 31287 27612 16879 16630 20206 30362 21919 25058
$$ packed form
12839E583K2024N806l3969j4762o365j553L043l410Q363K3243K1529q900j6515
12826D117N5O633m802j2105j6717K7910J2639R54k342k5234m586J8506J0094j1382
12812C740j1023Q947k3329p624K8762P046K674J177J50q248J9421j199l94l332
12798A6768o55J891m991o267m844M658J1914p718J487J9304j0741K2145Q571k3601
12784B7921j6995k3932n236P798N708P320K931M378p19j4187P554N525k2526k2154
12770c6614K8964L2162k7231j1878q365r67J4185n905j321j1071K463L1022M169
12757I613o528j6549M33Q383l581m867l084R664q164n378K2636J7052J0102o085
12743B3647j0537j5328j5638J4100K1127J3916l675j0733k49L576J0156q443L139
$$ plain form
12730 25058 22593 23558 13739 -1534 4528 2149 2625 7708 17280 1148 6171 12423 26540 31967
12716 31967 19878 24514 25255 10825 8807 -4002 1211 16306 29121 31722 37226 12955 13397
12703 13397 7768 4716 -10619 -10665 -13984 -36954 -24541 -9094 -11524 -9561 -17795 -12174 -15647 -19276
12689 -19276 -10276 5743 9472 -206 4144 -1199 12885 30438 35065 20613 11502 -4396 -1810
12676 -1810 14161 215 -9787 7859 21207 8174 -8436 -20561 -3406 9481 -2692 -20382
12664 -20382 -16806 -19147 -9705 -2225 1413 11910 38080 34384 10415 -4427 2896 -17116 -29383
12651 -29383 -26740 -15807 -15996 -8413 2501 6342 13383 22175 17131 12328 4876 -4059 -17939 -22482
12637 -22482 -20158 -3965 -16293 -34828 -48035 -49826 -31526 -14976 -3157 22073 29047 37444
$$ packed form
12730B5058k465R65r819j5273O062k379M76N083R572j6132N023O252J4117N427
12716C1967j2089M636P41j4430k018j2809N213J5095J2815K601N504k4271M42
12703A3397n629l052j5335m6l319k2970J2413J5447k430J963q234N621l473l629
12689a9276R000J6019L729r678M350n343J4084J7553M627j4452r111j5898K586
12676a810J5971j3946j0002J7646J3348j3033j6610j2125J7155J2887j2173j7690
12664b0382L576k341R442P480L638J0497K6170l696k3969j4842P323k0012j2267
12651b9383K643J0933j89P583J0914L841P041Q792n044m803p452q935j3880m543
12637b2482K324J6193j2328j8535j3207j791J8300J6550J1819K5230O974Q397
$$ plain form
12625 37444 1326 -258 8630 30558 27959 25443 19421 12981 8151 7030 3140 -185 -2404 -5287
12611 -5287 14138 13614 10407 14340 25225 19886 17602 19312 24552 5167 2263 1818 19296 6788
12597 6788 -24053 -27370 -13948 159 -1780 4856 -170 5304 7585 -1263 -2420 -10877 11733 44108
12583 44108 26731 8063 14861 4768 -7079 -22531 -5311 -2416 4637 10371 16042 23075 12948
12570 12948 12638 -1133 -4435 -5268 -13080 -25326 -23753 -16600 -9103 -1784 3707 5048 16477 27251
12556 27251 30949 18115 31178 24074 -3836 -11566 -5642 8247 26931 46446 52288 29271 9787
12543 9787 2510 4600 -2785 -18034 -12757 -181 13742 9625 -20274 -33198 -11936 -3885 16276
12530 16276 45125 46562 14650 4228 441 8820 11868 19169 26762 13931 5749 19807 24944
$$ packed form
12625C7444l6118j584Q888K1928k599k516o022o440m830j121l890l325k219k883
12611e287J9425n24l207L933J0885n339k284J710N240j9385k904m45J7478j2508
12597F788l0841l317J3422J4107j939O636n026N474K281q848j157q457K2610L2375
12583D4108j7377j8668O798j0093j1847j5452J7220K895P053N734N671P033j0127
12570A2948l10j3771l302q33p812j2246J573P153P497P319N491J341J1429J0774
12556B7251L698j2834J3063p104k7910p730N924J3889J8684J9515N842k3017j9484
12543I787p277K090p385j5249N277J2576J3923m117k9899j2924K1262Q051K0161
12530A6276K8849J437l1912j0422l787Q379L048P301P593j2831q182J4058N137
$$ plain form
12517 24944 37701 42783 39216 32106 16516 26717 29347 44836 52754 38458 25757 14664 17377
12504 17377 53241 57401 62236 44082 21389 18241 20904 6778 9255 21511 34175 27908 38836
12491 38836 37355 17248 4942 5106 -7675 -19185 1331 11603 3755 -9371 -4986 5358 1343
12478 1343 2803 14338 34522 14552 24384 53212 51414 37077 19826 12209 15442 17734 3465
12465 3465 -5629 -1502 7454 2813 -7338 -35 3700 13545 16297 16300 3221 16370 25521 17772 17685
12450 17685 15725 43343 67400 53716 29532 -1362 -8780 1383 -7 -15953 -19334 -5097
12438 -5097 -5408 -15555 -2279 -1317 -6994 -6072 840 -12873 7298 25867 27919 11169 21041 50044
12424 50044 38543 27492 29758 26430 18713 22378 29313 22085 30938 36850 32093 20495 26874 7329
$$ packed form
12517B4944J2757N082l567p110j5590J0201K630J5489P918j4296j2701j1093K713
12504A7377L5864M160M835j8154k2693l148K663j4126K477J2256J2664o267J0928
12491C8836j481k0107j2306J64j2781j1510K0516J0272p848j3126M385J0344m015
12478A343J460J1535K0184j9970R832K8828j798j4337j7251p617L233K292j4269
12465C465r094M127Q956m641j0151P303L735R845K752Lj3079J3149R151p749q7
12450A7685j960K7618K4057j3684k4184l0894p418J0163j390j5946l381J4237
12438e097l11j0147J3276R62n677R22O912j3713K0171J8569K052j6750R872K9003
12424E0044j1501j1051K266l328p717L665O935p228Q853N912m757j1598O379j9545
$$ plain form
12410 7329 -3867 -3939 19342 22455 30223 41041 40796 28966 210 -6834 -12300 2321 16726 18097
12396 18097 35025 38447 22318 16802 7180 33879 39537 21099 25674 35339 45549 32007 6058
12383 6058 -1624 1878 -2890 1992 -1952 18051 25879 37807 25719 14256 42279 30778 9705
12370 9705 12556 22346 24127 33422 27922 28531 25803 19644 42561 76447 59232 37258 47229 49903
12356 49903 34366 30947 40533 37685 39553 54081 38464 32835 20133 15817 16528 25600 13259
12343 13259 22382 37541 39344 20993 31627 41359 47817 48819 55856 44878 49286 57980 60129
12330 60129 45276 38339 25971 56873 61301 50406 43671 30265 40061 32056 31826 49238 28414
12317 28414 9718 19967 39727 47909 36514 26117 37243 39697 40769 58637 70849 74365
$$ packed form
12410G329j1196p2K3281L113P768J0818k45j1830k8756p044n466J4621J4405J371
12396A8097J6928L422j6129n516r622K6699N658j8438M575R665J0210j3542k5949
12383F058p682L502m768M882l944K0003P828J1928j2088j1463K8023j1501k1073
12370I705K851R790J781R295n500O09k728o159K2917L3886j7215k1974R971K674
12356D9903j5537l419R586k848J868J4528j5617n629j2702m316P11R072j2341
12343A3259R123J5159J803j8351J0634R732O458J002P037j0978M408Q694K149
12330F0129j4853o937j2368L0902M428j0895o735j3406R796q005k30J7412k0824
12317B8414j8696J0249J9760Q182j1395j0397J1126K454J072J7868J2212L516
$$ plain form
12305 74365 64642 59507 42649 35141 36458 33617 38651 40392 55579 44565 33437 56724 59150
12292 59150 22063 17283 21908 31998 22179 17672 26723 30276 20121 22895 22224 34312 27841 25588
12278 25588 11604 14188 19203 25027 37354 59307 61318 48046 54069 61657 62803 62635 62439 81273
12264 81273 42019 15619 8502 14775 31024 33298 43578 46568 62101 52565 53937 58101 56503
12251 56503 56990 18266 10271 29959 45042 52727 53118 65122 61681 40474 35526 34455 46987
12238 46987 42417 43542 50827 36696 48176 62282 78559 79538 63064 52173 51894 60451 54167
12225 54167 57144 37744 49147 74393 61909 48806 69803 76146 63260 89130 84747 78443
12213 78443 60454 66882 72185 65824 55594 47016 65489 64764 66666 83099 83897 77824 60657 66567
$$ packed form
12305G4365r723n135j6858p508J317k841N034J741J5187j1014j1128K3287K426
12292E9150l7087m780M625J0090r819m507R051L553j0155K774o71J2088o471k253
12278B5588j3984K584N015N824J2327K1953K011j3272O023P588J146j68j96J8834
12264H1273l9254k6400p117O273J6249K274J0280K990J5533r536J372M164j598
12251E6503M87l8724p995J9688J5083P685L91J2004l441k1207m948j071J2532
12238D6987m570J125P285j4131J1480J4106J6277R79j6474j0891k79Q557o284
12225E4167K977j9400J1403K5246j2484j3103K0997O343j2886K5870m383o304
12213G8443j7989O428N303o361j0230q578J8473p25J902J6433P98o073j7167N910
$$ plain form
12199 66567 64166 63446 74641 87251 99290 106463 111078 101787 105294 102666 86185 72754 66581
12186 66581 59374 60609 77270 89120 100502 102326 106110 93906 100120 116057 125510 134680 110321
12173 110321 68138 46702 34511 40977 74738 84652 97371 88293 91545 83443 81948 105867 123183
12160 123183 126593 142144 139618 117109 106726 104870 100688 83346 78136 105634 112982 112332 111507
12147 111507 109344 120144 108166 110466 116365 105359 103856 111147 112266 119895 114273 132421 160781
12134 160781 158509 132036 138059 145190 142156 149248 142087 128114 128098 142972 146842 143511 148245 154362
12120 154362 148268 178167 187752 179187 176396 168171 173999 186411 172091 150791 159633 180428 182975
12107 182975 197930 184596 186093 181435 169184 177003 204097 222976 242353 224719 218917 195383
$$ packed form
12199F6567k401p20J1195J2610J2039P173M615r291L507k628j6481j3431o173
12186F6581p207J235J6661J1850J1382J824L784j2204O214J5937R453R170k4359
12173A10321m2183k1436j2191O466L3761R914J2719r078L252q102j495K3919J7316
12160A23183L410J5551k526k2509j0383j856m182j7342n210K7498P348o50q25
12147A11507k163J0800j1978K300N899j1006j503P291J119P629n622J8148K8360
12134A60781k272k6473O023P131l034P092p161j3973j6J4874L870l331M734O117
12120A54362o094K9899R585q565k791q225N828J2412j4320k1300Q842K0795K547
12107A82975J4955j3334J497m658j2251P819K7094J8879J9377j7634n802k3534
$$ plain form
12095 195383 192185 200773 186831 195312 196815 195943 222524 242745 219264 206718 223096 231165 223859
12082 223859 213212 214773 218475 224959 226412 220286 237438 237623 244333 251456 256825 269756 280832
12069 280832 283966 282665 282184 276988 296190 295314 296098 305394 300291 286103 316193 341439 341960 325076
12055 325076 314371 314103 327372 316560 329452 354167 377157 391169 378835 373272 374849 386648
12043 386648 422126 429486 416780 391609 410337 426298 451643 444428 424961 423994 435783 445751
12031 445751 461341 472537 491402 506073 509705 519969 514678 521418 553956 566036 566946 565651 593274
12018 593274 613943 629913 626470 627507 651106 656310 655766 670201 694618 702372 723806 744125 734423
12005 734423 752996 769150 776020 789045 806541 835597 865541 891607 921176 935346 972112 984596
$$ packed form
12095A95383l198Q588j3942Q481J503q72K6581K0221k3481j2546J6378Q069p306
12082B23859j0647J561L702O484J453o126J7152J85O710P123N369J2931J1076
12069B80832L134j301m81n196J9202q76P84R296n103j4188L0090K5246N21j6884
12055C25076j0705k68J3269j0812J2892K4715K2990J4012j2334n563J577J1799
12043C86648L5478P360j2706k5171J8728J5961K5345p215j9467r67J1789R968
12031D45751J5590J1196J8865J4671L632J0264n291O740L2538J2080R10j295K7623
12018E93274K0669J5970l443J037K3599N204n44J4435K4417P754K1434K0319r702
12005G34423J8573J6154O870J3025J7496K9056K9944K6066K9569J4170L6766J2484
$$ plain form
11993 984596 1017370 1056949 1076656 1091042 1122006 1149376 1169842 1182392 1222492 1264767 1300385
11982 1300385 1324008 1359907 1416490 1460665 1501256 1537564 1579182 1621252 1677923 1730325 1787963
11971 1787963 1846294 1895157 1952310 2002729 2054187 2099152 2168421 2256934 2341518 2411956 2478281
11960 2478281 2576675 2664792 2760920 2869157 2960207 3042290 3170156 3311287 3435554 3543397
11950 3543397 3639824 3758503 3884272 4016341 4163320 4313708 4462583 4596840 4759060 4917114
11940 4917114 5090631 5257874 5384888 5526522 5677405 5846580 6010948 6169781 6330249
11931 6330249 6458524 6578137 6704791 6798071 6879931 6956777 7038485 7084473 7125528 7156312 7148382
11920 7148382 7155059 7142859 7107697 7053284 6983328 6895143 6802028 6695403 6586575 6465810 6332673
$$ packed form
11993I84596L2774L9579J9707J4386L0964K7370K0466J2550M0100M2275L5618
11982A300385K3623L5899N6583M4175M0591L6308M1618M2070N6671N2402N7638
11971A787963N8331M8863N7153N0419N1458M4965O9269Q8513Q4584P0438O6325
11960B478281R8394Q8117R6128J08237R1050Q2083J27866J41131J24267J07843
11950C543397R6427J18679J25769J32069J46979J50388J48875J34257J62220J58054
11940D917114J73517J67243J27014J41634J50883J69175J64368J58833J60468
11931F330249J28275J19613J26654R3280Q1860P6846Q1708M5988M1055L0784p930
11920G148382O677j2200l5162n4413o9956q8185r3115j06625j08828j20765j33137
$$ plain form
11909 6332673 6194195 6066867 5903505 5734704 5598651 5452888 5296787 5151807 5002762
11900 5002762 4835328 4682519 4550869 4411417 4287671 4128922 3975122 3864672 3751074
11891 3751074 3618901 3489739 3381113 3264510 3143174 3033822 2946424 2862830 2768821 2686420
11881 2686420 2599718 2520454 2445439 2382714 2309397 2233005 2152352 2108699 2050192 1983500 1929265
11870 1929265 1873563 1805846 1758871 1719396 1667551 1623363 1564540 1526619 1495561 1449478 1392881
11859 1392881 1341314 1314877 1282900 1228112 1218420 1194043 1163329 1129434 1076745 1047846 1040553 1052259
11847 1052259 1049029 1007539 976061 964673 929982 895826 856193 816170 808746 814306 810365 816901
11835 816901 806461 782973 747928 730044 706394 679331 667358 673947 679319 672614 663770 637203
$$ packed form
11909F332673j38478j27328j63362j68801j36053j45763j56101j44980j49045
11900E002762j67434j52809j31650j39452j23746j58749j53800j10450j13598
11891C751074j32173j29162j08626j16603j21336j09352q7398q3594r4009q2401
11881B686420q6702p9264p5015o2725p3317p6392q0653m3653n8507o6692n4235
11870A929265n5702o7717m6975l9475n1845m4188n8823l7921l1058m6083n6597
11859A392881n1567k6437l1977n4788r692k4377l0714l3895n2689k8899p293J1706
11847A052259l230m1490l1478j1388l4691l4156l9633m0023p424N560l941O536
11835H16901j0440k3488l5045j7884k3650k7063j1973O589N372o705q844k6567
$$ plain form
11823 637203 629255 594758 594989 594889 586192 560145 553740 541519 518663 523829 513718 514768 505068
11810 505068 503332 511812 501370 498046 492245 449130 423748 413579 408480 399027 417561 424277 412023
11797 412023 407494 416343 402942 388464 395303 398908 384355 358233 351329 347719 330922 324912 328693
11784 328693 317887 348716 347788 327074 295294 296512 296965 315524 313703 294536 278963 239076 264575
11771 264575 287292 285904 270663 266339 256849 255780 241815 243376 225929 206101 201582 202470 217840
11758 217840 215983 207021 210959 204467 206721 196061 194711 207078 208420 204235 197419 191166 194579 179078
11744 179078 191858 210979 215630 196102 195377 209252 201836 171871 149492 148919 177946 182478 158699
11731 158699 161982 178697 183693 176461 167018 162313 187207 187920 166847 154773 148421 118894 101187
$$ packed form
11823F37203p948l4497K31j00q697k6047o405j2221k2856N166j0111J050r700
11810E05068j736Q480j0442l324n801m3115k5382j0169n099r453J8534O716j2254
11797D12023m529Q849j3401j4478O839L605j4553k6122o904l610j6797o010L781
11784C28693j0806L0829r28k0714l1780J218M53J8559j821j9167j5573l9887K5499
11771B64575K2717j388j5241m324r490j069j3965J561j7447j9828m519Q88J5370
11758B17840j857q962L938o492K254j0660j350J2367J342m185o816o253L413j5501
11744A79078J2780J9121M651j9528p25J3875p416k9965k2379n73K9027M532k3779
11731A58699L283J6715M996p232r443m705K4894P13k1073j2074o352k9527j7707
$$ plain form
11718 101187 106634 118927 135082 134789 135249 138392 148573 144091 152991 159795 140234 124051 130053
11705 130053 152606 153415 146552 158831 157048 134097 113139 80753 72599 83393 93985 102269 124715
11692 124715 126017 104443 94796 114001 134510 130498 127855 128333 109322 107572 88195 104973 110090
11679 110090 120620 137307 133907 127979 124995 118744 113126 117118 110461 101507 74710 72453 89977
11666 89977 106072 123345 129463 112750 94269 73937 82059 96653 100034 99742 91593 102816 96563
11653 96563 86696 102659 108005 99882 80230 72118 71274 65693 70554 88067 81629 61740 55529 41062
11639 41062 38643 48765 47639 51384 57827 61072 56032 46554 37331 52390 60684 59381 53878 50415
11625 50415 42438 39387 57985 65008 70665 86212 89485 81764 66799 62416 62133 56204 52031 54661
$$ packed form
11718A01187N447J2293J6155k93M60L143J0181m482Q900O804j9561j6183O002
11705A30053K2553Q09o863J2279j783k2951k0958l2386q154J0794J0592Q284K2446
11692A24715J302k1574r647J9205K0509m012k643M78j9011j750j9377J6778N117
11679A10090J0530J6687l400n928k984o251n618L992o657q954k6797k257J7524
11666H9977J6095J7273O118j6713j8481k0332Q122J4594L381k92q149J1223o253
11653I6563r867J5963N346q123j9652q112q44n581M861J7513o438j9889o211j4467
11639D1062k419J0122j126L745O443L245n040r478r223J5059Q294j303n503l463
11625E0415p977l051J8598P023N657J5547L273p721j4965m383k83n929m173K630
$$ plain form
11611 54661 48690 49587 67862 60195 46876 41318 57195 63904 57273 42662 46036 53616 72017
11598 72017 61220 63103 73232 70342 54447 45579 45812 69302 76059 55757 45429 51433 51545
11585 51545 56133 74884 63954 34559 37037 53719 47284 31237 27789 59820 90555 85903 56052
11572 56052 43893 37989 41258 63958 68070 60191 71013 45857 22777 14979 29672 40736 46627
11559 46627 50923 26858 28666 36747 36795 28952 27604 49666 67619 44813 27057 36867 7562
11546 7562 1822 -24400 -3824 46700 64195 60490 61962 63887 39847 29717 17484 4692 19494
11533 19494 30081 38107 32802 10109 12371 24521 11877 10046 21422 32747 53219 54229 40187
11520 40187 36800 39640 53099 60844 36025 33912 45420 54308 71673 96864 89024 83575 75732
$$ packed form
11611E4661n971Q97J8275p667j3319n558J5877O709o631j4611L374P580J8401
11598G2017j0797J883J0129k890j5895q868K33K3490O757k0302j0328O004J12
11585E1545M588J8751j0930k9395K478J6682o435j6047l448L2031L0735m652k9851
11572E6052j2159n904L269K2700M112p879J0822k5156k3080p798J4693J1064N891
11559D6627M296k4065J808Q081M8p843j348K2062J7953k2806j7756R810k9305
11546G562n740k6222K0576N0524J7495l705J472J925k4040j0130j2233j2792J4802
11533A9494J0587Q026n305k2693K262J2150j2644j831J1376J1325K0472J010j4042
11520D0187l387K840J3459P745k4819k113J1508Q888J7365K5191p840n449p843
$$ plain form
11507 75732 62691 43854 32339 30982 49865 50559 46360 48540 62950 33850 14793 2001 -7443
11494 -7443 7469 20357 14484 4922 8457 21095 25886 21626 15056 36442 39884 42132 24466
11481 24466 13423 21834 26312 18098 28812 58851 42079 58136 55859 36632 21722 27741 37364
11468 37364 56859 42600 61384 60415 55669 75719 59683 21380 18002 27654 24583 24896 17062
11455 17062 30002 26031 18348 29989 28338 18965 31716 38911 32665 31979 18482 7360 9072
11442 9072 8822 9460 15319 428 13259 38969 50758 34564 43168 38148 35263 42263 34250 12685
11428 12685 -7996 -14783 -1787 13893 4278 4184 2588 -9236 3766 -7569 -21539 -14623 344
11415 344 -107 -18752 -27461 -27326 -24552 -6697 14971 39420 44554 24619 16956 20555 36920 36827
$$ packed form
11507G5732j3041j8837j1515j357J8883O94m199K180J4410k9100j9057j2792r444
11494g443J4912J2888n873r562L535J2638M791m260o570K1386L442K248j7666
11481B4466j1043Q411M478q214J0714L0039j6772J6057k277j9227j4910O019R623
11468C7364J9495j4259J8784r69m746K0050j6036l8303l378R652l071L13p834
11455A7062J2940l971p683J1641j651r373J2751P195o246o86j3497j1122J712
11442I072k50O38N859j4891J2831K5710J1789j6194Q604n020k885P000q013k1565
11428A2685k0681o787J2996J5680r615r4j596j1824J3002j1335j3970O916J4967
11415C44m51j8645q709J35K774J7855K1668K4449N134j9935p663L599J6365r3
$$ plain form
11401 36827 16032 13729 28976 18477 -1609 13741 38205 34255 26107 13602 15807 17601 30622
11388 30622 33849 31968 33848 19492 2398 -3978 6342 27189 45819 40659 15357 11314 27269
11375 27269 16444 -13305 -14999 5107 30165 29551 22019 33552 56244 56254 44596 11796 8345
11362 8345 -7001 -2075 -5691 -25745 -22011 -13610 -2564 1805 -1838 -3604 14243 31080 41275
11349 41275 53502 56714 52072 43123 27677 40056 40624 59845 53350 42409 9626 5511 7132
11336 7132 39770 44190 17795 12614 7752 15414 21945 6025 8504 37443 47103 24015 23561 11431
11322 11431 7894 33129 34613 15604 2125 2162 21151 15420 9803 23187 18177 19536 43197
11309 43197 50769 44137 54781 40718 42470 54960 58914 47781 15604 10761 13747 3869 19026
$$ packed form
11401C6827k0795k303J5247j0499k0086J5350K4464l950q148j2505K205J794J3021
11388C0622L227j881J880j4356j7094o376J0320K0847J8630n160k5302m043J5955
11375B7269j0825k9749j694K0106K5058o14p532J1533K2692J0j1658l2800l451
11362H345j5346M926l616k0054L734Q401J1046M369l643j766J7847J6837J0195
11349D1275J2227L212m642q949j5446J2379N68J9221o495j0941l2783m115J621
11336G132L2638M420k6395n181m862P662O531j5920K479K8939R660k3088m54j2130
11322A1431l537K5235J484j9009j3479L7J8989n731n617J3384n010J359K3661
11309D3197P572o632J0644j4063J752J2490L954j1133l2177m843K986r878J5157
$$ plain form
11296 19026 30408 32711 30779 17748 13140 1514 -14642 -6714 12241 9869 -9516 -20614 -16485
11283 -16485 -3697 504 5601 13112 22694 23575 9280 -2465 -1733 -16 13700 32187 28137 26700
11269 26700 34806 22570 14407 14586 38550 52901 17317 25007 30203 44190 52006 27833 7727
11256 7727 29865 31371 31882 36761 42531 32755 47475 45501 15388 -1071 3026 8293 3970 -2121
11242 -2121 8565 -4689 -13068 -15703 2687 2863 -3912 -1308 2293 5853 -2949 11430 2752 -136
11228 -136 8125 630 2162 14600 27017 42158 47680 40554 22000 7196 504 -34 -26987 -44606
11214 -44606 -40040 -17363 6561 8311 11808 -11240 -12521 -10907 9038 10664 8503 21366 22596
11201 22596 17351 20725 15017 22562 27400 23889 8403 -1314 -201 9565 13470 13323 -18533 -29035
$$ packed form
11296A9026J1382K303j932j3031m608j1626j6156P928J8955k372j9385j1098M129
11283a6485J2788M201N097P511R582Q81j4295j1745P32J717J3716J8487m050j437
11269B6700Q106j2236q163J79K3964J4351l5584P690N196J3987P816k4173k0106
11256G727K2138J506N11M879N770r776J4720j974l0113j6459M097N267m323o091
11242b121J0686j3254q379k635J8390J76o775K604L601L560q802J4379q678k888
11228a36Q261p495J532J2438J2417J5141N522p126j8554j4804o692n38k6953j7619
11214d4606M566K2677K3924J750L497k3048j281J614J9945J626k161J2863J230
11201B2596n245L374n708P545M838l511j5486r717J113R766L905j47l1856j0502
$$ plain form
11187 -29035 -7408 12014 15804 15979 10356 10256 12886 4323 -6685 334 4207 8521 560 16190
11173 16190 33245 3284 -6914 14885 46312 45981 43198 17651 1171 -12344 -779 14896
11161 14896 15956 12698 8846 18851 15933 -3459 62 3203 -542 2649 -2696 -1769 3297 -5443
11147 -5443 -29441 -32007 -37209 -7558 24553 17181 -8440 -28836 -40228 -29168 -9246 -14198 869
11134 869 22698 25507 22087 7729 5892 -6615 5977 12950 29937 41510 23113 -8996 3682
11121 3682 11396 32236 25692 10173 36245 32903 3097 14667 28643 33327 20978 8619 14973
11108 14973 32990 28770 36081 39447 38556 30663 15770 20308 17540 10422 24087 40977 29909
11095 29909 13381 2491 1746 -3880 -21211 -20529 19786 35616 33477 11443 3759 4371 21284
$$ packed form
11187b9035K1627J9422L790J75n623j00K630q563j1008P019L873M314p961J5630
11173A6190J7055k9961j0198K1799L1427l31k783k5547j6480j3515J1565J5675
11161A4896J060l258l852J0005k918j9392L521L141l745L191n345R27N066q740
11147e443k3998k566n202K9651L2111p372k5621k0396j1392J1060J9922m952J5067
11134H69K1829K809l420j4358j837j2507J2592O973J6987J1573j8397l2109J2678
11121C682P714K0840o544j5519K6072l342k9806J1570J3976M684j2349j2359O354
11108A4973J8017m220P311L366q91p893j4893M538k768p118J3665J6890j1068
11095B9909j6528j0890p45n626j7331O82M0315J5830k139k2034p684O12J6913
$$ plain form
11082 21284 28525 15946 6615 10369 19250 32863 42051 40525 34513 48854 62987 42699 15806
11069 15806 17893 18141 212 -5102 9401 13258 252 -4727 14703 13740 16970 10987 14216 6253
11055 6253 2846 7151 1235 -3820 9054 809 -1608 4081 11873 20689 23820 22733 30266 43441
11041 43441 40213 45381 51731 48218 72042 73170 64346 65678 73822 72521 81306 103414 100185 94686
11027 94686 95284 127570 143586 123609 110888 88473 84133 91438 83076 87762 102090 113599 153294
11014 153294 187661 194615 183302 175644 166774 149422 118850 110740 112700 133602 146821 168497
11002 168497 163643 150750 122930 105231 102811 97517 107328 95923 82138 93079 94541 85224 91107
10989 91107 85520 66010 64558 83706 62724 42190 34945 9949 -1321 -630 14343 41670 30427
$$ packed form
11082B1284P241j2579r331L754Q881J3613R188j526o012J4341J4133k0288k6893
11069A5806K087K48j7929n314J4503L857j3006m979J9430r63L230n983L229p963
11055F253l407M305n916n055J2874q245k417N689P792Q816L131j087P533J3175
11041D3441l228N168O350l513K3824J128q824J332Q144j301Q785K2108l229n499
11027I4686N98L2286J6016j9977j2721k2415m340P305q362M686J4328J1509L9695
11014A53294L4367O954j1313p658q870j7352l0572q110J960K0902J3219K1676
11002A68497m854j2893k7820j7699k420n294R811j1405j3785J0941J462r317N883
10989I1107n587j9510j452J9148k0982k0534p245k4996j1270O91J4973K7327j1243
$$ plain form
10976 30427 14399 21716 8918 -18704 -14463 -1414 12052 21481 20138 20161 1566 -15442 -12029
10963 -12029 116 -14717 -19022 -15995 -11214 860 9828 9141 11089 6383 26388 33045 26008 16182
10949 16182 4862 -588 18183 34102 36020 54681 65948 48345 26559 7827 1625 10694
10937 10694 6846 4772 3718 23844 37019 40316 31434 29006 35376 47665 64797 63093 45766
10924 45766 37528 29001 41069 52105 55265 52016 70859 81122 106676 120338 137911 187003
10912 187003 232320 306689 403834 538992 798421 1131180 1418938 1486485 1398077 1249287
10902 1249287 1000991 729310 542676 403381 311618 244376 202348 176558 163500 128313
10892 128313 114055 109493 102380 111085 99322 79381 71014 75529 75095 53512 41217 53397 52950
$$ packed form
10976C0427j6028P317j2798k7622M241J3049J3466R429j343K3j8595j7008L413
10963a2029J2145j4833m305L027M781J2074Q968o87J948m706K0005O657p037r826
10949A6182j1320n450J8771J5919J918J8661J1267j7603k1786j8732o202R069
10937A0694l848k074j054K0126J3175L297q882k428O370J2289J7132j704j7327
10924D5766q238q527J2068J1036L160l249J8843J0263K5554J3662J7573M9092
10912A87003M5317P4369R7145J35158K59429L32759K87758O7547q8408j48790
10902A249287k48296k71681j86634j39295r1763o7242m2028k5790j3058l5187
10892A28313j4258m562p113Q705j1763j9941q367M515m34k1583j2295J2180m47
$$ plain form
10879 52950 45681 39058 24998 25474 25328 23343 54082 53587 47219 54027 38495 20636 19889 25582
10865 25582 27786 32450 42392 29380 20240 15643 12373 18922 12227 20648 44190 25237 33462 35559
10851 35559 29566 36069 34599 36096 25065 24352 28066 8907 4845 2791 -5070 4994 12475 12430
10837 12430 -8374 -17343 -1437 11470 23957 22681 21511 23440 16376 12270 27133 26118 17848
10824 17848 32561 29315 27814 28750 21215 876 -11176 16646 34397 13433 -12801 -11274 8309
10811 8309 55877 86136 111857 131826 104689 76732 68450 73989 52322 47457 32458 12797
10799 12797 8840 15915 10736 -1721 7278 18331 8223 -5839 -3628 -15171 -19640 -29423 -13872
10786 -13872 -9059 -18632 -1442 35297 57676 53254 30074 10922 28463 32430 41480 47906 35944
$$ packed form
10879E2950p269o623j4060M76j46j985L0739m95o368O808j5532j7859p47N693
10865B5582K204M664R942j3012r140m597l270O549o695Q421K3542j8953Q225K097
10851C5559n993O503j470J497j1031p13L714j9159m062k054p861J0064P481m5
10837A2430k0804q969J5906J2907J2487j276j170J929p064m106J4863j015q270
10824A7848J4713l246j501R36p535k0339j2052K7822J7751k0964k6234J527J9583
10811H309M7568L0259K5721J9969k7137k7957q282N539k1667m865j4999j9661
10799A2797l957P075n179j2457Q999J1053j0108j4062K211j1543m469r783J5551
10786a3872M813r573J7190L6739K2379m422k3180j9152J7541L967R050O426j1962
$$ plain form
10773 35944 29355 38930 65227 69120 61760 23114 4781 21803 28326 31774 44908 61673 62895
10760 62895 66416 69486 86480 96936 111843 139953 127072 89108 105235 158645 187844 221340
10748 221340 229547 183381 137193 105574 75084 52081 84552 110773 93632 91055 88328 78858
10736 78858 65980 50582 62327 60495 29080 6615 5701 25210 50833 64543 73318 73654 87508
10723 87508 83695 74281 38268 18180 27903 50716 63467 70882 54179 51074 59158 75522 75871
10710 75871 69003 53945 39949 29899 9517 2150 1171 -6080 -7749 -8345 2710 -20254 -30333
10697 -30333 -41179 -43137 -60782 -111452 -156591 -150038 -157339 -121029 -65858 -11038 33461 68747
10685 68747 95177 115410 135204 150196 163864 161050 147411 150063 186010 206730 205254 201429
$$ packed form
10773C5944o589R575K6297L893p360l8646j8333J7022O523L448J3134J6765J222
10760F2895L521L070J6994J0456J4907K8110j2881l7964J6127N3410K9199L3496
10748B21340Q207m6166m6188l1619l0490k3003L2471K6221j7141k577k727r470
10736G8858j2878j5398J1745j832l1415k2465r14J9509K5623J3710Q775L36J3854
10723H7508l813r414l6013k0088R723K2813J2751P415j6703l105Q084J6364L49
10710G5871o868j5058j3996j0050k0382p367r79p251j669n96J1055k2964j0079
10697c0333j0846j958j7645n0670m5139O553p301L6310N5171N4820M4499L5286
10685F8747K6430K0233J9794J4992J3668k814j3639K652L5947K0720j476l825
$$ plain form
10673 201429 192913 194105 185181 202788 225945 210385 214801 211671 195438 164612 145191 163971
10661 163971 183880 173962 159888 139585 136284 149821 154490 177168 191858 208914 222170 230367
10649 230367 201329 185838 215309 232204 221580 237449 254652 266219 267356 273411 294711 312396
10637 312396 318225 334142 371690 404329 426931 479531 533394 568820 599504 622549 587819 433967
10625 433967 298859 275157 314370 387652 503648 639959 749039 860399 995394 1169704
10615 1169704 1421913 1749774 2174912 2759024 3593494 4726684 6088181 7510600 8646343
10606 8646343 9241778 9348290 9116943 8769694 8557938 8707067 9359628 10653649 12715075
10597 12715075 15458748 18305952 20257593 20796081 20162471 18755310 17146300 15952812
$$ packed form
10673B01429q516J192q924J7607K3157j5560M416l130j6233l0826j9421J8780
10661A63971J9909r918j4074k0303l301J3537M669K2678J4690J7056J3256Q197
10649B30367k9038j5491K9471J6895j0624J5869J7203J1567J137O055K1300J7685
10637C12396N829J5917L7548L2639K2602N2600N3863L5426L0684K3045l4730j53852
10625D33967j35108k3702L9213P3282J15996J36311J09080J11360J34995J74310
10615A169704K52209L27861M25138N84112Q34470J133190J361497J422419J135743
10606H646343N95435J06512k31347l47249k11756J49129O52561J294021K061426
10597A2715075K743673K847204J951641N38488o33610j407161j609010j193488
$$ plain form
10589 15952812 15526226 16067525 17673941 20398646 23944472 27343841 29172930 28904066
10581 28904066 26954980 23991333 20832033 18249657 16640597 16057883 16455994 17734208
10573 17734208 19585452 21232059 21744093 20803651 18809800 16261977 13743513 11735617
10565 11735617 10411665 9710477 9542912 9793227 10221267 10522658 10391527 9683305 8576134
10556 8576134 7300296 6051682 4979710 4125436 3505639 3045033 2697191 2461597 2277114
10547 2277114 2146813 2042575 1964168 1903710 1849047 1822284 1811116 1788257 1782842 1809652 1837064
10536 1837064 1876596 1916432 1955908 2008862 2083945 2161574 2284375 2407918 2572207 2790501
10526 2790501 3033927 3326967 3661455 4127608 4792633 5555246 6141075 6558337 7034620
$$ packed form
10589A5952812m26586N41299J606416K724705L545826L399369J829089k68864
10581B8904066j949086k963647l159300k582376j609060n82714L98111J278214
10573A7734208J851244J646607N12034r40442j993851k547823k518464k007896
10565A1735617j323952p01188j67565K50315M28040L01391j31131p08222j107171
10556H576134j275838j248614j071972q54274o19797m60606l47842k35594j84483
10547B277114j30301j04238p8407o0458n4663k6763j1168k2859n415K6810K7412
10536A837064L9532L9836L9476N2954P5083P7629J22801J23543J64289K18294
10526B790501K43426K93040L34488M66153O65025P62613N85829M17262M76283
$$ plain form
10517 7034620 7573300 8240717 9187918 10391445 11682196 13131276 14982257 17372000 20446338
10508 20446338 24723280 30964509 40200245 54436089 77292364 114777047 173601886
10501 173601886 246194615 287221348 276293893 250955500 213725137 159332642 110118832
10494 110118832 77652383 57577553 44839731 36271272 30179861 25694620 22349438
10487 22349438 19781430 17523073 15501970 13762914 12226451 10884198 9894033 9282008
10479 9282008 8806571 8208314 7525805 6873665 6181680 5485670 4902266 4452169 4108491
10470 4108491 3811690 3529344 3266193 3028313 2824673 2600793 2415757 2249682 2099750
10461 2099750 1991781 1918770 1823667 1701635 1593511 1474263 1370337 1278918 1219709 1186953
$$ packed form
10517G034620N38680O67417R47201J203527J290751J449080J850981K389743L074338
10508B0446338M276942O241229R235736J4235844K2856275L7484683N8824839
10501A73601886P2592729M1026733j0927455k5338393l7230363n4392495m9213810
10494A10118832l2466449k0074830j2737822q568459o091411m485241l345182
10487B2349438k568008k258357k021103j739056j536463j342253r90165o12025
10479I282008m75437n98257o82509o52140o91985o96010n83404m50097l43678
10470D108491k96801k82346k63151k37880k03640k23880j85036j66075j49932
10461B099750j07969p3011r5103j22032j08124j19248j03926r1419n9209l2756
$$ plain form
10451 1186953 1143993 1117549 1091376 1055490 1011721 980118 975454 951394 930983 897805 849121
10440 849121 819970 797598 787983 771039 735511 693281 648512 619264 597088 568617 571605 581040
10428 581040 558880 537744 510908 503310 503295 487516 472533 435038 397556 377858 375008 377725 372244
10415 372244 367416 382222 373296 352578 340949 320523 309601 312596 323268 310885 307438 298071
10403 298071 312151 303190 315447 315537 278552 243269 236100 247731 239366 241450 266604 287537 293074
10390 293074 304910 289079 266223 243344 240370 245936 256118 238244 238687 261156 273653 303579
10378 303579 362185 471674 576347 652831 671603 623851 560841 469091 355862 272581 221709
10367 221709 175247 164767 157197 139441 154585 170188 169075 157105 137563 124979 112057 96453
$$ packed form
10451A186953m2960k6444k6173l5886m3769l1603m664k4060k0411l3178m8684
10440H49121k9151k2372r615j6944l5528m2230m4769k9248k2176k8471K988R435
10428E81040k2160k1136k6836p598j5j5779j4983l7495l7482j9698k850K717n481
10415C72244m828J4806q926k0718j1629k0426j0922K995J0672j2383l447r367
10403B98071J4080q961J2257R0l6985l5283p169J1631q365K084K5154K0933N537
10390B93074J1836j5831k2856k2879k974N566J0182j7874M43K2469J2497K9926
10378C03579N8606J09489J04673P6484J8772m7752o3010r1750j13229q3281n0872
10367B21709m6462j0480p570j7756J5144J5603j113j1970j9542j2584j2922j5604
$$ plain form
10355 96453 93801 104198 126076 124952 126819 130378 106090 91321 64601 60383 70107 87413 86166
10342 86166 96567 81551 68884 80575 89011 62791 42766 38690 40290 38620 44045 34041 23418
10329 23418 16575 21557 18349 28294 50508 66343 52438 20963 17340 27815 16620 649 18177
10316 18177 28230 45830 40346 54713 108837 152186 186459 245350 299563 330540 316056 252812
10304 252812 218763 207955 172021 147403 150095 158720 149246 147403 152819 145960 155596 159991 141936
10291 141936 127290 131203 127519 133385 135190 123024 125994 139662 127820 103604 92294 99583 95137
10278 95137 91988 83618 85978 102583 106941 130925 159089 187969 174930 169144 174145 167102 157047
10265 157047 144214 153595 161387 178546 234223 288936 368384 478168 598455 720724 855125
$$ packed form
10355I6453k652J0397K1878j124J867L559k4288j4769k6720m218R724J7306j247
10342H6166J0401j5016j2667J1691Q436k6220k0025m076J600j670N425j0004j0623
10329B3418o843M982l208R945K2214J5835j3905l1475l623J0475j1195j5971J7528
10316A8177J0053J7600n484J4367N4124M3349L4273N8891N4213L0977j4484o3244
10304B52812l4049j0808l5934k4618K692Q625r474j843N416o859R636M395j8055
10291A41936j4646L913l684N866J805j2166K970J3668j1842k4216j1310P289m446
10278I5137l149q370K360J6605M358K3984K8164K8880j3039n786N001p043j0055
10265A57047j2833R381P792J7159N5677N4713P9448J09784J20287J22269J34401
$$ plain form
10254 855125 966376 1043256 1124425 1191114 1201317 1141868 1059587 962147 864463 761240 644310
10243 644310 551545 465425 382495 305870 238864 210108 184821 181325 155528 145692 157778 142845
10231 142845 134189 133590 112752 97140 84587 104017 126251 142121 150421 149561 115782 93681 104955
10218 104955 120112 130620 137554 137964 151091 154775 131363 144419 172590 176456 181518 155286 142404
10205 142404 150226 165669 183198 184736 159598 152922 160991 161265 172635 161841 148956 143808 141329
10192 141329 128010 113823 117804 161786 221576 257955 295265 328862 350320 374136 405389 424079
10180 424079 439247 474085 534851 588842 647577 740225 825515 869033 930192 1000232 1071924
10169 1071924 1186006 1346665 1509146 1722162 1990372 2330536 2733481 3261574 4006304
$$ packed form
10254H55125J11251P6880Q1169O6689J0203n9449q2281r7440r7684j03223j16930
10243F44310r2765q6120q2930p6625o7006k8756k5287l496k5797r836J2086j4933
10231A42845q656n99k0838j5612j2553J9430K2234J5870Q300q60l3779k2101J1274
10218A04955J5157J0508O934M10J3127L684k3412J3056K8171L866N062k6232j2882
10205A42404P822J5443J7529J538k5138o676Q069K74J1370j0794j2885n148k479
10192A41329j3319j4187L981M3982N9790L6379L7310L3597K1458K3816L1253J8690
10180D24079J5168L4838O0766N3991N8735R2648Q5290M3518O1159P0040P1692
10169A071924J14082J60659J62481K13016K68210L40164M02945N28093P44730
$$ plain form
10160 4006304 5074989 6610205 8889981 12262190 16990748 22468138 26197049 26289152
10152 26289152 24178720 20715763 16259368 12142964 9124678 7048134 5660446 4669758
10144 4669758 3922653 3344985 2895176 2522492 2206848 1943766 1713151 1555023 1438944
10135 1438944 1318261 1222999 1152624 1072669 992684 895104 810604 743639 693527 640504 591627
10124 591627 571578 547110 498830 470913 437257 404642 365476 321622 298615 275819 272845 248460
10112 248460 232097 230608 226970 222412 217814 213514 213784 201782 211745 233463 249416 248588 260071
10099 260071 267399 296395 323149 330869 356106 419383 518122 698783 955189 1292434 1570771
10088 1570771 1595938 1473046 1299888 1037244 769297 575343 454006 372041 327420 303948
$$ packed form
10160D006304J068685J535216K279776L372209M728558N477390L728911R2103
10152B6289152k110432l462957m456395m116404l018286k076544j387688r90688
10144D669758p47105n77668m49809l72684l15644k63082k30615j58128j16079
10135A438944j20683r5262p0375p9955p9985r7580q4500o6965n0112n3023m8877
10124E91627k0049k4468m8280k7917l3656l2615l9166m3854k3007k2796k974k4385
10112B48460j6363j489l638m558m598m300K70j2002R963K1718J5953q28J1483
10099B60071P328K8996K6754P720K5237O3277R8739J80661K56406L37245K78337
10088A570771K5167j22892j73158k62644k67947j93954j21337q1965m4621k3472
$$ plain form
10078 303948 262786 214890 179333 162582 145354 125915 137433 140710 122932 130153 117834 107853
10066 107853 117795 136053 138936 107438 84727 79048 77929 76448 68613 60837 58503 55467 61788
10053 61788 64436 50411 57262 52470 47786 56394 46827 52666 59336 68101 72579 72808 74043 56380
10039 56380 39359 46264 46216 52721 51819 52547 48838 44886 60483 65818 101031 119628 106035 92522
10025 92522 60081 45668 36789 30185 28573 36757 60114 74291 62511 47001 49161 45504 37230
10012 37230 40400 28606 10185 1062 -6003 9278 36808 42341 44315 54169 60456 27469 16137
9999 16137 26040 41157 44113 51140 59461 29405 9777 40495 53499 45587 29180 25483 13732
9986 13732 5941 14382 45637 68527 93528 77905 38105 17889 21763 12436 32440 42406 39801
$$ packed form
10078C03948m1162m7896l5557j6751j7228j9439J1518L277j7778P221j2319r981
10066A07853R942J8258K883l1498k2711n679j119j481p835p776k334l036O321
10053F1788K648j4025O851m792m684Q608r567N839O670Q765M478K29J235j7663
10039E6380j7021O905m8O505r02P28l709l952J5597N335L5213J8597j3593j3513
10025I2522l2441j4413q879o604j612Q184K3357J4177j1780j5510K160l657q274
10012C7230L170j1794j8421r123p065J5281K7530N533J974R854O287l2987j1332
9999A6137R903J5117K956P027Q321l0056j9628L0718J3004p912j6407l697j1751
9986A3732p791Q441L1255K2890K5001j5623l9800k0216L874r327K0004R966k605
$$ plain form
9973 39801 48653 64866 63702 46281 31235 21394 24928 19526 -8652 3630 18822 30819 38366
9960 38366 38610 36384 26670 16844 -440 -18060 -13906 -18488 -12551 -5234 24422 39999 26342 22897
9946 22897 35448 36749 36202 36293 31697 6641 -588 -1950 6368 27251 49718 39859 30366 27702
9932 27702 27756 26614 25842 43698 23637 15169 26028 31721 24619 4998 -10809 -4790 24275 40326
9918 40326 13758 3546 6921 11325 10997 15026 11466 241 -1029 3205 25879 26207 17368 12962
9904 12962 14743 25776 32762 38569 24789 5229 14477 7893 12854 26386 37314 28541 8446
9891 8446 19073 25056 42655 36957 18200 7402 9395 26812 25707 41353 59993 51662 47655
9878 47655 26634 32232 19666 25265 31957 34051 10725 15559 17821 21887 26676 18804 39369 46657
$$ packed form
9973C9801Q852J6213j164j7421j5046r841L534n402k8178J2282J5192J1997P547
9960C8366K44k226r714r826j7284j7620M154m582N937P317K9656J5577j3657l445
9946B2897J2551J301n47R1m596k5056p229j362Q318K0883K2467r859r493k664
9932B7702N4j142p72J7856k0061q468J0859N693p102j9621j5807O019K9065J6051
9918D0326k6568j0212L375M404l28M029l560j1225j270M234K2674L28q839m406
9904A2962J781J1033O986N807j3780j9560R248o584M961J3532J0928q773k0095
9891H446J0627N983J7599n698j8757j0798J993J7417j105J5646J8640q331m007
9878D7655k1021N598j2566N599O692K094k3326M834K262M066M789p872K0565P288
$$ plain form
9864 46657 35926 38294 37758 41721 19068 7087 16354 10118 101 -3129 -6464 6136 13497 -693
9850 -693 -6877 14709 35361 39870 39523 39813 39039 43851 49301 39653 34046 41839 26107 14924 29729
9835 29729 27029 -1320 -1815 -4102 6033 1541 3138 19977 22447 26003 37564 26783 14078
9822 14078 17821 10201 15043 15030 22090 12776 18234 31989 30273 1058 -16386 -2053 3086 -1142
9808 -1142 16378 19918 26184 25662 28867 25112 19552 8402 15648 15565 -6503 -9467 11147 2437 -13478
9793 -13478 -5456 885 21617 14614 749 -12552 -7452 2436 19865 7803 -3559 3967 16857
9780 16857 7486 2612 12142 33577 23438 9697 10571 19749 16041 7493 7875 10672 12228 4403
9766 4403 -10779 -5612 -2065 21366 30996 19721 -9193 -23479 -24702 -27215 -8477 14441 37719
$$ packed form
9864D6657j0731K368n36L963k2653j1981R267o236j0017l230l335J2600P361j4190
9850f93o184K1586K0652M509l47K90p74M812N450r648n607P793j5732j1183J4805
9835B9729k700k8349m95k287J0135m492J597J6839K470L556J1561j0781j2705
9822A4078L743p620M842j3P060r314N458J3755j716k9215j7444J4333N139m228
9808a142J7520L540O266n22L205l755n560j1150P246q3k2068k964K0614q710j5915
9793a3478Q022O341K0732p003j3865j3301N100R888J7429j2062j1362P526J2890
9780A6857r371m874R530K1435j0139j3741Q74R178l708q548L82K797J556p825
9766D403j5182N167L547K3431R630j1275k8914j4286j223k513J8738K2918K3278
$$ plain form
9753 37719 55339 69392 78583 58900 71737 97766 134823 137442 100474 93849 103108 98676 72579
9740 72579 55390 38854 27995 25235 27469 13636 7859 3000 13265 19536 14959 10376 -1237
9727 -1237 -3665 4060 -9067 -4969 1156 8914 13896 2227 21293 18421 695 1866 6265 6407
9713 6407 -15262 -4059 3217 -9112 -11281 7701 21841 40548 36658 33856 25372 7827 -3217
9700 -3217 -5034 -11520 -1863 6653 11740 11021 2031 7378 13056 15947 2368 -14087 -16383 -586
9686 -586 7768 11561 2381 -10618 -6847 6794 25274 27753 25466 43621 67033 53227 9878
9673 9878 1817 21744 18160 13749 456 7804 -2330 -6953 -13366 -4166 4510 16720 -3976 -16331
9659 -16331 8707 3378 6382 41485 55574 38597 19830 15907 4382 12360 12110 34023 44193
$$ packed form
9753C7719J7620J4053R191j9683J2837K6029L7057K619l6968o625R259m432k6097
9740G2579j7189j6536j0859k760K234j3833n777m859J0265O271m577m583j1613
9727a237k428P725j3127M098O125P758M982j1669J9066k872j7726J171M399J42
9713F407k1669J1203P276j2329k169J8982J4140J8707l890k802q484j7545j1044
9700c217j817o486R657Q516N087p19q990N347N678K891j3579j6455k296J5797
9686e86Q354L793r180j2999L771J3641J8480K479k287J8155K3412j3806m3349
9673I878q061J9927l584m411j3293P348j0134m623o413R200Q676J2210k0696j2355
9659a6331K5038n329L004L5103J4089j6977j8767l923j1525P978k50K1913J0170
$$ plain form
9646 44193 76400 126497 187038 192069 157471 148331 114661 83398 52336 39099 56807 53274
9634 53274 40315 41628 49770 45913 24895 -5594 -6090 8031 2044 -2187 5416 10933 11109 3773
9620 3773 -12916 -7428 -8613 -3251 1508 10275 21731 26632 24274 18397 11223 7124 -8246 -6889
9606 -6889 12873 30572 18517 14681 -7972 3031 17755 18038 24937 20552 15579 7445 13925 23279
9592 23279 18276 2220 -7053 -13908 -13753 -2054 6399 14191 19385 28834 38365 44167 51444 51659 37415
9577 37415 22225 18555 6202 9358 11584 2666 17844 48108 53802 56846 60744 38365 23172
9564 23172 34925 36640 24679 6205 12726 -285 8749 10026 -1388 -879 21035 22028 29822 26112
9550 26112 15111 6787 6694 -5828 -6193 -8347 -15217 -11551 -20092 -19192 -20986 -17930 -10707 -6129 9190
$$ packed form
9646D4193L2207N0097O0541N031l4598r140l3670l1263l1062j3237J7708l533
9634E3274j2959J313Q142l857k1018l0489m96J4121n987m231P603N517J76p336
9620C773j6689N488j185N362M759Q767J1456M901k358n877p174m099j5370J357
9606f889J9762J7699j2055l836k2653J1003J4724K83O899m385m973q134O480R354
9592B3279n003j6056r273o855J55J1699Q453P792N194R449R531N802P277K15j4244
9577C7415j5190l670j2353L156K226q918J5178L0264N694L044L898k2379j5193
9564B3172J1753J715j1961j8474O521j3011R034J277j1414N09K1914R93P794l710
9550B6112j1001q324r3j2522l65k154o870L666q541R00j794L056P223M578J5319
$$ plain form
9535 9190 26027 24646 9630 4756 11073 24012 23911 32802 32752 17348 25126 27966 9113 -7072
9521 -7072 2505 2249 -11996 -9784 -28650 -28702 -5981 -15527 -12754 -1595 6102 8701 7077 11486 35927
9506 35927 16627 5016 1812 2076 -5037 -4288 5011 862 6702 697 19596 29312 26837 21018
9492 21018 14572 17465 13325 8867 9587 1560 -14619 -22860 -8699 11110 21085 20025 21905 19256
9478 19256 18280 5819 -12770 -13146 -1273 -3810 27575 74824 63288 41190 22649 18935 26838
9465 26838 22960 4865 -6348 -6168 -13562 -29318 -33188 -3064 -2616 -1807 -2248 -11803 -4719 12531
9451 12531 19970 24820 25433 -6816 -28034 -5943 14415 2639 1783 -9959 -8866 292 -5183 17528
9437 17528 20064 13323 27559 24505 20630 23125 9199 -1521 -12881 -5569 -5156 4445 8969 14050
$$ packed form
9535I190J6837j381j5016m874O317J2939j01Q891n0j5404P778K840j8853j6185
9521g072R577k56j4245K212j8866n2K2721r546K773J1159P697K599j624M409K4441
9506C5927j9300j1611l204K64p113P49R299m149N840o005J8899R716k475n819
9492B1018o446K893m140m458P20q027j6179q241J4161J9809R975j060J880k649
9478A9256r76j2461j8589l76J1873k537L1385M7249j1536k2098j8541l714P903
9465B6838l878j8095j1213J80p394j5756l870L0124M48Q09m41r555P084J7250
9451A2531P439M850O13l2249k1218K2091K0358j1776q56j1742J093R158n475K2711
9437A7528K536o741J4236l054l875K495j3926j0720j1360P312M13R601M524N081
$$ plain form
9423 14050 14428 11756 20665 19615 22669 44998 51518 33336 20212 -1994 -13618 -4139 -3434 -14348
9409 -14348 -17391 -14522 2449 20573 41505 32595 36928 37408 15939 -1703 3281 3600 -127 4583
9395 4583 2607 1001 -1852 -1069 -4294 7893 22251 4884 13602 9067 -2 5171 16157 6399
9381 6399 -12998 -18675 4431 6645 8506 -1116 -9250 -19308 -18586 5218 15736 22963 6098 6813
9367 6813 14854 25031 20906 -1504 -14745 -3482 6869 8923 -6515 -5720 9368 27338 36350
9354 36350 37481 29062 8784 16266 18467 9105 -5731 -18509 -22727 -23763 -31347 -35043 -31925 -17879
9340 -17879 -8517 -3555 -14967 -37873 -37297 -16435 -28825 -19669 910 32992 39947 28713 24102
9327 24102 2414 -9410 7433 19008 36343 19999 26574 27218 25653 9451 962 4510 26638
$$ packed form
9423A4050L78k672Q909j050L054K2329O520j8182j3124k2206j1624R479P05j0914
9409a4348l043K869J6971J8124K0932q910M333M80k1469j7642M984L19l727M710
9395D583j976j606k853P83l225J2187J4358j7367Q718m535r069N173J0986r758
9381F399j9397n677K3106K214J861r622q134j0058P22K3804J0518P227j6865P15
9367F813Q041J0177m125k2410j3241J1263J0351K054j5438P95J5088J7970R012
9354C6350J131q419k0278P482K201r362j4836j2778m218j036p584l696L118J4046
9340a7879R362M962j1412k2906N76K0862j2390R156K0579L2082O955j1234m611
9327B4102k1688j1824J6843J1575J7335j6344O575O44j565j6202q489L548K2128
$$ plain form
9314 26638 40196 35423 35036 38200 37229 11543 6557 14489 12972 7732 -10568 -13505 -14393 -7937 -18221
9299 -18221 -4993 4401 27320 27134 -1295 2861 7453 -4898 -7992 4931 21111 10621 20826
9286 20826 23478 7326 1046 -2041 -12955 -10883 -21345 -18039 6217 16490 38936 40983 24650
9273 24650 20108 13270 33980 42263 30632 19473 8554 15991 17946 20070 19794 6385 1177 1798
9259 1798 1684 -22660 -7508 -1371 1822 17778 15839 35888 28436 11043 5627 13982 27321 19336
9245 19336 31877 37347 7516 -16597 -9012 -6789 4229 5067 -12579 2589 8127 3035 21439
9232 21439 21809 32650 6386 -10822 -8505 -2730 -14448 -18011 -28415 -31391 -32210 -8779 5311
9219 5311 124 27161 35707 6675 8623 29520 36393 41762 21027 10587 371 24729 36497
$$ packed form
9314B6638J3558m773l87L164r71k5686m986P932j517n240j8300k937q88O456j0284
9299a8221J3228R394K2919j86k8429M156M592j2351l094J2923J6180j0490J0205
9286B0826K652j6152o280l087j0914K072j0462L306K4256J0273K2446K047j6333
9273B4650m542o838K0710Q283j1631j1159j0919P437J955K124k76j3409n208O21
9259A798j14k4344J5152O137L193J5956j939K0049p452j7393n416Q355J3339p985
9245A9336J2541N470k9831k4113P585K223J1018Q38j7646J5168N538n092J8404
9232B1439L70J0841k6264j7208K317N775j1718l563j0404k976q19K3431J4090
9219E311n187K7037Q546k9032J948K0897O873N369k0735j0440j0216K4358J1768
$$ plain form
9206 36497 23910 3366 -6461 -2622 -10182 -10934 -25654 -19838 -11219 475 11377 5733 7759 3238
9192 3238 5241 -3297 -18751 -8839 9060 31061 18111 15582 -1057 -6902 -5547 11039 17565
9179 17565 13020 12099 23446 16701 15704 30675 23100 2921 -9296 -6205 10149 -6385 -1759 213
9165 213 -1292 -6920 9388 7322 31051 41953 28430 23893 21799 14876 -14556 -19321 -22571 -7466
9151 -7466 -9856 -1151 4665 647 18750 13098 4219 -7545 -19709 -15920 -17731 -9947 10029 13745
9137 13745 18262 12583 19025 21568 6952 -1923 -14603 -15029 6380 -3779 1247 9684 312 -18404
9123 -18404 -24551 7365 46059 33805 15952 -6959 -2923 7067 -181 1322 17122 13757 8998
9110 8998 12470 24406 16310 9177 11126 35408 33560 23807 14738 32284 42662 29121 17119
$$ packed form
9206C6497j2587k0544r827L839p560p52j4720N816Q619J1694J0902n644K026m521
9192C238K003q538j5454R912J7899K2001j2950k529j6639n845J355J6586O526
9179A7565m545r21J1347o745r97J4971p575k0179j2217L091J6354j6534M626J972
9165B13j505n628J6308k066K3729J0902j3523m537k094o923k9432m765l250J5105
9151g466k390Q705N816m018J8103n652q879j1764j2164L789j811P784J9976L716
9137A3745M517n679O442K543j4616q875j2680m26K1409j0159N026Q437r372j8716
9123a8404o147L1916L8694j2254j7853k2911M036R990p248J503J5800l365m759
9110H998L472J1936q096p133J949K4282j848r753r069J7546J0378j3541j2002
$$ plain form
9097 17119 3469 8655 -7712 -22551 -8165 3827 -470 -14815 -14591 -17795 -7308 -7679 -19761
9084 -19761 -30136 -16457 5233 11282 10191 -2072 1012 746 -7031 836 -2374 -1568 -2667 6707
9070 6707 12260 3615 -12971 -12799 -16728 -14915 -13346 -4978 2266 14323 695 5362 24138 24993
9056 24993 13224 -5578 1372 18361 21897 19639 25451 35394 33650 20206 8016 5539 4571 3724
9042 3724 -9755 -16090 3698 24613 25887 14606 3822 16313 27519 -7394 -43341 -46301 -12057
9029 -12057 11138 7880 22684 39180 49043 49865 30011 27915 25322 13445 4993 -14754 -12232
9016 -12232 -689 6819 -1830 10848 1527 -11142 -19982 2613 23139 28266 15642 724 21172
9003 21172 46497 66085 60778 45496 40685 25856 26004 35826 7304 -16418 -24290 -15427 -28216
$$ packed form
9097A7119j3650N186j6367j4839J4386J1992m297j4345K24l204J0487l71j2082
9084a9761j0375J3679K1690O049j091j2263L084k66p777P867l210Q06j099R374
9070F707N553q645j6586J72l929J813J569Q368P244J2057j3628M667J8776Q55
9056B4993j1769j8802O950J6989L536k258N812R943j744j3444j2190k477r68q47
9042C724j3479o335J9788K0915J274j1281j0784J2491J1206l4913l5947k960L4244
9029a2057K3195l258J4804J6496R863Q22j9854k096k593j1877q452j9747K522
9016a2232J1543P508q649J2678r321j2669q840K2595K0526N127j2624j4918K0448
9003B1172K5325J9588n307j5282m811j4829J48R822k8522k3722p872Q863j2789
$$ plain form
8990 -28216 -45199 -41411 -15557 8134 10135 56 -4392 -1140 8118 15852 18444 17935 36565 29555
8976 29555 15458 7439 8104 1495 -6356 -21027 -5548 12882 1904 -6248 -16281 -29515 -33158
8963 -33158 -45376 -56952 -48010 -30843 -31404 -30903 -24741 -23739 -27511 -14006 -12168 -17118 -4848 -1941
8949 -1941 8835 475 -10190 -11338 -9262 -12504 -12689 4297 16013 17980 4867 -12667 -12590 -8736
8935 -8736 5361 52 -10371 -7858 432 9190 -3574 610 6229 -830 6706 34125 48685 38676
8921 38676 32910 14627 18631 25096 10526 -12189 -19632 -8620 5460 -2869 -6288 -14294 3916
8908 3916 28437 47363 26905 12923 658 -906 7472 -8078 5093 7366 14314 15169 7112
8895 7112 8538 8662 -1469 -13723 -23652 -18483 3224 15164 10614 14098 8535 -4319 1483 -7211
$$ packed form
8990b8216j6983L788K5854K3691K001j0079m448L252R258P734K592n09J8630p010
8976B9555j4097q019O65o609p851j4671J5479J8430j0978q152j0033j3234l643
8963c3158j2218j1576Q942J7167n61N01O162J002l772J3505J838m950J2270K907
8949a941J0776q360j0665j148K076l242j85J6986J1716J967j3113j7534P7L854
8935h736J4097n309j0423K513Q290Q758j2764M184N619p059P536K7419J4560j0009
8921C8676n766j8283M004O465j4570k2715p443J1012J4080q329l419q006J8210
8908C916K4521J8926k0458j3982j2265j564Q378j5550J3171K273O948Q55q057
8895G112J426J24j0131j2254r929N169K1707J1940m550L484n563j2854N802q694
$$ plain form
8881 -7211 -20936 -37752 -28298 -1671 2101 10363 2786 8456 -111 4370 19463 26679 13104 6387
8867 6387 14158 18815 15223 20379 13472 16627 29416 52151 75022 83686 59419 37982 20625
8854 20625 10002 5184 7857 20554 10262 5590 4530 4171 -10233 -13896 -15325 -19003 -10199 9248
8840 9248 29343 37206 29281 16785 664 -10787 -25448 -22247 -15410 -3231 10221 23303 33876
8827 33876 31152 11861 12700 43638 24830 -6402 -14509 -23052 -7533 10753 22968 39573 36336
8814 36336 18762 9489 14395 11658 10745 -10625 -13369 -7780 -24188 -16811 180 837 20027 26661
8800 26661 10238 5404 -93 -2108 18431 27096 15769 11798 4767 -14128 -20225 -27176 -48412
8787 -48412 -50564 -32702 -17366 -10602 -2424 1286 11811 13997 14386 19581 22982 3702 -18924 -28883
$$ packed form
8881g211j3725j6816R454K6627L772Q262p577N670q567M481J5093P216j3575o717
8867F387P771M657l592N156o907L155J2789K2735K2871Q664k4267k1437j7357
8854B0625j0623m818K673J2697j0292m672j060l59j4404l663j429l678Q804J9447
8840I248K0095P863p925j2496j6121j1451j4661L201O837J2179J3452J3082J0573
8827C3876k724j9291Q39L0938j8808l1232q107q543J5519J8286J2215J6605l237
8814C6336j7574r273M906k737r13k1370k744N589j6408P377J6991O57J9190O634
8800B6661j6423m834n497k015K0539Q665j1327l971p031j8895o097o951k1236
8787d8412k152J7862J5336O764Q178L710J0525K186L89N195L401j9280k2626r959
$$ plain form
8773 -28883 -9214 -5089 -7429 5599 782 2060 1798 4102 8981 -2914 -24364 -49778 -60094
8760 -60094 -42317 -19811 -14200 -4696 -539 4663 -8322 -10480 13034 17786 7576 -2449 13519
8747 13519 -7870 -29906 -42562 -50046 -52439 -45157 -24679 -26162 -24880 -3374 1182 -4057 -417
8734 -417 -6152 -7914 -8819 -14410 -13035 -30754 -17148 -14945 -39203 -43027 -44552 -21098 -10150 -27047
8720 -27047 -15816 -13575 -15639 -28874 -34417 -33960 -20544 -9961 5699 -664 -12262 -27978 -27008
8707 -27008 -11572 -2868 -17012 -11292 -16854 247 -773 -978 12627 -3777 -35684 -48041 -16685
8694 -16685 -3520 -1080 609 4623 5746 -3240 -7704 -24877 -24289 -9560 1425 7337 12624 22034
8680 22034 18065 14339 14691 -11857 -24113 -17351 -11620 4566 8430 23275 17288 9096 -3400 -24318
$$ packed form
8773b8883J9669M125k340J3028m817J278k62K304M879j1895k1450k5414j0316
8760f0094J7777K2506N611R504M157N202j2985k158K3514M752j0210j0025J5968
8747A3519k1389k2036j2656p484k393P282K0478j483J282K1506M556n239L640
8734d17n735j762r05n591J375j7719J3606K203k4258l824j525K3454J0948j6897
8720b7047J1231K241k064j3235n543M57J3416J0583J5660o363j1598j5716R70
8707b7008J5436Q704j4144N720n562J7101j020k05J3605j6404l1907j2357L1356
8694a6685J3165K440J689M014J123q986m464j7173N88J4729J0985N912N287R410
8680B2034l969l726L52k6548j2256O762N731J6186L864J4845n987q192j2496k0918
$$ plain form
8666 -24318 -23886 -16929 -14286 -836 -1117 2297 15609 23407 15616 6902 16003 21716 8562 392
8652 392 -1083 -13228 -5483 9736 13705 9663 7265 38596 43199 35417 24909 11826 24917 33442
8638 33442 35446 39342 29931 16067 34249 37094 29783 21667 19794 9312 12876 9710 7023 -2701
8624 -2701 5284 6439 -31337 -46154 -41288 -22627 -3283 -11614 -25463 -23109 -2266 14928 21061
8611 21061 17874 25231 12761 18038 14132 15158 7493 4605 15634 35325 34983 20488 12365 8258
8597 8258 -1398 296 12494 36966 54281 43891 28561 11070 15282 19348 33077 31284 23982
8584 23982 1275 -4381 -6343 524 2631 13345 28366 16535 36097 53367 56743 41951 44909
8571 44909 32334 33308 38434 32733 21278 20508 16878 19738 19044 24875 34051 39813 32812 31069 34147
$$ packed form
8666b4318M32O957K643J3450k81L414J3312P798p791q714R101N713j3154q170
8652C92j475j2145P745J5219L969m042k398L1331M603p782j0508j3083J3091Q525
8638C3442K004L896r411j3864J8182K845p311q116j873j0482L564l166k687r724
8624b701P985J155l7776j4817M866J8661J9344q331j3849K354K0843J7194O133
8611B1061l187P357j2470N277l906J026p665k888J1029J9691l42j4495q123m107
8597H258r656J694J2198K4472J7315j0390j5330j7491M212M066J3729j793p302
8584B3982k2707n656j962O867K107J0714J5021j1831J9562J7270L376j4792K958
8571D4909j2575R74N126n701j1455p70l630K860o94N831R176N762p001j743L078
$$ plain form
8556 34147 20214 18711 28720 26915 30930 21507 12426 19880 35819 30417 35951 51744 50413 46069
8542 46069 27166 14453 17970 6304 8625 9842 6312 -1458 -19555 -19851 -4835 8878 9047 -3765
8528 -3765 -10712 -20487 -10439 -750 -3876 -11552 -13164 -4551 -3979 17141 17182 5713 14289 32510 17800
8513 17800 3204 8567 21809 40729 34131 18790 3505 -813 -9843 -15164 -551 1701 -8198
8500 -8198 28401 44597 30852 14146 12394 -48 -21940 -23062 -14886 -29866 -37427 -25499 -35898
8487 -35898 -35810 -24899 -18788 -6210 -4158 4174 5097 -4723 -12267 6542 17694 36962 26323 9620
8473 9620 2727 25361 23862 -2213 -11583 22885 33233 8833 6428 4885 7350 23759 25605
8460 25605 31762 -504 -19737 -30777 -29847 -7458 2846 3436 -1231 -16413 -3248 19690 43369
$$ packed form
8556C4147j3933j503J0009j805M015r423r081P454J5939n402N534J5793j331m344
8542D6069j8903j2713L517j1666K321J217l530p770j8097k96J5016J3713J69j2812
8528c765o947r775J0048R689l126p676j612Q613N72K1120M1j1469Q576J8221j4710
8513A7800j4596N363J3242J8920o598j5341j5285m318r030n321J4613K252r899
8500h198L6599J6196j3745j6706j752j2442k1892j122Q176j4980p561J1928j0399
8487c5898Q8J0911O111J2578K052Q332R23r820p544J8809J1152J9268j0639j6703
8473I620o893K2634j499k6075r370L4468J0348k4400k405j543K465J6409J846
8460B5605O157l2266j9233j1040R30K2389J0304N90m667j5182J3165K2938K3679
$$ plain form
8447 43369 33871 -3836 -20395 -25504 -4073 -3749 -9997 231 -2888 -5379 9420 -4119 -14253
8434 -14253 8995 33349 21076 -21418 -37707 -30563 -565 10507 368 5910 21797 4358
8422 4358 -2457 -17357 -15917 -14784 4165 6207 -10435 -24058 -47243 -42149 -28315 -19132 -9410
8409 -9410 -709 4793 7268 11374 26590 35169 27901 -2900 -13170 -12233 -23133 -35534 -23402 -2647
8395 -2647 -10756 -9771 7382 -14779 -36597 -33702 19883 41348 33900 10710 -7863 -28980 -1941
8382 -1941 18478 31601 19039 -3316 -20841 -3208 -4918 -14738 -563 5933 10792 24880 9407
8369 9407 -3448 -11039 -19971 -30049 -31292 -38123 -31751 -3417 18367 20813 -5493 -37618 -47569
8356 -47569 -41159 -14763 -2100 -10008 -9149 -33583 -53058 -62956 -49538 -34210 -18176 -3796 16169
$$ packed form
8447D3369r498l7707j6559n109K1431L24o248J0228l119k491J4799j3539j0134
8434a4253K3248K4354j2273m2494j6289P144K9998J1072j0139N542J5887j7439
8422D358o815j4900J440J133J8949K042j6642j3623k3185N094J3834R183R722
8409i410Q701N502K475M106J5216Q579p268l0801j0270R37j0900j2401J2132K0755
8395b647q109R85J7153k2161k1818K895N3585K1465p448k3190j8573k1117K7039
8382a941K0419J3123j2562k2355j7525J7633j710r820J4175O496M859J4088j5473
8369I407j2855p591q932j0078j243o831O372K8334K1784K446k6306l2125r951
8356d7569O410K6396J2663p908Q59k4434j9475r898J3418J5328J6034J4380J9965
$$ plain form
8343 16169 17473 13562 -4615 -1013 -158 -1405 -4757 -22756 -23381 -20785 -19676 -132 20592 12464
8329 12464 -7973 -21289 -30912 -24100 -22330 -31295 -34089 -6036 -2456 -12670 -19575 -26603 -33998 -41394
8315 -41394 -18981 -15406 -6237 9857 23431 17936 -17999 -24441 -15490 -6631 -16298 -15274 -8625 -5396
8301 -5396 -5293 5225 4189 376 -5367 -30473 -50703 -33929 -9013 11891 17903 19057 16873 11587
8287 11587 575 -13881 -7248 -11907 -23993 -33234 -14726 -36 -4878 -4075 -8205 -17541 -32498
8274 -32498 -30693 -14284 2952 20239 31805 32812 6283 -1683 20363 23559 7478 -2324 -12674
8261 -12674 -27524 -30285 -39426 -35037 -5091 5462 6916 3062 3613 -6232 -31412 -32339 -23909 -28397
8247 -28397 -33395 -10172 5779 8592 -11098 -23578 -11113 9175 8346 17553 -3536 -17808 -22965
$$ packed form
8343A6169J304l911j8177L602Q55j247l352j7999o25K596J109J9544K0724q128
8329A2464k0437j3316r623O812J770q965k794K8053L580j0214o905p028p395p396
8315d1394K2413L575R169J6094J3574n495l5935o442Q951Q859r667J024O649L229
8301e396J03J0518j036l813n743k5106k0230J6774K4916K0904O012J154k184n286
8287A1587j1012j4456O633m659j2086r241J8508J4690m842Q03m130r336j4957
8274c2498J805J6409J7236J7287J1566J007k6529p966K2046L196j6081r802j0350
8261a2674j4850k761r141M389K9946J0553J454l854N51r845k5180r27Q430m488
8247b8397m998K3223J5951K813j9690j2480J2465K0288q29R207k1089j4272n157
$$ plain form
8234 -22965 -37171 -40107 -41424 -14081 14224 6456 -11211 -2247 5372 9409 -10391 -19754 -18608
8221 -18608 -1191 -1060 1293 28758 19492 9231 551 6424 4659 -23522 -44633 -30169 -19424
8208 -19424 -17620 -21794 -28011 -46917 -43942 -16975 -12335 10950 23646 30038 31155 6680 -8469
8195 -8469 -19216 -22070 -15577 -12496 -3962 14836 26476 8430 -534 -17662 -23051 -11568 15697
8182 15697 5163 -26769 -36603 -30399 -23331 -32088 220 7398 9516 -548 -19412 -28732 -20355
8169 -20355 -11806 4521 19807 -4349 -11827 -2321 -4219 -30231 -24809 560 13002 21679 7440
8156 7440 -9303 -10961 -10240 1831 -15698 -15955 -12973 -5689 -6844 9890 -4392 -8271 5919 17607
8142 17607 23980 31156 31404 19646 24104 35471 40567 48874 40623 22646 -9390 -12321 10833 30331
$$ packed form
8234b2965j4206k936j317K7343K8305p768j7667Q964P619M037j9800r363J146
8221a8608J7417J31K353K7465r266j0261q680N873j765k8181k1111J4464J0745
8208a9424J804m174o217j8906K975K6967M640K3285J2696O392J117k4475j5149
8195h469j0747k854O493L081Q534J8798J1640j8046q964j7128n389J1483K7265
8182A5697j0534l1932r834O204P068q757L2308P178K118j0064j8864r320Q377
8169b0355Q549J6327J5286k4156p478R506j898k6012N422K5369J2442Q677j4239
8156G440j6743j658P21J2071j7529k57K982P284j155J6734j4282l879J4190J1688
8142A7607O373P176K48j1758M458J1367N096Q307q251j7977l2036k931K3154J9498
$$ plain form
8128 30331 34809 14356 1495 -6651 -15326 -24867 -24205 -6908 25936 24144 9966 -10758 -1785
8115 -1785 -10735 -14610 8688 8271 14889 19157 21225 22937 26120 24197 29568 32022 28312 20477 6152
8100 6152 8716 4772 4689 -14429 -26545 -14456 1571 10259 15280 21205 24636 10162 -15843 -31040
8086 -31040 -35016 -39146 -38386 -1153 13176 20085 6920 -3562 -11255 -2338 7737 15008 33230
8073 33230 49905 42284 22353 14236 5386 121 14299 18750 27262 36007 19724 15344 26681
8060 26681 26321 29016 12678 13973 34464 50165 51787 21600 900 -26618 -32085 -8678 15169
8047 15169 11369 -437 7249 9122 7346 5796 -14937 -36703 -25348 -9180 7661 26839 32959
8034 32959 33566 38146 12896 -19736 -7109 -20916 -8907 -846 -1283 -17612 -25389 -43674 -40612
$$ packed form
8128C0331M478k0453j2861q146q675r541O62J7297L2844j792j4178k0724Q973
8115a785q950l875K3298m17O618M268K068J712L183j923N371K454l710p835j4325
8100F152K564l944q3j9118j2116J2089J6027Q688N021N925L431j4474k6005j5197
8086c1040l976m130P60L7233J4329O909j3165j0482p693Q917J0075P271J8222
8073C3230J6675p621j9931q117q850n265J4178M451Q512Q745j6283m380J1337
8060B6681l60K695j6338J295K0491J5701J622l0187k0700k7518n467K3407K3847
8047A5169l800j1806P686J873j776j550k0733k1766J1355J6168J6841J9178O120
8034C2959O07M580k5250l2632J2627j3807J2009Q061m37j6329p777j8285L062
$$ plain form
8021 -40612 -33104 -36506 -12009 3813 -3879 -10772 -15754 -5271 -382 8068 22436 26819 25154 18194
8007 18194 64 14841 22723 16948 21460 21869 15166 13238 16933 9685 17517 5935 18668 18545
7993 18545 15333 11283 18840 12913 6770 8927 4758 6623 34548 26890 8504 3372 2680 1452
7979 1452 456 2651 11812 6879 10137 14173 27958 47066 36769 48439 56430 42990 43584 55916
7965 55916 65625 41933 24575 21394 17075 3369 20739 11947 26623 32674 14666 11306 24930
7952 24930 29812 22747 -12430 -24272 -27266 -11835 -10588 -27988 -9278 5407 18410 18679 13285
7939 13285 13930 33717 16398 -2451 -10981 -19687 -36802 -32208 -17721 -4576 17203 28683 28368
7926 28368 24001 24621 31459 43365 40086 30993 15384 8712 28087 35770 24560 1279 -40415
$$ packed form
8021d0612P508l402K4497J5822p692o893m982J0483M889Q450J4368M383j665o960
8007A8194j8130J4777P882n775M512M09o703j928L695p248P832j1582J2733j23
7993A8545l212m050P557n927o143K157m169J865K7925p658j8386n132o92j228
7979A452r96K195R161m933L258M036J3785J9108j0297J1670P991j3440N94J2332
7965E5916R709k3692j7358l181m319j3706J7370q792J4676O051j8008l360J3624
7952B4930M882p065l5177j1842k994J5431J247j7400J8710J4685J3003K69n394
7939A3285O45J9787j7319j8849q530q706j7115M594J4487J3145K1779J1480l15
7926B8368m367O20O838J1906l279r093j5609o672J9375P683j1210k3281m1694
$$ plain form
7913 -40415 -38041 -18201 -13191 6296 12736 2400 -2974 16043 21332 5980 8935 17436 22380
7900 22380 31409 46499 25964 447 -27 -11244 -31523 -28563 -27084 3957 22547 12972 14897
7887 14897 -3698 -24570 -28378 -53205 -40304 -24188 -7942 5226 -738 -14452 -2785 11001
7875 11001 -7365 4022 15122 26741 35200 23197 27610 20880 6049 17480 5198 -9336
7863 -9336 -13998 -2081 -6889 -2169 4608 502 23347 23363 28568 10021 9884 28806 19434 7715
7849 7715 -1264 -9701 -10048 -2452 734 -6197 -25927 -29827 -10412 -3280 -6308 -4597 -2926 1002 7813
7834 7813 3709 -3961 -944 9788 20594 21308 15317 9091 26948 22196 17919 23540 23682 28732 21315
7819 21315 16032 1215 10316 12395 -4966 14565 20233 7267 7804 15194 25041 10213 -11993
$$ packed form
7913d0415K374J9840N010J9487O440j0336n374J9017N289j5352K955Q501M944
7900B2380R029J5090k0535k5517m74j1217k0279K960J479L1041J8590r575J925
7887A4897j8595k0872l808k4827J2901J6116J6246J3168n964j3714J1667J3786
7875A1001j8366J1387J1100J1619Q459j2003M413o730j4831J1431j2282j4534
7863i336m662J1917m808M720O777m106K2845J6N205j8547j37J8922r372j1719
7849G715q979q437l47P596L186o931j9730l900J9415P132l028J711J671L928O811
7834G813m104p670L017J0732J0806P14n991o226J7857m752m277N621J42N050p417
7819B1315n283j4817R101K079j7361J9531N668j2966N37P390R847j4828k2206
$$ plain form
7806 -11993 -25977 -17081 -4959 369 11604 6434 -19270 -22473 -25514 -32484 -9588 -18888 12433
7793 12433 27398 22531 14708 -3668 -9307 4216 10305 -10431 -18889 -17235 -13090 -13469 -24503 -17372
7779 -17372 -26293 -31022 -18964 -22628 -38728 -54561 -38119 -25282 -10024 -10595 -12044 -9106 -16524
7766 -16524 -28561 -26261 -24071 -23680 -11531 -12560 -16889 -20606 -11160 -23990 -17074 7700 6283 -21332
7752 -21332 940 5735 -2921 -17503 -16488 -8946 5225 -7081 -6206 -4203 -14525 11311 27196
7739 27196 27628 16325 9950 20656 17827 11281 12937 24493 26505 34774 23590 -4505 -2412 -1544
7725 -1544 3717 -2477 12715 22815 13993 -24709 -22904 5626 3092 -2798 -1504 28277 21079 12348
7711 12348 2759 -13816 -9907 -15553 -3668 -3144 17037 38619 29528 24867 21802 11301 390
$$ packed form
7806a1993j3984Q896J2122N328J1235n170k5704l203l041o970K2896r300L1321
7793A2433J4965m867p823j8376n639J3523O089k0736q458J654M145l79j1034P131
7779a7372q921m729J2058l664j6100j5833J6442J2837J5258n71j449K938p418
7766a6524j2037K300K190L91J2149j029m329l717R446j2830O916K4774j417k7615
7752b1332K2272M795q656j4582J015P542J4171j2306Q75K003j0322K5836J5885
7739B7196M32j1303o375J0706k829o546J656J1556K012Q269j1184k8095K093Q68
7725a544N261o194J5192J0100q822l8702J805K8530k534n890J294K9781p198q731
7711A2348r589j6575L909n646J1885N24K0181K1582r091m661l065j0501j0911
$$ plain form
7698 390 10471 18054 17380 6190 -13668 -22226 -21819 -5148 -748 -1915 6658 8854 483 -5676 -13218
7683 -13218 -34182 -54142 -38898 -18022 -6382 14759 27329 26409 2814 -11814 -11537 -8565 -12611
7670 -12611 -20138 -15879 2709 4846 137 9840 10756 17690 25983 14658 9415 3298 -12568 -18453
7656 -18453 -18119 -13135 -11972 -15746 -1220 11757 6623 12230 86 -22563 -39919 -28783 613
7643 613 5760 15991 17220 11036 16019 -6311 -5312 -902 -5887 -2418 -8923 -4372 -3300 -18587 -34269
7628 -34269 -42867 -38437 -12733 -3229 62 -11166 -32853 -31976 -13344 -7934 8184 8748 6162 -8002
7614 -8002 -15330 -3680 -13804 -31843 -8039 3397 -847 -15380 -17945 765 12854 3900 -16999
7601 -16999 -23300 -25871 -24484 -20565 -5629 -1830 -6869 -3627 2221 -26580 -39923 -37912 -22501 -16130
$$ packed form
7698C90J0081P583o74j1190j9858q558M07J6671M400j167Q573K196q371o159p542
7683a3218k0964j9960J5244K0876J1640K1141J2570r20k3595j4628K77K972m046
7670a2611p527M259J8588K137m709R703R16O934Q293j1325n243o117j5866n885
7656a8453L34M984J163l774J4526J2977n134N607j2144k2649j7356J1136K9396
7643F13N147J0231J229o184M983k2330R99M410m985L469o505M551J072j5287j5682
7628c4269q598M430K5704R504L291j1228k1687Q77J8632N410J6118N64k586j4164
7614h002p328J1650j0124j8039K3804J1436m244j4533k565J8710J2089q954k0899
7601a6999o301k571J387L919J4936L799n039L242N848k8801j3343K011J5411O371
$$ plain form
7587 -16130 -14587 -11277 -33266 -45885 -34156 -18959 -2625 -12588 -7695 -5682 -21366 -15361 -29582
7574 -29582 -44225 -33683 -28980 -4481 -754 -20310 -26750 5360 -5196 -2610 10234 10198 16854
7561 16854 10960 24511 19256 -4961 5041 3489 -24082 -9830 13456 11323 2857 6690 6542
7548 6542 1542 -5128 1054 5605 33073 37252 10595 3095 68 9034 -13938 -8526 -7893 -11011
7534 -11011 -18676 -12429 -7938 -7142 -31321 -43551 -35312 -14290 -16687 -9513 -12321 -25044 -24068 -32982
7520 -32982 -50481 -39946 -15829 -9808 303 11056 29505 38335 37080 12773 883 -9893
7508 -9893 -20887 -14911 -41391 -42557 -45909 -43725 -26611 -1159 16204 -1246 -9641 -3906 -15856
7495 -15856 1237 20286 9570 -6781 -13593 -4717 -2248 10932 152 -1215 13998 21699 -17465
$$ packed form
7587a6130J543L310k1989j2619J1729J5197J6334r963M893K013j5684O005j4221
7574b9582j4643J0542M703K4499L727j9556o440L2110j0556K586J2844l6O656
7561A6854n894J3551n255k4217J0002j552k7571J4252K3286k133q466L833j48
7548F542n000o670O182M551K7468M179k6657p500l027Q966k2972N412O33l118
7534a1011p665O247M491P96k4179j2230Q239K1022k397P174k808j2723R76q914
7520c2982j7499J0535K4117O021J0111J0753J8449Q830j255k4307j1890j0776
7508i893j0994N976k6480j166l352K184J7114K5452J7363j7450q395N735j1950
7495a5856J7093J9049j0716j6351o812Q876K469J3180j0780j367J5213P701l9164
$$ plain form
7482 -17465 -37714 -23577 -10880 -22997 -31411 -12637 -7364 -6885 1394 -13733 -18083 -27216 -20136
7469 -20136 9649 16833 9858 20935 29849 -98 -10615 -20358 -5165 -1248 -627 -10422 -26211
7456 -26211 -13590 -24558 -42358 -28985 -34694 -38514 -13991 -4650 -25157 -56831 -45390 -24242
7444 -24242 -18231 -8949 8598 14407 -5537 -12726 318 -6314 -21965 -39906 -38956 -29602 -10959
7431 -10959 -1233 12270 23888 -10373 -15477 8367 36802 25545 25302 28484 16938 -8782 -20080
7418 -20080 -20651 -11838 -7116 11697 14428 -16134 -14517 -4255 1331 -1833 1716 8232 12372 12593
7404 12593 13656 17047 7135 -5016 -5417 -6984 -8980 -11873 -5718 -6723 -21606 -7030 3029 -15823
7390 -15823 -3187 13545 -3693 -1086 6396 -6841 -8248 9612 -9061 -24751 -38444 -39847 -16490
$$ packed form
7482a7465k0249J4137J2697j2117q414J8774N273M79Q279j5127m350r133P080
7469b0136K9785P184o975J1077Q914k9947j0517r743J5193L917O21r795j5789
7456b6211J2621j0968j7800J3373n709l820K4523R341k0507l1674J1441K1148
7444b4242O011R282J7547N809j9944p189J3044o632j5651j7941R50R354J8643
7431a0959R726J3503J1618l4261n104K3844K8435j1257k43L182j1546k5720j1298
7418b0080n71Q813M722J8813K731l0562J617J0262N586l164L549O516M140K21
7404A2593J063L391r912j2151m01j567j996k893O155j005j4883J4576J0059j8852
7390a5823J2636J6732j7238K607P482j3237j407J7860j8673j5690j3693j403K3357
$$ plain form
7377 -16490 10242 4015 -3155 -2199 -23498 -28487 -29161 -42111 -11505 23294 7668 -5225 -12345
7364 -12345 -1013 -6237 -5525 4825 -2321 -3211 9665 23541 13492 866 -19619 -15621 7691
7351 7691 4599 11326 -2401 -33349 -49115 -56477 -25065 -8927 -9565 -23815 -17991 -12076 -3674 -10026
7337 -10026 -926 -4536 -15605 -26767 -48339 -37723 -8246 -20587 -35310 -28102 -32734 -15701 518
7324 518 10121 2173 -2839 -11312 -11924 -16783 13112 31597 15684 18538 8680 -12435 1905 12573
7310 12573 3036 -19993 -22365 -22689 -29698 -19866 -10915 -13143 -25960 -49056 -40555 -39461 -32170 -21122
7296 -21122 -11289 14664 16840 21165 4334 4527 -3551 -743 6267 -2343 -14567 -6825 -27801 -11856
7282 -11856 2490 14342 12575 24560 18735 -13838 -18496 -9458 6586 6552 2030 646 -7676 -13163
$$ packed form
7377a6490K6732o227p170R56k1299m989o74j2950L0606L4799j5626j2893p120
7364a2345J1332n224P12J0350p146q90J2876J3876j0049j2626k0485L998K3312
7351G691l092O727j3727l0948j5766p362L1412J6138o38j4250N824N915Q402o352
7337a0026R100l610j1069j1162k1572J0616K9477j2341j4723P208m632J7033J6219
7324E18R603p948n012q473o12m859K9895J8485j5913K854r858k1115J4340J0668
7310A2573r537k3029k372l24p009R832Q951k228j2817k3096Q501J094P291J1048
7296b1122R833K5953K176M325j6831J93q078K808P010q610j2224P742k0976J5945
7282a1856J4346J1852j767J1985n825l2573m658R038J6044l4m522j384q322n487
$$ plain form
7268 -13163 -24158 -42092 -36466 -29715 -17104 -6846 2340 8424 8204 -12296 -23516 -42646 -34780
7255 -34780 -24389 -23443 -23129 -22776 17113 34025 39796 23874 4943 -10209 -1757 23597 30620 16447
7241 16447 13645 13687 27397 24881 -4743 -24250 -41407 -40817 -20212 134 -5314 6715 15945 11923
7227 11923 -2247 3762 -5747 -22245 -12906 -22559 -19568 15002 13335 1270 4309 10808 -1288
7214 -1288 -6176 3328 12878 16787 17309 20036 28842 36645 24588 21833 19389 -6688 -24147 -36569
7200 -36569 -22873 -12189 -2609 -7531 -5389 5007 3849 694 30259 55637 49793 22839 19081
7187 19081 -19962 -42855 -30719 -16671 -8943 -8526 -23043 -30263 -18077 4217 2073 1938 -13397
7174 -13397 -8666 -4253 -10228 -278 -808 11327 21062 20297 26393 8831 13502 14522 5285 14041 27366
$$ packed form
7268a3163j0995j7934N626O751J2611J0258R186O084k20k0500j1220j9130P866
7255c4780J0391R46L14L53L9889J6912N771j5922j8931j5152Q452K5354P023j4173
7241A6447k802M2J3710k516k9624j9507j7157N90K0605K0346n448J2029R230m022
7227A1923j4170O009r509j6498R339r653K991L4570j667j2065L039O499j2096
7214a288m888R504R550L909N22K727Q806P803j2057k755k444k6077j7459j2422
7200c6569J3696J0684R580m922K142J0396j158l155K9565K5378n844k6954l758
7187A9081l9043k2893J2136J4048P728M17j4517p220J2186K2294k144j35j5335
7174a3397M731M413n975R950n30J2135R735p65O096j7562M671J020r237Q756J3325
$$ plain form
7159 27366 35608 30699 25682 24439 8005 -841 433 -5555 -8315 -17650 -21184 -25667 -16004 -19330
7145 -19330 -6588 -1682 -672 -1893 -8540 -7375 -9596 -2763 -10460 -1880 6191 5415 12833 16483 7696
7130 7696 17088 14065 5073 -2055 12154 3676 -2537 4463 -7236 -25157 -30644 -14994 6696 18834
7116 18834 1775 -12935 -2371 10695 17746 14091 6368 -13986 -30593 -32304 -26532 -33276 -23893
7103 -23893 141 -791 -9105 -11128 -15035 -4634 894 -10761 -17281 -9061 4513 -8083 -18498
7090 -18498 -2494 29464 35833 12463 564 -6182 -37611 -52788 -34228 -768 3961 -2197 -3131
7077 -3131 -16001 885 8601 9088 3781 -20243 -35894 -9581 -1859 -8935 -20810 -24220 -15895 11250
7063 11250 15729 19245 16333 -7144 -15266 -16920 3048 -3996 -5028 -21542 6629 39 -6858 -4206
$$ packed form
7159B7366Q242m909n017j243j6434q846J274n988k760r335l534m483R663l326
7145a9330J2742M906J010j221o647J165k221O833p697Q580Q071p76P418L650q787
7130G696R392l023q992p128J4209q478o213P000j1699j7921n487J5650K1690J2138
7116A8834j7059j4710J0564J3066P051l655p723k0354j6607j711N772o744R383
7103b3893K4034r32q314k023l907J0401N528j1655o520Q220J3574j2596j0415
7090a8498J6004L1958O369k3370j1899o746l1429j5177J8560L3460M729o158r34
7077c131j2870J6886P716M87n307k4024j5651K6313P722p076j1875l410Q325K7145
7063A1250M479L516k912k3477q122j654J9968p044j032j6514K8171o590o897K652
$$ plain form
7049 -4206 -12475 -13778 -674 10319 11199 15825 17115 17433 17001 17433 -7901 -14602 -1741 18134 9579
7034 9579 -7694 -7667 2404 19064 24990 22740 24769 6724 -12941 -29374 -30059 -14109 -6055 6593
7020 6593 6169 6031 3391 -17226 -25955 -14068 -15821 -6581 -35 -4580 -2754 -4309 6444 19755
7006 19755 4880 -8688 -24337 -15907 16173 30558 24031 4595 1206 -6098 -8225 12562 23217
6993 23217 30670 31374 11240 13661 7918 -2121 -16329 -35313 -31858 -31439 -38826 -40504 -59192 -53326
6979 -53326 -13581 -5135 -15039 -17927 2910 22113 27946 9782 3176 4426 19573 24259 13235
6966 13235 1748 7833 4172 4537 17189 15649 13515 659 -2125 -18686 -48722 -41948 -28494
6953 -28494 -18778 -26158 -30869 -29570 -16197 -5428 12502 9350 -13592 -7141 -7026 6216 12717 22080
$$ packed form
7049d206q269j303J3104J0993Q80M626J290L18m32M32k5334o701J2861J9875q555
7034I579j7273K7J0071J6660N926k250K029j8045j9665j6433o85J5950Q054J2648
7020F593m24j38k640k0617q729J1887j753R240O546m545J826j555J0753J3311
7006A9755j4875j3568j5649Q430L2080J4385o527j9436l389p304k127K0787J0655
6993B3217P453P04k0134K421n743j0039j4208j8984L455M19p387j678j8688N866
6979e3326L9745Q446r904k888K0837J9203N833j8164o606J250J5147M686j1024
6966A3235j1487O085l661L65J2652j540k134j2856k784j6561l0036O774J3454
6953b8494R716p380m711J299J3373J0769J7930l152k2942O451J15J3242O501R363
$$ plain form
6939 22080 21197 24556 25043 13462 11462 -153 -30892 -24474 -10663 -20840 -34802 -18400 7013
6926 7013 31064 39753 37308 29496 18029 7798 8773 10471 5182 5244 6479 -380 7219 -4924 -15144
6911 -15144 -5274 -16225 -11055 -9385 -2589 6122 1864 2523 -4092 20744 35345 10829 11260 -2052
6897 -2052 -14263 -13166 -20349 -8775 -8166 -14700 11064 22322 45505 64737 57405 39301 29906
6884 29906 27709 26972 28687 12594 -9800 -5737 6851 -13305 -7823 21762 10486 8537 9871
6871 9871 4323 7336 -1362 10253 12210 13436 8383 -1298 -1194 12762 23375 -8765 -14076 -14033 -26162
6856 -26162 -36047 -24739 -12559 2779 24870 28968 17212 9605 19217 10923 3762 -8075 -1697
6843 -1697 -8153 -71 -7239 -21908 -9077 -15470 -29804 -14339 -10608 -14702 -15705 -42077 -33246 -14502
$$ packed form
6939B2080q83L359M87j1581k000j1615l0739O418J3811j0177j3962J6402K5413
6926G013K4051Q689k445p812j1467j0231R75J698n289O2J235o859P599j2143j0220
6911a5144R870j0951N170J670O796Q711m258O59o615K4836J4601k4516M31j3312
6897b052j2211J097p183J1574O09o534K5764J1258K3183J9232p332j8104r395
6884B9906k197p37J715j6093k2394M063J2588k0156N482K9585j1276j949J334
6871I871n548L013q698J1615J957J226n053r681J04J3956J0613l2140n311M3j2129
6856b6162r885J1308J2180J5338K2091M098j1756p607R612q294p161j1837O378
6843a697o456Q082p168j4669J2831o393j4334J5465L731m094j003k6372Q831J8744
$$ plain form
6829 -14502 1485 17450 7324 3514 8566 7882 -2053 -6319 4485 8847 34903 44398 12391
6816 12391 -11817 -22542 -533 14959 -6097 -20191 -27843 -28044 -30458 -49934 -55952 -68564 -57102
6803 -57102 -51169 -50939 -39752 -14489 -32262 -24068 684 12488 13960 7517 2643 -5803 -17410
6790 -17410 -11619 -519 -8710 9557 15928 13982 16533 9927 -10424 -20444 -21789 -7524 2068
6777 2068 5845 19923 21975 13303 143 -8625 -13098 -34636 -51830 -40614 -26703 -16054 -3956
6764 -3956 1140 -1769 -3278 -9765 290 -1010 -9471 -5156 7683 9388 10412 -1903 8495 21836
6750 21836 25489 34966 18574 13481 17712 21102 19347 27622 33170 5442 8313 35874 41870 25821
6736 25821 20674 38277 41633 30364 13002 -17445 -45620 -45662 -28518 -11873 -12698 -15930 -18192 -28570
$$ packed form
6829a4502J5987J5965j0126l810N052o84r935m266J0804M362K6056R495l2007
6816A2391k4208j0725K2009J5492k1056j4094p652k01k414j9476o018j2612J1462
6803e7102N933K30J1187K5263j7773Q194K4752J1804J472o443m874q446j1607
6790a7410N791J1100q191J8267O371j946K551o606k0351j0020j345J4265R592
6777B068L777J4078K052q672j3160q768m473k1538j7194J1216J3911J0649J2098
6764c956N096k909j509o487J0055j300q461M315J2839J705J024j2315J0398J3341
6750B1836L653R477j6392n093M231L390j755Q275N548k7728K871K7561N996j6049
6736B5821n147J7603L356j1269j7362l0447k8175m2J7144J6645q25l232k262j0378
$$ plain form
6722 -28570 -15042 -3651 -17099 -25399 -21304 -13091 -14273 -4151 2217 5969 13092 13941 1109 -1361
6708 -1361 -3458 -7121 -3764 10420 17061 -7673 -16540 -20498 -29479 -26156 -8475 -4737 -14988 -26785
6694 -26785 -8223 16980 18311 20200 6809 -2736 -33940 -48754 -27200 -18893 -16378 -30914 -32504
6681 -32504 -35876 -28919 -32869 -35459 -35657 -10628 11826 11493 -4174 22605 40719 -1359 -15414
6668 -15414 -563 8918 16636 33077 42744 14503 -15161 -16217 -19796 -14328 -10738 -29582 -22388
6655 -22388 13 -6849 -9609 -3288 7187 18525 21958 -1382 -23555 -29105 -16170 -16904 -20805
6642 -20805 -10303 -9205 -9051 1962 -4879 619 9039 39249 25364 9410 10530 21310 6786
6629 6786 -636 4272 5711 18856 14916 3071 -8279 -19420 -13609 -15618 -9 -5206 -8479 -3027
$$ packed form
6722b8570J3528J1391j3448q300M095Q213j182J0122O368L752P123Q49j2832k470
6708a361k097l663L357J4184O641k4734q867l958q981L323J7681L738j0251j1797
6694b6785J8562K5203J331J889j3391r545l1204j4814K1554Q307K515j4536j590
6681c2504l372O957l950k590j98K5029K2454l33j5667K6779J8114m2078j4055
6668a5414J4851R481P718J6441R667k8241k9664j056l579N468L590j8844P194
6655b2388K2401o862k760O321J0475J1338L433k3340k2173n550J2935p34l901
6642b0805J0502J098J54J1013o841N498Q420L0210j3885j5954J120J0780j4524
6629F786p422M908J439J3145l940j1845j1350j1141N811k009J5609n197l273N452
$$ plain form
6615 -3027 -15817 -23922 -24323 -21890 369 1786 -1777 -10729 -2986 -18144 -10605 5102 -4070 -11068
6601 -11068 -16630 -18264 -3652 17744 17544 -3 -13656 -11844 -4018 -2517 -5670 3827 4649 8327
6587 8327 6538 -22595 -26400 -11777 -7576 -3280 3602 32944 52276 44115 32672 2945 -20921
6574 -20921 -29798 -11719 9657 19231 -4298 -23916 -22286 -17724 -18460 -31425 -37519 -11648 -5322
6561 -5322 1493 12753 36474 56088 31919 24639 54065 61029 40300 12302 14330 25726 25027
6548 25027 9300 13384 7764 16177 9974 9006 -6434 5468 20187 11197 -8055 -658 3892 -8373
6534 -8373 -29228 -20787 -11488 3009 9709 -1713 -13189 -3431 -4949 -21610 -46410 -43602 -13565
6521 -13565 1696 -5803 -15462 -22437 -12100 -19778 -15951 1016 472 7347 17863 22439 10210 -13668
$$ packed form
6615c027j2790q105m01K433K2259J417l563q952P743j5158P539J5707r172o998
6601a1068n562j634J4612K1396k00j7547j3653J812P826J501l153R497Q22L678
6587H327j789k9133l805J4623M201M296O882K9342J9332q161j1443k9727k3866
6574b0921q877J8079K1376R574k3529j9618J630M562p36j2965o094K5871O326
6561e322O815J1260K3721J9614k4169p280K9426O964k0729k7998K028J1396o99
6548B5027j5727M084n620Q413o203r68j5440J1902J4719q990j9252P397M550j2265
6534h373k0855Q441R299J4497O700j1422j1476R758j518j6661k4800K808L0037
6521a3565J5261p499r659o975J0337p678L827J6967n44O875J0516M576j2229k3878
$$ plain form
6507 -13668 -21141 -14180 -3875 25649 31196 20805 28893 23058 9734 -2570 -9823 -3643 1796
6494 1796 17182 12522 -15036 691 13770 1160 -9504 -17503 -17400 -6020 -14222 -32195 -13431
6481 -13431 2343 18796 33348 19946 -4546 -19784 -23786 -8101 14991 1516 -32239 -40502
6469 -40502 -28480 -1186 3768 -3914 -8867 -21178 -22840 -6554 -6177 -31662 -24128 -12648 -26378
6456 -26378 -42682 -27660 -10217 -27443 -15483 77 -2426 9725 14860 6258 -2806 -16600 -14767
6443 -14767 -13092 -8081 10722 13398 2490 -4783 -16278 -17883 2599 20014 27649 14497 17525
6430 17525 1710 -10531 -17913 -33476 -50078 -43378 -23332 -14410 -16565 -26620 -12327 -10754 15664
6417 15664 30809 33505 36362 29334 18398 11954 11374 21761 5250 11745 19379 22286 -2954 -501
$$ packed form
6507a3668p473O961J0305K9524N547j0391Q088n835j3324j2304p253O180N439
6494A796J5386m660k7558J5727J3079j2610j0664p999J03J1380q202j7973J8764
6481a3431J5774J6453J4552j3402k4492j5238m002J5685K3092j3475l3755q263
6469d0502J2022K7294M954p682m953j2311j662J6286L77k5485P534J1480j3730
6456b6378j6304J5022J7443j7226J1960J5560k503J2151N135q602r064j3794J833
6443a4767J675N011J8803K676j0908p273j1495j605K0482J7415P635j3152L028
6430A7525j5815j2241p382j5563j6602O700K0046Q922k155j0055J4293J573K6418
6417A5664J5145K696K857p028j0936o444n80J0387j6511O495P634K907k5240K453
$$ plain form
6403 -501 9298 2321 18367 18416 -4802 -3580 -2591 -7175 -5903 -6411 2349 7712 10285 -4963 -8572
6388 -8572 -18341 -21288 13905 25159 17087 11244 -9262 6383 5917 15478 8072 10191 23625 40226
6374 40226 29749 5996 1712 4755 14243 19229 25501 24695 19510 4287 -11329 -6512 -6480 -8034
6360 -8034 4261 37679 50031 38828 24555 8005 -15325 -22027 -8760 -14817 -50469 -47105 -20058
6347 -20058 3065 10592 2122 16984 21559 -16062 -13586 -2970 13991 6174 -18195 -14206 -11539
6334 -11539 -6991 -19347 -30004 -15969 -9741 -14205 -8775 4848 17041 17938 -8214 -29894 -31898
6321 -31898 -24546 -24192 -24556 -32926 -39624 -49645 -24833 -9585 781 -6254 -3634 27188 44180 50601
6307 50601 48567 36648 28641 12231 -14324 -14262 2276 4949 1511 1468 -12563 -15060 -3115 -9494
$$ packed form
6403e01R799o977J6046M9k3218J222R89m584J272n08Q760N363K573j5248l609
6388h572r769k947L5193J1254q072n843k0506J5645m66R561p406K119J3434J6601
6374D0226j0477k3753m284L043R488M986O272q06n185j5223j5616M817L2j554
6360h034J2295L3418J2352j1203j4273j6550k3330o702J3267o057l5652L364K7047
6347b0058K3123P527q470J4862M575l7621K476J0616J6961p817k4369L989K667
6334a1539M548j2356j0657J4035O228m464N430J3623J2193Q97k6152k1680k004
6321c1898P352L54l64q370o698j0021K4812J5248J0366p035K620L0822J6992O421
6307E0601k034j1919q007j6410k6555O2J6538K673l438m3j4031k497J1945o379
$$ plain form
6293 -9494 -23002 -11503 -4477 -8547 6181 -8314 -9040 7022 21889 22397 13080 -11610 -6256 7823
6279 7823 -10872 -9894 6788 -715 -17071 -24514 -16822 -1226 11427 -4393 7355 22661 26451
6266 26451 16865 25032 34493 27415 8963 -837 11345 12871 18377 3249 -1956 -4351 -12905 -8624
6252 -8624 193 16243 38465 55788 47251 32781 31288 18521 674 -20134 -13042 30212 48233
6239 48233 40018 26863 13741 -9808 -36750 -16057 -12363 -3298 15154 36101 36805 35304 14693
6226 14693 4720 574 -11424 -26693 -24274 -17750 -15586 -14618 753 18388 29552 15747 13499
6213 13499 3523 19842 11338 10481 -6408 -10263 -607 5293 5661 -5976 -3630 1993 16347 19118
6199 19118 3319 8803 2033 -29788 -44386 -20035 -16447 -11576 -489 -1516 2611 -6987 -6104 -7205
$$ packed form
6293i494j3508J1499P026m070J4728j4495p26J6062J4867N08r317k4690N354J4079
6279G823j8695R78J6682p503j6356p443P692J5596J2653j5820J1748J5306L790
6266B6451r586Q167R461p078j8452r800J2182J526N506j5128n205k395q554M281
6252h624Q817J6050K2222J7323q537j4470j493j2767j7847k0808P092M3254J8021
6239D8233q215j3155j3122k3549k6942K0693L694R065J8452K0947P04j501k0611
6226A4693r973m146j1998j5269K419O524K164R68J5371J7635J1164j3805k248
6213A3499r976J6319q504q57j6889l855R656N900L68j1637K346N623J4354K771
6199A9118j5799N484o770l1821j4598K4351L588M871J1087j027M127r598Q83j101
$$ plain form
6185 -7205 -2577 -7725 -11378 -16642 -8375 -8807 -15024 -21349 -17521 10606 41195 55642 54053 22741
6171 22741 3921 7587 20059 22922 23164 5657 -20912 -22008 -26821 -20543 5648 9174 -12419
6158 -12419 -14143 1559 10873 -16444 -16860 9858 20001 4588 17449 1814 6006 11763 4916
6145 4916 22232 52077 47971 22054 7217 1663 -8830 -10447 -10186 3466 -6374 -18730 3527
6132 3527 7529 -2696 -2971 6111 13238 23313 22744 13 -16509 7876 22764 20491 17113 -10135
6118 -10135 -49572 -52452 -30503 -29239 -26502 -13394 -7421 -29925 -22110 -14745 -11208 770 -6513
6105 -6513 -31092 -41316 -39481 -43435 -28080 -15295 -16895 -17040 -28781 -13925 -33221 -40020 -14524
6092 -14524 -12438 -18692 -9361 -18455 -30773 -5744 -5609 -4286 1543 2509 -19072 -17183 -16894 2955
$$ packed form
6185g205M628n148l653n264Q267m32o217o325L828K8127L0589J4447j589l1312
6171B2741j8820L666J2472K863K42j7507k6569j096m813O278K6191L526k1593
6158a2419j724J5702R314k7317m16K6718J0143j5413J2861j5635M192N757o847
6145D916J7316K9845m106k5917j4837n554j0493j617K61J3652r840j2356K2257
6132C527M002j0225k75R082P127J0075n69k2731j6522K4385J4888k273l378k7248
6118a0135l9437k880K1949J264K737J3108N973k2504P815P365L537J1978p283
6105f513k4579j0224J835l954J5355J2785j600j45j1741J4856j9296o799K5496
6092a4524K086o254R331r094j2318K5029J35J323N829R66k1581J889K89J9849
$$ plain form
6078 2955 5098 -5410 -18287 -20423 -20942 -21418 -23335 -27042 -3108 20931 19643 11618 8448 21622
6064 21622 26947 6273 4388 -9836 -34565 -36604 -15963 -1873 1579 3069 16195 14936 -4438
6051 -4438 -8668 -948 4780 32688 51254 46234 16853 -21853 -40633 -10745 19040 28209 9202
6038 9202 -9843 8444 16011 15652 12857 12270 21194 -3537 -24001 -6359 -9853 -10020 -23123 -21731
6024 -21731 4281 -3052 -24880 -31015 -26010 -4010 5046 1627 960 -1275 20387 29411 18402 18768
6010 18768 12520 15348 18052 1426 -6896 -10306 -3900 23622 21986 14759 11314 -17002 -32571 -23090
5996 -23090 -7254 4564 5155 -12954 -19226 -26082 -9871 3199 21115 28133 23236 29977 39976
5983 39976 25154 25422 17694 32628 38862 43248 27756 12645 -5508 -26049 -11032 7965 25285
$$ packed form
6078B955K143j0508j2877k136n19m76j917l707K3934K4039j288q025l170J3174
6064B1622N325k0674j885j4224k4729k039K0641J4090L452J490J3126j259j9374
6051d438m230P720N728K7908J8566n020k9381l8706j8780K9888K9785R169j9007
6038I202j9045J8287P567l59k795n87Q924k4731k0464J7642l494j67j3103J392
6024b1731K6012p333k1828o135N005K2000R056l419o67k235K1662R024j1009L66
6010A8768o248K828K704j6626q322l410O406K7522j636p227l445k8316j5569R481
5996b3090J5836J1818N91j8109o272o856J6211J3070J7916P018m897O741R999
5983C9976j4822K68p728J4934O234M386j5492j5111j8153k0541J5017J8997J7320
$$ plain form
5970 25285 27873 20932 23973 33204 17428 2374 -8410 -11156 -5422 -2916 -8639 -16483 -15818 -10527
5956 -10527 15815 -192 -13199 -4471 8141 -5598 -31782 -23618 -7931 -6764 3799 -18851
5944 -18851 -32238 -8874 7360 17699 26922 23394 13198 19524 15164 1584 3086 5174 4542
5931 4542 20630 21750 26606 -2217 -30754 -24841 -14937 -19595 -31069 -33927 -40101 -35013 -25658 -34526
5917 -34526 -34394 -12816 19747 20437 14001 562 995 13291 10747 22707 30994 17826 6678 -10728
5903 -10728 -14936 -18646 -3155 -17283 -23139 -34684 -24424 5497 -12833 -23652 -21545 -872 21813
5890 21813 12206 10512 4520 -10875 -28101 -35396 -22032 -30794 -31039 -258 15168 -1850 -4245
5877 -4245 -662 3705 10104 23752 14093 -10264 -13667 8444 34817 25688 1913 -22063 -32061
$$ packed form
5970B5285K588o941L041R231j5776j5054j0784k746N734K506n723p844O65N291
5956a0527K6342j6007j3007Q728J2612j3739k6184Q164J5687J167J0563k2650
5944a8851j3387K3364J6234J0339R223l528j0196O326m360j3580J502K088o32
5931D542J6088J120M856k8823k8537N913R904m658j1474k858o174N088R355q868
5917c4526J32K1578L2563O90o436j3439M33J2296k544J1960Q287j3168j1148j7406
5903a0728m208l710J5491j4128n856j1545J0260K9921j8330j0819K107K0673K2685
5890B1813r607j694n992j5395j7226p295J3364q762k45L0781J5426j7018k395
5877d245L583M367O399J3648r659k4357l403K2111K6373r129k3775k3976r998
$$ plain form
5864 -32061 -31522 -6018 20295 8770 -10089 -7168 10648 21363 -7867 -13098 -7498 -12591 15168
5851 15168 14998 2551 7913 5664 -12227 -14948 -22448 -3059 -130 -19274 -13106 5762 12927 20278
5837 20278 29505 18630 -7172 -3975 15037 12037 6562 16373 14569 16462 16826 8613 6843 -6304
5823 -6304 -9223 2856 6994 -8680 -11683 1481 -138 -8547 -15500 -14549 -19530 -19167 -8560 1219
5809 1219 27326 322 -21871 -18548 -2455 -12531 -20366 -11052 9917 14143 -389 781 1611
5796 1611 4053 -14326 -9347 -16664 -26154 -14232 -5154 -5623 -1854 -2152 -19495 -17083 -24583 -8302
5782 -8302 -2697 -4004 17665 10402 -23599 -33768 -13652 1410 -13252 -19896 -9495 -10794 -11653
5769 -11653 4135 15297 -2288 3731 -17351 -23973 -9335 14841 19525 -9031 -15573 -180 9252
$$ packed form
5864c2061N39K5504K6313j1525j8859K921J7816J0715k9230n231N600n093K7759
5851A5168j70j2447N362k249j7891k721p500J9389K929j9144O168J8868P165P351
5837B0278R227j0875k5802L197J9012l000n475R811j804J893L64q213j770j3147
5823f304k919J2079M138j5674l003J3164j619q409o953R51m981L63J0607R779
5809A219K6107k7004k2193L323J6093j0076p835R314K0969M226j4532J170Q30
5796A611K442j8379M979p317r490J1922R078m69L769k98j7343K412p500J6281
5782h302N605j307K1669p263l4001j0169K0116J5062j4662o644J0401j299q59
5769a1653J5788J1162j7585O019k1082o622J4638K4176M684k8556o542J5393R432
$$ plain form
5756 9252 -9949 -34924 -32651 -6345 10328 325 14425 1603 -70 9250 -2445 -15963 -1134
5743 -1134 16513 32125 33512 17623 17196 24647 30839 28176 35576 25414 15639 79 2099 7399
5729 7399 3494 -8257 -25076 -11940 17735 17294 18961 12482 -2712 -4832 8217 147 -10242
5716 -10242 -16129 -21289 -15480 -15518 -19198 -5662 -10188 -7369 20045 26574 21146 3253 -9632 12362
5702 12362 48007 57586 36308 19842 2901 15300 27327 27293 9231 3107 -6963 -10978 1620
5689 1620 41651 59128 39821 12146 6176 8280 16162 6377 -1160 28245 42247 22192 -9348
5676 -9348 -18620 -13168 -8678 8224 25301 28187 13955 -283 8126 6255 138 7823 5944 13081
5662 13081 18624 2242 -15814 -20068 12628 3807 17215 24783 13945 16414 12017 13335 9954
$$ packed form
5756I252j9201k4975K273K6306J6673j0003J4100j2822j673R320j1695j3518J4829
5743a134J7647J5612J387j5889m27P451O192k663P400j0162r775j5560K020N300
5729G399l905j1751j6819J3136K9675m41J667o479j5194k120J3049q070j0389
5716a0242n887n160N809l8l680J3536m526K819K7414O529n428j7893j2885K1994
5702A2362L5645R579k1278j6466j6941J2399J2027l4j8062o124j0070m015J2598
5689A620M0031J7477j9307k7675n970K104P882r785p537K9405J4002k0055l1540
5676i348r272N452M490J6902J7077K886j4232j4238Q409j871o117P685j879P137
5662A3081N543j6382j8056m254L2696q821J3408P568j0838K469m397J318l381
$$ plain form
5649 9954 -7340 -725 7750 -4888 5668 21323 25757 15055 -16976 -9054 -15548 -12470 -24439
5636 -24439 -37855 -40880 -31862 -21852 -9494 1570 5564 -1127 -16682 -28366 -22297 -15346 -7642
5623 -7642 -2993 -6431 -2483 20592 29373 23902 -2446 1149 13877 13182 18566 26417 21700 21566 15275
5608 15275 8664 990 -9811 1296 -3309 8745 -17535 -13167 -13752 -15959 -12273 -11754 -14096 -16220
5594 -16220 -23348 -10426 4195 8318 14340 16856 20690 -19264 -30307 -28340 -21878 -662 7972
5581 7972 18660 5468 -13307 -27959 -39616 -32629 -44228 -32860 -45950 -55196 -45975 -26633 -24242
5568 -24242 -31924 -36917 -22107 4885 8414 1654 -4255 -24087 13724 43766 34455 19108 12712
5555 12712 5144 -9185 -15629 -12408 -1723 2588 -3251 -11803 5651 5939 -12516 -1811 17138
$$ packed form
5649I954j7294O615Q475j2638J0556J5655M434j0702l2031P922o494L078j1969
5636b4439j3416l025R018J0010J2358J1064L994o691j5555j1684O069O951P704
5623g642M649l438L948K3075Q781n471k6348L595J2728o95N384P851m717j34o291
5608A5275o611p674j0801J1107m605J2054k6280M368n85k207L686N19k342k124
5594a6220p128J2922J4621M123O022K516L834l9954j1043J967O462K1216Q634
5581G972J0688j3192j8775j4652j1657O987j1599J1368j3090r246R221J9342K391
5568b4242p682m993J4810K6992L529o760n909j9832L7811L0042r311j5347o396
5555A2712p568j4329o444L221J0685M311n839q552J7454K88j8455J0705J8949
$$ plain form
5542 17138 22140 13198 405 -16287 -12620 -6404 -15087 -26720 -19762 398 9484 -1527 -2300 -4833
5528 -4833 -21173 -36537 -20924 2026 14232 6318 3858 9552 -13004 -32123 -24427 -6051 -16122
5515 -16122 -28638 -22326 -24384 -25269 -19183 -9098 -24379 -15804 11974 19424 -811 -11886 1121
5502 1121 21180 12981 13313 19521 19789 4796 -8735 -22966 -34520 -40372 -40815 -24554 3650 3727
5488 3727 14289 8436 -1469 6890 10223 7850 19799 -16815 -41565 -39964 -9888 16661 20012
5475 20012 20859 -5483 -8745 4969 -11746 -16394 -2692 -713 -6562 -21826 -17393 -14651 -13202 89
5461 89 12274 -3622 -18927 -20215 -16030 -9832 -8369 -13359 -7175 3757 -2320 -5495 -1944 18367
5447 18367 12285 17093 13040 34615 40890 43239 51922 48376 40607 9696 -16641 -17259 -12135 -3695
$$ packed form
5542A7138N002q942j2793j6692L667O216q683j1633O958K0160R086j1011p73k533
5528d833j6340j5364J5613K2950J2206p914k460N694k2556j9119P696J8376j0071
5515a6122j2516O312k058q85O086J0085j5281Q575K7778P450k0235j1075J3007
5502A121K0059q199L32O208K68j4993j3531j4231j1554n852m43J6261K8204P7
5488C727J0562n853r905Q359L333k373J1949l6614k4750J601L0076K6549L351
5475B0012Q47k6342l262J3714j6715m648J3702J979n849j5264M433K742J449J3291
5461H9J2185j5896j5305j288M185O198J463m990O184J0932o077l175L551K0311
5447A8367o082M808m053K1575O275K349Q683l546p769l0911k6337o18N124Q440
$$ plain form
5433 -3695 18341 13412 -3344 -26892 -41706 -49222 -48908 -40614 -5137 16575 33092 16743 -3515
5420 -3515 -18261 -16109 -26018 -27725 -14435 -16222 -11881 -11851 -7662 -15090 -14794 -21901 -12673 -4939 4421
5405 4421 8430 -14013 -35984 -30923 -10463 -7743 -754 -3146 -6294 -1156 19499 21502 13310 20179
5391 20179 35193 29460 -8587 -17125 -11220 -26390 -36375 -22432 4918 23302 14354 551 -4533
5378 -4533 100 11254 14124 5425 -20586 -36391 -29271 -16713 -13638 -4202 -2118 16566 9062 -21539
5364 -21539 -11182 3087 9524 1129 2963 -1546 -7993 -8219 -10650 -23478 -4705 -5584 -10840 6563
5350 6563 10212 -9749 -4023 3969 10126 -399 -16722 -14848 -3249 -2759 -6560 4766 -741 -7787
5336 -7787 -41674 -60557 -46407 -27619 -7486 984 3657 -280 -9054 -13362 -26162 -35655 -13742
$$ packed form
5433c695K2036m929j6756k3548j4814p516L14Q294L5477K1712J6517j6349k0258
5420c515j4746K152r909j707J3290j787M341L0M189p428K96p107R228P734R360
5405D421M009k2443k1971N061K0460K720O989k392l148N138K0655K003q192O869
5391B0179J5014n733l8047q538N905j5170r985J3943K7350J8384q948j3803n084
5378d533M633J1154K870q699k6011j5805P120J2558L075R436K084J8684p504l0601
5364b1539J0357J4269O437q395J834m509o447k26k431j2828J8773q79n256J7403
5350F563L649j9961N726P992O157j0525j6323J874J1599M90l801J1326n507p046
5336g787l3887j8883J4150J8788K0133Q470K673l937q774m308j2800r493K1913
$$ plain form
5323 -13742 1724 -16651 -33340 -37736 -17495 -8446 -2822 -6492 -11315 -5046 7929 -4752 -16447
5310 -16447 -29048 -21861 -4886 11996 -978 -26808 -17369 22818 39450 39511 23915 778 -8767
5297 -8767 4017 1953 9162 12581 37354 57254 32765 24178 12674 -4346 -40240 -51613 -42819
5284 -42819 -23455 -10294 13427 15719 14953 30073 34936 18886 -7608 -30391 -42377 -45781 -35140
5271 -35140 -26938 -25168 -23406 -5622 -7612 -17782 -7702 -6668 -20516 -24424 -23260 -22439 -17275 -8031
5257 -8031 4458 -4584 -11058 -18086 -11442 25760 41697 32529 6886 -4748 -1398 -418 13551 21504
5243 21504 30090 17070 -6189 -31544 -41470 -11689 4455 7203 -13137 -16215 -18260 -9934 4619
5230 4619 -13541 -17403 -25518 -28797 -10798 21980 21997 20383 7828 -1700 -1887 -18745 -13747 -11364
$$ packed form
5323a3742J5466j8375j6689m396K0241R049N624l670m823O269J2975j2681j1695
5310a6447j2601P187J6975J6882j2974k5830R439M0187J6632O1j5596k3137r545
5297h767J2784k064P209L419K4773J9900k4489q587j1504j7020l5894j1373Q794
5284d2819J9364J3161K3721K292p66J5120M863j6050k6494k2783j1986l404J0641
5271c5140Q202J770J762J7784j990j0170J0080J034j3848l908J164Q21N164R244
5257h031J2489r042o474p028O644L7202J5937r168k5643j1634L350R80J3969P953
5243B1504Q586j3020k3259k5355r926K9781J6144K748k0340l078k045Q326J4553
5230D619j8160l862q115l279J7999L2778J7j614j2555r528j87j6858M998K383
$$ plain form
5216 -11364 -15888 -18707 -25229 -39882 -20755 -18863 -15035 8751 6986 8150 2756 -283 -393 7231
5202 7231 12160 21832 28023 12181 2593 -1685 -25109 -26061 -28024 -13622 3491 -2494 148 1833
5188 1833 -4629 -21932 -14451 14841 27881 6038 4645 -13506 -27418 -9963 2847 1827 -1546
5175 -1546 8405 3456 -2102 -104 -3301 -32523 -33042 -36387 -28695 -14806 -21576 -19494 -13452 -17691 -15593
5160 -15593 -28416 -33672 -40678 -43205 -25215 -33032 -14232 -15324 -26752 -2058 7083 4862 -3722
5147 -3722 9478 15488 11843 -4183 4382 -5523 -11243 -9583 -15711 -12422 -7470 -15056 -3059 15148
5133 15148 -266 -7280 7110 30567 26022 14253 -17384 -20228 -2575 5573 -17751 -5179 17028
5120 17028 23529 21046 853 -9848 8212 9599 -6261 2921 2824 -13613 -13449 -8832 -24005 -13912
$$ packed form
5216a1364m524k819o522j4653J9127J892L828K3786j765J164n394l039j10P624
5202G231M929R672O191j5842r588m278k3424r52j963J4402J7113n985K642J685
5188A833o462j7303P481K9292J3040k1843j393j8151j3912J7455J2810j020l373
5175a546R951m949n558J998l197k9222n19l345P692J3889o770K082O042m239K098
5160a5593j2823n256p006k527J7990p817J8800j092j1428K4694R141k221q584
5147c722J3200O010l645j6026Q565r905n720J660o128L289M952p586J1997J8207
5133A5148j5414p014J4390K3457m545j1769l1637k844J7653Q148k3324J2572K2207
5120A7028O501k483k0193j0701J8060J387j5860R182r7j6437J64M617j5173J0093
$$ plain form
5106 -13912 -16309 -11975 13888 27415 -2026 -4022 -9332 -6019 -969 15833 17828 11266 6453 -6096
5092 -6096 -8666 1337 -16065 -16922 -6399 6390 33408 51660 22176 -10430 -11672 -589 -37
5079 -37 -6076 -1433 7383 -297 9870 8787 1586 -1813 3853 -12512 -15350 11202 9213 12610 23970
5064 23970 9589 -8945 -23783 -10932 -6049 76 292 8266 9160 2218 -13079 -6877 -8703 -12689
5050 -12689 10349 29356 16235 10851 13036 15641 3013 -6109 5275 19181 14825 -313 9408
5037 9408 9240 9777 10850 8953 -5244 -375 5936 -10763 -3749 7277 -15083 -16700 -13240 -10254
5023 -10254 5720 -13037 -6963 -3786 -9539 -8651 4213 4340 16316 13125 -3720 3628 2444 -19236
5009 -19236 -14244 -26216 -28882 -21436 -31116 -20007 -1779 -3012 -11246 3523 21152 12727 -7678
$$ packed form
5106a3912k397M334K5863J3527k9441j996n310L313N050J6802J995o562m813j2549
5092f096k570J0003j7402q57J0523J2789K7018J8252k9484l2606j242J1083N52
5079c7o039M643Q816p680J0167j083p201l399N666j6365k838K6552j989L397J1360
5064B3970j4381j8534j4838J2851M883O125K16P974Q94o942j5297O202j826l986
5050a2689K3038J9007j3121n384K185K605j2628r122J1384J3906m356j5138R721
5037I408j68N37J073j897j4197M869O311j6699P014J1026k2360j617L460K986
5023a0254J5974j8757O074L177n753Q88J2864J27J1976l191j6845P348j184k1680
5009a9236M992j1972k666P446r680J1109J8228j233q234J4769J7629q425k0405
$$ plain form
4996 -7678 -7792 -14401 -9980 2927 1875 -22435 -36784 -23130 -21025 -13846 -21308 -25176 -24161 -11585
4982 -11585 -30592 -36188 -23502 -32122 -29743 -39338 -34016 -12695 -20797 -8993 -8984 -17493 -10909 -2121
4968 -2121 17992 23289 21276 12179 15396 34955 22045 -1492 4540 20551 4257 -4503 11807
4955 11807 12777 7451 9168 9809 653 4145 2522 -6634 -5894 -2562 -19873 -17458 -2986 17061 7128
4940 7128 -10361 -24091 -34545 -35800 -43016 -42918 -21053 -12278 6437 19430 22717 18338 4406 -10563
4926 -10563 5491 -1650 -10512 -14619 -214 3421 -2928 1237 7977 -5205 -17644 -19057 -9062 146
4912 146 16696 13354 15226 10656 -17063 -20470 -13748 -14106 -7615 -22374 -31028 -10178 -12050 -5914
4898 -5914 4952 22842 20967 22276 7028 -8347 -4922 7585 8293 12797 22325 -5287 -6179 5956
$$ packed form
4996g678j14o609M421J2907j052k4310j4349J3654K105P179p462l868J015J2576
4982a1585j9007n596J2686q620K379r595N322K1321q102J1804Rq509O584Q788
4968b121K0113N297k013r097L217J9559j2910k3537O032J6011j6294q760J6310
4955A1807R70n326J717O41r156L492j623r156P40L332j7311K415J4472K0047r933
4940G128j7489j3730j0454j255p216R8K1865Q775J8715J2993L287m379j3932j4969
4926a0563J6054p141q862m107J4405L635o349M165O740j3182j2439j413R995R208
4912A46J6550l342J872m570k7719l407O722l58O491j4759q654K0850j872O136
4898e914J0866J7890j875J309j5248j5375L425J2507P08M504R528k7612q92J2135
$$ plain form
4884 5956 2341 8718 10138 -17200 -14707 193 5839 1394 2910 -15277 -13820 -4682 -5752 -2192
4870 -2192 -8322 -19421 -13640 -11962 -4513 -8527 -24967 -30858 -25068 -5270 11833 12387 2768 17100
4856 17100 7687 7196 -3862 -7452 229 -17607 -34174 -19177 -9992 -12239 1047 18236 19941
4843 19941 3735 -7158 -6163 -8773 -17163 -13805 -4637 -7262 -5805 -16609 -32364 -5665 16904
4830 16904 13543 3196 -8525 -14022 -3616 14878 15140 11063 -4530 -21543 -23547 -10277 -7721
4817 -7721 -5086 -8246 -26025 -34686 -25161 -34524 -36731 -40042 -29450 -28204 -22137 -24572 -29034 -22564
4803 -22564 5886 14021 14825 18858 19028 20524 12505 16728 25290 31258 17439 13383 2365 8511
4789 8511 30490 40997 25304 -6774 -11091 -12476 -18599 -30846 -37244 -22240 -2144 -14784 -13594
$$ packed form
4884E956l615O377J420k7338K493J4900N646m445J516j8187J457R138j070L560
4870b192o130j1099N781J678P449m014j6440n891N790J9798J7103N54r619J4332
4856A7100r413m91j1058l590P681j7836j6567J4997R185k247J3286J7189J705
4843A9941j6206j0893R95k610q390L358R168k625J457j0804j5755K6699K2569
4830A6904l361j0347j1721n497J0406J8494K62m077j5593j7013k004J3270K556
4817g721K635l160j7779q661R525r363k207l311J0592J246O067k435m462O470
4803b2564K8450Q135Q04M033J70J496q019M223Q562N968j3819m056j1018O146
4789H511K1979J0507j5693l2078m317j385o123j2247o398J5004K0096j2640J190
$$ plain form
4776 -13594 -25563 -35460 -6243 10546 7540 -19337 -18427 -17242 -28354 -21308 -6215 4121 -7316
4763 -7316 -23858 -31606 -26790 -6077 -12820 -21565 -12102 -5777 -7763 195 5489 27990 26635 18269
4749 18269 13686 4497 -9447 -10900 5531 18477 24386 28159 13772 -12816 -24400 -28981 -7156
4736 -7156 25556 29281 10686 -1034 18858 13509 4940 -11431 -22071 -11772 -10427 3761 20159
4723 20159 20624 22499 23005 15651 831 -4420 -2763 -8832 -2205 -2948 10962 6406 -18473 -25027 -13650
4708 -13650 284 4488 -4671 -22291 -18839 -2389 -26589 -28604 -15542 -251 6400 -8090 10680
4695 10680 26762 19358 8156 18571 11735 -1943 2216 5486 23510 13952 -470 -4281 -11562
4682 -11562 775 25858 28106 24055 7898 -80 469 7424 22379 9347 3812 13796 10530 2867
$$ packed form
4776a3594j1969r897K9217J6789l006k6877R10J185j1112P046J5093J0336j1437
4763g316j6542p748M816K0713o743q745R463O325j986P958N294K2501j355q366
4749A8269m583r189j3944j453J6431J2946N909L773j4387k6588j1584m581K1825
4736g156L2712L725j8595j1720J9892n349q569j6371j0640J0299J345J4188J6398
4723B0159M65J875N06p354j4820n251J657o069O627p43J3910m556k4879o554J1377
4708a3650J3934M204r159j7620L452J6450k4200k015J3062J5291O651j4490J8770
4695A0680J6082p404j1202J0415o836j3678M159L270J8024r558j4422l811p281
4682a1562J2337K5083K248m051j6157p978N49O955J4955j3032n535R984l266p663
$$ plain form
4668 2867 1144 14552 91 -21471 -37409 -31874 -3886 9277 6151 -4612 -12819 -15798 -2748
4655 -2748 25820 35045 -5767 -48037 -32763 -4037 5648 -3064 10276 31418 53219 24538 8375
4642 8375 -7884 -37541 -24367 -3431 -4189 -16125 -25416 -29205 -23379 -32908 -19716 17064 17924 14505
4628 14505 7248 6049 1945 -4590 7787 15103 9090 7053 -2706 -9425 -11524 -2155 12479 24353
4614 24353 19786 30245 46832 39616 5916 -3825 -11728 -25392 -31701 -31666 -39173 -37824 -33744 -41623
4600 -41623 -34311 -27596 -21510 -22339 -17882 -20299 -32689 -41546 -36097 -34274 -26191 -2150 4023 -4349
4586 -4349 3621 5356 -8053 -13749 -23674 -39169 -27285 -7858 9751 1937 -24499 -25260 -22616 -31486
4572 -31486 -19086 2143 -11022 -24575 -2357 -427 -21682 -30628 -3623 16244 9346 18810 162
$$ packed form
4668B867j723J3408j4461k1562j5938N535K7988J3163l126j0763q207k979J3050
4655b748K8568R225m0812m2270J5274K8726R685q712J3340K1142K1801k8681j6163
4642H375j6259k9657J3174K0936p58j1936r291l789N826r529J3192L6780Q60l419
4628A4505p257j199m104o535J2377P316o013k037r759o719k099R369J4634J1874
4614B4353m567J0459J6587p216l3700r741p903j3664o309L5p507J349M080p879
4600d1623P312O715O086q29M457k417j2390q857N449J823Q083K4041O173q372
4586d349P970J735j3409n696r925j5495J1884J9427J7609p814k6436p61K644q870
4572c1486J2400K1229j3165j3553K2218J930k1255q946K7005J9867o898R464j8648
$$ plain form
4559 162 -22498 -22096 -3540 5997 2845 -14586 -8162 -14193 -10329 3932 15258 17443 27988 24335
4545 24335 7494 -10192 -6637 13306 11925 2409 -15154 -14645 -14088 -24010 -34114 -24447 -485 4244
4531 4244 -16854 -20221 -8506 -17301 -28142 -6637 13368 8014 1550 -8795 -3836 -9809 -3963
4518 -3963 10207 10146 -7975 -5811 8724 19842 16148 -5650 -31724 -32209 -6126 -3394 -13350 40
4504 40 1968 -2999 1924 30497 48432 36498 7537 6255 17959 31769 19764 15141 23994 29279
4490 29279 28867 461 -36332 -14042 -2594 20807 30757 11754 -11514 -2508 2034 3349 10085
4477 10085 30039 33170 7260 -20470 -37311 -52228 -33217 -18015 -8896 18143 42732 53735
4465 53735 24884 10409 -7289 -20314 -13609 -594 6793 -8600 -11309 -28846 -28374 -25214 -21067
$$ packed form
4559A62k2660M02J8556R537l152j7431O424o031L864J4261J1326K185J0545l653
4545B4335j6841j7686L555J9943j381r516j7563N09N57r922j0104R667K3962M729
4531D244k1098l367J1715q795j0841K1505K0005n354o464j0345M959n973N846
4518c963J4170o1j8121K164J4535J1118l694k1798k6074m85K6083K732r956J3390
4504D0J928m967M923K8573J7935j1934k8961j282J1704J3810j2005m623Q853N285
4490B9279m12k8406l6793K2290J1448K3401R950j9003k3268R006M542J315O736
4477A0085J9954L131k5910k7730j6841j4917J9011J5202R119K7039K4589J1003
4465E3735k8851j4475j7698j3025O705J3015P387j5393k709j7537M72L160M147
$$ plain form
4452 -21067 -11145 -2782 7462 8654 -5143 -7969 -21430 -41454 -33179 -7268 -6085 -26549 -39662
4439 -39662 -28705 -25782 -7159 9942 9413 -12285 -34491 -25876 3076 16362 7579 2610 20980
4426 20980 11275 -1932 3852 1499 -8722 -3204 -28642 -40082 -28985 -7863 11010 2370 974
4413 974 -2048 10016 19507 22816 31057 29204 7972 332 14357 -2251 -31686 -44712 -37165 -20086
4399 -20086 340 3761 5958 10665 -2559 -24774 -19513 -11789 -12347 4053 23326 31520 44204
4386 44204 30937 25223 16215 18597 10358 21650 15421 -13230 -9650 -8700 16201 21680 17448 11728
4372 11728 3270 1660 -3112 1939 -511 -5290 3503 7992 29046 56304 38057 5815 -4576
4359 -4576 -10510 -6618 -18295 1450 29388 25378 9814 2065 -9647 -2043 -18336 -15974 -19232
$$ packed form
4452b1067R922Q363J0244J192j3797k826j3461k0024Q275K5911J183k0464j3113
4439c9662J0957K923J8623J7101n29k1698k2206Q615K8952J3286q783m969J8370
4426B0980r705j3207N784k353j0221N518k5438j1440J1097K1122J8873q640j396
4413I74l022J2064R491L309Q241j853k1232p640J4025j6608k9435j3026P547J7079
4399b0086K0426L421K197M707j3224k2215N261P724n58J6400J9273Q194J2684
4386D4204j3267n714r008K382q239J1292o229k8651L580R50K4901N479m232n720
4372A1728q458j610m772N051k450m779Q793M489K1054K7258j8247l2242j0391
4359d576n934L892j1677J9745K7938m010j5564p749j1712P604j6293K362l258
$$ plain form
4346 -19232 -11388 -12092 -30573 -20741 -4866 1463 -8871 -11671 -22903 -31162 -30920 -27980 -26032 -37514
4332 -37514 -34158 -20695 -11915 -18519 -30600 -46843 -42282 -26813 -29933 -39742 -47181 -64666 -62482
4319 -62482 -26598 -14152 -33532 -37830 -28681 -26197 -34640 -46683 -39077 -40422 -40460 -23255 -9190 16045
4305 16045 27800 19825 7808 7324 19216 43692 26520 17664 21224 30909 21862 735 18327
4292 18327 -2605 3244 4349 10626 11203 10463 -17246 -33863 -46849 -36357 -9505 -9254 -12995 -9306
4278 -9306 7836 8513 92 -4730 -7063 -12070 -22519 -28260 -22928 -21678 -22825 -29334 -27285 -14950
4264 -14950 2193 -10298 -22477 -15981 -14213 -9360 -16238 -15199 -20755 -29383 -20582 998 3687 19014
4250 19014 24858 25640 32304 48254 64901 71404 55764 33095 20297 -5815 -2541 -859 14069
$$ packed form
4346a9232P844p04j8481R832J5875O329j0334k800j1232q259K42K940J948j1482
4332c7514L356J3463Q780o604j2081j6243M561J5469l120r809p439j7485K184
4319f2482L5884J2446j9380m298R149K484q443j2043P606j345l8J7205J4065K5235
4305A6045J1755p975j2017m84J1892K4476j7172q856L560R685r047k1127J7592
4292A8327k0932N849J105O277N77p40k7709j6617j2986J0492K6852K51l741L689
4278i306J7142O77q421m822k333n007j0449n741N332J250j147o509K049J2335
4264a4950J7143j2491j2179O496J768M853o878J039n556q628Q801K1580K689J5327
4250A9014N844P82O664J5950J6647O503j5640k2669j2798k6112L274J682J4928
$$ plain form
4237 14069 17532 29367 27604 7025 6851 13458 25418 31878 8051 -19823 -32961 -22820 955
4224 955 19366 18075 25456 16905 16302 10625 -924 -35256 -39613 -21959 6570 16521 26423 17132
4210 17132 3725 -9613 -20158 -16658 -981 6851 -6741 23678 53721 38215 27722 13139
4198 13139 11274 15888 18213 27300 29205 7517 -6085 -12202 -11935 -9741 -20373 -11077 -12882 -8620
4184 -8620 -11292 -2927 2745 -7850 8807 27572 11323 -8702 -523 5377 18627 34006 11188
$$ packed form
4237A4069L463J1835j763k0579j74O607J1960O460k3827k7874j3138J0141K3775
4224I55J8411j291P381q551o03n677j1549l4332m357J7654K8529R951R902r291
4210A7132j3407j3338j0545L500J5677P832j3592L0419L0043j5506j0493j4583
4198A3139j865M614K325R087J905k1688j3602o117K67K194j0632R296j805M262
4184h620k672Q365N672j0595J6657J8765j6249k0025Q179N900J3250J5379k2818
$$ [...]
##END NTUPLES=NMR SPECTRUM
##END=
