##TITLE=Analysis number 318355
Compound Code rf 01264
Project Code adrs
Chemist Name 3b pharmachem
##JCAMPDX= 6.0         $$ Bruker NMR JCAMP-DX V2.0
##DATA TYPE= NMR SPECTRUM
##DATA CLASS= NTUPLES
##ORIGIN= Bruker BioSpin GmbH
##OWNER= nmr
$$ XWIN-NMR		Version 3.5
$$ Fri Mar 24 11:52:19 2006 GMT Standard Time (UT+0h)  MAYBRIDGE\nmr@NMR_250MHZ
##.OBSERVE FREQUENCY= 250.131544655141
##.OBSERVE NUCLEUS= ^1H
##.ACQUISITION MODE= SIMULTANEOUS (DQD)
##.ACQUISITION SCHEME= undefined
##.AVERAGES= 16
##.DIGITISER RES= 18
##SPECTROMETER/DATA SYSTEM= dpx250
##.PULSE SEQUENCE= zg30
##.SOLVENT NAME= DMSO
##.SHIFT REFERENCE= (INTERNAL, DMSO, 0, 16.522)
##AUDIT TRAIL= $$ (NUMBER, WHEN, WHO, WHERE, WHAT)
$$ ##TITLE= Audit trail, XWIN-NMR		Version 3.5
$$ ##JCAMPDX= 5.01
$$ ##ORIGIN= Bruker BioSpin GmbH
$$ ##OWNER= nmr
$$ C:\u/data/dgb/nmr/ADRS/1430/pdata/1/auditp.txt
$$ ##AUDIT TRAIL=  $$ (NUMBER, WHEN, WHO, WHERE, WHAT)
(   1,<2006-03-24 11:51:21.10 +000>,<MAYBRIDGE\nmr>,<NMR_250MHZ>,
      <created by zg, POWCHK disabled, PULCHK disabled
       configuration hash MD5:
       84 BC 41 DB A1 6E 1D 46 DA 25 12 A5 C1 ED C5 3A
       data hash MD5: 64K
       38 98 8E 8D 5B 66 2D 59 E0 BF D5 D4 70 F3 E8 D7>)
(   2,<2006-03-24 11:51:43.10 +000>,<MAYBRIDGE\nmr>,<NMR_250MHZ>,
      <Start of raw data processing
       ef LB = 0.3 FT_mod = 6 PKNL = 1 SI = 32K 
       data hash MD5: 32K
       36 1E 72 B1 E2 EA 51 F2 60 D7 00 F6 B4 7F 01 E2>)
(   3,<2006-03-24 11:51:53.45 +000>,<MAYBRIDGE\nmr>,<NMR_250MHZ>,
      <apk 
       data hash MD5: 32K
       6B 02 BD DC DF 52 68 81 34 3F 35 CB 22 AD 23 9F>)
(   4,<2006-03-24 11:51:56.74 +000>,<MAYBRIDGE\nmr>,<NMR_250MHZ>,
      <abs ABSG = 5 
       data hash MD5: 32K
       00 B4 EC 65 FD 6B 43 3F 65 B0 4E D8 ED 3E B0 98>)
$$ ##END=
$$ 
$$ hash MD5
$$ 12 FA 5A 35 5C 04 B6 6B C3 FE 28 26 ED 06 CF CD
##$RELAX= 
##$RELAX= 
##$RELAX= 
##$RELAX= 
##$RELAX= 
##$RELAX= 
##$RELAX= 
$$ Bruker specific parameters
$$ --------------------------
##$DU= <C:\u>
##$EXPNO= 1430
##$NAME= <ADRS>
##$PROCNO= 1
##$TYPE= <nmr>
##$USER= <dgb>
##$AMP= (0..31)
100 100 100 100 100 100 100 100 100 100 100 100 100 100 100 100 100 100 
100 100 100 100 100 100 100 100 100 100 100 100 100 100 
##$AQSEQ= 0
##$AQ_mod= 3
##$AUNM= <au_zg>
##$AUTOPOS= <17 >
##$BF1= 250.13
##$BF2= 250.13
##$BF3= 250.13
##$BF4= 250.13
##$BF5= 500.13
##$BF6= 500.13
##$BF7= 500.13
##$BF8= 500.13
##$BYTORDA= 1
##$CFDGTYP= 0
##$CFRGTYP= 5
##$CHEMSTR= <none>
##$CNST= (0..31)
1 1 145 1 1 1 1 1 1 1 1 1 1 1 1 1 1 1 1 1 1 1 1 1 1 1 1 1 1 1 1 1 
##$CPDPRG= <>
##$CPDPRG1= <>
##$CPDPRG2= <>
##$CPDPRG3= <>
##$CPDPRG4= <mlev>
##$CPDPRG5= <mlev>
##$CPDPRG6= <mlev>
##$CPDPRG7= <mlev>
##$CPDPRG8= <mlev>
##$CPDPRGB= <>
##$CPDPRGT= <>
##$D= (0..31)
0 1 0 0 0 0 0 0 0 0.06 0 0 0 0 0 0 0.0002 0 0 0 0 0 0 0 0 0 0 0 0 0 0 
0 
##$DATE= 1143201079
##$DBL= (0..7)
120 120 120 120 120 120 120 120 
##$DBP= (0..7)
150 150 150 150 150 150 150 150 
##$DBP07= 0
##$DBPNAM0= <>
##$DBPNAM1= <>
##$DBPNAM2= <>
$$ [...]
##$SUBNAM7= <"">
##$SUBNAM8= <"">
##$SUBNAM9= <"">
##$SW= 20.6930455092707
##$SWIBOX= (0..15)
0 0 3 0 0 0 0 0 0 0 0 0 0 0 0 0 
##$SW_h= 5175.983436853
##$TD= 65536
##$TD0= 1
##$TE= 294.16
##$TE2= 300
##$TE3= 300
##$TEG= 300
##$TL= (0..7)
0 120 120 120 120 120 120 120 
##$TP= (0..7)
150 150 150 150 150 150 150 150 
##$TP07= 0
##$TPNAME0= <>
##$TPNAME1= <>
##$TPNAME2= <>
##$TPNAME3= <>
##$TPNAME4= <>
##$TPNAME5= <>
##$TPNAME6= <>
##$TPNAME7= <>
##$TPOAL= (0..7)
0.5 0.5 0.5 0.5 0.5 0.5 0.5 0.5 
##$TPOFFS= (0..7)
0 0 0 0 0 0 0 0 
##$TUNHIN= 0
##$TUNHOUT= 0
##$TUNXOUT= 0
##$USERA1= <user>
##$USERA2= <user>
##$USERA3= <user>
##$USERA4= <user>
##$USERA5= <user>
##$V9= 5
##$VALIST= <valist>
##$VCLIST= <CCCCCCCCCCCCCCC>
##$VD= 0
##$VDLIST= <DDDDDDDDDDDDDDD>
##$VPLIST= <PPPPPPPPPPPPPPP>
##$VTLIST= <TTTTTTTTTTTTTTT>
##$WBST= 1024
##$WBSW= 4
##$XGAIN= (0..3)
0 0 0 0 
##$XL= 0
##$YL= 0
##$YMAX_a= 295179
##$YMIN_a= -444351
##$ZGOPTNS= <>
##$ZL1= 120
##$ZL2= 120
##$ZL3= 120
##$ZL4= 120
##$ABSF1= 16.522
##$ABSF2= -4.171173
##$ABSG= 5
##$ABSL= 3
##$ALPHA= 0
##$AQORDER= 0
##$ASSFAC= 0
##$ASSFACI= 0
##$ASSFACX= 0
##$ASSWID= 0
##$AUNMP= <proc_1d>
##$AZFE= 0.1
##$AZFW= 0.1
##$BCFW= 0
##$BC_mod= 0
##$BYTORDP= 0
##$COROFFS= 0
##$CY= 12.5
##$DATMOD= 1
##$DC= 0
##$DFILT= <>
##$DTYPP= 0
##$F1P= 14.0000005364418
##$F2P= -0.99999901652339
##$FCOR= 0.5
##$FTSIZE= 32768
##$FT_mod= 6
##$GAMMA= 0
##$GB= 0
##$INTBC= 1
##$INTSCL= 1
##$ISEN= 128
##$LB= 0.3
##$LEV0= 0
##$LPBIN= 0
##$MAXI= 10000
##$MC2= 0
##$MEAN= 0
##$ME_mod= 0
##$MI= 0
##$NCOEF= 0
##$NC_proc= -4
##$NLEV= 6
##$NOISF1= 0
##$NOISF2= 0
##$NSP= 0
##$NTH_PI= 0
##$NZP= 0
##$OFFSET= 16.522
##$PC= 1
##$PHC0= 161.8439
##$PHC1= 12.68063
##$PH_mod= 1
##$PKNL= yes
##$PPARMOD= 0
##$PSCAL= 4
##$PSIGN= 0
##$REVERSE= no
##$SF= 250.13
##$SI= 32768
##$SIGF1= 0
##$SIGF2= 0
##$SINO= 400
##$SIOLD= 32768
##$SREGLST= <1H.DMSO>
##$SSB= 0
##$STSI= 32768
##$STSR= 0
##$SW_p= 5175.98343685301
##$SYMM= 0
##$S_DEV= 0
##$TDeff= 65536
##$TDoff= 0
##$TI= <Analysis number 999999
Compound Code 99
Book Reference 9
Project Code 9>
##$TILT= no
##$TM1= 0
##$TM2= 0
##$TOPLEV= 0
##$USERP1= <user>
##$USERP2= <user>
##$USERP3= <user>
##$USERP4= <user>
##$USERP5= <user>
##$WDW= 1
##$XDIM= 32768
##$YMAX_p= 387134186
##$YMIN_p= -483218
$$ End of Bruker specific parameters
$$ ---------------------------------
##NTUPLES= NMR SPECTRUM
##VAR_NAME=  FREQUENCY,     SPECTRUM/REAL,   SPECTRUM/IMAG
##SYMBOL=    X,             R,               I
##VAR_TYPE=  INDEPENDENT,   DEPENDENT,       DEPENDENT
##VAR_FORM=  AFFN,          ASDF,            ASDF
##VAR_DIM=   32768,         32768,           32768
##UNITS=     HZ,            ARBITRARY UNITS, ARBITRARY UNITS
##FACTOR=    0.157963299565203, 1,           1
##FIRST=     4132.6476996994, 0,             0
##LAST=      -1043.33573715361, 0,           0
##MIN=       -1043.33573715361, -483218,     0
##MAX=       4132.6476996994, 387134186,     0
$$ Real data points
##PAGE= N=1
##DATA TABLE= (X++(R..R)), XYDATA
$$ [...]
15975A20493k953j02581j09910J31837L9141M8892K6048P966k402j59477j21939
$$ 120493 117540 14959 -94951 36886 76027 124919 150967 158933 156531 -2946 -124885
15964a24885R4352J11003n9950n4116N8479j6441j0291J09431n4513q569K8514
$$ -124885 -30533 80470 20520 -33596 24883 8442 -1849 107582 53069 44500 73014
15953G3014k132n6216J9574Q601j03334K4700J67227J40271n5822k36209j95074
$$ 73014 70882 14666 34240 42841 -60493 -35793 131434 271705 215883 -20326 -215400
15942b15400j02176L8588J45875Q3873R6878J7424n5095J2049O31r1453r5349
$$ -215400 -317576 -278988 -133113 -49240 47638 65062 9967 22016 22647 -68806 -164155
15931a64155N495R8258J37685P7249P9981r4980p1180j30865j45p901J6326l4643
$$ -164155 -158660 -60402 77283 154532 234513 139533 68353 -62512 -62657 -70558 -54232 -88875
15919h8875N4340N0510N5906o8127J4590M954o5185m1344Q5122q0642j16967J05973
$$ -88875 -34535 15975 71881 3754 18344 23298 -41887 -83231 1891 -78751 -195718 -89745
15907h9745n7924r952N8642n1386p3889P0985O9666O3765M4186l3799L1365J3249
$$ -89745 -147669 -157621 -98979 -150365 -224254 -153269 -83603 -19838 24348 -9451 21914 35163
15895C5163n746N8225M5159p1664j29291K1194j0615o0950n972Q9456J7439j72544
$$ 35163 29417 87642 132801 61137 -68154 -46960 -57575 -118525 -124497 -35041 -17602 -190146
15883a90146p8689P0177P0163M8367n9073q3743r166J03982n4339j01650O7556
$$ -190146 -268835 -198658 -128495 -80128 -139201 -222944 -232110 -128128 -182467 -284117 -216561
15872b16561J38127J55355j4433o1004O4805O9895M7766n756m8319j57314n9043
$$ -216561 -78434 76921 62488 1484 66289 136184 183950 178194 129875 -27439 -86482
15861h6482N7308q1346o8852R3036J23848O417k15226o4197P3153J2737R0371
$$ -86482 -29174 -110520 -179372 -86336 37512 43929 -171297 -235494 -162341 -149604 -59233
15850e9233J29995N6488k4669j35159K905m5825k647l340Q9224J70890O7850m890
$$ -59233 70762 127250 102581 -32578 -29673 -75498 -78145 -81485 7739 178629 246479 241589
15838B41589q9945K6920l728q6390j23021r5373Q2171J7340k6445L5926Q5312
$$ 241589 151644 178564 174836 88446 -34575 -129948 -47777 -30437 -56882 -20956 64356
15827F4356J4189p120o4960j42331j5874P8455m662M3182K1398m1238N0132K3250
$$ 64356 78545 71425 6465 -135866 -151740 -73285 -77947 -34765 -13367 -54605 -4473 18777
15815A8777k5072J21350O708R6395m0391m2136O428O9025j01920o5375q784j495
$$ 18777 -6295 115055 121763 218158 177767 135631 142059 211084 109164 43789 35005 33510
15803C3510O7864l5419j22990L5796O0915l7193p2878P9561J13956K764n6108
$$ 33510 101374 65955 -57035 -21239 39676 2483 -70395 9166 123122 125886 69778
15792F9778j19594M5220L8854j16759K5127O7089o877k3189R9704N7575J6750
$$ 69778 -49816 -4596 34258 -82501 -57374 9715 2838 -20351 79353 136928 153678
15781A53678q9061o4647p3724P0337N0607J6742j08486o8053Q3233K4564j0265
$$ 153678 64617 -30 -73754 -3417 47190 63932 -44554 -112607 -29374 -4810 -15075
15770a5075j09819Q5963K09556o5670o6188p5535l8415L9969J32793O4859j8407
$$ -15075 -124894 -38931 170625 104955 38767 -36768 -75183 -35214 97579 162438 144031
15759A44031q5064q2475q2617N1944o62k8388O931K3682P7036q3122m414O1750
$$ 144031 58967 -23508 -106125 -54181 -54843 -83231 -76300 -52618 24418 -58704 -63118 -1368
15747a368J11426K8400m51K3295r8555p7759p7790J947J67697J06777q5853M350
$$ -1368 110058 138458 138007 161302 62747 -15012 -92802 -90855 76842 183619 97766 102116
15735A02116R8093J7130j08698m6155M8225k2473j74674k1985J06780L0338p5980
$$ 102116 200209 217339 108641 62486 110711 88238 -86436 -108421 -1641 28697 -47283
15724d7283j21716Q1174J56283N549n9589p5077o0514N8520M7475J013L8933n3644
$$ -47283 -168999 -87825 68458 74007 14418 -60659 -121173 -62653 -15178 -14165 24768 -28876
15712b8876K6096J26290k625o3649p4554k5016O0566j15291n1634M1868N3710
$$ -28876 -2780 123510 120885 57236 -17318 -42334 18232 -97059 -148693 -106825 -53115
15701e3115O7743n4379j4602m3138m5550N4842J52924M0984j21260k9996L2176
$$ -53115 14628 -39751 -54353 -97491 -143041 -88199 64725 105709 -15551 -45547 -13371
15690a3371q485k13695o2478o479k9463K19516J81686l9097r4206J2627m3849
$$ -13371 -21856 -235551 -298029 -304508 -333971 -114455 67231 28134 -66072 -53445 -97294
15679i7294j41877J28402J15706j9459L6050M2034n4236k0382m6636K0854m6578
$$ -97294 -239171 -110769 4937 -14522 21528 63562 9326 -11056 -57692 -36838 -83416
15668h3416l8213J21872R0758j34767q6637l303N603P9065M731L0409J1596p9462
$$ -83416 -121629 243 91001 -43766 -130403 -133706 -128103 -49038 -44307 -13898 -2302 -81764
15656h1764N1779J97130J09114K0100j62047j86450p1322l8017q8202N5469J52407
$$ -81764 -29985 167145 276259 296359 134312 -52138 -123460 -161477 -249679 -194210 -41803
15645d1803q1252L022R410N7346r132J05937O3132k8544j30952J3605j07447M1142
$$ -41803 -123055 -120033 -110623 -53277 -62409 43528 106660 78116 -52836 -39231 -146678 -105536
15633a05536k9573L8357J40079L5123l3868k3792N4221m5996j17121J6289N686
$$ -105536 -135109 -96752 43327 78450 44582 20790 75011 29015 -88106 -71817 -66131
15622f6131J8670P178P3337o2174R391o672O6752J25190L309k7628p4473k375
$$ -66131 -47461 -40283 33054 -29120 -19729 -26401 40351 165541 168850 141222 66749 64374
15610F4374l2373j17129J0209L8212o3146J31205R9283m0381j19401J17046j3893
$$ 64374 32001 -85128 -74919 -36707 -99853 31352 130635 90254 -29147 87899 74006
15599G4006k394M0983l0749j8906j04547k1899l416l957Q4739R253J3152l1018
$$ 74006 71612 112595 81846 62940 -41607 -63506 -66922 -70879 13860 23113 36265 5247
15587E247o0675L6282Q6269J10513m8528n8981n5082Q5501l7635J04965O4407
$$ 5247 -55428 -19146 67123 177636 129108 70127 15045 100546 62911 167876 232283
15576B32283J4549j00872j68081j24933O7149K37948J26934j03647l2042k0299
$$ 232283 246832 145960 -22121 -147054 -79905 158043 284977 181330 149288 128989
15566A28989k5529J078K2994k9084P3363k9726k4052l6003j28855j14790J21870
$$ 128989 103460 104538 127532 98448 171811 142085 118033 82030 -46825 -161615 -39745
15555c9745N6187q7961Q62J12160J30160k107n4288j756M3798o8823o5166k1738
$$ -39745 16442 -71519 -70657 41503 171663 169556 115268 113512 157310 88487 23321 1583
15543A583k9826P377P0267p7678o6742j5131Q4786J07609R3052j21857Q961N8687
$$ 1583 -28243 -20866 49401 -28277 -95019 -110150 -25364 82245 175297 53440 62401 121088
15531A21088o7221j135J6465J152q4857n8674P0194O4068l6526M4355L3963j16827
$$ 121088 53867 52732 69197 70349 -14508 -73182 -2988 61080 24554 68909 102872 -13955
15519a3955L2399J43384n100j6772l4380n8248L8950K3165m9984k7095j2724R2427
$$ -13955 18444 161828 156728 139956 105576 47328 86278 109443 59459 32364 19640 112067
15507A12067Q3259j42589j28553L4374J6912M7160P7870k2095p8787j05045O1211
$$ 112067 195326 52737 -75816 -41442 -24530 22630 100500 78405 -382 -105427 -44216
15496d4216J05975Q1459M549j01762p5849J2445M7996Q6057q8138q2923k2228
$$ -44216 61759 143218 147767 46005 -29844 -17399 30597 116654 28516 -54407 -76635
15485g6635J50765M8110J1134l5891o6116N797l6201Q7L3793J14080L3124m4839
$$ -76635 74130 122240 133374 97483 31367 37164 963 1050 34843 148923 182047 137208
15473A37208m1565j0714M9303j7377m0857o458o3481m6106J5016R9778O7515r5763
$$ 137208 95643 84929 134232 116855 75998 69540 6059 -40047 -25031 74747 142262 46499
15461D6499j4985J2835J4173l0429k2459K3846j9015K2940Q7623O2173j5332j65305
$$ 46499 31514 44349 58522 28093 5634 29480 10465 33405 121028 183201 167869 2564
15449B564p2585J27291m4158j17389j40864L6203J45698j8662m5120J2145O7570
$$ 2564 -70021 57270 13112 -104277 -245141 -208938 -63240 -81902 -127022 -114877 -47307
15438d7307J30055p7655m1738N2895N02K0333j10059N4971k3300N0861J51753
$$ -47307 82748 5093 -36645 16250 16752 37085 -72974 -18003 -41303 9558 161311
15427A61311n6479j30947L9439L3227J11363Q5056m5290p6383l5183r0273l0863
$$ 161311 104832 -26115 13324 46551 157914 242970 197680 121297 86114 -4159 -35022
15416c5022N5482J9362n0843P7230M2282n413o2840r0836p6939j86503K1307J41528
$$ -35022 20460 39822 -11021 66209 108491 103078 40238 -50598 -127537 -314040 -292733 -151205
15404a51205Q4377K103J6446r9190K5988J20177m1751l2485j6686j10996L338
$$ -151205 -66828 -64725 -48279 -147469 -121481 -1304 -43055 -75540 -92226 -203222 -199884
15393a99884M0394k6346P5944N5631m4456q2459L929P9569Q8195N0575l357j48933
$$ -199884 -159490 -185836 -109892 -54261 -98717 -181176 -177247 -97678 -9483 41092 37735 -111198
15381a11198m3204J51978M212Q966N5970P5393K8435j32765p0254q9498J1265
$$ -111198 -154402 -2424 1788 10754 66724 142117 170552 37787 -32467 -121965 -110700
15370a10700L7065n2313P4451R4212p5468j9972j1994k8674J40910M2565j8262
$$ -110700 -73635 -125948 -51497 42715 -32753 -52725 -64719 -93393 47517 90082 71820
15359G1820N9636N1584k5414o4842k2199p4589M0019j7983n716j03545p7336Q942
$$ 71820 131456 183040 157626 92784 70585 -4004 36015 18032 12316 -91229 -168565 -159623
15347a59623Q2606o26o7428p522k4348O4473P6815J09333r9703N1012M2772q395
$$ -159623 -77017 -77643 -145071 -152593 -176941 -112468 -35653 73680 -26023 24989 67761 59366
15335E9366M3700K1710q214o4360q0216K5174l8141M3172o396M3812L9535Q2880
$$ 59366 103066 124776 116562 52202 -28014 -2840 -40981 2191 -4205 39607 79142 162022
15323A62022j19556j32674J61757J2711l6425o608j5296l5728L1415L9463M8779
$$ 162022 42466 -90208 71549 84260 47835 41227 25931 -9797 21618 61081 109860
15312A09860k858o6619j02970l2131J10411L3209j54524J9056P8694Q8761L6371
$$ 109860 107002 40383 -62587 -94718 15693 48902 -105622 -86566 -7872 80889 117260
15301A17260p7574N620R6979J33584l5871j85458j541R0237L9771J3951l2890
$$ 117260 39686 45306 142285 275869 239998 54540 52999 143236 183007 196958 164068
15290A64068j13233O2690j502j7113l1350q3022j21763M9219K5802L6838o9449
$$ 164068 50835 113525 112023 94910 63560 -19462 -141225 -92006 -66204 -29366 -98815
15279i8815l688L563M6775j2730l3144j45882J0600P0904J91432P7717l1131K333
$$ -98815 -102503 -98940 -52165 -64895 -98039 -243921 -233321 -162417 29015 106732 75601 77934
15267G7934j6856O3616r0203r5451N9983M9895j2840j03185J7737O6369k1603
$$ 77934 61078 124694 34491 -60960 -977 48918 36078 -67107 -49370 16999 -4604
15256d604o3658l042l7897j6924j0158Q1914P8585j706r5963n4135N7867P3375
$$ -4604 -68262 -71304 -109201 -126125 -136283 -54369 24216 22510 -73453 -127588 -69721 3654
15244C654J28221m1958m9983n4964l4612K8098K5858o443O7026M5401R320K5205
$$ 3654 131875 89917 39934 -15030 -49642 -21544 4314 -2129 64897 110298 119618 144823
15232A44823r6864j07537Q546m7228J10169M3740M5445j3547o4291p45j2101P1845
$$ 144823 47959 -59578 -51032 -98260 11909 55649 101094 87547 23256 22511 10410 82255
15220H2255p9566j28540L7631K6479K2020j7942O4342J57352J8627j17769j6168
$$ 82255 2689 -125851 -88220 -61741 -39721 -57663 6679 164031 182658 64889 48721
15209D8721N1795m4780l5140o770k3784N9621M2933k0141o6533r4902r5664J79805
$$ 48721 100516 55736 20596 13826 -9958 49663 92596 72455 5922 -88980 -184644 -4839
15197d839N5114j7042m3526M7685P9776o3772j19465J46288N5755j75249l1947
$$ -4839 50275 33233 -10293 37392 117168 53396 -66069 80219 135974 -39275 -71222
15186g1222n1972k2764P4121J61308J27626j03406o5065p5842J18511R6789l1909
$$ -71222 -123194 -145958 -71837 89471 217097 113691 48626 -27216 91295 188084 156175
15175A56175j26735j39929q1322k20381O2651J77984J29192k121m5228J2708M7447
$$ 156175 29440 -110489 -191811 -412192 -349541 -171557 -42365 -44486 -89714 -77006 -29559
15164b9559J28995o3020o2844n7219l4923n0338M904J4720L7506P8150j11531
$$ -29559 99436 36416 -26428 -83647 -118570 -168908 -164004 -149284 -111778 -33628 -145159
15153a45159P0409K5756k3077O3808j7411m1311k2866Q8950k4521k4617j9819
$$ -145159 -74750 -48994 -72071 -8263 -25674 -66985 -89851 -901 -25422 -50039 -69858
15142f9858Q096K0994k0164R0604J9503k7183J0191J6448o8562j966j1681m218
$$ -69858 -61762 -40768 -60932 29672 49175 21992 32183 48631 -19931 -21897 -33578 -37796
15130c7796N5476j8658l3141L6411J2664K0601m223j2816M0232j9997K2426r9532
$$ -37796 17680 -978 -34119 2292 14956 35557 31334 18518 58750 38753 61179 -38353
15118c8353n3075M7698J71851k7574k0175l6203q0282N652N193j5927o3388q0208
$$ -38353 -91428 -43730 128121 100547 80372 44169 -36113 -30461 -25268 -41195 -104583 -184791
15106a84791M117J55579N8140n5558m5800K7859M9793P0022K1868L131p3070r4838
$$ -184791 -180674 -25095 33045 -22513 -68313 -40454 9339 79361 101229 104360 31290 -63548
15094f3548K0497N5159n9824n7072m1429k07J14860n576j3500j3949p2216R4991
$$ -63548 -43051 12108 -47716 -104788 -146217 -146424 -31564 -37140 -50640 -64589 -136805 -41814
15082d1814Q7337q092L3864K6349O1647j10615r3501J7590J53610p3724o6667
$$ -41814 45523 37431 71295 97644 159291 48676 -44825 -27235 126375 52651 -14016
15071a4016q5553k6649R920J5240L4317q0978P7518J43433o8393J12555M4617
$$ -14016 -99569 -126218 -116298 -101058 -66741 -147719 -70201 73232 4839 117394 162011
15060A62011N7470O083m6441J5809j35082q1856j65146j0262M179M3386K7908
$$ 162011 219481 225564 179123 194932 59850 -22006 -187152 -197414 -193235 -149849 -121941
15049a21941J57724J17027r523p806J4715k7743m5637j55309j14926o4845M7394
$$ -121941 35783 152810 143287 135481 150196 122453 76816 -78493 -193419 -258264 -210870
15038b10870J71048L0422k2253p5323j06249J860P5906M0059l7597m1195J18655
$$ -210870 -39822 -9400 -31653 -106976 -213225 -211365 -135459 -95400 -132997 -174192 -55537
15027e5537O2436O9783j1787o8577K4556o3249j95831J2113K4966p5972j1141
$$ -55537 6899 76682 64895 -3682 20874 -42375 -238206 -226093 -201127 -277099 -288240
15016b88240J97055J12398L4743k9536o9378k970L3991k06591Q469N1478K5116
$$ -288240 -91185 21213 55956 26420 -42958 -45928 -11937 -218528 -210059 -158581 -133465
15005a33465N8189J0381P9773P8378q6826l8949M687M7137l8317J7780q424n4625
$$ -133465 -75276 -64895 14878 93256 6430 -32519 -27832 19305 -19012 -1232 -9656 -64281
14993f4281L0599p8965j10343k7365O9691M501R7266Q3415q8223L7957R3248l711
$$ -64281 -33682 -112647 -222990 -250355 -180664 -176163 -78897 4518 -83705 -45748 47500 43789
14981D3789j73598o0922r8o04k2934m6541J607J14757O8542j8123l9083J2138
$$ 43789 -129809 -190731 -190829 -191433 -214367 -260908 -259301 -144544 -76002 -94125 -133208 -121070
14969a21070j637M2138J41339J0360N9625k4514r2836j85630q6882J25335R7035
$$ -121070 -122707 -80569 60770 71130 130755 106241 13405 -172225 -259107 -133772 -36737
14958c6737j22700k6459O4272M0840J17141p1068n075K2629j22464m082M3749
$$ -36737 -159437 -185896 -121624 -80784 36357 -34711 -39786 -17157 -139621 -143703 -99954
14947i9954j03300l1092K4081J75640J45627q3197L3341M1295K0858q4045M698
$$ -99954 -203254 -234346 -210265 -34625 111002 27805 61146 102441 123299 39254 43952
14936D3952O9449O933J09307l225p1210p9067o6067N4115q1280p7337k5535l5841
$$ 43952 113401 120334 229641 226416 155206 76139 10072 64187 -17093 -94430 -119965 -155806
14924a55806N4090l3826o082Q1477P2281k4148m0704k7892O3367j9047n4520n6016
$$ -155806 -101716 -135542 -141624 -60147 12134 -12014 -52718 -80610 -17243 -36290 -90810 -146826
14912a46826K3415n6509r6708J39964p3106K0317R2278Q77n890L1840j2295m4160
$$ -146826 -123411 -179920 -276628 -136664 -209770 -189453 -97175 -96298 -102188 -70348 -82643 -126803
14900a26803K0072L8452J02897k9958l4264j10859O8524J6628J4386J07572o7023
$$ -126803 -106731 -68279 34618 4660 -29604 -140463 -71939 -55311 -40925 66647 -376
14889c76j08752M3136J05391o2190j36370p5749R7306Q3861O6500L5492J9281
$$ -376 -109128 -65992 39399 -22791 -159161 -234910 -137604 -53743 12757 48249 67530
14878F7530N1980j8840p2470K3124j07642m1532O1175N5130J5632J3667k384L5301
$$ 67530 119510 100670 28200 51324 -56318 -97850 -36675 18455 34087 47754 45370 80671
14866H0671q5423o0750M8876O469j31214m154k5265j026J98961Q1231K1700k1452
$$ 80671 -4752 -65502 -16626 -10157 -141371 -145525 -170790 -171816 27145 108376 130076 108624
14854A08624j8926q5179j31812J2357Q6907r1206l5817P3324K02490n6376n1753
$$ 108624 89698 4519 -127293 -114936 -28029 -119235 -155052 -81728 120762 64386 12633
14843A2633L413Q0464R9323m2553J8169p0634q9046J0803k1998N8733Q8915p7622
$$ 12633 16046 96510 195833 153280 171449 100815 11769 22572 574 59307 148222 70600
14831G0600r1257Q3194j3376L3926Q3j8523Q4684n0723m1601l9600j09002M696
$$ 70600 -20657 62537 49161 83087 83170 64647 149331 98608 57007 17407 -91595 -86899
14819h6899n522J15322J3486J4794R6198j06790l1954m2431p3390p820N6414q521
$$ -86899 -92421 22901 36387 51181 147379 40589 8635 -33796 -107186 -115006 -58592 -67113
14807f7113m0554Q4854o0436j3207Q0925O3510m8849P2036M757j13815k21861
$$ -67113 -107667 -22813 -83249 -96456 -15531 47979 -870 71166 75923 -37892 -259753
14796b59753p5103P3863J9135L7610P8198n5105O7127j0471k1095J19866P4309
$$ -259753 -334856 -260993 -241858 -204248 -126050 -181155 -114028 -124499 -145594 -25728 48581
14785D8581m7398K2039J9500L6828M3037m0416r3361L628J14321j11875j52885
$$ 48581 1183 23222 42722 79550 122587 82171 -11190 -7562 106759 -5116 -158001
14774a58001M4482m1724Q6546K6448o6117j7395n5349K9647M4224l3072Q9811
$$ -158001 -113519 -155243 -68697 -42249 -108366 -125761 -181110 -151463 -107239 -140311 -50500
14763e0500J14041O4233l9349K5317k1614m3793J32700l8626r7791p3067l7670
$$ -50500 63541 127774 88425 113742 92128 48335 181035 142409 44618 -28449 -66119
14752f6119Q9212L5712o804k2996p8001l674P1046R1749j27371l8015n3979n4266
$$ -66119 23093 58805 52001 29005 -48996 -52670 18376 110125 -17246 -55261 -109240 -163506
14740a63506J01600L0717m2555N9288L6249j46212j7219J13884N56p0401q331
$$ -163506 -61906 -31189 -73744 -14456 21793 -124419 -141638 -27754 -27198 -97599 -105930
14729a05930j05374j54179J44336J66460R7145J01428L6790o4379n7660J7306
$$ -105930 -211304 -365483 -221147 -54687 42458 143886 180676 116297 58637 75943
14719G5943l8430j45367R0573J4411k6506m5226l6299j22082J4536O1380J50682
$$ 75943 37513 -107854 -17281 -2870 -29376 -74602 -110901 -232983 -218447 -157067 -6385
14708f385J12081n8619n5092m9979Q4770J479l7607p4193m0318L2515K1985O60
$$ -6385 105696 47077 -8015 -57994 26776 28255 -9352 -83545 -123863 -91348 -69363 -68703
14696f8703R552m004K3797N969j5919J1303j1356L3832l6248J6468R465J1818
$$ -68703 -59151 -63155 -39358 -33389 -49308 -38005 -49361 -15529 -51777 -35309 -25844 -14026
14684a4026r2548r9300J00067M2338l1727J1919J1442Q0931J04450k7286p7234
$$ -14026 -106574 -205874 -105807 -63469 -95196 -83277 -71835 9096 113546 86260 9026
14673I026p4509q1818M6382j0000l3317j56322J39512q6l6485K4366L9716R6561
$$ 9026 -65483 -147301 -100919 -110919 -144236 -300558 -161046 -161132 -197617 -173251 -133535 -36974
14661c6974q683j40086J59454J27566j00920j1832M3739P4932k4007L6185J18682
$$ -36974 -45657 -185743 -26289 101277 357 -11475 32264 107196 83189 119374 238056
14650B38056N2589L35r9556J0905j7970j02445o1064K868J13833m9495n7410p2552
$$ 238056 290645 290980 191424 202329 184359 81914 20850 23718 137551 88056 30646 -41906
14638d1906M6461J17737l2397p8008J41169K0430j04026l2360m6547Q1680J23573
$$ -41906 4555 122292 89895 11887 153056 173486 69460 37100 -9447 72233 195806
14627A95806J9205j45022p4273J9929J06010M1619j52929j99701k171n6593N3932
$$ 195806 215011 69989 -4284 15645 121655 163274 10345 -189356 -191527 -248120 -194188
14616a94188J44818J74167p005o9894l9951n8524q5290M9514Q2385M2083n5751
$$ -194188 -49370 124797 117792 47898 7947 -50577 -135867 -86353 -3968 38115 -17636
14605a7636n3179l1613o6345J47471K2045r2104j6702q3226N5216J44051J5410
$$ -17636 -70815 -102428 -168773 -21302 743 -91361 -108063 -191289 -136073 7978 23388
14594B3388J5386L2322L979r900l1486J482P4572N7693K1857L3666k4273j27137
$$ 23388 38774 71096 75075 65175 33689 35171 109743 167436 189293 222959 198686 71549
14582G1549n2635l2626l4285p3002M0473M7041J3936q390L6779M6492o0742p3103
$$ 71549 18914 -13712 -47997 -120999 -80526 -33485 -19549 -27939 8840 55332 -5410 -78513
14570g8513q6664K565j2879O1359l2840r0818k2239J39296L4910p1035L1831m0737
$$ -78513 -165177 -162612 -175491 -114132 -146972 -237790 -260029 -120733 -85823 -156858 -125027 -165764
14558a65764L2518R6949m8246j1461l5206k8496R6690J28647o9533j53538L0049
$$ -165764 -133246 -36297 -84543 -96004 -131210 -159706 -63016 65631 -3902 -157440 -127391
14547a27391Q3844O2331N7030K6703K3937r4676l860r9197N5124L6001M2752N6472
$$ -127391 -43547 18784 75814 102517 126454 31778 27918 -71279 -16155 19846 62598 119070
14535A19070q5424j57069O9060Q7265P1257p8712q7992O4278j65159j2227J23499
$$ 119070 33646 -123423 -54363 32902 104159 25447 -62545 1733 -163426 -175653 -52154
14524e2154J07037P6216j16984q2188p4509N9225r5859L0362J06232L2373r7421
$$ -52154 54883 131099 14115 -68073 -142582 -83357 -179216 -148854 -42622 -10249 -107670
14513a07670P3522M7162L2165L6680m9291j8092M9219j1100j6298L664k0884N0321
$$ -107670 -34148 13014 45179 81859 32568 14476 63695 52595 36297 39961 19077 69398
14501F9398j6454k7519j30402O6364p465j0317M2109J8322o4943n7990m7057J22089
$$ 69398 52944 25425 -104977 -38613 -46078 -56395 -14286 4036 -60907 -118897 -165954 -43865
14489d3865p607M310J3592k3204K8082q013j2236O1874q3241q1528j03301L057
$$ -43865 -51472 -47162 -33570 -56774 -28692 -36705 -48941 12933 -70308 -151836 -255137 -252080
14477b52080J09458K5103j5282N1004l6968m7994J03138N895j8865Q4145L836
$$ -252080 -142622 -117519 -132801 -81797 -118765 -166759 -63621 -57726 -76591 7554 11390
14466A1390Q4159N7887p4821j09212p2521R5714M0470n8528l2470J44335M3969
$$ 11390 95549 153436 78615 -30597 -103118 -7404 33066 -25462 -57932 86403 130372
14455A30372q3572q8297L1809J10432Q0923j37248j6271l1597j8580j26589O95
$$ 130372 46800 -41497 -9688 100744 181667 44419 28148 -3449 -22029 -148618 -147923
14444a47923m7450K1684J46043J13903m8165n4392M1025j0413q0896J0597l0903
$$ -147923 -195373 -173689 -27646 86257 38092 -16300 24725 14312 -66584 -55987 -86890
14433h6890O8620P8405N6740j09551j40105K3448M6223M7450n9264N6779L7605
$$ -86890 -18270 60135 116875 7324 -132781 -109333 -63110 -15660 -74924 -18145 19460
14422A9460o1465m4781k8553J1515J0814J6499J9992Q766m4321m9295J2517N4130
$$ 19460 -42005 -86786 -115339 -103824 -93010 -76511 -56519 -47753 -92074 -141369 -128852 -74722
14410g4722O4388j519O3473n1276M857K6490l4055K0411J5190p3150m6346p2609
$$ -74722 -10334 -11853 51620 344 5201 31691 -2364 18047 33237 -39913 -86259 -158868
14398a58868J990K0532J8546P6277j7411j15671p0836R7260J07126K26180k7435
$$ -158868 -156878 -136346 -117800 -41523 -58934 -174605 -245441 -148181 -41055 185125 157690
14387A57690j33593L2406O3175q6698j09213K1188R7423J18228k1308k06591j58634
$$ 157690 24097 56503 119678 32980 -76233 -55045 42378 160606 139298 -67293 -225927
14376b25927L4156J36800J25784j3656j41908l9489L2356K9915J49455k4841o5881
$$ -225927 -191771 -54971 70813 57157 -84751 -124240 -91884 -61969 87486 62645 -3236
14365c236Q3642J53693j12525q6555j33440K3061J06414L2762m1561J04567M3456
$$ -3236 80406 234099 121574 35019 -98421 -75360 31054 63816 22255 126822 170278
14354A70278j43502j43700r7344L9918K07657m3560l7906N818r8382j23876n0010
$$ 170278 26776 -116924 -214268 -174350 33307 -10253 -48159 -42341 -140723 -264599 -314609
14343c14609J58129j1337Q0058O2704O8343O7574N7467o5149j49162L513q918
$$ -314609 -156480 -167817 -87759 -25055 43288 110862 168329 103180 -45982 -42469 -51387
14332e1387j0568r6117p9511Q8641j9J16410J15094j40425j10377Q2567k0204
$$ -51387 -61955 -158072 -237583 -148942 -148961 -32551 82543 -57882 -168259 -85692 -105896
14321a05896q529l3730J14357M6571p5435j14797m8743N0095N4596j4407p052
$$ -105896 -114425 -148155 -33798 12773 -62662 -177459 -226202 -176107 -121511 -135918 -142970
14310a42970j2079m5721N1618M4808l9753M5546J77733O8299j9830Q2273j3888
$$ -142970 -155049 -200770 -149152 -104344 -144097 -98551 79182 147481 127651 209924 196036
14299A96036j51095j92328n6965J48560J06688k6647O7941J23878r2968j21744
$$ 196036 44941 -147387 -204352 -55792 50896 24249 92190 216068 123100 1356
14289A356m7840J1728K5272J03042O884K486O3146q3698j18311r5292J53217n8944
$$ 1356 -46484 -34756 -9484 93558 100442 102928 166074 82376 -35935 -131227 21990 -36954
14277c6954n9858k3038P3918J49076K1879r5832o8760K4706O7879J7776J565k1336
$$ -36954 -96812 -119850 -45932 103144 125023 29191 -39569 -14863 53016 70792 72357 51021
14265E1021L3547o279K082O9389j09617m1934n8573j38179R5131R6700j00798
$$ 51021 84568 78289 80371 149760 40143 -1791 -60364 -198543 -103412 -6712 -107510
14254a07510p0728j6206J03921Q1630n4813j8979M7212K3887k5410p517J37401
$$ -107510 -178238 -194444 -90523 -8893 -63706 -82685 -35473 -11586 -36996 -44513 92888
14243I2888m9638q0484J906J5282K4645P669M4220j74202j7393M4926O8949N3183
$$ 92888 43250 -37234 -35328 -20046 4599 12268 56488 -117714 -135107 -90181 -21232 31951
14231C1951N2722L5466j04335k3379M3296O9781J08829j27224q0192n2996j29660
$$ 31951 84673 120139 15804 -7575 35721 105502 214331 87107 6915 -46081 -175741
14220a75741K1204O8872J9605N7529O4338P1736J3745o608L6025r7321j5058P376
$$ -175741 -154537 -85665 -66060 -8531 55807 127543 141288 134680 170705 73384 58326 65702
14208F5702l6180m6281l832q406n6586k3111N2788l5337p9031J08463P0130n2814
$$ 65702 29522 -16759 -20591 -28997 -85583 -108694 -55906 -91243 -170274 -61811 8319 -44495
14196d4495O6298J49065O9725o4712j69324l7729O0071j9163J6141q5239m3387
$$ -44495 21803 170868 240593 175881 6557 -31172 28899 9736 25877 -59362 -102749
14185a02749Q362M3343J2922o9316j04214J35354P4432R8668L9399j6963r4397
$$ -102749 -94387 -51044 -38122 -107438 -211652 -76298 -1866 96802 136201 119238 24841
14174B4841p6646o0843Q7573R348o3558m8749p3021Q9583P5266Q0522o8444q4145
$$ 24841 -51805 -112648 -25075 -15727 -79285 -128034 -201055 -111472 -36206 44316 -24128 -108273
14162a08273L7410O6697L8157k6738j23169j14382J05434K9184j7772o4623K0715
$$ -108273 -70863 -4166 33991 7253 -115916 -230298 -124864 -95680 -113452 -178075 -157360
14151a57360P9745q3076O9949N0354J7808o7080j4890j5829j7208O7183L0354
$$ -157360 -77615 -160691 -90742 -40388 -22580 -89660 -104550 -120379 -137587 -70404 -40050
14140d0050k2448q9507k1279m4002l5515J38903Q2714l5614o7684M488K0570R7353
$$ -40050 -62498 -152005 -173284 -217286 -252801 -113898 -31184 -66798 -134482 -129994 -109424 -12071
14128a2071P0470N1935Q4605N4166r0500q7679n6304n6162M9470P8130K4202p3357
$$ -12071 58399 110334 194939 249105 158605 70926 14622 -41540 7930 86060 110262 36905
14116C6905O6372j8373J6399j51147l5439Q7691J29069K3699k3287r2349p2765
$$ 36905 103277 84904 101303 -49844 -85283 2408 131477 155176 131889 39540 -33225
14105c3225l1406M0244l846j03477n287P5737M2363J7423N2220n8258K5332P2427
$$ -33225 -64631 -24387 -28233 -131710 -136997 -61260 -18897 -1474 50746 -7512 17820 90247
14093I0247K98q4960r4700J9119P7140L9370j50240j1050K1818k2944L4428J5445
$$ 90247 90545 5585 -89115 -69996 7144 46514 -103726 -114776 -92958 -115902 -81474 -66029
14081f6029m6667l1772l3158N5369m0114N9027q5670M3977N4074N953o7427Q4647
$$ -66029 -112696 -144468 -177626 -122257 -162371 -103344 -189014 -145037 -90963 -85010 -152437 -67790
14069f7790l9174p9102p5552L7035J24386R2841K6123K5233O6741j18519j41Q1762
$$ -67790 -106964 -186066 -261618 -224583 -100197 -7356 18767 44000 110741 -7778 -7919 73843
14057G3843L014o1276l1870k9827J6516O8386N1413k6635K3754K4632p7895q682
$$ 73843 76857 15581 -16289 -46116 -29600 38786 90199 63564 87318 111950 34055 25373
14045B5373O0410N0802J38706K6090j20397k03026J5826N3962k1635k9746P9877
$$ 25373 85783 136585 275291 301381 180984 -22042 -6216 47746 26111 -3635 76242
14034G6242l8952r0076j6444J0678O9667j7976O4285q1044J08961N1960l9947
$$ 76242 37290 -52786 -69230 -58552 11115 -6861 57424 -23620 85341 137301 97354
14023I7354j83745j4259L3221L1620J8568J1986L1589N1826J1009j34293j6328
$$ 97354 -86391 -100650 -67429 -35809 -17241 -5255 26334 78160 89169 -45124 -61452
14012f1452O8038Q8039n8627r2648O3134K4497j8695l4196m3958J09730J2496
$$ -61452 6586 94625 35998 -56650 6484 30981 12286 -21910 -65868 43862 56358
14001E6358n1138K4242p2340k3014M1125o3704n8343j9478J25304K1382m0991
$$ 56358 5220 29462 -42878 -65892 -24767 -88471 -146814 -166292 -40988 -19606 -60597
13990f0597j26368J2038N3478k8276r8628j45030Q4220J34622O5668K8429N1749
$$ -60597 -186965 -174927 -121449 -149725 -248353 -393383 -309163 -174541 -108873 -80444 -28695
13979b8695L9917M3002N7309P3579O648n3019j08887l6660o9887K0295L3285R6808
$$ -28695 11222 54224 111533 185112 191760 138741 29854 -6806 -76693 -56398 -23113 73695
13967G3695J5047j36827J0776L393M5778k0833K8064j8979r3634L6282M8992n9224
$$ 73695 88742 -48085 -37309 -33916 11862 -8971 19093 114 -93520 -57238 -8246 -67470
13955f7470M6255O2355o5425n9549L9024M2478P9676Q1418m9087p7648l1683J6488
$$ -67470 -21215 41140 -24285 -83834 -44810 -2332 77344 158762 109675 32027 344 16832
13943A6832l7607L1497l938R3393J8722j60796m6759k610k7319q678P1940K9347
$$ 16832 -20775 10722 6784 100177 118899 -41897 -88656 -91266 -118585 -127263 -55323 -25976
13931b5976O314L4370j0391J50884M3554j54367n3953J00381m1570j43463n0416
$$ -25976 -19662 14708 4317 155201 198755 44388 -9565 90816 49246 -94217 -144633
13920a44633p3497j6254n0614J7905N2896J41310R3176K9210n9270r2419L1955
$$ -144633 -218130 -234384 -284998 -267093 -214197 -72887 20289 49499 -9771 -102190 -70235
13909g0235J00975n8751N596N0724p049q2337J7548q1306R7002M0463l0055O0933
$$ -70235 30740 -28011 -22415 28309 21260 -61077 -43529 -124835 -27833 12630 -17425 43508
13897D3508j15828m4687K5345O9128k2998N4756P1734K7000j6852M9990l3102
$$ 43508 -72320 -117007 -91662 -22534 -45532 9224 80958 107958 91106 141096 107994
13886A07994o7862n5265o2520j9980l2187p2402K1825Q3358k8214k3742r561o7704
$$ 107994 40132 -15133 -77653 -97633 -129820 -202222 -180397 -97039 -125253 -148995 -158556 -226260
13874b26260m202L1295J1952R8464J74590r9230j16033L9821m1709M1514N5734
$$ -226260 -230462 -199167 -187215 -88751 85839 -13391 -129424 -89603 -131312 -89798 -34064
13863c4064Q7630P5343o6399p5026J04290N1507k6591L9263j24542p2466K4877
$$ -34064 53566 128909 62510 -12516 91774 143281 116690 155953 31411 -41055 -16178
13852a6178n5099N7386k5118L002L5726o3839O6913O1086q3055r8314p5561n2056
$$ -16178 -71277 -13891 -39009 -36007 -281 -64120 2793 63879 -19176 -117490 -193051 -245107
13840b45107P4055m6656O8871p730M2564N8459n8522l4365p5205O1877L8765J23312
$$ -245107 -171052 -217708 -148837 -156567 -114003 -55544 -114066 -148431 -223636 -161759 -122994 318
13828C18m5322j8217J4812M9370m2064K7117J9121o3683m0532M0440J11438L9065
$$ 318 -45004 -63221 -48409 961 -41103 -13986 5135 -58548 -99080 -58640 52798 91863
13816I1863k23794p8532Q0564J20795Q3406n6499n2460R044l0234j24852n4974
$$ 91863 -131931 -210463 -129899 -9104 74302 17803 -34657 -25613 -55847 -180699 -235673
13805b35673M7633k5825Q0682N4598N167O1637k3481m9158j3970n6628j2669R7448
$$ -235673 -188040 -213865 -133183 -78585 -73418 -11781 -35262 -84420 -98390 -155018 -167687 -70239
13793g0239L2463O7811o7656p6609O4534M7632j25367n5896q542M7760R0598K4158
$$ -70239 -37776 30035 -37621 -114230 -49696 -2064 -127431 -183327 -191869 -144109 -53511 -29353
13781b9353j07757j01639R0112Q9783J933j59511R5258J12277R5525l0413r3087
$$ -29353 -137110 -238749 -148637 -58854 -56921 -216432 -121174 -8897 86628 56215 -36872
13770c6872P209O4977n0737m7383l4867o5023l8135K0927L4814N44q9111N2095
$$ -36872 -29663 35314 -15423 -62806 -97673 -162696 -200831 -179904 -145090 -144546 -233657 -181562
13758a81562J13530k0083J12601L610l6514N2552j9053n6581r7615O8863O2506
$$ -181562 -68032 -88115 24486 28096 -8418 44134 25081 -31500 -129115 -60252 2254
13747B254J056o6419j98756M5522K42598J38040m8367j16946j06922o3134R7308
$$ 2254 3310 -63109 -261865 -216343 26255 164295 115928 -1018 -107940 -171074 -73766
13736g3766k9286J3284Q8502L4737P273M3277O3214r468N0776j34264q8746j158
$$ -73766 -103052 -89768 -1266 33471 40744 84021 147235 137767 188543 54279 -34467 -35625
13724c5625j23259l3372P8760r1748O0739r637j750N6854K5291j9223J0929N2891
$$ -35625 -158884 -192256 -113496 -205244 -144505 -154142 -155892 -99038 -73747 -92970 -82041 -29150
13712b9150J67368Q2234q4912q5125n1925l2698K00362Q6824p4461K7478l4715
$$ -29150 138218 220452 135540 50415 -1510 -34208 166154 252978 178517 205995 171280
13701A71280J2881j43841L9303N1782o1392M69O4640n5655j19904L8680l578o6731
$$ 171280 184161 40320 79623 131405 70013 70482 135122 79467 -40437 -1757 -5335 -72066
13689g2066M0129L5101O1359L905m8682m0442l3807p6230M2654K9089k8149Q2466
$$ -72066 -31937 3164 64523 68428 19746 -20696 -54503 -130733 -88079 -58990 -87139 -4673
13677d673M9097k0902m344k6915J10413L724m4205j83930j07694J03519j4558
$$ -4673 44424 23522 19178 -7737 102676 106400 62195 -121735 -229429 -125910 -140468
13666a40468M4937Q7542P5466j1526R0987J2899p9568q2019o9733j0646K5347
$$ -140468 -95531 -7989 67477 55951 146938 159837 80269 -1750 -71483 -82129 -56782
13655e6782J12675J19461n4493l9001p2688r1534R132P6347m0359j06800n4897
$$ -56782 55893 175354 120861 81860 9172 -82362 -73230 3117 -37242 -144042 -198939
13644a98939J41715P3167n1038l3965m634n196N0080k0884m5764J27169N429r8943
$$ -198939 -57224 15943 -35095 -69060 -73694 -78890 -28810 -49694 -95458 31711 37140 -61803
13632f1803l7065K4915R3316p6901N5400j18451M776J29733J5844m1888q8300
$$ -61803 -98868 -73953 19363 -57538 -2138 -120589 -115813 13920 29764 -12124 -100424
13621a00424q3662L6128m7751p8120N8085J38670q718K3035M9783P0400j02684
$$ -100424 -184086 -147958 -195709 -273829 -215744 -77074 -85792 -62757 -12974 57426 -45258
13610d5258j75207k7579J0324K3320N8538M9535Q301j10555N0827J09260M8828
$$ -45258 -220465 -248044 -237720 -214400 -155862 -106327 -98026 -208581 -157754 -48494 334
13599C34J3237j1002N4903q279P4418J6546L2396k08675r3915J2911J29561J42482
$$ 334 13571 2569 57472 49193 123611 140157 172553 -36122 -130037 -117126 12435 154917
13587A54917Q3719L441q0738L2162r4798j9880o6937j99973k2577M9509l8561
$$ 154917 238636 242077 161339 193501 98703 78823 11886 -188087 -210664 -161155 -199716
13576a99716j0964J00675Q5963K625o2203j99225M8559J13024l9254o222j4219
$$ -199716 -210680 -110005 -24042 -21417 -83620 -282845 -234286 -121262 -160516 -166738 -180957
13565a80957Q5802R2266j8670n982n4533K159J8960L6120N2450Q0410j9473J10419
$$ -180957 -95155 -2889 -21559 -27541 -82074 -79915 -60955 -24835 27615 108025 88552 198971
13553A98971m8119m9581o1304L412M3455J12696l4029j66916k8289n88M6364O531
$$ 198971 150852 101271 39967 43379 86834 199530 165501 -1415 -29704 -30292 16072 22603
13541B2603o0863K8170J17221n499P069l7783p7260M9376N3551K5378j84896o5809
$$ 22603 -38260 -10090 107131 101632 108701 70918 -6342 43034 96585 121963 -62933 -128742
13529a28742J17409k6717L355k7505n5747j6573k7498J3232j5884J7364o2379
$$ -128742 -11333 -38050 -34695 -62200 -117947 -134520 -162018 -148786 -164670 -147306 -209685
13518b09685K6659n625J09229R0440o707j04052k9153O6368Q4997p8088N8963
$$ -209685 -183026 -188651 -79422 11018 4311 -99741 -128894 -62526 22471 -55617 3346
13507C346K5151n292Q6103J5638q4842m9038j4610q3717p511j14322o9212Q7454
$$ 3346 28497 23205 109308 124946 40104 -8934 -23544 -107261 -114772 -229094 -298306 -210852
13495b10852P1032L0861M2638J40034Q5681K3957k3372n8161p0849j5710Q9221
$$ -210852 -139820 -108959 -66321 73713 159394 183351 159979 101818 30969 15259 104480
13484A04480J4287j48733M0139q2944r605J5749J17752K6505r1175j1437J8317
$$ 104480 118767 -29966 10173 -72771 -82376 -66627 51125 77630 -13545 -24982 -6665
13473f665l5619o218j7209k0105P8374j475k212N9280J3348j01158j95007j761
$$ -6665 -42284 -48502 -65711 -85816 -7442 -8917 -11129 48151 61499 -39659 -234666 -236427
13461b36427R6248R2635N4796n737j07538J368Q2005J21657O8325n638l7700j69646
$$ -236427 -140179 -47544 7252 1515 -106023 -104655 -22650 99007 167332 161694 123994 -45652
13449d5652j4155o8534N7535k8594L4254Q0533p3070j43770m1687J18577J81201
$$ -45652 -59807 -128341 -70806 -99400 -65146 15387 -57683 -201453 -243140 -124563 56638
13438E6638R8088n594r6663p2977o0035m6723n6573J0076L2967j00554l9454L8986
$$ 56638 154726 149132 52469 -20508 -80543 -127266 -183839 -173763 -140796 -241350 -280804 -241818
13426b41818K4602J30117N6517n6229o196l8647j4457m8943P2870J6065m9550
$$ -241818 -217216 -87099 -30582 -86811 -93007 -131654 -146111 -195054 -122184 -106119 -155669
13415a55669m6002Q3676L8169M0433q6593J6025J05135J1677j6325m1021L5256
$$ -155669 -201671 -117995 -79826 -39393 -125986 -109961 -4826 6851 -9474 -50495 -15239
13404a5239k2581J0371k2146l8790P4278o2989N6258J8044K8961K5451J9860J8583
$$ -15239 -37820 -27449 -49595 -88385 -14107 -77096 -20838 -2794 26167 51618 71478 90061
13392I0061Q8969o2934j05020q465p1021k6847J6506P2377R7529j3381m4173m5970
$$ 90061 179030 116096 11076 2611 -68410 -95257 -78751 -6374 91155 77774 33601 -12369
13380a2369j24410n1489J09152o8942l0291L6852L9317j7055n1941k2299P3129
$$ -12369 -136779 -188268 -79116 -148058 -178349 -141497 -102180 -119235 -171176 -193475 -120346
13369a20346J08100M4318q0630J30742j1156j23359j25957L1882N1039R8216L8802
$$ -120346 -12246 32072 -48558 82184 71028 -52331 -178288 -146406 -95367 2849 41651
13358D1651k4157Q9154n842p6127L139n3670j07815O7705N4285p8651K8532Q7659
$$ 41651 17494 106648 100806 24679 27818 -25852 -133667 -65962 -11677 -90328 -61796 25863
13346B5863n2059l8901m1869K9164l4623p4339J7329J07974k1794L6682R26l232
$$ 25863 -26196 -65097 -106966 -77802 -112425 -186764 -169435 -61461 -83255 -46573 -45647 -48879
13334d8879K6672j26861o0795J5120J27260L4872K2356P0424J19019m6599m0298
$$ -48879 -22207 -149068 -209863 -194743 -67483 -32611 -10255 60169 179188 132589 92291
13323I2291K0659L897j02346m2304m4973j4026O6692n7900O1986Q8642n2490m3709
$$ 92291 112950 116847 14501 -27803 -72776 -86802 -20110 -78010 -16024 72618 20128 -23581
13311b3581l7063J2505R8301L5323p7023j04023l4803L1769o5546p9053K2231
$$ -23581 -60644 -48139 50162 85485 8462 -95561 -130364 -98595 -164141 -243194 -220963
13300b20963J2267J26330J02897k1578l9700l2871r6809K7081R5698Q9842J01152
$$ -220963 -208696 -82366 20531 -1047 -40747 -73618 -170427 -143346 -47648 42194 143346
13289A43346P889M041R5497L851r5391k02590o5236k5995q5095o4811k3257Q4762
$$ 143346 151235 155276 250773 254624 159233 -43357 -108593 -134588 -219683 -284494 -307751 -222989
13277b22989P7905M5411l7421O9486J07482J35404N0699j38007p9785k0850r6934
$$ -222989 -145084 -99673 -137094 -67608 39874 175278 225977 87970 8185 -12665 -109599
13266a09599j4979Q5844K8398l4762m843j69057q9739K3442N2660R9129J08504
$$ -109599 -124578 -38734 -10336 -45098 -49941 -218998 -308737 -285295 -232635 -133506 -25002
13255b5002O4288P577l6166p1327M5960n704k7462k8971R514J47134n4866o0500
$$ -25002 39286 46863 10697 -60630 -14670 -20374 -47836 -76807 -67293 79841 24975 -35525
13243c5525K2811Q597r7807k8309q6146k4849M3109j3502j5075O2094K7948j890
$$ -35525 -12714 -4117 -101924 -130233 -216379 -241228 -198119 -211621 -226696 -164602 -136654 -138544
13231a38544M5614M6130M5327l3989q2839r1287M4769N1818N5320J2999J18953
$$ -138544 -92930 -46800 -1473 -35462 -118301 -209588 -164819 -113001 -57681 -44682 74271
13220G4271r1558o8827M6679P8159k886l2245j26717j4459Q092Q6955Q1807l4506
$$ 74271 -17287 -86114 -39435 38724 35838 3593 -123124 -137583 -129491 -42536 39271 4765
13208D765n3203o3849k7396J1829J84878r2594r5529j3421m0295J32750M250o9904
$$ 4765 -48438 -112287 -139683 -127854 57024 -35570 -131099 -144520 -184815 -52065 -47815 -117719
13196a17719q474O9220M7320k3036l6397n4321m048J0266J22197O6635o8071J34039
$$ -117719 -126193 -56973 -9653 -32689 -69086 -123407 -127455 -117189 5008 71643 3572 137611
13184A37611J9606p5748n7477m4082R6954J50132j30123r4927n6267m2410m3565
$$ 137611 157217 81469 23992 -20090 76864 226996 96873 1946 -54321 -96731 -140296
13173a40296Q7013K5667p1411j01969Q9888j3388R935N7567K540R989R5244L1478
$$ -140296 -53283 -27616 -99027 -200996 -111108 -124496 -114561 -56994 -54454 -44465 50779 82257
13161H2257k0588J7514k5790j83435q0699n3539M5794Q1747m2442L1703N5949
$$ 82257 61669 79183 53393 -130042 -210741 -264280 -218486 -136739 -179181 -147478 -91529
13150i1529j6786J2407l2238N8219j3307j18332j01163M4758J21753O6144k9474
$$ -91529 -108315 -95908 -128146 -69927 -83234 -201566 -302729 -257971 -136218 -70074 -99548
13139i9548K130L5454L9166J2735K4331k840M306L5782m763L283N5044o9923j29461
$$ -99548 -97418 -61964 -22798 -10063 14268 11428 15734 51516 46753 50036 105080 35157 -94304
13126i4304R7141L2851k4495o0517j77297J01814P6906q9268R466P237P9113N1083
$$ -94304 2837 35688 11193 -49324 -226621 -124807 -47901 -137169 -127703 -120466 -41353 9730
13114I730j5113K8274k505l2405K9262p4966j8280M1448j32060p5007J23147J25728
$$ 9730 -5383 22891 20386 -12019 17243 -57723 -76003 -34555 -166615 -241622 -118475 7253
13102G253K9463K9614m302q2793o5672k0071k3848j0036J01947N1616p5692o7865
$$ 7253 36716 66330 62028 -20765 -86437 -106508 -130356 -140392 -38445 13171 -62521 -130386
13090a30386N9688J36626J6516l8578Q5324n0460Q230m1337k2685m5945J29604
$$ -130386 -70698 65928 82444 43866 129190 78730 86960 45623 22938 -23007 106597
13079A06597K5691o3550Q359K6412k5754J8978j3442p2562j29250k6032P1828
$$ 106597 132288 68738 77097 103509 77755 96733 83291 10729 -118521 -144553 -72725
13068g2725O8597l5324P5881r833k7062P772k3152p5787j04848J0272Q0237P0841
$$ -72725 -4128 -39452 36429 26596 -466 7306 -15846 -91633 -196481 -186209 -105972 -35131
13056c5131M8774J51883R8029M6478j33661n7837M4880J9540m7930p0806R7217
$$ -35131 13643 165526 263555 310033 176372 118535 163415 182955 135025 64219 161436
13045A61436j1648m4083q0554o4852p0675j8215Q3158l075n3126J5768K5786q424
$$ 161436 149788 105705 25151 -39701 -110376 -128591 -45433 -48508 -101634 -85866 -60080 -68504
13033f8504m8390q949L412L4657P5389J6223J0996L2631o6043l3554J2151K5301
$$ -68504 -116894 -125843 -122431 -87774 -12385 3838 14834 47465 -18578 -52132 -39981 -14680
13021a4680r7392K714J28170Q4184P5530L3249L1234r5666l5219p3031l5027K9632
$$ -14680 -112072 -109358 18812 102996 178526 211775 243009 147343 112124 39093 4066 33698
13009C3698L8693q743n5885j77073j14354N6793J84465J00489l4895J5926M107
$$ 33698 72391 63648 7763 -169310 -283664 -226871 -42406 58083 23188 39114 43221
12998D3221N7292l9389j13697K6490J801k04060n5338Q4499K1725Q3875L0576
$$ 43221 100513 61124 -52573 -26083 -24282 -228342 -283680 -199181 -177456 -93581 -63005
12987f3005p839J10095J1500q319K6894k9686j39879j7364N1347M0683l5872r8116
$$ -63005 -70844 39251 50751 42432 69326 39640 -100239 -117603 -66256 -25573 -61445 -159561
12975a59561K5091L8372j57967q3284L0148K06269L2372q7661n9855k8157R3231
$$ -159561 -134470 -96098 -254065 -337349 -307201 -100932 -68560 -156221 -216076 -244233 -151002
12964a51002R9685j8136J3701N6417P7751o3245j14760p7581R6658J02363k831
$$ -151002 -51317 -69453 -55752 665 78416 15171 -99589 -177170 -80512 21851 19020
12953A9020m9572j16091k593Q2105J10976O6623K1760n4005O0069l0887p6495
$$ 19020 -30552 -146643 -149236 -67131 43845 110468 132228 78223 138292 107405 30910
12942C0910P9882K02743N3120k40802r2960o6320n7090n5301l2497J47413R9648
$$ 30910 110792 313535 366655 125853 32893 -33427 -90517 -145818 -178315 -30902 68746
12931F8746J32279O9869l5104o6100p4245n8420k66704l0116O4385N9180Q2660
$$ 68746 201025 270894 235790 169690 95445 37025 -229679 -259795 -195410 -136230 -53570
12920e3570j884j03247m1315Q0024J10873P2908R5690j4604n4128o5390L8490
$$ -53570 -55454 -158701 -200016 -119992 -9119 63789 159479 144875 90747 25357 63847
12909F3847M5466k6783j45590K2700N4414K2788l5661r2222J08714K9713m9792
$$ 63847 109313 82530 -63060 -40360 14054 36842 1181 -91041 17673 47386 -2406
12898b406J5067K8681k3745J08805O7411k9804l7124l8708K940O2307J05588p5216
$$ -2406 12661 41342 17597 126402 193813 164009 126885 88177 91117 153424 259012 183796
12886A83796j4152N5251o7325k57476k8250K2633p9460J10179J11776J4487j00474
$$ 183796 169644 224895 157570 -99906 -128156 -105523 -184983 -74804 36972 51459 -49015
12875d9015r6551l2726O5376R6887Q642J8203r1561O5730o0195P860R7848m8272
$$ -49015 -145566 -178292 -112916 -16029 -7387 10816 -80745 -15015 -75210 -67350 30498 -17774
12863a7774q4458L7386L0142J3853J4753M0462K5806r1505k4816n822k6528J8195
$$ -17774 -102232 -64846 -34704 -20851 -6098 34364 60170 -31335 -56151 -61973 -88501 -70306
12851g0306J05339M1805k3918l9076k8982r3594j650J23473j41862n2155o9314
$$ -70306 35033 76838 52920 13844 -15138 -108732 -110382 13091 -128771 -180926 -250240
12840b50240m161J11119J29598Q801j0729K29489p9930j23529j476J22235K6215
$$ -250240 -254401 -143282 -13684 -4883 -15612 213877 133947 10418 8942 131177 157392
12829A57392l9890l6723m0412n0763k9787N207O9741j9108q9625r9582l1466P1736
$$ 157392 117502 80779 40367 -10396 -40183 -34976 34765 15657 -73968 -173550 -205016 -133280
12817a33280J01663L3105N1560L003p3454j37784M7229J5017k7560q1240L128
$$ -133280 -31617 1488 53048 56051 -17403 -155187 -107958 -92941 -120501 -201741 -198613
12806a98613N446O4315p9012J04733J32705l1437j32670m6199J61827O8379j1716
$$ -198613 -193167 -128852 -207864 -103131 29574 -1863 -134533 -180732 -18905 49474 37758
12795C7758J0716n7309j12052q7529m4295O4317K8034M518K28823m9795j20912
$$ 37758 48474 -8835 -120887 -208416 -252711 -188394 -160360 -155842 72981 23186 -97726
12784i7726k6461M4989P4893m3479j16360n8131O6401k9983n3512k1894J49336
$$ -97726 -124187 -79198 -4305 -47784 -164144 -222275 -155874 -185857 -239369 -261263 -111927
12773a11927J22369J09146J9167J43169K9651j44663j67790q169N8713p755j44302
$$ -111927 10442 119588 138755 281924 311575 166912 -878 -9047 49666 41911 -102391
12762a02391q492L388p1068R3224M6996o3171m4515j0313m784P2159J8123J19171
$$ -102391 -110883 -107495 -178563 -85339 -38343 -101514 -146029 -156342 -161126 -88967 -70844 48327
12750D8327L2142q1520l5140r6411N907J47502L9809k6446M734P394n6975n6640
$$ 48327 80469 -1051 -36191 -132602 -126695 20807 60616 34170 38904 46298 -10677 -67317
12738f7317m0885k9731N0436r8277L6920j19687m9721R9220Q7720J7041N2187
$$ -67317 -108202 -137933 -87497 -185774 -148854 -268541 -318262 -219042 -131322 -114281 -62094
12727f2094J36437j06814j07467r1076N7866M190N0826J90103M5575j23397M2328
$$ -62094 74343 -32471 -139938 -231014 -173148 -168958 -118132 71971 117546 -5851 36477
12716C6477r3520m4625O2669Q756n2207j2670J02568J17351j22020j77848Q8857
$$ 36477 -57043 -101668 -38999 -30243 -82450 -95120 7448 124799 2779 -175069 -86212
12705h6212J37719K0535K25N8206J2326j33782N4735m1249j85721p282J40025
$$ -86212 51507 72042 72267 130473 142799 9017 63752 22503 -163218 -170500 -30475
12694c0475L8381j27374K7657N9940J08680J71001l0465j56472j47252N4485M9429
$$ -30475 7906 -119468 -91811 -31871 76809 247810 217345 60873 -86379 -31894 17535
12683A7535j6532L8938J41088L7140j581j3534N7677r7225j60926j80545K2581
$$ 17535 1003 39941 181029 218169 216588 203054 260731 163506 2580 -177965 -155384
12672a55384M3006m3422O1018L8104P4599n1118p2321p7902K861J4282N8162K9910
$$ -155384 -112378 -155800 -94782 -56678 17921 -33197 -105518 -183420 -180559 -166277 -108115 -78205
12660g8205o163J12786k8369n5886K0733J4505p5863o9383J2126O851K5387n1435
$$ -78205 -84368 28418 49 -55837 -35104 -20599 -96462 -165845 -153719 -146868 -121481 -172916
12648a72916q5456o651J23991l2098m2454J34880J95727j6531o9014j02792J8010
$$ -172916 -258372 -265023 -141032 -173130 -215584 -80704 115023 98492 29478 -73314 -55304
12637e5304O731N695N1047N9566o4175M989J7791k1955j065k3680j12093r6311
$$ -55304 -48573 -42878 8169 67735 3560 8549 26340 4385 3320 -20360 -132453 -228764
12625b28764N8882j23325j68155K19703J25710M6796N2895J09289P6050j51674
$$ -228764 -169882 -293207 -461362 -241659 -115949 -69153 -16258 93031 169081 17407
12615A7407q9366r056N5029J35440K2980m5634n9431j43863J4588P8699L5366
$$ 17407 -71959 -81015 -25986 109454 132434 86800 27369 -116494 -101906 -23207 12159
12604A2159O1598M0683l2798R902J4411n1290o425N8965m2497l0086k6134L6411
$$ 12159 73757 114440 81642 91544 105955 54665 48240 107205 64708 34622 8488 44899
12592D4899o2138l6600j3885l1968L9243J01642Q2205j81797j03495L4945j0021
$$ 44899 -17239 -53839 -67724 -99692 -60449 41193 123398 -58399 -161894 -126949 -136970
12581a36970p1834R7805J24787J53075l3357j23628N3115m4044q567L5667J8518
$$ -136970 -208804 -110999 13788 166863 133506 9878 62993 18949 10382 46049 64567
12570F4567M892p9903K4634p574j8367j622J2563O221L4468o8487M9304m6247
$$ 64567 69459 -10444 14190 6616 -11751 -13373 -810 5411 39879 -28608 20696 -25551
12558b5551p9968k9096J29720Q9501j2467j05760J23648n8920p5346N7290l2403
$$ -25551 -105519 -134615 -4895 84606 72139 -33621 90027 31107 -44239 13051 -19352
12547a9352j91393p0995J19693J21989l043N7542O3279j09426k6123q752J7844
$$ -19352 -210745 -281740 -162047 -40058 -43101 14441 77720 -31706 -57829 -66581 -48737
12536d8737L4982Q4457J8538K0774m3395O0627j41498j22470l547J4397J25945
$$ -48737 -13755 70702 89240 110014 66619 127246 -14252 -136722 -140269 -125872 73
12525G3J30671N1788n7285j44937k7112K4885m5720p5533P6824J32991l2944j50824
$$ 73 130744 182532 125247 -19690 -46802 -21917 -67637 -143170 -66346 66645 33701 -117123
12513a17123n2916J16311J2846N3248O2638n5439o5839j143O3398J31446N3558
$$ -117123 -170039 -53728 -40882 12366 75004 19565 -46274 -47417 15981 147427 200985
12502B00985j11970r6475O093Q1471Q1101n4892j95694l4947N3698N4300K7921
$$ 200985 89015 -7460 -1367 80104 161205 106313 -89381 -124328 -70630 -16330 11591
12491A1591p2309l3948J6844l0416l1060N1271K0555O6326L1533q3471K4990N2915
$$ 11591 -60718 -94666 -77822 -108238 -139298 -88027 -67472 -1146 30387 -53084 -28094 24821
12479B4821o9640j07282Q440K7844L2053k5425m0698k0382n1456K1588J20078
$$ 24821 -44819 -152101 -143661 -115817 -83764 -109189 -149887 -170269 -221725 -200137 -80059
12468h0059l3406P046l4013M346J91129R0821k1293o6374k8484M3924J7775j2400
$$ -80059 -113465 -106419 -140432 -136086 55043 145864 124571 58197 29713 73637 91412 79012
12456G9012j08405M6948N9748o2245L2503J18516n5571m8272N836l5018p8489
$$ 79012 -29393 17555 77303 15058 47561 166077 110506 62234 68070 33052 -45437
12445d5437K9020o8330o3581Q8292M5123m0904o9151k715O5656J10902O7531L5578
$$ -45437 -16417 -84747 -148328 -60036 -14913 -55817 -124968 -127683 -62027 48875 116406 151984
12433A51984l0316p1369n3307N673L7553m8710J0745j313L2702O2744O8604n0696
$$ 151984 121668 50299 -3008 2665 40218 -8492 2253 940 33642 96386 164990 114294
12421A14294j11968j7238M8818N9077J2524o1811o275j19145m2686j23242K2031
$$ 114294 2326 -14912 33906 92983 105507 43696 37421 -81724 -124410 -247652 -225621
12410b25621R3951O2166J7337Q0139l1830M0122m7407j0362R6073M4272R005j4189
$$ -225621 -131670 -69504 -52167 27972 -3858 36264 -11143 -21505 74568 118840 127845 113656
12398A13656q3256K4118K438n5074n6508N4374J47795J31030J4961q1708j4196
$$ 113656 30400 54518 56956 1882 -54626 -252 147543 278573 293534 211826 197630
12387A97630j26061q1401n2399Q651M3070l398p720j29156P0652J66985J28174
$$ 197630 71569 -9832 -62231 -53580 -10510 -13908 -21628 -150784 -80132 86853 215027
12376B15027p8849M5444r0825p0779N4376j5619J6049l9516K3835Q4793j8670
$$ 215027 136178 181622 90797 20018 74394 58775 74824 35308 59143 143936 125266
12365A25266k919l2237j36980M620J6842P6972Q056O5429q4335n5719n302j5137
$$ 125266 122347 90110 -46870 -42250 -25408 51564 59620 125049 40714 -15005 -20307 -35444
12353c5444n4206k8619P6468O5712J7050q920J656r0632o3121J52185K58159R3967
$$ -35444 -89650 -118269 -41801 23911 40961 32041 33697 -56935 -120056 32129 290288 384255
12341C84255o2591j78738k44500p6128m0130J28401J84139J06568o7012j12274
$$ 384255 321664 142926 -101574 -177702 -217832 -89431 94708 201276 134264 21990
12331B1990l8318j0919P5049J8633l4408k9304j09888J02152K2236Q7918J09097
$$ 21990 -16328 -27247 47802 66435 32027 2723 -107165 -5013 17223 105141 214238
12320B14238K7743o6332l5935p9128r1599J66666J06591r8637n0601q4214J27898
$$ 214238 241981 175649 139714 60586 -31013 135653 242244 143607 93006 8792 136690
12309A36690l7600k1048J6726L8083k7477R620M1379l4466P38j22529j41026O0811
$$ 136690 99090 78042 94768 132851 105374 114994 156373 121907 122645 116 -140910 -80099
12297h0099N4579p1377j03795M4116J27462K6629K7008j2605m5053N7765j428
$$ -80099 -25520 -96897 -200692 -156576 -29114 -2485 24523 11918 -33135 24630 23202
12286B3202P6329J51374q175j04784k7099j15964M3123O3750j6297P1645J7600
$$ 23202 99531 250905 242730 137946 110847 -5117 38006 101756 85459 157104 174704
12275A74704p199n9996q564K3949O5028N5534o1887J04447L6461l6153j06326
$$ 174704 167505 107509 98945 122894 187922 243456 181569 286016 322477 286324 179998
12264A79998Q6900k6408o0953J67848P0602J3503l0588r2626J1576M8185k0644
$$ 179998 266898 240490 179537 347385 417987 431490 400902 308276 319852 368037 347393
12253C47393l9344r6605o4550k2724o9109M641k6644M2501P0521J442N6063J4658
$$ 347393 308049 211444 146894 124170 55061 59702 33058 75559 146080 147522 203585 218243
12241B18243j19509P5347k0542q7870n6727Q6322J10394j11443j26877P8939k0400
$$ 218243 98734 174081 153539 65669 8942 95264 205658 94215 -32662 46277 25877
12230B5877j22951o0404M994J54724O3869N4164J42065P2653q5801p2126J52364
$$ 25877 -97074 -157478 -152484 2240 66109 120273 262338 334991 249190 177064 329428
12219C29428K34042J364j18756j33461P6721Q659J8467K7054p5546m1677J8744
$$ 329428 563470 564834 446078 312617 389338 397997 416464 443518 367972 326295 345039
12208C45039j3527l3076r1716L6780Q0373O5124q0547l6489M5653n8963O5533
$$ 345039 331512 298436 206720 243500 323873 388997 308450 271961 317614 258651 324184
12197C24184N0965m9881P003j43778o1227M5821M7044J09138k2961k442m0553
$$ 324184 375149 325268 332271 188493 127266 173087 220131 329269 306308 303866 263313
12186B63313O3933L6362q8024n2805l5859K0332K0577J1133Q252o271J0614K8052
$$ 263313 327246 363608 275584 222779 186920 207252 227829 238962 247214 240943 251557 279609
12174B79609k986r5358K116J2303N8309K3340O2402L9922O5406j2186j21728p3566
$$ 279609 276623 181265 183381 195684 253993 277333 339735 379657 445063 432877 311149 237583
12162B37583l0130O1316j7041l5110J7997L0417J1606J6713Q3736K4698m0417
$$ 237583 207453 268769 251728 216618 234615 265032 276638 293351 377087 401785 361368
12151C61368K2783n4657l0113M4262O2037O8965k6721m2479P8938k5588J4823
$$ 361368 384151 329494 299381 343643 405680 474645 447924 405445 484383 458795 473618
12140D73618J709k6203j27458j21307n8687R6902M2110k5207L2607l4424r3746
$$ 473618 475327 449124 321666 200359 141672 238574 280684 255477 288084 253660 159914
12129A59914J03768P5872P6395q875j25820O1446N6895O5311L9794k9075Q7901
$$ 159914 263682 339554 415949 407074 281254 342700 399595 464906 504700 475625 563526
12118E63526m9106k03512K0766K50053k066p5959K0464J26863M1652p3814M4039
$$ 563526 514420 310908 331674 581727 579661 503702 524166 651029 692681 618867 662906
12107F62906Q6916J4893n2489j59124o8059M5043J7566O204N4608n7987p1444
$$ 662906 749822 764715 712226 553102 485043 530086 547652 553856 608464 550477 479033
12096D79033j8312l5348J00611J98915L5833L6623J9908p5974M4853Q6703n1601
$$ 479033 460721 425373 525984 724899 760732 797355 817263 741289 786142 872845 821244
12085H21244j08520r3598j03907P41Q1211K8249k8671J3527J22003J9381P7899
$$ 821244 712724 619126 515219 515960 597171 625420 596749 610276 732279 751660 829559
12074H29559L7166K4122j18606q4332J12786J62241J2847n9273q7244O5249N9213
$$ 829559 866725 890847 772241 687909 800695 962936 975783 916510 829266 894515 953728
12063I53728n9260q066m7161p3396N3775J16895J14045P4132j7067Q912j1488
$$ 953728 894468 886402 839241 765845 819620 936515 1050560 1124692 1107625 1116537 1105049
12052A105049n320q967Q058N423J36266m0310j3979k1577J3696n179R4484P9496
$$ 1105049 1099729 1090762 1098820 1104243 1240509 1200199 1186220 1164643 1178339 1173160 1267644 1347140
12040A347140j5657m7683R6890M9231L2096n4198m0673J6282K27768K26576q956
$$ 1347140 1331483 1283800 1380690 1429921 1462017 1407819 1367146 1383428 1611196 1837772 1828816
12029A828816n5943r7164j5165J13376O6801O7537N3534J05228R3374j9674j41973
$$ 1828816 1772873 1675709 1660544 1773920 1840721 1908258 1961792 2067020 2160394 2140720 1998747
12018A998747J08505K89827J80078j77071n1968m4845J26032J9355j1538j7002
$$ 1998747 2107252 2397079 2577157 2400086 2348118 2303273 2429305 2448660 2437122 2420120
12008B420120K545J43159J00476J66006J98774J40433Q5681j5108M5369N9205
$$ 2420120 2422665 2565824 2666300 2832306 3031080 3171513 3257194 3242086 3287455 3346660
11998C346660J6731J9361J47542J65925J49113J80389R2002J1669q887L0296P9620
$$ 3346660 3363391 3382752 3530294 3696219 3845332 4025721 4117723 4129392 4120505 4150801 4230421
11987D230421P1994J3912K53682R3657L8955J59884K17252L05185J92716J18901
$$ 4230421 4302415 4316327 4570009 4663666 4702621 4862505 5079757 5384942 5577658 5696559
11977E696559K25394J58721K85634K97825K49205J43438M6416K39482L74543L63376
$$ 5696559 5921953 6080674 6366308 6664133 6913338 7056776 7103192 7342674 7717217 8080593
11967H080593M13731K79091L37679K56485L55899M52375M05800M49961L51963
$$ 8080593 8494324 8773415 9111094 9367579 9723478 10175853 10581653 11031614 11383577
11958A1383577L63365N08206O46341O96754N99438O63658O36787P48399O63450
$$ 11383577 11746942 12255148 12901489 13598243 14197681 14861339 15498126 16246525 16909975
11949A6909975O87117P44089Q22795R69023J157779J160011J042519J131601J205038
$$ 16909975 17597092 18341181 19163976 20132999 21290778 22450789 23493308 24624909 25829947
11940B5829947J227766J264799J250649J430063J384600J500139J680143J433732
$$ 25829947 27057713 28322512 29573161 31003224 32387824 33887963 35568106 37001838
11932C7001838J253525J292586J277224J230476J192021R83961Q08765P72904
$$ 37001838 38255363 39547949 40825173 42055649 43247670 44231631 45040396 45813300
11924D5813300O67053L08273J37691J82324k02722l94520n77074p54860q51716
$$ 45813300 46480353 46788626 46926317 47108641 46905919 46511399 45934325 45179465 44327749
11915D4327749r91767j121403j149203j308658j342053j306515j271215j359101
$$ 44327749 43335982 42214579 41065376 39756718 38414665 37108150 35836935 34477834
11907C4477834j451134j432587j128296j009351j357737j153593j186595j096396
$$ 34477834 33026700 31594113 30465817 29456466 28098729 26945136 25758541 24662145
11899B4662145j137101q98293r87325r15435q23364p02607p71594q76749q45146
$$ 24662145 23525044 22626751 21639426 20723991 19900627 19198020 18426426 17549677 16704531
11890A6704531p15566m89610n70166o46697n59349m33242m02813n70315m73772
$$ 16704531 15988965 15499355 14929189 14282492 13723143 13289901 12887088 12316773 11843001
11881A1843001m34887l91069l19584l67704m58665m38164l41759k27671l15505
$$ 11843001 11408114 11017045 10697461 10329757 9871092 9432928 9091169 8863498 8547993
11872H547993k43476k21974k72483j79105k35013m05467l53120l66385j91134
$$ 8547993 8304517 8082543 7810060 7630955 7395942 6990475 6637355 6270970 6079836
11863F079836j54959j89291j33447q1919j23773q9853k21366j53703p2945r4181
$$ 6079836 5924877 5735586 5602139 5520220 5396447 5306594 5085228 4931525 4858580 4764399
11853D764399j3458P578j33035k24495k21129k62372k07011p4640k686Q1027j26058
$$ 4764399 4750941 4758519 4625484 4400989 4179860 3917488 3710477 3635837 3633151 3714178 3588120
11842C588120r2603p2481j39427J1340p4372j20534r6064l7095k2963j0848p654
$$ 3588120 3495517 3423036 3283609 3294949 3220577 3100043 3003979 2966884 2943921 2933073 2925419
11831B925419p0241o4473q4318r6380r1988R533m4748j37042j21055k6495n5952
$$ 2925419 2855178 2790705 2706387 2610007 2518019 2527552 2482804 2345762 2224707 2198212 2142260
11820B142260r0002l5645M2101L6582J3018R4312R658q9649k04898k9135Q138
$$ 2142260 2052258 2016613 2058714 2095296 2108314 2202626 2212284 2122635 1917737 1888602 1896740
11809A896740q23o1845O3393j18036j42023n0141J7985R1590q238m7611m0887
$$ 1896740 1895917 1834072 1897465 1779429 1637406 1587265 1605250 1696840 1688602 1640991 1600104
11798A600104O973j26055j31875Q419J08772R2642j1689j75150p2987n5715J1326
$$ 1600104 1607077 1481022 1349147 1357566 1466338 1558980 1547291 1372141 1299154 1243439 1254765
11787A254765R4854J02478l2881n0603l7108P4605L4070L090j12509o6559o7533
$$ 1254765 1349619 1452097 1419216 1368613 1331505 1406110 1440180 1443270 1330761 1264202 1196669
11776A196669k2861K627O0240m1118k3235q6013P7448J02695j22839j78765k5402
$$ 1196669 1173808 1176435 1236675 1195557 1172322 1086309 1163757 1266452 1143613 964848 939446
11765I39446R9988J215k19613l6142p1119J05362J15460R0622M5068q6768r3894
$$ 939446 1039434 1040649 821036 784894 713775 819137 934597 1025219 1070287 983519 889625
11754H89625j02566J6105k2263m03P7034k6526n231j12948j9839L5885J9975o3168
$$ 889625 787059 803164 780901 780498 857532 831006 825775 712827 692988 728873 748848 685680
11742F85680q7993M7723M1335K079J39744J02321m8598j25239j05698R0513P6508
$$ 685680 597687 645410 686745 688824 828568 930889 882291 757052 651354 741867 818375
11731H18375l0972j82598J4252o3181m4041K1246M4211R8661Q3961r6665m5541
$$ 818375 787403 604805 619057 555876 511835 533081 577292 675953 759914 663249 617708
11720F17708K8426M3411m436j38398L7272N759L5141O5179j6509j02738j51751
$$ 617708 646134 689545 685109 546711 583983 589742 624883 690062 673553 570815 419064
11709D19064l4670P2706O4183P3886k9649K6924N2237o8126j25520N1950j04315
$$ 419064 384394 457100 521283 595169 565520 592444 644681 576555 451035 502985 398670
11698C98670r4518j0563Q8412J60448r2746p0923M1729P1076m7199p46M726k5332
$$ 398670 304152 293589 382001 542449 449703 378780 420509 491585 444386 443640 448366 423034
11686D23034j29426K8446M8992p7088J00759P0189j88379r2210l1303K1922J00786
$$ 423034 293608 322054 371046 293958 394717 464906 276527 184317 153014 174936 275722
11675B75722N5148L0212J11825j10278j28824l562o4057J3505K35104J63393j18652
$$ 275722 330870 361082 472907 362629 233805 230243 166186 179691 414795 578188 459536
11664D59536m9371p3161m6834K8867K377j5020m4553l2957Q2205k236R4339j7321
$$ 459536 410165 337004 290170 319037 321414 306394 261841 228884 311089 308853 403192 385871
11652C85871o4188q9141l2533J09784j18545q937R5815L706n3649Q0757l1783
$$ 385871 321683 232542 200009 309793 191248 182311 278126 281832 228183 308940 277157
11641B77157j14381J12786N3564k5174P9638o3126m3834m733L5688Q115k882M1876
$$ 277157 162776 275562 329126 303952 383590 320464 276630 271897 307585 315700 312818 354694
11629C54694L2551m5891p7385P6492k0820q9952J11864P3440l2744m5855k5478
$$ 354694 387245 341354 263969 340461 319641 229689 341553 414993 382249 336394 310916
11618C10916R648j3666o0985k9507n0061j32391n10K3151J49904J4216K1155J57226
$$ 310916 320564 306898 245913 216406 166345 33954 33444 56595 206499 220715 241870 399096
11606C99096O6522r3684m1770q8045l3716l2295O8281q8225l0719P7776K8183
$$ 399096 465618 371934 330164 242119 208403 176108 244389 156164 125445 203221 231404
11595B31404p1713q3997j5150m6704L8483l0793j6861M7955R2393K6421n5143
$$ 231404 159691 75694 60544 13840 52323 21530 4669 52624 145017 171438 116295
11584A16295k3932r9820J77462K2957l6716j177j2505J0180J03973J06572j02906
$$ 116295 92363 -7457 170005 192962 156246 155069 142564 152744 256717 363289 260383
11573B60383j5475m6484K7831M8284l2822J01677O2491o4165j31809n1261K2916
$$ 260383 244908 198424 226255 274539 241717 343394 405885 341720 209911 158650 181566
11562A81566r61l3857J6583J3709L1083m8580m2340N1845L718R4926R887n8044
$$ 181566 180605 146748 163331 177040 208123 159543 117203 169048 172766 267692 277579 219535
11550B19535n1261P8109o005m1008P6285R2501n1920j35870j38219p621J65432
$$ 219535 168274 246383 240378 199370 275655 368156 316236 180366 42147 34526 199958
11539A99958N8311j4653p2671O9225P069k7807r965o4825m6806q561k94022j076
$$ 199958 258269 243616 170945 240170 247239 219432 209467 144642 97836 89275 -204747 -205823
11527b05823Q6008k4790M7417J52043J54472l6017J01489k179p1677j37139j00327
$$ -205823 -119815 -144605 -97188 54855 209327 173310 274799 272620 200943 63804 -36523
11516c6523J30374M0782m5020r2526n7763J7064M4975J15383K7531q7624P784
$$ -36523 93851 134633 89613 -2913 -60676 -43612 1363 116746 144277 56653 64437
11505F4437n1513O322p0416J07353L6377N80j53129Q5860R1826L2093R79L2702
$$ 64437 12924 19246 -51170 56183 92560 93140 -59989 25871 117697 149790 150769 183471
11493A83471m2296n5314J42535J1143N9223m4518l9324l2004m7935q2311m551
$$ 183471 141175 85861 228396 239539 298762 254244 214920 182916 134981 52670 48119
11482D8119L5063m1568j23298N6177R0579L1847J4235R7234M2942o2318J3314
$$ 48119 83182 41614 -81684 -25507 65072 96919 111154 208388 251330 189012 202326
11471B02326r3506q1380m0515k033L9846J56360j7194k8148n8062r5702R4714
$$ 202326 108820 27440 -13075 -15108 24738 181098 163904 135756 77694 -18008 76706
11460G6706J93783O0367j52735q1780j1024r4776K5854J36650J9220m3749q1578
$$ 76706 270489 330856 178121 96341 85317 -9459 16395 153045 172265 128516 46938
11449D6938j2958m7233J83403M9536m4370O7576k8552j13724j76319m6754n049
$$ 46938 33980 -13253 170150 219686 175316 242892 214340 100616 -75703 -122457 -127506
11438a27506O4502l674Q990O8222R6915J14489M7078p1799k3316L5753m1580j391
$$ -127506 -63004 -66678 -57688 10534 107449 221938 269016 197217 173901 209654 168074 166683
11426A66683O1183j4477m9994L0569J56283L2620r0231m8225k53511j39213M2353
$$ 166683 227866 213389 163395 193964 350247 382867 292636 244411 -9100 -148313 -105960
11415a05960J4074K3864j1334M8890l2760J3142j5613K7892M7559l3057l5815
$$ -105960 -91886 -68022 -79356 -30466 -63226 -50084 -65697 -37805 9754 -23303 -59118
11404e9118o3384n3967N1820k2589n8536Q6558j094R8986N2162k4837j2642m0349
$$ -59118 -122502 -176469 -124649 -147238 -205774 -119216 -120310 -21324 30838 6001 -6641 -46990
11392d6990k2370o1637N7960O3250J00888o6894m482J1520n5285K3741k4494j78121
$$ -46990 -69360 -130997 -73037 -9787 91101 24207 19725 31245 -24040 -299 -24793 -202914
11380b02914R3048P8960J05130L7571K7564q9777j00334k3321M0526j4390R5735
$$ -202914 -109866 -30906 74224 111795 139359 49582 -50752 -74073 -33547 -47937 47798
11369D7798J437j42358J709K2433N5402L9897J01670r8439o7192m0484j9851R2327
$$ 47798 49235 -93123 -91414 -68981 -13579 26318 127988 29549 -37643 -78127 -97978 -5651
11357e651j12145N141P0066l7793l720J28094R0329m2356P8612K0720K6852j23020
$$ -5651 -117796 -112655 -42589 -80382 -84102 43992 134321 91965 170577 191297 218149 95129
11345I5129r8612J5786q5757j9564J2144K0851j09301L6854k4037L2356M1101
$$ 95129 -3483 12303 -73454 -93018 -80874 -60023 -169324 -132470 -156507 -124151 -83050
11334h3050l370k2165J13494N0088K6181j9068J4397P1851J5020n5321j2377p0972
$$ -83050 -86420 -108585 4909 54997 81178 62110 76507 148358 163378 108057 95680 24708
11322B4708k5240l9303p3951N3423J29888L671J02533R720L1503l2290m5730p9786
$$ 24708 -532 -39835 -113786 -60363 69525 73196 175729 185449 216952 184662 138932 59146
11310E9146R856R0664n8190j19830J74580J14933j16933n1393l5846P6116p6279
$$ 59146 69002 159666 101476 -18354 156226 271159 154226 102833 66987 143103 66824
11299F6824m7312O1255M4701o7804m8866N2938N5458J9811M3587J1167N0048k106
$$ 66824 19512 80767 125468 57664 8798 61736 117194 137005 180592 191759 241807 239701
11287B39701j26842p243L5465j0588m3834q5216n3454p5895O8226K2037K528K7600
$$ 239701 112859 105616 141081 130493 86659 1443 -52011 -127906 -59680 -37643 -35115 -7515
11275g515J15100P8729l8106N067m4448l9984j32600j2474J09047q9744q0317
$$ -7515 107585 186314 148208 153275 108827 68843 -63757 -76231 32816 -56928 -137245
11264a37245o6302M4398K2315K6969K8914P4383j7205R8278M1454n7387j44897
$$ -137245 -203547 -159149 -136834 -109865 -80951 -6568 -23773 74505 115959 58572 -86325
11253h6325O7073K6567n1184m947j8461k8794j02259N8523N5080K1913o8390p6620
$$ -86325 -19252 7315 -43869 -48816 -67277 -96071 -198330 -139807 -84727 -62814 -131204 -207824
11241b07824J12400j3145Q896L4364J02312N8343r9041l9821L5498M5605m4184
$$ -207824 -95424 -108569 -99673 -65309 37003 95346 -3695 -43516 -8018 37587 -6597
11230f597m6799P6758O547J6992L4930K2359p5841k6428J4730P4684m6277o1030
$$ -6597 -53396 23362 29909 46901 81831 104190 28349 1921 16651 91335 45058 -15972
11218a5972M7247L9278j35704j78321J28716O6242N8560M0495j05868j6193M707
$$ -15972 31275 70553 -65151 -243472 -114756 -48514 10046 50541 -55327 -71520 -66813
11207f6813J8269K7286Q377j02125m3583l19k5598k5274N8240J20484J26370j2460
$$ -66813 -48544 -21258 -12881 -115006 -158589 -158908 -184506 -209780 -151540 -31056 95314 82854
11195H2854j12905r3278p0024L6908J40406p957K7325Q8788J37086j78297j72063
$$ 82854 -30051 -123329 -193353 -156445 -16039 -23996 3329 92117 229203 50906 -121157
11184a21157Q846J59638p2939j05460N689J24488N1268j11110p4520J1k011M2527
$$ -121157 -112311 47327 -25612 -131072 -125383 -895 50373 -60737 -135257 -135246 -137257 -94730
11172i4730J12648k0693N9336o1757M8874N7320j34087j20811q9262O1702P4004
$$ -94730 17918 -2775 56561 -5196 43678 100998 -33089 -153900 -243162 -181460 -107456
11161a07456M0742L0497O7505J6256k8633Q21q0241M7511O6336j3016k4445J444
$$ -107456 -66714 -36217 31288 47544 18911 19732 -60509 -12998 53338 40322 15877 17321
11149A7321k0383P7249k1607J30425J519j48887p4603N429o2582k7353P9397k512
$$ 17321 -3062 74187 52580 183005 184524 35637 -38966 -33537 -96119 -123472 -44075 -46587
11137d6587J19188J10869k7192j53050j35658q5780k7380R432J12059Q5559J6885
$$ -46587 72601 183470 156278 3228 -132430 -218210 -245590 -236158 -124099 -38540 -21655
11126b1655o27j2087M7739J142M230k4009j4621k7919m3192K9194K05065J7318
$$ -21655 -22282 -34369 13370 14512 18742 -5267 -19888 -47807 -90999 -61805 143260 160578
11114A60578o9475o7172j11295L7843k9596L8936R6467O435M8210j20417r2952
$$ 160578 91103 23931 -87364 -49521 -79117 -40181 56286 62721 110931 -9486 -102438
11103a02438j2933j7404J28703J44534m1692q202p551j11887p6727j4597j3783
$$ -102438 -115371 -132775 -4072 140462 98770 90568 83017 -28870 -105597 -120194 -133977
11092a33977p0674j0948N7008J1331J0240l5745N6420J69404l82M3957J291j01238
$$ -133977 -204651 -215599 -158591 -147260 -137020 -172765 -116345 53059 52677 96634 97925 -3313
11080c313j7808R579K9695l5368l8287q4982n937l2454J00307J29289k1657m9709
$$ -3313 -21121 -11542 18153 -17215 -55502 -140484 -146421 -178875 -78568 50721 29064 -20645
11068b0645J580k14757o2427L5332k8733q6306n3105J92236J51603J24834O4771
$$ -20645 -19065 -233822 -296249 -260917 -289650 -375956 -429061 -236825 -85222 39612 104383
11057A04383k4790j02081o6750M6954j09656n7594R3069Q5920J22452p2748p0306
$$ 104383 79593 -22488 -89238 -42284 -151940 -209534 -116465 -30545 91907 19159 -51147
11046e1147O1080q3708L5174J16739n6474j2104P498J43162L8219N653O2488N7091
$$ -51147 9933 -73775 -38601 78138 21664 9560 17058 160220 198439 204092 266580 323671
11034C23671J10617Q096M6809N5657P2338L4142j4388J3623R1948K20108J48267
$$ 323671 434288 442384 489193 544850 617188 651330 636942 650565 742513 962621 1110888
11023A110888j27165j09135j28315m9854N0048k0005J75455K58010J45262J32336
$$ 1110888 983723 874588 746273 696419 746467 726462 901917 1159927 1305189 1437525
11013A437525J30634Q5578j91153k14562j37860j58210m8250m2234J9543M39P3579
$$ 1437525 1568159 1653737 1462584 1248022 1110162 951952 903702 861468 881011 881450 955029
11002I55029J09556N9747p7812k1197k12637j74623N1330n4842r6139k5411j0376
$$ 955029 1064585 1124332 1046520 1025323 812686 638063 689393 634551 538412 513001 502625
10991E02625K5700j06079l170R6015n3051j23780k7823k7711j09134L733o2840
$$ 502625 528325 422246 419076 515091 462040 338260 310437 282726 173592 177325 114485
10980A14485l9583K5971k4558q512Q8640j01983p628k0337R0648n8537q2509r0356
$$ 114485 74902 100873 76315 67803 156443 54460 46832 26495 117143 58606 -23903 -114259
10968a14259L0341O465J01714o9275J42538O6384o338j06164l5177j08134l7699
$$ -114259 -83918 -77453 24261 -45014 97524 163908 157570 51406 16229 -91905 -129604
10957a29604J1502q7825L2171M9801K9280n3074J4365J07320k2921j39023J02577
$$ -129604 -118102 -205927 -173756 -123955 -94675 -147749 -133384 -26064 -48985 -188008 -85431
10946h5431O2232p9370j1540R0015J3323J1007p3092n8657j9728N7988J47104
$$ -85431 -23199 -102569 -114109 -24094 -10771 236 -72856 -131513 -151241 -93253 53851
10935E3851K3457j08618p0984m8652k9886O6238J03485N9156r1032O9022R0497
$$ 53851 77308 -31310 -102294 -150946 -180832 -114594 -11109 48047 -42985 26037 116534
10924A16534j6131p9476o1091O4162P7730j5707r7216l4904r5463j5529R3028
$$ 116534 100403 20927 -40164 23998 101728 86021 -11195 -46099 -141562 -157091 -64063
10913f4063p7582L1344L1646Q0347O2224J8728o6845j1006M2581n249N3966l8254
$$ -64063 -141645 -110301 -78655 1692 63916 82644 15799 4793 47374 42125 96091 57837
10901E7837p2774k1222J9765L8518J08067j23484o5458L7306O1858J183j26703
$$ 57837 -14937 -36159 -16394 22124 130191 6707 -58751 -21445 40413 41596 -85107
10890h5107j05315L743O1684J32699K4224n0873r0446r5746Q879J16987K03515
$$ -85107 -190422 -186679 -124995 7704 31928 -18945 -109391 -205137 -196258 -79271 124244
10879A24244O6669k9092n9260j51585k5355k1562j445l3866K4147L8731j1690
$$ 124244 190913 161821 102561 -49024 -74379 -95941 -97386 -131252 -107105 -68374 -80064
10868h0064O1977k0107n2890N4183J2404o7872q9507Q3860M1702j33462n2918
$$ -80064 -18087 -38194 -91084 -36901 -24497 -92369 -181876 -98016 -56314 -189776 -242694
10857b42694J22183K616m3151M6789n9237r4351J03114J19416J28455l4137n325
$$ -242694 -120511 -117895 -161046 -114257 -173494 -267845 -164731 -45315 83140 49003 43678
10846D3678j1214M7734m0170k3754j23882j29127O0626j0818J01991O1534k745
$$ 43678 32464 80198 40028 16274 -107608 -236735 -176109 -186927 -84936 -23402 -26147
10835b6147k2892N4349J18238p6462o6496m0734K4274p7649K3773J56099n9878
$$ -26147 -49039 5310 123548 47086 -19410 -60144 -35870 -113519 -89746 66353 6475
10824F475n1779J51325p3996j35493o250P2786O5045J0029l0855O558J77709P1631
$$ 6475 -45304 106021 32025 -103468 -109718 -36932 28113 38142 7287 13845 191554 263185
10812B63185k6460l5520k9752K1461L5088j86563j13206J5751L2522r4062p5874
$$ 263185 236725 201205 171453 192914 228002 41439 -71767 -56016 -23494 -117556 -193430
10801a93430m6329J36860J07421q6319q136K2983k2360M188J2738O4612r0154
$$ -193430 -239759 -102899 4522 -81797 -89933 -66950 -89310 -85122 -72384 -7772 -97926
10790i7926O2474J13616J4629o7779o3493l6579n3213O1918J06361o969m8610
$$ -97926 -35452 78164 92793 25014 -38479 -75058 -128271 -66353 40008 33039 -15571
10779a5571q7703K9018j7517L0924n9852R8802K6011r2992j39071K8914j9463
$$ -15571 -103274 -74256 -91773 -60849 -120701 -21899 4112 -88880 -227951 -199037 -218500
10768b18500R3173K3665r8666Q3062P3046j09491q035K283j1738l9894L3688l6523
$$ -218500 -125327 -101662 -200328 -117266 -44220 -153711 -161746 -159463 -171201 -211095 -177407 -213930
10756b13930p702J15579p248L8770l6077q4567j8406J07557j1662j0268o2521
$$ -213930 -221632 -106053 -113301 -74531 -110608 -195175 -213581 -106024 -117686 -127954 -190475
10745a90475j24098J09260J27837n1225l5936M4428o8225O96K7434L4242r0202
$$ -190475 -314573 -205313 -77476 -128701 -164637 -120209 -188434 -187738 -160304 -126062 -216264
10734b16264J7120K4115j7603p5184P659o1345j00591M0259O3331L0552P8893
$$ -216264 -199144 -175029 -192632 -267816 -260157 -321502 -422093 -381834 -318503 -287951 -209058
10723b09058l8022q2370N8929J97393J36906p5938p7380N5509j6303r4426j1104
$$ -209058 -247080 -329450 -270521 -73128 63778 -12160 -89540 -34031 -50334 -144760 -155864
10712a55864Q0139R3626L0018J20154K8991m5291m4478J6511j37303J1561M5211
$$ -155864 -75725 17901 47919 168073 197064 151773 107295 123806 -13497 -1936 43275
10701D3275q8697l0681o818P7827J0394l0295j2348J23636O774j01201K1832J19609
$$ 43275 -45422 -76103 -82921 -5094 5300 -24995 -37343 86293 93067 -8134 13698 133307
10689A33307m595l4344j26498j33823m5016n847m0575J58632J47183m5704j1205
$$ 133307 128712 94368 -32130 -165953 -210969 -216816 -257391 -98759 48424 2720 -8485
10678h485J32808j14252k7834J00312L9683k3568n8459j53002j46821Q7924J39151
$$ -8485 124323 10071 -17763 82549 122232 98664 40205 -112797 -259618 -171694 -32543
10667c2543M3926K6733L8246O3225j3868m4448k6546O3737J22261J80104J0881
$$ -32543 11383 38116 76362 139587 125719 81271 54725 118462 240723 420827 431708
10656D31708j71801j42593o1239p4575J29407R9998O1939O6096J20379J10429
$$ 431708 259907 117314 56075 -18500 110907 210905 272844 338940 459319 569748
10646E69748J33325K12403L41842K65137J00916J29625K01227o8922j27136j39718
$$ 569748 703073 915476 1257318 1522455 1623371 1752996 1954223 1885301 1758165 1618447
10636A618447k72449j40449n2708O6161J02946K76982M11206L66223M04514N87919
$$ 1618447 1345998 1205549 1152841 1219002 1321948 1598930 2010136 2376359 2780873 3368792
10626C368792P48014R37655J025033R53917P25665L30392J57716J63734N62600
$$ 3368792 4116806 5054461 6079494 7033411 7759076 8089468 8247184 8410918 8973518
10617H973518J001186J333565K014754K987856L835773N057979O573678Q430421
$$ 8973518 9974704 11308269 13323023 16310879 20146652 25204631 31778309 40208730
10609D0208730J0566365J2569033J3128881J0468360N341548L17949k851809k947597
$$ 40208730 50775095 63344128 76473009 86941369 92282917 92600866 89749057 86801460
10601H6801460p38785K926527P869175J3787202K0293712K5734137K6099796J7925214
$$ 86801460 86062675 88989202 96858377 110645579 130939291 156673428 182773224 200698438
10593B00698438M203988q817774j5604852j5157799r523892j497838P381082J7005682
$$ 200698438 204902426 196084652 180479800 165322001 155798109 154300271 161681353 178687035
10585A78687035K6676589L3495824L1451828J7016085m240697k2718703l1482713
$$ 178687035 205363624 238859448 270311276 287327361 283086664 260367961 228885248
10578B28885248k9673548k1915647j2640815l544037N051410J2654001J7105375
$$ 228885248 199211700 177296053 164655238 161111201 166162611 178816612 195921987
10571A95921987J4564487L889841j0566234k1886804k6154714k3528107j7596054
$$ 195921987 210486474 214376315 203810081 181923277 155768563 132240456 114644402
10564A14644402j1304182n809670j116420K198260L635437K102318k460946p967279
$$ 114644402 103340220 97530550 96414130 98612390 102247827 104350145 101889199 93921920
10556I3921920j2102815j3655506j2618176j0280736p911849n968367m515965
$$ 93921920 81819105 68163599 55545423 45264687 37352838 31384471 26868506
10549B6868506l313894k674354k270352j870246j595312j339220j058048r26463
$$ 26868506 23554612 20880258 18609906 16739660 15144348 13805128 12747080 11820617
10541A1820617r54126r42825o92015o12325m99035m80361n34734m66429m36246
$$ 11820617 10866491 9923666 9231651 8619326 8120291 7639930 7105196 6638767 6202521
10532F202521k99390k94053l15153j47626k36398l29554j67367k39453j77602
$$ 6202521 5903131 5609078 5293925 5146299 4909901 4580347 4412980 4173527 3995925
10523C995925j05575k12257j74491j64780k09247j66147r3855J3227j40988j57634
$$ 3995925 3890350 3678093 3503602 3338822 3129575 2963428 2869573 2882800 2741812 2584178
10513B584178j83733Q376k4847Q297n1158j27152k01930l033m0598j17477j65550
$$ 2584178 2400445 2408821 2383974 2392271 2341113 2213961 2012031 2008998 1968400 1850923 1685373
10502A685373r1788n3085R3100P1670l1791q6876M1349q129o2321l7991j41788
$$ 1685373 1593585 1540500 1633600 1705270 1673479 1586603 1627952 1619823 1557502 1519511 1377723
10491A377723j13705M9901J6078p4593j24510J4401p9890J015J30881Q0739j4644
$$ 1377723 1264018 1313919 1329997 1255404 1130894 1145295 1065405 1066420 1197301 1278040 1263396
10480A263396q5057P757n8500j65340o9493P1280N1882k1168N4914m6159k30075
$$ 1263396 1178339 1186096 1127596 962256 892763 964043 1015925 994757 1049671 1003512 773437
10469G73437j03373R900l3693k0672P7911J23784j09365J2486K3232j01901p9301
$$ 773437 670064 679964 646271 625599 703510 827294 717929 730415 753647 651746 572445
10458E72445J72011P8728J12246J18091N1683R952o5757r7466q7932N3672Q4639
$$ 572445 744456 823184 935430 1053521 1105204 1115156 1049399 951933 864001 917673 1002312
10447A002312j18247j66089p0547N0434J45286R0551N8646J19712l2617j03341
$$ 1002312 884065 717976 647429 697863 843149 933700 992346 1112058 1079441 976100
10437I76100j09046k03797k1882L6471J05425K5558J4981p6062j57869k4449J00770
$$ 976100 867054 663257 641375 677846 783271 808829 823810 747748 589879 565430 666200
10426F66200J3357l0932n2720M2567R8308K0095q2033p2282l413k9018m4418j1507
$$ 666200 679557 648625 595905 638472 736780 756875 674842 602560 599147 570129 525711 514204
10414E14204J03222J14233n4532m8314l0203n4595j08791l3572n1601N9991l0772
$$ 514204 617426 731659 677127 628813 598610 544015 435224 401652 350051 410042 379270
10403C79270m1243M2210J520J56588K54465J8786r3193R645q3345K9319K4878
$$ 379270 338027 380237 381757 538345 792810 811596 718403 728048 644703 674022 698900
10392F98900k2150j31725q216N663k2430j0387K5731k5454m9256J5805M9721J67971
$$ 698900 676750 545025 536809 542472 520042 509655 535386 509932 460676 476481 526202 694173
10380F94173N9770L824J11634k2490q6663m4155p324p3291O666L6916J0303J2514
$$ 694173 753943 757767 869401 846911 760248 716093 708769 635478 642144 679060 689363 701877
10368G01877j7015K5164L796J1463k6951N4788L4632j3995q2929j09545j64633
$$ 701877 684862 710026 713822 725285 698334 753122 787754 773759 690830 581285 416652
10357D16652J05568N5913O2777O5394p182o0102r2612o0232n8747m558K3982J06866
$$ 416652 522220 578133 640910 706304 699122 639020 546408 486176 427429 422871 446853 553719
10345E53719O9955j21506q2370Q8939Q1152k8559k7547k6512q3684p2549O9222
$$ 553719 623674 502168 419798 508737 589889 561330 533783 507271 423587 351038 420260
10334D20260n828L5345n9281J919j5575J23861J56345m9156j87432j36150R6844
$$ 420260 414432 449777 390496 392415 376840 500701 657046 607890 420458 284308 381152
10323C81152J37514J05253J94379J66684J44980M866j53944j44931j00855j51084
$$ 381152 518666 623919 818298 984982 1129962 1134828 980884 835953 735098 584014
10313E84014n1898q1508m3764m0593n4394P2984P0682K8610l8280m2917N2354
$$ 584014 532116 450608 406844 366251 311857 384841 455523 484133 445853 402936 455290
10302D55290L4578L9691j07996j63643l7055o7401m0799J06796R3748J55844l1136
$$ 455290 489868 529559 421563 257920 220865 153464 112665 219461 313209 469053 437917
10291D37917o6936l8602Q3054J23418O9972L5392j05168j4031p8197J3703p0651
$$ 437917 370981 332379 415433 538851 608823 644215 539047 525016 446819 460522 389871
10280C89871j9858m1521N399J14086r419j11443q1634P4046J74330Q9891K0780
$$ 389871 370013 328492 333891 447977 438558 327115 245481 319527 493857 583748 604528
10269F04528l3636L9554K51475K71422J84655L89773M40473M73899N47007M58902
$$ 604528 570892 610446 861921 1133343 1317998 1707771 2148244 2622143 3169150 3628052
10259C628052K81390M02957J52941O7844j04776l36663m49321m06264m92812m58752
$$ 3628052 3909442 4312399 4465340 4533184 4428408 4091745 3642424 3236160 2743348 2284596
10249B284596m32727k98982l78368k59720j37707r6146l4574L2901l1753k165
$$ 2284596 1851869 1552887 1174519 914799 777092 680946 646372 679273 647520 645355
10239F45355n4048m4419m3036j03349j18861m367K0193q8178K5864K9069Q3793
$$ 645355 591307 546888 503852 400503 281642 277275 297468 209290 235154 264223 348016
10228C48016Q9251n3150j14945K0459J27326p2557o9659k85P1037O1337L0726
$$ 348016 437267 384117 269172 289631 416957 344400 274741 274456 345493 406830 437556
10217D37556K5120m3061j31409r8359J8315j3588q0961J6132J7588J9138R2227
$$ 437556 462676 419615 288206 189847 208162 194574 113613 129745 147333 166471 258698
10206B58698M9904r2450J0598r8099j05064P3863Q4490J5368j7119m5246j31752
$$ 258698 308602 216152 226750 128651 23587 97450 181940 197308 180189 134943 3191
10195C191k9222J44696J36415r779p729K9237J17326P5992j48738n6432M6916
$$ 3191 -26031 118665 255080 245301 237572 266809 384135 460127 311389 254957 301873
10184C01873j9332n1958L334L5061P4668L8826m6234k3918J49596J42984N5258
$$ 301873 282541 230583 233917 268978 343646 382472 336238 312320 461916 604900 660158
10173F60158n6186j3008J42046P6733p438Q0202m0073j65q6448n325K6176j1360
$$ 660158 603972 590964 733010 809743 802305 882507 842434 842269 755821 750496 776672 765312
10161G65312N5732K11046K63492Q7577n1373j9987q4087k9190r7665m2324M5537
$$ 765312 821044 1032090 1295582 1383159 1331786 1311799 1227712 1198522 1100857 1058533 1104070
10150A104070Q0024J02677K43079J81409R6525j1334M1919j44356k17978j67151
$$ 1104070 1184094 1286771 1529850 1711259 1807784 1796450 1838369 1694013 1476035 1308884
10140A308884q7762j01354L1948J08800J70299R4913J12070j25285l06810k28374
$$ 1308884 1221122 1119768 1151716 1260516 1430815 1525728 1637798 1512513 1205703 977329
10130I77329r2960j63486r1924L3942J23708m2454r3224K0731J15622L9061o3139
$$ 977329 884369 720883 628959 662901 786609 744155 650931 671662 787284 826345 763206
10119G63206j4037N8417j20670j29032q6389j22845m4221M2319o7022j41681J8318
$$ 763206 749169 807586 686916 557884 471495 348650 304429 346748 279726 138045 156363
10108A56363l0L0128O6447m6932J3463Q6518N9301j15485Q653o7566m3833Q878
$$ 156363 156333 186461 252908 205976 219439 305957 365258 249773 258426 190860 147027 155905
10096A55905L8100p4189l4018L1603Q588L0710M6877J52777M7862r6253n4876
$$ 155905 194005 119816 85798 117401 125989 156699 203576 356353 404215 307962 253086
10085B53086K188J51264M8974o5375k10896j33915M6879J628J4699J20032K3984
$$ 253086 255274 406538 455512 390137 179241 45326 92205 93833 108532 228564 252548
10074B52548J982q7203N5369n573p988R0602K8758r85N1256p3458l4895j9662
$$ 252548 254530 167327 222696 217123 209135 299737 328495 327510 378766 305308 270413 250751
10062B50751m0261Q845J35073k03L430M6878j00198k8513p8378J9754j893k9416
$$ 250751 210490 219335 354408 354205 357635 404513 304315 275802 197424 217178 215285 185869
10050A85869J1654N8176m625O7776R9954J40612J10388p234r0743P0051J7066
$$ 185869 197523 255699 251074 318850 418804 559416 669804 662570 571827 641878 658944
10039F58944j20304j13960j395j05849p1479L4179K2723p6639j03211j0227M0278
$$ 658944 538640 424680 423285 317436 245957 280136 302859 226220 123009 112782 153060
10028A53060R5229K4490L8330o824N2265N2697m7821j52141r1288L9027L189K2527
$$ 153060 248289 272779 311109 304285 356550 409247 361426 209285 117997 157024 160213 182740
10016A82740r0474M5719k8665r2386M5495N3177k4067L5939L7560J02686M0829
$$ 182740 92266 137985 109320 16934 62429 115606 91539 127478 165038 267724 308553
10005C08553L2921r922j9639R749O1918O663k851J05755J6283r5342l7889m4919
$$ 308553 341474 331552 311913 321662 383580 390243 387392 493147 509430 414088 376199 331280
9993C31280P7212R9229o0381k17351k5526J8943n5577J7213l375J30740R3430
$$ 331280 408492 507721 447340 229989 204463 223406 167829 185042 181667 312407 405837
9982D05837J01187l6114k4944L691K6193k7220j02j60094j63134r342O3645K5450
$$ 405837 507024 470910 445966 449657 475850 448630 448528 288434 125300 115958 179603 205053
9970B05053P9547q8005k00276q0632P4792K3696K6952J61143J6575o6164K9429
$$ 205053 284600 196595 -3681 -84313 -9521 14175 41127 202270 218845 152681 182110
9959A82110R0411J05813j7871j50096p8800J7166p8829p9773P0859j2888K2219
$$ 182110 272521 378334 360463 210367 131567 148733 69904 -9869 60990 48102 70321
9948G0321K065O1337J25869o6825j26850j41354k6104J35193R3262m4661J7452
$$ 70321 72386 133723 259592 192767 65917 -75437 -101541 33652 126914 82253 99705
9937I9705m9569j4935K6647k3458J4756J8455J22596P0260j14596q0776l5032
$$ 99705 50136 35201 61848 38390 53146 71601 194197 264457 149861 69085 34053
9926C4053N8980k3967m216R1490m327k6277L0846J14559O2023r3850j11055j2998
$$ 34053 93033 69066 64850 156340 152013 125736 156582 271141 333164 239314 128259 115261
9914A15261m3319j4001J16459J23179m1848r4875n0624L8027M4233j30344q9193
$$ 115261 71942 57941 174400 297579 255731 160856 110232 148259 192492 62148 -27045
9903b7045p171p054j7659K5631J3910L2135P7195n3627k2096N2455M6235J6196
$$ -27045 -34216 -41270 -58929 -33298 -19388 12747 89942 36315 14219 66674 112909 129105
9891A29105J54155r710k2971m6575j2410m8441q025P0032o4099o3975j136K437
$$ 129105 283260 273550 250579 204004 191594 143153 135128 205160 141061 77086 75950 78387
9879G8387k1522n3335p1007L7709R3014j0472l0259J01966Q2477M8971j8402j0836
$$ 78387 56865 3530 -67477 -29768 63246 52774 22515 124481 206958 255929 237527 226691
9867B26691K9145K1770j94295m6248k976M8815K2372J07285K1409q444K4853J8711
$$ 226691 255836 277606 83311 37063 34087 82902 105274 212559 233968 225524 250377 269088
9855B69088m6485m3575q5336J32218M002j4937O5325n6312j06531j44227L431
$$ 269088 222603 179028 93692 225910 229912 214975 280300 223988 117457 -26770 -23339
9844b3339m518N7622M0733n282P1669J48268k75j82550j03620L461J2790m8807
$$ -23339 -27857 29765 70498 65216 136885 285153 284878 102328 -1292 2169 14959 -33848
9832c3848J6717M4501l6801k215M5991O3280n5165j7530O1989P2080q5447r5739
$$ -33848 -17131 27370 -9431 -11646 34345 97625 42460 24930 86919 158999 73552 -22187
9820b2187m1493N5608o940k6728J0636J6495M7497L2439j53512r3181J19635O6748
$$ -22187 -63680 -8072 -15012 -41740 -31104 -14609 32888 65327 -88185 -181366 -61731 5017
9808E017L4507Q006L440k588n3009J8955M7375p5307p5537m5099O2190R4208O957
$$ 5017 39524 47530 50970 48382 -4627 14328 61703 -13604 -89141 -134240 -72050 22158 29115
9795B9115j378L1387k6254l778k2021l7627k6068Q1172Q2140k7338j18249N8429
$$ 29115 27737 59124 32870 29092 7071 -30556 -56624 24548 106688 79350 -38899 19530
9783A9530J25375L8968m1329k000l3170p8049r3384p5475M0582J72122M3747L1949
$$ 19530 144905 183873 142544 140544 107374 29325 -64059 -139534 -98952 73170 116917 148866
9771A48866k4636l6127q2808K2832l6211K3224K9326L0361r366j0386m8848O1307
$$ 148866 124230 88103 5295 28127 -8084 15140 44466 74827 65461 55075 6227 67534
9759F7534K3092o8560m1985N2865Q0669J9830M2197R0479K8211P672l0230J947
$$ 67534 90626 22066 -19919 32946 113615 133445 175642 266121 294332 302004 271774 273721
9747B73721p5956o8455j069n6710n5847N7014P4317N4682P3072o3945q011k1725
$$ 273721 197765 129310 128241 71531 15684 72698 147015 201697 274769 210824 202813 181088
9735A81088M821o5750o4177L5295J18793r312K1405P1460k082o7460k3861M3999
$$ 181088 185909 120159 55982 91277 210070 200758 222163 293623 291541 224081 200220 244219
9723B44219R2489j30696k7005J2632k4022j70604p3206o2193P9018N913L7477
$$ 244219 336708 206012 179007 191639 167617 -2987 -76193 -138386 -59368 -53455 -15978
9712a5978J4280L407N5653R1247l545j15879r634N4274P0296p418q6530n2288
$$ -15978 -1698 1709 57362 148609 145064 29185 19551 73825 144121 136703 50173 -2115
9700b115k4600p9994N1160J0369k2131l8172J8208k6449j4936Q1318K6323L6327
$$ -2115 -26715 -106709 -55549 -45180 -67311 -105483 -87275 -113724 -128660 -47342 -21019 15308
9688A5308L0165k1843l1233j9068M2710J735K3499o024M5046O7737O6577J8588
$$ 15308 45473 23630 -7603 -26671 16039 17774 41273 35249 80295 148032 214609 233197
9676B33197j04312m0111J6824n0646N1404l3666P120K9313m5612K351M8472Q2526
$$ 233197 128885 88774 105598 54952 106356 72690 79810 109123 63511 65862 114334 196860
9664A96860j51052j10665Q7570P8549L406k3851j29796p4345L2407O453Q0230
$$ 196860 45808 -64857 22713 101262 104668 80817 -48979 -123324 -90917 -84464 -4234
9653d234O9218J5341j3360l1712O3662O374P464k1516Q7670n6077j22573p570
$$ -4234 64984 80325 66965 35253 98915 105289 112753 91237 178907 122830 257 -7313
9641g313r303N5008l0043l3382O7496P1056L7318P4276Q1789J05101J30810L565
$$ -7313 -16616 38392 8349 -25033 42463 113519 150837 225113 306902 412003 542813 546378
9629E46378J42942J93963J24251j58306j93517j28842p3758m6988n6708j90183
$$ 546378 689320 883283 1007534 849228 655711 526869 453111 406123 349415 159232
9619A59232j67504k8775P6117J47585K5363k3020j14961l9016J00769Q7393l3516
$$ 159232 -8272 -37047 39070 186655 212018 188998 74037 35021 135790 223183 189667
9608A89667P6960q1248m5573K358p6847P336J21829M0491q322j51755r4024l1809
$$ 189667 266627 185379 139806 142164 65317 72653 194482 234973 226651 74896 -19128 -50937
9596e0937k1092J02511j197J00182R8864k1713R1193k6598j05472p312K1699O8378
$$ -50937 -72029 30482 29285 129467 228331 206618 297811 271213 165741 158429 180128 248506
9584B48506r8774j50347J7912O0543M6380k1578p609Q0339J58194N008j4928j7343
$$ 248506 149732 -615 17297 77840 124220 102642 95033 175372 333566 338574 323646 306303
9572C06303j07049o7535J03804j2666m0580q2024K3866j2921P1045J4455N6906
$$ 306303 199254 131719 235523 222857 182277 100253 124119 111198 182243 196698 253604
9561B53604j33622l0109n2654j02345j3813K64024J82559m629r2041j25221K8535
$$ 253604 119982 89873 37219 -65126 -78939 185085 367644 363015 270974 145753 174288
9550A74288K6578k3579J9844L2595J37759P0686p7585j3830n0681j08931r0680
$$ 174288 200866 177287 197131 229726 367485 438171 360586 346756 296075 187144 96464
9539I6464J22916n361r7755O4019j940r0758L7201p2832M0181J4650Q243m1432
$$ 96464 219380 214019 116264 180283 178343 87585 124786 51954 92135 106785 115028 73596
9527G3596j02602j7062P6845N5547N961j01474r2809N1678M7110l9050R6337q1670
$$ 73596 -29006 -46068 30777 86324 92285 -9189 -101998 -50320 -3210 -42260 54077 -27593
9515b7593l1619p3169R9897l4107o7152M9657j0545K0808J27350J27271J865k4313
$$ -27593 -59212 -132381 -32484 -66591 -133743 -84086 -94631 -73823 53527 180798 182663 158350
9503A58350M1479k9574n6892j7087j3176l1400K0217K4578j9848j17156q0856
$$ 158350 199829 170255 113363 96276 83100 51700 71917 96495 76647 -40509 -121365
9492a21365P026N3551M8957l346Q0892j0815m1147l1935q3796L6968J12963M9560
$$ -121365 -114339 -60788 -11831 -15177 65715 54900 13753 -18182 -101978 -65010 47953 97513
9480I7513q430n4070j2945k080J8287n7276M1760p0551o0329O0267N2197J09853
$$ 97513 89083 35013 22068 19988 38275 -19001 22759 -47792 -108121 -47854 4343 114196
9468A14196J8109j6004l2704P0985O4546J9510j18935q1333O5983k1160l5725
$$ 114196 132305 116301 83597 154582 219128 238638 119703 38370 104353 83193 47468
9457D7468Q1901N7112j35316K7881M062l5487j20047q734J57333M3536j07376
$$ 47468 129369 186481 51165 79046 83108 47621 -72426 -81160 76173 119709 12333
9446A2333M0449K0218N2353p9540J45546P17j979J229Q71J4437L3558l7574l4721
$$ 12333 52782 73000 125353 45813 191359 192076 190097 191326 192197 206634 240192 202618 167897
9433A67897l1758p3942k4740J35069M9518l467m4213j24003k56962o9882q247
$$ 167897 136139 62197 37457 172526 222044 218577 174364 50361 -206601 -276483 -284730
9422b84730N9945J18065N9855L1415n8757M3399J12900J0767k83P1379p5308m1957
$$ -284730 -224785 -106720 -46865 -15450 -74207 -30808 82092 92859 92576 163955 88647 46690
9410D6690n129n0193J6499q9840j4308J10822N9672R2958J75260J56338M7923
$$ 46690 41561 -8632 7867 -81973 -96281 14541 74213 167171 342431 498769 546692
9399E46692M1205j07563q4221o1317j08014j46770j1338O5886q5677P9618N3369
$$ 546692 587897 480334 396113 334796 226782 80012 68674 134560 48883 128501 181870
9388A81870l6266j16102q3049O9281J56946m8929j67873p5262M145n5269n8214
$$ 181870 145604 29502 -53547 15734 172680 123751 -44122 -119384 -115239 -170508 -228722
9377b28722J60186M1078l1143n2644r3302R2228O5653J11478j9159m2360Q349
$$ -228722 -68536 -27458 -58601 -111245 -204547 -112319 -46666 64812 45653 3293 11642
9366A1642k7475q4132L181J24555m0212o7073O4313J57214O3135J7794j34773
$$ 11642 -15833 -99965 -96784 27771 -12441 -79514 -15201 142013 205148 222942 88169
9355H8169j23262n6578L8727n5966J51672K4117o227o3706N2321J45966K6421
$$ 88169 -35093 -91671 -52944 -108910 42762 66879 60652 -3054 49267 195233 221654
9344B21654j27082j53355p812n5540M4818M5231l4618o4523P1333J4089N8804
$$ 221654 94572 -58783 -66595 -122135 -77317 -32086 -66704 -131227 -59894 -45805 12999
9333A2999P8994J03788L6632p9569n9380k7104O0707J2583O0194M455O427K549
$$ 12999 91993 195781 232413 152844 93464 66360 127067 139650 199844 204299 210726 213275
9321B13275k9755q8299M857n2714n4511m2448M2672N9601P6445R097l5833r2325
$$ 213275 183520 95221 100078 47364 -7147 -49595 -6923 52678 129123 138220 102387 10062
9309A0062M6641m1809n4899O2384R6844J1828r3925k4198k1412J1993N7960O2502
$$ 10062 56703 14894 -40005 22379 119223 131051 37126 12928 -8484 3509 61469 123971
9297A23971O7685o3807p4657p620J34824K1837k1432l1946j9006n1624k3363J143
$$ 123971 191656 127849 53192 45572 180396 202233 180801 148855 129849 78225 54862 56005
9285E6005J02135J15350m8836j39506J11633L6946j05430r7655j6903r433J1380
$$ 56005 158140 273490 224654 85148 196781 233727 128297 30642 13739 4306 15686
9274A5686k963N279m7593J839R2408l2347J5953k5452n8313O8136O5061j58005
$$ 15686 12723 18002 -29591 -27752 64656 32309 48262 22810 -35503 32633 97694 -60311
9262f0311k687J42197L2559M8422K9286O6914j28017r1354M8322j30383k5503
$$ -60311 -62998 79199 111758 160180 189466 256380 128363 37009 85331 -45052 -70555
9251g0555J11868J1120R3335K0415q8713R2507m5561j71564l7168Q9913k2208
$$ -70555 41313 52433 145768 166183 77470 169977 124416 -47148 -84316 5597 -16611
9240a6611N9219L4918K4026Q2591r088j8722m3156m63P0170J15644m7948j26617
$$ -16611 42608 77526 101552 184143 175055 156333 113177 112714 182884 298528 250580 123963
9228A23963k378m8481K3082N4177L5211K6052k5769j71960q2341K7450o2138q1452
$$ 123963 121585 73104 96186 150363 185574 211626 185857 13897 -68444 -40994 -103132 -184584
9216a84584j1327J9011k9206l7256J4538J26034L4727q0319n6890K3353m3596
$$ -184584 -195911 -176900 -206106 -243362 -228824 -102790 -68063 -148382 -205272 -181919 -225515
9205b25515O3458J21657o8378N8467J87958j2288r5470j08752n1075L4876J25625
$$ -225515 -162057 -40400 -108778 -50311 137647 125359 29889 -78863 -129938 -95062 30563
9194C0563J13543l3692K8002q235n6373R9481J8847k45842j45839Q3080K6007
$$ 30563 144106 110414 138416 130181 73808 173289 192136 -53706 -199545 -116465 -90458
9183i0458J0940J04508j3245m136J14318J6270m6760k13409P7147J36910l9792
$$ -90458 -79518 24990 11745 7609 121927 138197 91437 -121972 -44825 92085 52293
9172E2293J59979O9717n8929q3199j53841k3176P83J8329P3374N8937R8397j18385
$$ 52293 212272 281989 223060 139861 -13980 -37156 -36373 -18044 55330 114267 212664 94279
9160I4279O6577O107m919P8693r230K807j07274k7956l5776L459K6167N7445r4352
$$ 94279 160856 166963 162044 240737 231507 234314 127040 99084 63308 66767 92934 150379 56027
9147E6027q2859l9908k1777k3399m822K9597p8388l3293j9800J63421J11589o8855
$$ 56027 -26832 -66740 -88517 -111916 -116738 -87141 -165529 -198822 -218622 -55201 56388 -12467
9135a2467j90749L850j5993j6453Q5705J55195J8840p3107j08145L7320K1426
$$ -12467 -203216 -199366 -215359 -231812 -146107 9088 27928 -45179 -153324 -116004 -94578
9124i4578q74k1100R3124k5983K6353P3562L8778q7838K976K2019j32709J036
$$ -94578 -95452 -116552 -23428 -49411 -23058 50504 89282 1444 4420 26439 -106270 -105234
9112a05234L6747k2203p590P3671P7717M4022N900k7583j1380m2358N2057r6217
$$ -105234 -68487 -90690 -98280 -24609 53108 97130 103030 75447 64067 21709 73766 -22451
9100b2451M4457P8967N218N9225j7481j50185r1966J08881Q7922L2393J7121n5058
$$ -22451 22006 100973 106191 165416 147935 -2250 -94216 14665 102587 134980 152101 97043
9088I7043O181K55n2050o9003L2599K4177N0657N113L2415J5764L995K5996o8209
$$ 97043 103224 103479 51429 -17574 15025 39202 89859 94972 127387 143151 147146 173142 104933
9075A04933n2123o338r148m2489m7181K020J10907j866p1182R3945q3223l9583
$$ 104933 52810 46472 37324 -5165 -52346 -50326 60581 58715 -12467 81478 -1745 -41328
9063d1328m4197l2014j6212k1132m0496J56082l4943p8187m0131J53844J12573
$$ -41328 -85525 -117539 -133751 -154883 -195379 -39297 -74240 -152427 -192558 -38714 73859
9052G3859J4445r8848r2335n287l1745j737R0716m2109L0445K0607P0687m0834
$$ 73859 88304 -10544 -102879 -108166 -139911 -141648 -50932 -93041 -62596 -41989 28698 -12136
9040a2136j3447J25798m8717l2757N1887J5788j6770K1945Q5006l3737r3118r3532
$$ -12136 -25583 100215 51498 18741 70628 86416 69646 91591 176597 142860 49742 -43790
9028d3790j5508L4316O0482M0633J52301m5260j23576o6890l7303M1836R5823
$$ -43790 -59298 -24982 35500 76133 228434 183174 59598 -7292 -44595 -2759 93064
9017I3064j12952n2696J53757J40560L003n0739n3414r8861L6944l5595M5491
$$ 93064 -19888 -72584 81173 221733 224736 173997 120583 21722 58666 23071 68562
9006F8562K0746J9481M3561M2120J1399j45628j24773L6539Q6026o7605k102q4575
$$ 68562 89308 108789 152350 194470 205869 60241 -64532 -27993 58033 -9572 -11674 -96249
8994i6249L6432R7711k8071o6738L6391m1121K7691k8882m3333Q3458j2376n6918
$$ -96249 -59817 37894 9823 -56915 -20524 -61645 -33954 -62836 -106169 -22711 -35087 -92005
8982i2005L7844L7901P1771J03413R9844p1446j9187P6265K6234J4022j6580k944
$$ -92005 -54161 -16260 55511 158924 258768 187322 168135 244400 270634 284656 268076 265132
8970B65132L0448n2002o8933o1556K1720k7407l9054m8830q816j0567J22234N9722
$$ 265132 295580 243578 174645 113089 134809 107402 68348 19518 10702 135 122369 182091
8958A82091j11396j09997k2948M3802r4948n7742K2285l4146k0805K5781J45048
$$ 182091 70695 -39302 -62250 -18448 -113396 -171138 -148853 -182999 -203804 -178023 -32975
8947c2975J15642r202L7776j71777k6818J5245N7512m687L4086K1058N1876R5757
$$ -32975 82667 73465 111241 -60536 -87354 -72109 -14597 -19284 14802 35860 87736 183493
8935A83493J1601j01643p5864L6537O4313j13532P4263P2090n6363o5240J878
$$ 183493 195094 93451 17587 54124 118437 4905 79168 151258 94895 29655 31533
8924C1533K4139r9000l3517J0938m058p6004M8634J30943j3572K6091O2475N0516
$$ 31533 55672 -43328 -76845 -65907 -69965 -145969 -97335 33608 20036 46127 108602 159118
8912A59118J78858j9203k18254j55095N6361m2504k0191o6638J91498o7109M7512
$$ 159118 337976 318773 100519 -54576 1785 -40719 -60910 -127548 63950 -3159 44353
8901D4353j0372p6072M2194K4257j3691m1842J4119O3689m8170l4866j8469j18655
$$ 44353 33981 -42091 103 24360 10669 -31173 -17054 46635 -1535 -36401 -54870 -173525
8889a73525K02250m1328j4015J6237M1914l3657K0n1220j02591J15161J38984
$$ -173525 28725 -12603 -26618 -10381 31533 -2124 -2104 -53324 -155915 -40754 98230
8878I8230K1495l1895M6702j02968j7296O688L961j15903r0304J0131n0338N0628
$$ 98230 119725 87830 134532 31564 14268 20956 24917 -90986 -181290 -171159 -221497 -170869
8866a70869J04280Q6949R8597J05550R0739r8279j87818n0906j3956R059J8367
$$ -170869 -66589 20360 118957 224507 315246 216967 29149 -21757 -35713 -26654 -8287
8855h287l8308Q1428P4102m0956n887Q584O4346m6206l4891r5047j11922N4588
$$ -8287 -46595 34833 108935 67979 62092 70676 135022 88816 53925 -41122 -153044 -98456
8843i8456P0000Q1423Q9200q3932r8644m1508k1116J1052m0059n9211J79406Q6666
$$ -98456 -28456 52967 142167 58235 -40409 -81917 -103033 -91981 -132040 -191251 -11845 74821
8831G4821n3731j5270K0219R0967M2034j31791j258M1086P3978m4531j2023R1833
$$ 74821 21090 5820 26039 117006 159040 27249 25991 67077 141055 96524 84501 176334
8819A76334J8170k6149L0707K9167j46056k3685m9551o4185J0657k2675n561J09431
$$ 176334 194504 168355 199062 228229 82173 58488 8937 -55248 -44591 -67266 -72827 36604
8807C6604L3183J34222R1391r6891p8137q9858L2721p1472k21280N9549R3324
$$ 36604 69787 204009 295400 198509 120372 30514 63235 -8237 -229517 -169968 -76644
8796g6644L1133N8963R5503L042j0219j1158p0385j01028j3340N2664K1512L5417
$$ -76644 -45511 13452 108955 111997 101778 90620 20235 -80793 -94133 -41469 -19957 15460
8784A5460J4705K6058R0903l4573l2420n0732P960N3793J19755P24k6150l5991
$$ 15460 30165 56223 147126 112553 80133 29401 37361 91154 210909 211633 185483 149492
8772A49492j35514q580k8447r4416j6619j08294P3443N9962O7092O8015l7966
$$ 149492 13978 5398 -23049 -117465 -134084 -242378 -168935 -108973 -41881 26134 -11832
8761a1832o3190J33641R571k1161n6724o4829N9522O7412O1086j5589n3879J6973
$$ -11832 -75022 58619 68190 47029 -9695 -74524 -15002 52410 113496 97907 44028 61001
8749F1001m5043N6790K1991L6685m6474M1639P72l6761J00399j0380r4424J1498
$$ 61001 15958 72748 94739 131424 84950 126589 127361 90600 190999 180619 86195 97693
8737I7693n7251J31061N7367n3550j23684k8243m3433j8302q5408O3328J25360
$$ 97693 40442 171503 228870 175320 51636 23393 -20040 -38342 -123750 -60422 64938
8726F4938J73032Q5287J2017j75830n241m232j11091M4107N7170M1631j4161j11254
$$ 64938 237970 323257 335274 159444 154203 149971 38880 82987 140157 181788 167627 56373
8714E6373J6002l1239J3297k1487K904j60968j38580J3073R5043p987Q4680Q8440
$$ 56373 72375 41136 54433 32946 35850 -125118 -263698 -250625 -155582 -163569 -78889 9551
8702I551M5391J7082p2441k6342J05362l340M3721P6521m597K8767j1746J5223
$$ 9551 54942 72024 -417 -26759 78603 75263 118984 195505 190908 219675 207929 223152
8690B23152p2221l4469j51943m7216K4819m4513N4736L2128j19047O764J89847
$$ 223152 150931 116462 -35481 -82697 -57878 -102391 -47655 -15527 -134574 -127810 62037
8679F2037L8384J3829N8114l8782j02271m1620K6336n7976K631M9130m0636q718
$$ 62037 100421 114250 172364 133582 31311 -10309 16027 -41949 -39318 9812 -30824 -39542
8667c9542o3938J2931J17128l0900r5595r455n5486k4363J41500L6561J12070
$$ -39542 -103480 -90549 26579 -4321 -99916 -109371 -164857 -189220 -47720 -11159 100911
8656A00911R3800q6153j07513P6296K9649m925l8461j20967p6466J28175J17831
$$ 100911 194711 108558 1045 77341 106990 102065 63604 -57363 -133829 -5654 112177
8645A12177J0684p7194K6134n0748k7995M2354N659q8085J2986J8840J03233O0226
$$ 112177 122861 45667 71801 21053 -6942 35412 41071 -47014 -34028 -15188 88045 148271
8633A48271J571o653K3643N8731J5101j0613j57984j36234L4750m0421R0888k0591
$$ 148271 149842 143189 166832 225563 240664 230051 72067 -64167 -29417 -69838 21050 459
8621D59k1093Q72P8947K032m0015J05641R9815j09053j26345J3656k7339J4655
$$ 459 -20634 -19762 59185 61217 21202 126843 226658 117605 -8740 4916 -22423 -7768
8609g768L5708o2145n2343n2219j1121l6637P0555J69065O8392J15375k7536q9538
$$ -7768 27940 -34205 -86548 -138767 -149888 -186525 -115970 53095 121487 236862 209326 119788
8597A19788N899M4218J02028n6842j45764Q8729L7695p4473K4621J21035M1430
$$ 119788 125687 169905 271933 215091 69327 158056 195751 121278 145899 266934 308364
8586C08364K657m2628M748k1021j6422o247Q5311p4953O818Q1100l3444J28217
$$ 308364 311021 268393 273141 252120 235698 229451 314762 239809 246627 327727 294283 422500
8574D22500J02714n7315p5913k4274n9303J5774P3377l825O204J70188O7911j16720
$$ 422500 525214 467899 391986 367712 308409 324183 397560 393735 399939 570127 638038 521318
8562E21318p7846j32210j26457J9820p23p9024q5212K3438L8184r507K0195o2903
$$ 521318 443472 311262 184805 204625 203902 124878 39666 63104 101288 91781 111976 49073
8550D9073P8642M1960j5572j5987l3511M3710j7346p291o25n4815m9695L5795
$$ 49073 127715 169675 154103 138116 104605 148315 130969 123678 123053 68238 18543 54338
8538E4338J39220l8534k0022L8448n8352N4432l1657O241k1575m7409L2263q1081
$$ 54338 193558 155024 135002 173450 115098 169530 137873 144114 122539 75130 107393 26312
8526B6312k897J0703J08313J3551j96066j49167J68715J80482k6913J2278K3832
$$ 26312 23415 34118 142431 155982 -40084 -189251 -20536 159946 133033 145311 169143
8515A69143P1531j7787k9947J9455j11482j256J0436Q5449J17700J340k80416
$$ 169143 240674 222887 192940 212395 100913 99657 110093 195542 313242 314582 34166
8504C4166j57587j844R8584J46475m2390p4779j200j0358K6929o1462n3706j1831
$$ 34166 -123421 -125265 -26681 119794 77404 2625 1425 -8933 17996 -43466 -97172 -109003
8492a09003M5887M9389n7433n1692o2327q2762M2404K23833J43285p7791j15811
$$ -109003 -63116 -13727 -71160 -122852 -185179 -267941 -225537 -1704 141581 63790 -52021
8481e2021Q3558J2414O724J00228l7476o4800R6778j4073j58883M5682O7732K9450
$$ -52021 31537 43951 50675 150903 113427 48627 145405 131332 -27551 18131 85863 115313
8469A15313O6728o2407N9252M3660n7021J8075n4417O4579j12896o3242k6748
$$ 115313 182041 119634 178886 222546 165525 183600 129183 193762 80866 17624 -9124
8458i124q2745m923m0641J23626P1343M450q0268r3171m3168k0238R6919J28048
$$ -9124 -91869 -96792 -137433 -13807 57536 61986 -18282 -111453 -154621 -174859 -77940 50108
8446E0108q0424M946M6668m1698O1725J40325o8898n3027j0793j87802j68767
$$ 50108 -30316 -25370 21298 -20400 41325 181650 112752 59725 48932 -138870 -307637
8435c07637P7928K30008J70015Q884m2211q4121n5709N4501J606N653m2564o8636
$$ -307637 -229709 299 170314 179198 136987 52866 -2843 51658 53264 58917 16353 -52283
8423e2283q8187K5211J00831M7916k6974k6101K2508l8902O2171Q481k6573o5985
$$ -52283 -140470 -115259 -14428 33488 6514 -19587 2921 -35981 26190 34671 8098 -57887
8411e7887N1232J22394l8883j17175p4571r9478L1023K5760O6233R2022K9485
$$ -57887 -6655 115739 76856 -40319 -114890 -214368 -183345 -157585 -91352 670 30155
8400C0155O968j40414n7723Q5989J76818J16698m2346j50517J5951J2216M0522
$$ 30155 37123 -103291 -161014 -75025 101793 218491 176145 25628 41579 53795 94317
8389I4317J6843L0081j4506J217n4678J753r9588J1063J33144M1096L9758k86
$$ 94317 111160 141241 126735 127952 73274 75027 -24561 -13498 119646 160742 200500 200214
8377B00214j03230j57281R5188K9237P598J7476J14066j49793k2961q9036o2210
$$ 200214 96984 -60297 34891 64128 71726 89202 203268 53475 30514 -58522 -120732
8366a20732J04719J10967R4080P2471j00023r6552m3872j00668K0911L2172N6435
$$ -120732 -16013 94954 189034 261505 161482 64930 21058 -79610 -58699 -26527 29908
8355B9908q262l0295K6174Q681P7434P6593Q9431q5030o0876o6588j9350M4597
$$ 29908 21646 -8649 17525 26206 103640 180233 269664 184634 123758 57170 37820 82417
8343H2417N571L315p3711r6407q5760J1443o062k2610J7580N317P9417N309P5513
$$ 82417 87988 91303 17592 -78815 -164575 -153132 -159194 -181804 -164224 -158907 -79490 -74181 1332
8330A332J01377r802l7285m3666n0076J5525R7751J4189p9703n7252K320M2729
$$ 1332 102709 92907 55622 11956 -38120 -22595 75156 89345 9642 -47610 -45290 -2561
8318b561j53507p3695J48439Q916j9362j17240Q4843P7097l6920k5144P4492J05014
$$ -2561 -156068 -229763 -81324 -72408 -91770 -209010 -124167 -47070 -83990 -109134 -34642 70372
8306G0372k6967J2501J03652j41120j39712M9040l1450M6735O3275m1648j06683
$$ 70372 43405 55906 159558 18438 -121274 -72234 -103684 -56949 6326 -35322 -142005
8295a42005j8903L6247J03706j3539m5939J1130N2942l424R1621p5758M3423m8654
$$ -142005 -160908 -124661 -20955 -34494 -80433 -69303 -16361 -19785 71836 -3922 39501 -9153
8283i153J8084L8432K8206l2456m461o6756L9187k2910M552r2688R4357J30095
$$ -9153 8931 47363 75569 43113 38652 -28104 11083 -11827 -7275 -99963 -5606 124489
8271A24489M0925j37824N0855J18240K6155K4048J43710q5828j18319j29968k3481
$$ 124489 165414 27590 78445 196685 222840 246888 390598 304770 186451 56483 33002
8260C3002k1774J31368j8784j49794o1203M8760K04685J0206p7666k1486l883
$$ 33002 11228 142596 123812 -25982 -87185 -38425 166260 176466 98800 77314 73431
8249G3431k9328N0816O2369L1169M3841m5760k7111j2645k3714m6376k8559J2153
$$ 73431 44103 94919 157288 188457 232298 186538 159427 146782 123068 76692 48133 60286
8237F0286N4437k9917N3039P978K1266j01537m3498j62388L7669J15548J23288
$$ 60286 114723 84806 137845 145823 167089 65552 22054 -140334 -102665 12883 136171
8226A36171k5598R123j4928P6327K2261p5728L6579O5405o4522k21693k02920
$$ 136171 110573 119696 104768 181095 203356 127628 164207 229612 165090 -56603 -259523
8215b59523Q4678N1356m782J31743K1958O0438j19273N8473k8335K6014q5237
$$ -259523 -174845 -123489 -128271 3472 25430 85868 -33405 25068 -3267 22747 -62490
8204f2490j38772Q2831M7268n2363k3147o879K1012P9059L6302J5336m1077r4137
$$ -62490 -201262 -118431 -71163 -123526 -146673 -153552 -132540 -53481 -17179 -1843 -42920 -137057
8192a37057o95L0336J01807M8223j1025K5233M9857N8991L5348j69101m5738L5117
$$ -137057 -137752 -107416 -5609 42614 31589 56822 106679 165670 201018 31917 -13821 21296
8180B1296K633j6417O2252k083R6880O354K821p8259p4972m6343n3880l3661O1836
$$ 21296 23929 7512 69764 67681 164561 170915 173736 95477 20505 -25838 -79718 -113379 -51543
8167e1543J6824P7722k2541L9442J59665P3898j14577o3272n8153J22460M0336
$$ -51543 -34719 43003 20462 59904 219569 293467 178890 115618 57465 179925 220261
8156B20261k2755j04828r7388r9176J42335M7274l7187K763j2325o6976r4444
$$ 220261 197506 92678 -4710 -103886 38449 85723 48536 51299 38974 -28002 -122446
8145a22446K7427p5210k2081J90858J17675O9755n0131m6868n3880n0720O4840
$$ -122446 -95019 -170229 -192310 -1452 116223 185978 135847 88979 35099 -15621 49219
8134D9219j21672k4819K5390k7343l450N135O5687K4608j1469l75j31203K161
$$ 49219 -72453 -97272 -71882 -99225 -102675 -97540 -31853 -7245 -18714 -19089 -150292 -148131
8122a48131J7460k6835j0731J53181k0205m4642L0490j5642l9262R5716J34372
$$ -148131 -130671 -157506 -168237 -15056 -35261 -79903 -49413 -65055 -104317 -8601 125771
8111A25771o0863j32930r4496q6346R9666P4359r0767k087P0168N0816L9410M5640
$$ 125771 64908 -68022 -162518 -248864 -149198 -74839 -165606 -167693 -97525 -46709 -7299 38341
8099C8341l942J06867K1935j55946m5516J30115N8580q4002J848M2489O1350J0169
$$ 38341 34399 141266 163201 7255 -38261 91854 150434 66432 68280 110769 172119 182288
8087A82288J07858r6247j22638l3351n9357M731j5106J00469J31789q3870q7159
$$ 182288 290146 193899 71261 37910 -21447 -16716 -31822 68647 200436 116566 29407
8076B9407P2970K8297l8481J7506R97j39090j04200L7309N684L0490M2471P1414
$$ 29407 102377 130674 92193 109699 110696 -28394 -132594 -95285 -89601 -59111 -16640 54774
8064E4774J31922N5363p3834m0934j1212Q6499J3842j90703N519L1562M3183M495
$$ 54774 186696 242059 168225 127291 116079 202578 216420 25717 31236 62798 105981 110476
8052A10476n0220L6696M2009n3962K8944J40418n794N7360o4294j13092P5205
$$ 110476 60256 96952 138961 84999 113943 254361 248567 305927 241633 128541 203746
8041B03746J26066k5081n4299m1009r0260m3336Q6909J735N9093J5703j28460
$$ 203746 329812 304731 250432 209423 119163 75827 162736 164471 223564 239267 110807
8030A10807L7987j7662m2970q9635o0728J05494Q1715N3056M6359l4769n3009
$$ 110807 148794 131132 88162 -1473 -62201 43293 125008 178064 224423 189654 136645
8019A36645j37396J36526P8263j00585o601P6013k1616n1116j5165N3415m0793
$$ 136645 -751 135775 214038 113453 106852 182865 161249 110133 94968 148383 107590
8008A07590n9461j7015k0945P1858L8665K6007R4452l1910q8609o6448q6397L1116
$$ 107590 48129 31114 10169 82027 120692 146699 241151 209241 120632 54184 -32213 -1097
7996a097O1116P130j9927p0255J5943q2992k4142K7215J8358N1703L5185r9345
$$ -1097 60019 67149 47222 -23033 -7090 -90082 -114224 -87009 -68651 -16948 18237 -81108
7984h1108K3225L4140l015L3901k7696R5164O415j62296L6979K3892j2836m3601
$$ -81108 -57883 -23743 -26758 7143 -20553 74611 81026 -81270 -44291 -20399 -33235 -76836
7972g6836Q5052R9341M5379R2551l9383k3883Q7966j0105k04749m6798O2601K3073
$$ -76836 8216 107557 152936 245487 206104 182221 270187 260082 55333 8535 71136 94209
7960I4209k2729n0011l2240R0380M6967k5366l1431k7590p0155n6701j2729P5997
$$ 94209 71480 21469 -10771 79609 126576 101210 69779 42189 -27966 -84667 -97396 -21399
7948b1399K8066j7394Q1338R3723l865j02659n4124J03446M0925J3622j4867j1967
$$ -21399 6667 -10727 70611 164334 160469 57810 3686 107132 148057 161679 146812 134845
7936A34845J4478m4609P985n9268n9455P5086N5468J38523J3215n6860R8106o7763
$$ 134845 149323 104714 112699 53431 -6024 69062 124530 263053 276268 219408 317514 249751
7924B49751j68857l4785k3804J29335J42589m8947j11264m5088j2608n561M9020
$$ 249751 80894 46109 22305 151640 294229 245282 134018 88930 76322 70761 119781
7913A19781Q0893n8164p8434m6319O8203J11229l26p0134m9988j10676l9839O0906
$$ 119781 200674 142510 64076 17757 85960 197189 196863 126729 76741 -33935 -73774 -12868
7901a2868j5850K5151J2606r2344M7991R2064R5998L2172J3125K3437J2189M3367
$$ -12868 -28718 -3567 9039 -83305 -35314 56750 152748 184920 198045 221482 233671 277038
7889B77038m5348o9763Q650J010n3351j19123M2712P0642o4304o1400m1411J03165
$$ 277038 231690 161927 170577 171587 118236 -887 41825 112467 48163 -13237 -54648 48517
7877D8517N3449q2140m030j8479L2806r703q1739j9217O8583P6470J36369n9982
$$ 48517 101966 19826 15796 -2683 30123 20420 -61319 -80536 -11953 64517 200886 140904
7865A40904q9838k3385m8956l912N127R5597N1229k9529j23697L4201L0218n0781
$$ 140904 51066 27681 -21275 -25187 -20060 75537 126766 97237 -26460 7741 37959 -12822
7853a2822J28349P3908l0948L498r024L3311P2926K6968j05310j45579j64386
$$ -12822 115527 189435 158487 161985 152961 186272 259198 286166 180856 35277 -129109
7842a29109K8905R1940p869M0688p1045m0602J9740Q6663Q865l6275j0873M5734
$$ -129109 -100204 -8264 -16133 24555 -46490 -87092 -67352 19311 28176 -8099 -18972 26762
7830B6762N462P7970M8315k2377j76193r636n5856j0471l0517J48947J9847l2241
$$ 26762 32224 110194 158509 136132 -40061 -49697 -105553 -116024 -146541 2406 22253 -9988
7818i988k8581p5017P3948J3595L1543P139p9482p7852r5160J7861L7892Q6885
$$ -9988 -38569 -113586 -39638 -26043 5500 12639 -66843 -144695 -239855 -221994 -184102 -97217
7806i7217m409m0998J5706L6069J09803n5514m3610j9543R8390P3193N9942q271
$$ -97217 -101626 -142624 -126918 -90849 18954 -36560 -80170 -99713 -1323 71870 131812 123541
7794A23541k2803r198K3942P1366M8691k7390L4362r0177l0919j33014j19427
$$ 123541 100738 91540 115482 186848 235539 208149 242511 152334 121415 -11599 -131026
7783a31026L1303M2084N2176J6626l5059j3001P1348J3978k2802l8449l2291P4552
$$ -131026 -99723 -57639 -5463 11163 -23896 -36897 34451 48429 25627 -12822 -45113 29439
7771B9439j9111k2554R625J55111l0548j09493k848q7364n2065J94989n011L6760
$$ 29439 10328 -12226 -2601 152510 121962 12469 9621 -77743 -129808 65181 60170 96930
7759I6930Q1549N41r4836j8389j2807J1940m417q3458q6765J1539O5957Q6063
$$ 96930 178479 179020 84184 65795 52988 64928 60511 -22947 -109712 -98173 -32216 53847
7747E3847O5157k2736m1084m0420p7022N727l8615r0332Q6040M0993Q1283O1720
$$ 53847 119004 96268 55184 14764 -62258 -56531 -95146 -185478 -99438 -58445 22838 84558
7735H4558r0317o8823L2653K0132K2584M644l0881J04944j6352j38137j06242
$$ 84558 -5759 -74582 -41929 -21797 787 5431 -25450 79494 63142 -74995 -181237
7724a81237M1270N0737N7446M6209j7814j5912p3092N5427K2276k0037J2137K4895
$$ -181237 -139967 -89230 -31784 14425 -3389 -19301 -92393 -36966 -14690 -34727 -22590 2305
7712B305J7776J32802Q4420k0733o9973J1631k1650p2005j63780j7382K03340
$$ 2305 20081 152883 237303 216570 146597 158228 136578 64573 -99207 -116589 86751
7701H6751K9500j37260o5890o1593j09636R4518R8651O1359P0103j6823J8561
$$ 86751 116251 -21009 -86899 -148492 -258128 -163610 -64959 -3600 66503 49680 68241
7690F8241n6363p8513o368q897m3492m7725R6469L5742K5479J16485q7242p7110
$$ 68241 11878 -66635 -73003 -81900 -125392 -173117 -76648 -40906 -15427 101058 13816 -63294
7678f3294k4906K6728O3718l8304j013P6448p388J5496L582L5696N1520q078k02018
$$ -63294 -88200 -61472 2246 -36058 -37071 39377 31989 47485 51067 86763 138283 130205 -71813
7665g1813M9624N9003n8015P1291m7413o3555o6241O5366p4113q3181K2983q2274
$$ -71813 -22189 36814 -21201 50090 2677 -60878 -127119 -61753 -135866 -219047 -196064 -278338
7653b78338q8888J21884O4519N1292L7431k3285J13792n304k869m4642m375R512
$$ -278338 -367226 -245342 -180823 -129531 -92100 -115385 -1593 -6897 -9766 -54408 -58783 -49271
7641d9271K4179K4855m4683n817r8004k2650K0924j7183l2508J3171J48607J92782
$$ -49271 -25092 -237 -44920 -50737 -148741 -171391 -150467 -167650 -200158 -186987 -38380 154402
7629A54402O3586j14548j03369n0009Q5266l8082p6216j5316O0823J5865l9453
$$ 154402 217988 103440 71 -49938 35328 -2754 -78970 -94286 -33463 -17598 -57051
7618e7051J13479L7702m0374o9684L65J9799J2142J20056J63851l1847q5811J0725
$$ -57051 56428 94130 53756 -15928 -15563 4236 16378 136434 300285 268438 182627 193352
7606A93352K0574j77349k8991J29875r6078k0679M5569L9904j40140r6394O7927
$$ 193352 213926 36577 7586 137461 41383 20704 66273 106177 -33963 -130357 -62430
7595f2430K02668M5935J1468K4690L3936j03177p4645j34769R4348j4959N8474
$$ -62430 140238 186173 197641 222331 256267 153090 78445 -56324 38024 23065 81539
7584H1539k99j857m9624j05156o2259q4794J56947J69600j638j62995p267L0411
$$ 81539 81240 79383 29759 -75397 -137656 -222450 -65503 104097 102459 -60536 -67803 -37392
7572c7392j46652J7878J04150q9173M533J0630j5603r6647M3042J18562L598N6217
$$ -37392 -184044 -166166 -62016 -151189 -146656 -136026 -151629 -248276 -205234 -86672 -83074 -26857
7560b6857O4738J7856j03370o7363J988Q0481Q2341R1333m658q9883r6855L9309
$$ -26857 37881 55737 -47633 -114996 -113008 -32527 49814 141147 136489 46606 -50249 -10940
7548a0940o410o9181q4996M4649o8277k9178P9144K3298M4932j09426o2727L5445
$$ -10940 -17350 -86531 -171527 -126878 -195155 -224333 -145189 -121891 -76959 -186385 -249112 -213667
7536b13667J4308J01612J13129K1623j21739Q8612N3483j33111N542Q8927O5701
$$ -213667 -199359 -97747 15382 37005 -84734 3878 57361 -75750 -70208 18719 84420
7525H4420n5262m2117j06452j36438j02766l5018R701Q2165R2164k8758r5697
$$ 84420 29158 -12959 -119411 -255849 -358615 -393633 -383932 -301767 -209603 -238361 -334058
7514c34058O2881J86979J19034L1548j376n9576j76349K6583n711n625J15919
$$ -334058 -271177 -84198 34836 66384 65008 5432 -170917 -144334 -150045 -155670 -39751
7503c9751N9600j3541R601K8410L9140K2004j41407j83209l4088J38045M4609
$$ -39751 19849 6308 15909 44319 83459 105463 -35944 -219153 -253241 -115196 -70587
7492g0587j11848j08585K9469J00877J8770R1570l499L6936q8253j3005P6583
$$ -70587 -182435 -291020 -261551 -160674 -141904 -50334 -53833 -16897 -105150 -118155 -41572
7481d1572q0615M2371J55623R067m6136n3796r3553j6384m3544K5696j3246J15851
$$ -41572 -122187 -79816 75807 84874 38738 -15058 -108611 -124995 -168539 -142843 -156089 -40238
7469d0238j1719N5438J6580j8851m6719O3166n6834Q998J06918J06243l929m4958
$$ -40238 -51957 3481 20061 1210 -45509 17657 -39177 -30179 76739 182982 179053 134095
7457A34095J5843l6449j12723p2313M1189J67274K8088k08226l625m6421o9620
$$ 134095 149938 113489 766 -71547 -30358 136916 165004 -43222 -46847 -93268 -162888
7446a62888Q6014P9940o3522j5716l9190q1390L5438J15977P649J10568M4299
$$ -162888 -76874 3066 -60456 -76172 -115362 -196752 -161314 -45337 -37688 72880 117179
7435A17179L5532j3000q0367J7834k3758j0606j4363m9571m0590J6128J33255
$$ 117179 152711 139711 59344 77178 53420 42814 28451 -21120 -61710 -45582 87673
7424H7673N2508k7148J0386P411M7877L1795j25045j51926K0492j2727n9372K5135
$$ 87673 140181 113033 123419 130830 178707 210502 85457 -66469 -45977 -58704 -118076 -92941
7412i2941J0876P1860Q4930m1210l6795m8730p285P2089M4472J23905O7589j14123
$$ -92941 -82065 -10205 74725 33515 -3280 -52010 -59295 12794 57266 181171 248760 134637
7400A34637j49680q063m9555M3101r51p3246k0671J28404J01897m4767k8199j7988
$$ 134637 -15043 -23106 -72661 -29560 -30511 -103757 -124428 3976 105873 61106 32907 14919
7388A4919j8646n133M1204O4910k9165l50j5074L457P8740K1871l0783n4225p3878
$$ 14919 -3727 -8860 32344 97254 68089 67739 52665 56122 134862 156733 125950 71725 -2153
7375b153o3243l0714R9323l0838Q8471J48562n2015k42676m5862m9816p3618M8005
$$ -2153 -65396 -96110 3213 -27625 60846 209408 157393 -85283 -131145 -180961 -254579 -206574
7363b06574J11052R866M5043J23533p6974k156O8570k42n7501p5532k0320j08449
$$ -206574 -95522 -85656 -40613 82920 5946 3790 72360 72118 14617 -60915 -81235 -189684
7351a89684K4086L7772O303O0870p702J17720L874p3472k5927n0922L0418J01020
$$ -189684 -165598 -127826 -121523 -60653 -68355 49365 53239 -20233 -46160 -97082 -66664 34356
7339C4356P5288q0354j22515p0458K7927P6392N1006P6417L81O039p1788r1160
$$ 34356 109644 29290 -93225 -163683 -135756 -59364 -8358 68059 68440 74479 2691 -88469
7327h8469r8966M6891L7042P9759Q7421J31741l6960q7143O8453K7468o6342L3426
$$ -88469 -187435 -140544 -103502 -23743 63678 195419 158459 71316 139769 167237 100895 134321
7315A34321J19339p4637j64139q2737m0393k6977l49J17416R1320m0499o2429
$$ 134321 253660 179023 14884 -67853 -108246 -135223 -135572 -18156 73164 32665 -29764
7304b9764P1548N5787l7546l6059K1566o303K3282M2362K0210j54280j4925n7825
$$ -29764 41784 97571 60025 23966 45532 39229 62511 104873 125083 -29197 -44122 -101947
7292a01947l6536J03176Q040K4985M1986J54658r3934o4359m4585j50923j8461
$$ -101947 -138483 -35307 -27267 -2282 39704 194362 100428 36069 -8516 -159439 -177900
7281a77900J62341K8806k00492j32349J66820K06183J0195p3356j02483k9164
$$ -177900 -15559 13247 -187245 -319594 -152774 53409 63604 -9752 -112235 -141399
7271a41399J31836J01788K6951r9381r9011r8413N8538J40935K4699m873p7765
$$ -141399 -9563 92225 119176 19795 -79216 -177629 -119091 21844 46543 41670 -36095
7260c6095r9862M974M2502J00130J03632L8053n5638n3651j20902q6673o1889
$$ -36095 -135957 -130983 -88481 11649 115281 153334 97696 44045 -76857 -163530 -225419
7249b25419P640P9977J02726M8690q247K7512j06014j58445k1635J35877P3906
$$ -225419 -217779 -137802 -35076 13614 5367 32879 -73135 -231580 -253215 -117338 -43432
7238d3432k4242j8518M3283j9492J00003M9831N0282M4884n3774o4592l0883J8049
$$ -43432 -67674 -86192 -42909 -62401 37602 87433 137715 182599 128825 64233 33350 51399
7226E1399j6543J6369m70p1306Q8985l3330l0322Q8559O7932j678j75832p4920
$$ 51399 34856 51225 50755 -20551 68434 35104 4782 93341 161273 159595 -16237 -91157
7214i1157j905M9938M2646P8319m7888j9137L1542p0953j0979O6899J13064J4748
$$ -91157 -93062 -43124 -478 77841 29953 10816 42358 -28595 -39574 27325 140389 155137
7202A55137q6911p4495q6306q6742j1262M9398R1186n4915N5343O9155N5393L7369
$$ 155137 68226 -6269 -92575 -179317 -190579 -141181 -49995 -104910 -49567 19588 74981 112350
7190A12350j9409r896m8284l2458K7261J11831n4046n5114L1526j1047p6812k7319
$$ 112350 92941 83045 34761 2303 29564 141395 87349 32235 63761 52714 -24098 -51417
7178e1417N9327J23353k8588k3894k8805N6739n4349n0433n5592L3196Q0752J8012
$$ -51417 7910 131263 102675 78781 49976 106715 52366 1933 -53659 -20463 60289 78301
7166G8301M9853L3368M993J2303M8164M4014j57971p7547R2312J2903K7208J9608
$$ 78301 128154 161522 166515 178818 226982 270996 113025 35478 127790 140693 167901 187509
7154A87509P006q9578N9293J09113r3208j50015o8177l1008n9319n0090K9057
$$ 187509 194515 104937 164230 273343 180135 30120 -38057 -69065 -128384 -178474 -149417
7143a49417O0584P6271j37151k2604N5924m19k4484j10545O9007J62267M8063
$$ -149417 -88833 -12562 -149713 -172317 -116393 -116812 -141296 -251841 -182834 -20567 27496
7132B7496Q9914O9312k0447J1570R489j70720j67819q6685J15543J15190n3367
$$ 27496 117410 186722 166275 177845 187334 16614 -151205 -237890 -122347 -7157 -60524
7121f0524n893l5646l7520l3561k5661J17799Q9952N9410J52353q8898q9439m9902
$$ -60524 -66417 -102063 -139583 -173144 -198805 -81006 8946 68356 220709 131811 42372 -7530
7109g530j24029R819j3908J35956J41384j03378O3110M594l3422M6871J21372
$$ -7530 -131559 -121740 -135648 308 141692 38314 101424 106018 72596 119467 240839
7098B40839m4921j66108N0277N6409o8684r4841j31807o4444J64119m958K5215
$$ 240839 195918 29810 80087 136496 67812 -27029 -158836 -223280 -59161 -64119 -38904
7087c8904n450m7684Q0555J49j6650J86666J04112j88577j58508K2112m5735p7528
$$ -38904 -44354 -92038 -11483 -11334 -27984 158682 262794 74217 -84291 -62179 -107914 -185442
7075a85442Q5080R5864P0793J6773q0202Q7189K3526l0161J0690O0300r0069o1308
$$ -185442 -100362 -4498 66295 83068 2866 90055 113581 83420 94110 154410 64341 3033
7063C033k5550N9435r931L1003M6326k7606m8555O1752r894J903J10492O2187
$$ 3033 -22517 36918 26987 57990 104316 76710 28155 89907 80013 81916 192408 254595
7051B54595k05761j89382M327m5123o0666P7830J6110J21206N8899o2133j15201
$$ 254595 48834 -140548 -136221 -181344 -242010 -164180 -148070 -26864 32035 -30098 -145299
7040a45299j6996M3263O8923M8546m8871J21853N9524j21162m9750R2352n9158
$$ -145299 -162295 -119032 -50109 -1563 -50434 71419 130943 9781 -39969 52383 -6775
7029f775j1567N4680m4090M9170j0806m7603M6410k7152k8781r215M7350J67791
$$ -6775 -18342 36338 -7752 41418 30612 -16991 29419 2267 -26514 -35729 11621 179412
7017A79412J91o4619r8340k8596P5742J00838k934r8495R077J23679n0134p7526
$$ 179412 179603 114984 16644 -11952 63790 164628 161694 63199 72276 195955 145821 68295
7005F8295L93K7652o9542n7371Q1099k1603j12322k5293J56626J32891j8567K187
$$ 68295 68688 96340 26798 -30573 50526 28923 -83399 -108692 47934 180825 162258 164445
6993A64445L1042q4601k6190o4225l590L5205R8881q1873j31601n5567J16465
$$ 164445 195487 110886 84696 20471 16881 52086 150967 69094 -62507 -118074 -1609
6982a609K8587Q105J9423r792l0286q2246l9255J2423j4182J09851Q6396m3247
$$ -1609 26978 35083 54506 44714 14428 -67818 -107073 -94650 -108832 1019 87415 44168
6970D4168j62633l4297J67566O4373P035j06727p2801J08305j542N4924q3383
$$ 44168 -118465 -152762 14804 79177 86212 -20515 -93316 14989 13447 68371 -15012
6959a5012l5874J07059j84185l5109O1669J38301O1693p8937p478N5949J37251
$$ -15012 -50886 56173 -128012 -163121 -101452 36849 98542 19605 12127 68076 205327
6948B05327O57k31915j67889O207P3065o4730K507L9960J43516Q6295q0119n2138
$$ 205327 205984 -25931 -193820 -187613 -114548 -179278 -176771 -136811 6705 93000 12881 -39257
6936c9257J38816L9368j13152j11610p9668o1096n6225n620J3818J17534J1674
$$ -39257 99559 138927 25775 -85835 -165503 -226599 -282824 -288444 -274626 -157092 -145418
6925a45418m048J06019J13071k2877q3189k3218L2993K2875p1404j02018J87321
$$ -145418 -149466 -43447 69624 46747 -36442 -59660 -26667 -3792 -75196 -177214 10107
6914A0107J42400j20972o0904O3460m5450j18790K1122K2803k5306N0529Q9916
$$ 10107 152507 31535 -29369 34091 -11359 -130149 -109027 -86224 -111530 -61001 28915
6903B8915M9616O00m2639O7779k886k7403j86246r2880J14365J53899P4712k4292
$$ 28915 78531 79131 36492 104271 101385 73982 -112264 -205144 -90779 63120 137832 113540
6891A13540o4753p647j3698p6520Q4630P4525p1088j25919k6311J07507p1458
$$ 113540 48787 41140 27442 -49078 35552 110077 38989 -86930 -113241 -5734 -77192
6880g7192j39927J22608P9175J2307m5362k2484K1109p9955m611Q1643L5929J526
$$ -77192 -217119 -94511 -15336 -3029 -48391 -70875 -49766 -129721 -134332 -52689 -16760 -15234
6868a5234l7858K0264J8369L9800L7894l9306o3053k7085j25258K3488J12404
$$ -15234 -53092 -32828 -14459 25341 63235 23929 -39124 -66209 -191467 -167979 -55575
6857e5575J41027L8869o998l6659l6779j33052j30937k3419R4963J4290P1015
$$ -55575 85452 124321 117323 80664 43885 -89167 -220104 -243523 -148560 -134270 -63255
6846f3255p3690N9001l1972K3908J40193J21241L3895K9310j31212m2870J30597
$$ -63255 -136945 -77944 -109916 -86008 54185 175426 209321 238631 107419 64549 195146
6835A95146K585j41832r5444p1582M5077O0829n3546O3807P9223m08l319j038
$$ 195146 197731 55899 -39545 -111127 -66050 -5221 -58767 5040 84263 83855 80536 79498
6823G9498l073P8778K5819k1973r3347J07578J6666J690L080o2594k0908Q5139
$$ 79498 76425 155203 181022 159049 65702 173280 189946 191636 194716 132122 111214 196353
6811A96353M7992L1j46727l2497M523p7516o4119o4132q0350Q5378K25844J78077
$$ 196353 244345 244376 97649 65152 69675 -7841 -71960 -136092 -216442 -131064 94780 272857
6799B72857O9007j3908p8218o9609k7006m9283J6972L1639m6308j2462m0576p0473
$$ 272857 341864 327956 249738 180129 153123 103840 120812 152451 106143 93681 53105 -17368
6787a7368P62j5820K5979N3638M5608j11508p622M0452p686K7407K0164j3128
$$ -17368 -16606 -32426 -6447 47191 92799 -18709 -26331 14121 6435 33842 54006 40878
6775D0878J2354m2193M6995p7312r0645q1888J10824R2229j8156P6732j33225
$$ 40878 53232 11039 58034 -19278 -109923 -191811 -80987 11242 -6914 69818 -63407
6764f3407J5656K0356J1166J800o6548j24853k1900Q0571J74071n3326j13125
$$ -63407 -47751 -27395 -16229 -14429 -80977 -205830 -227730 -147159 26912 -26414 -139539
6753a39539K9627O6315m1443N0228M1719m8102m7791j9294k1265N1143m9919M0477
$$ -139539 -109912 -43597 -85040 -34812 6907 -41195 -88986 -108280 -129545 -78402 -128321 -87844
6741h7844J18390l3893n4488o0273R3335M5039j14884M2999j2826l7660n4326
$$ -87844 30546 -3347 -57835 -118108 -24773 20266 -94618 -51619 -64445 -102105 -156431
6730a56431J2684O2104P9459j9289q3135J3860N6183J07270O8893J307j1852n8128
$$ -156431 -143747 -81643 -2184 -21473 -104608 -90748 -34565 72705 141598 142905 131053 72925
6718G2925q1624P2392K7500r1181n2685q664J16708J38863l4647k59884r0932
$$ 72925 -8699 63693 91193 12 -52673 -61337 55371 194234 159587 -100297 -191229
6707a91229P3048l0896J01771N6867J7914m1558p5117p0895k114J46116J68232
$$ -191229 -118181 -149077 -47306 9561 27475 -14083 -89200 -160095 -162209 -16093 152139
6696A52139P4459j28778p5520n9532n5841J08768j7941k1704j06642o4732r009
$$ 152139 226598 97820 22300 -37232 -93073 15695 -2246 -23950 -130592 -195324 -204333
6685b04333j00650p0078J44419J22154P873J7299L1796r5117O4708l5257m9606
$$ -204333 -304983 -375061 -230642 -108488 -100615 -83316 -51520 -146637 -81929 -117186 -166792
6674a66792O4008J7238m589o8777l0479j4113R6181m8621k7844J27714J30193
$$ -166792 -102784 -85546 -90135 -158912 -189391 -203504 -107323 -155944 -183788 -56074 74119
6663G4119J14465O3045m6020n2750p953l1401J08070M9319j6554m9651o3906j52205
$$ 74119 188584 251629 205609 152859 144906 113505 221575 270894 254340 204689 140783 -11422
6651a1422j57594j17465J10402J04862J2474n9577L1231l3620J2083j2164O1431
$$ -11422 -169016 -286481 -176079 -71217 -58743 -118320 -87089 -120709 -108626 -120790 -59359
6640e9359L6848O389j5574J3961K7182l6053j00375N2269J11876J035J0215l901
$$ -59359 -22511 -16122 -31696 -17735 9447 -26606 -126981 -74712 37164 38199 48414 44513
6628D4513j4103o0546j19875l44J04605K7110K6313K7394l1812R6417J28567j66540
$$ 44513 30410 -30136 -150011 -150355 -45750 -18640 7673 35067 3255 99672 228239 61699
6616F1699r7034l9084n4090K1737J5608M1708j13865j52655O2777N7649N1983
$$ 61699 -35335 -74419 -128509 -106772 -91164 -49456 -163321 -315976 -253199 -195550 -143567
6605a43567P803k5468O9458J0652k4490m6955J10385j4678n0438R8378O484N511
$$ -143567 -135764 -161232 -91774 -81122 -105612 -152567 -42182 -56860 -107298 -8920 -2436 3075
6593C075J8307K4585j39082o5677L4864j5345N9157J15441O7537j03434M9075
$$ 3075 21382 45967 -93115 -158792 -123928 -139273 -80116 35325 102862 -572 48503
6582D8503Q7415r4534p9034J5996n5807o26M7047k6351k7731m005P215K9821r8628
$$ 48503 135918 41384 -37650 -21654 -77461 -78087 -31040 -57391 -85122 -89127 -81912 -52091 -150719
6569a50719q1988K2900Q710O1021n4110K0908N3130P830J91186M8616k1221j18414
$$ -150719 -232707 -209807 -201097 -140076 -194186 -173278 -120148 -112318 78868 127484 106263 -12151
6557a2151P9235R1028n0095m9740j2137k0850j92338O61M0590o0332J60835J28198
$$ -12151 67084 158112 108017 58277 46140 25290 -167048 -166387 -125797 -186129 -25294 102904
6545A02904L2829K8060K6269m2592j3757N7659J7712k6937K7576k5270k5006r5796
$$ 102904 135733 163793 190062 147470 133713 191372 209084 182147 209723 184453 159447 63651
6533F3651j27362l1725K3291k1754M8005m0521n4881k7438O0544J14547p3988
$$ 63651 -63711 -95436 -72145 -93899 -45894 -86415 -141296 -168734 -108190 6357 -67631
6522f7631R244J24860P7887M6098j1307p785k7235J32460N3571o4278j31663l5013
$$ -67631 -58387 66473 144360 190458 179151 171366 144131 276591 330162 265884 134221 99208
6510I9208j75252n097j6042N13J9089K2816J0103m8101l9198n2802j00017p7685
$$ 99208 -76044 -81141 -97183 -96670 -77581 -54765 -44662 -92763 -131961 -184763 -284780 -362465
6498c62465M3698R7619J1343L2588L5312j5245L3624P9448J11730O5750j52249
$$ -362465 -318767 -221148 -209805 -177217 -141905 -157150 -123526 -44078 67652 133402 -18847
6487a8847j00874L4696J8753j3580K0484J31532R1018n3210j58040o6611Q6520
$$ -18847 -119721 -85025 -66272 -79852 -59368 72164 163182 109972 -48068 -114679 -28159
6476b8159J34363P3562j220q5614P1591J9941N227o217j54951j91853O2428J6531
$$ -28159 106204 179766 178546 92932 164523 184464 189691 183474 28523 -163330 -100902 -84371
6464h4371k348l7126Q2014M1362L8674N2468O7918K6277j07810n8811m0339L299
$$ -84371 -86719 -123845 -41831 -469 38205 90673 158591 184868 77058 18247 -22092 -18793
6452a8793k5687K3072j1953p4331M0336J05568j07255K6895N8100k3643k3419
$$ -18793 -44480 -21408 -33361 -107692 -67356 38212 -69043 -42148 15952 -7691 -31110
6441c1110J3758l0137K4449k881J1300k6355j09576J97841J13086j10356r3045
$$ -31110 -17352 -47489 -23040 -25921 -14621 -40976 -150552 47289 160375 50019 -43026
6430d3026J38929K41m873k3717j22871n6377O9964M6087K2676K3786J15702p4017
$$ -43026 95903 96144 91271 67554 -55317 -111694 -41730 4357 27033 50819 166521 92504
6418I2504j26481N4455J21636p9506j61737k7166L4449J66896R6288J3645j09296
$$ 92504 -33977 20478 142114 62608 -99129 -126295 -91846 75050 171338 184983 75687
6407G5687l4330o9561k2933K4297J8706R004k7106l5350P6095J34528J02949o5275
$$ 75687 41357 -28204 -51137 -26840 -8134 870 -26236 -61586 14509 149037 251986 186711
6395A86711m9446p2598j5409l1925J4301j22930j03391J84495J61803j01570r6225
$$ 186711 137265 64667 49258 17333 31634 -91296 -194687 -10192 151611 50041 -46184
6384d6184O4140K4536l1926q7349J01400l0527n5810k9794l4296L9520O7810R1555
$$ -46184 17956 42492 10566 -76783 24617 -5910 -61720 -91514 -125810 -86290 -18480 73075
6372G3075L0858l8821p4798j07585j264j305q7278l18J13284J15048N9436MJ8730
$$ 73075 103933 65112 -9686 -117271 -118535 -119840 -207118 -207436 -94152 20896 80332 80336 99066
6359I9066q6019j01314q6527j1830K3570o9227k7559R440J40968J78616N4495
$$ 99066 13047 -88267 -174794 -186624 -163054 -232281 -259840 -250400 -109432 69184 123679
6348A23679o8889j03657L180J2580Q1224j5139l6982j649r4279o9904L513J75524
$$ 123679 54790 -48867 -45687 -33107 48117 32978 -4004 -5653 -99932 -169836 -166323 9201
6336I201J25646r9483q1878j24037q6028n079Q7587P0351P1588J24821j42780
$$ 9201 134847 35364 -46514 -170551 -256579 -261658 -174071 -103720 -32132 92689 -50091
6325e0091l6597J56448J57476O4356j16095q1253j240p7394j19526M4056J13685
$$ -50091 -86688 69760 227236 291592 175497 94244 93004 15610 -103916 -59860 53825
6314E3825J5497j25365o6681J45463J02992q6475j36366J12533J89103p1262q8591
$$ 53825 69322 -56043 -122724 22739 125731 39256 -97110 15423 204526 133264 44673
6303D4673j8193j9496M8014o6629L6672L4138P4414J70398Q8122k51313j25569
$$ 44673 26480 6984 54998 -11631 25041 59179 133593 303991 392113 140800 15231
6292A5231P934K7857M6411m6080M7623m9499k2633j39435r1048Q287Q6796J24261
$$ 15231 23165 51022 97433 51353 98976 49477 26844 -112591 -203639 -195352 -108556 15705
6280A5705o42k3864j34854l5388N5400j4143L68J8489J40816K3480j06837R797
$$ 15705 15063 -8801 -143655 -179043 -123643 -137786 -137418 -118929 21887 45367 -61470 -51673
6268e1673o8804j0444O399l1819O8067J26560P828k4859j00083j8555l7267n1169
$$ -51673 -120477 -130921 -124522 -156341 -88274 38286 46114 21255 -78828 -97383 -134650 -185819
6256a85819O4484P8875J48313j8337j20140r8269K668L4589j8736J1057L7354
$$ -185819 -121335 -42460 105853 87516 -32624 -130893 -128225 -93636 -112372 -101315 -63961
6245f3961K4585M4361j0797M7193O6511l491j05802L9969J2240j0991n1332r1785
$$ -63961 -39376 4985 -5812 41381 107892 104401 -1401 38568 50808 39817 -11515 -103300
6233a03300o5806M6172P3903K01645j280j70864n5467R1952J14792j2618J1492
$$ -103300 -169106 -122934 -49031 152614 151334 -19530 -74997 16955 131747 119129 130621
6222A30621q379j6471k8713Q4131l8934o7496P5890Q9964n2018o1155r0975K9649
$$ 130621 122242 105771 77058 161189 122255 54759 130649 220613 168595 107440 16465 46114
6210D6114K5801r0692j26195L2283J34010R7395j00538K0270j5684m5217j68Q2532
$$ 46114 71915 -18777 -144972 -112689 21321 118716 18178 38448 22764 -22453 -22621 59911
6198E9911R3345j7242r1513q6705M5304n7752k4850J54866k1571M4256k0422j73675
$$ 59911 153256 136014 44501 -42204 3100 -54652 -79502 75364 53793 98049 77627 -96048
6186i6048q9301R8074K5852L2036p7448k0506K7209K1639J42195j9666r0907r0220
$$ -96048 -185349 -87275 -61423 -29387 -106835 -127341 -100132 -78493 63702 44036 -46871 -137091
6174a37091l6751J42415J17203R1207K7024M3838j33931p6510j5453p8366M1655
$$ -137091 -173842 -31427 85776 176983 204007 247845 113914 37404 21951 -56415 -14760
6163a4760K1280J2892J4896j32432q6413N0872P1014R5027l7897J6997k1950K5201
$$ -14760 6520 19412 34308 -98124 -184537 -133665 -62651 32376 -5521 11476 -10474 14727
6151A4727k9908Q10P15n4406K3248N4746J7760n9200k5105l8082L5799O6910R8301
$$ 14727 -15181 -14371 -13656 -68062 -44814 9932 27692 -31508 -56613 -94695 -58896 8014 106315
6138A06315O3739k0380M09l9646j82287o1507Q6825J43711M2258k07744J3258
$$ 106315 170054 149674 150083 110437 -71850 -133357 -46532 97179 139437 -68307 -55049
6127e5049M6625j089J220J08932P3306m948l3000O4804k3351j36742m5366J8608
$$ -55049 -8424 -9513 -8293 100639 173945 168997 135997 200801 177450 40708 -4658 13950
6115A3950Q8492J0561m343L3987P3290L9092l4950q1774q0933k7091r4857M7353
$$ 13950 102442 113003 108660 142647 215937 255029 220079 138305 57372 30281 -64576 -17223
6103a7223L2480q7358L4901M5900j9347L041P264j8198j7832J9428J8292p5453
$$ -17223 15257 -72101 -37200 8700 -10647 -7606 -342 -18540 -36372 -16944 1348 -74105
6091g4105R658n4621l1143O2541J52409P9763l9990q1523M947q6550k4497L8056
$$ -74105 -64447 -119068 -150211 -87670 64739 144502 104512 22989 27936 -58614 -83111 -45055
6079d5055J3239L928j92061j22169R3307Q1002P4013J05694J18748n5248r753
$$ -45055 -31816 -27888 -219949 -342118 -248811 -167809 -93796 11898 130646 75398 65645
6068F5645o5012m3440j4646q4286L1642N5137Q1944N6870j23937k654O2460j2994
$$ 65645 633 -42807 -57453 -141739 -110097 -54960 26984 83854 -40083 -42737 19723 6729
6056F729N2525N6274j56670q1334J9232l3365J5205J07631J58727m4471L7429
$$ 6729 59254 115528 -41142 -122476 -103244 -136609 -121404 -13773 144954 100483 137912
6045A37912L4616j5888R9502k422j33365j58955r7646R6124r843r1459j9123l8371
$$ 137912 172528 156640 256142 253720 120355 -38600 -136246 -40122 -49965 -141424 -160547 -198918
6033a98918m9772J6754Q8834J08645M5883J0256l1979J096O8249K6623k0802l5961
$$ -198918 -248690 -231936 -143102 -34457 11426 21682 -10297 -9201 59048 85671 64869 28908
6021B8908n7916j10631R041R3202o0235K1373P5053J69963m7035j41000j14493
$$ 28908 -29008 -139639 -130598 -37396 -97631 -76258 -1205 168758 121723 -19277 -133770
6010a33770J9719J07414Q6219k2738j276J4388l2613j8559r0124N8123M8991L2012
$$ -133770 -114051 -6637 79582 56844 55568 69956 37343 18784 -71340 -13217 35774 67786
5998F7786O0715n5255k5417p4873O8728L5913j41482r3866M9773J25755Q0209
$$ 67786 128501 73246 47829 -27044 41684 77597 -63885 -157751 -107978 17777 97986
5987I7986j17841q6866m82j6990q793j6190J1227L4903r4282L2243J5280M0982
$$ 97986 -19855 -106721 -107203 -124193 -132986 -149176 -137949 -103046 -197328 -165085 -149805 -108823
5975a08823L2481Q1444J1789l7315K7023N4474L0841k7777n1804L9426J00077
$$ -108823 -76342 5102 16891 -20424 6599 61073 91914 64137 12333 51759 151836
5964A51836k5502K8338j29903k58744l4902R8152J66268o1039j56071R1413R9658
$$ 151836 126334 154672 24769 -233975 -268877 -170725 -4457 -65496 -221567 -130154 -30496
5953c0496N2055P5074l3345L2141n4872j10551M7918N4049M7154j26055j57652
$$ -30496 21559 96633 63288 95429 40557 -69994 -22076 31973 79127 -46928 -204580
5942b04580J01899K04269N4887n8364N519p3503M7915q9917k7450M8672M476J8252
$$ -204580 -102681 101588 156475 98111 103630 30127 78042 -11875 -39325 9347 13823 32075
5930C2075L7627j2698J43070O5497k9311o9518m087M3524k6522r9099m4717L884
$$ 32075 69702 57004 200074 265571 236260 166742 162655 206179 179657 80558 35841 39725
5918C9725O4166k0539p5010L6997J00421M9162k3154m0598r7045j8383l0447K012
$$ 39725 103891 83352 8342 45339 145760 194922 171768 131170 34125 15742 -14705 -12693
5906a2693L793Q2009Q6208N1819J6087p4115m9516k7086j60779P0873r6083Q703
$$ -12693 -8900 73109 159317 211136 227223 153108 103592 76506 -84273 -13400 -109483 -100780
5894a00780R3799J03858P4533n2653L2160p356n6085o9914j26921l4512r9576
$$ -100780 -6981 96877 171410 118757 150917 143561 87476 17562 -109359 -143871 -243447
5883b43447J3817J15556K6795P9740M210J5931J986Q0711q029l4104m454j7818
$$ -243447 -229630 -114074 -87279 -7539 -3329 12602 14588 95299 87270 53166 48712 30894
5871C0894p8654j08788L1746J02842P1527q7560j10269J8402J1326J0462P1171
$$ 30894 -47760 -156548 -124802 -21960 49567 -37993 -148262 -129860 -118534 -108072 -36901
5860c6901J13475R3821N747o8019M9547j54410j11268J26843J930o4656P4392
$$ -36901 76574 170395 176142 108123 157670 3260 -108008 18835 20765 -43891 30501
5849C0501m8439l9164l037j3008O678j0236R42k1005L6964K5783Q0739J6090r3369
$$ 30501 -17938 -57102 -60139 -73147 -66469 -76705 -75763 -96768 -59804 -34021 46718 62808 -30561
5836c0561j66473J10416K02740N8452P471j4514J6321j6978p6458J6689k6437
$$ -30561 -197034 -86618 116122 174574 182045 167531 183852 166874 90416 107105 80668
5825H0668m5016r861q9768q8398j946K36919j5672j21812K689P5961l9576j07524
$$ 80668 35652 25791 -63977 -152375 -154321 82598 66926 -54886 -52197 23764 -15812 -123336
5813a23336l6129k0524K9298K8781K903J5651m1780q789m3984L6014J66018K2428
$$ -123336 -159465 -179989 -150691 -121910 -119007 -103356 -145136 -153925 -197909 -161895 4123 26551
5801B6551r5092j57367k7352K1600J71646J53949P4801q870m6664p0539r4867
$$ 26551 -68541 -225908 -253260 -231660 -60014 93935 168736 159866 113202 42663 -52204
5790e2204p4499P1181k7996o8001m7070O004l0049l7664P0848M9420J64150p766
$$ -52204 -126703 -55522 -83518 -151519 -198589 -192585 -222634 -260298 -189450 -140030 24120 16354
5778A6354l677N1645L2900O7009L5760Q720j05499k4262J83424k4304j23181k6767
$$ 16354 12677 64322 97222 164231 199991 208711 103212 78950 262374 238070 114889 88122
5766H8122j5982j27385k8979K2111M36P6368p4472J1338N579l2643k6101K8592
$$ 88122 72140 -55245 -84224 -62113 -61677 14691 -59781 -48443 -42864 -75507 -101608 -73016
5754g3016N0572O3765M5126j29710Q5467M6915L3916J8099j55274j06159Q3635
$$ -73016 -22444 41321 86447 -43263 42204 89119 123035 141134 -14140 -120299 -36664
5743c6664q1913M9078J16389K7187J3751R6813n1506m9304Q438J05513j3774j24474
$$ -36664 -118577 -69499 46890 74077 87828 184641 133135 83831 92269 197782 184008 59534
5731E9534l2299J8531p1957o8504l2260k6902N5998j4144J04131m772n6330q781
$$ 59534 27235 45766 -26191 -94695 -126955 -153857 -97859 -112003 -7872 -12644 -68974 -77755
5719g7755M9624n4234K3836J9619l1584R2834M4405L2941Q025k3578k9908Q1713
$$ -77755 -28131 -82365 -58529 -38910 -70494 22340 66745 99686 107711 84133 54225 135938
5707A35938R7969p0046r9540q6884l3828n1796n8026O585M2223m5286l201j7141
$$ 135938 233907 163861 64321 -22563 -56391 -108187 -166213 -159628 -117405 -162691 -165892 -183033
5695a83033N1301N7052j13598q315N9733m913M4115J68176Q6039j552q2815m6102
$$ -183033 -131732 -74680 -188278 -196593 -136860 -141773 -97658 70518 156557 155005 72190 26088
5683B6088j8301Q7579J22539r5201j7247J59902j6395n1469q6758m7504j4018
$$ 26088 7787 95366 217905 122704 105457 265359 248964 197495 110737 63233 49215
5672D9215n0118M6288o9529j61870O1052K10775m3069l4047N4263L4648r9298
$$ 49215 -903 45385 -24144 -186014 -124962 85813 42744 8697 62960 97608 -1690
5661a690q4818R7140P4851L5086J5685j0402j05519r0050R324J9127k5966l8690
$$ -1690 -86508 10632 85483 120569 136254 125852 20333 -69717 -60393 -41266 -67232 -105922
5649a05922K4549l3093O8898R0878O4300K5663l7820m5336N1931p2276k25835
$$ -105922 -81373 -114466 -45568 45310 109610 135273 97453 52117 104048 31772 -194063
5638a94063r8955J33650J05368R8630k5141r3008o3311o446M5732O4898L7801
$$ -194063 -293018 -159368 -54000 44630 19489 -73519 -136830 -143276 -97544 -32646 5155
5627E155k6316p1581m12O469M2746k8550r4353p4006L2081P8530L8107J6061R6270
$$ 5155 -21161 -92742 -93154 -86685 -43939 -72489 -166842 -240848 -208767 -130237 -92130 -76069 20201
5614B0201q7522J50505J16718j48980n2997n416L4198o2701j04383J9088J17662
$$ 20201 -67321 83184 199902 50922 -2075 -7491 26707 -35994 -140377 -121289 -3627
5603c627Q0701J6000q1379m1981R176J11245L4781n0254l9600j1514M7691M3559
$$ -3627 77074 93074 11695 -30286 -21110 90135 124916 74662 35062 23548 71239 114798
5591A14798o552o5912l7319O628o8539o1177K498J5656m3599R5819O0441L2139
$$ 114798 108246 42334 5015 11643 -56896 -118073 -115575 -99919 -143518 -47699 12742 44881
5579D4881J6723k5156P0475j2324p3368o2859p3723j4692P6688N2747J15748J2882
$$ 44881 61604 36448 106923 94599 21231 -41628 -115351 -130043 -53355 -608 115140 128022
5567A28022r0976n7739p4959N8075r413j72162n2085J34645J10913K0388l2621
$$ 128022 37046 -20693 -95652 -37577 -46990 -219152 -271237 -136592 -25679 -5291 -37912
5556c7912o2184L2401N9455k9320l9142M4548j1927j01420J01062J02723N0204
$$ -37912 -100096 -67695 -8240 -37560 -76702 -32154 -44081 -145501 -44439 58284 108488
5545A08488J15335n5528k7986O1257K4914o1859j02871j13334j13527R7793Q8607
$$ 108488 223823 168295 140309 201566 226480 164621 61750 -51584 -165111 -67318 21289
5534B1289q447N0849J4193n7389m2106j00773J06818M1445j08519j04329P5812
$$ 21289 12842 63691 77884 20495 -21611 -122384 -15566 25879 -82640 -186969 -111157
5523a11157K2527Q8033l7819j8673J02619k0862j4464K2872o6931p9537M9311
$$ -111157 -88630 -597 -38416 -57089 45530 24668 10204 33076 -33855 -113392 -64081
5512f4081j2318j5298J23515Q3909J4103j6456j28250q0144L9912o8342r705J12210
$$ -64081 -76399 -91697 31818 115727 129830 113374 -14876 -95020 -55108 -123450 -133155 -20945
5500b0945L6054N0884M7893o6640q0357o6690J08960K3380k6169j6071J06476
$$ -20945 15109 65993 113886 47246 -33111 -99801 9159 32539 6370 -9701 96775
5489I6775O7767m3715k627M1792K993j4234k7018J3341l8015l2083p4356l7884
$$ 96775 164542 120827 118200 159992 162985 148751 121733 135074 97059 64976 -9380 -47264
5477d7264J03622j6878q8344m4962J00805l413j03554m6337P316J05835p781j07114
$$ -47264 56358 39480 -48864 -93826 6979 3566 -99988 -146325 -139009 -33174 -40955 -148069
5465a48069p3551k2292K3763K535J06988m0441q4042J81322Q1162L9553o521K2527
$$ -148069 -221620 -243912 -220149 -217614 -110626 -151067 -235109 -53787 27375 66928 60407 82934
5453H2934q1501l1485j2393K5522l837k2161p484m3241k0312n2342N8546j58170
$$ 82934 1433 -30052 -42445 -16923 -20760 -42921 -50405 -93646 -113958 -166300 -107754 -265924
5441b65924n1797J60912Q8679q4699j11702J56322K02252O4115p6912j3119q3312
$$ -265924 -317721 -156809 -68130 -152829 -264531 -108209 94043 158158 81246 68127 -15185
5430a5185P1237N8292m7803K7172m8898l5914K4091P1281J3357L1903l1985j4503
$$ -15185 56052 114344 66541 93713 44815 8901 32992 104273 117630 149533 117548 103045
5418A03045n4935M7024n1093p4807O1044r3633q3891O9813J36754K918j23328
$$ 103045 48110 95134 44041 -30766 30278 -63355 -147246 -77433 59321 62239 -61089
5407f1089m7150q4903J30476N5581J5624j7161O1619M1469o6624R6493J37959
$$ -61089 -108239 -193142 -62666 -7085 8539 -8622 52997 94466 27842 124335 262294
5396B62294P5465N5170j23031j11759Q389j85418j4195L0585J3321P151j46484
$$ 262294 337759 392929 269898 158139 166528 -18890 -33085 -2500 10821 17972 -128512
5385a28512J20351R053M1759p8451O0269O7633k5553n7976J3055L8570P5562j12591
$$ -128512 -8161 892 42651 -35800 24469 92102 66549 8573 21628 60198 135760 23169
5373B3169j12408q498r5084q3973J02489J55119P6858Q8293j36518j02844m6988
$$ 23169 -89239 -97737 -192821 -276794 -174305 -19186 57672 145965 9447 -93397 -140385
5362a40385L5594J49309K0377L8723j18040Q74m439m5891J04662p7545r2129Q1891
$$ -140385 -104791 44518 64895 103618 -14422 -13548 -17987 -63878 40784 -36761 -128890 -46999
5350d6999J07906L4661p3942j7335j7478j11281O8630m2596R716P4688k0669j7377
$$ -46999 60907 95568 21626 4291 -13187 -124468 -55838 -98434 -88718 -14030 -34699 -52076
5338e2076k0802R622J21354q7517j31962N411M6765k1277j6210O8561j9005L9732
$$ -52076 -72878 -63256 58098 -29419 -161381 -155970 -109205 -130482 -146692 -78131 -97136 -57404
5326e7404j3226L944k6349M2440r947q9652L5151o1298J474J03460N4587O0670
$$ -57404 -70630 -66686 -93035 -50595 -60542 -150194 -115043 -176341 -174867 -71407 -16820 43850
5314D3850l8979k7198m4624N8826J3338l8572N9323o7492l2916m6927k85L2577
$$ 43850 4871 -22327 -66951 -8125 5213 -33359 25964 -41528 -74444 -121371 -121656 -89079
5302h9079q65K16679P1684o9290p4667m7749l3057J16157R6939N5608r1361J8692
$$ -89079 -89944 126735 198419 129129 54462 6713 -26344 89813 186752 242360 150999 169691
5290A69691K001o8383o0062m4960r598Q9966J9378P0375n560j45290r9639n6055
$$ 169691 171692 103309 43247 -1713 -11311 78655 98033 168408 162848 17558 -82081 -138136
5278a38136m4828O8303K7612j4853m8885n9375n8932L5451Q8006J01086j6636
$$ -138136 -182964 -114661 -87049 -101902 -150787 -210162 -269094 -233643 -145637 -44551 -61187
5267f1187J08070l6134m7750l6930l8051m1777j4200K58J30083M4353p2355N1174
$$ -61187 46883 10749 -37001 -73931 -111982 -153759 -167959 -167701 -37618 6735 -65620 -14446
5255a4446o0627j9558L4765n4277j2823K2262N4369n9582m1860J10770N3561n4474
$$ -14446 -75073 -94631 -59866 -114143 -126966 -104704 -50335 -109917 -151777 -41007 12554 -41920
5243d1920k03183r2145O9929k361N7706J75548O7091O2244n6933M0954K2700N5536
$$ -41920 -245103 -337248 -267319 -269680 -211974 -36426 30665 92909 35976 76930 99630 155166
5231A55166l9574j73858j11216R3436N2992k8896M4720O3188k630M1694J8368
$$ 155166 115592 -58266 -169482 -76046 -23054 -51950 -7230 55958 53328 95022 113390
5220A13390n5521k3744j73307m2659R3624N6557J03601k0380j47234Q811M4266
$$ 113390 57869 34125 -139182 -181841 -88217 -31660 71941 51561 -95673 -86862 -42596
5209d2596L6522O9616K3406m2510j967j67453O708K4595l0754K6565K2866l2714
$$ -42596 -6074 63542 86948 44438 42471 -124982 -118274 -93679 -124433 -97868 -75002 -107716
5197a07716Q1546Q2162M477k3493k7545K9863Q5564o6130q2502o181n7666l6982
$$ -107716 -26170 55992 60469 36976 9431 39294 124858 58728 -23774 -29955 -87621 -124603
5185a24603Q3063L6167p5284n7509Q8042J07217j05570j6171Q7978K032m3888
$$ -124603 -41540 -5373 -80657 -138166 -50124 57093 -48477 -64648 23330 25362 -18526
5174a8526k3784k8557O785p0564p673j2343K9295J01703O6454k6730m1648o4291
$$ -18526 -42310 -70867 -64082 -134646 -142319 -154662 -125367 -23664 42790 16060 -25588 -89879
5162h9879k6766O4937J15p0069p6830M5512J11662M859m1025l8962R2426r5673
$$ -89879 -116645 -51708 -51593 -121662 -198492 -152980 -41318 -36459 -77484 -116446 -24020 -119693
5150a19693j33348N6540J02247J8663j41112q2105K6457L4086K16067J93046j03609
$$ -119693 -253041 -196501 -94254 -75591 -216703 -298808 -272351 -238265 -22198 170848 67239
5139F7239r5338N3292L1914J19383l8889j18787R093Q912q1649o1281J8310J04145
$$ 67239 -28099 25193 57107 176490 137601 18814 27907 36819 -44830 -106111 -87801 16344
5127A6344M8543m9610R2855R7740j10029j04324o4151m4519k7467Q1161K5581
$$ 16344 64887 15277 108132 205872 95843 -8481 -72632 -117151 -144618 -63457 -37876
5116c7876L2153m2969j9035p6688L8523K6688l518O0274L0683j34435n2390J9655
$$ -37876 -5723 -48692 -67727 -144415 -105892 -79204 -82722 -22448 8235 -126200 -178590 -158935
5104a58935k5678K0471p332K9098P8233J00785J8174J5894j10246n0726Q9886
$$ -158935 -184613 -164142 -171474 -142376 -64143 36642 54816 70710 -39536 -90262 -376
5093c76J9535J8839p9542o4040l0110O5098J91217J05182K9195j34991j9279j7808
$$ -376 19159 37998 -41544 -105584 -135694 -70596 120621 225803 254998 120007 100728 82920
5081H2920l0993j38740O2482K9703K7476j7446l0453O6917k955j44799r1753k0929
$$ 82920 51927 -86813 -24331 5372 32848 15402 -15051 51866 48911 -95888 -187641 -208570
5069b08570J59692J8917n9181n6425Q0337n5198j100q3413j4643Q3253J16632
$$ -208570 -48878 -29961 -89142 -145567 -65230 -120428 -121528 -204941 -219584 -136331 -19699
5058a9699K1371j19997J8125n5185J6494j6783q0515P8718j6818O9266J46671
$$ -19699 1672 -118325 -100200 -155385 -138891 -155674 -236189 -157471 -174289 -105023 41648
$$ [...]
##END NTUPLES=NMR SPECTRUM
##END=
