##TITLE=Analysis number 317812
Compound Code rf 03845
Project Code adrs
Chemist Name fudan
##JCAMPDX= 6.0         $$ Bruker NMR JCAMP-DX V2.0
##DATA TYPE= NMR SPECTRUM
##DATA CLASS= NTUPLES
##ORIGIN= Bruker BioSpin GmbH
##OWNER= nmr
$$ XWIN-NMR		Version 3.5
$$ Mon Mar  6 11:54:12 2006 GMT Standard Time (UT+0h)  MAYBRIDGE\nmr@NMR_250MHZ
##.OBSERVE FREQUENCY= 250.131544655141
##.OBSERVE NUCLEUS= ^1H
##.ACQUISITION MODE= SIMULTANEOUS (DQD)
##.ACQUISITION SCHEME= undefined
##.AVERAGES= 16
##.DIGITISER RES= 18
##SPECTROMETER/DATA SYSTEM= dpx250
##.PULSE SEQUENCE= zg30
##.SOLVENT NAME= CDCl3
##.SHIFT REFERENCE= (INTERNAL, CDCl3, 0, 16.522)
##AUDIT TRAIL= $$ (NUMBER, WHEN, WHO, WHERE, WHAT)
$$ ##TITLE= Audit trail, XWIN-NMR		Version 3.5
$$ ##JCAMPDX= 5.01
$$ ##ORIGIN= Bruker BioSpin GmbH
$$ ##OWNER= nmr
$$ C:\u/data/dgb/nmr/ADRS/40/pdata/1/auditp.txt
$$ ##AUDIT TRAIL=  $$ (NUMBER, WHEN, WHO, WHERE, WHAT)
(   1,<2006-03-06 11:53:29.07 +000>,<MAYBRIDGE\nmr>,<NMR_250MHZ>,
      <created by zg, POWCHK disabled, PULCHK disabled
       configuration hash MD5:
       84 BC 41 DB A1 6E 1D 46 DA 25 12 A5 C1 ED C5 3A
       data hash MD5: 64K
       18 58 CB 01 85 3A A6 D1 02 B0 DF 40 4C 1C A2 23>)
(   2,<2006-03-06 11:53:51.07 +000>,<MAYBRIDGE\nmr>,<NMR_250MHZ>,
      <Start of raw data processing
       ef LB = 0.3 FT_mod = 6 PKNL = 1 SI = 32K 
       data hash MD5: 32K
       81 51 32 FA B4 70 C4 30 61 0E E0 18 71 36 72 5E>)
(   3,<2006-03-06 11:53:53.44 +000>,<MAYBRIDGE\nmr>,<NMR_250MHZ>,
      <apk 
       data hash MD5: 32K
       CC D2 06 5B FD C8 46 5C 9C 41 F1 BF 3B 7C 99 A0>)
(   4,<2006-03-06 11:53:54.41 +000>,<MAYBRIDGE\nmr>,<NMR_250MHZ>,
      <abs ABSG = 5 
       data hash MD5: 32K
       2F 4A 74 D3 0B 7B 59 C8 D0 9C 16 2C DF B6 0B 22>)
$$ ##END=
$$ 
$$ hash MD5
$$ 2A 31 91 2E 10 55 FC 97 0A D5 10 8E CA 54 44 17
##$RELAX= 
##$RELAX= 
##$RELAX= 
##$RELAX= 
##$RELAX= 
##$RELAX= 
##$RELAX= 
$$ Bruker specific parameters
$$ --------------------------
##$DU= <C:\u>
##$EXPNO= 40
##$NAME= <ADRS>
##$PROCNO= 1
##$TYPE= <nmr>
##$USER= <dgb>
##$AMP= (0..31)
100 100 100 100 100 100 100 100 100 100 100 100 100 100 100 100 100 100 
100 100 100 100 100 100 100 100 100 100 100 100 100 100 
##$AQSEQ= 0
##$AQ_mod= 3
##$AUNM= <au_zg>
##$AUTOPOS= <22 >
##$BF1= 250.13
##$BF2= 250.13
##$BF3= 250.13
##$BF4= 250.13
##$BF5= 500.13
##$BF6= 500.13
##$BF7= 500.13
##$BF8= 500.13
##$BYTORDA= 1
##$CFDGTYP= 0
##$CFRGTYP= 5
##$CHEMSTR= <none>
##$CNST= (0..31)
1 1 145 1 1 1 1 1 1 1 1 1 1 1 1 1 1 1 1 1 1 1 1 1 1 1 1 1 1 1 1 1 
##$CPDPRG= <>
##$CPDPRG1= <>
##$CPDPRG2= <>
##$CPDPRG3= <>
##$CPDPRG4= <mlev>
##$CPDPRG5= <mlev>
##$CPDPRG6= <mlev>
##$CPDPRG7= <mlev>
##$CPDPRG8= <mlev>
##$CPDPRGB= <>
##$CPDPRGT= <>
##$D= (0..31)
0 1 0 0 0 0 0 0 0 0.06 0 0 0 0 0 0 0.0002 0 0 0 0 0 0 0 0 0 0 0 0 0 0 
0 
##$DATE= 1141646006
##$DBL= (0..7)
120 120 120 120 120 120 120 120 
##$DBP= (0..7)
150 150 150 150 150 150 150 150 
##$DBP07= 0
##$DBPNAM0= <>
##$DBPNAM1= <>
##$DBPNAM2= <>
##$DBPNAM3= <>
$$ [...]
##$SUBNAM7= <"">
##$SUBNAM8= <"">
##$SUBNAM9= <"">
##$SW= 20.6930455092707
##$SWIBOX= (0..15)
0 0 3 0 0 0 0 0 0 0 0 0 0 0 0 0 
##$SW_h= 5175.983436853
##$TD= 65536
##$TD0= 1
##$TE= 293.16
##$TE2= 300
##$TE3= 300
##$TEG= 300
##$TL= (0..7)
0 120 120 120 120 120 120 120 
##$TP= (0..7)
150 150 150 150 150 150 150 150 
##$TP07= 0
##$TPNAME0= <>
##$TPNAME1= <>
##$TPNAME2= <>
##$TPNAME3= <>
##$TPNAME4= <>
##$TPNAME5= <>
##$TPNAME6= <>
##$TPNAME7= <>
##$TPOAL= (0..7)
0.5 0.5 0.5 0.5 0.5 0.5 0.5 0.5 
##$TPOFFS= (0..7)
0 0 0 0 0 0 0 0 
##$TUNHIN= 0
##$TUNHOUT= 0
##$TUNXOUT= 0
##$USERA1= <user>
##$USERA2= <user>
##$USERA3= <user>
##$USERA4= <user>
##$USERA5= <user>
##$V9= 5
##$VALIST= <valist>
##$VCLIST= <CCCCCCCCCCCCCCC>
##$VD= 0
##$VDLIST= <DDDDDDDDDDDDDDD>
##$VPLIST= <PPPPPPPPPPPPPPP>
##$VTLIST= <TTTTTTTTTTTTTTT>
##$WBST= 1024
##$WBSW= 4
##$XGAIN= (0..3)
0 0 0 0 
##$XL= 0
##$YL= 0
##$YMAX_a= 512877
##$YMIN_a= -450884
##$ZGOPTNS= <>
##$ZL1= 120
##$ZL2= 120
##$ZL3= 120
##$ZL4= 120
##$ABSF1= 16.522
##$ABSF2= -4.171173
##$ABSG= 5
##$ABSL= 3
##$ALPHA= 0
##$AQORDER= 0
##$ASSFAC= 0
##$ASSFACI= 0
##$ASSFACX= 0
##$ASSWID= 0
##$AUNMP= <proc_1d>
##$AZFE= 0.1
##$AZFW= 0.1
##$BCFW= 0
##$BC_mod= 0
##$BYTORDP= 0
##$COROFFS= 0
##$CY= 12.5
##$DATMOD= 1
##$DC= 0
##$DFILT= <>
##$DTYPP= 0
##$F1P= 14.0000005364418
##$F2P= -0.99999901652339
##$FCOR= 0.5
##$FTSIZE= 32768
##$FT_mod= 6
##$GAMMA= 0
##$GB= 0
##$INTBC= 1
##$INTSCL= 1
##$ISEN= 128
##$LB= 0.3
##$LEV0= 0
##$LPBIN= 0
##$MAXI= 10000
##$MC2= 0
##$MEAN= 0
##$ME_mod= 0
##$MI= 0
##$NCOEF= 0
##$NC_proc= -2
##$NLEV= 6
##$NOISF1= 0
##$NOISF2= 0
##$NSP= 0
##$NTH_PI= 0
##$NZP= 0
##$OFFSET= 16.522
##$PC= 1
##$PHC0= -21.20725
##$PHC1= 7.877067
##$PH_mod= 1
##$PKNL= yes
##$PPARMOD= 0
##$PSCAL= 4
##$PSIGN= 0
##$REVERSE= no
##$SF= 250.13
##$SI= 32768
##$SIGF1= 0
##$SIGF2= 0
##$SINO= 400
##$SIOLD= 32768
##$SREGLST= <1H.CDCl3>
##$SSB= 0
##$STSI= 32768
##$STSR= 0
##$SW_p= 5175.98343685301
##$SYMM= 0
##$S_DEV= 0
##$TDeff= 65536
##$TDoff= 0
##$TI= <Analysis number 999999
Compound Code 99
Book Reference 9
Project Code 9>
##$TILT= no
##$TM1= 0
##$TM2= 0
##$TOPLEV= 0
##$USERP1= <user>
##$USERP2= <user>
##$USERP3= <user>
##$USERP4= <user>
##$USERP5= <user>
##$WDW= 1
##$XDIM= 32768
##$YMAX_p= 300524477
##$YMIN_p= -48013
$$ End of Bruker specific parameters
$$ ---------------------------------
##NTUPLES= NMR SPECTRUM
##VAR_NAME=  FREQUENCY,     SPECTRUM/REAL,   SPECTRUM/IMAG
##SYMBOL=    X,             R,               I
##VAR_TYPE=  INDEPENDENT,   DEPENDENT,       DEPENDENT
##VAR_FORM=  AFFN,          ASDF,            ASDF
##VAR_DIM=   32768,         32768,           32768
##UNITS=     HZ,            ARBITRARY UNITS, ARBITRARY UNITS
##FACTOR=    0.157963299565203, 1,           1
##FIRST=     4132.6476996994, 0,             0
##LAST=      -1043.33573715361, 0,           0
##MIN=       -1043.33573715361, -48013,      0
##MAX=       4132.6476996994, 300524477,     0
$$ Real data points
##PAGE= N=1
##DATA TABLE= (X++(R..R)), XYDATA
$$ [...]
18759C5057l105r4N47O75L038N493K726K756K652J502O81J82n07q85r29p80q12
$$ 35057 31952 31858 32405 33080 36118 41611 44337 47093 49745 51247 51928 52110 51603 50718 49789 49009 48197
18742D8197j292j070o80k602j929k40o91m69o61K00k16N21P80N35l28R98O96J398
$$ 48197 46905 45835 45155 42553 40624 40384 39693 39224 38563 38763 38547 39068 39848 40383 40055 41053 41749 43147
18724D3147K678K219K640N039O563R109J3537J7373K0344K1006K1042J6832Q559
$$ 43147 45825 48044 50684 55723 62286 71395 84932 102305 122649 143655 164697 181529 190088
18711A90088J635l901j1213j6894j7728j6737j6045j1821o969l684n186l236q15
$$ 190088 191723 187822 176609 159715 141987 125250 109205 97384 90415 86731 81545 78309 77494
18698G7494p11J071J756K52Q72K415K377K048K737K836L035K754J814K432K736
$$ 77494 76783 77854 79610 79862 80734 83149 85526 87574 90311 93147 96182 98936 100750 103182 105918
18683A05918L819N197L652L674M989M809O983Q230J0901J1052R888P774P704P853
$$ 105918 109737 114934 118586 122260 127249 132058 139041 147271 158172 169224 179112 186886 194590 202443
18669B02443O734O175M971L726N718N974N884O179O888R667J0788J2799J6158
$$ 202443 209177 215352 220323 224049 229767 235741 241625 247804 254692 264359 275147 287946 304104
18656C04104J9262K5167K9295L6064M2616M9586N6646O4450P3053Q1740Q9430
$$ 304104 323366 348533 377828 413892 456508 506094 562740 627190 700243 781983 871413
18645H71413R3806R8151J07034J21745J45620J78814K30394L04927M11865N66094
$$ 871413 965219 1063370 1170404 1292149 1437769 1616583 1846977 2151904 2563769 3129863
18635C129863P79093J062447J414003J803967K163526K388922K363877K019126
$$ 3129863 3908956 4971403 6385406 8189373 10352899 12741821 15105698 17124824
18627A7124824J347864M34917n45589j418233k031918k311817k285470k033868
$$ 17124824 18472688 18907605 18362016 16943783 14911865 12600048 10314578 8280710
18619H280710j674118j306190r86358p37793n57122m28106l33934k65080k13265
$$ 8280710 6606592 5300402 4314044 3576251 3019129 2591023 2257089 1992009 1778744
18610A778744j72799j45788j25266j10029j00281r3183q6231p9278o9385n9865
$$ 1778744 1605945 1460157 1334891 1224862 1124581 1031398 945167 865889 796504 736639
18600G36639n0109m1912l6945l0683k4774k3832k2093k2966j9566j8163j6505
$$ 736639 686530 644618 607673 576990 552216 528384 506291 483325 463759 445596 429091
18589D29091j6932j4420j1874j0317q175o741n493l686P25L916N266R441J4788
$$ 429091 412159 397739 385865 375548 367373 360632 355139 351453 352178 356094 361360 370801 385589
18576C85589J7574K2281K7150L4490M2110M8738N5872O3921P4966Q3502R0663
$$ 385589 403163 425444 452594 487084 529194 577932 633804 697725 772691 856193 946856
18565I46856R4698R8426J06155J21045J42213J76672K27224L00718M08687N64834
$$ 946856 1041554 1139980 1246135 1367180 1509393 1686065 1913289 2214007 2622694 3187528
18555C187528P80584J069186J433661J847021K240500K505333K519300K198236
$$ 3187528 3968112 5037298 6470959 8317980 10558480 13063813 15583113 17781349
18547A7781349J523213N75052m70290j424645k116164k449996k446951k194943
$$ 17781349 19304562 19879614 19409324 17984679 15868515 13418519 10971568 8776625
18539H776625j813040j412427j064672p93498n93742m53823l54176k78378k23460
$$ 8776625 6963585 5551158 4486486 3692988 3099246 2645423 2291247 2012869 1789409
18530A789409j84255j53954j33254j17295j08064j01138r3503q5892p7663o6940
$$ 1789409 1605154 1451200 1317946 1200651 1092587 991449 897946 812054 734391 667451
18520F67451n8072n0477m3425l8993l6399l3717l2082l0608k7728k6417k5544
$$ 667451 609379 558902 515477 476484 440085 406368 374286 343678 315950 289533 263989
18509B63989k4044k3039k0431j9511j6750j3902j2974j1076o967k934k574k301
$$ 263989 239945 216906 196475 176964 160214 146312 133338 122262 115295 112361 109787 107486
18497A07486k651k251k291j837k418j827j287k573q71J566k8K018J425j257p31
$$ 107486 104835 102584 100293 98456 96038 94211 92924 90351 89480 91046 91018 93036 94461 93204 92473
18482I2473j028l150m905l496k683n01k817n548m064k705l855l009k127k802k406
$$ 92473 91445 88295 83390 79894 77211 76710 73893 68345 64281 61576 57721 54712 52585 49783 47377
18467D7377k064k803k237k974l177k149N4r11L70K229J976M75n22J276L12J204
$$ 47377 45313 42510 40273 37299 34122 31973 32027 31116 31486 33715 35691 36166 35644 36920 37232 38436
18451C8436k42l13l0M6j017q3l32j141q88M54j920k117j474q84o11j507j984k662
$$ 38436 38194 37881 37851 37897 36880 36797 36465 35324 34436 34890 32970 30853 29379 28495 27884 26377 24393 21731
18433B1731k889l425j311m87m96j626m98j102j818j426P4L84J667K832L994M335
$$ 21731 18842 15417 14106 13619 13123 11497 10999 9897 8079 6653 6727 7111 8778 11610 15604 19939
18417A9939K795O29P09j482m54o20P13J030K047K391k72m79p57j962k83k92r33
$$ 19939 22734 23363 24072 22590 22136 21516 22229 23259 25306 27697 27425 26946 26189 24227 23944 23652 22719
18400B2719J997L259J086K508K354J35J468J36k047l248n082m026k100k623j777
$$ 22719 24716 27975 29061 31569 33923 34058 35526 35662 33615 30367 25285 21259 19159 16536 14759
18385A4759j4J454L050N520M921L235J398n07k219j991j631j977m031k190k664
$$ 14759 14745 16199 19249 24769 29690 32925 34323 33816 31597 29606 27975 25998 21967 19777 17113
18370A7113j892o52l46N58N47O44l37r80q00k558k360j151O82J1k225j056q12
$$ 17113 15221 14569 14223 14781 15328 15972 15635 14655 13855 11297 8937 7786 8468 8479 6254 5198 4386
18353D386M51J309K050K316J463K349M287M237L024J194m51l75l42j897p72r28
$$ 4386 4837 6146 8196 10512 11975 14324 18611 22848 25872 27066 26615 26240 25898 24001 23229 22301
18337B2301K519N665O850O678M947J846l792n103n655o520o770l402k437j247
$$ 22301 24820 30485 37335 44013 48960 50806 47014 41911 36256 29736 22966 19564 17127 15880
18323A5880j184n29J521K628J881K405J519J583Q83r30m274l990m783n480l975
$$ 15880 14696 14167 15688 18316 20197 22602 24121 25704 26587 25657 21383 17393 12610 7130 3155
18308C155j803j665j166j881j928l44l83K26M66P15L4J684K47O08J035O58P12
$$ 3155 1352 -313 -1479 -3360 -5288 -5632 -6015 -5789 -5323 -4608 -4574 -2890 -2643 -2035 -1000 -342 370
18291C70j384m14n60J760R81K04M00q22J80O36K375J207Q70M9N8L13j169j695
$$ 370 -1014 -1428 -1988 -228 753 957 1357 535 715 1351 3726 4933 5803 5852 5910 6223 5054 3359
18273C359k118M44J30j866k131K9O24N32Q58J071j72o68K57j180J68j7O28J761
$$ 3359 1241 1685 1815 -51 -2182 -2153 -1529 -997 -139 932 760 92 349 -831 -663 -680 -52 1709
18255A709p37lJ067j70m64N68P12l5M70J199J494L185M378M697L182K623Q35j809
$$ 1709 972 969 2036 1866 1402 1970 2682 2647 3117 4316 5810 8995 13373 18070 21252 23875 24710 22901
18237B2901k283l326n319k658j486k11K009K797L349K948L388R73M61J383j307
$$ 22901 20618 17292 11973 9315 7829 7618 9627 12424 15773 18721 22109 23082 23543 24926 23619
18222B3619l748m714j654j841J46J444K174M33p95j885k907j573q56q43M24K156
$$ 23619 19871 15157 13503 11662 11808 13252 15426 15859 15064 13179 10272 8699 7843 7000 7424 9580
18206I580j30o17m60J81l5Q96K528J440m3M79l56J051q65n81Q50J611K817L456
$$ 9580 9450 8833 8373 8554 8519 9415 11943 13383 13340 13819 13463 14514 13649 13068 13918 15529 18346 21802
18188B1802L270K860K802K239J63k660k456J79QM412O176L698J619o20l511n911
$$ 21802 25072 27932 30734 32973 33136 30476 28020 28199 28207 32619 38795 42493 44112 43492 39981 34070
18172C4070o798o252l289j934k346k290j569j212O09o25j447k813K7l99r32J9
$$ 34070 27272 21020 17731 15797 13451 11161 9592 8380 8989 8364 6917 4104 4131 3732 2800 2819
18156B819M25l89j177j307j97L22J23R46L58N07P75k3R37N10J751L53N09J311
$$ 2819 3244 2855 1678 371 174 496 619 1565 1923 2430 3205 3182 4119 4629 6380 6733 7242 8553
18138H553J09j376M6K092L807L547J635Q85l72L12J456j31L52J268J309Q58K26
$$ 8553 8662 7286 7332 9424 13231 16778 18413 19298 18926 19238 20694 20563 20915 22183 23492 24350 24576
18121B4576n56O50J672Q03J276J489K609L632N200O354R286J3187J8961K9395
$$ 24576 24020 24670 26342 27145 28421 29910 32519 36151 41351 47705 56991 70178 89139 118534
18107A18534M7137P1316J18216K14720L75031M84150K96131M5124j56095l68876
$$ 118534 165671 236987 355203 569923 944954 1429104 1725235 1770359 1614264 1245388
18097A245388m53173l01681j54370q4023n2294l6038k7539k1666j7538j3497j0114
$$ 1245388 792215 490534 336164 252141 199847 163809 136270 114604 97066 83569 73455
18086G3455q579o653n832n393n042l788l056k169l176j998j672j893k562j198
$$ 73455 64876 58223 52391 46998 41956 38168 35112 32943 29767 27769 26097 24204 21642 20444
18072B0444j593k775j273n33j087j548j316k35j95N87p75j265n06j795n87K25
$$ 20444 18851 16076 14803 14270 13183 11635 10319 10084 9889 10476 9701 8436 7930 6135 5548 5773
18056E773r35o12L40q39m06Q59J384k0j022j189R33J095J560J080J367K44Q35
$$ 5773 4838 4226 4566 3727 3321 4180 5564 5544 4522 3333 4266 5361 6921 8001 9368 9612 10447
18039A0447J124L3Q90L33m05J315K94J949R95J625L228K345K861N970P334R380
$$ 10447 11571 11604 12494 12827 12422 13737 14031 15980 16975 18600 21828 24173 27034 33004 40338 49718
18023D9718J0185J2021J0583R618N628K83m668q193j0993j1487j1370r724p423
$$ 49718 59903 71924 82507 92125 97753 98036 93368 85175 74182 62695 51325 41601 34178
18010C4178n798n133m459k984k481j330j297j183L93l10j472j033n46Q6n19j004
$$ 34178 28380 23247 18788 15804 13323 11993 10696 9513 9906 9596 8124 7091 6545 6631 6112 5108
17994E108j86N6m96q94m91m32l57N67L10n98r39q20k041k92J908j98j451l264
$$ 5108 4922 4978 4482 3588 3097 2665 2308 2875 3185 2587 1648 828 -1213 -1505 403 205 -1246 -4510
17976d510J06K392K615J109j048L55L26j097l92M19p27o15p00o69o45J550Q34
$$ -4510 -4404 -2012 603 1712 664 1019 1345 248 -144 275 -452 -1067 -1767 -2436 -3081 -1531 -697
17959f97M9j620L5p7M60O03p09q85K20k13Q30k80j334j6J322R41K21n69MP96K72
$$ -697 -648 -2268 -2233 -2310 -1850 -1247 -1956 -2841 -2621 -2834 -2004 -2284 -3618 -3634 -2312 -1371 -1150 -1719 -1715 -919 -647
17938f47k97n01J072q3R0l4L44L74k96k30p18j480k012J355K020J83j370l69N03
$$ -647 -944 -1445 -373 -456 -366 -400 -56 318 22 -208 -926 -2406 -4418 -3063 -1043 -860 -2230 -2599 -2096
17919b096K79J580l8N1j364n93J108O05j37n25J59J091R22J654K670j92l68K75
$$ -2096 -1817 -237 -275 -224 -1588 -2181 -1073 -468 -605 -1130 -971 120 1042 2696 5366 5174 4806 5081
17901E081q07l87l33J70o58q57O81j93j45J405j359l96K814J808J586J915K024
$$ 5081 4274 3887 3554 3724 3066 2209 2890 2697 2552 3957 2598 2202 5016 6824 8410 10325 12349
17884A2349J542K1n2J582Q07L6l01o93J516N04j013q27j398j648n24J973m79j457
$$ 12349 13891 13912 13860 15442 16249 16285 15984 15291 16807 17311 16298 15471 14073 12425 11901 13874 13395 11938
17866A1938j617j370P26Q63l90n59j235J44J180l81n97p13l85j254q79k17Q39
$$ 11938 10321 8951 9677 10540 10150 9591 8356 8500 9680 9299 8702 7989 7604 6350 5471 5254 6093
17849F093l52j314j538r68M34L41j855J79Q06J053M30J807Q88n30L00J208J224
$$ 6093 5741 4427 2889 1921 2355 2696 841 1020 1826 2879 3309 5116 6004 5474 5774 6982 8206
17832H206K294P34j461k1J26K89q7R3N75o41P34j41m85p69J21q95q15o07j38o64
$$ 8206 10500 11234 9773 9752 9878 10167 10080 10173 10748 10107 10841 10700 10215 9446 9567 8672 7857 7250 7112 6448
17812F448p18k496k019M03M30P38N87n94l8J422l73o28j91o78l51O13n88j364
$$ 6448 5730 3234 1215 1618 2048 2786 3373 2779 2741 4163 3790 3162 2971 2293 1942 2555 1967 603
17794F03k76j114o15LmO48J288K077J599j471p06J957n13J30J301k11j119j96
$$ 603 327 -787 -1402 -1399 -1403 -755 533 2610 4209 2738 2032 3989 3476 3606 4907 4696 3577 3381
17776C381K99N13r78k23J101R83M67P20J70Q49n40l76j067r92j524k277k123L63
$$ 3381 3680 4193 3215 2992 4093 5076 5543 6263 6433 7282 6742 6366 5299 4307 2783 506 -1617 -1254
17758a254J457Q67m22l29m77j771K01O86n30j191j11Q29K61J10N92R9Q71J052
$$ -1254 203 1070 648 319 -158 -1929 -1728 -1042 -1572 -2763 -2874 -2045 -1784 -1674 -1082 -983 -112 940
17740I40m21n77J682J26P02J729R28L94R55j550q3j04m06m08q77q94K034Q06k40
$$ 940 519 -58 1624 1750 2452 4181 5109 5503 6458 4908 4825 4721 4315 3907 3030 2136 4170 4976 4736
17721D736K12p64m60j353k77m26l34m22j236q39J47J96J70j060J75N24n47j628
$$ 4736 4948 4184 3724 2371 2094 1668 1334 912 -324 -1163 -1016 -820 -650 -1710 -1535 -1011 -1558 -3186
17703c186j091l57J92J136K17q00l21R36p27j871M31P34L89O19M35j009o99J075
$$ -3186 -4277 -4634 -4442 -3306 -3089 -3889 -4210 -3274 -4001 -5872 -5441 -4707 -4318 -3699 -3264 -4273 -4972 -3897
17685c897J406J97r09L04J555N73m53p60p26k02o66J1J019k45M18O53q30j757
$$ -3897 -2491 -2294 -3203 -2899 -1344 -771 -1224 -1984 -2710 -2912 -3578 -3567 -2548 -2793 -2375 -1722 -2552 -4309
17667d309J88j564n27J284J033m35K71m70J011M77pl89P17L24O01o68j032j477
$$ -4309 -4121 -5685 -6212 -4928 -3895 -4330 -4059 -4529 -3518 -3041 -3048 -3437 -2720 -2396 -1795 -2463 -3495 -4972
17649d972j176J845q2p60M32r74J235J313k1n66N88j97P06R55j324j611j041k92
$$ -4972 -6148 -4303 -4385 -5145 -4713 -5687 -4452 -3139 -3160 -3726 -3138 -3335 -2629 -1674 -2998 -4609 -5650 -5942
17631e942L02q22k10n26N46R92J866M56k27m16N69j47l01Q06P73k90M44P09K58
$$ -5942 -5640 -6462 -6672 -7198 -6652 -5660 -3794 -3338 -3565 -3981 -3412 -3559 -3860 -3054 -2281 -2571 -2127 -1418 -1160
17612a160j537J076P5q66q28m5M42Q05L01j676j638k56J635K60J250N67m3l08
$$ -1160 -2697 -1621 -1546 -2412 -3240 -3285 -2843 -2038 -1737 -3413 -5051 -5307 -3672 -3412 -2162 -1595 -1638 -1946
17594a946l19J201K04m53L42R78j793l49L20J8J45O42L38N50o28p92J94Oj5j987
$$ -1946 -2265 -1064 -860 -1313 -971 7 -1786 -2135 -1815 -1797 -1652 -1010 -672 -122 -750 -1542 -1348 -1342 -1357 -3344
17574c344j708q45P0Q63r7K51MJ68P22l03j130O45M03Q63N42n97l85j34o00O59
$$ -3344 -5052 -5897 -5827 -4964 -5061 -4810 -4806 -4638 -3916 -4219 -5349 -4704 -4301 -3438 -2896 -3493 -3878 -4012 -4612 -3953
17554c953O92n45j282r48R23J580m53j313m85o21J535K109O86M51J262M24r6k342
$$ -3953 -3261 -3806 -5088 -6036 -5113 -3533 -3986 -5299 -5784 -6405 -4870 -2761 -2075 -1624 -362 62 -34 -2376
17536b376k160m71m45m45K71K61M9j79N78J655O53p5k63n90j320J546J053j403
$$ -2376 -4536 -5007 -5452 -5897 -5626 -5365 -5316 -5495 -4917 -3262 -2609 -2684 -2947 -3537 -4857 -3311 -2258 -3661
17518c661n85n01q67J44P29j083j07O08Q98J756M9j082R82n49j731j28L27n4m81
$$ -3661 -4246 -4747 -5614 -5470 -4741 -5824 -5931 -5323 -4425 -2669 -2620 -3702 -2720 -3269 -5000 -5128 -4801 -4855 -5336
17499e336J632J182j287o73P71J43l68k36k91m78L72M59j366o83J294L16O21k68
$$ -5336 -3704 -2522 -3809 -4482 -3711 -3568 -3936 -4172 -4463 -4941 -4569 -4110 -5476 -6159 -4865 -4549 -3928 -4196
17481d196j912J28L16M77J208J95j465J115J93K92P35j243j023l52P43R94k68
$$ -4196 -6108 -5980 -5664 -5187 -3979 -3784 -5249 -4134 -3941 -3649 -2914 -4157 -5180 -5532 -4789 -3795 -4063
17464d063j129Q55j59P16Q71M83O35m50J57k6j231K25J587O63K47m13j29k95o55
$$ -4063 -5192 -4337 -4496 -3780 -2909 -2426 -1791 -2241 -2084 -2110 -3341 -3116 -1529 -866 -619 -1032 -1161 -1456 -2111
17445b111Q23M27j034r37O45k90j700J98J243j036n9J267Q72K879L582Q63N71
$$ -2111 -1288 -861 -1895 -2832 -2187 -2477 -4177 -3979 -2736 -3772 -3831 -2564 -1692 1187 4769 5632 6203
17428F203P83j123k328k283j385n57k103j905j19J079L87O89J110K43j541j286
$$ 6203 6986 5863 3535 1252 -133 -690 -2793 -4698 -4817 -3738 -3351 -2662 -1552 -1309 -2850 -4136
17412d136K98J377N43O7qM81l45K50k01L59q61j440L51J112j273j809L07J454
$$ -4136 -3838 -2461 -1918 -1851 -1859 -1378 -1723 -1473 -1674 -1315 -2176 -3616 -3265 -2153 -3426 -5235 -4928 -3474
17394c474J39J868J287l77p12O14Q36J434J001L58j077k086l79P46q84K04j590
$$ -3474 -3335 -1467 -180 -557 -1269 -655 181 1615 2616 2974 1897 -189 -568 178 -706 -502 -2092
17377b092k725j74M9J746k21j077J314J185r31j081p25Q59J218m90q94K27m21
$$ -2092 -4817 -4991 -4942 -3196 -3417 -4494 -3180 -1995 -2926 -4007 -4732 -3873 -2655 -3145 -4039 -3812 -4233
17360d233p14L95N55J196K07j72r72k92Q42k08P27P24N91r32m4Q5J890J239J83
$$ -4233 -4947 -4552 -3997 -2801 -2594 -2766 -3738 -4030 -3188 -3396 -2669 -1945 -1354 -2286 -2330 -2245 -355 884 1067
17341A067J150J494J684M662M341R43K36l59m75j681l272k549k170l046j450K4
$$ 1067 2217 3711 5395 10057 14398 15341 15577 15218 14743 13062 9790 7241 5071 2025 575 599
17325E99Om2q16p73M17Q51k24j349J02K80j023m76l1Q43P99O77m2n22J444M22
$$ 599 605 563 -253 -1026 -609 242 18 -1331 -1229 -949 -1972 -2448 -2479 -1636 -837 -160 -202 -724 720 1142
17305A142j478p20L5J424P9j163j362p90J732lr03J558J451K037J990J196J454
$$ 1142 -336 -1056 -1021 403 482 -681 -2043 -2833 -1101 -1104 -2007 -449 1002 3039 5029 6225 7679
17288G679M45K76m61j064j181o22k375j404k328j930L18l15K72J058n26q12j093
$$ 7679 8124 8400 7939 6875 5694 5072 2697 1293 -1035 -2965 -2647 -2962 -2690 -1632 -2158 -2970 -4063
17271d063O36N36n45p26Q55O21L04J55n51n71N03J500J968j66P93l73J29K928
$$ -4063 -3427 -2891 -3436 -4162 -3307 -2686 -2382 -2227 -2778 -3349 -2846 -1346 622 456 1249 876 1005 3933
17253C933J118L57J101K78J122r28j681n69k31k08j107R68J186Q37O41K67K22
$$ 3933 5051 5408 6509 6787 7909 6981 5300 4731 4500 4292 3185 4153 5339 6176 6817 7084 7306
17236G306j100j047r96j359j572J269K485J665j327j625P13P91o94J401n40R8
$$ 7306 6206 5159 4163 2804 1232 2501 4986 6651 5324 3699 4412 5203 4509 5910 5370 5468
17220E468k71k24Q53J149J811J667J841J995L422N586M659M782K589J045N66j049
$$ 5468 5197 4973 5826 6975 8786 10453 12294 14289 17711 23297 27956 32738 35327 36372 36938 35889
17204C5889l659m848m448m788m697l111l182k176k163k208p59j183O65Q38j207
$$ 35889 32230 27382 22934 18146 13449 10338 7156 4980 2817 609 -150 -1333 -668 170 -1037
17189a037J21N69m03o91J077Q45l56J6p1j0j423j636J02J251M96J42Q28q45j880
$$ -1037 -916 -347 -750 -1441 -364 481 125 141 70 60 -1363 -2999 -2897 -1646 -1150 -1008 -180 -1025 -2905
17170b905j70P12l18j034N58J161J278m48k63l24K67j89k51m65j180Q26O94N43
$$ -2905 -3075 -2363 -2681 -3715 -3157 -1996 -718 -1166 -1429 -1753 -1486 -1675 -1926 -2391 -3571 -2745 -2051 -1508
17152a508N32M34p97o45O8P89m1L58O37l15J54K1J186L10J608o00J064L423L775
$$ -1508 -976 -542 -1339 -1984 -1916 -1127 -1168 -810 -173 -488 -334 -313 873 1183 2791 2191 3255 6678 10453
17133A0453N122N617M419M838J937l77j288k374m657n598l804l248l623k502l433
$$ 10453 15575 21192 25611 30449 32386 32009 30721 28347 23690 18092 14288 11040 7417 4915 1482
17118A482k564j696j177k05K60P34L37O28R40O55J99j551J27N82l64k98j122P10
$$ 1482 -1082 -2778 -3955 -4160 -3900 -3166 -2829 -2201 -1261 -606 -407 -1958 -1831 -1249 -1613 -1911 -3033 -2323
17100b323n12q55q03J883O02j58p23o06N64N55n10n54L36J627P18P01k03q90j226
$$ -2323 -2835 -3690 -4493 -2610 -2008 -2166 -2889 -3495 -2931 -2376 -2886 -3440 -3104 -1477 -759 -58 -261 -1151 -2377
17081b377o26o5Q24J130q62p82J910Q20j343K94m86P85N62j528m0M10l19p17j167
$$ -2377 -3003 -3068 -2244 -1114 -1976 -2758 -848 -28 -1371 -1077 -1563 -778 -216 -1744 -1784 -1374 -1693 -2410 -3577
17062c577J47L83m16r70Q62M53p95j938j4J262N82q53M17L61r52J044J169l43
$$ -3577 -3430 -3047 -3463 -4433 -3571 -3118 -3913 -5851 -5865 -4603 -4021 -4874 -4457 -4096 -5048 -4004 -2835 -3178
17044c178r88l40K74R36Q55K34n59n78l28O18Q4O1J060R7O08k3j096r33R7P33
$$ -3178 -4166 -4506 -4232 -3296 -2441 -2207 -2766 -3344 -3672 -3054 -2970 -2909 -1849 -1752 -1144 -1167 -2263 -3196 -3099 -2366
17024b366Q9l81O45j88q3K57J88m77O15j501j033P59P15p25n01j455o54Q86J751
$$ -2366 -2277 -2658 -2013 -2201 -2284 -2027 -1839 -2316 -1701 -3202 -4235 -3476 -2761 -3486 -3987 -5442 -6096 -5210 -3459
17005c459J066P5p21q33l32J630R4K34J235p98L08P0l29j93j123m56O57K034R43
$$ -3459 -2393 -2318 -3039 -3872 -4204 -2574 -2480 -2246 -1011 -1809 -1501 -1431 -1760 -1953 -3076 -3532 -2875 -841 102
16986A02n77P1j371j212k92j01p6L14k74O9L89r3L6K87k09j002p37Kp25n04m56
$$ 102 -475 -404 -1775 -2987 -3279 -3380 -3456 -3142 -3416 -3347 -2958 -3051 -3015 -2728 -2937 -3939 -4676 -4674 -5399 -5903 -6359
16965f359J28P12N61L18P16q13q7R10P28j075o59P61L19p0N09R67n73o45p28M28
$$ -6359 -6231 -5519 -4958 -4640 -3924 -4737 -4824 -3914 -3186 -4261 -4920 -4159 -3840 -3910 -3401 -2434 -3007 -3652 -4380 -3952
16945c952J225J402k33m25J29J083n50k096L04J025k02M18P94M50j54R2M56q93
$$ -3952 -2727 -1325 -1558 -1983 -1854 -771 -1321 -3417 -3113 -2088 -2290 -1872 -1078 -628 -782 -690 -234 -1127
16927a127l80J11m1N57J32J726J076p66O93p61l98O14Q16M17O32K112J481r29
$$ -1127 -1507 -1396 -1437 -880 -748 978 2054 1288 1981 1220 822 1436 2252 2669 3301 5413 6894 5965
16909E965j76J123R85l38o9J116J851J606n61L40q1j32k718j389J549N73p99j876
$$ 5965 5789 6912 7897 7559 7490 8606 10457 12063 11502 11842 11761 11629 8911 7522 9071 9644 8845 6969
16891F969j782j859j689nQ90o29r0j7o46r59j109l15N72j667o88J78J429RK25
$$ 6969 5187 3328 1639 1634 2524 1895 1805 1788 1142 183 -926 -1241 -669 -2336 -3024 -2846 -1417 -1408 -1183
16872a183M55o50Mr81m21L4N93n03K25P6K54m05P11L25j042o1J115J553k95q8
$$ -1183 -728 -1378 -1374 -2355 -2776 -2742 -2149 -2652 -2427 -2351 -2097 -2502 -1791 -1466 -2508 -2569 -1454 99 -196 -284
16852b84o2j243j521j844l82N84J513P78o77J158P3j583n99L46o0q43l06j080
$$ -284 -346 -1589 -3110 -4954 -5336 -4752 -3239 -2461 -3138 -1980 -1907 -3490 -4089 -3743 -3803 -4646 -4952 -6032
16834f032M79J378Q09l47n55R84J025p80P2L6l18q84P0J724j18j082j179J925
$$ -6032 -5553 -4175 -3366 -3713 -4268 -3284 -2259 -3039 -2967 -2931 -3249 -4133 -4063 -2339 -2457 -3539 -4718 -2793
16816b793J413J3m99j487L89J419N93q55L0l62j51j422P1p28N02J822J91r40l05
$$ -2793 -1380 -1367 -1866 -3353 -2964 -1545 -952 -1807 -1777 -2139 -2290 -3712 -3641 -4369 -3867 -2045 -1854 -2794 -3099
16797c099M32N3p45M04n64r81k9J415R85k23r0q01J10J142R94K55o88j231R4J040
$$ -3099 -2667 -2614 -3359 -2955 -3519 -4500 -4529 -3114 -2129 -2352 -2442 -3243 -3133 -1991 -997 -742 -1430 -2661 -2567 -1527
16777a527l04M40P41k70p9P31k009n24M98R8k35M25J13R6n94q25k27J202J554
$$ -1527 -1831 -1391 -650 -920 -999 -268 -2277 -2801 -2303 -2205 -2440 -2015 -1902 -1806 -2400 -3225 -3452 -2250 -696
16758f96l07J45j033j371j673J134Q42k42Q7Q42Q79m06q38L09k305L6K8N90K78
$$ -696 -1003 -858 -1891 -3262 -4935 -3801 -2959 -3201 -3114 -2272 -1393 -1799 -2637 -2328 -4633 -4597 -4569 -3979 -3701
16739c701N61M54Q70P15L03l54r70q19R98K05j60M36L28j201M58J69j302o35q9
$$ -3701 -3140 -2686 -1816 -1101 -798 -1152 -2122 -2941 -1943 -1738 -1898 -1462 -1134 -2335 -1877 -1708 -3010 -3645 -3734
16720c734J657J221K53l40m69j68j146k91R12NR77L26m48j422l45K82O5J241m12
$$ -3734 -2077 -856 -603 -943 -1412 -1580 -2726 -3017 -2105 -2100 -1123 -797 -1245 -2667 -3012 -2730 -2665 -1424 -1836
16701a836r52M52J542L91p35l42R68k64p15n22O53O11k57o45r74j208j32J417
$$ -1836 -2788 -2336 -794 -403 -1138 -1480 -512 -776 -1491 -2013 -1360 -749 -1006 -1651 -2625 -3833 -3965 -2548
16683b548O58J074J176L46m37j8n74r31k8J73j524M93J803P4J01P21J08m69j098
$$ -2548 -1890 -816 360 706 269 251 -323 -1254 -1282 -1109 -2633 -2140 -337 -263 -162 559 667 198 -900
16664i00k38P27J81m54j402M84Q04M99K92j428k226jJ187P18P35p03j01j99j06
$$ -900 -1138 -411 -230 -684 -2086 -1602 -798 -299 -7 -1435 -3661 -3662 -2475 -1757 -1022 -1725 -1826 -2025 -2131
16645b131P15O9k99K31N27O16j555n79L39k84J389J392R8p1P5n01n49k81q82j007
$$ -2131 -1416 -1347 -1646 -1415 -888 -272 -1827 -2406 -2067 -2351 -962 430 528 457 532 31 -518 -799 -1681 -2688
16625b688j3j164L48J203R76L09o58J42K0k01M51J224o47p76j81J35j078J785
$$ -2688 -2701 -3865 -3517 -2314 -1338 -1029 -1687 -1545 -1525 -1726 -1275 -51 -698 -1474 -1655 -1520 -2598 -813
16607h13J316j231K53n38L9K19J554J713N39k75J27q03j406j031J85Q0j9L5J388
$$ -813 503 -728 -475 -1013 -974 -755 799 2512 3051 2776 2903 2100 694 -337 -152 -72 -91 -56 1332
16588A332J529P65m32o44l30j446o10l10j157K53J87O02N76K37P06L96j403l06
$$ 1332 2861 3626 3194 2550 2220 774 164 -146 -1303 -1050 -863 -261 315 552 1258 1654 251 -55
16570e5K05n0N05o83n41n43K28K58j3j609M81N50n5m65K84K07J59O59J161k05
$$ -55 150 100 605 -78 -619 -1162 -934 -676 -689 -2298 -1817 -1267 -1322 -1787 -1503 -1296 -1137 -478 683 478
16550D78p85p89n45m2L50o8j017r11N66k17M70J430N12R43m33j319m99n19L0J891
$$ 478 -307 -1096 -1641 -1683 -1333 -1401 -2418 -3329 -2763 -2980 -2510 -1080 -568 375 -58 -1377 -1876 -2395 -2365 -474
16530d74M62J88k09l33j048n26k69k70r78m27J503J516n61n96L38j059n83J120
$$ -474 -12 176 -33 -366 -1414 -1940 -2209 -2479 -3457 -3884 -2381 -865 -1426 -2022 -1684 -2743 -3326 -2206
16512b206M57p2R60J071J773J620p71p76j556nq43j8P41J93J030M93RL63P83P12
$$ -2206 -1749 -1821 -861 210 1983 3603 2832 2056 500 495 -348 -366 375 568 1598 2091 2100 2463 3246 3958
16492C958o74p19M53M03j132o59N50N38j57j666j047j160r06M48L25J211J9o56
$$ 3958 3284 2565 3018 3421 2289 1630 2180 2718 2561 895 -152 -1312 -2218 -1770 -1445 -234 -215 -871
16474h71j579L46J161j32k26J99J116J03j403l99q4Q81O73L70L66j127j97j62
$$ -871 -2450 -2104 -943 -1075 -1301 -1102 14 117 -1286 -1685 -1769 -888 -215 155 521 -606 -803 -965
16456i65m46o60M25k44N6M48r2j061M15J144P48n73p90J694m11P72k40q42r98
$$ -965 -1411 -2071 -1646 -1890 -1834 -1386 -1478 -2539 -2124 -980 -232 -805 -1595 99 -312 460 220 -622 -1620
16437a620J56q4q1m16L86j35J395K3L12R58q14l49N2M47j013P30J103n62j931
$$ -1620 -1464 -1548 -1629 -2045 -1659 -1794 -399 -376 -64 894 80 -269 -217 230 -783 -53 1050 488 -1443
16418a443r64j35L70L62P01J276l24q51o19j21q24j594o15R74K85J218L59m20
$$ -1443 -2407 -2542 -2172 -1810 -1109 167 -157 -1008 -1627 -1748 -2572 -4166 -4781 -3807 -3522 -2304 -1945 -2365
16400b365j23n51m48P11R57K36Q42J178l58q45l17j454k50R62J705N64r86r44
$$ -2365 -2488 -3039 -3487 -2776 -1819 -1583 -741 437 79 -766 -1083 -2537 -2787 -1825 -120 444 -542 -1486
16382a486P15q16r30J56R70k90k23J605J53j220j57P89M9j296m67j402J72N65
$$ -1486 -771 -1587 -2517 -2361 -1391 -1681 -1904 -299 -146 -1366 -1523 -734 -685 -1981 -2448 -3850 -3678 -3113
16364c113k30J456O04o80J92N58O90N06k27O58m62j745j010k09m76M49O15Q99
$$ -3113 -3343 -1887 -1283 -1963 -1771 -1213 -523 -17 -244 414 -48 -1793 -2803 -3012 -3488 -3039 -2424 -1525
16346a525l29k28n78L17l20O31J044m37j395J41O96O36k04k15K71J97O04j649
$$ -1525 -1854 -2082 -2660 -2343 -2663 -2032 -988 -1425 -2820 -2679 -1983 -1347 -1551 -1766 -1495 -1298 -694 -2343
16328b343j544k49l2J988M29Q76j05j89p4M43p45J93O62q94q80n28R22p0k10N67
$$ -2343 -3887 -4136 -4168 -2180 -1751 -875 -980 -1169 -1243 -800 -1545 -1352 -690 -1584 -2464 -2992 -2070 -2140 -2350 -1783
16308a783R92Q07P97M29j752j148k7P47N68j777k02m41p19J640q92L80M34L06
$$ -1783 -791 16 813 1242 -510 -1658 -1685 -938 -370 -2147 -2349 -2790 -3509 -1869 -2761 -2381 -1947 -1641
16290a641J389j06q87k17M39j85o05R89M6j175K419J35q34J96l74N7N35J129O99
$$ -1641 -252 -358 -1245 -1462 -1023 -1208 -1813 -824 -778 -1953 466 601 -233 -37 -411 -354 181 1310 2009
16271B009j217n83M80N57L73j802p24Q65J557o06L28Q14r3j098q39p77P54J554
$$ 2009 792 209 689 1246 1619 -183 -907 -42 1515 909 1237 2051 1958 860 21 -756 -2 1552
16253A552O16L48j552m47J057LJ86m19R95j615j552j35j79J303N3n39o2k39o28
$$ 1552 2168 2516 964 517 1574 1577 1763 1344 2339 724 -828 -963 -1142 161 214 -325 -387 -626 -1254
16234a254p69q96N77l97J55K193m64j755L66J356J560K64J265J25p71o07Q78l46
$$ -1254 -2023 -2919 -2342 -2739 -2584 -391 -855 -2610 -2244 -888 672 936 2201 2326 1555 948 1826 1480
16216A480J67j12q00k07M02j75K94Q28M68j68l60j269Q6P31J78J6Q10q86q90j189
$$ 1480 1647 1535 735 528 930 755 1049 1877 2345 2177 1817 548 634 1365 1543 1559 2369 1483 593 -596
16196e96Q82O79O50j11l83l04o30p20l97k1q05N8n92j54k44O14J077m39m41Q13
$$ -596 286 965 1615 1504 1121 817 187 -533 -930 -951 -1756 -1698 -2290 -2444 -2688 -2074 -997 -1436 -1877 -1064
16176a064J94j80Q73R4K93m37j263K99J098j102K28J261o15m19j468m82R99R10
$$ -1064 -870 -1050 -177 -83 210 -227 -1490 -1191 -93 -1195 -967 294 -321 -740 -2208 -2690 -1691 -781
16158g81o05k31o46j55Q18Q05k16P10l22J35N17j46R34R53j418q43J287k02j718
$$ -781 -1386 -1617 -2263 -2418 -1600 -795 -1011 -301 -623 -488 29 -117 817 1770 352 -491 796 594 -1124
16139a124O99J051K81n60r01J456K37j024j698N84K441L09j637m15n44O83j23
$$ -1124 -425 626 907 347 -554 902 1139 115 -1583 -999 1442 1751 114 -301 -845 -162 -285
16122b85l20O14M27p69j464o18P2R7K017M06r89L01n73j544Q30Q92K04o70m95
$$ -285 -605 9 436 -333 -1797 -2415 -2343 -2246 -229 177 -812 -511 -1084 -2628 -1798 -906 -702 -1372 -1867
16103a867O2R12Rl21j055M41J049L02K77N19k02j380j473O67J350M85q27r60O24
$$ -1867 -1805 -893 -884 -1205 -2260 -1819 -770 -468 -191 328 126 -1254 -2727 -2060 -710 -225 -1052 -2012 -1388
16084a388O82j490K0J291J702k96Q3P16Q64j080j498j240J454M72O00J64k85m09
$$ -1388 -706 -2196 -2176 -885 817 521 604 1320 2184 1104 -394 -1634 -180 292 892 1056 771 362
16066C62O09k85L13Q85Q70k05l57q6n22p79L18n28L18J995K316R45k5K37K875
$$ 362 971 686 999 1884 2754 2549 2192 2106 1584 805 1123 595 913 2908 5224 6169 6144 6381 9256
16047I256N667M658N521O941M486J779L12j903m408n734o029n131m987l174k527
$$ 9256 14923 19581 25102 32043 36529 38308 38620 36717 32309 26575 20546 15415 10428 7254 4727
16032D727o41k49J63j161m3p08j448J37J528J535l48q32o02j495L5O06q31p9O68
$$ 4727 4086 3837 4000 2839 2796 2088 640 777 2305 3840 3492 2660 2058 563 598 1204 373 294 962
16013I62L51k16P28k74j873j22q08J01O37j278r3L12M80M29o07K90P4J140J42
$$ 962 1313 1097 1825 1551 -322 -444 -1252 -1151 -514 -1792 -1885 -1573 -1093 -664 -1271 -981 -907 233 375
15994C75O32N16l15L09j142L69O93o82L32j91k83M55M35l14N16j355j678N58J323
$$ 375 1007 1523 1208 1517 375 744 1437 755 1087 896 613 1068 1503 1189 1705 350 -1328 -770 553
15975E53k55j191J08O94J29n51j133N80j65K44N08N20o68O21P11J225P80N86J703
$$ 553 298 -893 -785 -91 38 -513 -1646 -1066 -1231 -987 -479 41 -627 -6 705 1930 2710 3296 4999
15956D999K917M921N762P337M964K779J575q13p95m636o151m954m372j480l002
$$ 4999 7916 12837 18599 25936 30900 33679 35254 34441 33646 29010 22859 17905 13533 12053 9051
15941I051k544j812l76K84m29n60n84K97O68j760l60M53j918n8L22K10J490N16
$$ 9051 6507 4695 4319 4603 4174 3614 3030 3327 3995 2235 1875 2328 410 352 674 884 2374 2890
15923B890j521j101r81j026j7L42j19J280K38M23j04j50m1j33R2J062J119m39
$$ 2890 1369 268 -713 -1739 -1756 -1414 -1533 -253 -15 408 304 154 113 -20 72 1134 2253 1814
15905A814r58j40O04k98o11q60l29ON9K91L31J41k74R4J002o66j11q77M83J133
$$ 1814 856 716 1320 1022 411 -449 -778 -772 -713 -422 -91 50 -224 -130 872 206 95 -782 -299 834
15885H34J257p99k107j127l54m10L57M19J173J198J340Q1n60j034J057Q34P32
$$ 834 2091 1292 -815 -1942 -2296 -2706 -2349 -1930 -757 441 1781 1862 1302 268 1325 2159 2891
15868B891Q7n13j718o88l15k2M67N69q08P66J040O71R65o97k21J58j80o10k007
$$ 2891 2978 2465 747 59 -256 -278 189 758 -50 716 1756 2427 3392 2695 2474 2632 2452 1842 -165
15849a65P0J438O75p56q8Q3j12j5p53n49J37J227j13J29K195l99j763j196Q01
$$ -165 -95 1343 2018 1262 1174 1257 1145 1130 377 -172 -35 1192 1079 1208 3403 3004 1241 45 846
15830H46J080l94j603n06J023J73R9L87n74J409L00j595J57L45j41J90j42k17
$$ 846 1926 1532 -71 -577 446 619 718 1105 531 1940 2240 645 802 1147 1006 1196 1054 837
15812H37j505M06J220q18N8J248l73l93l30L99J662Q05J34j878p54m01N94J537
$$ 837 -668 -262 958 140 198 1446 1073 680 350 749 2411 3216 3350 1472 718 317 911 2448
15794B448O03k62p07o72k36r0j206Q58O23L18L05k86J59j187J13M29k54n48J246
$$ 2448 3051 2789 2082 1410 1174 1084 -122 736 1359 1677 1982 1696 1855 668 781 1210 956 408 1654
15775A654m30O27Q53j13l9L89k01l21P57k59r48m09k79L88P5j85L23M91M46L17
$$ 1654 1224 1851 2704 2591 2552 2941 2740 2419 3176 2917 1969 1560 1281 1669 1744 1559 1882 2373 2819 3136
15755C136J153r82j335K24P17K37O95J500j08j909m44J27j270l98m14K334K64
$$ 3136 4289 3307 1972 2196 2913 3150 3845 5345 5237 3328 2884 3011 1741 1343 929 3263 3527
15738C527p75N95k60K5L91o49j422r35J54R71O03l57o23j10O21Q96N13k7J050
$$ 3527 2752 3347 3087 3112 3503 2854 1432 497 651 1622 2225 1868 1245 1135 1756 2652 3165 3138 4188
15719D188p1o81L19O01k7n10q09M41n42r33Q89J274R18J91j190j479k31L63n62
$$ 4188 4117 3436 3755 4356 4329 3819 3010 3451 2909 1976 2865 4139 5057 5248 4058 2579 2348 2711 2149
15700B149j300l45m47J112R99J650No83m46l61J84J653P06n60j385j02P36j238
$$ 2149 849 504 57 1169 2168 3818 3823 3140 2694 2333 2517 4170 4876 4316 2931 2829 3565 2327
15682B327j146l12M88J312Q07k68k37R26O02J70O29R54j015j473k514n23J727
$$ 2327 1181 869 1357 2669 3476 3208 2971 3897 4499 4669 5298 6252 5237 3764 1250 727 2454
15665B454J072L4o42J54O23J250J79n52J19k50k20k95O5J749J647K06O35L04m95
$$ 2454 3526 3560 2918 3072 3695 4945 5124 4572 4691 4441 4221 3926 3991 5740 7387 7593 8228 8532 8037
15646H037O24K008P00R37l93r2K27L28l80j762j044j677j248Q63R1J191J985m70
$$ 8037 8661 10669 11369 12306 11913 11821 12048 12376 11996 10234 9190 7513 6265 7128 7219 8410 10395 9925
15628I925p05m07r2K0l98r39r16O04J80R05n75j04J634R94K55j168o5O34N41N30
$$ 9925 9220 8813 8721 8741 8343 7404 6488 7092 7272 8177 7602 7498 9132 10126 10381 9213 9148 9782 10323 10853
15608A0853J508q9R39o3Q83J483O58N51M21J83N65m05J762J288K427Q65M34J309
$$ 10853 12361 12272 13211 13148 14031 15514 16172 16723 17144 17327 17892 17487 19249 20537 22964 23829 24263 25572
15590B5572J665j55J067J233K588K394j552J058K541r2P7j438n2o62q60n36j075
$$ 25572 27237 27082 28149 29382 31970 34364 32812 33870 36411 36319 36396 34958 34906 34244 33384 32848 31773
15573C1773o83p37j826j091l0k043k549j141J48R7j040j996j454M16J448P23o7
$$ 31773 31090 30353 28527 27436 27406 25363 22814 21673 21821 21918 20878 18882 17428 17844 19292 20015 19948
15556A9948j442p93j303j117k87J19J099J13K63j242R69j52k45M70q13Q02j65
$$ 19948 18506 17713 16410 15293 15006 15125 16224 16337 16600 15358 16327 16175 15930 16400 15587 16389 16224
15539A6224Jl46L59J378N43j398n96J374o53j085K24L10K72r6M2J030L276J503
$$ 16224 16225 15879 16238 17616 18159 16761 16165 17539 16886 15801 16025 16335 16607 16511 16553 17583 20859 22362
15521B2362Q53N49o62N1Q36J869Q96L49K076J749J677J753M67J375J238O7J699
$$ 22362 23215 23764 23102 23153 23989 25858 26754 27103 29179 30928 32605 34358 34825 36200 37438 37505 39204
15504C9204Q32J348K024J817L822M359L364R42p7p78k578m625m134m073n125l681
$$ 39204 40036 41384 43408 45225 49047 53406 56770 57712 57635 56857 54279 49654 45520 41447 36322 32641
15488C2641m326j924r74j684j05o32p18r18j161m21J0n80P67L13q57n30k83r48
$$ 32641 28315 26391 25417 23733 23628 22996 22278 21360 20199 19778 19788 19208 19975 20288 19431 18901 18618 17670
15470A7670m68J462L92K18L4n83q59J023j233j057m94o95l70M00m29j160j53l45
$$ 17670 17202 18664 19056 19274 19308 18725 17866 18889 17656 16599 16105 15410 15040 15440 15011 13851 13698 13353
15452A3353m59j407r58l08N88M77j500j159O04n84j23K008J90j96j09K98O51J041
$$ 13353 12894 11487 10529 10221 10809 11286 9786 8627 9231 8647 8524 10532 10722 10526 10417 10715 11366 12407
15434A2407J281M62J169J183J833L74J49m69n8j443q95j754k191r3K37o98l82
$$ 12407 13688 14150 15319 16502 18335 18709 18858 18389 18331 16888 15993 14239 12048 11955 12192 11494 11112
15417A1112j180m3N66K55j154o94r31P41K323Q6n16N44J161k21m76R56M83j10
$$ 11112 9932 9889 10455 10710 9556 8862 7931 8672 10995 11081 10565 11109 12270 12049 11573 12529 13012 12902
15399A2902j91o29j673q9J168J77m56J041J238M24p01l02p91n80L54J857k50o97
$$ 12902 12711 12082 10409 10320 11488 11665 11209 12250 13488 13912 13211 12909 12118 11538 11892 13749 13499 12802
15381A2802O25L70J033q69k67Q37k18m97j98M07M86J472Q14N53l05J3p16O56J787
$$ 12802 13427 13797 14830 13961 13694 14531 14313 13816 13618 14025 14511 15983 16797 17350 17045 17058 16342 16998 18785
15362A8785J070p51o59R64M55J696R69r17Q75J043O08L005K482J072J436J403
$$ 18785 19855 19104 18445 19409 19864 21560 22529 21612 22487 23530 24138 27143 29625 30697 32133 33536
15346C3536J723K429K910J701J840J865J92J247J496J659Q6J368L81j595j632
$$ 33536 35259 37688 40598 42299 44139 46004 46196 47443 48939 50598 50684 52052 52433 50838 49206
15331D9206k277k076k92k047l205k159j775j478j478j193j232r32j048j962p95
$$ 49206 46929 44853 44561 42514 39309 37150 35375 33897 32419 31226 29994 29062 28014 26052 25257
15316B5257n44l63r84L16J44Q36r90j510j172M60K31q72K98r96k248J62J385L72
$$ 25257 24713 24350 23366 23682 23826 24662 23672 22162 20990 21450 21681 20809 21107 20111 17863 18025 19410 19782
15298A9782K30k53O45k21q95m16K10K9R27O76L49K58N06K01n22R46K03M20K02
$$ 19782 20012 19759 20404 20183 19288 18872 19082 19111 20038 20714 21063 21321 21827 22028 21506 22452 22655 23075 23277
15279B3277N62Q95J41J851J951n1l7R89J925M43K55K031L100K415K490P44l79
$$ 23277 23839 24734 24875 26726 28677 28626 28589 29578 31503 31946 32201 34232 37332 39747 42237 42981 42602
15262D2602P31K397L083J743J452J476P34K50j382k397j44j23j804q49k450k638
$$ 42602 43333 45730 48813 50556 52008 53484 54218 54468 53086 50689 50545 50422 48618 47769 45319 42681
15246D2681j863j743j260k036k861j118k60n90j044p82j22P6o35o18m45j024j603
$$ 42681 40818 39075 37815 35779 32918 31800 31540 30950 29906 29124 29002 29078 28443 27825 27380 26356 24753
15229B4753r36j23N5q61o06j422K09j6k75n3J418M66K96n44q04q16k48Q88O66
$$ 24753 23817 23694 23749 22888 22282 20860 21069 21053 20778 20725 22143 22609 22905 22361 21557 20741 20493 21381 22047
15210B2047K9n24j34K83n99j479m69Q02J055K80l83j030KP06N54M93J151J67r54
$$ 22047 22076 21552 21418 21701 21102 19623 19154 19956 21011 21291 20908 19878 19880 20586 21140 21633 22784 22951 21997
15191B1997r14j040O71o76N83O45Q88n01n01M84J001N92QR54P26p80K1K22K46
$$ 21997 21083 20043 20714 20038 20621 21266 22154 21653 21152 21636 22637 23229 23237 24191 24917 24137 24158 24380 24626
15172B4626N08J08N15R44N43j149j072n06J016l49K6K28J224K35O99j50o69J671
$$ 24626 25134 25242 25757 26701 27244 26095 25023 24517 25533 25184 25210 25438 26662 26897 27596 27446 26777 28448
15154B8448j3j849K67p44o21M41o96L64M52R6j10k43j074l68l5M26J446K48O61
$$ 28448 28435 26586 26853 26109 25488 25929 25233 25597 26049 26145 26035 25792 24718 24350 24315 24741 26187 26435 27096
15135B7096k17j438m02P85K147O63M33J2j129K8P52J069O78j57p14p31m77J367
$$ 27096 26879 25441 25039 25824 27971 28634 29067 29079 27950 27978 28730 29799 30477 30320 29606 28875 28398 29765
15117B9765r74M76O88J176J386m42j054q3J557J017P47M00M82J055j99J08J929
$$ 29765 28791 29267 29955 31131 32517 32075 31021 30938 32495 33512 34259 34659 35141 36196 35997 36105 38034
15100C8034M66j603J066L22N46R26N90l18o6N56N5j228J26K45P4K70J196n65J116
$$ 38034 38500 36897 37963 38285 38831 39757 40347 40029 39963 40519 40574 39346 39472 39717 39791 40061 41257 40692 41808
15081D1808J031l78r95j322L85N18J54m4o94L67o98o85k69J180Q68k84M84P86
$$ 41808 42839 42461 41466 40144 40529 41047 41201 41157 40463 40830 40132 39447 39178 40358 41226 40942 41426 42212
15063D2212L93o3l8j40N92j050M94Q36J438P06l38r91K10O15K66K00m04p7L25
$$ 42212 42605 42542 42504 42364 42956 41906 42400 43236 44674 45380 45042 44051 44261 44876 45142 45342 44938 44861 45186
15044D5186R46p00L06j027n30j25K62L34O25M13M71K218J901P48J30J214P69M96
$$ 45186 46132 45432 45738 44711 44181 44056 44318 44652 45277 45690 46161 48379 50280 51028 51158 52372 53141 53637
15026E3637j065n92o49m20j601K38L51N93J130J228O45l8P25K032J293J237J133
$$ 53637 52572 51980 51331 50911 49310 49548 49899 50492 51622 52850 53495 53457 54182 56214 57507 58744 59877
15009E9877J457o21j012L23R69l28M51R15K52M99K75J118P52M45L78L84l77m97
$$ 59877 61334 60713 59701 60024 60993 60665 61116 62031 62283 62782 63057 64175 64927 65372 65750 66134 65757 65260
14991F5260M70J965R23L73M27J456N09M07Q86J367J530K496J407j057O02K368
$$ 65260 65730 67695 68618 68991 69418 70874 71383 71790 72676 74043 75573 78069 79476 78419 79021 81389
14975H1389K419L36J166l45Q55J599P33P81K05J647K604K167K094K908K043P81
$$ 81389 83808 84144 85310 84965 85820 87419 88152 88933 89138 90785 93389 95556 97650 100558 102601 103382
14959A03382Q32K032J430M68K578K777K670K397L043M130K219K217J978J098m44
$$ 103382 104214 106246 107676 108144 110722 113499 116169 118566 121609 125739 127958 130175 132153 133251 132807
14944A32807P47J699j582r73R4o87L06K534J582N67K044J702K527K749L362L140
$$ 132807 133554 135253 133671 132698 132792 132105 132411 134945 136527 137094 139138 140840 143367 146116 149478 152618
14928A52618K984L308L047K478K727L281N076L846L918L756M379M632K952L420
$$ 152618 155602 158910 161957 164435 167162 170443 175519 179365 183283 187039 191418 196050 199002 202422
14914B02422K877L191M990N984N368M710O072L885P258Q563P102M893N943O730
$$ 202422 205299 208490 213480 219464 224832 229542 235614 239499 246757 255320 262422 267315 273258 279988
14900B79988Q573Q261R517P989P545J1620J2960J1118J0356J0229J1936J2193
$$ 279988 288561 296822 306339 314328 321873 333493 346453 357571 367927 378156 390092 402285
14888D02285J4581J4415J4205J6078J7386J8052J8841J8862K0244K1345K2151
$$ 402285 416866 431281 445486 461564 478950 497002 515843 534705 554949 576294 598445
14877E98445K4944K5133K6999K8416L1462L2211L5120L8272L9957M2305M7294
$$ 598445 623389 648522 675521 703937 735399 767610 802730 841002 880959 923264 970558
14866I70558N1916N7106O2562O8098P4319Q0544Q9224R6504J06841J16687J29736
$$ 970558 1022474 1079580 1142142 1210240 1284559 1365103 1454327 1550831 1657672 1774359 1904095
14855A904095J43104J58649J76456J96644K17924K42113K67856K92870L20434
$$ 1904095 2047199 2205848 2382304 2578948 2796872 3038985 3306841 3599711 3920145
14846C920145L50718L77292M03553M22384M31206M30610M15122L83032L34889
$$ 3920145 4270863 4648155 5051708 5474092 5905298 6335908 6751030 7134062 7468951
14837G468951K68902J86576R2956m481j00315j88182k62148l23112l67796l94852
$$ 7468951 7737853 7924429 8017385 8012904 7912589 7724407 7462259 7139147 6771351 6376499
14827F376499m04316m02661l92951l76653l53544l27940l01958k74304k47991
$$ 6376499 5972183 5569522 5176571 4799918 4446374 4118434 3816476 3542172 3294181
14818C294181k25536k02307j80899j63333j47654j35574j23406j13357j02427
$$ 3294181 3068645 2866338 2685439 2522106 2374452 2238878 2115472 2002115 1899688
14809A899688r1479p9925p3008o3896n7362n0298m5641m2009l5403k8229k5500
$$ 1899688 1808209 1728284 1655276 1591380 1534018 1483720 1438079 1396070 1360667 1332438 1306938
14798A306938k2217j9572j4748r298n834k673K142P284J0844J5822J9672K4619
$$ 1306938 1284721 1265149 1250401 1241103 1235269 1232596 1234738 1242022 1252866 1268688 1288360 1312979
14786A312979L0104L7065M3726M8738N5517O3741P2093Q0193R1252J03268J13612
$$ 1312979 1343083 1380148 1423874 1472612 1528129 1591870 1663963 1744156 1835408 1938676 2052288
14775B052288J25880J40911J58271J77195J96332K19875K45088K68770K92092
$$ 2052288 2178168 2319079 2477350 2654545 2850877 3070752 3315840 3584610 3876702
14766C876702L16801L39930L62915L80885L91784L92152L80695L51647L04622
$$ 3876702 4193503 4533433 4896348 5277233 5669017 6061169 6441864 6793511 7098133
14757G098133K44649J70227Q4935m483r3963j76067k46647l05435l49153l75768
$$ 7098133 7342782 7513009 7597944 7593461 7499498 7323431 7076784 6771349 6422196 6046428
14747F046428l85673l86503l79717l65117l41419l19755k96228k69830k47920
$$ 6046428 5660755 5274252 4894535 4529418 4187999 3868244 3572016 3302186 3054266
14738C054266k26516k07379j88471j71215j55688j42467j30137j18401j07957
$$ 3054266 2827750 2620371 2431900 2260685 2104997 1962530 1832393 1713992 1606035
14729A606035r8236r0017q3622p6782p0923o5600o1223n5325n1212m8343m6416
$$ 1606035 1507799 1417782 1334160 1257378 1186455 1120855 1059632 1004307 953095 904752 858336
14718H58336m2460l8401l7636l4080l2733k8809k7169k5207k3523k1077j7417
$$ 858336 815876 777475 739839 705759 673026 644217 617048 591841 568318 547241 529824
14707E29824j6357j7140j5969j5453j6626j6087j4593j3351j2482j2095j0430
$$ 529824 513467 496327 480358 464905 448279 432192 417599 404248 391766 379671 369241
14696C69241j1317r969j0209j0730j2142j0236q497p929q164q929o011p243p359
$$ 369241 357924 347955 337746 327016 314874 304638 296141 288212 280048 271119 265108 257865 250506
14683B50506n245n615p104n508n572n391n135l891m233m434l576m049n060l888
$$ 250506 245261 239646 232542 227034 221462 216071 210936 207045 202812 198378 194802 190753 185693 181805
14669A81805k680l331l748k633k090j153l2J803K043P434J5636K0763J4831J044
$$ 181805 179125 175794 172046 169413 167323 166170 166138 167941 169984 177418 193054 213817 228648 229692
14655B29692q561j8356k3153k0363j2115o704l818j840%L011M594P094O247J869
$$ 229692 221131 202775 179622 159259 147144 140440 136622 134782 134782 137793 142387 149481 155728 157597
14641A57597m777q657j2708j1192o381l149k65P21J719K064J703K131K48o68k056
$$ 157597 152820 144163 131455 120263 113882 110733 110468 111189 112908 114972 116675 118806 119054 118386 116330
14626A16330m343l315l289m532m923k733p10k978k494k358k906l684k671k158
$$ 116330 111987 108672 105383 100851 95928 93195 92485 89507 87013 84655 81749 78065 75394 73236
14612G3236k131j195j215O9p0o34M24j214j071j620J52K56N88n2j493q23K27P67
$$ 73236 71105 69910 68695 68764 68694 68060 68484 67270 66199 64579 64731 64987 65575 65523 64030 63207 63434 64201
14594F4201m0l94M05q18j922j084j084j661o96j024J015O03m32J91j376j526r69
$$ 64201 64161 63767 64172 63354 61432 60348 59264 57603 56907 55883 56898 57501 57069 57260 55884 54358 53389
14577E3389j722j398k102j273N67k39j400j665j474j218q05n95l55l64L11k4J554
$$ 53389 51667 50269 48167 46894 47461 47222 45822 44157 42683 41465 40660 40065 39710 39346 39657 39633 41187
14560D1187L054J275J324O36O90K449L176J363J299J256q26j184l842m690l906
$$ 41187 44241 45516 46840 47476 48166 50615 53791 55154 56453 57709 56883 55699 51857 47167 43261
14545D3261l077j803r87j871o70o86p34M89m88K69l83M03N26k454j838n32O47
$$ 43261 40184 38381 37394 35523 34853 34167 33433 33922 33434 33703 33320 33723 34249 31795 29957 29425 30072
14528C0072J485l22P1l63K111L228L870R357R688O447Q28n368r256r374p003l737
$$ 30072 31557 31235 31306 30943 33054 36282 40152 49509 59197 65644 66472 61104 51848 42474 35471 31734
14512C1734r93O68O71j100o10j050l565j682Q18R82r12j122j325J329L68k38J93
$$ 31734 30741 31409 32080 30980 30370 29320 25755 24073 24891 25873 24961 23839 22514 23843 24211 23973 24166
14495B4166m3j94J53J9K716M886P183Q718N159J733k975n393o921p030l949k567
$$ 24166 24123 23929 24082 24101 26817 31703 38886 47604 52763 54496 51521 46128 39207 32177 28228 25661
14479B5661j209j382j865o05j092j053J73R24N95Q63O87o9o1q23l55J632K223
$$ 25661 24452 23070 21205 20600 19508 18455 18628 19552 20147 21010 21697 21628 21567 20744 20389 22021 24244
14462B4244K493J832j404j088k327k321k308l98m02k55J207j22K83J163Q99M86
$$ 24244 26737 28569 27165 26077 23750 21429 19121 18723 18321 18066 19273 19151 19434 20597 21496 21982
14446B1982j359j692k49J75r12j084o92M85K3l215J25N39k37N61O23n08m10l8
$$ 21982 20623 18931 18682 18857 17945 16861 16169 16654 16677 13462 13587 14126 13889 14450 15073 14565 14155 14117
14428A4117j22j47m52L85K40O40Q74j060o24m18o30J822n21q09j78q25Q7m40L79
$$ 14117 13995 13848 13396 13781 14021 14661 15535 14475 13851 13433 12803 14625 14104 13295 13117 12292 12379 11939 12318
14409A2318L75O95J00L83l64j366l89J349M08n82o46P23J228N72M4N79P31j039
$$ 12318 12693 13388 13488 13871 13507 12141 11752 13101 13509 12927 12281 13004 14232 14804 14848 15427 16158 15119
14391A5119o05J00K14J577Mo19J57J615Q87N87l59m91j035p88k99O02J782rj286
$$ 15119 14514 14614 14828 16405 16409 15790 15947 17562 18449 19036 18677 18186 17151 16363 16064 16666 18448 18439 17153
14372A7153J02J43l9j917q18M75J630N64n47M07J179K345K09o42p37N1M89o3n23
$$ 17153 17255 17398 17359 15442 14624 15099 16729 17293 16746 17153 18332 20677 20886 20244 19507 19558 20047 19984 19461
14353A9461J2k58q16P49J605P36J6J296J118N96Q44J011J415K302K430J910J495
$$ 19461 19473 19215 18399 19148 20753 21489 21505 22801 23919 24515 25359 26370 27785 30087 32517 34427 35922
14336C5922J969K274M882K510K637J958J702J380J20r67j356j506k262j533j199
$$ 35922 37891 40165 45047 47557 50194 52152 53854 55234 55354 54387 53031 51525 49263 47730 46531
14321D6531l234j636j346k963k543M4M44n28k607l234j056r01j004l41l92L94
$$ 46531 43297 41661 40315 37352 34809 34853 35297 34769 32162 28928 27872 26971 25967 25626 25234 25628
14305B5628k82k798j020o05M4O35l73l20j424j077K62n24j049k44J220K68p33
$$ 25628 25346 22548 21528 20923 20967 21602 21229 20909 19485 18408 18670 18146 17097 16853 18073 18341 17608
14288A7608R23J416o66m25M42j001n06J596P35m52k1j443k46J244J510k65N45
$$ 17608 18531 19947 19281 18856 19298 18297 17791 19387 20122 19670 19649 18206 17960 19204 20714 20449 20994
14271B0994J121J039l24N2L21O73J144R64K180J959K25M41J146K828K580K679
$$ 20994 22115 23154 22830 22882 23203 23876 25020 25984 28164 30123 30348 30789 31935 34763 37343 40022
14255D0022K265J510R34K273L181M94l25J439m88l39O59j275l755m093j732l31
$$ 40022 42287 43797 44731 47004 50185 50679 50354 51793 51305 50966 51625 50350 46595 42502 40770 40439
14239D0439k252k363j799j524j517j989j578k598l206k196m26K03N87p62j20j237
$$ 40439 38187 35824 34025 32501 30984 28995 27417 24819 21613 19417 18991 19194 19781 19019 18899 17662
14223A7662j277n47l50l62k88R38l57j52N44j146j984q79k28J313m90k48k26Q38
$$ 17662 16385 15838 15488 15126 14838 15776 15419 15267 15811 14665 12681 11802 11574 12887 12397 12149 11923 12761
14205A2761L23P7R26J17L76J302m0J31L68O9p5j353j143P20l39n91K57m46j188
$$ 12761 13084 13161 14087 14204 14580 15882 15842 15973 16341 16410 16335 14982 13839 14559 14220 13629 13886 13440 12252
14186A2252j761O5p93J28J173M88j212m6M38o87J22K17J01M90O2J066k37Q04J043
$$ 12252 10491 10556 9763 9891 11064 11552 10340 10294 10732 10045 10167 10384 10485 10975 11037 12103 11866 12670 13713
14167A3713j42J512K961L165M065k44j614k756m569l357m72nJ57J11M25n36j128
$$ 13713 13571 15083 18044 21209 25274 25030 23416 20660 16091 12734 12262 12257 12414 12525 12950 12414 11286
14150A1286k50P95l73M89K11N49O75N17J065O36M52P01j339j391m18J204J851
$$ 11286 11036 11831 11458 11947 12158 12707 13382 13899 14964 15600 16052 16753 15414 14023 13605 14809 16660
14133A6660J032L61O33K235J182P86K20J078L118L679J388P32J710L195M400O088
$$ 16660 17692 18053 18686 20921 22103 22889 23109 24187 27305 30984 32372 33104 34814 38009 42409 48497
14117D8497Q858J0068J2794J8453K7049L4051M1569M3675L3434J2619q598k7692
$$ 48497 57355 67423 80217 98670 125719 159770 201339 245014 278448 291067 282469 254777
14105B54777l7761l8621l4573k7693j9484j4093j1834p970p332o559n291l425
$$ 254777 217016 178395 143822 116129 96645 82552 70718 62748 55416 48857 43566 40141
14093D0141k920l223k512j513j911k952j900n32n77k762j117l67r45l67n16o98
$$ 40141 37221 33998 31486 29973 28062 25110 23210 22678 22101 19339 18222 17855 16910 16543 16027 15329
14077A5329J09K02m84m43L76j16k102r12L39K107j60j809j250p2Kj492r58J39
$$ 15329 15438 15640 15156 14713 15089 14973 12871 11959 12298 14405 14245 12436 11186 11114 11116 9624 8666 8805
14059H805J247j240m20J351m96q17J011o03j141N87M08J13P5n86m58m03L76P2
$$ 8805 10052 8812 8392 9743 9247 8430 9441 8838 7697 8284 8692 8805 8880 8294 7836 7433 7809 7881
14041G881r09J028M29M60k83o74Q76J942J505m31K83J359k95r49K82K640K003
$$ 7881 6972 8000 8429 8889 8606 7932 8808 10750 12255 11824 12107 13466 13171 12222 12504 15144 17147
14024A7147N56K719M550N928O152M914L641q28n767n661m968l387j926k409j324
$$ 17147 17703 20422 24972 30900 37052 41966 45607 44779 39012 33351 28383 24996 23070 20661 19337
14009A9337q69l16p81q01K38J39J349Q28J1O19J381K588K688L428J722o17j308
$$ 19337 18468 18152 17371 16570 16808 16947 18296 19124 19135 19754 21135 23723 26411 29839 31561 30944 29636
13992B9636k176l365k726l62m39k17k52j711k81k11L37Q69N74M33R4j711q41k85
$$ 29636 27460 24095 21369 21007 20568 20351 20099 18388 18107 17896 18233 19102 19676 20109 20203 18492 17651 17366
13974A7366P53M52J024N55J68R39J145j8j802j649j146q79K80R38N07K72j60j77
$$ 17366 18119 18571 19595 20150 20318 21257 22402 22384 20582 18933 17787 16908 17188 18126 18633 18905 18745 18568
13956A8568n85j47K78l46r26j209P58P58j007j347J187J699J105m20O24J87l38
$$ 18568 17983 17836 18114 17768 16842 15633 16391 17149 16142 14795 15982 17681 18786 18366 18990 19177 18839
13939A8839N23J473J54m14N10O89O48n78n46P94j33N43L28P62K194J805L90j363
$$ 18839 19362 20835 20989 20575 21085 21774 22422 21844 21298 22092 21959 22502 22830 23592 25786 27591 27981 26618
13921B6618J89R37k98j404o32q38j834k801j208k202k769k354J06P51J84n22J154
$$ 26618 26807 27744 27446 26042 25410 24572 22738 19937 18729 16527 13758 11404 11510 12261 12445 11923 13077
13904A3077m48k33J872Q36N04Q91J047J483K02J031Q65M66J21J81l49L6M50K153
$$ 13077 12629 12396 14268 15104 15608 16499 17546 19029 19231 20262 21127 21593 21714 21895 21546 21582 22032 24185
13886B4185J958J417J227K85J475J541o96l91m90P88j015j208J70j86N82Q78j2
$$ 24185 26143 27560 28787 29072 30547 32088 31392 31001 30511 31299 30284 29076 29246 29060 29642 30520 30508
13869C0508L37P85J291M45J0L58J026P11K22p59J940K768J944J757J379J100N30
$$ 30508 30845 31630 32921 33366 33376 33734 34760 35471 35693 34934 36874 39642 41586 43343 44722 45822 46352
13852D6352O40k348q98q72j590j224k536k405l78j605l87j86j476l18K32k90k156
$$ 46352 46992 44644 43746 42874 41284 40060 37524 35119 34741 33136 32749 32563 31087 30769 31001 30711 28555
13835B8555q13n52P47J829J268J544J246K717K395K555K438J340K29j544o34j684
$$ 28555 27742 27190 27937 29766 31034 32578 33824 36541 38936 41491 43929 45269 45498 43954 43320 41636
13819D1636j599N36P86j085j241j114P94Q77L456K957P35K27j633m529k981j925
$$ 41636 40037 40573 41359 40274 39033 37919 38713 39590 43046 46003 46738 46965 45332 40803 37822 35897
13803C5897k182j245j456j120j670Q47M32O03Q38j238j117j5r49n59r56q24K157
$$ 35897 33715 32470 31014 29894 28224 29071 29503 30106 30944 29706 28589 28574 27625 27066 26110 25286 27443
13786B7443K596N68j125n5p98o91j588j22O60m28j456r96m4n09Q64J335K414L034
$$ 27443 30039 30607 29482 29427 28629 27938 26350 26228 26888 26460 25004 24008 23964 23455 24319 25654 28068 31102
13768C1102L638K157J055p41k27R31m83l12l34M45q85j666j302l12N87J382J359
$$ 31102 34740 36897 37952 37211 36984 37915 37432 37120 36786 37231 36346 34680 33378 33066 33653 35035 36394
13751C6394K363m55k023J869K222K625P123J0654J5541K2785K5608J8898O715
$$ 36394 38757 38302 36279 38148 40370 42995 50118 60772 76313 99098 124706 143604 150319
13738A50319m994j5572k1488j8893j3988q938m584j336M92L768N938M722N084
$$ 150319 145325 129753 108265 89372 75384 66446 61862 60526 61018 64786 70724 75446 80530
13725H0530M461M616M110M90j672q87q83j184r64k590l380k311r89j80j166p45
$$ 80530 84991 89607 93717 94207 92535 91648 90765 89581 88617 86027 82647 80336 79347 79167 78001 77256
13709G7256R64K142K554L851M020L397L878K313L119Q21j069J278J975K815N93
$$ 77256 78220 80362 82916 86767 90787 94184 98062 100375 103494 104315 103246 104524 106499 109314 109907
13694A09907K75K134L093J887J164K546M672L359K313L66j55J22m1j89O05K381
$$ 109907 110182 112316 115409 117296 118460 121006 125678 129037 131350 131716 131561 131683 131642 131453 132058 134439
13678A34439K653M073N386M150L414M107N424M043M304N092M617O164N838N562
$$ 134439 137092 141165 146551 150701 154115 158222 163646 167689 171993 177085 181702 187866 193704 199266
13664A99266P291Q064P170O520Q877O898O798Q347Q810J1355J1826J2865J5538
$$ 199266 206557 214621 221791 228311 237188 244086 250884 259231 268041 279396 291222 304087 319625
13651C19625J6266J7426J8350J7671J6379J4835J4328J3536J5756J6764J7222
$$ 319625 335891 353317 371667 389338 405717 420552 434880 448416 464172 480936 498158
13640D98158J9311J9783K2314K3280K5562K8233L1811L5802L9296M4199N1879
$$ 498158 517469 537252 559566 582846 608408 636641 668452 704254 743550 787749 839628
13629H39628N9863O9641P7974Q7145R9872J15509J34755J56503J82107K11486
$$ 839628 899491 969132 1047106 1134251 1234123 1349632 1484387 1640890 1822997 2034483
13619B034483K43241K70828K93774L21020L55288M07991M88412O09231P81417
$$ 2034483 2277724 2548552 2842326 3163346 3518634 3926625 4415037 5024268 5805685
13610E805685J018712J336123J755563K290961K944888L671045M308667M573136
$$ 5805685 6824397 8160520 9916083 12207044 15151932 18822977 23131644 27704780
13602B7704780M134869K855296R40551j172991l002627m145491m452317m098891
$$ 27704780 31839649 34694945 35635496 34462505 31459878 27314387 22862070 18763179
13594A8763179l428032k723975k119772j648449j289040j019319q10773o51288
$$ 18763179 15335147 12611172 10491400 8842951 7553911 6534592 5723819 5072531
13586E072531n30358m45470l87914l47532l16261k86842k54320k22093j95041
$$ 5072531 4542173 4096703 3708789 3361257 3044996 2758154 2503834 2281741 2086700
13577B086700j72465j53734j40831j27893j13820j00128q8179q2816p6120p1069
$$ 2086700 1914235 1760501 1619670 1491777 1377957 1277829 1189650 1106834 1030714 959645
13567I59645o5326o0637n8560n3654m9399m5655m3538m0328l6789l3250l1416
$$ 959645 894319 833682 775122 721468 672069 626414 582876 542548 505759 472509 441093
13556D41093k5302j9149j2045q663j0691j2123j6027k1248j9363j3988j0929q349
$$ 441093 415791 396642 384597 375934 365243 353120 337093 315845 296482 282494 271565 263216
13544B63216p948r856r861j0297j0335q747p114o747n774n577n367n875l972l767
$$ 263216 255268 245412 235551 225254 214919 206172 199058 192311 186537 180960 175593 169718 165746 161979
13530A61979l185m175m619m295l207k196k403k218l140l999m152m962l426m119
$$ 161979 158794 154619 150000 145705 142498 140302 137899 135681 132541 128542 124390 119428 116002 111883
13516A11883n232n186n781l207K54o39J709J957K139J773l02k03m28j754k285
$$ 111883 106651 101465 95684 92477 92731 92092 93801 95758 97897 99670 99368 99165 98737 96983 94698
13501I4698k090k759k006j879k965l134k544k951j927K13k4k547j571l264m885
$$ 94698 92608 89849 87843 85964 82999 79865 77321 74370 72443 72656 72632 70085 68514 65250 60365
13486F0365l251k116j831k630n186m350k463j079k502p06K655P957J0769J2311
$$ 60365 57114 54998 53167 50537 45351 41001 38538 37459 34957 34251 36906 44863 55632 67943
13472F7943J2372J0035L986q05n366r270q838o319l784k187k361j694l86l28m03
$$ 67943 80315 90350 94336 93531 88165 78895 70057 63738 59954 57767 55406 53712 53326 52998 52595
13457E2595K57L38J917J419K043N4j619J75o1j59k76j5n24l38p15N44K563L974
$$ 52595 52852 53190 55107 56526 58569 58623 57004 57179 57118 56959 56683 56668 56144 55806 55091 55635 58198 62172
13439F2172N535L403j362m474o641o808l458j586j611J4J679J14m29M01m85M7
$$ 62172 67707 71110 69748 65274 58633 51825 48367 46781 45170 45184 46863 46977 46548 46949 46464 46511
13423D6511n07m97Q10j58r93j40M10J07O39k303k435k669k500m293l578j775k179
$$ 46511 46004 45507 46317 46159 45166 45026 45436 45543 46182 43879 41444 38775 36275 31982 28404 26629 24450
13406B4450k031J25J126J565R66Q45J339J380K15k158j540j056l33J28J477J422
$$ 24450 22419 22544 23670 25235 26201 27046 28385 29765 29980 27822 26282 25226 24893 25021 26498 27920
13390B7920p07k323l035k262l102L96M511N623J0911J4724R498K038m457j1488
$$ 27920 27213 24890 21855 19593 16491 16887 21398 27021 37932 52656 62154 64192 59735 48247
13376D8247j5242j1254o079j822p42J393J818O60J080J76p26q17n73j027k99k0
$$ 48247 33005 21751 15672 13850 13108 14501 16319 16979 18059 18235 17509 16692 16119 15092 14793 14773
13360A4773Q67m61j639j033K87P12p36O41J470J816N67r86j572j284j66L5q48
$$ 14773 15640 15179 13540 12507 12794 13506 12770 13411 14881 16697 17264 16278 14706 13422 13256 13291 12443
13343A2443q77m4q6J303J684l26j551j371j082j089j572k41R15j18r47j414j48
$$ 12443 11566 11522 11436 12739 14423 14097 12546 11175 10093 9004 7432 7191 8106 7988 7041 5627 5479
13326E479n43K23J277K75M13R69J142P23o59L29M76N60J317l39k33M55N91QJ39
$$ 5479 4936 5159 6436 6711 7124 8093 9235 9958 9299 9628 10104 10664 11981 11642 11409 11864 12455 12463 12602
13307A2602r22j398k74J716M39j56K38k61q5J16M87J813K52J74J900R95j10j851
$$ 12602 11680 10282 10008 11724 12163 12007 12245 11984 11899 12015 12502 14315 14567 14741 16641 17636 17526 15675
13289A5675k731k564j705j565p29j802j685r65j073o73K16j021j150n52P21Q61
$$ 15675 12944 10380 8675 7110 6381 4579 2894 1929 856 183 399 -622 -1772 -2324 -1603 -742
13273g42K517J624J39P06J098L82m14Q01K52O7m09p35R30J066L8K32n27M56P15
$$ -742 1775 3399 3538 4244 5342 5724 5310 6111 6363 6430 6021 5286 6216 7282 7320 7552 7025 7481 8196
13254H196J13K54K23J303O72j253P9m3L1J189J124P26N91K04r34j800J82R17J200
$$ 8196 8309 8563 8786 10089 10761 9508 9587 9544 9575 10764 11888 12614 13205 13409 12475 10675 10857 11774 12974
13235A2974L68O97r27j264k79R85l67p99J094L77J06n08j165j689j265N89l34
$$ 12974 13342 14039 13112 11848 11569 12554 12187 11388 12482 12859 12965 12457 11292 9603 8338 8927 8593
13218H593k210r30J20j36K90K064P49P05m33n00j90j076K7k36j371l0J132Q70
$$ 8593 6383 5453 5573 5437 5727 7791 8540 9245 8812 8312 8122 7046 7073 6837 5466 5436 6568 7438
13200G438p5R7l12o10k6L06J685n08q37j254j221P16L02L3L00N42Q00Q97o9j13
$$ 7438 7363 7460 7148 6538 6512 6818 8503 7995 7158 5904 4683 5399 5701 5734 6034 6576 7376 8273 8204 8091
13180H091O05l93j547k7J249J068n9R42k87p00l57M41R12P94J004L23R55J392
$$ 8091 8696 8303 6756 6729 7978 9046 8987 9929 9642 8942 8585 9026 9938 10732 11736 12059 13014 14406
13162A4406J130m20k10N83J85j55l13p85j506j280n42r00m80L40M52J229n57L03
$$ 14406 15536 15116 14906 15489 15674 15519 15206 14421 12915 11635 11093 10193 9713 10053 10505 11734 11177 11480
13144A1480J208L24j242J29n64R15J012J25O96l47k247k44m15m05J50K274K61
$$ 11480 12688 13012 11770 11899 11335 12250 13262 13387 14083 13736 11489 11245 10830 10425 10575 12849 13110
13127A3110j678M53J82k38k88q01j54J431J020J568q42n77n51Q36J40m9O56R65
$$ 13110 11432 11885 12067 11829 11541 10740 10586 12017 13037 14605 13763 13186 12635 13471 13611 13562 14218 15183
13109A5183J668J353o75k52J605K752K427P99J134K898K475J692L077K670K147
$$ 15183 16851 18204 17529 17277 18882 21634 24061 24860 25994 28892 31367 33059 36136 38806 40953
13094D0953N908R011J0344J2663J7448K2080K4202K3147J9379J1018Q80q606j9879
$$ 40953 46861 55872 66216 78879 96327 118407 142609 165756 185135 196153 197033 188427 168548
13081A68548k3929k1453k1306j7159j3786r958o759p527o361k546j496l622k440
$$ 168548 144619 123166 101860 84701 70915 60957 54198 46671 40310 37764 36268 32646 30206
13068C0206k014k064j456j135j87j223j355j032k015r33j620p83L14q25n12J93
$$ 30206 28192 26128 24672 23537 23350 22127 20772 19740 17725 16792 15172 14389 14703 13878 13366 13559
13052A3559M00m97m83K38r55j590p66p58o73N49K03R2J150M9L73J77k23O72M17
$$ 13559 13959 13462 12979 13217 12262 10672 9906 9148 8475 9024 9227 9319 10469 10518 10891 11068 10845 11517 11934
13033A1934m2j016p06l24p96j01J65R42J117M57J558m85n35j213O67J23l12J144
$$ 11934 11892 10876 10170 9846 9050 8949 9114 10056 11173 11630 13188 12703 12168 10955 11622 11745 11433 12577
13015A2577L21J250K711L371M767O271O845M665N89l205n777n978n510n066m859
$$ 12577 12898 14148 16859 20230 24997 31268 38113 42778 43367 40162 34385 28407 22897 17831 12972
13000A2972l313m7j18q70p31q3j233J559M02j291o45m67r03n64K10o99j865K61
$$ 12972 9659 9612 9494 8624 7893 7810 6577 8136 8538 7247 6602 6135 5232 4668 4878 4179 2314 2575
12982B575K011J648N74j178j10N57Nj089k69J817P31J96j299P5Q84K58p6N41O08
$$ 2575 4586 6234 6808 5630 5520 6077 6082 4993 4724 6541 7272 7468 6169 6244 7128 7386 7310 7851 8459
12963H459n6J27m51L65J392P14r04J9J439Q6o66m23m3J721Q49j443O89J437K906
$$ 8459 8403 8530 8079 8444 9836 10550 9646 9665 11104 11190 10524 10101 10058 11779 12628 11185 11874 13311 16217
12944A6217K246J380m74m73j665k655k051j824j702p69l01Q17J206l47m06k33
$$ 16217 18463 19843 19369 18896 17231 14576 12525 10701 8999 8230 7929 8746 9952 9605 9199 8966
12928H966M42J793J448r8k270j140n84R40J818o15l36J301l3j55j234L10K82L98
$$ 8966 9408 11201 12649 12551 10281 9141 8557 9497 11315 10700 10364 11665 11632 11477 10243 10553 10835 11233
12910A1233L23J248R0m97n10j22p41R71j25k53N76j692k056n92j113N66J370N28
$$ 11233 11556 12804 12894 12397 11887 11765 11024 11995 11870 11617 12193 10501 8445 7853 6740 7306 8676 9204
12892I204P05J405J446j290J936R90p32K38J447L26M8j342m9p16L28L43l22j603
$$ 9204 9909 11314 12760 11470 13406 14396 13664 13902 15349 15675 15723 14381 14332 13616 13944 14287 13965 12362
12874A2362r22n54j41j777r12Q04K35k85N62O03%L89O61J45K8j18L55j35l41J61
$$ 12362 11440 10886 10745 8968 8056 8860 9095 8810 9372 9975 9975 10364 11025 11170 11198 11080 11435 11300 10959 11120
12854A1120m55K54J059J835J624O14m53j000l20M12l88k79k93j90M50J597j6j186
$$ 11120 10665 10919 11978 13813 15437 16051 15598 14598 14278 14690 14302 14023 13730 13540 13990 15587 15571 14385
12836A4385q38j85k79j187j124J380J075j288l50o5O91j436n35j51o12K67K002
$$ 14385 13547 13362 13083 11896 10772 12152 13227 11939 11589 11524 12215 10779 10244 10093 9481 9748 11750
12819A1750P47O94j77j373j113J18Q18o0R98L70L12j084J43r0l19J516L56n06
$$ 11750 12497 13191 13014 11641 10528 10646 11464 11404 12402 12772 13084 12000 12143 12053 11734 13250 13606 13100
12801A3100r35k81o67n00k13J070Q84J70J065l29m99J110O72m2M99k42L65o30
$$ 13100 12165 11884 11217 10717 10504 11574 12458 12628 13693 13364 12865 13975 14647 14605 15104 14862 15227 14597
12783A4597J070K295P28j524k260P29N56N62j091p91N41J702l39j023n95j566
$$ 14597 15667 17962 18690 17166 14906 15635 16191 16753 15662 14871 15412 17114 16775 15752 15157 13591
12767A3591j80J184k17p77R71j76n55o77m04j92Q44K18j89P81l22r59P14K539
$$ 13591 13411 14595 14378 13601 14572 14396 13841 13164 12760 12568 13412 13630 13441 14222 13900 12941 13655 16194
12749A6194R09J005R70Q37J729J507R87J55N03j074j276q26j621j03m04o45J62
$$ 16194 17103 18108 19078 19915 21644 23151 24138 24293 24796 23722 22446 21620 19999 19896 19492 18847 19009
12732A9009p51M61J620M5p58K240K479J004l88k36j808l078j982q45m39o91o53
$$ 19009 18258 18719 20339 20384 19626 21866 24345 25349 24961 24725 22917 19839 17857 17012 16573 15882 15229
12715A5229q34j9O04L1K40j137j137o91L48R86l94j066O5J262L74L21k59r71J79
$$ 15229 14395 14376 14980 15011 15251 14114 12977 12286 12634 13620 13226 12160 12225 13487 13861 14182 13923 12952 13131
12696A3131M06K24P71M83l8p01k58J25j447k9k55j220j277J07%K19j59J289O62
$$ 13131 13537 13761 14532 15015 14977 14276 14018 14143 12696 12667 12412 11192 9915 10022 10022 10241 10082 11371 12033
12677A2033j03J57J272J072J544J439Q2J146M28p07R2Q90L36j063j310q9R95L46
$$ 12033 11930 12087 13359 14431 15975 17414 17496 18642 19070 18363 18455 19345 19681 18618 17308 17219 18214 18560
12659A8560J287j403m1R46M4j641Q83J107M01J240j13J172M37m77J106R45k61
$$ 18560 19847 18444 18403 19349 19393 17752 18635 19742 20143 21383 21270 22442 22879 22402 23508 24453 24192
12642B4192J41p72J223J550L97M93p24l54n22L35K53j317o44j184j104M27m43
$$ 24192 24333 23561 24784 26334 26731 27224 26500 26146 25624 25959 26212 24895 24251 23067 21963 22390 21947
12625B1947o54j15j038j476r00J09l78l48J315J236M16j4L60K45J13J058K037
$$ 21947 21293 21178 20140 18664 17764 17873 17495 17147 18462 19698 20114 20100 20460 20705 20818 21876 23913
12608B3913J336J419J776L05j630r10Q88J638J947L972O608J1224J1578Q764M505
$$ 23913 25249 26668 28444 28749 27119 26209 27097 28735 30682 34654 41262 52486 64064 72828 77333
12593G7333r91o916j1534j0328p985o229k330n34m02m32p43k88L85l4r28j610
$$ 77333 76342 69426 57892 47564 39579 33350 31020 30486 30084 29652 28909 28621 29006 28972 28044 26434
12577B6434L22R68o90j866L61J287j06k62Q63J030J178J216Q76M11L86Q46j6O65
$$ 26434 26756 27724 27034 25168 25529 26816 26710 26448 27311 28341 29519 30735 31611 32022 32408 33254 33238 33903
12559C3903J38j325j708j140k228o2J251r00k071j824o05K21N4P01k81l39p48
$$ 33903 34041 32716 31008 29868 27640 27578 28829 27929 25858 24034 23429 23650 23704 24405 24124 23785 23037
12542B3037j640l71J95J51o01r65P31J958k27q10o4P48J29J25J018P24J311l07
$$ 23037 21397 21026 21221 21372 20771 19806 20537 22495 22268 21458 21394 22142 22271 22396 23414 24138 25449 25142
12524B5142P51M94o40m83o49l12l78k09Q04k59j051n64j120L42J187J137J507
$$ 25142 25893 26387 25747 25264 24615 24303 23925 23716 24520 24261 23210 22646 21526 21868 23055 24192 25699
12507B5699J526L011J021K84J890q4j352r8P22j429q63J117K211O91K390M952
$$ 25699 27225 30236 31257 31541 33431 33347 31995 31897 32619 31190 30327 31444 33655 34346 36736 41688
12491D1688Q142R218M508j028n364r223j0537o754l957l984k104m52N11N98Q1
$$ 41688 49830 59048 63556 62528 57164 47941 37404 30650 26693 22709 20605 20153 20664 21262 21343
12476B1343k82k78N22J727J464l5O65L88Q59P11O52J171J097N52Q07R50R33q33
$$ 21343 21061 20783 21305 23032 24496 24461 25126 25514 26373 27084 27736 28907 30004 30556 31363 32313 33246 32413
12458C2413j483k982k33MM64L0j153Q83J370J174J799J122J008R36O88r20J067
$$ 32413 30930 27948 27715 27719 28183 28213 27060 27943 29313 30487 32286 33408 34416 35352 36040 35120 36187
12441C6187Q78L095N061N373L816L309L907O165O005N630Q147J1389J4514K5084
$$ 36187 37065 40160 45221 50594 54410 57719 61626 67791 73796 79426 87573 98962 113476 138560
12427A38560M2130O7738J13764J89597K70346K53811J16345j8437j51959k64665
$$ 138560 180690 248428 362192 551789 822135 1075946 1192291 1173854 1021895 757230
12417G57230k53649j62070q8792n1260l3271k1911j6681j2776r926q535p477p442
$$ 757230 503581 341511 252719 201459 168188 146277 129596 116820 106894 98359 90882 83440
12405H3440n007l218l930l370k026q61l017m269l638l690l393k483j497N55J972
$$ 83440 78433 75215 71285 67915 65889 65028 62011 57742 54104 50414 47021 44538 43041 43596 45568
12390D5568P99J399J358P55L19M1K414K570N483Q983R292L664k123p749j1114
$$ 45568 46367 47766 49124 49879 50198 50239 52653 55223 60706 69689 78981 82645 80522 72773 61659
12375F1659j0451n788k777m38j180j090J36p8P34R50O66K055L499L166K494M92
$$ 61659 51208 45420 42643 42205 41025 39935 40071 39993 40727 41677 42343 44398 47897 51063 53557 54049
12359E4049k382m175j773o76n60j47K95j86j192j280j396J08K548K740k27N43
$$ 54049 51667 47492 45719 45043 44483 44336 44631 44445 43253 41973 40577 40685 43233 45973 45746 46289
12343D6289L40j457j616j010j371p0O07K85K398K087O16J493J30M04o84k470k773
$$ 46289 46629 45172 43556 42546 41175 41105 41712 41997 44395 46482 47098 48591 48721 49125 48441 45971 43198
12326D3198l534k724k48M0q93j591L00p66R36J445N28R90P08J68L00K19J943M7
$$ 43198 39664 36940 36692 36732 35839 34248 34548 33782 34718 36163 36691 37681 38389 38557 38857 39076 41019 41066
12308D1066j254M56K11J205O66j02j536j764j645j52J329J552K552N285K528J936
$$ 41066 39812 40268 40479 41684 42350 42248 40712 38948 37303 37151 38480 40032 42584 47869 50397 52333
12292E2333J338N17m2l15j204j856k100j525o06p90O20J265j20K090J648J089
$$ 52333 53671 54188 54146 53831 52627 50771 48671 47146 46540 45750 46370 47635 47515 49605 51253 52342
12276E2342l52j16j009j998j55Q78J242J758P22P65r56j50N5l17j466o76j088
$$ 52342 51990 51874 50865 48867 48712 49590 50832 52590 53312 54077 53121 52971 53026 52709 51243 50567 49479
12259D9479r24J07J699Q46O08K954J96r19j648l017j991R29q1k165j090L016L061
$$ 49479 48555 48662 50361 51207 51815 54769 54965 54046 52398 49381 47390 48319 48238 46073 44983 47999 51060
12242E1060L810N80n94J61n9L067K485J560J663K732J492J905P98j500k925m002
$$ 51060 54870 55450 54856 55017 54958 58025 60510 62070 63733 66465 67957 69862 70660 69160 66235 62233
12226F2233n130m274k851N6P33J071L720M800N586L241m55j183l283m252k226
$$ 62233 57103 52829 49978 50034 50767 51838 55558 60358 65944 69185 68730 67547 64264 60012 57786
12211E7786j685j020q54Q4K75K970M115M612K402K079J921J085J333J623J347
$$ 57786 56101 55081 54227 54311 54586 57556 61671 66283 68685 70764 72685 73770 75103 76726 78073
12196G8073L399O254O703R698J2608J3916J9518L0380M5687P0093J06000J71814
$$ 78073 81472 87726 94429 104127 116735 130651 150169 180549 226236 296329 402329 574143
12184E74143K90170M47567M99295K97582L6938j95692m33684m94006l53398k04883
$$ 574143 864313 1311880 1811175 2108757 2145695 1950003 1516319 1022313 668915 464032
12174D64032j15774p1396m5005k9369k0465j3141p850o399k766M62M049M964L96
$$ 464032 348258 276862 231857 202488 182023 168882 161032 154633 151867 152329 156378 161342 161738
12161A61738j710o868j2677j1461p078n105m896l586k395j858j279k556j373o82
$$ 161738 160028 153160 140483 129022 121944 116839 111943 108357 105962 104104 102825 100269 98896 98214
12147I8214M3Q75j009j369j700k500k946m427m255j582R25N287O655M908M278
$$ 98214 98257 99132 98123 96754 95054 92554 89608 85181 80926 79344 80269 85556 92211 97119 101397
12132A01397L324M67k205k801j356j010P31J038q32o34J804K555K854O52j09P09
$$ 101397 104721 105188 102983 100182 98826 97816 98547 99585 98753 98119 99923 102478 105332 105984 105875 106584
12116A06584Q54k246j812n46j058p257n453l978n801l276K010P48L16K541L910
$$ 106584 107438 105192 103380 102834 101776 94519 89066 85088 79287 76011 78021 78769 79085 81626 85536
12101H5536J774j81j373j116k388j008M02J174K978J928k901m189l602m116j513
$$ 85536 87310 87129 85756 84640 82252 81244 81646 82820 85798 87726 84825 80636 77034 72918 71405
12086G1405r9L344N273O75J681L194J536J078M07J924J543J283J710J238J228
$$ 71405 71306 74650 79923 80598 82279 85473 87009 88087 88494 90418 91961 93244 94954 96192 97420
12071I7420J418J494O80O9o82m75P02K184J428N608Q686J0812J0312O221M172
$$ 97420 98838 100332 101012 101081 100399 99924 100626 102810 104238 109846 118532 129344 139656 145877 150049
12056A50049L098M42l5P37R02p29j421n151o674j0843k1469k4847j0887l764p898
$$ 150049 153147 153589 153554 154291 155193 154464 153043 147892 141218 130375 108906 84059 73172 69408 61510
12041F1510q342K393J6073J6721J2159O022J740O44K470Q628J9244K9288K2614
$$ 61510 53168 55561 71634 88355 100514 106536 108276 108920 111390 120018 139262 168550 191164
12028A91164O958o353j8536k4191k1067j4142o332J175N030P691J5153K0769K3778
$$ 191164 198122 191769 173233 149042 127975 113833 107501 108676 113706 121397 136550 157319 181097
12015A81097K1038J2163m7j0275j7081j7326r059m710m135l689K51Q257J0131
$$ 181097 202135 214298 214251 203976 186895 169569 160510 155800 151665 147976 148227 156484 166615
12002A66615N510L962N375O982L664k2M207J757K433L699K1670K5699K5415J4123
$$ 166615 172125 176087 181462 188444 192108 192086 196293 198050 200483 204182 225852 251551 276966 291089
11988B91089K447j0139P152M4432J1738k9519k9057j3028l8808k5619j6861j4973
$$ 291089 293536 283397 290549 334981 346719 317200 288143 275115 236307 210688 193827 178854
11976A78854n892J072M886K608p6M82l674r649j2124r610o355r55O578J5053K1344
$$ 178854 172962 174034 178920 181528 181452 181934 178260 168611 156487 146877 140522 139567 146145 161198 182542
11961A82542K5492K6329K4780J9568Q725l528j2144j3025j2634j0779q777p723
$$ 182542 208034 234363 259143 278711 287436 283908 271764 258739 246105 235326 226549 218826
11949B18826o138l855o719j0447j1041n762m125l682M35M390N724K543n230j5110
$$ 218826 212688 208833 202114 191667 180626 174864 170739 167057 167492 171882 177606 180149 174919 159809
11935A59809j8506r777J0618L2176L7554L5293L1967J8328J667o041p149j3533
$$ 159809 141303 131526 142144 174320 211874 247167 279134 297462 299129 293088 285939 272406
11923B72406k7659m3014l8432j7856p504j2607j2424o583k597r05K728O165N777
$$ 272406 244747 201733 163301 145445 137941 125334 112910 106327 103730 102825 105553 111718 117495
11910A17495M652N266J470k695m801p61L588Q847J8820K6809K2445J0843O113
$$ 117495 122147 127413 128883 126188 121387 120626 124214 133061 151881 178690 201135 211978 218091
11897B18091N316M953R510J4239J1930M868o458j4423j0071j6774l6392l9410
$$ 218091 223407 228360 237870 252109 264039 268907 262449 248026 237955 221181 184789 145379
11885A45379j9292L411N661K151M138N743R999J5746J4132R072O112M751M845
$$ 145379 126087 129498 135159 137310 141448 147191 157190 172936 187068 196140 202252 207003 211848
11872B11848M860Q239L506l473p740p015q360j0525k194L4650P7919Q7188Q2513
$$ 211848 216708 224947 228453 224980 217240 210225 201865 191340 189146 223796 301715 388903 471416
11859D71416R5241J62846K16513J61983O7343k3207j09501j46695j29059j06965
$$ 471416 566657 729503 946016 1107999 1175342 1152135 1042634 895939 766880 659915
11849F59915q4446n7476m2939m0956l3068j7948j448O726Q873J6758K4250K7764
$$ 659915 575469 517993 475054 434098 401030 383082 381634 388360 397233 413991 438241 466005
11837D66005K8674M3980P3345P1985M2987K1547j7589n2067m5880k9124k0245
$$ 466005 494679 538659 612004 683989 726976 748523 730934 678867 632987 603863 583618
11826E83618j0219m03J6821L7430N0088M9635M5280L5068J6059q064k8540l7050
$$ 583618 573399 572996 589817 627247 677335 726970 772250 807318 823377 815313 786773 749723
11814G49723l6893k4729l907P740J1541J8640K0857O731j1697k0413j2761J1861
$$ 749723 712830 688101 684194 691934 703475 722115 742972 749703 738006 717593 704832 716693
11802G16693L5680M1873M0917M4788N3531P7529Q9944O0928K5138Q35l4241m8823
$$ 716693 752373 794246 835163 879951 933482 1011011 1100955 1161883 1187021 1187856 1153615 1104792
11790A104792j9505J5081L6883M6893N3058O7586R9742J19641J12327J00738R5301
$$ 1104792 1085287 1100368 1137251 1184144 1237202 1304788 1404530 1524171 1636498 1737236 1832537
11779A832537Q6589N5447K1734K6812O1968P7863O9141Q2561J34899K06473K31685
$$ 1832537 1919126 1974573 1996307 2023119 2085087 2162950 2232091 2314652 2449551 2656024 2887709
11768B887709J67500R7621K8434k8067J766R2423J69379K46723L43597M13825
$$ 2887709 3055209 3152830 3181264 3153197 3154963 3247386 3416765 3663488 4007085 4420910
11758D420910M13053M00325L96392M21923N57946P48862Q85976J006173J221038
$$ 4420910 4833963 5234288 5630680 6052603 6610549 7359411 8245387 9251560 10472598
11749A0472598J524493J780624J842243J900449K107884K564493L599594N345952
$$ 10472598 11997091 13777715 15619958 17520407 19628291 22192784 25792378 31138330
11741C1138330P781381J1397339J6858532K5279517L7971250N3401403O0610502
$$ 31138330 38919711 50317050 67175582 92455099 130426349 183827752 244438254
11734B44438254M2530144J3556079j074081j8848482m7214438o1123373m9907774
$$ 244438254 286968398 300524477 299450396 280601914 233387476 172264103 122356329
11727A22356329l2908332k1079796j4106316r943487p243537n384299m108279
$$ 122356329 89447997 68368201 54261885 44318398 37074861 31690562 27582283
11720B7582283l212701k646300k329888k110556j992119j857497j544124j158880
$$ 27582283 24369582 21723282 19393394 17282838 15290719 13433222 11889098 10730218
11712A0730218q37965o40869n62128n77464n63739m99300m75226m38543l69001
$$ 10730218 9892253 9251384 8689256 8111792 7548053 7048753 6573527 6134984 5765983
11703E765983l20803l13999l15871l43365l81455l79239l44259l20582k87529
$$ 5765983 5445180 5131181 4815310 4471945 4090490 3711251 3366992 3046410 2758881
11694B758881k53403k34144k09088j65627j37648j49318j72684j53360j00694
$$ 2758881 2505478 2271334 2062246 1896619 1758971 1609653 1436969 1283609 1182915
11685A182915n4275l2316j5730M159Q032j6414l4280l2098k7967l3828m1323m8254
$$ 1182915 1128640 1096324 1080594 1084753 1092785 1076371 1042091 1009993 982026 948198 906875 858621
11673H58621m9258k9527j4442j4796j2233j3113j8982j5951k923J3907K5965K7818
$$ 858621 809363 779836 765394 750598 738365 725252 706270 690319 687396 701303 727268 755086
11661G55086K1023K947j6045j7085k3272l4127m0558m0051l3941l3577m1987m7043
$$ 755086 776109 779056 763011 745926 722654 688527 647969 607918 573977 540400 498413 451370
11649D51370m2432l3213k1640n981K632J1050K2127L1690K9673K0920J1820J0208
$$ 451370 408938 375725 354085 348104 350736 361786 383913 415603 445276 466196 478016 488224
11637D88224J0397P009R42M096J7255K5960L1288K4573M855k0938l9788m2924
$$ 488224 498621 505630 506572 510668 527923 553883 585171 609744 614599 593661 553873 510949
11625E10949m1482l9646k8918j6834j5498k7659l9397m1223l1281k2577j8807
$$ 510949 469467 429821 400903 384069 368571 340912 301515 260292 229011 206434 187627
11614A87627j8506k1919l1230n3468p5133l5384P1819J53110J36519M5399K0064
$$ 187627 169121 147202 115972 62504 -12629 -48013 23806 176916 313435 358834 378898
11603C78898M401R276j0518q610J5837M2699M8045J9061q866l0740n0920n4290
$$ 378898 383299 392575 382057 373447 389284 431983 480028 499089 490223 459483 408563 354273
11591C54273l2231j2809n071O02N754O731J928L468P965P722P666P403r341k6480
$$ 354273 322042 309233 304162 304764 310518 317249 319177 322645 330610 338332 345998 353401 344060 317580
11577C17580j9270l823j3225l2647l4711j9173l14P169J0263Q075P843R449R833
$$ 317580 298310 294487 281262 248615 213904 194731 194417 201586 211849 219924 227767 237216 247049
11564B47049J3679J5441J0477O443L679q66n817q348m958j967P06N637N819L134
$$ 247049 260728 276169 286646 293089 296768 295902 290085 281737 276779 274812 275518 281155 286974 290108
11550B90108k078n638r814j0600n393j598j0317k8957l2822j9207p827o599q112
$$ 290108 288030 282392 272578 261978 256585 254987 244670 215713 182891 163684 155857 149258 141146
11537A41146J712J4177K1815J6956J3324O477p412k2074k3778j5890n771O84M147
$$ 141146 142858 157035 178850 195806 209130 215607 208195 186121 162343 146453 140682 141366 145513
11524A45513J479l133m495n917r899j3029r481m594m019o554j2557j5096j3920
$$ 145513 146992 143859 139364 133447 123548 110519 101038 96444 92425 85871 73314 58218 44298
11511D4298j3168r906m602K939J0111J4994J7831J7429J7846J7570J2932P115
$$ 44298 31130 21224 16622 19561 29672 44666 62497 79926 97772 115342 128274 135389
11499A35389L051o61n169j0596j1625q921n553m888l325K070M542M916N772R000
$$ 135389 138440 137779 132610 122014 110389 101468 95915 91027 87702 89772 94314 99230 105002 114002
11485A14002R220M836K538k938j684k813r077j3870n469k932o54l47N99j100m333
$$ 114002 123222 128058 130596 127658 125974 123161 114084 100214 94745 91813 91159 90812 91411 90311 85978
11470H5978l872l49k1L952N662P301Q197J0609J2069J4178J1011K381j699p12
$$ 85978 82106 81757 81736 85688 91350 98651 106848 117457 129526 143704 154715 157096 155397 154685
11456A54685K427O924Q748Q498O681O449O679R031J4254J8553K0318K2610K6331
$$ 154685 157112 164036 172784 181282 187963 194412 201091 210122 224376 242929 263247 285857 312188
11443C12188L1850L9387N5352P2712Q7939R6397R6300Q2909N2969J3642k6307
$$ 312188 344038 383425 438777 511489 599428 695825 792125 875034 928003 941645 915338
11432I15338n8481p6107q1376p2260n5339l6397j9054j1674j5606k1884k2806
$$ 915338 856857 780750 699374 627114 571775 535378 516324 504650 489044 467160 444354
11421D44354k1683k6460l4250k6020j3278q163p027m295K33K063N90Q4M119O883
$$ 444354 422671 396211 361961 335941 322663 314500 307473 303178 303411 305474 306064 306148 310267 317150
11407C17150J0120J4249J8094J7372J6492J7298J6769J7980K1586K5031K4529
$$ 317150 327270 341519 359613 376985 393477 410775 427544 445524 467110 492141 516670
11396E16670J9355J4260P428J168r16K274O119R728J1998J2204J4090J6263J6775
$$ 516670 536025 550285 557713 558881 557965 560239 566358 576086 588084 600288 614378 630641 647416
11383F47416J8082J7735J9724K5009K5314K5233K3421K2143K0350J9414K4396
$$ 647416 665498 683233 702957 727966 753280 778513 801934 824077 844427 863841 888237
11372H88237K8940L0468L0844L0320L2658L7229L9629M0188M4732M9272N1379
$$ 888237 917177 947645 978489 1008809 1041467 1078696 1118325 1158513 1203245 1252517 1303896
11361A303896N3286N7222O1600O3235O3451O6337O9388P6176Q2025Q8323R4116
$$ 1303896 1357182 1414404 1476004 1539239 1602690 1669027 1738415 1814591 1896616 1984939 2079055
11350B079055J00836J07979J13251J17130J25539J34824J45100J55456J65487
$$ 2079055 2179891 2287870 2401121 2518251 2643790 2778614 2923714 3079170 3244657
11341C244657J74593J85851K00195K09009K15694K22975K34807K55064K87626
$$ 3244657 3419250 3605101 3805296 4014305 4229999 4452974 4687781 4942845 5230471
11332E230471L25892L69183M15548M65945N19808N77814O44297P22571Q10128
$$ 5230471 5556363 5925546 6341094 6807039 7326847 7904661 8548958 9271529 10081657
11323A0081657R10806J027596J159067J307691J476148J665740J874650K105743
$$ 10081657 10992463 12020059 13179126 14486817 15962965 17628705 19503355 21609098
11315B1609098K356673K622174K889943L138210L334020L446970L434006L257059
$$ 21609098 23965771 26587945 29477888 32616098 35950118 39397088 42831094 46088153
11307D6088153K887839K320249J581342P21540j84867j059272j826401k437157
$$ 46088153 48975992 51296241 52877583 53599123 53414256 52354984 50528583 48091426
11299D8091426k863247l105890l181639l126164k980652k781943k557290k329596
$$ 48091426 45228179 42122289 38940650 35814486 32833834 30051891 27494601 25165005
11291B5165005k111291j906238j717758j543598j380530j228987j088486r52494
$$ 25165005 23053714 21147476 19429718 17886120 16505590 15276603 14188117 13235623
11283A3235623q11691o53766m50046k22186j24638k79438m78927o68644q61657
$$ 13235623 12423932 11770166 11320120 11097934 10973296 10693858 10214931 9546287 8684630
11274H684630q71241o93880n23114m17985l61728l26196k99272k74570k53827
$$ 8684630 7813389 7119509 6596395 6178410 5816682 5490486 5191214 4916644 4662817
11265D662817k32901k11128j89612j69286j44186j10649p8201p3260r9488j23955
$$ 4662817 4429916 4218788 4029176 3859890 3715704 3605055 3526854 3453594 3354106 3230151
11255C230151j48205j68464j58346j29046j06394r2395q3580p7154o9640o3395
$$ 3230151 3081946 2913482 2755136 2626090 2519696 2427301 2343721 2266567 2196927 2133532
11245B133532o1115n7469n5278n4092n2264n0525m7398m5480m3478m2025l8052
$$ 2133532 2072417 2014948 1959670 1905578 1853314 1802789 1755391 1709911 1666433 1624408 1586356
11234A586356l5328l4389l4110l1642k9298k8760k9350l0280k7793k4843k5172
$$ 1586356 1551028 1516639 1482529 1450887 1421589 1392829 1363479 1333199 1305406 1280563 1255391
11223A255391k4358k0730k1307j9740j7515j5108j2588j0777r969j2389j3942
$$ 1255391 1231033 1210303 1188996 1169256 1151741 1136633 1124045 1113268 1103299 1090910 1076968
11212A076968j5863j9211j9932j9883j8584j8737j7960j8357j5899j2877j3478
$$ 1076968 1061105 1041894 1021962 1002079 983495 964758 946798 928441 912542 899665 886187
11201H86187j0343r431j0193j1952j2415j2577j1344j1217j1668j1678j0758r597
$$ 886187 875844 866413 856220 844268 831853 819276 807932 796715 785047 773369 762611 753014
11189G53014p174n461l152k035K3J957L897K645J194k343p364j0214j0679r006
$$ 753014 745840 740379 737227 735192 735215 737172 741069 743714 744908 742565 735201 724987 714308 705302
11175G05302p487n979k838k822k124q68J58J125Q44j285l124l210j966j394j026
$$ 705302 697815 691836 688998 686176 684052 683184 683342 684467 685311 684026 680902 677692 675726 674332 673306
11160F73306k032k933k660l589k401j106r56K949K575j433n748j0676j4288j4879
$$ 673306 671274 668341 665681 662092 659691 658585 657629 660578 663153 661720 655972 645296 631008 616129
11146F16129j0968q589n368m412m944m426k537l958l310k214j780j786m60J23
$$ 616129 605161 596572 591204 586792 581848 577422 574885 570927 567617 565403 563623 561837 561377 561500
11132E61500j2L73L92J172j885j799k888l416m793m360k294j938j688k387k834
$$ 561500 561488 561861 562253 563425 561540 559741 556853 553437 548644 544284 541990 540052 538364 535977 533143
11117E33143k494l303m380m144l206j288m23k96o82j032j686j570o91J033K155
$$ 533143 530649 527346 522966 518822 515616 514328 513905 513609 512927 511895 510209 508639 507948 508981 511136
11102E11136J063j739m178o474n633l48L205P117L519N62l863o741q016p097l761
$$ 511136 512199 510460 506282 499808 494175 493827 497032 504149 507668 508230 504367 497626 489610 482513 478752
11087D78752m59n65j864K64J331K216K998M070M552M661M777P876J0351R808R642
$$ 478752 478293 477728 475864 476128 477459 479675 482673 486743 491295 495956 500733 508609 518960 528768 538410
11072E38410R366R299P467P819J1230J1250J2885J7102J9703K2908K4472K9507
$$ 538410 547776 557075 564542 572361 583591 594841 607726 624828 644531 667439 691911 721418
11060G21418L3556L6321L6816L2417K6583J9564P547k915j0558j6993j9042k0398
$$ 721418 754974 791295 828111 860528 887111 906675 914222 911307 900749 883756 864714 844316
11048H44316k0026j6345j2912p299k40P897K3404M3740O0808N6658L0748j798
$$ 844316 824290 807945 795033 787734 787494 795391 818795 862535 923343 980001 1010749 1008951
11036A008951l4400n5404n2954l2736j3042j436N551J0249J4054J6567J7956J7602
$$ 1008951 974551 919147 866193 833457 820415 818979 824530 834779 848833 865400 883356 900958
11024I00958J6394J2628Q322N980K350p01m749o808o479o715p815o560l739k197
$$ 900958 917352 929980 938302 944282 946632 945931 941182 934374 927895 921180 913365 906805 903066 900869
11010I00869k14p8p28J005L296N094O149P218Q900J1475J3517J3701J2959J3793
$$ 900869 900655 900577 899849 900854 904150 909244 915393 922611 931511 942986 956503 970204 983163 996956
10996I96956J5325J5751J5024J5082J5067J6152J6379J6414J8776K1652K2633
$$ 996956 1012281 1028032 1043056 1058138 1073205 1089357 1105736 1122150 1140926 1162578 1185211
10985A185211K2472K3383K2364K3285K2007K1671K3334K7134K9679L1255L3005
$$ 1185211 1207683 1231066 1253430 1276715 1298722 1320393 1343727 1370861 1400540 1431795 1464800
10974A464800L3890L7562L9079M0033M1512M4142M5952M7368M8676N1734N4577
$$ 1464800 1498690 1536252 1575331 1615364 1656876 1701018 1746970 1794338 1843014 1894748 1949325
10963A949325N8942O3670O7944O9544P3850P6766Q1539Q5359Q9816R2878R6199
$$ 1949325 2008267 2071937 2139881 2209425 2283275 2360041 2441580 2526939 2616755 2709633 2805832
10952B805832J02999J06822J12024J20218J28585J36838J45233J54581J67161
$$ 2805832 2908831 3015653 3127677 3247895 3376480 3513318 3658551 3813132 3980293
10943C980293J78576J90969K06620K24764K44941K67010K91841L20542L50534
$$ 3980293 4158869 4349838 4556458 4781222 5026163 5293173 5585014 5905556 6256090
10934F256090L84144M23830M65761N14306N67186O28924O96938P73629Q62224
$$ 6256090 6640234 7064064 7529825 8044131 8611317 9240241 9937179 10710808 11573032
10925A1573032R62531J073010J200743J347781J509618J691235J892462K109239
$$ 11573032 12535563 13608573 14809316 16157097 17666715 19357950 21250412 23359651
10917B3359651K335610K568902K793182K989385L126749L175387L103079K878331
$$ 23359651 25695261 28264163 31057345 34046730 37173479 40348866 43451945 46330276
10909D6330276K484281J926191J227358M32129l99956j195718j893756k449003
$$ 46330276 48814557 50740748 51968106 52400235 52000279 50804561 48910805 46461802
10901D6461802k840697l065850l140760l096169k964586k780483k565598k341984
$$ 46461802 43621105 40555255 37414495 34318326 31353740 28573257 26007659 23665675
10893B3665675k122970j912727j718142j543108j380613j234935j105380r90954
$$ 23665675 21542705 19629978 17911836 16368728 14988115 13753180 12647800 11656846
10885A1656846q88401p97597p18047o46463n83788n28962m80696m39527m01896
$$ 11656846 10768445 9970848 9252801 8606338 8022550 7493588 7012892 6573365 6171469
10876F171469l66113l35483l09383k83514k59983k39049k20568k04798j88246
$$ 6171469 5805356 5469873 5160490 4876976 4616993 4377944 4157376 3952578 3764332
10867C764332j75437j65210j57591j49077j43399j38813j32697j27154j23869
$$ 3764332 3588895 3423685 3266094 3117017 2973618 2834805 2702108 2574954 2451085
10858B451085j18592j08723j02824r7971r1226q5129p8650p2790o8037o4398o0710
$$ 2451085 2332493 2223770 2120946 2022975 1931749 1846620 1767970 1695180 1627143 1562745 1502035
10847A502035n6655n4282n2458m8364m5955m3989m1443l7750l6686l5986l2608
$$ 1502035 1445380 1391098 1338640 1290276 1244321 1200332 1158889 1121139 1084453 1048467 1015859
10836A015859l2044l0631k8981k7823k7626k5418k4826k3462k4503k3065k1037
$$ 1015859 983815 953184 924203 896380 868754 843336 818510 795048 770545 747480 726443
10825G26443j9611j8676j8084j7277j7532j6029j3709j2998j1151r977j0088j0078
$$ 726443 706832 688156 670072 652795 635263 619234 605525 592527 581376 571399 561311 551233
10813E51233r696r706r478r936j0151j0354j0887r898r591r829j1231j1905r878
$$ 551233 541537 531831 522353 512417 502266 491912 481025 471127 461536 451707 440476 428571 418693
10800D18693r110r147p837q436q764q898r714j0770r441q188p488o029o858n752
$$ 418693 409583 400436 392599 384163 375399 366501 356787 346017 336576 328388 320900 314871 308013 302261
10786C02261m429n295m906n129m173j618k165k015p3L9k747l095l249k937j959
$$ 302261 297832 292537 287631 282502 278329 276711 274546 272531 272458 272497 269750 266655 263406 260469 258510
10771B58510j386l659n146l240k701l017k342j534k248j729k656k686j130j662
$$ 258510 257124 253465 248319 245079 242378 239361 237019 235485 233237 231508 228852 226166 225036 223374
10757B23374l123j050k062l573j456k782l317l251l481m331n831m587l200l175
$$ 223374 220251 219201 217139 213566 212110 209328 206011 202760 199279 194948 189117 184530 181330 178155
10743A78155k836j418j673j020j333k006l61j565j565j450j759k064j18K26k33
$$ 178155 175319 173901 172228 171208 169875 167869 167508 165943 164378 162928 161169 159105 158987 159213 158980
10728A58980k325k595k902k606j993j420k384j645l546l777l616l222l229k187
$$ 158980 156655 154060 151158 148552 146559 145139 142755 141110 137564 133787 130171 126949 123720 121533
10714A21533j796k531l264k626l622k395j987l011j943p13j731l331k631j725
$$ 121533 119737 117206 113942 111316 107694 105299 103312 100301 98358 97645 95914 92583 89952 88227
10700H8227l034l178k457k488k153k617m059k406k749l241k026k152j093j843
$$ 88227 85193 82015 79558 77070 74917 72300 68241 65835 63086 59845 57819 55667 54574 52731
10686E2731j227j253m86j80p5Q06K204K028J248k99O23k00R82R79M37N34j102
$$ 52731 51504 50251 49765 49585 49510 50316 52520 54548 55796 55497 56120 55920 56902 57881 58318 58852 57750
10669E7750j371o98l15o06L44L43j798k061j180q55O38P17k44j025L6k74j653
$$ 57750 56379 55681 55366 54760 55104 55447 53649 51588 50408 49553 50191 50908 50664 49639 49675 49401 47748
10652D7748j283j297j266k054M63k01j720j675O4N7r89j011j99j539p33J076J208
$$ 47748 46465 45168 43902 41848 42311 42110 40390 38715 38779 38836 37847 36836 36637 35098 34365 35441 36649
10635C6649j055j482n22m6r3O12J357K79J68j41J025J464O75K441Q40L27J500
$$ 36649 35594 34112 33590 33544 33451 34063 35420 35699 35867 35726 36751 38215 38890 41331 42171 42498 43998
10618D3998J817J873r51Q21K981K102P99j067n18l16r07N37J568o18L54l13l55
$$ 43998 45815 47688 46737 47558 50539 52641 53440 52373 51855 51539 50632 51169 52737 52119 52473 52160 51805
10601E1805N59j737k631l55Q72j77M89k989j122k15l766l252j152q90j823j387
$$ 51805 52364 50627 47996 47641 48513 48336 48825 45836 44714 44499 40733 37481 36329 35439 33616 32229
10585C2229k373r17p39J784J331J046J471J648K3O56K901K143M174N654O167N791
$$ 32229 29856 28939 28200 29984 31315 32361 33832 35480 35503 36159 39060 41203 45377 51031 57198 62989
10569F2989L546N14k283l777k891l519m378k936k686k184q16Q6J279L67o49n84
$$ 62989 66535 67049 64766 60989 58098 54579 50201 47265 44579 42395 41579 41665 42944 43311 42662 42078
10553D2078o73j48J001J470O01Q14L96Q23R1Rj75j341k469j279p1N81R89r94r50
$$ 42078 41405 41257 42258 43728 44329 45143 45539 46362 46453 46462 46287 44946 42477 41198 41127 41708 42697 41703 40753
10534D0753P20J231J032l20J0j6n65J13l05o73N31o61M04P61J31L59P06P58J88
$$ 40753 41473 42704 43736 43416 43426 43410 42845 42958 42653 41980 42511 41850 42254 43015 43146 43505 44211 44969 45157
10515D5157J102J747J876O46L37J024J660QJ508J036J366J699K604K460K004J463
$$ 45157 46259 48006 49882 50528 50865 51889 53549 53557 55065 56101 57467 59166 61770 64230 66234 67697
10499F7697J673K993K856L097J599K265K034K393M021L428M379O116O626M919
$$ 67697 69370 72363 75219 78316 79915 82180 84214 86607 90628 94056 98435 104551 111177 116096
10485A16096N196O817P074Q969R806J0384J0803J2345J4391J4364J5289J7503
$$ 116096 121292 128109 135183 144152 153958 164342 175145 187490 201881 216245 231534 249037
10473B49037J7455J8662K1010J8999J6549J4172J1589Q212N574Q245R943N910
$$ 249037 266492 285154 306164 325163 341712 355884 367473 375685 381259 389504 399447 405357
10461D05357p425j6955k7108l5633l3934k9226k1400j6755j3143r812q402p331
$$ 405357 397932 380977 353869 318236 284302 255076 233676 216921 203778 193966 185564 178233
10449A78233o675n232n614n915n052l929n455k694m436m302l600l287l295k962
$$ 178233 171558 166326 160712 154797 149745 145816 140361 137667 133231 128929 125329 122042 118747 115785
10435A15785r32j299j461l095m411m017p41p01k141j261M60O69l83j818k340k007
$$ 115785 114853 113554 112093 108998 104587 100570 99829 99128 96987 95726 96186 96855 96472 94654 92314 90307
10419I0307k152j007p1j45j199j469k560r45j28m07k293j554l98o88j707j147
$$ 90307 88155 87148 87077 86932 85733 84264 81704 80759 80631 80224 77931 76377 75979 75291 73584 72437
10403G2437j216N85N78J80j286j603j258l23n61N20Q24K622O71L6n4L8j325j634
$$ 72437 71221 71806 72384 72564 71278 69675 68417 68094 67533 68053 68877 71499 72170 72206 72152 72190 70865 69231
10385F9231j796l310l146k357n60K5j568r5p80r18Q35J120j670p31R41J476R45
$$ 69231 67435 64125 60979 58622 58062 58087 56519 56424 55644 54726 55561 56681 55011 54280 55221 56697 57642
10368E7642P83J568P79J423O70j57j203j509q59j142k328k160l200j351l5n76
$$ 57642 58425 59993 60772 62195 62865 62708 61505 59996 59137 57995 55667 53507 50307 48956 48921 48345
10352D8345L60j64J663J233K579K955J293O59l89l198m703j931k344m176j924
$$ 48345 48705 48541 50204 51437 54016 56971 58264 58923 58534 55336 50633 48702 46358 42182 40258
10337D0258l5q29J128L690N058P057P665P973Q583P053N521L149Q29k655n512
$$ 40258 40223 39394 40522 44212 49270 56327 63992 71965 80548 87601 93122 96271 97100 94445 88933
10322H8933q671r671r774r516r178o879m881l226k453p94m75r71j710k621q25
$$ 88933 80262 70591 60817 51301 42123 35244 30363 27137 24684 23890 23415 22444 20734 18113 17288
10307A7288J483k57k7J18K4r2l53Q78K92m28p40m33j204n98J254j641j554J070
$$ 17288 18771 18514 18487 18605 18629 18537 18184 19062 19354 18926 18186 17753 16549 15951 17205 15564 14010 15080
10289A5080J057J452k11p70l063O31J61j230k235q18J050J330P84N00j049J00
$$ 15080 16137 17589 17378 16608 13545 14176 14337 13107 10872 10054 11104 12434 13218 13718 12669 12769
10273A2769K54k64r82k18J602J871O67L54m58q03q85j53O50O11l75M60J546J149
$$ 12769 13023 12759 11777 11559 13161 15032 15699 16053 15595 14792 13907 13754 14404 15015 14640 15100 16646 17795
10255A7795K367L09J113Q49N14O00q04j405n29j820j900k527k519j316q47k00
$$ 17795 20162 20471 21584 22433 22947 23547 22743 21338 20809 18989 17089 14562 12043 10727 9880 9680
10239I680P68n37K5M6j126r11J85j172q15R0j44N32J46p86k21K48J57J161J727
$$ 9680 10448 9911 9936 9982 8856 7945 8130 6958 6143 6233 6089 6621 6767 5981 5760 6008 6165 7326 9053
10220I053K704L004K301K017J55K84Q08J425o59j255j975j684k773k084r99k97
$$ 9053 11757 14761 17062 19079 19234 19518 20326 21751 21092 19837 17862 16178 13405 11321 10322 10025
10204A0025j72j653j59o05j448J889P26J408P46l38Q81P80j130M0k69j06M85J254
$$ 10025 9853 8200 8041 7436 5988 7877 8603 10011 10757 10419 11300 12080 10950 10990 10721 10615 11100 12354
10186A2354J052R53R66K579K906L395M493M476M243K049K001L37k122k493k012
$$ 12354 13406 14359 15325 17904 20810 24205 28698 33174 37417 39466 41467 41804 39682 37189 35177
10171C5177l914l498k446l088l776l097l06l78J138L032L286M465N405O264P172
$$ 35177 31263 27765 25319 22231 18455 15358 15052 14674 15812 18844 22130 26595 32000 38264 45436
10156D5436Q750N899M959L795Q0k684l488o319n821o736n157n643n407l825k598
$$ 45436 54186 60085 65044 68839 68919 66235 62747 56428 50607 43871 38714 33071 27664 23839 21241
10141B1241j400k822j825k070m087j662n02J069J445N70Q40P90P70N52J419P04
$$ 21241 19841 17019 15194 13124 9037 7375 6873 7942 9387 9957 10797 11587 12357 12909 14328 15032
10125A5032j336J25m18k192j020n05o81k34J27r42m47j79j059j744p71n41O63
$$ 15032 13696 13821 13403 11211 10191 9686 9005 8771 8898 7956 7509 7330 6271 4527 3756 3215 3878
10108C878l51o40P5J547J568L65R85Q42o16l77L82J40P46l83l75j26j014r11j370
$$ 3878 3527 2887 2962 4509 6077 6442 7427 8269 7653 7276 7658 7798 8544 8161 7786 7660 6646 5735 4365
10089D365l00Pr22k33K55m00j708m35O4M00R16n00j546J69l2j242n85q0J693L28
$$ 4365 4065 4072 3150 2917 3172 2772 1064 629 693 1093 2009 1509 -37 132 100 -1142 -1727 -1807 -114 214
10069B14p80k7j18J395J18j307p22N95Q23O3m17K27M19N41l06o92m0R09J090k82
$$ 214 -566 -593 -711 684 802 -505 -1227 -632 191 254 -163 64 483 1024 718 26 -14 895 1985 1703
10049A703O61k38Q61O40K08O2J427J327J527N46r44o11O39Q14J201L52k45N97
$$ 1703 2364 2126 2987 3627 3835 3897 5324 6651 8178 8724 7780 7169 7808 8622 9823 10175 9930 10527
10031A0527L54Q23r82k425k803q52j253m33M49J213Q30O12r87j89K868K218J711
$$ 10527 10881 11704 10722 8297 5494 4642 3389 2956 3405 4618 5448 6060 5073 4884 7752 9970 11681
10014A1681P33K384R63K414M373L814K223M76j947m521m098n531m552j359n19
$$ 11681 12414 14798 15761 18175 22548 26362 28585 29061 27114 22593 18495 12964 8412 7053 6534
9999F534k19J358l16p86l46j242Q3J478J15o26p26p11J005K448L041L754L870
$$ 6534 6315 7673 7357 6571 6225 4983 5066 6544 6659 6033 5307 4596 5601 8049 11090 14844 18714
9982A8714L709L495O01k765m593m174m233k300k291k069j006q58r60R08N53o54
$$ 18714 22423 25918 26519 23754 19161 14987 10754 8454 6163 4094 3088 2230 1270 2178 2731 2077
9966B077j299j5Q70L55m9k94R20J152M56O29Q65J50p9L56m62q95K085K039K419
$$ 2077 778 763 1633 1988 1939 1645 2565 3717 4173 4802 5667 5817 5738 6094 5632 4737 6822 8861 11280
9947A1280M335N308L286J088r46m013l626l081k010k370j682j430r3L27K165J288
$$ 11280 15615 20923 24209 25297 24351 20338 16712 13631 11621 9251 7569 6139 6046 6373 8538 9826
9931I826j015j785Qo48K23K43j094r71j175p47m34J32r05K74q63j7M60l63m3j414
$$ 9826 8811 7026 7034 6386 6609 6852 5758 4787 3612 2865 2431 2563 1658 1932 1069 1052 1512 1149 1106 -308
9911c08nN33J44R70K157K780J210P18L52L67j096j658j413l47m9j284j298J231
$$ -308 -313 220 364 1334 3491 6271 7481 8199 8551 8918 7822 6164 4751 4404 4355 3071 1773 3004
9893C004o18j418k46r03Q47K228K52l45o46j013o79j191p91M85r75k105O42K311
$$ 3004 2386 968 722 -181 666 2894 3146 2801 2155 1142 463 -728 -1519 -1034 -2009 -4114 -3472 -1161
9875a161J016l71q66N67R30K120K969K152L852L302K498R71j896j986l152l441
$$ -1161 -145 -516 -1382 -815 115 2235 5204 7356 11208 14510 17008 17979 16083 14097 10945 7504
9859G504j988K93J67q71J51k040k207j176j123m62P02Q67Q25j23j162m86J002
$$ 7504 5516 5809 5976 5105 5256 3216 1009 -167 -1290 -1752 -1050 -183 642 519 -643 -1129 -127
9842a27K08L92p39o56N35J202L15l15O04K183K118J290J393P91R77M200M463J914
$$ -127 81 473 -266 -922 -387 815 1130 815 1419 3602 5720 7010 8403 9194 10171 14371 18834 20748
9824B0748l05k721m225m554m679k858r49r54K82J751j23j078O87K359J132M78
$$ 20748 20443 17722 13497 8943 4264 1406 457 -497 -215 1536 1413 335 1022 3381 4513 4991
9808D991o52r01Q5o0j954j459j378m28m67J00R95N34K69J223o86M85J613r5j270
$$ 4991 4339 3438 3523 3463 1509 50 -1328 -1756 -2223 -2123 -1128 -594 -325 898 212 697 2310 2215 945
9789I45l44p1J7P1p51m45L30N5j645J195J221l08k67Q73r6j277r59j74N25Q3k08
$$ 945 601 530 547 618 -133 -578 -248 -193 -1838 -643 578 270 3 876 780 -497 -1456 -1630 -1105 -1022 -1230
9768a230p38j273p65M88N53j78Q12P71L01L85p51L9J081K28q07M3l76n25o1n36
$$ -1230 -1968 -3241 -4006 -3518 -2965 -3143 -2331 -1560 -1259 -874 -1625 -1586 -505 -277 -1084 -1041 -1417 -1942 -2003 -2539
9748b539n72N39J607J77K44O48j017P19j14J193J380K68J691J699M367M134K593
$$ -2539 -3111 -2572 -965 -788 -544 104 -913 -194 -308 885 2265 2533 4224 5923 10290 14424 17017
9731A7017K150j417k612l870k759r48j027J95M5l67q8j39p06j747O52O33l78p70
$$ 17017 19167 17750 15138 11268 8509 7561 6534 6729 6774 6407 6319 6180 5474 3727 4379 5012 4634 3864
9713C864Q02Q0q49j588j354N88J068P90J563L189O509R551R855R169P310K760
$$ 3864 4666 4746 3897 2309 955 1543 2611 3401 4964 8153 14662 24213 34068 43237 50547 53307
9697E3307k503n195n316l262K306M362M864M129Q27m784q553j0511j0268o766
$$ 53307 50804 45609 40293 37031 39337 43699 48563 52692 53519 48735 40182 29671 19403 12637
9683A2637l516j802k330k088l1j25j272j243K43R27k24K24j454J419K619K010
$$ 12637 9121 7319 4989 2901 2870 2745 1473 230 473 1400 1176 1400 -54 1365 3984 5994
9667E994K845K400M53O50k47p53j191m74l69K77j233j518m66o40q20q74k043j351
$$ 5994 8839 11239 11692 12342 12095 11342 10151 9677 9308 9585 8352 6834 6368 5728 4908 4034 1991 640
9649F40j290j29P41K07k46J160N08j139j039j231L7M5J672k2l05Q87L45Q93j37
$$ 640 -650 -779 -38 169 -77 1083 1591 452 -587 -1818 -1781 -1736 -64 -86 -391 496 841 1734 1597
9630A597m90j60J08j240j361q12J378J728J218R45K946O269Q378Q646P250J846
$$ 1597 1107 947 1055 -185 -1546 -2358 -980 748 1966 2911 5857 12126 20504 29150 36400 38246
9614C8246j665n595q896q138m405k694n7O44k99j56r5p41j834k557j373r19K65
$$ 38246 36581 30986 22090 13952 9547 6853 6796 7440 7141 6985 6890 6149 4315 1758 385 -534 -269
9597b69n26j290J9J403K75J30o30q6K9j015j148p30K51j90J155j31p19j244k06
$$ -269 -795 -2085 -2066 -663 -388 -258 -888 -974 -945 -1960 -3108 -3838 -3587 -3777 -2622 -2753 -3472 -4716 -4922
9578d922o0N27R88J436j93k53j9o85o26L32J044J650p20j892j465N49J641M40
$$ -4922 -4982 -4455 -3467 -2031 -2224 -2477 -2496 -3181 -3807 -3475 -2431 -781 -1501 -3393 -4858 -4309 -2668 -2228
9560b228j32m10L58O20j546r0N55o42o12O05R97j94j82l92K91P06q94l53K71k49
$$ -2228 -2360 -2770 -2412 -1792 -3338 -3428 -2873 -3515 -4127 -3522 -2525 -2719 -2901 -3293 -3002 -2296 -3190 -3543 -3272 -3521
9540c521L78r20M93p33K29r5J105J09r22o08m15L5p49N02J267K90l93L05J365
$$ -3521 -3143 -4063 -3570 -4303 -4074 -4169 -3064 -2955 -3877 -4485 -4900 -4865 -5614 -5112 -3845 -3555 -3948 -3643 -2278
9521b278J117j337p97M13K217J966j305p73j216r74O43M0L04J029m74k04R05O3
$$ -2278 -1161 -2498 -3295 -2882 -665 1301 -4 -777 -1993 -2967 -2324 -2284 -1980 -951 -1425 -1629 -724 -661
9503f61J018n34r55n44k10k61k09N51J343k24J78o72J8O29O45L11J240J660r50
$$ -661 357 -177 -1132 -1676 -1886 -2147 -2356 -1805 -462 -686 -508 -1180 -1162 -533 112 423 1663 3323 2373
9484B373o42K152K78J429L338L686M732N151Q855Q476N762M760R86r83l480n982
$$ 2373 1731 3883 4161 5590 8928 12614 17346 22497 31352 39828 45590 50350 51336 50353 46873 40891
9468D0891p913p433p364n661m817l767j803m76j168p92q67K5J396K95O80J341
$$ 40891 32978 25545 18181 12520 7703 3936 2133 1657 489 -303 -1170 -1145 251 546 1226 2567
9452B567N13r42j064j183J056K598K342K28j846m68j099j471j684M59j091J058
$$ 2567 3080 2138 1074 -109 947 3545 5887 6115 4269 3801 2702 1231 -453 6 -1085 -27
9436b7L019K050R83j497j155j756j763K50l94J76M33P84j524K77J53m61n17j263
$$ -27 2992 5042 6025 4528 3373 1617 -146 104 -290 -114 319 1103 -421 -144 9 -452 -969 -2232
9418b232N11K297R2Q22R8k28k1l46R1R05l54R6k19J359Q97J518K703J821Q60k05
$$ -2232 -1721 576 668 1490 1588 1360 1339 993 1084 1989 1635 1731 1512 2871 3768 5286 7989 9810 10670 10465
9398A0465o50k71N84Q79K550k61M41M1r60j535P3p48k671l829k941j50n45R73
$$ 10465 9815 9544 10128 11007 13557 13296 13737 13778 12818 11283 11356 10608 7937 4108 1167 1017 472 1445
9380A445j39q14k18r25P04J911Q43o92j156q62K03j51M57J205Nj235O47L45N09
$$ 1445 1306 492 274 -651 53 1964 2807 2115 959 97 300 149 606 1811 1816 581 1228 1573 2082
9361B082K080J256q16j32K70M00J017P06o40o34J07n52J28K072J056p58n91J67
$$ 2082 4162 5418 4602 4470 4740 5140 6157 6863 6223 5589 5696 5144 5272 7344 8400 7642 7051 7218
9343G218L15k5K49R45J050k04J99L21k35j841l052k627J267N68P03N88m19Nl94
$$ 7218 7533 7508 7757 8702 9752 9548 9747 10068 9833 7992 4940 2313 3580 4148 4851 5439 5020 5025 4631
9324D631p6j046j118J66q03j675p38o50k13J180J795N72j404j950k24J349Q89
$$ 4631 4555 3509 2391 2557 1754 79 -659 -1309 -1522 -342 1453 2025 621 -1329 -1553 -204 685
9307F85k93j786P54k65L34J226J616Q10N76j054k262r66M57J96K08Q38N41k80
$$ 685 392 -1394 -640 -905 -571 655 2271 3081 3657 2603 341 -625 -168 28 236 1074 1615 1335
9289A335j063P42O35M84o28l47M72l82p05j326k76O34J008p55L96J729L16P8O59
$$ 1335 272 1014 1649 2133 1505 1158 1630 1248 543 -783 -1059 -425 583 -172 224 1953 2269 2347 3006
9270C006L92j937j549j188o47J68J66k06q62J23J388p1n03Q03L25J43N2j944j465
$$ 3006 3398 1461 -88 -1276 -1923 -1755 -1589 -1795 -2657 -2534 -1146 -1217 -1720 -917 -592 -449 -397 -2341 -3806
9251c806R4L98p97r5m09P50M60J109Q36M63L86j109J345J396J005j312l84O85
$$ -3806 -3712 -3314 -4111 -4206 -4615 -3865 -3405 -2296 -1460 -997 -611 -1720 -375 1021 2026 714 330 1015
9233A015J192k8p66P63M68m91p63n64j943Q20J85q44o5k32J61m73L07P17J34k0
$$ 1015 2207 2179 1413 2176 2644 2153 1390 826 -1117 -297 -112 -956 -1021 -1253 -1092 -1565 -1258 -541 -407 -427
9213d27P5j019k530j440M76J354J011R48J710P4j265K25J42j242N30j329p56K78
$$ -427 -352 -1371 -3901 -5341 -4865 -3511 -2500 -1552 158 232 -1033 -808 -666 -1908 -1378 -2707 -3463 -3185
9195c185K45k59p9J061J039l54J133p4o0k43m66K91K35l19j58r11j200K25q04
$$ -3185 -2940 -3199 -3278 -2217 -1178 -1532 -399 -473 -533 -776 -1242 -951 -716 -1035 -1193 -2104 -3304 -3079 -3883
9176c883J36J64j67j030Q74J771q14k055j823J015J367P60K82L62O98J192n01
$$ -3883 -3747 -3583 -3750 -4780 -3906 -2135 -2949 -5004 -6827 -5812 -4445 -3685 -3403 -3041 -2343 -1151 -1652
9159a652jq45p09j26j54Q2N25j202m57K93P25Q80p76j327J90L24K76o78n21n00
$$ -1652 -1653 -2498 -3207 -3333 -3487 -3405 -2880 -4082 -4539 -4246 -3521 -2641 -3417 -4744 -4554 -4230 -3954 -4632 -5153 -5653
9139e653K13J176j135m35R19J034O50J021J969J493p25j197l19r57j82j468q69
$$ -5653 -5440 -4264 -5399 -5834 -4915 -3881 -3231 -2210 -241 1252 527 -670 -989 -1946 -2128 -3596 -4465
9122d465Q98M86n03p43m08q1k34R00J011J388j145j407r35O19Q60J720J019K43
$$ -4465 -3567 -3081 -3584 -4327 -4735 -4816 -5050 -4150 -3139 -1751 -2896 -4303 -5238 -4619 -3759 -2039 -1020 -777
9104g77N55j012j703q19J13k29J49K039O80o02k072j336j095M46J438P48M6Pn8
$$ -777 -222 -1234 -2937 -3756 -3643 -3872 -3723 -1684 -1004 -1606 -3678 -5014 -6109 -5663 -4225 -3477 -3431 -3424 -3482
9085c482P46j47J88o21J149O52j718j553K57M89M40J691P59N09j569N17qq82q78
$$ -3482 -2736 -2883 -2695 -3316 -2167 -1515 -3233 -4786 -4529 -4040 -3600 -1909 -1150 -641 -2210 -1693 -1701 -2583 -3461
9066c461k49p32l81j85p62L07J058l3K38N55O55L86q09p41J219J288l69l86m01
$$ -3461 -3710 -4442 -4823 -5008 -5770 -5463 -4405 -4438 -4200 -3645 -2990 -2604 -3413 -4154 -2935 -1647 -2016 -2402 -2803
9047b803O0k26o71k21J030K033P04j507r93k92k36Q61J56N45O55L68n54j628O44
$$ -2803 -2743 -2969 -3640 -3861 -2831 -798 -94 -1601 -2594 -2886 -3122 -2261 -2105 -1560 -905 -537 -1091 -2719 -2075
9028b075q70L10L13q31j59j88o43R50M44P43P62P87P69p34j572j087J47N02n28
$$ -2075 -2945 -2635 -2322 -3153 -3312 -3500 -4143 -3193 -2749 -2006 -1244 -457 312 -422 -1994 -3081 -2934 -2432 -2960
9009b960K12J58Q00k88k50j067o54J792J877j31O61K36k140j695K85M32p11K20
$$ -2960 -2748 -2590 -1790 -2078 -2328 -3395 -4049 -2257 -380 -511 150 386 -1754 -3449 -3164 -2732 -3443 -3223
8991c223K06J6N08q22P7K29n1qn89Q31R20l17l77Q4J41J04p50P9J32j26K11j135
$$ -3223 -3017 -3001 -2493 -3315 -3238 -3009 -3060 -3068 -3657 -2826 -1906 -2223 -2600 -2516 -2375 -2271 -3021 -2942 -2810 -2936 -2725 -3860
8969c860J08J52N58J61q25O96q5Q79J45k85O52p16k057L36R40J071J81o76N02
$$ -3860 -3752 -3600 -3042 -2881 -3706 -3010 -3095 -2216 -2071 -2356 -1704 -2420 -4477 -4141 -3201 -2130 -1949 -2625 -2123
8950b123N48M38j76j689NL17O37J360J93m11q40j198L54K42M63j401J08N06r19
$$ -2123 -1575 -1137 -1313 -3002 -2997 -2680 -2043 -683 -490 -901 -1741 -2939 -2585 -2343 -1880 -3281 -3173 -2667 -3586
8931c586Q56N32j017j69j236j258Q85K185J100L57j291j868k42J69n05Q11p96
$$ -3586 -2730 -2198 -3215 -3384 -4620 -5878 -4993 -2808 -1708 -1351 -2642 -4510 -4752 -4583 -5088 -4277 -5073
8914e073N65J471J90J58L05r39q45p29rJ467j25L13J414Q15P07K07j176p38m00
$$ -5073 -4508 -3037 -2847 -2689 -2384 -3323 -4168 -4897 -4906 -3439 -3564 -3251 -1837 -1022 -315 -108 -1284 -2022 -2422
8895b422Q33j365R40N81k29J49M39l21o06j156j056M5k90l24m08O26R78P02m5
$$ -2422 -1589 -2954 -2014 -1433 -1662 -1513 -1074 -1395 -2001 -3157 -4213 -4168 -4458 -4782 -5190 -4564 -3586 -2884 -2929
8876b929k31M21O25m3r03P80J123p89p41p8j1J991J328Q88j548p04j355q66m8
$$ -2929 -3160 -2739 -2114 -2157 -3060 -2280 -1157 -1946 -2687 -2765 -2776 -785 543 1431 -117 -821 -2176 -3042 -3090
8857c090o31m23l46Q78N22o6J741j09j41o65J05O68J567P08p48j717n61p56Q30
$$ -3090 -3721 -4144 -4490 -3612 -3090 -3156 -1415 -1524 -1665 -2330 -2225 -1557 10 718 -30 -1747 -2308 -3064 -2234
8838b234N8k56K71P71k35m22k06j24P86L40m93N9K26J62L1J2j72J33q2M59K30
$$ -2234 -2176 -2432 -2161 -1390 -1625 -2047 -2253 -2377 -1591 -1251 -1744 -1685 -1459 -1297 -1266 -1254 -1426 -1293 -1375 -916 -686
8817f86J05J239k89j840m56o39j468RO48M34o72Q06Q50P03R83j086J68P66j9r
$$ -686 -581 658 369 -1471 -1927 -2566 -4034 -4025 -3377 -2943 -3615 -2809 -1959 -1256 -273 -1359 -1191 -425 -444 -453
8797d53l02J00j010n84J186J218j491M69j165o67j175l23O49o09l73n40p82J5
$$ -453 -755 -655 -1665 -2249 -1063 155 -1336 -867 -2032 -2699 -3874 -4197 -3548 -4157 -4530 -5070 -5852 -5837
8779e837J962j4K98Q52R49R85Kk65n14k88Q42p14p8M5j538P59o2j78K64l57K76
$$ -5837 -3875 -3889 -3591 -2739 -1790 -805 -803 -1068 -1582 -1870 -1028 -1742 -1820 -1775 -3313 -2554 -2616 -2794 -2530 -2887 -2611
8758b611O56M74J164k74k64N35j256M42n42p28m59J06Q06J389J5l22j440l79P72
$$ -2611 -1955 -1481 -317 -591 -855 -320 -1576 -1134 -1676 -2404 -2863 -2757 -1951 -562 -547 -869 -2309 -2688 -1916
8739a916J386m85r74j096r5J169R63O8q61j99p27n80K3m0K84R37M44P90N18j88
$$ -1916 -530 -1015 -1989 -3085 -3180 -2011 -1048 -980 -1841 -2040 -2767 -3347 -3324 -3364 -3080 -2143 -1699 -909 -391 -579
8719e79k08p34j80M80l1M02O64j12l39O20n12l8N50L42m03q8L16n40j227N79M47
$$ -579 -787 -1521 -1701 -1221 -1252 -850 -186 -298 -637 -17 -529 -567 -17 325 -78 -166 150 -390 -1617 -1038 -591
8698e91j62J05m94J85J28M96K180j09n79k68P7N03M16J216K325J858K455L949
$$ -591 -753 -648 -1142 -957 -829 -333 1847 1738 1159 891 968 1471 1887 3103 5428 7286 9741 13690
8680A3690L693M187M778J506n32m453l737m159k383k817l869j964r60L01p57k56
$$ 13690 17383 21570 26348 27854 27322 22869 19132 14973 12590 9773 5904 3940 2980 3281 2524 2268
8664B268L03K93q35p04j078j65J23O20r54j13P30NR14o32o68q65N69R53m96p84
$$ 2268 2571 2864 2029 1325 247 82 205 825 -129 -242 488 493 1407 775 107 -758 -189 764 268 -516
8644e16p41j94J24O80R4J793J572J656K281L449L608P070Q961N118J536l205o850
$$ -516 -1257 -1451 -1327 -647 -553 1240 2812 4468 6749 10198 13806 20876 29837 34955 36491 33286 26436
8627B6436p866o249k226q07j464k169o64k440j025J895K478M05j185l97l64J137
$$ 26436 18570 12321 10095 9288 7824 5655 4991 2551 1526 3421 5899 6304 5119 4722 4358 5495
8611E495R07M2J356J937K099R82r45k194j956k991j996k07M2l70l23j397m7J771
$$ 5495 6402 6444 7800 9737 11836 12818 11873 9679 7723 4732 2736 2529 2571 2201 1878 481 434 2205
8593B205J703R76J46QM42J88R01K038L171K701M038N710Q407J2792J4364J4804
$$ 2205 3908 4884 5030 5038 5480 5668 6569 8607 11778 14479 18517 24227 32634 45426 59790 74594
8577G4594Q646j417q367j3184j4950j2858p844n820l461j753j331o16n93n29M0
$$ 74594 83240 81823 73456 60272 45322 32464 24620 18800 15339 13586 12255 11639 11046 10517 10557
8562A0557p50j681r96j471r35r90j017l31Q57J860m35k19o4k342j262j673p35
$$ 10557 9807 8126 7130 5659 4724 3734 2717 2386 3243 5103 4668 4449 4385 2043 781 -892 -1627
8545a627J142r1m51K24O38o64j173k32O16o1K47P53O33J20R66o80j834j372m07
$$ -1627 -485 -576 -1027 -803 -165 -829 -2002 -2234 -1618 -1679 -1432 -679 -46 74 1040 360 -1474 -2846 -3253
8526c253m38M78O41J820J291J289R47m25o76m46M66m64j35J226k73j052q19m97
$$ -3253 -3691 -3213 -2572 -752 539 1828 2775 2350 1674 1228 1694 1230 1095 2321 2048 996 177 -320
8508c20O04J186k1L36M75j10p45p83p63r40o65Q24J859L43j7l38J7R35P63j90
$$ -320 284 1470 1449 1785 2260 2150 1405 622 -141 -1081 -1746 -922 937 1280 1263 925 942 1877 2640 2450
8488B450j483q30N90L08K39M87j32p80n29J166M9R29M4k01j04r36r41j057J231
$$ 2450 967 137 727 1035 1274 1761 1629 849 320 1486 1535 2464 2508 2307 2203 1267 326 -731 500
8469E00J412Q56j551r82J271J271o59k94J4M84n52j269J08P8n22m57Q43m4o90
$$ 500 1912 2768 1217 235 1506 2777 2118 1824 1838 2322 1770 501 609 687 165 -292 551 507 -183
8450a83R08M38j857Q38J426O99n09k33q11R88J50J103j01L49p07m21k71L0R23
$$ -183 725 1163 -694 144 1570 2269 1760 1527 716 1704 1854 2957 2856 3205 2498 2077 1806 1836 2759
8431B759j48O37L76K56m55O17N41j76m58J54J09M26N4m94j85N92q97p22j668P61
$$ 2759 2611 3248 3624 3880 3425 4042 4583 4407 3949 4103 4212 4638 4692 4198 4013 4605 3708 2986 1318 2079
8411B079K258L31M2j173j274J157M8P13M83M27J38J593P11N52o72n20R9l70j104
$$ 2079 4337 4668 4710 3537 2263 3420 3468 4181 4664 5091 5229 6822 7533 8085 7413 6893 6992 6622 5518
8392E518l98K13N30J306M46p1l91J173J82m38j374j139Q77J910m57m17n89k18
$$ 5518 5120 5333 5863 7169 7615 7544 7153 8326 8508 8070 6696 5557 6434 8344 7887 7470 6881 6663
8374F663R64q25j826Q92Q83J958K254J792j5p91J412N29q99J3Q97M4p51J328M22
$$ 6663 7627 6802 4976 5868 6751 8709 10963 12755 12740 11949 13361 13890 12991 13004 13901 13945 13194 14522 14944
8355A4944J29J140l5L02L06Q71N38J286L276K969J466N99J292J814M347M314L166
$$ 14944 15073 16213 16178 16480 16786 17657 18195 19481 22757 25726 27192 27791 29083 30897 35244 39558 42724
8338D2724L697M350N902O137O117M611M344K392k093o968q723q570q415n972l483
$$ 42724 46421 50771 56673 62810 68927 73538 77882 80274 78181 71213 62490 53920 45505 39533 36050
8323C6050l756k951j839j450j398l23Q95o5k965l258l891j755q19j062k560p59
$$ 36050 32294 29343 27504 26054 24656 24333 25228 25163 22198 18940 15049 13294 12475 11413 8853 8094
8307H094l85R40J255j84M00J060l7j600m51r62n96l55j025J450J702L27J874J888
$$ 8094 7709 8649 9904 9720 10120 11180 11143 9543 9092 8130 7534 7179 6154 7604 9306 9633 11507 13395
8289A3395J561J765O07J403N78j078j675j304p24n33k519j664l22J044J534K507
$$ 13395 14956 16721 17328 18731 19309 18231 16556 15252 14528 13995 11476 9812 9490 10534 12068 14575
8273A4575K804K898M285L743K226L11M09r84m716m472l261j943q92j760j707q41
$$ 14575 17379 20277 24562 28305 30531 30842 31251 30267 25551 21079 17818 15875 14983 13223 11516 10675
8257A0675j323j234J046L91Q17J422J478L357J021r4K63o55j403k325j670j803
$$ 10675 9352 8118 9164 9555 10372 11794 13272 16629 17650 17556 17819 17164 15761 13436 11766 9963
8241I963k950k231n48J137O18l09L06Q64J764N0K90M49R59J555J687L554M108
$$ 9963 7013 4782 4234 5371 5989 5680 5986 6850 8614 8664 8954 9403 10362 11917 13604 17158 21266
8224B1266K877j057k589k497k599k509k416k105j490m56o15m25n11n01N64q62
$$ 21266 24143 23086 20497 18000 15401 12892 10476 8371 6881 6425 5810 5385 4874 4373 4937 4075
8208D075j314P33M35Q37L9n90r3K90r24k8N75J2k88R48J789L980L025K814J922
$$ 4075 2761 3494 3929 4766 4805 4215 4122 4412 3488 3460 4035 4047 3759 4707 6496 10476 13501 16315 18237
8189A8237K388K168J612l80j345k708m115l101k684j517q80j56N71j467r19q60
$$ 18237 20625 22793 24405 24025 22680 19972 15857 12756 10072 8555 7675 7519 8090 6623 5704 4844
8173D844L66q44j159J56o68K12J73J163K03q57P92j420m53k06J56k45l31O31L64
$$ 4844 5210 4366 3207 3363 2695 2907 3080 4243 4446 3589 4381 2961 2508 2302 2458 2213 1882 2513 2877
8154B877p46j058J391N50m65Q24J088O05J48J150J62L88K151N68r1J005P88j28
$$ 2877 2131 1073 2464 3014 2549 3373 4461 5066 5214 6364 6526 6914 9065 9633 9542 10547 11335 11207
8136A1207q15j052m98j475j6j626j160l04j232j236R2l39k30P78K013P11j489
$$ 11207 10392 9340 8842 7367 7351 5725 4565 4261 3029 1793 1885 1546 1316 2094 4107 4818 3329
8119C329j05J238j85K85j224J40o83l18j95N06j23N42L71m29J513J228P81O40
$$ 3329 3224 4462 4277 4562 3338 3478 2795 2477 2282 2788 2665 3207 3578 3149 4662 5890 6671 7311
8101G311P02J060R26J97Q36j411k483o69J85l79P1j078j000j36J8j108n86k88
$$ 7311 8013 9073 9999 10196 11032 9621 7138 6469 6654 6275 6346 5268 4268 4132 4150 3042 2456 2168
8083B168j709p75j336k08K058K524P40k55j95L05N06P80Q38j84j27N90Q3r96J21
$$ 2168 459 -316 -1652 -1860 198 2722 3462 3207 3012 3317 3823 4603 5441 5257 5130 5720 5803 4807 4928
8064D928m83n46N57J62Q96j58K62O59j438o47M85k58Q56j16Q75L13r77j025j043
$$ 4928 4445 3899 4456 4618 5514 5356 5618 6277 4839 4192 4677 4419 5275 5159 6034 6347 5370 4345 3302
8045C302K84r1r00J82J394O53M44K49k583p96J791N86M61j091K82J366m06l38
$$ 3302 3586 3495 2595 2777 4171 4824 5268 5517 2934 2138 3929 4515 4976 3885 4167 5533 5127 4789
8027D789P66O23L0n43J415J860L02j230p94P35Q32j21m41N00N79k29j239j355
$$ 4789 5555 6178 6208 5665 7080 8940 9242 8012 7218 7953 8785 8664 8223 8723 9302 9073 7834 6479
8009F479N6O31m87J98Q0j172l96r69j32J672K053K750K406J371N87M18j11j823
$$ 6479 6535 7166 6679 6877 6957 5785 5389 4420 4288 5960 8013 10763 13169 14540 15127 15545 15434 13611
7991A3611n91K66j055k259N78r36l06p45q27J16M80J492K020J298m14j466j061
$$ 13611 13020 13286 12231 9972 10550 9614 9308 8563 7736 7852 8332 9824 11844 13142 12728 11262 10201
7974A0201j100M18R61r42p72j008j72O56J210j232m70O48L90j02O96R54j090P47
$$ 10201 9101 9519 10480 9538 8766 7758 7586 8242 9452 8220 7750 8398 8788 8686 9382 10336 9246 9993
7956I993J767L076L087L454L460M172L334J583j623m572m671m320j777o20k504
$$ 9993 11760 14836 17923 21377 24837 29009 32343 33926 32303 27731 23060 18740 16963 16343 13839
7941A3839j613j807j18k64q21j032Q78J490n99k94p59l59J3k87o57j318l85L40
$$ 13839 12226 10419 10301 10037 9216 8184 9062 10552 9953 9659 8900 8541 8554 8267 7610 6292 5907 6247
7923F247K27J717J385l48p59Q45M42j1k82L01L53j208p05J393J271R61J036J122
$$ 6247 6474 8191 9576 9228 8469 9314 9756 9745 9463 9764 10117 8909 8204 9597 10868 11829 12865 13987
7905A3987P43m33j258m12j978j196p47j368j76k8j403m7J280l71j700o25j543
$$ 13987 14730 14297 13039 12627 10649 9453 8706 7338 7162 7134 5731 5684 6964 6593 4893 4268 2725
7888B725N99J259Q45l88j269K11J086N31K70j72J8Q27J813K16J478L31K051K436
$$ 2725 3324 4583 5428 5040 3771 3982 5068 5599 5869 5697 5715 6542 8355 8571 10049 10380 12431 14867
7870A4867P01J443Q76M36L38M86R21Q32l1j038l02n66k826p85Q13j353l96j75
$$ 14867 15568 17011 17887 18323 18661 19147 20068 20900 20869 19831 19529 18963 16137 15352 16165 14812 14416 14241
7852A4241j039j397R2K49J475l24j170J433R67j166J97N56J521J526O98p41n97
$$ 14241 13202 11805 11897 12146 13621 13297 12127 13560 14527 13361 13558 14114 15635 17161 17859 17118 16521
7835A6521R29J703P40N04L3P16Q32m9o73n03k070k232k806j217o39n45j253l10
$$ 16521 17450 19153 19893 20397 20430 21146 21978 21929 21256 20753 18683 16451 13645 12428 11789 11244 9991 9681
7817I681j176j959L0N75p02j053o93N07l76m33j145q32o65M52O24n03j45R46P34
$$ 9681 8505 6546 6576 7151 6449 5396 4703 5210 4834 4401 3256 2424 1759 2211 2835 2332 2187 3133 3867
7798C867o17m73K57N07P18l47N9j26P58R01J654J604P44k17P8n43o47j157n05
$$ 3867 3250 2777 3034 3541 4259 3912 3971 3845 4603 5504 7158 8762 9506 9289 9367 8824 8177 7020 6515
7779F515J231N37j50J91p58j481j180M55K50j674k04J029j03K27l61j143j68J340
$$ 6515 7746 8283 8133 8324 7566 6085 4905 5360 5610 3936 3732 4761 4658 4885 4524 3381 3213 4553
7761D553j6J47j44K83N97L72N04n04k61P2L64J368P82L93M15J9q04J004P35q07
$$ 4553 4537 4684 4540 4823 5420 5792 6296 5792 5531 5603 5967 7335 8117 8510 8925 8944 8140 9144 9879 9072
7741I072r5K167k50r24R02J938L72r67p9K94j143j183p63j291j174k94l40j96
$$ 9072 8977 11144 10894 9970 10872 12810 13182 12215 12136 12430 11287 10104 9341 8050 6876 6582 6242 6046
7723F046q68r83J6M39m67R28l73P20Q20n12r7j205j34K60R6N71J793n55l67L01
$$ 6046 5178 4195 4211 4650 4183 5111 4738 5458 6278 5766 5669 4464 4330 4590 4686 5257 7050 6495 6128 6429
7703F429q80k66O94P85L2j371n92k22N2J44K73J472J98m88o39j89J86j401Q12
$$ 6429 5549 5283 5977 6762 6794 5423 4831 4609 4661 4805 5078 6550 6748 6260 5621 5432 5618 4217 5029
7684E029M41j650m47M03J243r4q20p45J236p49m23j082j068J51M68j80j89P99
$$ 5029 5470 3820 3373 3776 5019 4925 4105 3360 4596 3847 3424 2342 1274 1425 1893 1713 1524 2323
7666B323R83j166m39R42J652n46p83k08R13j086j731l50O26n1N10R4J134O50q06
$$ 2323 3306 2140 1701 2643 4295 3749 2966 2758 3671 2585 854 504 1130 1079 1589 1683 2817 3467 2661
7647B661k24n24j647K60M25j521j063O71J108j007n05m09n61L94O55R98M43r84
$$ 2661 2437 1913 266 526 951 -570 -1633 -962 146 -861 -1366 -1775 -2336 -1942 -1287 -289 154 -830
7629h30j05n37l42j8J498J396O01l76L9J59J849m5j174k592l4l82j066K84J554
$$ -830 -935 -1472 -1814 -1832 -334 1062 1663 1287 1326 1485 3334 3289 2115 -477 -511 -893 -1959 -1675 -121
7610a21M07l67k27L10P2j339p18k50J011K040L82j680J69J86Q37j97k292k323
$$ -121 286 -81 -308 2 74 -1265 -1983 -2233 -1222 818 1200 -480 -311 -125 712 515 -1777 -4100
7592d100p70J161Q36p3O86J740J148J227l03j607j235K57M15Q1Q9R45K12k45j550
$$ -4100 -4870 -3709 -2873 -2946 -2260 -520 628 1855 1552 -55 -1290 -1033 -618 -537 -448 497 709 464 -1086
7573a086j537K76J054O32J31J06q05o54M01O9Q70L1j41o08P50q10r73L89M13J08
$$ -1086 -2623 -2347 -1293 -661 -530 -424 -1229 -1883 -1482 -1413 -543 -512 -653 -1261 -511 -1321 -2294 -1905 -1492 -1384
7553a384J70M82L06m94R1k98M67j2r11q18O6P43P51K25K01n06j155j183j72J281
$$ -1384 -1214 -732 -426 -920 -829 -1127 -660 -672 -1583 -2401 -2335 -1592 -841 -616 -415 -921 -2076 -3259 -3431 -2150
7533b150J329m3j877j428J355M69P62Q76m04j013p21J54k030j311j54R11J999
$$ -2150 -821 -864 -2741 -4169 -2814 -2345 -1583 -707 -1111 -2124 -2845 -2691 -4721 -6032 -6186 -5275 -3276
7516c276J099J345J64m17k45j304J19J543J117m42k27O20p35p28n36p10O58l71
$$ -3276 -2177 -832 -668 -1085 -1330 -2634 -2515 -972 145 -297 -524 96 -639 -1367 -1903 -2613 -1955 -2326
7498b326J085R07N7j193n97O8P01j4j144o44j67q7J318m87o72R19m24l71J778
$$ -2326 -1241 -334 -277 -1470 -2067 -1999 -1298 -1312 -2456 -3100 -3267 -3354 -2036 -2523 -3195 -2276 -2700 -3071 -1293
7479a293K98k61r20P0n33O24M61L3K59M46j145p45m72o82k30m06L22J482K18o92
$$ -1293 -995 -1256 -2176 -2106 -2639 -2015 -1554 -1521 -1262 -816 -1961 -2706 -3178 -3860 -4090 -4496 -4174 -2692 -2474 -3166
7459c166o51q3J80L3M15J91Q46Q08m7N4L53q33j308P20M56l76k29p53k41R32P97
$$ -3166 -3817 -3900 -3720 -3687 -3272 -3081 -2235 -1427 -1474 -1420 -1067 -1900 -3208 -2488 -2032 -2408 -2637 -3390 -3631 -2699 -1902
7438a902m41J89n33p22k82L01M45R67j39K1q85l33Q75j137j058k87M42J370J486
$$ -1902 -2343 -2154 -2687 -3409 -3691 -3390 -2945 -1978 -2117 -2096 -2981 -3314 -2439 -3576 -4634 -4921 -4479 -3109 -1623
7419a623K77p23p82N53P40k06n50J021N31Q93r88q91n04r38l38N80N93k05j78
$$ -1623 -1346 -2069 -2851 -2298 -1558 -1764 -2314 -1293 -762 131 -857 -1748 -2252 -3190 -3528 -2948 -2355 -2560 -2738
7400b738J129J09o73m29R48J692K09k76r47o47J345Q35J84j465j503m81O54o05
$$ -2738 -1609 -1500 -2173 -2602 -1654 38 247 -29 -976 -1623 -278 557 741 -724 -2227 -2708 -2054 -2659
7382b659o02j3J09k75O26N21L94J013j066k97k22j074j15k19O97J006J134k45
$$ -2659 -3261 -3274 -3165 -3440 -2814 -2293 -1899 -886 -1952 -2249 -2471 -3545 -3660 -3879 -3182 -2176 -1042 -1287
7364a287M4j76j155j77P47R80p1J523l73m16O98l31j334j23J62nm37R47Q85J6
$$ -1287 -1243 -1419 -2574 -2751 -2004 -1024 -1095 428 55 -361 337 6 -1328 -1451 -1289 -1294 -1731 -784 101 117
7344A17j310k88m93J64J28q25n72M55J178J562j688j82o44j318J1l96O18Q81R21
$$ 117 -1193 -1481 -1974 -1810 -1682 -2507 -3079 -2624 -1446 116 -1572 -1754 -2398 -3716 -3705 -4101 -3483 -2602 -1681
7325a681K06o16j762J69J89k18L0l02j387J57j14K089J382P94N2n87n97j8oJ97
$$ -1681 -1475 -2091 -3853 -3684 -3495 -3713 -3683 -3985 -5372 -5215 -5329 -3240 -1858 -1064 -1012 -1599 -2196 -2214 -2220 -2023
7305b023J334M3j460m2O30q12Q23P09l58m65J670j09m86k38o73m78r66n59R68
$$ -2023 -689 -646 -2106 -2148 -1518 -2330 -1507 -798 -1156 -1621 49 -60 -546 -784 -1457 -1935 -2901 -3460 -2492
7286b492n78k36P25J50q68m03P9l2J461O1o34m3R6K9n57j389M6Q65J30m08r88
$$ -2492 -3070 -3306 -2581 -2431 -3299 -3702 -3623 -3655 -2194 -2133 -2767 -2810 -2714 -2685 -3242 -4631 -4585 -3720 -3590 -3998 -4986
7265d986J029P86P4L6L54r7m95n21O32K99K41R7R06o63j637l83j38Q65J206K96
$$ -4986 -3957 -3171 -3097 -3061 -2707 -2804 -3299 -3820 -3188 -2889 -2648 -2551 -1645 -2308 -3945 -4328 -4466 -3601 -2395 -2099
7245b099P50R59k01j357k39J99j183r2K87qM22O80n62l18l67n14o8R06J65m79
$$ -2099 -1349 -390 -591 -1948 -2187 -1988 -3171 -3263 -2976 -2984 -2562 -1882 -2444 -2762 -3129 -3643 -3711 -2805 -2640 -3119
7225c119M9o43j210k69J103J470J353M3j368n47O24o18j211O77R30L48l7n21J129
$$ -3119 -3070 -3713 -4923 -5192 -4089 -2619 -1266 -1223 -2591 -3138 -2514 -3132 -4343 -3666 -2736 -2388 -2425 -2946 -1817
7206a817Q79n84M83m47j282j587m87R99J763p51j000O76J321J189p06m74k68N77
$$ -1817 -938 -1522 -1039 -1486 -2768 -4355 -4842 -3843 -2080 -2831 -3831 -3155 -1834 -645 -1351 -1825 -2093 -1516
7188a516M01J18m14j500J66J151N01q54p74m77P00L46J108N85R08N21p70k900
$$ -1516 -1115 -997 -1411 -2911 -2745 -1594 -1093 -1947 -2721 -3198 -2498 -2152 -1044 -459 449 970 200 -2700
7170b700l23R17j158j821m93M85O15J023L93J081N62k24j233n22n02m08J469K19
$$ -2700 -3023 -2106 -3264 -5085 -5578 -5093 -4478 -3455 -3062 -1981 -1419 -1643 -2876 -3398 -3900 -4308 -2839 -2620
7152b620J02J07k5K55N06K55n25p52n94K97R95L49p94j663k73J036J662M95L96
$$ -2620 -2518 -2411 -2436 -2181 -1675 -1420 -1945 -2697 -3291 -2994 -1999 -1650 -2444 -4107 -4380 -3344 -1682 -1187 -791
7133g91K27P45l85j969q5n58l90M02K96q58J21j54j8p54p88N61Jj77O14r2J310
$$ -791 -564 181 -204 -2173 -2258 -2816 -3206 -2804 -2508 -3366 -3245 -3399 -3417 -4171 -4959 -4398 -4397 -4574 -3960 -4052 -2742
7112b742O06J17M07L48L94L40j946j060j041k32J461J27N75J76q5m44N82o65k6
$$ -2742 -2136 -2019 -1612 -1264 -870 -530 -2476 -3536 -4577 -4809 -3348 -3221 -2646 -2470 -2555 -2999 -2417 -3082 -3108
7093c108J443o69q58J339J33r55p48J185K60j006J80M91p07q68p49M61J447N10
$$ -3108 -1665 -2334 -3192 -1853 -1720 -2675 -3423 -2238 -1978 -2984 -2804 -2313 -3020 -3888 -4637 -4176 -2729 -2219
7075b219O11Q93K81m27r91l25J163l96K88M3j60Q93k20l36R7j216K5Q43l4J169
$$ -2219 -1608 -715 -434 -861 -1852 -2177 -1014 -1410 -1122 -1079 -1239 -346 -566 -902 -805 -2021 -1996 -1153 -1187 -18
7055a8n16j052n62N3m67l20J662l98l89m26n34Q96J006N64j202L58j72k26k65
$$ -18 -534 -1586 -2148 -2095 -2562 -2882 -1220 -1618 -2007 -2433 -2967 -2071 -1065 -501 -1703 -1345 -1517 -1743 -2008
7036b008n79N56o7J46M32L83m95j82J54M87O72N03l51j327M13R23L58l38j069
$$ -2008 -2587 -2031 -2098 -1952 -1520 -1137 -1632 -1814 -1660 -1173 -501 2 -349 -1676 -1263 -340 18 -320 -1389
7017a389j38l84p09q83q7M40K95kJ090m49j074j11L74O65K88q5N11P73L77J106
$$ -1389 -1527 -1911 -2620 -3503 -3590 -3150 -2855 -2857 -1767 -2216 -3290 -3401 -3027 -2362 -2074 -2159 -1648 -875 -498 608
6997F08l55n70N26m97j525N5r45L50O13k16L42k05k4N85p44l5J552J91k21j152
$$ 608 253 -317 209 -288 -1813 -1758 -2703 -2353 -1740 -1956 -1614 -1819 -1843 -1258 -2002 -2037 -485 -294 -515 -1667
6977a667j76o74k26J138J725P80j468m26r5j770q09J606M39m92m35J90J432k03
$$ -1667 -1843 -2517 -2743 -1605 120 900 -568 -994 -1089 -2859 -3668 -2062 -1623 -2115 -2550 -2360 -928 -1131
6959a131o67r56J518K47m37p77L2N45R20K08j02J702m44q50j709r58M28M83P19
$$ -1131 -1798 -2754 -1236 -989 -1426 -2203 -2171 -1626 -706 -498 -600 1102 658 -192 -1901 -2859 -2431 -1948 -1229
6940a229n5L18J50J25n78l15L03P17K03m19N86P59k93j045k84m63L8l54j016M10
$$ -1229 -1284 -966 -816 -691 -1269 -1584 -1281 -564 -361 -780 -194 565 272 -773 -1057 -1520 -1482 -1836 -2852 -2442
6920b442N49j045m80J98l91J410J192j011l15O9m41O41N00J245K07q36P87j024
$$ -2442 -1893 -2938 -3418 -3220 -3611 -2201 -1009 -2020 -2335 -2266 -2707 -2066 -1566 -321 -114 -950 -163 -1187
6902a187k264j373O01P22N05J069J4K96k33n07Q73R33J006n19K4M0J42r42r34
$$ -1187 -3451 -4824 -4223 -3501 -2996 -1927 -1913 -1617 -1850 -2357 -1484 -551 455 -64 -40 0 142 -800 -1734
6883a734j109J00N37J23k69j362r33M2O57L44L55J72p58o54o3j0J155P08l45l39
$$ -1734 -2843 -2743 -2206 -2083 -2352 -3714 -4647 -4605 -3948 -3604 -3249 -3077 -3835 -4489 -4552 -4562 -3407 -2699 -3044 -3383
6863c383P33J427l67J63k14k57j118j86Q32q0J52o11n94N85j58k01l68J140k92
$$ -3383 -2650 -1223 -1590 -1427 -1641 -1898 -3016 -3202 -2370 -2450 -2298 -2909 -3503 -2918 -3076 -3277 -3645 -2505 -2797
6844b797p08q64L44M84N83K00n30j00K61O06m32N41m22j53Q04J686o71k94J671
$$ -2797 -3505 -4369 -4025 -3541 -2958 -2758 -3288 -3388 -3127 -2521 -2953 -2412 -2834 -2987 -2183 -497 -1168 -1462 209
6825B09n11j21p82j078q10l35J544J137M64j207o93K75j79J1N89Q57j085K9j58
$$ 209 -302 -423 -1205 -2283 -3093 -3428 -1884 -747 -283 -1490 -2183 -1908 -2087 -2076 -1487 -630 -1715 -1686 -1844
6806a844o17N17N15J301k25l6n15m77J21j081p87J425J233L78k02l83j106n92
$$ -1844 -2461 -1944 -1429 -128 -353 -389 -904 -1381 -1260 -2341 -3128 -1703 -470 -92 -294 -677 -1783 -2375
6788b375%Q32N9j427Q82N41M41l72j372j247P21J134k09p53k33L4L26M53j12K30
$$ -2375 -2375 -1543 -1484 -2911 -2029 -1488 -1047 -1419 -2791 -4038 -3317 -2183 -2392 -3145 -3378 -3344 -3018 -2565 -2677 -2447
6768b447l35j98N54P68K79j96N54L56q99r19L5O90N73k06k27N92l33J042P0k074
$$ -2447 -2782 -2980 -2426 -1658 -1379 -1575 -1021 -665 -1564 -2483 -2448 -1758 -1185 -1391 -1618 -1026 -1359 -317 -247 -2321
6748b321r49j18j53R36l79o69l83M46J198J213o23K15K42n30P88P4j056K23O87
$$ -2321 -3270 -3388 -3541 -2605 -2984 -3653 -4036 -3590 -2392 -1179 -1802 -1587 -1345 -1875 -1087 -1013 -2069 -1846 -1159
6729a159k75R3K9P42L58j668L55k20K89L05l3N71k83j006p72J49J088K22k73p04
$$ -1159 -1434 -1341 -1312 -570 -212 -1880 -1525 -1745 -1456 -1151 -1184 -613 -896 -1902 -2674 -2525 -1437 -1215 -1488 -2192
6709b192K54k50L36o75J24J347q42L61k45q76Q40m13q13n60l31M01M76N14j400
$$ -2192 -1938 -2188 -1852 -2527 -2403 -1056 -1898 -1537 -1782 -2658 -1818 -2231 -3044 -3604 -3935 -3534 -3058 -2544 -3944
6690c944J85j16L36m08K87J88J97l36O91K99N54K103O75n16o3J62L54m1k10j790
$$ -3944 -3759 -3875 -3539 -3947 -3660 -3472 -3275 -3611 -2920 -2621 -2067 36 711 195 132 294 648 607 397 -1393
6670a393k68Q56J146q57n32J92P57P59o58n16n29J86N61O02o65K11k88P68p62
$$ -1393 -1661 -805 341 -516 -1048 -856 -99 660 2 -514 -1043 -857 -296 306 -359 -148 -436 332 -430
6651d30j632r82O50j105O79j046p32K250J487K57q31k82L38O35j14k37j043p27
$$ -430 -2062 -3044 -2394 -3499 -2820 -3866 -4598 -2348 -861 -604 -1435 -1717 -1379 -744 -858 -1095 -2138 -2865
6633b865J56K72m52O19K036M76p57j365K55J125N52j223L53J21K01j25j92L11
$$ -2865 -2709 -2437 -2889 -2270 -234 242 -515 -1880 -1625 -500 52 -1171 -818 -697 -496 -621 -813 -502
6615e02L84M61p39k234j640l34Q32j77O97J676J540j01m91q16m32J144R08j01
$$ -502 -118 343 -396 -2630 -4270 -4604 -3772 -3949 -3252 -1576 -36 -137 -628 -1444 -1876 -732 176 75
6597G5J53O17N06o07j345m99J71L49Q08Q13p67r99k03J603J716o18O35j329k458
$$ 75 228 845 1351 744 -601 -1100 -929 -580 228 1041 274 -725 -928 675 2391 1773 2408 1079 -1379
6578a379j951O68J938J126n67r51r31R8K319k20r64N84r7o2J26j357j623Q80P23
$$ -1379 -3330 -2662 -724 402 -165 -1116 -2047 -1949 370 150 -814 -230 -327 -389 -263 -1620 -3243 -2363 -1640
6559a640M46N14j045o93Q74L3l70O27j84j323nM5J14R64P46no24k70l7P79l78
$$ -1640 -1194 -680 -1725 -2418 -1544 -1511 -1881 -1254 -1438 -2761 -2766 -2721 -2607 -1643 -897 -902 -1526 -1796 -1833 -1054 -1432
6538a432q27k65j718j505J769J5J509J805J014J78p11m24l72k1J60l51lo6p9n31
$$ -1432 -2259 -2524 -4242 -5747 -3978 -3963 -2454 -649 365 543 -168 -592 -964 -985 -825 -1176 -1179 -1245 -1324 -1855
6518a855P5m36K68k79n5N89O72k42j57O68r48K07J94J101J695P52k261m66J65
$$ -1855 -1780 -2216 -1948 -2227 -2282 -1693 -1021 -1263 -1420 -752 -1700 -1493 -1299 -198 1497 2249 -12 -478 -313
6499c13M2R77n37p73p6L40jl94p36n65j01q09M29Q87n31M64l05R04M29j54p47
$$ -313 -271 706 169 -604 -680 -340 -341 -735 -1471 -2036 -2137 -2946 -2517 -1630 -2161 -1697 -2002 -1098 -669 -823 -1570
6478a570l86J70L52J198J07j38l80k38l35J008j20o64O03O95Q33N37J28q78j389
$$ -1570 -1956 -1786 -1434 -236 -129 -267 -647 -885 -1220 -212 -332 -996 -393 302 1135 1672 1800 922 -467
6459d67j457j028n76l96J483J603R50Q72M6l92Pn12n66m2M79L95r54j80J68J132
$$ -467 -1924 -2952 -3528 -3924 -2441 -838 112 984 1030 638 645 133 -433 -475 4 399 -555 -735 -567 565
6439E65M2k14j068j664k44J244R42j467j93N67Q79j2K30O65J11L83j209j65l7
$$ 565 607 393 -675 -2339 -2583 -1339 -397 -1864 -2057 -1490 -611 -623 -393 272 383 766 -443 -608 -645
6420f45q12J66J273J361l43q64r7o58n08j593J515pL38p25O24k04N24M16K79L4
$$ -645 -1457 -1291 -18 1343 1000 136 39 -619 -1127 -2720 -1205 -1212 -874 -1599 -975 -1179 -655 -239 40 74
6400G4J56j124o57Q86J176l56j073o53m6R58L92M39k47j124M76J606r13j197k084
$$ 74 230 -894 -1551 -665 511 155 -918 -1571 -1617 -659 -267 172 -75 -1199 -723 883 -30 -1227 -3311
6381c311m12M33O78j116l05NP09J743J987o17o27l07m94J295J172n97l70m48k53
$$ -3311 -3723 -3290 -2612 -3728 -4033 -4028 -3319 -1576 411 -206 -833 -1140 -1634 -339 833 236 -134 -582 -835
6362h35m27J38J296K18m77m62n42j210r57R81J700J115j170q91r60N41m36l34
$$ -835 -1262 -1124 172 390 -87 -549 -1091 -2301 -3258 -2277 -577 538 -632 -1523 -2483 -1942 -2378 -2712
6344b712R0q2O72O17j61K61O84J51q11L76L77J21J103o60j673m39O69J254k52
$$ -2712 -2622 -2704 -2032 -1415 -1576 -1315 -631 -480 -1291 -915 -538 -417 686 26 -1647 -2086 -1417 -163 -415
6325d15k05Q99J64j134r69l55j094p1J70j88M52J19k78J512N47l16Q26J58r41
$$ -415 -620 279 443 -691 -1660 -2015 -3109 -3180 -3010 -3198 -2746 -2627 -2905 -1393 -846 -1162 -336 -178 -1119
6306a119n08j50K65j22L41K36Q42j97o51p36M74J95r99J78J345o50j070l09J46
$$ -1119 -1627 -1777 -1512 -1634 -1293 -1057 -215 -412 -1063 -1799 -1325 -1130 -2129 -1951 -606 -1256 -2326 -2635 -2489
6287b489J11R61N01N41n01p83J5J570J07o02Q6L34J56K32J20m08j35J07j107N62
$$ -2489 -2378 -1417 -916 -375 -876 -1659 -1644 -74 33 -569 -483 -149 7 239 359 -49 -184 -77 -1184 -622
6267f22M20L10j09J01L62k87o33l34j228l47O36J082K14k75O31m44k50N52j42
$$ -622 -202 108 -1 100 462 175 -458 -792 -2020 -2367 -1731 -649 -435 -710 -79 -523 -773 -221 -363
6248c63r21K2l57R61J340N2M69p92p04j47J26o24l90k98J61P1J70K53O91L58P41
$$ -363 -1284 -1262 -1619 -658 682 734 1203 411 -293 -440 -314 -938 -1328 -1626 -1465 -1394 -1224 -971 -280 78 819
6227H19j036j730m71J91Q78Q45K72J557O34k000r11r3n70k20L13M48j88P16o90
$$ 819 -217 -1947 -2418 -2227 -1349 -504 -232 1325 1959 -41 -952 -1045 -1615 -1835 -1522 -1074 -1262 -546 -1236
6208a236M9m34j89P04o86j455p61Q60J848J399J292q22l28j269O8J622K54l83
$$ -1236 -1187 -1621 -1810 -1106 -1792 -3247 -4008 -3148 -1300 99 1391 569 241 -1028 -960 662 916 533
6190E33r3m37n55O1J310nn98J12Q94k50K56J456j176j939o44k72N09Q05J390R75
$$ 533 440 3 -552 -491 819 814 216 328 1222 972 1228 2684 1508 -431 -1075 -1347 -838 -33 1357 2332
6170B332O1m14l38r52r05r32j10l42m22j399k18O97J353R79K96M9R25R9J43j59
$$ 2332 2393 1979 1641 689 -216 -1148 -1258 -1600 -2022 -3421 -3639 -2942 -1589 -610 -314 -265 660 759 902 743
6150G43n21q55r97n76k93P31Q43J88j704J49r09R81J19l43J163M05l17O07n12
$$ 743 222 -633 -1630 -2206 -2499 -1768 -925 -737 -2441 -2292 -3201 -2220 -2101 -2444 -1281 -876 -1193 -586 -1098
6131a098K1J082J492j99j40j755k03K58K98p07L62Q72L29k89j0n72o0j264P39
$$ -1098 -1077 5 1497 1298 1158 -597 -800 -542 -244 -951 -589 283 612 323 313 -259 -319 -1583 -844
6112h44M44n8K14J146k29j60j57l42k506j711J55J667R39M41j388P5Q43L51N32
$$ -844 -400 -458 -244 902 673 513 356 14 -2492 -4203 -4048 -2381 -1442 -1001 -2389 -2314 -1471 -1120 -588
6093e88P21R37j073J26m99L47l15j210R72k41q25p57N75k63j17Q14P93p75M14
$$ -588 133 1070 -3 123 -376 -29 -344 -1554 -582 -823 -1648 -2405 -1830 -2093 -2210 -1396 -603 -1378 -964
6074i64N28p5l51o13J35j58m89J41J074l85j76r27o83Q04J065Q31r93m57k32P1
$$ -964 -436 -511 -862 -1475 -1340 -1498 -1987 -1846 -772 -1157 -1333 -2260 -2943 -2139 -1074 -243 -1236 -1693 -1925 -1854
6054a854p5j002n68M79J556k25K18J348L28m6j82n10j087j510j40K30o27J308
$$ -1854 -1929 -2931 -3499 -3020 -1464 -1689 -1471 -123 205 159 -23 -533 -1620 -3130 -3270 -3040 -3667 -2359
6036b359J800Q46j057j660L10J154J031K30M65k24R9O46l65Q5j086j780q49Q00
$$ -2359 -559 287 -770 -2430 -2120 -966 65 295 760 536 635 1281 916 1001 -85 -1865 -2714 -1914
6018a914O14K22L06n8K62j30Q94L17J17m02j126Kj060J098m38N01N83J36l66q72
$$ -1914 -1300 -1078 -772 -830 -568 -698 196 513 630 228 -898 -896 -1956 -858 -1296 -795 -212 -76 -442 -1314
5998a314M30m44k18J02J413N47l50p11M08K84k99m87L34N15k71k4j017j12L84
$$ -1314 -884 -1328 -1546 -1444 -31 516 166 -545 -137 147 -152 -639 -305 210 -61 -85 -1102 -1214 -830
5979h30k07j181j18kl37O58Q95l29O8o63L62J530K69J04q0j558p56k08M43R91
$$ -830 -1037 -2218 -2336 -2338 -2675 -2017 -1122 -1451 -1383 -2046 -1684 -154 115 219 139 -1419 -2175 -2383 -1940 -949
5959i49j85p95R3K32l49k89M53O50M06J566j72j084J321k78j873l70n45l1j339
$$ -949 -1134 -1929 -1836 -1604 -1953 -2242 -1789 -1139 -733 833 661 -423 898 620 -1253 -1623 -2168 -2199 -3538
5940c538N72R58Q67N91P01J23J60o15L51M94O7O1q31m24J220L00k62o65L70j281
$$ -3538 -2966 -2008 -1141 -550 151 274 434 -181 170 664 731 792 -39 -463 757 1057 795 130 500 -781
5920g81j530n56L97J77J167P43Q68N70J21l10m45p94M01k7j91R68Q25j624K90
$$ -781 -2311 -2867 -2470 -2293 -1126 -383 485 1055 1176 866 421 -373 28 1 -190 778 1603 -21 269
5901B69O29n59j379l74N88M41o32n33N83l80K15R41R61o15l76o1j318m98j54l18
$$ 269 898 339 -1040 -1414 -826 -385 -1017 -1550 -967 -1347 -1132 -191 770 155 -221 -282 -1600 -2098 -2252 -2570
5881b570J315M02j68J382j0q11o13L91K040P51r05r42L87l1j123n69j74o41Q58
$$ -2570 -1255 -853 -1021 361 351 -460 -1073 -682 1358 2109 1204 262 649 618 -505 -1074 -1248 -1889 -1031
5862a031L74q11j629r78L8Q23J50M62o6N03J273Q0k98j116M89Q77R70J91r5M92
$$ -1031 -657 -1468 -3097 -4075 -4037 -3214 -3064 -2602 -2668 -2165 -892 -812 -1110 -2226 -1737 -860 110 301 206 698
5842F98q86p2J186R59K73o87r5K80Q3q17p70o78j343Q3O70J005R55J31O46L90
$$ 698 -188 -260 926 1885 2158 1471 1376 1656 1739 922 152 -526 -1869 -1786 -1116 -111 844 975 1621 2011
5822B011l28j378j707j403Q58n6p2P47L14M35o3j185OK437K44m01j096r86k78
$$ 2011 1683 305 -1402 -2805 -1947 -2003 -2075 -1328 -1014 -579 -642 -1827 -1821 616 860 459 -637 -1623 -1901
5803a901n53j55J219L85j65m24O55O33K09o80J90J163k20j37j879N61J60R69M52
$$ -1901 -2454 -2609 -1390 -1005 -1170 -1594 -939 -306 -97 -777 -587 576 356 219 -1660 -1099 -939 30 482
5784D82n54j637m19J211j74m86K05n8J516L48L52q93Q8Q07o80o27j531r86k24
$$ 482 -72 -1709 -2128 -917 -1091 -1577 -1372 -1430 86 434 786 -107 -19 788 108 -519 -2050 -3036 -3260
5765c260J553P71r0j456J44r4N62N42K03J311J250j88j479j076n14j24r86J12
$$ -3260 -1707 -936 -1026 -2482 -2338 -2432 -1870 -1328 -1125 186 1436 1248 -231 -1307 -1821 -1945 -2931 -2819
5747b819r61k1Q2P38J88J347j46J257M40J31k9n81J129j31o78m82l68r74K057
$$ -2819 -3780 -3801 -3719 -2981 -2793 -1446 -1592 -335 105 236 207 -374 755 624 -54 -536 -904 -1878 179
5728A79K394j001j728m63j154n06l82p84K92k39L14O30J097L16r66q6J650M97
$$ 179 2573 1572 -156 -619 -1773 -2279 -2661 -3445 -3153 -3392 -3078 -2448 -1351 -1035 -2001 -2087 -437 60
5710F0N65L91K26m4l51r3J203n27j297j516J003P17r95N9M31J21k28N63o24L56
$$ 60 625 1016 1242 1198 847 754 1957 1430 133 -1383 -380 337 -658 -599 -168 -47 -275 288 -336 20
5690B0J547J22k3J109L52j582j867L55J16p7o12J48K40Q71R67J329j867q42K72
$$ 20 1567 1689 1666 2775 3127 1545 -322 33 149 72 -540 -392 -152 719 1686 3015 1148 306 578
5671E78K02k12J63m2L24j548q10j331J53k07o46Q22M39J38M20J039p05P68K25
$$ 578 780 568 731 689 1013 -535 -1345 -2676 -2523 -2730 -3376 -2554 -2115 -1977 -1557 -518 -1223 -455 -230
5652b30K58n11o31l84j108o09J28N31J098L2O13j15N32R22N31j217p95O20L2j13
$$ -230 28 -483 -1114 -1498 -2606 -3215 -3087 -2556 -1458 -1426 -813 -928 -396 526 1057 -160 -955 -335 -303 -416
5632d16J7m39j107k35L85R34J124j85j16L57R3M1q9J37k49R09Q56n95j393j099
$$ -416 -399 -838 -1945 -2180 -1795 -861 263 78 -38 319 412 453 364 501 252 1161 2017 1422 29 -1070
5612a070o49j75O86k17J082o16R83K83j661N50P5M39k32J53m85Q70J679n72p71
$$ -1070 -1719 -1894 -1208 -1425 -343 -959 24 307 -1354 -804 -729 -290 -522 -369 -854 16 1695 1123 352
5593C52n31l51K16l54j491L2k34k34P69k94P55K39M48L92j70p82j232r31l27P47
$$ 352 -179 -530 -314 -668 -2159 -2127 -2361 -2595 -1826 -2120 -1365 -1126 -678 -286 -456 -1238 -2470 -3401 -3728 -2981
5573b981O34J533O00J69k04K5O28r5j541j70k25M9J457J044J13n74k74k83j38
$$ -2981 -2347 -814 -214 -45 -249 -224 404 309 -1232 -1402 -1627 -1578 -121 923 1036 462 188 -95 -233
5554b33m6o2M02j83L45J172n25j241n84M70K87m36q10N91K15o41M11O89k5j66
$$ -233 -279 -341 61 -122 223 1395 870 -371 -955 -485 -198 -634 -1444 -853 -638 -1279 -868 -179 -204 -370
5534c70Q04l29O07j71K38m05j717k83J211j045q35P27J00M70n78k54P72o01o43
$$ -370 434 105 712 541 779 374 -1343 -1626 -415 -1460 -2295 -1568 -1468 -998 -1576 -1830 -1058 -1659 -2302
5515b302R12J92O4l60N47k30l75O02L38M31M36l62q98j806M67O68J248k03j49
$$ -2302 -1390 -1198 -1134 -1494 -947 -1177 -1552 -950 -612 -181 255 -107 -1005 -2811 -2344 -1676 -428 -631 -780
5496g80m93j90M39j135L14M02M02K02q92R07K27J282R72O06j86M60m54k64l62
$$ -780 -1273 -1463 -1024 -2159 -1845 -1443 -1041 -839 -1731 -824 -597 685 1657 2263 2077 2537 2083 1819 1457
5477A457o69n82j762r54J478K26k10l36J54J035M42p53N10O4p12J54L87R73j815
$$ 1457 788 206 -1556 -2510 -1032 -806 -1016 -1352 -1198 -163 279 -474 36 100 -612 -458 -71 902 -913
5458i13j417Q60M5q1J123k14J236M7P72L96m67q70M16k96n88m58M39r76L0p85
$$ -913 -2330 -1470 -1425 -1506 -383 -597 639 686 1458 1854 1387 517 933 637 49 -409 30 -946 -916 -1701
5438a701R74m8N47P6K71j05j17L16n02L37J313J124J37j607j337k54M09k74J454
$$ -1701 -727 -775 -228 -152 119 14 -103 213 -289 48 1361 2485 2622 1015 -322 -576 -167 -441 1013
5419A013N59j024j085j461p45J192J124n12j09N2K164J055P9M14j016j472N42
$$ 1013 1572 548 -537 -1998 -2743 -1551 -427 -939 -1048 -996 1168 2223 2302 2716 1700 228 770
5402G70P10P7Q13J020j674j262l36m37N14j37n34J99J038J030N04r72l19Kj57
$$ 770 1480 1557 2370 3390 1716 454 118 -319 195 58 -476 -277 761 1791 2295 1323 1004 1006 849
5383H49r67l75j315O7J217n9P1j622M79J649M72R75l13n27K38J068l55p61J168
$$ 849 -118 -493 -1808 -1741 -524 -583 -512 -2134 -1655 -6 466 1441 1128 601 839 1907 1552 791 1959
5364A959j075p56o30n03p93J59J531J000Q65O32j19j227j796j4K72l01o82p85
$$ 1959 884 128 -502 -1005 -1798 -1639 -108 892 1757 2389 2270 1043 -753 -767 -495 -796 -1478 -2263
5346b263q85O59J615P94r7L4j219m27oJ579j45n80r9K48P62K02l57j875j120l36
$$ -2263 -3148 -2489 -874 -80 -177 -143 -1362 -1789 -1795 -216 -361 -941 -1040 -792 -30 172 -185 -2060 -3180 -3516
5326c516O35M67L35J333L98j415J365R47R0o85j405Q08L21P48O81p41M21O72J80
$$ -3516 -2881 -2414 -2079 -746 -348 -1763 -398 549 639 -46 -1451 -643 -322 426 1107 366 787 1459 1639
5307A639o50p88p70J102J301Q83n08j96l40j064j101L7n58k84r8P56J28n80K45
$$ 1639 989 201 -569 533 1834 2717 2209 2013 1673 609 -492 -455 -1013 -1297 -1395 -639 -511 -1091 -846
5288h46J005Q1J43j720j402Q38J460J119J37j309k6R13J234R05J144L33k249j476
$$ -846 159 240 383 -1337 -2739 -1901 -441 678 815 -494 -520 393 1627 2532 3676 4009 1760 284
5270B84n67K25l75Q19j031r24M73L72N9K67l19J90L22M50J013j512k157J107P66
$$ 284 -283 -58 -433 386 -645 -1569 -1096 -724 -665 -398 -717 -527 -205 245 1258 -254 -2411 -1304 -538
5251e38P26j291J045M05n23l38P58N48O77J42j511J58N1N04k85q92N26L05j149
$$ -538 188 -1103 -58 347 -176 -514 244 792 1469 1611 100 258 309 813 528 -364 162 467 -682
5232f82p39n60J042k43j024J282k85j087K03Q46O3j256k42L60P17K60J044Q15
$$ -682 -1421 -1981 -939 -1182 -2206 -924 -1209 -2296 -2093 -1247 -1184 -2440 -2682 -2322 -1605 -1345 -301 514
5214E14j21l86O34l06j171j83J827l7j008J285J385J35j06q55q91l76O9N21L91
$$ 514 393 7 641 335 -836 -1019 808 771 -237 1048 2433 2568 2462 1607 716 340 409 930 1321
5195A321Q90j407p67n59K5L95J437n19m89L11N61l08m10k86J56k66l77M66j99
$$ 1321 2211 804 37 -522 -497 -102 1335 816 327 638 1199 891 481 195 351 85 -292 174 -25
5176b5q64K56R08N27Q10Q53j044j005L1J269K66j16m39o47k14J147j246n10J54
$$ -25 -889 -633 275 802 1612 2465 1421 416 447 1716 1982 1866 1427 780 566 1713 467 -43 111
5157A11K15R95R2j189j943n37o83O70P21M57j89P45R55P01J467p75l70M99j99
$$ 111 326 1321 1413 224 -1719 -2256 -2939 -2269 -1548 -1091 -1280 -535 420 1121 2588 1813 1443 1942 1743
5138A743m71k45N41N50N25j278r36K63R99P3K83l49m0l88j47m56j579j222M30
$$ 1743 1272 1027 1568 2118 2643 1365 429 692 1691 1764 2047 1698 1658 1270 1123 667 -912 -2134 -1704
5119a704Q96K08J443J301m49j441j007K55N65o42o25r69j392J617L088J608k1
$$ -1704 -808 -600 843 2144 1695 254 -753 -498 67 -575 -1200 -2169 -3561 -1944 1144 2752 2731
5102B731m92n67n63k06R33Q09N0L54m49r05j761m05P43Q14K96p0j94m02Q8r8K54
$$ 2731 2239 1672 1109 903 1836 2645 2695 3049 2600 1695 -66 -471 272 1086 1382 1312 1118 716 804 706 960
5081I60l88l61J115p5n54j73Q13o97O62P29M0j961j638N35Q26J290M66k53J136
$$ 960 572 211 1326 1251 697 524 1337 640 1302 2031 2071 110 -1528 -993 -167 1123 1589 1336 2472
5062B472J56j316r14l88l34j189K00O09Q12J60J43M82r04j234N33J690N68L8l31
$$ 2472 2628 1312 398 10 -324 -1513 -1313 -704 108 268 411 893 -11 -1245 -712 978 1546 1584 1253
5043A253r28O62J095J14j414p18J89R40J092j39o83k50n60n83j399Q62J74k57
$$ 1253 325 987 2082 2196 782 64 253 1193 2285 2146 1463 1213 653 70 -1329 -467 -293 -550
5025e50j079R06O50o20J76J336O48J71J020m29m71j841N40P40J070M19j37O21
$$ -550 -1629 -723 -73 -693 -517 819 1467 1638 2658 2229 1758 -83 457 1197 2267 2686 2549 3170
5007C170q23j17j305r39M48P15K65K02L21r43J78J167m59m00M03L43n98r36l93
$$ 3170 2347 2230 925 -14 434 1149 1414 1616 1937 994 1172 2339 1880 1480 1883 2226 1628 692 299
4988B99K72n06m9m86j16R65q00n03K61K175O29j93p41j45L56J214J006p4q82o79
$$ 299 571 65 16 -470 -586 379 -421 -924 -663 1512 2141 1948 1207 1062 1418 2632 3638 3564 2682 2003
4968B003o04j476L7J038M51p64P23J19j45k63l97J8K99q4l31j77r66n10K31L9
$$ 2003 1399 -77 -40 998 1449 685 1408 1527 1382 1119 722 740 1039 955 624 447 -519 -1029 -798 -759
4948g59R96J206J83j44J40q61j563o80J677J476m29k17m44J69Q02K58j589q81
$$ -759 237 1443 1626 1482 1622 761 -802 -1482 195 1671 1242 1025 581 750 1552 1810 221 -660
4930f60p36K60P8J543K14N68J554J663R52J150n37J4N05k221j680m14l67L1r72
$$ -660 -1396 -1136 -1058 485 699 1267 2821 4484 5436 6586 6049 6063 6568 4347 2667 2253 1886 1917 945
4911I45j61p39r99o80q99o96N24O9P02J860J786O56j519k092Q9J094N07o73j385
$$ 945 784 45 -954 -1634 -2533 -3229 -2705 -2636 -1934 -74 1712 2368 849 -1243 -1154 -60 447 -226 -1611
4892a611L70R07j222M72m5Q0j365R34j22O17Q9m65M39P08q11k35N11Q01O59j29
$$ -1611 -1241 -334 -1556 -1084 -1129 -1049 -2414 -1480 -1602 -985 -896 -1361 -922 -214 -1025 -1260 -749 52 711 582
4872E82K19j56j331L28K81K45K24Q37O02j323m40j178J941J052K31L36L22K63
$$ 582 801 645 -686 -358 -77 168 392 1229 1831 508 68 -1110 831 1883 2114 2450 2772 3035
4854C035j025j363j154Rj0j12J283K74j68K7P85J091J462N2J00m88j71J54r91
$$ 3035 2010 647 -507 -498 -508 -620 663 937 769 796 1581 2672 4134 4186 4286 3798 3627 3781 2790
4835B790k102j079P20l03j969J36M71J277J484l23l01R61K21J15n40j538r92k167
$$ 2790 688 -391 329 26 -1943 -1807 -1336 -59 1425 1102 801 1762 1983 2098 1558 20 -972 -3139
4817c139q95l50M07J418k87R19J107l69n3l05J106N85m07m90m02K18K18L52J353
$$ -3139 -4034 -4384 -3977 -2559 -2846 -1927 -820 -1189 -1242 -1547 -441 144 -263 -753 -1155 -937 -719 -367 986
4798I86n94l28Q51M38m58j71J670k70o28J228r8k46m20p89r16j32n07j287n25
$$ 986 392 64 915 1353 895 724 2394 2124 1496 2724 2626 2380 1960 1171 255 123 -384 -1671 -2196
4779b196j59K7J325k10L42J221k63M61j33M04K69k57J002r21J81k61L33n41j26
$$ -2196 -2355 -2328 -1003 -1213 -871 350 87 548 415 819 1088 831 1833 912 1093 832 1165 624 498
4760D98J513J409M40n33j053j434q70p66J49M64M5J798M03m39m59P16oK3L4r10
$$ 498 2011 3420 3860 3327 2274 840 -30 -796 -647 -183 -138 1660 2063 1624 1165 1881 1875 1898 1932 1022
4740A022M9j5j097r88o16m2p9J355P20J228N77m13j29J83M78J30k6j90n7N34l49
$$ 1022 1071 1056 -41 -1029 -1645 -1687 -1766 -411 309 1537 2114 1701 1572 1755 2233 2363 2337 2147 2090 2624 2275
4719B275j389K78j20j555J50J463R11j107k81q3j61o32J27O1m75j4q2L8J74p47
$$ 2275 886 1164 1044 -511 -361 1102 2013 906 625 542 381 -251 -124 -63 -538 -552 -634 -596 -422 -1169
4699a169j605J057J193k28J572R70p46q87k11l77M96K40J11m98OJ214J372R02
$$ -1169 -2774 -1717 -524 -752 820 1790 1044 157 -54 -431 65 305 416 -82 -76 1138 2510 3412
4681C412p67n60n82j113M00Q42r53j05j84o5q23m47J9O79R10j324j8r73J140J296
$$ 3412 2645 2085 1503 390 790 1632 679 574 390 325 -498 -945 -926 -247 663 -661 -679 -1652 -512 784
4661G84j29m00k55l82K28M83n06M01k45J334P20k62N5M95n72m53p76l44Q72J71
$$ 784 655 255 0 -382 -154 329 -177 224 -21 1313 2033 1771 1826 2321 1749 1296 520 176 1048 1219
4641A219Q85l4k94j775l45J53J19Q21p81m02m0K62M19m30r37J32Q5L71J405J124
$$ 1219 2104 2070 1776 1 -344 -191 -72 749 -32 -434 -474 -212 207 -223 -1160 -1028 -943 -572 833 1957
4621A957j03q67J31j062k39J210J250K94j106j110N66R04j452o11M48J081J587
$$ 1957 1854 987 1118 56 -183 1027 2277 2571 1465 355 921 1825 373 -238 210 1291 2878
4604B878l23k041j682k38O19q6Q69J041M92N76o32J41J18k79j33j702p08m13k3
$$ 2878 2555 514 -1168 -1406 -787 -873 -4 1037 1529 2105 1473 1614 1732 1453 1320 -382 -1090 -1503 -1526
4585a526L80N95J34l54L74k28J066J302J858j194j695j346n87O07J120p9q15l29
$$ -1526 -1146 -551 -417 -771 -397 -625 441 1743 3601 2407 712 -634 -1221 -614 506 427 -388 -717
4567g17n90M17K003J257j539oJ085O81K25k109n11J019r72n01Q59J543j199l86
$$ -717 -1307 -890 1113 2370 831 825 1910 2591 2816 707 196 1215 243 -258 601 2144 945 559
4549E59M55J55N17j18O9o78j132j33K042L0j283r06l56O33j168k42L62r3j54J124
$$ 559 1014 1169 1686 1568 1637 959 -173 -306 1736 1766 483 -423 -779 -146 -1314 -1556 -1194 -1287 -1441 -317
4529c17K65J025k74p55N34R41Q73o60j145r78J423J015o16j87N6j22M35o30K07
$$ -317 -52 973 699 -56 478 1419 2292 1632 487 -491 932 1947 1331 1144 1200 1078 1513 883 1090
4510A090J93R32M83j537o39j740n00j35R24J80L83k64K62m18P9n53J540J136K23
$$ 1090 1283 2215 2698 1161 522 -1218 -1718 -1853 -929 -749 -366 -630 -368 -786 -707 -1260 280 1416 1639
4491A639Q70J602N12l28m35q74r37q03N72J583p18k94J59J82J143q35j569k59
$$ 1639 2509 4111 4623 4295 3860 2986 2049 1246 1818 3401 2683 2389 2548 2730 3873 3038 1469 1210
4473A210P66m11N7J194J329p89j348j558N41J62J231K20N27j494j506N05Q50o02
$$ 1210 1976 1565 1622 2816 4145 3356 2008 450 991 1153 2384 2604 3131 1637 131 636 1486 884
4455H84n88j540q49j097J006J131J166k18L24L2J88L29o69p51K07J823M06r22
$$ 884 296 -1244 -2093 -3190 -2184 -1053 113 -105 219 251 439 768 99 -652 -445 1378 1784 862
4437H62j047l40J603j23j333o1N89J106R19R01n26k291k238J049J033J39j56J56
$$ 862 -185 -525 1078 955 -378 -439 150 1256 2175 3076 2550 259 -1979 -930 103 242 86 242
4419B42Q15m82N8n04J052M43p12q31m45K26J059Q48m11Q24O31L8m09m25n13p20
$$ 242 1057 575 633 129 1181 1624 912 81 -364 -138 921 1769 1358 2182 2813 2851 2442 2017 1504 784
4399G84R6L66p57O21q06k4M27J77M38J476K00j419l01L5K19q7K0k30J053O23l28
$$ 784 880 1246 489 1110 304 280 707 884 1322 2798 2998 1579 1278 1313 1532 1445 1465 1235 2288 2911 2583
4378B583j260o62o48q17k44K1k14J061J164L57n38Q35o0j420%R49k22j166o87
$$ 2583 1323 661 13 -804 -1048 -1027 -1241 -180 984 1341 803 1638 1578 158 158 1107 885 -281 -968
4359i68J307L36j34J19M96M90j283q33q14J239J430N75K2Ko83N04q01O13p27j183
$$ -968 339 675 541 660 1156 1646 363 -470 -1284 -45 1385 1960 1982 1984 1301 1805 1004 1617 890 -293
4339b93K83P82J136n96L0l59j170j318o05o97P49J500J782M2q35P47J525o9o07
$$ -293 -10 772 1908 1312 1342 983 -187 -1505 -2110 -2807 -2058 -558 1224 1266 431 1178 2703 2634 2027
4320B027j886l02J647P90M52o62j42q18M07Q40p06r28N63m97j366n10O64M42M88
$$ 2027 141 -161 1486 2276 2728 2066 1924 1106 1513 2353 1647 719 1282 785 -581 -1091 -427 15 503
4301E03k0k24l70Q89J63m05J250J408J43k35j847r06l51j05Q01n41N14J970l74
$$ 503 483 259 -111 778 941 536 1786 3194 3337 3102 1255 349 -2 -107 694 153 667 2637 2263
4282B263q41p9j41M49Q29j069j515j007q07L02n15l10K42J57o0L14k67J076J896
$$ 2263 1422 1343 1202 1651 2480 1411 -104 -1111 -1918 -1616 -2131 -2441 -2199 -2042 -2102 -1788 -2055 -979 917
$$ [...]
##END NTUPLES=NMR SPECTRUM
##END=
