##TITLE=Analysis number 316599
Compound Code rf 04123
Project Code adrs
Chemist Name hixia
##JCAMPDX= 6.0         $$ Bruker NMR JCAMP-DX V2.0
##DATA TYPE= NMR SPECTRUM
##DATA CLASS= NTUPLES
##ORIGIN= Bruker BioSpin GmbH
##OWNER= nmr
$$ XWIN-NMR		Version 3.5
$$ Fri Jan 20 09:16:09 2006 GMT Standard Time (UT+0h)  MAYBRIDGE\nmr@NMR_250MHZ
##.OBSERVE FREQUENCY= 250.131544655141
##.OBSERVE NUCLEUS= ^1H
##.ACQUISITION MODE= SIMULTANEOUS (DQD)
##.ACQUISITION SCHEME= undefined
##.AVERAGES= 16
##.DIGITISER RES= 18
##SPECTROMETER/DATA SYSTEM= dpx250
##.PULSE SEQUENCE= zg30
##.SOLVENT NAME= CDCl3
##.SHIFT REFERENCE= (INTERNAL, CDCl3, 0, 16.522)
##AUDIT TRAIL= $$ (NUMBER, WHEN, WHO, WHERE, WHAT)
$$ ##TITLE= Audit trail, XWIN-NMR		Version 3.5
$$ ##JCAMPDX= 5.01
$$ ##ORIGIN= Bruker BioSpin GmbH
$$ ##OWNER= nmr
$$ C:\u/data/dgb/nmr/ADRS/15010/pdata/1/auditp.txt
$$ ##AUDIT TRAIL=  $$ (NUMBER, WHEN, WHO, WHERE, WHAT)
(   1,<2006-01-20 09:15:41.80 +000>,<MAYBRIDGE\nmr>,<NMR_250MHZ>,
      <created by zg, POWCHK disabled, PULCHK disabled
       configuration hash MD5:
       62 19 C7 07 E1 42 D1 B7 37 6C 3D D0 77 39 F9 E6
       data hash MD5: 64K
       69 93 EA 9B EB 72 7D C5 0C 99 B7 98 72 44 88 3F>)
(   2,<2006-01-20 09:15:57.02 +000>,<MAYBRIDGE\nmr>,<NMR_250MHZ>,
      <Start of raw data processing
       ef LB = 0.3 FT_mod = 6 PKNL = 1 SI = 32K 
       data hash MD5: 32K
       22 B5 34 0F 71 D9 15 F1 B6 CB CC 04 C7 76 D3 25>)
(   3,<2006-01-20 09:15:59.05 +000>,<MAYBRIDGE\nmr>,<NMR_250MHZ>,
      <apk 
       data hash MD5: 32K
       27 8B EB 44 D4 62 4E 13 19 BD 29 91 45 40 8E F2>)
(   4,<2006-01-20 09:15:59.86 +000>,<MAYBRIDGE\nmr>,<NMR_250MHZ>,
      <abs ABSG = 5 
       data hash MD5: 32K
       89 04 34 CA ED A2 8A 9A 3A 3C A8 FA 73 B3 BC 7F>)
$$ ##END=
$$ 
$$ hash MD5
$$ 69 C9 66 32 6C A5 0D 81 98 45 6C 10 5A D3 F3 82
##$RELAX= 
##$RELAX= 
##$RELAX= 
##$RELAX= 
##$RELAX= 
##$RELAX= 
##$RELAX= 
$$ Bruker specific parameters
$$ --------------------------
##$DU= <C:\u>
##$EXPNO= 15010
##$NAME= <ADRS>
##$PROCNO= 1
##$TYPE= <nmr>
##$USER= <dgb>
##$AMP= (0..31)
100 100 100 100 100 100 100 100 100 100 100 100 100 100 100 100 100 100 
100 100 100 100 100 100 100 100 100 100 100 100 100 100 
##$AQSEQ= 0
##$AQ_mod= 3
##$AUNM= <au_zg>
##$AUTOPOS= <25 >
##$BF1= 250.13
##$BF2= 250.13
##$BF3= 250.13
##$BF4= 250.13
##$BF5= 500.13
##$BF6= 500.13
##$BF7= 500.13
##$BF8= 500.13
##$BYTORDA= 1
##$CFDGTYP= 0
##$CFRGTYP= 5
##$CHEMSTR= <none>
##$CNST= (0..31)
1 1 145 1 1 1 1 1 1 1 1 1 1 1 1 1 1 1 1 1 1 1 1 1 1 1 1 1 1 1 1 1 
##$CPDPRG= <>
##$CPDPRG1= <>
##$CPDPRG2= <>
##$CPDPRG3= <>
##$CPDPRG4= <mlev>
##$CPDPRG5= <mlev>
##$CPDPRG6= <mlev>
##$CPDPRG7= <mlev>
##$CPDPRG8= <mlev>
##$CPDPRGB= <>
##$CPDPRGT= <>
##$D= (0..31)
0 1 0 0 0 0 0 0 0 0.06 0 0 0 0 0 0 0.0002 0 0 0 0 0 0 0 0 0 0 0 0 0 0 
0 
##$DATE= 1137748540
##$DBL= (0..7)
120 120 120 120 120 120 120 120 
##$DBP= (0..7)
150 150 150 150 150 150 150 150 
##$DBP07= 0
##$DBPNAM0= <>
##$DBPNAM1= <>
##$DBPNAM2= <>
$$ [...]
##$SUBNAM7= <"">
##$SUBNAM8= <"">
##$SUBNAM9= <"">
##$SW= 20.6930455092707
##$SWIBOX= (0..15)
0 0 3 0 0 0 0 0 0 0 0 0 0 0 0 0 
##$SW_h= 5175.983436853
##$TD= 65536
##$TD0= 1
##$TE= 294.16
##$TE2= 300
##$TE3= 300
##$TEG= 300
##$TL= (0..7)
0 120 120 120 120 120 120 120 
##$TP= (0..7)
150 150 150 150 150 150 150 150 
##$TP07= 0
##$TPNAME0= <>
##$TPNAME1= <>
##$TPNAME2= <>
##$TPNAME3= <>
##$TPNAME4= <>
##$TPNAME5= <>
##$TPNAME6= <>
##$TPNAME7= <>
##$TPOAL= (0..7)
0.5 0.5 0.5 0.5 0.5 0.5 0.5 0.5 
##$TPOFFS= (0..7)
0 0 0 0 0 0 0 0 
##$TUNHIN= 0
##$TUNHOUT= 0
##$TUNXOUT= 0
##$USERA1= <user>
##$USERA2= <user>
##$USERA3= <user>
##$USERA4= <user>
##$USERA5= <user>
##$V9= 5
##$VALIST= <valist>
##$VCLIST= <CCCCCCCCCCCCCCC>
##$VD= 0
##$VDLIST= <DDDDDDDDDDDDDDD>
##$VPLIST= <PPPPPPPPPPPPPPP>
##$VTLIST= <TTTTTTTTTTTTTTT>
##$WBST= 1024
##$WBSW= 4
##$XGAIN= (0..3)
0 0 0 0 
##$XL= 0
##$YL= 0
##$YMAX_a= 451150
##$YMIN_a= -484986
##$ZGOPTNS= <>
##$ZL1= 120
##$ZL2= 120
##$ZL3= 120
##$ZL4= 120
##$ABSF1= 16.522
##$ABSF2= -4.171173
##$ABSG= 5
##$ABSL= 3
##$ALPHA= 0
##$AQORDER= 0
##$ASSFAC= 0
##$ASSFACI= 0
##$ASSFACX= 0
##$ASSWID= 0
##$AUNMP= <proc_1d>
##$AZFE= 0.1
##$AZFW= 0.1
##$BCFW= 0
##$BC_mod= 0
##$BYTORDP= 0
##$COROFFS= 0
##$CY= 12.5
##$DATMOD= 1
##$DC= 0
##$DFILT= <>
##$DTYPP= 0
##$F1P= 14.0000005364418
##$F2P= -0.99999901652339
##$FCOR= 0.5
##$FTSIZE= 32768
##$FT_mod= 6
##$GAMMA= 0
##$GB= 0
##$INTBC= 1
##$INTSCL= 1
##$ISEN= 128
##$LB= 0.3
##$LEV0= 0
##$LPBIN= 0
##$MAXI= 10000
##$MC2= 0
##$MEAN= 0
##$ME_mod= 0
##$MI= 0
##$NCOEF= 0
##$NC_proc= -3
##$NLEV= 6
##$NOISF1= 0
##$NOISF2= 0
##$NSP= 0
##$NTH_PI= 0
##$NZP= 0
##$OFFSET= 16.522
##$PC= 1
##$PHC0= 235.9126
##$PHC1= 8.329902
##$PH_mod= 1
##$PKNL= yes
##$PPARMOD= 0
##$PSCAL= 4
##$PSIGN= 0
##$REVERSE= no
##$SF= 250.13
##$SI= 32768
##$SIGF1= 0
##$SIGF2= 0
##$SINO= 400
##$SIOLD= 32768
##$SREGLST= <1H.CDCl3>
##$SSB= 0
##$STSI= 32768
##$STSR= 0
##$SW_p= 5175.98343685301
##$SYMM= 0
##$S_DEV= 0
##$TDeff= 65536
##$TDoff= 0
##$TI= <Analysis number 999999
Compound Code 99
Book Reference 9
Project Code 9>
##$TILT= no
##$TM1= 0
##$TM2= 0
##$TOPLEV= 0
##$USERP1= <user>
##$USERP2= <user>
##$USERP3= <user>
##$USERP4= <user>
##$USERP5= <user>
##$WDW= 1
##$XDIM= 32768
##$YMAX_p= 304304242
##$YMIN_p= -89158
$$ End of Bruker specific parameters
$$ ---------------------------------
##NTUPLES= NMR SPECTRUM
##VAR_NAME=  FREQUENCY,     SPECTRUM/REAL,   SPECTRUM/IMAG
##SYMBOL=    X,             R,               I
##VAR_TYPE=  INDEPENDENT,   DEPENDENT,       DEPENDENT
##VAR_FORM=  AFFN,          ASDF,            ASDF
##VAR_DIM=   32768,         32768,           32768
##UNITS=     HZ,            ARBITRARY UNITS, ARBITRARY UNITS
##FACTOR=    0.157963299565203, 1,           1
##FIRST=     4132.6476996994, 0,             0
##LAST=      -1043.33573715361, 0,           0
##MIN=       -1043.33573715361, -89158,      0
##MAX=       4132.6476996994, 304304242,     0
$$ Real data points
##PAGE= N=1
##DATA TABLE= (X++(R..R)), XYDATA
$$ [...]
27287c5224N66M340K4689k179K205J2955O740r174P448Q65K390j7499k683j2161
27273a6722O874M680m129p114k220P009K6966J1826n891k0672j9353N105J3722
27260H1o58l706j2543L236j0478j3074L936J8973l036P915J6700R530Q06r87J564
27245A8259Q787K47O388n703k6473k6679K003K010j196P68K5418R341k5092q715
27231b0637K1109R885o539r705n702p559n879m885J4199L001j4120J6866J5923
27218E957J2187j4569k5644j8617N339P195J1950J3282k367p069K894N715l714
27205g461J0529J6484j2370l0774j1935R100j132L105o315r33J8921m799n050
27192b2630J2110k208j2758r33J6734O715p116K768N760N454M199n782R561l795
$$ plain form
27287 -35224 -34658 -30318 -5629 -7808 -5603 7352 14092 4918 12366 13231 15621 -1878 -4561 -16722
27273 -16722 -9848 -5168 -9297 -16411 -18631 -11622 15344 27170 21279 607 -18746 -13641 81
27260 81 -577 -4283 -16826 -13590 -24068 -37142 -33206 -14233 -17269 -9354 7346 16876 17682 16695 18259
27245 18259 27046 27293 33681 27978 1505 -25174 -23171 -21161 -22357 -21589 3829 13170 -11922 -20637
27231 -20637 472 10357 3818 -5887 -11589 -19148 -25027 -29912 -15713 -12712 -26832 -9966 5957
27218 5957 18144 3575 -22069 -40686 -35347 -28152 -16202 -2920 -5287 -12356 -9462 -3747 -7461
27205 -7461 3068 19552 7182 -23592 -35527 -26427 -27559 -24454 -30769 -31702 -12781 -17580 -22630
27192 -22630 -10520 -12728 -25486 -26419 -9685 -2970 -10086 -7318 -1558 3896 8095 2313 11874 8079
27178H079Q25m225J3784q33j4818m517J1233J3274M637j0000J654j8252k2215
27165b1374J608Q475J656L261l988L25J7082P507L71J5877j663j7745j0719l060
27151b387Q153l530j945j668j0761J0063j0618k5802q922m84O333R731K565J963
27137b7309J9376J3760n066M541P222L999j538j0311q250k438l793k3226m731
27124c7764n067K1190J4736j4446N760J2687J186K571k980j6632q094p119L749
27111c0223j763K4907J3741P370m013l5556j7495J4301L5425N839P797k111r702
27098H517p352L467N735J353J119o713j1408n995r185K1952J735k0533j882j3783
27084c2973K391J2844J8098l56n530r118j1373R275P126J0271Q498j6773j0105
$$ plain form
27178 8079 8904 4679 18463 17630 2812 -1705 9528 22802 27439 17439 19093 841 -21374
27165 -21374 -19766 -11291 -9635 -6374 -10362 -10037 7045 14552 14923 30800 29137 11392 673 -2387
27151 -2387 5766 2236 291 -1377 -12138 -2075 -12693 -38495 -47417 -47901 -41568 -31837 -29272 -27309
27137 -27309 -7933 5827 761 5302 12524 16523 14985 4674 -3576 -6014 -9807 -33033 -37764
27124 -37764 -42831 -21641 -6905 -21351 -15591 -2904 -1718 853 -2127 -18759 -26853 -33972 -30223
27111 -30223 -31986 -7079 6662 14032 10019 -25537 -43032 -28731 6694 12533 20330 18219 8517
27098 8517 1165 4632 10367 11720 12839 6126 -5282 -11277 -20462 1490 3225 -17308 -19190 -32973
27084 -32973 -30582 -17738 360 4 -5526 -14644 -26017 -16742 -9616 655 9153 -7620 -17725
27071a7725j5690O786M330Q608m474M5J598j0465M332l49O565J2889j016K40K4855
27056B0529J2170O84m358j7584j6704q26j6909Q074J282j3985R363J5014J3923
27043A0673l949P834K8523N722r692o666j2410k260l448o954r026M033o288O920
27029C012J6307P295k5862k4614k6344m653P834O008J6606K5338j487k6518J2781
27016a4297J0502K3730m203q606J6149J1156j1463n654J0537j5163k5457j86q452
27003b1407j0820N724L2085J8998J5176k0603j4282J4981m566j3184j178N828
26991F752L775n685j3123q533M497n522L601K075J951m208J371M929r028J482
26977a5666k0043J0255P045n626p177Q495J5328j3499R543Q120J3247j3119q47
$$ plain form
27071 -17725 -33415 -26629 -22299 -13691 -18165 -18120 -16522 -26987 -22655 -23004 -16439 -3550 -4566 -4326 20529
27056 20529 32699 33383 29025 11441 -5263 -6089 -22998 -14924 -13642 -27627 -18264 -3250 10673
27043 10673 6724 14558 43081 48803 39111 32445 20035 17775 14327 7373 -1653 2380 -3908 3012
27029 3012 19319 26614 752 -23862 -50206 -54859 -47025 -41017 -24411 927 -560 -27078 -14297
27016 -14297 -3795 19935 15732 7126 23275 34431 22968 17314 27851 12688 -12769 -12955 -21407
27003 -21407 -32227 -26503 5582 24580 39756 19153 4871 19852 15286 2102 924 6752
26991 6752 10527 4842 -8281 -16814 -12317 -17839 -14238 -12163 -10212 -14420 -13049 -8120 -17148 -15666
26977 -15666 -35709 -25454 -18409 -24035 -31212 -22717 -7389 -20888 -11345 -3225 10022 -3097 -3944
26964c944o759q858q891J7461J2924j711j7442j1890J5906J30P023Q403j8321
26951a5969k0298q485K1562K1822J097j2644K284R254J1161R057j3549j3252J7539
26938I579j2917j4200k1691M223r606j838P615M878m957j8468J4098J6588J3461
26925a3235Q94K474k5232K702J2375J5087K6023M079j1526j866j1236q601J407
26912f655O547o160l189J852m783j9309j5508J2237K0715J3755J490l874j1867
26899a4749J0364N453K648O464k7363q552J7980O655L062J803J3257J4089j5831
26886A5280l5111J3331K1145M688k713l226o423j4848L759L944J5726L595j9361
26873b14J8282J3808j5872r791j5328O675J5502O677j3743j0959m344j517J1160
$$ plain form
26964 -3944 -10703 -19561 -28452 -10991 1933 222 -17220 -29110 -13204 -13074 -6051 2352 -15969
26951 -15969 -36267 -44752 -23190 -1368 -271 -12915 -10631 -1377 9784 18841 5292 -7960 9579
26938 9579 -3338 -17538 -39229 -35006 -44612 -46450 -38835 -33957 -38914 -57382 -43284 -26696 -13235
26925 -13235 -12341 -9867 -35099 -32397 -20022 -4935 21088 25167 13641 11775 539 -8062 -6655
26912 -6655 -108 -6268 -9457 -7605 -12388 -31697 -47205 -34968 -14253 -498 992 -2882 -14749
26899 -14749 -4385 1068 3716 10180 -17183 -25735 -7755 -1100 1962 3765 17022 31111 15280
26886 15280 -19831 -6500 14645 19333 16620 13394 6971 -7877 -4118 -174 15552 19147 -214
26873 -214 18068 31876 16004 6213 -9115 -2440 13062 19739 5996 -4963 -9307 -10824 336
26860C36J5445j711j6811k5949o381N017o518J7176N978o088J85J0037k695J180
26846a0799J9603L784r951j9289j7102K43J5374M817K0015Q136M468n56j5454
26833C289R704J8154k2638j9349R018J0696r475l601N90K7035J2655j9264k6523
26820i709o738j268p399j6432K484K9088j0777k0415J0805R526J7343J1880L105
26807A1493o477p60k996j7050J7816J6886J9542M25q527q632N814k3685P168P837
26793A8854p342k5502N458J9133j6716r288r275Q984j0193j1564J0321K1424p535
26780a3241m569J7725L152Q290m262M452L0943p568k4742N450k0513j1638o840
26767b3361M252Q22q777p869P74Q305j2281m858J2531K6521K1511m392K712q861
$$ plain form
26860 336 15781 14070 -2741 -28690 -35071 -30054 -36572 -19396 -13418 -19506 -19321 -9284 -11979 -10799
26846 -10799 8804 12588 2637 -16652 -33754 -33511 -18137 -13320 6695 14831 19299 18743 3289
26833 3289 12993 31147 8509 -10840 -1822 8874 -601 -4202 -3612 23423 36078 16814 -9709
26820 -9709 -16447 -17715 -25114 -41546 -39062 -9974 -20751 -41166 -30361 -20835 -3492 8388 11493
26807 11493 5016 4256 1260 -15790 2026 18912 38454 38879 30352 21720 27534 3849 11017 18854
26793 18854 11512 -13990 -8532 10601 -6115 -15403 -24678 -15694 -25887 -37451 -27130 -5706 -13241
26780 -13241 -17810 -85 3067 11357 7095 11547 42490 34922 10180 15630 -4883 -16521 -23361
26767 -23361 -19109 -18287 -27064 -34933 -34159 -25854 -38135 -42993 -30462 -3941 17570 13178 15890 7029
26753G029j9006J0484M903k58j777Q96P455K30J2644Q22j9596j637K1151m463
26739A8877m465k394j0160j310j2278j1608J4153K747j9034M678J8266j744j249
26726e521Q523q470l395n683O456j5645P121L126J0509J3474l083p337J758l276
26712a443K54M719m419n631j0193p167k212J8435K2258M12q418k3250k5483J2785
26698b9353J9806p694P812j471j1196J9438J6719J78q984j4981p661J028J8370
26685B011k2351j3412M561O064q692p776J5899P691R180N035r938m095K4504N670
26671A4351J371p618l54m4j5265n881j3222Q749L596J6546M581k341J723K5791
26657C1983J452j6270k2705p362j1838j2621Q885J2370m812P478j0265k650l569
$$ plain form
26753 7029 -11977 -1493 3410 3152 1375 2271 9726 9956 22600 23422 3826 2189 23340 18877
26739 18877 14412 12018 1858 548 -11730 -23338 -9185 -6438 -25472 -20794 -2528 -4272 -5521
26726 -5521 3002 -5468 -8863 -14546 -8090 -23735 -16614 -13488 -2979 10495 7412 75 1833 -1443
26712 -1443 -1189 3530 -889 -6520 -16713 -23880 -26092 -7657 14601 15013 6595 -16655 -42138 -29353
26698 -29353 -9547 -17241 -9429 -10900 -22096 -2658 14061 14239 5255 -9726 -17387 -16359 2011
26685 2011 -20340 -33752 -29191 -23127 -31819 -39595 -23696 -16005 -6825 -1790 -11728 -15823 8681 14351
26671 14351 15722 8104 7750 7706 -7559 -13440 -26662 -17913 -14317 2229 6810 4469 6192 31983
26657 31983 33435 17165 -5540 -12902 -24740 -37361 -28476 -16106 -20918 -13440 -23705 -26355 -29924
26644b9924j0886P672J340o231J6407j154J8160P168O965J5756L321l049K317
26631B7862l0504j1203J6814J6408J0726O886j6803p850J597k43l866o329N674
26618I169m610L64J889M080j2243n488m0278J424K4853N187j260m215l962K3255
26604a835N944r574O148K950J4637J3536k9971M967P559k5153o741K501l657j7953
26590c6642J1437J0850p441J503q815m546J7449L581l019P992m875o18P642Q056
26576B554L81K659p915j3979j2802P75J0938N165j801M71J3715Q025p999R141
26562I328K1282N92n296j5716k8063j3719L142N112Q171o583j864k0366l126R341
26548c7765K231j693P605K8670O390j7532J1557J3203q37k0008j0726J6305J1027
$$ plain form
26644 -29924 -40810 -33138 -31798 -38029 -21622 -22776 -4616 2552 9517 25273 28594 25545 27862
26631 27862 -2642 -13845 2969 19377 30103 36989 20186 12336 13933 13690 9824 3495 9169
26618 9169 4559 4923 6812 10892 -1351 -6839 -47117 -45693 -20840 -15653 -16913 -21128 -25090 -1835
26604 -1835 4109 -5465 683 3633 18270 31806 1835 6802 14361 -10792 -17533 -15032 -18689 -36642
26590 -36642 -25205 -14355 -21796 -20293 -29108 -33654 -16205 -12624 -15643 -7651 -12526 -13144 -5502 2554
26576 2554 2935 5594 -2321 -16300 -29102 -28327 -17389 -12224 -14025 -13554 161 8186 187 9328
26562 9328 30610 31202 25906 10190 -17873 -31592 -28450 -23338 -15167 -21750 -23614 -43980 -47106 -37765
26548 -37765 -35534 -37227 -29622 -952 5438 -12094 -537 12666 11829 -8179 -18905 -2600 8427
26535H427j7226n351J5194m301j2328l043J7293q487J7413q201k759K757J0548
26522I936K888Q64K047p224k562J0151R844j0792j1981j5978J0171R681J90j581
26508E654m648j071J5059o79K123o926j6290J556j2264k277K3741P316r060k4843
26494b2609j8753R02J8413o478q49Q324P684q153j799J1139J2083m408L718O608
26480E822R129J1113r777j6825O877O673j7638o473J4111J0585J883n924J221
26467A0777R427J7895o895j0715k5156o804P17o900N999J4140K938r788P785j1604
26453h184r596j6998l17K4279Q686J2043J5532j0616L756j5732m586k982j0143
26440a4858r465Q9n884l390J9829K6340P359K994J422L071j5983K155K3760j4984
$$ plain form
26535 8427 -8799 -14150 1044 -3257 -15585 -18628 -1335 -9822 7591 -610 -3369 -612 9936
26522 9936 12824 13688 15735 8511 5949 16100 25944 15152 3171 -12807 -2636 7045 7235 5654
26508 5654 1006 -65 14994 14315 16438 9512 -6778 -5222 -17486 -19763 3978 11294 2234 -22609
26494 -22609 -41362 -40460 -22047 -28525 -29374 -21050 -13366 -21519 -23318 -12179 -96 -4504 -786 5822
26480 5822 14951 26064 16287 -538 6339 13012 -4626 -11099 3012 13597 15480 9556 10777
26467 10777 20204 38099 31204 20489 -4667 -11471 -10754 -17654 -11655 2485 5423 -4365 3420 -8184
26453 -8184 -17780 -34778 -35095 -10816 -2130 9913 25445 14829 18585 2853 -1733 -4715 -14858
26440 -14858 -24323 -24234 -30118 -33508 -13679 12661 20020 23014 24436 27507 11524 13679 37439 22455
26426B2455j6973j4431K71j8786j9647M455J1159L759Q336J8802q507n525J6794
26413B162p212j0513J1274J7951p419r954k1460p473M251N3P045J1167J8389K3213
26399C1474o343l6773k2390J6091J0656J3144j1972j4678q490J2914L837K4168
26387A1638J3800m769j314r840L337L744q902p308o472P675L656q96k712q877
26373g240j3083p012M861l183L415L795O849P933r819J0063J8050k0202j1529
26360a7102J5193R80M590j014k376q456j2902P928K5246P132j0403j1732p017
26347i933l978j759J5250k7m892k0030R552Q123j0069j4844k209Q871J643q358
26333c2660M556o64j562J0133j2662j0383J8163J4752J0m765j0285J994N340N260
$$ plain form
26426 22455 5482 -8949 -8678 -27464 -47111 -42656 -31497 -27738 -19402 -600 -9107 -14632 2162
26413 2162 -5050 -15563 -4289 13662 6243 -3711 -25171 -32644 -28393 -28340 -21295 -10128 8261 31474
26399 31474 25131 -11642 -34032 -17941 -7285 5859 -6113 -20791 -29281 -16367 -12530 11638
26387 11638 25438 20669 19355 9515 12852 16596 7694 386 -6086 1589 5245 4349 1637 -7240
26373 -7240 -20323 -27335 -22474 -25657 -22242 -18447 -11598 -3665 -13484 -3421 14629 -5573 -17102
26360 -17102 -1909 -929 3661 2647 271 -8185 -21087 -13159 12087 19219 8816 -2916 -9933
26347 -9933 -13911 -15670 -420 -447 -5339 -25369 -15817 -7694 -17763 -32607 -34816 -25945 -24302 -32660
26333 -32660 -28104 -28768 -30330 -20197 -32859 -43242 -25079 -10327 -10317 -15082 -25367 -23373 -18033 -12773
26319a2773K867k0868J3116J2053J3687M01p904j2836j833k273K023J8923J2913
26306A7496m341j2125j1267J977J8634J208q993p2Q704L697r891M845j1119j7869
26292a9116o711k350P475J956j7008m213J9281K107J8461J6814Q223p510r084
26279H325l792j5498j1025m861J5046R520L502J1287n255j5225O376l530j0740
26266a5870k491J613J1800R09r855o639N8J2188R431m477N334r130j096k8L899
26251d354O451j0144O471k0834J5524J1346j0883k1802j3217m860j4506k857Q22
26238f2843J1999J6654K4213J5409N36K911j7127m983O588j0435N354Q644L463
26225C83k279Q79J2736j0091j7258o215q08O384K215J2072L722J572j4935N67
$$ plain form
26319 -12773 -9906 -30774 -17658 -5605 8082 8483 579 -12257 -14090 -16363 -14340 4583 17496
26306 17496 13155 1030 -10237 -8260 10374 11582 2589 2517 11221 14918 5027 9872 -1247 -19116
26292 -19116 -25827 -28177 -20702 -18746 -35754 -39967 -20686 -18579 -118 16696 24919 17409 8325
26279 8325 4533 -10965 -21990 -26851 -11805 -2285 1217 12504 7249 -7976 -1600 -5130 -15870
26266 -15870 -18361 -16748 -4948 -4039 -13894 -20533 -20475 -8287 1144 -3333 2001 -7129 -8225 -8253 -4354
26251 -4354 2097 -8047 -1576 -22410 -6886 4460 -6423 -28225 -41442 -46302 -60808 -63665 -62843
26238 -62843 -50844 -34190 -9977 5432 5968 8879 -8248 -13231 -6643 -17078 -11724 -3080 383
26225 383 -1896 -1017 11719 1628 -15630 -21845 -22653 -16269 -14054 -1982 1740 3312 -11623 -11056
26211a1056M995J1511j5408j6607o894J2585J0506q577j2812J6872m085j688p35
26198b1393O567L029O740j0172j1454J0110J039J3253J1611L412l444j7073J3227
26185E452N612L289m844K580Q923p651n780R061o105m930J594J047j1286r993
26171a3031j4325J0413R882j1745J0170J8656Q159k1308j0485K1243j494j4840
26159h705j0164J2142J7506Q2r828j0769N966k460q20j0638l502k981O683j1654
26145b9142O823J1953R068K3261J2880j5486k0509k0405p39J2901L150n064o285
26132a7594r703L1154K4661j2982j2682j6878k058K1955N299j297P28j1232p592
26119h221J3625J6341k2549o389o303M72m136k019J4219J7568o633O397J2108
$$ plain form
26211 -11056 -6061 5450 -9958 -26565 -33459 -20874 -10368 -18945 -31757 -14885 -18970 -20658 -21393
26198 -21393 -14826 -11797 -5057 -15229 -26683 -16573 -15534 -2281 9330 12742 9298 -7775 5452
26185 5452 11064 14353 9509 12089 21012 13361 7581 16642 10537 5607 7201 8248 -3038 -13031
26171 -13031 -27356 -16943 -7061 -18806 -8636 10020 18179 -3129 -13614 7629 6135 -8705
26159 -8705 -18869 -6727 10779 10861 1033 -9736 -3770 -6230 -7050 -17688 -21190 -24171 -17488 -29142
26145 -29142 -22319 -10366 -1298 21963 34843 19357 -1152 -21557 -22296 -9395 -6245 -11309 -17594
26132 -17594 -27297 3857 28518 15536 2854 -14024 -16082 5873 11172 9875 10603 -629 -8221
26119 -8221 5404 21745 -804 -7193 -13496 -13024 -17160 -19179 -4960 12608 5975 12372 24480
26106B4480k2792j2656P825O606o300M965k3043k243J4405R65j1235j6517n770
26093d1310M937J8925J5285L494J034j2106j084j0262l394M708K725L306J2514
26080a228M247o058j5054L787J4884j2451P72J2220N982j051J466P335j0861R206
26066A3196P767j6660P312n42j0755N796j481J410L316Q491l2875j9707J2325
26053b2407K2253J4053L454l087k7356j6973K572O279R467l763M825P251M436
26040A004p496J7876J196k3645J2776l303N661l129j0927L59M858j8509r193P022
26026b5450R360q38Q458O502R63j666k711q941m355j3779L047R155q230o350J3166
26011b1669m700J3881J0597r730J2589Q49k1878Q585J8339j0410q342Q123P29
$$ plain form
26106 24480 1688 -10968 -3143 3463 -2837 2128 -20915 -23158 -8753 -7788 -19023 -35540 -41310
26093 -41310 -36373 -17448 -2163 1331 2365 -9741 -10825 -21087 -24481 -19773 -17048 -13742 -1228
26080 -1228 3019 -3039 -18093 -14306 578 -11873 -11101 1119 7101 6050 7516 14851 3990 13196
26066 13196 20963 4303 11615 11073 318 6114 4633 6043 9359 17850 -15025 -34732 -22407
26053 -22407 -154 13899 17353 14266 -13090 -30063 -27491 -21212 -11745 -15508 -10683 -3432 1004
26040 1004 -6492 11384 12580 -11065 1711 -1592 4069 940 -9987 -9628 -4770 -23279 -32472 -25450
26026 -25450 -16090 -16928 -8470 -1968 -1005 -2671 -5382 -14323 -18678 -32457 -29410 -20255 -28485 -34835 -21669
26011 -21669 -26369 -12488 -1891 -11621 968 1817 -20061 -11476 6863 -3547 -11889 -3766 -3037
25998c037Q519j3201q10M822P37k650k054n23Q35Q61j1773r094J6166J0023j773
25983b952j3155r866m689L506M962q932j3111K404R114Q566J6354J7921k323J6904
25969B4703O807k1627n875J1601m23J697J86j746J5898J604k9204j7436j6475
25956c0290j115J9143m006j2457p313J5337J8078R916O538n151j8839M261j3966
25943a9864O938R333K2395J8431j0726k2193j6210n075L861j4974l57L612j746
25930b6575J5654N241o155k747K913L524P247k5690o329L640J6764K475l295J7754
25916D421L3306P107q912o347j2172k4500j0494j1962Q433N225r759J4537n740
25903a6857M999J3530N911J878j6541J5416J4102j7515n654j069k267J791l92
$$ plain form
25998 -3037 5482 -7719 -8529 -3707 -2970 -5620 -7674 -8197 -7362 -6501 -18274 -27368 -11202 -1179 -2952
25983 -2952 -16107 -25973 -30662 -27156 -22194 -31126 -44237 -41833 -32719 -24153 -7799 10122 7799 24703
25969 24703 31510 9883 4008 15609 15186 16883 17069 15323 31221 32825 3621 -13815 -30290
25956 -30290 -31405 -12262 -16268 -28725 -36038 -20701 -2623 7293 13831 8680 -10159 -5898 -19864
25943 -19864 -12926 -3593 18802 37233 26507 4314 -11896 -16971 -13110 -28084 -28441 -24829 -26575
25930 -26575 -10921 -5680 -11835 -14582 -11669 -8145 -898 -26588 -32917 -29277 -12513 -10038 -13333 4421
25916 4421 37727 44834 35922 29575 17403 -7097 -17591 -29553 -21120 -15895 -25654 -11117 -16857
25903 -16857 -11858 1672 7583 9461 -7080 8336 22438 4923 -731 -1800 -4067 -2276 -2668
25890b668P344L151p790K345J3383j2606p685L875Q246k266R398L760o608j2687
25876h08m682j1499R709J4798J5958j3826k0882m473J8684q613J0140J3622j3209
25863D919K12r170j3478l096J5625J9666K292k4078k1202J5720N022J172k3169
25850b9565L398K5271p671R173J3048l516O931l055P36j5172q03q25k601l210
25836g861O821J8487M513j5603p279o974j5590j8039L662J1056J3406k81J6363
25823B681J0502l598J1646P446j9067o552m59k220l385J2601k513m977P464q795
25809G74o622J155M057K785m91j2739J2435J0732n892j0440j3382L873K701L955
25795g099J8674r411j4065k026p157l080l016J6049J9107J4156N913o661j4399
$$ plain form
25890 -2668 4676 7827 37 2382 15765 3159 -4526 -651 7595 5329 14727 18487 11879 -808
25876 -808 -5490 -16989 -7280 7518 23476 9650 -11232 -15705 2979 -5634 4506 18128 4919
25863 4919 5131 -4039 -17517 -20613 -4988 14678 16970 -7108 -28310 -12590 -7568 -6396 -29565
25850 -29565 -26167 -896 -8567 606 13654 10138 17069 14014 14750 -422 -1225 -2050 -4651 -7861
25836 -7861 -1040 17447 21960 6357 -922 -7896 -23486 -41525 -37863 -26807 -13401 -13682 2681
25823 2681 13183 9585 21231 28677 9610 3058 2599 379 -3006 9595 7082 2105 9569 774
25809 774 -5848 -4693 -636 2149 1658 -11081 1354 12086 6194 -4246 -17628 -13755 -11054 -7099
25795 -7099 11575 2164 -11901 -13927 -21084 -24164 -27180 -11131 7976 22132 28045 21384 6985
25782F985q493n101J1070J0961L865M90l1426L513J115j8594k5559N866J8382
25769b6926L976J0740O804O218N389N809n83j19K906j1995o581j6070o056J469
25755b5019J695l21j3712P161J0638J3803P575o114J3252J6237k211J766j0419
25742A4331K651m889r195M67p809j041O359o474m549k410J3039j2847R868J8095
25728A5596k095l750O244n684R408J1245p216q554J3114j5908j5839N502p131
25715e068M75n077q821j2609P185O545R010J1248j0540L440R811J163j1126o507
25701a0871J0283J918n105O215j8931j961J5853K065j5647J4609K529j1956q303
25688a9302j542O050k0414K113J3316M418m315o516k51P416O724M676K9973l703
$$ plain form
25782 6985 -1508 -6609 4461 15422 19287 19777 -11649 -8136 -7021 -25615 -51174 -45308 -26926
25769 -26926 -22950 -12210 -5406 812 6201 12010 11427 11308 14214 2219 -4362 -20432 -26488 -25019
25755 -25019 -23324 -23645 -37357 -30196 -19558 -5755 1820 -4294 8958 25195 22984 24750 14331
25742 14331 16982 12093 2898 3365 -4444 -5485 874 -5600 -10149 -12559 480 -12367 -2499 15596
25728 15596 13501 9751 15995 10311 19719 30964 23748 15194 28308 12400 -3439 2063 -5068
25715 -5068 -4593 -9670 -18491 -31100 -23915 -17370 -8360 2888 -7652 -4212 5599 6762 -4364 -10871
25701 -10871 -588 1330 -3775 2440 -16491 -18452 -2599 -534 -16181 -1572 957 -10999 -19302
25688 -19302 -20844 -14794 -35208 -33095 -19779 -15361 -19676 -26192 -26443 -19027 -12303 -7627 22346 18643
25674A8643j7866m244j6022K878J6355O974Q156j004o901M013k0037L716J0212
25661D873Q769O583j872J3331L948p441n710L090O412j325j817O406N596j3049
25647B7794l7497j6121n586K4273K1697k604o164J4455m64o465j3685r785j3192
25634b3344n064J2417p441K8106J7929q543j4446M205k384m765M089R725J174
25621A1658j3645k1220J0094n813j2146J979M995M666P444J6635m931r540j8454
25608b8278k918J9814K0930J2179j3201j149l794p134j9520P384j0966K196j973
25595b6430J872J4316R782M002j8953j5280R221J7569K2410j9958k5863K457M581
25582b0274R962J2118J4274N593j6206m946j3652k0030O457J8145P961J9609K2526
$$ plain form
25674 18643 777 -3467 -19489 -16611 -256 6718 14874 13870 6969 10982 -9055 -5339 4873
25661 4873 13642 20225 18353 31684 35632 28191 22481 25571 31983 30658 28841 35247 40843 27794
25647 27794 -9703 -25824 -31410 -7137 14560 11956 5792 20247 19783 13318 -367 -10152 -23344
25634 -23344 -28408 -15991 -23432 4674 22603 14060 -386 3819 1435 -3330 759 10484 11658
25621 11658 -1987 -23207 -13113 -18926 -31072 -29093 -24098 -19432 -11988 4647 -284 -9824 -28278
25608 -28278 -31196 -11382 9548 21727 8526 7377 3583 -3551 -23071 -15687 -26653 -24457 -26430
25595 -26430 -24558 -10242 -460 3542 -15411 -30691 -21470 -3901 18509 -1449 -27312 -24855 -20274
25582 -20274 -10312 1806 16080 21673 5467 521 -13131 -33161 -26704 -8559 -598 19011 41537
25569D1537K601j0231j8975j5144J883K892P618L058j4265o887j693J4630P770
25556A4794o183j3919n226M56N648J0393J006j4838P658K2669j2453j3345N380
25543B040k134N285q360L446J1269J6806j1884j8108j494l35P681K883k497J703
25529F301j108R56J3515j3032K263R663j7833R180J9386M660n027k3148j0662
25516d886o273N549J7512M371m658k2102J340k538k1429J1179J3998K43J6563
25503H869N876O473N644l006k0329k8129m87J7780R912k370J65j7048o639O849
25489a6440K090L588j1166R460K55K582k9207m547J3348j3512r39P565R46K2526
25475a3451q123P90K3116l44m288k970r819K282K745p343P022J7160k3561L070
$$ plain form
25569 41537 44138 33907 14932 -212 1671 4563 12181 15239 974 -5913 -7606 7024 14794
25556 14794 8611 -5308 -10534 -10078 -4430 5963 6969 -7869 -211 22458 10005 -3340 2040
25543 2040 -94 5191 -3169 277 11546 28352 16468 -1640 -3134 -3469 4212 7095 4598 6301
25529 6301 5193 6149 19664 6632 8895 18558 725 9905 29291 33951 28924 5776 -4886
25516 -4886 -11159 -5610 11902 16273 11615 -10487 -9147 -11685 -33114 -21935 -7937 -7694 8869
25503 8869 14745 21218 26862 23856 3527 -24602 -25089 -7309 2603 233 398 -16650 -23289 -16440
25489 -16440 -14350 -10762 -21928 -12468 -12213 -9631 -38838 -43385 -30037 -43549 -44488 -36923 -35977 -13451
25475 -13451 -21574 -20784 2332 1988 -2300 -5270 -15089 -12807 -10062 -17405 -10383 6777 -16784 -13714
25461a3714K16j1304q076R717j524L157J7762J4688P30j6807j1249n211J8245
25448c370M814M461O775r958l813J1818J1119j5320q272P188j1959M44j6131O51
25434b1553J6877J1218K690k5083l645K990J5637M893N809n821j2458P093K2232
25421B0879M26k3462j6872J5283j353j7687M838K0287o64j7315j616K540J0123
25408d593J7290r995q740q25J104R09n019l803J5304M125J4397k571k5277k3598
25394c1292K9540J0754k2622p577J2527J041k959J8050K2507P838j3591J174q437
25381A6953n621m861J5726J5353o385p206l366M62n022j0025j9204j0176n779
25368b9151L553M764J2283J3148o226k3664J6576J2289m374j1871j4414J3250
$$ plain form
25461 -13714 -13498 -24802 -32878 -23161 -24685 -21528 -3766 10922 11652 -5155 -16404 -21615 -3370
25448 -3370 1444 5905 12680 2722 -1091 10727 21846 6526 -1746 5442 -6517 -6073 -22204 -21553
25434 -21553 -4676 6542 9232 -15851 -19496 -16506 -869 4024 9833 4012 -8446 -1353 20879
25421 20879 21305 -2157 -19029 -3746 -5099 -22786 -17948 2339 1675 -15640 -17256 -14716 -4593
25408 -4593 12697 2702 -6038 -6863 -5759 -4850 -9869 -13672 1632 5757 20154 17583 -7694 -31292
25394 -31292 -1752 9002 -13620 -21197 -8670 -7629 -10588 7462 29969 37807 24216 25390 16953
25381 16953 11332 6471 22197 37550 31165 23959 20593 21055 16033 6008 -13196 -23372 -29151
25368 -29151 -25598 -20834 -8551 4597 -1629 -25293 -8717 3572 -802 -12673 -27087 -13837
25356a3837J8825K7039K6021j5945j3398j0609j3432j004k014j949p109M521r561
25343a2452j969p569P971M365l004j0704j979J0449K2118P781o717J2942j094
25330B0138k8785k4657J227J6806p940M65P401K3155L113K553j350k0995j0524
25317a9393O803J731R474K0610J3711j9698j9305P191p76J884j1992l027J623
25304a1164K2492J6121J842r516j1079n983R474l153K282q440n934P134J5911
25291A9987J0629j1094j7517p860L785j9278k903Q493K221j714j7579J1803K0572
25278d55k632j4954K2218J0917j4639j9961J3809J1594j797m808J549j0804P355
25265b608J8537Q404K349j323j6173Q309j3050n533L741j0881n914J5509K703
$$ plain form
25356 -13837 4988 32027 58048 42103 28705 18096 4664 3660 1646 -303 -7412 -2891 -12452
25343 -12452 -14421 -21990 -14019 -9654 -12658 -23362 -25341 -14892 7226 15007 8290 21232 20138
25330 20138 -8647 -33304 -32077 -15271 -23211 -22746 -15345 7810 10923 13476 12126 -8869 -19393
25317 -19393 -12590 -10859 -1385 19225 32936 13238 -6067 1124 348 2232 -9760 -12787 -11164
25304 -11164 11328 27449 29291 19775 8696 2713 12187 9034 11316 2876 -3058 4076 19987
25291 19987 30616 19522 2005 -5855 -2070 -21348 -24251 -15758 -13537 -15251 -32830 -21027 -455
25278 -455 -3087 -18041 4177 15094 455 -19506 -5697 5897 4100 -708 841 -9963 -2608
25265 -2608 15929 24333 26682 25359 9186 17495 4445 -1088 2653 -8228 -14142 1367 4070
25252D070O381k2k0879k6145L788O906l14J2279j6127j99J5951K1244k962J7931
25238B1902j056p600j002o775j4496Q343Q782J1215L515p054j3716k685M347l163
25224E57k572j7838P896J4249Q971J6695J8241l0086j9801q738Q926O782l911
25211f29o198J869l666J287q529n706J4983J7990q549j9477n469J7873J2398p301
25197H76n453j3322J1160K007m349o265O779J1986J4415O011j2620p327J4502
25184A8400J0212L11j4556p662j1122R437p321j4486r861k514J816R253N365N526
25170g202N795O655Q530j3213q32l426j4137K3927J8033J776q923j3033o214Q087
25156E823M508n587m964p534o067P769J0583k4994j713j707q473J1449J7599Q089
$$ plain form
25252 4070 10451 10429 -10450 -36595 -32807 -25901 -26215 -13936 -30063 -30262 -14311 6933 3971 21902
25238 21902 20846 13246 12244 5469 -9027 -684 8098 19313 22828 15774 2058 -627 3720 557
25224 557 -2015 -19853 -11957 2292 11263 27958 46199 16113 -3688 -12426 -3500 3282 -629
25211 -629 -6827 -4958 -8624 -7337 -15866 -21572 -6589 11401 2852 -16625 -22094 -4221 8177 876
25197 876 -4577 -17899 -6739 -4732 -9081 -15346 -8567 3419 17834 23845 11225 3898 18400
25184 18400 28612 28923 14367 6705 -4417 5020 -2301 -16787 -26648 -29162 -27346 -18093 -12728 -7202
25170 -7202 -1407 5248 13778 565 -267 -3693 -17830 6097 24130 25906 16983 3950 -2264 5823
25156 5823 10331 4744 -220 -7754 -13821 -6052 4531 -20463 -22176 -23883 -32356 -20907 -3308 4781
25142D781J585j8040J6727J4165j3966j5511O342L3169N674o577j8843k1912k667
25129a5073q958M106J2450q024r64p281r326L87K0852J2199j2040k4666k597J3573
25115b5362R423l796K391J3866J7296m300m794P780k567q359O69m212J0954l848
25101E141j3622K1114l241j3406p674j3756L325N413p128R415m979j9093o218
25088d4709j615j3518L582J1261K7688J6865K434Q600l378j744n068j6889m143
25075b0634L7465j2120M189J5096k0581p737J3548J4622L284k1748j6693K2890
25063A1581p578j8618r391Q093J4042r932M590K599K747n684K0822k580n809k86
25049D596K3936q378P780Q307o202LJ63k411j3789j3379J062J8267n543O443j605
$$ plain form
25142 4781 6366 -11674 5053 19218 5252 -10259 -3917 29252 34926 28349 9506 -12406 -15073
25129 -15073 -24031 -19925 -7475 -15499 -16463 -23744 -33070 -32683 -11831 368 -11672 -36338 -38935 -25362
25115 -25362 -15939 -19735 -17344 -3478 13818 9518 4724 12504 9937 1578 2247 -1965 8989 5141
25101 5141 -8481 12633 9392 -4014 -11688 -25444 -22119 -16706 -23834 -14419 -19398 -38491 -44709
25088 -44709 -46324 -59842 -56260 -44999 -17311 -446 1988 10588 7210 5466 398 -16491 -20634
25075 -20634 16831 4711 8900 23996 3415 -4322 9226 23848 27132 5384 -11309 11581
25063 11581 4003 -14615 -24006 -15913 -1871 -11803 -7213 -4614 -1867 -7551 13271 10691 4882 4596
25049 4596 28532 20154 27934 36241 30039 30042 30205 27794 14005 626 1688 19955 14412 20855 19250
25034A9250k1317l667J1304P781o479P79J4085j528j4933p062k225N13K27j2373
25020a5645J4573K4526q456p600O238L715j6134j0286K329K9254J2643n328k262
25007B7567l880r753n113k1885l966N552J7636K9775q865k5564j0732Q68M302
24994d058Q479J2605M036j0046k8188n81L880q114j2641J1771P812q860K523J8128
24980c254K6702q685j9277J8875R04o978J082Q032k759k994k950k814J5464N618
24966B6966Q58j7464Q016J092L777j8649j4127J1991m695j2529N317J5128L647
24953I328l060O713n776r075k3910m86J1749k143N420m579Q458O142j3210P029
24939g400K35J2020q966L878Q552R881P288J4516r800k1091J3872K0479o326j5439
$$ plain form
25034 19250 -2067 -5734 5570 13351 6872 7651 21736 20208 5275 -1787 -4012 -3499 -3272 -15645
25020 -15645 -1072 23454 14998 7398 13636 17351 1217 -9069 -6740 22514 35157 29829 27567
25007 27567 23687 13934 8821 -13064 -17030 -11478 6158 35933 27068 1504 -9228 -8360 -4058
24994 -4058 4421 17026 21062 11016 -17172 -17753 -13873 -21987 -34628 -22857 -15045 -23905 -21382 -3254
24980 -3254 23448 14763 -4514 14361 15265 8287 9369 17401 14642 11648 8698 5884 21348 26966
24966 26966 27824 10360 18376 19468 23245 4596 -9531 2460 -2235 -14764 -9447 5681 9328
24953 9328 6268 12981 7205 -1870 -25780 -26266 -14517 -16660 -11240 -15819 -7361 -1219 -14429 -7400
24939 -7400 -7165 4855 -4111 -233 8319 18200 25488 40004 30204 9113 22985 43464 37138 21699
24925B1699m610J2781j1943k1389J0189J884j3195n95p356K842q726j1480q35
24912c0734K1455j481j2136P805o320M781r477M633K090K190j985M150J3884p273
24898h418j7456P189l8r255m804m747M561J8945J1133J709O625O593j0406j264
24884C67m232J6716m206j3180k442j0694p349k189n885J1028J8574j4399p254
24871b5145N406N072O530j148O534M86n733j955r259o238P433J9299J6030P515
24857B4827j2171N364M145q924j5841j4137k7681M340K2987O368o60j3793l097
24844b8273K136O754o803m048j3012J9763K1028J2217J0218j0576j939j515k6086
24831b0136p982o74J0562O534K512l943q261L569L1558N59k5485P721N638r350
$$ plain form
24925 21699 17089 29870 17927 -3462 6727 8611 -4584 -5179 -12535 -9693 -18419 -29899 -30734
24912 -30734 -9279 -10760 -22896 -15091 -21411 -16630 -26107 -21474 -19384 -17194 -19179 -15029 -1145 -8418
24898 -8418 -25874 -18685 -18723 -27978 -32782 -37529 -32968 -14023 -2890 -1181 5444 12037 1631 367
24884 367 -3865 12851 8645 -4535 -6977 -17671 -25020 -27209 -33094 -22066 -3492 -17891 -25145
24871 -25145 -19739 -14667 -8137 -9285 -2751 -2265 -7998 -9953 -19212 -25450 -18017 1282 17312 24827
24857 24827 12656 18020 22165 13241 -2600 -16737 -44418 -40078 -17091 -10723 -11383 -25176 -28273
24844 -28273 -26137 -19383 -26186 -30234 -43246 -23483 -2455 9762 19980 9404 7465 5950 -20136
24831 -20136 -28118 -28792 -18230 -11696 -9184 -13127 -21388 -17819 13739 14298 -11187 -3466 2172 -7178
24817g178J6167J7440O15p312j9426k9637p630J3428m840j109M281J7368p687
24804a5520k2997P34J8590K0743J3058K4l86j0511q784m19o845K6954J4204j762
24790B7083J385q335j032j6292k1576O260Q044l855j215j2404P39J2596J1013
24777B411J6028k230l361K9641m822l2520j4888K2800J5499K077l179p825m066
24764A5565j6333q150J2994j2527N707K3195L838J0899k507l4528j2889J7881
24752C145j0816j0790j813J2210J6220q54J6953j081k0659r790J25J2356j7532
24739a2326q614K594J3123J5943K77O25N922m028P052N650n618j2108K528O624
24725A7644o004j8078j8134o751J7961K3228P034M372j4456k7383J5351K0691
$$ plain form
24817 -7178 8989 26429 27044 19732 306 -29331 -36961 -23533 -28373 -29482 -25201 -7833 -15520
24804 -15520 -38517 -37783 -19193 1550 14608 14632 14246 3735 -5049 -5468 -12313 14641 28845 27083
24790 27083 28468 20133 19101 2809 -18767 -12507 -4463 -8318 -9533 -21937 -21198 -8602 2411
24777 2411 18439 16209 12848 42489 37667 5147 -9741 13059 28558 30635 27456 19631 15565
24764 15565 -768 -8918 4076 -8451 -2744 20451 24289 35188 32681 -1847 -14736 3145
24752 3145 -7671 -18461 -20274 -8064 8156 7302 24255 23174 2515 -7275 -7150 5206 -12326
24739 -12326 -20940 -18346 -5223 10720 10997 11622 17544 13516 20568 26218 20600 8492 11020 17644
24725 17644 11640 -6438 -24572 -31323 -13362 9866 16900 21272 6816 -20567 -5216 15475
24713A5475r728k0905N546j828Q738j9014o530J9929J0085k384l985k851J0300
24700B848R098R324n864j5135J910O121j3439j2663j781M955N535J3900k586P553
24686I776k31j2608p333N183R564K0063K2764l343k7207m917J2109J234j0188
24673A4866M8J5034j9456N03j1486j7328j794J1035K3715m375P144J1498N722
24660C5126j1821j2718k436M800O67j4011j4647O369P444j8031K2270O636M77
24647A0125J2122J8994q451n794j262N942k81P976j3858j3728J2621o766p46J5907
24633C2801L27j0886j6443l841O686K039n896M349P623r777J0891k165j1819j2515
24619h626N132J7424l263j995q56M850J7404N072l9520k7729J1369J3504J465
$$ plain form
24713 15475 5747 -15158 -9612 -11440 -2702 -21716 -28246 -8317 1768 -616 -4601 -7452 2848
24700 2848 11946 21270 15406 271 2181 8302 -5137 -17800 -19581 -14626 -9091 4809 2223 9776
24686 9776 9545 -3063 -10396 -5213 4351 24414 47178 43835 16628 11711 23820 25054 14866
24673 14866 14914 29948 10492 10995 -491 -17819 -19613 -8578 15137 10762 17906 29404 35126
24660 35126 23305 10587 8151 12951 13618 -393 -15040 -8671 -1227 -19258 3012 9648 10125
24647 10125 22247 41241 32790 26996 25734 31676 31395 39371 25513 11785 24406 17640 16894 32801
24633 32801 33128 22242 5799 1958 8644 10683 4787 9136 16759 6982 17873 15708 3889 -8626
24619 -8626 -3494 13930 10667 8672 7816 12666 30070 35142 -4378 -32107 -20738 -7234 -5769
24606e769p311r618k298q546q155M647K9330K6289K6086j425q094q207n919k8514
24592g504k5689J2710J9283J7214m226n818J5616j0363k7890k045L079k8830j482
24579d5945L2945J7712J5905M911P106K5660k0608j6114m452n567j5448M472O057
24566F634N859J8778j4093j526m368l004J1831p666m689L010m503L970J3787j0896
24552A3124j2742J6728L429q02j1888j341Q613o729j6560J1481P333N396j2O636
24538B2666j5233j5696k2403k179J2320N937q534P985N091J8231m145n022J3984
24525A3002J1970p052Q03P679M5J1476P524J704R359k8814j1350k0093o1j1848
24511a5656j0408J2140L0858k194k8544M806J0301L410M089o175j7799l501J6194
$$ plain form
24606 -5769 -13080 -22698 -24996 -33542 -41697 -37050 -7720 18569 44655 43230 35136 26929 21010 -7504
24592 -7504 -33193 -20483 -1200 16014 11788 5970 21586 11223 -16667 -18712 -15633 -44463 -45945
24579 -45945 -13000 4712 20617 25528 32634 58294 37686 21572 17120 11553 -3895 577 6634
24566 6634 12493 31271 17178 15652 11284 8280 20111 12445 7756 10766 6263 10233 24020 13124
24552 13124 382 17110 20539 19737 7849 6508 15121 8392 -8168 3313 10646 16042 16030 22666
24538 22666 7433 -8263 -30666 -32845 -20525 -14588 -23122 -15137 -10046 8185 4040 -982 13002
24525 13002 24972 17920 18723 26402 26447 37923 45447 47151 56510 27696 16346 -3747 -3808 -15656
24511 -15656 -26064 -13924 16934 14740 -13804 -8998 1303 4713 8802 2627 -15172 -18673 -2479
24498b479J56M251N431l991K2556j803o484J989n695q178J5960n947j059m808
24484I899m80K2144O944k8318k5924J3929M81N489K2468l005j5274K295P034O858
24470B4540p405j4692n985m71j8594p577J3421P673j2229J1707N209M935n086
24457d554m338n307L558K1414P420l966R042m863j3306j709J0439N975Q228J4338
24443D2371p962k5063j2268R239m02q718J8425Q437l1880r298n837J5806J2356
24430E206o867j724N752O231J5915J6536j3029j9093r053R299K7871O022j2822
24417C0244j2526j0955q924N74L373K958m733q701k1408l092K2064J4278K2356
24404B5508p409m629R226M895J9208j8502j3965q368J6751o96n366o987j625k774
$$ plain form
24498 -2479 -2323 1928 7359 3368 25924 24121 17637 19626 13931 5753 21713 15766 14707 9899
24484 9899 9419 31563 38507 10189 -15735 -1806 -1325 4164 26632 23627 8353 10648 17682 24540
24470 24540 17135 2443 -3542 -4013 -22607 -30184 -16763 -9090 -21319 -9612 -4403 532 -4554
24457 -4554 -8892 -14199 -10641 10773 18193 14227 23269 18406 5100 3391 13830 19805 28033 42371
24443 42371 34409 9346 -2922 6317 5915 -2803 15622 24059 -7821 -17119 -22956 -7150 5206
24430 5206 -1661 -3385 2367 8598 24513 41049 28020 8927 -126 9173 37044 43066 30244
24417 30244 17718 6763 -2161 -1587 1786 4744 11 -8690 -30098 -33190 -11126 3152 25508
24404 25508 18099 13470 22696 27591 46799 28297 14332 5964 22715 22019 16653 9666 8041 5267
24390E267j5821J525K6379J9104q650j8545Q80j0446O187n552j599N025k459j400
24376a05K4070Q670l156j3021r891K5083J9344j9950k2013M104j268l079l489
24363E299q369J2047P608n733l943M993r980r273N260m556j1388m845J8795R314
24349E229j4054J3796K1683p458j0534O441k440j3697o32R042K788O015J2865
24336B9044r185n958j0372j353j0938l813o79J1995Q961n635j7730j2339K396
24323b5606J3266Q143p561K227k482m684J8434J4469q379j7333p11Q249j1580
24310a3548N034K4634J1301M401j0569j8362j0405O248R305J1718O498k4763j5838
24297a4346J8517N193O670J2876J1555n491j606Q047j2105N13Q200m832k5339
$$ plain form
24390 5267 -10554 -9029 17350 36454 27804 9259 10139 -307 5880 328 -1271 3754 1295 -105
24376 -105 23965 32635 29479 16458 6567 31650 50994 31044 9031 13135 11867 8788 5299
24363 5299 -3070 8977 16585 10852 6909 11902 1922 -7351 -2091 -6647 -18035 -22880 -4085 5229
24349 5229 -8825 4971 26654 19196 8662 15103 12663 -1034 -1666 7376 10164 16179 29044
24336 29044 19859 13901 3529 2176 -8762 -12575 -13254 -1259 7702 2067 -15663 -28002 -25606
24323 -25606 -12340 -4197 -11758 -9531 -12013 -16697 1737 16206 7827 -9506 -10217 -1968 -13548
24310 -13548 -8514 16120 27421 31822 21253 2891 -7514 -1266 8039 19757 26255 1492 -14346
24297 -14346 4171 9364 16034 28910 40465 34974 33368 41415 29310 29823 38023 33191 7852
24284G852q656J3559Q747l093m190j080J8931O986q015l793k3160j4391J4942
24271D639K8743q205m987J899N579J5590K963j2958J133m443l3021j2895J6400
24258D37O087K0463N661o706j2365J2689Q36j4754N554o951j0306j0971J753K4267
24244A5694k30p33J1891m627O835J622J2183l582P873r179k2035q107J2572J4980
24230C5157p54k575j1348o019M708J4260j3602j1821j76k102l979M999j642j2659
24216g553J0460O390P111J6221n190o619j5878J8583J4797p090p757j1578j07
24203A1790Q338l319l413n608J2806K0962l976p866K248l631j0213j77q189j1085
24189a333j3667K4914K3454J0208r72j0988j3260J6261m536p510k2049j9980J2332
$$ plain form
24284 7852 -804 12755 21502 18409 14219 13139 32070 39056 31041 27248 4088 -10303 4639
24271 4639 33382 25177 20190 22089 27668 43258 46221 33263 34396 29953 -3068 -15963 437
24258 437 6524 26987 32648 25942 13577 26266 27102 12348 17902 10951 645 -10326 -8573 15694
24244 15694 15464 14731 26622 21995 28830 30452 42635 39053 46926 37747 15712 7605 20177 35157
24230 35157 34403 31828 20480 14461 19169 33429 19827 8006 7830 5728 1749 6748 5106 -7553
24216 -7553 2907 9297 16408 32629 27439 20820 4942 23525 38322 31232 23475 11897 11790
24203 11790 20128 16809 13396 7788 20594 41556 37580 29714 31962 28331 18118 17941 9752 -1333
24189 -1333 -15000 9914 33368 43576 42604 31616 18356 34617 30081 22571 522 -19458 -7126
24176g126J7478J482L703L461k62M03q66P141j3216j0873K1234L636k4529j3958
24162a2292J7059J5712J433k338l297R176K2672o395k8405k0295N645J0932L198
24149A2805m644k938o169M939N208M765J0328j1598m330P865M659J5452j9730
24136A6612k3343L252m049K10O609m065j0504j359J7938J4143o985J6383k586
24123B2256m736K1022Q289r084j6957j2910k7221j5241N124M216J6902N297j1049
24110a4092p707Q257J1912N266J46K741K5658L81n474m276o78o415k2836j1754
24096a8871l16O096R248L1741Q932j5712n427K167l411j0353j224n565L726N099
24082F130J0019p135q833J788K0899l61j5480K251O059J877j0423O289o226p074
$$ plain form
24176 -7126 10352 11834 15537 18998 18736 19139 18273 25414 12198 1325 22559 26195 1666 -12292
24162 -12292 4767 20479 21912 19574 16277 25453 48125 41730 13325 -6970 -1325 9607 12805
24149 12805 8161 5223 -946 3993 9201 13966 24294 12696 8366 16231 20890 36342 16612
24136 16612 -6731 -3479 -7528 -7318 -709 -4774 -15278 -16637 1301 15444 8459 24842 22256
24123 22256 17520 38542 46831 37747 20790 7880 -19341 -34582 -29458 -25242 -8340 -3043 -14092
24110 -14092 -21799 -13542 -1630 3636 3782 6523 32181 32562 27088 22812 22134 15719 -7117 -18871
24096 -18871 -19187 -13091 -3843 27898 36830 21118 15691 17858 14447 4094 2870 -2695 1031 6130
24082 6130 16149 9014 181 1969 22868 22507 7027 9278 15337 17214 6791 13080 6854 -220
24068b20M911j1313j6011K209j741k458j078J4304J2583J08L939J005M585J0944
24054B1767M91l035j6456J005J914j1370n759q40O863J2063j9993K8052N425r397
24040A0730J919L561j7921J533J4682O869j1297J4896k829L30K550o217j1912
24027F894N668n085J471j3101N032K5129n906n570J0840K832j3888k479J589J0061
24013B3487P224J124R461Q038j6446j2592L300q669Q691N28r680j0240N849O06
23999A0681R918j2334k5951O08n742O491L1777J2042k636R952J2222O112n616
23986D7524k2581k0440P371K0638j0792k0412L522M294K326j0946N878k3434J4140
23973b912J5283J1558j5092p761O02P936L489N996N80J3459O097m304r766K892
$$ plain form
24068 -220 4691 -6622 -22633 -20424 -22165 -24623 -25701 -11397 1186 1294 5233 6238 10823 21767
24054 21767 22258 19223 2767 3772 5686 -5684 -11443 -12283 -5420 6643 -13350 14702 20127 10730
24040 10730 12649 16210 -1711 -178 14504 21373 10076 24972 22143 22473 25023 18806 6894
24027 6894 12562 7477 8948 -4153 879 26008 20102 14532 25372 28204 14316 11837 13426 23487
24013 23487 30711 31835 41296 49334 32888 20296 23596 14927 23618 24146 14466 4226 10075 10681
23999 10681 20599 8265 -17686 -17078 -22820 -16329 15448 27490 24854 34806 47028 53140 47524
23986 47524 24943 4503 11874 32512 21720 1308 4830 9124 11450 504 6382 -17052 -2912
23973 -2912 12371 23929 8837 1076 1678 9614 13103 19099 19679 33138 39235 34931 25165 28057
23959B8057o486q257O016m976J158P689n195q518j6296N31P941k3425k24K5287
23945C302N386R91J5755O200R997j269j0266q284j1282P825O687m341r793j12
23931A0796O238P711K348O262J1791k129r087n113m214n029j0880j1893L709m506
23917c996j4676n67J4669Q935J5397o413j8652j3195L22J2770J8061k1470l226
23904a2041K6218N780k752N131J5340J0993l780r424L929j8785k764K659q949
23891A1555j064K2189J4572j1333L415q45N968j1640j0880n291m347o641R450
23878A5108R676r175j0908R609l206j3304J6261k133L793N821k2358r927J3693
23865B950K0854n810N750J7923l954j3102m393k6258K176J2038K666j061o867
$$ plain form
23959 28057 21571 13314 19330 14354 15512 23201 18006 9488 -6808 -6277 1664 -21761 -21985 3302
23945 3302 8688 9679 25434 31634 41631 40362 30096 21812 10530 18355 25042 20701 10908 10796
23931 10796 17034 24745 27093 33355 45146 43017 33930 28817 24603 19574 8694 -3199 510 -3996
23917 -3996 -18672 -19239 -4570 4365 19762 13349 -5303 -18498 -18176 -5406 12655 -8815 -12041
23904 -12041 14177 19957 17205 22336 37676 48669 44889 35465 39394 20609 17845 20504 11555
23891 11555 10491 32680 47252 35919 39334 38489 44457 32817 21937 16646 12299 5658 15108
23878 15108 24784 15609 4701 14310 11104 -2200 14061 11928 15721 21542 -816 -10743 2950
23865 2950 23804 17994 23744 41667 37713 24611 20218 -6040 -3864 8174 10840 9779 2912
23852B912j73L51J5984M467m733K2755Q263R487j1431m32j4983n050M955Q09j1859
23837B1322j0259o764P886m181O850j1319l899K1962l296j9344n802j0458L255
23824a4047M807m239M752J7881r738j0003J9206O948j65J4080j6437k858J7811
23811B7998j8264j9496o221K6205Q045j8316q136J604J3015k592j7321O240J0597
23798C358K413J4044P582m348p068l407K0252j2375j1778M28N125J0176J5647
23785D0049K089Q06j548j1690J822R328j4957Q640O629R50l919j281j593L058
23771C8383j6669j1020R017J896j6575k0468J2512J9848Q905l938r232j160N671
23758A7170m558J583j9199Q048q253p770K3267K2569N013j1806j5816m382k4519
$$ plain form
23852 2912 2739 3090 19074 23541 18808 41563 49826 59313 47882 47450 32467 27417 32372 33181 21322
23837 21322 11063 4299 12185 8004 14854 3535 -364 21598 18302 -1042 -6844 -17302 -14047
23824 -14047 -9240 -13479 -8727 9154 -584 -10587 8619 15567 15402 29482 13045 10187 27998
23811 27998 9734 -9762 -15983 10222 18267 -49 -8185 -6581 6434 3842 -13479 -7239 3358
23798 3358 5771 19815 27397 23049 15981 12574 32826 20451 8673 9101 14226 24402 40049
23785 40049 42138 42944 41396 29706 31528 40856 25899 34539 41168 42118 38199 36918 35325 38383
23771 38383 21714 10694 19711 21607 5032 -15436 -2924 16924 25829 21891 12659 11499 17170
23758 17170 12612 14195 -5004 3044 -5209 -12979 10288 32857 37870 26064 10248 5866 -18653
23745a8653M792J4288J8305O254J0521R661j3815p412K177k001j0817r072q712
23732d484k8870J4340K9321R590J0854j574J0335l538N747j3707j404J9481j0652
23719C5439l613P448O368j759j8200j5256j1369M961n699M120J1428J0464j5690
23706H642k5359n070Q550N654P133K8986L566q968j9192j878J2449n24R236R35
23692B4160J272J703k6762M606J1886P996j6814j7758J3667N438j3646r342J6021
23679B427K728P460J3031O072J920o84q712j2461j5740K221j796j995Q878J2412
23665A5761P096n23j3517R282l609R496N362n765L050O54j8297o713P941K8471
23651C8689J5897k0142j7377J877Q108l581j0873o74K0994J2059o524j924n341
$$ plain form
23745 -18653 -13861 427 18732 24986 35507 45168 31353 23941 26118 24117 13300 4228 -4484
23732 -4484 -33354 -19014 10307 19897 30751 29177 39512 35974 41721 28014 26610 46091 35439
23719 35439 31826 39274 45642 43883 25683 10427 -942 4019 -1680 2440 13868 24332 8642
23706 8642 -16717 -21787 -13237 -7583 -450 28536 32102 23134 3942 2064 14513 13989 23225 24160
23692 24160 25432 27135 373 4979 16865 24861 8047 -9711 3956 9394 -4252 -13594 2427
23679 2427 5155 12615 25646 31718 33638 32954 24242 11781 -3959 -1738 -3534 -5529 3349 15761
23665 15761 22857 22334 8817 18099 14490 23986 29348 23583 26633 27287 8990 2277 10218 38689
23651 38689 54586 34444 17067 18944 27052 23471 12598 11924 32918 44977 38453 36529 31188
23638C1188j3598k1748j1841O308J694L573j1095q620J5375J0531j337K0915j859
23625A9486o761Ln15m401K0124j0706j1772J9775j987j5645J0752j724q16J7338
23611C3151m710j3856j1940K0548k838L986q314n796p386j3670K4384K0580m563
23598B9576m385j2101r096q61R914J1609n974o046o312K723j1144l210O98m92
23584e101j431k947K725L436k5954N763K3366O486j6108j6119J3742K6433J0105
23571B4396K795j0467q368j0992n450M831j0573l387J3768k737K22J1819K9057
23558C4914M89j9247K1311J3976o01l2368p22J738m879l065J1401J3153k0582
23545A5518j4741J2423K2617n860q722J3281j7004j0746K2268J2653R107j6150
$$ plain form
23638 31188 17590 -4158 -15999 -9691 -7997 -4424 -15519 -24139 -8764 1767 430 21345 19486
23625 19486 12725 12728 12213 7812 27936 17230 5458 25233 23246 7601 18353 16629 15813 33151
23611 33151 28441 14585 2645 23193 20355 24341 16027 10231 2845 -10825 13559 34139 29576
23598 29576 25191 13090 3994 3133 13047 24656 18682 12636 6324 9047 -2097 -5307 -4609 -5101
23584 -5101 -6532 -9479 -6754 -3318 -29272 -23509 -143 6343 -9765 -25884 -12142 14291 24396
23571 24396 27191 16724 8356 -2636 -8086 -3255 -13828 -17215 -3447 -6184 -5962 5857 34914
23558 34914 35403 16156 37467 51443 50842 18474 17752 19490 14611 11546 22947 36100 15518
23545 15518 777 13200 35817 29957 21235 34516 17512 6766 29034 41687 50794 34644
23533C4644j8759q793k2155L773K6246K2392J2983r659j6732m447q901K161k786
23520I967P666J2241K6608o85j2051n103q886j0019K656R177R777R424K853P249
23506F0874k2754k4476n832p584j9800l962J3314Q602K2499N83j1441O369p833
23493H559P881J5262P799R519k3562k5665P233J3090J5426j2477k2706m787k778
23480g206L056K2959r109K994O485L141j6465P503K0018p916r098J2599K239j0819
23466B0381o209l121Q817R738J3117J293j3202M128L611o444o941q290J585L003
23452B1466J0359j4830o435o957N230q491oJ5806j1P154k2216o355j625N666r265
23437a0510J83J1929O894q248O324K4557J1259L21j7205j1394n628K584M781n776
$$ plain form
23533 34644 15885 7092 -15063 -11290 14956 37348 50331 40672 23940 19493 10592 12753 9967
23520 9967 17633 29874 56482 55797 43746 38643 29757 19738 22394 31571 41348 50772 53625 60874
23506 60874 38120 13644 7812 228 -19572 -23534 -10220 -1618 20881 21464 10023 16392 8559
23493 8559 16440 31702 39501 49020 25458 -207 7026 20116 35542 23065 359 -4428 -7206
23480 -7206 -4150 18809 9700 12694 19179 22320 5855 13358 33376 25460 16362 28961 31200 20381
23466 20381 14172 11051 19868 29606 42723 44016 30814 34942 38553 32109 25168 16878 18463 21466
23452 21466 31825 16995 10560 3603 8833 342 336 16142 16131 23285 1069 -5286 -6911 -1245 -10510
23437 -10510 -10327 1602 8496 248 6572 31129 42388 42709 25504 14110 8482 11066 15847 10071
23423A0071P605Q673M461l607j0279P582l134k1508J901J9668q663l118J4947
23410B4599J228j6536O762P949N959J925m170m633r42p903m713o082R576M636
23396A7655J0889n852n934r592J716O019J2710p07j117k2300j141K0198Q962m769
23382B6737k5101j0469j675K699M962j6016j534N573R82O492J7044M134Q98j0742
23368C984j0007O009J8296J0596L930m11n192k2694j7970O629K4748Q923P762
23355C4603k2640q44N319j6313p80q988r71K3287j3580N983K2774l259j9435p953
23341b797R746k50J613m92P319l898k0765l717P646k370J5996n592q52K801q855
23326d467P509J039o088j6069o757R709J3529k679M824J2252J8824p503j8609
$$ plain form
23423 10071 17676 26349 30810 27203 16924 24506 21372 -136 1765 21433 12770 9652 24599
23410 24599 25827 9291 16053 24002 29961 31886 27716 23083 22141 14238 9525 3443 13019 17655
23396 17655 28544 22692 16758 7166 8882 14901 27611 26904 25787 3487 2346 22544 31506 26737
23382 26737 1636 -8833 -10508 -7809 -2847 -18863 -20397 -14824 -13842 -7350 9694 13828 14726 3984
23368 3984 -6023 -14 18282 28878 32808 32397 27205 4511 -13459 -6830 17918 26841 34603
23355 34603 11963 11119 16438 125 -655 -9643 -10614 12673 -907 5076 27850 24591 5156 -2797
23341 -2797 6949 6699 8312 7820 15139 11241 -9524 -13241 -5595 -7965 8031 2439 1587 4388 -4467
23326 -4467 3042 4081 -2007 -18076 -24833 -15124 -1595 -4274 550 12802 31626 24123 5514
23313E514p713K297k5022q543K829J6607R452N740J5517P424j0011J2045J1510
23300C7646k2611j1462r97J5029O558j7538m46q872J2147L40k961j0803k5735
23287b9705N465M030j2741L3793L1052L104k6800n27P34J9288J4136m214j9536
23274A8079K718J4588L598j6588j4282j3950K503K3141Q623m682j3060J2964J812
23261B5464j4460k882Q739N265J905J119j8759r365r74J650J3091j3286j3984
23248a6477J2557K6267n63k0516N617o783j64J2098K5336n335q042O962j923k315
23234B6719K519q054k1928N841R721r241l942J4086J0700P381J1935j5154o080
23221B4503n103K134J0984O050j6007l3899P486J0141j3119j171L6901K2731p262
$$ plain form
23313 5514 -2199 98 -24924 -33467 -30638 -14031 -4579 1161 16678 24102 14091 26136 37646
23300 37646 15035 3573 2576 17605 24163 6625 6179 -2693 9454 9794 6833 -3970 -29705
23287 -29705 -24240 -20210 -32951 842 31894 34998 8198 7671 8405 27693 41829 37615 18079
23274 18079 20797 35385 38983 22395 8113 -5837 -3334 19807 28430 23748 10688 23652 25464
23261 25464 11004 8122 16861 22126 24031 25150 6391 -2974 -3948 -2298 10793 -2493 -16477
23248 -16477 -3920 22347 21784 1268 6885 102 -62 12036 37372 32037 23995 30957 29034 26719
23234 26719 29238 21184 -744 5097 14818 5577 1635 15721 26421 33802 45737 30583 24503
23221 24503 19400 21534 32518 38568 22561 -11338 -3852 6289 -6830 -8001 28900 51631 44369
23208D4369p838o758j8719r003J1808N930K468O502k2717J546K7829K051j1913
23195B5555J0774J3393j3274m488r567m767L449r068p20q837j0310K2888n86j2639
23181A803j9185K6467J7730N884j0276n571J1086J125k176k329l497j252o450
23168A3359Q768J665p373j704P836j3178j700k970j2279k052j0514p650J2045
23155a5747J0619J0514K869Q811J3068m738J0550J1431j548k2876o719N250J334
23142B2818K2668Q530l754k943j4753l455k2718K3218J3018j4530o284L181J5049
23129D0045K7041j515l3678o983K115k2299q254R764j1877j2883J1435O454M408
23116C773Q832n622p193J0340J1714P158l295j2117j4489o091J0777M399J744
$$ plain form
23208 44369 36531 29773 11054 2051 13859 19789 22257 28759 6042 7588 35417 37468 25555
23195 25555 36329 49722 36448 31960 22393 17626 21075 12007 11287 2450 -7860 15028 14442 1803
23181 1803 -17382 9085 26815 32699 22423 16852 27938 29063 26887 24558 21061 19809 13359
23168 13359 22127 23792 16419 14715 22551 9373 7673 4703 -7576 -9628 -20142 -27792 -15747
23155 -15747 -5128 5386 8255 17066 30134 25396 35946 47377 45829 22953 16234 21484 22818
23142 22818 45486 54016 50262 47319 32566 29111 6393 29611 42629 28099 21815 24996 40045
23129 40045 67086 65571 31893 24910 27025 4726 -3528 6236 -5641 -18524 -7089 -635 3773
23116 3773 12605 6983 -210 10130 21844 29002 25707 13590 -899 -6990 3787 8186 9930
23103I930Q372J8427R421n913j8063m329k947p68j494N392J1518M281J272J742
23089C6841p708m236j1959j6726N846J3181J2241j8276J1527J9280N987j4707
23077C1291q658l416r682o452m971R976l928k590M521l744Q624J2865J860J1891
23063C7587j5734j7504M0567K0706j6699j7492k1772k995K713l600r320p863P60
23050a0646R736Q243l118o273J6041M61K501j4575j4857LJ5833r363r960J1409
23036d565J1696O123j3254j6362N156L4734J4433N576j205M432j2709p191m088
23023B2776k1834o036J5736q630j6247L23Q218J2605J8280J5389M919j7752m970
23010B2777j8123n801M649j611N332K059n626K776o312o742O990j416k5938M613
$$ plain form
23103 9930 18302 36729 46150 40237 22174 17845 14898 14130 12636 18028 29546 33827 35099 36841
23089 36841 29133 24897 12938 -3788 2058 15239 27480 9204 20731 40011 45998 31291
23077 31291 22633 19217 9535 3083 -1888 8088 4160 1570 6091 2347 10971 23836 25696 37587
23063 37587 21853 4349 44916 65622 48923 31431 9659 6664 9377 5777 -3543 -11406 -10646
23050 -10646 -910 7333 4215 -2058 13983 14444 16945 2370 -12487 -12484 3349 -6014 -15974 -4565
23036 -4565 7131 13254 0 -16362 -11206 23528 37961 43537 42332 46764 34055 26864 22776
23023 22776 942 -5094 10642 2012 -14235 -13912 -5694 6911 25191 40580 45499 27747 22777
23010 22777 4654 -1147 3502 1891 7223 9282 3656 6432 120 -6622 368 -1048 -26986 -22373
22996b2373J0390L185n385k854M600r31K1338K0575o622r757L175J440k3495r059
22982a5773J4822k762J2638J683J1956R220j1175k2002j1241J1989J1503J244
22970A2102q847J1436J6545R34k4617k3419o635J58J0491J1797j8326n028L0005
22957F596J1942r877k1803j4327O073K0255J7187N425L906N550j7696k2165O693
22944b241K0855j943r229L269J3254L420p13n510j0178j0762K1447o450p074j066
22930G079K8124J2889J2810m574l4061j5954L87M167J4500Q794J4907j1670k3446
22917A3952k5807K1000Q301J8355m743j0982l570J7106M905k9859m496J2928j718
22904A5372Q156o529N425J1418P401j700j1184k3937M270J2706K274K326j9601
$$ plain form
22996 -22373 -11983 -8798 -14183 -17037 -12437 -13368 7970 28545 21923 12166 15341 16781 -6714 -15773
22982 -15773 -951 -3713 8925 10608 22564 31784 20609 -1393 -12634 -645 10858 12102
22970 12102 3255 14691 31236 32170 7553 -15866 -22501 -22343 -11852 -55 -18381 -23409 6596
22957 6596 18538 8661 -13142 -27469 -21396 -1141 16046 21471 25377 30927 13231 -8934 -2241
22944 -2241 18614 16671 7442 10711 23965 27385 26672 21162 10984 222 21669 15219 8145 7079
22930 7079 35203 48092 60902 56328 22267 6313 6700 10867 25367 34161 49068 37398 13952
22917 13952 -11855 9145 17446 35801 31058 20076 16506 33612 38517 8658 4162 17090 15372
22904 15372 23528 16999 22424 33842 41243 39543 28359 4422 8692 21398 23672 25998 6397
22891F397j9750J0292O620j2781L017J2413o311k876J8674N561r253N951j1792
22878F162k702k86J4746Q070l558K3661M245k8161r329L92j8033L426M331j5587
22864a2623j075J5044L3025R042r230j2355j1681p657k577o771Q816M605j6163
22851i600n945j3514M332L3916J8507j438j7716o586J5927n46k947N813j606j1080
22837G517q146M378r680j0234J1840p358j878K234q7J354M112o031k986J928L265
22822i772N889l985J3814K3573N408K958p745j1689n716J3907j1411l462p677
22809D092n870n868K3854J58j0618K853L469l990q322J1325r365r2m079j0100
22795a2553k808Q342L156q518j5587J0133J8514r670l688J2276j532j0334J1694
$$ plain form
22891 6397 -13353 -3061 3559 -9222 -6205 6208 -103 -2979 15695 21256 12003 17954 6162
22878 6162 3460 3174 17920 25990 22432 46093 50338 22177 12848 13240 -4793 -1367 2964 -12623
22864 -12623 -13698 1346 34371 43413 34183 21828 10147 2490 -87 -6858 1958 6563 -9600
22851 -9600 -15545 -29059 -24727 9189 27696 26258 8542 1956 17883 17337 14390 20203 18597 7517
22837 7517 -629 3749 -5931 -16165 -4325 -11683 -13561 -11327 -11414 -10060 -5948 -11979 -14965 -13037 -9772
22822 -9772 -3883 -7868 5946 29519 34927 37885 30140 18451 12735 26642 15231 11769 4092
22809 4092 -1778 -7646 16208 16366 5748 8601 12070 8080 -242 11083 1718 1626 -2453 -12553
22795 -12553 -15361 -7019 -3863 -12381 -27968 -17835 679 -8991 -12679 -403 -1935 -12269 -575
22782e75J2993r279j2554J917p85L576J3360P626j0004j2105M130j657K5779p010
22768A5412j8838q566m855l067M603K1297M123j5663j1311p963N611L784J8439
22755C006J5723n989J8665m31j326n464K2179k726j6735j6774L524N062r407J396
22741A0703J7473M025j8936K485J2072J4258j7876l2389j4550L772J2274M364
22729b325M199P492j1595r318L70Q751r965j2403J8424K2959J2728K595k2319
22716I593o274o869n136R432Q457j8336o169Q671K2542j0469k6933J3259R804
22703A572k0990j2376J1995m920q6J3845M271J0742P734N754Q932p815P059Q22
22689B6539j9507j5997n173K507o773k1010k876K9396R799k039k0403j080J4661
$$ plain form
22782 -575 12418 3139 -9415 -7498 -8283 -4707 8653 16279 6275 -5830 -1700 -3357 22422 15412
22768 15412 -3426 -11992 -16847 -19914 -15311 5986 10109 -5554 -16865 -24828 -19217 -15433 3006
22755 3006 18729 12740 31405 30974 29648 24184 46363 43637 26902 10128 13652 18714 9307 10703
22741 10703 28176 32201 13265 15750 27822 42080 24204 -8185 -22735 -18963 -6689 -2325
22729 -2325 1874 9366 -2229 -11547 -11177 -2426 -12391 -24794 -6370 16589 29317 31912 9593
22716 9593 3319 -3550 -8686 746 9203 -9133 -15302 -6631 15911 5442 -21491 -8232 1572
22703 1572 -19418 -31794 -19799 -24719 -24805 -10960 -6689 4053 11787 17541 26473 18658 25717 26539
22689 26539 7032 -8965 -14138 -11631 -18404 -39414 -42290 -12894 -3095 -5134 -25537 -26617 -11956
22676a1956k64K1438J5077J6431j6408l9412J320J1676r42q155p033Q172Q785
22663a271J6270L866j3548M750O633k1993j8978J8825J2944k089J0420P782k5510
22650a899l0403M424L7115K2326k0267j376J2580j5264n640l921j3848j3601m851
22637c4625J1632J0169l886M057K2995K365j88O813j2890r981J947Q140r450j4644
22623a7546l326Q217J0794J9982J5956J0217j2051j5561Q174r704k0567J0110
22611D695L0672N855n92j6634k1379q424J3563N71m762j6184M741J0955P768j0963
22597a18j5629j160J795m380L847K4602N090k4316o417Q652J4520M189j775o060
22583B840m510K352j1408P123K204j0947N43j3335J1750R598j653Q506K83O695
$$ plain form
22676 -11956 -12220 9218 24295 40726 24318 -15094 -13774 -2098 -3040 -11195 -18228 -10056 -1271
22663 -1271 14999 18865 5317 10067 16700 -5293 -24271 -5446 7498 5409 15829 23611 -1899
22650 -1899 -32302 -27878 9237 31563 11296 9920 22500 7236 1596 -2325 -16173 -29774 -34625
22637 -34625 -22993 -12824 -16710 -12653 10342 12707 12519 19332 6442 -3539 -1592 6548 -2902 -17546
22623 -17546 -20872 -12655 -1861 18121 34077 44294 32243 16682 24856 15152 -5415 4695
22611 4695 35367 41222 40630 23996 2617 -5807 7756 8327 3565 -12619 -7878 3077 10845 -118
22597 -118 -15747 -16907 -15112 -19492 -15645 8957 14047 -10269 -16686 -8034 6486 10675 8900 2840
22583 2840 -1670 682 -10726 -3603 -1399 -12346 -11803 -25138 -13388 -3790 -5443 3063 3346 10041
22569A0041J2217k6567r111J8865Q391j1967j0838p135j1410j0081l450k034P241
22556c5838Q312n530m577J0578J5913K48r847q327K4226J2000J520m978l0101
22543b6401J8983q149j5024K1835K6834L509j3542j042J493N917p382j7734O448
22530d255l333k180J4730j1285j4472j6911j3590J9677K1033k304J6666J3430
22518A7206p462j1378L494K0305j1209P955J761j1874J0656j494J1022n268j2351
22505A1363j3075j4445O248K2952K561n673k5517J5683Q553n025P940k797j8077
22492i309k083J117q657K853N55m765J2019m030J4K874J0347P413J1210o599k0921
22477g962k1033O222j3529J1629j7072j067J0606M255R438Q474o91l079o82J7767
$$ plain form
22569 10041 22258 -4309 -13420 5445 13836 1869 -8969 -16104 -27514 -37595 -41045 -43079 -35838
22556 -35838 -27526 -33056 -37633 -27055 -11142 -10894 -20741 -29068 -4842 7158 8678 3700 -26401
22543 -26401 -7418 -15567 -30591 -8756 18078 21587 8045 7003 8496 14413 7031 -10703 -4255
22530 -4255 -7588 -9768 4962 -6323 -20795 -37706 -51296 -31619 -10586 -12890 3776 17206
22518 17206 9744 -1634 1860 22165 10956 18911 20672 8798 19454 17960 28982 23714 11363
22505 11363 -1712 -16157 -9909 13043 15604 9931 -15586 97 8650 3625 11565 8768 -9309
22492 -9309 -11392 -10275 -18932 -16079 -15524 -20289 -8270 -12300 -12286 -9412 935 8348 19558 12959 -7962
22477 -7962 -28995 -22773 -36302 -24673 -41745 -42812 -32206 -27951 -18513 -10039 -10730 -13809 -14491 3276
22463C276j42K513J5793q198j1222j6480l868O113J0232n248K938J3533p243p154
22449e157O554l522j030k628K4524O300m338k643r294j0925k7067o256j2341L812
22435d4011K9721J2972l933j532M497k494O185R150J1066o020p831r210j1778
22422a3218K899J6024l466L077j2361j4754J7879M396k982j653k194m798J3468
22409B317o816m5269M961J9372J9587L321j6544k1710o373J3068M472K029O563
22396b1022L7278L7681j4268l9757q515o265J8961J522k0308K344P531N253N351
22383E786J3834N368M864r834k5741j0937k293j0363M829L14l797J4215R92N725
22369g038R829L548J370k131k415k50l695l366j441j4276L398K869J5591R976
$$ plain form
22463 3276 3134 5647 21440 13242 2020 -14460 -18328 -12215 -1983 -7231 -4293 9240 1997 -5157
22449 -5157 1397 -2125 -3155 -5783 18741 25041 20703 18060 8766 -2159 -29226 -35482 -47823 -44011
22435 -44011 -14290 -1318 -5251 -6783 -2286 -4780 1405 10555 21621 15601 7770 -1440 -13218
22422 -13218 -10319 5705 2239 5316 -7045 -21799 -3920 476 -2506 -4159 -6353 -11151 2317
22409 2317 -4499 -49768 -44807 -25435 -5848 -2527 -19071 -40781 -47154 -34086 -29614 -27585 -21022
22396 -21022 16256 53937 39669 -88 -8603 -14868 4093 5615 -14693 -12349 -4818 435 5786
22383 5786 19620 24988 29852 20018 -5723 -16660 -18953 -29316 -24487 -24173 -27970 -13755 -12763 -7038
22369 -7038 2791 6339 7709 5578 3163 2913 -782 -4148 -5589 -19865 -16467 -13598 1993 11969
22355A1969n909N803M835j3148j5785M800N438J6452J2110j7183M416J855j68
22342A5485j3702J3584M796n058k4468m1J832q294K377n462J2144m189L151L1210
22328B3365J4427L660J322n800j7341j5714l676N226j725j8535k281q432N65j730
22314b6669p663J0653J8862P201J3280o261P856J568p147k245q728r360q358n153
22300b2164P607J7839R836k941j795p473r853j7012Q866J0730J2817O571J964
22287A4992k079n838J521l500M33r991m393l400j252j6895p75j427K361J0307
22273a9936k197n821k413l843R386J8886m274J0535J6042R920j6939k7163m746
22260b2563P633L077l73J4165m784L70P200j1353p864o501r208O354J1757N545
$$ plain form
22355 11969 6060 11863 16698 3550 -12235 -7435 -1997 14455 26565 9382 13798 15653 15485
22342 15485 1783 15367 20163 15105 -9363 -9404 -7572 -15866 -13489 -18951 -6807 -10996 -7845 23365
22328 23365 37792 41452 42774 36974 19633 3919 243 5469 3744 -14791 -17072 -25504 -24939 -26669
22314 -26669 -34332 -23679 -4817 2384 15664 9403 17259 18827 11680 9435 707 -8653 -17011 -22164
22300 -22164 -14557 3282 13118 10177 8382 909 -8944 -25956 -17090 -6360 6457 13028 14992
22287 14992 12913 7075 8596 5096 5529 -4462 -8855 -12255 -13507 -30402 -31177 -32604 -30243 -19936
22273 -19936 -22133 -27954 -30367 -34210 -24824 -5938 -10212 323 16365 26285 9346 -17817 -22563
22260 -22563 -14930 -11853 -12226 1939 -2845 -2475 4725 -6628 -14492 -20993 -30201 -23847 -12090 -6545
22246f545O269J5149J7071j6651l4997l8904j2608K7200L5550M876N783P446j0867
22233a228j3890n926L713j2311J4825Q181L345j4601P054k099J035J4935J0172
22220A3205L355j0124L159J5236l23q22q371M68k316j8194j7281o1K9130r636
22206b575j4782P348N496q931J1408J3620m19n36J2510L609j0185o548J1790k0063
22192A742j7571L716K185O029j3138p338J0051O744N74J3016n699j5723N251K0198
22178A0037J2475M311Q075p242j6414k2799j105k600O809j0332q400j682J1297
22165a7570J9469Q319p058q922j6941j39m641J7898k88K304J2929J7671J7072
22152D0103j9188l1973p432r116k601M542Q772J6112j4298m080J234R124J1321
$$ plain form
22246 -6545 -276 14873 31944 15293 -19704 -58608 -71216 -44016 -8466 -3590 2193 9639 -1228
22233 -1228 -15118 -21044 -17331 -29642 -14817 -6636 -3291 -17892 -10838 -12937 -11902 3033 13205
22220 13205 16560 6436 9595 24831 24508 23686 15315 15783 13467 -4727 -22008 -22069 7061 -2575
22206 -2575 -17357 -10009 -4513 -13444 -2036 11584 11165 10629 23139 26748 16563 10015 21805 1742
22192 1742 -15829 -12113 -9928 -3899 -17037 -24375 -14324 -7580 -7006 6010 311 -15412 -10161 10037
22178 10037 22512 26823 34898 27656 11242 -11557 -12662 -15262 -8453 -18785 -27185 -28867 -17570
22165 -17570 1899 10218 3160 -5762 -22703 -22842 -27483 -9585 -9873 -7569 5360 23031 40103
22152 40103 20915 -11058 -18490 -27606 -30207 -25665 -16893 -781 -15079 -19159 -17925 -8801 2520
22139B520o403m242M028J338l237R183J9760L501j5346r095k4394j7746K4172
22126a5961J2446j883J466l47r403q414o272l755m768Q12K752K2943L269q541
22112a5656L206K504N45j3694n91L452R140K06k260m743q010N776K887J2142p437
22097a2533K50L238p79j3791k6602K463P707K4515Q042q129J235j4733k1957J278
22083d9796Q776J8288Q406j147O26k2189j737M170o6O708M967K7206j12P188l183
22068H105k0324j2521Q654O14j02K494L992l760L668Q542K07J43j2578N435J1720
22053D289q888j7572K507L752l435m885L02j9616N839O890K8916L9318p471k2104
22039G842n130J995j699k0795o842J2071j367j093Q805J921m917J3798o621Q979
$$ plain form
22139 2520 -3883 -8125 -4097 -2759 -5996 3187 22947 26448 11102 2007 -22387 -40133 -15961
22126 -15961 -3515 -5398 -3932 -4279 -13682 -22096 -28368 -32123 -36891 -36079 -33327 -10384 -7115 -15656
22112 -15656 -12450 -9946 -9401 -23095 -23686 -20234 -11094 -10888 -13148 -17891 -25901 -20125 -17238 -5096 -12533
22097 -12533 -12283 -9045 -9824 -23615 -50217 -47754 -40047 -15532 -7490 -15619 -14384 -29117 -51074 -49796
22083 -49796 -41020 -22732 -14326 -15473 -14847 -37036 -38773 -34603 -34669 -27961 -22994 4212 4100 11288 8105
22068 8105 -12219 -24740 -16086 -15472 -15574 -13080 -9088 -12848 -9180 -638 -431 -288 -12866 -7431 4289
22053 4289 -4599 -22171 -19664 -15912 -19347 -24232 -23930 -43546 -37707 -30817 -1901 37417 29946 7842
22039 7842 2712 4707 3008 -17787 -24629 -12558 -13925 -15018 -6213 -4292 -9209 4589 -2032 6947
22025F947P14k8521j1059Q767j2476J776O564Q803J040j470j7372J19K9086K5141
22011A8059r514n641j2141j3928P604J5075q280J2685J4539j7432j9762j795N6
21998b0475M871K9012J5233j2601k8534q234m399J5505Q584l557o917J173p360
21985a7699J1442J2250R433j0477q773j8307j2106K245K8060P481r051L028N507
21972C033J6635o68p575k0966j3654K457j800L028J3572P388j4306j3916J5137
21959a1635Q342n034j339k393P306J0236j407Q928J1422j7152j2574N208Q567
21946H475R154j0530l299j469j2428Q316M548J724j0912j7260n16M86N465R124
21932i122P327J86q36r652O468P1m747P95J8358J1386J0074j2935j8872o556J8258
$$ plain form
22025 6947 7661 -20860 -31919 -23152 -35628 -33852 -27288 -18485 -17445 -18915 -36287 -36168 -7082 18059
22011 18059 8545 2904 -9237 -23165 -15561 -486 -8766 3919 18458 1026 -18736 -20531 -20475
21998 -20475 -15604 13408 28641 16040 -12494 -20728 -25127 -9622 -1038 -4595 -11512 -10339 -17699
21985 -17699 -6257 5993 15426 4949 -3824 -22131 -34237 -31992 -3932 3549 -5502 -2474 3033
21972 3033 19668 19000 11425 -9541 -23195 -20738 -22538 -19510 -5938 1450 -12856 -26772 -11635
21959 -11635 -3293 -8327 -9666 -12059 -4753 5483 4076 13004 24426 7274 -5300 -92 8475
21946 8475 17629 7099 3800 2331 -10097 -1781 2767 4491 -6421 -23681 -24197 -23711 -18246 -9122
21932 -9122 -1795 -1609 -2445 -12097 -5629 -5558 -10305 -9510 8848 20234 30308 17373 -1499 -8055 10203
21917A0203o864j1117q515j3855m413P902K1367P720o045k0604o835j120J5118
21904a7058J5488l454m16J2157M38k3576N292K045K1310L907r243K014j1454l648
21890f198Q958J940j0482k063J0934J8619P652k8590p493o122Q280J4357j357
21877H435j5279l087k45j2625J0707r238j5854Q629m90r350l343P355K2759K2828
21863A1202j6382M482j353P473K159o280K1696Q813k0188j6995k222P832j334
21850a097j0006J247r225j7059j4769J2099J4603J6110k092N65r365j0608l454
21837c3051N48K0659J263J023m682J850P583K341j108j7714q834r39j029J9159
21823a2931J3517j1864J1244m915r823m284O629M402j2054j5779J1136Q000Q445
$$ plain form
21917 10203 3339 -7778 -16293 -30148 -34561 -26659 -5292 2428 -3617 -24221 -31056 -32176 -17058
21904 -17058 -1570 -5024 -5440 6717 7155 -16421 -11129 -9084 12226 16133 6890 8904 -2550 -6198
21890 -6198 2760 4700 -5782 -7845 3089 21708 29360 770 -6723 -12845 -4565 9792 8435
21877 8435 -6844 -9931 -10176 -22801 -12094 -21332 -37186 -28557 -29047 -38397 -41740 -34385 -11626 11202
21863 11202 -5180 -698 -2051 5422 7581 1301 22997 31810 11622 -5373 -7595 237 -1097
21850 -1097 -11103 -9856 -19081 -36140 -50909 -38810 -24207 -8097 -10189 -9624 -18989 -29597 -33051
21837 -33051 -32503 -11844 -10581 -9558 -14240 -12390 -4807 -2466 -3574 -21288 -30122 -31061 -32090 -12931
21823 -12931 586 -11278 -34 -4949 -14772 -19056 -12427 -8025 -20079 -35858 -24722 -16722 -8277
21810h277j2320n209J3509m440p469L797O105q940J2852J1386O466k0402J398
21797a1544M427R529O726m618n228R94k345m500q238J0332j936k119o57j0358
21783a9535r584K706j260m613J870k595J4339o08n263J8417M226p702j1181j8526
21769c9309r174K4121Q631k1424J837J0039n372O204j0191J897n69J644j2546
21756d4212j1533J4550j3341j222J1520K929J6118J4061L870K889r336j8407J815
21743c0299K558k4766j534L2080l050J3224j2131J232j8852k0148M159P273J5690
21730c4564P371P837p381q667O544O446L078q54k488j2347J1105K0303J3689j7827
21716g755k7445p491K0382J0572P32J5856N783Q585j7040J968O560o252j3949
$$ plain form
21810 -8277 -20597 -25806 -12297 -16737 -24206 -20409 -14304 -23244 -10392 994 7460 -12942 -11544
21797 -11544 -7117 2412 9138 4520 -708 286 -2059 -6559 -14797 -4465 -6401 -8520 -9177 -19535
21783 -19535 -29119 -26413 -27673 -32286 -30416 -33011 -18672 -19280 -24543 -6126 -1900 -9602 -20783 -39309
21769 -39309 -48483 -24362 -15731 -37155 -35318 -25279 -30651 -24447 -34638 -32741 -33310 -31666 -44212
21756 -44212 -55745 -41195 -54536 -55758 -44238 -41309 -25191 -11130 -7260 -4371 -13707 -32114 -30299
21743 -30299 -27741 -52507 -54041 -21961 -25011 -11787 -23918 -22686 -41538 -61686 -57527 -50254 -34564
21730 -34564 -27193 -19356 -26737 -35404 -28860 -22414 -19336 -20190 -22678 -35025 -23920 -3617 10072 -7755
21716 -7755 -35200 -42691 -22309 -11737 -11005 4851 10634 19219 2179 4147 10707 4455 -9494
21703i494j9691r565k690O838j1066J4824J8015M715P3k916q460j5506r28O963
21689b8888M763J714J1407J3530o352j9335P112J3872J5019j047L959l522k1153
21676h921l613K656k21J0380J0751l482p505P908r62n081J316M474n763j9942
21662a8005J147J5228M643J3056M785j3682j0461q837j035o169o459M299l0687
21649e2177J0043J0741L662R12J0495J1441j2493m348k596r80J7036p109J0503
21636d870J0361M43p848l846m05R837L858m727p613J9312J5629q968L105j9550
21622D718q63J2298M954J6417M748k968n272J0800K1797P36l345J9433K7972L2855
21608A44280K9243K3360L2400O1836R8861J21525J26672J39416J73722J62776
$$ plain form
21703 -9494 -29185 -38750 -41440 -34602 -45668 -30844 -12829 -8114 -8041 -10957 -19417 -34923 -35851 -28888
21689 -28888 -24125 -22411 -11004 2526 -3826 -23161 -16049 -2177 12842 11795 15754 12232 -8921
21676 -8921 -12534 -9878 -10099 281 11032 7550 45 7953 6991 1910 3226 7700 1937 -18005
21662 -18005 -16858 -1630 3013 16069 20854 7172 -3289 -12126 -13161 -19330 -25789 -21490 -52177
21649 -52177 -42134 -31393 -27731 -26819 -16324 -4883 -17376 -21724 -24320 -25300 -8264 -15373 -4870
21636 -4870 5491 5934 -1914 -5760 -6165 3672 7530 2803 -4810 14502 30131 21163 24268 4718
21622 4718 3855 16153 21107 37524 42272 39304 34032 44832 66629 67365 64020 83453 111425 144280
21608 144280 173523 196883 229283 291119 389980 511505 638177 777593 951315 1114091
21598A114091J58920J44590J36082P7705L175n8153p2319j05047j40217j51309
21588A107518j61499j63422j67837j41252j06894q2011p3268m5334n6692k4139
21578H5170j6884j6621j3914o54M631J0823p189r30j308M08r825j0516o427O657
21564B3421l001o429J5932J0227N503n77L073k494k1241j776j2592M424P047k851
21550A8666P032j9009q143m841j5540o479J3481L5201L827j1480j635J9778R834
21537D0692m008j6829j2863l6563l165J0167J2804k187J3709J5581J4058K732
21525C4128O636R696j2511N51M351J1399j1023O326N572j5835J3967K9176J1474
21512I3907J2911L1173L7852N3555O4324N9995O7315Q6258J03456Q8162N5937
$$ plain form
21598 1114091 1273011 1417601 1553683 1631388 1634563 1576410 1504091 1399044 1258827 1107518
21588 1107518 946019 782597 614760 473508 366614 284603 211335 166001 109309 85170
21578 85170 68286 51665 37751 37097 41728 52551 45362 44432 43124 43532 33707 23191 16764 23421
21564 23421 20420 13991 29923 40150 45653 45076 48149 45655 24414 22638 10046 14470 21517 18666
21550 18666 25698 6689 -1454 -6295 -21835 -28314 -14833 20368 24195 12715 11080 30858 40692
21537 40692 36684 19855 6992 -29571 -32736 -22569 -9765 -11952 1757 17338 31396 34128
21525 34128 40764 50460 37949 38500 42851 54250 43227 49553 55125 39290 53257 82433 93907
21512 93907 106818 137991 175843 229398 293722 353717 421032 507290 610746 698908 754845
21501G54845K8721L1903r321k5286k0805p5899r3107p8022p0352q2167o8759n6804
21489B34947m9093j7872j1486k0414n213k0605k2856K262J2598J6700J2895L6677
21477A68540M7402M7845N6461Q3943J06732J19908R7436N3318M9152K6091R588
21466H66416p399l6309p8659p5430p0444r5855q0218p5338p5607o8402l6356l4872
21454A31527j6909k4447l1635j7213J392m564J0350J3868l165l130k0435j3119
21442B2520J0551j918j6193j3165J2078K97k7549M462L037k035l278J3409K7280
21429B9496R517k28j0460M887j7019k8726J4613J7958m267p870k7951j0474J352
21416b9172O889N178J4189j177J7233j0046j5119J8925K9956J4313J6219j1838
$$ plain form
21501 754845 783566 815469 806148 780862 760057 684158 591051 513029 442677 360510 291751 234947
21489 234947 185854 167982 156496 136082 130869 110264 87408 89670 102268 118968 131863 168540
21477 168540 215942 263787 320248 404191 510923 630831 728267 781585 830737 856828 866416
21466 866416 859017 822708 744049 668619 598175 502320 422102 346764 271157 202755 166399 131527
21454 131527 114618 90171 58536 41323 42715 38151 48501 62369 59204 56074 35639 22520
21442 22520 33071 31153 14960 1795 13873 14170 -13379 -8917 -5880 -7915 -11193 2216 29496
21429 29496 39013 38785 28325 33212 16193 -12533 2080 20038 15771 7901 -20050 -30524 -29172
21416 -29172 -22283 -17105 -2916 -4093 13140 3094 -12025 6900 36856 51169 67388 55550
21404E5550k0299q528j6624J0623o91K35K981Q444p027o258M963l478Q870J1104
21390C9865q781k1157l07J6044J4375j3865j6740k377J3174N007J950J2823l594
21377C6417j9001j7708J2217J4540k0305q071K2537j0440K220J4412J0662n773
21365C1707j1758j5119J1753M171r519J0610J7044K2824q032p701j7669n987q493
21352A3831L949K844J0369j54n317j6550k145L611r287n45J6904j4765j6268J1649
21338a874N065O481L244o852N254O76j5480m692k3102p320J6663M500j6455J2225
21324b1667l429Q207J742Q99J1087Q329n411K606N954K7967j1838l001q506p889
21310E050m424m850R328o709j8100L621K9096J3462J586M842j5489o590J4635
$$ plain form
21404 55550 35251 26723 10099 20722 20031 20266 23247 31691 24664 18406 23369 19891 28761 39865
21390 39865 31084 9927 9620 25664 40039 26174 9434 7057 20231 25238 27188 40011 36417
21377 36417 17416 -292 11925 26465 6160 -1911 20626 10186 12406 26818 37480 31707
21365 31707 19949 4830 16583 20754 11235 21845 38889 61713 53681 45980 28311 22324 13831
21352 13831 17780 20624 30993 30839 25522 8972 6827 10438 1151 606 17510 2745 -13523 -1874
21338 -1874 3191 9672 12916 6064 11318 11994 -3486 -8178 -31280 -38600 -21937 -17437 -33892 -21667
21324 -21667 -25096 -16889 -15147 -14248 -3161 5168 -243 2363 8317 36284 24446 21445 12939 5050
21310 5050 626 -4224 5104 -1605 -19705 -16084 13012 26474 28060 32902 17413 10823 25458
21297B5458J6816P902J7010j1458K47o251j0989j7234r793P486J1522q32j0813
21284A9071J3092K0622J8098O282j9284j4595j6196j386m009j1397L091J3735
21272B7124l934j676J3086n946m234j468N990j6257j1836J6337P916R048P596
21259D1746R836J8059K1734L0219K7117K583K0998K8087K9450L1576M352Q982
21247B74739O757r53l1719l4398j9361k0158q661l9372k9372n063R800k0163k1270
21234F0806r483q592j363l422k7770r564J0398J1159j1662M081Q354o614K78J0637
21220B7243N186m049q296K830J389j1414k3096k3188r014L733K541J1973J2198
21207a1964j3154L713L800N761K617j3811j3658l176N562P013j1011o848Q074
$$ plain form
21297 25458 42274 50176 67186 55728 55975 49724 38735 21501 11708 19194 30716 29884 19071
21284 19071 32163 52785 70883 77165 57881 43286 27090 25704 21695 10298 13389 27124
21272 27124 23190 21514 34600 28654 24420 22952 28942 12685 849 17186 25102 34150 41746
21259 41746 51582 69641 91375 121594 148711 151294 172292 200379 229829 261405 265757 274739
21247 274739 281496 280543 248824 214426 195065 174907 166246 126874 97502 92439 102239 82076 60806
21234 60806 51323 42731 41368 37946 10176 612 11010 22169 10507 14588 22942 16328 16606 27243
21220 27243 32429 28380 20084 22914 24303 12889 -10207 -33395 -42409 -38676 -36135 -24162 -11964
21207 -11964 -25118 -21405 -17605 -11844 -9227 -23038 -36696 -39872 -34310 -27297 -38308 -45156 -37082
21194c7082N356O268j4521N937J3242J6924J0602l304J613J6200K6720J9663J2732
21181H0350J3475K9004J7636K1274L1432K0796K0959L2669K6170J3478l112j258
21169C02873J482K1664J043k6459k1511j7776J600q708k6566j8757j0081k4382
21157A74422J550j5372J551L2933J0657j892j2699Q846N603j9119k2140J9960
21145A84300J5968K0566Q901M664J1556N680n667P055K1759L569M3499M0044J3032
21132C74926J6828J9716N445N41K2769K2348k811l016J3654L816j4409j9820k2966
21119D17021k7415l914k3221l0521k2162j5397j8093j7942J097K4378J7255Q302
21107C09388q05R172R246J3639L4287J8908J2809q065n906J2931J1511j3667j739
$$ plain form
21194 -37082 -31726 -25458 -39979 -34042 -20800 -3876 6726 3422 5035 21235 47955 67618 80350
21181 80350 93825 122829 140465 161739 193171 213967 234926 267595 293765 307243 304131 302873
21169 302873 304355 326019 327062 300603 279092 261316 262916 254208 227642 208885 198804 174422
21157 174422 175972 160600 162151 195084 205741 203849 191150 199996 205599 186480 164340 184300
21145 184300 200268 220834 229735 234399 245955 251635 245968 253023 274782 278351 321850 361894 374926
21132 374926 391754 411470 416915 417456 440225 462573 459762 456746 470400 474216 459807 439987 417021
21119 417021 389606 385692 362471 331950 309788 294391 276298 258356 259453 283831 301086 309388
21107 309388 308583 317755 327001 340640 374927 393835 406644 398579 392673 405604 417115 403448 401709
21094D01709J3194J7757N815R173J0612J3723K562o160P963q951K550J6758L2178
21081E18883R005L983m290k967P693N932K4047K9221L6051L1631J8376K8198m003
21068G01760p257L6544L1269N140o44K8278K8079K8819L9762J4572K3798N0109
21056I80229L6374J8604K2701L2709N4026N6124N5546P7472N5830N1772J00650
21045A542037J29813J04532J12377J75441K15884K23338K47940L12368L61874
21036C425604L52655L79957L90532M01883L82390L30759L06228L05290L05875
21027F581173L03367L01074L47155L82359M36867N08385N73722O62575P19940
21018A0816617Q12038R41935J069592J276159J533270J844407K249999K800457
$$ plain form
21094 401709 414903 432660 438475 447648 458260 471983 474545 468385 476348 467397 469947 486705 518883
21081 518883 527888 531871 527581 524614 532307 538239 562286 591507 627558 659189 677565 705763 701760
21068 701760 694503 731047 762316 767456 766812 795090 823169 851988 891750 906322 930120 980229
21056 980229 1016603 1035207 1057908 1090617 1144643 1200767 1256313 1333785 1389615 1441387 1542037
21045 1542037 1671850 1776382 1888759 2064200 2280084 2503422 2751362 3063730 3425604
21036 3425604 3778259 4158216 4548748 4950631 5333021 5663780 5970008 6275298 6581173
21027 6581173 6884540 7185614 7532769 7915128 8351995 8860380 9434102 10096677 10816617
21018 10816617 11628655 12570590 13640182 14916341 16449611 18294018 20544017 23344474
21010B3344474L579776M718373O484058R199593J2889709J6681711J9917283K3858854
21002A20673831K9180482L2507148L1113164K7266857K4717411K2165192J4392359
20995C02016444K287798p930860j3738194j9159916k5881860l1335131l2214691
20988A74043590k9932157k7184378k4148597k0221252j5970272j2104359q896215
20981C5586360o436258m698324l492430k650276k050867j631938j281834j051194
20973A2293239q76378p41773o26568m92618m07776l58103k92172k37639j89281
20964H070931j93611j96165j77017j45553j50904j95859k24393k09371j87384
20955F390674j35613j23128j38071j22831q3459k9130k9317j6427l402K0825M4845
$$ plain form
21010 23344474 26924250 31642623 38126681 47326274 60215983 76897694 96814977 120673831
21002 120673831 149854313 182361461 213474625 240741482 265458893 287624085 302016444
20995 302016444 304304242 296373382 282635188 263475272 237593412 206258281 174043590
20988 174043590 144111433 116927055 92778458 72557206 56586934 44482575 35586360
20981 35586360 29150102 24451778 20959348 18309072 16258205 14626267 13344433 12293239
20973 12293239 11416861 10675088 10048520 9555902 9148126 8790023 8497851 8260212 8070931
20964 8070931 7877320 7681155 7504138 7358585 7207681 7011822 6787429 6578058 6390674
20955 6390674 6255061 6131933 5993862 5871031 5787572 5758442 5729125 5712698 5709296 5730121 5774966
20944E774966N0336M4540R1892J35302J62224J73051K11853K18456K36156L11458
20934G410234M12201M80893N24859O71271R03276J161753J492272J950624K567386
20925A7574769L513463M984281P195534J0015146J2204197J3051313J3856697
20918H2395400J6242183J9112225J7242503J1448644N482576L748478K386937
20911A58058946l014424j0055350j5235032j5763651j5306221j4971703j4619781
20904F9092784j3287645j1041534q588661o189244m264588k835553j722706q43744
20896B0319109p8846O38785J390224K297399L550021N423477Q077026J0926801
20888E2543996J2654081J3396950J4736914J7854235J9255171J5217455Q769547
$$ plain form
20944 5774966 5825302 5869842 5961734 6097036 6259260 6432311 6644164 6862620 7098776 7410234
20934 7410234 7822435 8303328 8828187 9499458 10402734 11564487 13056759 15007383 17574769
20925 17574769 21088232 26072513 33268047 43283193 55487390 68538703 82395400
20918 82395400 98637583 117749808 134992311 146440955 151923531 155672009 158058946
20911 158058946 155044522 144989172 129754140 113990489 98684268 83712565 69092784
20904 69092784 55805139 44763605 36174944 29985700 25721112 22885559 21162853 20319109
20896 20319109 20240263 20879048 22269272 24566671 28116692 33540169 41617195 52543996
20888 52543996 65198077 78595027 93331941 111186176 130441347 145658802 154428349
20881A54428349M020197L339749J14907o431764j3510156j6714243j6447142j6051213
20873I2748684j5757985j5134682j3305419j0868335q368552o162856m460398
20866A8690457l219359k368104j742477j286664r97404p95760o44386n22541m23691
20857F690071l81052l32853k86057k21019j78582j73142j55679j54455j31478
20848D675754o2893m7105j28215j58847j67622j88319j92790k04425k20593k04008
20838C100937k11206k18802k02845j82570j51600j29937j16762j15812q2810q9085
20828A599508o5795o3207o9011p7731n8223n4848n0209k6437l1734l618k8384
20817A070311m4368k9612l1540j5591j8049j8248M210J0438k5320j1972p925j7577
$$ plain form
20881 154428349 158448546 161788295 161903202 155471438 141961282 125247039 108799897 92748684
20873 92748684 76990699 61856017 48550598 37682263 29313711 23150855 18690457
20866 18690457 15471098 13102994 11360517 10073853 9076449 8280689 7636303 7113762 6690071
20857 6690071 6309019 5976166 5690109 5469090 5290508 5117366 4961687 4807232 4675754
20848 4675754 4612861 4565756 4437541 4278694 4111072 3922753 3729963 3525538 3304945 3100937
20838 3100937 2889731 2670929 2468084 2285514 2133914 2003977 1887215 1771403 1688593 1599508
20828 1599508 1533713 1470506 1401495 1323764 1265541 1210693 1160484 1134047 1102313 1098695 1070311
20817 1070311 1025943 996331 964791 949200 931151 912903 917113 927551 902231 890259 882334 864757
20805H64757k1552P461j9615j4467j0156K1750K3209R175j0535l0720j9454M347
20793H04200o741k0691k6436k7662k0844k6364k7620k4926j3631j3065j4389n01
20781E81330j7581k1487k1167r817j6093j6599K5748J1871p314j5806p334o12
20769D85139j6239r943Q205o677n284q255M06K620j191j7141n730k3742k1512
20756C80656j3190j6382k84J0881L155J0632k453k0935j078j14o491j3075L230
20743C34552Q461j7795J448L464k9567j2504J3800K0266O843r131j0840k364L18
20730C06951n929N89J2438k312n693J3314K6515k758L908K1278J2575j4162k3338
20717C43376j5992n577L272P542j3405J1092J8720j8938k6453j2431o732K374
$$ plain form
20805 864757 843205 850666 831051 816584 806428 828178 851387 860562 850027 819307 799853 804200
20793 804200 797459 776768 750332 722670 701826 675462 647842 622916 609285 596220 581831 581330
20781 581330 563749 542262 521095 511278 495185 478586 504334 516205 508891 493085 485751 485139
20769 485139 468900 458957 467162 460485 455201 446946 447352 449972 448781 431640 425910 402168 380656
20756 380656 367466 351084 350800 361681 364836 375468 373015 352080 351002 350888 344397 331322 334552
20743 334552 343013 325218 326666 330130 300563 288059 301859 322125 328968 319837 308997 306633 306951
20730 306951 301022 301611 314049 311737 306044 319358 345873 343115 347023 368301 380876 366714 343376
20717 343376 327384 321807 325079 332621 319216 330308 349028 330090 303637 291206 284474 286848
20705B86848p525j6929j7167m952R529m884J1879M9374N5066M1673N1935O8047
20693E22894L8803J4680J7662J5444J6990J1662j7148j5442N846M889Q703l920
20681F21063N099K0513k0181k0127l014j326J2936M736l2191l6247o4714n6462
20669D30085l7107l5270j2767Q040j7855j4813n884j1416j9635m668o069q332
20657B64309Q081Q677j6765K094p24J541Q654R133O809J5973K0459j2024j6406
20644B99811k6913j5891R173l695k0754j3090o12J1676j9067j8192L704O251j3032
20631A99369n169k5440J259M752n234o735j511J2500q194j2051J7026J090L329
20618A74991o907q686J333m687J4699J9662J5646o727J0281J0681q987k1151j8023
$$ plain form
20705 286848 279323 262394 245227 240275 249804 244920 256799 306173 361239 402912 454847 522894
20693 522894 561697 576377 594039 609483 626473 638135 620987 605545 611391 616280 624983 621063
20681 621063 626162 646675 626494 606367 603353 602027 614963 619699 587508 551261 486547 430085
20669 430085 392978 357708 344941 352981 335126 320313 314429 303013 283378 278710 272641 264309
20657 264309 272390 281067 264302 266396 265672 267213 275867 285000 291809 307782 328241 316217 299811
20644 299811 272898 257007 266180 262485 241731 228641 228029 239705 220638 202446 206150 212401 199369
20631 199369 194200 168760 170019 174771 169537 162802 161291 173791 165597 153546 170572 171662 174991
20618 174991 168084 159398 160731 156044 170743 190405 206051 199324 209605 220286 211299 190148 172125
20605A72125K0673N88j6J7255J9392L0541L8721K6622M2889K2695j9566k9193
20593C42726j7421j2906k0388k0728J04J2795L5163M8455K1619o005l4152l1825
20581C17437l8942l2195K987j2063k524J2967M744J839J0028J1665n56K0885L3798
20568C30070M9621N0150O9003M0649K3816K6852M6284O9153P9284O9754J23236
20557I77872J73570J07849M2824L8541N5302j4899j33535j57378j40225j23842
20547H26079j05124j07650j02980r6455m0657k4229l5160m2039k9925P503k488
20536B46875J5988K3483n973Q767J7953L4924O5924J00751J03665P7416J14414
20525H04187J56984J12242L9080R136L2624O904n7626j16274j18657q8628j06119
$$ plain form
20605 172125 192798 193386 193370 210625 230017 260558 299279 325901 368790 391485 371919 342726
20593 342726 325305 312399 292011 271283 271387 284182 319345 367800 389419 383414 349262 317437
20581 317437 278495 246300 249287 237224 234700 247667 252411 254250 264278 275943 275387 296272 330070
20568 330070 379691 429841 498844 539493 563309 590161 636445 705598 784882 854636 977872
20557 977872 1151442 1259291 1302115 1340656 1395958 1381059 1247524 1090146 949921 826079
20547 826079 720955 613305 510325 413870 373213 348984 313824 271785 241860 249363 246875
20536 246875 262863 286346 280373 289140 307093 342017 407941 508692 612357 689773 804187
20525 804187 961171 1073413 1112493 1121629 1154253 1161157 1103531 987257 868600 779972 673853
20514F73853j31243r6136q7647p3500m5920k2134p273j4801k6011k6131k6540
20503A16517m336J3850J1661j6087l1760J3675K367R375K4800q261m622J7703
20491A44882j651j5797j850P208l803j8158k1747J1504J9426J502k065o960L545
20478A16036n740j0227J0035L781k2313n596J4232K0362j463r328J0452j4371
20466A05860j2420k0301M256J246l420m288J9261J1554j323l015J8987O813M534
20453A27744j6509l738n819j4267j61j1902J1810p271r794j3916p711J1637J7525
20440G7628P015J8872p428O760P12k5181m361J0362Q193J8058L46j0949J680N811
20426A07518J4398p595N307K339p355r864j6604J465J6381Q185J1638J7403q495
$$ plain form
20514 673853 542610 446474 358827 285327 239407 217273 210000 195199 169188 143057 116517
20503 116517 112181 126031 137692 121605 89845 103520 105887 115262 140062 131801 127179 144882
20491 144882 143231 127434 125584 132792 128989 110831 89084 100588 120014 121516 119451 112491 116036
20478 116036 110296 100069 110104 113885 91572 85976 100208 120570 119107 109779 120231 105860
20466 105860 93440 73139 77395 78641 75221 70933 90194 101748 100425 97410 116397 123210 127744
20453 127744 111235 107497 101678 87411 87250 75348 87158 79887 70093 56177 48466 60103 77628
20440 77628 84643 103515 96087 102847 103559 78378 74017 84379 92572 110630 110976 100027 101707 107518
20426 107518 121916 114321 119628 121967 114612 104748 88144 89609 105990 114175 125813 143216 134721
20413A34721m738R045J6484P040j0189k990J0025K6220O783J6421N1486L5884
20401B96192N6274P8123Q4657J03025J12046J33076J79154J75037J53030J33327
20391A503941J11572Q3331L7223l5860p4037j24453j22237j55472j80565j67542
20381H75901j62708j40552j20527q7912m8067l3332n0385l8442k6208j7882P556
20370A57442M757r122k5779l0405n335L898K764O236Q571L37j7580j3129J4819
20357I7474q067j4589K780K0997K401j0678J2141K6816j309n709n892J8899M32
20344A35696k870J114r57j1072O019k794j3948j0050J3547J7194l781M264J3374
20331A45736K3581M8798M5658J7694O6773P5082N5791P5999Q3249R4652O6064
$$ plain form
20413 134721 129983 139028 155512 162552 152363 149373 159398 185618 192401 208822 260308 296192
20401 296192 352466 430589 515246 618271 730317 863393 1042547 1217584 1370614 1503941
20391 1503941 1615513 1698844 1736067 1700207 1626170 1501717 1379480 1224008 1043443 875901
20381 875901 713193 572641 452114 364202 316135 282803 232418 193976 167768 149886 157442
20370 157442 162199 153077 127298 96893 91558 95456 98220 104456 113027 113364 95784 82655 97474
20357 97474 89407 74818 77598 98595 100996 90318 102459 129275 127966 122257 116365 135264 135696
20344 135696 132826 133940 132983 121911 127930 125136 111188 101138 114685 131879 128098 132362 145736
20331 145736 169317 218115 263773 281467 348240 423322 479113 555112 638361 733013 799077
20320G99077L5947K6485L1686j0305n1784q2906q7893q0769p4457o4189n7358
20309C83534o1796n3503l9200l6716j2237J1015K659q731L746j3334L790J3569
20297A92796L8021M5575N4973P1926R4779P7084R8320R9529Q2858L4908K2203
20286I12972K6660O827k8994o4236q0475r5239j07800r8282p2135o8296m8820
20275B82182m9619k9680k4973K24j8104j7314L405l217l471k0122j6153l796K1538
20262A20900j5163j0359J3798N186n472J0041l882j7281l6m114N679j9366m414
20249G5517n225j0870j209n102R516J2697m976N943n911l93J0409N266J822m836
20235H2648n606j3956j1276o965Q131k405j717k734j4452Q798K3465n872O840
$$ plain form
20320 799077 835024 861509 893195 882890 831106 748200 660307 579538 505081 440892 383534
20309 383534 321738 268235 229035 192319 180082 191097 193756 185025 188771 175437 179227 192796
20297 192796 230817 276392 331365 403291 498070 575154 673474 773003 855861 890769 912972
20286 912972 939632 946459 917465 853229 772754 677515 569715 471433 399298 331002 282182
20275 282182 232563 202883 177910 178134 160030 142716 146121 142904 139433 119311 103158 99362 120900
20262 120900 105737 95378 109176 114362 108890 118931 115049 97768 97732 93618 99297 79931 75517
20249 75517 70292 59422 58213 53111 62627 75324 70348 76291 70380 69987 80396 85662 87484 82648
20235 82648 77042 63086 51810 44845 52976 50571 48854 46120 31668 40466 63931 58059 64899
20222F4899l596p929l033J328l464q954Q157l445j1320L47J3360N374r833n229
20208C6662O903m248J6877J7422j8554k2083K6651J880l2071R507K286r597K74
20195C1909k272p656J3804M741j4739K845k304m7J3332J6265m19j619J1879j1829
20181E3890k4017o079N733K919K5805L913j413J1324j250M766k413k7310k4342
20168B1526O83J2043M163o172o3m700n306r553K89J4718J3837J4184P704j0904
20154E2449j4909n271O690p770K197O061L820M951j114j75o426k858J0920O849
20140E5414O164J9767j750o976o740k6517r998o109J1201J3902J2037n070j2139
20127D3186r671L664l418N727m344p198J599R485j387j6220L632J9835R806k056
$$ plain form
20222 64899 61303 53374 50341 51669 48205 39251 47408 43963 32643 32990 46350 51724 41891 36662
20208 36662 43565 39317 56194 73616 55062 32979 59630 61510 29439 38946 41232 31635 31909
20195 31909 29637 21981 35785 40526 25787 28632 26328 26281 39613 55878 55459 53840 65719 53890
20181 53890 29873 23794 29527 32446 58251 62164 60751 72075 70825 75591 73178 45868 21526
20168 21526 22209 34252 38415 32243 32180 27480 22174 12621 12910 27628 41465 55649 63353 52449
20154 52449 37540 32269 38959 31189 33386 39447 43267 48218 47104 46929 40503 37645 48565 55414
20140 55414 61578 81345 79595 72619 65879 39362 29364 23255 34456 48358 60395 55325 43186
20127 43186 33515 37179 33761 39488 35144 27946 29545 39030 37643 21423 25055 44890 54696 52640
20113E2640j389o770j1989P571l255o010o021r441K2662L1574r013k1732k8853
20100I974K211J9772J635K302Q621r773l875K503m315M90K624J5059Q285q399
20086D7114j0534r929l571O783J2834R075p414q957j2349n73R498m644q384m843
20072A4106j1202j1101J4259N184P675j246k8345J3691K9464K0237J1933r404
20060E5251j4445k4601k1361O42m478J4573Q591m168n753L238J0605R056J7797
20047D4947P314j6502p291K3116K729K667j926j2623J578j3646k2426j7942Q41
20034i164k5688J6631K9325M364N651K127J912r372M77r213N116J1429k390r324
20020A1881j3457j9912q592J2681L6607J6705j73K549N689N058J8351p651j6955
$$ plain form
20113 52640 51251 44481 32492 40063 36808 30798 24777 15336 37998 69572 60559 38827 9974
20100 9974 12185 31957 33592 35894 44515 34742 30867 33370 29055 29545 32169 47228 55513 47114
20086 47114 36580 26651 23080 29863 42697 51772 44358 35401 23052 22479 31977 27333 18949 14106
20072 14106 2904 -8197 6062 11246 18921 17675 -10670 3021 32485 52722 64655 55251
20060 55251 40806 16205 -5156 -4514 -8992 5581 14172 10004 4251 7489 18094 27150 44947
20047 44947 52261 35759 28468 51584 54313 56980 55054 42431 44009 30363 7937 -10005 -9164
20034 -9164 -34852 -18221 11104 15468 21119 23246 25158 15786 16263 7050 12166 23595 21205 11881
20020 11881 -1576 -21488 -30080 -17399 19208 35913 35740 38289 43978 49036 67387 59736 42781
20007D2781p104J5623p364l839j3232m552K0014N249p402Q495r790j1136J197
19994B8940J703k194p565P643k0419r259J639j1773L796P153J0190j696k345l305
19980B508Q976O754L318n80m590K600J2283k215q006L609j5147J122P661j532
19966A6761K304R332r607J627L637K856j334r022m205M001J5314J7865q889o816
19952C3824j3216q870k55R163K257j0458N232j4089j4119M370j3315j3640J7887
19939a5229P613j34J7101J6721Q512j3293j9082o32K7873J6671j7588j6193l952
19926H388j748q850n56O979q188k404q681J0131Q599K0417Q248p064k3813j1881
19912a0423m372J3031J2822J645L681J2271r416o963R61j644j1157O674J7032
$$ plain form
20007 42781 35677 51300 43936 40097 26865 22313 42327 47576 40174 48669 38879 27743 28940
19994 28940 30643 28449 20884 28527 8108 -1151 488 -11285 -7489 -336 9854 8158 5813 2508
19980 2508 11484 18238 21556 20976 16386 18986 31269 29054 21048 24657 9510 10632 18293 16761
19966 16761 19065 28397 18790 20417 24054 26910 25576 16554 12349 16350 31664 49529 40640 33824
19952 33824 20608 11738 11483 20646 22903 12445 17677 3588 -10531 -6161 -19476 -33116 -15229
19939 -15229 -7616 -7750 9351 26072 34584 21291 2209 1577 29450 46121 28533 12340 8388
19926 8388 6640 -2210 -2766 4213 -3975 -6379 -15060 -4929 3670 24087 32335 25271 1458 -10423
19912 -10423 -14795 -1764 11058 12703 16384 28655 19239 12276 13237 11593 436 7110 24142
19899B4142p604j8703o374J5391J3949j2585O652n390o10J7460K883k774J665
19886B8102R86j1300r308N84J0245m798P449r251r634Q987Q820r45q601J3720
19872B5056L0517M425k9928k0847j7553J476P976k688k0517O51K9988j5969j0304
19859a7717q284J1407K8781J0655o851j5574k422L620j8529j5130J968J1032J8882
19846A838M497M866R858p951j014j3653M50O40Q366M932Q113j0698j6181N602
19832c35K017O468n968j5837Q476L4079M096p344j5190j1453O389n30M413j4307
19818e026M745J906k610j0864J6577K4558j119k4153k2827Q871l584K619K6510
19805A5603K8310m144q906r552j7941j2385j8942m130Q650J7962L1786J1307o699
$$ plain form
19899 24142 16538 -2165 -8539 6852 20801 8216 14868 9478 8868 26328 29211 26437 28102
19886 28102 29088 17788 8480 9064 19309 14511 21960 12709 3075 12062 20882 19937 11336 25056
19872 25056 55573 59998 30070 9223 -8330 -6854 1122 -1566 -22083 -21432 8556 -7413 -17717
19859 -17717 -26001 -14594 14187 24842 17991 2417 -5 3615 -14914 -30044 -28076 -17044 1838
19846 1838 6335 11201 21059 13108 12094 -1559 -1109 -469 7897 12829 20942 10244 -5937 -335
19832 -335 1682 8150 2182 -13655 -5179 28900 32996 25652 10462 -991 5398 4868 9281 -5026
19818 -5026 -281 1625 -985 -11849 4728 29286 28167 4014 -18813 -9942 -13526 -10907 15603
19805 15603 43913 39769 30863 21311 3370 -9015 -27957 -32087 -23437 -5475 26311 37618 30919
19792C0919j7219k258J4860M486m215j296k7754j0398J4960J6202k064j7502q399
19779i678O586K663l974J3236Q172O152r408p097N376O78R645j2411j0300k4305
19765b4665j696K068J8632J4090R345k6043J7530J0689q585j052p836J4300J404
19752A8181p403r767J7n102J1870m445j3436O766l250r424k233j8623J1323J3989
19738a1537M370j5232N648j0470K368J6949N293q728J5082J4187N346j9569j6791
19725a3084k890m362J1538J7663K0956j3457P681Q427K412J8317j6717l803o804
19712B5877j9507J644o124k1699r484L679Q435J4065K5053K401o943j3587j5809
19699a1999J6308j4727k947J0771Q517m263o691K755o282l195m228O491J855L468
$$ plain form
19792 30919 13700 11442 26302 30788 26573 25277 -2477 -12875 2085 18287 16223 -1279 -9678
19779 -9678 -3092 -429 -4403 8833 17005 23157 13749 6652 12028 12706 22351 9940 -360 -24665
19765 -24665 -26361 -24293 -5661 8429 17774 -8269 9261 19950 11365 10313 2477 16777 18181
19752 18181 10778 1011 1028 -4074 7796 3351 -10085 -3319 -6569 -15993 -18226 -36849 -25526 -11537
19738 -11537 -7167 -22399 -16751 -27221 -24853 -7904 -2611 -11339 3743 17930 23276 3707 -13084
19725 -13084 -15974 -20336 -8798 8865 29821 16364 24045 32472 34884 53201 36484 32681 25877
19712 25877 6370 8014 1890 -19809 -29293 -25614 -17179 -3114 21939 24340 17397 3810 -11999
19699 -11999 4309 -10418 -13365 -2594 5923 1660 -5031 -2276 -8558 -11753 -15981 -9490 -7635 -4167
19685d167N976j5243Q800R441J4555M078j1418j3925m14o401Q634p588j1881l456
19671b3009l456n498J8708K1484L966k1879p473J4298Q368j7410p877q883J0277
19658a8384m0J950J5933J1366N663j037q701o011J1819Q191j1367k1545j4145
19645b6308j1716K1659J9392m875L525P79J0264k032j4029j4999J0485j427R516
19632B34m593o073J7802p81j0477m282r746K0446n689o204m332Q117O635J6803
19618A7860j1263j8646P776R882o327o422j016J9752J077l860J1610J2607M496
19605C7526q507n487O879j1007m970k625J4074j282o671O954J7691k925j9785
19592A9865j0227L0979M526k3586j7341k101k0183J0117K4529P739k2985j3225
$$ plain form
19685 -4167 1809 -13434 -4634 4807 19362 23440 12022 -1903 -2317 -8718 -84 -7672 -19553 -23009
19671 -23009 -26465 -31963 -13255 8229 12195 -9684 -17157 -2859 5509 -11901 -19778 -28661 -18384
19658 -18384 -18424 -16474 -541 10825 16488 15451 6750 739 12558 20749 9382 -12163 -26308
19645 -26308 -38024 -16365 3027 -1848 1677 2456 12720 10688 -3341 -18340 -7855 -9282 234
19632 234 -4359 -10432 7370 6589 -3888 -8170 -17916 2530 -3159 -9363 -13695 -5578 1057 17860
19618 17860 6597 -12049 -4273 5609 -718 -7140 -8156 11596 12673 8813 20423 33030 37526
19605 37526 29019 23532 30411 19404 14434 11809 25883 24601 17930 24884 42575 39650 19865
19592 19865 9638 40617 45143 21557 4216 2115 -18068 -7951 16578 24317 1332 -11893
19580a1893j0598J5478j070p550o839J1861j716J1995K3496J1386N491r809k3586
19567F646o375j5672l445j63J0392j589j1256m490K672J1198P522n718j2704j0522
19553c3504j707r571J3246J6860q431o882P872J0809J1664j5364j5917J2240R039
19540i646K3823J0088j0956N588j02o875q256k993Q382L790N977j2708j7472m717
19526a6077O385M850j6759k8442j667J8563K0457K1005j5577j7931r8P061P516
19513a0714j6503O550J3845K0095m303j3111j0347J5036J164n728p072j0381J6644
19500d825J7642l922m08J3010m439j1951j0990m335n963r906n506M055L22J8299
19486h917p475l197J6991p7p225j5439j1691n195k980J63J1114J1856J2984L315
$$ plain form
19580 -11893 -22491 -7013 -8083 -15633 -22472 -10611 -12327 -332 23164 34550 40041 30232 6646
19567 6646 271 -15401 -18846 -19009 -8617 -10206 -21462 -25952 -23280 -12082 -4560 -10278 -22982 -33504
19553 -33504 -35211 -44782 -31536 -14676 -23107 -29989 -22117 -11308 356 -15008 -30925 -18685 -9646
19540 -9646 14177 24265 13309 18897 18795 11920 3664 671 9053 12843 18820 6112 -11360 -16077
19526 -16077 -9692 -4842 -21601 -50043 -51710 -33147 -12690 8315 -7262 -25193 -25291 -18230 -10714
19513 -10714 -27217 -20667 -6822 13273 8970 -4141 -14488 548 1712 -4016 -11088 -21469 -4825
19500 -4825 12817 8895 8487 21497 17058 5107 -5883 -10218 -16181 -26087 -31593 -27538 -27216 -8917
19486 -8917 -16392 -19589 -2598 -2675 -9900 -25339 -37030 -42225 -45205 -45042 -33928 -22072 -9088 -5773
19472e773N152J2646Q950m546L801L885j7708n908J2628J0235r717k2918j3626
19459b2899J2857j602N977J6903Q962j6662k0135m140p412J133K8712L203k8740
19446b3843k4827q156L03K4532Q211J3970L2986k405l5856q624J1976O675j470
19433f528k961q492J495j574o347q90L670r889k3974K771K6857R419J703j3355
19419b8095k2734O987J0354K841J1464J4579K1382J7073N241n196P027n270Q560
19406D4213j0775j7093r626j879N696K9203N006J5812J001L2454N0273L4434M3808
19393B22527N1473J12141J26645J03767O4413O4451Q4650P0596j519m4613n0226
19382H04305m3816m3185j02146r6593p2393o3682q7752o8793m7008m1376j5546
$$ plain form
19472 -5773 -621 12025 20975 16429 20230 24115 6407 499 13127 23362 13645 -9273 -22899
19459 -22899 -10042 -11644 -5667 11236 20198 3536 -16599 -20739 -28151 -27018 1694 4897 -23843
19446 -23843 -48670 -56826 -56523 -31991 -23780 -9810 23176 20771 -15085 -23709 -11733 -5058 -6528
19433 -6528 -9489 -17981 -16486 -18060 -24407 -25297 -21627 -31516 -55490 -52719 -25862 -16443 -14740 -28095
19419 -28095 -50829 -43842 -33488 -30647 -19183 -4604 16778 33851 39092 33896 40923 35653 44213
19406 44213 33438 16345 6719 4840 10536 39739 44745 60557 61558 94012 144285 178719 222527
19393 222527 274000 386141 512786 616553 680966 745417 830067 900663 899144 854531 804305
19382 804305 760489 717304 615158 518565 446172 382490 294738 225945 178937 137561 122015
19371A22015m360j1274l443m083L5593J8819L237K4348L0433M4072M3396N4616
19359C53369Q1458J05901Q2703N2602O5280P7373P5850j2629o1768m9256m3108
19348G27775q2489j07376p3644p7800r0296p8135p7982n3139k9820q615M952q345
19336D5086k0155o211J0332j4245j9575M013N396M651q768n188q165O196J976
19323d657l925K754q820J4043K2858J1669J576L68m138k533k0725K664L576K869
19309A7579O197n418j2924P804Q481j7132k254J1015K539j7209j9978k6410N454
19296d2256N832J4860J2883n334k662p52J2999K7542l080N976n706J2517K7268
19283F0087K4325M3083M5686r18k6510k6722j5131k2438k1839k966J7879M5358
$$ plain form
19371 122015 117655 106381 102938 98855 134448 153267 156504 180852 211285 255357 298753 353369
19359 353369 434827 540728 623431 676033 741313 818686 894536 881907 820139 770883 727775
19348 727775 645286 537910 464266 386466 296170 218035 140053 86914 57094 48479 53431 45086
19336 45086 24931 18720 29052 14807 -4768 -755 4641 9292 524 -4664 -12829 -6633 -4657
19323 -4657 -8582 -5828 -14648 -605 22253 33922 35498 35866 31728 29195 8470 11134 14710 17579
19309 17579 23776 18358 5434 13238 21719 4587 2333 13348 15887 -1322 -21300 -47710 -42256
19296 -42256 -36424 -21564 -8681 -14015 -16677 -17429 -4430 23112 20032 26008 20302 32819 60087
19283 60087 84412 127495 173181 172263 145753 119031 103900 81462 59623 56657 74536 119894
19271A19894O1524J4734J9884L2670j5072n4520n6769m6034j5524r50O531N551
19259G1919m146L8244M6420k0300m3212j5835m098k1517j7762L513k0709k0518
19247h001m6K786J108o552O94j1544M787K3662K5850J5310j0377j3420J8317N2961
19233I5535K9087M6983K0606k7204l3540q120k2025j5298j7432Q082J4080K4448
19221A15202N8881N3673K6972L7666j3472m8353m3055m7322k8523j729P63n964
19209A04739n000L0775N4748m615l0620j8955l0174k0411j8501k1690j6539l1288
19197g531j3986K5224K0866O866L03j1063Q60o256Q243j5989O091j164q415q513
19183d464m454J7884K2478N6r492n723L282j6723k7877R410R432J568k08J9747
$$ plain form
19271 119894 181418 196152 216036 248706 233634 179114 122345 76311 60787 59837 66368 71919
19259 71919 67773 106017 152437 132137 88925 73090 68992 47475 29713 33226 12517 -8001
19247 -8001 -8047 -5261 -4153 -10705 -10011 -21555 -16768 6894 32744 48054 37677 24257 42574 95535
19233 95535 124622 171605 192211 165007 131467 123347 101322 86024 68592 76674 90754 115202
19221 115202 174083 227756 254728 292394 278922 230569 187514 140192 111669 109940 110703 104739
19209 104739 99739 130514 185262 180647 150027 131072 100898 80487 61986 40296 23757 -7531
19197 -7531 -21517 3707 24573 31439 31742 20679 21539 15283 23526 7537 13628 12464 4049 -4464
19183 -4464 -8918 8966 31444 31500 22008 16285 19567 2844 -25033 -15623 -6191 -4623 -4831 14916
19169A4916j0038j3084Q656P470p359Q352J6612p587j452r856j0598j2080j6556
19156c2604m922J7372M719P467o274m28k161k218m22q287k5030P653M2719J8434
19142A6018J4821n397R86r630l1546k2004J2592j0790r373N722p665K5583J987
19129a8696j2892n698P804K1372M001p980k6788j4245R95K6971M249P966P731
19116e210J2134l041k4270n168J8231K6304Q625J3006L3764K09j3451J9193J9130
19103I9456J9165M274o167J3795j455j7144j2038m689k877j3971k7594k2072n661
19090B3022N904K250m862j4290j0801j3238j0021M383L81j2513O157L4421J8574
19077B9367o198O941K5936K368J1464J3451L665p566K448P808p232L555J1917
$$ plain form
19169 14916 4878 -8206 450 7920 561 8913 25525 17938 16486 6630 -3968 -16048 -32604
19156 -32604 -37526 -20154 -15435 -7968 -14242 -14670 -16831 -19049 -19471 -27758 -52788 -45135 -2416 16018
19142 16018 30839 25442 26428 16798 -14748 -36752 -24160 -34950 -44323 -38601 -46266 -20683 -18696
19129 -18696 -31588 -37286 -29482 -8110 -4109 -12089 -38877 -53122 -52127 -25156 -20907 -12941 -5210
19116 -5210 6924 3883 -20387 -25555 -7324 18980 27605 40611 74375 74584 61133 80326 99456
19103 99456 118621 122895 116728 130523 129068 111924 99886 95197 92320 78349 50755 28683 23022
19090 23022 28926 31176 26314 12024 1223 -12015 -22036 -17653 -17272 -29785 -23628 10793 29367
19077 29367 23169 30110 56046 58414 69878 83329 86994 79428 81876 89684 82452 86007 97924
19064I7924j1352j6128j8703K517j6321j0245j2718j6348l39p615j9181k3471
19052e1980p758m716R249j4871j9082J2516N132j760J0054M253o716l198J8697
19039e0180J5109P305j1788o639O864J6844P714K0845J1506K7420O771j7939J292
19026C5124M250j0077k2025J808R820J224N224j1596j0255j395k4993k7121n030
19013e5042L635J2846J2541K088L492K2036m060n10N137J6984K2592J3192J1411
19000F6342o052J5630K2280J2585J0110J4351j1380Q334j2033j56j3539k3106
18988H3366J4971Q968P025Q684p901K1518Q943J0278K7163K1984J6401q186p760
18975B05454n942j4977R322Q692r222l039l53j9443O481R084j8230Q969j0032
$$ plain form
19064 97924 86572 70444 51741 54258 37937 27692 14974 -1374 -1713 -9328 -28509 -51980
19052 -51980 -59738 -64454 -55205 -70076 -89158 -76642 -71510 -73270 -63216 -58963 -65679 -68877 -50180
19039 -50180 -35071 -27766 -39554 -46193 -39329 -22485 -14771 6074 17580 45000 51771 33832 35124
19026 35124 39374 29297 7272 9080 18900 20124 25348 13752 3497 2102 -22891 -50012 -55042
19013 -55042 -51407 -38561 -26020 -23932 -20440 1596 -2464 -2974 2163 19147 41739 54931 66342
19000 66342 60290 75920 98200 110785 120895 135246 123866 132200 120167 120011 106472 83366
18988 83366 98337 107305 114330 123014 115113 136631 145574 155852 183015 204999 221400 213214 205454
18975 205454 199512 184535 193857 202549 193327 190288 189935 170492 176973 186057 167827 176796 166764
18962A66764j8844Q64J4923j4337n205L586j2786J5404K0909L7228k065M133J4570
18949B25144Q611q089K424J7149J2022J8538K9667K526j7777J1759k1973k5427
18937B54574r57O784j4630l379m43L1051O495n120j6892k6389J3367L3519L6780
18924C14760O851j0000k054P25j4232o06J3032O727p265o470j3263r281J0017
18911B88941K3717J5977K594J0626O262K6549J6505J4899K8284O189J4824K0650
18899D76017J4548K3698L9220L3363L6259L5214M9230K5144M3047L8016N4989
18888H68745O5127Q7452P4281O1132P9450O5619R4555J12091J24021J72833J91783
18877A997089J98853K29301K95215L44086L54857L42745L90545M77504N43507
$$ plain form
18962 166764 147920 148784 163707 149370 144165 147751 134965 150369 171278 208506 206441 210574 225144
18949 225144 233755 225666 228090 245239 257261 275799 305466 307992 290215 301974 280001 254574
18937 254574 253617 260401 245771 242392 241949 273000 279495 274375 257483 231094 244461 277980 314760
18924 314760 321611 311611 309557 310282 296050 295444 308476 315203 307938 301468 288205 278924 288941
18911 288941 312658 328635 331229 341855 348117 374666 391171 406070 434354 440543 455367 476017
18899 476017 490565 514263 553483 586846 623105 658319 707549 732693 775740 813756 868745
18888 868745 933872 1021324 1095605 1156737 1236187 1301806 1396361 1508452 1632473 1805306 1997089
18877 1997089 2195942 2425243 2720458 3064544 3419401 3762146 4152691 4630195 5173702
18868E173702N49909O44019P00932Q01865R57459J211113J539849J967288K713992
18859A6260128M137723O545609R745056J0921170J0295644J4385491K2199692
18852I4490513K2206631J1999986R987076J6069709J6489783K448682r036568
18845A64655812q094714n698477j1977779k0157046j9096840j6266414j4897531
18838F8467011j3862661j1271911q774907o427814m311770k692971j539205p42484
18830A8843288l3221O53028J369758K384157M166868O981883R766394R625008
18822E3757163J0457831J6534839K2792496J7035754R090876J1435018J7205573
18815A58309550J1207077m058306r635522o651851p040058j6246466k0346873
$$ plain form
18868 5173702 5723611 6367630 7068562 7870427 8827886 10038999 11578848 13546136 16260128
18859 16260128 20397851 26943460 36688516 47609686 57905330 72290821 94490513
18852 94490513 116697144 128697130 138684206 154753915 171243698 173692380 164655812
18845 164655812 156561098 150862621 138884842 118727796 99630956 83364542 68467011
18838 68467011 54604350 43332439 34557532 28129718 23817948 21124977 19585772 18843288
18830 18843288 18810067 19463095 20832853 23217010 27383878 34365761 44132155 53757163
18822 53757163 64214994 80749833 103542329 120578083 129668959 141103977 158309550
18815 158309550 169516627 165458321 155822799 149170948 142130890 125884424 105537551
18808A05537551j7714295j5365034j4643133j3044280j0450124q102640n877604
18801B0340441m090602k826634k030718j534562j153644q53221o97831o51448
18793F501781o08214n22554m20747m00523m04147l54744k98598k77953k30633
18784B983668j87571j78686j64298j34635j09595j03539q7986o7888l9300J0384
18774A920554P1384J03494Q9625J75406K30346M9135K2010N5385q5232j70048
18764B462059j25934j83692k38738k26502k10327j65888r9179p2804m8358m2669
18754A047968k7705m0341j0445k5102m2004j9617j2211j8136n621j1938m39M6646
18742H81055Q2804J23098J15321J62746K33548J09132M3615R0225k973j60212
$$ plain form
18808 105537551 87823256 72458222 57815089 44770809 34320685 26218045 20340441
18801 20340441 16249839 13423205 11392487 9857925 8704281 7851060 7153229 6501781
18793 6501781 5893567 5371013 4950266 4549743 4145596 3790852 3492254 3214301 2983668
18784 2983668 2796097 2617411 2453113 2318478 2208883 2105344 2017358 1949470 1910170 1920554
18774 1920554 1991938 2095432 2185057 2360463 2590809 2639944 2661954 2717339 2632107 2462059
18764 2462059 2336125 2152433 1913695 1687193 1476866 1310978 1211799 1138995 1090637 1047968
18754 1047968 1020263 979922 969477 944375 902371 882754 870543 852407 846786 834848 834409 881055
18742 881055 963859 1086957 1202278 1365024 1598572 1707704 1751319 1841544 1838571 1678359
18732A678359j36785j47894k00472j95548j44228j38382r4462m8070n3483n9160
18722D59875k2623j1921l3728k0644j810k948l79K729n206K386L815p459j5716
18709C46371K58J0857j5276k2026Q77j9823j7872k1851J5236K8489j2489k6159
18697B66592q785N099J6796p121k1601j2121K953K705l133l3645j8528J6879m533
18684B01557o254N906J0958L859Q07l330m228l4199j9006J2785l700m241O999
18671A67913j2405n471K596P372k2504J510P132K5629Q293J1903r010j8449r511
18658A54998n80K5799K3483O626Q083J7976j51p397n603k2808Q886j1868j2144
18645A85300J5668K5160o917L95q533k5749p392N209j0450O616N654n501n188
$$ plain form
18732 1678359 1541574 1393680 1193208 997660 853432 715050 620588 572518 519035 459875
18722 459875 437252 425331 391603 370959 369149 366201 365822 368551 363345 365731 369546 362087 346371
18709 346371 346629 357486 342210 320184 321061 301238 283366 261515 276751 305240 292751 266592
18697 266592 257807 262906 279702 272581 250980 238859 241812 244517 241384 207739 189211 206090 201557
18684 201557 195303 201209 212167 216026 216833 213503 209275 175076 156070 168855 165155 160914 167913
18671 167913 155508 150037 152633 160005 137501 139011 146143 171772 180065 191968 182958 164509 154998
18658 154998 154418 180217 203700 210326 218409 236385 236234 228837 223234 200426 209312 197444 185300
18645 185300 200968 226128 219211 219606 211073 185324 177932 183141 172691 179307 184961 179460 174272
18632A74272m766r065j2059J0997j276K5357K3610j2889k1669q40K8604K5944
18620B26220J7217J290N047j4508r184p783Q908J6849j619k045J973j0091n538
18607B26736j5923j5147j0407P126J8719j7688o209O812l142K547l80o498M118
18594A90664M74q568J4587j718n46k68k969j5193p795J2648n948j2543M186j2965
18580A54046j1195n240j4213O882j73j443q355K650K5636q300l050j4400j7454
18567A05391M005K1974L641o503q86N954R36K11R573j5190j4264O450o317k0189
18553I4786R453J524J373J5416l628k347L177O332O624R784J063M700k5917P896
18539A30236K1666m241k852m840j5498j7833j705L526k277R19o173j4525J7899
$$ plain form
18632 174272 169506 160441 148382 159379 158103 183460 207070 194181 172512 171672 200276 226220
18620 226220 243437 244727 249774 235266 226082 218299 227207 244056 242437 240392 242365 232274 226736
18607 226736 210813 195666 185259 192385 211104 193416 187207 194019 190877 193424 193044 186546 190664
18594 190664 191138 182570 197157 195439 194893 194625 191656 176463 168668 181316 175368 162825 167011 154046
18580 154046 142851 137611 123398 130280 130107 128664 120309 122959 148595 140295 137245 122845 105391
18567 105391 109396 131370 135011 128508 127622 133576 134512 134723 144296 129106 114842 121292 114975 94786
18553 94786 104239 105763 107136 122552 118924 116577 119754 126086 132710 142494 143557 148257 122340 130236
18539 130236 151902 147661 144809 139969 124471 106638 104933 108459 106182 107101 100928 86403 104302
18526A04302M443j6783O151q239j6930J2223R182j4781J53R667J4375J8883J6562
18513A39208j1746j4342r271m605j330k694l142m049J0409P016q012N847l78j051
18499A01860K937o086j0417j0230m339n985J8190L384j0725O39O938J0031o932
18486H9265L67L807j3316J5849N48m477j6722l917O335k3471j6259J5351K1026
18473G4386J0787K282k3934L023p183j783K9148J5077o531k565Q770K3747K2055
18460A47279K9948J0455M844j5449l276M2528K0207j0883j2252l4354l9970k8012
18448A11065Q621k526o595j7351L450j1333l1294j8409J2734q12N451N462J834
18435F0297R958K420j7422n980K2884K6718N5569N0867J5495p613p654j1178J8522
$$ plain form
18526 104302 108745 91962 98113 89874 72944 85167 94349 79568 79721 89388 103763 122646 139208
18513 139208 127462 113120 103849 99244 97914 95220 92078 88029 98438 105454 97442 103289 102911 101860
18499 101860 104797 98711 88294 78064 73725 67740 85930 89314 78589 79228 86166 96197 89265
18486 89265 89632 93439 80123 95972 96520 92043 75321 71404 77739 54268 38009 53360 74386
18473 74386 85173 87455 63521 66544 59361 57578 86726 101803 95272 92707 101477 125224 147279
18460 147279 177227 187682 192526 177077 173801 216329 236536 225653 213401 179047 139077 111065
18448 111065 119686 117160 110565 93214 96664 85331 54037 35628 48362 47550 53001 58463 60297
18435 60297 70255 72675 55253 49273 72157 98875 154444 205311 220806 213193 205539 194361 212883
18422B12883J0494o559j9221l3824m3308j3904J534J031K876j057m222K2148M3261
18409A72132L7572o358k2931m665J5850M3400O189j5289l7416l4527k0602l6608
18397I6747q973r90p53p994j0427l882R024J2556N974p28j1450N62j894k279O119
18382H1612K0389K149Q493L5029L9885P874p288j0480O343O788N108N340k866
18369A98376L203k8235k6046q009q357j2425M358Q38j9678j2015k9656j4749M982
18356E2587K0272j1418j8420J243n111M79K3350J0774j0996O684k3975l400J4442
18343E6511J8125J5160n420j2555j9098J760J7862Q082k8968j8776J25J6492K0789
18330G0089j0304J2974K6231K986k540j0130N406q410j7209J3143J1953K7257
$$ plain form
18422 212883 223377 216818 197597 163773 120465 106561 108095 109126 112002 110945 106723 128871 172132
18409 172132 209704 203346 180415 175750 191600 235000 241189 225900 188484 153957 133355 96747
18397 96747 87774 86784 86031 78037 67610 63728 72752 85308 91282 90554 79104 79666 77772 75493 81612
18382 81612 102001 104150 112643 147672 187557 195431 188143 177663 184006 190794 195902 201242 198376
18369 198376 201579 173344 147298 139289 130932 118507 122865 123703 104025 92010 62354 47605 52587
18356 52587 72859 61441 43021 44264 39153 39632 62982 73756 62760 69444 45469 42069 56511
18343 56511 74636 89796 84376 71821 52723 54483 72345 80427 51459 32683 32808 49300 70089
18330 70089 59785 72759 98990 101976 99436 89306 94712 86302 69093 82236 94189 121446
18318A21446O463m779O070J8562J9709O0646P4095N2841N1380Q5312J09542Q3430
18306F84717N3481R0987R8563N1269k8043n1513m1988q1979r0590p9995p5756
18295E29153p6678p6164o2832n7946m5074p780j1411k6089o520L372O226q018
18283A60239K492K3135K5065L6038O7809M3632N9150J19435J15035O1484L9771
18272G53285Q0637R1009K2830l2223o2218n3233o4634j33861j02825o5654n5983
18261C77130o1438p5024m6490l4130j5174k5974J573j3623j0468J096j4103J449
18249H4824k829m804j0939j9354N595j1127j6649j4289M861L1283J3414L362L857
18236F7205o014j6464j5960J313L795Q208P834R447q985L920K5255R076k4835
$$ plain form
18318 121446 127909 123130 129200 147762 167471 228117 302212 355053 406433 491745 601287 684717
18306 684717 738198 829185 927748 979017 950974 899461 857473 775494 684904 604909 529153
18295 529153 452475 376311 313479 255533 210459 202679 191268 165179 158659 162031 168257 160239
18283 160239 162731 185866 210931 246969 314778 358410 417560 536995 652030 713514 753285
18272 753285 833922 924931 947761 915538 853320 800087 735453 601592 498767 433113 377130
18261 377130 315692 240668 194178 160048 144874 118900 120473 106850 96382 97478 83375 84824
18249 84824 81995 77191 66252 46898 52493 41366 24717 10428 15289 46572 59986 63348 67205
18236 67205 61191 44727 28767 30080 33875 42083 49917 59364 50379 54299 79554 88630 63795
18223F3795o676J573P866J075L4J068l158n429j3092q662q16m15j3082l591J3892
18208C4382l167R611M296J823n775P895K7885J0477j6049j5089q051k1688K044
18195B8594p89L388J652J65N916J084j068j1278J382J5174M575o553o361L280
18181C9161L955n862J1245J1422J0127j5612j8208L246J7097j205J7651m283J2153
18168H0887j0107j0683j3705J7594n221J0183j6573l400l412j5955O532P329Q177
18155E1646k058J0991J3408J988r614j6895m900J6183j30J1533r007j2481K1793
18142G2457J4049K1554J5424J5852Q889j1495k1846n994K4891J5228J2728K5451
18130A87188J6849K6883J3410K2630K9269J6604M7201L3981M1958M7230M8215
$$ plain form
18223 63795 57119 58692 66558 67633 67667 68735 65577 60148 47056 38394 37578 37163 24081 20490 34382
18208 34382 31215 40826 45122 46945 41170 49065 76950 87427 71378 56289 48238 26550 28594
18195 28594 27805 31193 32845 33010 38926 40010 38942 27664 29046 44220 48795 42242 35881 39161
18181 39161 43116 37254 48499 59921 70048 54436 36228 39474 56571 55366 73017 68734 80887
18168 80887 70780 60097 46392 63986 58765 68948 52375 48975 45563 29608 36140 43469 51646
18155 51646 49588 60579 73987 75975 66361 49466 44566 60749 60619 72152 63145 50664 72457
18142 72457 86506 108060 123484 139336 148225 136730 114884 108890 133781 149009 161737 187188
18130 187188 204037 230920 244330 266960 296229 312833 360034 394015 435973 483203 531418
18119E31418Q1467Q8454J14622J45826J69888K10929K72190L76426N45717P35892
18109C272829J147682J992225L961519Q594734J4243481L629290o346090o708689
18101B3786981p466304n623091l622492k271293j394710r32174o15434m13711
18093A447772k56852j70868j62291j21475j02927p3847o2220m1808n3508m8719
18083C53257k9009k0336l3679k6069k9963P377n571n766n096N81R462k7348j5844
18070A71996k9222j7841j5972K2195J2724N973l517m063j1526j5161j3273k581
18058I9732L553Q498R673j9274j2839q575J2207M892j937P808J80k2571r456m341
18044F7550j1919R7K6018Q749j2698R046K4130J2954m129p743j0240j1187j6435
$$ plain form
18119 531418 612885 701339 815961 961787 1131675 1342604 1614794 1991220 2536937 3272829
18109 3272829 4420511 6412736 10374255 18968989 33212470 36841760 30495670 23786981
18101 23786981 16320677 10697586 7075094 4803801 3409091 2476917 1861483 1447772
18093 1447772 1190920 1020052 857761 736286 633359 559512 497292 455484 401976 353257
18083 353257 324248 303912 270233 244164 214201 221578 216007 210241 205145 205726 215188 187840 171996
18070 171996 142774 124933 108961 131156 143880 149853 146336 142273 130747 115586 102313 99732
18058 99732 103285 111783 121456 102182 89343 80768 92975 97867 95930 103738 103918 81347 71891 67550
18044 67550 55631 55728 81746 90495 77797 86843 110973 123927 119798 112055 101815 90628 74193
18031G4193o119K081k1958O10L823Q327p13L256M615o508m228j785j6318p952
18017C1324R641K439M406K11k695L830J5843m919j4569j6215r710J6428J7284
18004E3298k311L251K367J8198J2734j6479k6767k308J7685p957l155j0083j2087
17991B6386O918r575j357K1223J1186L163n166p227j3752J5576J7924r596M203
17978E9906m785p858k9120M72m074M944K4322K420O263Q348o905r084j3035O130
17964C7944Q087o872J5128J0475P873k0932j8105J4070R950p484q787N324k210
17951D4461K327j8771j4433Q813O133O589K5125p910j1556q683k288K2085J7894
17938F9786J961j3263N994K568M227j3191k3926j410o4m487n369N825R070J030
$$ plain form
18031 74193 68074 70155 48197 48807 52630 60957 60244 63500 68115 61607 57379 55594 39276 31324
18017 31324 40965 43404 47810 48021 45326 49156 64999 60080 45511 29296 19586 36014 53298
18004 53298 50987 54238 56605 74803 87537 71058 44291 41983 59668 51711 48556 38473 26386
17991 26386 33304 23729 22372 43595 54781 57944 52778 45551 31799 47375 65299 55703 59906
17978 59906 55121 47263 18143 18615 14541 19485 43807 46227 52490 60838 53933 44849 31814 37944
17964 37944 46031 39159 54287 64762 72635 51703 33598 47668 57618 50134 41347 46671 44461
17951 44461 46788 28017 13584 22397 28530 35119 60244 52334 40778 32095 29807 51892 69786
17938 69786 71747 58484 64478 67046 71273 58082 34156 32746 32682 28195 22826 28651 37721 38751
17924C8751N416M056Q983j638r143k1167k1619m414Q189K8676J8357k0410j7056
17911A6981J0407O319m785p445j1739J2321k41J119P015Q469j6838M380O993J1867
17897D4823k517J0699J4584j5243k6500o199K5071k768r700M088m579R97M841
17884C7597M950j133L526P44j1176k9772M648O807k919J4052r563p719k22N123
17870A4943K2985N30k8829J3683R304J6157R130J5574j450p420j3472o062J4387
17857E9460p690k4400j67L115r064k3430k609J8832J4559N728j7169j117R843
17844B5891L3776J1352k2110j5860R228J6041m509j8592N570K0932J2763o113
17832F8369j706k0264j2570J1243J9145k32j976j076j6330j4305k7382m181k821
$$ plain form
17924 38751 44167 48223 57206 55568 46425 25258 3639 -775 7414 36090 54447 34037 16981
17911 16981 27388 33707 28922 21477 9738 22059 21818 22937 29952 38421 21583 25963 32956 44823
17897 44823 42306 53005 67589 52346 25846 19647 44718 41950 32250 36338 31759 32756 37597
17884 37597 42547 41414 44940 45684 34508 4736 9384 16191 13272 27324 17761 10042 9820 14943
17870 14943 37928 38458 9629 23312 32616 48773 57903 73477 72027 64607 51135 45073 59460
17857 59460 51770 27370 27203 30318 21254 -2176 -4785 14047 28606 34334 17165 16048 25891
17844 25891 59667 71019 48909 33049 42277 58318 53809 35217 40787 61719 74482 68369
17832 68369 66663 46399 33829 45072 64217 63985 62009 60933 44603 30298 2916 -1265 -4086
17819d086N987r993k699K6701L491j0011m063l042M974K1149j2299n61J5266r26
17805B9888j5517j211K2585m489n32j5809k623J1901O629K23J0303j1744q395
17792B1209L022J1054L618R08M076k2273j3081J4365J4138q502k4026r986k87
17779e765J4385J26P474J6860p07K345k059j7921j0048N949J362p288M874r835
17765b48k514K8349J8004j502K876j1018Q51P655J4264Q564q487j8325N431m799
17751C9101k4053n943K313q186M861J7702J2097j2262j4928j7977J0707k483J0859
17738A1808N864j132k1703j9083Q781J2890l662J947J6216J1769K941N450r652
17725B2434n149l4007q757K8711K3218n251j5824j5043J2865o539q110j8130n941
$$ plain form
17819 -4086 1901 -8092 -10791 15910 19401 9390 5327 2285 7259 28408 16109 15548 30814 29888
17805 29888 14371 13160 35745 31256 30724 14915 12292 24193 30822 31045 41348 29604 21209
17792 21209 24231 35285 38903 39811 43887 21614 8533 22898 37036 28534 4508 -5478 -5765
17779 -5765 8620 8746 16220 33080 32373 34718 32659 14738 4690 10639 12001 4713 9587 -248
17765 -248 -2762 25587 43591 42089 44965 33947 34798 42453 56717 65281 56794 38469 43900 39101
17751 39101 15048 9105 11418 3232 8093 25795 37892 25630 10702 -7275 3432 949 11808
17738 11808 17672 16540 -5163 -24246 -15465 -2575 -6237 -4290 11926 23695 26636 32086 22434
17725 22434 17285 -16722 -25479 3232 26450 21199 5375 -9668 3197 -3342 -11452 -29582 -35523
17712c5523J0764q364m790J0470J7822K9062L681j6516j8596o205o342Q414j977
17699a8100Q864m41q303J0549J1545N998j147L1431q457k1812N930R581O269P435
17685C9342J6199k800k3586N285J9904M577K924n067j8930j5592j502k274P067
17672B5547J630r519o58j010N957P643m965n531r662l470k96j1382m737j1385
17658b1838J682J1280P103q11R237J2874k177L14O851j0265O769J6207o399n006
17644B5821j5565j2824R87p56Q463J4436M393R504J2982p147p190j8287j0389
17631D428K291J1484j9337m368J8701J7972N872j1220j4201l16K988R282j6788
17618F788K3792Q091j7346J771K7194k1634j8408p160p251m144K0135j769K13
$$ plain form
17712 -35523 -24759 -33123 -37913 -27443 -9621 19441 23122 6606 -11990 -18195 -24537 -16123 -18100
17699 -18100 -9236 -9677 -17980 -7431 4114 10112 8965 40396 31939 10127 16057 25638 31907 39342
17685 39342 55541 52741 29155 34440 54344 58921 61845 56778 37848 22256 20754 18480 25547
17672 25547 27177 17658 17000 15990 21947 29590 24625 19094 9432 5962 5666 -5716 -10453 -21838
17658 -21838 -20156 -8876 -1773 -2584 6653 19527 17350 17664 24515 14250 21019 37226 30827 25821
17644 25821 10256 -2568 -1581 -2337 6126 20562 24955 34459 47441 40294 33104 14817 4428
17631 4428 6719 18203 -1134 -5502 13199 31171 37043 25823 11622 11306 14294 23576 6788
17618 6788 30580 38671 21325 23096 50290 28656 10248 3088 -4163 -8307 11828 10059 10272
17605A0272q127l860o380k318m647P786O059J7417J4658p533n588K74j1292L446
17591A0167P170N193Q474N944k4457k0366J3599J6740Q875l851o90n892q153R123
17577B1876M126q971K714K1J4822Q182k181j3463j3380j4804j7556J347J2089
17564e178l645n952k0509J4357K4561J1322j2767j1438J2444N116l935k2454j043
17551a9121L9977J6624k2039p365O977J1269J4726J0220J2401k9789j1156n548
17539A7176j1451j4175J3050J3267j6126k32J250j2815j254J2651p747J132J4080
17526H806J0258j3343p198k149O474m784l792K4790J5525M726j54q842j3542m380
17512A2395N036Q630p711n271J5688J9569k256n715P433j5439k6434l830P397
$$ plain form
17605 10272 2145 -1715 -8095 -10413 -15060 -7274 -1215 16202 30860 23327 17739 18013 6721 10167
17591 10167 17337 22530 31004 36948 12491 -7875 5724 22464 31339 27488 26798 20906 12753 21876
17577 21876 26002 17031 19745 19766 34588 42770 40589 27126 13746 -1058 -18614 -17267 -5178
17564 -5178 -8823 -14775 -35284 -20927 3634 14956 2189 -9249 3195 8311 4376 -18078 -19121
17551 -19121 20856 37480 15441 8076 15053 26322 41048 51268 63669 33880 22724 17176
17539 17176 5725 -8450 4600 17867 1741 1509 2759 -10056 -11310 1341 -6406 -5274 8806
17526 8806 19064 5721 -1477 -3626 2848 -1936 -5728 19062 34587 39313 39159 30317 16775 12395
17512 12395 17431 26061 18350 13079 28767 48336 46080 40365 47798 32359 5925 2095 9492
17499I492K0133q164j3705m168p300K77j768J5730k266R700r212j0289j002q213
17485a0755q734J7226R226r951K996R130K294j971l899O23L234k1850J757K4885
17471A4211J5362j1198m373L022J256j0943L249l875K5407K1397n074J4207r726
17458E2922l7325k2799q064l019N997p237J2326j5752Q10J1144k497q23K1634
17445G317q00J7547R537L522m01K2572N6060O1943K3104k1224m0963m7093m8762
17432D2359l9883J930K5054r40k4714k880J6354J7130k657k5200K143M347Q613
17419B1656m265j8840R711m725p040j3400M651K1890J1612l667O605k4181j1752
17406a1745J2808N943J0289k143N598j130R449k420j2238m038j190j414k209Q910
$$ plain form
17499 9492 29625 21461 7756 3588 -3712 -3435 -5203 10527 8261 17961 8749 -1540 -2542 -10755
17485 -10755 -19489 -2263 6963 -2988 8 9138 11432 9461 5562 6185 9419 -12431 -10674 14211
17471 14211 29573 18375 14002 17024 18280 7337 10586 6711 32118 53515 48441 62648 52922
17458 52922 15597 -7202 -15266 -18285 -12288 -19525 -7199 -22951 -22141 -10997 -13494 -14317 7317
17445 7317 6517 24064 33601 37123 36722 59294 115354 177297 200401 179177 138214 91121 42359
17432 42359 2476 4406 29460 28520 3806 926 17280 34410 31753 6553 8696 13043 21656
17419 21656 17391 -1449 8262 3537 -3503 -16903 -12252 9638 21250 17583 24188 7 -11745
17406 -11745 1063 7006 17295 15152 20750 19620 29069 26649 14411 10373 9183 7769 5560 14470
17392A4470L911j1552J2440Q440K454k694M859J644J729Q514k6468k4666p948
17379a4867J3558O645P122n605Q282P847j5623k7564j3661M807Q932O400l954
17366a7681J1277J5651M260K889p692J4349J8114p901j898J0654j1865j9171n428
17353E558J5552k969k507n299j3429K223J2199J1740m110q625j1186j8782n935
17340b5570Q737J2849O349j6486l846J9660R210J2895K0602J0976j2137l99n588
17327C7252n897k2534j1352J5223N065J024j864Q950k091l202o122k9497J419
17314a3626J4644J1439r889J1870l721j6402r724Q296Q878m459P477O089m03J679
17300A2148r680j3856P125P5P017Q858L958k1837j8935L050j818J0875m876R19
$$ plain form
17392 14470 18381 6829 19269 27709 30163 27469 32328 33972 35701 44215 17747 -6919 -14867
17379 -14867 -1309 5336 12458 6853 15135 22982 7359 -20205 -33866 -29059 -20127 -13727 -17681
17366 -17681 -6404 9247 13507 16396 8704 23053 41167 33266 31368 42022 30157 10986 5558
17353 5558 21110 18141 15634 10335 -3094 -871 11328 23068 18958 10333 -853 -19635 -25570
17340 -25570 -16833 -3984 2365 -14121 -17967 1693 10903 23798 44400 55376 43239 42840 37252
17327 37252 31355 8821 -2531 12692 17757 18781 16917 25867 23776 20574 14452 -15045 -13626
17314 -13626 1018 12457 2568 14438 10717 -5685 -15409 -7113 1765 -2694 4783 10872 10469 12148
17300 12148 2468 -11388 -4263 -4188 2829 11687 15645 -6192 -25127 -22077 -23895 -13020 -17896 -16977
17286a6977p76Q593n482j7065J268J0168J1776O137n564j4043l0986m207K3489
17273c3669J1967j3884j2687L4355L0083j6147j6069K34R016K1038Q977j4818
17261H396n055K0608j1097j1352n449j434j1886p61O231J0826J2238J1402n80
17248B2087n385j3299r0L186j9304j0978J7904L2014Q241K785l34j3471k3545
17235a89k05J2682R046J0349P497q973r630Q344q383j2240J860O479q33R594K379
17220B7777j1278j3567J9018Q98k2860m125M516j7164L031J2772J1947R481l833
17207A6613j3591j2338o644K724P155O873L882q95j1877p893K4720j252P020J0811
17193B5308K733J0716K839q829j2657L232j859k5078K799K088R843n16j4111j1585
$$ plain form
17286 -16977 -17753 -9160 -14642 -31707 -30439 -20271 -8495 -2358 -7922 -21965 -52951 -57158 -33669
17273 -33669 -21702 -35586 -48273 -13918 16165 18 -16051 -15817 -6801 14237 23214 8396
17261 8396 3341 23949 12852 1500 -3949 -5383 -17269 -18030 -11799 -973 11265 22667 22087
17248 22087 16702 3403 3313 6499 -12805 -23783 -5879 26135 34376 37161 36827 23356 -189
17235 -189 -394 12288 21334 31683 39180 30207 20577 28921 20538 8298 10158 16637 15804 25398 27777
17220 27777 16499 2932 21950 22848 -12 -4137 379 -16785 -13754 -982 10965 20446 16613
17207 16613 3022 -9316 -15960 -13236 -6081 792 4674 3779 -8098 -15991 8729 7477 14497 25308
17193 25308 28041 38757 41596 32767 20110 23342 21483 -3595 -796 1292 11135 10619 -3492 -15077
17179a5077J3545N896p097j4208J8311K6177m395m256j0457J887J1152j1335n00
17166I643j7546J010Q617r992J4678J7351R480o371K653j1313o179N053r571o997
17152E16J0993j110j2783j4812m943K289Q066O927K225k900n290J9712J6463J3500
17138C8853j3112j8353j0139n477m77R949J595J8017M974p264j7217j7719k1306
17125c7676J4062J1487j0721P479j902J1497L7064P45j3481M623r278n108N611
17112A4402p180k3512K7536J0034k2092q141J2309p24j2803q159K0975J0316j992
17099A0969J3965o075k012q736n819k1006R259J487K578M203k290j4246K868J4181
17085f74J3212R528K562r93k0988j1662K2745p134j8286J26K661J7462J4587j3265
$$ plain form
17179 -15077 -1532 4364 -2733 -16941 1370 27547 23152 18896 8439 10326 21478 10143 9643
17166 9643 -7903 -6893 1724 -8268 6410 23761 33241 26870 29523 18210 12031 17084 7513 516
17152 516 11509 10399 -2384 -17196 -22139 -19850 -11784 -4857 -2632 -5532 -10822 8890 25353 38853
17138 38853 25741 7388 -2751 -8228 -8705 1244 2839 20856 25830 18566 1349 -16370 -37676
17125 -37676 -23614 -12127 -22848 -15369 -17271 -5774 31290 32035 18554 23177 13899 8791 14402
17112 14402 7222 -16290 11246 21280 -812 -8953 3356 2632 -10171 -18330 2645 12961 10969
17099 10969 24934 18859 16847 8111 2292 -18714 -9455 -7968 -5390 -1187 -3477 -17723 -14855 -674
17085 -674 12538 22066 24628 23635 2647 -9015 13730 6596 -11690 -11564 -8903 8559 23146 9881
17071I881m800K1365P648J880m305l0153j4229O845p181N271o303Q169n007j4851
17057b5770j7064K793K9852J3562M784k931k272J7503L0953L829j9171j6629L399
17044B2838P602o093p91P92Q847J098k2359j3150N403Q838K557J7127k661k2692
17030G356k2496Q969Q831Q619q800j1151l10j4072k381J1971J0584J7276J603
17017A5999O847l430j5403j35n536M206l121K408J4376j4493k899n837k0781J0541
17003a7258K2759n064R474M39J952o512J2618J278j2356l860o833j3747O89J1753
16989d668P036q291R252J9132J1034q16l717n465j398p452m114o428n602m948
16975f445k48r410j3785K1031O736j2288n923r486N25J3048O719q654k6480j5105
$$ plain form
17071 9881 5081 26446 34094 35974 31669 1516 -12713 -5868 -13049 -7778 -14081 -5912 -10919 -25770
17057 -25770 -42834 -40041 -10189 3373 8157 5226 2954 20457 51410 55239 36068 19439 22838
17044 22838 30440 24347 23556 24348 33195 34293 11934 -1216 4187 13025 15582 32709 30048 7356
17030 7356 -15140 -6171 2660 11279 2479 -8672 -8982 -23054 -25435 -13464 -2880 14396 15999
17017 15999 22846 19416 4013 3878 -1658 2548 -573 1835 16211 1718 -1181 -7018 -27799 -17258
17003 -17258 5501 437 9911 10350 12302 5790 18408 19686 7330 3470 -3363 -17110 -16421 -4668
16989 -4668 2368 -5923 3329 22461 33495 32679 28962 23497 22099 14647 10533 4105 -1497 -6445
16975 -6445 -6693 -16103 -29888 -8857 -2121 -14409 -20332 -29818 -29293 -16245 -9526 -18180 -44660 -59765
16961e9765K2535K0225M891O021O605J6475P563q727k654o34k30j2266N21j0993
16947a0433j6419l177o259J987R127L14q197J9385J5000j764o109j3134j1462
16934c1141P790R943K5418p10j4328k3706r792K5819K5640m708J5669O504j4191
16921A8207q519J557j4348J1783N822j9735q577p609K5317Q624j8424l50n563
16908a1815J4786J2266N762r263q036k456K521j3247k403N445K3445K0307k8847
16895H465k8588m291n73j5854J3838K243K831J365J5484P558j0441J645n994o696
16881a9008L348J3446J6476j0263j3628J7924j9728j1643J0124J2110K973p100
16869d969k3838r754K3286r63L733l7P042k1511m032J4277K4207o607q835m314
$$ plain form
16961 -59765 -37230 -17005 -12114 -6093 512 16987 24550 15823 13169 12535 12305 39 560 -10433
16947 -10433 -26852 -30029 -36288 -34301 -25174 -24860 -33057 -13672 1328 -436 -6545 -19679 -31141
16934 -31141 -23351 -13408 12010 11300 -3028 -26734 -36526 -10707 14933 10225 25894 32398 18207
16921 18207 9688 11245 -3103 8680 14502 -5233 -13810 -21419 3898 12522 -5902 -6252 -11815
16908 -11815 2971 15237 20999 11736 3700 1244 3765 -9482 -11885 -6440 17005 37312 8465
16895 8465 -20123 -24414 -24987 -40841 -27003 -24760 -21929 -20564 -5080 2478 -7963 -6318 -12312 -19008
16881 -19008 -15660 -2214 14262 3999 -9629 8295 -11433 -23076 -12952 -842 2131 -4969
16869 -4969 -28807 -38561 -15275 -16238 -12505 -12542 -5500 -27011 -31043 -16766 7441 834 -8001 -12315
16855a2315j4222j2259J4417L426J9766n465m382O552J235j0247P174k314m481
16842a3115j2393j943M698K267Q637N780q305J48l749L927j592q310j8573R138
16828c3385J1211R775n718j967M485K2463q497j3831q795K6918m608j397P498
16815D152J1514j1772n835l965k0552r945K5492j937N790N929M185p554K415k007
16801d090r425n474K519n866J2410k184O712N964j2391J1397j1479k0888Q569
16788b4226K133J9883P867O745M144n884j5009j1509l002J5027Q325j1754r37
16775h197n169j1225l661J6545J3683j9372k7278J1945J4710k209p672k144N96
16762b9448J2029L463P570J233J199m142J285j0879R111J1307j4233j4346J1014
$$ plain form
16855 -12315 -26537 -38796 -24379 -20953 -1187 -6652 -11034 -4482 -3247 -13494 -6320 -8634 -13115
16842 -13115 -25508 -27451 -22753 -20486 -11849 -6069 -14374 -14226 -17975 -14048 -15640 -23950 -42523 -33385
16828 -33385 -22174 -12399 -18117 -20084 -15599 6864 -1633 -15464 -24259 2659 -1949 -3346 4152
16815 4152 15666 3894 -1941 -5906 -26458 -36403 -10911 -12848 -7058 -1129 3056 -4498 -2083 -4090
16801 -4090 -13515 -18989 -16470 -22336 -9926 -12110 -5398 566 -11825 -428 -11907 -32795 -24226
16788 -24226 -22093 -2210 5657 12402 16546 10662 -4347 -15856 -18858 -3831 4494 -7260 -8197
16775 -8197 -13366 -24591 -28252 -11707 1976 -17396 -44674 -32729 -18019 -20228 -27900 -30044 -29448
16762 -29448 -17419 -13956 -6386 -5153 -3954 -8096 -6811 -17690 -8579 2728 -11505 -25851 -14837
16749a4837P264m833m785P899K3144Q695j2957j4524J5934r740J2872j5770l0587
16736c2225J4957K3528q40q83j1878M735l795j0997J984O556o253J0352K513q687
16722a0933l086k607K668j445J6985j6313J000Q887P466r019J1576j6363n656
16709a6840k821j2024K0414J2226M481Q806n077j7940J4197j4195r888N16K1752
16696C607K7935j1656l3447n394n330J4079K2989k863r506Q866M96l953o776n854
16682f807M757j6713j1950K635K5668J0953j1370j3710o159L945J1128J0630K1261
16669B4268J403n079Q575l590k457m800k6533j8884J1264M675p254K5370O472
16656A3430o92n553m187K4477J0508k0015p267J5164j6410p99J0788o485j1270
$$ plain form
16749 -14837 -7573 -12406 -17191 -9292 13852 22547 9590 -4934 11000 1260 14132 -1638 -32225
16736 -32225 -17268 6260 5420 4537 -7341 -2606 -6401 -17398 -15414 -8858 -15111 -4759 -2246 -10933
16722 -10933 -14019 -16626 -13958 -15403 1582 -14731 -13731 -4844 2622 -6397 5179 -11184 -16840
16709 -16840 -19661 -31685 -11271 955 5436 14242 9165 -8775 5422 -8773 -18661 -18145 3607
16696 3607 31542 19886 -13561 -18955 -24285 -10206 12783 9920 414 9280 9776 5823 -953 -6807
16682 -6807 -2050 -18763 -30713 -28078 -2410 8543 -2827 -16537 -22696 -18751 -7623 3007 24268
16669 24268 25671 20592 29167 25577 23120 18320 -8213 -27097 -15833 -11158 -18412 6958 13430
16656 13430 12738 7185 2998 27475 37983 17968 10701 25865 9455 8656 19444 12959 1689
16643A689M38p638l0271r558K530K6419J2057L95j1363j0120J2040J9633Q619
16630A4870k641j4921k0557j1545K2928Q387j9895q02K7562J0987P41m93o02L107
16616A7126O876q069j8099j3445L603K1545K814m175L0745j7693k5586P481L240
16603F363j5719N507M440n236N600N328j5228p470J5242J4458n304l830j0186
16590f035N556K2712l919j1086K833J773J345o430k0168J3992J2310L729K729
16577A9341J8943k491j3383j9930p975K383P554J2343j2125o800o041j2737j793
16564b2711K5270P245j6031j6639N448J677P335q570M151k35L426L02J2583m390
16550a139K34n329j0596k087Q366J1575r275l555J1440K6591J4242k6749j5551
$$ plain form
16643 1689 2127 -5511 -35782 -45340 -42810 -16391 -4334 -3939 -15302 -25422 -13382 6251 14870
16630 14870 12229 -2692 -23249 -34794 -11866 -3479 -23374 -24176 3386 14373 15114 14621 14019 17126
16616 17126 24002 15933 -2166 -15611 -12008 9537 12351 8176 38921 21228 -4358 3123 6363
16603 6363 -9356 -3849 591 -4645 955 6283 -8945 -16415 -1173 13285 7981 4151 -6035
16590 -6035 -479 22233 18314 7228 10061 11834 13179 6749 -13419 573 12883 16612 19341
16577 19341 38284 35793 22410 2480 -5495 -3112 4442 16785 4660 -2140 -8181 -20918 -22711
16564 -22711 2559 9804 -6227 -22866 -17418 -15741 -8406 -16976 -12825 -13060 -9634 -9332 3251 -1139
16550 -1139 -905 -6234 -16830 -18917 -10551 1024 -8251 -11806 -366 26225 40467 13718 -1833
16537a833n955n764J6185J1429l586J1214r209r779j0104K084J6181r309j6718
16524a5164L458j7n679N233m332k3575k47K9546j264O954k625K079K870P364j821
16509B780l5490m108K0096J750R032K0997K263j8590l5750J2534K3970J3998p537
16496E945J2600J7290j0224n483O164K245J4548j5458j1546m372j0904j2449L854
16483g790L033k4077J8043N838n018J992k820m845K2621p993k0974J4895J4217
16470G122P360J0883k1163l3562m793J9872J0351J1901m085J567o69j7261L704
16457h773n246q317j0544K2612K1610R519j6043o900J6306K7034j2089j0044j3499
16444E626j955J510k4227k6349K705J7461L0792K581k511j3346r091N844L256
$$ plain form
16537 -1833 -7788 -13552 2633 14062 10476 21690 12481 2702 -7402 -5318 10863 1554 -15164
16524 -15164 -11706 -11723 -17402 -12169 -16501 -40076 -40323 -10777 -12041 -5087 -7712 -5633 -2763 4601 2780
16509 2780 -32710 -36818 -16722 -14972 -5940 15057 17320 -1270 -37020 -24486 -516 13482 5945
16496 5945 18545 35835 25611 20128 26292 28537 43085 27627 16081 11709 805 -11644 -7790
16483 -7790 -4757 -28834 -10791 -4953 -9971 -7979 -10799 -15644 6977 -1016 -21990 -7095 7122
16470 7122 14482 25365 4202 -29360 -34153 -14281 -3930 7971 3886 5453 4784 -12477 -8773
16457 -8773 -14019 -22336 -32880 -10268 11342 20861 4818 -2082 14224 41258 29169 19125 5626
16444 5626 3671 5181 -19046 -45395 -42690 -25229 5563 8144 5633 -7713 -16804 -10960 -7704
16431g704l574J9117Q143k0377k689J8669N633p217M577J0827K866p250n286O509
16417B2244J1725j749j9456p967K356j914p971r278K1370p474r682P963L765R395
16403A3327K934k925k2356j0189J1016J8503O066k4349m098J4164J4960j6407
16391F46m728r249k1686m130L807J3173j3410j3806K4705N797m319K2031J791
16378F22j5358j51J3449j0045p171j2214q878J6709P282k874r97P962l896r86
16364a6546M870R005j0094p280L235j1675J6778l788N153o146P45P786r641l573
16350b1171J0908J8468O883J749p117r973J2001J9238j9701O449N468n786q707
16337H709J2155N237Q949k3172q86J2607j2592j5886J6513R822j7738l7806J810
$$ plain form
16431 -7704 -11278 7839 15982 -4395 -7084 11585 17218 10001 14578 25405 28271 21021 15735 22244
16417 22244 33969 32220 12764 4797 7153 5239 -2732 -12010 9360 1886 -7796 167 3932 13327
16403 13327 16261 13336 -9020 -19209 -8193 10310 16376 -7973 -12071 2093 17053 646
16391 646 -4082 -13331 -35017 -39147 -35340 -22167 -35577 -49383 -24678 -18881 -23200 -1169 622
16378 622 -14736 -14887 -1438 -11483 -18654 -30868 -39746 -23037 -15755 -18629 -19626 -11664 -15560 -16546
16364 -16546 -11676 -2671 -12765 -20045 -16810 -28485 -11707 -15495 -10342 -16488 -15743 -7957 -17598 -21171
16350 -21171 -10263 8205 15088 16837 9720 -253 11748 30986 11285 17734 23202 17416 8709
16337 8709 20864 26101 35050 11878 10992 23599 11007 -4879 11634 21456 3718 -34088 -32278
16324c2278J1636N640K4349J3172k32k272k0038O583J7219j6521L902J1470j0244
16311A2386n583k406J119j2438j3291J3079r7k3117J7839K3941L507l490M385
16298A5834k259k2603j2489J1487q64o313l181J5251K810p277j9129k074p935
16285c8742Q290J6050O634J1239j5686r978J1327Q870j9962o780K368O247J9865
16272b58K4395J5511j1272j537j5182k2005M54K935K4227J6846o041k6865J658
16259B866P020N731n663M098j0829k3258j5199K808J0069R071l50R596k185o616
16245a2841M847J6196J1832M120k4480j6869R503J6855j3432l679n603j1110j9
16232b4680n253k220R990j1664J0080J3183n958J7158J537j1103J6647K1478p980
$$ plain form
16324 -32278 -20642 -15002 9347 22519 22287 20015 -23 6560 23779 7258 11160 22630 12386
16311 12386 6803 4397 5516 -6922 -20213 -7134 -7231 -30348 -12509 11432 14939 11449 15834
16298 15834 13575 -9028 -21517 -10030 -10894 -17207 -20388 -5137 -2327 -9604 -28733 -30807 -38742
16285 -38742 -30452 -14402 -7768 3471 -12215 -22193 -10866 -1996 -21958 -28738 -26370 -20123 -258
16272 -258 24137 39648 28376 26839 11657 -10348 -9894 -6959 17268 34114 28073 1208 2866
16259 2866 9886 15617 9954 14052 3223 -20035 -35234 -32426 -22357 -13286 -13636 -4040 -6225 -12841
16245 -12841 -7994 8202 20034 24154 -326 -17195 -7692 9163 -4269 -7948 -13551 -24661 -24680
16232 -24680 -29933 -32153 -22163 -33827 -23747 -10564 -16522 636 2173 -8930 7717 29195 21215
16219B1215k0897j5374M183K7553O877q958l07j408k8805n266N348J0832o219
16206a1226J280n690q21r486O897Q454j121J8083q456j1017P127J0232M489n726
16192C019O249O109M766j1243j3332J9302J732n981M087r296j2207J3567R977
16179A6749J3864J2376j2184k1090k4241J159j583Q73Q708q10O079J1941j0907
16166I34j0271n916l229N93R039K726M726L7k5856l575P208m938N145J0551M270
16151h556l643K034J2713j4882J3134J6936K467P128P00M883q114M660j5192r522
16137D746M657R807q47p600j3091j9127k0407o100L807L327R972J7692j9809q183
16123d1156n805j989K1726K7609l485N077q457o10J4829j9716k971L245j482K1953
$$ plain form
16219 21215 318 -15056 -10873 16680 23557 14599 14292 12884 -15921 -21187 -15839 -5007 -11226
16206 -11226 -9946 -15636 -16457 -25943 -19046 -10592 -11713 6370 -2086 -13103 -5976 4256 8745 3019
16192 3019 9268 15377 20143 8900 -4432 14870 16602 10621 14708 5412 -6795 6772 16749
16179 16749 30613 42989 30805 9715 -14526 -13367 -14950 -14077 -5369 -6179 -100 11841 934
16166 934 -9337 -15253 -18482 -17889 -8850 -6124 -1398 -1361 -27217 -30792 -23584 -28522 -23377 -12826 -8556
16151 -8556 -12199 -10165 2548 -12334 800 17736 20203 27331 28031 32914 24800 29460 14268 4746
16137 4746 9403 19210 18363 10763 -2328 -21455 -41862 -47962 -44155 -40828 -30856 -13164 -32973 -41156
16123 -41156 -46961 -48950 -27224 385 -3100 1977 -6480 -7090 7739 -11977 -14948 -11703 -13185 8768
16109H768J4319k3430j6308k493R392j0890m232m470j7369k742K0683p141p071
16096d2984M291L034K975j382k628j0541N82J6130J2349R61M392M71K933P492
16082a925j0910K602Q404P167J4253j2877k367J758O223q440j3092p537l558m476
16068b4775n561j744K0866O412j8314n970N050J3032m388k5790L975K2068J4929
16055b10J4134m376j5547j5182n641J1472J2007N810p505j631l511m620J8855
16042D055J8747K760l3529j2688J236N111N836j310O865O603k0776n905J0795
16029a2200k634k2832j598L887j2896J5257J4801l036O583P05p932j820q39j7095
16015d1649N65J5648K999J9543j2281J844J5740J0196n021J62r05J3999k272p132
$$ plain form
16109 8768 23087 -343 -16651 -19144 -9752 -20642 -24874 -29344 -46713 -49455 -28772 -35913 -42984
16096 -42984 -38693 -35659 -32684 -34066 -36694 -47235 -46653 -30523 -18174 -17213 -12821 -12350 -9417 -1925
16082 -1925 -12835 -10233 -1829 5338 19591 6714 4347 6105 12328 3888 -9204 -16741 -20299 -24775
16068 -24775 -30336 -32080 -11214 -4802 -23116 -29086 -24036 -11004 -15392 -41182 -37207 -15139 -210
16055 -210 13924 9548 -5999 -21181 -26822 -15350 -3343 2467 -5038 -6669 -10180 -14800 4055
16042 4055 22802 25562 -7967 -20655 -19419 -14308 -8472 -9782 -2917 3686 -17090 -22995 -12200
16029 -12200 -14834 -37666 -39264 -35377 -48273 -33016 -18215 -21251 -14668 -13963 -21895 -23715 -24554 -41649
16015 -41649 -41084 -25436 -22437 -2894 -15175 -13331 2409 12605 7584 7746 6841 20840 18568 11436
16001A1436M56n966r258p81N518n307j0837Q524R32k714N987J3110p774j8108
15987a4782J6095J3499l854J504q50j2127q16J885j2677k018L5696J0256j5781
15974A6030n462j0055k433P122j0726j3309j9362j3726J8932O577N374K22j5892
15961c6708J1906o22R91k551J9028K4008r439n995J2274K12j8807o893n238K0868
15947C034K0498J4024k3106j6944J479r882p96L315n350q019L327r623k729K2958
15933g814M138j733n607r908j9501L309R238k350k087M271J1629J5605P887j3352
15919f275j457o546n23j0423o327r108o001J3419K2964J1404N426R193J939J0860
15905B8545m64J583r299k1975J2382J8083j304k71k0724k2993P762j08M329R527
$$ plain form
16001 11436 11892 5926 -3332 -4113 1405 -3902 -14739 -6215 -5283 -7997 -2010 11100 3326 -14782
15987 -14782 1313 14812 10958 12462 11612 -515 -1331 554 -12123 -14141 21555 31811 16030
15974 16030 10568 513 -1920 5202 -5524 -18833 -38195 -51921 -32989 -26412 -21038 -20816 -36708
15961 -36708 -24802 -25424 -24433 -26984 -7956 16052 6613 618 12892 13104 -5703 -12596 -17834 3034
15947 3034 23532 37556 14450 -2494 -1015 -10897 -11693 -8378 -13728 -21747 -18420 -28043 -30772 -7814
15933 -7814 -3676 -5409 -11016 -20924 -40425 -37116 -27878 -30228 -32315 -28044 -16415 -810 7077 -6275
15919 -6275 -7732 -14278 -14801 -25224 -31551 -40659 -46660 -33241 -10277 1127 6553 15746 17685 28545
15905 28545 28081 29664 20365 -1610 10772 28855 27551 27280 6556 -16437 -8675 -8783 -4454 5073
15891E073M362L791O351N504j5549j4798m19K498K2173o344j1115J3026j756o784
15877F013P153j2436k689K609q784k982K436M014J0372j1218J0020m008R568J3092
15863B3160J3833r145j0131O662j2015k5969k2981l158K6892q125l701L972K3857
15850C151o532j0659k140N61j7470p449P752J6922p388k5773k001K2700J9842
15837h484J5353j1127j255P075o118n524q140R978l772j6340L758N213j582p053
15823b8018J0677J7096k0365o259P345K4459M091R04l558j3092k0749R313J1208
15810f948j5358j7316J1398J3222n566K493J2663N567K188j1814m266R827J0133
15797F223p050r709O396k061K511J427P066j1823k3229j9215k682J7934K2159
$$ plain form
15891 5073 9435 13226 19577 25081 9532 -5266 -5685 -3187 18986 12642 1527 14553 12797 6013
15877 6013 13166 730 -1959 650 -8134 -11116 -8680 -4666 5706 -5512 4508 500 10068 23160
15863 23160 36993 27848 17717 24379 12364 -13605 -36586 -39744 -12852 -20977 -24678 -20706 3151
15850 3151 -3381 -14040 -16180 -15619 -33089 -40538 -32786 -15864 -23252 -49025 -51026 -28326 -8484
15837 -8484 6869 -4258 -5513 1562 -4556 -10080 -18220 -8242 -12014 -28354 -24596 -19383 -20965 -28018
15823 -28018 -17341 -245 -20610 -26869 -19524 4935 9026 9930 6372 -6720 -27469 -18156 -6948
15810 -6948 -22306 -39622 -28224 -15002 -20568 -18075 -5412 155 2343 -9471 -13737 -3910 6223
15797 6223 -827 -10536 -4140 -6201 -3690 -2263 4803 -7020 -30249 -49464 -52146 -34212 -12053
15784a2053L190m300O625m284Q023Q700n934j7738j1968Q605J7969K7131p854
15771A6112m81j4063O068K0045j2073j1486k1157M314J2472L868j4440j5277P716
15758a8382J2412J8028o036k4981j5781k697N354J2519J3253N484j3638o701l719
15745b4885N406j0652K705J5832N858K119q585k1083k441m27P568J0499Q397l516
15731a3205o056K399R918J8984k240q353L064k3486j8885R58J7850O278j7284
15718c0058Q388P680K276J0081o878p062m051l820J6497J0533p645q141N240J6617
15704I657J8822k035j6831j0638q113M25J6817j9448j1837j677J2800L36J2294
15691E72J6690j136j5320r281K470j531L208m526j5060n494J5165J8979L899J1658
$$ plain form
15784 -12053 -8863 -13163 -6538 -10822 -2799 5901 -33 -17771 -29739 -21134 -3165 23966 16112
15771 16112 15631 1568 7636 27681 15608 4122 -17035 -12721 -249 3619 -10821 -26098 -18382
15758 -18382 -5970 12058 6022 -18959 -34740 -37437 -32083 -19564 -6311 -827 -14465 -21166 -24885
15745 -24885 -19479 -30131 -27426 -11594 -5736 -3617 -12202 -33285 -35726 -36153 -28585 -18086 -9689 -13205
15731 -13205 -19261 -16862 -6944 12040 9800 1447 4511 -18975 -37860 -36902 -19052 -12774 -30058
15718 -30058 -21670 -13990 -11714 -1633 -8511 -15573 -19624 -23444 -6947 3586 -4059 -12200 -6960 9657
15704 9657 28479 26444 9613 -1025 -9138 -8713 8104 -11344 -23181 -24858 -12058 -11722 572
15691 572 17262 16126 806 -8475 -6005 -7536 -4328 -8854 -23914 -29408 -14243 4736 8635 20293
15677B0293N475q094L266m512j597K291L683J055J2825j4515j992j3022K7370
15664C2526M639k5925j7076M623Q269j7336K129m588q31J5027j446j2916k099
15651a5004K2076K0871j0004j0352j2370L356J9672q159J378j8010k0899P10J3923
15638a2812n491n644M329J4034K0762j2399P083J8886K419j2315m1967k3482J6461
15625c0136J4944M954P79N875o717r946j6482R754P861j7322O36J5291J2621j1077
15611a8965l596j2449Q251O294N873R820J5301J086m43o437q015j6428j0711m481
15597c4900N52L3644J0135j5137j3927P280M297j3140q95M380J340O487J5696
15584E812j6543p059l2957J943J7098J6033K6186P86l2517L15o149p825j8363
$$ plain form
15677 20293 25768 17674 20940 16428 14831 17122 20805 21860 34685 20170 18178 5156 32526
15664 32526 37165 11240 -5836 -1213 7056 -10280 -8151 -12739 -13570 1457 11 -12905 -15004
15651 -15004 7072 27943 17939 7587 -4783 -1427 18245 10086 11464 -6546 -27445 -26735 -12812
15638 -12812 -18303 -23947 -19618 -5584 15178 2779 9862 28748 31167 18852 -23115 -46597 -30136
15625 -30136 -15192 -10238 -9459 -3584 -10301 -20247 -36729 -26975 -19114 -36436 -35800 -20509 -7888 -18965
15611 -18965 -22561 -35010 -26759 -20465 -14592 -4772 10529 11615 11172 4735 -3280 -19708 -30419 -34900
15597 -34900 -34348 -704 9431 -5706 -19633 -12353 -8056 -21196 -22091 -17711 -16371 -9884 5812
15584 5812 -10731 -17790 -50747 -48804 -31706 -15673 10513 11299 -21218 -20903 -27052 -34877 -53240
15571e3240R331N143Q776J3838j1898j9733N579J2010l717P230J3809j3735j2359
15558c8966L832q473J0861J352J7315J3942r68M22L236k0757q080O730J3692M936
15544i26l974J950R507L516Q133j0226k5430P135J7451P978J4331O412q963R761
15530C6655q631j0875n247j2807O554j8192L298L804r953m743j145J0082L0991
15517A9791j284l1108j7444j2391P244K7012n418o403K536Q170J516j5558k4030
15504d7367N473m596q725L2559O536r538J0462J4515J8185Q801r609j0424R811
15491A6083j4652J546L239j0406L843J5562J2292j602j4758p693o150j5022k2145
15478c9863m776K5448J8423o511K764j232r735l1672j1890J4906m16L3200K5986
$$ plain form
15571 -53240 -43909 -38766 -29990 -16152 -28050 -47783 -42204 -30194 -33911 -26681 -12872 -26607 -38966
15558 -38966 -35134 -43607 -32746 -31394 -14079 -137 -1105 -683 2553 -18204 -26284 -19554 -5862 -926
15544 -926 -4900 -2950 6557 10073 18206 7980 -17450 -10315 7136 15114 29445 35857 26894 36655
15530 36655 28024 17149 11902 -905 5649 -12543 -9245 -5441 -15394 -20137 -21282 -11200 19791
15517 19791 18507 -12601 -30045 -42436 -35192 -8180 -13598 -20001 -17465 -9295 -7779 -23337 -47367
15504 -47367 -41894 -46490 -55215 -22656 -16120 -25658 -15196 -681 17504 26305 16696 6272 16083
15491 16083 1431 2977 6216 -4190 -347 15215 27507 25905 11147 3454 -2696 -17718 -39863
15478 -39863 -44639 -19191 -768 -7279 -4515 -5747 -15482 -47154 -59044 -44138 -44554 -11354 14632
15465A4632L941j9520k5803j6719J7397J3325j1922k668j1967Q135j749L034J0094
15452a9790r04o332m913J9359K1315K002l0782r09R929J8157L173o239m02p361
15438c697j1716L194M758K4013K093l3456j6110n959l979o339J481J7568Q176
15425a9973L0640J4877p125l8165J115J3291Q058M558j6934R616P591p215K697
15412C031O128J1238j9773j4027k0335M043l050m652j2317K5497J976j1619L370
15399c0490J1214N938J514q833M146O214k543p635J3442n046j6689L28J254n98
15385b7784N075J0443Q255L373N111p126l609O798P578L559j8126n449J6397J2917
15371A7412p913p016j7336j4192M60Q525J6155j0077p442R052K7088O894n064
$$ plain form
15465 14632 18573 -947 -26750 -43469 -26072 -12747 -24669 -27337 -39304 -31169 -32918 -29884 -19790
15452 -19790 -20694 -27026 -31939 -12580 8735 10737 -20045 -20954 -11025 7132 10305 4066 3664 -3697
15438 -3697 -15413 -12219 -7461 16552 18645 -14811 -30921 -36880 -40859 -47198 -45717 -28149 -19973
15425 -19973 10667 25544 18419 -19746 -18631 -5340 2718 7276 -9658 -42 7549 334 3031
15412 3031 9159 20397 624 -13403 -33738 -29695 -32745 -37397 -49714 -24217 -22241 -33860 -30490
15399 -30490 -19276 -13338 -11824 -20657 -16511 -10297 -12840 -20475 -7033 -12079 -28768 -28440 -27186 -27784
15385 -27784 -22709 -12266 -4011 -638 4473 -2653 -6262 536 8114 11673 -6453 -11902 4495 17412
15371 17412 9499 2483 -14853 -29045 -28585 -20060 -3905 -13982 -21424 -12372 14716 21610 16546
15358A6546j7243j2271J2078J1553k790j0072N894j4493n829O830J5847l111p306
15345d367j5969K570N883k550l348J5633O257K702L130j9005j1578K2260Q392
15332A0010q68l649j5346N880Q95K240j0668r901l353k3794k702J8789K8206J1917
15318G656j3069J659K5144K814k7560k0567r902M323q462L262J6078J2541n39
15305f622O576O774j129p361L307q939r550m012r482l428m67k440J4178Q538r207
15290b3264n188N120m29j815L128M899M474q540j2153R82L353M141J549Q578R83
15275a4182p667M859O163k0275q501n289l630J5441k601L987n742M97J6897J4699
15261e344M460J9838p615l213N908J5132j0119j3514l253p169r147j5039j2748
$$ plain form
15358 16546 -697 -12968 -890 10663 7873 -2199 3695 -10798 -16627 -9797 6050 2939 -4367
15345 -4367 -20336 -17766 -11883 -14433 -17781 -2148 4109 6811 9941 -9064 -20642 1618 10010
15332 10010 9142 5493 -9853 -3973 -3078 -838 -11506 -21407 -24760 -48554 -51256 -32467 -4261 7656
15318 7656 -5413 -3754 21390 24204 -3356 -23923 -33825 -29502 -37964 -34702 -18624 -6083 -6622
15305 -6622 -46 6728 5599 -1762 1545 -7394 -16944 -20956 -30438 -33866 -34333 -36773 -22595 -14057 -23264
15290 -23264 -28452 -23332 -23761 -25576 -22448 -17549 -13075 -21615 -33768 -32786 -29433 -25292 -23743 -15165 -14182
15275 -14182 -21849 -16990 -10827 -31102 -39603 -44892 -48522 -33081 -35682 -31695 -37437 -36940 -20043 -5344
15261 -5344 -884 18954 11339 8126 14034 29166 19047 5533 2280 -4889 -14036 -29075 -41823
15248d1823M447K25N591Q218K249l809J848J932j350Q951J7028o099L675J550
15234B633l906n004P291J0941O013j623j1335q187k353J0491j2857j1651J5565
15221c982o731r227l472R745o048k459p485M869K1136Q232j3848N594N480m147
15207b343j0445R007J1415J4532l214k6302k4620n881P894j543L000J4484L1782
15194A7766Q86k3674k659J1913J9519k556j6362m338Q438o774j0463L0157J6757
15181C8610k8380j7451J2641M778l648r79Q916J0222j7814j1950K5744N84j7486
15168C787r128L0244k29r540j3021k0307m970O910K3778q48o710j086k0573k777
15154b4470K437k476n147L758J1417p966m439J7402r594p009L356j0048o261J8182
$$ plain form
15248 -41823 -37376 -37151 -31560 -23342 -21093 -24902 -23054 -21122 -22472 -13521 3507 -2592 1083 2633
15234 2633 -1273 -6277 1014 11955 17968 16345 5010 -3177 -5530 4961 -7896 -19547 -3982
15221 -3982 -10713 -19940 -23412 -13667 -19715 -22174 -29659 -24790 -3654 4578 -9270 -3676 1804 -2343
15207 -2343 -12788 -3781 7634 22166 18952 -7350 -31970 -37851 -29957 -31500 -28500 -14016 17766
15194 17766 18652 -5022 -7681 4232 23751 21195 4833 495 8933 2159 -8304 21853 38610
15181 38610 10230 -7221 5420 10198 6550 5571 14487 24709 6895 -5055 20689 21273 3787
15168 3787 -5341 24903 24674 15134 2113 -18194 -23164 -16254 7524 6676 -34 -1120 -21693 -24470
15154 -24470 -22033 -24509 -29656 -25898 -14481 -22447 -26886 -9484 -19078 -26087 -22731 -32779 -39040 -20858
15140b0858K3552J0500J1511J0167l5018j6257J0384j3057j3951k29K8219K450
15128b587k463j102J346J5449L657l419N607k7864k0818J3971K943J0299K8955
15115B3974L766r135j4998j1521l629q67j2038J0689o611o459m658J3984l406
15102b0909o05r160j2400O761N717M567J6897O143k066n960J7781L282j0482l860
15088d294O659L738J1399L696j1922j1588Q417j5620k0780J5183J0137R532p36
15075C821k3963q30Q247j0324j6340P169L219j1031M972J3882K6536N453q670
15062B141j2564j6013J3924R342J8922J417j1210M926J0352l15j7461k5766j2890
15049c5195k585Q741J0085J4800P518k767j8448L26J3075R863P733j2000k5249
$$ plain form
15140 -20858 2694 13194 24705 34872 -146 -16403 -6019 -19076 -33027 -33256 -5037 -2587
15128 -2587 -5050 -6152 -4806 10643 14300 10881 16488 -11376 -32194 -18223 -15280 -4981 23974
15115 23974 27740 18605 3607 -7914 -11543 -12410 -24448 -13759 -20370 -26829 -31487 -17503 -20909
15102 -20909 -21514 -30674 -43074 -36313 -30596 -26029 -9132 -2989 -5055 -11015 6766 10048 -434 -4294
15088 -4294 2365 6103 17502 21198 9276 -2312 6105 -9515 -30295 -15112 -4975 4557 3821
15075 3821 -20142 -20972 -12725 -23049 -39389 -32220 -29001 -40032 -35060 -21178 5358 10811 2141
15062 2141 -10423 -26436 -12512 -3170 15752 17169 5959 10885 21237 20922 3461 -22305 -35195
15049 -35195 -37780 -29039 -18954 -4154 3364 597 -17851 -17525 -4450 5413 13146 1146 -24103
15036b4103o257J1141J1569J4090K139j6938P269j490n846N786l615q862P101
15023h016j5380J549J9164j2094k062r971K71J9363q024k094P565l280M26k846
15009a5429K1213J169n12j1992j4941o089M151J0000K3030K265j6333P100j541
14996B091O265j9408k6786L174m79J1472J2766J4120q907K991K938J754O108J3359
14982B1458J3055l475R601J4476L3683N6446K6075k7821l0874l2797k8861k0038
$$ plain form
15036 -24103 -30360 -19219 -7650 6440 8579 -8359 -1090 -2580 -8426 -2640 -6255 -15117 -8016
15023 -8016 -23396 -21847 -2683 -14777 -16839 -26810 -26539 -7176 -15200 -17294 -9729 -13009 -12583 -15429
15009 -15429 5784 6953 6441 -5551 -20492 -26581 -22430 -12430 10600 12865 -3468 3632 2091
14996 2091 8356 -11052 -37838 -34664 -35143 -23671 -10905 3215 -5692 -2701 237 1991 8099 21458
14982 21458 34513 31038 40639 55115 88798 145244 171319 143498 112624 79827 50966 30928
$$ [...]
##END NTUPLES=NMR SPECTRUM
##END=
