##TITLE=Analysis number 316223
Compound Code rf 05052
Project Code adrs
Chemist Name fudan
##JCAMPDX= 6.0         $$ Bruker NMR JCAMP-DX V2.0
##DATA TYPE= NMR SPECTRUM
##DATA CLASS= NTUPLES
##ORIGIN= Bruker BioSpin GmbH
##OWNER= nmr
$$ XWIN-NMR		Version 3.5
$$ Thu Jan  5 13:39:40 2006 GMT Standard Time (UT+0h)  MAYBRIDGE\nmr@NMR_250MHZ
##.OBSERVE FREQUENCY= 250.131544655141
##.OBSERVE NUCLEUS= ^1H
##.ACQUISITION MODE= SIMULTANEOUS (DQD)
##.ACQUISITION SCHEME= undefined
##.AVERAGES= 16
##.DIGITISER RES= 18
##SPECTROMETER/DATA SYSTEM= dpx250
##.PULSE SEQUENCE= zg30
##.SOLVENT NAME= DMSO
##.SHIFT REFERENCE= (INTERNAL, DMSO, 0, 16.522)
##AUDIT TRAIL= $$ (NUMBER, WHEN, WHO, WHERE, WHAT)
$$ ##TITLE= Audit trail, XWIN-NMR		Version 3.5
$$ ##JCAMPDX= 5.01
$$ ##ORIGIN= Bruker BioSpin GmbH
$$ ##OWNER= nmr
$$ C:\u/data/dgb/nmr/ADRS/14290/pdata/1/auditp.txt
$$ ##AUDIT TRAIL=  $$ (NUMBER, WHEN, WHO, WHERE, WHAT)
(   1,<2006-01-05 13:39:08.52 +000>,<MAYBRIDGE\nmr>,<NMR_250MHZ>,
      <created by zg, POWCHK disabled, PULCHK disabled
       configuration hash MD5:
       62 19 C7 07 E1 42 D1 B7 37 6C 3D D0 77 39 F9 E6
       data hash MD5: 64K
       21 F8 17 47 8A 69 2C 18 E8 FC CF 70 F9 02 5A F2>)
(   2,<2006-01-05 13:39:22.87 +000>,<MAYBRIDGE\nmr>,<NMR_250MHZ>,
      <Start of raw data processing
       ef LB = 0.3 FT_mod = 6 PKNL = 1 SI = 32K 
       data hash MD5: 32K
       19 49 46 52 DF 32 B5 CF D0 75 CF D8 BC 13 5B AD>)
(   3,<2006-01-05 13:39:26.41 +000>,<MAYBRIDGE\nmr>,<NMR_250MHZ>,
      <apk 
       data hash MD5: 32K
       1A DC 5E C5 10 F2 06 56 84 59 41 6F C1 FF 21 A3>)
(   4,<2006-01-05 13:39:27.66 +000>,<MAYBRIDGE\nmr>,<NMR_250MHZ>,
      <abs ABSG = 5 
       data hash MD5: 32K
       27 7A 6F A3 2D 1A E9 E0 E0 71 EC 8C 08 9C 47 43>)
$$ ##END=
$$ 
$$ hash MD5
$$ DC 77 13 C4 E9 44 C9 E1 A6 C2 94 3B 7A DE AD 47
##$RELAX= 
##$RELAX= 
##$RELAX= 
##$RELAX= 
##$RELAX= 
##$RELAX= 
##$RELAX= 
$$ Bruker specific parameters
$$ --------------------------
##$DU= <C:\u>
##$EXPNO= 14290
##$NAME= <ADRS>
##$PROCNO= 1
##$TYPE= <nmr>
##$USER= <dgb>
##$AMP= (0..31)
100 100 100 100 100 100 100 100 100 100 100 100 100 100 100 100 100 100 
100 100 100 100 100 100 100 100 100 100 100 100 100 100 
##$AQSEQ= 0
##$AQ_mod= 3
##$AUNM= <au_zg>
##$AUTOPOS= <48 >
##$BF1= 250.13
##$BF2= 250.13
##$BF3= 250.13
##$BF4= 250.13
##$BF5= 500.13
##$BF6= 500.13
##$BF7= 500.13
##$BF8= 500.13
##$BYTORDA= 1
##$CFDGTYP= 0
##$CFRGTYP= 5
##$CHEMSTR= <none>
##$CNST= (0..31)
1 1 145 1 1 1 1 1 1 1 1 1 1 1 1 1 1 1 1 1 1 1 1 1 1 1 1 1 1 1 1 1 
##$CPDPRG= <>
##$CPDPRG1= <>
##$CPDPRG2= <>
##$CPDPRG3= <>
##$CPDPRG4= <mlev>
##$CPDPRG5= <mlev>
##$CPDPRG6= <mlev>
##$CPDPRG7= <mlev>
##$CPDPRG8= <mlev>
##$CPDPRGB= <>
##$CPDPRGT= <>
##$D= (0..31)
0 1 0 0 0 0 0 0 0 0.06 0 0 0 0 0 0 0.0002 0 0 0 0 0 0 0 0 0 0 0 0 0 0 
0 
##$DATE= 1136468347
##$DBL= (0..7)
120 120 120 120 120 120 120 120 
##$DBP= (0..7)
150 150 150 150 150 150 150 150 
##$DBP07= 0
##$DBPNAM0= <>
##$DBPNAM1= <>
##$DBPNAM2= <>
$$ [...]
##$SUBNAM7= <"">
##$SUBNAM8= <"">
##$SUBNAM9= <"">
##$SW= 20.6930455092707
##$SWIBOX= (0..15)
0 0 3 0 0 0 0 0 0 0 0 0 0 0 0 0 
##$SW_h= 5175.983436853
##$TD= 65536
##$TD0= 1
##$TE= 294.16
##$TE2= 300
##$TE3= 300
##$TEG= 300
##$TL= (0..7)
0 120 120 120 120 120 120 120 
##$TP= (0..7)
150 150 150 150 150 150 150 150 
##$TP07= 0
##$TPNAME0= <>
##$TPNAME1= <>
##$TPNAME2= <>
##$TPNAME3= <>
##$TPNAME4= <>
##$TPNAME5= <>
##$TPNAME6= <>
##$TPNAME7= <>
##$TPOAL= (0..7)
0.5 0.5 0.5 0.5 0.5 0.5 0.5 0.5 
##$TPOFFS= (0..7)
0 0 0 0 0 0 0 0 
##$TUNHIN= 0
##$TUNHOUT= 0
##$TUNXOUT= 0
##$USERA1= <user>
##$USERA2= <user>
##$USERA3= <user>
##$USERA4= <user>
##$USERA5= <user>
##$V9= 5
##$VALIST= <valist>
##$VCLIST= <CCCCCCCCCCCCCCC>
##$VD= 0
##$VDLIST= <DDDDDDDDDDDDDDD>
##$VPLIST= <PPPPPPPPPPPPPPP>
##$VTLIST= <TTTTTTTTTTTTTTT>
##$WBST= 1024
##$WBSW= 4
##$XGAIN= (0..3)
0 0 0 0 
##$XL= 0
##$YL= 0
##$YMAX_a= 525214
##$YMIN_a= -480735
##$ZGOPTNS= <>
##$ZL1= 120
##$ZL2= 120
##$ZL3= 120
##$ZL4= 120
##$ABSF1= 16.522
##$ABSF2= -4.171173
##$ABSG= 5
##$ABSL= 3
##$ALPHA= 0
##$AQORDER= 0
##$ASSFAC= 0
##$ASSFACI= 0
##$ASSFACX= 0
##$ASSWID= 0
##$AUNMP= <proc_1d>
##$AZFE= 0.1
##$AZFW= 0.1
##$BCFW= 0
##$BC_mod= 0
##$BYTORDP= 0
##$COROFFS= 0
##$CY= 12.5
##$DATMOD= 1
##$DC= 0
##$DFILT= <>
##$DTYPP= 0
##$F1P= 14.0000005364418
##$F2P= -0.99999901652339
##$FCOR= 0.5
##$FTSIZE= 32768
##$FT_mod= 6
##$GAMMA= 0
##$GB= 0
##$INTBC= 1
##$INTSCL= 1
##$ISEN= 128
##$LB= 0.3
##$LEV0= 0
##$LPBIN= 0
##$MAXI= 10000
##$MC2= 0
##$MEAN= 0
##$ME_mod= 0
##$MI= 0
##$NCOEF= 0
##$NC_proc= -3
##$NLEV= 6
##$NOISF1= 0
##$NOISF2= 0
##$NSP= 0
##$NTH_PI= 0
##$NZP= 0
##$OFFSET= 16.522
##$PC= 1
##$PHC0= 79.37438
##$PHC1= 8.446519
##$PH_mod= 1
##$PKNL= yes
##$PPARMOD= 0
##$PSCAL= 4
##$PSIGN= 0
##$REVERSE= no
##$SF= 250.13
##$SI= 32768
##$SIGF1= 0
##$SIGF2= 0
##$SINO= 400
##$SIOLD= 32768
##$SREGLST= <1H.DMSO>
##$SSB= 0
##$STSI= 32768
##$STSR= 0
##$SW_p= 5175.98343685301
##$SYMM= 0
##$S_DEV= 0
##$TDeff= 65536
##$TDoff= 0
##$TI= <Analysis number 999999
Compound Code 99
Book Reference 9
Project Code 9>
##$TILT= no
##$TM1= 0
##$TM2= 0
##$TOPLEV= 0
##$USERP1= <user>
##$USERP2= <user>
##$USERP3= <user>
##$USERP4= <user>
##$USERP5= <user>
##$WDW= 1
##$XDIM= 32768
##$YMAX_p= 478933524
##$YMIN_p= -171374
$$ End of Bruker specific parameters
$$ ---------------------------------
##NTUPLES= NMR SPECTRUM
##VAR_NAME=  FREQUENCY,     SPECTRUM/REAL,   SPECTRUM/IMAG
##SYMBOL=    X,             R,               I
##VAR_TYPE=  INDEPENDENT,   DEPENDENT,       DEPENDENT
##VAR_FORM=  AFFN,          ASDF,            ASDF
##VAR_DIM=   32768,         32768,           32768
##UNITS=     HZ,            ARBITRARY UNITS, ARBITRARY UNITS
##FACTOR=    0.157963299565203, 1,           1
##FIRST=     4132.6476996994, 0,             0
##LAST=      -1043.33573715361, 0,           0
##MIN=       -1043.33573715361, -171374,     0
##MAX=       4132.6476996994, 478933524,     0
$$ Real data points
##PAGE= N=1
##DATA TABLE= (X++(R..R)), XYDATA
$$ [...]
28463 -8665 15597 -8480 -2304 41386 49096 35955 2259 -29638 -34412 -24451 12360 15637 -12377
28450 -12377 -32323 -25825 -8201 21531 31219 30988 39657 85572 25188 -38614 -50443 -65502 -92929
28437 -92929 -73553 -10658 26353 38025 -4400 -47219 -44818 14910 65284 9179 13997 8934
28425 8934 -5795 13197 12360 -38645 -33607 -1208 39408 14850 1224 -1401 28272 70334 45387
28412 45387 14347 24369 53906 46199 6868 -22152 -25674 15503 27192 -706 -34467 -85021
28400 -85021 -47034 22815 19925 -13927 13150 12842 -16559 -12347 -3863 7666 35627 35581 -24733
28387 -24733 -10089 -15990 17777 48158 56181 44447 22272 -11476 -1576 5179 -19054 -29011 -18935
28374 -18935 -5812 -3529 -4789 10303 13680 -11770 -24713 -17252 -7534 -10785 330 4285 -5262
28361 -5262 -26850 -42811 -2388 -32397 -47219 -16588 -2017 -4515 20278 32898 19367 11752
28349 11752 14246 -33981 -33617 16276 34500 42249 76114 107769 110814 58139 1920 -1253 2046
28336 2046 18595 78700 97008 66082 35688 31730 50729 58175 66491 55736 56356 35090 -40202
28323 -40202 -49903 -24149 10378 53596 81096 91276 79669 52679 20983 -12166 -25629 -56749
28311 -56749 -93029 -88122 -57605 -56113 2991 34802 4904 -15309 10725 5916 -15917 -7520
28299 -7520 12605 21223 -455 18444 60110 99367 73211 73205 43875 -8208 -29660 -59574 -48029
28286 -48029 -29018 -18150 5063 19194 26081 3035 -9103 -36469 -65699 -19192 -32405 -46630
28274 -46630 -19185 -18641 -23543 -14946 1007 10652 33665 37199 4109 21576 32498 5049 27588
28261 27588 44377 34273 32211 53158 70502 77301 65042 49410 29338 41466 58841 29242
28249 29242 -2036 -13573 -20996 -4886 36072 69603 76000 75195 49462 40536 6548 -20661 -48622
28236 -48622 -26479 -18141 11695 -4440 -13942 20647 14755 29223 6664 -17691 -38672 -31767
28224 -31767 22061 28016 43290 85581 39504 11114 19161 50495 88464 74572 19671 -6326
28212 -6326 21279 51762 20083 -355 6066 -8280 1528 -5339 -59807 -48606 29545 87015
28200 87015 66671 17175 19339 52978 62310 74239 56879 39325 59506 24532 -50938 -26747
28188 -26747 -28315 -3061 32548 32381 19967 -1060 -21616 5314 61601 36663 23702 18774
28176 18774 -25125 -58279 -57011 -40515 -19206 -24056 -72984 -89710 -56990 -51110 -41690 1665
28164 1665 -8185 16659 14610 -28642 -33580 -22558 -36719 -32704 7722 15882 18748 -694 -19762
28151 -19762 1952 46696 85584 42970 14240 37451 47429 20087 23842 71183 77803 42451
28139 42451 19220 -5490 -45546 -20108 6330 2926 348 22713 13764 -7558 -3266 -23359
28127 -23359 15088 -2597 -15520 -6050 -10606 -7037 21761 23122 30534 805 -46537 -17025 -14201
28114 -14201 -19858 32342 75153 50986 8615 -4931 4788 3457 8368 73275 65186 31659 28791
28101 28791 27184 49474 26461 -1325 -12555 -9975 -16736 -13440 -22838 -49933 -35909 -34113 -53570
28088 -53570 -31256 30139 32247 31455 81958 101845 108846 80733 85396 81681 63602 68796 103391
28075 103391 117239 100617 54543 30486 16726 41418 62670 56825 40980 39972 53576 14934
28063 14934 17214 9087 -67 9066 -18134 -13880 -19206 6589 -8675 -7933 -23469 -17262 -29574
28050 -29574 -21524 -3508 56580 84455 -8782 -40227 3050 -12729 -24551 -3062 12755 20133
28038 20133 31679 60303 26585 -2338 15759 9778 -25524 -44419 -79867 -76680 -27211 1522
28026 1522 -26077 -50083 -41786 -31958 -23054 -17027 7191 2175 -16924 -13515 -2517 9761 -4150
28013 -4150 15924 22589 6558 -27295 1072 22309 -2991 -33444 -53318 -61524 -31547 -25617
28001 -25617 922 23832 43589 31987 36230 49993 41201 71921 94498 71399 12351 -3582
27989 -3582 10874 -36926 -59172 -44902 -27786 -16736 -19462 -29972 -27773 -22381 13265 16363 -11378
27976 -11378 15270 24325 7837 17385 35879 39933 66839 45498 30109 14569 -3752 33692
27964 33692 4098 -25775 -6444 -35464 -41880 -1267 -3326 -20720 3532 30108 11148 -8346
27952 -8346 -25279 7036 48814 18411 6326 23256 30746 40234 17836 10003 4619 32300 26706
27939 26706 5264 24444 12670 -33951 -27199 1527 16731 49011 61148 31464 -36181 -44837
27927 -44837 -33628 -50462 -68642 -72488 -74865 -90344 -61471 -18117 15400 416 13458 8928
27915 8928 -12506 15182 21207 28787 72032 77095 49178 41151 34973 -30 4619 41317 1920
27902 1920 10328 61933 76145 68543 71937 24870 -70325 -92884 -58612 -39909 -28213 -20949 -10423
27889 -10423 -29363 1024 27823 56447 30870 40919 44632 45790 17539 -16686 -7980 1632
27877 1632 -15237 -63038 -84098 -86149 -64749 -44966 -35295 -34325 -34381 -56491 -34761 -37676 -32806 3457
27863 3457 5186 10140 13553 -13583 -25580 21182 18979 -2410 5473 45124 48365 51879 67226
27850 67226 87641 72519 29779 33278 25702 -11263 -52035 -24620 26310 60495 71471 64098
27838 64098 83080 83481 53047 53097 65909 46440 34388 23830 33310 39885 11516 -50306 -44425
27825 -44425 -47120 -37857 -44090 -77822 -102273 -66732 -46630 -41397 -12582 16039 43735 8901
27813 8901 -51844 -53294 -38408 -42700 -55428 16258 71903 67176 66009 37183 -14936 -12706 -2892
27800 -2892 -31857 -55490 -38437 -9191 -2710 -34796 -11223 -32291 -52953 -18963 30168 37813
27788 37813 61667 19410 -4925 -19133 -5658 14208 8979 4839 -12713 -25267 -12935 20498
27776 20498 29904 26250 -5858 -9336 -10178 1944 -26939 -18239 10381 -21864 -23724 -16561 -36513
27763 -36513 -10975 35834 49910 50963 42236 5076 -22408 -354 34418 34786 44800 50639 -430
27750 -430 -12394 5019 15815 7112 12332 10164 19652 26336 8942 31140 39253 26213 13241
27737 13241 995 -3778 34695 33613 13771 39066 63011 24980 28344 27970 37829 77270 40265
27724 40265 10760 -24995 -26650 -6103 51347 59942 31632 17842 13901 12433 32569 49442
27712 49442 56185 67713 94036 81120 9042 -23362 -441 27298 31566 9075 -16219 -58949
27700 -58949 -132552 -135921 -97668 -44472 -21184 -27694 -16743 -214 -16263 -7180 16756 63789
27688 63789 60961 28956 35378 -28435 -36993 -30696 -23360 17277 41525 28070 22173 31025 16831
27675 16831 24748 -8561 -33318 -27115 -34511 -26414 3007 12684 -16627 7484 10814 -3029 -18510
27662 -18510 -41366 -1589 1843 9114 16504 40003 38321 45201 16449 4054 24298 24770 33696
27649 33696 10192 965 -8177 22506 85819 53499 -13575 -5678 5264 11138 -19780 -45897
27637 -45897 -23845 6226 49840 50518 24673 -36093 -5813 441 -43340 -80925 -72378 -39880
27625 -39880 -8032 35135 57409 75670 103839 66359 22177 9436 11587 17412 17970 28412
27613 28412 24878 21658 8732 20009 757 -17046 -16402 -1521 -17880 -45194 -59902 -12114
27601 -12114 2469 4145 -19673 -68332 -70629 -53543 -9982 38801 56506 59433 51469 42222 63568
27588 63568 6129 -41402 1553 2795 -18090 -7841 32031 60894 11943 -4045 -28734 -37732
27576 -37732 -11960 8525 12297 -13527 -6977 18343 21582 32603 31308 14626 12844 -8306 18177
27563 18177 35556 32325 13765 2003 -19400 -18134 -33419 -4450 -68396 -89400 -124496 -92950
27551 -92950 -27151 -27539 -14711 -8261 -12292 30397 55672 41435 59174 23656 51906 61263 48374
27538 48374 37151 7501 -2911 32454 43086 22515 13072 -25992 -10832 -13543 -39175 -65206
27526 -65206 -81597 -40788 -7753 11856 7310 -7608 15185 28125 13506 39189 49125 38465
27514 38465 45943 4599 7591 -11331 8134 43362 36065 -640 -12878 -20722 -33367 -29084 -24226
27501 -24226 -41838 -40029 -27866 -9219 -20848 -28380 -52310 -58332 -53053 -25375 -17303 -27085 -11810
27488 -11810 -20471 -30909 -67085 -28946 -15997 18592 66229 92311 52543 13281 -7933 -13277
27476 -13277 9289 52037 40689 973 -31523 -28621 -146 26371 31438 -12543 -11576 6543
27464 6543 754 8341 5545 -24 -38529 -64133 -18142 -8330 15389 30442 -25310 -24461 8761
27451 8761 -4811 -11510 26871 40551 -1561 -68709 -97965 -60401 209 9975 49545 39888
27439 39888 19646 36577 43931 55118 17329 -19180 7048 17235 25277 55470 54733 40807
27427 40807 33851 41023 52898 47700 12024 -8574 28120 38859 40942 39257 34914 30602 29736
27414 29736 48085 67035 69627 102753 86132 65965 65520 54995 12125 -34479 -52762 -34317
27402 -34317 -10505 16702 29034 18955 -11733 -19254 -2998 -19955 -42327 -29503 -73079 -65503
27390 -65503 -50672 -20639 30209 35032 11264 23717 5452 16940 12745 9746 35025 57701
27378 57701 9026 -10421 40398 35734 -21009 -65643 -69106 -35579 2685 5147 37288 42581
27366 42581 38750 32916 34056 47222 -731 -32468 -26222 -54024 -42138 9242 38601 7654
27354 7654 -29066 -53310 -51988 -29710 13358 56802 71736 60264 40292 17502 28457 40385
27342 40385 49765 43835 37386 59020 73985 58093 13199 -24861 -9652 29685 62912 12457
27330 12457 -10405 -18799 -5873 -18273 -35148 -29399 -9673 23400 47566 60286 42248 -3974
27318 -3974 -10644 31609 36092 30722 -2288 -20426 -36132 -24452 -4480 26993 20740 55401 62154
27305 62154 25954 19332 46225 66884 30997 -16725 19499 5142 -2550 1353 -26686 5757
27293 5757 -10327 -3599 16068 23670 30620 32701 27543 -9449 -25210 -41914 -40733 -48469 -35113
27280 -35113 1214 55600 70218 58664 98061 98858 59641 26608 46059 35590 57930 91065
27268 91065 93347 115554 82832 31060 -10229 -10582 -10137 22085 44709 40286 55169 87713 86968
27255 86968 47280 -12352 -19683 7704 -497 22826 39671 -7181 17530 53669 -1359 8569
27243 8569 -13984 -62302 -75364 -118326 -124317 -101545 -55310 -43701 -35203 -7923 3033 -7241
27231 -7241 -28569 -390 15818 -6662 -7970 41402 66763 76730 100679 69860 48075 44428
27219 44428 6136 -17201 34793 47863 31034 30655 13381 -3399 6190 35414 56991 52967
27207 52967 27794 21762 8953 12968 5223 -5218 22036 14409 22911 39070 38311 41449 21439
27194 21439 -31224 -18397 55343 122045 106273 85173 49485 -3321 8467 -38593 -55985 -31100
27182 -31100 -19367 336 -13917 -2240 6165 -6854 11947 -6232 -10336 39936 22733 -42420
27170 -42420 -31801 -8850 -2363 7517 39616 68789 31559 -12655 -15209 4994 -285 -24587
27158 -24587 -13810 -25002 -21661 15048 28827 45807 3955 -811 -24350 -14360 3249 -6178
27146 -6178 23945 53880 45293 23587 2659 -16356 11929 -2975 -966 -1396 429 11459 -24339
27133 -24339 -27719 -23269 -46668 -40557 -29354 -5336 31824 69738 56895 7373 -40613 -63099
27121 -63099 -65267 -31759 -18633 -18964 -7775 40073 41473 67410 77375 37214 20300 5411 -16904
27108 -16904 -13807 7599 19322 -3672 -6362 -858 -5982 20816 58831 115348 115188 101604 53839
27095 53839 -16391 6196 10766 -14796 -7317 -14630 4411 13978 19388 -4124 2631 12396 51021
27082 51021 46695 44747 51309 55635 68328 51525 10258 -15936 -19383 -13689 321 -13025 -34860
27069 -34860 -16277 3481 -8132 -21660 -4799 45837 16714 -27168 -15039 55 -46660 -24587
27057 -24587 -1810 11739 13151 26147 29516 -16763 12127 41257 41053 37941 5595 -3157 9570
27044 9570 26878 2176 -20008 -8529 -15992 -43153 -19877 10257 -18666 -41559 -31174 -43281
27032 -43281 -24152 2514 24197 39916 13257 -31659 -55895 -55638 -37858 -37431 15307 43335
27020 43335 63082 31137 -44127 -77797 -63496 -36801 -20165 -29142 5244 28862 -5593 -59235
27008 -59235 -60804 -52548 -49898 -47978 12471 64075 42372 -3446 -35798 -18795 13984 55810
26996 55810 80105 77214 47065 77602 72619 42614 41897 44700 36823 23312 -1877 -40676 -58580
26983 -58580 -41677 -14700 8519 57787 106865 95488 63029 27515 27474 24623 -4619 -5511 -5530
26970 -5530 10193 2526 5697 27001 10342 -260 -31052 -57508 -4472 20512 -1672 -5608
26958 -5608 15467 17654 -13556 -24954 -39397 -75649 -42417 -8171 27698 51766 36057 -2258
26946 -2258 -45486 -74134 -86292 -86009 -23494 9998 -11918 -52227 -73437 -63328 -24059 402
26934 402 33294 -3653 -5332 2859 -5906 -3479 -12633 30199 46694 8336 21246 45390 36017
26921 36017 54010 75851 70678 45485 18935 9755 34436 21311 2702 14274 53929 27603
26909 27603 -10344 -30102 -7842 17028 -33318 -37146 -16912 17046 47206 57143 37434 2128
26897 2128 -17819 -4368 14597 4943 -6060 -651 457 -16916 -37877 -35504 -21747 2665 7462
26884 7462 13271 -10957 3957 31846 57109 68392 11994 -46360 -47104 -25132 -20325 -45206 -59451
26871 -59451 -39260 -33395 -25402 -46658 -86718 -61510 2392 20468 42865 63470 80592 109545
26859 109545 138619 88825 60063 80553 62102 7492 31802 50764 37066 29010 10068 -40784
26847 -40784 -41753 -38198 -13831 -34737 -34386 -2979 -10455 -24931 -33997 -3029 49896 13811 29271
26834 29271 37186 65949 27227 41334 56835 50663 4543 -10194 -46221 -62491 -61035 -38979
26822 -38979 -5644 -19272 -45400 -41088 -56273 -61559 -55456 -63461 -6380 30653 35691 27431 -8302
26809 -8302 -17112 -20256 -50419 -57602 -4582 9828 -5537 -31247 -11255 15586 -22288 -28789 -9213
26796 -9213 -14363 3384 16434 45045 17901 12754 -4527 -35933 -31267 -14613 8588 5210 -22499
26783 -22499 -20733 -13768 -32642 -8571 26347 49828 16938 -25153 -55764 -73902 -59426 -34444
26771 -34444 -26073 -32435 -56759 -64519 -39284 -2431 -21425 -52234 -63140 -31054 -32413 -61656
26759 -61656 -65211 -55996 -25964 -25330 -22870 13764 34863 33518 3520 -1784 -7584 -10448 2780
26746 2780 2421 -32404 -29623 42968 62162 13529 16055 -6679 -15883 -50432 -94250 -53294 -6351
26733 -6351 2947 552 -21629 1011 20124 -17544 -6549 -24518 -22774 -26013 -65885 -120717 -95635
26720 -95635 -43012 -18716 -34705 -18609 22242 32895 72609 57705 41692 60211 42513 16662
26708 16662 27361 8127 7947 -6079 33951 44297 14163 29805 23071 30338 67431 52660
26696 52660 53469 76054 68982 59288 26066 60714 92236 42094 -5837 -18271 7817 21089
26684 21089 40940 51530 16830 26271 54388 31122 55478 97533 91512 78276 64464 70885
26672 70885 47749 30635 17204 30135 19085 12385 12005 20078 26214 -11493 -39645 -38629 -42210
26659 -42210 -86331 -72164 -17728 -4912 -36837 -46883 -30561 -14330 16404 40951 32019 2030
26647 2030 -1710 53770 48008 14312 46124 62901 56630 87628 89947 40128 -714 17835 22221
26634 22221 29125 1981 -9080 -41283 -47344 -28631 -25254 -54756 -29459 -1709 26833 17132
26622 17132 -27158 -35681 -38692 -42003 -35899 12588 52206 64934 74696 27288 10201 791 -441
26609 -441 32453 38198 -6396 -16334 -26023 -7803 27469 18348 -19781 29770 53431 31724 -5813
26596 -5813 485 -55377 -61721 -38722 -70509 -58755 -32939 -27985 -27792 -21511 -34015 -28959 -13120
26583 -13120 -25887 -16250 -3419 11521 -5254 -21342 -9583 14996 31531 -8643 -8586 -22723
26571 -22723 -9544 -16148 -27220 -26263 -46466 -48160 -54028 -83894 -38297 3629 14521 22007 -4348
26558 -4348 -41434 -45877 -72294 -81725 -42048 13232 14613 11654 -7869 -24779 11586 51917 80813
26545 80813 48241 37206 23086 12148 3365 9750 31712 54555 29045 6346 19933 27811
26533 27811 46120 36650 25255 17749 4448 -13589 6472 4527 -7064 -13705 -32148 -10128
26521 -10128 -2403 29340 38032 -18075 -41791 -30493 -26145 -47400 -59014 -19617 3448 -22792
26509 -22792 -44094 17670 24751 1859 43113 31398 -4 -48350 -36152 -6124 21203 59110
26497 59110 94020 15949 -10117 39423 52462 19335 28958 53554 48424 51483 58655 23149
26485 23149 16179 33281 24553 7649 -16652 -22653 -6973 20319 59885 65153 69655 56055 67929
26472 67929 47422 19600 -23631 -67040 -31835 -29099 -8142 -14099 -6996 -20089 -34253 -41362
26460 -41362 -44878 -29616 -27636 -20559 -23156 -45207 -48069 -3816 -13879 -24300 3716 -12199 -17437
26447 -17437 -16226 5311 42872 8214 14920 6223 -10348 9124 14150 14485 -5525 910 14017
26434 14017 -6163 -42680 -39987 -8195 4790 -8768 -21929 -18153 -15211 -67959 -102547 -68759
26422 -68759 -10269 -4911 2957 -5458 2038 21845 32860 18175 28973 40863 40690 14718 -1592
26409 -1592 23052 -9979 -16082 807 -816 -57 33658 18159 -2754 -8500 -49265 -19265 -33076
26396 -33076 -58998 -32767 -31680 -42685 -48519 -67398 -68577 -71608 -90696 -71224 -49286 -71884
26384 -71884 -79520 -20719 27609 21492 49215 50390 73403 81813 65280 34328 54364 60148 82076
26371 82076 130469 143831 119804 61304 40907 14138 11133 -24194 -29516 -9879 -3024 -8841
26359 -8841 -21571 5930 26954 11812 -16612 -48506 -31085 -15037 -37992 12353 -11900 -48533
26347 -48533 -11310 27982 -17183 -26343 -21622 -31094 6437 26184 -1279 -525 18858 11602 -28460
26334 -28460 -18704 -3658 -4256 12333 36350 20513 12305 14636 -12105 44976 54108 13850 3730
26321 3730 5624 11825 -30790 -50462 -38659 -24808 -27341 -36290 -35603 -60789 -65795 -35549 -60465
26308 -60465 -79657 -26169 24359 25873 6633 -1414 -4465 39105 46388 30684 -5620 -14229 9130
26295 9130 19352 19219 49909 37350 3664 -17967 1573 -5322 -1574 -23719 -68674 -56233 -2969
26282 -2969 898 18110 -26657 -20493 -2934 18499 16192 13062 906 -12908 -56294 -38399 -48809
26269 -48809 11575 44581 53314 48677 51998 34888 6515 -29106 -51389 -43850 -11411 -21052 16367
26256 16367 20234 25102 -10480 -39943 -27739 -8499 -2778 23072 34210 25421 64714 83935
26244 83935 66568 43727 3968 -5996 -37580 -55943 -50180 -32643 -51611 -56357 -57421 -48317 440
26231 440 24593 -33455 -34198 -10706 684 -18477 -9674 -8789 8136 -2830 -512 2804 52521
26218 52521 78026 61988 44345 39511 31478 21710 28267 39518 44552 72366 57330 51937 27284
26205 27284 -7605 13305 -10656 -13788 3404 -41305 -44237 30529 60981 43107 34276 33741 -5738
26192 -5738 -8552 -30451 -30429 4308 26802 -9046 -48692 -68992 -90022 -46719 -9630 24461 24224
26179 24224 10421 14207 -16317 -17028 8292 5447 4342 4795 33686 74155 85120 67961 36154
26166 36154 32189 27698 -3562 -42408 -41145 -23992 -504 22046 36287 21238 16143 53199
26154 53199 74620 49378 32608 68090 49932 44671 79637 122308 118171 71006 36959 55734
26142 55734 8012 -11309 18699 42610 24622 19913 2264 6103 28343 30383 62878 61443
26130 61443 1258 9815 34322 21290 -19123 -24436 22816 74573 51121 23314 31299 66756
26118 66756 97603 48056 -34841 -73069 -28361 862 -11359 -17986 -30691 -21578 22199 70414
26106 70414 86447 85538 79416 85943 51987 22515 323 -3458 -3484 -30756 20309 39209 7493
26093 7493 -1587 -17043 19210 3566 5930 -11345 -43940 -56894 -16236 8510 28534 34871
26081 34871 1099 -19647 -37896 -6300 17680 -5200 -6775 -12507 -22561 29035 82480 89037
26069 89037 71696 36823 7506 -39882 -98583 -116106 -96098 -47515 -40388 -60276 -57421 -14399
26057 -14399 107 41538 35707 -14939 -9139 -1987 33268 30686 8845 -3739 -19765 19964
26045 19964 -2776 -14468 -13430 -19203 -4408 -8289 -23899 -8165 -22603 -26347 -9254 -1286 6002
26032 6002 10601 -4670 6887 -32113 -85985 -75736 -25327 18242 52164 34802 -7973 -21085
26020 -21085 -9802 4726 6989 22594 -12288 -75365 -62898 -42157 -11099 -2758 -3224 -12760 -3060
26007 -3060 738 28156 18106 12061 19266 -12095 -24758 -50744 -41038 -24107 -16811 11135 55815
25994 55815 37092 11859 35819 52405 30544 61824 88519 70073 86673 62698 76464 102427
25982 102427 92972 60774 33105 21236 30326 31971 -6137 6594 -9089 -27757 -52747 -55649
25970 -55649 -9725 13744 22993 47747 24435 -17541 34322 78691 46371 -13642 -21040 38
25958 38 37082 -8503 -19136 -24275 -31834 5414 52432 116081 119213 36359 19957 -24602 -49811
25945 -49811 -52167 -21603 10773 -16555 -13816 40698 51186 11360 26695 8791 6823 -41456
25933 -41456 -84934 -80385 -35037 -21358 -46507 -45852 -47337 -38701 -27399 -33967 -34068 -38095 -27448
25920 -27448 -21112 -864 23421 3128 -10749 1370 -6994 -35206 -80342 -59271 -18713 28739
25908 28739 4761 -8952 16493 7134 15532 12360 -582 30215 62338 66054 33946 -3422
25896 -3422 2934 24509 49279 43081 13651 26817 30457 28408 44498 12009 6149 15092 -16562
25883 -16562 -68480 -92548 -65807 -40166 -25874 -1376 20766 4944 -30265 -83273 -38582 7191
25871 7191 12753 -939 16273 23765 11421 45755 49036 62486 56924 51318 8274 -7364 -28777
25858 -28777 -50478 -38466 -32631 -25212 -11457 -30705 -70479 -86759 -60945 -40197 -9487 -15758
25846 -15758 -35108 -29816 -17790 22754 31578 -15184 -12390 39426 56888 42043 41178 31071 25625
25833 25625 -23629 -53855 -14266 -17561 -55212 -63259 -43030 -27799 -24787 9874 9600 -3818 -19409
25820 -19409 -25497 -15381 -19138 -6302 -13240 -42197 -5415 -7977 43063 27581 -6579 -26550
25808 -26550 -16673 40512 -3251 -43376 -34804 -54519 -39939 -5484 4084 -17009 1671 -184
25796 -184 -11933 28346 71901 64754 36169 16787 -23739 -63562 -56853 -1103 22466 -21879
25784 -21879 -33750 -17126 -7721 21872 -90 -1447 -25306 -59840 -65150 -68205 -52669 -26926
25772 -26926 -5246 31447 18942 9982 18822 -17604 -56205 -45340 -41143 15050 65001 28185
25760 28185 -608 -7158 6943 37921 34857 -32408 -58685 -21510 -5938 -1462 14146 38345
25748 38345 12052 -49114 -44815 16029 50237 50923 27813 8429 28643 33530 27631 -1355 -39033
25735 -39033 -61616 -49396 -75356 -23556 38996 40014 -8930 -18679 -21355 -5043 8389 24648
25723 24648 27815 24073 -1110 -27674 -58098 -25604 -18482 36456 70133 16145 3287 21735
25711 21735 31122 20920 -23904 -49459 -38788 -4501 8824 18447 43063 33679 26079 19430 -1710
25698 -1710 -58860 -96957 -106145 -54803 -52010 -46931 -364 43762 52875 19096 8303 35756 47875
25685 47875 31491 -8177 -5371 16512 -9938 -22812 -2837 19501 8307 14961 -6561 -56060
25673 -56060 -52792 -51308 -58273 -49184 -63062 -56878 -17077 19521 46761 78317 18472 -5978 9808
25660 9808 -2914 -4318 30467 37792 35359 28243 12595 -11702 -12193 19550 34588 27635 8985
25647 8985 -27542 -16130 16274 20820 56704 10904 -1631 8488 33877 52558 14436 -15254
25635 -15254 11553 26222 4660 29432 48443 84839 97322 44933 21016 41503 76149 54982
25623 54982 13698 -30180 -55349 -38922 2182 -7628 -14983 589 19047 43701 72277 48238
25611 48238 40399 49569 42974 27926 -12923 -1578 26562 24964 27745 42560 32102 23550 -5669
25598 -5669 -28168 -51689 -97374 -72741 -30620 -48802 -51777 -53242 -19951 -15381 16406 57728
25586 57728 54499 65349 36577 6591 17094 7518 24393 74240 58420 63293 67312 41340
25574 41340 19632 5796 34899 42644 14751 2426 17214 -5311 -5467 -3232 3217 26370 64095
25561 64095 25327 -27329 -56568 -25373 -1508 50900 19166 -32344 -62984 -33109 -28222 -23824
25549 -23824 -2859 5111 657 -8965 1726 26591 45651 53841 8763 -44822 -37348 -18423 25691
25536 25691 23163 -7899 -59548 -69090 -35685 -23829 -57891 -67247 -44557 -72780 -54271 -70110
25524 -70110 -52989 -38356 -45813 -44608 -40909 -30109 -32492 -14647 3032 7406 6175 -31668 -3683
25511 -3683 37460 26477 12179 -5583 30398 22565 2660 7617 16735 3537 34920 29700 34342
25498 34342 54263 66767 71306 46352 8186 261 5982 -22307 -16192 -32522 40325 53952
25486 53952 41014 29957 32269 45386 58984 34820 16712 -18410 -13356 -15644 -22172 -37501
25474 -37501 -59127 -103267 -43520 28164 67944 39399 30170 -14782 -33317 -25839 -30774 -38449
25462 -38449 -43088 -27915 -7112 -12088 -20007 15196 19664 18495 37218 53959 53971 38675 54467
25449 54467 2270 -50320 8117 31158 39036 32598 47827 28607 -43691 -21607 2858 -17361
25437 -17361 -50276 -44047 -29936 -52538 -45119 -21405 14026 -30823 -64437 -75028 -52724 -60359
25425 -60359 -48742 -45212 -27922 -10911 -25937 -47959 -41824 3553 12988 -11050 6394 37047
25413 37047 36498 -12365 -43668 -48772 -25201 -23637 -10881 -30586 -15936 49230 45669 43684 49014
25400 49014 47164 28906 -7744 -10885 -37505 -39163 -53593 -62529 -61980 -35483 10815 18563 2390
25387 2390 -22257 6435 24680 13197 -32359 -31867 -50673 -27891 10513 55232 28271 -8851
25375 -8851 37149 60085 46680 46607 37909 29606 20957 45272 53896 73750 73280 59332 35282 25984
25361 25984 31283 27750 53482 56585 17576 4561 37093 42132 83630 82269 -11628 -47827 -6027
25348 -6027 44741 31452 1479 -19760 -2763 -13743 -30966 -15934 -27364 -17028 29488 60415
25336 60415 53564 40553 20696 32128 58891 60344 89942 92663 43211 -7785 -33703 3561
25324 3561 4043 35533 27309 993 -11900 9669 8198 641 17719 15547 -6076 -4195 -3161
25311 -3161 56042 55307 26017 26566 33724 25144 37037 42321 17800 28690 63448 57056 51482 45005
25297 45005 13741 52031 103602 118627 118639 89812 30329 37288 48646 56833 45018 -4745 -19366
25284 -19366 -1395 -1371 -9741 -23174 -27715 -49209 -27428 4232 6110 -18191 -16225 29701 22569
25271 22569 10748 26120 53231 12254 5507 27606 13624 -5957 14887 21821 1106 -48885
25259 -48885 -49874 -22253 -30917 -29978 -8501 6202 8174 1557 1745 -37288 -12584 17702 6370
25246 6370 13332 49566 84520 88277 66517 79340 97811 87829 38541 -20341 -15999 20725 25032
25233 25032 20187 28700 33601 32784 34296 29137 16904 20524 27870 50326 24341 46245 94110
25220 94110 92472 79801 84404 56667 6442 16659 13707 2146 -3705 -17610 -9208 -21863 1331
25207 1331 -18248 -34060 15085 14751 -29542 -19325 -10416 -5238 -5959 5638 33480 40611 34959
25194 34959 5627 9828 -41136 -68457 -79269 -64702 -8293 -6022 43139 44169 -4689 -21465
25182 -21465 -18994 7966 7093 -7942 7838 -6792 -11975 -11081 16835 29084 -5802 -35958 -23919
25169 -23919 27072 23415 3499 27114 22146 6044 14970 17335 23621 31671 62491 44864 48890
25156 48890 52417 51868 48791 71623 68644 34926 30782 45880 40402 -9041 -6638 26733 17858
25143 17858 24949 33640 -7607 -31260 -17476 -9578 -17881 -29803 -11443 25296 -12276 -32420
25131 -32420 -2597 31780 48946 61636 45198 29036 -6355 7232 -8448 -32978 -24478 -26586
25119 -26586 -44673 -44977 -3750 25971 -11192 -62778 -52921 -23170 2993 -36467 -27089 -27706 -40169
25106 -40169 -40507 -40973 -10144 -3617 37173 54231 44638 35139 -11602 -15051 23419 70162 66036
25093 66036 28661 -8625 -5212 24087 51950 10929 1925 -10611 9385 -2249 -14934 -48872
25081 -48872 -57610 -18863 -24703 -55917 -82148 -100446 -75719 -77790 -61331 -48018 -89695 -97395
25069 -97395 -92330 -70042 -65788 -68642 -42800 11255 17272 -1839 18959 13064 -22009 -53564 -52989
25056 -52989 -82328 -64981 -17224 -26300 -57950 -58415 -46470 -54837 -65640 -55952 -27998 -35348 -41784
25043 -41784 -37446 -3817 -25585 -52545 -23010 27965 62289 43205 51996 46470 17060 -16685
25031 -16685 -22550 -2357 -12718 -23538 -1266 4902 13453 25993 -22674 -27832 -8848 -35800
25019 -35800 -19249 30056 29208 26011 -7433 -11639 6699 42992 99706 68664 32306 28438 45984
25006 45984 39314 79563 67424 19139 -6325 -42280 -56305 -65648 -59034 -44569 -21600 -6816
24994 -6816 -4245 -12621 5864 25624 55378 9486 -69699 -44004 -19054 24096 38357 36715
24982 36715 26950 24457 -15116 -42340 -38886 -31120 -928 212 -10060 16844 5144 -8791 29694
24969 29694 68176 47750 53771 26769 -9485 -28455 -28215 -14089 -37426 -45726 801 -13606
24957 -13606 -4349 30212 35414 16461 51409 44407 5768 -13514 -15000 -20980 -12069 -7082 -26744
24944 -26744 -55783 -4576 33944 19502 -15624 -22918 -30025 -21226 -5390 -13270 -9297 -7743 31201
24931 31201 58310 32468 -11170 -20942 -43673 -25574 -19159 26116 -9947 -34704 -39133 -34256
24919 -34256 -26087 -29535 -6521 12885 -12147 -54132 -36996 -9368 -3618 -5334 2490 15146 25427
24906 25427 39883 36959 48077 52239 26648 21113 45790 56302 56885 62573 48417 -21026 -36489
24893 -36489 11040 18012 13986 31930 15889 -269 -15397 11970 19218 6308 366 11107
24881 11107 10089 -4180 9170 15477 35 -15284 2509 -2651 -30924 -31410 -15203 -34825 -97205
24868 -97205 -115690 -97410 -77647 -38991 -19349 -47881 -60869 -44896 -26794 -15739 -18029 14568
24856 14568 15842 10985 -37347 -60130 -36064 6574 25110 20951 -8973 -22369 -17571 -12375 22704
24843 22704 12908 13136 18469 69324 44558 -11980 -44421 -39332 -3198 14039 32910 59007 54741
24830 54741 47577 5726 15829 5195 -26036 -48296 -13491 38337 57059 31545 68369 87291
24818 87291 71370 84113 41442 -3082 -9716 -14847 12609 4991 13809 2317 6714 16787 40722
24805 40722 24271 -4380 -5352 -12163 21514 2692 6697 21578 -993 35 21202 -15600 6580
24792 6580 38643 -17102 -45610 -30277 -6303 6061 21888 47626 26711 18155 -6011 -6281
24780 -6281 -45846 3112 10886 -41397 -86729 -75846 -38112 -21598 -3689 14472 -18989 -30916
24768 -30916 -17183 -63094 -66678 -16265 3950 3583 -21377 -34352 -8185 20468 36043 57285
24756 57285 75857 76297 18610 -27394 -6819 6029 32673 62185 31922 30739 19976 -31380
24744 -31380 -62671 -7996 23313 28102 50988 65382 9848 2094 15480 17022 12747 -378
24732 -378 -23977 -39305 -31933 -28487 -37843 -27809 -8943 21223 14399 6846 -33961 -31494 -8499
24719 -8499 -3076 20352 69688 67047 77845 92181 99276 84969 57640 64852 37553 13679 -10287
24706 -10287 -21537 -3795 19744 -26334 10009 -14380 -34012 -36358 -39553 -40290 -30175 -42434
24694 -42434 -18643 15696 11837 40711 33230 54531 59217 44991 11695 25311 10710 -45143
24682 -45143 -13910 21183 13776 13472 21573 35729 12443 -9449 -4807 18302 53680 41652 16268
24669 16268 16626 4713 9328 -18891 -22448 -29923 -56531 -37337 -56048 -46753 -21320 -16754 -33122
24656 -33122 -75592 -98020 -108000 -79580 -28733 6275 47026 25588 -16909 -8855 -34602 -11223
24644 -11223 -102 1530 8340 11663 11246 -8517 -8374 -12605 10261 45869 44977 12319 25490 36018
24630 36018 66347 68167 31546 -7860 14580 42579 19302 37506 34502 21987 -10653 -41195
24618 -41195 -39172 17719 29226 22061 284 2405 561 14393 -25149 -73928 -39149 48315
24606 48315 108203 102478 70090 42254 26749 -5075 -42201 -58442 -55674 -42120 -58168 -16479
24594 -16479 38272 74800 72826 38297 -1417 3925 13077 20831 -2512 39222 69972 38696
24582 38696 -12333 -48225 -49884 -46502 -16179 1518 11043 -33827 -45595 -12893 22671 6434
24570 6434 37307 18766 29524 24728 35412 39121 62533 54310 19543 5256 -23929 -53632
24558 -53632 -66740 -15424 43562 44964 56808 73654 49648 49310 55133 73293 47567 30534
24546 30534 -5509 7019 1291 -7180 27399 33542 50717 1206 -24417 -63204 -85678 -87024
24534 -87024 -89524 -58282 -31512 -54120 -49212 -16807 23125 -23788 -47744 -50246 -29295 -54920
24522 -54920 -87184 -123268 -104603 -40288 8237 26233 17001 2130 495 -10000 -45299 -60319
24510 -60319 -22722 8868 24570 23968 -999 42410 87946 101779 47895 49200 56298 53901 4458
24497 4458 -57244 -60161 -13420 -4777 -5018 30348 25877 -1821 -9468 -44152 -44394 -36365 -39949 -34796
24483 -34796 -23463 -47177 -36536 -17927 56576 96488 113671 114099 98186 34476 -9313 -27749
24471 -27749 -37863 -34106 -14446 -44353 -58754 -46097 -25253 -22257 7108 30174 21533 54409
24459 54409 57667 44798 23273 -4402 -5058 -14278 -16008 -6270 18357 9157 1199 23645 26850
24446 26850 15098 36088 45209 30733 13510 -11277 -14312 8624 5694 7134 23027 22744 29154
24433 29154 -6358 -63016 -53316 -39508 -33293 3643 15888 -21640 -3621 36361 64691 84922
24421 84922 50559 8776 38207 68135 79339 101140 72029 69259 49404 17564 43151 59893
24409 59893 59677 37291 21184 -6899 711 27008 10610 9575 -4339 -23385 -33303 -30932 -19903
24396 -19903 5511 31654 62645 82228 82914 72958 60926 29405 38673 57067 -7553 -22805
24384 -22805 3497 8509 20925 -13489 -24096 15018 32544 14226 -11540 -22678 -58474 -6940
24372 -6940 53749 87534 106479 67599 54841 51566 66559 32671 -20082 -6461 23588 33503
24360 33503 43660 35696 -20706 -11729 32295 32298 71703 74294 28756 1352 17121 2105 -44432
24347 -44432 -69231 -10473 21307 57495 101284 96312 52292 18100 28178 59209 3306 -34428
24335 -34428 -23503 29534 54549 48624 23762 646 -20201 -24545 11662 -10260 -65075 -70436
24323 -70436 -25710 -3773 19569 1156 23832 21606 55873 74094 77879 68098 41331 49236
24311 49236 57447 37939 38626 35067 50596 49814 6143 6181 6549 24299 10977 1634 -17237 -6613
24297 -6613 20122 16031 37977 62109 80859 34246 7198 -5725 -24764 -42527 -49972 -20638
24285 -20638 19505 16274 -26714 -61408 -42983 -19948 -2949 19000 30920 20990 15257 34150
24273 34150 52269 17703 -21461 -16929 -30200 -49651 -42030 -30291 -16220 12157 63603 60208
24261 60208 62260 65573 98687 85761 80997 66366 11711 7163 -31021 -51143 -56769 -60636 -43486
24248 -43486 -17477 -10321 389 1314 9937 10991 19956 1383 -2396 -41484 -68902 -76692 -59791
24235 -59791 -27699 18395 31246 18169 43989 19100 15031 62970 74139 52014 31457 -24141
24223 -24141 -42304 -28361 -32165 -41353 -37749 -20853 -23659 733 -22139 -61065 -66186 -88358 -55542
24210 -55542 -68730 -65437 -12397 -34779 -68673 -68812 -48708 -21621 -10606 20979 16116 -7559
24198 -7559 -8963 -30524 -50209 -39455 -35524 -54364 -29595 -3732 1281 -3487 -2277 -32437 -60239
24185 -60239 -73326 -52754 -20245 -54104 -49688 -72800 -59200 -11419 -32083 -38590 -19192 -14962
24173 -14962 -45112 -68443 -38044 -41589 -20583 25143 28250 26378 937 -4800 -39984 -63303
24161 -63303 -24720 -12986 35103 40805 52118 63711 63206 74758 79894 48358 7469 20812
24149 20812 47848 53506 41272 13073 -40337 -40978 -43389 -35416 -4283 22773 65059 54432 18375
24136 18375 8848 -1994 -20605 -42120 -31136 -21645 3910 -7873 -2240 23152 39852 31256
24124 31256 45307 22448 14293 21587 -2246 12590 -2694 6213 6898 15517 24144 7473 -52088
24111 -52088 -52107 -63617 -40350 -16759 23779 17207 12147 32585 27105 -22035 -52475 -49899 -42665
24098 -42665 -63773 -56790 -56740 -48247 -11835 34579 47163 4041 11674 5351 37435 69718 115232
24085 115232 103428 73874 19005 -13386 -28757 -22060 6958 35925 32123 -12833 -43872 -65874
24073 -65874 -50516 -52427 -49519 -29459 -23611 -7178 44685 64936 67832 69933 18228 553 -21971
24060 -21971 -21368 -25240 -4002 861 16013 1856 -17984 -17564 -25158 -9328 17049 -18561 -40949
24047 -40949 -28682 -22105 -8703 -24871 -41565 -10313 12364 -1447 -54039 -88494 -84061 -49367
24035 -49367 -11582 -5516 2716 -969 -1864 -21117 13817 8428 -32866 -41363 -36335 -631 483
24022 483 8304 -12598 -59393 -48415 -13023 35664 37808 51591 66716 42846 23835 43967
24010 43967 750 -7061 5333 1026 -32741 -17540 -348 15665 -8497 3676 36900 17318
23998 17318 -3204 -3562 31882 14265 17938 18771 33263 23261 21874 24170 -30695 -60205 -53573
23985 -53573 -11665 5010 12685 17760 16076 39951 26235 -14203 -21955 -3146 38583 36110 9152
23972 9152 -9564 -10100 -24503 15303 14543 5220 -6815 -35719 -15055 42292 49617 10635 -28566
23959 -28566 -73594 -13669 7942 3001 -19143 -15060 4407 26114 9000 -12175 22746 44293
23947 44293 21295 -9233 -45744 -45457 -6844 -9161 -53738 -76830 -45103 8681 51994 38835
23935 38835 5049 13831 10150 16429 -5619 19462 3165 -26436 -75453 -56204 -24789 -45877
23923 -45877 -47594 -58188 -31046 -7915 -36262 -36184 -12728 5578 -6817 12132 19888 -26493 -45674
23910 -45674 -1329 35001 53063 48340 -6283 -57819 -68266 -35383 -45782 -43348 -18811 2094
23898 2094 -11745 -11294 -7358 -5102 5580 10066 -3141 -33602 -57294 -87598 -66848 -90744 -97641
23885 -97641 -74517 -59075 -23417 -2184 2195 -134 -5299 -31880 -29077 -43798 -46068 -54999 -12426
23872 -12426 -16395 -26087 -30836 -60373 -46992 -5484 -4264 -240 -1280 390 1747 7589 43337
23859 43337 51235 -7880 -27155 8505 -10955 -495 13092 10630 18510 15795 6796 1233 21503
23846 21503 17687 18354 -27359 -58604 -32262 -9349 -16924 -32332 -36695 -30083 -47682 -41248 -45446
23833 -45446 -70072 -44646 -2877 -19820 -32640 -60423 -81420 -30792 40886 32310 10087 21217
23821 21217 42900 34360 40533 66550 52260 35654 8050 5348 -46850 -85425 -103723 -100561
23809 -100561 -117610 -90736 -30147 -31378 -37508 -11556 4134 13929 -23818 -18204 30534 51399
23797 51399 47116 26724 -7074 -40219 -54475 -60456 -22502 -15241 -15492 4997 -30151 -61805 -21417
23784 -21417 13218 12123 -17234 -3833 -35806 -15516 35516 41793 -6976 -14589 32381 42272
23772 42272 48582 6992 -26233 -73450 -33585 12033 11303 30675 37369 48249 63706 53270
23760 53270 11103 16824 -14199 -76320 -72643 -40835 -31635 -60567 -63543 -63809 -88603 -64021 -48291
23747 -48291 -18795 17558 15018 1488 22372 5172 10278 33320 56922 15140 -10794 -19740
23735 -19740 -26302 5217 35687 27871 -15802 -4091 -4394 -30226 -30400 -37779 -1457 38292 45515
23722 45515 38382 198 -28798 -49391 -24029 -12766 -4859 8123 -13196 -17823 -6060 12375
23710 12375 38392 14749 7136 25797 41112 -7214 -2606 -38974 -31968 -11821 38640 8612
23698 8612 -3706 -34770 -32109 26397 2282 -18934 12091 23594 29798 48735 -1704 -35098
23686 -35098 -36478 -41172 -11304 14297 -10689 10525 35199 32148 6775 -15976 -19625 48127
23674 48127 56623 74081 57723 -15672 -41231 -9754 10001 19809 -12270 43288 74080 56198
23662 56198 28739 -17296 -28380 -13644 18036 -1911 -5053 6548 38223 70233 62705 -17367
23650 -17367 -21259 -1444 8701 27993 45277 21794 44136 31391 35962 52712 85337 61490
23638 61490 56658 66625 40446 -2328 -81281 -61831 -59268 -63933 -49273 -3978 -28694 -36428 -62928
23625 -62928 -75128 -47813 -30038 42742 83174 96264 24864 -29423 -4596 9787 39260 48246
23613 48246 7090 2711 34711 41442 18745 27627 39513 40564 21137 -12212 -3331 -10932 -16368
23600 -16368 7872 6342 -2191 -11504 5418 40092 15712 -5725 889 18254 -8352 9135
23588 9135 48454 69284 21863 -9842 -1479 3527 -17327 -26459 -29374 -31044 -22434 9253 10046
23575 10046 24242 25038 14062 13806 3941 -31519 -16745 7373 10753 11651 8122 -8612 -24899
23562 -24899 -62853 -76275 -53843 -36715 -28985 7914 18120 1216 -7058 905 10411 27508
23550 27508 -986 13717 52027 60685 21198 -20596 -40908 -21036 20028 41525 26298 -32855
23538 -32855 -71662 -77956 -61804 -21459 -34457 -42708 -45012 -47515 4782 37112 23708 3872
23526 3872 10587 -17850 -33000 -26585 -45993 -19690 -1076 1507 -305 -4502 -8630 -31266 -38888
23513 -38888 -28981 -10399 30656 62107 15264 6704 1373 -2201 -17173 -5613 -6034 25251 21922
23500 21922 1338 -12058 -25302 -36784 -14182 7950 43378 47706 69500 62705 40333 9280
23488 9280 -12127 16707 43267 41910 54649 31221 -2884 -21574 9710 13291 -19797 -39525
23476 -39525 -23121 -6171 -24267 -33068 -50693 -3804 23480 63690 95463 71249 15946 -13025
23464 -13025 -46331 -31619 9772 57576 88434 96101 101021 31498 -193 -8889 -2807 20976
23452 20976 22222 -48593 -74609 7100 -785 -18423 -29272 -38626 7204 22821 12307 -4172
23440 -4172 -4462 17408 11311 -2928 -5036 1184 14094 2784 8020 14729 -11450 -10542 19497 8765
23426 8765 32256 42406 -11222 -10125 33463 21362 -30445 -28472 -4747 -1204 -4676 3287 49289
23413 49289 77512 46095 5691 -13302 -35690 -58995 -31602 -20071 -44153 -26201 9836 23102
23401 23102 7760 -26089 -48446 -52379 -27786 3211 27556 11793 -6108 -6475 -25630 -19929
23389 -19929 -18179 -7035 -1593 -21526 -22175 -30990 -20098 16521 27433 -22136 -19137 -46403 -47315
23376 -47315 -15399 18950 34161 32755 -2261 -52841 -52272 -29822 20376 13707 45440 20521
23364 20521 159 -40916 -29377 -21122 -12000 1846 3437 11885 46149 55657 42324 -3763 -51510
23351 -51510 -56347 -27735 -42463 -62954 -2653 35815 -24299 -32974 -5924 -8413 1208 -16372
23339 -16372 6759 35070 3524 649 5616 -11306 -6031 -4407 -17356 2812 25488 60987
23327 60987 65486 42622 52377 7397 -36838 24706 35861 17334 42307 110057 46106 12458
23315 12458 13795 47664 73764 44191 32473 33160 -13244 -85320 -93701 -71624 -60771 -75769
23303 -75769 -85854 -97781 -88576 -71221 -4041 4003 -43052 -73356 -63689 -44085 -43749 -42941 -2735
23290 -2735 15070 10060 12108 5929 -30551 12326 56487 37644 21846 24280 9061 -36970 -34222
23277 -34222 -8503 -15878 -21294 -34003 -15112 -2527 10635 19980 51760 33638 17951 8105
23265 8105 15565 31114 7920 33571 69096 45737 -3509 -30369 -59571 -33041 -28745 -11521
23253 -11521 31523 13627 18875 30936 -4172 22106 30397 19421 5241 17984 46771 61855
23241 61855 100836 49126 15253 7323 25888 -7138 -47040 -56146 -56281 -54806 1714 10840 23551
23228 23551 10215 -1179 23079 52362 64340 82945 59534 23393 24961 33570 -3752 -39281
23216 -39281 -25832 14575 29264 29351 5667 -23248 -4980 15085 48262 52035 64396 84896
23204 84896 83866 66775 -5643 -19151 9905 -8972 -35569 -24411 13425 24050 -3760 56626
23192 56626 124276 68753 16502 12566 25902 17779 17119 17836 3785 3321 24888 -6088 -46347
23179 -46347 -45023 -59304 -39231 -74997 -64774 -23142 23508 53088 20436 18920 -12169 -74327
23167 -74327 -51421 -49034 -60505 -61016 -24903 -21547 -19539 -15560 -43956 -54417 -88760 -82650 -2363
23154 -2363 7771 8185 34804 25108 -30831 -39298 -30489 -8241 18789 20005 -9486 -45717 -99777
23141 -99777 -89494 -33778 -12216 18645 34528 57196 44811 -16274 -67970 -47270 -30697 -17365
23129 -17365 -30702 -21732 -8534 -9077 -33636 -42965 -73184 -108097 -83286 -53466 -39518 -64683
23117 -64683 -58265 -59859 -68510 -44782 -33840 -35587 -13318 10364 11874 31535 49141 36939 52431
23104 52431 44569 -10699 -65948 -97042 -87656 -75058 -36261 -25336 -18983 -15168 -45229 -71603
23092 -71603 -22165 -36191 -81351 -50052 -43709 -61591 -41386 -64423 -41375 -13105 12059 -37883
23080 -37883 -41265 -4170 -14219 -1695 17400 18179 37243 38505 20613 -16758 -12247 27680 40935
23067 40935 38115 23455 5098 11835 30436 44015 19172 18312 24721 9751 15819 18888 -4200
23054 -4200 -58326 -78297 -68402 -66146 -107728 -89260 -51399 -567 11099 -16898 9721 29829
23042 29829 22356 29290 40110 59837 9948 -5829 -7701 26742 39091 22232 -10195 -18080
23030 -18080 4284 59130 69203 57552 2115 -2355 -193 4908 -16314 -11382 -27160 -33019 -34451
23017 -34451 -15905 3380 7232 20831 3023 -28702 -34622 -50396 -71619 -99358 -65931 -46322
23005 -46322 -63771 -13257 -333 -35519 -19131 -17138 -11825 -8316 -10209 14641 -835 -33114
22993 -33114 -61896 -83944 -50069 -19754 -44459 -61640 -21980 7097 25207 -5174 26823 46640
22981 46640 85797 78956 16197 17249 14096 -32755 -50511 -42715 -37703 -830 8754 -617 20612
22968 20612 26477 30147 15506 40394 51804 48246 60574 44662 -663 -4728 14848 -19217
22956 -19217 -30157 -164 -348 -18377 -24412 -25076 -14152 -13447 -31917 7004 3679 -17741 -18286 6704
22942 6704 62145 69217 32955 7297 21353 50808 51749 23435 25123 23064 27316 36956 11526
22929 11526 -16024 18803 3154 -873 26890 34338 49015 40648 36988 -2061 -39955 -45214 -3362
22916 -3362 9060 358 -6561 -30995 -26336 -24918 -15331 -13514 -28748 -39849 -23999 -19647 -23403
22903 -23403 -39339 -37014 -56688 -33017 15256 -1769 -29822 -58144 -89529 -71711 -26459 -39221
22891 -39221 -32422 -32094 -50589 -26819 -23186 -18281 14854 -17757 -41172 -46690 -40684 -26602 -28410
22878 -28410 -55595 -63987 -81647 -65055 -49962 -36488 -38443 -35258 709 15525 8884 1542 -32764
22865 -32764 -35867 -57704 -33793 -14810 -32504 -35356 -64108 -58504 -23830 -36695 -39895 -43839 -86421
22852 -86421 -100499 -92715 -49814 -29629 -78970 -96789 -64771 -42984 -1981 21811 -11392 -38989
22840 -38989 -3570 -4969 -17045 -37531 -42864 -38406 -15667 39466 58409 41484 8164 93
22828 93 9750 5014 25019 36556 16636 -4144 8681 -31428 12203 85212 100452 83342 31017
22815 31017 21268 31423 58098 30883 33535 8703 -24796 -48538 -12518 14275 3518 -29669
22803 -29669 -47208 -16137 -4542 42405 37954 -10607 -7110 33603 40358 -12960 -45426 -41018
22791 -41018 -35638 -63073 -29824 4082 28132 30826 49611 83135 19731 7299 -4496 -27228
22779 -27228 -10893 -49040 -63918 -50773 -20561 42017 78994 23438 -10126 -35688 -80673 -69097
22767 -69097 -9017 43658 42605 -3152 -16099 -33442 -42526 -63200 -46946 348 24487 56062
22755 56062 46494 11225 -30100 -71863 -63246 -43157 -78934 -111148 -67739 -19711 -31515 -33034
22743 -33034 -49856 -71412 -66139 -84316 -90350 -86539 -80222 -20011 33194 -3141 626 -19007 -61445
22730 -61445 -52887 -69171 -70699 -28731 -9251 -4240 -57372 -52057 -22653 -7442 -11291 -26252 6090
22717 6090 11848 5093 34995 46149 -11165 -3339 8101 19654 -25462 -23921 -21041 9090 65850
22704 65850 28980 9099 -23548 -24109 -19437 -16546 -36859 -39503 -57436 -26156 -7224 -4186 -22183
22691 -22183 -10359 5743 11692 -10592 -25955 -17567 -26088 -15842 17279 41286 10167 -13284
22679 -13284 8948 -4587 -24177 -54325 -72009 -42731 -47662 -39543 -18840 -8955 653 32182
22667 32182 57309 33877 29546 21976 14552 13278 -4754 22782 20629 12915 5016 19415 32421
22654 32421 -9393 -2815 32364 -3282 -13669 14186 29691 3129 -10361 -9482 -48061 -9133
22642 -9133 17409 -11667 -47665 -35022 -24481 -29822 -44503 -49926 -57513 -69149 -6799 19962
22630 19962 -15086 -30715 -17145 -19262 18991 33452 67650 75237 70635 65392 56152 64144 52354
22617 52354 10755 -14767 5045 -26936 -70607 -63201 -71906 -79915 -58106 -53768 -41017 -55383
22605 -55383 -53822 -44571 -26472 -52557 -61998 -5051 -6888 -21404 -18388 -4031 -2451 6187 -53353
22592 -53353 -93387 -27151 26314 39846 23143 -1671 -32364 -23629 -85478 -98298 -48056 -27464
22580 -27464 -39930 -30647 -50200 -72806 -46696 -18820 5100 -499 1543 -7506 -2386 34362 36136
22567 36136 27675 23494 -21568 -49155 -24584 35238 54289 36044 -18055 -48184 -87474 -112228
22555 -112228 -91991 -61662 -29022 -12700 -2232 -13603 -4558 -23488 -22717 5028 -24390 20109
22543 20109 47458 44820 23967 45740 57810 26851 -10976 -21924 -17686 9576 8530 24561
22531 24561 2307 -2716 -32779 -33928 -29415 -44485 -43610 7072 32856 30498 1998 5406 17217
22518 17217 7454 14910 12649 -22926 9236 19400 10344 -45372 -68818 -30739 -5664 -4770 -25240
22505 -25240 -28265 -3814 10376 35461 50351 59237 36568 56896 25768 -7635 -6079 24099
22493 24099 37756 8856 -1108 -15358 -41859 -50627 -16869 46686 26693 -13473 -55110 -89584
22481 -89584 -82004 -60376 -49424 -25045 -49059 -35482 -10899 27640 85036 90970 73343 15776
22469 15776 1712 27313 41738 6950 -13456 17569 5000 15103 953 -23316 -19900 -48506
22457 -48506 -68825 -57083 -42213 -32859 -43061 -45873 -31805 -2681 -33489 -57325 -37811 -46619
22445 -46619 -58013 -63298 -64826 -60239 -50568 -78745 -113232 -90330 -43642 -3139 7037 -16794
22433 -16794 -24328 -9925 -12026 9657 90061 104161 55678 43021 38012 32651 49608 72424
22421 72424 53848 7230 -10376 -45207 -73723 -56692 -42115 -24771 -3604 -33193 -20046 -37532
22409 -37532 -29367 -3474 116 -1624 -2903 -27203 -18503 4319 22935 23220 12077 -19952 -21442
22396 -21442 -14293 42384 53304 20751 -4253 -23587 -14892 8009 30490 17815 6616 2249
22384 2249 4553 15217 -25326 -38771 -11366 21571 -8514 26348 44550 21251 -13173 -9833
22372 -9833 -16365 -12915 -21581 17379 7991 -10468 -13656 -4700 5521 63124 77782 35742 40921
22359 40921 43256 50091 19729 -14534 -23009 -32419 -19030 -26276 -49371 -16556 11846 -1567 -3254
22346 -3254 8490 -21426 -17710 13599 -22758 -50837 -48570 -44707 -20172 -4900 -43304 -48308 -65166
22333 -65166 -39640 -26438 -26539 -69053 -80315 -36848 4765 -18918 -39167 -30415 -18572 -34448
22321 -34448 -27099 -12555 -35838 -24027 -47086 -37175 15664 3149 -13925 6168 25243 20491
22309 20491 10867 18869 -27218 -42542 -14725 24919 34486 37381 79840 47266 -17620 9009
22297 9009 60592 23311 7792 -10767 -52685 -25978 5850 10062 -22615 -17801 -10471 -31160
22285 -31160 -28049 -22631 -42610 -38382 -26304 -47115 -48275 -75171 -61933 -34662 13702 -1285
22273 -1285 2147 -11086 3898 14025 -25316 -34317 -7470 9222 -26272 -75199 -85802 -80976
22261 -80976 -62951 -68411 -67980 -42040 -6097 -50786 -55102 -28603 3993 57057 36631 -5019
22249 -5019 2089 -19285 -31323 18968 -21786 -20344 -32834 -43000 -9152 17677 12407 38459
22237 38459 49857 36935 12976 -18481 -57838 -17357 33077 18021 -24843 -57621 -43540 -60816
22225 -60816 -53367 -10366 -28129 -18622 35877 32250 11176 -538 5731 -1532 -454 17468 9149
22212 9149 9985 -21608 -12126 21527 42416 26451 -8980 5683 36604 37681 1489 8400 17294
22199 17294 3797 -8819 -8185 -38421 -25761 -24080 -23875 -9443 -27030 -55364 -65058 -60979 -14485
22186 -14485 25488 47693 57079 2181 -64328 -28614 5880 1928 -15048 -36467 -19089 5959
22174 5959 29609 35520 23505 -18095 -6555 64607 56290 39326 23144 11339 -27721 -70083
22162 -70083 -112785 -65374 -12751 -1722 -13462 -19440 -31615 -76982 -43908 452 33830 27008
22150 27008 30433 66702 29366 -19742 -67881 -56284 -47183 -21364 31183 41387 21018 -12204
22138 -12204 -30053 -30633 -57091 -56683 -11257 -3751 -21962 25240 32357 28025 -18470 -20810 -29714
22125 -29714 -54668 -44339 -11724 25247 24651 15940 -49261 -51602 -6094 -7764 -29710 -6376 25384
22112 25384 24124 -1407 -14827 -30753 -19706 26752 66803 40902 27691 35730 8543 33903
22100 33903 25196 -4552 -48616 -41014 -1773 -45109 -57304 -33474 -66339 -40036 -15856 1916
22088 1916 22873 13202 -4953 -25887 -47860 -50996 -42473 -3709 40675 47959 36511 80792 33581
22075 33581 -18619 -14676 -52459 -21809 8036 33551 38227 18587 -17058 -44975 -40768 -45218
22063 -45218 -45812 -11301 22247 23097 9883 -23112 -4673 13516 -17409 -448 1796 -45776 -13349
22050 -13349 -4124 -25120 -70921 -47267 -23468 10113 13540 5180 12607 -317 -25440 -6265
22038 -6265 34164 37432 34562 32223 17782 50250 89590 71399 42930 37032 60302 35978 13234
22025 13234 -6476 -2996 -15038 6119 29180 -4098 -38260 -2970 -16727 -48499 -79370 -79217
22013 -79217 -55152 -10517 -53564 -58401 -48040 -24455 -45322 -53637 -43413 -43182 -23824 11719
22001 11719 59045 30239 -30331 -40517 -48949 -14255 11597 52847 37508 -9399 -16535 -21930
21989 -21930 -4100 -21232 -10247 -20953 -10886 25090 15381 1649 9009 27548 12471 -11430
21977 -11430 -32213 -22658 -6710 1979 -62 6749 -15843 -9155 -20069 -24898 -39876 -43825 5582
21964 5582 25823 36617 50480 79412 88950 55157 16038 9704 -6752 -2673 -2325 23857 -1140
21951 -1140 11043 -39170 -54963 -23199 614 19824 -8273 -26149 16987 24366 -16641 -24875
21939 -24875 -8804 -35269 -38833 -16306 3514 -20041 -32053 4768 16900 -30698 -58064 -33236
21927 -33236 -1725 27186 50758 38023 25791 57402 19242 14978 20076 44534 8313 -20354
21915 -20354 -12858 -19497 36490 47705 17594 -19158 -2251 12172 -1466 -1586 -11164 58946 86669
21902 86669 18220 -13784 -26593 -32790 -7149 -8222 46431 19064 30765 -18869 -31254 -5242
21890 -5242 55425 63810 69249 52764 16594 -7776 44382 104671 115518 105382 69137 27950
21878 27950 22233 43112 31616 44584 54428 51366 415 -14662 26343 18502 1035 3403 14334
21865 14334 22179 20256 12910 -2332 20620 35886 70506 43134 9458 -24057 -22318 9852
21853 9852 44886 79789 32755 -3170 7297 37248 34150 19145 22939 -28533 -37211 -27480 -52021
21840 -52021 -64254 -43942 -30648 3148 44059 25444 -8649 -42181 -8765 -7518 8825 63480
21828 63480 80078 41447 23781 25072 46273 40640 33897 58852 24537 -12155 -31599 724
21816 724 -6910 56789 63992 56656 64879 12935 -37251 -34615 -74846 -60877 13261 44434 32042
21803 32042 14865 -1832 11735 87 -4772 -16720 -15713 -13967 -24729 -6388 -9064 -27376
21791 -27376 -21551 -924 -6851 -26283 14563 4476 433 8209 23734 30861 21251 13234 28619
21778 28619 26729 18840 -17727 -49035 -40854 -40188 -17839 29501 21947 22244 27612 19620 19384 16058
21764 16058 12230 57712 6404 -48652 -51730 6061 48707 36240 2767 -19527 -30655 432
21752 432 41861 16668 4276 -34876 858 36632 7980 -9649 -45077 -71784 -41816 -30887
21740 -30887 -36962 -27089 -20777 -16698 9924 -6004 -7141 -13702 -19505 -37798 -45469 -51453 -43737 -937
21726 -937 14498 -26987 -58492 -48040 -55932 -51754 -9318 -4977 -43389 -36455 -18705 -25539 -2869
21713 -2869 51480 69451 61529 29433 -30883 -50030 12005 35479 27814 3895 -5085 -8655 -8422
21700 -8422 12745 38628 41653 25092 33920 54001 89346 87118 68417 48184 31315 23718 -10197
21687 -10197 4531 22711 -1337 2976 20205 -20741 -28923 -44896 -42618 -25607 -12186 21459
21675 21459 -3092 -22731 -29873 -19611 -41548 -26036 -22715 -9478 4010 1898 24207 -3851
21663 -3851 -30764 6771 48938 48802 21100 6759 25434 22708 48215 3024 -11612 -33613
21651 -33613 -36443 -39384 -55278 -88032 -76402 -85537 -92380 -59566 -35299 -8341 9135 3053 20286
21638 20286 43569 51469 35583 32984 15749 -1982 -28094 -25834 -51400 -36600 -42447 -104700
21626 -104700 -105275 -61094 -42765 -40457 -44213 -24746 -43083 -22875 12641 58019 42923 37186
21614 37186 18737 31801 7165 -12251 820 -13468 -65750 -82241 -63602 -24735 -11736 23518
21602 23518 -8695 -14958 8154 17925 30680 69669 57134 6557 -55764 -63908 -32545 -12324
21590 -12324 -19928 -2639 5753 -5036 -64354 -75983 -91744 -67418 -70210 -44351 -36237 -24157
21578 -24157 22489 60645 48707 32208 -20383 -23455 9354 -1615 -24970 16319 13735 -33893
21566 -33893 -55422 -23965 -6280 -9466 21949 45251 28701 150 -9903 -18782 -24688 -51088
21554 -51088 -46578 -36497 -50500 -39959 -35644 -46724 -40287 -33643 -10545 27879 49417 38625
21542 38625 7254 3377 -22241 4190 11472 -4436 19906 31547 46322 -6603 -25112 -51946
21530 -51946 -70532 -22062 22349 -21489 -66483 -98249 -72038 -54176 -31571 1526 41233 50428
21518 50428 55179 51118 55318 40190 14587 25474 60985 109474 79872 46769 38976 18319
21506 18319 10734 3142 -6539 -29945 -13025 -15395 -24459 -13554 2111 -30576 -75781 -73418 -76265
21493 -76265 -64261 -25097 -14645 2493 -16240 -32244 -71117 -86701 -51091 -18998 -61252 -84270
21481 -84270 -68315 -49575 -46031 -42641 -31053 -20225 -2977 75088 89288 64973 72227 31968
21469 31968 -3272 -50710 -101191 -54376 -40907 -74023 -81286 -13502 19833 9694 361 45057
21457 45057 33116 21477 24925 48310 22825 5579 -2434 12547 2226 -46521 -122223 -143971
21445 -143971 -41067 1126 -15349 -28226 -19893 -37883 -47577 -49608 -39787 -46770 -70153 -76039
21433 -76039 -43195 5455 8186 24957 33045 14728 -4880 -28754 -22883 -25623 6288 36000
21421 36000 35279 3343 -33085 -34867 -37272 -17229 -34300 13960 44498 13536 28196 -6569
21409 -6569 -23866 -15068 -24485 -59141 -47497 -6152 1929 1484 -2820 -33227 -19979 -6496 9700
21396 9700 -38269 -65030 -52768 -43266 -31319 -13216 30947 22789 4054 -10221 -29917 -82862
21384 -82862 -44130 -26228 -44795 -58322 -62197 -59459 -26656 42796 50967 44624 -4648 15973
21372 15973 33192 10633 -36335 -27202 -15760 -28137 -12798 -4606 11372 23473 15077 10465
21360 10465 32222 30484 5345 -33212 -75215 -67081 -57756 -51206 -64835 -53211 -42422 -89521
21348 -89521 -83622 -73274 -48931 -27978 -12138 -48600 -66915 -86103 -42700 -12728 -14437 -46818
21336 -46818 -45918 -49903 -53524 -63909 -60160 -120472 -163114 -113630 -62850 -74740 -101090 -59419 -3773
21323 -3773 -23361 -49632 -61136 -37476 6495 -8640 19588 -7159 -33042 -25270 14646 23043
21311 23043 18439 -34643 -82562 -83269 -69403 -36365 -27085 -65422 -93669 -47950 -32916 -16329
21299 -16329 -7688 -37203 -63077 -74471 -69879 -26333 -12449 -43932 -40180 -16378 12514 -842
21287 -842 -3127 -5389 -31611 -5570 -19622 -44249 -48537 -53405 -42680 -51536 -74061 -96794 -104713
21274 -104713 -74789 -42993 -50265 -58323 -45861 21597 28024 3010 -15300 -32988 -27562 3178
21262 3178 18246 -4804 -33594 -40385 -74797 -46286 -3589 -5230 10399 -16424 -54051 -38046
21250 -38046 -40147 -39162 -14129 -41495 -85425 -99850 -52145 -1331 4637 5768 9769 -23919 -948
21237 -948 40250 34883 -1082 -24320 -36383 -40724 -42438 4666 18322 -10459 -19570 -29468 -18544
21224 -18544 -35671 -40855 -35388 1353 38417 28094 1068 5123 12916 -48622 -69508 -80325
21212 -80325 -55699 -57795 -75052 -49650 -11162 14259 35167 13333 -16468 -10180 -27963 -24240
21200 -24240 4760 -2131 2152 6954 15306 2614 -790 -13295 -10762 6412 9473 19330 28802
21187 28802 5729 -24069 -48494 -35625 -41398 -14976 19289 22708 30472 35706 10852 -9166
21175 -9166 -19336 -6534 -17621 -46427 -50330 -50069 -78014 -83822 -70802 -59806 -6412 -12972 -29191
21162 -29191 -3544 16795 -19962 -41944 -51397 -50322 -48999 -14388 -15156 -14499 -3260 10892 48499
21149 48499 43486 18537 38215 4272 -63347 -33097 24614 -3762 -14272 9982 11846 -768
21137 -768 20696 3873 32290 33583 31571 16632 12403 22050 -33942 -37243 -54011 -124119 -170315
21124 -170315 -164327 -101014 -43774 16822 16908 -9553 26618 56565 45302 20702 2288 20415
21112 20415 28206 14810 -33132 -21359 -16092 12707 -23180 -49035 -16113 -15527 8719 31849
21100 31849 16887 -18912 2509 15596 -11438 -2106 9778 -7876 32804 42772 38698 24451
21088 24451 34746 37921 80321 70349 48019 52404 8551 3960 4265 -23458 -46518 -61537 -54289
21075 -54289 -44133 -41931 -50229 -56562 -32077 15619 35255 26594 -8003 20741 43406 63525
21063 63525 86431 48173 19682 -16170 -36940 -39702 -59367 -68005 -79407 -64547 -66246 -81253
21051 -81253 -71339 -9445 18488 13909 33343 26760 31333 12260 17328 11803 -10270 6688 21188
21038 21188 -19100 -32443 -74917 -99909 -103077 -69018 -20105 15581 17905 15196 33095 31822
21026 31822 14967 13525 4499 18843 37425 135 12870 14847 14976 -31979 -34747 2559 44472
21013 44472 58404 -1899 -58312 -34923 -46072 -47052 -48483 -28005 15317 16752 4709 5568 -12345
21000 -12345 -5438 31633 6769 -24722 7786 -2985 4696 -6616 -27130 -8882 36284 43915
20988 43915 9458 30668 17422 14929 -9608 24391 21514 12226 14308 -26736 -38367 -54222
20976 -54222 -54972 -14024 -17833 -31788 -17891 -25575 18799 53773 26111 -10923 -47576 -55471 -51927
20963 -51927 -65909 -53798 -26010 -14491 -41525 -54210 -10763 -36056 -73525 -67905 -42476 -16265
20951 -16265 -19807 -30855 -27364 -13144 -22424 -35370 -26433 -31579 -57676 -53057 -44805 -19965 -37224
20938 -37224 -28249 -66831 -60166 -19237 -8255 -10152 -12699 3702 -29194 305 4190 -14006 -34256
20925 -34256 -42118 -36052 1060 22092 32254 20539 34085 21626 7040 2105 -37202 -66660
20913 -66660 -21133 -788 -22569 -67955 -38690 -27783 -39678 -77627 -112764 -66667 -1880 -2737
20901 -2737 -8116 3198 -24163 -27218 22512 25909 -4852 -34882 -47401 -45154 -48901 -29746 -28933
20888 -28933 15 12921 4168 31150 41108 432 -44455 -29322 9557 30594 -4861 -15728
20876 -15728 -25075 587 40489 30899 -11079 -38978 -56389 -62708 -9170 38297 20379 34944
20864 34944 67650 58043 273 -51069 -29614 -498 10618 -9718 2681 2030 -20425 -19805 -21109
20851 -21109 6572 11784 -17887 -64511 -47346 -32667 -42397 -22034 -13958 -11812 -21417 -39080 -24161
20838 -24161 -29083 -36981 -30107 -16965 -27634 23365 84759 43065 21254 -739 -15139 -33096
20826 -33096 -56960 -71835 -57018 -14664 1334 -47055 -69851 -84098 -72100 -99029 -55855 -14100
20814 -14100 -5813 9808 30265 14779 23694 -16220 -54268 -33888 -34232 -15318 -2845 31184
20802 31184 15920 17281 31114 29299 8105 -37418 -31554 -54784 -85816 -36922 22191 48615
20790 48615 43379 5562 2902 -15852 -14436 -18873 -8204 -8474 -18262 -8440 -49513 -27986 -1933
20777 -1933 -21704 -66591 -49572 -5575 -10117 -38089 -64169 -66488 -84408 -81108 -76288 -59267 -45136
20764 -45136 -68740 -52164 -30247 -36888 -38545 -40064 -56797 -38270 -71499 -83715 -68654 -30753
20752 -30753 -11771 -9610 25380 18149 4993 10694 13030 -22690 -31844 1772 -1443 -44182 -24391
20739 -24391 -22601 -40560 -10106 2423 -31385 -36436 -36429 -34973 -15767 -20179 -35357 -54007 -71561
20726 -71561 -46913 -83021 -84540 -36335 -34380 -25605 -16861 -2847 -44127 -22561 -21720 -20223 1591
20713 1591 -6908 -8244 13643 21445 25404 29784 30317 28817 -21553 -28733 -12114 -34988 6958 18067
20699 18067 43611 21797 -2967 20573 16658 5400 -12436 -2027 3478 -23333 -34182 -31201
20687 -31201 -46591 -25618 -2301 -7877 13861 34248 55434 49662 18419 24771 38133 21097
20675 21097 2819 -13364 -43087 -54800 -19783 -24437 -24138 3008 23243 15361 -11380 10590
20663 10590 11122 -16034 -48130 -65613 -34280 -20183 -32470 -37411 -71998 -70993 785 38800
20651 38800 31516 -11506 -4798 -36310 -73006 -51358 -11526 -9156 -10827 -11535 -13698 -6154 4804
20638 4804 19108 36326 22927 237 27486 44764 70565 82532 34978 15460 18887 48256
20626 48256 93711 74911 4513 -17817 16347 4736 9180 56139 39796 38788 25627 -3436
20614 -3436 -16245 10352 26197 59922 108990 95882 53629 35478 36159 -4766 40011 100637
20602 100637 106567 68663 15811 -15633 -45121 -39843 -27364 -31209 -28930 -23088 -11454 -1263
20590 -1263 20810 15614 27164 -970 -39046 -47333 -49796 -6020 31585 57827 52751 15702 50572
20577 50572 68268 26517 -18783 -18989 8280 -7128 33130 54312 41052 10665 35809 24999
20565 24999 -19176 -32394 -42407 -21692 10047 6174 -13726 -6921 -16707 -9431 -25654 -24567 -22092
20552 -22092 -54007 -86742 -59044 14524 35170 60802 39687 30747 40857 15188 44260 -11003
20540 -11003 -47290 -77168 -43908 -20048 7400 13461 41774 13435 -9139 2828 1883 -17419
20528 -17419 -40976 -26015 -31054 -25033 -25548 -21204 -47937 -53799 -48293 -28398 40992 69781 66283
20515 66283 61732 48524 56861 23022 5396 -42562 -26838 -32345 -59123 -41450 -21855 -33983
20503 -33983 -19155 9808 49072 51953 -41836 -64857 -16689 -31133 -55942 -45584 -73129 -38491
20491 -38491 -32871 20712 51831 54181 1917 -14294 -29415 -18757 -19524 -65832 -76407 -27569
20479 -27569 -19432 -16220 -49528 -27295 -41087 -53922 -1507 11306 23946 51208 10284 -9396
20467 -9396 -6453 -9330 -3786 17783 -12994 -6243 -9847 2715 -28090 -60835 -17638 -60000 -49842
20454 -49842 -12958 19344 32703 -132 -11115 -11421 -2347 -11775 -22869 -67111 -81224 -73520 -87384
20441 -87384 -74713 -17013 -4128 -5402 -561 -29973 -23967 -65902 -62311 -19194 -22612 -21540 -577
20428 -577 20000 17902 23192 2441 8694 23727 45329 29721 -18618 -28819 -28409 11640 10240
20415 10240 9025 -15173 -30018 -29530 -19907 -33150 -46766 -31534 -7449 -7067 -3574 3261 -8940
20402 -8940 -17237 21103 8588 -53292 -93032 -92685 -79844 -59600 -44483 -5006 -11255 3927 -11285
20389 -11285 -42240 -51629 -3833 31171 41664 -2101 -33033 -31675 8249 28691 21585 1775
20377 1775 -3479 -22133 -35073 -20657 -13848 -12335 -29667 -50739 -59072 -22071 -21 -20101 -25114
20364 -25114 -4046 -8372 -11204 -7257 -11816 -30195 18321 52026 1513 20062 47501 32702
20352 32702 -10203 -47166 -66776 -83907 -69031 -58661 -54323 -38014 -58293 -74358 -24612 -30753
20340 -30753 -3350 -26467 -48145 -81057 -44835 -12175 11916 28160 21295 -41465 -19120 -18564
20328 -18564 -50230 -73746 -41033 -6055 -8800 -55548 -4322 34098 9524 -30258 -45829 -267
20316 -267 -360 -10829 5450 41617 37401 -497 -39247 -37020 26314 35768 59942 37019 27126
20303 27126 19010 15191 22805 17626 30809 13102 -49880 -56262 771 55308 45138 29694 53916
20290 53916 71507 88051 53163 -7797 -12099 30620 14000 -28935 -22222 19094 25286 -8208
20278 -8208 -41580 -62859 -75600 -68251 -64986 -49553 -41594 -23098 9766 -17610 -11060 6785 -5454
20265 -5454 -10245 25180 23857 27023 1622 -25577 -42027 -22522 -43805 -52838 -36669 1068 243
20252 243 -7958 5689 -4496 -20301 -9531 -3540 2502 -7601 -29493 -32945 -10291 -1021 5542
20239 5542 27596 13828 35613 54963 2585 -18267 -22370 -39888 -55655 -30958 -21405 8909
20227 8909 43259 36241 35024 40889 35244 31625 30479 32194 31332 55470 29998 15405 38073 32871
20213 32871 39689 55515 35951 -8164 -35178 -10341 -25897 -28395 2908 980 -31102 -59455
20201 -59455 -71700 -68934 -20752 -16477 -28128 -10777 33784 18174 31418 2678 12619 39886
20189 39886 20182 -11668 -30753 -55621 -40508 -38431 -38016 -34106 -25750 21092 4661 -48860 -51603
20176 -51603 -48243 -56597 -19537 -5783 14134 1328 -3717 -28135 -76085 -49728 -60414 -31026
20164 -31026 6936 -13928 -23263 582 8991 -20293 -50785 21199 62043 56500 47217 69447
20152 69447 53076 546 -52068 -82957 -115313 -119077 -96389 -69686 -7799 6193 -3691 -19353
20140 -19353 -8989 -13509 -10779 22477 67083 72261 67814 60461 14584 12970 -26664 -45114 -35251
20127 -35251 25349 65695 54570 -3467 -33069 -40897 -31357 -2135 14738 43 -20746 7487
20115 7487 58030 80612 93965 58281 7447 3854 34868 1034 -43685 -34292 -56731 -98259
20103 -98259 -77737 -41643 -42353 -43706 -28348 -25284 -62434 -62713 -74128 -65514 -46716 -52922 -19295
20090 -19295 22615 49495 -14062 -43551 -33163 -48715 -23652 19372 9859 -24448 -59262 -32917
20078 -32917 11153 2576 -26620 -57003 -54619 -73895 -56636 -21514 -26139 -71772 -39285 -18587
20066 -18587 -39314 -35136 -47853 -33489 -4431 1577 -15966 -2102 -36309 -63591 -61476 -47049
20054 -47049 -30007 -35078 -36979 -47310 -27655 14994 32686 -4793 -10593 -14030 6496 2732 -1227
20041 -1227 -17970 -37632 -13738 -14120 -15886 -27241 -22969 -19623 -39666 -37034 -27832 -7374 13881
20028 13881 -13893 -53930 -101970 -89141 -41709 -65023 -75782 -36426 -56963 -85210 -104568 -78231
20016 -78231 -21992 -28028 -21790 -6475 -3764 22147 8936 -9194 -6577 -4371 18634 62150 95642
20003 95642 66523 25202 -2548 10553 1750 -54513 -99590 -62153 -34515 -39707 -37671 -70319
19991 -70319 -73462 -78953 -62888 -58495 -22703 11377 -40 -5728 -36290 -57610 -69838 -32713
19979 -32713 -1230 3108 1293 -8911 -34402 -20999 22095 18114 -4881 3439 13450 7922 -32640
19966 -32640 -27277 -17635 12669 -6577 -983 38781 17660 43956 19759 39130 42263 37616 1315
19953 1315 7267 -26625 -23059 4644 11173 2479 12761 27245 64567 33799 -5692 2915 -10189
19940 -10189 -33405 -12465 23904 22422 -18276 -85803 -97199 -92615 -39643 -17708 35161 44014
19928 44014 12408 2766 2287 -23755 -48621 -75956 -61951 -47830 -24391 -17241 -12594 -20381 -1880
19915 -1880 17636 25241 64789 61727 60558 79998 53800 4281 10201 -38470 -9944 14846 2309
19902 2309 -20576 -18365 -443 -16986 -47786 -65546 -56284 -64487 -58270 1404 -1999 -23771 -35579
19889 -35579 -13423 19887 16689 15811 17214 12037 1843 8973 16771 -33685 -41325 -47825 -20436
19876 -20436 -20138 -22374 -20096 -14065 -3221 50685 36026 35991 46949 51151 62791 64712 69381 5944
19862 5944 -53798 -83114 -77602 -43163 175 -14061 -10519 -24035 -5572 -30105 -8833 24039
19850 24039 14112 -3615 18227 39327 64913 49368 -4309 22269 33187 -6999 -14566 -11696
19838 -11696 -17546 -40128 -23119 -37183 -22825 6087 29262 -10968 -23510 -20575 3667 -23903
19826 -23903 -40493 -43253 -43306 -24597 11561 38338 61583 30792 -18140 -8141 7101 31792 35921
19813 35921 14210 5552 -36838 -50766 -64327 -35338 5193 9769 -13135 -2364 25110 6342
19801 6342 -12462 16275 34373 13805 -9022 -28846 19945 49200 23612 5328 40137 48402
19789 48402 48777 21971 -8921 -17272 -4036 -2566 -4015 -51622 -17266 8733 58315 32253 431
19776 431 5316 15494 -30630 -29425 -32158 -6237 -16609 -44267 -50500 -28985 12848 13433 -33676
19763 -33676 -56296 -16185 16662 -21988 -43207 -51900 -36486 -33136 -13538 5079 47219 30519
19751 30519 32704 47627 40292 4374 -8260 -2393 -6469 4751 6281 -14090 -33245 -58243 -47094
19738 -47094 -10163 23034 44442 41514 53680 20224 7932 12850 -48605 -63795 -82376 -51077
19726 -51077 6902 4715 1817 32321 53627 10056 -46630 -66474 -74115 -55373 -13520 213
19714 213 -32786 -28151 -13388 -32748 -9193 -848 -6946 3946 21665 31110 36370 12941 63
19701 63 -9091 -15064 -50188 -33452 -16380 -43089 -45259 -19490 17342 29024 28865 11590 18741
19688 18741 50997 64216 39253 29395 -9848 -47588 -87354 -73691 -47452 -34937 -45199 -69484
19676 -69484 -61164 -43917 -3811 31835 63620 59325 51655 15424 -10881 -22167 -15344 -17077 -5361
19663 -5361 -2733 31160 44429 19103 25786 8002 -19471 -23204 -24484 -23985 -17212 -33960 2439
19650 2439 58976 57064 21629 34835 57828 40793 -4810 -69954 -113247 -113361 -66101 -63541 -21115
19637 -21115 -17285 -16482 19784 9756 10052 -9881 -24859 -31859 -7778 -848 -24293 2403 22268
19624 22268 16289 5505 -192 -35850 -40573 -35701 -22483 7785 21259 -1564 -1557 18528 12278
19611 12278 1994 60865 79622 103472 110024 35721 8129 -6225 -623 -5371 -37734 -64930
19599 -64930 -73402 -37195 9348 30000 69509 59796 32270 -13443 -35684 -19800 -12821 -60540
19587 -60540 -86119 -63383 -42674 -9606 -11478 -18796 -38354 -21983 -26180 -38426 -20863 -53817
19575 -53817 -51617 -43683 -22123 -4250 -7843 28198 32778 -18616 -19925 1598 -10416 -22694 -3609
19562 -3609 -21894 -17616 -14139 20641 619 -33384 -18069 18824 -13296 -27575 -36624 -26632 -13181
19549 -13181 17817 24016 -21781 -26519 17503 16833 57877 78115 104586 62335 44077 6160
19537 6160 -17552 8309 -5707 -11741 26853 46909 65903 37589 20820 -2901 -13398 -17741
19525 -17741 4062 16676 10838 -37895 -66433 -36317 -24237 20551 18778 24633 -14369 -12973
19513 -12973 -45867 -88475 -68153 -16238 29649 4187 -16361 -34385 -26709 -19483 -13497 7342
19501 7342 6253 -25766 -62730 -68210 -30668 -18115 -3192 -1728 4763 10663 -6664 8737 51419
19488 51419 41673 39037 50234 7010 -11499 -3028 -9646 -5154 -54358 -108489 -98345 -87573 -90277
19475 -90277 -35912 -33185 -58084 -28409 -25376 -24755 -2522 9047 1870 -3054 23463 26043 12324
19462 12324 -6985 25714 50869 18154 -55376 -62054 18967 65477 33053 -1671 -14772 21386
19450 21386 27583 -1264 -17311 6472 18788 35061 29354 43530 4767 -39199 -65126 -61606
19438 -61606 -14420 15158 42693 72199 63867 2162 -15823 4463 6292 -52040 -81166 -44398
19426 -44398 -46832 -38897 -17673 -49738 -41708 -27361 -46513 -68695 -41943 -72440 -97766 -74312
19414 -74312 -13555 11128 18416 -54399 -45302 -13045 28580 9283 17429 6028 -1588 -2729 33822
19401 33822 11966 5141 32480 36755 38155 51407 19288 12391 5611 1684 -16922 -2267 -6785
19388 -6785 -37613 -43375 8345 19755 31991 23778 31089 34747 42451 69360 47086 -6237 -13500
19375 -13500 23996 32716 23466 3299 -40801 -60815 -34965 -19589 18559 24794 16462 17469 -1200
19362 -1200 -3199 -9150 11451 28430 19223 -2487 -11245 -9080 -13636 -32199 -36437 -62091 -62601 -52210
19348 -52210 -19319 1355 -11692 -44253 -31220 -11605 -10428 -20643 32254 38222 23337 24225
19336 24225 41155 56097 21547 -8294 -12742 -33160 -17856 11746 44667 64680 74977 75751
19324 75751 51669 31178 39247 71419 37387 -2151 20764 -23627 -21266 -13716 -1282 14686
19312 14686 37198 39696 -1709 -70318 -63237 -21213 18452 33878 17517 -3609 -4676 6062
19300 6062 -8 -31517 -33161 -8491 551 12329 47980 41597 -15241 -41523 -74651 -69605 -68707
19287 -68707 6913 65715 81788 75137 74295 78640 62658 29815 7749 -5188 -37434 -11580
19275 -11580 45827 60630 52809 43634 -13639 -33941 -58486 -77810 -24957 15907 50123 80154
19263 80154 58706 64181 166280 268183 295975 258732 200463 125206 46258 50923 60064 9937
19251 9937 -4078 1369 -28580 -21822 5800 4365 9608 7760 -8767 -27294 -31808 -37871 -23414
19238 -23414 21893 35053 -14176 -2164 10892 15818 14150 22236 23800 -1264 6894 22513 11145
19225 11145 1851 2159 29308 38795 5597 -13346 -12009 -7379 36854 44167 61678 147780 227377
19212 227377 293013 339397 340615 328249 342045 296932 266299 229635 143789 85773 56039 88775
19200 88775 54500 19214 2652 2246 4257 -4707 -29228 1199 21388 6704 51273 64315
19188 64315 61912 84026 115643 98578 52507 23247 -44315 -54194 -28900 1938 33511 14789
19176 14789 29079 49367 46576 44535 41276 10981 5168 55834 46611 8987 5446 48559 71928
19163 71928 98296 151181 278376 356340 277946 143886 66817 72313 72495 66895 37512 22884
19151 22884 -10904 -14941 -11206 -2206 24265 59707 38605 -10485 -40774 -23263 4934 21053
19139 21053 54708 47352 8911 20954 -2646 -35050 -62112 -69579 -64531 -48136 -12489 -28845
19127 -28845 -26468 6817 8049 -8748 14456 18482 17634 34205 9546 -1325 -11599 6142 -20144
19114 -20144 19289 76131 55860 47378 32648 -23265 -21168 33936 57486 50508 49655 53208 55481
19101 55481 42491 57381 40567 35322 17518 5045 -5219 38205 96570 53032 1048 -34470
19089 -34470 -10891 11993 -5035 -16927 -6427 36091 55068 52146 39678 10992 13476 2029
19077 2029 22909 64699 39179 -8606 -721 -37426 -81707 -76040 -63690 -42553 8680 61865
19065 61865 79118 72441 21153 -6307 6321 28772 -7022 -49204 -48452 -19700 14927 38034
19053 38034 60205 4119 9776 37491 21974 21292 18504 23265 20679 31812 37405 59409 94308
19040 94308 53781 20508 -28157 -22624 -16445 31717 68858 68340 57066 49106 59823 63041 64522
19027 64522 17564 21382 48501 40265 4582 -18927 -17933 -15374 -4375 13284 28543 41688 -18061
19014 -18061 -79278 -66546 -62135 -82314 -68655 -73332 -35102 -14451 -25873 -18141 -29730 -21242
19002 -21242 -7705 7352 8311 3400 12969 16945 -7575 -33196 -61146 -35682 -42740 -68742 -54819
18989 -54819 -27977 7452 3744 124 14566 15790 37229 63541 62258 12993 8571 36395 70242
18976 70242 61215 9947 -27238 -37658 6895 37834 160 -19485 -52721 -38415 -29878 27563
18964 27563 32290 -8907 15452 34379 17739 45109 63741 37699 1608 -14596 -21113 -43914
18952 -43914 -86940 -72840 -33362 -48504 -41154 -1101 14794 3841 48091 40210 19574 25810
18940 25810 24878 9205 -5287 -42409 -44316 -41718 -34101 -28964 -5273 -5559 -32686 -34220 -45413
18927 -45413 -34072 -37608 -20250 -2329 23814 25977 4747 -18387 -15431 -69177 -81833 -48229
18915 -48229 -28750 -9095 -37085 -77006 -66947 -21872 -10271 -35217 -59024 7025 15752 9336
18903 9336 -6957 -18741 1299 -12999 1449 12143 -26186 -54912 -44922 -36177 -64562 -46144
18891 -46144 -23806 -52301 -60732 -77938 -93311 -43271 19342 54810 22145 -7584 -3954 -2615
18879 -2615 -10308 22799 74283 61766 81610 112442 105470 93868 60663 37700 32791 22878 18216
18866 18216 -6628 -21962 -17686 -9150 -24471 -36172 9760 16653 13955 -3796 -8346 -3795 -48174
18853 -48174 -27709 12329 30350 36305 60721 75360 62022 20186 -25888 -13710 -21150 12273
18841 12273 34036 45912 55617 56421 18742 13174 28008 35947 14785 12795 -14399 -49241 -72938
18828 -72938 -44273 -17602 -8961 9415 68136 89841 67929 42387 65717 77532 32841 45302
18816 45302 19205 10737 29674 30025 34035 41819 53961 8503 -3356 -10694 -35801 -8232 -29909
18803 -29909 -88678 -97117 -33358 24093 66829 93718 71192 91341 122913 139671 112400 82211
18791 82211 49048 10741 18407 8330 28209 42173 46775 50831 -535 -13836 30776 31671 3979
18778 3979 37705 64375 33183 8793 10832 16580 -7158 18124 38622 32716 76579 118104
18766 118104 107063 102557 66441 55935 60375 24994 16756 21755 -8741 -12779 -21305 -40887 -41498
18753 -41498 -7504 5157 44450 65785 103340 95865 52710 13552 24525 49158 48692 47880 61857
18740 61857 62790 41946 44864 27564 -667 -46327 -68590 -65487 -67686 -24078 -35891 -79306 -28712
18727 -28712 27910 32258 58998 42840 56894 34822 20485 25563 31832 59887 54434 69980
18715 69980 55345 53318 27500 47974 -4640 -71614 -70458 -30962 -9207 -32239 -32697 -28262 -2824
18702 -2824 1173 -21417 -22837 -25448 3622 36358 21494 4290 -4694 -18829 -46424 -15824 -9730
18689 -9730 -7727 19977 7380 -6776 -2963 11543 16747 25651 -13811 -60338 -13225 18911 7109
18676 7109 -7419 -11347 -2034 18370 77919 113058 135084 144383 209596 300889 400607 565869
18664 565869 854432 1112644 1170148 976180 709082 462191 288003 200360 167851 165925
18654 165925 125369 149129 163093 124802 136080 155124 158520 119334 52621 35478 44464 45095
18642 45095 23842 29886 41617 64350 50098 64586 74904 88131 74669 33289 49514 40955
18630 40955 48882 52283 19941 55106 87874 69324 25707 25255 58123 114534 117439 126172 197524
18617 197524 304684 431074 596348 797714 914150 968910 876525 667092 444487 269754
18607 269754 195810 221093 204922 184012 161664 168629 184326 204040 220358 245979 294100 315977
18595 315977 350832 430502 541147 672484 775159 859242 896891 852112 733515 557905
18585 557905 435420 332006 302304 261650 181546 134042 119550 114116 112165 78038 69598 94950
18573 94950 105659 83620 105796 118879 85638 53634 52631 55598 50647 34112 51375 71380
18561 71380 78036 99874 88648 106309 130199 173049 147949 162925 192317 230915 263628 318646
18549 318646 389927 475489 634581 833709 1056965 1098383 1028219 923604 922137 984534 1058600
18538 1058600 1107345 1144427 1067638 965066 850578 698517 518823 402227 371635 311737
18528 311737 304120 296566 251361 202762 130838 72052 89591 134171 166197 132490 107161 88323
18516 88323 152664 169310 126106 90720 90814 67622 47921 106862 175177 177316 153792 127440
18504 127440 122208 151845 172856 179986 199359 202304 248844 274125 336626 421714 555301 821048
18492 821048 1061653 1174577 1066551 797660 560312 366632 249457 170931 148003 118972
18482 118972 71237 38202 56349 42549 36625 3722 -6611 3540 11268 48592 73545 54817
18470 54817 41295 18288 15483 23706 17318 31996 27798 24066 -3426 -23417 -2902 7891 46745
18457 46745 54122 60309 49476 53022 9848 47987 92796 129636 125043 83537 72896 56195
18445 56195 69200 125234 96493 74710 73521 114484 94436 85546 71832 93556 146682 131789
18433 131789 90410 80906 84804 77834 80158 43170 44505 45377 23313 34666 39286 52676 74210
18420 74210 95566 87550 34741 58511 101830 94822 101040 105461 64690 41971 31358 19918
18408 19918 59777 20070 -35018 -34104 -26270 -12616 40965 56504 40099 69653 83065 86547
18396 86547 107286 99646 111455 115589 103398 62888 44719 57180 62081 51000 31782 20352
18384 20352 42709 73488 115945 130266 118398 74135 73213 88473 94759 101134 78143 91284
18372 91284 99200 104285 80907 71129 70919 125861 153578 115226 97321 83381 64088 75033 104798
18359 104798 75355 89461 87731 37201 36807 114657 112966 127579 149013 171518 174320 128034
18347 128034 97625 133798 90698 70904 81011 122687 133699 139693 150749 119513 113834 113639
18335 113639 118224 84945 104408 156035 140172 148120 109982 116600 135861 141131 176733 211436
18323 211436 275450 263697 219898 201085 195879 206092 191869 198332 232121 225429 221409 189374
18311 189374 148582 160296 126728 131629 149212 208181 192345 188599 189854 164057 132858 124440
18299 124440 137728 155799 157767 114927 151040 166751 165424 163710 159182 181098 198136 204511
18287 204511 217311 226913 227284 183324 172942 157105 181629 231574 253672 282841 310813 313525
18275 313525 282390 251059 264302 259516 256499 241803 248826 225812 230189 238247 256556 253911 232169
18262 232169 203305 210383 232703 283831 306882 322755 305144 250374 199952 183211 218293 234973
18250 234973 230890 258842 249731 209877 224784 240131 208264 175858 137974 125759 135072 146819
18238 146819 142836 211142 224961 178885 143443 152830 156631 169577 136627 162594 146085 127642
18226 127642 81715 73215 159849 162884 104208 104120 154355 193873 211335 202671 177388 149181 147433
18213 147433 176378 219780 211429 226100 245111 238237 284945 340612 353749 363147 292750 234618
18201 234618 222089 245715 249370 214045 167294 129687 104644 90512 88636 98597 86498 51026
18189 51026 16176 22619 -17693 -25595 67597 116266 137083 131884 152702 150453 138400 130305 117780
18176 117780 119973 138850 106250 108182 116400 53692 32459 39146 37220 96266 93368 80795 148863
18163 148863 198123 220795 292404 300137 330217 388428 399528 382635 390099 399986 394191 426515
18151 426515 428515 352843 330995 352386 332189 310759 341349 327871 328706 374304 452648 486576
18139 486576 498070 471061 410865 416957 463030 489804 488434 466486 474444 426326 402706 401060
18127 401060 398965 369310 423398 469934 502788 502834 570095 605875 627758 655531 615652 610236
18115 610236 663855 655756 668957 703378 714557 740171 815957 876867 925196 944754 924693 866177
18103 866177 871898 918435 938666 956744 921369 945269 955993 932021 966002 987201 1030740 1000292
18091 1000292 982554 954982 984510 1099055 1213514 1356152 1479663 1517475 1521704 1518217 1521557
18080 1521557 1595545 1710688 1842981 2048972 2265216 2526386 2959468 3650863 4613075 6182020
18070 6182020 8798911 13135202 19210303 24741681 25852839 22469759 17302975 12612164
18062 12612164 9246119 7068607 5667031 4798769 4258738 3904681 3705463 3666485 3770277
18053 3770277 3970699 4185951 4389612 4588953 4812107 4953306 4944711 4811679 4712482 4710115
18043 4710115 4803940 4914814 5077754 5411411 5763070 6140369 6664312 7371808 8310956 9520597
18033 9520597 10932520 12444239 14011442 15575104 16997977 18499613 20343063 22669048
18025 22669048 26010592 30466686 35345583 40788362 48083957 59246545 76989100 105638085
18017 105638085 152389966 226090492 324980809 411595422 436481062 404001706 355936831
18010 355936831 332751030 360114160 434990513 478933524 432365015 332508248 233109846
18003 233109846 158967091 110306279 80091234 61867178 50250157 41398353 34033086
17996 34033086 28117529 23498577 19897407 17026496 14729340 12879424 11332041 10132934
17988 10132934 9217977 8587513 8242155 8133224 8037597 7519437 6737414 5960707 5350083
17979 5350083 4949736 4747156 4719160 4889125 5271918 5508353 5409895 5213727 5134460 5065741
17969 5065741 4914639 4590284 4236018 3896272 3643554 3485532 3479658 3634682 3920597 4527797
17959 4527797 5552432 7302062 10380384 15853931 23912438 28417797 25647832 19305341
17951 19305341 13294670 9039813 6341234 4681797 3661021 3035298 2554328 2129778
17943 2129778 1872797 1698065 1519534 1419475 1345867 1215071 1151716 1151392 1161053 1208693 1248532
17932 1248532 1346570 1430445 1348669 1171467 986551 828428 789358 789649 780296 828900 949347
17921 949347 990627 865513 699394 604082 506806 428184 394674 326692 280034 267128 338735
17910 338735 374563 344499 305724 256014 263833 300056 309254 274869 261569 268823 304968 304760
17898 304760 226555 221437 201308 168729 195132 213426 217668 258449 294622 327477 365664 341823
17886 341823 268021 277438 352345 337381 294857 243299 201800 164618 206136 243839 306384 322506
17874 322506 279686 265776 267767 249503 190182 144164 112482 56425 66220 79385 103976 100644
17862 100644 107235 74555 51510 70735 124358 180207 237939 269806 259262 258825 347530 398538
17850 398538 413349 383933 378350 288352 230919 227986 248794 235282 200977 192438 157547 110345
17838 110345 108729 106459 126193 144863 158812 197714 263411 284805 256545 248558 214861 206162
17826 206162 217675 191037 141801 79626 -89 -4281 46274 41971 -27601 -100982 -131326 -136213
17814 -136213 -98476 -20074 33080 59509 53889 23071 -27438 -21543 -9306 14461 40115 111079
17802 111079 141899 93374 78128 69154 70108 91654 58608 26481 45972 10577 6838 -35494
17790 -35494 -85990 -57957 -40425 -62324 -75810 -64471 -35727 -11158 -29017 6876 20601 67294
17778 67294 75792 60967 20493 2028 31161 45673 38467 25667 16938 -1163 -6338 40882
17766 40882 86561 77643 21632 30655 22768 -12677 -9123 50875 95093 69205 34236 -3634
17754 -3634 -34533 24 14343 26194 36410 39825 53867 62612 36014 24372 45070 49992
17742 49992 45541 37783 23602 -19990 -63885 -57996 -37305 -21809 -41278 -57821 -51409 -2655
17730 -2655 18008 -1064 10299 41659 -336 15451 37712 15410 22368 7741 -11227 -24105
17718 -24105 -15514 13628 52256 47838 11198 -4573 -13946 1714 52887 79313 28247 374
17706 374 3881 13690 16318 -1240 16808 -9667 -37708 -50053 -53623 -52937 -43478 -50391 -30958 -16067
17692 -16067 -53528 -107328 -69634 -60947 -63700 -80379 -93918 -122666 -65016 -47754 -49548 -16978
17680 -16978 10854 21096 -3860 -39295 -64545 -33591 -14547 -18542 -18414 -38647 2645 2462 3095
17667 3095 20799 -17016 -4053 -15533 -48647 -25166 -10633 -59471 -110658 -90021 -98153 -63726
17655 -63726 -25915 -30853 -43408 -46649 -61297 -59990 -31722 -10914 -26763 -16849 14066 26688
17643 26688 2791 -2220 -4843 18220 27661 20935 -34318 -44296 -61171 -72978 -81560 -68456 -49209
17630 -49209 -1978 48124 41551 42279 23568 24056 27415 35435 74054 59915 35619 -22608 -34919
17617 -34919 23467 28910 -10191 8089 18022 -16932 -10577 8683 -193 -61217 -96623 -84091
17605 -84091 -90991 -66554 -27127 -34842 -39684 -55121 -68196 -80917 -88547 -92919 -63843 -51687 -80750
17592 -80750 -83452 -42841 -1717 74489 76087 40854 20395 -1053 -46014 -59217 -69038 -110114
17580 -110114 -115083 -54045 -32368 -20296 -24957 -87623 -118524 -69252 -48514 -29558 37218 61547
17568 61547 56476 25318 -13974 -20134 -29302 -25996 16959 34055 32306 26780 -13938 -38976 15998
17555 15998 72026 52663 50372 101798 89611 16793 16044 36604 24157 42540 100693 49511
17543 49511 13391 3830 45526 67491 46850 46755 20987 -4708 998 2332 15187 38744 59969
17530 59969 48041 52617 35254 6606 12495 30591 52371 68508 79820 63639 47812 45276
17518 45276 43110 57741 87133 116250 156469 143343 149865 240364 320550 341362 391259 599868
17506 599868 831381 999785 1035365 984564 904108 833425 795335 786490 897812 1066902 1184997
17495 1184997 1145776 946499 708240 531697 344375 235976 181259 136106 56016 1759
17485 1759 18762 62872 95295 76119 112826 130484 95553 66799 56121 40508 119563 114086
17473 114086 74290 39798 44591 44711 29737 44117 40738 45536 23935 22120 21352 42306 57155
17460 57155 115667 140076 197760 252872 320081 403646 528055 684300 769875 831948 790707
17449 790707 728352 652609 608728 637548 740020 867861 947503 910350 763510 579382 425880
17438 425880 255123 151893 100892 75440 55636 1819 26247 63920 61114 35885 38444
17427 38444 25493 56149 91472 64999 12952 -41342 -70717 -2770 12491 325 24930 44890
17415 44890 51448 31021 -10521 -22490 -65251 -29628 -36161 -52387 -53274 -48494 -68559 -77798 -40888
17402 -40888 -48956 -11369 25652 18125 -10226 -33376 -18396 -42655 -15883 36595 19989 -20844
17390 -20844 -43140 -23965 8732 33161 29289 26543 41244 25920 47375 53367 23462 -5301
17378 -5301 8399 24887 20232 38114 58152 13064 -17477 5107 8124 -12138 -22221 -39106
17366 -39106 5120 9657 8582 39923 11436 -11312 -2153 -15098 -27967 -7953 14201 13366 4638
17353 4638 5761 27126 12446 24749 27378 24652 55188 76657 61079 9846 -66836 -31888
17341 -31888 -45923 -51984 -54563 -78056 -57910 -61769 -23158 -25631 -17385 -29692 -45139 -42606 -14328
17328 -14328 -2139 -25932 15227 -7823 -9024 33049 25442 -14690 -26524 -56071 -64265 -70924
17316 -70924 -60690 -55527 -44328 -27727 -37278 -43499 -51833 -44483 -20046 -14972 -21909 -42414 -1166
17303 -1166 27932 27120 -12002 -35419 -42625 -30202 -33293 -41397 20218 15097 -231 -37385 -37852
17290 -37852 -38566 -31707 -4747 4583 -23077 -28149 -14635 -14383 25647 50958 47238 42590 48616 36746
17276 36746 2171 13406 18142 64629 80546 72227 62585 61208 50417 34095 58711 60111 48829
17263 48829 32567 50835 34164 38283 57914 37064 21015 38891 -12084 -86366 -62265 -29739
17251 -29739 -10641 14576 12368 9912 22100 35313 16104 -13595 -17257 -33379 -15823 -6167
17239 -6167 -504 -2272 -60771 -76467 -27358 -4816 -17542 -9778 53009 59790 41985 14250 25753
17226 25753 32412 44198 30148 25075 44078 42353 40131 20471 -14639 -18937 5459 42441 63556
17213 63556 85037 59521 51807 14063 -8407 -38206 -64386 -72603 -61310 -51885 -60418 -44563
17201 -44563 -26773 -3129 20506 8916 -13984 -18177 -17595 -5167 4469 6577 -20243 -17374 -1002
17188 -1002 -5009 -27246 -10390 49800 49266 2837 -38717 -14745 14964 32027 37240 50819 59665
17175 59665 21941 30692 54988 42848 38383 48211 -1359 -68107 -77866 -52259 -3046 8392
17163 8392 -26433 -40675 -41815 -41836 -44565 -58975 -30746 16347 5542 -8280 -15533 -12854 5666
17150 5666 9651 25318 47980 20184 -2491 33852 29687 -16044 -45560 -68506 -74701 -68601 -79486
17137 -79486 -23144 -7150 -19800 -49852 -59497 -33086 19848 13041 1722 -16419 -34350 -32454
17125 -32454 -17958 1915 25515 37027 65009 75125 35120 56444 60131 25616 18555 32316
17113 32316 -12325 -34741 -2143 35888 42114 17520 4057 173 12670 -4900 -11881 27573
17101 27573 53194 54229 48388 58580 70971 62415 39153 45502 40575 32260 10784 12415 -35852
17088 -35852 -66627 -70539 -34645 4802 -13041 -14422 -6053 -44933 -70829 -26739 -32188 -2408
17076 -2408 -20531 6422 28284 68757 71713 45381 -16614 -25071 -26952 -6024 9483 4603 -1180
17063 -1180 -44720 -69182 -83547 -80031 -37547 -16014 -2619 -12856 -25606 -34475 -44230 -58022
17051 -58022 -45247 -60355 -10120 11705 -8567 -12282 30082 42032 40079 17047 8387 7226
17039 7226 13650 -6274 -15875 -24055 10473 -9935 -41149 -57721 -60692 -25531 23577 64718 63128
17026 63128 81134 96484 70477 32287 20794 39437 12343 -14935 23987 100467 92121 26630
17014 26630 -3237 9679 20594 -11208 6359 36107 23325 -17039 -65821 -48421 6363 35739
17002 35739 37366 21077 27240 18822 13032 22299 13602 21482 35952 57987 59918 19151 -42498
16989 -42498 -40552 -26584 54093 91701 75203 45195 5278 -18160 -29114 2220 37310 38594
16977 38594 66977 28319 2053 34122 61799 13719 -2751 -9692 -28560 -7781 -23431 11694
16965 11694 52436 32441 -12364 -17749 -14280 26836 39056 33662 54373 75040 52565 47315
16953 47315 53934 68088 54633 11656 10089 45923 45891 30078 6740 18884 19687 17392 58917
16940 58917 40012 11851 11633 26012 9356 -250 37299 -36828 -86905 -67709 -39488 -28190
16928 -28190 25489 92391 96545 58283 19250 -15804 8472 47958 69861 91221 104228 130513
16916 130513 120123 82154 65002 60219 25587 10649 -12661 924 28818 41591 56742 37248
16904 37248 30486 19837 -25218 16243 56118 53368 76963 76054 94486 58910 55497 38600 34862
16891 34862 55722 28591 29417 5736 -14034 -5944 11696 -12557 -37210 -46973 -37949 35307 70005
16878 70005 27311 36399 42543 39559 35014 16864 -2475 44529 29285 16780 -8012 -27453
16866 -27453 6822 9630 10139 34201 18426 32410 -16781 -27404 15017 33621 -4382 2625
16854 2625 46544 105096 90223 79692 86029 78819 80150 75954 53139 37412 58476 74573 30469
16841 30469 32396 6754 -10954 8013 19058 20038 13132 -3757 -22809 -31285 -31601 -17386 -22141
16828 -22141 25084 55698 56084 16566 -11002 6823 32030 16169 1481 41868 61878 46852
16816 46852 41732 50788 33263 46686 54361 56512 62550 47147 32002 9740 49398 82195 76281
16803 76281 79481 105374 108557 114589 55078 65955 76060 69395 33282 26526 22363 6518 -11762
16790 -11762 37997 91111 49427 -25427 -82477 -71476 -27604 27848 67888 43418 51109 46390
16778 46390 29825 5044 21383 45814 35816 32467 26326 41462 41409 1519 -5630 30880 59959
16765 59959 57841 -7361 -26251 -1407 36202 25425 -22240 -53493 -68772 -60899 -31394 23490
16753 23490 23213 15469 -16372 -2370 1117 15020 5019 9672 -18582 -38784 -81138 -81472 -35227
16740 -35227 -50137 -45273 -32337 -11288 -12928 -4785 2653 21758 45210 4471 -18634 -2728
16728 -2728 31581 -38557 -42608 -8208 18807 37177 41646 10823 12489 51457 67220 86547
16716 86547 54982 -2625 -53945 -54493 26792 12148 -3515 37885 45684 42802 36539 65307 24079
16703 24079 11095 9777 14189 43554 39054 -3673 -23723 3608 36461 30842 62566 79047
16691 79047 59721 41459 5264 -19921 11406 19635 4988 49489 47158 32636 9650 -1150
16679 -1150 -9585 -21447 -27953 7112 35696 11202 21642 60457 42955 35371 51149 47225 39784
16666 39784 22711 5780 32825 473 -8224 14458 34732 24741 27803 44598 54231 67874
16654 67874 61497 34343 50873 85310 54408 26589 34470 50440 26479 3269 55617 55033
16642 55033 -8430 -17260 -6653 591 16542 57976 81933 56341 77664 79949 49454 60314
16630 60314 63045 35069 39467 73471 62039 23028 56439 106245 118845 130044 117220 102328
16618 102328 54249 -22561 -45996 -9950 16841 34336 22744 31573 80508 78013 101093 79432
16606 79432 84175 99983 72242 61045 46912 -15013 -294 -8509 36724 3564 12566 -18399
16594 -18399 -58590 -37967 2964 39792 38150 6104 -18158 -19103 -15059 -18675 -30358 52905 108346
16581 108346 73461 57768 59232 23904 9432 10275 32061 42002 32882 34769 33324 3936 9219
16568 9219 1109 18581 47801 42224 40725 80986 87721 83380 40798 24652 40695 68392 55865
16555 55865 69226 62512 34158 40486 33853 39532 40983 70141 43001 22530 24862 23097 13731
16542 13731 47729 49955 58558 77850 62810 73373 115181 130466 111163 110679 105552 92425 63292
16529 63292 11550 -820 38497 22592 32387 38960 31137 32852 58062 57600 31621 33997 75222
16516 75222 83917 51156 38307 35368 61378 114695 113281 120213 90593 66286 57351 90890 95218
16503 95218 70026 59357 70961 86269 40701 44844 44584 43258 72068 61784 54730 67610 65328
16490 65328 63922 80502 74709 97210 115931 118465 131659 138728 101381 61423 61720 96425 90838
16477 90838 71844 66251 54634 76335 88523 61877 63562 85409 91849 75421 62204 57049
16465 57049 47508 41738 -9437 3503 14417 -8348 -6173 47464 69627 100828 108460 75015
16453 75015 34960 17436 15306 10685 28649 53579 43047 25898 15438 14200 20086 41820
16441 41820 114038 131040 71684 12173 43750 39868 1223 -8068 -5035 -2528 33977 51214
16429 51214 52000 82309 98809 97875 112825 94881 76288 56644 34753 23938 -6239 -18731
16417 -18731 14845 70067 94381 79690 115935 158579 140805 115500 145881 153083 116839 75141
16405 75141 76149 46498 50795 67286 101302 128267 139459 74790 44489 83211 138409 142343
16393 142343 112495 83799 61712 92233 114752 121736 90786 44973 37814 73027 51164 33855
16381 33855 51085 64832 49450 51769 54184 58368 45323 53813 86766 116137 139757 138356 150444
16368 150444 188006 165883 123249 109058 84645 130926 142328 125452 130105 106817 126304 149726
16356 149726 110359 70984 80400 79963 100746 108141 99644 78742 45621 41167 24893 30604 68708
16343 68708 72288 87084 113508 128018 137401 161670 97962 82808 129389 133689 162571 172432
16331 172432 100001 51649 82476 126087 133338 132050 86363 79653 62745 71609 66738 97518
16319 97518 129621 106264 94887 74736 98117 125123 118771 96818 139007 164923 135828 109017
16307 109017 87177 82080 125293 162157 135970 139553 178260 159957 167335 200240 186152 180089
16295 180089 181615 174483 131454 112648 141387 119872 88507 84525 95622 137821 121667 141657
16283 141657 155025 183944 185185 192694 149670 148955 156792 172292 178754 194147 203574 228376 229571
16270 229571 238154 235888 164723 116219 129545 132491 89139 115457 156006 207924 229860 256579
16258 256579 255869 236600 259000 241165 224532 194050 192056 206906 185908 162517 162154 144892
16246 144892 154851 169498 180554 180591 186357 144546 148347 167906 161073 142711 145521 185007 207648
16233 207648 206360 210609 210440 188123 151857 184966 188609 159285 131808 140679 167417 162267 154606
16220 154606 162010 152072 187578 235754 246860 256839 230039 170717 151259 139316 185688 212767
16208 212767 177200 188844 155794 217952 260682 291636 284311 310034 294428 290286 250780 226183
16196 226183 233696 208537 181933 178061 167705 175341 182093 194281 210046 211533 202915 197873 228964
16183 228964 215052 217870 218597 258186 255607 226382 229608 235335 232801 241546 243932 225441 247173
16170 247173 253048 239913 243399 227120 197789 194468 195579 211512 203955 221364 265437 259738 260924
16157 260924 241481 252491 295162 282159 268773 249190 279340 255865 275753 299968 290750 251400
16145 251400 242777 268996 255352 244404 223420 211873 197940 265196 330472 340502 298980 307263
16133 307263 355604 372282 378777 344673 339196 337926 352063 347918 335877 336915 352827 376493
16121 376493 399756 408589 396170 378358 356042 360695 370419 394356 397562 386801 351547 321243
16109 321243 332104 341766 351229 361380 408039 447366 418741 348581 334721 409298 409186 417134
16097 417134 394063 415882 422093 432284 418851 394519 388763 417954 442161 489299 515376 487405
16085 487405 436477 431889 480468 472353 497681 547868 588061 599549 669576 750880 817823 938633
16073 938633 1144269 1334398 1470445 1531430 1478665 1392933 1237549 1074957 940689 802297
16063 802297 721756 674178 640729 633372 619466 591607 601051 596765 594941 600002 616157 602573
16051 602573 566463 603136 634495 647401 648222 653446 649667 631614 587034 581482 609638 605564 632256
16038 632256 630749 619600 597015 628198 654393 649001 627576 642721 650431 649375 683810 668174
16026 668174 612361 598460 602111 617221 624516 639334 639378 626021 640504 648117 697949 703632 691401
16013 691401 684125 706425 711132 738509 767850 768751 800382 745435 695384 673022 731112 776559
16001 776559 765656 764918 775274 808756 866008 847925 851745 869929 831345 813967 830540 846389
15989 846389 855205 864282 869227 836770 814983 850572 832054 872315 897792 878392 887525 881447
15977 881447 855386 860482 879734 901989 923916 951455 1009072 1041583 1029160 986391 938816 936753
15965 936753 992310 1030665 1046127 1037334 1049436 1057130 1082136 1107600 1122945 1141647 1195170 1204085
15953 1204085 1209031 1177408 1184934 1232824 1283979 1322539 1319918 1355139 1389864 1417448 1422865 1428290
15941 1428290 1459021 1513910 1619433 1619542 1622120 1615207 1661742 1693587 1699185 1702279 1725802 1743811
15929 1743811 1795627 1790932 1778398 1803037 1838594 1871243 1940555 1992902 2006806 2027713 2041977
15918 2041977 2083868 2119372 2136839 2159339 2214475 2264789 2309742 2324802 2351611 2431279 2483354
15907 2483354 2533787 2594604 2595721 2627372 2656039 2748864 2811538 2844965 2908781 2986151 3085596
15896 3085596 3174014 3247438 3292186 3305244 3315009 3369944 3433283 3522284 3576356 3640318 3736801
15885 3736801 3845476 3922096 3989847 4061054 4101327 4282801 4425616 4558444 4655561 4753777
15875 4753777 4855950 4954942 5077293 5194664 5330663 5422508 5554045 5704554 5859745 5992902
15865 5992902 6166876 6324638 6510553 6711788 6925673 7139735 7350832 7557480 7782693
15856 7782693 8014028 8274864 8544958 8829411 9150819 9489418 9795320 10126606 10512857
15847 10512857 10910223 11267190 11683213 12141512 12605669 13110297 13606244 14185660 14812982
15838 14812982 15454737 16079163 16796853 17543930 18382576 19243223 20166399 21131292 22170733
15829 22170733 23282913 24493613 25800205 27209976 28707062 30315206 32059159 33932453
15821 33932453 35893450 38098490 40477782 43049139 45804317 48750834 51936807 55411807
15813 55411807 59220537 63285996 67682249 72401341 77491524 83008161 88815232 94935284
15805 94935284 101379990 107984547 114739597 121494725 128129745 134394805 140111171 145011136
15797 145011136 148909883 151674623 153106921 153121566 151702699 148989023 145143977 140269129
15789 140269129 134596570 128348366 121723808 114894871 108089461 101479473 95143058 89069748
15781 89069748 83307613 77851408 72739425 67966835 63595582 59584045 55874646 52405225
15773 52405225 49190203 46215829 43455599 40913129 38540550 36295334 34226900 32326725
15765 32326725 30585887 28940729 27426013 26066015 24737967 23530716 22405896 21317305
15757 21317305 20295921 19372335 18492638 17672258 16928655 16203334 15534486 14872758 14237764
15748 14237764 13644301 13109342 12652007 12228679 11768443 11317171 10919457 10550283 10182440
15739 10182440 9874251 9486026 9146909 8858626 8536498 8275988 8038193 7760119 7547084
15730 7547084 7364838 7162707 6955973 6741207 6564744 6415476 6217024 6036102 5834960
15721 5834960 5684774 5577380 5429706 5258367 5129295 5007524 4891955 4776438 4669981
15712 4669981 4565287 4424001 4307780 4207387 4108752 4001472 3919174 3840730 3761734 3696511
15702 3696511 3624949 3535952 3415294 3390312 3361142 3298167 3229014 3136045 3024460 2943839 2871538
15691 2871538 2844974 2829312 2788975 2688209 2618677 2577706 2514891 2465935 2426092 2390292 2377953
15680 2377953 2344479 2323777 2270432 2224350 2204316 2195031 2120165 2089063 2075516 2028669 2023768 1971904
15668 1971904 1923573 1890560 1869955 1894884 1876431 1820386 1773022 1775726 1774788 1762625 1734046 1707913
15656 1707913 1690891 1688386 1690983 1634670 1565418 1580726 1574671 1558192 1529482 1531693 1515167 1511231
15644 1511231 1492119 1480597 1449098 1429353 1389044 1391958 1398361 1355116 1367796 1387044 1368617 1313862
15632 1313862 1248597 1208247 1185670 1173357 1205651 1234972 1245079 1191873 1172556 1132191 1137583
15621 1137583 1133901 1095607 1109989 1094443 1049033 1018760 1049238 1066626 1016722 985075 951803
15610 951803 938934 937068 940587 957849 910448 826474 801426 810899 826462 830189 823560 781775
15598 781775 801416 783249 775585 802596 803907 767113 778104 752249 751514 761767 732969 693417
15586 693417 717972 732265 746175 738420 729658 731377 735417 709599 657505 652938 605811 571994
15574 571994 585680 592457 600833 602819 601118 619431 621462 630974 600423 615440 655895 664541 676297
15561 676297 678243 645927 614153 587354 559999 569158 545981 508475 474127 445088 439694 505414
15549 505414 513547 504665 503777 487979 478743 488800 514275 510072 521456 541356 529885 523438 473198
15536 473198 470398 460447 451987 493471 554704 565538 528105 514953 526460 529451 568412 619205
15524 619205 630356 674928 821528 1022951 1213569 1366714 1427535 1360996 1224495 1050427
15514 1050427 862330 748345 631035 519834 476494 491681 432375 406061 421760 442092
15504 442092 413642 388937 410136 403344 333738 251963 245032 295556 366688 385080 349119 362619
15492 362619 352955 337689 325315 341025 427907 453496 390461 359667 353243 333548 346020 331654
15480 331654 318430 352644 363409 341965 313374 280552 221888 213563 257528 270514 278445 258207
15468 258207 246483 231443 215875 185802 213863 250226 278844 306044 320785 264626 302393
15457 302393 281231 225928 259731 264191 240415 234799 217822 172216 195439 209978 205877 213016
15445 213016 247971 260721 222235 212045 237987 223828 191302 179916 226000 232146 205774 229183
15433 229183 238471 226451 241820 283715 258883 231273 255704 245799 235426 237361 230274 219458
15421 219458 236763 200063 198111 249957 279055 273238 238458 201359 181618 184154 203741 161156
15409 161156 153325 169632 236153 212909 165882 169398 152495 126824 168751 199313 221297 179371
15397 179371 137987 152383 157381 129897 97211 97666 115190 144814 166226 119778 76514 66896
15385 66896 108253 112406 122000 142638 152445 148988 134238 109934 133893 126944 166422 208921 184512
15372 184512 155262 142887 155419 147172 113588 102174 121054 106607 122608 140933 170814 153039
15360 153039 126259 102160 122216 124214 124256 97619 77043 61211 66012 90593 134353 162495
15348 162495 184330 219355 219814 211836 199740 156454 146671 153356 181260 153884 106393 49963
15336 49963 20076 50654 50872 55003 106736 138739 157164 174866 194396 180291 215799 175191
15324 175191 122291 122627 123876 152522 136061 99114 63831 51040 43868 30299 87495 81254
15312 81254 71600 73214 102425 147164 174558 146460 111027 46665 10359 37270 66268 81456
15300 81456 83792 76556 94462 101938 76342 109024 171997 178540 156339 94462 66282 59937 80534
15287 80534 85261 91476 118938 97957 72956 90828 106906 106878 139866 137191 127735 128773 108263
15274 108263 91165 77329 57835 60220 73043 105812 139624 110147 68185 59260 30881 25125
15262 25125 2883 14460 57684 75902 101633 112512 114591 114308 111026 79658 106007 148450
15250 148450 157147 184067 165244 126974 79487 73000 88415 96685 67970 32644 63111 54072
15238 54072 54643 47660 12373 -22529 -15095 12081 -19474 1557 45040 80566 73812 76428 75689
15225 75689 122974 118461 92126 148717 120852 62161 35863 41614 57893 60067 58234 62178 103626
15212 103626 157963 142076 110105 90962 72837 94620 126767 109582 128166 118228 134026 136797
15200 136797 117006 91978 39493 47166 68363 30493 40600 66752 104464 102439 63943 50596
15188 50596 57449 47756 56501 114087 111041 70720 112151 134223 86006 40093 38163 21690 42298
15175 42298 66531 77771 114856 123589 113760 100286 91655 83153 72068 62277 53628 34076 25701
15162 25701 80734 121795 142509 109479 71631 39068 45770 19675 22926 47065 88112 99087
15150 99087 32642 21241 52440 56464 63390 59859 39066 43303 72991 86601 85099 75617 40354
15137 40354 22468 44019 11878 4295 58791 55913 -27511 -6701 46198 27726 8319 -11536
15125 -11536 -5031 19689 30083 14095 43750 64039 43118 7495 7813 51505 53551 26749
15113 26749 34590 39835 22552 -33769 -7845 9651 2837 15877 12873 34629 39859 29790 8627
15100 8627 13992 29704 52882 29957 19152 13468 29051 70040 103768 126953 105000 62337
15088 62337 54927 52790 39093 8317 -31631 -8589 33192 28035 17721 35558 58513 56851
15076 56851 98139 94849 70600 71357 89026 26610 17145 22708 24842 33065 2423 -8633 -15456
15063 -15456 -33863 -7936 41179 50555 50302 61630 64370 26847 349 2944 -7799 -21796 -15504
15050 -15504 -58793 -45684 -47070 -60630 -22539 24425 34260 51244 35872 65232 90287 85278
15038 85278 41547 -6872 -23124 -10223 41816 31807 25518 92 1605 -15271 7873 -4649
15026 -4649 16043 31408 35428 15173 3310 20738 25763 -20715 -24685 -10256 16833 21675 594
15013 594 -1977 -17076 -6548 -19696 -35365 -63 34444 46136 36981 39334 13048 18931 23044
15000 23044 20108 19302 68263 81695 65113 65679 50864 32797 46358 42680 18967 38630 80076
14987 80076 72731 74374 59899 97089 95255 86280 129219 156324 131753 88871 86482 58987 48896
14974 48896 68979 68620 72341 79883 54625 26043 51628 62776 40448 20822 4281 -9984
14962 -9984 26999 16132 -20580 -18869 -17993 -23008 8055 1675 2654 2394 -3027 18297 33914 65585
14948 65585 14925 -34049 -43980 -7502 11229 9137 -5253 -8577 37555 38845 16173 2379
14936 2379 -24493 -21893 -38244 -41030 -11061 -50243 -79011 -58547 -53158 -36127 -11180 19850
14924 19850 35600 23216 26759 -2499 -10583 30304 9066 11014 -13151 -11777 -558 47227
14912 47227 53669 -18313 -8712 46251 36930 13662 -9085 -28857 -1414 22064 17033 30756
14900 30756 40154 44361 44203 54488 31983 6499 10345 -5951 29383 70797 71511 -4393 -29771
14887 -29771 1618 22101 -10658 -52198 -48881 10389 60037 22961 -15263 22791 13281 -27467
14875 -27467 -24753 -20731 -20099 -30179 -28931 23740 9567 -14556 -35563 -26625 31343 65457 68895
14862 68895 41461 52786 42509 20189 6307 -18077 -14363 -26110 17545 16741 29616 -21048
14850 -21048 -34271 -16349 -12299 -4491 -2244 -7426 -9896 -12013 -39941 -7018 -15647 -10185 -30569
14837 -30569 -26169 -12551 26687 39604 44846 61643 27823 4367 -37711 -37377 -11699 3474
14825 3474 -4775 -9628 -17080 -16608 16939 10055 -35418 -38393 -8687 -4935 7082 44801 10908
14812 10908 15809 3990 359 15699 40897 18377 17301 -8996 -41139 -25969 -5368 -940
14800 -940 24470 49958 31684 26513 10474 -2712 -14391 -45438 -47663 3060 22809 18014 22334
14787 22334 27041 18124 10498 -10693 -20308 5004 43562 45404 12906 -15288 10463 49621 63179
14774 63179 74265 67791 51560 24556 37006 83419 114957 113781 73802 35100 31384 35560
14762 35560 47913 21351 8422 -5389 -35394 -26927 -22576 -432 -17458 -6151 -4600 -19338
14750 -19338 2371 8429 -26080 -70259 -66189 -26654 36188 62799 46430 52517 7689 -15452
14738 -15452 2948 5264 -40593 -68942 -76884 -56647 -47751 -16910 4719 15342 917 -35707
14726 -35707 -55383 -32641 -70296 -42537 594 6579 -21756 10128 -2204 33729 65418 44658
14714 44658 15276 11730 25346 81247 63713 13227 21814 28266 -23119 -36688 20178 36089
14702 36089 48319 39864 35883 35556 9058 -15274 -59030 -56748 -40286 -29074 -16862 -56499 -62426
14689 -62426 -22328 -10448 -3061 15081 22242 -10061 -35030 -35502 -29476 -45064 -10645 26501 42574
14676 42574 -6850 -19293 14194 -15550 -63836 -68901 -15281 21630 -6027 -12841 -55372 -38547
14664 -38547 -18238 -46648 -40834 -33257 -21094 -6630 -10311 -47576 -54506 -44909 -19240 -17273 -35647
14651 -35647 3806 -10880 -33152 -27368 11147 -1087 -20630 -31003 -17645 -4529 -15384 -38670
14639 -38670 -7067 7730 -16138 -25634 -19984 21696 67419 61451 35903 -1168 -23645 -16995
14627 -16995 -16932 -13316 8322 48177 46379 29357 43529 11913 -43367 -43609 13898 11285 -34255
14614 -34255 -21587 -24577 -50904 -26486 -1687 8763 20670 -10590 -17328 6655 -4005 -15190
14602 -15190 -1832 -39840 -60504 -61785 -18127 27716 11253 -30647 -49969 -32112 24603 101075
14590 101075 55562 41906 59246 21736 -20509 -4200 -30154 -70603 -66903 -51646 -8413 9852
14578 9852 25333 68537 35434 -3517 -23616 -27470 -7929 12557 -17098 -57298 -56095 -38824
14566 -38824 -4255 13285 -1983 -6128 27496 6328 36361 46819 33701 22409 -5002 944
14554 944 44907 57370 46129 41870 45629 45109 5148 -42007 -45766 -19753 15691 33829 17133
14541 17133 10417 -18840 -60687 -66894 -49536 -50371 -33678 7194 13470 30853 62880 21827 -25602
14528 -25602 -12198 37240 42371 22749 19044 50527 36176 17925 22268 39898 69653 35505
14516 35505 49142 68030 42387 35980 15992 -10894 -26790 -50994 -89205 -88071 -51304 -28749
14504 -28749 13985 38127 -12611 -68814 -52222 -45328 -29057 -22212 -41151 -82612 -60228 -138
14492 -138 48309 54351 65171 39815 39782 34512 60382 32305 17696 29788 4949 14965 -23068
14479 -23068 -50837 -27242 -1637 370 -15016 -27301 -12056 -37042 -49282 -36478 -37052 -53859
14467 -53859 -35613 39375 68817 54890 62964 62443 36977 8326 -25754 -25556 -22903 14741 47029
14454 47029 51494 5861 -7065 -24944 -45517 -60486 -40883 -39249 14530 48658 20684 -14565
14442 -14565 -7985 -15159 1056 25915 3413 -15886 -18465 -5097 18288 48238 60792 20469
14430 20469 -16354 -31252 -12001 -7073 -10986 -21846 -24973 -38234 -3012 18783 38463 15458
14418 15458 10531 4915 -15937 -6457 -16385 -31515 -82432 -70612 -49653 -43250 -46358 -30281 -35910
14405 -35910 -2247 5889 13479 -14187 -25779 -2548 506 -20569 -3065 8216 43051 52370
14393 52370 70246 83480 59749 33159 23400 10421 -5440 7013 33569 31786 -12652 -56032
14381 -56032 -5403 31695 40826 13832 21690 -11875 -38514 -56373 -61018 -21439 -21844 -26258 -4258
14368 -4258 17542 20536 42118 71526 29274 28854 27248 32176 36341 61344 81163 31415 37637
14355 37637 30206 31633 35070 2308 22453 38277 16222 -26077 -68923 -88440 -61715 -2986
14343 -2986 23914 60545 102148 80554 21374 -55216 -14720 16098 9684 -19502 -42032 -49693
14331 -49693 -23311 -14161 -30524 -27369 -13637 18990 1349 15690 -11007 -26886 -36241 -23685
14319 -23685 -56594 -21090 -13212 -30362 -4131 -3822 18430 40976 39027 16223 -33460 -40525 -23717
14306 -23717 -50402 -72211 -23235 12649 18449 2898 -22350 -21272 -52255 -60524 -88512 -71161
14294 -71161 -41314 -19194 -6061 14584 38473 63928 65675 79310 50083 42588 63571 72840
14282 72840 43824 44097 23278 22683 16017 19327 24948 17828 26783 53618 57084 12007 29747 40665
14268 40665 25804 -1376 -37063 -36788 -18779 -1260 -17948 -13077 -44471 -53272 -37422 -3928
14256 -3928 28659 -4416 -9648 23716 4732 -37918 2125 -6684 -12061 -61312 -98033 -54128
14244 -54128 14748 31794 13708 -34142 -53413 -40656 -30182 9366 64759 45634 24801 -12792
14232 -12792 -28982 -58628 -48492 -12394 -30982 -28574 -28289 -10978 9297 -981 6127 -14722
14220 -14722 -36036 -36965 15750 78232 65812 45008 24715 16795 20838 32258 34444 26748 34314
14207 34314 27062 24372 13057 44938 64961 25872 17792 27756 16831 31600 35209 -1136 10373
14194 10373 10132 -8696 -4687 14582 339 -10695 -49806 -39565 -30601 88 20196 63099
14182 63099 94254 75017 19176 -34690 -41536 11537 49848 63630 76705 64441 51520 41932
14170 41932 14221 7272 -25393 -31218 -2535 21569 6719 -6790 -8255 -24236 -23089 -4801
14158 -4801 12472 47894 38680 29016 6326 -3357 -4428 34856 -13417 -33325 -45278 -14394 -8087
14145 -8087 -48824 -70367 -52655 -28394 15406 41815 25987 -19408 -63777 -76490 -70832 -27927
14133 -27927 -43214 -10423 -9912 -19621 -25048 -46106 -72459 -49259 -43258 -34561 -52763 -38419 5331
14120 5331 34322 21088 -17644 -33894 -46574 -28993 -14022 -39204 -56186 -15294 -5298 30455
14108 30455 41404 28171 -29814 -39295 -12294 -30218 -23231 -378 22135 -34750 -91758 -87863
14096 -87863 -58044 -39619 -6043 31033 35344 17305 2781 -23048 -6299 -16178 -12706 -116
14084 -116 28163 41513 64087 64786 32966 4991 -7771 -22666 -9140 -13478 -12475 -25987 -8010
14071 -8010 -21907 -19575 849 1335 7436 16865 10656 6313 35230 63116 75941 74209 63751
14058 63751 41239 5242 18765 -9492 -32578 -27148 -37085 -66228 -76897 -76558 -36716 -48754
14046 -48754 -79175 -65913 -5205 27877 8725 6011 -7737 2919 29217 17853 -6714 2032
14034 2032 2691 18937 -10557 -8326 27347 67551 50719 19677 40603 46708 69558 80601 69505
14021 69505 18505 -15649 3521 20106 14221 23402 13147 -27739 -73552 -93320 -67612 -16179
14009 -16179 -852 24333 27472 3655 -11231 -8570 -12837 -25801 -15018 6454 -14787 -43409
13997 -43409 -91872 -100328 -60340 -40488 -89418 -109622 -68297 -58661 -53212 -56518 -55358 -43209 -47877
13984 -47877 -67906 -16233 11867 25706 38014 36035 1740 -26770 -23933 15424 -2782 -4069
13972 -4069 -13925 -16406 -9294 10735 -5575 -15496 508 -9544 -30927 16915 21547 11146 24332
13959 24332 19546 7302 20031 -7901 -44883 -49945 -54402 -11688 15886 -9180 -14722 -6191 27727
13946 27727 -21898 -41443 -32585 -7287 -19583 -61474 -42983 -21965 -44453 -44147 -21679 -29579
13934 -29579 -50168 -31444 37787 51261 21125 -29915 -44783 41056 46336 21270 17058 8442
13922 8442 4439 -19318 -17238 298 9767 -7291 -22626 13105 24981 6085 -10920 -47231
13910 -47231 -34138 -20275 1377 55527 38963 -1218 -18137 -40586 -17886 14525 25706 12682
13898 12682 15026 14972 -7922 -45495 -51887 -27382 9456 20272 29511 -5052 -13156 -12987 31636
13885 31636 62947 38025 11157 -42929 -44696 -23601 -3491 -70150 -75985 -78523 -69381 -38418
13873 -38418 -44213 -27097 -51228 -80366 -83666 -87835 -135385 -69285 -58348 -73754 -51965 -33562
13861 -33562 -27361 -23776 16226 9077 -12245 -7253 -49791 -79834 -82571 -50100 -7715 48899 40017
13848 40017 -24991 -21801 -15911 -19393 -25695 -69002 -49742 -1212 6203 -7127 -17365 14897 -7238
13835 -7238 -20034 6540 10841 31363 -68 -35871 -9052 12565 -17390 -34402 -25570 -10241
13823 -10241 8216 -7881 -26443 -32381 -3207 -35388 -25444 -18542 -33795 -42873 -43074 -65472 -70406
13810 -70406 -70855 -65389 -20931 -21456 34216 12817 5044 19796 58017 46220 31728 23932 17776
13797 17776 6673 -15006 -35495 -47010 -82529 -62910 -43318 -46778 -78796 -92799 -109708 -89452
13785 -89452 -64041 -37611 -34647 -34179 -27170 47731 78636 53342 21877 -7798 10577 4033 7828
13772 7828 25293 5434 -1413 -3821 -734 22026 34161 70237 57141 -1235 -63870 -77111
13760 -77111 -14068 40088 43253 33783 24917 -11267 -26555 -7405 -21324 -10099 -9861 -12323 -4203
13747 -4203 -2990 17399 17428 26482 28046 -32224 -55795 -52896 -65873 -24530 -33245 -75720 -54144
13734 -54144 -19872 10845 22767 30631 21236 -957 -31971 -19245 -29814 -38516 -36959 -13954
13722 -13954 -5565 31644 20564 16661 17473 34582 18482 28715 27791 -4195 19611 15546 9651
13709 9651 10741 4325 21087 46708 31262 23244 32636 27872 18229 13628 -21883 -19373 -30709
13696 -30709 -45641 -20287 35290 -15298 -34656 -32752 -39109 -24408 2598 16925 21065 15536
13684 15536 36583 24434 27926 50055 27629 18768 -3337 -51517 -46715 -19431 26865 24522
13672 24522 -40030 -84286 -35512 7006 -9041 -11603 2765 -9294 -10125 -4660 -50396 -88300
13660 -88300 -39843 -32542 -29892 -20844 2673 -9345 24193 49740 45340 46468 34911 28270 37395
13647 37395 22205 -15245 -43558 -67488 -32902 -27048 -39152 -50109 -48371 -20749 25731 -5012
13635 -5012 -24380 -16114 -40647 -16978 -41951 -30168 -16161 16927 62629 71555 43226 6180
13623 6180 -14541 -40313 -30960 -21259 -33914 -13390 -28428 -57998 -53157 -33274 -14644 15176
13611 15176 10498 24431 38231 8536 30346 28940 25427 50229 82527 32328 16824 27486
13599 27486 38887 27210 1685 681 23794 16628 8880 27308 16648 34442 52591 50603
13587 50603 58923 47466 32804 -2515 8588 36057 28176 1109 -38418 -63199 -47711 -24582
13575 -24582 -49991 -62080 -81349 -69571 -20362 13989 18378 26496 33653 9934 -4867 4073
13563 4073 -19644 -25095 208 -8152 -54637 -25922 12912 5824 13606 24575 19741 18554 51185
13550 51185 9056 -64974 -72146 -53651 -57431 -37125 -6963 16724 20574 1482 -1306 -1152 -27472
13537 -27472 -64540 -86385 -66816 -31740 -46427 -66965 -64327 -41374 -1855 -826 -27064 -36270
13525 -36270 -20960 5173 9894 -31743 -11354 4933 44882 40177 21127 24143 36329 48621
13513 48621 28269 8248 16774 18179 13869 -24053 -70814 -45158 -16818 -17444 5607 197 -11129
13500 -11129 -2648 37634 35200 59023 113133 101498 60444 43757 66801 62685 16366 10580
13488 10580 -14166 14009 34369 26910 56875 38134 -20448 -65626 -40865 689 4970 -24972
13476 -24972 -45260 -53067 -42819 2175 2270 -41664 -34952 -40615 -44059 -13348 -15970 -35260 -20053
13463 -20053 -16942 -9412 -27093 -39554 -33928 -994 12684 38884 42319 18058 7990 10142 56131
13450 56131 26321 22704 2369 -43380 -91812 -58838 1243 -9901 -26479 -57122 -53871 -58301
13438 -58301 -33565 5980 -37750 -17280 20182 23797 -9446 -33344 -21532 -12897 -8671 22935
13426 22935 51810 26212 -23306 -48516 -18384 -5427 -13035 14145 21438 -34008 -57630 -20233
13414 -20233 -807 -15489 1608 12241 39774 26677 7122 29360 19785 25026 18262 -44551
13402 -44551 -20991 -23456 -30575 -38238 -1652 -24820 -51874 -45555 -42404 -32310 6655 -21234 -58438
13389 -58438 -69459 -39021 10009 39727 -48818 -85992 -57859 -59344 -64520 -69423 -54516 -47423
13377 -47423 -23982 -980 13891 -12855 -18802 -4431 -175 -4417 -13285 630 -5580 -22989 -26710
13364 -26710 -45477 -67194 -31212 -34363 -48660 -3995 9549 -4864 -6201 3979 -25530 -54745
13352 -54745 -74447 -70996 -62924 -41641 -8831 5449 -26323 -34337 -24226 -51442 -31886 -4357
13340 -4357 -12182 -5295 19765 34344 64795 64998 68777 32940 15584 26549 -6163 30482 47370
13327 47370 48489 27379 14203 12842 -11581 10251 30950 35791 8228 29792 36206 45046 52857
13314 52857 -9058 -58686 -73926 -85448 -61362 -23526 -9251 -35473 -57963 -57648 -31461 -7233
13302 -7233 -38752 -15465 13181 -10636 -69429 -82323 -105466 -99756 -80903 -94225 -103208 -103054 -97214
13289 -97214 -53666 -9031 19484 14688 -28587 -17743 -3987 -10223 -39880 -9977 -28313 -59712
13277 -59712 -48077 -11676 -67743 -83166 -26747 -1009 16718 28576 36622 49278 38813 4403
13265 4403 -3191 -1898 -18494 -12987 -18858 -36768 -74339 -97348 -52086 -20631 -47913 -29816 -670
13252 -670 27574 47503 14113 -26255 -61961 -82331 -59892 20973 61146 45401 -22407 -35893
13240 -35893 -13907 1856 -19538 -5774 -1572 -15719 -4844 -17118 -51923 -62766 -27572 21502
13228 21502 59553 90023 87362 41949 21409 -16783 1778 38428 48118 36416 -6252 -6589
13216 -6589 34307 25240 8109 -6684 -26500 -16321 -7416 17711 -14239 -41769 -7817 7516
13204 7516 -42085 -81281 -43040 8858 11938 38254 17937 3612 -15901 15852 48087 27622
13192 27622 -46984 -44915 13021 21078 -17500 -53544 -65133 -87148 -105551 -120333 -123133 -120822
13180 -120822 -91174 -84399 -79232 -68003 -18080 861 -1326 1222 -1282 6767 -818 -7852 -37955
13167 -37955 -31262 -13670 15859 -1003 -23814 -6582 9697 15863 20798 47115 37670 980
13155 980 -47553 -43897 -24879 -4451 -33330 -84664 -118699 -119222 -143532 -137294 -98012 -98258 -69685
13142 -69685 -30633 -7711 -8209 -9643 -18084 -51352 -64495 -41283 3448 2014 11430 -2869 -31203
13129 -31203 -46914 -83156 -67334 -68081 -72419 -31465 -33397 -51990 -27187 -28038 -31520 -1536 19929
13116 19929 -1561 -26177 -40313 -33129 -849 -27621 -34181 -4837 10522 15077 55544 99477
13104 99477 117152 105915 10172 -16463 -27252 -12779 -9673 -20466 -59670 -67433 -19237 17168
13092 17168 11879 10 -3598 -24789 -27923 -38214 -46814 -63204 -75745 -75141 -76402 -70700 -57211
13079 -57211 -48593 -57420 -26383 -5294 -10052 -21355 -23367 -6133 4742 14283 2498 -22505 -2286
13066 -2286 28050 15996 -24791 -13370 30944 -7314 -5958 52489 22072 -17037 -27404 -23906
13054 -23906 -20768 -1622 2518 -31829 -60994 -43397 277 63354 59102 22223 14660 3499
13042 3499 29205 -1473 -18000 -5037 39411 91635 45982 -2826 -7738 -26061 -17426 -50390
13030 -50390 -26574 -4075 -6049 -29652 -40680 14821 52133 74720 88001 73150 23945 13938
13018 13938 44275 12781 -9025 -16921 -1533 2789 10086 25339 1760 31947 77042 49652
13006 49652 5275 -38867 -48974 -50077 -86626 -68392 -26512 -661 12129 6269 -12882 -6873
12994 -6873 -5187 -59816 -89263 -91098 -49958 -14359 -27613 -38018 -83878 -48871 -16563 -12607
12982 -12607 3935 -785 34658 43855 34507 28105 21773 -33234 -76180 -78750 -33737 -19597 -76323
12969 -76323 -40314 -8484 -36144 -16864 -14081 -18123 -3291 -30556 -51230 -35397 -34481 -22480
12957 -22480 14778 5360 -17717 -20835 -21753 -45853 -59461 -103949 -91620 -30165 -24450 -33607 -51774
12944 -51774 -20934 -21547 -28800 -32357 -17477 -12920 -19386 -11613 -1355 33371 72575 64399 75170
12931 75170 89245 82974 39111 24164 42037 27919 9968 -51433 -78274 -91190 -29171 -6162
12919 -6162 -13396 -19016 -35676 2209 -2865 -34700 -18922 -14212 11289 -31282 -70911 -62091 -15362
12906 -15362 14477 29128 15328 -11535 -61454 -80904 -45792 4476 15206 24474 24400 -1101
12894 -1101 -22002 -21006 -11062 -32027 -48917 -29318 20343 10060 -11487 -53112 -85625 -27541
12882 -27541 -14729 -28420 -57096 -62691 -35162 -29696 16925 32624 59037 100581 89014 53031
12870 53031 34495 48870 30871 9405 -28626 -1736 -10927 -24207 -7421 28128 -12554 -63838
12858 -63838 -58864 -15181 37521 18370 -5965 -3809 707 -1399 -13445 -18674 -11811 25403 25800
12845 25800 21412 42644 19153 6140 37486 45686 35254 30153 36145 28109 9313 10031 -20189
12832 -20189 -57892 -33470 -5544 25159 58603 26690 -4099 -13063 -2741 4340 36564 49626
12820 49626 62666 85913 57176 43117 25703 45810 25439 -34277 -73169 -113666 -99509 -76508
12808 -76508 -71684 -48092 7499 52941 26034 38266 28856 -7275 -22149 -63239 -46321 2277
12796 2277 22772 5261 25503 34371 -4644 -73694 -84909 -25470 11654 -22504 -34908 -33433
12784 -33433 -17125 -27539 -33568 -35857 -73956 -71411 -74239 -134107 -169617 -136242 -81573 -97334
12772 -97334 -76006 -10117 -2764 -34621 -54791 -47933 -4657 22062 1415 -38635 -72610 -24461
12760 -24461 -38255 -54998 -67138 -54447 -52207 -54029 -46267 -43420 -37124 -28325 -50602 -66508 -56992
12747 -56992 -56030 -57640 -956 30518 -7972 -41760 -83591 -82098 -64477 -2473 14254 38122
12735 38122 43093 -6056 -15098 -38205 -18913 7548 649 2114 -8824 -7856 43238 21210 31613
12722 31613 20477 25313 28685 -13730 -26393 27360 14178 -41703 -69555 -64463 -15480 -9005
12710 -9005 -55494 -97677 -90985 -35800 -25088 -4715 29271 18335 27289 35827 -15408 -12090 -3239
12697 -3239 13511 41064 -7561 -40227 -60734 -35988 6473 -3726 -40381 -42841 -23822 -18551
12685 -18551 19821 22611 24665 -17833 -42403 -63729 -33752 -14002 -614 -5435 -2419 -7146 -8224
12672 -8224 15428 38684 53146 4966 749 16613 -1008 -18932 -62879 -44394 -48059 -4684
12660 -4684 36647 11404 -23870 41228 59868 15136 -9732 -31019 -45946 -22409 330 3411
12648 3411 7027 -8028 8509 24437 37563 21279 40940 35366 15018 -34021 -28337 -14827
12636 -14827 -848 10209 45801 59697 65137 46646 48501 14032 4755 -28945 -27372 -18373 -12205
12623 -12205 20921 10766 15732 -23031 -25949 -16317 -23691 -29282 -34639 -59932 -28908 -14243 6613
12610 6613 4038 -9645 4830 11999 -39077 -47501 821 8793 -4990 20629 40066 28462 12213
12597 12213 38468 16826 4603 25435 49641 44355 8004 -12788 9693 2208 -16677 -28552
12585 -28552 -16155 3403 8180 21675 79435 87948 81016 26215 -47861 -69084 -59863 -38945
12573 -38945 -44788 -107 55139 57050 69663 63405 59474 14634 -11309 -6691 -35223 -28810 -2466
12560 -2466 -2234 1180 -12805 -4753 -3692 -11989 -46150 -74977 -29204 12508 4694 -23315 -21469
12547 -21469 3451 6367 -8886 -47025 -50952 -9806 21375 23629 40646 20093 51409 9198
12535 9198 -9514 -7209 27601 27789 50765 92965 70490 33073 15367 10597 -4946 2978 -15480
12522 -15480 12617 18645 -28010 -27691 -54777 -18591 24001 -25666 -53284 -40448 -15670 -5048
12510 -5048 -20200 -14428 62122 67492 73750 95181 113210 92755 35490 26590 20085 12493 45498
12497 45498 100073 109509 83050 58938 43666 -1694 -5617 35518 90641 102652 103185 72184
12485 72184 45067 64567 46119 -3838 -34033 -31281 -24831 -40241 -101563 -104804 -55212 11882
12473 11882 32326 34656 28446 36439 33850 14005 15711 -4010 -8455 -17127 -37920 -1412 20421
12460 20421 13249 -14720 -15935 -34839 -35705 -23512 -16538 -5862 18676 86382 61231 44575 66779
12447 66779 50913 55004 58124 37895 5893 10465 20306 5984 44579 60740 -895 -14240
12435 -14240 15302 27061 17510 38795 41213 40017 7686 -49425 -56515 -38703 -24056 -17893 -15831
12422 -15831 31466 32806 25501 30060 51475 92023 52963 12344 11220 -4875 -18146 -52450
12410 -52450 -37846 -14242 -13404 -76182 -96220 -43068 27329 58516 20737 -24734 -62638 -39431
12398 -39431 -12288 -14879 -46056 -45199 -17382 9710 44191 60245 73769 47579 -12473 -20088
12386 -20088 -39964 -29816 -46858 -40439 -26435 -3580 23268 64639 70569 8658 -4568 18933
12374 18933 43215 10169 -36993 -41550 12274 15890 24409 11249 21478 24613 29526 20903 16274
12361 16274 51210 45914 60950 39565 -20935 -37502 -26642 -20739 -62286 -51120 -32420 -49409
12349 -49409 -42589 630 2023 27920 56694 84433 103017 110043 74102 50033 40314 33890 36213
12336 36213 37128 61275 47481 -9919 259 -22436 -49467 -64641 -61134 -49371 -49422 -45247 -38576
12323 -38576 -55291 -69758 -55464 -29649 24499 11500 -18156 -62080 -90405 -84904 -76981 -104184
12311 -104184 -132678 -119624 -97201 -93804 -72475 -63836 -8256 63539 35971 -38825 -33431 -41524
12299 -41524 -17044 11468 14026 -39813 -31097 -2386 40403 95895 61371 11332 -27742 -48121
12287 -48121 -48170 -68942 -74053 -42266 -16598 -17637 -29380 -34846 -56703 -35823 -17152 -18028 -20149
12274 -20149 -33903 -25230 26785 37803 3689 -48516 -35430 1700 42058 64574 39611 -4893
12262 -4893 -45903 -34181 -28353 -55782 -32148 -12521 10777 17618 -32338 -29311 -9121 32855
12250 32855 47229 -3281 -22223 -7454 18470 16462 -15017 -44928 -71356 -45443 -9568 11940
12238 11940 44721 37879 26905 -2081 1658 -1568 9765 25100 11208 24963 22073 48872
12226 48872 32738 17413 -20105 -2008 36293 89678 90864 57278 27726 22209 31732 46681
12214 46681 71118 40901 5522 -17958 -11693 -12248 -29136 -35685 -17804 -14756 -12112 31591 72808
12201 72808 72613 72374 30338 37068 43013 61134 48206 27802 19413 -12962 -22049 -9761 -1405
12188 -1405 22045 25472 42602 51705 70010 86372 56765 52486 42654 16300 28668 30995 -26914
12175 -26914 -45847 -26478 -17150 26814 48237 61620 104519 139352 120222 71914 8158 -14850
12163 -14850 15344 62982 39138 20223 21339 51964 49338 20570 -6967 12239 12824 -30613
12151 -30613 -44692 -28546 -14009 19535 50715 56538 49994 33788 -5820 -7923 315 -4608 9615
12138 9615 61901 55047 25438 -14322 -2016 14601 23027 22816 -18457 21522 77054 27114 -40393
12125 -40393 -30859 6290 24350 44748 44701 -5271 -28208 -11274 -13840 1720 14828 20147 45701
12112 45701 46195 5395 3527 -94 26216 24234 -16334 -50017 -38960 -35379 -30653 -23103 -13133
12099 -13133 -41265 -24423 -27247 -106994 -111865 -68023 -83480 -103091 -32336 -8372 -19789 -49986
12087 -49986 -77385 -85304 -43577 14410 17969 17220 28986 66516 50969 14996 -38023 -62985
12075 -62985 -50424 -34514 -50617 -24202 -28628 15019 59427 51556 22414 22603 34584 68137
12063 68137 77231 73957 8850 -4761 49098 53256 49616 54594 39188 51240 20462 -20058 29897
12050 29897 58483 106230 115255 89793 51980 -5285 -44427 -59570 -20247 28251 43190 23244
12038 23244 47557 86703 92595 70251 86108 85309 75482 43350 15054 51768 39167 41178 68103
12025 68103 84707 79037 87964 78213 69383 63415 89692 92676 51753 30433 44187 71264 76836
12012 76836 59388 27146 25224 20926 49081 94240 125207 109165 110323 132678 183137 169070
12000 169070 127682 108932 150892 178837 126749 102056 150315 208129 243131 214178 167124
11989 167124 188654 235733 222494 185306 211588 247349 237024 240609 243528 257763 304456 341097
11977 341097 359863 394081 449924 460921 461679 454216 484182 539762 603935 644707 677556 726008
11965 726008 766187 832810 912109 976871 1038121 1088438 1178773 1287948 1405906 1546366 1723218
11954 1723218 1912607 2104401 2354709 2720821 3100613 3524153 4012588 4671837 5537673
11945 5537673 6680818 8141027 10102817 12805914 16660815 22328297 30833073 43868182
11937 43868182 63221622 86728817 102970542 101470791 85481402 64908303 46894120
11930 46894120 33584207 24383436 18224319 14010998 11026442 8880329 7344222 6165107
11922 6165107 5214185 4430017 3855301 3366408 2973145 2656252 2401407 2170600 1956480
11913 1956480 1780578 1642721 1473929 1345739 1233111 1137003 1023800 952390 904355 866204
11903 866204 800970 728663 705512 669965 669806 619831 610397 602053 590208 588365 574809 565701 528166
11890 528166 484964 466398 446775 374804 313053 314318 292392 239124 277418 320960 318471 292401
11878 292401 243427 229683 259233 292502 232602 151914 132974 190135 234242 225232 157167 124809
11866 124809 145133 192944 223392 219867 155772 132952 101837 114313 148269 172257 177696 156974
11854 156974 135095 144203 186732 163780 146516 128039 99456 69658 50580 48656 63703 81423
11842 81423 82638 84131 111602 82132 20808 36129 36879 47713 44353 38041 28769 49735 54614
11829 54614 51231 57720 40631 55993 60894 67931 18290 13491 14531 37249 37860 53180 62866
11816 62866 65061 88812 78414 28373 -15384 4487 -896 43246 82514 45751 -20976 -41479
11804 -41479 -33208 -57794 -53517 -44318 15798 20463 42593 58628 77303 99056 65697 13012
11792 13012 25853 5924 -26542 -56227 -19178 -17610 -27317 -59405 -59772 -9672 -404 2094 23026
11779 23026 43154 45073 62900 93948 104323 78219 73466 62522 68567 102662 92328 24527
11767 24527 15553 53898 62054 72200 119672 108234 85772 72478 44506 45065 51140 48639 51472
11754 51472 55002 41577 41628 35003 54142 29694 12900 6376 17611 -42893 -50686 -27324 -40720
11741 -40720 24115 77938 109778 54448 365 -29731 -29055 -30651 -32212 -51881 -45517 2652 27799
11728 27799 4416 -26616 -84608 -123126 -82818 -55220 -38088 -54952 -49527 -59933 -90753 -61952
11716 -61952 14214 59723 60243 67534 42070 16188 6942 -18236 -10970 -19376 -4843 -17472 21993
11703 21993 27764 68103 68971 17044 -8825 -4332 24452 27604 29438 24976 48493 34092 20524
11690 20524 -20960 -56325 -53685 -43606 -943 50753 51990 37142 28944 82907 117792 87692
11678 87692 58935 28382 26940 67837 48124 36270 24286 11964 26131 34461 44875 51705
11666 51705 27536 22221 -9615 -27440 -20958 -15062 -31427 -20480 -32309 -77787 -72509 -40649
11654 -40649 -25933 -66520 -65141 -12267 36159 51308 28682 16951 45119 85098 81086 61119
11642 61119 26405 -11012 -7857 2178 18385 2129 3326 15504 -31851 -42896 -11321 36704
11630 36704 60151 36221 -17578 -16444 535 32913 50297 69557 27040 23099 -4406 -22715
11618 -22715 27567 74277 59652 32661 57411 63067 48575 46285 54636 73730 110406 58975
11606 58975 14765 6405 16681 45600 74657 139026 111349 65759 53134 56105 30735 25050
11594 25050 3300 -34144 -22699 4750 -3035 7792 -45235 -26452 -5608 19873 14669 6541
11582 6541 11563 48283 37353 -13064 -71335 -29582 5657 -30346 -48400 -49028 -37654 -46817 -37324
11569 -37324 -14427 -32502 2680 30424 26521 71654 33543 5446 35405 35126 17334 -14463
11557 -14463 -39703 -28663 -7026 7204 18070 5844 30825 35807 15525 9701 -22970 -40632
11545 -40632 -47734 -14914 -3412 -26121 -11031 17337 13491 -13843 -19053 -1175 -27267 2360
11533 2360 57722 34367 33880 15290 9029 -3240 -22003 -31527 -39230 4676 1228 -18163 -44638
11520 -44638 -38243 -41463 -31283 -14733 -19954 -54187 -30405 -9090 -16763 -24293 9661 -31758 -16954
11507 -16954 -7724 -611 -6977 -8433 -12367 -26162 -31854 -5547 -3118 11272 13595 24986 -4550
11494 -4550 -54074 -77556 -88984 -80441 -59618 -23047 -8335 18192 51703 33426 15330 25113
11482 25113 38089 -21275 -47188 -40275 -22058 -42216 -42162 -40932 -28459 -18830 -4238 51219 108762
11469 108762 69156 -8463 -51718 -45270 6568 13525 -9880 -34948 -72474 -22474 77266 80579
11457 80579 48296 31503 1203 -25417 -22978 -3496 -14985 -38837 14641 51574 2892 -36934
11445 -36934 -35193 -24771 -19818 12848 -1420 -2625 9627 -21142 -49117 -49208 -50290 -10900 11010
11432 11010 -21614 23944 39580 21674 26448 26223 59492 59892 53735 53450 55030 48824 27462 7467
11418 7467 -12400 2912 -12144 7213 -30954 -51923 -34923 -27756 4096 7128 29356 28470 49246
11405 49246 68449 92532 89217 46201 -13741 -26668 -30987 -23667 32433 44887 40627 -4091
11393 -4091 -45632 -62517 -15862 -10753 -40703 -37346 3801 18391 -1164 4482 -4935 -45493 -49074
11380 -49074 -51611 -7527 54669 53004 58046 41968 275 -24816 -70751 -6085 51584 21376
11368 21376 24111 3759 -8416 -21777 6377 15274 31456 51824 44082 38314 37092 36967 42328
11355 42328 42953 40236 21730 -31537 -59817 -37384 -17456 -8574 -33251 -13228 -5380 27955 -13108
11342 -13108 -41889 -31594 2543 639 -11588 -45377 -28700 -28639 -18269 -22089 -37547 -19318 14516
11329 14516 66502 75137 80508 27737 -20085 -17836 -21818 -54033 -14632 14409 2735 -12570
11317 -12570 -28880 -24292 -28764 -22496 -60084 -82272 -50463 -32009 -26037 -18142 -801 -3444 13748
11304 13748 10460 159 -16768 8745 30806 33417 19283 -4036 -699 -15839 -34345 -63616
11292 -63616 -91732 -81189 -31521 -11772 48476 48613 -30227 -52937 -35555 10325 30381 38967
11280 38967 -1546 -31803 -65857 -81291 -62303 -45453 -55047 -85749 -89082 -75234 -22008 -11244
11268 -11244 -39203 -16247 5393 3277 -11032 25072 18102 -21603 -43654 -48274 -24913 535
11256 535 19459 8052 21152 -1942 -6860 16760 6406 -23071 -12703 397 11076 17554
11244 17554 -3669 -7545 23481 -12069 5593 8790 -11609 -23604 -17856 -25715 2809 36002
11232 36002 16584 -25694 -28932 -52310 -41242 -45238 -50060 -55597 -52743 -51207 -61437 -71272 -85534
11219 -85534 -98575 -95178 -116696 -80344 -67618 -37345 -27562 -24958 -7227 -28027 -1021 -6590
11207 -6590 -44504 -78583 -35072 -35912 -3263 45329 5966 -17410 -23025 40913 79244 60657
11195 60657 4786 -4493 -1306 27945 44776 5686 -22641 -31068 -22986 -27210 -8786 19364 -8313
11182 -8313 -78971 -84465 -48297 -28355 -49554 -59826 18057 54546 44197 20448 -40775 -42102
11170 -42102 -29285 -5406 -5989 -25097 -32607 -46516 -51765 -27785 8280 -36934 -85928 -78251 -43396
11157 -43396 -80571 -83080 -26762 111 20569 -2778 69 2497 30111 69005 83705 42390
11145 42390 36049 -650 -11578 39285 21575 41788 18228 -31519 -52811 -62429 -35645 -23188
11133 -23188 5415 32450 25647 60232 92385 74396 23268 -6692 199 6080 4955 37641
11121 37641 51500 37159 27537 18697 2117 1374 29266 79609 22766 -28420 -8004 16069
11109 16069 7606 -32345 -49922 4525 74474 22019 -49155 -15920 -8377 -8886 -32418 -18910
11097 -18910 3913 32049 34290 8500 27064 -23365 -52207 -42630 -47943 -47594 -10419 -2661 -10076
11084 -10076 -11941 -22364 -30400 -20879 -10406 -25959 -48416 -32730 1421 27402 -10660 -55741
11072 -55741 -29101 -38199 -48098 -49192 -5788 42839 61608 44596 21452 4902 26312 61490
11060 61490 57720 43246 47089 59675 54060 54706 33028 1815 -11368 4370 -18737 8486 39841
11047 39841 113415 151602 138093 148598 153510 142415 157511 186798 193374 122356 104260 163326
11035 163326 263925 288649 265073 256767 224575 168942 148591 175140 208778 270781 323600
11024 323600 370583 423822 446361 419850 377791 332654 304492 287380 208925 181372 199038
11013 199038 225069 243894 274711 328518 307759 260481 235371 232049 179263 132458 125887 148240
11001 148240 119210 109053 152841 142921 134814 132889 80895 29057 -8528 -6407 14289 32513
10989 32513 41750 67984 74877 70943 74224 52561 20833 23843 22220 -6940 -11509 16440 -7759
10976 -7759 -25054 -33991 -51928 -40836 -1414 56670 34535 25774 45896 61936 25190 12727
10964 12727 41922 20974 -9992 17745 47353 80240 57163 23568 -13645 -59969 -52681 -24197
10952 -24197 -24868 -60399 -67324 -55255 2658 34740 -3506 -31444 -21427 -55430 -86128 -69750
10940 -69750 -38689 -18338 -22702 -12517 50801 63521 25844 42110 55748 58202 47803 9721
10928 9721 -6510 9645 21003 14219 -32368 -21622 -6456 17233 -891 1146 9534 2097 -9762
10915 -9762 34254 32523 40037 53391 44804 43870 56921 50156 11500 5864 23490 25536 34201 47674
10901 47674 35152 26177 -17152 -5327 3574 -12135 2062 52264 23060 -2908 29883 67492
10889 67492 92471 103964 63293 31352 12146 -17451 -31713 18098 42916 15628 27304 13912
10877 13912 8788 46446 28987 -350 -14948 -50411 -69936 -54505 -11756 21561 28796 21173
10865 21173 55327 75552 62584 87743 79961 39047 30801 13545 20275 17745 46849 44557 27246
10852 27246 20312 2027 32068 62676 38611 -7156 -11156 42219 97837 89877 60231 71017
10840 71017 70575 40083 61338 65337 67016 -2704 -23436 -31702 -21199 13810 19870 31586 -9848
10827 -9848 4382 12203 21089 5254 -36736 -39845 -5619 31311 44229 31372 20890 -17068
10815 -17068 -29411 -15137 8052 11593 18610 8421 5929 3859 5748 21220 13962 25612 7000
10802 7000 49509 51905 33295 42029 46681 28613 3279 3378 21823 -2269 -4518 13246 14402
10789 14402 9930 -12602 -9655 -17378 -16345 -30100 -32275 -56053 -43252 -39574 -57966 -62855 -47164
10776 -47164 -27726 -33222 -35214 -31381 -3916 21991 3225 -17413 -15199 -54833 -47583 -35139 -63216
10763 -63216 -63787 -39620 -46497 -31375 2496 -4570 4424 -3254 -17025 -19398 -44431 -425 1544
10750 1544 -23152 -33067 -19810 11960 16964 24830 3391 -30799 3820 15825 -23533 11784
10738 11784 10970 9472 -19322 -27262 -4225 14661 -7435 17246 25624 4408 -659 23974 82987
10725 82987 77736 46982 66794 69607 106376 93245 53704 41485 78571 140237 150471 107170
10713 107170 51227 48372 42828 46266 40521 12050 46779 72902 53033 96270 109076 110901
10701 110901 111677 109074 113272 107291 118548 120474 127498 71228 51292 67072 76765 78503 79719
10688 79719 97717 87638 90823 80873 101965 120374 104815 76660 42460 47618 97803 104981
10676 104981 100044 117761 118442 99897 76969 34636 69247 125535 176752 180371 156754 141660
10664 141660 169280 160950 172285 229081 232227 244645 264590 345550 388243 436497 473525 528686
10652 528686 604132 663966 755231 787337 740899 655978 591661 582166 580116 605615 624317 672854
10640 672854 720629 798798 877598 978124 1091517 1217799 1339591 1490235 1698298 1804346
10630 1804346 1930183 2110170 2333262 2608046 2952732 3388650 3988333 4862702 6030327
10621 6030327 7607824 9696239 12489615 15977138 19824566 23345464 25522174 25987428
10613 25987428 25259415 24129227 23418367 23661335 25110841 28081246 32909205 39715955
10605 39715955 47641306 54340682 57249146 55756220 51487944 46771580 43247953 41679049
10597 41679049 42455743 45914477 52191703 61083915 70921724 78093417 79174159 73978759
10589 73978759 65289603 56323719 49058096 44237739 42000307 42321207 45046527 49611899
10581 49611899 54586659 57407327 55966132 50550790 43196945 36063865 30374686 26465821
10573 26465821 24270920 23483993 23851282 24986919 26096066 26183309 24534356 21410303 17654209
10564 17654209 14018281 10986174 8611207 6877400 5628450 4679075 3957651 3344885
10556 3344885 2864617 2526154 2293172 2072589 1855813 1660033 1520890 1392864 1264796
10547 1264796 1162992 1038899 986737 978373 876412 772117 760761 760792 721031 663021 598867
10536 598867 572090 548354 527756 480334 486966 496187 491888 490449 470152 417130 412421 418580 407247
10523 407247 377246 318312 319351 323582 262050 241892 268507 293431 262688 256451 264863 247963
10511 247963 206667 234030 286470 293345 277422 233313 209983 162634 137703 179448 188177 174592
10499 174592 207596 263548 283885 236924 209275 183348 144031 117105 96286 99711 131628 140642
10487 140642 142913 112765 103121 139667 114587 89478 101396 91438 78951 58823 53345 75631
10475 75631 30534 14772 27691 71537 82633 94074 92862 94573 89727 106320 103441 50190
10463 50190 44558 77143 92730 112926 99316 63273 105610 111482 121686 112813 93618 114082
10451 114082 146340 151122 135053 107777 106650 95870 94485 95050 91131 96159 44213 54970 95915
10438 95915 120201 152130 162396 109152 74769 50393 123724 134732 86609 63718 59502 96704
10426 96704 124412 137110 116490 121573 75518 45957 29766 41991 82812 107068 108733 92017
10414 92017 97947 103680 124762 122180 99549 70203 78607 121360 135285 130417 66735 12513 29949
10401 29949 37790 5833 -10642 -987 -1491 29175 43226 19472 34393 55184 24671 12752
10389 12752 43147 63033 98432 135842 97034 54045 38607 66205 74375 70906 40381 61394
10377 61394 55908 68456 88457 87876 122600 102274 70488 37302 37137 32096 32582 56141 55523 47095
10363 47095 17645 20837 85170 118907 111952 63783 40435 69643 58826 69982 59308 30867
10351 30867 26772 26128 442 14104 16963 34435 62457 59804 89000 77279 50876 50878 31346
10338 31346 44518 68643 61179 42008 70239 46579 -133 -6397 38405 71035 41445 14182
10326 14182 -14728 -36712 -451 16465 47066 83158 82736 3014 -29861 -14246 -1092 33607
10314 33607 38244 -3579 -11632 -22970 -23670 -22952 -19087 20686 21854 14958 16513 8105 37914 53076
10300 53076 62959 75703 88194 80484 82706 93976 84542 58783 38345 40095 12278 24492 63457
10287 63457 55676 29146 31726 20806 -25968 -17090 275 -26828 -9414 -17341 32101 45992
10275 45992 34410 32036 52595 101793 210427 354553 454121 618338 803615 941550 1081497
10264 1081497 1168327 1216489 1231466 1215233 1125669 1005398 858344 720457 560608 404868
10254 404868 300095 206688 116205 83883 63452 50119 37548 47627 12750 8018 27819
10243 27819 49113 45263 -14802 -54761 -22781 12710 32231 19554 27277 34682 12319 -2929
10231 -2929 -12651 -10347 36462 62936 -240 -3729 17390 66485 62287 44495 782 -4839 -2501
10218 -2501 35237 65310 60053 63963 58103 79830 86944 65567 36324 24829 12224 30297 -5467
10205 -5467 -12776 -40788 -46489 -27185 -18179 -6584 31527 61467 24138 -653 -41181 -40645 23326
10192 23326 47422 24448 -13593 -15141 -1310 -10674 -16997 10565 56993 71989 75688 92908
10180 92908 107276 79909 66168 80656 80165 136988 137175 134144 159422 169417 188195 224979 303437
10167 303437 344562 325709 255695 268485 285761 242744 252697 229049 212344 301968 408261
10156 408261 453304 448294 415091 373273 353330 339045 285339 234144 216912 210205 215432 241311
10144 241311 287504 257401 220389 219458 191349 140844 136077 149918 124237 75186 95665 117071
10132 117071 110879 150105 165588 127684 106791 68478 -679 -30695 -25394 -6649 24724 23744
10120 23744 1236 15867 25696 28457 40556 40131 8600 -1627 -7029 23013 55342 48130 -9971
10107 -9971 -22925 11688 37781 64157 8435 -11417 -2591 -4264 -20375 -21948 12533 40948
10095 40948 41150 21278 -214 19802 46261 55271 36690 -6237 -29831 -15372 28441 54232
10083 54232 40867 -11525 -49158 -53386 -45770 -27639 13402 44563 42397 21968 30036 40217
10071 40217 -6343 -30130 -26385 -4783 29352 18303 1393 4149 -16582 -20485 3168 47786
10059 47786 75043 57777 35914 132 -6732 -12271 -24779 -18650 -3145 55688 43171 10121
10047 10121 6853 -40788 -30433 -70738 -59050 -41386 -46418 -48545 -58345 -43251 19311 20756 -40726
10034 -40726 -57127 -16512 8378 -13158 -14788 -20364 -4550 -2786 9729 -5940 -2172 7836
10022 7836 3929 13798 -9942 -35914 6602 27667 18435 34465 53797 57250 49653 43756 43940
10009 43940 59252 60021 54119 40775 18774 8765 2875 -8132 -10903 -8229 -26172 -54296 -61333
9996 -61333 -28760 35 -767 -8559 -31770 -12532 -22669 -44626 -22978 -9518 -32096 -26739 -41864
9983 -41864 -86389 -109247 -71133 -75196 -70617 -78635 -87087 -71226 -51601 -35343 -70108 -39562 -28504
9970 -28504 253 36948 7649 25213 -9136 -24000 -1236 -6876 -21826 15258 14096 -3859
9958 -3859 9588 20239 53129 48429 30602 23703 -2946 1771 21750 -5043 -7834 34830 35414
9945 35414 14952 6737 -27568 -80903 -85307 -57722 -93397 -77167 -18259 10426 -10154 -38856
9933 -38856 -65550 -100268 -46961 15924 51307 80112 98013 64169 52436 80898 46096 363
9921 363 -15430 -8100 -41420 -47113 -6001 -11344 -52122 -59816 -62832 -54407 -24422 -5965 -50603
9908 -50603 -61536 -59075 -69537 -50106 -15079 32206 18252 20725 56153 68353 56606 43355
9896 43355 28711 11764 4961 44917 76877 17326 -28659 -6995 22340 -18700 -31433 -4041
9884 -4041 -2696 22559 57792 20673 6583 -1637 -52647 -53734 -4077 21940 16786 20786 -36240
9871 -36240 -74921 -35606 -28453 -44471 -20202 -358 10998 6541 -325 26470 25800 33898 6797
9858 6797 -13752 -46612 -51742 3494 21263 14984 35212 42578 17251 20240 19153 -32103 -34304
9845 -34304 -45330 8300 57846 13348 -31786 -29661 -737 48606 53270 25897 16069 9650 -31209
9832 -31209 -22505 -3297 22605 23487 23685 20568 7595 -5616 7578 16649 -319 -76491 -123036
9819 -123036 -103370 -59438 -29640 -56122 -30658 1146 3929 1861 -7611 -66036 -54696 -32793
9807 -32793 -25060 1395 10551 7455 4527 12361 48624 91195 82310 121378 130388 104191 115470
9794 115470 87953 41404 -24117 -48042 -27786 2330 60246 35643 -9770 -4595 8320 -2635
9782 -2635 -12603 12330 73115 118183 203516 336448 472288 478806 389400 263300 190288 142388
9770 142388 109335 109400 66999 34531 91055 110778 122460 110030 46793 12492 32392 80985
9758 80985 60766 7462 -7372 21780 45389 72345 109963 92938 17555 -63 15829 11079
9746 11079 -8534 -41608 -19877 3158 -39923 -36698 9023 49451 76974 52088 14682 -29658
9734 -29658 -27889 30293 11356 16828 26527 21365 -3835 -12597 -5444 32253 6244 18267 15888
9721 15888 6718 -3654 -3948 -16393 -3174 -42277 -24073 4318 2400 17524 13288 30039 54693
9708 54693 37544 -5491 -3763 45867 24112 5241 4361 -10381 21380 53448 44535 35247 38210
9695 38210 12916 25377 25029 18932 37192 52366 79189 123000 96795 48501 7384 -5880
9683 -5880 4461 -8503 -19237 -11706 31135 97910 82528 68042 50480 19340 13632 20116 31812
9670 31812 43361 22964 -24470 -35293 -32465 6515 76334 114277 89569 100168 123622 111053
9658 111053 98221 100093 120163 137143 159814 225405 282169 343637 421433 516872 674736 809817
9646 809817 919606 998786 992614 974818 855362 669073 529668 442432 372145 291178 211141
9635 211141 161473 108531 92447 87912 98359 76449 44669 11778 3377 -4680 44658 80378
9623 80378 91016 62703 15614 -30595 -30899 -23821 -50625 -21737 -19003 26640 2540 -2798 9276
9610 9276 -17264 -2967 3064 5946 35819 63959 24862 -15661 -29863 -32357 -4573 47458 47413
9597 47413 16647 21520 78996 91731 74726 60657 92947 63848 50205 48579 20609 -22884
9585 -22884 -7337 -25167 -36216 3828 -276 -17532 -16859 -31277 -44865 -51923 -44554 -22319 -10766
9572 -10766 21204 24119 32336 14032 7441 -19288 -35872 -57664 -58762 -19936 -8536 9257 -17091
9559 -17091 -1031 48366 54582 18591 -1236 13284 -6195 -17483 -18305 -2348 38379 55017
9547 55017 44951 10087 -22923 -10970 -5499 -22621 -29895 35856 53396 50879 45987 22926 -7385
9534 -7385 -48572 -78493 -60946 8287 -977 4057 -35096 -80124 -100451 -72713 -37139 -41362 -44691
9521 -44691 -49026 -43967 -61206 -76780 -99379 -92634 -72229 -40838 -71479 -34525 -26924 -30533 -11143
9508 -11143 -9907 -12037 -24902 -46577 -76740 -28355 18869 30990 11930 21427 37488 33640 26719
9495 26719 27002 -48 45682 33116 32476 25919 -11573 -48532 -28083 -39518 -38695 -8505 21307
9482 21307 12923 13837 5551 -31930 -27622 -58529 -55979 -48745 -53192 -64438 -48509 -14433 19562
9469 19562 12784 -1946 7813 222 -16661 -15903 191 30262 -10705 -7374 40271 4056 -5045
9456 -5045 -26134 -69648 -108272 -72011 -65691 -82179 -90122 -97636 -67162 -76878 -62240 -58628 -46489
9443 -46489 -65506 -31455 8611 39639 44911 -8434 -9563 6770 -14651 -36845 -35392 -10956
9431 -10956 2424 41631 53240 33418 -8734 -12640 1513 39271 66870 33544 -9760 -25422
9419 -25422 -53901 -38754 -9111 -7714 56666 107086 82899 84149 76416 45329 49710 112923 96950
9406 96950 64460 54738 68933 41761 -24976 -6323 39887 84149 127051 121533 60470 35633
9394 35633 62250 42298 -27287 -22864 -2188 2615 29564 39197 26097 -20710 -64050 -62764 -9145
9381 -9145 23260 35411 40212 8655 -44249 -53410 -33166 -21051 8044 -12266 -4355 24069 25274
9368 25274 37078 9119 -28405 -18729 14660 -6249 -395 -9546 -10488 -5821 -16594 -16713 -40813
9355 -40813 -7628 2375 -5952 -9509 -45796 -29736 -3265 3655 10268 10240 24269 21275 10167
9342 10167 8163 19137 42525 47095 79611 93397 29040 -4080 2826 -10765 -6111 4609 39394
9329 39394 63410 91739 37549 -20123 23911 32132 23855 34728 22970 12014 -1747 -16962
9317 -16962 -26459 -14800 -26046 -17706 10560 37259 51800 36439 5140 -39310 -35536 -28868 -40824
9304 -40824 -28993 -5912 11277 31431 4814 -11566 -23457 -41975 -15999 28811 32271 72706
9292 72706 88363 55445 -6662 -14625 -13615 -24914 -35219 -27109 -25757 -29214 -57507 -23803 4674
9279 4674 41078 40525 12784 -14709 -39656 -28151 -16579 -10527 14659 3618 -45600 -87455 -68349
9266 -68349 -37729 -49230 -47342 -36136 -30020 -1812 -5999 -24905 -6771 4680 -39172 -52892
9254 -52892 -40691 -71842 -81415 -41163 3122 5717 -19287 -45800 -47246 -67458 -89230 -78488
9242 -78488 -49260 27517 78479 54202 -9006 -29641 -37644 2159 19430 28163 -8101 -34943
9230 -34943 -60813 -58214 -49240 -38358 -22253 -55213 -31172 -12075 -31642 22065 54079 40349
9218 40349 24502 59397 75242 34460 5713 -30008 -18631 12486 -691 -37541 -57436 -30553
9206 -30553 -43273 -11296 -676 -1890 16398 8956 21836 16132 1700 17494 84573 33601
9194 33601 -5986 4871 2446 -19846 -40203 7147 18464 27201 28827 15708 12291 -8343 -23353
9181 -23353 4449 30880 34074 -12488 -27140 -30879 -5930 -26088 -18653 -5291 4013 1507 25787
9168 25787 16343 27496 25132 -6356 -45996 -40825 -53072 -69110 -39950 -8726 -19197 -24288 -25957
9155 -25957 -18008 22146 45842 45332 43042 -295 -8889 -13280 -15742 -23222 -23472 -5730 -27241 -44749
9141 -44749 -20512 -53037 -68321 -73206 -40810 5015 -13357 -15802 7010 17939 -6090 -49800
9129 -49800 -58932 -53812 -27421 -47498 -73112 -76072 -26656 45480 34042 13992 -14999 -6615 47348
9116 47348 78181 57106 32614 22527 25992 39094 -6754 210 -1867 3026 -39058 -49137 -35784
9103 -35784 -2233 -11213 -5680 -3230 -12917 11916 32979 54036 37494 20472 10059 -22762 -53085
9090 -53085 -52048 -19660 -36693 -47844 -48325 -50672 -22282 -4902 9950 -11167 1071 12283 21661
9077 21661 2816 29792 34840 -1224 -44423 -37674 -17841 -23130 15395 34821 45373 57371
9065 57371 56602 19164 5510 27352 13191 -439 29562 27872 41297 33007 -8848 -3018 9220
9052 9220 -9784 -10029 20808 37946 21234 33589 3998 4512 20533 16165 14648 4239 -24507
9039 -24507 -50573 -36306 -16139 -19224 -6408 34203 61693 94578 52148 517 -20127 -21065
9027 -21065 -36521 -51271 -40235 -5392 25226 -295 -8202 27051 11151 -12888 4982 19960
9015 19960 -8184 -60306 -93658 -39878 -41684 -104553 -92796 -57515 -46356 -65545 -71972 -57399
9003 -57399 -31166 -19043 -13914 -1873 -8412 19653 66335 46048 11490 28359 54423 32026
8991 32026 25841 3510 -2884 -11567 -3990 4530 15525 36757 -15013 -51828 -58052 -45512 -35642
8978 -35642 -44921 -15050 -13330 -13266 28625 19175 18943 20515 13172 -1924 34433 13393 33005 -24194
8964 -24194 -59924 -18987 -34998 -33698 -41441 -39860 12464 37881 35524 52420 43706 22008 8730
8951 8730 3031 71333 128750 109490 45080 70913 35759 12987 15653 32222 46470 32898
8939 32898 -22147 -15704 25560 -15061 -21950 16767 21328 23236 35675 3326 195 47085 32916
8926 32916 13300 -34733 -56192 -24306 11717 10569 14352 32210 24153 7247 13281 38908 30488
8913 30488 5765 -7164 -27290 -49409 -63017 -78251 -80026 -61537 -59580 -68504 -78378 -68094 -58672
8900 -58672 -72833 -62379 -55521 -43945 -28895 -32051 -60330 -65206 -41465 -7257 -18737 -24097 -10410
8887 -10410 -21434 -5753 7461 -49254 -36038 -21794 1366 -7734 -34119 2061 33350 21117
8875 21117 41099 59064 4770 -41099 -82927 -58253 -35057 -1021 21660 41548 2452 -21271
8863 -21271 -30581 11167 14855 -89 -13327 -31255 -70027 -45068 -24062 -40757 -30782 -919
8851 -919 46437 64160 23955 -20683 -35647 -24732 -19569 -26185 -42572 -42578 -12140 33050 6340
8838 6340 6951 11864 -17553 -2335 49274 55072 28410 18964 -17583 -39061 -70294 -77007 -28921
8825 -28921 -1478 33895 27888 5398 13156 -32075 -36714 3311 8732 -8921 -56 24042 20377
8812 20377 -6554 -5963 5963 9637 51705 48392 35299 41773 46407 55773 67006 37717 -17859
8799 -17859 14997 27768 17583 16725 -14024 -52837 -19157 -14484 -40964 -65610 -33790 -522
8787 -522 -29353 -45289 -34995 -35835 -35219 -15907 -12028 -40909 -37354 -24871 27169 41720 -8226
8774 -8226 -27881 8182 -6644 -14974 19018 23391 6342 18479 30549 34214 -22347 -38560 -1985
8761 -1985 -54470 -92346 -47950 -14412 2209 -3563 7158 26790 1478 -25710 -6563 29575
8749 29575 33431 19535 67727 89589 65377 19504 -11624 -40556 -89212 -68878 -46413 -50923
8737 -50923 -44382 -33800 -60022 -80700 -57930 -14721 -798 -4468 2403 5110 7250 11156 -23403
8724 -23403 -31090 18922 29904 7000 57150 62201 3054 14199 57276 92397 95292 66162
8712 66162 24485 -25606 -6182 23695 82482 59123 21767 846 16214 27576 36451 -34610
8700 -34610 -52850 -19668 207 11347 11389 -5442 5483 54726 31464 -24508 -49962 -60693
8688 -60693 -52718 -34285 -4326 8598 -44784 -44345 -59268 -63048 -35404 -46053 -43438 -33179 -17948
8675 -17948 1618 -15273 12017 37011 63921 57183 28142 55615 48268 28796 371 6686
8663 6686 17092 10454 687 -16823 -37980 -45382 -20278 -7612 -26123 -84245 -47953 -21844 -47147
8650 -47147 -38820 13734 13945 27563 1711 -11856 38433 36506 30814 7136 22479 61378 54331
8637 54331 22890 2768 -13147 -13402 -32997 -35038 -51513 -36150 -35644 -12259 -5227 -2550 19952
8624 19952 28625 41703 43982 52819 14218 38731 93704 140655 128253 77934 48089 58865
8612 58865 71883 45233 -709 -35975 -1527 3808 12540 31593 -73 18559 7258 -9794
8600 -9794 2160 25013 20704 5230 -26510 -43343 -21730 -22217 -49360 -70912 -43374 -27847 -64163
8587 -64163 -76729 -43038 -30485 -39105 -22478 -22728 -15612 -25874 -42051 6661 25041 -23038 -81358
8574 -81358 -112567 -80015 -49662 9725 37723 35214 15729 -8286 21547 8683 -11915 20935
8562 20935 26055 25535 33143 43718 75195 52382 28738 -1593 26550 18164 -4720 -28513 -43619
8549 -43619 -25206 22809 -3369 -20062 -3380 46448 24429 35136 34649 64603 64360 61239 30974
8536 30974 63917 33171 3137 38892 60973 77764 109960 129365 122533 132902 150303 129230
8524 129230 90157 53015 29305 26198 48249 38319 27772 57871 93174 57278 19192 833
8512 833 2793 -13040 -12839 6038 -13426 -37585 -26003 42017 40011 18713 -537 -80686 -98960
8499 -98960 -101715 -84764 8833 20170 1964 -33802 -71812 -42010 -4685 -45396 -55321 49471
8487 49471 90793 89664 97783 100879 115664 162753 204951 148256 132496 109105 78619 66291
8475 66291 40894 30949 38507 26118 12517 -3472 1076 42793 42593 4440 -18070 20428 36411
8462 36411 59927 85226 81013 35335 39069 38489 -163 -15190 5621 17136 31373 31414 15584
8449 15584 10446 2574 5688 11596 -14167 -7180 -11406 -11447 21424 90931 114743 115140 136146 131293
8435 131293 116919 113691 99356 52221 44364 38755 24804 35773 78405 114995 124467 98890
8423 98890 9995 -45639 -49663 -37486 -32896 -19164 8305 41912 45993 46553 76322 70543 -9795
8410 -9795 -30708 -35377 -49272 -19966 -2472 25445 28736 1980 12075 -22113 -14364 -4277 1111
8397 1111 14249 27985 -23871 -35064 -45735 -13121 17727 40708 20851 34715 50492 49881
8385 49881 18804 29352 41011 47885 80480 62032 39778 14073 -13853 -16128 -9378 -33767
8373 -33767 -48053 -43449 -38616 -9095 -12287 24221 56500 59092 44280 61110 67011 55114 54420
8360 54420 34776 5784 -10590 5269 33670 22196 31487 26202 24327 20106 21603 7140 20286
8347 20286 43694 25282 -34969 -24925 51911 83149 62079 65979 65054 37711 -3601 2058 61854
8334 61854 84238 60724 58441 80102 70495 72682 57798 33691 12339 15691 44315 35817 3046
8321 3046 48778 67392 65003 60787 36102 29355 17299 20088 28239 5706 -35206 -58940 -56788
8308 -56788 -25650 -8090 -28807 -32925 -16003 -9561 12879 5852 -16537 21477 90247 123271
8296 123271 77693 54453 45225 47074 48293 35922 37200 46270 21016 11652 42309 19220 16985
8283 16985 688 -8941 -8471 7247 16824 36098 10039 22468 6087 -9607 13031 4194 1693
8270 1693 18981 20664 18319 35595 57168 49763 41115 -18588 -36301 -28026 -41079 -16287 36375
8257 36375 25568 17200 -10271 -13826 -14755 -14586 -9534 -24389 -56411 -58160 -63949 -50687 -38989 -68550
8243 -68550 -84536 -79393 -50866 -22185 -41668 -61282 -74960 -59678 -23800 1334 15372 19961
8231 19961 13117 -1320 -9606 -30318 -57307 -93712 -71171 2334 23669 5557 6597 -4165
8219 -4165 -57092 -31484 21018 -3162 -30498 -18258 -4163 -21091 -24733 -56800 -38750 -6370
8207 -6370 7850 -12651 -11257 -5567 -22878 -35055 13965 38292 66946 63793 44607 39974 33351
8194 33351 -4636 -36980 -42346 -32875 14331 -12619 -77120 -90173 -26093 -3874 -19809 29302
8182 29302 43160 56839 54433 10667 -17837 -44842 -43004 -50550 -54599 -44592 -38691 -20343 10548
8169 10548 15089 22317 29162 42204 19935 -2473 -22661 -11621 14150 14754 -24223 -21660 -17472
8156 -17472 -28188 -47062 -75223 -77947 -40068 -502 40654 56744 93046 85455 72642 13157
8144 13157 -53392 -94087 -29886 2007 -1633 37895 66761 57064 32030 7134 8477 3222 -4429
8131 -4429 -23664 -5349 -10662 -8916 2020 18898 32448 21706 12021 12146 -45 -28614 -12018
8118 -12018 -13175 -17010 -7189 5670 15120 38846 36563 35356 32431 7418 -6318 -1282 -22518
8105 -22518 -17061 -39926 -71429 -66630 -107402 -92554 -40114 6489 36872 61946 42193 23271
8093 23271 11213 10418 -26669 -4773 17324 13545 -29488 -38722 -32698 -25565 -12293 -2523 22363
8080 22363 48498 57825 14243 -25287 -37497 -24181 18609 39255 36646 34708 30188 36198 7635
8067 7635 -2626 -19321 -31785 -3252 45051 52556 11190 -18042 7530 20388 -5259 19749
8055 19749 55394 39400 33582 6251 9027 -4202 -7770 35682 40585 29880 31081 13188 -20443
8042 -20443 -22461 -35101 -61657 -69987 -36968 -48458 -66131 -47429 -33434 -12850 17718 44989
8030 44989 61501 74446 47059 12484 12735 -10156 -32760 -35922 -55690 -72140 -45152 -14586
8018 -14586 4425 -7782 -44932 -79030 -70744 -30936 -50537 -56589 -69705 -69495 -87640 -98864 -65508
8005 -65508 -31362 -20685 -54375 -41320 2010 54192 43735 27993 -6572 -25027 -35792 -66909
7993 -66909 -77635 -50162 6111 -2289 -23327 -12546 -4252 2288 35053 33714 -12495 -4742 32610
7980 32610 41016 51059 13199 -55885 -77151 -26598 9567 -15406 -52573 -62746 -85066 -59772
7968 -59772 -61895 -34801 -20467 15889 8235 7385 46319 70249 12412 -3397 -16015 -6513 1099
7955 1099 6948 -8203 -14625 21226 33669 34808 42595 55009 35738 3259 -2683 10133 -11418
7942 -11418 -25951 -46068 -29293 29007 50536 59362 65111 54662 44031 31131 28955 28745 21223
7929 21223 17109 19419 10096 -5024 -51574 -32524 5869 10994 224 -14938 3711 -23904 -21903
7916 -21903 -43967 -80474 -93859 -61677 -20501 -42314 -61866 -36670 -16742 -28957 -55260 -35478
7904 -35478 -31195 -40082 -33876 -1592 59771 34876 20495 18452 8228 5857 -1542 -22451 -8
7891 -8 27810 8024 15742 36191 13640 -20301 -36986 -56515 -59517 -95509 -64718 -27740 10952
7878 10952 18999 15200 46408 73070 59534 74931 51849 18119 8595 -8084 -23873 -15228 -3894
7865 -3894 -2787 22917 32921 -9176 -29497 -1425 3376 42324 45671 21756 -12472 -3613 15186
7852 15186 4535 38591 49254 24270 39443 38850 21473 9255 36347 16408 23572 -545
7840 -545 -25249 -38292 -19319 10464 22540 -31330 -86441 -114906 -79406 -45225 -47084 -62503
7828 -62503 -23717 20347 3285 30145 37731 -11888 -40427 -49193 -32689 14894 32928 32610 21220
7815 21220 15640 22083 33974 -4555 -19423 -32415 -50351 -47546 -29168 -32383 -33497 6962 46413
7802 46413 18424 36560 34793 18762 29770 49229 36887 4135 -26390 -20824 -46059 -38092
7790 -38092 -35102 -27205 -7485 -14909 6425 48226 89349 104807 95322 65306 34711 408 8288
7777 8288 22034 31272 30906 47639 34879 12764 14984 52902 61417 27421 5209 86 -16129
7764 -16129 -23832 -49395 -6085 18719 6816 5214 -20158 -21242 3552 -12608 -44712 -60881
7752 -60881 -98601 -45392 -22442 -14866 -25680 -31 -29019 -22955 -39182 -26784 -26236 -23643 -53809
7739 -53809 -26378 -29075 -34791 -30813 -43420 -32688 7444 -40342 -59491 -24820 -13980 3278
7727 3278 -1150 673 23142 42484 45650 33258 32328 -2776 -38880 -59921 -69769 -3919 32494
$$ [...]
##END NTUPLES=NMR SPECTRUM
##END=
