##TITLE=Analysis number 318038
Compound Code rh 00119
Project Code adrs
Chemist Name prosynth
##JCAMPDX= 6.0         $$ Bruker NMR JCAMP-DX V2.0
##DATA TYPE= NMR SPECTRUM
##DATA CLASS= NTUPLES
##ORIGIN= Bruker BioSpin GmbH
##OWNER= nmr
$$ XWIN-NMR		Version 3.5
$$ Mon Mar 13 14:07:05 2006 GMT Standard Time (UT+0h)  MAYBRIDGE\nmr@NMR_250MHZ
##.OBSERVE FREQUENCY= 250.131544655141
##.OBSERVE NUCLEUS= ^1H
##.ACQUISITION MODE= SIMULTANEOUS (DQD)
##.ACQUISITION SCHEME= undefined
##.AVERAGES= 16
##.DIGITISER RES= 18
##SPECTROMETER/DATA SYSTEM= dpx250
##.PULSE SEQUENCE= zg30
##.SOLVENT NAME= DMSO
##.SHIFT REFERENCE= (INTERNAL, DMSO, 0, 16.522)
##AUDIT TRAIL= $$ (NUMBER, WHEN, WHO, WHERE, WHAT)
$$ ##TITLE= Audit trail, XWIN-NMR		Version 3.5
$$ ##JCAMPDX= 5.01
$$ ##ORIGIN= Bruker BioSpin GmbH
$$ ##OWNER= nmr
$$ C:\u/data/dgb/nmr/ADRS/600/pdata/1/auditp.txt
$$ ##AUDIT TRAIL=  $$ (NUMBER, WHEN, WHO, WHERE, WHAT)
(   1,<2006-03-13 14:06:43.70 +000>,<MAYBRIDGE\nmr>,<NMR_250MHZ>,
      <created by zg, POWCHK disabled, PULCHK disabled
       configuration hash MD5:
       84 BC 41 DB A1 6E 1D 46 DA 25 12 A5 C1 ED C5 3A
       data hash MD5: 64K
       53 83 47 4D BD B4 85 DA 16 17 89 7D F6 B6 B0 58>)
(   2,<2006-03-13 14:06:56.66 +000>,<MAYBRIDGE\nmr>,<NMR_250MHZ>,
      <Start of raw data processing
       ef LB = 0.3 FT_mod = 6 PKNL = 1 SI = 32K 
       data hash MD5: 32K
       25 2F 23 B5 FF 67 4D F2 7F A8 F2 A3 88 09 BD EB>)
(   3,<2006-03-13 14:06:58.20 +000>,<MAYBRIDGE\nmr>,<NMR_250MHZ>,
      <apk 
       data hash MD5: 32K
       E0 BE 97 9A CB B4 D2 E1 E6 FC 5E BD E0 C8 84 75>)
(   4,<2006-03-13 14:06:59.04 +000>,<MAYBRIDGE\nmr>,<NMR_250MHZ>,
      <abs ABSG = 5 
       data hash MD5: 32K
       D9 8E A3 E8 84 54 AE C2 2B 6B 32 46 FA 29 83 2D>)
$$ ##END=
$$ 
$$ hash MD5
$$ F4 8B B1 02 63 C9 1C C9 4D F0 AC 00 86 85 DB 41
##$RELAX= 
##$RELAX= 
##$RELAX= 
##$RELAX= 
##$RELAX= 
##$RELAX= 
##$RELAX= 
$$ Bruker specific parameters
$$ --------------------------
##$DU= <C:\u>
##$EXPNO= 600
##$NAME= <ADRS>
##$PROCNO= 1
##$TYPE= <nmr>
##$USER= <dgb>
##$AMP= (0..31)
100 100 100 100 100 100 100 100 100 100 100 100 100 100 100 100 100 100 
100 100 100 100 100 100 100 100 100 100 100 100 100 100 
##$AQSEQ= 0
##$AQ_mod= 3
##$AUNM= <au_zg>
##$AUTOPOS= <40 >
##$BF1= 250.13
##$BF2= 250.13
##$BF3= 250.13
##$BF4= 250.13
##$BF5= 500.13
##$BF6= 500.13
##$BF7= 500.13
##$BF8= 500.13
##$BYTORDA= 1
##$CFDGTYP= 0
##$CFRGTYP= 5
##$CHEMSTR= <none>
##$CNST= (0..31)
1 1 145 1 1 1 1 1 1 1 1 1 1 1 1 1 1 1 1 1 1 1 1 1 1 1 1 1 1 1 1 1 
##$CPDPRG= <>
##$CPDPRG1= <>
##$CPDPRG2= <>
##$CPDPRG3= <>
##$CPDPRG4= <mlev>
##$CPDPRG5= <mlev>
##$CPDPRG6= <mlev>
##$CPDPRG7= <mlev>
##$CPDPRG8= <mlev>
##$CPDPRGB= <>
##$CPDPRGT= <>
##$D= (0..31)
0 1 0 0 0 0 0 0 0 0.06 0 0 0 0 0 0 0.0002 0 0 0 0 0 0 0 0 0 0 0 0 0 0 
0 
##$DATE= 1142258802
##$DBL= (0..7)
120 120 120 120 120 120 120 120 
##$DBP= (0..7)
150 150 150 150 150 150 150 150 
##$DBP07= 0
##$DBPNAM0= <>
##$DBPNAM1= <>
##$DBPNAM2= <>
##$DBPNAM3= <>
$$ [...]
##$SUBNAM7= <"">
##$SUBNAM8= <"">
##$SUBNAM9= <"">
##$SW= 20.6930455092707
##$SWIBOX= (0..15)
0 0 3 0 0 0 0 0 0 0 0 0 0 0 0 0 
##$SW_h= 5175.983436853
##$TD= 65536
##$TD0= 1
##$TE= 294.16
##$TE2= 300
##$TE3= 300
##$TEG= 300
##$TL= (0..7)
0 120 120 120 120 120 120 120 
##$TP= (0..7)
150 150 150 150 150 150 150 150 
##$TP07= 0
##$TPNAME0= <>
##$TPNAME1= <>
##$TPNAME2= <>
##$TPNAME3= <>
##$TPNAME4= <>
##$TPNAME5= <>
##$TPNAME6= <>
##$TPNAME7= <>
##$TPOAL= (0..7)
0.5 0.5 0.5 0.5 0.5 0.5 0.5 0.5 
##$TPOFFS= (0..7)
0 0 0 0 0 0 0 0 
##$TUNHIN= 0
##$TUNHOUT= 0
##$TUNXOUT= 0
##$USERA1= <user>
##$USERA2= <user>
##$USERA3= <user>
##$USERA4= <user>
##$USERA5= <user>
##$V9= 5
##$VALIST= <valist>
##$VCLIST= <CCCCCCCCCCCCCCC>
##$VD= 0
##$VDLIST= <DDDDDDDDDDDDDDD>
##$VPLIST= <PPPPPPPPPPPPPPP>
##$VTLIST= <TTTTTTTTTTTTTTT>
##$WBST= 1024
##$WBSW= 4
##$XGAIN= (0..3)
0 0 0 0 
##$XL= 0
##$YL= 0
##$YMAX_a= 328425
##$YMIN_a= -517974
##$ZGOPTNS= <>
##$ZL1= 120
##$ZL2= 120
##$ZL3= 120
##$ZL4= 120
##$ABSF1= 16.522
##$ABSF2= -4.171173
##$ABSG= 5
##$ABSL= 3
##$ALPHA= 0
##$AQORDER= 0
##$ASSFAC= 0
##$ASSFACI= 0
##$ASSFACX= 0
##$ASSWID= 0
##$AUNMP= <proc_1d>
##$AZFE= 0.1
##$AZFW= 0.1
##$BCFW= 0
##$BC_mod= 0
##$BYTORDP= 0
##$COROFFS= 0
##$CY= 12.5
##$DATMOD= 1
##$DC= 0
##$DFILT= <>
##$DTYPP= 0
##$F1P= 14.0000005364418
##$F2P= -0.99999901652339
##$FCOR= 0.5
##$FTSIZE= 32768
##$FT_mod= 6
##$GAMMA= 0
##$GB= 0
##$INTBC= 1
##$INTSCL= 1
##$ISEN= 128
##$LB= 0.3
##$LEV0= 0
##$LPBIN= 0
##$MAXI= 10000
##$MC2= 0
##$MEAN= 0
##$ME_mod= 0
##$MI= 0
##$NCOEF= 0
##$NC_proc= -4
##$NLEV= 6
##$NOISF1= 0
##$NOISF2= 0
##$NSP= 0
##$NTH_PI= 0
##$NZP= 0
##$OFFSET= 16.522
##$PC= 1
##$PHC0= 166.4974
##$PHC1= 8.538045
##$PH_mod= 1
##$PKNL= yes
##$PPARMOD= 0
##$PSCAL= 4
##$PSIGN= 0
##$REVERSE= no
##$SF= 250.13
##$SI= 32768
##$SIGF1= 0
##$SIGF2= 0
##$SINO= 400
##$SIOLD= 32768
##$SREGLST= <1H.DMSO>
##$SSB= 0
##$STSI= 32768
##$STSR= 0
##$SW_p= 5175.98343685301
##$SYMM= 0
##$S_DEV= 0
##$TDeff= 65536
##$TDoff= 0
##$TI= <Analysis number 999999
Compound Code 99
Book Reference 9
Project Code 9>
##$TILT= no
##$TM1= 0
##$TM2= 0
##$TOPLEV= 0
##$USERP1= <user>
##$USERP2= <user>
##$USERP3= <user>
##$USERP4= <user>
##$USERP5= <user>
##$WDW= 1
##$XDIM= 32768
##$YMAX_p= 363550557
##$YMIN_p= -478514
$$ End of Bruker specific parameters
$$ ---------------------------------
##NTUPLES= NMR SPECTRUM
##VAR_NAME=  FREQUENCY,     SPECTRUM/REAL,   SPECTRUM/IMAG
##SYMBOL=    X,             R,               I
##VAR_TYPE=  INDEPENDENT,   DEPENDENT,       DEPENDENT
##VAR_FORM=  AFFN,          ASDF,            ASDF
##VAR_DIM=   32768,         32768,           32768
##UNITS=     HZ,            ARBITRARY UNITS, ARBITRARY UNITS
##FACTOR=    0.157963299565203, 1,           1
##FIRST=     4132.6476996994, 0,             0
##LAST=      -1043.33573715361, 0,           0
##MIN=       -1043.33573715361, -478514,     0
##MAX=       4132.6476996994, 363550557,     0
$$ Real data points
##PAGE= N=1
##DATA TABLE= (X++(R..R)), XYDATA
$$ [...]
15937D9577p3005p1562P9441K1765j1326j04635O435P3823O3901J32257j9355
15926A47316m8526K0516k0613r3026l9214P9906N5816j06316n6918O0453l2928
15915c3534K4907Q6866J17487j739o2133N422K4694k9268m1228j15228j23925
15904a47679K4177o1990r158L5642L0992Q639j4082j13159L8056J15116n0298
15893a43744K1622L1634J14767J39023o9861j25528r8583J2813R6092K079J08637
15882H8951J622n972P7496j1671n4755n6912P8956Q8772j04893j34916J13849
15871H0527J62165q174N6958J27026n6649r3441j45076j42477l3025Q071n0302
15860i4397M7777n1491O6548n8001K245N024Q0290M5551m388K2346l7832j36436
$$ plain form
15937 49577 -23428 -94990 -15549 6216 -5110 -109745 -103310 -29487 34414 166671 147316
15926 147316 98790 119306 98693 5667 -33547 46359 102175 -4141 -61059 -606 -33534
15915 -33534 -8627 78239 195726 193987 131854 137276 161970 132702 91474 -23754 -147679
15904 -147679 -123502 -185492 -194650 -159008 -128016 -119377 -133459 -246618 -208562 -93446 -143744
15893 -143744 -122122 -90488 24279 163302 93441 -32087 -130670 -117857 -21765 -19686 88951
15882 88951 90573 84601 162097 150426 95671 38759 117715 206487 101594 -33322 80527
15871 80527 242692 234518 291476 418502 361853 268412 123336 -19141 -52166 -44095 -94397
15860 -94397 -46620 -98111 -31563 -89564 -87319 -82295 -2005 43546 39158 61504 23672 -112764
15848a12764R1340k833l992J11965J20070j8171n1956R481o1114l2966N3541L5253
15836A37854j65299k8929k9668l0786J24940J62161l0679j04795L3557J44241
15826B12597q2511K9273p6071q4401j08790L4985j273N1532N7617j0115K2345
15815D5188j10859j58539P2415r336k7614j86189n6668K21369R4273n736N6603
15804f5093O5494O81J59898M7565j22052j39938P9321J84736n4222J3441P4038
15793B43869m4322j75249j4340Q470o0220L6211J14841O3153j5343j03489m834
15782D8747j8738n7151P6609J46587p005j08603n0653m6075J03035L5661O7293
15771A89707J3300O3572p0149j13905p6356M8914Q4985q2049q597l3615o0428
$$ plain form
15848 -112764 -21424 -24257 -28249 83716 203786 185615 133659 143140 82026 49060 102601 137854
15836 137854 -27445 -56374 -86042 -116828 8112 170273 139594 34799 68356 212597
15826 212597 130086 159359 83288 -1113 -109903 -74918 -76191 -24659 32958 22843 45188
15815 45188 -65671 -224210 -151795 -161131 -188745 -374934 -431602 -210233 -115960 -121696 -65093
15804 -65093 401 1082 160980 208545 86493 -53445 25876 210612 156390 169831 243869
15793 243869 199547 24298 9958 18428 -41792 -5581 109260 172413 157070 53581 48747
15782 48747 30009 -27142 49467 196054 189049 80446 29793 -16282 86753 122414 189707
15771 189707 203007 266579 196430 82525 6169 55083 140068 58019 49422 15807 -44621
15760d4621k7144r4379M1917R5117J04779K1189r6700j15041J10898J62243P6104
15749B34362n667j53900J0516L9342r8324p6474Q972L5058j23620R3012P9084
15738D2361Q1846q9459P1874Q5010j02633n8327o1540j67331l6462L469M884J32579
15726i3729M0058Q2595Q2354P4437j02702q2582o4224l1032k9625J67465J10652
15715A53667k5064L8815n3635j02900J3389L9422J2229o239l3228J6359j1836
15704D0979j06227n3602K9047k2189j46995L812J47891K6819Q2943J93618O4386
15693B60482j63300n7391o8243q1451j7444j2831l80L3121K34881R7211L0327
15682B54982P0810J4196j03214o3811l3704O7143l1036j23873j29469L5249k0673
$$ plain form
15760 -44621 -71765 -166144 -124227 -29110 75669 96858 158 -114883 -3985 158258 234362
15749 234362 228695 74795 85311 124653 26329 -50145 -41173 -6115 -129735 -36723 42361
15738 42361 124207 34748 106622 191632 88999 30672 -30868 -198199 -234661 -231192 -226308 -93729
15726 -93729 -53671 28924 111278 185715 83013 431 -63793 -94825 -124450 43015 153667
15715 153667 128603 167418 113783 10883 24272 63694 75923 69684 36456 52815 40979
15704 40979 -65248 -118850 -89803 -111992 -258987 -255175 -107284 -80465 2478 196096 260482
15693 260482 97182 39791 -28452 -109903 -127347 -140178 -140558 -107437 127444 224655 254982
15682 254982 325792 339988 236774 172963 139259 206402 175366 51493 -77976 -42727 -63400
15671f3400Q5945Q4636l0019m2755M8307j6734L7609j19603k0238J27657j4274
15660G7131j28591j09263J01462M8368q9736K2911M8936k4879k5293J6963p8787
15649a40778L4780N9366L2933N778p7011k8809Q282J5926O484k7423l2367j00067
15637b42906K46L5361m708n4801m8432K2481M1730N9333R5377k1046J5085O2231
15625d0049n0938j17825j9606K5509Q2338L3250j7362k8829L9420J83624N1300
15614A40832o464l3296p3453K8532R0901N0733n8208q3623l9733J4866J04302
15603A35389J1662q3456r8744J2655O0429R5418M0987n4699j18461K1480j44129
15592a21469n0636m5832K09544P9638L4977J5126R1439L4046j68430o1805o7497
$$ plain form
15671 -63400 22545 107181 77162 34407 82714 65980 103589 -16014 -36252 91405 77131
15660 77131 -51460 -160723 -59261 -10893 -100629 -77718 -28782 -53661 -78954 -61991 -140778
15649 -140778 -105998 -46632 -13699 -7921 -84932 -113741 -105459 -89533 -83049 -110472 -142839 -242906
15637 -242906 -242660 -207299 -212007 -266808 -315240 -292759 -251029 -191696 -96319 -117365 -102280 -40049
15625 -40049 -90987 -208812 -228418 -202909 -120571 -87321 -104683 -133512 -94092 89532 140832
15614 140832 134368 101072 27619 56151 147052 197785 139577 55954 16221 31087 135389
15603 135389 147051 63595 -35149 -22494 37935 133353 174340 119641 1180 22660 -121469
15592 -121469 -172105 -217937 -8393 71245 106222 121348 212787 246833 78403 16598 -50899
15581e0899n8381O7789J28570J2235r6487j21198L931R1814o0177j6258J11934
15570A2873J1784k9789k7725n3929n6915j06247K0662K6707J2933P4122N3663
15559f1861R3878m0302j9252n348k4778M0449K9109O0608N100j41532j1330J6771
15547e8488k256m6729O6293R6846Q0608j01272j25105N4777K0460p4134m246J46572
15535E3326j0289m6248j22232l1065J08792j0063m3490o7237R1408J6338O6360
15524E600k6958k0660J43071J22689L3675l5790m1932m1351k842q8012j35965
15513h8475K6850L6112p0821P234o5536M2317N2017J28726l7692p4383J37201
15502I3550N3876K2152L7895r7216j48563q9402l6557r5274J523O1902P3197M4483
$$ plain form
15581 -50899 -109280 -41491 87079 99314 2827 -118371 -114440 -22626 -82803 -99061 12873
15570 12873 24657 -5132 -32857 -86786 -143701 -249948 -229286 -202579 -189646 -115524 -61861
15559 -61861 32017 -8285 -27537 -32885 -57663 -17214 11895 72503 77603 -63929 -75259 -58488
15547 -58488 -60744 -107473 -41180 55666 136274 35002 -90103 -35326 -14866 -89000 -93246 53326
15535 53326 43037 -3211 -125443 -156508 -47716 -57779 -101269 -168506 -77098 -60760 5600
15524 5600 -21358 -42018 101053 223742 257417 221627 179695 138344 135502 47490 -88475
15513 -88475 -61625 -25513 -96334 -89100 -154636 -112319 -60302 68424 30732 -43651 93550
15502 93550 147426 169578 207473 110257 -38306 -127708 -164265 -259539 -258016 -196114 -122917 -78434
15490g8434Q5126K6498R2727k1979o9861j0250n3293K3419L9081o0236k7484p8273
15478a32959j68684J3188J78798J72766M1954J1506l5924n6377l8877k7346K3180
15467a8775p0078l9484J16055R8214k00990j49081K8118N4169J12105k4792N9108
15456c5431L0964J01927m0112n9305m8472N346j9044k9884L7806J57813j0778
15445I0830p7662j13809M46M7889J18921L249O0026l7983k0914Q8075M7158m2249
15433A63977L7371p302j07500p042k4149p1671J5321J18297j51170j3331R2804
15422D5605j0800o4579k5220M3119o2533l9263j9114R3765J64668J5871j15016
15411B6503p2165M8780L4217l1434M5010P146N2199k179j28571k4747M4515j8202
$$ plain form
15490 -78434 6692 33190 125917 103938 34077 23827 -29466 -6047 33034 -27202 -54686 -132959
15478 -132959 -301643 -288455 -109657 63109 105063 116569 80645 24268 -14609 -41955 -18775
15467 -18775 -88853 -128337 -12282 85932 -115058 -264139 -236021 -181852 -69747 -94539 -35431
15456 -35431 -4467 97460 57348 -1957 -50429 -45083 -64127 -94011 -56205 101608 90830
15445 90830 13168 -100641 -100195 -52306 66615 69864 129890 91907 70993 159068 206226 163977
15433 163977 201348 194046 86546 79504 55355 -16316 -995 117302 -33868 -47199 45605
15422 45605 34805 -29774 -54994 -11875 -74408 -113671 -132785 -39020 125648 141519 26503
15411 26503 -45662 3118 37335 5901 50911 58057 110256 108077 -20494 -45241 -726 -18928
15399a8928o6481O9690K341k3961p074J6529m8951o519n314R5599o9827k3545
15387h6441J54166o8050J32492L297j1820L675o2138o0865k3173N1774K7530K4272
15375H4719O3370m734o2094p1372n4717p5891l0751R4961O6764M27O20l5261j1540
15362c5499K1306J02884k8620L6983j5963J3456O3416j16533k06374j03310O0008
15351b08246J6088K7706L7984J8540M4944P7144j2169m4593j0717O1333j5557
15340g543n1436n3138j3106o5565m9680J51077Q5912Q8488n3103M9370P2518q4423
15328F9371o4737p6040N341J49527P3575j27803N084Q8519k6201N7740r319j19166
15316B5891M038j8929N5837j4101p102j39808j42393P8010P6904R0688P9992O8532
$$ plain form
15399 -18928 -85409 -15719 -13378 -37339 -44413 -27884 -76835 -83354 -88668 6931 -62896 -86441
15387 -86441 67725 -325 132167 135464 123644 127319 65181 4316 -18857 32917 60447 84719
15375 84719 148089 143355 81261 9889 -44828 -120719 -151470 -56509 10255 10682 11302 -23959 -35499
15362 -35499 -14193 88691 60071 97054 81091 94547 157963 41430 -164944 -268254 -208246
15351 -208246 -192158 -164452 -126468 -107928 -62984 14160 1991 -42602 -53319 8014 -7543
15340 -7543 -58979 -112117 -125223 -190788 -240468 -89391 -3479 85009 31906 81276 153794 69371
15328 69371 4634 -71406 -66065 83462 157037 29234 34318 122837 96636 154376 145057 25891
15316 25891 29929 11000 66837 52736 45634 -94174 -236567 -158557 -81653 9035 89027 157559
15304A57559j25037j08624p7414o2513q7560O6134K17585J07539l7341M6017J044
15293I7389O2756n057m4581j06999k6944R9382q4854J2728k7269m6269l1445j6109
15281a17272K9950J32928J42915m5690p3276J5930k1955J4916j59439j05608L5421
15270a51180J25574l8485p7969N17J78051K34729m3487n6136k69138k18786P5952
15259b40358J00908o5217o8577O4497P0218j8691j48739N4253J70383Q9457K811
15248A0945M4157o4401p3155M6304K6270P9109P205k2446o7523n5949P197J3972
15236d8315j10595J78568J19259n61r7870o912J83124j24405m9253M8149j5680
15225G5509K7263n464q3255j28151J6654N1947k2914L333N2760Q7700L5543o1283
$$ plain form
15304 157559 32522 -76102 -153516 -216029 -303589 -237455 -19870 87669 50328 96345 97389
15293 97389 160145 155088 110507 3508 -23436 75946 -8908 3820 -23449 -69718 -101163 -117272
15281 -117272 -87322 45606 188521 142831 69555 85485 63530 78446 -80993 -186601 -151180
15270 -151180 -25606 -64091 -142060 -141543 36508 271237 227750 171614 -97524 -316310 -240358
15259 -240358 -139450 -204667 -273244 -208747 -138529 -157220 -305959 -251706 -81323 8134 10945
15248 10945 55102 -9299 -82454 -36150 -9880 69229 76434 53988 -13535 -69484 -62287 -48315
15236 -48315 -158910 19658 138917 138356 40486 33574 216698 92293 43040 91189 75509
15225 75509 102772 97308 14053 -114098 -97444 -45497 -68411 -65078 -12318 75382 110925 49642
15213D9642K250n4853j13443J44539k568K3604J34169M2324k3050j716j97863
15202C035L0091l0903j4817r1934l6858K0079l1653L8116R6866J6536k7081m962
15190c3485K8363j10734K1963j7990l4999o9709j6651J42722J12468O081m3061
15179a5032J67511N1006l0200j76j37357k6461k9983r316M601l2249j25070L8624
15167a44102K7273k5407O6890L6161K0958K0123n058J0717M4370o8391r7880L749
15155a10597J37922L5499m1490J37255j53290k73998m4366N6482J31923J14711
15145i949J813K2697N3581p0119m4889Q3897k3484l7901n8006P457o7363o4713
15133b06979o381J4066Q4706L3363Q1967O1409N3894p9322n9125q070p315j13555
$$ plain form
15213 49642 51892 -2961 -116404 28135 25567 49171 183340 225664 202614 200898 3035
15202 3035 33126 2223 -12594 -104528 -141386 -121307 -152960 -114844 -17978 -1442 -28523 -33485
15190 -33485 -5122 -115856 -93893 -111883 -146882 -216591 -233242 -90520 21948 28029 -15032
15179 -15032 152479 203485 173285 173109 35752 9291 -20692 -30008 -25407 -57656 -182726 -144102
15167 -144102 -116829 -142236 -75346 -39185 -18227 1896 -3162 7555 51925 -16466 -114346 -110597
15155 -110597 27325 62824 21334 158589 5299 -268699 -313065 -256583 -124660 -9949
15145 -9949 -8136 14561 68142 -1977 -46866 37031 13547 -24354 -82360 -74903 -142266 -206979
15133 -206979 -213360 -199294 -114588 -81225 742 62151 116045 36723 -22402 -30472 -37787 -151342
15121a51342L1155K26281R3695o5473k3325k7567r8229j48870J5130J75282K9898
15110E6635L4760J55583p2915o3114r7136J6644J08445j8746K4322O662j37392
15099A3748j16433j7205k2908r5779o8320R8069J47186M2554O7906k9735L8559
15088E7642M0161j62607p5687n9041J20404L3123l1816j31302L5984K53990j4420
15077F6431p3879j05444q4411J08351Q5669K0q9051q9363O0321K01931J5477k1964
15065G4088J20126j6685j98075o6890m0286j21405K0440m2024N7266O1720n6131
15054b07856Q0315P4323n838j06069o5607J7930N1383J07965P2431L4859p5143
15043b1307m4655k9739L6299j5188j10879j29043J12151Q2359m8339K9317J30548
$$ plain form
15121 -151342 -120187 106094 199789 134316 110991 83424 -14805 -163675 -148545 26737 56635
15110 56635 91395 246978 174063 110949 13813 30457 138902 120156 144478 151140 13748
15099 13748 -102685 -119890 -142798 -238577 -306897 -208828 -61642 -19088 48818 19083 57642
15088 57642 97803 -64804 -140491 -199532 -79128 -46005 -77821 -209123 -173139 80851 66431
15077 66431 -7448 -112892 -197303 -88952 -3283 -3263 -92314 -181677 -121356 80575 96052 74088
15065 74088 194214 177529 -20546 -87436 -127722 -249127 -228687 -270711 -213445 -151725 -207856
15054 -207856 -127541 -53218 -59056 -165125 -230732 -212802 -161419 -53454 18977 53836 -21307
15043 -21307 -65962 -95701 -59402 -74590 -185469 -314512 -202361 -120002 -168341 -139024 -8476
15032h476l5091J03025m1918l5848N2947P901m376m1294P2898r7148o8901L9173
15020e7108J31231m7445j32301K6462J16570J47785L563m7680q1399n5648l6653
15009c2623m9072Q5715N9284Q4140q6348q8159k212m8419p5960P833l0092j01279
14997b77192R4382Q0611j6066j2998J89937N4238l0836L1783M0479m7960k7880
14986G8498r4811m7355r7751p0059p2649K04326M1438Q1652m7867j13871L2109
14975a06340P8108R8288J2291m4646j06274J7523N3694r8714Q3752n7377j74461
14964b44156O2652J25576N7609q3830P5797M7021J0166P1960p0291j03588J05435
14953E4351j00687l299P7542L4263K3534q9308o6706j0443k2166J19283J62513
$$ plain form
15032 -8476 -43567 59458 17540 -18308 34639 42540 38164 -3130 69768 -27380 -96281 -57108
15020 -57108 74123 26678 -105623 -79161 37409 185194 188757 141077 59678 4030 -32623
15009 -32623 -81695 4020 63304 147444 61096 -27063 -29275 -77694 -153654 -145821 -175913 -277192
14997 -277192 -182810 -102199 -118265 -131263 58674 112912 82076 113859 154338 106378 78498
14986 78498 -16313 -63668 -161419 -231478 -304127 -99801 -58363 23289 -24578 -138449 -106340
14975 -106340 -28232 70056 82347 37701 -68573 -51050 2644 -96070 -12318 -69695 -244156
14964 -244156 -181504 -55928 1681 -82149 -6352 40669 50835 122795 52504 -51084 54351
14953 54351 -46336 -49635 27907 62170 85704 -3604 -70310 -80753 -102919 16364 178877
14942A78877p6636q2436J26849l1686j91755j3997R1811P0097l6671j09222R5125
14931B0356n4212l7455K8459l2016N0795N2028l0638o3540J02843M8706k8301
14920E7025j7258j3351n3048p0203M453N4845J9692L3006k041m8596r69j07927
14908a44372n8584N6345j8294R5473J04444K6033j13103j2507o9038o6462l5654
14897b35719J20630J36019M792j40913k9397j637J59133N2112l2377P1484o6712
14886C7415j0231Q6104Q789o8865j0994M2037m1751O1465k3548j70417p3802J6677
14874a47121J51327k2643q6840m263K8131K6030M4838n7967q3634j25411L2600
14863b44953L6637O2997K3193K8312L4732O8200K3162j4271n1640p7639J4952
$$ plain form
14942 178877 102241 19805 146654 114968 -76787 -90784 1027 71124 34453 -74769 20356
14931 20356 -33856 -71311 -42852 -74868 -24073 27955 -2683 -66223 36620 85326 57025
14920 57025 39767 26416 -26632 -96835 -92382 -37537 -17845 15161 13120 -35476 -36445 -144372
14908 -144372 -202956 -146611 -164905 -69432 35012 61045 -52058 -64565 -133603 -200065 -235719
14897 -235719 -115089 20930 25722 -115191 -144588 -146225 12908 65020 32643 104127 37415
14886 37415 27184 113288 122077 53212 42218 84255 42504 103969 80421 -89996 -163798 -147121
14874 -147121 4206 -18437 -105277 -109540 -81409 -55379 -10541 -68508 -152142 -277553 -244953
14863 -244953 -208316 -145319 -122126 -93814 -59082 9118 32280 18009 -33631 -111270 -96318
14852i6318p9282L3498J00169P6055j39261m1124P7039J19202K7208o9948r945
14841b707l0959r1518q437k3157M73K5556l0842P106K1504k4524M752N9915L3829
14828e9009J18099O4543o088j27117j50482j2776L2463K0983J01419N5727r7568
14817e9806L9229J03328Q2941m1008m2578p0165n0539n3227n4331j5082K8922
14806a32316P2713M7681m2486Q954P7914P373J33486N3273r6944k2493j8839K082
14794I0398K5432l5526r1779m7928K513k5846j9508N5352O7712O616j70701l6044
14782a79309P6862m5867J0611J6213j8092j4476K0290M8433j36597j26289M4080
14771c04141l1578R529O4278O698J31425Q2148M5061J52076j0830k8283l6307
$$ plain form
14852 -96318 -175600 -142102 -41933 34122 -105139 -146263 -69224 49978 77186 7238 -2707
14841 -2707 -33666 -125184 -133621 -156778 -156305 -130749 -161591 -154485 -132981 -157505 -152753 -92838 -59009
14828 -59009 59090 123633 117545 -9572 -160054 -172830 -140367 -119384 -17965 37762 -59806
14817 -59806 -20577 82751 165692 124684 82106 11941 -38598 -91825 -146156 -161238 -132316
14806 -132316 -59603 -11922 -54408 -45454 32460 39833 173319 226592 129648 107155 88316 90398
14794 90398 115830 80304 -11475 -59403 -56890 -82736 -102244 -46892 20820 27436 -143265 -179309
14782 -179309 -102447 -148314 -137703 -121490 -139582 -154058 -133768 -85335 -221932 -348221 -304141
14771 -304141 -335719 -326190 -261912 -255214 -123789 -41641 3420 155496 144666 116383 80076
14760H0076l5203P580m9762Q0476N8744o435N6101J3237n5087n1575n6149o0942
14748a8939r127K5620q8467M7113J06637P7119q9140j29953J5979R6014m6414
14737a3558j34078P7820M8003l21j3417j89238J2894N8653k0677J1943L8443J53775
14725C0242J81892J702j60109l3044J9930j4520K6877o6713M0465l3726j02399
14714a09403L1257Q3823n2575j18090Q2651j3132m0377P2477l7963l1321M3743
14703h8910n796l1735K1617K102J34383L2452p1454M0249r32m1720o0531J5256
14691e5019J30490L706j74248q4571J43772M6567M5663j22238l6009L4658j15882
14680a83111J0138R6573P2066M7110l6777k1362k2998q3281k002J02484m3624
$$ plain form
14760 80076 44873 52453 2691 83167 141911 135476 191577 204814 149727 98152 42003 -18939
14748 -18939 -28066 -2446 -90913 -43800 62837 139956 50816 -79137 -63158 32856 -13558
14737 -13558 -147636 -69816 -21813 -22134 -35551 -224789 -211895 -153242 -173919 -161976 -123533 30242
14725 30242 212134 213836 53727 20683 40613 26093 52970 -13743 26722 -7004 -109403
14714 -109403 -78146 5677 -46898 -164988 -82337 -95469 -135846 -63369 -101332 -132653 -88910
14703 -88910 -94706 -126441 -104824 -102722 31661 64113 -7341 32908 31976 -9744 -70275 -55019
14691 -55019 75471 79177 -95071 -179642 -35870 10697 56360 -65878 -101887 -67229 -183111
14680 -183111 -172973 -76400 -4334 42776 5999 -15363 -38361 -121642 -123644 -21160 -64784
14669f4784M3407K2702Q2907m8248r0775l2044j1907m0855o9524J48338J44072
14658H3289j24737m6908N0823K4254r6013j53941R9539J26061L5681j1117P7214
14647F4145o1748K791j9417L4113p9708r9843J17590M3943M8929o6624j50232
14636a66061O6899r564q6163J35008K1633j05230k5619N5994j05102N828O1533
14625a50844L6600J17008n2071m2626j492J07826J8083j51718j05561Q8912Q1984
14614e3899j9430J0607K6929p0785p0417l2942J41108K70562N6372j35609j30654
14603h158n4186N3512J73882P2339o0271p5688p0539k288J8187j50494J4710M7352
14591d1642j9201K2196J2061J79092l5105j11482L3482m5647p7341o2835L6440
$$ plain form
14669 -64784 -21377 1325 84232 35984 -54791 -86835 -98742 -139597 -209121 -60783 83289
14658 83289 -41448 -88356 -37533 -13279 -109292 -263233 -163694 -37633 -1952 -13069 64145
14647 64145 2397 5188 -14229 19884 -59824 -159667 -42077 1866 50795 -15829 -166061
14636 -166061 -99162 -108726 -194889 -59881 -38248 -143478 -169097 -113103 -218205 -212377 -150844
14625 -150844 -114244 2764 -49307 -91933 -93425 14401 32484 -119234 -224795 -135883 -53899
14614 -53899 -73329 -62722 -35793 -106578 -176995 -209937 -68829 201733 258105 122496 -8158
14603 -8158 -62344 -8832 165050 237389 177118 101430 30891 28603 46790 -103704 -88994 -41642
14591 -41642 -60843 -38647 -26586 152506 117401 5919 39401 -6246 -83587 -146422 -109982
14580a09982J37460L6215j11133q2922J1908j1172P3581k656Q862J18232j0931
14569E7462j25553M0731j5816K1035j1090P8415J9860J8333j02261J7423p2775
14558g4236J55000p4532j8762o5926m4693N9507j22266n1581J35900M0658n4921
14547a15852M3378k4849Q2644r6644j42299J2294N1227l490K4504R917K7826N4494
14535g6850J15687l8744l7314J09477N0893j20041J0266J0760j6118l972O02O8520
14523G3166o449K3206J1166O2860j59582o03o4908j5809l7470k6263J4771m4892
14511a70807R0131N3233P562J19271Q4491m0568r1528k1032j23075j02502K18702
14500B3878l4926m711M2861p3897l8318P3087J07628l3448p8070j1361j0930O5221
$$ plain form
14580 -109982 27478 63693 -47440 -130362 -118454 -129626 -56045 -58701 -49839 68393 57462
14569 57462 -68091 -27360 -43176 -22141 -33231 45184 65044 83377 -18884 -1461 -74236
14558 -74236 80764 6232 -12530 -78456 -123149 -63642 -185908 -237489 -101589 -60931 -115852
14547 -115852 -72474 -97323 -14679 -111323 -253622 -241328 -190101 -193591 -169087 -159170 -131344 -76850
14535 -76850 38837 93 -37221 72256 123149 3108 13374 24134 8016 4044 4646 73166
14523 73166 66717 89923 101089 163949 4367 3764 -61144 -76953 -114423 -140686 -125915 -170807
14511 -170807 -80676 -27443 -19881 99390 183881 143313 51785 30753 -92322 -194824 23878
14500 23878 -11048 -15759 27102 -46795 -85113 -12026 95602 62154 -15916 -27277 -38207 27014
14488B7014L6210j28480l1416J58900J2534p1236j32379l425J02264j8117p4459
14477a22590j01641P8778R6827K9064n2853k084J9214L1737k0505l7695p9901
14466a61649Q3113n907p2688n5750j04755J4257l837J526J42876l419p6595k7841
14454b70669K8529M1332r269m427J49017J6598N5029j04598L3484J00550J6221
14443E1797L8504r3445p9998k8581P8281l3415J38883L0467O988R7630m1537q1669
14431H3905l90J4926j80877q9791n7109j1025J71206J04057k2138j17874K6073
14420g9037P4211j6712o516N5953q5844o8946j3887k737R171K4258J062K3733
14408h5291J69785o2102q0546p156Q4997K8748o7527l4940M7228K1917J2764J62563
$$ plain form
14488 27014 63224 -65256 -96672 62228 74762 3526 -128853 -132278 -30014 -48131 -122590
14477 -122590 -224231 -145453 -48626 -19562 -72415 -74499 -55285 -23548 -44053 -81748 -161649
14466 -161649 -78536 -84443 -157131 -212881 -317636 -303379 -307216 -305690 -162814 -166233 -242828 -270669
14454 -270669 -242140 -200808 -210077 -214504 -65487 -48889 6140 -98458 -64974 35576 51797
14443 51797 90301 -3144 -83142 -111723 -33442 -66857 72026 102493 109481 207111 165574 83905
14431 83905 83515 98441 -82436 -172227 -229336 -240361 -69155 34902 12764 -105110 -79037
14420 -79037 -4826 -21538 -28054 27899 -57945 -126891 -140778 -143515 -134344 -110086 -109024 -85291
14408 -85291 84494 22392 -58154 -65310 19687 48435 -19092 -54032 -6804 15113 27877 190440
14396A90440O9185j83931p1897K5759L8958j51479o8437K2149Q7429j05266j37043
14385b84133o5448K6422J18580N8951P2562J39816J09806J2001j3542j28851o1017
14374a4853m5286K1288j04777k6349m8341O1451L9129K1586k6095o6561L6984
14363a51824J25800P6845R6306P1811m4037p5969k6967m6916J08125k4856m6241
14352F2077m4943j31683K8482J15037p9375j04851O4283R7174O5844J02026L0116
14341B04187M605r7204j41516n654N327L1674M6267N813p8781o7443J8398N9929
14329a4398n3601O3687p0532j09P2391M0022m0203j01323q1932J037J65599Q344
14317a1018p9040j17175P2019P6898R3393R3604n027n4868r8954k10428o0637
$$ plain form
14396 190440 259625 75694 3797 29556 68514 -82965 -151402 -129253 -41824 -147090 -284133
14385 -284133 -349581 -323159 -204579 -145628 -73066 66750 176556 188557 175015 46164 -14853
14374 -14853 -60139 -38851 -143628 -169977 -218318 -156867 -117738 -96152 -122247 -188808 -151824
14363 -151824 -26024 50821 147127 218938 174901 98932 71965 25049 133174 108318 62077
14352 62077 17134 -114549 -86067 28970 -50405 -155256 -90973 6201 72045 174071 204187
14341 204187 208792 111588 -29928 -35582 -30255 1419 47686 53499 -25282 -92725 -74327 -14398
14329 -14398 -67999 -4312 -74844 -74953 -2562 37460 -2743 -104066 -185998 -184961 -19362 -11018
14317 -11018 -90058 -207233 -135214 -58316 35077 128681 123654 68786 -30168 -240596 -301233
14306c01233Q4609R0532R4442L1085o1484m0069L738Q3912J58223J0106o5853
14295H8008l8660p8857J1207k1706r9326l2470m1913q910K3366J73123j3266n0497
14283h9901n522l1304Q4763m0463m963m45k9310j2375o6761J45413P5933M608
14271B9673K6187p9561n3330o9420J4211L4347n4271P4914M342j6383J3949O5504
14259i838k347o4215M1661n3434Q805O205Q9581J47116M1778L4579O64m8319j24364
14246F7872k17350o1245M0758r843m8975Q4438J32444J0641j3869L7151k2967
14235i45M946M0197p61q0431j5463J0409M8447J05563k69R610j37623r0027R6899
14222i448J6929m8480k0183l6738N8522R3087j21257J634M2475k3138M112R4645
$$ plain form
14306 -301233 -216624 -126092 -31650 -565 -62049 -102118 -98380 -14468 143755 153861 88008
14295 88008 49348 -29509 -18302 -40008 -139334 -171804 -213717 -222627 -199261 -26138 -39404 -89901
14283 -89901 -95423 -126727 -41964 -82427 -87390 -87835 -117145 -129520 -196281 -50868 25065 29673
14271 29673 55860 -23701 -77031 -146451 -132240 -97893 -152164 -77250 -72908 -89291 -75342 -9838
14259 -9838 -12185 -76400 -34739 -88173 -79368 -73163 16418 163534 205312 239891 240555 192236 67872
14246 67872 -149478 -210723 -169965 -179808 -228783 -144345 -11901 -1260 -15129 22022 -945
14235 -945 4001 44198 43437 -36994 -52457 -42048 6399 111962 111693 121303 -16320 -106347 -9448
14222 -9448 7481 -40999 -61182 -97920 -39398 53689 -67568 -65934 -23459 -46597 -42485 52160
14210E2160L6080O6883q431L5613j6487j19257O789q2466k536j42083q0562O5289
14198a89008n784O3737J2039m2462O2652O7446j8807r8404j0208K9432J8602j4318
14186a25083r114k4406P3075M2409P4391J00805O7927j15891j23269j327L0423
14175a0060m8370N9705R8692m3925j05351l8609j0960j14693l8395Q9904J43963
14164a8099N0202m1426k3436r2172o9545N8268K3629j7047l9936l938M2876O4024
14152f6600o8868p8478K1572J31366O5535J3315J5922L748o9951m4414q5413q3856
14140b46122n4861o6331q1142J38037J51235J11323r217p1471M5097j4943j5644
14129a14039O0756O8416r49r535j7515m4529Q5473J06854K5395j1329K9890Q5002
$$ plain form
14210 52160 88240 155123 146692 182305 165818 46561 53350 -29116 -31652 -173735 -254297 -189008
14198 -189008 -194792 -131055 -119016 -161478 -98826 -31380 -50187 -148591 -158799 -129367 -110765 -125083
14186 -125083 -134197 -158603 -85528 -43119 31272 132077 200004 84113 -39156 -40483 -10060
14175 -10060 -58430 1275 99967 56042 -49309 -87918 -98878 -213571 -251966 -162062 -18099
14164 -18099 32103 -9323 -32759 -124931 -194476 -136208 -112579 -129626 -169562 -173500 -130624 -66600
14152 -66600 -135468 -213946 -192374 -61008 4527 17842 33764 37512 -32439 -76853 -162266 -246122
14140 -246122 -300983 -367314 -448456 -310419 -159184 -47861 -57078 -128549 -83452 -98395 -114039
14129 -114039 -53283 15133 14184 4649 -12866 -57395 28078 134932 160327 148998 178888 263890
14117B63890j6012n6586j58234J7467P4101J34869J3212r5995j39719j27683O1873
14106b8817L4107r9850J18731R5141J17004r3467p5874r6401l3086M697n6368
14095a14183K2565m9065k3334J15806K8499q520n5353K946l7832O0706j4874l4300
14083a06939N1644N5775j3584m2805J38999J10416Q938n0059j24325l5279L2126
14072B4907J5080K067R3504O1392j53913j00838j329M3876O0020J4794J09182
14061A68742P3740q9453n3576K5688O0949n5731o7672O85P6242N1487o3408q4014
14049D3679j49857j2598P377L2021o0984j48754L0962Q1051J0502o5156Q5110
14038a46647O5814L2953n1256j5863m4598N1798q0344Q201J51038N5842L3839
$$ plain form
14117 263890 247878 191292 33058 50525 124626 259495 272707 176712 36993 -90690 -28817
14106 -28817 5290 -94560 24171 119312 236316 142849 66975 -29426 -62512 -57815 -114183
14095 -114183 -91618 -140683 -164017 -48211 -19712 -28232 -83585 -80639 -118471 -57765 -72639 -106939
14083 -106939 -55295 480 -13104 -55909 83090 193506 202444 152385 28060 -7219 24907
14072 24907 39987 42054 135558 196950 43037 -57801 -59130 -15254 44766 59560 168742
14061 168742 242482 153029 99453 125141 186090 130359 62687 63372 139614 191101 127693 43679
14049 43679 -106178 -118776 -111399 -79378 -140362 -289116 -258154 -177103 -166601 -231757 -146647
14038 -146647 -80833 -47880 -99136 -114999 -159597 -107799 -188143 -179942 -28904 26938 60777
14027F0777r2329j77808l4687M5649J07253L0666J28912o53j66415O4531J5662
14016a8442J10734J44000N5526n4552j25844J40688K1093l5440J37393q8579j10943
14005A75634o1274n0761o0290P9921m4165j41535J9678J4724l7828r5095M7754
13994a53237P5130R6982J9397p4284k533k2178n8118J47959K5827J7689K1949
13983I4583m2463l9958K8107J0135J5783k3596l2963r7639o3108J14418p6363
13972a13064m201J0021J07599Q3644n8838m0219l5428k9412r5007j26531R3607
13961b07829K63245Q7671l0969o7518p0808L2187l3817m9748q2408l2106M1776
13950a50324Q3820O0909q2691k0082l5848J9045J19603P560K613q8417M3642L0966
$$ plain form
14027 60777 -31552 -209360 -244047 -198398 -91145 -60479 68433 67780 -98635 -34104 -18442
14016 -18442 92292 236292 291818 237266 111422 252110 273203 237763 375156 286577 175634
14005 175634 114360 63599 3309 83230 39065 -102470 -82792 -68068 -105896 -200991 -153237
13994 -153237 -78107 18875 38272 -36012 -38545 -60723 -118841 29118 54945 72634 94583
13983 94583 52120 12162 40269 50404 66187 42591 9628 -88011 -151119 -36701 -113064
13972 -113064 -117265 -107244 355 83999 25161 -15058 -50486 -79898 -174905 -301436 -207829
13961 -207829 55416 143087 112118 44600 -26208 5979 -27838 -77586 -159994 -192100 -150324
13950 -150324 -66504 -5595 -88286 -108368 -144216 -125171 -5568 1992 4605 -83812 -40170 -9204
13938i204K6942J6938j05582j26272N4205R7110J07408l8291p0566l9842J1010
13927g6144o7587l2843J57556Q9341p5869n9956q9278q7966Q8142J6236r4283
13916b32651P2177J35329L8964l926j1764K8629j06327m0104j5423n6864J31754
13905f0206O5898p5279j49310l4739J62153N9784k4934l0392L9207o9932j0417
13894a28167K1045L942j42o0329m0268J31651J4601o2374L4730q0750l8218R1325
13882a12954J21283j0453o7627K1858J29994j11316j07703j1836J04036P9776
13872C5058J40828N0273p4398j01407j815L2016o8243r2333m5287K2747Q4997
13861a7564J4062L4564N548M680J27872J03335k809j10536r5434n5311M2276p9509
$$ plain form
13938 -9204 17738 34676 -70906 -197178 -142973 -45863 61545 23254 -47312 -87154 -76144
13927 -76144 -143731 -176574 -19018 70323 -5546 -65502 -154780 -242746 -154604 -138368 -232651
13916 -232651 -160474 -25145 13819 9893 -1871 26758 -79569 -119673 -135096 -191960 -60206
13905 -60206 5692 -69587 -218897 -253636 -91483 -31699 -56633 -87025 -47818 -117750 -128167
13894 -128167 -107122 -103180 -103322 -163651 -203919 -72268 -57667 -120041 -85311 -166061 -204279 -112954
13882 -112954 8329 -2124 -69751 -47893 82101 -29215 -136918 -148754 -44718 35058
13872 35058 175886 226159 151761 50354 48539 80555 12312 -80021 -125308 -102561 -17564
13861 -17564 -3502 31062 36610 41290 169162 272497 269688 159152 63718 8407 50683 -28826
13849b8826j18991q8269N1514J24121m9013J08057J12694r5435p4766k5629k0810
13838a05353P0668j8128m5254m0337k1198J36274O4300K7728m8109p4403k8290
13827h2102r0730J46770K24389O3567o0606j1439J03400m681j34826j26072j933
13816B5737P2674O3880n7833j41642q7508j3789Q0127J56350J29275P5349k04874
13805I7746j52784M0755J29241J02854l1728q64O589n9021j00993r434P2585P036
13793A01982l769J28415n6854j68189q2896J05079N5054n6510J17285J78239o3136
13782B54700o2431L9627J49481K16213J35090k0450j4898q2682r5289j39948j11468
13771B67945k0884M5627n8242k82221m1285Q5239L5050j2034k0188J08045n8661
$$ plain form
13849 -28826 -147817 -236086 -184572 -60451 -109464 -1407 111287 15852 -58914 -84543 -105353
13838 -105353 -34685 -52813 -98067 -138404 -159602 -23328 40972 68700 20591 -53812 -82102
13827 -82102 -172832 -26062 198327 261894 201288 189849 293249 288568 153742 27670 25737
13816 25737 98411 162291 104458 -37184 -124692 -138481 -58354 97996 227271 302620 97746
13805 97746 -55038 -14283 114958 217812 186084 185220 191809 132788 31795 22361 94946 101982
13793 101982 98213 226628 169774 1585 -81311 23768 78822 22312 139597 317836 254700
13782 254700 192269 231896 381377 597590 732680 712230 697332 614650 519361 379413 267945
13771 267945 247061 292688 234446 -47775 -89060 -3821 31229 19195 -993 107052 48391
13760D8391K0418N7860p4644m0762J31339J31452m884j14025j6122R0482M268
13749B33773Q9415r2905p5776K5524p5171j4852p8121K2380N5476L8334L1620
13738A59697L9925J25280L8255L3615J84579J81191k7095j14863j03584r1538
13728D25462j6742L1000J7452j26973q2672M0282O0438r7918j03206J5260n760
13717A56623Q241o2613J838P4625Q4485m8227j08683m4724J1819Q8265r0282j67241
13705i5874J84233R4165k1958L0875j31591q5319J387J5539j07794j4366Q3030
13694d7673L643k1644K8866J2227J90727Q8072m9348q0257J21663j9907j46733
13683G9636q1282q4110J8029Q1892Q9407K8169N3241r3040j31634K8251J63520
$$ plain form
13760 48391 68809 126669 52025 11263 142602 274054 269170 155145 139023 229505 233773
13749 233773 323188 230283 154507 180031 104860 90008 11887 34267 89743 128077 159697
13738 159697 199622 324902 363157 396772 581351 762542 735447 620584 517000 425462
13728 425462 408720 439720 457172 330199 247527 287809 348247 250329 147123 162383 156623
13717 156623 164864 102251 104089 178714 263199 214972 106289 61565 73384 161649 71367 -95874
13705 -95874 88359 182524 160566 191441 59850 -25469 -24082 -8543 -116337 -130703 -47673
13694 -47673 -44030 -65674 -36808 -24581 166146 254218 204870 124613 246276 226369 79636
13683 79636 -1646 -85756 -67727 14165 103572 131741 184982 91942 -39692 -11441 152079
13672A52079n1047l5025J12478k6881l0532l3875n5577j8816L1280K8556K973
13661G5613M1769n7974j53362j9717M8783P6798j9702o6791j28162O4834N3807
13650h4104Q1549O6652m2779j777k06505j19357P2982n7895n6908R2227J56919
13639i8996M0497p610M1389Q3175J11242k7717q9130J51j01642K4652P6899Q1824
13627A34734m294K1982j00356j65947Q226k2454O962J34112O7458o7654r7589
13616h4820J7164Q2263L8555J6873L4425p2892m2386j10424K488R735O4545J10747
13604F6273J5291l313J6269r9283p7169m3435j3736M3574l7745q1997J9587J40223
13592e5461M7057j3672M9678q1944k7775K3755J08626K3562j12792J11077K4336
$$ plain form
13672 152079 101032 66007 178485 151604 121072 87197 31620 12804 44084 72640 75613
13661 75613 117382 59408 -93954 -113671 -64888 11910 -7792 -74583 -202745 -137911 -84104
13650 -84104 -2555 64097 21318 19541 -186964 -306321 -233339 -291234 -348142 -255915 -98996
13639 -98996 -58499 -66109 -24720 58455 169697 141980 52850 53001 -48641 -23989 52910 134734
13627 134734 130440 152422 52066 -113881 -105655 -128109 -121147 12965 80423 12769 -84820
13616 -84820 -67656 14607 53162 70035 104460 31568 -10818 -121242 -118754 -109019 -44474 66273
13604 66273 81564 78251 94520 -4763 -81932 -125367 -139103 -95529 -133274 -215271 -195684 -55461
13592 -55461 -8404 -22076 27602 -54342 -82117 -58362 50264 73826 -38966 72111 96447
13581I6447K1061J8473n2498j4730P0574l7810n719O5222J28554n786N2366J48593
13569D84747L8320K1105l3491o4050j6376q514J9753k00689p8601N8081R771p0946
13557A59110m0734J7039n4045K194k2052l165L6831j36K9732q1462m2476l9294
13545c8458O3314J30186R9957k464l0694P3711J18400J50143K47611J28795J32965
13534A073466O9788j29001k08855k58805p4022o3753m365L4497m5565L1863L0352
13523D55600o6294m1004p6619j01449o7253K7134Q4714j4788m3522j43385P5095
13512H8229J10160j41341k6737J2800k6560J31320J09241K3683J67304K51259
13502F99358M0624m9430j29943q7898j18194j08279j14352O6794j9664n4385J7525
$$ plain form
13581 96447 117508 135981 83483 68753 139327 101517 95798 161020 289574 283788 336154 484747
13569 484747 523067 544172 510681 446631 430255 421741 441494 240805 162204 220285 230056 159110
13557 159110 118376 135415 81370 83564 61512 58347 95178 95042 124774 43312 836 -38458
13545 -38458 24856 155042 254999 252535 221841 295552 413952 564095 811706 940501 1073466
13534 1073466 1143254 1014253 805398 546593 472571 408818 404453 438950 393385 425248 455600
13523 455600 389306 348302 271683 170234 102981 130115 214829 200041 156519 13134 88229
13512 88229 198389 57048 30311 43111 16551 147871 257112 280795 448099 699358
13502 699358 739982 690552 560609 472711 354517 246238 131886 198680 179016 124631 142156
13491A42156M173J4722L4125q7151n9864l9101o1284L9020J11172J4215Q26j33249
13479b0240j53606J02476J4577J75922J71289L3013J6373N8732M9380m0757n1912
13468C55247j86556j60016l8279L3809o0169L8034P5585m3311K8638q8973j6825
13457f2816J56267Q4189J5719o9407l5155O1759j928p062n8473j06574N4721o8194
13445c6954J09397R3163l5120j13904n7886J31577J02362L3404k4115o2248j9977
13434A19699J08559J1233k4788o8700o794M3693j11725J5201J47265l2322J22209
13423C23530M8304n6328o3251j14113K3254n3455r3724K0725R437O0499J21377
13412B26255j9061l6776L8276o5121n738K2980K6782r38n7992L7697M8452R6056
$$ plain form
13491 142156 146329 161051 195176 108025 48161 9060 -52224 -13204 97968 112183 113009 -20240
13479 -20240 -173846 -71370 -56793 119129 290418 323431 339804 398536 447916 407159 355247
13468 355247 168691 8675 -29604 4205 -55964 -17930 57655 14344 42982 -45991 -62816
13457 -62816 93451 177640 193359 123952 88797 150556 148628 141566 83093 -23481 31240 -36954
13445 -36954 72443 165606 130486 16582 -41304 90273 192635 226039 201924 139676 119699
13434 119699 228258 239491 214703 146003 139209 182902 71177 86378 233643 201321 323530
13423 323530 371834 315506 252255 138142 161396 107941 14217 34942 44379 104878 226255
13412 226255 207194 170418 208694 143573 137835 160815 187597 186659 128667 166364 214816 310872
13400C10872L614q0649L4733j95m74J29581R4525P2838N9166L6545j04191P0560
13388F26925k3822Q012J69882L6843o5092Q8485J96504K12958J00244R7484J39893
13377A588316J38320K50222K66453J23349L39360M89817N12104P30859R62727
13368E401527J139041J548376K223254L178240M772113O983439Q907148Q302793
13360D2455931M404177p84604n127440p573814p629071o042471m211181k778253
13352A2713274k028281j659654j245720r96663n72061n13437n53962l69475k21658
13343D552363j68919j59094j45907K6359k0721Q7560R7866k738O0094L24196L74986
13332E026045M66237N47147P58021Q74174J129725J389757J580299J900555K639254
$$ plain form
13400 310872 314486 233837 268570 268375 267901 397482 492007 564845 624011 660556 556365 626925
13388 626925 603103 611115 780997 817840 752748 841233 1037737 1250695 1350939 1448423 1588316
13377 1588316 1726636 1976858 2243311 2366660 2706020 3195837 3707941 4438800 5401527
13368 5401527 6540568 8088944 10312198 13490438 18262551 25245990 34153138 42455931
13360 42455931 46860108 46075504 40948064 33374250 25745179 19702708 15491527 12713274
13352 12713274 10684993 9025339 7779619 6782956 6210895 5697458 5143496 4774021 4552363
13343 4552363 4383444 4224350 4078443 4104802 4084081 4171641 4269507 4266769 4326863 4651059 5026045
13332 5026045 5492282 6039429 6797450 7671624 8801349 10191106 11771405 13671960 16311214
13323A6311214L559468M751202O724239J0236193J5763549K3657086L1634738
13316A12637689L0176437J3126221o843672k1296799k8740168k6112877j8838414
13309E4108417j2494736q328807n879286m349052l162950k542373k222968j876074
13301A3252171j409749j054106r67498p51851o01893l53017l13492m19831k33519
13292G147215j81179N476O4659J81336K14102L24073M03339O42021Q48764J084008
13282A0733814J307009J628251K100764K679277L538789M993561P180100J0989701
13274D5151266J6813991K5157525L2736592K9352034J0383769r403772k3373686
13267A26817719k9923460k6003303j8279860j2268146q187043n545637m046498
$$ plain form
13323 16311214 19870682 24621884 31346123 41582316 57345865 81002951 112637689
13316 112637689 142814126 155940347 149096675 127799876 99059708 72946831 54108417
13309 54108417 41613681 33284874 27405588 23056536 19893586 17351213 15128245 13252171
13301 13252171 11842422 10788316 9820818 9068967 8467074 8114057 7800565 7380734 7147215
13292 7147215 6966036 6971512 7036171 7217507 7431609 7755682 8159021 8801042 9649806 10733814
13282 10733814 12040823 13669074 15769838 18449115 21987904 26981465 34161565 45151266
13274 45151266 61965257 87122782 119859374 149211408 159595177 150191405 126817719
13267 126817719 96894259 70890956 52611096 40342950 32155907 26610270 22563772
13260B2563772l126722k581046k247635j924447j563417j234721r56767p91814
13252H137203o38971o73656n93320m67427k00046k04574k22120j68114p3219L46
13242D896102M9653J02456K42026L09940K64855L74098M27851O54987J034061
13233H356029J137545J918586K716969L953477N724684Q071086R257705P366543
13225D8502624K218539l380932p225139q666653p565965n639085l981827k679747
13217A1581815j903723j578481j273213r59009p53972o01682n41487n24763m80241
13208B965244l75443k96388q0544j24479j03882r8235p4884j17005j32696k38274
13198A323414m1697j12142j31807p7700r420p2299o2499k7288J04833J02844r4066
$$ plain form
13260 22563772 19437050 16856004 14608369 12683922 11120505 9885784 8929017 8137203
13252 8137203 7498232 6824576 6231256 5763829 5563783 5359209 5137089 4968975 4895756 4896102
13242 4896102 4945755 5048211 5290237 5600177 5865032 6239130 6666981 7321968 8356029
13233 8356029 9493574 11412160 14129129 18082606 23807290 31878376 41136081 48502624
13225 48502624 50721163 47340231 40115092 31448439 23882474 18243389 14261562 11581815
13217 11581815 9678092 8099611 6826398 5867389 5113417 4511735 3970248 3445485 2965244
13208 2965244 2589801 2293413 2212869 2088390 1984508 1886273 1811389 1694384 1561688 1323414
13198 1323414 1281717 1169575 1037768 960068 950648 878349 815850 788562 893395 996239 902173
13187I02173o4525P0777j0041K2014j22582j82024m8421O5557J6181j22079n6668
13176D70362J8947J12785N3762j96399j17509P6952q895J94K9481O5172Q765l9516
13164D74101q5848n3899J12025J41615j09422j68388o739L322j40082j79746P650
13153e411J66671L7113j5530K5655L6943J7860j3658K0854n1227m1808j28082
13142D9380k1191J27663J31983p0784r516j1324L0566k9700O9459m5862Q9916
13131C10590O541M1167N1767o0488j21529m064k2397M7780L0375M4590p6767k01312
13119D6253p0480j789L8375N1666o2091j7117L7279n2754P5502Q6538J17156k6902
13107B21636l2192l401j01836L5021N8168r2041p576M6167j9037q3261n3650J04826
$$ plain form
13187 902173 837648 908425 898384 920398 797816 615792 567371 632928 649109 527030 470362
13176 470362 489309 602094 655856 459457 341948 418900 410005 410199 439680 504852 513617 474101
13164 474101 388253 334354 446379 587994 478572 310184 303445 306767 166685 -13061 -5411
13153 -5411 161260 198373 182843 208498 245441 263301 249643 270497 219270 177462 49380
13142 49380 28189 155852 287835 217051 207535 196211 226777 197077 266536 220674 310590
13131 310590 317131 358298 410065 349577 228048 223984 201587 249367 279742 324332 247565 46253
13119 46253 -24227 -26016 12359 64025 1934 -15183 22096 -30658 44844 131382 248538 221636
13107 221636 189444 186043 84207 119228 177396 85355 77779 123946 104909 21648 -32002 72824
13095G2824O6167k4247k0508P3710K2545p4798q2703K9053K3222p8479K8036R4716
13083A29538m8214K7745m5093J0324K6512k9857N1702n786K7008o8640j6123O1901
13071A21017N6378k7013K8373j06866O0406l0241j9599o5896L6873P3013k9799
13060I6646p4529q9340k139R1527O0957R4197k1339m5668j2496J13559L0878q8645
13048A53608o7512M8012m8331Q0582J32371R420j07043O0L7375p1833q7124l1399
13036D8186m0080O5380O6990r4798q6331j8420J8829Q8983N4765O0478O5929O6479
13024B96390O7322j61615p5103j3807J3645Q6681j9855n5823p908j3181j095n1120
13012F4531j3913m9366n649J43158L0938j7915k7866j7445o8707j1894l7327j7257
$$ plain form
13095 72824 138991 114744 94236 167946 190491 115693 32990 62043 85265 6786 34822 129538
13083 129538 81324 109069 63976 74300 100812 70955 122657 116871 143879 75239 59116 121017
13071 121017 177395 150382 178755 71889 132295 102054 82455 16559 53432 126445 96646
13060 96646 22117 -67223 -69362 22165 83122 177319 155980 110312 97816 211375 242253 153608
13048 153608 86096 134108 85777 166359 298730 308150 201107 201167 238542 166709 79585 48186
13036 48186 8106 73486 140476 45678 -40653 -59073 -40244 48739 103504 163982 229911 296390
13024 296390 363712 202097 126994 113187 126832 213513 193658 137835 129927 116746 115651 64531
13012 64531 50618 1252 -4397 138761 169699 151784 123918 106473 37766 25872 -11455 -28712
13000b8712p2421L3051R9350j8139r8909R2625J17554m2106o9029L2995m6679
12989d20j421k476o232k9178R7027Q9843r0128j20548k3735O6366O7939o15l6712
12976I710j5646J0160m8563m5061L6015R3389K7069l1702k4232j2685q6741K3537
12964f4750j8150J53614R2328k53J3046n228O8212m0283j40636k9617N8207k3
12952H6467J5313j3270K377R3971j05591j12332O7847J67798O5045j32604o6780
12941F8241r5193l0814P3820K4464p5583J0378o318r4297k3919J07235M8543R1905
12929I8462m1024m1617j84817n5345R7474J21104M8182M3445j43962j77645L4588
12918b01155P2504L2000L3937k7064M466L1724M7156L5207j06382K6249O0668
$$ plain form
13000 -28712 -101133 -68082 31268 13129 -85780 6845 124399 82293 13264 46259 -420
12989 -420 -1841 -4317 -10549 -39727 57300 147143 57015 -63533 -87268 -20902 47037 46422 9710
12976 9710 -5936 4224 -44339 -89400 -53385 40004 67073 35371 11139 -1546 -88287 -64750
12964 -64750 -82900 70714 163042 162789 175835 170607 238819 198536 57900 28283 86490 86467
12952 86467 101780 88510 90887 184858 79267 -33065 34782 202580 267625 135021 68241
12941 68241 -26952 -57766 16054 40518 -35065 -24687 -31005 -125302 -149221 -41986 6557 98462
12929 98462 57438 15821 -168996 -224341 -126867 -5763 42419 85864 -58098 -235743 -201155
12918 -201155 -128651 -96651 -62714 -89778 -85312 -53588 -6432 28775 -77607 -51358 9310
12907I310M0943O6719J06838J11219p3796j35982j9807J61845O1272M5728o2845
12896C11444j89985j26568r3547Q4132O4272m1228Q9773N7927O3978J6530r079
12885B27649K2756j6607o7858n6468r7205j04700O8736L8191O400Q3631J37023
12874B41548q5343p7821M9162j5685r716L8511p5952n3163O8353j6281M75r8998
12862c4910m3248O3943J9313m3979O8499M0126l7017J13682O0816n2188j5122
12851A39915m8499m6863Q2828J74129Q3624M5208J04025J11209J14083k9352j56665
12840E73642j95839q5984K3156L0877j34342m4060J1325m5694k6862o9453O0938
12829I7704O6786J3825m0655J9784j09434P204K7569K0047l3369l1886l7488P8928
$$ plain form
12907 9310 50253 116972 223810 335029 261233 125251 105444 267289 328561 374289 311444
12896 311444 121459 -5109 -98656 -14524 49748 8520 98293 156220 220198 236728 227649
12885 227649 250405 233798 165940 109472 12267 -92433 -23697 14494 20894 104525 241548
12874 241548 156205 78384 127546 111861 102145 140656 64704 11541 79894 63613 64088 -34910
12862 -34910 -78158 -14215 5098 -38881 29618 69744 32727 146409 207225 155037 139915
12851 139915 91416 44553 127381 301510 385134 430342 534367 645576 759659 730307 573642
12840 573642 377803 291819 314975 345852 211510 167450 178775 133081 106219 36766 97704
12829 97704 164490 178315 137660 157444 48010 55214 82783 102830 69461 37575 87 79015
12817G9015L5348k3171K1125r0176k6817Q3227R1842l0793r9265k1193n23K5783
12805D4402O4030L7972J21877K35161K19165J7854j24790J2347j29328q0629q3094
12794C34967n3225m1092o7125j04992j4307n0263j33830O4608J44001J8374n4749
12783D2367O98k6748k8459J6350n4131m3299P0273m9434J8875l8031N9814J01792
12771G0067J2767J8404O2344O591k4829j08671M4009R6649K2149j57340l3848
12760H292J0169P4794J26773j8533N4248j09161O2235k7651o1770q1443l0002
12749G951J54733P1457q4859l2558J86408O6240j24145o1423J3607Q2941j51515
12738A28837j329J8784O0008M5708L2937j16588j50301p9252m3900M5279p5520
$$ plain form
12817 79015 114363 91192 112317 22141 -4676 78551 170393 139600 40335 19142 18619 44402
12805 44402 108432 146404 268281 503442 722607 740461 615671 628018 498690 418061 334967
12794 334967 281742 240650 173525 68533 54226 3963 -129867 -65259 78742 97116 42367
12783 42367 43065 16317 -12142 4208 -49923 -93222 -22949 -72383 -53508 -91539 -31725 70067
12771 70067 82834 101238 163582 170173 145344 36673 80682 177331 199480 42140 8292
12760 8292 18461 93255 220028 201495 255743 146582 208817 181166 119396 37953 7951
12749 7951 162684 234141 149282 116724 303132 369372 245227 183804 197411 280352 128837
12738 128837 127508 146292 206300 252008 284945 168357 18056 -61196 -105096 -59817 -135337
12727a35337O139N1242l8711m894J795k8877K2442J27375M2680m1549j0435r4426
12715a02556K7825j082N8733L018n4210j23782l6286P9546J98811l5098j2901
12704B018J7530r2898r7478k0023l525L894Q9227N1715j8732M8529n9340J511
12692g7572L2532L3314K3494M0518J300Q619n0995O1337M4472r6061k3712J08011
12680A05257m910j09677m2197Q6267J5492p5924n4164J780k0160n7698o0863J71029
12668d5768J2747r3487m0305R1715R9392J197p4049j15054M8089J05001l5643
12657d6165n1396r0799Q7609K34984N7825j61388Q392l3686p0368o0308l0468
12646a55768J28271O9304m625j69031J10129n4202k9512k0054K3052K6021J2585
$$ plain form
12727 -135337 -129198 -77956 -116667 -121561 -119766 -148643 -126201 1174 43854 2305 -8130 -102556
12715 -102556 -74731 -75813 -17080 -14062 -68272 -192054 -228340 -148794 50017 14919 2018
12704 2018 19548 -73350 -170828 -190851 -194376 -190482 -101255 -49540 -68272 -19743 -79083 -77572
12692 -77572 -45040 -11726 11768 52286 53586 62205 11210 72547 117019 20958 -2754 105257
12680 105257 100347 -9330 -51527 34740 50232 -25692 -79856 -78076 -98236 -155934 -216797 -45768
12668 -45768 -33021 -126508 -166813 -75098 24294 25491 -48558 -163612 -115523 -10522 -46165
12657 -46165 -97561 -188360 -100751 134233 192058 30670 39062 5376 -64992 -125300 -155768
12646 -155768 -27497 41807 37182 -131849 -21720 -75922 -105434 -125488 -102436 -76415 -63830
12635f3830Q9503j2502r5917m1828l8189J04639J02128P086n9684P733L8120n2459
12623a5200K929L6139M9230j5675j04741k5868k3051J00061P3252q410m1880O2045
12611H8831j3817o7535J4497K561q066j28442j0976L4572M3193L5959M752l0086
12599c4557K6561p3545M7132L6172k0613J3558L2921m6352q9112n9472R5941J09937
12587C8571p3021n9798n6461m9091m7548Q1155R5279R6971m370J0635j6712M5706
12575F1316o8590n0264L8430L2445l4669r5926j3685P3185p8670o7746J83539
12564b0635J34090m9013K8279Q3167J529k6898p8337m7724l4494P5724M1210r6704
12552A0194r6748K6560R6105M230J1198L8782l0669m7031M0598K7742M3048K2648
$$ plain form
12635 -63830 25673 13171 -82746 -124574 -162763 -58124 44004 51090 -8594 -861 37259 -15200
12623 -15200 -12271 23868 73098 57423 -47318 -73186 -96237 3824 77076 68666 26786 88831
12611 88831 75014 7479 21976 24537 16471 -111971 -122947 -88375 -45182 -9223 -4471 -34557
12599 -34557 -7996 -81541 -34409 1763 -18850 -5292 27629 -18723 -107835 -167307 -71366 38571
12587 38571 -34450 -94248 -150709 -199800 -247348 -166193 -70914 26057 21687 32322 15610 61316
12575 61316 -7274 -57538 -19108 13337 -21332 -117258 -130943 -57758 -136428 -204174 -20635
12564 -20635 113455 64442 92721 175888 177417 150519 72182 24458 -10036 65688 106898 10194
12552 10194 -86554 -59994 36111 40341 51539 90321 59652 12621 53219 80961 124009 146657
12540A46657m4598l2384k6941q8529K1508N526J1482j66643k615J23374P9730
12529B6567p5159O565N9955L9683J0651J9401o2147j12196j3452L4446M8390O8827
12517E1531j3566l6131p512n9893m9415j5517J299Q4877M8494l4278p5550M5584
12505f0077l7290j1353J21242m7434p2310m3045K6817K56P0902J12068j3384r7116
12493e0724N9785J9992j05070o1452P5646K639J2995p1189P6277k0375j1479q9759
12481a62714o4334J4494P1395R5867K804n1660j3209M4976o548j7172k7055J20486
12469G330M9946K4794k8346K5054k2460J01600N4092j1129n4476j8447Q9499k8413
12457A89044m5779j35517q0755r7550j8115J27682Q2804P254k7813j36676o4575
$$ plain form
12540 146657 102059 69675 42734 -45795 -24287 -18761 -7279 -173922 -176537 -53163 26567
12529 26567 -48592 -42027 17928 57611 68262 87663 25516 -86680 -100132 -65686 -17296 51531
12517 51531 37965 1834 -5678 -65571 -114986 -130503 -129204 -44327 4167 -30111 -105661 -60077
12505 -60077 -97367 -108720 12522 -34912 -107222 -150267 -123450 -123194 -52292 59776 46392 -50724
12493 -50724 9061 29053 -76017 -137469 -61823 -59184 -46189 -117378 -41101 -61476 -72955 -162714
12481 -162714 -227048 -212554 -141159 -45292 -42488 -94148 -107357 -62381 -68929 -86101 -113156 7330
12469 7330 57276 82070 53724 78778 56318 157918 212010 200881 146405 127958 217457 189044
12457 189044 143265 7748 -73007 -170557 -188672 -60990 21814 29068 1255 -135421 -199996
12446a99996J17152J40214N9983k6502n5391k7283R1892P0807K2353m3043j60283
12435a0097j42158n5129J17765K9066J48014j920m9663J50774j10724j00066p8805
12424a02943l4042M5371j80L5803Q105P8797k4973k1195J1499j32649p7057k511
12412b15975J41368L9725m033J06600n0917j7619P7410J43978K5357j24677q4195
12401C7022M3323J44922k5577o7789j64820p4633j8683r5109R1946J8039p392
12390a18751J06824J0316r1865k6216k717k4857R0800O1978L164j11309o1535
12379a64168N6986L4365m7049n8895L2114K0296J10334K6267j02880n8775P597
12368a43808m1878n7447L8945L9751J12101P6156M860N8924q3604K2105k4351
$$ plain form
12446 -199996 -82844 57370 117353 90851 35460 8177 100069 170876 193229 150186 -10097
12435 -10097 -152255 -207384 -89619 -60553 87461 85541 35878 186652 75928 -24138 -102943
12424 -102943 -136985 -91614 -91794 -55991 -47886 30911 5938 -15257 -3758 -136407 -213464 -215975
12412 -215975 -74607 -34882 -38915 67685 16768 -851 76559 220537 245894 121217 37022
12401 37022 80345 225267 199690 131901 -32919 -107552 -126235 -221344 -129398 -111359 -118751
12390 -118751 -11927 -1611 -93476 -119692 -122409 -147266 -56466 5512 8676 -102633 -164168
12379 -164168 -107182 -72817 -119866 -178761 -146647 -126351 -16017 10250 -92630 -151405 -143808
12368 -143808 -185686 -243133 -204188 -164437 -52336 23820 28680 87604 4000 26105 1754
12357A754L4856M1455j8417n7906M251P218k1340J5136o3926j01620n2707J79
12345b11067R0028J24853L0526o4043K4295k8077q6051J5287K2610p3380l1419
12334a86438j704j8198K05031K21690l0110p9769j78348K5675J10362N8658q8748
12323C8101j7735Q8314M0603N370N3054o1787M461P8597r49k5926j53031o2693
12311a3621n096O099J157p2242N783O7995Q2236p4444M5201L5215L3463J116p6187
12298C6675l2930M1663J5996k9477q1268o403Q7084j1648N5830J06159j530m4663
12286A35488j58642q1728n5833K6612Q8606J15815L8062P7905q7152K5336Q557
12275A33026q8498m7376j5055K8994p7284O463o7785P9801J21620Q7302J6688
$$ plain form
12357 1754 36610 78065 59648 1742 5993 13211 -8129 7007 -56919 -158539 -211246 -211067
12345 -211067 -121039 3814 34340 -29703 -5408 -33485 -119536 -104249 -81639 -155019 -186438
12334 -186438 -188142 -206340 -1309 220381 190271 110502 -67846 -42171 68191 126849 38101
12323 38101 20366 108680 149283 154653 207707 145920 150381 228978 228029 202103 49072 -13621
12311 -13621 -18717 -12618 -11461 -83703 -77920 -9925 72311 -2133 43068 78283 111746 112862 36675
12298 36675 3745 45408 61404 31927 -49341 -55744 31340 19692 75522 181681 180151 135488
12286 135488 -23154 -104882 -160715 -134103 -45497 70318 108380 186285 99133 124469 133026
12275 133026 44528 -2848 -17903 11091 -66193 -59730 -127515 -47714 73906 161208 177896
12264A77896L3556r6373n5715J18093P5336l4866l8519m4285n9658n9050J48605
12253A65020O2358n3726j18605n4500K8071K9594r0170P8659n310M694j28584
12242h2499m7486k2751R1252R4511l2212P5892p3173n0112J88611K3538j87323
12231b1752K0461j46376o8606J64879Q2559j13587q2969m1067l9037J13867J55996
12220B4368j9688j2211N4606j01761K3306N1634n2839j11233k9164K2235J18260
12209c2487P1524k3584L3221m1170j21059j15268N1781J22924O5673p3971k1240
12198h3656o6819M3962J10292N5131O7668n5695m0851p5896R7520N9488O27j941
12186A09830j42310n1009n68J18569J4070k2072j58935j94086Q9466m200J56561
$$ plain form
12264 177896 211452 115079 59364 177457 252793 217927 179408 135123 75465 16415 165020
12253 165020 227378 173652 55047 547 28618 58212 -31958 46701 41391 46085 -82499
12242 -82499 -129985 -152736 -61484 33027 815 76707 3534 -46578 142033 165571 -21752
12231 -21752 -1291 -147667 -216273 -51394 31165 -82422 -165391 -206458 -245495 -131628 24368
12220 24368 4680 -7531 47075 -54686 -31380 20254 -32585 -143818 -172982 -150747 -32487
12209 -32487 39037 15453 48674 7504 -113555 -228823 -177042 -54118 11555 -62416 -83656
12198 -83656 -150475 -106513 3779 58910 126578 70883 30032 -45864 51656 111144 111771 109830
12186 109830 -32480 -83489 -84057 34512 48582 26510 -132425 -326511 -237045 -241245 -84684
12175h4684Q8206p0499k0468Q8497O171p7546l4831P0419O3794L6434m687J3649
12163G4455n66Q0370O8139K82j3583p3767j09477L442J4215Q395k5265J42797
12151A69437n432J58644Q2997j68765N2592O3405j2574p8812m7325J8705l1078
12140B01794q7037q1203R20r5952O0139J17548j3940L4318j30718n2787J0664
12129c6254j12605k4193J2989K03924J02844P8536p4970r9311m0290K1720R9616
12118A32006O0102j4984J3553L0457N6894j2490k138j8641R7224j9333n1532N7812
12106C28930P4233K20314K04826J2417j57046k32318L2481P6003j14411l8028
12096D07401n1794K5754n5015j05307j58783o8296L012j5504k4556n4370L09J22482
$$ plain form
12175 -84684 3522 -66977 -87445 1052 7223 -70323 -105154 -34735 29059 65493 60806 74455
12163 74455 73889 154259 222398 222680 209097 135330 25853 29295 43510 51905 26640 169437
12151 169437 164005 322649 405646 236881 289473 352878 340304 261492 214167 232872 201794
12140 201794 114757 33554 34474 -61478 -1339 116209 102269 136587 5869 -46918 -36254
12129 -36254 -148859 -173052 -160063 43861 146705 225241 150271 50960 10670 32390 132006
12118 132006 192108 177124 190677 221134 278028 265538 263400 244759 341983 322650 271118 328930
12106 328930 403163 623477 828303 840720 683674 451356 483837 559840 445429 407401
12096 407401 355607 381361 326346 221039 62256 -6040 -3028 -18532 -43088 -97458 -97149 25333
12084B5333J7403q3165j1563R4978J77292J07273n8834o9163J22301J86217L03773
12073H11845K98350P9639o7477q7423k82689j56462o3526k0674m8136O944J04056
12062E74447J69806K49373q498P690r5375k40643k79742r3425M2249Q780o3002
12051B71660n7690J15508p1813k39471j30154N0020P3078P3492N3332j05520j14286
12040h1844K6709N0894P9879L6703j55825j468K56654K5892J6365J06337K72787
12029F33083K92491J44191q3208k65994L8075n4282j74386j46397r7810M6701
12019C32464m9221L150P3588j9915j40664J5659K5087m0836r2639q5997L5759
12008E6435P7736J6450p9438j519o9500l2244J5097m618J32988O8994j81123l3068
$$ plain form
12084 25333 42736 -40429 -51992 42986 220278 327551 268717 199554 321855 508072 811845
12073 811845 1110195 1189834 1122357 1034934 752245 595783 532257 511583 463447 470391 574447
12062 574447 744253 993626 985128 992818 897443 656800 377058 283633 325882 334662 271660
12051 271660 213970 329478 257665 18194 -111960 -61940 11138 84630 137962 32442 -81844
12040 -81844 -55135 -4241 75638 112341 -43484 -44952 211702 237594 253959 360296 633083
12029 633083 925574 1069765 986557 720563 758638 704356 529970 383573 285763 332464
12019 332464 283243 286393 359981 340066 199402 215061 240148 199312 106673 20676 56435
12008 56435 134171 150621 71183 69664 164 -32080 -16983 -21601 111387 180381 -742 -33810
11996c3810Q9813M9015Q219j9919l4194M4165J24946R9240k9764J2617N1101J79356
11984E40785L5630p5277l5040r7913o9835q1113K8242K0463O5155K516l3880J3780
11972C13513P961o0171q1833J12431q106N200k3465K5302N0842k5986n8595J5004
11960B72097k0063M4275j0065R4060J02363J16374K7433m6913o4037J41056K9713
11949F86293O9283R05K4997M9460J09963M987J03207j40933Q7214J89715K08097
11938A393188J17465O2718J03774J36198J79349J47098K40362L24994N01365N46234
11928C752745M37044M46687O51198R64385J091871J163458J577774K016569K829228
11919A4930959L951534N576726Q340870J3158240K2208913L9491211O6882369
$$ plain form
11996 -33810 56003 105018 113237 93318 59124 103289 228235 327475 297711 310328 361429 540785
11984 540785 576415 501138 466098 368185 298350 217237 245479 265942 331097 333613 299733 313513
11972 313513 321474 261303 179470 291901 283795 288995 265530 290832 341674 315688 257093 272097
11960 272097 252034 296309 286244 380304 482667 599041 626474 579561 515524 656580 686293
11949 686293 755576 756481 781478 830938 940901 945888 1049095 908162 995376 1185091 1393188
11938 1393188 1510653 1573371 1677145 1813343 1992692 2139790 2380152 2705146 3206511 3752745
11928 3752745 4189789 4636476 5287674 6252059 7343930 8507388 10085162 12101731 14930959
11919 14930959 18882493 24459219 32800089 45958329 68167242 107658453 174540822
11912A74540822P8283279L2133420j4355021m6046413o7088213n2961018l2493533
11905G2013323j9448269j2389978q369198n957429m418254l364885k588093k092502
11897A3384715j716411j353068j126697j017889q22847o52966n08404m00048n32701
11888E253684m95245l06020j68742k93377j96572l00615j86779j48373m9543j06590
11878C001828l8534m9968J24801J50028l3367r6778j70981j23061j62457j47093
11868B454418j21582j20754j43324k13324j11949k31066j66774n7964n8592q8702
11858A140387p5412k02805j59355r6196P1362j07133j21007P1600J48266k8721
11848F40986r5105j4705P1598q1839j7976m7171o741O4100n1275o6780l9538l4682
$$ plain form
11912 174540822 252824101 284957521 270602500 224556087 157467874 104506856 72013323
11905 72013323 52565054 40175076 31805878 25848449 21430195 18065310 15477217 13384715
11897 13384715 11668304 10315236 9188539 8170650 7347803 6694837 6186433 5786385 5253684
11888 5253684 4758439 4452419 4283677 3990300 3793728 3493113 3306334 3157961 3108418 3001828
11878 3001828 2963294 2913326 3038127 3188155 3154788 3058010 2887029 2763968 2601511 2454418
11868 2454418 2332836 2212082 2068758 1855434 1743485 1512419 1345645 1287681 1229089 1140387
11858 1140387 1064975 862170 702815 606619 677981 570848 449841 521441 669707 640986
11848 640986 545881 531176 602774 520935 502959 455788 449047 513147 461872 395092 355554 320872
11836C20872m6111K1344J01380q44r915p2972K4114L279P2142J2378p0784j2573
11824C42310m8280k8875K821M5750Q507j1617P71p3548q4648m1043M8846L8288
11812A99282L4177j30837k28958n7495R1241K21935R9056K3347L3993K4772k0484
11801B90029L002M0287n7906p4321o4262r8380n3043L102n143n4593n3706L425
11789a21509Q1534N4512P9909N8080J0536J23680K7643L3935j2452m7533P0114
11778C58449l8877j58909q0359O1738O4858K853P1159p4639J1170j5395r1510
11767A10538M817l5262p2533n3713o702o960L7531j7133J7741O070N5273p3897
11755c4230j16782j929L6673o4305l8080N6753J10090P0261k8136J3300J8129
$$ plain form
11836 320872 274761 296105 397485 396641 386726 313754 337868 341147 413289 425667 354883 342310
11824 342310 294030 265155 267976 313726 322233 310616 311387 237839 153191 112148 160994 199282
11812 199282 233459 102622 -126336 -183831 -92590 129345 228401 251748 285741 310513 290029
11801 290029 293031 333318 275412 201091 136829 38449 -14594 -11492 -16635 -71228 -124934 -121509
11789 -121509 -39975 14537 94446 152526 163062 286742 314385 348320 335868 288335 358449
11778 358449 319572 160663 80304 142042 206900 209753 280912 206273 217443 202048 110538
11767 110538 115355 80093 7560 -46153 -52855 -59815 -22284 -39417 -21676 -15606 39667 -34230
11755 -34230 -151012 -152941 -116268 -180573 -218653 -161900 -51810 18451 -9685 3615 21744
11744B1744l6504N6671M3532p0863R5018K49r863L1657Q8704o6530j68479j7739
11732c2403R2611J01847m0853j19013j44741M2293J13798J6357o2588N9017P495
11721C3820k1184Q247L076m2918N8749J32514r2264k13825j70941L5052N5311
11710b14363r8281k6395K11400J89176M9103j50302q6025n6124J02314m8362N7
11699a27802J29745p412k3627n2981J7437J01907L2369L3030j620l5528n479m9236
11687A0803j20501l1176J07343J12007m9601K6554k6730o7918m4987o3573m8472
11676a96251K9373J43156P4918j11757j36522J2819N4136j0511j3671j8077k517
11665a74904M0128M7128K5962M5893J28481L4305j2221Q2393j54788m4384O3395
$$ plain form
11744 21744 -14760 41911 85443 14580 109598 109847 99984 131641 220345 153815 -14664 -32403
11732 -32403 60208 162055 121202 2189 -142552 -100259 13539 29896 -32692 26325 33820
11721 33820 12636 20883 23959 -18959 39790 172304 80040 -133785 -304726 -269674 -214363
11710 -214363 -312644 -339039 -127639 61537 110640 -39662 -125687 -181811 -79497 -127859 -127802
11699 -127802 1943 -5469 -29096 -82077 -64640 37267 69636 102666 101046 65518 60039 10803
11687 10803 -109698 -140874 -33531 78476 28875 55429 28699 -39219 -84206 -147779 -196251
11676 -196251 -166878 -23722 51196 -60561 -197083 -184264 -130128 -140639 -154310 -172387 -174904
11665 -174904 -134776 -87648 -61686 -15793 112688 146993 134772 217165 62377 17993 81388
11654H1388Q0469j00716p0678K14605l1131l4085j24932o8208J9490L3120j8881
11643a9559L7051k408J6147J1224K6311P4602o6560n9231j18155j05681k556O7674
11631a41141J39111P7528k4563j11353r7550J36007J37363O390p8591j04976Q2085
11620B0310n624M821M1141L474J0519j9571j23167m5682O3822J17475R3490p2153
11608H8855j36072O458P8556k9221j20761q6401J18585Q5764j01246l8339N5089
11597g8733N9584J23034J7424p5654r3452J09515M8772J4952q956R3942N265q4992
11585A30701q1984l5822k3351m6553N4983M5151M1977j6664o3804k4833O0606
11574D0407O7745j29120O4357N6116n8471n6686k9193K998J0422O4746M805r881
$$ plain form
11654 81388 161857 61141 -9537 205068 173937 139852 14920 -53288 -33798 -678 -19559
11643 -19559 17492 15084 31231 42455 68766 143368 76808 17577 -100578 -206259 -208815 -141141
11631 -141141 -2030 75498 50935 -60418 -157968 -21961 115402 121792 43201 -61775 20310
11620 20310 14686 19507 60648 64122 74641 55070 -68097 -113779 -49957 67518 161008 88855
11608 88855 -47217 -40759 37797 8576 -112185 -198586 -80001 5763 -95483 -133822 -78733
11597 -78733 -19149 103885 121309 45655 -47797 61718 110490 125442 116486 210428 215693 130701
11585 130701 48717 12895 -10456 -57009 -2026 43125 85102 68438 4634 -20199 40407
11574 40407 108152 -20968 43389 99505 41034 -15652 -44845 -41847 -31425 33321 38126 28245
11562B8245p8167J7639k6051O1617O4384m222m1419l4104K9504m5783O9983j5515
11550B6111m4165k5041P8945k1910j197O9235j10085o7948O3299J8245p6320n3023
11538a43854J25775J27439j9826m0656l1527J6566L374j49323O5998l204P5242
11527B6004n8602r8190J09133O5691n8553j31064j06601L6775Q9969k3996R7790
11516e1644K810n9264N0373k1745r8631L5305M5986M0728L7297N4104K0065j49739
11504i4355r3658K942P7078M6813q0569j1689M5458k1453J6569M0894j2718n8181
11492a42869K1731l6256J3264J10592l4014k3108P7860J9109p3093j4636O609
11481g4811M6683Q9367M3833M3373m9717P8943j18937l5429r8490L4025m8777
$$ plain form
11562 28245 -49922 -32283 -58334 3283 67667 63445 22026 -12078 17426 -28357 41626 26111
11550 26111 -18054 -43095 35850 13940 12743 81978 -28107 -96055 -32756 -14511 -90831 -143854
11538 -143854 -18079 109360 89534 48878 17351 33917 37291 -112032 -46034 -49238 26004
11527 26004 -32598 -130788 -21655 44036 -14517 -145581 -252182 -215407 -125438 -149434 -51644
11516 -51644 -48834 -108098 -57725 -79470 -178101 -142796 -96810 -56082 -18785 35319 55384 -94355
11504 -94355 -188013 -185071 -107993 -61180 -141749 -153438 -107980 -129433 -112864 -71970 -84688 -142869
11492 -142869 -121138 -157394 -144130 -33538 -67552 -90660 -12800 6309 -66784 -81420 -74811
11481 -74811 -28128 61239 105072 148445 98728 177671 58734 23305 -75185 -41160 -89937
11470h9937l5022J27266l3919l6630J6854k9736M4341K2493j11121m4014M0358
11459a29067n7843m6524j1621M8708J28750J06347p02o8011q6990l9528J1093
11448a45388P8193J4567j06778o2981J7556J27327R5143Q5792K3100o6300n8862
11437A369q9475j704J5480m7883K2267N3027n5767o7260O7597Q4317j70868P0036
11425a18864O0437j0215L0886q616K9457j4051O5554O9219k6580J327L7483m3262
11413G2775l4278P5364N9751j6719j22249j41804n487K4920n3325P3268J1463
11402e6321O7535N5380j00423q8144Q0792K3428k2165m0829j01502K6655K07889
11391E2295P3482j12453J2819j20994p0989J3642l2003J2399P8143J19182R1252
$$ plain form
11470 -89937 -124959 2307 -31612 -68242 -51388 -81124 -36783 -14290 -125411 -169425 -129067
11459 -129067 -186910 -233434 -245055 -196347 -67597 38750 38048 -29963 -116953 -156481 -145388
11448 -145388 -67195 -52628 -159406 -222387 -204831 -77504 17639 103431 126531 60231 1369
11437 1369 -88106 -89810 -74330 -122213 -99946 -46919 -102686 -169946 -102349 -18032 -188900 -118864
11425 -118864 -58427 -68642 -37756 -46372 -16915 -30966 34588 103807 77227 78554 116037 72775
11413 72775 38497 113861 173612 156893 34644 -107160 -112647 -87727 -141052 -67784 -56321
11402 -56321 11214 66594 -33829 -121973 -41181 -17753 -39918 -80747 -182249 -155594 52295
11391 52295 125777 13324 26143 -94851 -165840 -152198 -184201 -171802 -93659 25523 116775
11380A16775l5018j05552k919r2925q1190L4636P3681k0980P3879o1888r4271
11369a95772Q4692O3953K5309J61794N9670q4149Q9854J1877j34435K228P8908
11358A63929k1710j14016n6114L759J11432m6149p9378l5976Q1406k6324m2149
11347f1290j853m4808J24244n331L9523J3286p0918j31517m7104J2415R7596L8425
11335c7332q8715p0158j7999N0080k4658j11031N4730J80410O3168l5289J04059
11324F7265n319N8906n6795j06365n5281o1555R9357j7657r9839k0235l234J20575
11312h0177K8704K9640P0828o8550m9210N28M5708K6841j4566r1712j8505R4781
11300b5690M2546o8241O3173j8912m9581L8476Q5122j5468l7792l0385m4131k6168
$$ plain form
11380 116775 81757 -23795 -26714 -119639 -200829 -166193 -92512 -113492 -39613 -101501 -195772
11369 -195772 -111080 -47127 -21818 139976 199646 115497 205351 217228 82793 85021 163929
11358 163929 142219 28203 -27911 -24152 87280 41131 -38247 -74223 7183 -19141 -61290
11347 -61290 -63143 -107951 16293 10962 50485 63771 -7147 -138664 -185768 -173353 -75757 -37332
11335 -37332 -126047 -196205 -214204 -164124 -188782 -299813 -245083 -64673 -1505 -36794 67265
11324 67265 61946 120852 64057 -42308 -97589 -159144 -59787 -77444 -177283 -197518 -200752 -80177
11312 -80177 -51473 -21833 48995 -19555 -68765 -68237 -22529 4312 -10254 -101966 -120471 -25690
11300 -25690 16856 -51385 11788 -7124 -56705 -18229 66893 51425 13633 -16752 -60883 -87051
11288h7051O6383j19001j07717J52392J58630l0558l828k09087o7076N425L3260
11277b08228R0636Q3837k9048m6765m184n041J55412J15501o5782l5538m8301
11266B499l3380j30286O4313M5084k7872r4309R9263P4871o7829j60663m9647
11255b77956N2954Q6484J696K1449l9556M5768N8452n9829r2254O8589J20756
11244a3447L1417j26868p8759k9889j01218k65K07465J63778j4904K191M0980
11233H0481q0449R6222L9747j8364l1726M0644N5371K9807j47972j72681q5754
11222a94674j8434O6008J34902n6598o890L9392Q8699M8988Q709m8743m6481J14994
11210A29872p4052P7675Q1547r0120r8572j9885j00377n8428M5290j9277K4077
$$ plain form
11288 -87051 -20668 -139669 -247386 -94994 63636 33078 29250 -179837 -246913 -241488 -208228
11277 -208228 -117592 -33755 -62803 -109568 -113752 -118793 36619 152120 86338 50800 2499
11266 2499 -30881 -161167 -96854 -51770 -79642 -173951 -74688 183 -67646 -228309 -277956
11255 -277956 -225002 -138518 -136822 -115373 -154929 -109161 -50709 -110538 -202792 -134203 -13447
11244 -13447 17970 -108898 -187657 -217546 -318764 -319029 -111564 52214 37310 39501 80481
11233 80481 32 96254 136001 117637 85911 126555 181926 211733 63761 -108920 -194674
11222 -194674 -213108 -147100 -12198 -68796 -75686 -36294 52405 101393 110102 61359 14878 129872
11210 129872 55820 133495 215042 124922 26350 6465 -93912 -152340 -107050 -126327 -102250
11199a02250R0290Q4684J42251J1692r8404m9136q5758l4970p7541q8357O798
11188b00701P8036M4922N2599j00235L0701M8193j01318r502l8384K630K5427
11177a67632j6632k269l6710P1886J07769n5702n1899J553L6464R1161K5284l1731
11165b8458N2205J24387r2672o2967Q8539K143n1391r2717j3261l1310m2836J6171
11153a32167O1625N4358q7059j01407j4116M5851J7064l5869r301P2619J19076
11142i326m0788m258K279k6789j12478p8235O0572L6040k0438Q3183J0964M5367
11130e3907p161o4033o2803o2754R9564P0388n0559J1721N669j53066K4284P9994
11118a62663J71976J3547j28620L458P2471P815q9408l722l1023L851J01646k9203
$$ plain form
11199 -102250 -11960 72724 214975 226667 128263 79127 -6631 -41601 -119142 -207499 -200701
11188 -200701 -122665 -77743 -25144 -125379 -94678 -46485 -147803 -157305 -195689 -193059 -167632
11177 -167632 -184264 -186533 -223243 -151357 -43588 -99290 -151189 -149636 -113172 -22011 3273 -28458
11165 -28458 23747 148134 55462 -7505 81034 83177 31786 -60931 -74192 -105502 -148338 -132167
11153 -132167 -70542 -16184 -103243 -204650 -218766 -172915 -155851 -191720 -201021 -128402 -9326
11142 -9326 -50114 -54372 -52093 -78882 -191360 -269595 -209023 -172983 -193421 -110238 -99274 -53907
11130 -53907 -61068 -125101 -187904 -250658 -151094 -80706 -131265 -119544 -113875 -266941 -242657 -162663
11118 -162663 9313 22860 -105760 -102302 -29831 -22016 -111424 -115146 -146169 -142318 -40672 -69875
11106f9875j0107J7744O7503r895j7291L5887p289r934M914P3659m3789r6425
11094f4898k3593L4980P5404R0371n1828j04298j6205L4413N7061K759j62571
11083a28405J11669J9279p6890j32943j24783o149J42979O0465r187O7459J08680
11072C2174r1500J2283Q0112J14768J3410n2141j60942o1867N8820k1782j13597
11061a90262l2697J9749R7131M1108Q3034q355m7602o4739o1640N0007L4913K4886
11049e4467K3608J2035m7274R8916n0649o631N8996J21741P8698O0700J04286
11038C99959J47888J8135q048p7437p4753J146K3851K6636J03242O4226j7239
11027F07606O5663M6282P4606M8457n3406j56427l6080Q2050L2708J01403J17414
$$ plain form
11106 -69875 -79982 -62238 5265 -4630 -21921 13966 6677 -3257 1657 75316 31527 -64898
11094 -64898 -88491 -53511 21893 112264 60436 -43862 -60067 -25654 31407 34166 -128405
11083 -128405 -16736 2543 -74347 -207290 -332073 -338222 -195243 -134778 -143965 -76506 32174
11072 32174 -59326 -47043 33069 147837 161247 109106 -51836 -113703 -54883 -76665 -190262
11061 -190262 -222959 -203210 -106079 -64971 18063 9708 -37894 -102633 -164273 -114266 -79353 -54467
11049 -54467 -30859 -18824 -66098 32818 -17831 -24462 34534 156275 234973 295673 399959
11038 399959 547847 565982 557934 480497 405744 406890 430741 457377 560619 624845 607606
11027 607606 673269 719551 794157 842614 789208 632781 596701 678751 711459 812862 930276
11016I30276J9304Q9756K82376N0132q6008k06114k52025j05807p3659J3050R2825
11005G54106o7014q417j0350j6818J37593R7880j5103j96271j08747j9760n6132
10994D90967n2987k6087l7866m6715N9896J1669J3936J11088p2266j44752m1631
10983B65252n6649q6357q84J1447k7760l1996J3197N5513m4078m2673r3507M4776
10971F281N6336P4757K6259j60973r2785p0547M9054J44950N9318J27204l7611
10960A82243k00787k23780l91J5247J3248O3633o9368m5124L1579J20394J42610
10949B9504L3016j2189m8502K0498m5171k5127M24n3511O2131J07135l4566Q144
10937D1786j7219j39836p3092L5308P3544Q7526j5451M2293L3410n5198m3803
$$ plain form
11016 930276 949580 1039336 1321712 1371844 1285836 1079722 827697 721890 648231 661281 754106
11005 754106 687092 678675 668325 651507 789100 886980 871877 675606 566859 547099 490967
10994 490967 437980 411893 374027 327312 387208 398877 412813 523901 451635 306883 265252
10983 265252 208603 122246 121362 132809 105049 73053 86250 141763 97685 55012 -38495 6281
10971 6281 62617 137374 163633 2660 -90125 -160672 -111618 33332 92650 219854 182243
10960 182243 -18544 -242324 -242715 -227468 -214220 -150587 -219955 -265079 -233500 -113106 29504
10949 29504 62520 50331 1829 22327 -22844 -47971 -47547 -101058 -38927 68208 33642 41786
10937 41786 24567 -115269 -188361 -153053 -79509 8017 -7434 34859 68269 13071 -30732
10926c0732k0898P5121Q0705J2188K7070r8308o5431m1123R3643J71230Q128q2515
10914A29078K419r9810o2507l3737O5974j3608j32645N7918p5899K0301N9675
10903h2841J17598M0467P3398J6460p7358m7064j34734P8805N8853j00573k8683
10892h5672J18187P0382l5437M626j55847j80969J36265K24689J33806j26036
10882A03994j75295q5616m266N6580k3633j29267n583J74526O9669n7375n2048
10871a28314k706m6345l8641k9373P4321K3860o7652R6963K8192o0892Q3990P3494
10859F897n0206Q424K23821J34697k5643q9478J3671K3451J4528K0565j47176
10848A33551p8399k3441j7669M4797p7474m2625K6600O1906O8219M5090L772l4966
$$ plain form
10926 -30732 -51630 23491 104196 116384 143454 45146 -20285 -61408 32235 203465 211593 129078
10914 129078 131497 31687 -30820 -64557 1417 -12191 -144836 -86918 -162817 -142516 -82841
10903 -82841 34757 75224 148622 165082 87724 40660 -94074 -15269 43584 -56989 -85672
10892 -85672 32515 102897 67460 72086 -83761 -264730 -128465 96224 230030 103994
10882 103994 -71301 -156917 -161183 -104603 -128236 -257503 -263086 -88560 -18891 -76266 -128314
10871 -128314 -131020 -177365 -216006 -245379 -171058 -147198 -214850 -117887 -89695 -150587 -66597 6897
10859 6897 -43309 -34885 188936 323633 297990 208512 222183 245634 260162 280727 133551
10848 133551 55152 31711 14042 58839 -18635 -61260 -34660 27246 95465 140555 144327 109361
10836A09361p0565N2243r0038j02645M2321P1892K4822k4259m3821q3574L4487
10825g9776J00584N3395L6079O8021N6309K1976j59299r4097l8652n7188p4936
10814a67584j70648l342J82284J11440N7005m0012j0245j31745o11J19092J6339
10803c8027N9084N3614j3614j06267K3545j55329J5654P5482J17141K2663k8116
10792B5830K96K8392l5953P0110J24960j07933j6397R8020l5709m6408q9539l5804
10780b0135q8057l3585O703J45739r614k9448j0992n2785P425j0816j8558J71513
10768E7390Q9695j73679m2676j3471j42526l9046R6420J31082L5506M0496O3389
10757A02580l346p9453p7351k8486k9301K2980l7535k5855O2120Q8608M858J7309
$$ plain form
10836 109361 38796 91039 1001 -101644 -59323 12569 37391 13132 -30689 -114263 -79776
10825 -79776 20808 74203 110282 178303 234612 256588 97289 3192 -35460 -92648 -167584
10814 -167584 -338232 -341574 -159290 -47850 9155 -30857 -41102 -172847 -173458 -54366 -38027
10803 -38027 21057 74671 61057 -45210 -21665 -176994 -161340 -85858 31283 53946 25830
10792 25830 26126 54518 18565 88675 213635 105702 89305 187325 151616 105208 15669 -20135
10780 -20135 -108192 -141777 -135074 10665 1051 -28397 -39389 -92174 -84749 -95565 -114123 57390
10768 57390 147085 -26594 -69270 -82741 -225267 -264313 -167893 -36811 -1305 39191 102580
10757 102580 99234 19781 -57570 -86056 -115357 -92377 -129912 -155767 -93647 -5039 -181 17128
10745A7128j2845n3013n8018M5443N555J009n424J8281o582J0431L5990K8142
10733B6097j57071p5404L9786M0861M2975o66n2210o8269L2703J22803J17986
10722F9591Q1606k1546r1969p0346J8346N2477Q6129J8363l5289r4009j03041
10711h9688q8728N3778o6049j8505J92182J72583j813q1965j11297j96973n0082
10700b86557J23339J46617j14343K2487M2004p8597K01173J3103n6037P4052p8740
10689H501j0387M2575K9128J2919J33784K5013Q5604j6778j8285l9918l7094J10923
10677C25985n6190j18706j37440p452L0872J3249R0705K1544p0060n0652O7068
10666A08923J05025K2415p4929K1867K1196J3974l7640R97k4727N4559L8011M6020
$$ plain form
10745 17128 4283 -48730 -106748 -61305 -55750 -54741 -60165 -41884 -48466 -38035 -2045 26097
10733 26097 -130974 -206378 -166592 -125731 -82756 -83422 -135632 -203901 -171198 -48395 69591
10722 69591 151197 129651 37682 -32664 -14318 38159 124288 142651 107362 13353 -89688
10711 -89688 -178416 -124638 -190687 -209192 -17010 155573 153760 71795 -39502 -236475 -286557
10700 -286557 -163218 -16601 -130944 -108457 -66453 -145050 56123 69226 13189 87241 8501
10689 8501 -1886 40689 69817 82736 216520 241533 327137 310359 292074 252156 215062 325985
10677 325985 269795 151089 13649 6197 37069 50318 141023 162567 92507 41855 108923
10666 108923 213948 236363 161434 183301 204497 218471 180831 181828 157101 211660 249671 295691
10654B95691j6983P9348J4520L9343O8207N5661k0869j4764K7607Q8843N4961
10643F71565p830J9310J00234j2977q0902m6635N8511J35006J00013J74288O9733
10632A180316J31982o0624L7009J19929J75742L28898L48958K89646K87918M32349
10622C272123L90764L69025M32201L80896M37962Q00489J024273J390782K058504
10613A0557019K904078M050646N379750P608201J0057471J1646336J0907486P392717
10605G0503704K485299j800268l755303l203162q30815K719154P497237J3443452
10597H7059298K0037793K4349532K1397734J1056196j126828j0878856j4948664
10590A36946205j2810141o800098M29047Q416426J7603653K6514437L1060103
$$ plain form
10654 295691 278708 358056 372576 411919 480126 535787 514918 500154 527761 616604 671565
10643 671565 663735 683045 783279 770302 689400 642765 701276 836282 936295 1110583 1180316
10632 1180316 1312298 1251674 1288683 1408612 1584354 1913252 2262210 2551856 2839774 3272123
10622 3272123 3662887 4031912 4464113 4845009 5282971 6083460 7107733 8498515 10557019
10613 10557019 13461097 17511743 22891493 30499694 40557165 52203501 63110987 70503704
10605 70503704 72989003 71188735 67433432 64230270 63399455 66118609 73615846 87059298
10597 87059298 107097091 131446623 152844357 163900553 162773725 151894869 136946205
10590 136946205 124136064 117335966 117765013 126181439 143785092 170299529 201359632
10583B01359632K4466193P628631j0178471k3472767k8315829k4404295j6435277
10576A30647817q140036j31600P428586J4084698J6445715J0882006j100534j2888835
10568A57227817k0729809k2500468j8668423j2902270p501605k825728Q89480
10561G2988994L463189L975959J288452l528788q046915j0876617j1351020r754656
10553C8158598p621052n732763m299160l198160k426661j875185j406267j161442
10545A0437908r55474p75410p49357p26176o93050m89799m49032l71251l27611
10536D900748k78049k56767l78071k46940j74386j10752j20115j63434k73907
10527B898327k23200j11007n6226k01023j21342j87570j72804k7940j26421n3358
$$ plain form
10583 201359632 225825825 233454456 223275985 199803218 171487389 147083094 130647817
10576 130647817 122507781 122376181 129804767 143889465 160335180 171217186 170116652 157227817
10568 157227817 136498008 113997540 95329117 82426847 74925242 72099514 72988994
10561 72988994 76452183 80428142 81716594 78187806 70140891 59264274 47913254 38158598
10553 38158598 30537546 24804783 20505623 17307463 14880802 13005617 11599350 10437908
10545 10437908 9482434 8707024 7957667 7231491 6538441 6048642 5599610 5228359 4900748
10536 4900748 4622699 4365932 3987861 3740921 3566535 3455783 3335668 3172234 2898327
10527 2898327 2675127 2564120 2507894 2306871 2185529 1997959 1825155 1797215 1670794 1617436
10517A617436N0674k3399o0410m5187k07194j08322k5637q3041P6269j15743L485
10506A078931r8399j47115N4484J01494m9139j07509j7703N7195r6695n1490N5217
10495G79271J12221l1602o9401j08771L3691m4190p8610k0366n418j11583p2053
10484C83189J2718J12457j6996k7517M1726K456p7750m3284R111p9899J26577
10473D42788O9002o6194K1977q1183J2153J18591O9716q8408n8421k969J03557
10462E40609j1774q3963q9503p693q973O3220J5935P4964O6274j526j03605K5151
10450D79116o6654M8004k0094p0127N1777K3090k4875K3297Q3511J8522k8777
10439E16790k29p082j53178j31017m6170J1897J29577J0500K3656K8977j40064
$$ plain form
10517 1617436 1668110 1644711 1584301 1539114 1331920 1223598 1197961 1114920 1191189 1075446 1078931
10506 1078931 980532 833417 887901 989395 940256 832747 815044 872239 775544 724054 779271
10495 779271 891492 859890 790489 681718 715409 671219 592609 572243 566825 455242 383189
10484 383189 395907 508364 491368 463851 505577 508033 430283 386999 396110 316211 442788
10473 442788 511790 445596 467573 386390 398543 517134 586850 498442 440021 437052 540609
10462 540609 528835 444872 355369 347676 338703 401923 417858 492822 559096 557570 453965 479116
10450 479116 412462 460466 440372 370245 422022 445112 420237 443534 527045 545567 516790
10439 516790 516561 509479 356301 225284 179114 191011 320588 331088 354744 383721 243657
10428B43657r9839m0938K7470J23314O1086o3246j8752R1333j4456n0009j57337
10417A02283k6417L569R6119j6478p1610Q876m0145p0322r1054Q6500J16750R9962
10405A98033j01661n7389q6928J0142O423M3577J45638k0817p8727n164m6082
10394G045l2725j2137J9623L9092K0302L2973J10636J91807M8861r0268j62776
10383A72433r5681P8343k9236L4100M740m6989o7689r182M5574o1746j21077O3939
10371c2471R4160j7319Q778R9023l4042O4470p8122l1017M0888j4501P5696j6566
10359A58977N7991K5539k2701j53572j64079n2671O3517K4619P22K2867L0844
10348g947N8557J12336l8297m4278q7373Q0766n8467O0767J920m5764o29O7690
$$ plain form
10428 243657 143818 102880 130350 253664 314750 251504 232752 324085 309629 259620 102283
10417 102283 75866 79435 175554 159076 87466 96342 56197 -14125 -105179 -18679 98071 198033
10405 198033 96372 38983 -47945 -37803 -31380 12197 157835 137018 58291 53127 7045
10394 7045 -25680 -37817 -18194 20898 41200 74173 184809 376616 425477 335209 172433
10383 172433 76752 155095 125859 159959 164699 117710 50021 40839 86413 24667 -96410 -32471
10371 -32471 61689 44370 53148 152171 118129 182599 104477 73460 114348 99847 175543 158977
10359 158977 216968 242507 219806 66234 -97845 -150516 -86999 -62380 -61658 -38791 -7947
10348 -7947 50610 162946 124649 80371 -7002 73764 15297 76064 77984 32220 31591 99281
10336I9281p4067l7673L066O2067K8424n7888O7819O9586j10729o1416P2846O0560
10324A21876J38047N4301j01761m3220L616p2304l8046m6678p0485R9104J18985
10313A63435q2740o3913k0078k559R4950Q3370o1947m4849m6986n8000p1676q2812
10301a93805l4006N9165Q8043Q1176J3272O7939N3725m7714j27950L0607P2857
10290F3309J1711Q6318n8333l7116P6635J02680L7504j10793j97499j0207J25667
10279H9876Q2260o262m8939J33450j7585J3437l8955o6469j22426p4764J27538
10268G1161Q9053J43066J46665q2357j91843o319l1946N4133J10370Q9118j49190
10257B41911j83728o3800J22911p8852J18212Q177j43572o1594K9550J15732J06687
$$ plain form
10336 99281 25214 -12459 -9393 52674 81098 23210 91029 160615 49886 -11530 61316 121876
10324 121876 259923 314224 212463 169243 172859 100555 62509 15831 -54654 44450 163435
10313 163435 80695 16782 -3296 -5855 89095 172465 110518 65669 18683 -39317 -110993 -193805
10301 -193805 -227811 -168646 -80603 573 13845 81784 135509 87795 -40155 -9548 63309
10290 63309 75020 161338 103005 65889 142524 245204 282708 171915 -25584 -35791 89876
10279 89876 172136 165874 116935 250385 232800 246237 207282 140813 18387 -56377 71161
10268 71161 160214 303280 449945 367588 175745 169426 137480 191613 301983 391101 241911
10257 241911 58183 -5617 117294 38442 156654 164831 21259 -40335 -10785 104947 211634
10246B11634j4685k9009J3543n4229j9253N6944O7361j8985L0768m6982l2540
10235A64567p0530o6071p7423N60N6581J565L870L1730K7086N3956p8956K6721
10223G3656Q12K5727K1617j03903o0952M6293j10842j22956j1789P4330o9521
10212b37528k1095J02289J22817j95541r8264J46739j9863J2113J61829J06042
10202G9538Q5154j38297r3914Q8398j17147j58857L9330J80632q7070L3893J00957
10191A2617R8569j5289j19238j39895L7642J43893n984J5050J04088j2671k3810
10180I4972l8940k8549N8374J12041J03665l7528J619l5570L5057J36502L6025
10169D37668P632j04437n1088P1738L0166N8199J13N0071N7709R3084J71387K78508
$$ plain form
10246 211634 196949 167940 181483 127254 108001 164945 232306 213321 244089 197107 164567
10235 164567 94037 27966 -49457 -48897 7684 9249 13119 44849 71935 125891 46935 73656
10223 73656 74468 100195 121812 17909 -43043 3250 -107592 -230548 -242337 -168007 -237528
10212 -237528 -258623 -156334 -33517 -229058 -327322 -180583 -200446 -188333 -26504 79538
10202 79538 164692 26395 -67519 20879 -96268 -255125 -215795 -35163 -122233 -88340 12617
10191 12617 111186 95897 -23341 -163236 -125594 18299 12315 27365 131453 118782 94972
10180 94972 56032 27483 85857 197898 301563 264035 265654 230084 265141 401643 437668
10169 437668 445300 340863 289775 361513 391679 449878 449991 500062 557771 650855 822242 1100750
10157A100750L3370m0026m0427k61090j54377O1356Q9259R4719Q7493K17160J72847
10146A361034P0501P988m2223j24448k45632j85060j03612o3547J34371J14825
10136I24197J10791J02070j16453k01140q8509m801p7763r5663j55549r8270q5664
10125B13246P5549J09116O170q45p3666J52825R7285n4010j08270j34672o0064
10114B22664l9048j35456j23581L0832J76219P5014K1979o0738m8476J13248J56766
10103C89423p4185q4682r2074n1890O860k5797l2O5215O3306M0035K6374k3602
10091B38951n7381m9331P2373M854r2714n2994J8255o3615q2607N1363N8747j08228
10079f2327J9489j06086K6113j0199j3982q674P7504R1283O7700k1094j21052
$$ plain form
10157 1100750 1134120 1094094 1053667 792577 638200 699556 788815 883534 971027 1188187 1361034
10146 1361034 1431535 1439523 1397300 1272852 1027220 842160 738548 675001 809372 924197
10136 924197 1034988 1137058 1020605 819465 730956 726155 648392 552729 397180 298910 213246
10125 213246 288795 397911 404081 403236 329570 482395 579680 525670 417400 282728 222664
10114 222664 183616 48160 -75421 -44589 131630 206644 228623 167885 119409 232657 389423
10103 389423 315238 230556 138482 86592 93452 67655 67623 132838 196144 236179 262553 238951
10091 238951 181570 132239 204612 209466 116752 63758 82013 18398 -64209 -12846 45901 -62327
10079 -62327 -42838 -148924 -122811 -133010 -146992 -155666 -78162 13121 80821 59727 -61325
10068f1325n6140K5337K3124j5777L2834L1462j242M475n4328J0255N1335O1261
10056E1271J2119l7190p1827R875K6170k2342J168P6724J48875N0634q8599j61424
10044d546P657L5042R9364M2212l6524p3483n0160L3623o5904O2384M1403J6678
10032A07746J20769P658j62410j24301k1936N855N816O710M3986J67826O9956
10021B27675O6449m8994j02479o894R1298q9625k886k7977q907J2969o8332P5236
10009A17533J23772n2218q3850Q1594R8416m1743J0722m9779j55055J4052k9331
9998C4113M6796k10775j41447O9590Q6949J07583m7030r0730J4001M6383Q321
9987g6246r5298k0817l4539M0214J48470K1196o05j23017P253L7241m7097j2778
$$ plain form
10068 -61325 -117465 -92128 -69004 -84781 -51947 -20485 -21727 -17252 -71580 -61325 -9990 51271
10056 51271 63390 26200 -45627 -35752 -9582 -31924 -30756 45968 194843 245477 156878 -4546
10044 -4546 3111 38153 137517 179729 143205 69722 19562 53185 -12719 49665 91068 107746
10032 107746 228515 236173 73763 -50538 -72474 -66619 -60803 -54093 -10107 157719 227675
10021 227675 294124 245130 142651 135757 227055 137430 134544 106567 97660 110629 42297 117533
10009 117533 241305 189087 105237 186831 285247 243504 254226 204447 49392 63444 34113
9998 34113 80909 -129866 -271313 -201723 -114774 -7191 -54221 -144951 -130950 -84567 -76246
9987 -76246 -171544 -192361 -226900 -186686 -38216 -17020 -17625 -140642 -133389 -96148 -143245 -156023
9975a56023O1031M1901p8778q2178J77595P6837K0661p044P1897q7844M7m9790
9963a1688N5413J0206L6617l8282q5050q6568J8575M8251k420m5359K5415l7685
9951a12575J12259J2539j02053R1401O9854k4903n759o4895n6539J78320K6934
9940A24583q709l4023L2093K4424k2458p5939k7907p818r4524O3607J27208j64210
9928f3673j26934O6436L5507k6965Q1543J10404O5109r7515R7941R4819l3712
9917B02960q2637p7849M0845J115q8855j66208R402O3196P4817N7760J5492M4434
9905I4472J15159m7990k00672j10646L7257P0328J31287J5732N5726m6157o8968
9894D5528N2605o1892j30847n4701j0195J77968P39j44219r6927J41361J57003
$$ plain form
9975 -156023 -94992 -53091 -131869 -214047 -36452 40385 61046 54002 125899 38055 38102 -11688
9963 -11688 43725 53931 90548 52266 -32784 -119352 -100777 -52526 -54946 -100305 -74890 -112575
9951 -112575 -316 12223 -89830 1571 71425 46522 40763 -24132 -80671 97649 124583
9940 124583 115874 81851 113944 138368 115910 39971 12064 4246 -90278 -26671 100537 -63673
9928 -63673 -190607 -124171 -88664 -115629 -34086 76318 141427 43912 141853 236672 202960
9917 202960 120323 42474 83319 84434 -4421 -170629 -161227 -98031 -23214 34546 50038 94472
9905 94472 209631 161641 -39031 -149677 -112420 -42092 89195 104927 160653 114496 45528
9894 45528 98133 36241 -94606 -149307 -159502 18466 19205 -125014 -221941 -80580 76423
9883G6423O834q8393j03087p141j0999N2172J49422J4173j68478K6288k2461N8257
9871a6990J10977N8904j3762n1741m649L2806j6392O3223P458J5492r5232j94508
9859a04414m9511J03764M7327J3598M2890L6120j23301l4690k1140Q520R646J3614
9847e7577n501K7860J52234M0552k345N6760M903r6363j7842j1611p9852m2802
9835c1584Q7924Q4698l4802j76671p5596P3424L9784P939J05070m8903q704j6088
9823F491K4352p3855K2153L8254o2721l0205N7506q1022L2975N1769O2623n6828
9811h508o0252n0974M5837K2788l1734m8655L9394J36711N4487m3755k8473O0240
9799H7106j5925K6402o3103j21445L9254K1268O1910J03063r644p5895q2006p9616
$$ plain form
9883 76423 83257 -5136 -108223 -115364 -126363 -74191 75231 89404 -79074 -52786 -75247 -16990
9871 -16990 93987 152891 139129 87388 82739 115545 99153 162376 169834 185326 90094 -104414
9859 -104414 -153925 -50161 -2834 10764 53654 89774 -33527 -68217 -89357 -80837 -71191 -57577
9847 -57577 -63078 -35218 117016 157568 155223 211983 216886 120523 102681 91070 11218 -31584
9835 -31584 56340 141038 106236 -70435 -146031 -72607 -32823 -24884 80186 31283 22579 6491
9823 6491 30843 -43012 -20859 17395 -45326 -75531 -18025 -99047 -66072 -14303 48320 -8508
9811 -8508 -68760 -119734 -73897 -51109 -82843 -131498 -92104 44607 99094 55339 26866 87106
9799 87106 71181 97583 34480 -86965 -47711 -26443 35467 138530 128886 52991 -29015 -108631
9787a08631r9167L9883J09598m2166L7168l66M9171N0826n5694j5575N8238j1526
9775A1759p902l0828j5172k139j19495M6036J16087j465l7027l119o6616K5284
9763h4597J31409o544L4427q1289j34582L9127J91950O4309m6719r3022l2390
9752a7921R6162R549n7488K8486n5642j33053k3325N0867n0990j3888l7570L6206
9740a68607k2355k9883J17472Q0346Q8289q3658p9588p077J6654P7350N8812O353
9728E4108m5395l9035l2191M0215J9694Q0554p020q8657l3573m9632O97j37121
9716b37356R6234J02905K09305J00933k7367m9227j13804j17161m9246Q9599q857
9705d042o8005K9984M1512n38q8852k3896r246K76J18792R7755q8537P173l6300
$$ plain form
9787 -108631 -207798 -167915 -58317 -100483 -63315 -63681 -14510 36316 -19378 -34953 23285 11759
9775 11759 3857 -26971 -42143 -44282 -163777 -117741 -1654 -3119 -40146 -43265 -109881 -84597
9763 -84597 46812 40268 74695 -6594 -141176 -102049 89901 154210 107491 14469 -17921
9752 -17921 78241 87790 30302 58788 3146 -129907 -153232 -102365 -153355 -167243 -204813 -168607
9740 -168607 -190962 -220845 -103373 -23027 65262 -18396 -97984 -105061 -88407 -11057 47755 54108
9728 54108 8713 -30322 -62513 -22298 -2604 77950 70930 -17727 -51300 -100932 -100235 -237356
9716 -237356 -141122 -38217 171088 272021 244654 195427 81623 -35538 -84784 4815 -4042
9705 -4042 -72047 -42063 -551 -1089 -89941 -113837 -123083 -122807 -4015 93740 5203 12376 -23924
9692b3924j13416N3065R2077P7359o4768j02846L1777L0451M718n651J04194R780
9680I2816j50239N742J3551N9022K6586P6285n9712r2476o5941j02655J4520O1262
9668a21239N3866J15769m4506K1198l0637M5678R1804l9344j24284j12462L2833
9657a11324N2725R4874k2485j29242j189P2289P9945j09920q7125O5237J5112
9646h1103K5036n8113r1891K9518K8917M3953O7581p6156L3082O2477j4098o0381
9634i1178J3532K3534k58j5304k7445P0348M3276j15549p0568M5191J16232K7285
9622A9096L1885m1160k10364o8435l8591k2730Q7045J13177Q306J15826Q3085
9611G7140l6795n5595M5848M6718k8771p2564J0686p7751m0344M5538Q3913J43271
$$ plain form
9692 -23924 -137340 -84275 7802 85161 20393 -82453 -50676 -20225 -15507 -21158 83036 92816
9680 92816 -57423 -51681 -38130 20892 47478 123763 64051 -28425 -94366 -197021 -182501 -121239
9668 -121239 -67373 48396 3890 25088 -5549 40129 131933 92589 -31695 -144157 -111324
9657 -111324 -58599 36275 13790 -115452 -116641 -44352 35593 -74327 -161452 -96215 -81103
9646 -81103 -56067 -114180 -206071 -176553 -147636 -103683 -36102 -112258 -79176 -16699 -30797 -91178
9634 -91178 -77646 -54112 -54370 -69674 -97119 -26771 16505 -99044 -169612 -124421 -8189 19096
9622 19096 50981 9821 -200543 -268978 -307569 -330299 -243254 -130077 -121771 -5945 77140
9611 77140 40345 -15250 30598 77316 48545 -24019 -13333 -91084 -131428 -85890 -1977 141294
9599A41294J0429j66873n7291j3852J16501r9541j14364J4111L7629p527j9813
9588a59297P8128J70345M2768j71730l033m1196p7754J29543J79273m0864m0416
9577F5767K210o0938p7284O2291L7525n345j02217r540P3321J21681p4738p1062
9565c8329O581J45759r2159j09647n3934j73100O9317J58479O1572l3018k9593
9554h8072N2332o566j2781j0918N1052J4229L4190K7717k5179L4656j1643N7935
9542A16952L081j3171k2191n2576o5703J20796L7187k2217n6485j09165p1918
9531a35410m285L7013j2844J52239N2373j45551N9347L6649l5524q587K5858R2483
9519A13761N0644o9453O0796m1633r7419L0890j17545p1827O8698J1603L6873
$$ plain form
9599 141294 151723 -15150 -72441 -86293 30208 -69333 -183697 -169586 -131957 -139484 -159297
9588 -159297 -81169 89176 131944 -39786 -42819 -84015 -161769 -32226 147047 106183 65767
9577 65767 67977 7039 -70245 -7954 29571 24226 -77991 -87531 -14210 107471 32733 -38329
9565 -38329 -31748 114011 21852 -87795 -141729 -314829 -245512 -87033 -25461 -58479 -88072
9554 -88072 -35740 -42306 -55087 -66005 -14953 -724 33466 61183 36004 70660 59017 116952
9542 116952 120033 106862 84671 32095 -33608 87188 124375 102158 45673 -63492 -135410
9531 -135410 -139695 -102682 -115526 36713 89086 -56465 2882 39531 4007 -4580 21278 113761
9519 113761 164405 94952 155748 114115 16696 47586 -69959 -141786 -73088 -61485 -24612
9508b4612m8227J04605J25535L369k0246r0630r3735R9497O4180M6972q5789r9379
9496a8460q7393M466k411J37747k1414n574l8628r9814p8919K0871L2196J11970
9484d5363M7523p4839p4210k2094L936R0236J42365P6428l4929j37175j55727
9473a83849k3129N1031N5651J19671Q9905R6989K2805k3089o9312l5799O2053
9462A62927J34685M2507j46134j37911k5376J02135J5631r4982r4890J9062q8878
9451a11224J61197N8580j10749m5811k9341l4484J3132K7753K325N9072Q115k087
9439c522L146k06146k3549K2510J11451J36123K1826j8752j587n4840m3990k2487
9427g9817o2455j07333m3688J05322J4734N6457j941O7944R3268o3196o8736n2054
$$ plain form
9508 -24612 -72839 31766 157301 160670 140424 49794 -43941 55556 119736 166708 80919 -18460
9496 -18460 -105853 -101387 -103798 33949 12535 6961 -31667 -131481 -210400 -189529 -157333 -45363
9484 -45363 2160 -72679 -146889 -168983 -165047 -74811 67554 143982 109053 -28122 -183849
9473 -183849 -206978 -155947 -100296 19375 109280 206269 229074 205985 136673 100874 162927
9462 162927 297612 340119 193985 56074 30698 132833 148464 53482 -41408 -22346 -111224
9451 -111224 49973 108553 -2196 -48007 -77348 -111832 -98700 -70947 -68622 -9550 -1435 -3522
9439 -3522 -376 -206522 -230071 -207561 -96110 40013 61839 43087 41500 -13340 -57330 -79817
9427 -79817 -142272 -249605 -293293 -187971 -173237 -116780 -118721 -50777 42491 -20705 -89441 -141495
9415a41495p624l1819P4393L700o0346J49915K3693K882j12160r6665N0287J06488
9403c8751l9375k8621R722R7904J57165R5316l1729m8415l5847n9708o2985n2860
9391c8184o5094n229J19460N27o1669l5252L1529L3975M4164n5151j5377K1911
9379b4390o2799J8155o7850p4336J12978J21544n5479O212M636m1178l687n6656
9367a22850P9274k8576J8984N1922o1732o2874Q1320M6485j6137o9052k35887
9356c19123o5913J04530N5996o6317O4945J37097o6990J9050J71659P6256m9959
9345F1231N7711K41507r6704l3230k2770j16674o1500l3096j07815J9153k7744
9334a19931R0774K1423L9517k8172l3444R4773j01925M8462M385M680Q890K0193
$$ plain form
9415 -141495 -149119 -180938 -106545 -102845 -163191 -13276 10417 13299 -98861 -195526 -145239 -38751
9403 -38751 -78126 -106747 -97025 879 158044 253360 221631 173216 137369 77661 14676 -38184
9391 -38184 -103278 -108507 10953 11480 -50189 -85441 -53912 -19937 24227 -30924 -46301 -24390
9379 -24390 -87189 -69034 -136884 -211220 -98242 23302 -32177 -25965 -21329 -62507 -66194 -122850
9367 -122850 -43576 -72152 -53168 -1246 -62978 -125852 -44532 1953 -14184 -83236 -319123
9356 -319123 -385036 -280506 -224510 -290827 -225882 -88785 -155775 -136725 34934 111190 61231
9345 61231 118942 360449 263745 230515 207745 91071 29571 -3525 -111340 -92187 -119931
9334 -119931 -29157 -7734 31783 3611 -29833 64940 -36985 11477 15862 20542 29432 49625
9322D9625q6382k2016J0093J15077Q8825k4370K209r6333k08036m8137O0512J17948
9310d0985J44680P0979n2354m4928K0021m8150n5031r3418k2719L0536J16413
9299B5044m2991o4189j3381n4639P4241L1609m9169J2051J43728L0213L8319k8247
9287A02589l2363r4904Q592j06971r7044l7289j77321m3803M938L6923P7472K8654
9275c30527Q0688m7117P296J26996J36137L3027p2624r952R450m6346K4967N5437
9263c2568k370p606o004L7152M1549M8896n592N1653Q4889L9829j53215j52111
9251e5498L7672P7706k0704m59j13253j48898j1384L7266J10086J10390k6501
9240c577j10488q749J06929L2886r2317R140o617J735N6868k05025r5864J38729
$$ plain form
9322 49625 -36757 -58773 -48680 66397 155222 130852 133061 36728 -171308 -219445 -158933 -40985
9310 -40985 103695 174674 122320 77392 97413 49263 -5768 -99186 -121905 -91369 25044
9299 25044 -17947 -82136 -95517 -150156 -75915 -44306 -93475 -81424 62304 92517 130836 102589
9287 102589 70226 -24678 -16086 -123057 -220101 -257390 -434711 -478514 -473576 -436653 -359181 -330527
9275 -330527 -249839 -296956 -289660 -162664 -26527 6500 -66124 -76076 -66626 -112972 -88005 -32568
9263 -32568 -34938 -42544 -48548 -11396 30153 79049 73457 125110 209999 249828 96613 -55498
9251 -55498 -17826 59880 39176 38717 -74536 -223434 -234818 -197552 -87466 22924 -3577
9240 -3577 -114065 -122814 -15885 17001 -75316 -66176 -72793 -71058 -14190 -219215 -315079 -176350
9228a76350J61483j4647L3640N545J8661r8513r1016N6284R3102P4029M0657j41890
9216c9015l1181K8649p5200m3477p8540Q0716Q0714R8380o0249M2341J2317j37674
9204a22219j3808J86295J9566o9566o7301j34901l9303J12632L1977j39045r922
9193b45595J24974o3323n7669J02781L3395N4713J9809K0197k961q158J42183
9182A20346N3510l0043o1842p4402K8283J42074O1999q5921j17190j5838q7916
9171f6940k0585K52281J43859j20172j61448j98578O7459K6660j61063K8771Q7200
9160a22556k2668k3872P993O3245J21013r2225Q3117m6448j57979L2768O1774
9149i5838K4867J03983p5568j75264K2303N2631N8259J2793J0397L1225m2619
$$ plain form
9228 -176350 -14867 -29514 4126 9671 28332 -70181 -161197 -104913 -11811 62218 102875 -39015
9216 -39015 -70196 -41547 -116747 -160224 -238764 -158048 -77334 21046 -39203 3138 15455 -122219
9204 -122219 -136027 50268 69834 268 -67033 -201934 -241237 -128605 -96628 -235673 -245595
9193 -245595 -120621 -183944 -241613 -138832 -105437 -50724 -30915 -10718 -13679 -21837 120346
9182 120346 173856 143813 81971 7569 35852 177926 239925 154004 36814 20976 -66940
9171 -66940 -87525 164756 308615 188443 26995 -171583 -104124 -77464 -238527 -209756 -122556
9160 -122556 -145224 -169096 -161103 -97858 23155 -69070 14047 -32401 -190380 -157612 -95838
9149 -95838 -70971 33012 -42556 -217820 -195517 -142886 -84627 -71834 -61437 -30212 -72831
9138g2831J6054r6561q005J5117j6059J3931J03445Q4634J4283J8906L6887m601
9126A05200r0098l3023J54355R1378o6521j23325q2336R9313J16103j2521o9779
9115H8746j25291j72692j5998K0314J66540M1878m7560r7081p3305m2899N807
9104b51541j2257J3473J34170m053N8102M1761q6372O7257P6703l3908O5171N6590
9092A25096j16862n2573N2105N135j18134K1034N7380M445j2432m7138k4162R2099
9080a4007N6761n2725m9071K8867O7909O7308M7670P6487J49589J87128J8495
9069E84411j7861p920j73502r3811L9454n8410l3773p2054m0821j18053L953J10779
9057A22392p192p2263l1433m2196m7639k1587r5173l565K6497p681Q2985R3843
$$ plain form
9138 -72831 -56777 -153338 -161343 -146226 -162285 -148354 -44909 39725 54008 72914 109801 105200
9126 105200 15102 -17921 136434 227812 161291 37966 -44370 54943 171046 158525 88746
9115 88746 -36545 -209237 -225235 -204921 -38381 3497 -44063 -141144 -214449 -257348 -251541
9104 -251541 -263798 -250325 -116155 -120208 -62106 -20345 -106717 -39460 37243 3335 68506 125096
9092 125096 8234 -44339 7766 12901 -105233 -84199 -26819 -22374 -34806 -81944 -106106 -14007
9080 -14007 42754 -9971 -59042 -30175 37734 105042 152712 229199 378788 565916 584411
9069 584411 566550 558630 385128 291317 330771 272361 238588 166534 125713 7660 11613 122392
9057 122392 115200 42937 11504 -30692 -78331 -99918 -195091 -198656 -172159 -179840 -96855 -3012
9045c012n3373j52748J22850K0835q9925K0713K2658R2554L6853n7246Q6403j00950
9033e4388O4404R3757Q1066M2834J72230K38072M29840N25179K61501j25778j98876
9022A529841l81973m00616j92794j23464r3722r1547m523j07794J8557k8008L4406
9011A58363o3626o0956R5779K8039N4315k8710j03504j07014l2723R2016L6808
9000F8787j44435o3256L7987P8402N1566J2518p1241J5897M4353q7739N804J43760
8988I2403o3792m4637M8411M821O5166K21332J49758K58399K55721o9928k40797
8977F76857k12698j24984j22550L8956Q6793j03535l3936J2546O989L4840l511
8966B55767Q0459o3210j71104p0426m705o050J3536O1071J0438j68496q339Q3635
$$ plain form
9045 -3012 -56385 -209133 -86283 -65448 -155373 -134660 -112002 -19448 17405 -39841 46562 -54388
9033 -54388 10016 103773 184839 227673 399903 637975 1067815 1592994 1854495 1728717 1529841
9022 1529841 1147868 747252 554458 430994 337272 245725 241202 133408 151965 123957 158363
9011 158363 94737 33781 129560 157599 211914 183204 79700 -27314 -60037 31979 68787
9000 68787 -75648 -138904 -100917 -22515 29051 41569 -29672 -13775 30578 -57161 -51357 92403
8988 92403 28611 -16026 32385 37206 102372 323704 473462 731861 987582 917654 676857
8977 676857 464159 339175 216625 255581 342374 238839 204903 217449 224438 259278 255767
8966 255767 336226 273016 101912 31486 26781 20731 34267 95338 105776 -62720 -71059 12576
8954A2576J2483k0648K0864L7071j04407n01P9165N9763J4560j5833o2341q258
8942B4494J92j34883O6761Q3659l3059O8641L5964o4328J12707q692j00333j15306
8930f4183J23043R6465j54067p9699J8342R6199M3984r9476l2779M1794K1247
8919A0870j2228J2169q1526O8337R00N759n6645p9426J70000m845m8822r6554
8907a12011n905J6494O8855R490P4031J8660j07680j7894r9695N0168K9342J7638
8895e8507J21669n6083k1095O9724o535R6736N9307j38939j12465L788j032M7408
8883C976M9573J236N628k1733n4408L2033P3321k2077j8201q1696m6573p2560
8871a51481l497J49126J05323j19217q6576r7547L9444O57m4065j0370Q8204J10974
$$ plain form
8954 12576 25059 4411 25275 62346 -42061 -42562 36603 96366 110926 95093 32752 24494
8942 24494 24686 -110197 -43436 40223 7164 75805 111769 47441 160148 151456 51123 -64183
8930 -64183 58860 155325 1258 -78441 -60099 36100 80084 -19392 -52171 -10377 10870
8919 10870 -1358 10811 -70715 -2378 -1478 4281 -52364 -131790 38210 33365 -15457 -112011
8907 -112011 -117916 -101422 -32567 -23077 50954 69614 -38066 -55960 -155655 -105487 -76145 -58507
8895 -58507 63162 7079 -14016 55708 49173 145909 205216 66277 -46188 -42400 -43432 3976
8883 3976 53549 54785 60413 38680 -15728 16305 89626 67549 49348 -32348 -78921 -151481
8871 -151481 -154978 -5852 99471 -19746 -106322 -203869 -164425 -163768 -207833 -218203 -129999 -19025
8859a9025l0328j82793J60331L2759O6296J36999N2308q6621L459N1542k12196
8848b7269j00573j95135J33337N4529m7202K6042L7548O3432l173o7037J0606
8837a14895N8295P2577M9029k9357j03465m2200J3502R6236k3967n0492O9695
8826e042P2691J1662q9268k2267j3098J769J12109p0042j9947q2924o2504o1568
8814b28429j5914J2509Q0249j9609m798O2700K6971J1369r088o181n1430j0825
8802a52476J27836N8808L18K8525j28659n4519m9130P3543N9108N6640O2122l3132
8790D8984J4506j18738P526J45892Q6504n1848O283M8775k4083O679L7207L7448
8778B45135R2317p2129j07639j15522r7133l6451J9429j3601k7820N4255O2925
$$ plain form
8859 -19025 -49353 -232146 -71815 -39056 27240 164239 216547 129926 133385 184927 -27269
8848 -27269 -127842 -322977 -189640 -135111 -182313 -156271 -118723 -55291 -58464 -125501 -114895
8837 -114895 -56600 15977 65006 35649 -67816 -110016 -96514 -278 -24245 -74737 -5042
8826 -5042 67649 79311 -9957 -32224 -45322 -43553 68556 -1486 -21433 -104357 -166861 -228429
8814 -228429 -244343 -231834 -151585 -171194 -175992 -113292 -86321 -74952 -84040 -90221 -141651 -152476
8802 -152476 -24640 34168 34486 63011 -65648 -120167 -169297 -95754 -36646 19994 82116 48984
8790 48984 63490 -55248 -47722 98170 184674 132826 139109 187884 163801 170480 207687 245135
8778 245135 337452 265323 157684 42162 -54971 -91422 -71993 -85594 -113414 -59159 3766
8767C766k0942o3577Q9747J8645L1866k1231j4197N0655n8788k09995q2337J8958
8755b57430k3228L7154J51511m3717N4866L2574R5423L4062m571P3177K8041k17
8743A77645K8651K4178K6322N6246p9595p7165k6404K9705N9595o2818l8941o9267
8731D8152J076M7290L4499P0000J11562o9619J597J36582l0965j43926j37091
8720F9157L4948P1788J08578n66N1322R8423l7576r9801l4927L0130J00492J61660
8708E53628J24144O3392k7638m9297Q2108J44476J61132M7374P1281O2462J90621
8697A423683o2239M4616J08718J73670K93576K09033L61879M92939M16753M26428
8687C889056O00698P25407Q61843R29475J120851J310876J736995K314873L348663
$$ plain form
8767 3766 -17176 -80753 8994 27639 59505 38274 24077 74732 15944 -194051 -276388 -257430
8755 -257430 -280658 -243504 -91993 -135710 -80844 -48270 47153 81215 76644 149821 177862 177645
8743 177645 206296 230474 256796 313042 233447 156282 129878 159583 219178 156360 117419 48152
8731 48152 49228 96518 131017 201017 312579 242960 244557 381139 350174 206248 69157
8720 69157 104105 175893 284471 283905 335227 433650 396074 296273 261346 291476 391968 553628
8708 553628 677772 741164 713526 664229 746337 890813 1051945 1099319 1170600 1233062 1423683
8697 1423683 1361444 1406060 1514778 1688448 1982024 2191057 2552936 3045875 3462628 3889056
8687 3889056 4489754 5215161 6077004 7006479 8127330 9438206 11175201 13490074 16838737
8678A6838737M890449P329583J1258139J8162190K8365112L7756302L2665363
8671A57265875J0819578j0274747k5702433l2104684k7071570j8822861j2386057
8664D1723101q434609n984666m326841l224062k420321j932296j470888j327791
8656A2601627q37925n86739n91875o77622m75828l08476j69929p6156j49248o3163
8646H664666J30193L54210O20920Q17245J129923J291548J377072J475758J710963
8637A7572498K167177K955859M238419O087917R025682J3778812K2062934L7937770
8629A15827068O6408816R7309349P4549583R455741l1498031p0237745p7035246
8622A84779535n5731881l5422454k2394976j5104020j0570367p560812n567647
$$ plain form
8678 16838737 21729186 29058769 40316908 58479098 86844210 124600512 157265875
8671 157265875 168085453 157810706 132108273 100003589 72932019 54109158 41723101
8664 41723101 33288492 27303826 22976985 19752923 17332602 15400306 13929418 12601627
8656 12601627 11763702 11176963 10585088 9907466 9431638 9123162 8953233 8877077 8727829 8664666
8646 8664666 8794859 9149069 9769989 10587234 11717157 13008705 14385777 15861535 17572498
8637 17572498 19739675 22695534 26933953 33021870 42047552 55826364 77889298 115827068
8629 115827068 182235884 279545233 354094816 363550557 332052526 261814781 184779535
8622 184779535 129047654 93625200 71230224 56126204 45555837 37995025 32427378
8615C2427378m233648l291618k521453j766167j654316j624722j499529j345851
8607A4490074j075518q16593q15550o20644l73531l50446k44786j74912L2552
8598A0050646J86870M07871M88242N08444P26225J039192J269993J827861K604850
8589A9110194L792071N323514P909463J2378348J9687344K9598404L5904897K5485544
8581A59189779K954930j5576124k8604942l0986366k4171698j6143793j0875655
8574C5786131p499808n281443l773128k929322k261201j556518j285248j023204
8566A0176259j064710q57770p71697o41546o21849n93690m88621m31590l97106
8557D307680k52451k38852k46321k00855k60526k70479k56084j9858M408j43016
$$ plain form
8615 32427378 28193730 24902112 22380659 20614492 18960176 17335454 15835925 14490074
8607 14490074 13414556 12597963 11782413 11161769 10788238 10437792 10193006 10018094 10050646
8598 10050646 10237516 10645387 11133629 11642073 12368298 13407490 14677483 16505344 19110194
8589 19110194 22902265 28225779 36135242 48513590 68200934 97799338 133704235 159189779
8581 159189779 162144709 146568585 117963643 86977277 62805579 46661786 35786131
8574 35786131 28286323 23004880 19231752 16302430 14041229 12484711 11199463 10176259
8566 10176259 9111549 8253779 7482082 6840536 6218687 5624997 5136376 4704786 4307680
8557 4307680 4055229 3816377 3570056 3369201 3108675 2838196 2582112 2562254 2566662 2423646
8547B423646o8196k42556j27077p9065j0173p3594n4667J9464J7663k9368l5903
8536A740174n9328j48738o6928p8352N2201L8148q5819j71102q2090m7337o3247
8525A027582j02900j0880o6848m6070O8214K0791n2927j79637k08375n9866P3747
8514D62831N5246P990j16678n4034R2852P9002J3183q9426m4483j11681O1626
8503C56428K8793N1560R2232K07335J0507o7764o9292K5367N8716j51783j50233
8492C91866O5866J14915j9297q5766q3851L9701q5634l6029Q7686M8024P0888
8481E08369n5509m4896r492J8534K1468M6431l067l3219n1427o589k9770r9455
8469B61378j07284q9789R8414J40793J49664k0871o6262j4711P3766j19375k8630
$$ plain form
8547 2423646 2355450 2112894 1985817 1906752 1896579 1822985 1768318 1787782 1805445 1776077 1740174
8536 1740174 1680846 1532108 1465180 1386828 1439029 1477177 1391358 1220256 1138166 1090829 1027582
8525 1027582 924682 913802 846954 800884 869098 889889 836962 657325 448950 389084 462831
8514 462831 518077 526067 409389 355355 448207 527209 540392 450966 406483 294802 356428
8503 356428 385221 436781 529013 736348 746855 679091 609799 635166 693882 542099 391866
8492 391866 457732 572647 553350 467584 383733 423434 337800 301771 389457 437481 508369
8481 508369 452860 407964 398472 417006 438474 484905 481838 448619 397192 390603 360833 261378
8469 261378 154094 64305 162719 303512 453176 432305 366043 351332 425098 305723 277093
8458B77093J8910j6076k523L1452P3066J3142j7990K7166M7006j31495j2322K00203
8446E07632J19416m6672j09693l4841j0565q8469R9335M9582j7144o4104j65157
8435B39320K1881Q2140r572K9532l4961n4460Q6715J4185k6583n5581j3004N3575
8423C33187p8757j31053o1650j13528M4619N1142P4199R0677L146P571M3709K1811
8411B85073m4940j7192L3207P4036k03030q0803O2895J07425Q2343l1090o8392
8400A99532m044j01361k689L224Q9953p9332n4275o1906J07701J0852J761o6658
8388D2758J62985O9710p3221o1796l2463O9382k5024p077K8457m5020L9230J8949
8376A86870R4676J42183l542j72133j15976n7108K7094j0613O1100K9501p1530
$$ plain form
8458 277093 296003 279927 277404 308856 381922 395064 377074 404240 451246 319751 307429 507632
8446 507632 627048 580376 470683 435842 425277 336808 436143 485725 468581 404477 239320
8435 239320 261201 343341 333769 363301 328340 273880 360595 374780 348197 292616 279612 333187
8423 333187 254430 123377 61727 -51801 -7182 43960 118159 208836 211982 219553 263262 285073
8411 285073 240133 222941 256148 330184 127154 46351 109246 216671 299014 267924 199532
8400 199532 195488 94127 91438 94662 184615 105283 51008 -10898 96803 107655 109416 42758
8388 42758 205743 275453 202232 140436 107973 177355 152331 145254 173711 128691 167921 186870
8376 186870 281546 423729 420187 248054 132078 74970 102064 91451 152551 182052 110522
8365A10522K414R4862M778k435r9966j52702J29523P3506M7487J8230R3217J01393
8353D20829l2562l5067l7304O286o5853n8608R5794J32849k1435J4478n2807o013
8341C60587j00885L9649J21089J08190K46899N62077P79864L25644q5833l49471
8331B007810n96539m23261k29294j81934j64042J8829R450l8312m6902j11369
8321B44436j06860L8014M2674j19981P2754J05267j9056l046k8946o3570J74905
8310C36591O367j21305k1873n4029l5805M2471P8659L3809N4550J69490j70988
8299C17937j20067L3950M1383Q6243J45378J95988L91022Q77128J655104J145618
8289D769684q888n53794j225252j268582o76610k42776p3966k913k6236j73374
$$ plain form
8365 110522 112936 207798 212576 210141 110175 -42527 86996 160502 207989 226219 319436 420829
8353 420829 388267 353200 315896 322182 256329 197721 293515 426364 404929 419407 366600 360587
8341 360587 259702 299351 420440 528630 775529 1337606 2117470 2443114 2357281 2007810
8331 2007810 1411271 988010 758716 576782 412740 431569 441019 402707 355805 244436
8321 244436 137576 175590 218264 98283 171037 276304 257248 254202 225256 161686 336591
8310 336591 342958 221653 199780 145751 109946 152417 231076 264885 319435 488925 317937
8299 317937 197870 231820 273203 359446 504824 700812 1091834 1968962 3624066 4769684
8289 4769684 4760796 4207002 2981750 1713168 1036558 793782 719816 716903 690667 517293
8279E17293j07912J5503o8421k2771K2521m110l0823k4191J63440K80815K52143
8268I93487K37528P6209m1070k00815j83873j12541j2424r2012j14332j22499
8258D27658j9479M3805M0545k2834j00230j50115q2597J1603K21297K38921K63001
8247H71575O05708O88487J78938o8105l29008p94601m44128j24983j04711l7789
8237D41383r359q6932k9870q7693J03638L0647N1891P3913K5060j5939J12448
8226F09187K65283L07281M81478L34125o3502j79159l26306l49581k85063k91296
8216E02447j46984r283J134n973k4153N693J65r7482n7669m8880n7379K633l2306
8203C1963J00361J93999o4034k12030p1955K14881k6503n6390R539K5699l794
$$ plain form
8279 517293 409381 424884 356463 333692 356213 352103 321280 297089 460529 741344 993487
8268 993487 1231015 1307224 1266154 1065339 881466 768925 756501 664489 550157 427658
8258 427658 408179 451984 492529 469695 369465 219350 136753 148356 369653 608574 871575
8247 871575 1477283 2165770 2344708 2276603 1947595 1152994 708866 583883 479172 441383
8237 441383 432024 345092 315222 227529 331167 361814 413705 487618 512678 496739 609187
8226 609187 874470 1181751 1663229 1997354 1933852 1754693 1428387 1078806 793743 502447
8216 502447 355463 346180 347314 341341 317188 322881 323046 225564 167895 119015 61636 64269 31963
8203 31963 132324 326323 262289 50259 -21696 193185 166682 110292 119831 145530 141736
8192A41736j36498o2631O7723J94470K0072q5627r8900N2767K1240J34647J97424
8181D46423L4716K11003K10754P827n6888p8374k17541q4635q6690r2802n8644
8170B35149k02278J7722J06705P1851N1799J2059j2069m8824q2268j24152M6943
8159G2637K3413p473n6437J1053k5868M0783Q9701L1989J9843q7580l6621L2075
8147A07515k7857j257n6623r9362P3636M9477L7495n5786J4164J00673o0813j362
8135G9900O8879o057P3604r8919o1644J24198J3301n6621m7049o3099j2577M9597
8123F3513K2768m7276j30516k612J86025Q7338l5148O4600p0448r0136p2986l2545
8111e7423N2926M6158j41371K9057J29728J19169J00279Q4438k1427q9145j96300
$$ plain form
8192 141736 5238 -57393 10330 204800 224872 139245 40345 93112 114352 248999 446423
8181 446423 481139 692142 902896 910723 853835 775461 557920 473285 386595 293793 235149
8170 235149 32871 50593 157298 229149 280948 293007 280938 232114 149846 25694 72637
8159 72637 96050 88577 32140 43193 17325 58108 147809 179798 199641 112061 75440 107515
8147 107515 79658 78401 21778 -77584 -3948 45529 83024 27238 41402 142075 81262 79900
8135 79900 148779 142722 216326 117407 55763 179961 193262 136641 89592 26493 13916 63513
8123 63513 86281 39005 -91511 -94123 91902 179240 144092 208692 138244 48108 -24878 -57423
8111 -57423 -4497 41661 -99710 -70653 59075 178244 278523 362961 341534 252389 56089
8100E6089k3060N1259k7352M4694L129l1770M5742p0611L8790K9658K2821L1518
8088A70907l7855j14293j7548R250J18358J4278k4542K1925j89455j61161M1418
8077a68718J86781J13984j16538n1413K714Q783n622l1348k2551j22624m1038
8066b47590j2345J43820J38205r4700m5999Q8976J15743l1496p8850j13074j59670
8055b96980j8462J29500J27937J66197J11322m5434j14873N228p479m8039n4154
8044d5237p3476K2991J15559l016m6459l3088L292J9464J4621K339N8008m0814
8032e816j2969p5995r620Q4874K9982p6871K5254M1163l8063M3692Q746j32400
8020a18023K7058O7242J78871r1169k09731m3847J24107K1172j1775N2656K4380
$$ plain form
8100 56089 33029 84288 56936 101630 104759 72989 118731 48120 86910 116568 139389 170907
8088 170907 133052 18759 1211 10461 128819 143097 118555 140480 -48975 -210136 -168718
8077 -168718 18063 132047 15509 -35904 -33190 -24407 -30029 -61377 -83928 -206552 -247590
8066 -247590 -259935 -116115 22090 -72610 -118609 -29633 86110 54614 -24236 -137310 -296980
8055 -296980 -315442 -185942 -58005 108192 219514 174080 59207 64435 56956 8917 -45237
8044 -45237 -118713 -95722 19837 16821 -29638 -62726 -59434 -39970 -25349 -23010 34998 -5816
8032 -5816 -18785 -94780 -104400 -19526 10456 -66415 -41161 2 -38061 5631 14377 -118023
8020 -118023 -90965 -23723 155148 63979 -145752 -189599 -65492 -44320 -56095 -3439 20941
8009B0941k6085M4581r836k1287o6262r7600J06042Q9780m572n8649m1153L6810
7997b7290O1301Q8569j07298L9669J09989k6463p9489j12667N978Q2531P8279
7986A13109m3172j08340p1262k1523N3905j2327j9410J40853l817j7520j33208
7975a22712k9589O1132K7818q3224N5131K0757M9789N2791M8982p8741j27486
7964a25352N6736R4001j5400J12476N2646l0712q950k9450j13546n5024K4254
7953c8321J10361l8391p245J74024m7367r6438l2754q944n6748M2065j9981j13759
7941a33498M4552J30067Q0074N9915L1701L9357j19144j59611m8716N7761m3989
7930f1531j33260K8487J12562k1817J7310n2595L9473j22331R9379N6006j2423
$$ plain form
8009 20941 -5144 39437 29601 8314 -57948 -155548 -49506 40274 35702 -22947 -64100 -27290
7997 -27290 34011 122580 15282 54951 164940 138477 58988 -53679 -47701 34830 113109
7986 113109 69937 -38403 -109665 -131188 -77283 -89610 -109020 31833 28016 10496 -122712
7975 -122712 -152301 -91169 -63351 -146575 -91444 -70687 -20898 31893 80875 2134 -125352
7964 -125352 -68616 25385 9985 122461 175107 144395 135445 105995 -7551 -62575 -38321
7953 -38321 72040 33649 26404 200428 153061 56623 23869 14925 -41823 242 -19739 -133498
7941 -133498 -88946 41121 121195 181110 212811 252168 133024 -26587 -75303 -17542 -61531
7930 -61531 -194791 -166304 -53742 -75559 -58249 -110844 -71371 -193702 -94323 -38317 -50740
7919e0740j4416Q702J00554L5837o7012J3681M9032J9598m438Q6670M4482J0888
7907B32838M3202N3942m6268j29335l2776Q9535R4622o9022r4291q9191j07205
7896e3949R5523J18891Q7530n9579j05449k7235l3490k2705j20902O380N1221
7885f3764o6267n2654p1340q371Q0207J62208l1258O3354Q3730L4459m5038k640
7873H2626k4912j11032k385n5629P9377n428q2128k2914P8708p104R1454j20453
7861i9820j60021J00107J80610O0616j7378o3198J07695R0144J1371p6501p553
7850A26072j33657o5096k2668m7917J36425J37019m9971P5708j10461n7725J07900
7839I5629O9720r1141j37536K1314L3093Q351J01180j16364P965N2996o9148j9313
$$ plain form
7919 -50740 -65156 -56454 44100 79937 12925 26606 75638 95236 90798 177468 221950 232838
7907 232838 276040 329982 283714 154379 121603 211138 305760 236738 142447 53256 -53949
7896 -53949 41574 160465 247995 188416 82967 55732 22242 -463 -121365 -114985 -63764
7885 -63764 -130031 -182685 -254025 -262396 -182189 -19981 -51239 12115 95845 130304 85266 82626
7873 82626 57714 -53318 -55703 -111332 -31955 -37383 -119511 -142425 -63717 -70821 20633 -99820
7861 -99820 -259841 -159734 20876 81492 64114 916 108611 198755 210126 133625 126072
7850 126072 -7585 -72681 -95349 -143266 -6841 130178 80207 155915 45454 -12271 95629
7839 95629 165349 74208 -63328 -42014 -8921 -570 100610 -15754 -7789 45207 -23941 -43254
7827d3254L6535P530l0827O4623p3651n6178n2193J37286J32889q1614L1410k6642
7815D5914n7675P1281K9024M2961p2233l4637J58940P422p7827j1192L9442k4810
7803A16610j6602L2618j4817j0199k2692M7543j47602n4027J00779Q6020k1153
7792I6478j541P8049O1367M1705j20760j55762q1034J9802P2725K1376K3357n9152
7780c390l8653q4659j08834J13842J57325J69614M1304l606J4293j59865j40542
7769d3171l9098P8198l7920L1688O6487R074L982l1388r1048J1949m0700k0018
7757a01965K7766N4898J9522J28914J62314O100o0463j54924j68338k2949J01440
7746g685N0533j181j35746k5557J15072P2259j0497o504j00920O0658R9527K0679
$$ plain form
7827 -43254 -6719 811 -30016 34607 -39044 -95222 -147415 -10129 122760 41146 72556 45914
7815 45914 -11761 59520 88544 131505 59272 24635 183575 190997 113170 101978 141420 116610
7803 116610 100008 132626 117809 107610 84918 132461 -15141 -69168 31611 117631 96478
7792 96478 94937 172986 234353 276058 155298 -464 -81498 -61696 11029 32405 55762 -3390
7780 -3390 -42043 -126702 -235536 -121694 35631 205245 246549 242943 257236 97371 -43171
7769 -43171 -82269 -4071 -41991 -10303 56184 65258 69240 37852 -53196 -41247 -81947 -101965
7757 -101965 -74199 -19301 221 129135 291449 297549 237086 82162 -86176 -109125 -7685
7746 -7685 42848 41667 -94079 -119636 -4564 67695 57198 50694 -50226 10432 109959 130638
7734A30638l1662j08051J27772K4757k9385n0335K6513P1826p6790m0239N3705
7723I8749p06J1951j28112K54O7263P305O7132k7840j05230q3982q7280m6770
7711b27266R4550N6192J10640K9o7512k754L8967L5685J1045j15577q3577o5523
7699b15101j2193P4163P8420n741m7201L8796O0427J7340N397R6327K3333K8729
7687A42696o5951j7703n304N67m8013j4898Q0357R255j17901k4710n0214k3249
7675a35068N8725J34634J78338o3681j21536p4228J4487K4219M8286N7848q486
7664A13538j42696n45P4978p9574j04251K7137J17378o5137o3156m9142n7703
7653b29173K7847M4912k151N7319k4945Q0679M5251K0102O4236R6013J19027r9585
$$ plain form
7734 130638 98976 -9075 118697 143454 114069 63734 90247 162073 85283 45044 98749
7723 98749 98043 109994 -18118 -17864 49399 56704 123836 95996 -9234 -93216 -180496 -227266
7711 -227266 -132716 -76524 34116 34145 -33367 -36121 2846 38531 49576 -66001 -149578 -215101
7699 -215101 -227294 -153131 -74711 -80452 -127653 -88857 -28430 -11090 -5693 90634 113967 142696
7687 142696 76745 59042 53738 54305 6292 -8606 71751 81006 -36895 -61605 -111819 -135068
7675 -135068 -76343 58291 236629 172948 51412 -22816 -8329 15890 64176 122024 113538
7664 113538 -29158 -29703 45275 -34299 -138550 -111413 5965 -59172 -122328 -171470 -229173
7653 -229173 -201326 -156414 -158565 -101246 -126191 -45512 -261 19841 84077 180090 299117 199532
7641A99532j21274j26838o6559k4166J2971O6020n7929J6278P5497N3434R5711
7630A22677Q4765P1185k0898p3430l5017j7625k3902j42806n3227L7703k83o4054
7618a14912M1441Q6966o3438N6298j66185j35296N6393M5198L304N8623p192O9292
7606f9508N9636J6782r7901O3448J26035P6430k8197k1464n3410j833L3944q3639
7594B0323r9233J5155k3072n3980Q2616L8625l425R208L763o6359Q9004O8334
7582H0959p0533j71516J09681J53220J14124j8469n5660p9484J02202L1413J07198
7571C03135p5980j8720j2350J989j11168j87775O7471J29037n7373l0131q2879
7560g4744j8313N8891J16675l5931j34319l4749P5727M1130q8341k5715P9746
$$ plain form
7641 199532 78258 -48580 -115139 -139305 -126334 -60314 -118243 -101965 -26468 26966 122677
7630 122677 207442 278627 257729 184299 149282 131657 107755 -35051 -88278 -50575 -50858 -114912
7618 -114912 -73471 13495 -49943 6355 -159830 -295126 -238733 -193535 -190231 -131608 -138800 -69508
7606 -69508 -9872 6910 -90991 -27543 98492 174922 146725 125261 71851 70018 103962 20323
7594 20323 -78910 -63755 -86827 -140807 -58191 -19566 -22991 -13783 -10020 -76379 12625 80959
7582 80959 10426 -161090 -51409 101811 215935 197466 141806 62322 164524 195937 303135
7571 303135 227155 208435 196085 198074 86906 -100869 -33398 95639 38266 8135 -74744
7560 -74744 -93057 -34166 82509 46578 -87741 -122490 -46763 -5633 -93974 -119689 -39943
7549c9943J18112K4731m4268K1248L6377k7749r3704N4173N5046M1362m0362K4356
7537A29379j9566r3728J2166J3676L2659r472r8657O952R7069O535n3597k2088
7525A328J7156O0367R4323o6901K2569j8055j5294r4826J18673L5504j26388L493
7513C1949K4177J09349J1461n4111p0033k0742q740J08877k6527j18548r3886
7502a06774K7811J59485j6673q2841L7094K292L5907l8814l0148P0113n5972j9702
7490a8222J1164m5166O5947k6569L1651j00857J5205K0675j06414j59220j6982
7479c28788J29928J36828m144J3617O2851m2046o7562L5344n8841q9674J18769
7468i3718P0722O4619J15077k8286m2556O1649o5278m1248J6592k39311o9638
$$ plain form
7549 -39943 78169 102900 58632 79880 116257 88508 -5196 48977 104023 145385 105023 129379
7537 129379 109813 16085 28251 41927 74586 65114 -33543 -26591 70478 77013 23416 1328
7525 1328 18484 78851 173174 106273 128842 110787 95493 667 119340 154844 28456 31949
7513 31949 56126 165475 176936 122825 52792 32050 23310 132187 105660 -12888 -106774
7502 -106774 -78963 80522 63849 -18992 18102 20394 56301 17487 -12661 57452 1480 -18222
7490 -18222 -7058 -52224 13723 -12846 18805 -82052 -66847 -46172 -152586 -311806 -328788
7479 -328788 -198860 -62032 -66176 -52559 10292 -31754 -99316 -63972 -122813 -212487 -93718
7468 -93718 -22996 41623 156700 128414 85858 147507 82229 40981 57573 -181738 -251376
7457b51376N7890L8833J15618l362n2545N0008P0126j3743m2301P5534N0992q0205
7445A5469k1518N220k3076k4112M295o1839j8481k7215P5386Q1330L9811M0767
7433H6037K1693p5811j8626n2359j21954p1257O9592J58860j23974J2575Q4383
7422c0841m0170q245m5026j3574Q7669M6188m4388K7541O3077N5987j5159N8249
7410A41308N0879q0069o0629O5124J164N873M9154o6382j92745p1480p017J51838
7398a2982J04722n7449P9279p991m8877j3867r5007j591Q978j3815j4411p0053
7386a43064K3240L1897J5729k9082J31731O2966r5005K078O5675K7724n5075k01078
7374a62264j24243J75406J57944O978N8577J07003R4015j05948j3208N0160o5127
$$ plain form
7457 -251376 -193486 -154653 -39035 -42397 -94942 -44934 25192 11449 -30852 44682 95674 15469
7445 15469 -6049 -829 -23905 -48017 -43722 -105561 -124042 -151257 -75871 5459 45270 86037
7433 86037 107730 31919 13293 -39066 -161020 -232277 -162685 -3825 -127799 -115224 -30841
7422 -30841 -71011 -79256 -124282 -137856 -50187 -3999 -48387 -20846 42231 98218 83059 141308
7410 141308 192187 112118 51489 116613 117777 123650 172804 106422 -86323 -157803 -164820 -12982
7398 -12982 91740 34291 113570 105579 56702 42835 -52172 -53763 -44785 -58600 -73011 -143064
7386 -143064 -119824 -87927 -72198 -101280 30451 93417 -1588 490 66165 93889 38814 -162264
7374 -162264 -286507 -111101 46843 53821 112398 219401 313416 207468 194260 244420 179293
7363A79293j07192l5781k5880j1655j00662k0328O2677K14598L3783q0358p4155
7352C4340j14833K6038p8599n682L8995O5110J36384j0586j5455J22766O6900
7341B65378r0497j16818q5435j63582J5587Q45K6941P7069R1570Q9147N4038n1981
7329A12262p7073q6564K5818M1593J16375n8695m3097m1807m699n3485l107K3409
7317d9070K7900l3014r9645l2558M4974k4121j03529O393J5231P7020o0927K3239
7305b08107R95m8356J07856N7421K6706P2562l590K0565n0198m8336J8180K1698
7293c2604K550M9734r7074m9163Q1128J52966n8040m3237j41471p9825J65192
7282d9844J19962o6943P9381N5697k3841M1028q7408k2140j07635L593N76L8357
$$ plain form
7363 179293 72101 36320 10440 -1215 -101877 -122205 -59528 155070 188853 108495 34340
7352 34340 -80493 -54455 -133054 -138736 -99741 -34631 101753 91167 75712 198478 265378
7341 265378 174881 58063 -27372 -190954 -175367 -174522 -147581 -70512 21058 110205 164243 112262
7329 112262 35189 -51375 -25557 16036 132411 73716 30619 -11188 -15887 -69372 -72479 -49070
7317 -49070 -21170 -54184 -153829 -186387 -141413 -165534 -269063 -262670 -247439 -170419 -231346 -208107
7305 -208107 -207112 -255468 -147612 -90191 -63485 9077 5487 26052 -24146 -72482 -54302 -32604
7293 -32604 -30054 19680 -77394 -126557 -45429 107537 49497 6260 -135211 -215036 -49844
7282 -49844 70118 3175 82556 138253 114412 155440 68032 45892 -61743 -58150 -57574 -19217
7270a9217j3915j54136o9295J88638k2227n9082Q5434O9767P2253M889j7575N2085
7258A17619O350L5873j0138m1158q4063M7889M3645m3906j30185k4383n1204M982
7246a28679R7931J92886N2683k608j26608p7282K9338j7945p0289Q4922K679K3002
7234F0030j09743j89989J17833R5950r390r152K6146K9943l1668j0380J52635
7223A22215Q2917o4266p2601j30115j05357N4153J69044O291j09696J7006K5045
7212e364J39251J1296k13933j23364q13m3558R9122P4436J05846K8466k5491J9555
7200F5449j01176P7269J5693j53901k27643j9403Q0670J62734K79311j8869j63992
7189c858Q3327j0570q7921L5135j9950L3401Q1627n5013M4220r425m8692N8050
$$ plain form
7270 -19217 -33132 -187268 -256563 -67925 -90152 -149234 -63800 5967 78220 83109 65534 117619
7258 117619 123969 159842 149704 108546 24483 72372 116017 72111 -58074 -82457 -133661 -128679
7246 -128679 -30748 162138 214821 212213 85605 8323 37661 19716 -50573 34349 37028 60030
7234 60030 -49713 -239702 -121869 -25919 -35309 -44461 -18315 11628 -20040 -30420 122215
7223 122215 205132 140866 68265 -61850 -167207 -113054 55990 62281 -47415 -30409 -5364
7212 -5364 133887 145183 -68750 -192114 -192927 -236485 -137363 -62927 42919 71385 45894 65449
7200 65449 -35727 41542 57235 -96666 -324309 -343712 -263042 -100308 179003 160134 -3858
7189 -3858 79469 68899 -19022 16113 -3837 29564 111191 56178 100398 90973 42281 100331
7177A00331J28305j655j97651p4199L5223J20401l2096n2920o751j33214N5447
7166e8779M4023k8195J4212p354l3807J2853Q16n2343J521K3489J0659R9975J66323
7153A93393j14335j79406j6843Q2028M4869j8976r1743j7896o9854K5961J53544
7142i258J09191o430N4332j38453j42216J4497P1043J20825m0333j10089Q8253
7131A1362O2658l9653K666J5921M6252M4052M9095r847k1787o1927L6007j106
7119A33693k2363l2637K2111k0331q3938J3117k2782J32975j02233j22328Q8476
7108a6240k719J24293q069n0078K4813q0948q8877r4109k2001J35570Q2634Q0388
7096H4657J13742j55776k2656P0078l011j04399j5213O9872m0271p066N5434j0734
$$ plain form
7177 100331 228636 226981 29330 -44869 -9646 110755 78659 25739 18988 -114226 -58779
7166 -58779 -14756 -42951 -28739 -36093 -69900 -57047 -56231 -108574 -107053 -83564 -72905 27070 193393
7153 193393 79058 -100348 -117191 -35163 9706 -9270 -101013 -118909 -188763 -162802 -9258
7142 -9258 99933 93503 147835 9382 -132834 -118337 -47294 73531 33198 -76891 11362
7131 11362 74020 34367 37033 52954 99206 143258 192353 182506 160719 98792 134799 133693
7119 133693 111330 78693 100804 80473 -3465 9652 -13130 119845 17612 -104716 -16240
7108 -16240 -18959 105334 97265 47187 72000 -8948 -97825 -191934 -213935 -78365 4269 84657
7096 84657 198399 42623 19967 90045 87034 -17365 -32578 37294 -2977 -10043 45391 34657
7084C4657j05383j9584J8094J8343J58650M2706J4192l1235n3258o3531q0299
7073f6648J0007j5510l7154j6680R9147J11539J20829J9489p9346R039K9869r2423
7061I2158j92022r6343K3508J09574J20759P3340m0852j20988J13534L8303l8461
7050H2510l4649p5589j01567J09409R0465P5580R9261p5327j09715o4906P8991
7039G4463j7115l1712P2051J2104Q0741J08744k3033k411n4721q9770q9867j06554
7027f7080K954m938j64531N4432O4617M7096J05194J07050l3900o6610n7818L0825
7015A7291m1527R0306q5578K9715K9825p7717r9345J51456K1905j28743n4846
7004a47258M5667L1777o299l2763n3332N7198L3579L8057J21609P6439n8079N3081
$$ plain form
7084 34657 -70726 -90310 -72216 -53873 104777 147483 161675 130440 77182 13651 -66648
7073 -66648 -56641 -72151 -109305 -125985 -26838 84701 205530 225019 145673 154712 184581 92158
7061 92158 -99864 -196207 -172699 -63125 57634 130974 90122 -30866 82668 120971 82510
7050 82510 47861 -27728 -129295 -19886 70579 146159 245420 170093 60378 -4528 74463
7039 74463 57348 25636 97687 109791 190532 299276 276243 273832 219111 129341 39474 -67080
7027 -67080 -64126 -69064 -233595 -179163 -114546 -67450 37744 144794 110894 44284 -13534 17291
7015 17291 -24236 66070 -19508 10207 40032 -37685 -137030 14426 36331 -92412 -147258
7004 -147258 -101591 -69814 -76113 -108876 -162208 -105010 -71431 -33374 88235 164674 106595 159676
6992A59676p1330r7550l4074k364R836R2632J06041n2622m1063j34335K4281O4368
6980B3496j1200M8655p1093O4431N2370j4207r4916j9505J7493J1781M2833J10776
6968A60914m0522j26098j35490k7488J11962L0994J0972o661j2878R8462l3513
6957C0654j2338M4303j3012r3594j05305j0344K2315J08413J6196m1053k3204
6946g6969P1197J53712l5600k1406p1970n3584p895M8621j04528P043q297M2267
6934e7409q3835k2676J89341J17200o8855j16992j74993N6007J14632L8743l2299
6923d1136o6014o9659k5970q4159o7134O0838j23088j9715J81086R3173p9161
6912b40939R7867M0698n8956O2404r827o758J1260J5327K4029O8991m1701n0415
$$ plain form
6992 159676 88346 -9204 -43278 -45642 -35806 56826 162867 110245 69182 -65153 -40872 23496
6980 23496 12296 60951 -10142 54289 106659 92452 -2464 -21969 -4476 7305 50138 160914
6968 160914 120392 -5706 -141196 -168684 -56722 -25728 -14756 -21417 -34295 64167 30654
6957 30654 18316 62619 49607 -43987 -149292 -159636 -137321 -28908 -12712 -53765 -76969
6946 -76969 -5772 147940 112340 90934 18964 -34620 -42515 6106 -98422 -91379 -99676 -57409
6934 -57409 -141244 -163920 25421 142621 73766 -43226 -218219 -162212 -47580 -8837 -41136
6923 -41136 -107150 -176809 -202779 -286938 -354072 -293234 -416322 -436037 -254951 -161778 -240939
6912 -240939 -143072 -102374 -161330 -98926 -108753 -115511 -104251 -88924 -64895 4096 -37605 -88020
6900h8020q792n8571P7335J54342j01622Q6027J1459j5678j02750N1345P3856
6889G8931q4571r3019M1338L7085j76741N3879K6809N729P8041j0816J7826P2376
6877D6867O0249Q3277j4024j23585n2565n527m4850K3438Q0778m3367J0670j25544
6865a04183l2309R4109j1876m5159N8503O3973n283N591M9603J2765j93082r7527
6853b04875K166l1460l0352O9694J11124p290j00065Q3616J4507K8065Q4206K2849
6841D2185N1400n4109p7364o665K2263M3454k3247O0519N2497j245Q239n3049
6829F4878N9965P9218P0333p6232p0726k9111K5062l6789j11097j5024r8555k2147
6817a60225O8799L6931j9835p3172l1933M7638j1037M0643q3891j00934M3939
$$ plain form
6900 -88020 -96812 -155383 -78048 76294 -25328 60699 72158 56480 -46270 5075 78931
6889 78931 -5640 -98659 -57321 -20236 -196977 -143098 -116289 -110560 -32519 -43335 -25509 46867
6877 46867 107116 190393 176369 52784 219 -5308 -50158 -26720 54058 10691 21361 -104183
6865 -104183 -136492 -42383 -54259 -99418 -40915 23058 17775 23366 72969 85734 -107348 -204875
6853 -204875 -202709 -234169 -264521 -194827 -83703 -90993 -191058 -107442 -92935 -64870 19336 42185
6841 42185 93585 39476 -37888 -44553 -22290 21164 -2083 58436 110933 109688 117927 64878
6829 64878 124843 204061 274394 198162 127436 98325 123387 86598 -24499 -39523 -138078 -160225
6817 -160225 -91426 -54495 -74330 -147502 -179435 -131797 -142834 -102191 -186082 -287016 -243077
6806b43077O7710l1229M4956J19423l6454q6339L6837r82J03040Q4483N7703L4379
6794A50450q0929m7045j51018j46510J13274J14201Q8729Q2059L5836K5675m36
6783A84286q5127P6003M4507q5499j67040n8112K4780j59196P7672J15295l2428
6772f4859J15549P5316J1578o5859p7404J49132L8509K7632n7665l4455l1815
6761H5659o1761k0356J36308l5801j15379J8646K6517j7201M9311J03838K082
6750A71863q470r9053k2150n1146o6459J8693R7967n0796L5635Q3688L0850m9760
6738I0862j33147M1546N3980m9388q8898n6788p3412J3287n9255l5468o01R4159
6726b03123j4009J31192k4313L7645N9406L6646j44505j36897K8335J49713N3942
$$ plain form
6806 -243077 -175367 -206596 -161640 -42217 -78671 -165010 -128173 -129155 -26115 58368 116071 150450
6794 150450 69521 22476 -128542 -275052 -161778 -47577 41152 123211 159047 184722 184286
6783 184286 99159 175162 219669 134170 -32870 -90982 -66202 -225398 -147726 -32431 -64859
6772 -64859 50690 126006 137584 71725 -5679 143453 181962 209594 151929 117474 85659
6761 85659 23898 3542 139850 104049 -11330 7316 33833 16632 65943 169781 171863
6750 171863 163393 64340 42190 -8956 -75415 -56722 41245 -9551 26084 109772 140622 90862
6738 90862 -42285 -739 53241 3853 -85045 -141833 -215245 -201958 -261213 -296681 -297282 -203123
6726 -203123 -217132 -85940 -110253 -72608 -13202 23444 -121061 -257958 -229623 -79910 -25968
6715b5968O7714N1187k6100m3763m7856m9477j21060k9585K16698J41864P8363
6704B12017N158j23882n9921m3758q0087j00607N0014K7398O1972Q009L1097J10339
6692I7749Q1013j68086q9456p1249N2671J53392J23119O9727o0387j65257k0249
6681B987J5429q7468L3942M7371O218K6703K2998j7440j6279j308N6388N5631
6669A45172L6070Q6948j56847j01170J541J5411k522O9603K8053K4208J6951p8120
6657H5298K1756o659l8657L94O0754o1832j8512m2856N3519J11384m9925l3636
6645H1028K912L0862j10899J8838M2778J9831J1568k6058M0743K3295p9950k5332
6633B9616m666k0518O0165k8283r768K4432n532j32973N2132N9027J3887Q9392
$$ plain form
6715 -25968 41746 92933 66833 23070 -24786 -74263 -195323 -224908 -8210 133654 212017
6704 212017 217175 93293 33372 -10386 -90473 -191080 -141066 -113668 -51696 -43687 -12590 97749
6692 97749 178762 10676 -78780 -150029 -97358 56034 179153 248880 188493 23236 2987
6681 2987 18416 -69052 -35110 12261 18479 45182 68180 50740 34461 33153 89541 145172
6669 145172 181242 268190 111343 10173 11714 27125 24603 94206 122259 146467 163418 85298
6657 85298 107054 100395 61738 62132 122886 61054 42542 -314 53205 164589 114664 81028
6645 81028 83940 114802 3903 22741 65519 85350 96918 70860 111603 134898 54948 29616
6633 29616 24950 4432 64597 36314 26546 50978 45446 -87527 -35395 23632 37519 126911
6621A26911M4945R8532o3384m8987L1509n358k2797O4496q5444o6951J1161P2667
6609A57300j36580n2914j04465p1074j3056J25131L6704Q3663L3134k2453J3496
6598D8886q0831l3023N3663n2360J5636j3101J08512k6918j3660J42495K6075
6587A75374j8434r5159j4048J20314j39507o2860J840L0023k9503P5290j274n8792
6575a6736n4479q7515j7899R4491P0858K7168K4871O0542j11839j5402J8357l2294
6563c9877n1650L1414R7542o1392j04620M028l5390m4576l5545j6403M3037N7394
6551a56038J17330Q4025N9474q1888n0508m0761K4546J45713k1961l7349l181
6540C9402l9923L6325j5671l0492l3859N6137J3752j3753K5064j9664P6611M1607
$$ plain form
6621 126911 171856 270388 207004 158017 189526 184168 161371 225867 140423 73472 84633 157300
6609 157300 20720 -32194 -136659 -207733 -220789 -95658 -58954 24709 57843 35390 48886
6598 48886 -31945 -64968 -11305 -63665 -48029 -61130 47382 20464 6804 149299 175374
6587 175374 156940 61781 47733 168047 28540 -34320 -32480 -2457 -31960 43330 42056 -16736
6575 -16736 -71215 -158730 -176629 -82138 -11280 15888 40759 101301 -10538 -25940 -7583 -39877
6563 -39877 -91527 -60113 37429 -23963 -128583 -124555 -159945 -204521 -240066 -256469 -213432 -156038
6551 -156038 -38708 45317 104791 22903 -27605 -68366 -43820 101893 79932 42583 39402
6540 39402 -521 35804 20133 -10359 -44218 11919 25671 11918 36982 17318 93929 135536
6528A35536l4171j14333o9097m4845J08377J33597K1234j18856k5051R5079P265
6517I4735j7213L9349m6932n2835j13917m4604K0724l9534O4718m9200k8510r7169
6505b70388L0410O575P806j10383Q8056K21561L3683k1388L63K5868N6619j49939
6493h1157P2030m955l5355L4128j6032J6325M5739M2789O5711j37063j62139n1548
6481b11527J27611K4497K9106m7177r9729L2666l6417K01q942J06690j582n0717
6469a35320r527L753l9283r3488N5428K15240j9789l5909p701m8208J18709J64804
6457A68709j30276r8128J6406P4937M9q4638P9948J25725p2313j4571j04777K2045
6445a6884O9726M093m2232J03151K1764n0857r1496P5985l1273j1486O4433k2568
$$ plain form
6528 135536 101365 -12968 -82065 -126910 -18533 115064 136298 17442 -7609 87470 94735
6517 94735 77522 116871 69939 17104 -96813 -141417 -120693 -160227 -95509 -144709 -173219 -270388
6505 -270388 -239978 -233403 -225597 -335980 -247924 -26363 7320 -14068 -13705 12163 68782 -81157
6493 -81157 -9127 -14082 -49437 -15309 -31341 -15016 30723 73512 139223 2160 -159979 -211527
6481 -211527 -83916 -59419 -30313 -77490 -177219 -144553 -180970 -180769 -189711 -83021 -84603 -135320
6469 -135320 -144847 -141094 -180377 -273865 -218437 -3197 -22986 -58895 -66596 -114804 3905 168709
6457 168709 38433 -59695 -43289 31648 31697 -52941 27007 152732 80419 65848 -38929 -16884
6445 -16884 52842 56935 14703 117854 139618 88761 -2735 73250 41977 30491 94924 72356
6433G2356L5421m654J9700n4300K9409j13614j08967J2933m8069O8592J34279
6422D3086L6228o0089j274j44149M0227J53351j54112M2375K522r4048O7297J70319
6410A01733P3702o8688n3585r9820q0147K4724L7550r051J387Q8249O148l6051
6398a3849l6547j3158J4833J5065l305M6642L1894r1568L7739L5364Q2861J2243
6386A18214m9297J8357p925q40K5994L3402k1894Q1440J17877J2807r2217m5920
6374A89998j34455N7743Q6264k185k4328n0905j60159j64327R0651O6463M7956
6363B716O3763J085q0312P8926N807k7402M0212l3332l3135L2069L138p1234o0093
6350g7792m4086O1684K383O9535o2747p9549K9953J11344k1446p7980m7373J0467
$$ plain form
6433 72356 107777 103123 122823 68523 97932 -15682 -124649 -111716 -159785 -91193 43086
6422 43086 79314 19225 17951 -126198 -85971 67380 -86732 -44357 -41835 -135883 -68586 101733
6410 101733 175435 106747 53162 -46658 -126805 -102081 -64531 -73582 -72195 16054 22202 -13849
6398 -13849 -50396 -63554 -48721 -33656 -36961 9681 41575 -49993 -12254 23110 105971 118214
6386 118214 68917 87274 79349 78509 104503 137905 116011 197451 315328 328135 235918 189998
6374 189998 55543 113286 199550 197365 173037 122132 -38027 -202354 -111703 -45240 2716
6363 2716 66479 67564 -12748 66178 71985 44583 84795 51463 18328 50397 53535 -17699 -77792
6350 -77792 -121878 -60194 -57811 11724 -51023 -130572 -100619 10725 -10721 -88701 -136074 -125607
6338a25607L0171P1279j4830m1882P5312R2999R4991O4086q8059j96031n222J38925
6326I6132J18552j65491j25716N0038j8600k0977l487k873J83649O5762q9141
6315H7848o4597N7609n8981j0590k9216J19105L5631j36859l1661R7089k7234
6304C8144Q8288N5350n3035q8746Q2671M8925n1198k1483j27206j2741l9506r0237
6292a70774r7364j1180J12385P0300J10789Q6991o0996j470L8859K697J6123k2229
6280G4131o0854L6865j0666k31297p7904R5941j2161M069Q3644J26241q9564J2554
6268d9001k6210M6044J36987k7714m8390L6481M9635l9219j19785j773j055O0782
6256A6782J4243P3518K5449n7848j06041o2244p714N7351M1581J5584L3149l4344
$$ plain form
6338 -125607 -95436 -24157 -38987 -80869 -5557 87442 182433 246519 158460 -37571 -42793 96132
6326 96132 214684 49193 -76523 -26485 -45085 -66062 -69549 -72422 111227 176989 87848
6315 87848 23251 80860 21879 11289 -17927 101178 136809 -50 -31711 65378 38144
6304 38144 126432 181782 128747 40001 122672 171597 120399 98916 -28290 -41031 -80537 -170774
6292 -170774 -268138 -279318 -166933 -96633 14156 101147 40151 38681 77540 80237 96360 74131
6280 74131 13277 50142 39476 -191821 -269725 -173784 -185945 -181876 -98232 28009 -61555 -49001
6268 -49001 -75211 -29167 107820 80106 31716 68197 117832 78613 -41172 -42945 -44000 16782
6256 16782 31025 104543 129992 72144 -33897 -96141 -103855 -46504 -4923 10661 43810 9466
6244I466r2816k6367J8296J38758P8759M6519j6576j05902k2042L8459M9726l0686
6232H5594k137j0443J23957k7330o7988K1068J05033j13754j04912N609L5057
6221D9754M4804k047j89057m1752O72n8928O1782O6385Q9020k619k2650j9325
6209b3961j0756j08776l8529J09052K4137l4582k3638L6742L0747r9897j0854
6198a50315p1655j3622J60160J36883Q2767r1598p6382J0591L8910l6234m0473
6187e0968M9201K392k7121o2364j2459L3207o190Q6524J8706m7001R506j92K3438
6174A6679n4188J6130M3514o8761q9494n8557m037O6634K2369O9109P8528K586
6162D0512n7765j44095j0440K28718O4246R458j04231j1596N8871l0165q6898
$$ plain form
6244 9466 -83350 -109717 -91421 47337 126096 172615 156039 50137 28095 66554 116280 85594
6232 85594 83457 73014 196971 169641 101653 122721 227754 114000 9088 14697 49754
6221 49754 94558 92511 -96546 -138298 -137626 -196554 -134772 -68387 20633 18014 -4636 -23961
6209 -23961 -34717 -143493 -182022 -72970 -48833 -83415 -107053 -70311 -39564 -139461 -150315
6198 -150315 -221970 -235592 -75432 61451 144218 52620 -23762 -13171 25739 -10495 -50968
6187 -50968 -1767 625 -26496 -88860 -101319 -68112 -74302 12222 30928 -16073 -6567 -6759 16679
6174 16679 -37509 -21379 22135 -46626 -136120 -194677 -198714 -132080 -109711 -40602 37926 40512
6162 40512 -17253 -161348 -171788 56930 121176 130634 26403 14807 73678 43513 -43385
6151d3385p9400L2973O7164N2417j19300k06349J5169J28337J34293N7941k2698
6140A7162r9091J7504J40787k2078l8031L374o8410q2243o051J04254K9807q5616
6128h8632j17575j32P5008O7003O2024l1714Q9509j4345q5535L0483J1284j32147
6116a34769j18625j0144N0876K6253N1285J41600L2286q4615k7862L2414R6930
6105E5629l0034o961j2668L6260O1020M3835p6565r3467o9244p3182M1612K0182
6093a03583j01783Q988J04743N1985k3318N7362N3847k584J9401J14065O5474
6082B44597m6064o5215r9985K0314N8313j14768n5473L0428j8962n5778O6666
6071c5927l1570j11498L1405O6399m2936J412P5346O8482O9567m5228j03785L747
$$ plain form
6151 -43385 -122785 -89812 -22648 29769 -89531 -295880 -280711 -152374 -18081 39860 17162
6140 17162 -81929 -64425 76362 54284 16253 19627 -48783 -131026 -137077 -32823 -3016 -88632
6128 -88632 -206207 -206339 -131331 -64328 -2304 -34018 55491 41146 -44389 -13906 -2622 -134769
6116 -134769 -253394 -263538 -212662 -186409 -135124 6476 38762 -45853 -73715 -41301 55629
6105 55629 25595 18634 5966 42226 103246 147081 70516 -22951 -92195 -165377 -123765 -103583
6093 -103583 -205366 -196378 -91635 -39650 -62968 -5606 48241 45657 65058 179123 244597
6082 244597 198533 133318 33333 53647 111960 -2808 -58281 -27853 -46815 -102593 -35927
6071 -35927 -67497 -178995 -147590 -81191 -124127 -122715 -47369 21113 90680 45452 -58333 -54586
6059e4586N4123R5239J820p2330j0335r0780l8527j1598M4112r0735k2873M9118
6047a47352K4357Q0342M9681l8557J1379K3878m2366R7687L3321N383P8288Q7249
6035B63290O4615j98818l07042o6335j3884O8265K26282P374j7801l0050n5031
6024e9135K2733m0577o0625P1260k2214J56746J41769r2342j26969k8911K488
6013c5777K3945J29060J1812l1085r5259K4069J48485P182n4919l7034N2493j21858
6001B1114o403j33285M1464J2851j97789j03718O8588O6968k1313J02622N0324
5990i8577j1280J41521O9285o5297m8358l3285n151k7486R8317K1583j3581l5026
5978g335r5956N2645O9437P839O2720K3035J1508k7684j39355N92q6198p3159
$$ plain form
6059 -54586 -463 94776 96596 24266 13931 -76849 -115376 -126974 -82862 -173597 -196470 -147352
6047 -147352 -122995 -42653 7028 -31529 -20150 3728 -38638 59049 92370 97753 176041 263290
6035 263290 327905 129087 -177955 -244290 -258174 -189909 36373 43747 25946 -4104 -59135
6024 -59135 -36402 -76979 -137604 -66344 -88558 68188 209957 117615 -9354 -38265 -35777
6013 -35777 -11832 117228 129040 97955 2696 26765 175250 182432 127513 90479 142972 21114
6001 21114 14711 -118574 -77110 -64259 -262048 -365766 -297178 -230210 -251523 -148901 -98577
5990 -98577 -109857 31664 100949 35652 -12706 -45991 -51142 -78628 19689 41272 27691 -7335
5978 -7335 -103291 -50646 18791 26630 89350 112385 123893 96209 -43146 -42554 -128752 -201911
5966b01911k9937L5888R1843Q2955M9605M4118m3225k20m5163n2925M2338p1078
5954i7712o397l1191q9322k1158l8024J14620N3941j2447Q5591M5258r2104J4462
5942g4483J34270J30991J7235J0640j05950r5147O8784K2205k6993j16413M8992
5931A4131K6836l0804q0086J463P0121r1219q0417p6931K6127Q7159J99324Q2942
5919A48646q072p1193p4380n6936M8158O3210L9380O0880l3477L3530M5526k05748
5907a0476q1025P1822n7715p3332p7659J941P4m9915L2311R5144J19710M106k8661
5894e3675M7392J58365R4592m6499q3259J053K1297k0938l0431k666Q507M8574
5882A42312m8562k66698p7914k114M3232R5155J9833q6003O9414Q4388k3801l564
$$ plain form
5966 -201911 -231848 -195960 -104117 -21162 28443 72561 29336 29116 -16047 -68972 -26634 -97712
5954 -97712 -104109 -135300 -224622 -245780 -283804 -169184 -115243 -127690 -42099 3159 -88945 -74483
5942 -74483 59787 190778 208013 218653 112703 17556 86340 108545 81552 -34861 14131
5931 14131 40967 10163 -69923 -68460 1661 -89558 -169975 -246906 -220779 -133620 65704 148646
5919 148646 140574 69381 -4999 -61935 -13777 49433 88813 149693 116216 149746 195272 -10476
5907 -10476 -91501 -19679 -77394 -150726 -228385 -226444 -226370 -276285 -243974 -148830 -29120 -25014 -53675
5894 -53675 -6283 152082 246674 200175 116916 117969 139266 118328 87897 85231 93738 142312
5882 142312 93750 -172948 -250862 -252976 -209744 -114589 -94756 -180759 -111345 -26957 -50758 -54322
5870e4322l1009K171N2873L8646k9796j9976L787N4528o293M8485M5816j2181
5858I2729r593k6017Q934k7537o1196j3200L1545O7621l4777O738J4116K7229
5846G6592q0654l2489L6518M7551Q5684o5007j80059m0369J1266L0946N5651J46273
5834I1903J00856r4006r8583j53478o6688J24472R4541o268j0747m4590N075p0768
5822a28281j7248O3750Q2261R7163p2235r689L9173j25863m4485P7194Q0695n9616
5810a7181k3252K8241M9843n185O1342l320r2021o8231J31193M8418j23190k8564
5798d1907r7830R972J71243L1922o4233M2511P1382o8259j01034o192j26194P6740
5786a01879J00208N051n670P9782R1968L7130R905j64170p0956K1680M1252O2699
$$ plain form
5870 -54322 -85331 -83160 -30287 8359 -21437 -41413 -37626 16902 10609 59094 104910 92729
5858 92729 83136 57119 66053 38516 -22680 -35880 -4335 63286 28509 35247 49363 76592
5846 76592 -4062 -36551 -33 47518 133202 68195 -111864 -152233 -140967 -110021 -54370 91903
5834 91903 192759 98753 170 -153308 -219996 -95524 -983 -7251 -17998 -62588 -57513 -128281
5822 -128281 -145529 -81779 482 97645 25410 15721 54894 -70969 -115454 -38260 42435 -17181
5810 -17181 -40433 -12192 37651 32466 93808 90488 -1533 -69764 61429 109847 -13343 -41907
5798 -41907 -139737 -129765 41478 73400 9167 51678 123060 54801 -46233 -52425 -178619 -101879
5786 -101879 -1671 3380 -2290 77492 169460 206590 216495 52325 -18631 3049 44301 107000
5774A07000J7628j60409m1319N8893J68622J0027p4161m4474Q8128L4457J13466
5763B77858N045j44957j36618m1319L6397l2446J1345n623j18322o967o07J49026
5751g188Q6693o2758q7955m4504M9470J0970k4636p4864k5281L0025N2262J197
5739i6569l6417J33046K1186J1723K7147M8867Q6860j89030j10038m1920M9894
5728i5251R3148j7189j4806j7235m7701q3L2506k25J14919K5648q3033J156M6756
5715C8610L5273J928M0429L7800J054P86j32350Q8867J36015k4079j89112j06073
5703g0852N388j7811o5018Q1923M2223j14642N3539k7413n426n628N5599q5239
5691a53357K0923J31773j2402m986o609j28584o1666N5345J48075J4933P6213
$$ plain form
5774 107000 124628 -35781 -77100 -18207 150415 160442 86281 41807 129935 164392 277858
5763 277858 282903 137946 1328 -39991 -3594 -36040 -24695 -30318 -148640 -155607 -156214 -7188
5751 -7188 79505 16747 -71208 -115712 -66242 -55272 -79908 -154772 -180053 -150028 -97766 -96569
5739 -96569 -132986 60 21246 32969 60116 108983 195843 6813 -103225 -145145 -95251
5728 -95251 -2103 -19292 -34098 -51333 -99034 -99117 -66611 -66836 48083 73731 -9302 -8146 38610
5715 38610 73883 75811 116240 154040 155094 155880 23530 112397 248412 224333 35221 -70852
5703 -70852 -65464 -83275 -148293 -66370 -24147 -138789 -85250 -112663 -118089 -123717 -68118 -153357
5691 -153357 -132434 -661 -13063 -18049 -24658 -153242 -214908 -159563 -11488 3445 79658
5680G9658M5922k0155p401n5076j07244O9993O4070J4024j28905m3665N1162J44373
5668A06756k8364j40882m9109n4688l6650j8340M5364k8143Q2511m1829M3911
5657a19463P7882M7745Q4311l1483K8850j10967K4888k1167j6410n1377R0519
5646C328J43759P3023j18831j52806p9011l0509N6014L2328O4252N065p0404p1483
5634a45275j09751l2639O9391L4876j7444O0523K4255P8874K7269J6518q6945
5623h0348k0548n8014J29256m49o8977l5945n2583o2605q6802K877J77291M4610
5611a12237Q0967M308N5786J3703n2458l6621J593N1190J51924K6515Q3608q0036
5599A88242j82194q8301q7034K1558P6406n644J5958L6016N632L8033Q6819n3951
$$ plain form
5680 79658 125580 105425 98024 42948 -64296 5697 69767 83791 -45114 -88779 -37617 106756
5668 106756 78392 -62490 -111599 -166287 -202937 -221277 -175913 -204056 -121545 -163374 -119463
5657 -119463 -41581 6164 90475 58992 87842 -23125 1763 -19404 -35814 -87191 3328
5646 3328 147087 220110 101279 -51527 -130538 -161047 -105033 -72705 -8453 -3388 -73792 -145275
5634 -145275 -255026 -287665 -218274 -183398 -200842 -140319 -116064 -37190 -9921 6597 -80348
5623 -80348 -100896 -158910 -29654 -30103 -99080 -135025 -187608 -250213 -337015 -334138 -156847 -112237
5611 -112237 -31270 -26962 28824 42527 -9931 -46552 -44959 6231 158155 184670 268278 188242
5599 188242 6048 -82253 -169287 -147729 -71323 -76967 -61009 -24993 -19361 18672 105491 51540
5587E1540q9674n0816J01715q051j78922J20091Q4298l46O588o3625N4264J50346
5575A77408J34195j65483j75278p0623l8889m5783N7975j0390o8688R287N3486
5564a42783L930M4909l9723L0994n624o0127K6815K2791J917J71468R9953j34696
5552A9824q7437o0865j00688r4495O8396N2390L5718M6612J23233O0560j8088
5541D5160O5793p0254j06485M9370J19402k6897l9612L7120Q2375P2402j08914
5530A19460n2465M5671o883p2838m3920K1614P049n3132p1044p6544K2947J26845
5518c3240R7914L5939o6552m0444Q8830L7894N0234L3397K3211k566p7350j62512
5506a5245l7519l6287J52966J22955p9093K4209M7532j7243J0518M3497j4122
$$ plain form
5587 51540 -38134 -88950 12765 4714 -174208 -54117 30181 29835 36423 -27202 27062 177408
5575 177408 311603 146120 -29158 -99781 -138670 -184453 -126478 -136868 -205556 -196269 -142783
5564 -142783 -138853 -93944 -133667 -102673 -108297 -168424 -141609 -118818 -116901 54567 154520 19824
5552 19824 -67613 -128478 -229166 -323661 -255265 -202875 -167157 -120545 2688 63248 45160
5541 45160 110953 40699 -65786 -16416 102986 76089 36477 73597 155972 228374 119460
5530 119460 66995 112666 105783 32945 -10975 10639 17688 -35444 -106488 -183032 -160085 -33240
5518 -33240 64674 100613 34061 -6383 82447 120341 170575 203972 227183 224617 147267 -15245
5506 -15245 -52764 -89051 63915 186870 107777 131986 179518 162275 172793 216290 202168
5495B02168r0052r5355P4787l0533K6735J7866j8397K5944o1380r875L0061r9319
5483b7350p6907J13523m1005o8771N7169k7247l7380R2303O5016j35646k8714
5472a15009o3933n974J00013O3987P2467r4078k2816L476N9289m8544J29268l5024
5460D3122j3135l8303l0048o1589P1790R8933L5852j34406J997J6444q4110k8772
5448a22225M362O4287L076L5342P0769J03628L7082j45930N764r6418j07862j0485
5436a58610R3693o628K8475K2681j56319J52755J20710o6396R9666J01657k4870
5425B06814m9020j29988p2736O7942r5261j7119O6106O4012P0149k7023j67003
5414h3127l4389J4254J15666J23797N5276j11866K8304O8549K7309j4105o5188
$$ plain form
5495 202168 112116 16761 91548 61015 87750 105616 87219 113163 51783 41908 71969 -27350
5483 -27350 -104257 9266 -31739 -100510 -43341 -70588 -107968 -15665 49351 -86295 -115009
5472 -115009 -178942 -184916 -84903 -20916 51551 -42527 -65343 -61867 -2578 -51122 78146 43122
5460 43122 29987 -8316 -38364 -99953 -28163 70770 106622 -27784 -25787 -9343 -93453 -122225
5448 -122225 -117863 -53576 -50500 -15158 55611 159239 196321 50391 56155 -40263 -148125 -158610
5436 -158610 -64917 -71545 -43070 -20389 -176708 -23953 96757 30361 130027 231684 206814
5425 206814 157794 27806 -44930 23012 -72249 -89368 -23262 40750 110899 83876 -83127
5414 -83127 -117516 -103262 12404 136201 191477 79611 107915 176464 203773 189668 124480
5403A24480j17531n0075N3186p5928m1175M7967j07176M8356l4771K1499j3140
5392a44308l4184P5165J21407Q3357R0196m3902j28511l8357m5867j7935r2583
5381a75522M3994p5882K3692J24942p5492J2076m842M4737j9812N0478Q0257o7711
5369c9085o0503l2806j0715J8129m6640O2541J06076K2964q259n1730p6783j2074
5357a28885R4542Q7105p8194k05j0823J6526R6699r8288j47018R107j3046l0967
5345b03447Q8605J19152l8264O6155m9163n9062j06817J5996k7032j4132J17692
5334i0317j7808L5996Q5860j20779P5269J18484l14n7450L2386M1395q7318M2912
5322E8316q283J23451J5165k0741o6981j05099P70Q6497J64117p4160j53461p9414
$$ plain form
5403 124480 6949 -43126 10060 -65868 -107043 -59076 -166252 -117896 -152667 -131168 -144308
5392 -144308 -178492 -103327 18080 101437 191633 147731 19220 -19137 -65004 -82939 -175522
5381 -175522 -131528 -207410 -183718 -58776 -134268 -122192 -127034 -82297 -102109 -51631 28626 -39085
5369 -39085 -99588 -132394 -143109 -124980 -171620 -109079 -3003 19961 11702 -40028 -116811 -128885
5357 -128885 -34343 52762 -25432 -25637 -36460 -19934 76765 -21523 -168541 -159434 -172480 -203447
5345 -203447 -114842 4310 -33954 32201 -16962 -76024 -182841 -166845 -193877 -208009 -90317
5334 -90317 -108125 -72129 13731 -107048 -31779 86705 86391 28941 61327 102722 15404 58316
5322 58316 50033 173484 188649 167908 100927 -4172 -3402 83095 247212 173052 19591 -59823
5310e9823k5984P0044O7559P4453j05415N4125n1147p1984j50927l0546Q9851
5299a39794J42266j3578n8514j2856J61180o696Q3613j19147j17460K2427n2267
5288a10826k4538J78439J17313M8311K3449j03451n2218K218P6192JN8852k4505
5276A89237r8296o2593J00677p0598M1105n1153m563K9877J1195R1219P2719k8454
5264B20372o5676J9657n8154p0804j00881j57654L8268J33375m3021j1625K4574
5253g1569K2543N6593O5702M567j45744K528R5126O077K8834n2649j09190k4797
5241a21979P9719R9378l5356l2384k5093R131j7307L4446J00854O4745n221j8358
5229A32575q9177q7251P2959o197o0846l733Q6057j358p3078P0339L4655K5364
$$ plain form
5310 -59823 -85807 -15763 51796 126249 20834 74959 23812 -48172 -199099 -229645 -139794
5299 -139794 2472 -11106 -69620 -82476 78704 72008 155621 36474 -80986 -58559 -110826
5288 -110826 -135364 43075 160388 208699 232148 128697 76479 78697 154889 154890 213742 189237
5276 189237 90941 28348 129025 58427 99532 48379 43816 73693 84888 176107 248826 220372
5264 220372 154696 174353 116199 45395 -55486 -213140 -174872 -41497 -84518 -96143 -71569
5253 -71569 -49026 7567 73269 77836 -67908 -65380 29746 35823 64657 12008 -97182 -121979
5241 -121979 -42260 57118 21762 -10622 -35715 -26584 -43891 -9445 91409 156154 150933 132575
5229 132575 43398 -43853 29106 22909 -37937 -41670 44387 43029 -30049 40290 74945 100309
5217A00309O8541j09055m2818o1670j01500K621k4134r4526k7299J24945L5464
5206a29122N1876J07802O0454m1370M2188q54n0152J9355J11781L3542r9498q9265
5194A6737j1195K6344l328j2235P3537Q5388n573n8777m8711p1675q5906J32534
5182C7140J42296K9570p7782n2195l3547p7937k5628o6444L7386r902L0299O1541
5170e203N2448O5962n3481n8489j22668O577Q5561p6125M221n823n2367J8020
5158a41367O2531K7950l5181J10356J28421O738N2864o7987j88081l8083K43498
5147A61659K5148j6741r3331m9534m6683k5738l1284m223l6645n3932p773J02095
5135g6982J15406J9855r3927l2854J07794p7909j74455O7156J16734J24201K7278
$$ plain form
5217 100309 168850 59795 16977 -44693 -146193 -143572 -167706 -262232 -289531 -164586 -129122
5206 -129122 -77246 30556 91010 49640 91828 90974 40822 60177 171958 205500 106002 16737
5194 16737 5542 31886 28558 16323 89860 175248 169675 110898 62187 -9488 -95394 37140
5182 37140 179436 209006 131224 79029 45482 -32455 -58083 -124527 -87141 -97043 -66744 -5203
5170 -5203 47245 113207 59726 1237 -121431 -114854 -29293 -105418 -101197 -107020 -159387 -141367
5158 -141367 -78836 -50886 -86067 24289 152710 159448 212312 144325 -43756 -81839 161659
5147 161659 186807 170066 76735 27201 -19482 -45220 -76504 -80727 -117372 -171304 -179077 -76982
5135 -76982 38424 58279 -35648 -68502 39292 -38617 -213072 -145916 -29182 95019 122297
5124A22297j24522l5495m9682M4482M5398Q8306n7561o5529L152M7371j11690
5113i3473L9395P4171L5143N5283p8433J9523l9041m8659M2855L6964l7762P7371
$$ plain form
5124 122297 -2225 -37720 -87402 -42920 2478 90784 33223 -32306 -29154 18217 -93473
5113 -93473 -54078 20093 55236 110519 32086 51609 12568 -36091 6764 43728 5966 83337
$$ [...]
##END NTUPLES=NMR SPECTRUM
##END=
