##TITLE=Analysis number 316314
Compound Code rh 00481
Project Code adrs
Chemist Name fudan
##JCAMPDX= 6.0         $$ Bruker NMR JCAMP-DX V2.0
##DATA TYPE= NMR SPECTRUM
##DATA CLASS= NTUPLES
##ORIGIN= Bruker BioSpin GmbH
##OWNER= nmr
$$ XWIN-NMR		Version 3.5
$$ Wed Jan 11 09:49:38 2006 GMT Standard Time (UT+0h)  MAYBRIDGE\nmr@NMR_250MHZ
##.OBSERVE FREQUENCY= 250.131544655141
##.OBSERVE NUCLEUS= ^1H
##.ACQUISITION MODE= SIMULTANEOUS (DQD)
##.ACQUISITION SCHEME= undefined
##.AVERAGES= 16
##.DIGITISER RES= 18
##SPECTROMETER/DATA SYSTEM= dpx250
##.PULSE SEQUENCE= zg30
##.SOLVENT NAME= CDCl3
##.SHIFT REFERENCE= (INTERNAL, CDCl3, 0, 16.522)
##AUDIT TRAIL= $$ (NUMBER, WHEN, WHO, WHERE, WHAT)
$$ ##TITLE= Audit trail, XWIN-NMR		Version 3.5
$$ ##JCAMPDX= 5.01
$$ ##ORIGIN= Bruker BioSpin GmbH
$$ ##OWNER= nmr
$$ C:\u/data/dgb/nmr/ADRS/14460/pdata/1/auditp.txt
$$ ##AUDIT TRAIL=  $$ (NUMBER, WHEN, WHO, WHERE, WHAT)
(   1,<2006-01-11 09:48:21.76 +000>,<MAYBRIDGE\nmr>,<NMR_250MHZ>,
      <created by zg, POWCHK disabled, PULCHK disabled
       configuration hash MD5:
       62 19 C7 07 E1 42 D1 B7 37 6C 3D D0 77 39 F9 E6
       data hash MD5: 64K
       1E BD 77 4D 22 43 0A F0 0C FE 56 D1 B1 7E 38 25>)
(   2,<2006-01-11 09:48:48.09 +000>,<MAYBRIDGE\nmr>,<NMR_250MHZ>,
      <Start of raw data processing
       ef LB = 0.3 FT_mod = 6 PKNL = 1 SI = 32K 
       data hash MD5: 32K
       30 8B 39 1E 63 D1 DA A1 61 94 A2 81 FC AB C3 E2>)
(   3,<2006-01-11 09:48:52.93 +000>,<MAYBRIDGE\nmr>,<NMR_250MHZ>,
      <apk 
       data hash MD5: 32K
       06 70 09 C8 D3 63 53 D8 05 5B 1E D5 E7 6C 7C 23>)
(   4,<2006-01-11 09:48:54.12 +000>,<MAYBRIDGE\nmr>,<NMR_250MHZ>,
      <abs ABSG = 5 
       data hash MD5: 32K
       FE 65 79 97 DC E9 93 DB 74 88 0E 28 53 44 47 33>)
$$ ##END=
$$ 
$$ hash MD5
$$ 09 F3 BF 8F 64 74 9A 24 98 61 7B E7 4F C6 41 E2
##$RELAX= 
##$RELAX= 
##$RELAX= 
##$RELAX= 
##$RELAX= 
##$RELAX= 
##$RELAX= 
$$ Bruker specific parameters
$$ --------------------------
##$DU= <C:\u>
##$EXPNO= 14460
##$NAME= <ADRS>
##$PROCNO= 1
##$TYPE= <nmr>
##$USER= <dgb>
##$AMP= (0..31)
100 100 100 100 100 100 100 100 100 100 100 100 100 100 100 100 100 100 
100 100 100 100 100 100 100 100 100 100 100 100 100 100 
##$AQSEQ= 0
##$AQ_mod= 3
##$AUNM= <au_zg>
##$AUTOPOS= <6 >
##$BF1= 250.13
##$BF2= 250.13
##$BF3= 250.13
##$BF4= 250.13
##$BF5= 500.13
##$BF6= 500.13
##$BF7= 500.13
##$BF8= 500.13
##$BYTORDA= 1
##$CFDGTYP= 0
##$CFRGTYP= 5
##$CHEMSTR= <none>
##$CNST= (0..31)
1 1 145 1 1 1 1 1 1 1 1 1 1 1 1 1 1 1 1 1 1 1 1 1 1 1 1 1 1 1 1 1 
##$CPDPRG= <>
##$CPDPRG1= <>
##$CPDPRG2= <>
##$CPDPRG3= <>
##$CPDPRG4= <mlev>
##$CPDPRG5= <mlev>
##$CPDPRG6= <mlev>
##$CPDPRG7= <mlev>
##$CPDPRG8= <mlev>
##$CPDPRGB= <>
##$CPDPRGT= <>
##$D= (0..31)
0 1 0 0 0 0 0 0 0 0.06 0 0 0 0 0 0 0.0002 0 0 0 0 0 0 0 0 0 0 0 0 0 0 
0 
##$DATE= 1136972899
##$DBL= (0..7)
120 120 120 120 120 120 120 120 
##$DBP= (0..7)
150 150 150 150 150 150 150 150 
##$DBP07= 0
##$DBPNAM0= <>
##$DBPNAM1= <>
##$DBPNAM2= <>
$$ [...]
##$SUBNAM7= <"">
##$SUBNAM8= <"">
##$SUBNAM9= <"">
##$SW= 20.6930455092707
##$SWIBOX= (0..15)
0 0 3 0 0 0 0 0 0 0 0 0 0 0 0 0 
##$SW_h= 5175.983436853
##$TD= 65536
##$TD0= 1
##$TE= 294.16
##$TE2= 300
##$TE3= 300
##$TEG= 300
##$TL= (0..7)
0 120 120 120 120 120 120 120 
##$TP= (0..7)
150 150 150 150 150 150 150 150 
##$TP07= 0
##$TPNAME0= <>
##$TPNAME1= <>
##$TPNAME2= <>
##$TPNAME3= <>
##$TPNAME4= <>
##$TPNAME5= <>
##$TPNAME6= <>
##$TPNAME7= <>
##$TPOAL= (0..7)
0.5 0.5 0.5 0.5 0.5 0.5 0.5 0.5 
##$TPOFFS= (0..7)
0 0 0 0 0 0 0 0 
##$TUNHIN= 0
##$TUNHOUT= 0
##$TUNXOUT= 0
##$USERA1= <user>
##$USERA2= <user>
##$USERA3= <user>
##$USERA4= <user>
##$USERA5= <user>
##$V9= 5
##$VALIST= <valist>
##$VCLIST= <CCCCCCCCCCCCCCC>
##$VD= 0
##$VDLIST= <DDDDDDDDDDDDDDD>
##$VPLIST= <PPPPPPPPPPPPPPP>
##$VTLIST= <TTTTTTTTTTTTTTT>
##$WBST= 1024
##$WBSW= 4
##$XGAIN= (0..3)
0 0 0 0 
##$XL= 0
##$YL= 0
##$YMAX_a= 340957
##$YMIN_a= -287197
##$ZGOPTNS= <>
##$ZL1= 120
##$ZL2= 120
##$ZL3= 120
##$ZL4= 120
##$ABSF1= 16.522
##$ABSF2= -4.171173
##$ABSG= 5
##$ABSL= 3
##$ALPHA= 0
##$AQORDER= 0
##$ASSFAC= 0
##$ASSFACI= 0
##$ASSFACX= 0
##$ASSWID= 0
##$AUNMP= <proc_1d>
##$AZFE= 0.1
##$AZFW= 0.1
##$BCFW= 0
##$BC_mod= 0
##$BYTORDP= 0
##$COROFFS= 0
##$CY= 12.5
##$DATMOD= 1
##$DC= 0
##$DFILT= <>
##$DTYPP= 0
##$F1P= 14.0000005364418
##$F2P= -0.99999901652339
##$FCOR= 0.5
##$FTSIZE= 32768
##$FT_mod= 6
##$GAMMA= 0
##$GB= 0
##$INTBC= 1
##$INTSCL= 1
##$ISEN= 128
##$LB= 0.3
##$LEV0= 0
##$LPBIN= 0
##$MAXI= 10000
##$MC2= 0
##$MEAN= 0
##$ME_mod= 0
##$MI= 0
##$NCOEF= 0
##$NC_proc= -3
##$NLEV= 6
##$NOISF1= 0
##$NOISF2= 0
##$NSP= 0
##$NTH_PI= 0
##$NZP= 0
##$OFFSET= 16.522
##$PC= 1
##$PHC0= 88.94984
##$PHC1= 5.839001
##$PH_mod= 1
##$PKNL= yes
##$PPARMOD= 0
##$PSCAL= 4
##$PSIGN= 0
##$REVERSE= no
##$SF= 250.13
##$SI= 32768
##$SIGF1= 0
##$SIGF2= 0
##$SINO= 400
##$SIOLD= 32768
##$SREGLST= <1H.CDCl3>
##$SSB= 0
##$STSI= 32768
##$STSR= 0
##$SW_p= 5175.98343685301
##$SYMM= 0
##$S_DEV= 0
##$TDeff= 65536
##$TDoff= 0
##$TI= <Analysis number 999999
Compound Code 99
Book Reference 9
Project Code 9>
##$TILT= no
##$TM1= 0
##$TM2= 0
##$TOPLEV= 0
##$USERP1= <user>
##$USERP2= <user>
##$USERP3= <user>
##$USERP4= <user>
##$USERP5= <user>
##$WDW= 1
##$XDIM= 32768
##$YMAX_p= 517733130
##$YMIN_p= -185568
$$ End of Bruker specific parameters
$$ ---------------------------------
##NTUPLES= NMR SPECTRUM
##VAR_NAME=  FREQUENCY,     SPECTRUM/REAL,   SPECTRUM/IMAG
##SYMBOL=    X,             R,               I
##VAR_TYPE=  INDEPENDENT,   DEPENDENT,       DEPENDENT
##VAR_FORM=  AFFN,          ASDF,            ASDF
##VAR_DIM=   32768,         32768,           32768
##UNITS=     HZ,            ARBITRARY UNITS, ARBITRARY UNITS
##FACTOR=    0.157963299565203, 1,           1
##FIRST=     4132.6476996994, 0,             0
##LAST=      -1043.33573715361, 0,           0
##MIN=       -1043.33573715361, -185568,     0
##MAX=       4132.6476996994, 517733130,     0
$$ Real data points
##PAGE= N=1
##DATA TABLE= (X++(R..R)), XYDATA
$$ [...]
15978C0902M411J6925o8269J8752L6371K8343L3660m4627j6081l6480j9587K1405
15966E725k9316j5203r300K727L1697K0957j5027o937J5850J9735l5K787L0838
15953E4498o0655k7259M3063J3178j4519N459L5845L0771p953J4659r482p1506
15941F099l2980j3332J2866J6753j3633n3808M133R624O9435l070q076o808J5608
15928B811K8320Q528n2390m2155K796P4385j485k0747q857m9p9968M5846K4107
15915a8858m7676o152J446L0371j3024K4292L0108J7851J2397O110P069J4186
15903E8120K0977l4393m3801j9554J3694l2375k3676L4150K6660M5836J5656O63
15891F1957J6988J2485n0300m5133k5110M550k4375j9208j088p47J5446M4153
$$ plain form
15978 30902 35313 52238 -16031 2721 39092 67435 101095 56468 40387 3907 -15680 5725
15966 5725 -23591 -38794 -48094 -45367 -13670 7287 -7740 -14677 1173 20908 20873 23660 54498
15953 54498 -6157 -33416 9647 22825 8306 13765 49610 80381 72428 87087 77605 6099
15941 6099 -26881 -40213 -27347 -10594 -24227 -78035 -73902 -64278 5157 2087 -5989 -12797 2811
15928 2811 31131 39659 -12731 -54886 -52090 22295 20810 63 -8794 -8843 -88811 -42965 -18858
15915 -18858 -66534 -72686 -71240 -40869 -53893 -29601 507 18358 30755 36865 43934 58120
15903 58120 79097 44704 903 -18651 -4957 -37332 -61008 -26858 -198 45638 61294 61957
15891 61957 78945 91430 41130 -4003 -29113 -24563 -48938 -68146 -69234 -69981 -54535 -10382
15879a0382k1752j8621K3001K8498M919j0480L1914J8613j3574J5156j4355J6850
15867D9787J0074M340k8066J9734M8750Q142l9128p3474K7161L1842j267o4750
15855f855L142J8292n2229R373Q395N0231j9495l5240J8045K5615k3109m3285
15843d7120L5479n452l7228k1090J4254M433M6433J5663n179j0773k3794m869
15831c9243l217N1310j9896N777J6125j1656K1292N366j0920L1574J555k8005
15819B0062k6645k0870L8347K3451j4144k1932k083q5982l4765J8767L486K250
15807a00058M3361j600k8183M131L6830O5135K5433o226p2931m4399j1191O1260
15795b8438K6182K8145m8720o750P405j2731m1444J4410L6429J3879p150k8902
$$ plain form
15879 -10382 -32134 -50755 -27754 744 5663 -4817 27097 45710 32136 47292 32937 49787
15867 49787 59861 64201 36135 55869 104619 112761 73633 159 27320 59162 57895 -6855
15855 -6855 -3713 14579 -37650 -28277 -19882 30349 10854 -24386 -6341 19274 -3835 -47120
15843 -47120 -11641 -17093 -54321 -75411 -61157 -56724 -10291 5372 193 -10580 -34374 -39243
15831 -39243 -42460 8850 -11046 -5269 10856 -800 20492 25858 14938 46512 48067 20062
15819 20062 -6583 -27453 10894 34345 20201 -1731 -3814 -89796 -124561 -105794 -102308 -100058
15807 -100058 -56697 -58297 -86480 -82349 -45519 19616 45049 38823 -34108 -78507 -89698 -28438
15795 -28438 -2256 25889 -22831 -29581 -22176 -34907 -76351 -61941 -25512 -11633 -18783 -47685
15783d7685O030O5465j8685m8713J5458L0509j2979l604o376k1579L1337l753
15771a4575J1694k892n8651J9444N9350O15l3031K2389R7553m0310n4859O96J7425
15758B4848j0727l3199r56J0631K040K1911J6253K1008J3930k9438m9929L4561
15746B0933J9061o5854k9159k6899J4403L4783L4174o24k0259K1140k2132L675
15734a6758o361N016K0984j3489K3196l005J4475l007k0965k736K4888K2729k0734
15721B4233k5723K2667L0021J4340m1190l6041j1811J7178M305J3441M0975M5233
15709I7628l1244o7239q394m1857m8590R717k1892m5416k6867M6296N8993L4984
15697d3881K750K8596k5481L3026j5868j0185m616L8038J0646k5419J5161l720
$$ plain form
15783 -47685 -41655 23810 5125 -43588 -28130 2379 -10600 -14204 -20580 -42159 -10822 -14575
15771 -14575 -2881 -5773 -64424 -44980 14370 14985 -18046 4343 101896 61586 6727 7423 24848
15758 24848 14121 -19078 -20034 -9403 -7363 14548 30801 51809 65739 36301 -13628 20933
15746 20933 39994 -25860 -55019 -81918 -67515 -32732 1442 818 -19441 1699 -20433 -16758
15734 -16758 -23119 -18103 2881 -10608 12588 9583 24058 21051 86 -2650 22238 44967 24233
15721 24233 -1490 21177 51198 65538 24348 -11693 -23504 -6326 -2021 11420 52395 97628
15709 97628 66384 -855 -9249 -51106 -99696 -89979 -111871 -157287 -184154 -137858 -78865 -43881
15697 -43881 -41131 -12535 -38016 -4990 -20858 -31043 -35659 2379 13025 -12394 2767 -953
15685i53J1520j7628m4188L6154k153j8123j8591M2625M5103J290k3689j1874
15673e07k8559L977K3363l5302L237J1419n090J2213K155j6007J7880q402K301
15660a7322J4447l0441N816O7393N0586k5900m0961n0049N917k6627K6701j3475
15648c3915j926N6818j1975j4475M704M3873K3419K048k1018r164J8733j5649
15636D1473r550k6606K3654l1040Q659K5708n1884q34o073j5139N2248K5024M8594
15623H4234p595l7624K263J6905o1906r811j9720M188j7096J9247L7720j0357
15611D48M88k5006l9454N73N903L968J0295j5389L4106Q3683J1699n960n0778
15598A4576K5451l4154j643j7606Jk3781M279O6689o0672k6703K0515J559j5424
$$ plain form
15685 -953 10567 -7061 -51249 -15095 -17248 -35371 -53962 -11337 33766 35056 11367 -507
15673 -507 -29066 -25089 -1726 -37028 -33791 -22372 -27462 -15249 -13094 -29101 -11221 -19623 -17322
15660 -17322 -2875 -33316 -27500 39893 90479 64579 23618 -26431 -20514 -47141 -20440 -33915
15648 -33915 -35841 20977 9002 -5473 -769 43104 66523 68571 47553 38389 57122 41473
15636 41473 31923 5317 28971 -2069 6590 32298 -19586 -20420 -26493 -41632 10616 35640 84234
15623 84234 76639 39015 41278 58183 -3723 -13534 -33254 -29066 -46162 -26915 10805 448
15611 448 936 -24070 -63524 -62951 -57048 -53080 -42785 -58174 -24068 59615 71314 65354 14576
15598 14576 40027 5873 4230 -13376 -13375 -37156 -32877 33812 -26860 -53563 -33048 -31489 -46913
15585d6913l7305N0655R964j9040J1323L3291r037p670j9472j199k9223k8739
15573i3365L9460J2244K5628L875n3617R61M6061L1388j665K991k112k6738k4925
15560c9814K2655p690K3133L2667m9281m5244J355j5804J6292L6281M9557N941
15548C0048K420k5704k9202K3039J9128n6103K4327k4857n6734M1723M6868L3176
15536B8129J0392m4278k9059M7214K256l8752K9624R966j5008m1171k9050K6081
15524d3656M6378J6856K326j8366n279O2379J8997j8358j2240q175l6317n168
15512f23j1447J753J8989n976k7764l0290m2329K643P6965O5337l3475M6327j2172
15499D7938M3026r354l6480j5857n0153m862J4195m682P0593j9468k4340o380
$$ plain form
15585 -46913 -84218 -33563 -23599 -42639 -31316 1975 -7062 -14732 -34204 -35403 -64626 -93365
15573 -93365 -53905 -41661 -16033 -12158 -65775 -64814 -18753 12635 10970 13961 11849 -14889 -39814
15560 -39814 -17159 -24849 -1716 30951 -18330 -63574 -62219 -78023 -61731 -25450 24107 30048
15548 30048 32468 6764 -22438 601 19729 -36374 -12047 -36904 -93638 -51915 -5047 28129
15536 28129 38521 -5757 -34816 12398 14654 -24098 5526 15492 484 -40687 -69737 -43656
15524 -43656 2722 19578 21904 3538 -1741 60638 79635 61277 49037 40862 4545 -623
15512 -623 -12070 -10317 8672 2696 -25068 -55358 -97687 -95044 -18079 47258 13783 60110 47938
15499 47938 90964 81610 45130 29273 -20880 -25742 -11547 -16229 54364 34896 10556 4176
15487D176O7770M1798n5705j0899J2199J8178J1737n4452n8249L0193m4339j4146
15475e1739L7266J7694j889K8249l286j3531r743p4112K592J9354K6475K8341
15463E671K8662N3977K4482k5942p5162r787K2894n330M681M8085p765n7493l5248
15450b8275q172K3459k148O637m2145n3743P178L6790N581K883O378l4826N5413
15437b4990K9851l9030l2901J2399M0953K1967j8322m9200o194J4343O3440J9096
15425C1412o9085J5361L4074M9296j700k7786k4630N506L1850J7829j8658o2232
15413a8763J7646Q145L6831j5327P307m2283l1940j2119N434K8023M8482J1581
15401D3017q155k8992M712k6290J6102L428Q248j7838j1672O747L9350L9172l548
$$ plain form
15487 4176 71946 113744 58039 47140 59339 77517 89254 34802 -23447 6746 -37593 -51739
15475 -51739 -14473 3221 1332 29581 26295 12764 3021 -71091 -68499 -49145 -22670 5671
15463 5671 34333 88310 112792 86850 11688 1901 24795 19465 24146 72231 64466 6973 -28275
15450 -28275 -36447 -12988 -15136 -8499 -50644 -104387 -97209 -60419 -54838 -51955 -45577 -80403 -24990
15437 -24990 4861 -34169 -67070 -54671 -13718 8249 -10073 -59273 -65467 -51124 12316 31412
15425 31412 -37673 -22312 11762 61058 59358 31572 6942 12448 44298 62127 43469 -18763
15413 -18763 -1117 7028 43859 28532 35839 -6444 -38384 -50503 -45069 -17046 31436 43017
15401 43017 34862 5870 10582 -15708 394 3822 12070 -5768 -17440 -10693 28657 67829 64281
15388F4281k4599l6070n097k5259J6375l1909L6715j5281k0335J4752J1300l9864
15376e4991r747M7905p855m4051K5060l6176K9501O1064Q7619o4620J6842o0411
15364i860o1564j5340J226K5629o604L0736L859R99l1016p870k163J0546L9635
15351b1787n7211l9458j859Q9163N9702K6430k4619n921J6482R253l0561j6883
15339B731l7996k0708M2M0966M0373j478l7585K696p46L481k408k602k9253L1898
15325a0589N9019m032M855J1278L0180l9057K3959n82j9012m428J8511J0074l0106
15312E0070o8826l1011l1031J4723M9704M0807J3439m992J7601L0380m668n9903
15300A6293l5357K4902k2390k2542K7242P7797J8893J115l5508m8528l6986J1599
$$ plain form
15388 64281 39682 3612 -1485 -26744 -10369 -42278 -5563 -20844 -41179 -26427 -15127 -54991
15376 -54991 -64738 -16833 -24688 -68739 -43679 -79855 -50354 10710 98329 33709 50551 -9860
15364 -9860 -71424 -86764 -85538 -59909 -66513 -35777 -31918 -30919 -61935 -69805 -71968 -61422 -21787
15351 -21787 -78998 -118456 -120315 -31152 28550 54980 30361 24440 40922 50175 19614 2731
15339 2731 -35265 -55973 -55931 -14965 25408 23930 -13655 -10959 -11705 -8224 -10632 -13234 -42487 -10589
15325 -10589 48430 44398 49253 60531 90711 51654 75613 75031 56019 51591 70102 80176 50070
15312 50070 -18756 -49767 -80798 -66075 -16371 24436 37875 32883 50484 80864 76196 16293
15300 16293 -19064 5838 -16552 -39094 -11852 65945 84838 85953 50445 1917 -35069 -23470
15288b3470N060J4738j7905m8076j2865L3240n342K7963j5556j1845K6829K7771
15276E42K2906P074p2040n4943k6756k5914M3291M2472N7460J4801K1159j7156
15264A2896k0301p43K3292J8223m5205j7715K5683j0653J9092O0638l7489L9J8259
15251D6016l942n036k0455l66L7053M3161m0023n0137O175j6356m016k2262L2594
15238B406j8011p1643N2167M7385k8300K4506O7709j2149m9514J9961j8121k812
15226A3584j1931J6296p892K2587L1386n6106j7654R315L3153j1738l3269K4786
15214A2517O969J4768K9381K7960N920n8501p5116q567L9682J8010P073m517k8374
15201a2795j888k9852j6521J1524o766l59O0372L5284j6580j3396k7901r185k2897
$$ plain form
15288 -23470 -18410 -3672 -21577 -69653 -82518 -49278 -54620 -26657 -42213 -54058 -27229 542
15276 542 23448 30522 -41518 -96461 -123217 -149131 -105840 -63368 -5908 8893 30052 12896
15264 12896 -7405 -8148 15144 33367 -11838 -29553 -3870 -14523 4569 65207 27718 27757 46016
15251 46016 42074 37038 16583 16217 53270 96431 56408 6271 12446 -3910 -7926 -30188 2406
15238 2406 -15605 -87248 -35081 12304 -15996 8510 76219 64070 14556 34517 16396 13584
15226 13584 1653 17949 10057 32644 64030 7924 -9730 -415 32738 21000 -12269 12517
15214 12517 19486 34254 63635 91595 97515 39014 -36102 -44669 -4987 13023 20096 15579 -12795
15201 -12795 -14683 -44535 -61056 -49532 -56298 -56657 3715 38999 22419 9023 -18878 -28063 -50960
15188e0960l0906K2900N9895R4675J3043n4037K9892L8855p9150k8950K049j1916
15176E390M471k0260J0082j1453j6773K7476N2848j2493m8283j6763J0965M710
15164a0083r668k0745M5107K4560k6333J8110r637j9600n014j9268j649P968K4878
15151a374K1589K2033j5804k6701J6993j6465j6059L9744L2880m5985n0129n9164
15139i8442K8507P7765K3925m9994K0245k7291l7801q965j2655m2681K3753N2413
15127e1221M9254o6763k21K2016L3063n206P937l976j4216q468j750J0725J5363
15114a3463J6746K0071k3178j4563o6545K268K9797K5399K7165l887k372R994
15102G432k0311l6920k3436M4351M3122J6806J6418j0756M0570L1731Q541l683
$$ plain form
15188 -50960 -81866 -58966 929 95604 108647 54610 84502 123357 44207 15257 17306 5390
15176 5390 9861 -10399 -317 -11770 -28543 -1067 51781 39288 -8995 -25758 -14793 -10083
15164 -10083 -19751 -40496 4611 29171 2838 20948 11311 -8289 -13303 -32571 -34220 -26252 -1374
15151 -1374 20215 42248 26444 -257 16736 271 -15788 23956 56836 10851 -39278 -98442
15139 -98442 -69935 7830 31755 -18239 2006 -25285 -63086 -72051 -84706 -127387 -103634 -51221
15127 -51221 -1967 -68730 -68951 -46935 -13872 -19078 -11141 -15117 -29333 -37801 -39551 -28826 -13463
15114 -13463 3283 23354 176 -14387 -80932 -78664 -48867 -23468 3697 -190 -2562 7432
15102 7432 -12879 -49799 -73235 -28884 14238 31044 47462 36706 77276 109007 117548 113865
15090A13865l3921l9678n1236l3816J9710N7956j0009k092m0384J2449J5806J2936
15078B1586J109j3785k3527o812m3591q851K9216l1840K346k6522r746M9210O555
15065e4652K2573L996P0537j265k3221j0342j9028J4922l992Q862L3003J572l2348
15052A0617n4070P838P6293J6056n4282p270K7471L2289n18k0642l1568m3253
15040d1039k6083L7688n060m578j5815k0132P7559N745k3200p572K7120k4971
15028b0338n431M6671J8287j4195j3507m6128J4036m3699k3341j3014j9334L8052
15016h1941N1902M9080p325L3090p073j7606j2945K9230J2516j054J3823M8245
15004A09942r564J4537k2143o5961j1342j6218n3955L8424l7402J499M8295J329
$$ plain form
15090 113865 79944 40266 -10970 -44786 -25076 32880 22871 20779 -19605 -7156 8650 21586
15078 21586 22695 8910 -14617 -21429 -65020 -73871 -44655 -76495 -74149 -100671 -110417 -61207 -54652
15065 -54652 -32079 -28083 42454 41189 17968 7626 -11402 3520 -472 8390 41393 42965 10617
15052 10617 -43453 -35615 40678 56734 2452 -4818 22653 54942 54424 33782 2214 -41039
15040 -41039 -67122 -29434 -34494 -39072 -54887 -75019 2540 8285 -14915 -22487 4633 -20338
15028 -20338 -25769 20902 39189 24994 11487 -34641 -20605 -64304 -87645 -100659 -119993 -81941
15016 -81941 -30039 19041 11716 44806 37733 20127 7182 36412 48928 47874 61697 109942
15004 109942 100378 114915 92772 26811 15469 -749 -54704 -16280 -53682 -52183 -3888 -2559
14992b559k4493j7185J7385K8581m8343j7650K817j9306J0522K6349K7093m4645
14980f1434j5365O3152P1021k6358n3259j8756L2687j8593o2976J3877N7777O972
14968a1255K4703m5336k1068K1306K961J2418L0183J0380j7708m479M964J7227
14956B4296J3102k9799m5817K895L1632K0834J5295J9169k335k3431j6631k3042
14944a3832K6251k308m4446k6285J5255J7797K839J8785j5970M6791J3749j6620
14932B2006R022R386p3195Q172K391R664L1409L1839o170k1860l4200O516K0452
14919A5432J6590k3267k6550k4442j0101R030j1328j3140P4817K2467j6827n5837
14907d3156N460j7818l7836L9864K8363L458O679m304k374l1274J7716k8892M9114
$$ plain form
14992 -2559 -27052 -44237 -26852 1729 -46614 -64264 -61447 -80753 -70231 -43882 -16789 -61434
14980 -61434 -76799 -13647 57374 31016 -22243 -40999 -8312 -26905 -89881 -76004 -18227 -11255
14968 -11255 13448 -31888 -52956 -31650 -28689 -16271 13912 24292 6584 2105 7069 24296
14956 24296 37398 7599 -38218 -35323 -3691 17143 32438 51607 49272 25841 9210 -13832
14944 -13832 12419 10111 -34335 -60620 -45365 -27568 -24729 -5944 -21914 24877 38626 22006
14932 22006 31028 40414 -32781 -24609 -22218 -12554 18855 50694 44524 22664 -11536 -5020 15432
14919 15432 32022 8755 -17795 -42237 -52338 -43308 -54636 -67776 7041 29508 12681 -43156
14907 -43156 -37696 -55514 -93350 -53486 -25123 -21665 -14986 -19290 -21664 -52938 -35222 -64114 -15000
14894a5000M8008q520j7599r105K108o139K77n0484q043K9356K3385N2323J657
14881D2224n5201l0302K7497j7974J0924O4701l5716p5971j4250J3901K8890K9059
14869a2218J2766l8311p426L1170k738q41m8039N6567Q467j2225p605N995L1356
14856A6918J2198l0115M765k0762j3330l5308K7102Q1256j8956j6978r1981p2040
14844a57231J7336M7731O5878N1160J8979J2640l6998j773J5093K1611j3167l0526
14832A0733k5511j3410M2716K2623J3348l5217p715K2493j7342n007j052N4581
14820F1240K4629p3098l8617o68K4647L3058m9547k33j2268J6808k9961j1178
14808e5188L3962L2480l3555j2633J5491J095k1062L7896j6458K5543K2592j6000
$$ plain form
14894 -15000 33008 24488 6889 -2216 -108 -6247 -5970 -56454 -64497 -35141 -11756 40567 42224
14881 42224 -12977 -43279 -15782 -33756 -22832 41869 6153 -69818 -84068 -70167 -41277 -12218
14869 -12218 548 -37763 -45189 -14019 -16757 -17598 -65637 -9070 -603 -12828 -20433 -14438 16918
14856 16918 29116 -999 3766 -16996 -30326 -65634 -38532 42724 23768 6790 -85191 -157231
14844 -157231 -139895 -92164 -26286 24874 43853 56493 19495 17722 32815 54426 41259 10733
14832 10733 -14778 -28188 14528 37151 50499 15282 7567 30060 12718 7711 6659 61240
14820 61240 85869 12771 -25846 -26514 -1867 31191 -18356 -18589 -30857 -14049 -44010 -55188
14808 -55188 -21226 11254 -22301 -34934 -19443 -18348 -39410 -1514 -17972 7571 30163 14163
14796A4163J2695r179l0158L7095J6439p692k6628Q213L4833m4051m0304J0241
14784b4333K3713M8732k5382j7109m2212m3073K9718R458J788J0157l6044J7274
14772d7313M1222Q324j2420J7320m257l1142k4968M6653O1681p844m6369k9554
14760b8667m4069P170L5938l054m0565p3305K864P7821M6522M269m1930K0598
14748c6408K9790M4526R573l8669l7940K0241N2309k4053m9370k4143k0442J4975
14736e9611j8480O4207O2081j8341n6210n0429k0715N4594J5482K9371l0500q407
14724c6958l1263l59J1855j4011K3059L6221j625J0952m1623j7416l1669L485
14712h9352N7755M2271J5255j2166q683j093j5218M889k0616L8185j7543k5150
$$ plain form
14796 14163 26858 17679 -12479 24616 41055 33363 6735 14948 49781 5730 -34574 -24333
14784 -24333 -620 48112 22730 5621 -36591 -79664 -49946 -40488 -38700 -28543 -64587 -47313
14772 -47313 -6091 2233 -10187 7133 2876 -28266 -53234 -6581 55100 47256 887 -28667
14760 -28667 -72736 -65566 -29628 -32682 -73247 -146552 -143688 -65867 -19345 -15076 -57006 -36408
14748 -36408 -6618 37908 47481 8812 -29128 -8887 43422 19369 -30001 -54144 -74586 -59611
14736 -59611 -78091 -13884 48197 29856 -26354 -76783 -97498 -42904 -27422 1949 -28551 -36958
14724 -36958 -68221 -68580 -56725 -70736 -47677 -11456 -13081 -2129 -43752 -61168 -92837 -89352
14712 -89352 -31597 10674 25929 13763 5080 3987 -11231 -6342 -26958 11227 -6316 -31466
14700c1466m631l6710r164o456O2055M5019K2025m809l6858O589L2124m9519p272
14687a9073m53n8002o568L617R258M1160Q6720L2820o4950l8921n8639k0847K4420
14674f9458k830n385K3303K1747K6164J3273j4375J0737L7867r613o60M3049L975
14661G7794j9654q2728n9358K2338K2629j279j5518M0910O2L4071N600K5288j5056
14648C5099j3896l7573J5335R874L0533J9820j5362n2172j9771M2077L533l5450
14636a7953m066J1285K1685J4763k3189l3974j5667O914K3349N4670m238j6477
14624A7102R151j3484l7201J5802K4369o958L260O494M537k5613j2165J8249k29
14611C314K5505j1845J158l3975O912J3867j4185M558n824k6419J1046M4979k7225
$$ plain form
14700 -31466 -36097 -72807 -81971 -88427 -26372 18647 40672 35863 -995 5594 37718 -11801 -19073
14687 -19073 -19526 -77528 -84096 -80479 -71221 -30061 56659 89479 24529 -14392 -73031 -93878 -69458
14674 -69458 -72288 -77673 -54370 -32623 -6459 6814 -7561 3176 41043 31430 30770 73819 77794
14661 77794 58140 -24588 -83946 -61608 -38979 -40258 -55776 -14866 -14804 19267 24867 50155 35099
14648 35099 21203 -16370 -1035 8839 39372 59192 43830 -8342 -28113 13964 17497 -17953
14636 -17953 -22019 -10734 10951 25714 2525 -31449 -47116 -40202 -16853 37817 33579 17102
14624 17102 26253 12769 -24432 -8630 15739 8781 12041 18535 23072 -2541 -14706 3543 3314
14611 3314 28819 16974 18132 -15843 -8931 4936 -9249 -4691 -10515 -36934 -25888 19091 -8134
14598h134o0532J2895k6461l096J2584J7487J0294J8794K623J558J1398J9524
14586H934J5141J1887l1076q732j6852l682K7591Q194J3596J2330k8910j0765
14574b344L8197n499p238M358n4387k1757n097k6804Q067L0800L5677k593K0363
14561A1743j173L7224l49k9818O773O242M770k1667m524j3047j1686n5992m153
14548g5657M7319J7272M2218j2860j9862J1262m3730q281N2106J5902M6916L018
14536G5623p1433N554K1259n1046k4048k2922k5249P181j2050K7801J5538j1151
14524f4943j0135L4796N746l2834j3606R497J5721k0780M8268K6673P987o045
14512C45j6700q505J6994J943r559N917l916p0771k0079M8846K9312N6730M5297
$$ plain form
14598 -8134 -68666 -55771 -82232 -85328 -72744 -55257 -44963 -26169 -23546 -21988 -10590 8934
14586 8934 24075 35962 4886 -3846 -20698 -24380 3211 11405 25001 37331 8421 -2344
14574 -2344 35853 30354 23116 27474 -26913 -48670 -53767 -80571 -72504 -41704 -6027 -8620 11743
14561 11743 10570 47794 47445 17627 24400 30642 35412 13745 9221 -3826 -15512 -71504 -75657
14548 -75657 -28338 -11066 31152 18292 -1570 9692 -34038 -42319 9787 25689 72605 75623
14536 75623 4190 9744 31003 -20043 -44091 -67013 -92262 -85081 -97131 -69330 -53792 -64943
14524 -64943 -75078 -40282 -34536 -67370 -80976 -71479 -55758 -76538 -28270 -1597 6390 345
14512 345 -16355 -24860 -7866 -5923 -15482 -9565 -13481 -84252 -104331 -55485 -26173 30557 75854
14499G5854n9779r219q300M8786K5704J7948k056k5884p0133j8170k0167K878
14487d2538K6478M710R404m0310j5484J5866M335M7764J7140n4431k8687J2548
14475d3205j0801N4182J3117J4164j1892J1738k0060n4618N420M9532Mj8884J1383
14462H0K6779j7525k8059j691M6346r513p996M8659J0506j9220r974Q623P4o997
14448D0092j4511n4327Q843J0923J3570k398k3519l2986K9676M2593J9397k019
14436C5334j1222j9396n3713L8168J1769k6693K1012J571K6309O534O4694J6944
14424A11311l6838j523K9015J8109p013o2994k7632K3925p335j7014l9030j667
14412a8686M9410M4637M2078k3107m6243m1101k8387K0775K7516L0960j2079p041
$$ plain form
14499 75854 16075 6856 -1444 47342 73046 90994 88938 63054 -7079 -25249 -45416 -42538
14487 -42538 -16060 -11350 -1946 -42256 -57740 -41874 -37539 10225 27365 -27066 -55753 -43205
14475 -43205 -54006 176 13293 27457 15565 27303 7243 -47375 -41955 7577 7581 -11303 80
14462 80 26859 9334 -18725 -20416 25930 16417 8421 57080 67586 48366 38392 47015 47089 40092
14448 40092 25581 -28746 -19903 -8980 4590 2192 -21327 -54313 -24637 17956 37353 35334
14436 35334 24112 4716 -48997 -10829 940 -25753 -4741 -3170 23139 29673 94367 111311
14424 111311 74473 72950 101965 120074 113061 50067 22435 46360 39025 22011 -17019 -18686
14412 -18686 30724 75361 117439 94332 48089 6988 -21399 -624 26892 57852 45773 38732
14400C8732K2184J3839k0465p821l8531k7158K0218K1424J8503j6529J8355o8071
14388b5320l0967P3636k6731k6901M0469M6033K115l4548N2660o723J0516N0993
14376A25232k0250L297K4864l7115o4368q862J800Q352n5834n1209M0816O5078
14364C1801K5955m9775l79l898k0263l5280l0018k1386J1671L2426K6537N5322
14352B2713J3084K9462K4154n9398r1744K7816N4476K7840R342J5933k7917m617
14340D1144l7991k9103O0945K900j9320o0879l1214L0226M3024J7028L811R2M806
14327B5469q052M6445N6991K511r8243L727J9205K997L0807n5697q2422R278L919
14314d3065K1648J120p0023J8647M2302N4482k0079k0893m1931p737L1867O83
$$ plain form
14400 38732 60916 74755 54290 46469 7938 -19220 998 22422 40925 24396 42751 -25320
14388 -25320 -56287 17349 -9382 -36283 4186 50219 52334 17786 70446 63723 74239 125232
14376 125232 104982 108279 133143 96028 31660 22798 24598 32950 -22884 -74093 -33277 31801
14364 31801 57756 7981 7602 3704 -16559 -51839 -81857 -103243 -91572 -59146 -32609 22713
14352 22713 35797 65259 89413 30015 -61729 -33913 20563 48403 57745 73678 45761 41144
14340 41144 3153 -25950 34995 37895 18575 -42304 -73518 -43292 -268 16760 20571 20663 25469
14327 25469 17417 63862 120853 123364 25121 28848 48053 51050 81857 26160 -56262 -46984 -43065
14314 -43065 -21417 -20297 -90320 -71673 -29371 25111 5032 -15861 -57792 -65529 -33662 -32979
14302c2979O2957O066N695J804k7854r232j633M1525M3618l0205m0039m7849K6807
14289a319P927K0973N999p574l1957K9900r794l7371R845P1078K6211l7055l2259
14276A4604o228N389K6556r354P924j8302m9350J403R188J6700r185j7623k1481
14263d9759M8062M0048J4978n1440n8284m6056L4074n3j6661K5585M9950K9328
14251A9772J691p446j9777k0134J6178l8477j546j620p044O2086M8352k0329k1574
14238A0132j8859l3152L9872M6965j3739o0578l4323n206J9387M2205n335k9808
14226d2439j7344N3895j3545J4086M3584p968k6377L1367k284o3868q380K8030
14214a1243J172K9798N086n43K7057L4661L3801n9681l7762r592L0411l128K648
$$ plain form
14302 -32979 29978 36044 41739 43543 15689 6457 4824 46349 89967 59762 19723 -28126 -1319
14289 -1319 6608 27581 33580 26006 -5951 23949 14155 -23216 -13371 57707 83918 46863 14604
14276 14604 8376 13765 40321 30967 38891 20589 -28761 -27358 -18170 -1470 -10655 -28278 -49759
14263 -49759 -1697 38351 53329 1889 -56395 -102451 -68377 -68430 -85091 -59506 -9556 19772
14251 19772 21463 14017 -5760 -25894 -9716 -48193 -49739 -51359 -58403 3683 52035 31706 10132
14238 10132 -8727 -41879 -2007 44958 31219 -29359 -63682 -68888 -49501 -7296 -12631 -42439
14226 -42439 -59783 -5888 -19433 -5347 38237 30269 3892 35259 32975 -30893 -39273 -11243
14214 -11243 -10071 19727 24813 24270 51327 85988 119789 60108 22346 12754 43165 40037 42685
14201D2685K9062l7922j8728r629J3758l534q741j4492k0088o7875m124J6837
14189h2791L3800M278m5944L1075l7104n044P0121K823l5399m9973K5560P723
14177h0875L611k577R908l761K2532J0642k6373n772l2192L52N6487N0799P116
14164I897M4091l744l8942k8887K9352K3820L3058j1360o060J7619R465p6155
14152B154r267K5455n1186l8077M2331N603j8001P256O206k9555j8165j319K4000
14139e2565L1553j3663r06L146P1875N2594k8563r0070J7749N0520O937L0368
14127G8975j6264k6103K2376p355l0421p788k0659L7410J5019j9053l1671l9058
14115d4592J0965R1261M601p2860p1427k3788N4275M6449K8253q9584j0178M4685
$$ plain form
14201 42685 71747 33825 15097 5468 19226 15692 6951 -7541 -27629 -95504 -99628 -82791
14189 -82791 -48991 -44713 -90657 -59582 -96686 -101730 -31609 -28786 -64185 -114158 -88598 -80875
14177 -80875 -77264 -79841 -69933 -73694 -51162 -40520 -66893 -72665 -104857 -104505 -48018 2781 9897
14164 9897 53988 50244 11302 -17585 11767 35587 68645 57285 51225 68844 78309 2154
14152 2154 -7113 18342 -32844 -70921 -28590 -22987 -40988 -33732 -27526 -57081 -75246 -76565 -52565
14139 -52565 -21012 -34675 -35581 -32435 39440 92034 63471 -26599 -8850 41670 48607 78975
14127 78975 62711 36608 58984 51629 21208 13420 -7239 30171 45190 26137 -5534 -44592
14115 -44592 -33627 57634 62235 -10625 -82052 -105840 -51565 -5116 23137 -66447 -76625 -31940
14103c1940K7052J3492r584j3485j2819j595k0343J1056J4212n775R632J0852
14091i245p6239O443r395K345j4041N6712K3585m252L1256m4206l2049J1429k4192
14078h1849l969P3386J7234r420N661O50k6178J3318O9939O917m9406l242L864
14065A6905J4537k1917n2836k5276M4064J1307J8355k4507J1024k5748j6525M9971
14053f46k9292j752j4006J1775r99k4742K7256N2006J9733j6858p899l0867k463
14040a8754m803L058m6838L5221L1732j9053k1914K8177J2664M7903L2288L5536
14028A15217k6448m4641m4732j190j9317j3532l1021J7858M7753M6927j8224l3250
14016d600K090m5318q987j9298L1096L0092k2517j289K1666l8126J4972K8572
$$ plain form
14103 -31940 -4888 8604 -980 -14465 -27284 -28879 -49222 -38166 -23954 -29729 -20097 -9245
14091 -9245 -85484 -79041 -88436 -86091 -100132 -43420 -19835 -24087 7169 -37037 -69086 -57657 -81849
14078 -81849 -85818 -12432 4802 -4618 1043 1693 -24485 -11167 58772 65689 16283 13041 16905
14065 16905 31442 9525 -43311 -68587 -24523 -13216 5139 -19368 -8344 -34092 -50617 -646
14053 -646 -29938 -31690 -45696 -33921 -34920 -59662 -32406 19600 39333 22475 14576 -16291 -18754
14040 -18754 -23557 -20499 -67337 -32116 -384 -19437 -41351 -13174 -510 47393 79681 115217
14028 115217 88769 44128 -604 -1794 -21111 -34643 -65664 -47806 -53 46874 28650 -4600
14016 -4600 -2510 -47828 -56815 -76113 -45017 -14925 -37442 -38731 -17065 -55191 -40219 -11647
14004a1647m7471j8587K3777M8637n43j7058j184J6844n9050j4837q80l0480M1838
13991g0641L3Q647K4344k2396J8344J6359L9654j3202l3265J6254K5608L1257
13979D0996O5505K9278o7370j10011k914j1720o2596M565P2289N6172J7737J0946
13967D2877l6602p3863j3537K8835M3810J3882k7633L3538Q041m7134j5225L2038
13955a0973M7510M866O667J6726l316l3998n8158j3037J7287K8202p255m273J0683
13942I31R233L1960L6036M4037o1553l4302k5996K0388l2105l0351K3796J8587
13930F61j176K2921K4659L1091n4283l2432J4347K4288K4150k0124J8515j5549
13918C7068m7603K634J7315R611K8670J3607l5123p21j8518l714P610N124k531
$$ plain form
14004 -11647 -59118 -77705 -53928 -5291 -5834 -22892 -24076 -7232 -66282 -81119 -81999 -112479 -70641
13991 -70641 -70608 -61961 -37617 -60013 -41669 -25310 14344 1142 -32123 -15869 9739 40996
13979 40996 106501 135779 68409 -41602 -44516 -56236 -118832 -114267 -41978 14194 31931 42877
13967 42877 6275 -67588 -81125 -52290 -8480 5402 -22231 11307 19348 -27786 -43011 -10973
13955 -10973 36537 41403 48070 64796 61480 27482 -30676 -43713 -26426 1776 -5479 -9752 931
13942 931 10164 42124 78160 122197 60644 26342 346 20734 -11371 -41722 -17926 661
13930 661 -515 22406 47065 78156 23873 -8559 5788 30076 54226 34102 52617 37068
13918 37068 -10535 -7901 9414 19025 47695 61302 26179 25458 6940 3226 10836 15960 13429
13905A3429l4794j7041J3007M1924J6755k983m6233p216J4399k9549M0428J0815
13893A2941l9639k7838N3065J4779J2415l1796j0103L4734m7076l8246j3263R130
13881g0897L418M0200n267K2896M015N2202L9548m3597n8971J6346K2882J1569
13869C4344K025m8198P417M5368k8772L6578r856N540l6699j2582k8162M0919
13857G922L1568N015k0186J6293L2831k4826K772k1537k8916N114L0278k684N1928
13844H5572k670n3380o286M5415O2993j9567n5542k8575o3525l6237M5557J7250
13832h995l9494m2810K2039M1166N5264j4844O623L8027n529N693M6944J0003
13820A14087m0029M857N3180M261k1366p779Q093m8239k8523N976J8702l5594
$$ plain form
13905 13429 -21365 -38406 -25399 16525 33280 30297 -15936 -23152 -8753 -38302 2126 12941
13893 12941 -26698 -54536 -1471 13308 25723 -6073 -16176 18558 -28518 -66764 -80027 -70897
13881 -70897 -67479 -27279 -32546 -9650 -5635 46567 86115 42518 -16453 -107 22775 34344
13869 34344 36369 -11829 -4412 40956 12184 48762 38906 44446 7747 -4835 -32997 7922
13857 7922 39490 44505 24319 40612 73443 48617 51389 29852 936 6050 36328 33644 85572
13844 85572 82902 29522 23236 68651 131644 112077 56535 27960 -35565 -71802 -26245 -8995
13832 -8995 -48489 -91299 -69260 -28094 27170 12326 18949 56976 51447 57140 104084 114087
13820 114087 74058 78915 132095 136356 114990 107211 115304 67065 38542 44518 63220 27626
13808B7626l0833j1303J2991K0457K0949J4953l3901k0303j0888J343M1607q336
13796B4362l6191N878q0554l497R9420N4817k363o738J7898L847J2360J7507j3901
13783I2845j3138o7476j8234k6400j9002L4887P0214J7308m6718l9706K5833j7729
13771g316m919M7793l4206l3432j1411J0186L2746J5714q029L1553J732k4198
13759A6213L857J2888j7755J2745J0048k5283J0160r789p564L0855J3554l7976
13747A1953k8797j3317J8989M6806k9489p5580l6531n24J3717M1327N1264j4540
13735a4722m4157N3217L1779K2224K471m7047j4379l2694J9565K6828L3767l4402
13723B450L3111J9405j976k9044j0657Q019k4965j6339m7574J5609k695L8124
$$ plain form
13808 27626 -3207 -14510 -1519 18938 39887 54840 20939 636 -10252 -8909 32698 24362
13796 24362 -11829 -5951 -86505 -90002 9418 64235 61872 55134 73032 76879 89239 106746 92845
13783 92845 79707 12231 -6003 -32403 -51405 -16518 53696 71004 24286 -15420 10413 -7316
13771 -7316 -12235 35558 1352 -32080 -43491 -33305 -559 15155 7126 38679 40411 16213
13759 16213 20070 32958 15203 27948 37996 12713 22873 13084 5520 36375 49929 11953
13747 11953 -16844 -30161 -11172 35634 6145 -69435 -105966 -106490 -92773 -51446 -182 -14722
13735 -14722 -58879 -5662 26117 48341 50812 3765 -10614 -43308 -23743 3085 36852 2450
13723 2450 35561 54966 52990 23946 13289 21308 -3657 -19996 -67570 -51961 -54656 -16532
13711a6532k0527l9130K8580K2738L9280O9288O7892l109n2128r426l8647n2917
13699d638k9163o143l5914N4894R4856M438m0751m2712o2734K4086K3067K9837
13687I123j9095R423J5735k3422M898L3400J9664P35j2116j6578k0387k6256R708
13674a5168j3141l3175O3596O6012k8748k0532l142J9879L395J0969j1113N212
13662D4044P054K5433j7874j7844K0712Q509n092J3211J954j671K5492n1630J67
13649E2465N3385l2012n6214l1529m249k8489O045m3330O107P3948O521J3258
13637A5906k0331k2821l609P852J1039K3122j9045k539L2060L5676J9110k9973
13625D6447m5327o503O029O147j18M6465k5096p3715j9143J665k4546j2041M2991
$$ plain form
13711 -16532 -37059 -76189 -47609 -24871 14409 83697 151589 148480 96352 86926 48279 -4638
13699 -4638 -33801 -39944 -75858 -20964 73892 78330 37579 -5133 -67867 -43781 -20714 9123
13687 9123 -9972 -549 15186 -8236 -3338 30062 49726 50461 38345 21767 1380 -24876 -15168
13674 -15168 -28309 -61484 2112 68124 39376 18844 15702 35581 38976 49945 38832 44044
13662 44044 51098 76531 58657 40813 61525 70034 64942 78153 80107 78436 103928 52298 52465
13649 52465 105850 73838 17624 -13905 -18154 -46643 -40598 -83928 -77821 -3873 2648 15906
13637 15906 -4425 -27246 -30855 -23003 -11964 11158 -7887 -10426 21634 57310 76420 46447
13625 46447 1120 -5383 646 6793 6675 53140 28044 -45671 -64814 -63149 -87695 -99736 -56745
13612e6745P1718O4385l585J6270J8376j3572N082l7724j9018k3065m1201L3200
13600A4121O4864L1696k4519l9511l8214k2799K2262R811k7946J1426j3748k9304
13588d1861R145q528L0948J6284k5303j6239r261L0261P639k7437k28o013M8567
13575G974M3133k572k7037J1206n0821k2069O0407k5136k9870k1536l16L0472
13563b6165J1057L0481J3910J5284J221m2375l8912l039P215L4938K3736J3326
13551D0677J0200L2254n31k7120l690L105j2663M1643n5211l8518M6922o747l5028
13538d707j3381k6498j5486L3177J0930L2587k1893m1827k5289K9545j319J5128
13526b9033m0472l4612J1815N0847p460j4959O9224j9754k7355Q823l461j9126
$$ plain form
13612 -56745 14973 79358 75773 92043 110419 96847 101929 64205 45187 22122 -19079 14121
13600 14121 78985 110681 86162 46651 8437 -14362 7900 17711 -10235 1191 -12557 -41861
13588 -41861 -32716 -41244 -10296 5988 -19315 -35554 -44815 -14554 -6915 -34352 -34580 -40593 7974
13575 7974 51107 48535 21498 32704 -18117 -40186 20221 -4915 -34785 -56321 -56637 -26165
13563 -26165 -15108 15373 29283 44567 45788 3413 -35499 -38538 -31323 3615 27351 40677
13551 40677 50877 83131 82600 55480 51790 54895 42232 83875 28664 -9854 37068 30321 -4707
13538 -4707 -18088 -44586 -60072 -26895 -15965 16622 -5271 -47098 -72387 -42842 -44161 -29033
13526 -29033 -69505 -104117 -92302 -41455 -48915 -63874 5350 -14404 -41759 -32936 -36397 -55523
13514e5523J6518J4033k0663m857M9630N277n439j0628j4665K1501k3930k7990
13502e6736j5828L8211K0764l8868k659M8337J1908j1250J852j1095l4369J3180
13490c6553J5202O993L6302L4536j448m0805q4441j5620N5721J3344R978k7732
13478c4523N631Q850K4973j8321K4541j2201J3675k0326n2242K5772K4955j360
13466a0576o4506j1369M3107K9977p700m7872n1796K8947P3441M3955P835J6270
13454D9713r055n689L7763K826k2315k0238K7508J2544k3380o0665q4055N0064
13442d4979O5310N4758k6765k7515j0874l804k6439J3102Q599J4139n1526J2981
13430b3013K3114L266k9128J619r330L4092O3109K8944J1431j7740j3467j0083
$$ plain form
13514 -55523 -39005 -24972 -45635 -50492 -862 4415 -1024 -11652 -26317 -4816 -28746 -56736
13502 -56736 -72564 -34353 -13589 -52457 -55116 -6779 5129 -6121 -4269 -15364 -49733 -36553
13490 -36553 -21351 -14358 21944 56480 55032 14227 -70214 -85834 -30113 -16769 -6791 -34523
13478 -34523 -28892 -20042 4931 -13390 11151 -1050 12625 -7701 -59943 -34171 -9216 -10576
13466 -10576 -75082 -86451 -43344 -13367 -21067 -68939 -120735 -91788 -18347 25608 33443 49713
13454 49713 40658 34969 72732 75558 53243 33005 60513 73057 49677 -10988 -95043 -44979
13442 -44979 20331 75089 48324 20809 9935 6131 -20308 -7206 1393 15532 -35994 -23013
13430 -23013 101 3367 -25761 -24142 -33472 620 63729 92673 104104 86364 72897 62814
13418F2814K7391j5270n5383J0145j5218l844o230j8753l3874J0221k360L2322
13406h039K0016l5836R320P3243N164L4767J9024k2053m7220K051n4634k9927
13394c4124L0220K1490j73K4766J3846q434j8563Q266K3430L7545j4427k1467
13382F2375K086j7608j8459J3488J3639J2514N3308k3616o8610K4832N956N7391
13370A17296L4702K4489o406M5176O9080J28011J87372L70760O27755P41015K50111
13359B589361l47158o50638o13978l59762j77208p9144l2068n3408q0346k1162
13349A74489J8053n6876p7860l1108L5027n348L6908j8781m1455J2471K3762m97
13337F8785Q514k5050n8387j5027k399Q787L1796J113n798M3808n7620k6559L6946
$$ plain form
13418 62814 90205 74935 19552 29697 14479 10635 4405 -14348 -48222 -38001 -40361 -8039
13406 -8039 11977 -23859 -14539 58704 63868 98635 117659 95606 48386 50437 -4197 -34124
13394 -34124 -3904 17586 17413 42179 56025 47591 29028 37294 60724 98269 83842 62375
13382 62375 64461 46853 28394 41882 55521 68035 121343 97727 29117 53949 59905 117296
13370 117296 151998 176487 170081 215257 284337 412348 599720 970480 1598235 2339250 2589361
13359 2589361 2242203 1591565 977587 617825 440617 361473 329405 275997 195651 174489
13349 174489 192542 135666 57806 26698 61725 56377 93285 74504 33049 45520 69282 68785
13337 68785 77299 52249 -6138 -21165 -23564 -14777 17019 18132 12334 56142 -1478 -28037 8909
13324H909L7255J0351K7210n2624Q285K9387j5797l1337R328Q169l0205J4796
13312B3727N4880K927o7172k5457j5221j7520j1862j6048j0125K571K2449N100
13300e1751l452L2049M2986j5735j6838R913M8324l649l1090p2093n909J7486
13288d9759K8920R5658J1497m1305m0899o33j2660K4988N4224K3777l3915K6k0095
13275C9824J4543j8452n7547p230M032Q500m092L9088k567K5617r312o618m3722
13262a7936k7911R709O2000J5849l8895m1043n0316K1318L1005J3506J2315j3879
13250b4278n9470j0219L071k3330P4041O7341P0483j992l5624n3993q3890K2933
13238e4927K8892J9412O2891O5660l6033m2904o393J7881k7562q019k2554P756
$$ plain form
13324 8909 46164 56515 83725 31101 39386 68773 52976 21639 30967 39136 8931 23727
13312 23727 78607 81534 14362 -11095 -26316 -43836 -55698 -71746 -81871 -79300 -56851 -51751
13300 -51751 -55203 -23154 19832 4097 -12741 -2828 45496 41847 10757 -61336 -67245 -49759
13288 -49759 -20839 74819 86316 45011 4112 3479 -9181 15807 70031 93808 59893 59919 39824
13275 39824 54367 35915 -21632 -28862 -24830 -16330 -20422 18666 16099 41716 32404 25786 -17936
13262 -17936 -45847 -36138 25862 41711 2816 -38227 -88543 -67225 -36220 -22714 -10399 -24278
13250 -24278 -83748 -93967 -90896 -114226 -40185 27156 97639 95647 60023 6030 -77860 -54927
13238 -54927 -26035 -6623 56268 121928 85895 42991 36598 54479 26917 18898 -3656 4100
13226D100J6122O986j9741K9541K7831J9648q154q602L065l3585p5401k8952J8917
13213d8225o386j3523L0068R7348O7505k1013n7819k3391P999L5638m7411l5570
13201a4780J8648N9320j4199J659l7041p3873m2202J2866O7248k2997J3336J9953
13189a2062j7780n6333M3723L0538J7084O5451J0657j434K8661j08o2808m9249
13177c660r85M9258J0147l674L5882J5311l4995n6870J0434l095k9124J6271P0914
13164G5814N5297m5285O151K1231Q010Q2445K7319j876N4133L6297l5997m9898
13152B33641m9909k8773L6513P8305L4420o6870r0336m1705L2564L3174l8462
13141A32562j1064K8662n6659j05616j6743N0177l147J5475L1263Q056k3663q088
$$ plain form
13226 4100 20222 27208 7467 37008 64839 84487 76333 67731 70796 37211 -38190 -67142 -48225
13213 -48225 -54611 -68134 -38066 59282 126787 105774 47955 24564 32563 68201 20790 -14780
13201 -14780 3868 63188 48989 50648 13607 -60266 -102468 -89602 -22354 -45351 -32015 -12062
13189 -12062 -29842 -86175 -42452 -11914 5170 70621 81278 79844 108505 108397 45589 -3660
13177 -3660 -4645 44613 54760 51086 86968 102279 67284 10414 20848 17753 -11371 4900 75814
13164 75814 131111 85826 91977 113208 121218 203663 230982 229106 283239 319536 283539 233641
13152 233641 183732 154959 191472 269777 304197 237327 146991 105286 137850 171024 132562
13141 132562 121498 150160 93501 -12115 -28858 21319 18172 33647 64910 72966 49303 41215
13129D1215J0796k8987J7605j5526L0588k4472j4684Q964j2412L6151O1108j9599
13117I0747k0279J5096q294o330J1257M7938P638j143j9398m1695m5079J7006
13105D7464L7800l5669m139o727k932n3616N817N9249Q0510K5772l9058q3867
13093C0604j6015L2043j4833J1921j6549L952K1561J295k0826j8004O726K9252
13081E1127J4355j7570L0015J3654l5325k0041k1564J485L811l117L3562K049
13069E2441k7278N647O319J9929O5823J5422m3807j5192l4918n5514j4601K4717
13057a012O2K1112l6848O4080j5250j7844R476L1171J0883J0196J13568N0504
13045B40098J4424O9559J09895J25164J61964O0098o4286j67415j50918r3362
$$ plain form
13129 41215 52011 23024 40629 25103 55691 31219 16535 25499 13087 49238 110346 90747
13117 90747 70468 85564 77270 70940 82197 130135 137773 136630 117232 75537 30458 47464
13105 47464 85264 49595 45456 38729 35797 -17819 -12002 47247 127757 153529 114471 30604
13093 30604 14589 46632 31799 43720 27171 31123 52684 53979 33153 15149 21875 51127
13081 51127 65482 47912 77927 91581 56256 36215 14651 16136 19947 16830 50392 52441
13069 52441 25163 30810 37129 57058 122881 138303 94496 79304 44386 -11128 -25729 -1012
13057 -1012 -950 20162 -16686 47394 32144 14300 23776 54947 65830 76026 189594 240098
13045 240098 254522 324081 433976 559140 721104 781202 716916 549501 398583 305221
13035C05221n2580n1123K2952k636J767p148p9364n2032K6484M3601L1780M8799
13023B35721M8595L0524O6206k7717l2520p1631j07263k6381l0717l0350J40N8052
13011A12659M4628l199j5945K5140O914K132R883j9267K2738K8630K356j7684
12999A98985J269j4473o2423N9415M5687l8409J2551L4693L1000O70k347M4816
12987C11434M6654k9319n0552j351M3271O373K7637k0622J2302M3515j9819o1496
12975C08027o9291M3478j0041K479N4073O6069k9965j0849P7444R8285R875P8220
12963F17804J55133K19614L35297M96142Q20205N73479k53029o93488p11256m05791
12953A154110j93351j09586l6609J978o462J198K7013L0142m520J8039j7655n3876
$$ plain form
13035 305221 252641 201518 224470 221834 223601 216453 137089 85057 111541 155142 186922 235721
13023 235721 284316 314840 381046 353329 320809 249178 141915 115534 84817 54467 54607 112659
13011 112659 157287 154088 138143 163283 170197 172329 182212 162945 185683 214313 216669 198985
12999 198985 200254 185781 123358 182773 228460 190051 202602 237295 268295 268965 266618 311434
12987 311434 358088 328769 278217 276866 320137 326510 354147 333525 345827 389342 369523 308027
12975 308027 238736 282214 272173 274652 328725 394794 364829 353980 431424 529709 539584 617804
12963 617804 772937 992551 1327848 1823990 2644195 3217674 2964645 2271157 1559901 1154110
12953 1154110 960759 851173 814564 816542 810080 811278 838291 868433 863913 881952 864297 810421
12941H10421K8832O8949N9994L4058L9928J44403K03439O7580l308M1064M9397
12930A544757J95820K45920K10348J34453J74031J32576J41718J87042K27744
12921C194409L18683L85833N01013N43581O54855R58533J303636J586623R35693
12912A0382859J77509K33643Q73504J939091K789936K881034K957274L518259
12904B5753109M732511O194724Q401787J2543944J9784479L2798213N9182563
12897A69391330J11397026J64810137P2134637p3406142j31592711j20023696
12891A92710581p5370959m1786307k3262146j3982760r113188o044422l786659
12884A9364140k172831j188232j371838j845402j895679j687955j469794j306915
$$ plain form
12941 810421 839253 908202 968196 1002254 1042182 1186585 1390024 1457604 1454296 1495360 1544757
12930 1544757 1740577 1986497 2196845 2331298 2505329 2637905 2779623 2966665 3194409
12921 3194409 3513092 3898925 4399938 4943519 5598374 6556907 7860543 9447166 10382859
12912 10382859 10560368 10794011 11667515 13606606 16396542 19277576 22234850 25753109
12904 25753109 30485620 36680344 45082131 57626075 77410554 110208767 169391330
12897 169391330 280788356 445598493 517733130 444326988 312734277 192710581
12891 192710581 117339622 75553315 52291169 38308409 29195221 23150799 19364140
12884 19364140 17191309 16003077 14631239 12785837 10890158 9202203 7732409 6425494
12876F425494j092106o93386m54512l18816k31646j87267j88398k08494k53367
12867B797502k85549k52319j69832j35387j43410j11582k8487K5862L2551m5077
12857A684272j06739j03211r5586l7539N1965o5938k1319j3345n1305j07260j27580
12846A006415r0833p2207p4172Q727j9247k7038N5663J00260p70j14249j02792
12835F69757k5419N7057o256m7871J063M3195o0720k2332q2703l5825m2041O8745
12823E16650P3590Q551n5615K831m2740O039N1994k6515j23268n5590j039k1081
12811C33807j0408p491k5043K552K3801q917J6561L6403k6367K6004K8558n7219
12799C32241j3481m6709l7918L9228k9231k6081K6863J9027j3511L4923J07607
$$ plain form
12876 6425494 5333388 4640002 4185490 3866674 3635028 3447761 3259363 3050869 2797502
12867 2797502 2511953 2259634 2089802 1954415 1811005 1699423 1670936 1696798 1729349 1684272
12857 1684272 1577533 1474322 1378736 1341197 1393162 1327224 1305905 1292560 1241255 1133995 1006415
12846 1006415 915582 843375 769203 777930 758683 731645 787308 887568 886798 772549 669757
12835 669757 644338 701395 695139 647268 648331 691526 630806 608474 525771 489946 447905 516650
12823 516650 590240 598791 543176 546007 503267 509306 561300 534785 411517 355927 354888 333807
12811 333807 323399 315908 290865 293417 317218 308301 324862 361265 334898 360902 389460 332241
12799 332241 318760 272051 234133 273361 244130 218049 244912 263939 250428 285351 392958
12788C92958O7037J1618l7670m9972l2028P984o988J0388Q353m9973p6312l3369
12776B12026M2796N1765J823j0896n2354l3539j2771p1581m3584N6498m7216k8462
12764F4505L8625K2027l5306l0167K3448N7135M3841k0844k6573J9418k6567K7716
12752A57258J7362l3855k7645M9082K3521l3050m6252n1613K2322L9745K2845
12741A39720L6454o95L2413K5885k630l5622j8410m2246K4141J1423K1648o684
12729A85397J3732p3434m1372k5810Q859L9804p133j6636n420J036J3206l7443
12717E4786N9134N720q692q357j8517J1427J9186o998k5012j1040l2348M6583
12705H5872J1653l5109P058q935j2696m4532L62j423l0073l6651M3556K6221J4303
$$ plain form
12788 392958 459995 471613 433943 383971 351943 359927 352939 363327 371680 321707 245395 212026
12776 212026 254822 306587 308410 297514 245160 211621 198850 127269 83685 140183 92967 64505
12764 64505 103130 125157 89851 59684 83132 140267 184108 163264 136691 156109 129542 157258
12752 157258 174620 140765 113120 162202 185723 152673 106421 54808 77130 116875 139720
12741 139720 176174 175479 207892 233777 231147 195525 177115 134869 159010 170433 192081 185397
12729 185397 199129 125695 84323 58513 67372 107176 100043 83407 77987 79023 92229 54786
12717 54786 113920 119640 110948 102591 84074 95501 114687 107689 82677 71637 39289 85872
12705 85872 97525 62416 69474 60539 47843 3311 3673 2250 -27823 -64474 -20918 5303 19606
12692A9606N4357M2007J8131k0194n0881l3582q743o565N1045j1862L4425j8818
12680F8926K057L964l7536k1811J5978k7499m077k421J1349L401m615K3006R847
12667D0569L5909K5529k8943j4015j7324r004O6723l257k3278r3j1874J4983K8151
12654A04076l0102L059l854J0833M0600l1882N9321K7373k3570n1666j2367j7288
12642G4533j7549k7929M3994K5067k2583M7393J4904q291k0877n2592o605k3726
12630B5739r631J3697l0820j8958M9574Q6225P8302L4672k4174n9128m5739n9206
12618D0553R429L0020K0898K3610m0469m3677m169J3295j6755m690K2457m2031
12606H471K1691K4623j4197m7159q203q019N4707K5031j5650J558M1434L1062
$$ plain form
12692 19606 73963 115970 134101 113907 63026 29444 20701 14136 65181 53319 87744 68926
12680 68926 70983 74947 37411 15600 31578 4079 2 -2419 8930 12331 7716 30722 40569
12667 40569 76478 102007 73064 59049 41725 32721 99444 96187 72909 72816 60942 75925 104076
12654 104076 73974 77033 73179 84012 124612 92730 152051 179424 155854 104188 91821 74533
12642 74533 56984 29055 73049 98116 75533 122926 137830 129539 108662 56070 49465 25739
12630 25739 16108 29805 -1015 -19973 29601 115826 194128 228800 204626 145498 99759 40553
12618 40553 49982 80002 100900 124510 84041 40364 36195 49490 32735 28045 50502 8471
12606 8471 30162 54785 40588 -6571 -14774 -22793 31914 56945 41295 42853 84287 115349
12594A15349N495q4445n2399R125O8534P5141r093o5600m6887l0547l4790K8578
12582b1539L9423L8480N8547k3489o7873P383O204K427p2555k4464M0669k6675
12570d3462J9183L7709J0533J3702m951l9890K0890P0586L1188M9181O875n6807
12558A14737m1763J6190n7424l2472L783l5956k7123Q8799N2921k2717o1149n4990
12546e7164K1635k1402k758Q2382p8L6866K782K9119j0908l4716q9055K4483O1558
12533D2744k199j9634L79J7040J7048j9967m187K6072k0131K2352J4231J975l7469
12520C8254n1182j9116M4081O0125K2589m7075m3403N8095N1103k6922M640l2506
12508E8683o5039L4056M9796J1443j2496l985k7586k6444J4311M323r192n0416
$$ plain form
12594 115349 120844 36399 -16000 -6875 61659 136800 127707 62107 15220 -15327 -50117 -21539
12582 -21539 17884 56364 114911 91422 23549 30932 37136 39563 -32992 -57456 -16787 -43462
12570 -43462 -24279 13430 23963 37665 32714 -7176 13714 84300 115488 164669 171544 114737
12558 114737 72974 89164 31740 -732 3051 -32905 -60028 28771 81692 58975 -2174 -57164
12546 -57164 -35529 -56931 -59689 22693 22615 59481 62263 91382 80474 45758 -43297 -18814 42744
12533 42744 40545 20911 21290 38330 55378 35411 31224 57296 37165 59517 73748 75723 38254
12520 38254 -12928 -32044 12037 72162 94751 47676 4273 62368 113471 86549 91189 58683
12508 58683 -6356 27700 77496 88939 76443 72458 44872 18428 32739 37062 27870 -22546
12496b2546k301k3531M2226L3297m0159p6489K0275N1978M2951p798k9899K8827
12484A6831K2893k7113k7744K3955r475L703L4799k8274N5281L4429l1589l3302
12472C4394k8919M230j3156P268j207k8147O2142L128J3071l5255j01731L8556
12460d5626R5156J8076n4974j16j5653L757M9376N4925j6636J7731k3401p5634
12448F981k0844k1700n640L5617k1348M916O6321Q304j1232O0518K7476j6422
12436A12947N3532m769l1823J0275K3888J5250L2254N5218R7072R5608J39449
12425E98901K78508N30983P77575M53085k64917n40623o42109m79860k46117j48835
12415C16591q6839q7816o1554m442j9030k7352k1177k4678N1773K5722k1319N547
$$ plain form
12496 -22546 -24847 -48378 -6152 27145 -13014 -89503 -69228 -17250 25701 17903 -11996 16831
12484 16831 39724 12611 -15133 8822 -653 3050 37849 9575 64856 99285 67696 34394
12472 34394 5475 9705 -3451 3817 2610 -25537 36605 39733 52804 17549 -84182 -45626
12460 -45626 49530 67606 12632 12516 -3137 620 49996 104921 88285 106016 82615 6981
12448 6981 -13863 -35563 -41203 -5586 -26934 -22018 44303 52607 41375 101893 129369 112947
12436 112947 166479 161710 129887 140162 164050 179300 211554 266772 363844 459452 598901
12425 598901 877409 1408392 2185967 2639052 2374135 1833512 1191403 711543 465426 316591
12415 316591 229752 141936 80382 75940 56910 29558 8381 -16297 35476 61198 39879 45426
12403D5426J5792q803K2838K1350j2816J5556J2618l6204m4921k699j4828o3935
12391e0626j4967L8628L8746M0043R03j1116K8569j1318R772L1613q451l1949
12379E9847j2954j5536J713o372l721J8579L7423J3965l4696k6483j433Q533m0133
12366a268k6578m616J0778K1340k8441O648L7989l8714k7057k315J8025J1366
12354b2843L2400J086M00o4475M4184O1781l5558J2563J2977L6120l9515N375
12342D4495k9614m2620J5489J0277R72k5460m399j5532K7396k5500m9258p082
12330a00836N170l124K9179N8541J3944k5549L2143L5607l2072m1793q713J2837
12318b4666J4484j3419J581M2685K308j9123J3136N0307j9510m4599j4203K0218
$$ plain form
12403 45426 61218 52415 75253 96603 83787 99343 111961 75757 30836 28137 13309 -50626
12391 -50626 -65593 -26965 11781 51824 52727 41611 70180 58862 68634 100247 91796 59847
12379 59847 46893 31357 33070 26698 22977 41556 78979 92944 58248 31765 30332 38865 -1268
12366 -1268 -27846 -32462 -21684 -344 -28785 -22137 15852 -22862 -49919 -52234 -34209 -22843
12354 -22843 9557 10643 11043 -53432 -9248 52533 16975 29538 42515 78635 39120 44495
12342 44495 14881 -27739 -12250 -1973 -1001 -26461 -30860 -46392 -18996 -44496 -93754 -100836
12330 -100836 -95666 -98790 -69611 -11070 2874 -22675 9468 45075 13003 -28790 -37503 -24666
12318 -24666 -10182 -23601 -22020 20665 22973 3850 16986 67293 47783 3184 -11019 9199
12306I199k562r033M8651Q736l487l5297n3822N606J3408j0661L5452J3436k5613
12293e987q797L2462L1923R035R341K8563l7513r1681J3012L4322O458q320Q743
12280B1561K5306N5324L3513K5219n9636p1859K9052J8657n4418p002J1219k5861
12268A075o9546K2249L7539K8976l1488k1812k1436n4688J1432L772J0231J3605
12256g0091M265J3996L3059N2820l2381j1032l3562J7271L2679j7683m506N3670
12244C8505n7846m0773L1389m25J4833o226k7111K1631l4697n2153R300K5869
12232g7704k1029l4424K1209N6652K6657m603j0962m4866k4195K6763Q0439K3148
12220A7085K8903l5999m0333j064L269j8911N5900K2405j714k5770j5801m6399
$$ plain form
12306 9199 6637 -2396 46255 54991 51504 16207 -37615 -32009 -18601 -29262 6190 19626 -5987
12293 -5987 -14784 17678 49601 58636 67977 96540 59027 -32654 -19642 14680 21138 12818 21561
12280 21561 46867 102191 135704 160923 101287 29428 58480 77137 22719 15717 26936 1075
12268 1075 -68471 -46222 -8683 20293 -11195 -33007 -54443 -109131 -97699 -93927 -83696 -70091
12256 -70091 -65826 -51830 -18771 34049 1668 -9364 -42926 -25655 7024 -10659 -15165 38505
12244 38505 -19341 -60114 -28725 -29150 -14317 -20543 -47654 -26023 -60720 -112873 -103573 -77704
12232 -77704 -98733 -133157 -111948 -55296 -28639 -33242 -44204 -89070 -113265 -86502 -6063 17085
12220 17085 45988 9989 -30344 -31408 -28139 -47050 8850 31255 29541 3771 -12030 -58429
12208e8429O572N5787K5186K366o4996j1950N7976j1879k6374M5072j5511p320
12196c500k2115J941J0388k0985p079j5676k4458k1285l882N1691L2816J7911
12184d233O8724q751m2827j1327j7954M231m9467k2825M5612O9187K414l5759
12172b975J3248L6887k9988q1321J104P5282O3937J5593l2419n7987j3874P766
12160d747m1055J8655k0937L1662K5514J1512m181K6492m0807p014j2515L4191
12148A6770j6452J1140j2800L6111p231m8643l289o720k4255K9719K9745j3998
12136i903q739K3037J025j0407j1174J5733J714N1248l6510l2194l2915M2882
12124f203M2004K0922l1899j9633K599o119j0711k2739k107j8721K582O257j3571
$$ plain form
12208 -58429 -51857 3930 29116 31482 -33514 -45464 12512 633 -25741 19331 3820 -3500
12196 -3500 -25615 -23674 -13286 -34271 -41350 -57026 -81484 -102769 -106651 -54960 -22144 -4233
12184 -4233 64491 55740 12913 1586 -16368 -12137 -61604 -84429 -38817 30370 32784 -2975
12172 -2975 10273 47160 17172 -64149 -63045 12237 76174 91767 59348 1361 -12513 -4747
12160 -4747 -45802 -27147 -48084 -16422 9092 20604 16423 42915 2108 -4906 -17421 16770
12148 16770 318 11458 -1342 34769 27538 -21105 -24394 -31114 -55369 -25650 4095 -9903
12136 -9903 -18642 4395 5420 -4987 -16161 -428 1286 52534 16024 -16170 -49085 -6203
12124 -6203 35801 56723 24824 5191 7790 1671 -9040 -31779 -33886 -52607 -50025 -43768 -57339
12111e7339j3834M5141j5287m8085M4690R421L389M0351r063j4096N52j5888j5506
12098d5554K9289J8444J7797p521n3194m7509N2376N8245n0550R014L7217K2795
12086D0849m5728j534K3254M2198k2286q1082o2411J8515L4119K7931R9Q09L0156
12073D889j1599O457j3957J879K1722j251l5103K6474m535r455J760j4908J2240
12060a5387n453R863l4966k0999K1704N0261M1443j6309p592k1598k9540K7990
12048e83j7340N336l6987k1718J0769J5955K3701J1498L4701j8826J8738L1397
12036E6641m5979n5472m8389L4387L9739K0698M1973M6091l7640l6722j0054L3225
12024C8498r932j0157j3142J2657j4745k992j5160k3729j0552J775P778O0418
$$ plain form
12111 -57339 -71173 -26032 -41319 -89404 -44714 -35293 -31904 8447 -616 -14712 -14160 -30048 -45554
12098 -45554 -16265 2179 19976 12455 -40739 -88248 -35872 22373 -28177 -19163 18054 40849
12086 40849 -4879 -6413 16841 59039 36753 -44329 -106740 -88225 -54106 -26175 -26076 -25267 4889
12073 4889 -6710 -253 -14210 -12331 9391 8140 -26963 -489 -5024 -14479 -12719 -27627 -15387
12060 -15387 -20840 -10977 -45943 -66942 -45238 5023 46466 30157 22565 967 -28573 -583
12048 -583 -17923 -12587 -49574 -71292 -60523 -44568 -20867 -9369 25332 6506 25244 56641
12036 56641 10662 -44810 -93199 -58812 -19073 1625 43598 89689 52049 15327 5273 38498
12024 38498 28566 18409 5267 17924 3179 187 -14973 -38702 -49254 -47479 -39701 20717
12012B0717N2189K4437n7790K0484J5534j4991l895p212K0150j2356o437l6636
12000A4194m3067k6425J1659Q223J5108J0349J0893k4920J4053N1975M4748j5936
11988G0854m3047k9483L960J2882O776M940l3583m4451j223r536k7054k0164J4353
11975i4776K9099K1632p731M8066Q729R783J1876L0080l5478k5775j4038J2357
11963f176N495K7313j4218J345l0584j1587j1910j0432J2956j9603J4560J2343
11951c0498J9060r652n5409p273L5584M1324N1110n6884k7109J7890p534L6582
11939G191L0438l3336l6507L8660l1421k2657O3996L9901j7762k2738j5257m2405
11927d1897R319M2458k8879l5534j1141J5277K2923j1037j6318J2449O4247P216
$$ plain form
12012 20717 72906 97343 39553 60037 75571 60580 56685 49473 69623 57267 50830 14194
12000 14194 -28873 -55298 -43639 -35416 -20308 -9959 934 -23986 -9933 42042 86790 70854
11988 70854 27807 -1676 2284 15166 21942 26882 -6701 -51152 -52375 -61911 -88965 -109129 -94776
11975 -94776 -65677 -44045 -51776 -3710 5019 14802 26678 56758 21280 -4495 -18533 -6176
11963 -6176 -681 26632 12414 13759 -16825 -28412 -40322 -50754 -37798 -57401 -42841 -30498
11951 -30498 -11438 -21090 -76499 -83772 -48188 -6864 44246 -12638 -39747 -21857 -29391 7191
11939 7191 37629 4293 -32214 6446 -24975 -47632 16364 56265 38503 15765 508 -41897
11927 -41897 -32578 9880 -18999 -54533 -65674 -50397 -27474 -38511 -54829 -42380 21867 29083
11915B9083l4148L9003O391J4210k048m8445n978k2595J3651K0225j4570l4893
11903d0114L1180Q273k4558O1095M1322O924m0414j0441k0276N750J3633O045
11891C8419n3551K5281L5365m2824L059L0269M344l9338k1173k6679k492m0669
11879h9989k5422N1566M2399R556j1726o132k6247k8125K3154M697k837o615N8710
11866g011J3563K0953j4851L848k7391p3376j2630J6850j094J8099L8123M1659
11854A6742O3159N9850l0038l7331k952k6135l8632m4429k9611K6721M230l7182
11842g5608O9319P1640p998o040R325k5532k8827M890L2698j9338j3829J7003
11830B7703j626L6071M9170k346m4238k3828L2625P062j9849k5918J1090j2404
$$ plain form
11915 29083 -5065 33938 40329 54539 52491 4046 -1932 -24527 -10876 9349 -5221 -40114
11903 -40114 -8934 -661 -25219 35876 77198 84122 43708 33267 12991 18741 32374 38419
11891 38419 -15132 10149 45514 2690 5749 36018 40362 1024 -20149 -46828 -49320 -89989
11879 -89989 -115411 -63845 -21446 -11890 -23616 -29748 -55995 -84120 -60966 -56269 -59106 -65721 -7011
11866 -7011 6552 27505 12654 16502 -10889 -84265 -96895 -80045 -81139 -63040 -24917 16742
11854 16742 79901 139751 109713 72382 69430 43295 4663 -39766 -69377 -42656 -38426 -75608
11842 -75608 -6289 65351 57353 51313 60638 35106 6279 11169 43867 24529 10700 27703
11830 27703 26077 62148 111318 108972 64734 40906 73531 80593 60744 34826 45916 33512
11818C3512K6586n808J0875L2607K2972o8064o6527n8254j0069O3004M0845k8309
11806f630o7468k0968M3108L3496K519K1922J7520j8854j1042M131L876q846k0019
11793b7255k9491K1108j4416J4260M3283j5701m6013L9288P2235q075l7854k2684
11781a1315J5437j159P7301J0038o0025L003J8059k178J0146l7098o8821l8748
11769h5360L9863J3501K4608j1745R318N220n2836J121O7062K4584k6043k7757
11757a8464r899J3301N338M6858L6813R154k6127K3595m6516j2661J2863P552
11745D1807J8034Q998J9793j5153j9534K276p1467k639L7086N737K7662r02q8599
11732c6901J7802N3041Q692k0763k4542n8638M0452K6213K7002J8026j0166j8579
$$ plain form
11818 33512 60098 54290 65165 97772 120744 52680 -13847 -72101 -82170 -19166 21679 -6630
11806 -6630 -74098 -95066 -51958 -18462 -15943 5979 23499 4645 -6397 -2266 1610 -7236 -27255
11793 -27255 -56746 -35638 -50054 -35794 7489 -8212 -54225 -14937 57298 49223 11369 -11315
11781 -11315 4122 2963 80264 90302 30277 33280 51339 49161 59307 22209 -46612 -85360
11769 -85360 -45497 -31996 -7388 -19133 -9815 -4595 -57431 -56310 10752 35336 9293 -18464
11757 -18464 -28363 -15062 -9724 37134 73947 83101 56974 80569 34053 21392 34255 41807
11745 41807 59841 68839 88632 73479 53945 56221 -15246 -17885 19201 24938 52600 51698 -36901
11732 -36901 -19099 33942 42634 21871 -2671 -61309 -20857 5356 32358 50384 40218 21639
11720B1639N727p006N5518L200j1843J4085L4731j4933l2694l3031p443J8698
11708D6648j225k2819n419k3422Q494O9647m5106m3609L8410J2095P739j450l4997
11695D986j987K1962o693j0604m0131j9371k7670K1538N6938N0589K4209R711
11683H3477n1492r0894R612J3080J1088N2604j0993j5727l972j8236k3332m5993
11671i0778l031N4599o546K0209J8824K0669J3429k3494j5455L067J4345r696
11659c858m6903K909k1146k7284L9927Q7410P4044n188o6950l6677k4190j0880
11647c8786R456N290o559r8825k8210l63L7196Q8990Q1168J7385l885l4873j5115
11634A2869J6493p9146o0983K9163M5110L1535M5021j3790l8407j5079J3081n3433
$$ plain form
11720 21639 27366 20360 75878 79078 67235 81320 116051 101118 68424 35393 27950 46648
11708 46648 45423 22604 17185 -6237 2257 71904 26798 -16811 21599 33694 41433 39983 4986
11695 4986 2999 24961 18268 7664 -32467 -51838 -79508 -57970 -1032 49557 73766 83477
11683 83477 31985 -58909 -49297 -36217 -25129 27475 16482 755 -3217 -21453 -44785 -90778
11671 -90778 -93809 -39210 -45756 -25547 -6723 13946 27375 3881 -11574 -8507 5838 -3858
11659 -3858 -50761 -47852 -68998 -96282 -56355 31055 105099 99911 32961 -3716 -27906 -38786
11647 -38786 -29330 -24040 -30599 -129424 -157634 -157997 -120801 -31811 49357 66742 62857 27984 12869
11634 12869 29362 -49784 -110767 -81604 -36494 -4959 40062 26272 -12135 -27214 -14133 -67566
11622f7566J0345J5367N0451J885j2603q764j3600K8623n7178k8741J7986J166
11610f2629M0716K9993J016L8141L7607O697r195j4043J3204l3165j9248Q915
11598C8009j0942k9538J4464M0897J3548k1746l9631K6507J7615M035j6408K0758
11586E7568J572l9229q571Q484l2038J4500J9201k1946Q498l777J557m0667r553
11573d4401L2271K2000k0686k2299j6345l1738l0482M0486N8571J01829M4382
11562A33588q854n1809j0381n4988k7767J3957j2020M008K5281j938L7241N206
11550E1524K9694l851j2373m0170k167k3296n283K8815Q803o7681N5596J7541
11538C7152j8886j5925N417j1774j2683K157J0885j1839j9386J3774J0879j9959
$$ plain form
11622 -67566 -57221 -41854 8597 10482 -2121 -10885 -24485 4138 -53040 -81781 -63795 -62629
11610 -62629 -21913 8080 9096 47237 84844 91541 82346 68303 81507 48342 29094 38009
11598 38009 27067 -2471 11993 52890 66438 44692 5061 31568 49183 53218 36810 57568
11586 57568 59140 19911 11340 19824 -12214 2286 21487 -459 8039 4262 5819 -34848 -44401
11573 -44401 -12130 9870 -10816 -33115 -49460 -81198 -111680 -71194 -12623 89206 133588
11562 133588 124734 72925 62544 7556 -20211 -6254 -18274 -14266 11015 9077 46318 51524
11550 51524 81218 77367 64994 24824 22657 -639 -5922 22893 31696 -35985 19611 37152
11538 37152 18266 2341 7758 -4016 -16699 -14542 -3657 -15496 -34882 -21108 -10229 -30188
11526c0188M867J2562k5224n973o925J8753j031l1800K5375K4651j9618k1573
11514e6124k7843J2375M4528K1224j2311j8870M5408J4487q212L486J5831N626
11502C9605p1041m1708j0552R612K6098P1283K1800k543o9846n5060q572N1191
11490c9733N1221N0914K1394p2270r5018m983L2331K2395P583J5101Q580K4620
11478B2135k9370j1228o7073l1661M3063n83m8967M1191O4607Q772p5054O71N8466
11465b5031l400j2572J3446k028N2020q378K570p420o007n0595K0446N878M2659
11452B1588k5365m465n385m8715j1756L7758M0879J2974k8645n2721n303M7999
11440b1157P6927N983m4580m794J2124L6577R389R133l264m0329n363L4148m610
$$ plain form
11526 -30188 -25321 -12759 -37983 -43956 -50881 -32128 -33159 -64959 -39584 -14933 -34551 -56124
11514 -56124 -83967 -71592 -27064 -5840 -18151 -37021 8387 22874 14662 18148 33979 39605
11502 39605 -31436 -73144 -83696 -74084 -47986 23297 45097 42554 -27292 -82352 -90924 -39733
11490 -39733 11488 62402 83796 11526 -83492 -88475 -56144 -33749 -26166 -11065 -2485 22135
11478 22135 -7235 -18463 -85536 -117197 -74134 -74717 -123684 -82493 -17886 -9114 -84168 -83497 -25031
11465 -25031 -28431 -41003 -27557 -29585 22435 14057 16627 9207 3200 -47395 -26949 -21071 21588
11452 21588 -3777 -8242 -13627 -62342 -74098 -36340 4539 17513 -11132 -63853 -69156 -21157
11440 -21157 55770 61753 17173 12379 24503 61080 70469 79602 76338 36009 30646 64794 60184
11427F0184k0106n0037m2390j0288N0394L5751j3598n1592k0772K2728J2804K9413
11415B491q070n5892j1726K995l291J6479j4972k3449L6682K8430M656o8678l3007
11402a27352K1497L2157K5222m670m0701k8410K6612k0990j7687P3830K4428K529
11390c3535k2894J5830P0363K1138k1573k1614j3056J8803J8725j42m034m3861
11378a5850l5578j7357R932O2098L7929k7984P57R077O195K2259J5691p002q10
11365E9357m02j795m7512M8597M021R43K0348k1407n5761o841L7015J444k1598
11352A6409j1851k9809j7439K5655M2451J7729j3600k4561q116l989k0107P802
11340a9426K3584K9834m0424j4218J0003J7164M5451r83o7908n1484O4726L4811
$$ plain form
11427 60184 40078 -9959 -52349 -62637 -12243 23508 9910 -41682 -62454 -39726 -26922 2491
11415 2491 -5579 -61471 -73197 -70202 -73493 -57014 -71986 -95435 -58753 -30323 -25667 -94345 -127352
11402 -127352 -105855 -73698 -48476 -53146 -93847 -122257 -95645 -116635 -134322 -60492 -36064 -33535
11390 -33535 -56429 -40599 29764 50902 29329 7715 -5341 13462 32187 32045 28011 -15850
11378 -15850 -51428 -68785 -58853 3245 41174 13190 13947 23024 29219 51478 67169 60167 59357
11365 59357 58955 57160 9648 58245 62266 63209 83557 62150 6389 -452 36563 38007 16409
11352 16409 4558 -25251 -42690 -17035 25416 43145 29545 4984 -3132 -7121 -27228 -19426
11340 -19426 4158 33992 -6432 -20650 -10647 6517 51968 50985 -16923 -68407 -3681 31130
11328C1130K211J4048p217k8007m6823K2771K0998L2114p330l6467O310k664P545
11315H619L1754K0810m7044n6119j9971l951L6232K4191J2461N910l0075j5192
11303c2375N696L392J1916k4965j6435M2563K6316l4036J296J3213n4636m278
11291f2333J6396M9907j7433p3560J2822N2062K0971k0899R097l2242k9327K0782
11279e3757J7237N0955J6412k2328K1894m0658j0941k2171j9394L3206P8134M0259
11267H8848Q392k5120q8180q859K5683l4639j6550N7442L2354M5555k6463j0980
11255D7483P084k7025l1795J3631p724J5991M9037J3999K3916n0040n3523j8505
11243a7471j195J9025K7350j4563J399K2828K8320M2796O485l6324l1153J4316
$$ plain form
11328 31130 33341 47389 40172 12165 -34658 -11887 9111 41225 33895 -2572 3738 1074 8619
11315 8619 40373 61183 14139 -41980 -61951 -65902 -29670 -5479 6982 12892 -17183 -32375
11303 -32375 -26679 -23287 -11371 -36336 -52771 -10208 16108 -17928 -16632 -3419 -58055 -62333
11291 -62333 -45937 3970 -13463 -87023 -74201 -22139 -1168 -22067 -12970 -45212 -74539 -53757
11279 -53757 -36520 14435 30847 8519 30413 -10245 -21186 -43357 -62751 -29545 48589 88848
11267 88848 97240 72120 -16060 -24919 764 -33875 -50425 7017 39371 84926 58463 47483
11255 47483 54567 27542 -4253 9378 1654 17645 66682 80681 104597 54557 1034 -17471
11243 -17471 -18666 359 27709 13146 14545 37373 65693 108489 114974 78650 47497 61813
11231F1813m1380n5488j6359J1873L8197m820L2808J4633m4160n220k0995o3341
11219i2439L3604O957K2050J9927n226k0265l0014K3291J1644j907J3722O235
11207a2421R015m4182J1055l3601q549o550P3154M9136J4386K37m5531k2539L0731
11194A4341L2880M1512q691j148l2044j4267k2690k5683r069r548J2812M2502
11182B0907K7169m1245l3433l9237K6151N5847j4209q2923k4677L9929K7249J8827
11170a9645j5317k6661J3250K4193K1152l414l6452O788j3499L2294O3109K2135
11158F7933o6559n8360p660n5259N325l7780M1406L3404k501j918j2620L3997
11146f0592J9562O268N426L5829J1292P674m143K1556m0576k2009R436M8831J9490
$$ plain form
11231 61813 20433 -35055 -51414 -39541 -1344 -6164 26644 41277 -2883 -8103 -29098 -92439
11219 -92439 -58835 -51878 -29828 -9901 -15127 -35392 -65406 -42115 -30471 -32378 -18656 -12421
11207 -12421 -3406 -47588 -36533 -70134 -78683 -85233 -12079 37057 51443 51680 6149 -16390 14341
11194 14341 47221 88733 80042 78894 46850 32583 9893 -15790 -24859 -34407 -21595 20907
11182 20907 48076 6831 -26602 -65839 -39688 16159 1950 -80973 -105650 -65721 -38472 -19645
11170 -19645 -34962 -61623 -48373 -24180 -3028 -6442 -42894 -36106 -49605 -17311 45798 67933
11158 67933 1374 -56986 -64646 -119905 -114580 -152360 -110954 -77550 -80051 -81969 -94589 -60592
11146 -60592 -41030 -34762 -29336 6493 17785 25459 21316 42872 2296 -19713 -10277 38554 58044
11133E8044m3196k6315l9092n5091k7659J9512j7617r198J8878O2677K3671k9171
11121f4557J576M3791j791J237p536J737J8795L4536j2732j9120o006M4372p605
11108B6697j3098J7605K4672l6527k6678J7498K5651j8479k6887k6880l2265J2012
11096e6679J4244j6158K6165R2n743l63j8956O9567J7813j2075K1726j4228l8357
11083a2952j4576M0676K9607j6593Q718k7859o1635P700M1278L1186M266l5555
11071e739k3212j9660j1863N088K7854K7681M1178J9241l1418l8369k808j1399
11059b3426L2629o647j1326j3068R190J239j1610K5863P7401J1665n0497m4251
11047b838Q259j2200j4206o663M762L4164o957N6773K8022l0474j1556K3096m7321
$$ plain form
11133 58044 14848 -11467 -50559 -105650 -133309 -113797 -131414 -140612 -121734 -59057 -35386 -64557
11121 -64557 -62981 -19190 -20981 -19744 -27280 -25543 -6748 27788 15056 -4064 -10070 34302 26697
11108 26697 13599 31204 55876 19349 -7329 10169 35820 17341 -9546 -36426 -68691 -56679
11096 -56679 -42435 -58593 -32428 -32336 -38079 -38442 -57398 12169 29982 17907 39633 25405 -12952
11083 -12952 -27528 13148 42755 26162 34880 7021 -54614 -46914 -5636 25550 29816 -5739
11071 -5739 -28951 -48611 -60474 -55386 -27532 149 41327 60568 29150 -9219 -12027 -23426
11059 -23426 9203 2556 -8770 -21838 -12648 -11409 -23019 2844 80245 91910 41413 -2838
11047 -2838 5421 -6779 -20985 -27648 -22886 11278 4321 61094 89116 58642 47086 70182 22861
11034B2861l330L5925l6978l7349m0943j8991l8479J6200N2987K8164J7425J7732
11022A5224k2578l1725M4848L1774k9576l6455J5196L8286j1557n3245n6075J4113
11010h1770K4840J6297K846N1887M769j1120m895j8668k8375l705J2183K6929
10998h782M5285J1343l9797o5329M0084K2243J4252L2816L6161k1470m1568j1896
10986A3342L005L6991o001m6491r350J8312N8334L8802m5677o4072K6601M8272
10974G2068q918n7632q1939n1501k068j6941N0784O4251O9894K9275j3643J9120
10962G2750r887k0202l1607r970j3834J9374q24o005j2891J4324K3516L7192m532
10949E7404p4273k7865j0137N2733K5554K3653k4387k7084J2691k5794k4244J7040
$$ plain form
11034 22861 19531 55456 18478 -18871 -59814 -78805 -117284 -101084 -48097 -19933 -2508 15224
11022 15224 -7354 -39079 5769 37543 7967 -28488 -13292 24994 13437 -39808 -95883 -81770
11010 -81770 -56930 -40633 -37787 14100 18869 7749 2854 -15814 -44189 -47894 -35711 -8782
10998 -8782 36503 47846 8049 -57280 -17196 5047 19299 52115 88276 66806 25238 13342
10986 13342 16347 53338 47337 846 -8504 9808 68142 106944 61267 -2805 23796 72068
10974 72068 63150 5518 -76421 -127922 -129990 -146931 -96147 -31896 37998 67273 53630 72750
10962 72750 62863 42661 11054 1084 -12750 6624 5800 -205 -13096 1228 24744 61936 57404
10949 57404 -16869 -44734 -54871 -2138 23416 47069 22682 -4402 8289 -17505 -41749 -24709
10937b4709k9588M6171r53l0924k5977K1869L4670j0368J1686L0703m8105l2255
10925e7780L5091L0046K3993l2002l5776J661j067J5339k599J01K776M3486k2025
10912A244n7938J3010K6694L2399K6316N2876L3316n4087l1393j8045o681k4338
10900f627j1264Q125n633l0070m8950J136N3778K6196n5622k3898M3623K7281
10888b1925l675l1353K7551K4624l3289j8092L0199J9431L6822n0775j2867j5249
10876d8598j5673J7542o294k6707L6403P425K4958l1735L2712J4562J5968p392
10864A3171K0939J3834j1214n4648j7137j7886k7624j4708k3885k7526j4840O4755
10852i6769R7240M6883J6871r805m5184o854o8109n8928N1981L7424J5774K851
$$ plain form
10937 -24709 -54297 -8126 -9079 -40003 -65980 -44111 -9441 -19809 -8123 22580 -25525 -57780
10925 -57780 -22689 7357 31350 -652 -36428 -34767 -35834 -20495 -23094 -22993 -20217 23269 1244
10912 1244 -56694 -43684 -16990 15409 41725 94601 127917 73830 42437 24392 17711 -6627
10900 -6627 -17891 -9766 -15399 -45469 -94419 -93283 -39505 -13309 -68931 -92829 -49206 -21925
10888 -21925 -25600 -56953 -29402 -4778 -38067 -56159 -25960 -6529 30293 -20482 -33349 -48598
10876 -48598 -64271 -46729 -53023 -79730 -43327 -35902 -10944 -42679 -9967 4595 20563 13171
10864 13171 34110 47944 36730 -17918 -35055 -52941 -80565 -95273 -119158 -146684 -161524 -96769
10852 -96769 471 47354 64225 54420 9236 2382 -65727 -124655 -72674 -35250 -19476 -16625
10840a6625j7435J377J2945k6581k6604R174M394k816N4803j1606j1056q557J8423
10827b0164L6859k5880l441k5619K8189O5523K2519j5447k512K564l7872m9398
10815b4679p0426m1725P3617P1398N1242j5290n5753l7521L5627K4888j5991k7478
10803c2091j295K3064r483q073N164J933j0410j6643N2526O0779q640j3512j8981
10790B4338o49l5082J9059J1868K470n309K5195M1690J1283J9434n5262o384j9101
10777C3550j3485j6520l9722L2181M9967N280l4829l9694j1985N4427J5155o7837
10765c3512r611j6821o4462j1270Q6440N6338K6432j6935P185j242o7079K8945
10753a5592Q534K0960o025l7664r410L2498L5112p705K2778q889j3886J2993o495
$$ plain form
10840 -16625 -34060 -32683 -19738 -46319 -72923 -63749 -59355 -62171 -7368 -18974 -30030 -38587 -20164
10827 -20164 16695 -9185 -12626 -38245 -10056 55467 77986 62539 60027 62591 24719 -24679
10815 -24679 -95105 -136830 -63213 8185 59427 44137 -11616 -49137 -13510 11378 -4613 -32091
10803 -32091 -33386 -10322 -19805 -27878 -22714 -20781 -31191 -47834 4692 65471 56831 43319 24338
10790 24338 23689 -11393 7666 19534 22004 16695 41890 83580 94863 114297 59035 52651 33550
10777 33550 20065 3545 -36177 -3996 45971 51251 16422 -23272 -35257 19170 34325 -33512
10765 -33512 -43123 -59944 -124406 -135676 -49236 7102 33534 16599 23784 22542 -44537 -15592
10753 -15592 -7058 13902 7877 -29787 -39197 -6699 28413 20708 43486 34597 20711 33704 27209
10740B7209k9301M2703J083j3191l990j6640l1549j2825K850K3114n0983Q29P526
10727e3165j9320K1874p418O6407K0560K5873j241j8880k9266o5862O7280M880
10715A1722K2917o3202n0866J3292J7139M0430R198j7128k2327j7828Q134J63
10703d8356o270j2317J8398L0173L1391M0874k7718R774n752j9158k2756J4739
10691C022K8337J3054j9021k8637L4683L5661M1811j8633n208l8630n9457n635
10679a8653p431J6857K6346m2993l0987m6859J033M7440K2389J7004J3653K6112
10667B3911J4954n5469K3583O0983j9764l4954j3923Q8008L5132l7305l8984J2026
10655E8198J2573k2083p618K6239k3048r895n240k1396l3676K0810p158K5000
$$ plain form
10740 27209 -2092 40611 41694 28503 24513 7873 -23676 -36501 -33651 -10537 -61520 -60691 -53165
10727 -53165 -72485 -50611 -58029 8378 28938 54811 53570 34690 5424 -60438 6842 11722
10715 11722 34639 -28563 -79429 -66137 -48998 -8568 630 -16498 -38825 -56653 -48519 -48356
10703 -48356 -54626 -66943 -48545 -18372 13019 53893 26175 35949 30197 11039 -11717 3022
10691 3022 31359 44413 25392 -3245 31438 67099 108910 90277 85069 46439 -13018 -18653
10679 -18653 -26084 -9227 17119 -25874 -56861 -103720 -102687 -55247 -32858 -15854 -2201 23911
10667 23911 38865 -16604 6979 67962 48198 13244 -679 87329 122461 85156 46172 58198
10655 58198 70771 48688 41070 67309 44261 34366 29126 7730 -25946 -5136 -12294 12706
10643A2706J8175K9365m199n783K123k333M7684L7992p4714k9237k7651m9870
10631d5742j8321N4934M6413k9918M280L5154j3429L1496N8416R22k6451m970
10619I2784J0017j421n0402l4942J9470k6893o5479J7695M0970L2288m4446k6799
10607c7158j0863K8744m250P1985k1839J1000O765p4517n8516M4783M1993M0490
10595C8617J0119j09268k181K2812K197n066L7795K2972l7956l3064K8625P292
10583a7106J3003K5687j5M838j5719J9839M4016n225n008j5626K2869j0838j0580
10570E0135J0668M344M3636R4661L8046P5034J26402K94792N18372P48978O02788
10559B607856j10135n82872p13255m79346k15133j01396j04562q7547m4255M628
$$ plain form
10643 12706 30881 60246 56047 50264 52387 50054 97738 135730 61016 31779 4128 -45742
10631 -45742 -64063 -9129 37284 7366 11646 46800 33371 64867 123283 124205 97754 92784
10619 92784 102801 101380 50978 16036 35506 8613 -56866 -39171 1799 34087 -10359 -37158
10607 -37158 -48021 -19277 -23527 48458 26619 37619 44384 -30133 -88649 -43866 -1873 38617
10595 38617 48736 -60532 -62713 -39901 -37704 -42770 -4975 17997 -19959 -53023 -24398 -17106
10583 -17106 -4103 21584 21569 26407 10688 30527 74543 69318 64310 48684 71553 60715 50135
10570 50135 60803 65147 108783 203444 241490 316524 442926 737718 1256090 2005068 2607856
10559 2607856 2497721 1914849 1201594 722248 507115 405719 301157 213610 169355 173983
10549A73983j3116k4704k566l1789k5085k360J5577O1933p993q2186J020j0975
10537E1739m7655k0419J5810L9746K4956J3498N480K9140j4663r2065n1489n558
10525e1480K2688N1703J2798R824j1269k2832m0852L6195O3088j3004n4918j6819
10513a4878j997K4314k6336P009M0139M7835n93j5108L919m5976j0791j6196M6138
10500C7479P6924j1242j9506j4417L9600J4062m0213O9J1053r9128o0072j1460
10488g6851l8636L5593N8052P8003j7356l7857l9478k954M4128K5169N6983j0195
10476G4601l9042m4359J1286J8640J9367j542l5090k4185M2302Q9743J604m7978
10464F5347k5889o776k2027p2604j540M6425j4080q1642k4636k4370L009P9601
$$ plain form
10549 173983 160867 136163 133597 101808 76723 74363 89940 151873 143880 61694 62714 51739
10537 51739 4084 -16335 -525 39221 64177 77675 83155 112295 97632 5567 -45922 -51480
10525 -51480 -28792 22911 35709 45533 34264 11432 -29420 6775 69863 56859 1941 -14878
10513 -14878 -16875 7439 -18897 -11888 28251 76086 75493 60385 64304 18328 7537 -8659 37479
10500 37479 114403 103161 83655 69238 108838 122900 82687 82756 93809 -5319 -65391 -76851
10488 -76851 -115487 -79894 -21842 56161 38805 948 -38530 -41484 2644 27813 84796 74601
10476 74601 35559 -8800 2486 21126 40493 38951 3861 -20324 21978 111721 113325 65347
10464 65347 39458 32682 10655 -61949 -63489 -17064 -31144 -112786 -137422 -161792 -158783 -79182
10452g9182M0377J8970n968j726M9506L1798r175K271k4994q92j6413K5862K4265
10439E4699l9765k5353o203m4036Q737J8890j1702J0813N7535q417n1426k0513
10427e6741m086J5892j5747m8627L697J5940N5128K7808L8313K2531J4542j061
10415F7589j0257k074n96J542K2685N0835N8726P7271M2416K7407K661j04292
10403B33913n1284j1478M082m972m1903q5637r0832L1508Q1888K1452M537j9337
10391G1937Q718K8597l964l6187l2351q117L513L3421k6974j9420j3594N8504
10379F4083L269j1169K0980L8338J1832K1777l1089K1621R333p434J87m8460m9329
10366D3939J6839J5005k0211l8261j3217M12j583j041J0105o889j1297Q558Q230
$$ plain form
10452 -79182 -38805 -19835 -25803 -27529 21977 53775 44600 46871 21877 20985 4572 30434 54699
10439 54699 14934 -10419 -16622 -60658 -51921 -33031 -44733 -33920 23615 15198 -36228 -56741
10427 -56741 -60827 -44935 -60682 -109309 -105612 -89672 -34544 -6736 31577 54108 68650 67589
10415 67589 57332 55258 54662 56204 78889 129724 188450 265721 308137 335544 338205 233913
10403 233913 182629 171151 175233 170261 128358 42721 -48111 -16603 65285 86737 91274 71937
10391 71937 80655 109252 105288 69101 36750 28633 32146 65567 38593 19173 5579 64083
10379 64083 67352 56183 77163 115501 127333 149110 118021 139642 148975 141541 141728 93268 43939
10366 43939 60778 75783 55572 17311 4094 4506 2923 1882 11987 5098 -6199 2359 10589
10353A0589j4516K6141O3645P0011l2758o3968o1751O216L6071m286k1266L8794
10341E2922M115J8915J2763K5584J9712j3716q3746l6119M297j5936p71J9743
10329G763L7178m4524K096N153m05M6461L6225m7060k247r552o5813j2202M3394
10316c533r044n877J0380J0725P646p481J3102M0567J1006L9901P8500L3616j1007
10303B08501l3360l5053m4839o1326j1904k954K4480O722P561K5009L1994q826
10291A06005K1619K4746M3579J0144r489j403L7530J32182O5383j1220J7096P285
10279D43457q1216o0934r4725p4804m3306m005N5277M5264j719l0000J7602M077
10267A74968N2207P378L0389M9792R2411J48134J81820L38885O60536Q42601M04947
$$ plain form
10353 10589 -3927 22214 85859 155870 123112 59144 -2607 3609 39680 35394 14128 52922
10341 52922 57037 75952 88715 114299 134011 120295 36549 430 4727 -11209 -11980 7763
10329 7763 44941 417 2513 7666 7261 53722 89947 42887 40640 31088 -34725 -46927 -3533
10316 -3533 -12577 -18454 -8074 2651 10297 2816 15918 56485 67491 107392 185892 219508 208501
10303 208501 175141 140088 95249 33923 22019 19065 43545 50267 57828 82837 114831 106005
10291 106005 127624 152370 195949 206093 196604 195201 232731 364913 430296 419076 436172 443457
10279 443457 362241 301307 206582 131778 88472 84467 139744 185008 183289 153289 170891 174968
10267 174968 227175 234553 264942 314734 407145 555279 737099 1075984 1736520 2579121 2984068
10256B984068k56584n76145m52698k06990j65860k57252k99999j69360j1854q9615
10246D97711k9166o5451n512j5392o9904p0761j0885K0123N2877L4331p7523n9413
10234B01035j3568k4851K153J3073P518M192k3178N8227K3836k4891K2454M0471
10222B86471K1063L4942K7666j3454J4986L8850M7757P206k991M0469O1230M3154
10210F07349J1512O663N448K0972L4606K7121L1056m7345j1304O0112L9689l1922
10198G53957j117L0007J37388J67636J88973O5310j7905K3496J81724K43087K03636
10187A976192K15311J52151J23427J46120J97434J25777J85052L06256M40517
10178C868237N25050O13701Q78085J247988J417410Q16943J43166l3300K83219
$$ plain form
10256 2984068 2727484 2151339 1698641 1491651 1325791 1068539 768540 599180 587326 497711
10246 497711 468545 403094 397582 382190 312286 241525 230640 250763 303640 337971 260448 201035
10234 201035 187467 162616 164769 177842 185360 189552 166374 224601 248437 223546 246000 286471
10222 286471 307534 342476 370142 356688 371674 410524 458281 465487 462496 502965 564195 607349
10210 607349 618861 625524 630972 651944 686550 713671 744727 697382 686078 746190 785879 753957
10198 753957 752840 782847 920235 1087871 1276844 1342154 1324249 1347745 1529469 1772556 1976192
10187 1976192 2191503 2343654 2467081 2613201 2810635 2936412 3121464 3427720 3868237
10178 3868237 4393287 5006988 5885073 7133061 8550471 9367414 9510580 9477280 9760499
10169I760499R32221J540743K018249K648543L435894M342066N578770O962593
10161C7219578R284839J3670124K1113933L5082888O3168987J14820823J52251716
10154D46612888N6204174p4270302j26978270j13481359p1991285m0452835k2837298
10147E2805713j3992684r172274n905863l587202j998185j528812j934016k020865
10139A2665812j764313j431178j173988q23662l34859J17016j71928p85842j019359
10130E277699q59584n83515l67930l23624l48618l27008k51157j67496j45989
10121A902778m5693J3560j878k8085o5027q9229r4234r5825p4275j7199n2954
10110A351939p7529m3687l9564n1947l9454p8821p8164o9400k5571N100l3274
$$ plain form
10169 9760499 10692720 12233463 14251712 16900255 20336149 24678215 30256985 37219578
10161 37219578 46504417 60174541 81288474 116371362 179540349 294361172 446612888
10154 446612888 502817062 428546760 301568490 188087131 116095846 75643011 52805713
10147 52805713 38813029 29640755 23734892 20147690 18149505 16620693 14686677 12665812
10139 12665812 10901499 9470321 8296333 7472671 7137812 7254828 7082900 6297058 5277699
10130 5277699 4418115 3834600 3466670 3143046 2794428 2467420 2216263 2048767 1902778
10121 1902778 1857085 1870645 1868767 1840682 1775655 1686426 1592192 1496367 1422092 1404893 1351939
10110 1351939 1274410 1230723 1191159 1139212 1099758 1020937 942773 873373 847802 852902 819628
10099H19628m5509l6851k9865n4642Q326l6634l0573j2543R693j7661j6831J550
10087E58088Q606N63L621J5776R710k187o9691n6482l8148M0276L6055r025J9612
10074E16774n6748q5303k3035k6168q0533m4006K4023O3847K1067J5642K5076
10063C50636m2660l9781L5134m7886k1016N1503K2078K5329K1458k879j2736m5586
10051B93594m8077Q529k0639k1287o6640q747N2728M66M2948L1342j557K562m4525
10038B20697k9170J9627M0718K6467J4611L2853J0094l5512l8377p0658j4233
10027A77117l2743k3558L9767K2661n9249R531l2568j045M5190J8056M231K678
10015A70068K9376J3300j1687K8357j8524l9766K0061L2336J9164p5512o4189
$$ plain form
10099 819628 774119 737268 707403 652761 661087 624453 593880 581337 591030 573369 556538 558088
10087 558088 566694 567257 570878 586654 596364 594177 524486 468004 429856 470132 506187 497162 516774
10074 516774 460026 374723 351688 325520 244987 200981 225004 288851 309918 325560 350636
10063 350636 307976 268195 303329 255443 234427 285930 308008 333337 354795 351916 339180 293594
10051 293594 245517 254046 233407 212120 145480 136733 189461 189927 232875 264217 262660 265222 220697
10038 220697 191527 211154 251872 278339 292950 325803 335897 300385 262008 191350 177117
10027 177117 144374 120816 160583 183244 123995 133526 100958 99913 145103 163159 167390 170068
10015 170068 199444 212744 201057 229414 210890 171124 191185 223521 242685 167173 102984
10004A02984k5990M271l5k1992K9272L1664K165K1074N386J1377k420j927N6467
9991B12296M0651J1823p9862q4299M383L8093J2144j6830L49J0973K7918P997
9979A85636m6884q315K8056K7494k9773O738k8437n4253K3938q117l6743J1925
9967G1265K1087P3140P826j1275K0419m9148m7003l8520o648K7779q502J7269
9955G7689K9044J4193k3274N43m280j6205Q995M123j3772l0213j3146j61N1917
9942H5453M3997l09k3606m8046l3107K8696p3882m7839J5230J8562L6010K3731
9930B4890L1903N6354J5233m2759k1341K6212K1824N6784j3325j9040k6971n6159
9918E3605l2222M2726M3494m0487K633q910j0494j9855J9383L512j7864R215J1075
$$ plain form
10004 102984 76994 81265 81230 59238 88510 120174 122339 143413 148799 160176 157756 155829 212296
9991 212296 252947 264770 184908 100609 104992 143085 155229 138399 138748 149721 177639 185636
9979 185636 138752 130437 158493 185987 156214 162952 134515 80262 104200 96083 59340 71265
9967 71265 92352 165492 173318 162043 182462 133314 86311 47791 41143 68922 60420 77689
9955 77689 106733 120926 97652 98195 93915 77710 86705 90828 77056 46843 33697 33536 85453
9942 85453 129450 129141 105535 57489 24382 53078 -20804 -68643 -53413 -34851 1159 24890
9930 24890 56793 113147 128380 85621 64280 90492 112316 169100 155775 136735 109764 53605
9918 53605 21383 64109 107603 67116 69749 60839 50345 30490 49873 53385 35521 44736 55811
9905E5811n575m859Q897j1268o514O4348L2110l6415k9568L6404Q4867J3520O126
9892B07884j6069o4049m8017m907j0380K2355M7371K7111k7008k419j1613k1931
9880I8328Q917J7116o799j2617k0234k8142q834n464l8012J5134J23443J5297
9868A58133p3402j8243K4837n925L277J6088Q266K2000k9926m577k9973M0404
9856A10959P1005J20491L4327j992M4592J88212K19782J57526k3019k30050k68307
9845D23526j84466p0032m251m6339n2287J2093m5976j2988r169O275j4456n289
9833c359m6214l277L5940L7894Q152m4444m4717n720L5585L38J029L7692O4607
9820G3506K475j7549l5997k610k5067K070O380J3128K7564j0391k7203K3952M6597
$$ plain form
9905 55811 50236 45377 54274 43006 36492 100840 132950 96535 66967 103371 188238 201758 207884
9892 207884 191815 127766 79749 74842 64462 86817 134188 161299 134291 131872 120259 98328
9880 98328 107245 124361 117562 104945 84711 56569 47735 42271 4259 19393 142836 158133
9868 158133 84731 66488 91325 85400 88677 104765 113031 135031 105105 100528 70555 110959
9856 110959 181964 302455 336782 334790 379382 567594 787376 944902 921883 691833 423526
9845 423526 239060 169028 164777 118438 66151 78244 32268 19280 10111 16386 1930 -3359
9833 -3359 -49573 -52850 -16910 20984 29136 -15308 -60025 -65745 -30160 -29822 -28793 8899 73506
9820 73506 75981 58432 22435 19825 -5242 -3172 3208 16336 43900 33509 6306 30258 76855
9807G6855k5907j2980p176K9639R722j5411l10J8300j2510J1863J5730l7262l2336
9794A8217J7555J8810K6510l9421j5717R346J3154k1488K303N5211j3010o6782
9782D688K0355j650J4817J9504Q297l3041l167k848N3553K8328k2238K6451j3461
9769I9588M821m202n514R750K8883m854Q516j0799q839o3266l6486K2910L4739
9756G5247L8000L0080L1982O1712M3063k0624K9164Q5209J04495K03674K95618
9745I77620N84220P74857K64264l40286o75790n27124l26607k35880j45711j14588
9735B34975n7481k1293j7714o5081j0477P801l664K1809L4879p441n5134l8751
9723B2428J7405R9m5597J8144K0497k1270J5710J4886J306m7980n4616n449M6413
$$ plain form
9807 76855 50948 37968 30792 60431 70153 54742 54432 72732 60222 72085 87815 50553 18217
9794 18217 35772 54582 81092 41671 25954 35300 48454 26966 29269 84480 71470 4688
9782 4688 25043 23393 38210 57714 66011 32970 29803 26955 80508 108836 86598 113049 99588
9769 99588 104409 100207 94693 104443 133326 128472 136988 126189 117350 54084 17598 40508 75247
9756 75247 113247 143327 175309 237021 280084 259460 288624 373833 478328 682002 977620
9745 977620 1561840 2336697 2600961 2260675 1584885 1057761 731154 495274 349563 234975
9735 234975 177494 156201 138487 73406 62929 70730 67066 88875 123754 116313 61179 22428
9723 22428 39833 39932 -5665 12479 32976 11706 27416 42302 43608 -4372 -58988 -64437 -18024
9710a8024N5945N780j0578J8236P916r605k4065L9018k3936k2750R514O15L136
9697C1202Q399m4305k4503Q324k1195J444o9844j2020J2135K5248K7020M3604
9685a4491L440l4490M23N6952K6832J0950j706J156k9296p3534j2813J5455p147
9672e8269K1514K4537L7152L8965J1062o97k5100l6813n5662o747K3384n926K7663
9659d937K9227n1527n1859J0107k018J7182Q3080Q543k6842n7296l5627L9244
9647d2723K8831j1241K0191J8871J596J5206L827p045j3956K08j5477L2908K1212
9634E2408l7098m0370J8307K427J0531J5609j8871l3896L86L4157N1228k1813
9622C3005J944P0306J2396k5320l0793N7579M594o9224l1620j1964J2839O1661
$$ plain form
9710 -18024 37921 43701 33123 51359 59275 49670 25605 64623 40687 17937 27451 28066 31202
9697 31202 39601 -4704 -29207 -20883 -42078 -40634 -110478 -122498 -110363 -85115 -58095 -14491
9685 -14491 -11051 -45541 -45118 11834 38666 49616 47910 49066 19770 -53764 -66577 -51122 -58269
9672 -58269 -36755 -12218 24934 63899 74961 74264 49164 12351 -43311 -50058 -26674 -32600 -4937
9659 -4937 24290 -27237 -79096 -68989 -71007 -53825 29255 37798 10956 -46340 -81967 -42723
9647 -42723 -13892 -25133 -4942 13929 15525 30731 34558 27513 13557 13765 -1712 31196 52408
9634 52408 15310 -25060 -6753 -4326 6205 21814 2943 -30953 -30567 3590 54818 33005
9622 33005 34949 105255 117651 92331 61538 119117 123711 54487 22867 10903 23742 85403
9610H5403L9780K8586k6810k7076k3534l1872n0269M472L9892m256j4841m5698
9598b6223O5428j792l1603j3386J0898k733L0208O4820O468j8426r480J334j8715
9585E6798n8649m0562Q369j7257P655Q1555k2457j8649k6466q238J7497M6210
9573B5806k1100r356J3322m8258J486M9432J3724k5419Q809L6196j627J0768o63
9560E3120q406o8527m0613L6385j8085n3240k3588K8516L8037N7458L1128k8254
9548C931j2892o067l7838l9160J4933l0573N3735M9081k7123m306M1140k7071
9536b2210M321L9267J4566M331K3308K5608o951j8370l851J360L7658m6192m9205
9523C640J049Q825l2864J2748p93Q291J8669L7234o0159q1314k0774M0090J7129
$$ plain form
9610 85403 125183 153769 126959 99883 76349 44477 -5792 -1320 38572 34316 19475 -26223
9598 -26223 39205 37413 5810 -7576 3322 589 30797 95617 102085 83659 74179 75513 56798
9585 56798 -1851 -42413 -34044 -51301 -43646 37909 15452 -3197 -29663 -37901 -20404 25806
9573 25806 4706 -4650 8672 -39586 -38100 11332 25056 -363 8446 44642 43015 53783 53120
9560 53120 44714 -23813 -64426 -28041 -46126 -99366 -122954 -94438 -56401 1057 32185 3931
9548 3931 -8961 -15028 -52866 -92026 -77093 -107666 -53931 -4850 -31973 -36279 4861 -22210
9536 -22210 -17889 21378 35944 40275 63583 89191 82240 63870 60019 61379 99037 52845 3640
9523 3640 4689 13514 -19350 -6602 -7395 896 19565 56799 -3360 -84674 -105448 -65358 -48229
9510d8229k4875O756O126K9463L0440k4177j3649J347L1151L3792J855j3660k4162
9497g822k4611j7710j1219n4166P775O7651M309n968J494K1622l3200J2606M9489
9484A0250l5805J4190k8877M7271q794m7544l2223R9413K3583j1720J4968r575
9472C5137R389L509n3382l1660j2898K1463O281L5954M7721K8584r411J234n3105
9459B8816l4444L9761P2969J5093n9623m2966j3159o0539J0922J8360M4023P6853
9447I6066K0966k312m6064j7599P088j1226J5982L4799j5001n8224j4128L0554
9435D0901J6547l884o261J5759j7918n719n6987j1145L7755O017O245j1676k7544
9422a7910J4608R96q168l4277M0770N5606k8377n6842K3880j2380l5708J8065
$$ plain form
9510 -48229 -73104 -66348 -60222 -30759 -319 -24496 -38145 -36798 -5647 28145 30000 16340 -7822
9497 -7822 -32433 -50143 -61362 -115528 -107753 -40102 -35793 -41761 -40267 -18645 -51845 -39239 10250
9484 10250 -25555 -11365 -40242 7029 -1765 -49309 -81532 17881 41464 29744 44712 35137
9472 35137 44526 48035 -5347 -37007 -49905 -28442 -22161 13793 61514 90098 80687 81921 28816
9459 28816 -5628 34133 107102 122195 62572 19606 6447 -54092 -43170 -24810 19213 96066
9447 96066 117032 114720 68656 51057 58145 46919 62901 97700 82699 24475 10347 40901
9435 40901 57448 53564 47303 63062 45144 39425 -17562 -28707 9048 15065 21310 9634 -17910
9422 -17910 -3302 -2306 -10474 -44751 -3981 51625 23248 -33594 -9714 -22094 -57802 -39737
9410c9737K8671n307n1816M9830P7252M0788l0806m5634L0544l9611O266J5240
9398C5680Q20l4558o1152J2234K9821K2914L7829l525K741K6847J0624p1448k4024
9385a5197m233m8069N2605O1685q609k7836J7859K4011k0592l2713m1906K4541
9373a8454L1613K7684L5918J3177l4320o0992m1247J4631m318L4067M937M6362
9361D9058M6125j2904m0453k1963O825M876j3486l6765k8647L295k111K0012O31
9348b5507n3023J0477K9611O530j7750n7472m4597L0459J00771J4350l4669J9855
9336b0965k0914L3650J6003j6896j4107J8736O1580L0774l8992p937n760j1339
9324B3833J5904k9785L7646r688K7085R277l0535l6229J8489l6376J7804K2316
$$ plain form
9410 -39737 -11066 -16373 -68189 -18359 58893 99681 68875 23241 53785 14174 20440 35680
9398 35680 36500 1942 -59210 -46976 -17155 5759 43588 40063 42804 69651 80275 8827 -15197
9385 -15197 -19430 -67499 -14894 46791 38182 10346 28205 52216 31624 -1089 -42995 -18454
9373 -18454 13159 40843 76761 89938 55618 -5374 -46621 -31990 -36308 -2241 2696 49058
9361 49058 95183 82279 41826 19863 26688 31564 18078 -18687 -47334 -44039 -46150 -26138 -25507
9348 -25507 -78530 -68053 -38442 -31912 -49662 -107134 -151731 -121272 -20501 -6151 -40820 -20965
9336 -20965 -41879 -8229 7774 -9122 -23229 -4493 57087 87861 48869 40932 35172 23833
9324 23833 39737 9952 47598 37910 64995 74272 43737 7508 25997 -10379 7425 29741
9312B9741j2986k1770P2383N2320J7417o7948k2791k5654n5192K4978L0666L8759
9300E9923q06K8232l0279n2213K7359p008j2998O947j0344m534k4947j9560K6322
9287a3906K3910m3175k807L6365l8080l0333k7995K8459K9567q371k8865M8027
9275b7204Q2938P641j7279k5092Q349L44l2138R358K6452N314l8746O123o885
9262h25k3524j4085o482O452l1839N283P7073K1245q329j9783l3075J1700J0350
9249e839M5907R732k2816J7733j9960k3710J9849l1938R827J2603k032J2955m4199
9236b1888M3837M9419j1844o3546n565J547k2145J1366P712K8644N14J7971j1103
9223B4919k5809j3791J9828r670K1773P1556K0295k5343l7158j0559J1019M1429
$$ plain form
9312 29741 16755 -5015 67368 119688 137105 69157 46366 20712 -34480 -9502 21164 59923
9300 59923 59117 87349 57070 4857 32216 25208 12210 19157 8813 4279 -20668 -40228 -13906
9287 -13906 10004 -33171 -35978 387 -37693 -68026 -96021 -67562 -37995 -46366 -75231 -27204
9275 -27204 55734 63375 46096 21004 29353 29697 -2441 6917 33369 38683 -63 6060 -825
9262 -825 -24349 -38434 -44916 -38464 -70303 -65020 12053 33298 24969 5186 -27889 -16189 -5839
9249 -5839 40068 49800 26984 44717 24757 1047 20896 -11042 -1215 11388 9356 22311 -21888
9236 -21888 21949 71368 59524 -4022 -9587 -8040 -30185 -18819 -11107 17537 18051 36022 24919
9223 24919 -890 -14681 5147 -4523 17250 88806 109101 83758 46600 36041 47060 88489
9211H8489j9721J0156K3695J0452Q505k4786r302j9941J7209j906m9803j4201
9199A8846j3128J5328M4088m9245l2742J9526L5567J7634K4932K1885j5832o3881
9187B2978l9764m0371N7878K7860K7194L9669j5147m1534K308k859o0026K8543
9175F729j487P19m2555J8075N5682P260n0396q742R670K2281R822K4698K0359
9162G2115j6222L0876j8816J8334k7038r566P6106L9685m4707k1112J1797L8611
9150A50063r754j259J6125M7480J4431j2048J7394j1726J0688J8118k8717J8720
9138B29515L1242m949j1331L8875J9892K6753L4194j6007k9245Q5678M9346L2706
9126D86669M8508M8085O5415J28910R9337J13212J40881K47250L48798L63469
$$ plain form
9211 88489 68768 78924 102619 113071 121576 96790 87488 67547 84756 82850 33047 18846
9199 18846 5718 21046 65134 15889 -16853 2673 38240 55874 80806 102691 86859 22978
9187 22978 -16786 -57157 721 28581 55775 95444 80297 38763 41071 38212 -21814 6729
9175 6729 5242 5961 -36594 -18519 37163 44423 -5973 -14715 -5045 17236 27058 51756 72115
9162 72115 55893 86769 67953 86287 59249 49683 125789 165474 120767 99655 111452 150063
9150 150063 140309 139050 155175 202655 217086 205038 222432 210706 221394 239512 210795 229515
9138 229515 260757 255808 244477 283352 303244 329997 364191 348184 318939 404617 453963 486669
9126 486669 535177 583262 648677 777587 876924 990136 1131017 1378267 1727065 2090534
9116B090534L93918N69299Q92474J282135K077641L564858O382149R284019N413317
9107C1950344l178943p463934p458864n105763l006820j747678j078886o58553
9099B250903m23938l38207j88245j40928j26823j39896j33800p1074p9005j22534
9089D86453q1536r0607k2118J4495j7089J4919m239m5403m8191m0207J6614M018
9077A87109k2687J2639L1243o9536L7988j8909m494l0960K4340l4730j5677J8455
9065A14781m7837k0807L1350J1864K9531O391n6492k2113k7749k1211k1387Q596
9053a5083P8869K1505N0966n741M532k5634k5843o443l110p883o1353o428J4798
9040A3152J3758m0817O383r124R080K8919L6481O8537K5730j0424l3202m4282
$$ plain form
9116 2090534 2484452 3053751 3946225 5228360 7306001 10870859 17253008 26537027 31950344
9107 31950344 28771401 21307467 13848603 8742840 5736020 3988342 2909456 2250903
9099 2250903 1826965 1488758 1300513 1159585 1032762 892866 759066 687992 608987 486453
9089 486453 404917 314310 292192 306687 289598 304517 300278 254875 206684 166477 183091 187109
9077 187109 164422 177061 208304 138768 176756 157847 153353 122393 146733 112003 96326 114781
9065 114781 66944 46137 77487 89351 118882 125273 68781 46668 18919 -2292 -23679 -15083
9053 -15083 63786 85291 136257 130516 135048 109414 83571 77128 74018 66135 4782 -1646 13152
9040 13152 26910 -13907 -7524 -16648 -7568 21351 57832 126369 152099 141675 108473 64191
9028F4191l2270Q883j5275j0603j439l968K4740k227j8603J4857J1274j0818k8356
9015C86N5532M8176l1914m8566j1659j8653R916j941J3405m986j861k2824j2238
9002b7227n323k693K0823K9725J5395R177J2206N89L4074M7986K1568k9833j1457
8989A15010l5665K55q148K595O811l9632o6270J0167K2669l8620K7349O8267n989
8976E8799n1235j8120K5874J0743k081k6876j3658m058L2411K8317K2585P276
8964F9977m1969Q433l975k551M0223m720m8860L0326O221l803n2904j9311J0163
8951a2750m1006J3642M7648M5755k9466k8462j2724J2770N173K3822L1414J9607
8939G5423n146k0272J5596j2521k0621M236J3447o927p275j0602j0498O28k5999
$$ plain form
9028 64191 31921 40804 25529 14926 13487 9519 34259 32032 13429 28286 39560 28742 386
9015 386 55918 104094 72180 23614 11955 -6698 3218 1277 14682 9696 7835 -14989 -27227
9002 -27227 -32550 -35243 -14420 15305 30700 39877 52083 52672 86746 134732 156300 126467 115010
8989 115010 79345 79600 71452 74047 80858 41226 -25044 -14877 7792 -30828 -3479 64788 58799
8976 58799 7564 -10556 15318 26061 23980 -2896 -16554 -20612 11799 40116 62701 69977
8964 69977 28008 36441 32466 29915 70138 65418 16558 46884 53105 49302 -3602 -22913 -12750
8951 -12750 -53756 -40114 7534 53289 23823 -4639 -17363 -4593 580 24402 55816 75423
8939 75423 70277 50005 65601 53080 32459 36695 50142 43215 35940 25338 14840 15468 -10531
8926a0531o2853Q614N078k8832j5322J2789K8451J8895j5623K8074M6742k2113
8914f631K914j9546k1782J4746M8344L3351p531J4694n0146m7653j2721l1989
8902h3950j7449k0506K3868Q0896m05K4794l0857n367n828p35N0272Q768m050
8889A9451j9978J1682k9173L480K4746N5574O5581n9639q6648m0728K3754O2601
8877C0703L8732j7175k6682m3804k177Q172K1635M5468K9579m6164K0581M4524
8865A03392P202l9850l2587p553k383n7732j4029P3516J4709j6918j0407K1290
8853C8650Q979K5189L7241k1907n6394N040K8912P077o711l3560j3103Q7286Q890
8840A15589k4202k4544m5298J8617N1868l7127n9489m3261j7119K9171K3440J9148
$$ plain form
8926 -10531 -73384 -64770 -59692 -88524 -103846 -91057 -62606 -43711 -59334 -31260 15482 -6631
8914 -6631 -3717 -23263 -45045 -30299 18045 51396 43865 58559 8413 -39240 -51961 -83950
8902 -83950 -101399 -121905 -98037 -17141 -17546 7248 -23609 -28976 -34804 -35539 14733 23501 19451
8889 19451 -527 11155 -18018 -14538 10208 65782 131363 71724 -14924 -55652 -31898 30703
8877 30703 69435 52260 25578 -18226 -20403 -12231 9404 54872 84451 38287 58868 103392
8865 103392 110594 70744 38157 30604 28221 -29511 -43540 29976 44685 27767 17360 38650
8853 38650 47629 72818 110059 88152 31758 36798 65710 72787 66076 32516 19413 106699 115589
8840 115589 91387 66843 21545 40162 92030 54903 -4586 -47847 -64966 -35795 -12355 6793
8828F793P535m0923l048M087J6696L0497j2756j8664j3292L5053P223k5490l6666
8815d2955j2266N2931M149l1269l721l9800K5211R4577n8729l1228N854k0175
8803e7421j117J5926l2873m262N6949O0308L6098k9161m3182k3351Q884M4245
8791C1043O425l6315R112K7256J6214l3470n327P529m1295k8187N2847O893P1168
8778H3893l9360l720j5356J1013O70p6125j5121L8343M6374l5853o9686L2670
8766d2258R920j9273J2804N3182M8177K51n9916l03k2506j4295l4477j5905L8674
8753d5925M3731J1765K6907K8632l0388r072k218J5782L954m2412j613L6789K2336
8740E8268j7125l2817O296K4291j3373r331L5065L2747m9559j2541L3209O537
$$ plain form
8828 6793 14328 -26595 -29643 -25556 -8860 21637 8881 -9783 -23075 11978 19201 -6289 -42955
8815 -42955 -55221 -2290 1859 -29410 -33131 -72931 -47720 46857 -11872 -43100 -37246 -57421
8803 -57421 -58538 -42612 -75485 -79747 -22798 37510 73608 44447 1265 -22086 -13202 31043
8791 31043 37468 1153 10265 37521 53735 20265 14938 22467 -18828 -47015 5832 12725 83893
8778 83893 44533 40813 25457 36470 37140 -38985 -54106 -15763 30611 -5242 -74928 -42258
8766 -42258 -32338 -51611 -38807 14375 62552 62803 2887 2584 -19922 -34217 -68694 -84599 -45925
8753 -45925 -2194 9571 36478 65110 34722 25650 23432 39214 43168 756 -857 35932 58268
8740 58268 41143 8326 14622 38913 25540 16209 51274 84021 34462 21921 55130 61667
8728F1667Q32j6057l6519k6644N9405q728q099l1583k1655K9589N5512l3017m7525
8715b2822J5824L6016k5049k858J3435K4828l1134M939Q742n5786J5907j6811
8703c4769m9521L2474J5759j0990J9525N1124m1934l8323M4048j5198k886m581
8691c5272n504K6602N1235M4809J8734n3582j4095n3869l5722L822l0857L4983
8679d8716J8451k3501L0019l167l7146P104K3497L9203j2128l2119N0343P2010
8667H3850K7941p9555q661J82L660L0145O772j9756j5454k5214J5845k453J1678
8654B8980K4038M1533k4582J7931O5745J6247M9470Q2411n0188j03074p0821j8950
8642E8740K3293m6267k1715k6702n190m0058m3810K489r132j2254L5913J3655
$$ plain form
8728 61667 62499 46442 9923 -16721 42684 33956 25857 -5726 -27381 2208 57720 24703 -22822
8715 -22822 -6998 29018 3969 1111 14546 39374 8240 13179 21921 -33865 -17958 -34769
8703 -34769 -84290 -51816 -36057 -47047 -27522 23602 -18332 -56655 -12607 -27805 -30691 -35272
8691 -35272 -40776 -14174 37061 81870 100604 47022 32927 -20942 -56664 -52842 -83699 -48716
8679 -48716 -30265 -53766 -23747 -26914 -64060 -56956 -33459 5744 -6384 -38503 11840 83850
8667 83850 111791 32236 23575 23757 27417 57562 64334 44578 29124 3910 19755 17302 28980
8654 28980 53018 94551 69969 87900 153645 169892 219362 301773 251585 148511 77690 58740
8642 58740 82033 35766 14051 -12651 -17841 -57899 -101709 -99220 -108352 -120606 -84693 -71038
8630g1038l2813J5252K5160j5260M0125P2849K3162R626l3637n7177j9767J1941
8618c1577N5434J72q686P18L4864K6711q491k781l2321m5162p505K0391K7670
8605B9437P9123N8026J33024J67069j8586q5849j19808l1945n4317n9824l6034
8594F0316K4902j3302j4273q895j8620K316o2944k649O3237J903l1191R885L875
8581A4560j0825r216j4819K3172K6636j3083L3314k2668p8412j7740K4346K4439
8569b0296M225r57l7005j9825K2622L1740L1972k0134n864Q111O5186N0482P3531
8556A83788L8462k0338o6389m4586m823j0578o3916P355N80O782J6017j0583O3705
8543I5476k4204k1266k4684q889j1922l3607K7557K0392j9397k6426L5170K9312
$$ plain form
8630 -71038 -103851 -88599 -63439 -78699 -38574 34275 57437 67063 33426 -23751 -43518 -31577
8618 -31577 23857 24029 15343 16061 50925 77636 69145 66364 34043 -11119 -18624 1767 29437
8605 29437 108560 166586 299610 466679 448093 362244 242436 210491 156174 96350 60316
8594 60316 85218 71916 57643 48748 30128 32444 -30500 -33149 30088 31991 800 10685 14560
8581 14560 3735 -5481 -20300 2872 29508 16425 49739 27071 -51341 -69081 -44735 -20296
8569 -20296 -16071 -17028 -54033 -73858 -51236 -19496 12476 -7658 -13522 -5411 59775 110257 183788
8556 183788 222250 201912 135523 90937 86114 75536 11620 18975 19555 26337 42354 31771 95476
8543 95476 71272 50006 25322 16433 4511 -29096 -1539 18853 -544 -26970 8200 37512
8531C7512Q99k074k1604j606Q717L62M384o210K5957k7234P964l8334m9447j1826
8517g2540J6911j943J3940L367j2409m0977P875L2816q169J302N1125j3498L4613
8504A2413O1722j4287l5797l92J9930k8896J425n771n3470R606J5049j9822m3940
8491h2230L012k0623k3056L7211J8878J9722K594n3730q834o376N8953J148l9030
8478i2361L7810R741m265N0552M9621k8400n8709J3757J2682j7206m484r433M0658
8465c7O94J2195L592N574j7612j102R506m690j958J8996j4673m1064n0771r66
8451h2316L5025K0682K1688j2566l0203l2041N2684L2843j6022L5160K3134M7577
8439I5645K7731n7795l7341K9088m8350n6440k0434M2357M1791K3045n5959l3869
$$ plain form
8531 37512 38411 36337 14733 13127 21844 22206 26590 20380 46337 19103 27067 -11267 -60714 -72540
8517 -72540 -55629 -57572 -43632 -40265 -52674 -93651 -85776 -52960 -61129 -59827 -8702 -22200 12413
8504 12413 74135 59848 24051 23659 43589 14693 16118 10347 -43123 -33517 -18468 -38290 -82230
8491 -82230 -79218 -99841 -122897 -85686 -66808 -47086 -44492 -98222 -107056 -113432 -54479 -53331 -92361
8478 -92361 -54551 -44810 -49075 1477 51098 22698 -36011 -22254 -9572 -26778 -31262 -40695 -37
8465 -37 657 12852 16444 22018 4406 3304 12810 8120 6162 25158 10485 -30579 -81350 -82316
8451 -82316 -47291 -26609 -4921 -17487 -47690 -79731 -27047 5796 -10226 24934 48068 95645
8439 95645 123376 65581 28240 57328 8978 -47462 -67896 -25539 16252 39297 -16662 -50531
8427e0531M497N084J8678K4177Q408j0118m6348J4520M7648O1273M7374j5783
8415A08879l558j4970j1278l3520l80m1192j0846p441J7821k6265n1201l599k8043
8402a05593k400K3960O8337L154n0435n4267L2872N4756M4636o018q882K4685
8390B4805J5143K9946Q294p39k3018o4678O473m3441q393m631P558K5973k4191
8377e0899J9489J5437j3190j7491K6732M2840j1197l1184L3758k0619J4342K3737
8365C1755k0807o043r602k2595q509N08J2910M263l7252N4487O9986R515J9597
8352I8213o2771m30M7966J6108l2734o7119o0241K6543M4141N4799R9586p74r9299
8339F3988p5716k3460M4194J8712j7703r525m2601k2337j0031L600q71P659K1684
$$ plain form
8427 -50531 -46034 -40950 -22272 1905 10313 195 -46153 -31633 16015 77288 124662 108879
8415 108879 105321 90351 79073 45553 45173 3981 -6865 -14306 3515 -22750 -73951 -77550 -105593
8402 -105593 -107993 -84033 -15696 -12542 -62977 -117244 -84372 -29616 15020 9002 120 24805
8390 24805 39948 69894 78188 77449 54431 -10247 -3774 -47215 -55608 -60239 -52681 -26708 -50899
8377 -50899 -31410 -15973 -29163 -46654 -19922 22918 11721 -19463 14295 -6324 8018 31755
8365 31755 10948 4905 -4697 -27292 -35801 -35293 -22383 -18120 -55372 -885 69101 78616 98213
8352 98213 35442 35012 82978 99086 66352 -767 -61008 -34465 9676 64475 164061 163287 63988
8339 63988 -11728 -35188 9006 27718 10015 490 -42111 -64448 -74479 -70879 -71750 -64091 -42407
8326d2407N4366P091j5419K0298j313R678l4710j1099J280L859M0791j8520M35
8313A4330j6234K8591m6715l6867J1191K7312L5117k0425n8155J1758J9922O616
8301b3559J2079k5791M039J4551r186L8049J7630k8729k7058m7870o532J6925
8289f5452K4742m565J1484J3199L5555Q292J6877k0991j5757J3064p801P20J630
8276A0997o3496K0829O824M7569J6359M678N937J4025k0517P634m303J8494N247
8263G0277m773m582j8854k1240j2851n7215j7122K3382K9152R1518j582M611K5652
8250A06373j7223m0447k2368J9334j2746K5130M5351l3807o8867q720O663l2699
8238c4026l809l5314q974J2164R656K3716r855Q1444K7980k9274K990n165m5964
$$ plain form
8326 -42407 11959 19050 3631 23929 22616 32294 -2416 -13515 -12235 -8376 32415 13895 14330
8313 14330 -1904 26687 -20028 -56895 -45704 -18392 16725 -3700 -61855 -50097 -30175 -23559
8301 -23559 -11480 -37271 -33232 -18681 -27867 10182 27812 -917 -27975 -75845 -82377 -65452
8289 -65452 -40710 -45275 -33791 -20592 14963 23255 40132 19141 3384 16448 8647 9367 10997
8276 10997 -52499 -31670 -24846 22723 39082 43760 49697 63722 43205 50839 46536 65030 70277
8263 70277 65504 60922 42068 20828 7977 -49238 -66360 -42978 -13826 77692 76110 80721 106373
8250 106373 89150 48703 26335 45669 32923 58053 103404 69597 730 -7990 -1327 -34026
8238 -34026 -37835 -73149 -82123 -69959 -60303 -36587 -46442 35002 62982 33708 36698 31533 -14431
8225a4431m775k2221o649j8630K1055j4173q058L725J8319o705M120m583J7885
8212c5121M099K0613l8543L6749Q3733J0809K48J0213n6226o1642k2444M6019
8200a493l1392o503L195J970m520L25k7126P686M4109k3925l1289O5469J1222
8187G728J230q264L1454K6036j6684j8327l4354j6197J0351O8372K1282k6386
8175D6241n6125J2346N2432J2467j4351L4993l4943l7878m4392j9369k102J9753
8163c0928K6581j3331J5547P385j8112j8815K281n810j8446K2265J4349k2111
8151c9145R330j1584N6868J8348j4749p525j4923j0466j2581J1321J2162j1046
8139a3990r261N5347N516j197m0265l9502M7286J9768r821o535K7373L262n912
$$ plain form
8225 -14431 -19206 -41427 -48076 -66706 -45651 -59824 -67882 -64157 -45838 -52543 -48423 -53006 -35121
8212 -35121 -31022 -10409 -48952 -12203 71530 82339 82587 92800 36574 -25068 -47512 -1493
8200 -1493 -32885 -39388 -36193 -34223 -38743 -38418 -65544 -57858 -13749 -37674 -68963 -3494 7728
8187 7728 8958 694 32148 58184 41500 23173 -11181 -27378 -17027 51345 72627 46241
8175 46241 -9884 2462 54894 67361 53010 88003 53060 15182 -29210 -48579 -50681 -30928
8163 -30928 -4347 -17678 -2131 5254 -12858 -31673 -29392 -35202 -53648 -31383 -17034 -39145
8151 -39145 -29815 -41399 15469 33817 19068 11543 -3380 -13846 -26427 -15106 -2944 -13990
8139 -13990 -23251 32096 37612 36415 -3850 -43352 3934 23702 13881 7346 34719 37981 32069
8126C2069k3930j012j9145n1345m2799J3057k5402l7996O5105N2056l9210P3678
8114d874M8419L947k2848k5666k4275k2592M0317k3858j5515m1939R097K3124
8102e6663Q280J0345r663m1212J8197M2820O3284j2795K840j7186l0663J5669
8090f747J1952m1575J980J8335j7592J8564o2494l3870N3431R3767l8729l3529
8078c6507J9683K8222j2747j7053M0715K6359N714m8159J5598Q2691l9465q8741
8066b3690r713j2044K3129k1107j9464K7014M2570N8101K2877N63k3142K9180
8054I4274j3724k3737m9218j3887L2170J2232k9118M2284J0791k0807j5508J300
8042B7052m7468r1079k6899J1145P2703N3874m2621k1038L2783M5126o248o824
$$ plain form
8126 32069 8139 7127 -12018 -63363 -106162 -93105 -118507 -156503 -91398 -39342 -78552 -4874
8114 -4874 43545 47492 24644 -1022 -25297 -47889 -7572 -31430 -46945 -88884 -79787 -56663
8102 -56663 -48383 -38038 -47701 -88913 -70716 -27896 35388 22593 25433 8247 -22416 -6747
8090 -6747 5205 -36370 -34390 -16055 -33647 -15083 -77577 -111447 -58016 35751 -2978 -36507
8078 -36507 -16824 11398 -1349 -18402 22313 48672 54386 6227 21825 104516 65051 -23690
8066 -23690 -33403 -45447 -22318 -43425 -62889 -35875 6695 64796 87673 88236 65094 94274
8054 94274 80550 56813 7595 -6292 25878 38110 8992 51276 62067 41260 25752 27052
8042 27052 -20416 -111495 -138394 -127249 -54546 -672 -43293 -64331 -31548 13578 7330 506
8030E06j7500J1654K8207k965M5470l2004j1479L7981K3594j8962m6099M1723
8018F0126Q739l4106k1556k0721j812P42P690k9799n3226j8490N914M7999L4866
8005a3634R115O839K4631M1226l8589m2144J9584j9829j5325K3736L5986j0570
7993B1026l2407m3595k0499L3481K9012N309O3377J4193l8901o6943q161K7758
7981a6350M684J6858K6844O2719L3872j5555m4100l1320r290l5224l8275K9877
7969a5260K1458M671P3544L4757J0546n7214K5183K4848k5444l6853k4028q018
7957B8190K127j3287L0120L7613k486j8649J8709R455j5511j444r381l4262M721
7944C5915k425J4577m152j0524m7468k6336K447K2875J8450O7839J8388j1973
$$ plain form
8030 506 -16994 -5340 22867 19902 65372 33368 21889 59870 83464 64502 18403 60126
8018 60126 68865 34759 13203 -7518 -9330 -8588 -898 -30697 -83923 -102413 -96499 -48500 -13634
8005 -13634 -4519 2320 26951 68177 29588 -12556 7028 -12801 -28126 -4390 31596 21026
7993 21026 -11381 -54976 -75475 -41994 -12982 -7673 55704 69897 30996 -35947 -44108 -16350
7981 -16350 -11666 5192 32036 94755 128627 113072 68972 37652 28362 -6862 -45137 -15260
7969 -15260 6198 10869 84413 119170 129716 72502 97685 122533 97089 60236 36208 28190
7957 28190 30317 17030 47150 84763 82277 63628 82337 91792 76281 74837 65456 31194 35915
7944 35915 33490 48067 43915 33391 -14077 -40413 -37966 -15091 3359 71198 89586 77613
7932G7613k5177J1121m3911N017L4974M818K9832j4053l2755j5201k9676j1483
7920h881o547r556J0579N6671K8445k8835J928O786K4347m7281q635M4857M5170
7907A09048k9356n1545j5712J2847K5060L6453j5636m511K8492M0013m6060n6643
7895C2450l6287k7649n2364J517L4982L6239K7699m9925l1022J3049n225M30L8732
7882a7374q702k3398J6471l012K4691L0019m4196Q579J2002n7194M3385J07123
7870H8394J6025k8538n3225j5873J5238m797L7381M4562m0162o3861l3347k2834
7858f1037J3099L0386J8450q275k672K9708K7711K5142r7234m1015O1595K2890
7846A8748M8410j9372j183k2039K0507L4712m4528m1003N6841J0106n1840m7028
$$ plain form
7932 77613 52436 63557 19646 24663 59637 64455 94287 80234 47479 32278 2602 -8881
7920 -8881 -15428 -24984 -14405 42266 70711 41876 43804 50590 74937 27656 19021 63878 109048
7907 109048 79692 28147 12435 25282 50342 86795 71159 66648 95140 135153 89093 32450
7895 32450 -3837 -31486 -83850 -82333 -47351 -11112 16587 -33338 -64360 -51311 -56536 -56106 -17374
7882 -17374 -26076 -49474 -33003 -36015 -11324 18695 -25501 -16922 -4920 -62114 -18729 88394
7870 88394 104419 75881 22656 6783 22021 17224 54605 99167 59005 -4856 -38203 -61037
7858 -61037 -47938 -17552 898 -7377 -10049 19659 47370 72512 -24722 -65737 -4142 18748
7846 18748 67158 47786 46603 24564 45071 79783 35255 -5748 51093 61199 9359 -37669
7834c7669L7117m7853n1074J2693M8145K6663j0111j0656M5084j1300n0028L9160
7822i829N6793m2395j9263k371K6040m4122k6433K2740l1309J5713J5333l23Q222
7809c1204N273Q3892J1464K456j618l9435L1872M0088N486p8633l1622M8746m0117
7796F648L554N7826J1399l8738m2614l6478J8801J9985J9368O509m2138p833p29
7783b4440N3529K140l3126l6584N0231K873R789l7132k7557L8327L191K2791n7813
7770c3781j6992p42J3300N2376L2628p744j89q1195J0340N6287j5632K453L3494
7757D4603j0244N108J2255M2597q02m9085j827l5273j6195R859J4988n8427j6453
7744e8896j2256N735j105K0736M3279M2734N4836m0081k3911K300O411r327j1721
$$ plain form
7834 -37669 -552 -48405 -99479 -86786 -38641 -11978 -22089 -32745 12339 1039 -48989 -9829
7822 -9829 46964 4569 -14694 -17065 8975 -35147 -61580 -38840 -70149 -54436 -39103 -39426 -31204
7809 -31204 -25931 57961 69425 71881 70263 30828 62700 102788 108274 29641 -1981 46765 6648
7796 6648 10202 68028 79427 40689 -1925 -38403 -19602 383 19751 26260 -15878 -23711 -24440
7783 -24440 29089 31229 -1897 -38481 11750 14623 24412 -12720 -40277 -1950 1241 24032 -33781
7770 -33781 -50773 -51515 -38215 14161 46789 39045 38856 -42339 -31999 24288 8656 11109 44603
7757 44603 34359 39467 51722 94319 93517 44432 42605 7332 -8863 996 15984 -42443 -58896
7744 -58896 -71152 -65417 -66522 -45786 -2507 40227 95063 54982 31071 33371 39782 30455 18734
7731A8734l8849J3539j6564m9670m262M6466K4905L1889L2927K1139j3624n0120
7719A6510k3397k16N532o574M3897j570k3961J8315O782K0122k3800K670L4928
7706F9238j0631m0179j59j3915j7268O936K2969J8737j8492J3236M8087l193k9764
7693D5602J035j3409l4697N0349K0354Q354l7069j7587j4232l7940k9362N7196
7681a406l882o463R874l2827o1351j735K9901J8137l4841k4988J1211L4012K1216
7668d3142m5651q739M4766P6057J3892j4845p487o5080J1892q927N2592J4344
7656A9672q2626l6997o881k7440k4801j4108L0045L4989M9240l7965k3636K2137
7644i8371O7603L7485K9454O255m0012J7981M7144m5958P463p391j3705q901J4927
$$ plain form
7731 18734 -20115 -6576 -23140 -72810 -77072 -30606 -5701 26188 59115 80254 66630 16510
7719 16510 -6887 -7103 -1571 -8145 35752 34182 10221 28536 35318 55440 31640 34310 69238
7706 69238 58607 18428 18269 4354 -12914 -5978 16991 35728 17236 30472 78559 75366 45602
7693 45602 46637 33228 -1469 48880 69234 77588 40519 22932 8700 -29240 -58602 -1406
7681 -1406 -5288 -11751 -1877 -34704 -96055 -97790 -67889 -49752 -84593 -109581 -98370 -64358 -43142
7668 -43142 -88793 -97532 -52766 23291 37183 22338 14851 -50229 -38337 -47264 5328 19672
7656 19672 -62954 -99951 -106832 -134272 -159073 -173181 -143136 -108147 -58907 -96872 -120508 -98371
7644 -98371 -30768 6717 36171 42426 2414 20395 67539 21581 29044 21653 7948 -953 13974
7631A3974j8784Q673P508k0364m8871K7695M2630L727L942m5084m4581J0280N7285
7618a970M9074J9090j4016m9839m2111K0043K5150J8065m1101p997R438K3660
7606G486j7472n4463L119J9736L2047j355j2335J4669K0896L0309j9267p203J8534
7593C4701K0913j3832k6073k1058L784o16P871J813n9026L835J12m744j8902K0930
7579e0292l6599O115K2770Q85M834l367P0119o210m0564O741m365L152j2403o0395
7565i9579J4249K5613k0721J4254k4746j0987L4841Q1224P2798j021l4881p3375
7553b2331m4831N175J5177J8549L7940l4840K325Q818L672L9742m7406J1353J5274
7540H617o379k3284j5609j178M3529K406j7409J1531J9104l74K1740p886N2931
$$ plain form
7631 13974 -4810 3863 11371 -8993 -57864 -30169 12461 16188 20130 -24954 -69535 -59255 -1970
7618 -1970 47104 66194 52178 2339 -39772 -19729 5421 23486 -17615 -25612 -16174 7486
7606 7486 -9986 -64449 -61330 -41594 -9547 -10902 -23237 -8568 12328 42637 23370 16167 34701
7593 34701 55614 41782 15709 -5349 -1565 -2181 5690 7503 -51523 -47688 -47576 -52320 -71222 -50292
7579 -50292 -86891 -80776 -58006 -57121 -52287 -55654 14465 8255 -32309 -25568 -29933 -26781 -39184 -99579
7565 -99579 -85330 -59717 -80438 -66184 -90930 -101917 -67076 14148 86946 85925 51044 -22331
7553 -22331 -67162 -61987 -46810 -28261 9679 -25161 -22836 -14018 -10346 29396 -18010 -6657 8617
7540 8617 2238 -21046 -36655 -37833 5696 8102 -9307 2224 21328 20954 42694 34808 87739
7527H7739l7154j6403j8144m576o801J8985j3794p527K9360L0191j3963j5079
7515C2834k641k468m9532K194Q354J3049r25K2492L5130p551o1125J6785M4562
7502E1158m2489k5304j6368L735L0413j2385m1902L2896k4087P733N529J545K0321
7489i205M5861k9118n8119l5257J7508N036N028N127J4214M579L3575N5478j2537
7476D2170l8542k5290P484j3423L1837J043r789M730j2871k0093K4453j4788J9482
7463c597J9242j3640J4014l932n9629J8760M4764J3342K2577j1516j7078J4664
7451C7971q1053n0223L6918K5976K8282J0003R202o0977k5696O3079K2349k6664
7439a0833m5862N2688L7037m620j07M503K3194P668K5817K4382J5838k0277n5232
$$ plain form
7527 87739 50585 34182 16038 11462 4661 23646 9852 2325 31685 61876 47913 32834
7515 32834 30193 27725 -21807 -19613 -11259 1790 865 23357 58487 50936 -10189 6596 51158
7502 51158 8669 -16635 -33003 -29268 1145 -11240 -53142 -20246 -44333 -36600 -31071 -29526 -9205
7489 -9205 36656 7538 -50581 -85838 -68330 -63294 -58266 -53139 -38925 -34346 -771 54707 42170
7476 42170 3628 -21662 -14178 -27601 4236 5279 -4510 220 -12651 -32744 -8291 -23079 -3597
7463 -3597 15645 2005 16019 12087 -47542 -28782 15982 29324 51901 40385 23307 37971
7451 37971 -43082 -93305 -56387 -30411 -2129 7874 17076 -43901 -69597 -6518 15831 -10833
7439 -10833 -56695 -4007 33030 28410 28303 32806 56000 63668 89485 113867 129705 109428 54196
7426E4196m3602m880M0349n748o1127m9896O1412L2484k8666K891M1095J6684
7414E5192L1891m763m2011l2613l342k0914M924o9033k7832M8128L8968j0340
7402c1745L8378j631j5146j2901p819r405K2840o532J1807k3288k902K8531j4941
7389b4754l6448n797L1415K803l1739k9038J3542L1083N7960O378j8777n498K9338
7376B0468m4677q661N2427Q8596J6890m7155n1567K27j5053K2793O571l325k8292
7363I242k0280P077N467J0975k035n6800j3099L0290M8820k6395k4435j3655k029
7350d6857J8683m746r817o277k5771K5177O32J3657n1431j603K7933o722k8317
7337i5459Q6537O0554j220r4757p0133K2550O2685L4323K4109K35k4367J2j0411
$$ plain form
7426 54196 10594 5714 46063 40315 -20812 -70708 -9296 23188 -5478 -2587 38508 55192
7414 55192 87083 82320 40309 7696 4354 -16560 -11636 -80669 -108501 -60373 -21405 -31745
7402 -31745 6633 5002 -10144 -23045 -30864 -40269 -17429 -23961 -12154 -35442 -38344 -9813 -24754
7389 -24754 -61202 -66999 -35584 -32781 -64520 -93558 -80016 -48933 9027 15405 -3372 -8870 20468
7376 20468 -24209 -32870 19557 108153 125043 77888 26321 26548 11495 34288 40859 37534 9242
7363 9242 -11038 -3961 1506 12481 10446 -46354 -59453 -29163 19657 -6738 -31173 -44828 -46857
7350 -46857 -28174 -32920 -42737 -49014 -74785 -49608 -48976 -35319 -86750 -88353 -60420 -67142 -95459
7337 -95459 -8922 51632 50412 -44345 -114478 -91928 -29243 5080 29189 29424 5057 5069 -5342
7324e342P031L349M2356k1286o3603k1088J5015j0190l6207M0460L4757j2865
7312b7613n1233J1335M0913k3609J0912J8315k6116P753J2158r706r574M7841
7300A376M8331m5515J9353M4272l3188j736Q052k1768k0940M9111n254o905K0334
7287E5523l7794m293m5257p768L5975O9637L4660k7359o9016j93L8357K5554n6222
7274A1804l5139L7711O7346M051n1270m9299k7180J1072N5637K36l9544J9474
7262D899j912J307L2297K6341m0477j7633K6266l9576j871J8584M5412N64j6867
7249C7334m7257n094J0259l8396m3543N3211N8624K3247l110j2550m0635j8630
7237b6540j889Q5754J9111l5680Q254J7716m801l814l506P22L2767j4324k3138
$$ plain form
7324 -5342 1689 5038 47394 26108 -37495 -58583 -43568 -53758 -89965 -49505 -14748 -27613
7312 -27613 -78846 -67511 -26598 -50207 -39295 -20980 -47096 -39343 -27185 -36891 -46465 1376
7300 1376 49707 4192 23545 67817 34629 32893 40945 19177 -1763 47348 42094 35189 55523
7287 55523 17729 13436 -31821 -39589 -3614 66023 100683 73324 4308 4115 42472 68026 11804
7274 11804 -23335 14376 81722 85773 34503 -14796 -41976 -30904 24733 24969 -14575 4899
7262 4899 2987 4294 36591 62932 22455 4822 31088 -8488 -10359 8225 53637 54201 37334
7249 37334 -9923 -15017 -4758 -43154 -86697 -33486 25138 48385 45275 32725 -7910 -26540
7237 -26540 -28429 57325 76436 40756 49010 66726 61925 58111 54605 55327 88094 73770 50632
7224E0632o0466l6218N4901J3831l0351J3560K4003m331l2134m8832J8169L0228
7212g008K8151M233J5572K1833n953p265J049m6341p3495l7811K9950L6855J5537
7199b4693L0209J818L58l0214K0204L6289k6391j0855j306l6630k4121J6293O7560
7186A8521K4902k2249L5404J6226j3285m64k9356k2652m1759N279M1548P662j2530
7173G247l6541k2793J6479K8463j8153k4356j5412J4724N7112l1082K267P496
7161a4549M109l663L023P948k4228j8337J7656K0888m3704j243L8163K0448J1989
7148A8500j4735J4033J1086L7521O205j6919j0336j6705k2032r00O776L4668j5377
7135C1785l8857L4705M7519j0407j7574R398k5891q648l5438l7203k7501R919
$$ plain form
7224 50632 -9834 -46052 8849 22680 -7671 5889 29892 25561 -6573 -55405 -37236 -7008
7212 -7008 21143 25376 40948 62781 56828 49563 50612 4271 -69224 -107035 -77085 -40230 -24693
7199 -24693 5516 7334 7692 -22522 -2318 33971 7580 -3275 -4581 -41211 -65332 -49039 18521
7186 18521 43423 21174 56578 72804 59519 59055 29699 7047 -34712 -29433 12115 19777 7247
7173 7247 -29294 -52087 -35608 -7145 -25298 -49654 -65066 -50342 6770 -24312 -22045 -14549
7161 -14549 -10440 -14103 -11080 -3132 -27360 -45697 -28041 -7153 -50857 -52100 -13937 6511 18500
7148 18500 3765 17798 28884 66405 72610 55691 45355 28650 6618 5718 12494 47162 31785
7135 31785 -7072 27633 75152 64745 47171 56569 30678 22030 -13408 -50611 -78112 -68193
7123f8193N9859k454l1497J9433m6174J9035P9803k2124l8927k7714L1900k5769
7111e2822m027O9699J2381m4349k5471J4175K4660k6102K5146K6167r935k66k171
7098G085M199l4204k2109K44p651N3547R7543M7200J990n4l5467m616k1126l3552
7084E3029n9826l5670J7071j2370N3777L1500j1199L6945L178k7759n03k0120
7072B8053l8788r5386J183N630j2867M8790P5129O4368J2408J0596n1639n095
7060D2382l2544l4933k8554N1695L4010M5365j4329j9585m6967m6851k990M6422
7048f879J3098m1624p113J9960J3797Q008N3933j8917j7147K0276k1056p194L0162
7035C9304J4903l7833j6725l628J2135K9490n836n3357K2178K5066n3526j6162
$$ plain form
7123 -68193 -8334 -10788 -42285 -22852 -69026 -49991 29812 7688 -31239 -58953 -27053 -52822
7111 -52822 -56849 12850 25231 -19118 -44589 -30414 -5754 -31856 -6710 19457 9522 9256 7085
7098 7085 11284 -22920 -45029 -44785 -52436 1111 98654 145854 147844 147790 112323 107707 86581 53029
7084 53029 -6797 -42467 -25396 -37766 16011 47511 36312 73257 76435 48676 48173 28053
7072 28053 -10735 -106121 -104938 -99308 -112175 -63385 11744 76112 88520 99116 47477 42382
7060 42382 9838 -25095 -53649 -1954 32056 77421 63092 43507 -3460 -50311 -53301 -6879
7048 -6879 6219 -35405 -42518 -22558 -8761 -753 53180 34263 17116 37392 16336 9142 39304
7035 39304 54207 16374 -351 -3979 8156 37646 31810 -21547 631 25697 -27829 -43991
7023d3991J92j6269Q6581L8642p510p9200l3226K9317J2755l5841N8774L4868
7011D5092p2091o0212j137L7677j4484l9396k8577K1409J966K2699J942L4014
6999e1098M5421L9525L277M0488j095m9949o900L062p3687n9624K853L2705m464
6986g9486L5900K2000L5910R588m7619n2990J5980N3040Q864n8630l9206K1552
6974g5097K6126L5163N157j6429j1454K9648l215j5614L6288M6198o655k5416
6962B4700m4252n642R0498L7498o6057j5680N5526p580j6360m7867j8122k0719
6950c4057j6098m755M0774R016M3578O6223o654n2080n408q113L6601m5935l8430
6937a5338m5495L2205P2768j1286l9737R329J6548J4371K4530o0706L0391J6358
$$ plain form
7023 -43991 -43799 -60068 26513 65155 57645 -21555 -54781 -25464 -12709 -48550 10224 45092
7011 45092 -26999 -87211 -88348 -50671 -65155 -104551 -133128 -111719 -109753 -87054 -85112 -51098
6999 -51098 -5677 33848 37125 77613 76518 26569 19669 22731 -50956 -110580 -107727 -75022 -79486
6986 -79486 -43586 -21586 14324 23912 -23707 -76697 -60717 -7677 1187 -57443 -96649 -75097
6974 -75097 -48971 -13808 -8651 -25080 -36534 -6886 -10101 -25715 10573 56771 50116 24700
6962 24700 -19552 -25194 65304 102802 36745 21065 76591 69011 52651 4784 -13338 -34057
6950 -34057 -50155 -54910 -14136 -5120 38458 104681 98027 45947 40539 32426 69027 23092 -15338
6937 -15338 -60833 -28628 44140 32854 -6883 2446 18994 33365 57895 -2811 27580 43938
6925D3938J5982R875k0567j7932m9145J2253J1508j2151M3659m1046j883N4989
6913D9480L0813l8178j9496l0552j535R241p0277j2590M3094p838M1177P22J5929
6900I990P138m3071L48l1099l2242L0712M5013J8208m0664O1000M9928k1003j9560
6887C4698J1761n9053m9212k0274K2292J0273k9698J2796K2526K0183M6894j6418
6875F768M324m4834j7731L0139J0098j5364j9122j8547M1246O449j8347J7117
6863a7804J7072j3769J6034O2256j8572l9644K6196N2869j4197o1549q137K5179
6851B5934R632p484L5234k2407m9538N238o2116k8552m2456K1166N7145L6177
6839b2027k3881n4285K5971j509L9202L9207o944K1685K8313j0022k8613k7140
$$ plain form
6925 43938 59920 69795 49228 31296 -17849 -5596 5912 -6239 37420 -3626 -5509 49480
6913 49480 80293 42115 22619 -7933 -9468 -227 -70504 -83094 -40000 -47838 -6661 -5939 9990
6900 9990 17128 -25943 -25595 -56694 -88936 -58224 -13211 4997 -35667 25333 75261 54258 34698
6887 34698 46459 -12594 -61806 -82080 -59788 -49515 -79213 -66417 -43891 -23708 23186 6768
6875 6768 11092 -33742 -51473 -21334 -11236 -26600 -45722 -64269 -23023 -16574 -34921 -17804
6863 -17804 -732 -14501 1533 63789 45217 5573 31769 84638 70441 8892 755 25934
6851 25934 35566 28082 63316 40909 -8629 -3391 -65507 -94059 -136515 -115349 -58204 -22027
6839 -22027 -45908 -100193 -74222 -75731 -36529 2678 -4266 17419 45732 35710 7097 -20043
6827b0043l6370R937k36N6002m1377j1464N7422L3924k4960m7680J657L6592m2822
6814b9418N513r571k7538L6506L6504j7474o0184n741L6591M941k2490Q023L5514
6801h824K9919K9424K1158l746J3166k7667n2215l8289k0000k0191L030N243k4209
6788i3201j4210K6858Q1841O778k8683K3056P5135q1872n1362J2448K7447M8990
6776C3225j6881k7902K608n278p754L904o4882M6158K3877L5075Q041m2436K333
6763i912K3535j8852k7225l0547P784J7585J020q990k231L5328L8308k2208k0216
6750a6621J9591m123Q610k4256q6302OP1913Q7935j5767o9315K3517N9496j686
6737E2998m6941N327m0768o611p815R835Q4780M5654L7209m8860p5580N1630k016
$$ plain form
6827 -20043 -56413 -46476 -46712 9290 -32087 -43551 13871 47795 22835 -24845 -23188 13404 -29418
6814 -29418 -23905 -33476 -61014 -24508 11996 -5478 -65662 -71403 -34812 -29871 -52361 -44338 -8824
6801 -8824 21095 50519 71677 67931 81097 53430 1215 -37074 -57074 -77265 -74235 -68992 -93201
6788 -93201 -107411 -80553 1288 8066 -20617 2439 77574 -4298 -55660 -43212 -15765 33225
6776 33225 16344 -11558 -8950 -14228 -21982 -18078 -82960 -36802 -12925 22150 30191 -12245 -9912
6763 -9912 13623 -5229 -32454 -63001 -55217 -37632 -36612 -45602 -47833 -12505 25803 3595 -16621
6750 -16621 2970 -1153 7457 -16799 -103101 -103095 -31182 56753 40986 -28329 -4812 54684 52998
6737 52998 6057 11384 -29384 -35995 -43810 -33975 50805 96459 133668 84808 9228 60858 58842
6724E8842M800j1448J941q3801l4175j8228Q287R653K3758N1815J2419l1760M6483
6711C8586m675p037j2142l7657O565j9485j3535K2270K9691k3752q646l312L3488
6698C59L476o851J8787J2131m5071n9010m293Q162J5101J7110r307j3726j374
6685f4506N7870n644J1995L5313j2547l9918L2518J0677o8361j1796Q963K0533
6673b4903M1579n2301k0560p130n295M0999R133L0184J4332k1340j0814l999J149
6660h966N773j5021O998o275j3348j3592K8232j6906k3274O1717M2829m3092m1881
6647c6806k4913L3899J5105j640R289n49m0255m1914J5269N2689L5782J328k795
6634A4489j6242k8598K5084M4806j2411r4700l9127K0599P4281N8405n675k3704
$$ plain form
6724 58842 63642 52194 54135 -29666 -63841 -82069 -73782 -64129 -40371 11444 23863 -7897 38586
6711 38586 33911 26874 14732 -22925 -16360 -35845 -49380 -27110 2581 -21171 -29817 -33129 359
6698 359 3835 -3016 15771 27902 -17169 -76179 -80472 -72310 -57209 -40099 -49406 -63132 -64506
6685 -64506 -6636 -12280 -285 35028 22481 -17437 15081 25758 -42603 -54399 -45436 -24903
6673 -24903 16676 -35625 -56185 -63315 -68610 -27611 -18478 11706 26038 4698 -6116 -10115 -8966
6660 -8966 -3193 -18214 -11216 -17491 -30839 -44431 -16199 -33105 -56379 5338 48167 5075 -36806
6647 -36806 -61719 -27820 -12715 -14355 -5066 -5615 -45870 -87784 -72515 -19826 15956 17284 14489
6634 14489 -1753 -30351 -5267 39539 27128 -67572 -106699 -86100 -11819 46586 40911 17207
6622A7207j594K897j356O270j3668K8821r840o094j0010Q174J67j942M1206J3680
6608G3918J8702J5138m5036p2760j7960K5788K9277K1690q58j2942l6225j443
6596b711r811N0473K4247M796j8120n280k7843k6342k3547q677L8394N6385O099
6583E8063o9277K5204P4423j8831m5467j5182j162L8119q0099K4038P6889l2668
6571C4050m5030L2976l9599k6065K1148N0329m102o727l5386k8031j8097l673
6559f8207p464p177j3475J6938K9899J4485R23K0595k6232O252L0839K7186k6393
6546a831j7444o286j9799J0953K8817J3650l3995J9297p169L3814K5208k8910
6534A6305n6631K2673J9490J9324J9626l1851k5629K8241k9142l0580l5626K5947
$$ plain form
6622 17207 15613 18510 17154 23424 9756 38577 28737 22643 12633 20807 20974 19032 60238 73918
6608 73918 92620 107758 62722 -10038 -27998 -2210 27067 48757 47899 34957 -1268 -2711
6596 -2711 -12522 37951 62198 66994 48874 43594 15751 -10591 -34138 -42815 -4421 51964 58063
6583 58063 -11214 13990 88413 69582 24115 8933 7771 45890 -34209 -10171 66718 34050
6571 34050 -10980 21996 -17603 -43668 -22520 27809 23707 16980 -18406 -46437 -64534 -68207
6559 -68207 -75671 -82848 -96323 -79385 -49486 -35001 -34078 -13483 -39715 -33463 -2624 24562 -1831
6546 -1831 -19275 -25561 -45360 -34407 -5590 8060 -25935 -6638 -13807 20007 45215 16305
6534 16305 -40326 -17653 1837 21161 40787 8936 -16693 11548 -17594 -48174 -83800 -57853
6522e7853L3618M1230j1134k8673N0524k3313n6990N533M6109N3650m4670k6480
6510a8449n709j5864l5894j7683Q259P250O2930M9028l1843j2718J2533J2359
6498A4199J2019l1807l715k3007l3963n168O8333L5244k6659j9779N964l6404
6486d4743L0987L625P20p446o803J3269m718L6729J0455m2233k4436j7199P165
6473d4628K7096N499j998K1746j9924k6348j9281L497O0773P652j8289O357K5826
6460B7978j2320k2589M76m453J6960j6760j2080m6091J3900P6908n371j6477N206
6447E287K5874N7569n0150k7824j7743J3409L010k071J8721j3912q1346n3671
6435a22847P0092Q4052J1461k669J8358n0625l6830n5508p00K9423L5901N7555
$$ plain form
6522 -57853 -24235 16995 5861 -22812 27712 4399 -52591 -47058 -949 52701 8031 -18449
6510 -18449 -24158 -40022 -75916 -93599 -85340 -78090 -15160 33868 2025 -10693 1840 14199
6498 14199 26218 -5589 -9304 -32311 -66274 -71442 -3109 32135 5476 -14303 -8339 -44743
6486 -44743 -13756 -10131 -9411 -16857 -23660 -10391 -15109 21620 32075 -10158 -34594 -51793 -44628
6473 -44628 -17532 -12033 -14031 7715 -12209 -38557 -57838 -54341 6432 14084 -4205 2152 27978
6460 27978 15658 -6931 -6455 -10908 6052 -10708 -22788 -68879 -54979 21929 16558 81 5287
6447 5287 31161 88730 38580 10756 -6987 6422 9432 7361 26082 12170 -69176 -122847
6435 -122847 -52755 31297 42758 40089 58447 7822 -29008 -84516 -85216 -55793 -19892 37663
6423C7663j8367j8621R634j3270j6011l8066K4262N1185J1627k9134J3405L4612
6411D8919L6552q7302J5593r850l2862k240K6593q252L6749J5885l5871k3002
6399a9088R789k677J1112L2428n1061J9385J675K9611L8600n046j8940P028J2553
6386F5369J5337l0421k3460J3506o3469l9934K4639J514K1484J915j1386K0627
6374d279J3935K2124q3138q7456O065N5904L9561P736J4047k2136j810K1293O196
6361a1958k5439j9787J9846N3301J1054m3200K4499P443L6953J8026J824K5636
6349I8198o2235o0334l658J9045l2310j3813k1136k8594J8500l2774p336N3657
6337g2790N3841j8970Q37l618J8497q419P298K1009l7641K5615k0295o7409L331
$$ plain form
6423 37663 19296 675 10309 -2961 -18972 -57038 -32776 18409 30036 902 14307 48919
6411 48919 85471 -1831 13762 3912 -28950 -31190 -4597 -12849 23900 39785 3914 -19088
6399 -19088 -9299 -11976 -864 31564 -19497 -112 1563 31174 69774 64728 45788 52816 65369
6386 65369 80706 50285 26825 40331 -23138 -63072 -38433 -36919 -15435 -13520 -24906 -4279
6374 -4279 9656 31780 -51358 -138814 -132749 -76845 -37284 -29548 -15501 -37637 -39447 -18154 -11958
6361 -11958 -37397 -57184 -37338 15963 27017 -16183 8316 15759 52712 70738 72562 98198
6349 98198 35963 -24371 -28029 -8984 -41294 -55107 -76243 -104837 -86337 -119111 -126447 -72790
6337 -72790 -18949 -37919 -37082 -40700 -22203 -30622 -23324 -2315 -39956 -14341 -34636 -102045 -98714
6324i8714O6134K1544L204p858l1852n681q313O024k7721l4587J681q740o256
6311a31135O1865M4332n5154N2606N0918j3634J4389R126k2591o3620k9833M9511
6299c3220M0398K7724o794m6025N022N1712k1870j0179Q645J8145j857l5967K3258
6286A8992J0787j4819n8724o0559m531J13651N6895k8567j3311n9871p425P362
6274d0120K3035K4850l8859J6190J0468K7176J5870k0126j0708J1415n0179R454
6262b1534J8543j0384L052L4102K9977R990o4943j1737K5347k3667k2680k985
6250c6919L9288M8946n1388J1771J6492o217j7551k3105M0014j7446l8853M5219
6238A0251K1933j1640m7130j5161K0117J2795J3585J2660k859J4416j3368k452
$$ plain form
6324 -98714 -32580 -11036 -7832 -15690 -47542 -53223 -61536 -55512 -83233 -117820 -116139 -124879 -131135
6311 -131135 -69270 -24938 -80092 -27486 23432 9798 24187 33313 10722 -52898 -82731 -33220
6299 -33220 7178 34902 28108 -17917 -12895 38817 16947 6768 15413 33558 31701 -4266 18992
6286 18992 29779 14960 -43764 -104323 -108854 4797 61692 33125 19814 -40057 -47482 -40120
6274 -40120 -17085 7765 -31094 -14904 -4436 22740 38610 18484 7776 19191 -30988 -21534
6262 -21534 -2991 -13375 -10323 23779 53756 63746 -1197 -12934 12413 -11254 -33934 -36919
6250 -36919 2369 51315 -73 11698 28190 21973 4422 -18683 21331 3885 -34968 10251
6238 10251 32184 20544 -26586 -41747 -21630 -8835 4750 17410 14551 28967 15599 13147
6226A3147m3208j7111k174M1724N6139j3849n5277n6350N527L9131K3143J9200
6214A0042k3311J5955N4096L3077R423n7650j8886l0406l139J2536M4703J7840
6202F4280k0584p3824P961O6912j464R113J996m2059q165O1256q597k6141m1940
6189a1256l1302L6598L4949M0130k3036K3808l678K3653Q96j5901k1610m6567
6177F684L30L6531Q689N7690j1986j9554k763k2586L551l482n842j5404j8075
6164A3783p4970m7277P4216N5774O567r279L0899q820J4457m2844p257M972p2052
6151f1831J583K5733J417j3438k3323P336k4985J0962M8052k6375q451L365J9747
6138d0208J5450M770j1116N315M3254p23k4233J0344k3006k7762m98M3783N7058
$$ plain form
6226 13147 -30061 -47172 -49346 -7622 48517 34668 -20609 -76959 -71432 -32301 -9158 10042
6214 10042 -13269 2686 56782 89859 99282 41632 22746 -7660 -10799 1737 46440 64280
6202 64280 43696 -30128 -22167 44745 43281 52394 54390 12331 4166 65422 56825 30684 -11256
6189 -11256 -42558 -5960 28989 69119 46083 69891 66213 89866 90762 74861 53251 6684
6177 6684 7014 43545 52234 109924 97938 78384 75621 53035 56586 53104 47262 31858 13783
6164 13783 -61187 -108464 -34248 21526 28093 18814 49713 40893 55350 12506 5249 10221 -61831
6151 -61831 -60248 -34515 -33098 -46536 -69859 -62523 -87508 -76546 -28494 -54869 -63320 -59955 -40208
6138 -40208 -24758 -19988 -31104 -25789 17465 16742 -7491 2853 -20153 -47915 -48413 -4630 52428
6125E2428m72n8038j8200l9818j9955N738R4567q574l3258K970O1707N884n6715
6112a1736n1191M053P9555R536m2994k1492K9678j8483n3225K5347J9299L73k7441
6099e8721l4813L933N8998K6991j0881m3314j4761N8413K0142k5386k1486l3996
6087g4881J4475O3112J1837n1093N753j4308N182m4937l6337L1593Q7156M7530
6075D5082n989j2594p1569k229Q6130J4485k3358l4082n6707j0277p741O2628
6063a6221P2534m0997l7588j7090M2045J1692o915q090l3235k9426P2550N9292
6051F8551O118m6015o7246j642J5345j7894O267J3396J6388l0632J0071N2709
6039B5416R3085q136l2110j0195q0871k0669K7322j987J9437j2163K8301K2224
$$ plain form
6125 52428 51956 -6082 -24282 -64100 -84055 -78317 16250 7676 -25582 -22612 39095 44979 -11736
6112 -11736 -62927 -58874 20681 30217 -12777 -34269 -4591 -23074 -76299 -50952 -31653 -31280 -58721
6099 -58721 -93534 -89601 -30603 -3612 -14493 -57807 -72568 -14155 5987 -19399 -40885 -74881
6087 -74881 -60406 2706 14543 -36550 -30797 -45105 -39923 -84860 -121197 -89604 -2448 45082
6075 45082 39093 26499 -45070 -47299 38831 53316 29958 -4124 -60831 -71108 -78849 -16221
6063 -16221 56313 15316 -22272 -39362 2683 14375 7460 -630 -33865 -63291 9259 68551
6051 68551 74669 28654 -38592 -40234 -24889 -42783 -36516 -23120 -6732 -37364 -27293 25416
6039 25416 118501 110365 78255 68060 -12811 -33480 -6158 -8145 11292 -871 27430 49654
6027D9654K557l4030J5428j8154k0949j0433L793L694j8161m4225J2872K7111
6015c0843O788j521K7569O939R436j2102j9597L3556J442p2724q066k18J7013
6002d2328N5370j967m8517J3847m922j1149K3503L2120n8009J280K2903L862l9309
5989e3316K9552M8901j1N654m7449m8998l639N8800L8670r613l9631k622J5434
5976h268M919j2852J1402J6334J7526k0697l3815l2768k7342k9847k0695m9465
5964a85568K1811N0332R4425J7828l251n353n1714m7581K3073j9163L7409O1427
5952f325q017o608l343M4756p222j1649j4336q708J9340r682L7699J7756q0137
5939c6476l0411J0952K6795M238J6995K4495K7364j2814n6823j7328R688r394
$$ plain form
6027 49654 52211 18181 33609 15455 -5494 -15927 -12134 -8440 -26601 -70826 -57954 -30843
6015 -30843 -24055 -25576 1993 8932 18368 6266 -13331 20225 21667 -51057 -59123 -59341 -42328
6002 -42328 13042 11075 -37442 -23595 -28517 -39666 -16163 15957 -42052 -40772 -17869 -14007 -53316
5989 -53316 -23764 25137 25126 30780 -16669 -65667 -69306 -10506 28164 18551 -21080 -23702 -8268
5976 -8268 -3349 -16201 -4799 11535 29061 8364 -25451 -58219 -85561 -115408 -136103 -185568
5964 -185568 -163757 -113425 -19000 -1172 -4423 -9776 -61490 -109071 -85998 -105161 -67752 -6325
5952 -6325 -14342 -20950 -24293 20463 13241 1592 -12744 -21452 -2112 -11794 25905 43661 -36476
5939 -36476 -66887 -55935 -29140 -24902 -7907 16588 43952 31138 -25685 -43013 -33325 -42719
5927d2719L701J5144l8031L8846J4190j2429j9692q123k3645M785O6161M0710
5915C8898J2412j0529k6865N978L8071K14J7103r104n264j3956n4383m4464K3651
5902b8238Q028L1818l57J8325P3362R706k1461m6470R671n035l4358r126l0973
5889b5108p01O1185K5460k7892O868K818p9345L0074k101j2915k971j8567j6587
5876e9782M2281L9207J3768j0739J9773J9524Q988j9599l786N56m0714k0043r906
5863b0472r574J797J3991L365K0319k0377j4583m8447K4964J5372p130l7777J0379
5850f8173J3825J4972N0336L3416o5803n9850j3016L591M0649K8004L52k280K3277
5837g00n158l0981l912m7698n8056J2473L8330j7697n188L3683K5421l0206L5835
$$ plain form
5927 -42719 -39018 -23874 -61905 -23059 -8869 -21298 -40990 -49113 -72758 -67973 -1812 38898
5915 38898 51310 40781 13916 19894 57965 58179 75282 66178 60914 46958 -7425 -51889 -28238
5902 -28238 -20210 11608 11251 29576 102938 112644 91183 44713 54384 49349 14991 5865 -25108
5889 -25108 -25809 35376 60836 32944 39812 42630 -36715 -6641 -8742 -21657 -24628 -43195 -59782
5876 -59782 -17501 21706 35474 24735 44508 64032 73020 53421 49635 50191 9477 -10566 -20472
5863 -20472 -30046 -28249 -14258 -10893 9426 -10951 -25534 -73981 -49017 -33645 -40775 -78552 -68173
5850 -68173 -54348 -39376 10960 44376 -21427 -81277 -94293 -90702 -50053 -22049 -21697 -23977 -700
5837 -700 -5858 -36839 -40751 -88449 -146505 -134032 -95702 -113399 -118587 -84904 -59483 -89689 -53854
5824e3854L7196O490j9236J6839J9539O8686k1488r290J9480k961K363k4034m3520
5811c790r019l4422k8240K4413N1681O057j7283l980J3338M9174m010m9882o7075
5798g3038M530K8162J6493M9576j0110o5320m0302L8296K4640k0839j867K9990
5786a9789K7317O804M0528p1786m8403j1793R6570k3756j5929j1854j3634K6274
5774a9451M1762N586l3999j6784J7291K9734R328j4485j453l150L6084j4021o947
5761B9495k086m7544l0332n460L2763K9987J1398o614j3817j6359l5797O0816
5749F450O3485k7770k7892l0026j2250J9866j3545j1406M1056R637k2069R871
5737E407L7936J1862N058M0267j0800k7991l6770k8722j4175l322j0031j017L8897
$$ plain form
5824 -53854 -16658 -10168 -29404 -12565 6974 75660 54172 44882 64362 61401 63764 39730 -3790
5811 -3790 -12809 -47231 -75471 -51058 623 6680 -10603 -14583 -1245 47929 43919 -5963 -73038
5798 -73038 -68508 -40346 -23853 25723 15613 -49707 -90009 -51713 -27073 -47912 -49779 -19789
5786 -19789 7528 14332 54860 -16926 -65329 -77122 19448 -4308 -20237 -32091 -45725 -19451
5774 -19451 22311 27897 -6102 -22886 -5595 24139 33467 18982 17529 14379 50463 36442 29495
5761 29495 27409 -20135 -50467 -55927 -23164 6823 18221 11607 -2210 -18569 -54366 6450
5749 6450 69935 42165 14273 -15753 -28003 -8137 -21682 -33088 7968 17605 -4464 5407
5737 5407 43343 55205 60263 100530 89730 61739 24969 -3753 -17928 -21250 -31281 -32298 6599
5724F599K4282n7926o7265K337N3802j2701o357L9771k8802p653j4448L3242k0768
5711e5887m3818R189R905M7841O2491j7250J2339j1200Q030K3480o1464l9926
5699e6270o482L5112K1811K0635l6162l8083o122J2341L4921J5304n5471k96L4013
5686b4749p104K393L053j5018n473l4417N387M2223j2750Q164K218K6129j7228
5673b7172K8221j4909J6876k8609k2563L7775K4060k2022o3544k8211M087K5720
5661g0291p802M1546N0039K0037J1844l2113L9076J6748k6867m9079k1167K4120
5649c909r064J9842M1414k9489q792l9496N320J731j16M1275J9113m223l8881
5636e275P306J7382Q262l2241m802M9035L2354p761l1481o095k1490l2045M7378
$$ plain form
5724 6599 30881 -27045 -94310 -91973 -38171 -50872 -57229 -17458 -46260 -53913 -68361 -35119 -55887
5711 -55887 -99705 -90516 -80611 -32770 29721 12471 24810 13610 21640 45120 -16344 -56270
5699 -56270 -62752 -27640 -5829 14806 -21356 -59439 -65561 -53220 -18299 -2995 -58466 -58762 -24749
5686 -24749 -31853 -29460 -26407 -41425 -46898 -81315 -75928 -33705 -46455 -38291 -36073 -9944 -27172
5673 -27172 1049 -13860 3016 -25593 -48156 -10381 13679 -8343 -71887 -100098 -96011 -70291
5661 -70291 -78093 -36547 13492 33529 45373 13260 52336 69084 42217 -6862 -28029 -3909
5649 -3909 -12973 6869 48283 18794 10002 -29494 -24174 -22443 -22559 18716 37829 33606 -5275
5636 -5275 2031 19413 27675 -4566 -9368 39667 72021 64260 32779 26684 5194 -26851 20527
5623B0527L2746K604o4512m0587L353L680k8167j227P4573J0825l2349p969L3710
5610G207k5763j9069k4310J2474m1288L6465M0111k296k7401J9478N963n7247
5598g5676J381J5537L8695K4265K1898m7807j6805l0251N6574j1962m209m978
5586c3338P7126K1355o0404m3162K4201p097Q083k397j017K7536J8442J5735q442
5573C6621R871k7221n815j2891o8332J568K5309j4690K1250L2000K6304j3113
5561A0861j7028l8163N3565j7017j3165J8552L5955j4195k5591j6200k8456r642
5549f0524K4349K0925J8252k4608l5156r201K0406K6745N85p621J730K6804K3832
5536B6518P4574j4995l7431k3773q355J6800J4932Q93j5877J8793K3549q9672
$$ plain form
5623 20527 53273 55877 -8635 -49222 -45869 -42189 -70356 -71583 2990 13815 -18534 -26503 7207
5610 7207 -18556 -37625 -61935 -49461 -90749 -54284 -14173 -16469 -43870 -24392 -18429 -75676
5598 -75676 -74295 -58758 -20063 4202 26100 -21707 -38512 -68763 -12189 -24151 -28360 -33338
5586 -33338 43788 65143 4739 -38423 -14222 -21319 -13236 -15633 -16650 10886 29328 45063 36621
5573 36621 46492 19271 13456 565 -67767 -66199 -40890 -55580 -34330 -2330 23974 10861
5561 10861 -6167 -44330 9235 -7782 -20947 -2395 33560 19365 -6226 -22426 -50882 -60524
5549 -60524 -36175 -15250 3002 -21606 -56762 -65963 -45557 -18812 -18227 -25848 -24118 2686 26518
5536 26518 101092 86097 48666 24893 16538 33338 48270 49163 33286 52079 75628 -14044
5524a4044l5972O914o84k3827l5182K6156N6448o8251l4968k564N2335N0182J5558
5511g899k45j2530j7580R708L0833O238L5550n162J6064k7904q4559k6996q313
5498i2795J2553J6378J8570l6522L8039j2361l4793L3445L3884l3672r799o19
5486f7692L827N5514P467l873l665m852K5017K6720J675j6672M2699P648l747
5473G0066L7850l0144n3242J3470L5981j0223p9867m0938K6752K5586M8188J2652
5461E6131p236m0199l3593j3111K821J5326L586q061k2990M1199J6970J7170k4065
5448C948m9781n6482M3224P2313K634j1099k9337k235L40l1705J6935o169P4252
5435B6838M2701l5759o2055K5417J1856J9907L4723l4041o2631J1744n662L372
$$ plain form
5524 -14044 -50016 -43102 -43786 -67613 -102795 -76639 -20191 -88442 -123410 -125974 -73639 -23457 -7899
5511 -7899 -8144 -20674 -38254 -28546 2287 8525 44075 38913 54977 27073 -57486 -84482 -92795
5498 -92795 -80242 -63864 -45294 -81816 -43777 -56138 -90931 -57486 -23602 -57274 -67073 -67692
5486 -67692 -63865 -8351 -884 -4757 -8422 -13274 11743 38463 40138 23466 66165 73813 70066
5473 70066 107916 77772 24530 38000 73981 63758 -16109 -57047 -30295 -4709 43479 56131
5461 56131 48895 8696 -24897 -38008 -35187 -19861 -16275 -24336 -47326 -6127 10843 28013 3948
5448 3948 -45833 -102315 -59091 13222 15856 4757 -24580 -26815 -26475 -58180 -41245 -47414 26838
5435 26838 69539 33780 -28275 -2858 8998 28905 63628 29587 -33044 -21300 -26962 -23590
5423b3590L0802L0107k4331k5427J5534o05J3820J8146k9411j247j447m8238k5646
5410g1533K5426J0265M1483J1658Q735k2183J3917M7262j9851m9019k0440l2125
5398e6405J7479J0959j7249j1929j3012q775k4625R0313O6323Q737j20j6872N7642
5385A02466L9085Q045n3575j05182q2656N1331M4793N34J4276k1328j1561Q361
5373e411L3531K0492l2571J3035P850k2050K5740l2880L859k5136L9757j4996
5361A1220j7911j7538M8112P014j0301J473R6J1294j7643k709K3396k3347p0112
5348e6956k7298N328K226j2536J8859j3826K0924N5418J2342l3439j677k8302
5336e8937N410J5291J2933K1994L0142m687k740N7964K6656J4810k7581n3030
$$ plain form
5423 -23590 7212 37319 12988 -12439 3095 2490 16310 34456 5045 3798 2351 -45887 -71533
5410 -71533 -46107 -35842 5641 17299 26034 3851 17768 65030 45179 -3840 -24280 -56405
5398 -56405 -38926 -27967 -45216 -57145 -70157 -78932 -103557 -13244 53079 61816 61696 44824 102466
5385 102466 141551 149596 96021 -9161 -91817 -40486 4307 4841 19117 -2211 -13772 -5411
5373 -5411 28120 48612 16041 29076 36926 14876 40616 7736 11595 -13541 26216 11220
5361 11220 -6691 -24229 23883 30897 20596 22069 22165 33459 15816 13107 36503 13156 -56956
5348 -56956 -84254 -78926 -76700 -89236 -70377 -84203 -63279 -7861 4481 -28958 -30635 -58937
5336 -58937 -53527 -38236 -25303 -3309 26833 22146 19406 77370 104026 118836 91255 38225
5324C8225l2204m1504L1277j4430K8446o360R99L0016j8806M0833k2917m3128
5312i553J0594O0j0879L3748J4654m4116K5814j613n3516p875P697j1504K1148
5299b5341J4550l888j0779j4198J9323M5922o8902M0838J8900J5128K524l9241
5287e164j88R674N0806k2913l4273N2809K4381m6845j4201K5812m610m3984K476
5274f220m7082J5779n076K1144L6013K8416l0131j7064k3057M069K8049J0996
5262A5836q767Q708J6755j2067m8112l8985K4612L1616K3819K384K066J5544K8533
5249F1942J5044m0198j07647j0674Q2922n453n7336J9473M5771K8010J9056k111
5237D8799l0539m8924q629M3794k0684n485K641P666m0958K051L5186P744k1259
$$ plain form
5324 38225 6021 -35483 -4206 -18636 9810 3450 4449 34465 15659 56492 33575 -9553
5312 -9553 1041 1101 -9778 23970 38624 -5492 20322 18709 -34807 -42682 -34985 -46489 -25341
5299 -25341 -10791 -14679 -25458 -39656 -20333 25589 -43313 -2475 16425 31553 34077 -5164
5287 -5164 -5352 4322 55128 32215 -2058 50751 75132 28287 14086 39898 35288 -8696 -6220
5274 -6220 -53302 -37523 -42599 -21455 14558 42974 12843 -4221 -27278 -23209 4840 15836
5262 15836 7069 15777 32532 20465 -27647 -66632 -42020 -10404 13415 15799 17865 33409 61942
5249 61942 76986 36788 -70859 -81533 1389 -4064 -61400 -41927 3844 31854 50910 48799
5237 48799 18260 -30664 -39293 4501 -16183 -21668 -19027 -11361 -52319 -50268 -15082 -7338 -28597
5224b8597n1997N2881K8978J6781L5399K2680J7196m2920o4954n3027J6986L8921
5212a1673O884l1604l1895j4643n004m8843j1079O9469J6779O7394k6442n0940
5200g1597K7003J3658l7119l4278J1682O5132N1165m2110J2879K8912K6722m5821
5188F228m2680J8763M9872k7847k0623o7548o792Q1103M5820L7j8257r2m2893
5175b4909P80K4447K578R263j7716j907l77K2983J3968q693M6836j800m6587J9477
5161C8343J351K0117K9425j5560k2228j1911l4331l1563q640M3903j7298l626
5149a2018k5548q031R180m6104j5116k5810j7071P4635L7422R249l9331L8609
5137a9934M4716J6130n6139K8922N7808m6393l3457K012o723j4981R865k0215
$$ plain form
5224 -28597 -80594 -27713 1265 18046 53445 76125 93321 50401 -14553 -67580 -50594 -11673
5212 -11673 -4789 -36393 -68288 -82931 -87935 -136778 -147857 -78388 -61609 5785 -20657 -71597
5200 -71597 -44594 -30936 -68055 -102333 -90651 -25519 25646 -16464 -3585 25327 52049 6228
5188 6228 -36452 -17689 32183 4336 -16287 -83835 -90627 -9524 36296 36333 18076 17984 -24909
5175 -24909 -24129 318 2896 12159 -5557 -7464 -7841 15142 29110 20417 67253 65453 18866 38343
5161 38343 39694 59811 89236 73676 51448 39537 5206 -26357 -34997 8906 -8392 -12018
5149 -12018 -37566 -45597 -36417 -82521 -97637 -123447 -140518 -65883 -28461 -19212 -58543 -19934
5137 -19934 24782 40912 -15227 13695 71503 25110 -8347 -6335 -13058 -28039 -18174 -38389
5125c8389J922k657M3473N0061N7337L209q4502k9360m2678o3689q863R7334M5600
5112B8798K868r528J8472M7201J2682m8912j3660l2421m9592M071Q121P920M1477
5099A7497J9032K849j2669p108J0527o345n5340q404q121J9674L9174J6483j7734
5086I515J0156m3236l641m1263j7192L3371p112K8159P4547J5290p2720j9304
5074c3430n663J9154J3473K0132n0039m0041M8598J8286K0664q73K1567K3631
5062E5459J4610l7409q532k2623N2918L8642j9285q846j7570m02L7705p683n1679
5049B5305n3660l232j1321j2296K6064M0405N0722k4974l587N824k3489L4759
5037E0520M0968m2215K2606K2490l2226l8645l6249P049n05l6067J8287L6299
$$ plain form
5125 -38389 -36467 -39124 4349 54410 111747 114956 30454 1094 -41584 -105273 -114136 -16802 28798
5112 28798 31666 22138 40610 87811 100493 51581 37921 5500 -44092 -40021 -31900 -23980 17497
5099 17497 36529 39378 26709 19601 30128 23783 -31557 -39961 -48082 -28408 10766 27249 9515
5086 9515 19671 -23565 -27206 -68469 -85661 -52290 -59402 -31243 43304 58594 -14126 -33430
5074 -33430 -39093 -19939 -6466 13666 -36373 -76414 -27816 -9530 11134 10261 31828 55459
5062 55459 70069 32660 24128 1505 54423 93065 73780 64934 47364 46962 84667 76984 25305
5049 25305 -28355 -31587 -42908 -55204 -29140 11265 61987 37013 33426 39250 15761 50520
5037 50520 91488 49273 71879 94369 62143 23498 -12751 -5702 -6207 -42274 -23987 12312
5025A2312j1253m6935J4875j6767J4117L5427J7903j85n517m7138l933O1212M37
5012B4555Q491m438o895l9381j1477O196K9433L1077p889L2821N7180m4038k2137
4999E3498j8291l9056J1749J0419K464k892j7091j6600l3497J027L9908O780k7040
4986b8622l4740M113L2066o383k6880j5056K4922K4831K6349L1860N4527M3193
4974A30180j8883N20k764j0200j0602p442o101l7286j7443o5791j0780o472M4572
4961a8492N5452J2851n4568m0101P5232j5686l2645l590P3149J5584k9534j0540
4949B7112J589l8561l274k6445l687J3354J8308N3061P119m9567j2626J8335k2095
4936a7377O5707L1713k8412j3833l1376p103K074K3257K0243l4558k8152m2986
$$ plain form
5025 12312 1059 -45876 -31001 -47768 -33651 1776 19679 19494 13977 -33161 -37094 24118 24555
5012 24555 33046 28608 21713 -17668 -29145 -22949 6484 37561 29672 62493 119673 75635 53498
4999 53498 35207 -3849 7900 18319 20783 17891 800 -15800 -49297 -48270 -8362 -1582 -28622
4986 -28622 -63362 -59249 -27183 -33566 -60446 -75502 -50580 -25749 600 32460 86987 130180
4974 130180 111297 111817 109053 98853 88251 80809 74708 37422 19979 -45812 -56592 -63064 -18492
4961 -18492 36960 49811 -4757 -44858 30374 14688 -17957 -21547 51602 67186 37652 27112
4949 27112 28701 -9860 -13134 -39579 -43266 -29912 -11604 41457 48576 -991 -13617 4718 -17377
4936 -17377 48330 80043 51631 37798 6422 -681 1393 24650 44893 10335 -17817 -60803
4924f0803k1454m654n63N0848K9666J5468L834Q399k3694o1888K68L0786M3818
4911A0031j9195k7822p23J7498j6709l1195K6476Q6478j0329J4017n8674o1300
4899g1447J7364L3474N2881L765j0685Q038L0717k4405l9158J1J9489K6476J7802
4886F4322q946J457q913J3187k8649L787K4589J6331j4740q062l3822k289L6726
4873E4978j3571K4013j053j5411m6144m1090L8423Q6478K866O673J5205o2794
4861D8573n8936j0503j6080j8026K839N7371L8462J9199k2051k2763p386L3895
4849D4594M2467L4462n0010j287k0761m8669K3458l905L3899M2386k5277o4899
4837F458q981L1623P1L952P498K101P474k3039k7703J1309J8336R835j0348k6583
$$ plain form
4924 -60803 -82257 -86911 -87474 -36626 -6960 8508 12342 20741 -2953 -64841 -64573 -33787 10031
4911 10031 -9164 -36986 -37709 -20211 -36920 -68115 -41639 44839 34510 48527 -10147 -71447
4899 -71447 -54083 -20609 32272 36037 25352 33390 64107 39702 544 555 20044 46520 64322
4886 64322 55376 56833 47920 61107 32458 36245 60834 77165 62425 54363 20541 18252 54978
4873 54978 41407 65420 64367 48956 2812 -38278 145 86623 89489 96162 111367 48573
4861 48573 -10363 -20866 -36946 -54972 -52133 5238 43700 62899 40848 18085 10699 44594
4849 44594 87061 121523 71513 70226 49465 796 24254 20349 54248 96634 71357 6458
4837 6458 -2523 29100 29171 33123 40621 42722 50196 27157 -546 10763 29099 38934 28586 2003
4823B003j9138J2104j7138n8634K1672M2809J7080K0576J5166l4832l2753M572
4811b6513O0957J852o2056n4416K6673L3613l8999l0822L6373O989j065o6984
4799a14398j0362k5850L4230P2920O0960K8617j3050n280k7556O598N4453J2678
4787G3960o5688l3201J6557j1952j9788L8471M3851R91j9494j0878J728J8950
4775C3507K0927O195L4261k2576n0030l9618n0975k5648N0923M1106m022k9135
4763c5085J2637K4296K4874K6333o779m8783p59K8421m2312L7454M8971J0255
4751G9523l9367l0683k0055l3600L765j9982o487N7555K3854l2464J8358J3785
4739A4202m6665n1570j3419K3200J212m3803m167K7710K3084J3431p035J8677
$$ plain form
4823 2003 -17135 -5031 -22169 -80803 -59131 -16322 758 21334 36500 1668 -31085 -26513
4811 -26513 34444 36296 -25760 -80176 -53503 -19890 -58889 -89711 -53338 -46349 -47414 -114398
4799 -114398 -124760 -150610 -116380 -43460 17500 46117 33067 27787 231 6829 61282 73960
4787 73960 8272 -24929 -8372 -20324 -40112 -1641 42210 43201 23707 12829 14557 33507
4775 33507 54434 60629 94890 72314 22284 -17334 -68309 -93957 -43034 -1928 -5950 -35085
4763 -35085 -22448 1848 26722 53055 46276 -2507 -3266 25155 -17157 20297 69268 79523
4751 79523 40156 9473 -10582 -44182 -40417 -60399 -66886 -9331 14523 -17941 417 14202
4739 14202 -32463 -84033 -97452 -74252 -73040 -116843 -121010 -93300 -70216 -56785 -63820 -45143
4727d5143M3449J6466l7908Q868J2537M4331N558j320L2874j3099l5595k5963
4715E055l8209P398M8994j225J0093J4732j2754k4494k9997p634m002J2467Q8508
4702F8932R767n6910J7222O494P974l5140k5702k911j3461L8546J1711M2231l939
4689F4814j2456l1266k8506J9017J762l6909j0852K9876L1996K2291o5211k6070
4677d1514r23J6331j4640j5925m56k3051O805M4067M6071Q126N0522j2083m2571
4664B0759L159J324j6253j2257P558M5356j2816l1925n824J5288J8901K3080j6671
4651C9679N85l0243k5228M2671n0034L566J0423K43J1868O590K266K86k1513N909
4637b932l881l1030L6851N3741O8029k0521m9761k2559j6577m322k6244J4603
$$ plain form
4727 -45143 -1694 14772 -23136 -14268 -1731 42600 48158 46838 79712 66613 31018 5055
4715 5055 -33154 -25756 23238 22013 32106 46838 34084 9590 -20407 -28041 -32043 -19576 68932
4702 68932 78699 21789 39011 45505 53479 18339 -7363 -10274 -23735 14811 26522 68753 64814
4689 64814 52358 21092 -7414 11603 13365 -23544 -34396 -4520 27476 49767 -15444 -41514
4677 -41514 -42437 -26106 -40746 -56671 -57127 -80178 -73373 -29306 16765 24891 75413 63330 20759
4664 20759 23918 25242 8989 -3268 4290 49646 36830 4905 -919 14369 33270 56350 39679
4651 39679 40264 10021 -15207 27464 -22570 -19004 -8581 -8338 3530 10120 12386 12672 -8841 -2932
4637 -2932 -6813 -37843 -992 52749 120778 100257 50496 27937 11360 7038 -19206 -4603
4625d603L6039n160l2810m2474K725j577K6965J9942J1709R849K704n6266o1359
4612i4316M9084Q3860L411L3723k9048l3381j9471R80l2218J120J8996O005M729
4599f526l0555J5630o803n79k5304K7568k8450M1272O7246K9271l5850k7085j0636
4586I199j7976K523K0222L6116L7796O420K9788N110o5680o5357j4906M9873j7176
4573A5952J4056Q415j5521k4350k5890J5838P593L7931O5696l6571k2841j0963
4561B9345m5482J3179J9945k6081J9084J9464J522J9902P156k6525j5146l8139
4549b1776J0534L381l6460k0652K9080J9618L7187Q726j1759k3031r46j0758k3087
4536c9943J7121l6711K3937M3237q666p7437m4101K3702L7274M6635N8691j1892
$$ plain form
4625 -4603 31436 26276 -6534 -49008 -46283 -47860 -20895 -953 10756 20605 23309 -32957 -94316
4612 -94316 -45232 38628 42039 75762 46714 13333 -6138 -5158 -37376 -36256 -17260 -11255 -6526
4599 -6526 -37081 -21451 -28254 -28833 -54137 -26569 -55019 -13747 53499 82770 46920 19835 9199
4586 9199 -8777 -6254 13968 50084 87880 94300 124088 129198 63518 -1839 -16745 33128 15952
4573 15952 30008 38423 22902 -1448 -27338 -11500 -3907 34024 99720 63149 40308 29345
4561 29345 -16137 -2958 16987 -9094 9990 29454 30976 50878 58034 31509 16363 -21776
4549 -21776 -11242 -7861 -44321 -64973 -35893 -16275 20912 29638 17879 -5152 -6098 -16856 -39943
4536 -39943 -22822 -59533 -35596 7641 -1025 -78462 -122563 -98861 -61587 -14952 43739 31847
4524C1847j8718n178l5763J1141J5850o6163l137K2407J0665p532l890m21M3532
4511e360l2044j5148j0138j240m6753j023M1897L3693j3373j04P881O971J4905
4498a9836j224K5792J5728l9592k5497M991M101R310L2990j3594R184m295q060
4485a0002k8872K0139l985k1370K4026k225m3558M3696L2006O6537j1095j5998
4473D9299k5481k3742J5932O2552K1443R743p604m713m3973m5336k3873j2753
4461b8506j3019Q731N0045L2620p212k1750l8148k7076M6790O4642M4531k9859
4449H1789o5588k4086l2634K0518j6650p744J3387K8352L4214m5106J3738J1466
4437A1656j5015l3621J8412M867l3143K9209N8452K8942K3651k2059k8302n5486
$$ plain form
4524 31847 13129 7951 -27812 -16671 -821 -66984 -70121 -47714 -37049 -44581 -48471 -48892 -5360
4511 -5360 -37404 -52552 -62690 -63930 -110683 -111706 -69809 -36116 -49489 -49593 -41712 -34741 -19836
4498 -19836 -21060 4732 20460 -19132 -44629 -39638 -35537 -26227 6763 -6831 2353 -1942 -10002
4485 -10002 -38874 -18735 -22720 -44090 -20064 -22289 -65847 -22151 9855 76392 65297 49299
4473 49299 23818 76 16008 78560 100003 109746 102142 97429 53456 8120 -15753 -28506
4461 -28506 -41525 -32794 17251 49871 42659 20909 -17239 -44315 2475 67117 111648 81789
4449 81789 16201 -7885 -40519 -20001 -36651 -44395 -31008 -2656 31558 -13548 190 11656
4437 11656 -3359 -36980 -18568 -13701 -46844 -17635 40817 69759 93410 71351 43049 -12437
4425a2437J8875k0262j4692J3583J8443J3382j1535o4701J9084J2623J21K9181
4413A665q753m6987J7539n593l302K4513J3405K7255L8647K268l5863m0482k4522
4400d0210L6152l6414K0616M1378j261j5653j8800k62l3153J4081J0352J8341
4388d833j1297q624M2016M0202l3008n2154Q575K8892K4743J4040k3607k0203
4376D742R493J8999j235j459L8868j0487m9352k2933j8300K3357K3552p53J7226
4363C1718J3608m3089J3464k0760n012R344N7457O321n2065J8705N3147l5639
4351D7199L816M0064o4956m3246J5865M2822n9669k7161N1523j4688k4091J3219
4339a9303M3610j0406q471J8827p642m7518k462J6073J959m3101K909Q925L9409
$$ plain form
4425 -12437 6438 -13824 -28516 -14933 3510 16892 5357 -59344 -40260 -27637 -27516 1665
4413 1665 -7088 -54075 -36536 -42129 -45431 -20918 -7513 19742 58389 60657 24794 -15688 -40210
4400 -40210 -4058 -40472 -19856 21522 20261 4608 -14192 -14454 -47607 -33526 -23174 -4833
4388 -4833 -16130 -24754 17262 57464 24456 -27698 -19123 9769 34512 48552 24945 4742
4376 4742 14235 33234 31999 30540 69408 58921 9569 -13364 -31664 -8307 15245 14492 31718
4363 31718 45326 2237 15701 -5059 -10071 -727 56730 63051 10986 29691 82838 47199
4351 47199 51015 91079 26123 -17123 -1258 41564 -18105 -45266 6257 -8431 -32522 -19303
4339 -19303 24307 13901 5430 24257 16615 -30903 -33365 -17292 -15333 -58434 -55525 -46600 -7191
4326g191Q528j2482J4579l544L6046L1969n1514P233J0220k0408j8082l8592P58
4313d2480K0899m3120Q248K7578n3348r605O0100J5183n556l6408K175R1749O036
4300D1451j1469K042L7614K5039k6179j5702k1651k0888J7625j7987k816L3129
4288D0208J8527J3845k8701o511m3471k1831K0742l5073m1237n991j3168j0342
4276a13003l838l1134M3503M6251K3663j2278L4261K1057k7029M0504j0899k7938
4264a6880J0108j1308M456K3447n803J3817J4808j8756j4573j9670j4241N4201
4252A9606Q451k1998j5648K287K0214n542m6087j7484O1440Q4538K0863K1684
4240A32324l3119k3728m8113L771k2022k1119l1017O716K4287o750m9913o286
$$ plain form
4326 -7191 1337 -11145 3434 -110 35936 67905 16391 23624 33844 13436 -4646 -43238 -42480
4313 -42480 -21581 -64701 -56453 -28875 -82223 -91828 -31728 -16545 -22101 -58509 -56334 35415 41451
4300 41451 29982 32024 69638 94677 68498 52796 31145 10257 27882 9895 7079 40208
4288 40208 58735 72580 43879 37368 -6103 -27934 -7192 -42265 -83502 -89493 -102661 -113003
4276 -113003 -116841 -147975 -104472 -58221 -34558 -46836 -12575 8482 -18547 21957 11058 -16880
4264 -16880 -6772 -18080 -13624 9823 4020 17837 32645 13889 -684 -20354 -34595 19606
4252 19606 28057 6059 -9589 -7302 12912 7370 -38717 -56201 5239 89777 110640 132324
4240 132324 99205 75477 27364 31135 9113 -12006 -43023 -36307 -12020 -18770 -68683 -74969
4228g4969j7164R320N9301K6982K6529n5521l9699M9367M571k1050j488L7350
4216C529k4198n6049q635j7801J1692K8315N0821K1377Q314J0171k6521q0613
4204g9598n85K1606M5575J9216o8221k083J1011N8680Q201l5867p584J7940J8161
4191F452J458r700J6350k4801j2679L945J0088m962k1314k4433j7170Q593q882
4178g7055l1520l853J0738j9374o753M4423L8061J9209J1634l8449K9135l407
4166b7211K3383l5931n7162k047N6097K7667L0477J5084P43k156j6889j0041K176
$$ plain form
4228 -74969 -92133 -82813 -23512 3470 29999 -25522 -65221 -15854 -11283 -32333 -33821 3529
4216 3529 -20669 -76718 -85353 -103154 -91462 -63147 -12326 9051 17365 27536 1015 -79598
4204 -79598 -80183 -58577 -13002 6214 -62007 -64090 -53079 5601 13802 -22065 -29649 -11709 6452
4191 6452 7910 -1790 14560 -10241 -22920 -18975 -8887 -13849 -35163 -59596 -76766 -68173 -77055
4178 -77055 -108575 -112428 -101690 -121064 -127817 -83394 -45333 -26124 -14490 -52939 -23804 -27211
4166 -27211 -3828 -39759 -96921 -98968 -42871 -15204 15273 30357 31100 28944 12055 2014 4190
$$ [...]
##END NTUPLES=NMR SPECTRUM
##END=
