##TITLE=Analysis number 314853
Compound Code rh 00796
Project Code adrs
Chemist Name af chempharm
##JCAMPDX= 6.0         $$ Bruker NMR JCAMP-DX V2.0
##DATA TYPE= NMR SPECTRUM
##DATA CLASS= NTUPLES
##ORIGIN= Bruker BioSpin GmbH
##OWNER= NMR
$$ XWIN-NMR		Version 3.5
$$ Fri Oct 28 09:42:57 2005 GMT Daylight Time (UT+1h)  MAYBRIDGE\NMR@NMR_250MHZ
##.OBSERVE FREQUENCY= 250.131544655141
##.OBSERVE NUCLEUS= ^1H
##.ACQUISITION MODE= SIMULTANEOUS (DQD)
##.ACQUISITION SCHEME= undefined
##.AVERAGES= 16
##.DIGITISER RES= 18
##SPECTROMETER/DATA SYSTEM= dpx250
##.PULSE SEQUENCE= zg30
##.SOLVENT NAME= CDCl3
##.SHIFT REFERENCE= (INTERNAL, CDCl3, 0, 16.522)
##AUDIT TRAIL= $$ (NUMBER, WHEN, WHO, WHERE, WHAT)
$$ ##TITLE= Audit trail, XWIN-NMR		Version 3.5
$$ ##JCAMPDX= 5.01
$$ ##ORIGIN= Bruker BioSpin GmbH
$$ ##OWNER= NMR
$$ C:\u/data/dgb/nmr/ADRS/11500/pdata/1/auditp.txt
$$ ##AUDIT TRAIL=  $$ (NUMBER, WHEN, WHO, WHERE, WHAT)
(   1,<2005-10-28 09:42:14.47 +100>,<MAYBRIDGE\NMR>,<NMR_250MHZ>,
      <created by zg, POWCHK disabled, PULCHK disabled
       configuration hash MD5:
       62 19 C7 07 E1 42 D1 B7 37 6C 3D D0 77 39 F9 E6
       data hash MD5: 64K
       0B DD CF C0 55 FF 6C A8 DE DC 03 C9 52 12 35 E3>)
(   2,<2005-10-28 09:42:34.99 +100>,<MAYBRIDGE\NMR>,<NMR_250MHZ>,
      <Start of raw data processing
       ef LB = 0.3 FT_mod = 6 PKNL = 1 SI = 32K 
       data hash MD5: 32K
       14 4A 60 13 43 06 AD 25 3F 76 81 C3 5A 2A E0 27>)
(   3,<2005-10-28 09:42:39.50 +100>,<MAYBRIDGE\NMR>,<NMR_250MHZ>,
      <apk 
       data hash MD5: 32K
       D9 A5 34 5A A9 87 BB 4D 36 61 B8 25 A5 5D A5 91>)
(   4,<2005-10-28 09:42:40.85 +100>,<MAYBRIDGE\NMR>,<NMR_250MHZ>,
      <abs ABSG = 5 
       data hash MD5: 32K
       2E 88 0D 01 A6 EB 25 4C 7B DA 75 65 E9 C8 14 BC>)
$$ ##END=
$$ 
$$ hash MD5
$$ 9B 0E FF 24 5C 0D 62 46 DC FE 30 C4 55 5C 99 DB
##$RELAX= 
##$RELAX= 
##$RELAX= 
##$RELAX= 
##$RELAX= 
##$RELAX= 
##$RELAX= 
$$ Bruker specific parameters
$$ --------------------------
##$DU= <C:\u>
##$EXPNO= 11500
##$NAME= <ADRS>
##$PROCNO= 1
##$TYPE= <nmr>
##$USER= <dgb>
##$AMP= (0..31)
100 100 100 100 100 100 100 100 100 100 100 100 100 100 100 100 100 100 
100 100 100 100 100 100 100 100 100 100 100 100 100 100 
##$AQSEQ= 0
##$AQ_mod= 3
##$AUNM= <au_zg>
##$AUTOPOS= <4 >
##$BF1= 250.13
##$BF2= 250.13
##$BF3= 250.13
##$BF4= 250.13
##$BF5= 500.13
##$BF6= 500.13
##$BF7= 500.13
##$BF8= 500.13
##$BYTORDA= 1
##$CFDGTYP= 0
##$CFRGTYP= 5
##$CHEMSTR= <none>
##$CNST= (0..31)
1 1 145 1 1 1 1 1 1 1 1 1 1 1 1 1 1 1 1 1 1 1 1 1 1 1 1 1 1 1 1 1 
##$CPDPRG= <>
##$CPDPRG1= <>
##$CPDPRG2= <>
##$CPDPRG3= <>
##$CPDPRG4= <mlev>
##$CPDPRG5= <mlev>
##$CPDPRG6= <mlev>
##$CPDPRG7= <mlev>
##$CPDPRG8= <mlev>
##$CPDPRGB= <>
##$CPDPRGT= <>
##$D= (0..31)
0 1 0 0 0 0 0 0 0 0.06 0 0 0 0 0 0 0.0002 0 0 0 0 0 0 0 0 0 0 0 0 0 0 
0 
##$DATE= 1130488932
##$DBL= (0..7)
120 120 120 120 120 120 120 120 
##$DBP= (0..7)
150 150 150 150 150 150 150 150 
##$DBP07= 0
##$DBPNAM0= <>
##$DBPNAM1= <>
##$DBPNAM2= <>
$$ [...]
##$SUBNAM7= <"">
##$SUBNAM8= <"">
##$SUBNAM9= <"">
##$SW= 20.6930455092707
##$SWIBOX= (0..15)
0 0 3 0 0 0 0 0 0 0 0 0 0 0 0 0 
##$SW_h= 5175.983436853
##$TD= 65536
##$TD0= 1
##$TE= 296.16
##$TE2= 300
##$TE3= 300
##$TEG= 300
##$TL= (0..7)
0 120 120 120 120 120 120 120 
##$TP= (0..7)
150 150 150 150 150 150 150 150 
##$TP07= 0
##$TPNAME0= <>
##$TPNAME1= <>
##$TPNAME2= <>
##$TPNAME3= <>
##$TPNAME4= <>
##$TPNAME5= <>
##$TPNAME6= <>
##$TPNAME7= <>
##$TPOAL= (0..7)
0.5 0.5 0.5 0.5 0.5 0.5 0.5 0.5 
##$TPOFFS= (0..7)
0 0 0 0 0 0 0 0 
##$TUNHIN= 0
##$TUNHOUT= 0
##$TUNXOUT= 0
##$USERA1= <user>
##$USERA2= <user>
##$USERA3= <user>
##$USERA4= <user>
##$USERA5= <user>
##$V9= 5
##$VALIST= <valist>
##$VCLIST= <CCCCCCCCCCCCCCC>
##$VD= 0
##$VDLIST= <DDDDDDDDDDDDDDD>
##$VPLIST= <PPPPPPPPPPPPPPP>
##$VTLIST= <TTTTTTTTTTTTTTT>
##$WBST= 1024
##$WBSW= 4
##$XGAIN= (0..3)
0 0 0 0 
##$XL= 0
##$YL= 0
##$YMAX_a= 569702
##$YMIN_a= -481910
##$ZGOPTNS= <>
##$ZL1= 120
##$ZL2= 120
##$ZL3= 120
##$ZL4= 120
##$ABSF1= 16.522
##$ABSF2= -4.171173
##$ABSG= 5
##$ABSL= 3
##$ALPHA= 0
##$AQORDER= 0
##$ASSFAC= 0
##$ASSFACI= 0
##$ASSFACX= 0
##$ASSWID= 0
##$AUNMP= <proc_1d>
##$AZFE= 0.1
##$AZFW= 0.1
##$BCFW= 0
##$BC_mod= 0
##$BYTORDP= 0
##$COROFFS= 0
##$CY= 12.5
##$DATMOD= 1
##$DC= 0
##$DFILT= <>
##$DTYPP= 0
##$F1P= 14.0000005364418
##$F2P= -0.99999901652339
##$FCOR= 0.5
##$FTSIZE= 32768
##$FT_mod= 6
##$GAMMA= 0
##$GB= 0
##$INTBC= 1
##$INTSCL= 1
##$ISEN= 128
##$LB= 0.3
##$LEV0= 0
##$LPBIN= 0
##$MAXI= 10000
##$MC2= 0
##$MEAN= 0
##$ME_mod= 0
##$MI= 0
##$NCOEF= 0
##$NC_proc= -3
##$NLEV= 6
##$NOISF1= 0
##$NOISF2= 0
##$NSP= 0
##$NTH_PI= 0
##$NZP= 0
##$OFFSET= 16.522
##$PC= 1
##$PHC0= 72.92521
##$PHC1= 5.332025
##$PH_mod= 1
##$PKNL= yes
##$PPARMOD= 0
##$PSCAL= 4
##$PSIGN= 0
##$REVERSE= no
##$SF= 250.13
##$SI= 32768
##$SIGF1= 0
##$SIGF2= 0
##$SINO= 400
##$SIOLD= 32768
##$SREGLST= <1H.CDCl3>
##$SSB= 0
##$STSI= 32768
##$STSR= 0
##$SW_p= 5175.98343685301
##$SYMM= 0
##$S_DEV= 0
##$TDeff= 65536
##$TDoff= 0
##$TI= <Analysis number 999999
Compound Code 99
Book Reference 9
Project Code 9>
##$TILT= no
##$TM1= 0
##$TM2= 0
##$TOPLEV= 0
##$USERP1= <user>
##$USERP2= <user>
##$USERP3= <user>
##$USERP4= <user>
##$USERP5= <user>
##$WDW= 1
##$XDIM= 32768
##$YMAX_p= 284697183
##$YMIN_p= -361905
$$ End of Bruker specific parameters
$$ ---------------------------------
##NTUPLES= NMR SPECTRUM
##VAR_NAME=  FREQUENCY,     SPECTRUM/REAL,   SPECTRUM/IMAG
##SYMBOL=    X,             R,               I
##VAR_TYPE=  INDEPENDENT,   DEPENDENT,       DEPENDENT
##VAR_FORM=  AFFN,          ASDF,            ASDF
##VAR_DIM=   32768,         32768,           32768
##UNITS=     HZ,            ARBITRARY UNITS, ARBITRARY UNITS
##FACTOR=    0.157963299565203, 1,           1
##FIRST=     4132.6476996994, 0,             0
##LAST=      -1043.33573715361, 0,           0
##MIN=       -1043.33573715361, -361905,     0
##MAX=       4132.6476996994, 284697183,     0
$$ Real data points
##PAGE= N=1
##DATA TABLE= (X++(R..R)), XYDATA
$$ [...]
16424a5983L071R880K1880J1233j8854n332k424k652o660m1308j3045K4100M410
16411c1684p820L3981K6739o331j6803r466j2633m780P03m642l709j0970R659
16398c7756L074j2384L5722J9262k2701k2047J3610J4319J7353k717P660Q8J5517
16385B9000J6885J5861J1698j829k7175j1928j2044j8317n188j5870n899K4351
16373d55j1715l0034R720J5684J6297j0778k546J5621J7605J1026j750M004j7389
16360A5290q108m46j2199j1757J7804p061J9922K8972j2438j6831K305j7311J8620
16347A6762N51j3093O302r799J4447j4642l2101n79L2710J5410P190Q337o712
16334B4783M420j2841n756N766l1502j455K2219r49o078k287J4749j2259j8770
$$ plain form
16424 -15983 -12912 -3032 18848 30081 11227 5895 3471 819 -5841 -47149 -60194 -36094 -31684
16411 -31684 -39504 -5523 21216 14885 -1918 -11384 -24017 -28797 -28094 -32736 -36445 -47415 -37756
16398 -37756 -34682 -47066 -11344 7918 -14783 -36830 -23220 -8901 8452 5735 13395 13483 29000
16385 29000 45885 61746 73444 71615 44440 32512 20468 2151 -3037 -18907 -24806 -455
16373 -455 -12170 -42204 -32484 -16800 -503 -11281 -13827 1794 19399 30425 28675 32679 15290
16360 15290 7182 6736 -5463 -17220 584 -6477 13445 42417 29979 13148 15453 -1858 16762
16347 16762 17313 4220 10522 723 15170 528 -31573 -32152 558 15968 23158 31495 24783
16334 24783 29203 16362 10606 16372 -15130 -16585 5634 4685 -1393 -3680 11069 -1190 -19960
16321a9960N109K1509j0749m779K4403j4598K402j3584o227N331P372p313k1034
16308c2118q30J3237L4284M410k5074O763Q04j4955K089J4106j5353p68r087j7396
16294c9888J2853L5299j3027j5555O177J3278k3217j4788J1063j4997j0305m857
16282e7964M3194K7407j2542K871R173K2598j932j4888k2883J467k06p986j3743
16269b5434o209J7710K1268j3786J642p699o465J2094J8586J7018J8107j166k2352
16256B3314k9212l0937J5111J7166L205J5977j9127n840J285K89J2162M6370J6117
16243F5880n678m0736m6757k6177M728l022L826J8619K2360l354O532N645L08
16230B174K4705n920r069R353j9516k2290m093J0881J0678q267j6589r909J5728
$$ plain form
16321 -19960 -14851 6658 -4091 -8870 15533 935 3337 -10247 -16474 -11143 -3771 -11084 -32118
16308 -32118 -32948 -19711 14573 18983 -6091 672 1476 -13479 -11390 2716 -12637 -13405 -22492 -39888
16294 -39888 -27035 8264 -4763 -20318 -14141 -863 -24080 -38868 -27805 -42802 -53107 -57964
16282 -57964 -14770 12637 95 2966 12139 34737 32805 17917 -4966 -3499 -3705 -11691 -25434
16269 -25434 -31643 -13933 7335 -6451 -4809 -12508 -18973 -6879 11707 28725 46832 45666 23314
16256 23314 -5898 -36835 -21724 -4558 -1353 14624 -4503 -10343 -9058 -8769 3393 49763 65880
16243 65880 60202 19466 -27291 -53468 -48740 -51762 -47936 -29317 -6957 -10311 -3779 1866 2174
16230 2174 26879 20959 11890 21243 1727 -20563 -24656 -13775 -3097 -11364 -27953 -37862 -22134
16217b2134R417J2849k5631j4153J1956K8839J7677M7N696J502n550L03r413J4759
16203B6164N028k6786j6609P192M4729K0514l211J614l4706k3968M740M492p763
16190A430O104M288P648j7388j6991j7245P876p07J8459M24p338k1396J676J1988
16176b1172K0765j9611J1340K0843j250j226j706k16M432k3232k9739P081J4141
16163a9550p9M412N110k2013j3055L2437L9727M364k4355R608L881p369j1903
16150A215j8672j8518L214M2838J2996j08n607K4603J7133k0427l8762k3285J6161
16137g219L4525j8071m861j4917o564J1806l923j5011l886J2957J6122J5594J2657
16124B9209J9335j7304l2163r926K5092J7871j9367m371k2157L229J6414K1104
$$ plain form
16217 -22134 -12717 132 -25499 -39652 -27696 1143 18820 18867 24563 26065 20515 20818 11405 26164
16203 26164 31192 4406 -12203 -5011 39718 60232 57021 58635 23929 -39 4701 9193 1430
16190 1430 7534 11822 19470 2082 -14909 -32154 -24278 -24985 -6526 -6102 -13440 -34836 -33160 -21172
16176 -21172 -407 -20018 -8678 12165 10915 9689 7983 7767 12199 -11033 -40772 -33691 -19550
16163 -19550 -19629 -15217 -10107 -32120 -45175 -12738 26989 31353 6998 16606 20487 13118 1215
16150 1215 -17457 -35975 -32761 10077 23073 22965 17358 41961 59094 38667 -95 -23380 -7219
16137 -7219 27306 9235 4374 -10543 -17107 -5301 -9224 -24235 -28121 -15164 958 16552 29209
16124 29209 48544 31240 -923 -10849 14243 32114 12747 8376 -13781 -10552 5862 26966
16112B6966O589l6294L1066L7132L260k5919l2253k4922q579m563M818k3766M204
16099d2261K7173p497J950J8078K4670k4060n976J3500J2794N175Q005k6153j561
16086C837n740R383l144J1349J9954K6616j1432l9689j7914O416J2131J7994l4068
16073d307q876k6939K305K9181J9540j5373R031n352l6655m6494k904J9515L1724
16060c5604J4449m0399L348O315L4843L0511R121L607j1329O716m698O870q136
16047A5614M420K18J2489k0070j1104q308p295J6699N356J428k998k8512j5254
16034c7317j0339P873J2323J5863J9501K692L0867k5793k5685L055O999M52j6259
16021a5768o726O958M284K5017J1622p703p693K8036L8374l9281o7357j0783Q522
$$ plain form
16112 26966 33555 -2739 28327 65459 68719 42800 10547 -14375 -22954 -27517 -22699 -46465 -42261
16099 -42261 -15088 -22585 -20635 -2557 22113 -1947 -7923 5577 18371 23546 31551 5398 3837
16086 3837 -1903 7480 4336 15685 35639 62255 50823 11134 -6780 -364 11767 29761 -4307
16073 -4307 -13183 -40122 -37817 -8636 10904 -4469 4562 -790 -37445 -83939 -86843 -67328 -35604
16060 -35604 -21155 -61554 -58206 -51891 -17048 13463 22584 26191 14862 21578 16880 23750 15614
16047 15614 20034 20252 32741 12671 1567 -6741 -14036 2663 8019 9447 6449 -22063 -37317
16034 -37317 -47656 -39783 -27460 -11597 7904 10596 41463 15670 -10015 -6960 39 491 -15768
16021 -15768 -22494 -15536 -11252 13765 25387 17684 9991 38027 76401 37120 -30237 -41020 -32498
16008c2498L0016K8522N643l7787j2047J1488J4449K748j802j3116O070K8608
15996C0294O905r428j4558k718j1901N240j0089P491M851K4820O883r614n56N614
15982C3234m903j826O9k4393j1577o348j6421L079J5960R445j8521J6057j4185
15969b0330q733q637M696K7261p375M570r677j4881r172n309M6251J3637k7141
15956a4840o507J2077j0121J733J29m995J6236R893K289N81o321J8367q356j7341
15942g176O764J6813J9360j4421l5560j2627L3130P877J0455j0943j7843r986
15930a4157j3747o685L379J3K8498k679K347M375L7108l172k3289l5462j2365
15917c5836K8389j4642k7580R848K9705N949N514O041j278j7642J3613K7833k6537
$$ plain form
16008 -32498 -2482 26040 31683 -6104 -18151 -6663 7786 10534 8732 -4384 1686 30294
15996 30294 37199 27771 13213 10495 -1406 3834 -6255 1236 6087 30907 37790 28176 27620 33234
15982 33234 28331 26505 26574 2181 -9396 -15744 -32165 -29086 -13126 -3681 -22202 -6145 -20330
15969 -20330 -29063 -37700 -33004 -5743 -13118 -8548 -18225 -33106 -42278 -47587 -1336 12301 -14840
15956 -14840 -21347 -9270 -19391 -17658 -17529 -22524 -6288 3605 5894 6475 154 18521 10165 -7176
15942 -7176 -412 16401 35761 21340 -14220 -26847 6283 14160 24615 13672 -4171 -14157
15930 -14157 -27904 -34589 -31210 -31197 -2699 -5378 -3031 1344 38452 35280 11991 -23471 -35836
15917 -35836 -7447 -22089 -49669 -39821 -10116 -4167 1347 7388 6110 -11532 2081 29914 3377
15904C377k8894l204L726r55R838r565L908j5024j470q194J7790K4315P952L57
15890C957J4027j662j4409l296J9143M380j8223K215J5569k3407j092Q011j203
15877D010P255l897Q421k1764M935j7035n476j3105J2870J2949J494J9386N831
15864A5874O494j1073j4055O771J2259k783j9331k243K623r839Q126J661J7271
15851A1755n312R574K294k3144k0987k1746j7484m132K2637N868O960Q601n905
15838c1021J648m24m431J0426N1706L5084j0094j7489o529J5981j5583k2583j1201
15825d510j6859r189O095j2518l4034k271m742J0975R599J1421r171K4907J7743
15812a2554J4592n716K5994J6516p228K722J0303k1544l8454J4976j1777m667
$$ plain form
15904 3377 -25517 -28721 -24995 -25950 -16112 -25677 -21769 -36793 -38263 -46457 -28667 -4352 3600 3957
15890 3957 17984 16322 1913 -1383 17760 22140 3917 6132 21701 -1706 -2798 5213 4010
15877 4010 11265 7368 15789 -5975 -1040 -18075 -23551 -36656 -23786 -10837 -9343 10043 15874
15864 15874 22368 11295 -2760 4011 16270 13487 -5844 -8087 -5464 -15303 -7177 -5516 11755
15851 11755 6443 16017 18311 -4833 -25820 -47566 -65050 -69182 -46545 -40677 -33717 -25116 -31021
15838 -31021 -29373 -29797 -34228 -23802 27904 62988 52894 35405 28876 44857 29274 6691 -4510
15825 -4510 -21369 -30558 -24463 -36981 -71015 -73286 -78028 -67053 -57454 -46033 -55204 -30297 -12554
15812 -12554 2038 -3678 22316 38832 31604 34326 44629 23085 -15369 -393 -12170 -16837
15800a6837L384p305J0556N354j9566J3175L956L5443M649l6851l445j2143j7320
15787c6950q487J5137K552r648q810J4688J5509K644J7110m598J4863j8529l7842
15774d2361j4470J3078k892R69J3768J5972K2799j9207j2604L3311J5695j7050
15762G008k0733O04k3291o087M420J5757J7982p663N717K4727J394m5088j1649
15749c6902j2656m297k857K813J6600J9274L0712j951J785J0766l057J7961k8901
15736I290j831R904q471p431K2466k776Q642M66j4893k0437J4507M402m216K7194
15722C6816k4107j695j7712p846Q755l693k0381q962j0646J6236J5436J1982j678
15709g495J2454l084j0779J226L296j543K9218N590j6496k3166o185k479N130
$$ plain form
15800 -16837 -13453 -20758 -10202 -4848 -24414 -11239 -7283 28160 32809 -4042 -7487 -19630 -36950
15787 -36950 -45437 -30300 -27748 -37396 -46206 -31518 -16009 -13365 3745 -853 14010 -4519 -42361
15774 -42361 -56831 -43753 -46645 -45676 -31908 -15936 6863 -12344 -24948 8363 24058 7008
15762 7008 -13725 -13121 -36412 -42499 -38079 -22322 -4340 -12003 -6286 18441 19835 -25253 -36902
15749 -36902 -49558 -53855 -56712 -53899 -37299 -18025 12687 10736 12521 23287 20230 38191 9290
15736 9290 7459 17363 8892 1461 23927 21151 29793 30259 15366 -5071 9436 13838 9622 36816
15722 36816 12709 11014 -6698 -14544 -5789 -9482 -29863 -38825 -49471 -33235 -17799 -5817 -7495
15709 -7495 4959 1875 -8904 -7678 -4382 -5925 23293 28883 12387 -10779 -16964 -19443 -14313
15696a4313J3821j5442m1588M1740M0305r668k0843j729K267K9436J1671J0385
15684D6042l7496l1486J8830L2560J3499N776k1171m3733o410j522q565K2498
15672a1178K5436K2738p074l3315M236J4858J271k5974j4542K2239K5718j6049
15660H364k7474r258M408L5491R430j1843k5285q904P825J1487j4410l519j9152
15647d2840p522Q380N853J0410K2259Q459K592j4907k7429R664K5492L0103N874
15634C6388o331l3225j2584j0649m378k8236K4560L5317J2137O89O217j9074j1458
15621a0627j743J0203P375N081N287r185j9765M120k831r573J7665O735j6014
15608a3272J5569r306j065r570j7113q35J9239r503M106J6264J8008k5994J8935
$$ plain form
15696 -14313 -492 -15934 -57522 -15782 24523 14855 -5988 -7717 -5450 23986 35657 46042
15684 46042 8546 -22940 -4110 28450 41949 47725 26554 -17179 -23589 -25111 -33676 -11178
15672 -11178 14258 36996 29922 -3393 843 15701 16972 -9002 -23544 -1305 24413 8364
15660 8364 -19110 -28368 -23960 11531 20961 9118 -16167 -25071 -17246 -5759 -20169 -23688 -42840
15647 -42840 -50362 -41982 -36129 -25719 -3460 4999 7591 -7316 -34745 -25081 411 30514 36388
15634 36388 30057 -3168 -15752 -26401 -30779 -59015 -34455 862 12999 13688 19905 831 -10627
15621 -10627 -12370 -2167 5208 10289 15576 6391 -13374 -9254 -12085 -21658 -3993 2742 -13272
15608 -13272 2297 -7009 -8074 -17644 -34757 -35592 -16353 -25856 -21750 -5486 12522 -13472 5463
15595E463K2147m833Q613k541k2990j5819j4859K22K3339l082j666J710P865n742
15581b173j498m730J1834j8459r145J0417J8504j1506j8193M549R54P692K462
15568i292j6530q717O07o451J4141M5413J2829P7J9304M732k0780k4486k078k3102
15554a4333k6280Q4R853P865J2304n388k0524L2751K1431j1978j7938k2696j7319
15541e2168M2759K9071j738l587j1414k864k7139J2181k44K639J5014J1557N209
15528A9276m907L550K2468K0685L33k4767j7066k1389r563K7246j297k1878k3496
15515c0805n651J3326k217l4569P491L0072L911L234K011l76k305o958m611l2430
15501e9877L807N0979J9573Q234j9328j6882K9533J9436k721J1175q824j5878
$$ plain form
15595 5463 27610 22777 31390 28849 5859 -9960 -24819 -24597 -1258 -4340 -6006 -4296 3569 -2173
15581 -2173 -3671 -8401 3433 -15026 -24171 -13754 4750 -6756 -24949 -20400 -19446 -11754 -9292
15568 -9292 -25822 -34539 -33932 -40383 -26242 19171 32000 32077 51381 56113 35333 10847 8769 -14333
15554 -14333 -40613 -40529 -30676 -22811 -10507 -15895 -36419 -3668 17763 5785 -12153 -34849 -52168
15541 -52168 -9409 19662 17924 14337 2923 59 -27080 -14899 -15143 -12504 2510 14067 19276
15528 19276 14369 17919 40387 61072 61405 36638 19572 -1817 -11380 15866 14569 -7309 -30805
15515 -30805 -36456 -23130 -25347 -59916 -52425 -22353 -18442 -15208 -13197 -13573 -15878 -22836 -27447 -59877
15501 -59877 -56070 -5091 14482 22716 3388 -13494 16039 35475 32754 43929 35105 19227
15489A9227K5450O111j8308k6761k1337p980L4055R795j6188k6271j8150o285
15477d6642L5961M1525o694k8669k7864j5829q645K6033J4979n125J2061J6005
15465G096m654k7137j5629J0612K262j2746Q598M437L992J1273L315k2311k2086
15452e2978j4968K6213M3506R481q480m4575l3799J6408L8654K1926j3445Q758
15440c299J5472R55j5557k1010J4307M232j6747l084j7575J9427l141p501k5033
15427e8554L097J7841J3513r285q376K1659J5649q70n713L863R327j3329j9425
15414c0603K2416R137r552j1385l649O56L734o427L3682J5766L164m919j4255
15401G765k0073j3763L3283L2474J0795j2759k8085j138r679k1312j5759L197
$$ plain form
15489 19227 44677 50788 32480 5719 -15618 -23598 10457 20252 4064 -22207 -40357 -46642
15477 -46642 -10681 30844 24150 -4519 -32383 -48212 -56857 -30824 -15845 -20970 -8909 7096
15465 7096 2442 -24695 -40324 -29712 -27450 -40196 -31598 -27161 -23169 -11896 -8581 -30892 -52978
15452 -52978 -67946 -41733 1773 11254 2774 -41801 -75600 -59192 -20538 1388 -12057 -3299
15440 -3299 12173 13128 -2429 -23439 -9132 -4900 -21647 -24731 -42306 -22879 -26020 -33521 -58554
15427 -58554 -55457 -37616 -24103 -33388 -41764 -20105 -4456 -5326 -11039 -7176 2151 -11178 -30603
15414 -30603 -8187 950 -8602 -19987 -23636 -22980 -19246 -25673 8009 23775 26939 22020 7765
15401 7765 -12308 -26071 7212 39686 50481 37722 9637 8499 -1180 -22492 -38251 -35054
15389c5054Q043O051j5978n354M4403R312k2280k4700K8863L7853k3894j9032
15377a1767k071r754k3391J0052L4094Q444j6472J2311r616M79j2056J2684R401
15364B338k562J728k4277K4623K0146m972k0178L782K0734r212K0641J1361k6082
15351A8070J473J6943j5573J6734J952j7207k3581J6476k3005o954k759J4993
15339b438J5414k579r330j5857n748k1019n160K9253J3035Q944Q005j8424l4982
15326d0886P045Q613K4203K04l07J0985q301J0701J7220j727m0823l0860r032
15313e2965K392q71J530K526K2029L6711L1516m818K272K347n257n704p131j1678
15299A2899j8561j5992j3568L788K3016L5738K6338l0642j3276L414q897l055
$$ plain form
15389 -35054 -27011 -20960 -36938 -42292 2111 11423 -10857 -35557 -6694 31159 7265 -11767
15377 -11767 -13838 -23592 -46983 -36931 -2837 5607 -10865 1446 -8170 -7691 -19747 -7063 2338
15364 2338 -224 1504 -22773 1850 21996 17024 -3154 628 21362 12150 32791 44152 18070
15351 18070 19543 36486 20913 37647 39599 22392 -1189 15287 -7718 -14672 -17431 -2438
15339 -2438 12976 10397 1067 -14790 -20538 -41557 -46717 -17464 -4429 4515 12520 -5904 -40886
15326 -40886 -33841 -25228 -1025 -821 -1128 9857 1556 12257 29477 27750 -13073 -43933 -52965
15313 -52965 -50573 -51444 -49914 -47388 -25359 11352 42868 38050 40322 42669 37412 31708 24577 12899
15299 12899 -5662 -21654 -35222 -31434 -8418 27320 53658 23016 9740 13154 4257 1202
15287A202j8868p088J0560j1574p345L2109l977J5758q66k4584p644r507J818
15274c0006K230K2561R299J662Q410J617k4747j5707L276J8246k3866P961L8617
15261A9553O597J9929r275o0145o688J3505J6878K0239J3433j1472k1565j3073
15249a2084m217j1952L466K6327O434j8326k2162m854M701L5833q21M739l704
15236C380l297q417j3499q34p628r607J0405L5487P142j0614r969k6291K204R628
15222b1910K8850Q470k0574k6820k925J3857j9973K5382K3731j1425k2786O65
15210b5458L9205J6236J3418j1313k1696j0110k1685L179m579P728j0001j0307
15198c5383N266l437J0736J3201J0767j4690r930j6l698o109J749q508j7480L4522
$$ plain form
15287 1202 -17666 -24754 -14194 -25768 -33113 -1004 -4981 10777 9911 -14673 -22317 -31824 -30006
15274 -30006 -27776 -5215 4084 5746 14156 15773 -8974 -24681 -21405 -3159 -27025 -19064 19553
15261 19553 26150 46079 36804 -23341 -30029 -16524 354 20593 34026 22554 989 -12084
15249 -12084 -16301 -28253 -24787 1540 7974 -10352 -32514 -37368 -32667 3166 2345 7084 3380
15236 3380 83 -8334 -21833 -22667 -30295 -39902 -29497 5990 13132 2518 -7451 -33742 -31538 -21910
15222 -21910 6940 15410 -5164 -31984 -34909 -21052 -41025 -15643 8088 -3337 -26123 -25458
15210 -25458 13747 29983 43401 32088 10392 282 -21403 -18224 -22803 -15075 -25076 -35383
15198 -35383 -30117 -33554 -22818 -9617 1150 -13540 -23470 -23486 -27184 -33293 -31544 -40052 -57532 -23010
15184b3010J5067j9180R53J3953l908k0124K0757L507N360l035j5629j6o634j9902
15170e1841O373J1275q764n191j857L860O84J3403K7894o654k5286p699K3464
15157b0339K859o103K463N923j39R395J5150L2091J742q261j3082M92O68l0914
15143h055k8353J1626L3226J2097q018k6293j5244j6683j1396J4983J385J3445
15131b7280J5725M021l2141j9557n296J1034J6722J7074m312O87K9374Q53J0894
15118A7798o566J6576J0989n627p28N161n668K0868k836l8995l7923k2552J7889
15105c1614K5791n764k9443p603O238L061l927Q783K1555J02j9877J6140R230
15092g328N02L6305J7465j2933m428j5822l6575m911j8688Q147n05j289J967J1051
$$ plain form
15184 -23010 -7943 -27123 -26170 -12217 -16125 -36249 -15492 -11985 -6625 -9660 -25289 -25305 -31939 -51841
15170 -51841 -45468 -34193 -42957 -48148 -50005 -46145 -45461 -32058 -4164 -10818 -36104 -43803 -20339
15157 -20339 -17480 -23583 -21120 -15197 -15336 -5941 9209 41300 43042 34781 21699 22191 22859 -8055
15143 -8055 -36408 -24782 8444 20541 12523 -13770 -29014 -45697 -57093 -42110 -40725 -27280
15131 -27280 -11555 -7534 -39675 -59232 -64528 -53494 -36772 -19698 -24010 -23323 6051 6904 17798
15118 17798 11232 27808 38797 33170 32442 37603 31935 52803 49967 10972 -26951 -49503 -31614
15105 -31614 -5823 -11587 -41030 -48633 -42395 -39334 -43261 -34478 -12923 -12821 -32698 -16558 -7328
15092 -7328 -6826 29479 46944 34011 29583 13761 -22814 -27725 -46413 -38266 -38771 -40060 -38093 -27042
15078b7042K5783J1666j0234j0586R74P720j288J8301l8042P744R550m555m647
15065a4656R065K7392j0830l0728k5234J4567J3468l3647k4679n543K1939K8780
15053c0106K5719K0725J601j1083p147J2225J4166r950N382o605k811m519L100
15040A0697J7447j0980L43l201K102k903j0063M240r732K224o9k7778j4086K3941
15026a7818R033M488J6495l880j5129K4987k3777Q213J3466J7800J2333j1448
15014C4763k3257J9892l45j9053J063O044N126j6090l782k3053k8785J5938K4393
15001g146K2846J6483J53r745k2659j2043M907P004L076O938M076k9331n680J0769
14987a0352K546m888O252K1341n584J023k4136k1724j438J4307R708l39k2656
$$ plain form
15078 -27042 -1259 10407 173 -10413 -9439 -1719 -3007 15294 -22748 -15004 -5454 -10009 -14656
15065 -14656 -5591 21801 10971 -19757 -44991 -30424 -16956 -50603 -75282 -80825 -58886 -30106
15053 -30106 -4387 16338 17939 6856 -291 11934 26100 16150 21532 14927 12116 7597 10697
15040 10697 28144 17164 17507 14306 16408 13505 3442 7682 -2050 174 105 -27673 -41759 -17818
15026 -17818 -8785 -4297 12198 8318 -6811 18176 -5601 2612 16078 33878 46211 34763
15014 34763 11506 31398 31053 12000 13063 19107 24233 8143 4361 -18692 -47477 -31539 -7146
15001 -7146 15700 32183 32336 22591 -68 -12111 -7204 -200 2876 9814 13890 -15441 -21121 -10352
14987 -10352 -7806 -12694 -6442 14899 9315 10338 -13798 -35522 -36960 -22653 -12945 -13284 -35940
14974c5940J023K9330j5844k2783Q542q509J5796K1071M673r032J1818N813j5451
14961i493R813l163j4060l916K794J2561M342J9695J1640j1824j9415q194j5090
14948b4310l0178j8108j7478l830J7947L7125M0510J5302J911k5027j3314K3515
14936D065K6260k2333m5366p935L1357J9852J3389J6674l2919k3810J2955q608
14924a6419l135O952o240K4588J0479N300k1110l246l521K9358J182J4491O467
14911D5146l5916j6053K0181m106r64L440k6113l5725J339J9481M8920J4650k3246
14898A1034l1431K0384j5589j1693L5504n396J5938m456j1375J4018N413k792
14886A9559k796j2028n40J2889N412L675l0755k0591R288k1694l1467L7290K3338
$$ plain form
14974 -35940 -34917 -5587 -21431 -44214 -35672 -44181 -28385 -7314 -2641 -11673 145 5958 -9493
14961 -9493 320 -2843 -16903 -20819 -18025 -5464 -1122 18573 30213 18389 -1026 -9220 -24310
14948 -24310 -54488 -72596 -90074 -93904 -75957 -38832 1678 16980 18891 -6136 -19450 4065
14936 4065 30325 7992 -37374 -45309 -13952 5900 19289 35963 3044 -20766 -7811 -16419
14924 -16419 -19554 -12602 -18842 5746 16225 21525 415 -2831 -6352 23006 24188 38679 45146
14911 45146 9230 -6823 13358 9252 8288 11728 -14385 -50110 -48771 -29290 19630 34280 11034
14898 11034 -20397 -13 -15602 -27295 8209 2813 18751 14295 2920 16938 22351 19559
14886 19559 16763 4735 4195 17084 22496 26171 -4584 -25175 -15887 -37581 -69048 -31758 -8420
14873h420Q173J6393j800j8031k4310o446P423O473L637J061L490P573R030J3648
14859A7894j1639k5539K2501Q198l142M649j4799j6485j008Q789r83j6994N576
14846b2982J4820Q393Q890m372P068M762k9018n206l726N437K9465P523k3220
14833b166k0150p523O228K4703j5j8108n993N911J9717n703k7678k680J6815L4624
14819A7982j7421q415Q012K0207n203r765k5190N971J0783k3510j0753J3010R866
14806a4426O323J2768K220q646N87j0088m307P737J3784m673o747J6137L951j9887
14792e267j5513j0810L719J7649J1351J805j6111J7994L0792K181j9925k5085
14780g220m98J1795j68J1546P095j1687k2561l7088P476K9087K2520k4504o408
$$ plain form
14873 -8420 -247 16146 14346 -3685 -27995 -34441 -27018 -20545 -16908 -15847 -12357 -4784 4246 17894
14859 17894 6255 -19284 3217 11415 8273 12922 -1877 -18362 -19370 -10581 -11564 -28558 -22982
14846 -22982 -8162 231 9121 4749 11817 16579 -12439 -17645 -21371 -15934 13531 21054 -2166
14833 -2166 -22316 -29839 -23611 1092 1077 -17031 -23024 -17113 2604 -3099 -30777 -33457 -16642 17982
14819 17982 561 -7854 158 20365 15162 5397 -19793 -13822 -3039 -26549 -37302 -24292 -14426
14806 -14426 -8103 4665 6885 -1761 -1174 -11262 -15569 -7832 5952 1279 -5468 10669 14620 -5267
14792 -5267 -20780 -31590 -27871 -10222 1129 2934 -13177 4817 35609 37790 17865 -7220
14780 -7220 -7718 4077 3909 15455 22550 10863 -11698 -48786 -41310 -12223 10297 -14207 -20615
14767b0615j3683Q973K1351j1156l896J5503J5578n845N004J5243o169K8357J563
14754E0208k8529M986j3440q079P053J6852p179r712Q257P801o293k6616k4497
14741b9188K3618K4840P791j8205k433r07j5654j8354m69L030M04K0442J5910
14728A0825J60l1220j2889J625O553L057J1150R05J9582K6K227k4039o727l553
14714b2318K7884j1511N066M970N815L03j678j6251k5746J6959K9250N962J2677
14701C1382r899j9599j2102O830J3681J343J8736n378r110M024M336P137j473
14688B9908j3996nr180r839J0195P567j907q43r614l734M49J1724N763k019l060
14673A1409J5031J414J0188j844J1678p995J168l3499P590N061j2805J4530J9142
$$ plain form
14767 -20615 -34298 -25325 -3974 -15130 -19026 -3523 12055 6210 11214 26457 20288 48645 50208
14754 50208 21679 26665 13225 5146 12199 29051 21872 12160 20417 28218 21925 -4691 -29188
14741 -29188 -5570 19270 27061 8856 6423 5516 -10138 -28492 -28961 -25931 -25527 -5085 10825
14728 10825 10985 -20235 -33124 -31499 -24946 -21889 -10739 -9834 9748 9774 12001 -12038 -18765 -22318
14714 -22318 5566 -5945 -879 4091 9906 10209 8531 -7720 -33466 -16507 12743 18705 31382
14701 31382 21483 1884 -10218 -3388 10293 11636 30372 24994 15884 19908 24244 31381 29908
14688 29908 15912 15907 6727 -3112 7083 14650 12743 11900 2286 -1448 -999 10725 16488 14469 11409
14673 11409 26440 27854 38042 36198 47876 39881 41049 7550 15140 20201 7396 21926 41068
14660D1068J1791M215r320l5376o698J5102J9399j8596N362R032k2307k3598k2228
14647c2154J0795J9010K4684J6059Q32j5989M380k3508k756l4563j962l74L454
14634c2092K440O118L4207l269k1245N205j5872m627K0049j487K4904K1920o162
14621C0089l2486J831R421R69r77J96j4225O541j2563j3898J7284J4148j7992
14608a1662j0271O020L4233L475k3277k0628p925j1296J0274J9589J9696N764
14596A3992J8693Q635M355J0809k2350k5521j6846R125J1173K1843n502Q324J4053
14583E0783O262P14j3503j3579K5855j3794k2896j3497r211K9205j0236o17j6776
14570a290L600m159P710L2998p249l1351k7971l145P615K0861J2633J5926J5485
$$ plain form
14660 41068 52859 57074 47754 12378 5680 20782 40181 21585 26947 35979 13672 -9926 -32154
14647 -32154 -21359 -2349 22335 38394 39226 23237 27617 4109 1353 -33210 -35172 -35546 -32092
14634 -32092 -29652 -23534 10673 7404 -13841 -8636 -24508 -29135 -9086 -10573 14331 36251 30089
14621 30089 -2397 -566 8855 9824 8847 9043 -5182 1359 -11204 -25102 -7818 6330 -11662
14608 -11662 -21933 -15913 18320 21795 -1482 -22110 -30035 -41331 -31057 -11468 8228 13992
14596 13992 32685 41320 45675 56484 34134 8613 -8233 892 12065 33908 28406 36730 50783
14583 50783 57045 57759 44256 30677 56532 42738 19842 6345 -2866 26339 16103 15486 -1290
14570 -1290 2310 -1849 5861 38859 31610 259 -27712 -30857 -23242 -2381 10252 26178 41663
14557D1663p725l2501j2279p268j2790L7134K469lj3863l5918j2583L1787K0696
14544a181O965J2004q888r275Q290J5678j2665l2718j3391j7952q690O851L0737
14531b4235K1945j0948K4622J9080L891J4729k6093j6629R757q949k656P748O114
14518A8376j0635k279j0796r591J3639j0425K486m389k177O254j8468J1395r48
14505a7558l5535r052N1161K0964J0740J1407j5556l4137M262J8492M596j4449
14493d665j901Q426J9275p828j6717j5492J073J3367K0655J4124k1530l525r604
14480d342Q879m546P683n725L803K260K879r708k2524p970J3650J3522N554m41
14466B974Q51j7013K5827L2134J152k5171m5333j0871J8847R039J1683J2238q478
$$ plain form
14557 41663 33938 1437 -10842 -18110 -30900 6234 8703 8700 -5163 -41081 -53664 -21877 -1181
14544 -1181 5784 17788 8900 -375 7915 23593 10928 -21790 -35181 -53133 -61823 -54972 -24235
14531 -24235 -2290 -13238 11384 30464 34355 49084 22991 6362 16119 7170 4514 12262 18376
14518 18376 7741 5462 -5334 -14925 -1286 -11711 -9225 -13614 -15791 -9537 -28005 -16610 -17558
14505 -17558 -53093 -62145 -10984 9980 20720 32127 16571 -17566 -13304 5188 9784 -4665
14493 -4665 -6566 1860 21135 13307 -3410 -18902 -17829 -4462 16193 30317 8787 5262 -4342
14480 -4342 4537 -9 7674 1949 5752 8012 10891 1183 -21341 -29311 -15661 -2139 3415 2974
14466 2974 3825 -13188 12639 44773 45925 20754 -24579 -35450 -16603 -7564 4119 16357 7879
14453G879j8997j8279l316J4674M4142J3314k7966m724K613N97M541j4627j0668
14440a0817K3100J0823q323K704K2713K6142q317l2552k876K5703O619n261p540
14427D2118P244j919j1083j2399p871k4054n790k0820O387K9950J6401J1015j8772
14414A0407n570j3158k054l1456j7628J6043K2672O940K8513K0480j3645l4916
14402a3372K468R444q857J1414J0595j7993r34l0241n27J3373l934J2472j4895
14389c0987J541J2221k896R457r54J6533K84J1653K262r039O333n556j3482j1524
14375a4154l239J7226Q508j3413O945J2140j5082J0861R693j3011j7290J1980
14363A164K9478Q781k7699l0641k298Q504J353P115N076J76N826L201R17R233
$$ plain form
14453 7879 -11118 -29397 -32713 -18039 26103 39417 11451 6727 9340 9937 14478 -149 -10817
14440 -10817 12283 23106 14783 17487 40200 66342 58025 25473 22597 48300 54919 49658 42118
14427 42118 49362 47443 36360 23961 16090 -7964 -13754 -34574 -28187 1763 18164 29179 10407
14414 10407 4837 -8321 -10375 -41831 -59459 -43416 -20744 -13804 14709 35189 21544 -13372
14402 -13372 -10904 -1460 -10317 1097 11692 -6301 -7235 -37476 -38003 -24630 -28564 -16092 -30987
14389 -30987 -29446 -17225 -20121 -10664 -11618 4915 5199 16852 19114 10075 16408 10852 -2630 -14154
14375 -14154 -17393 -167 8341 -5072 1873 14013 -1069 9792 19485 6474 -10816 1164
14363 1164 30642 39423 11724 -18917 -21215 -12711 -11358 -4243 833 1009 6835 10036 10953 20186
14349B0186K109j2924L856P790O734l9084l8349K6344J0828j7037K916L6575J2611
14336B2555j8475p529M857j1878N225J2542J8286j6708q609J9666L3736p100j5341
14323C1227J0917l6934j8265K0621R889k1765l1892j4801J4921p03K0318J5070
14311a397p748M198J0427L3254J0224l4816m4447O910K3818J7104l854N176j5828
14298C021J0298J647J317J418J8617P401K2032l158j5542l048j2762j811o602
14285B2828K497O955K0536j1715r584P209j115m641j1938o417l189K41O85J6621
14271B8973j3809j1171M58o643K8688K3395l4831N891K2273j7809k6726j2552
14259a3863J6931O465k61q797r851J1119L1515n390j4522j8666K8276J703j8649
$$ plain form
14349 20186 22295 9371 13227 21017 27751 -11333 -49682 -23338 -12510 -29547 -26631 9944 22555
14336 22555 4080 -3449 1408 -10470 -5245 7297 25583 8875 266 19932 53668 46568 31227
14323 31227 42144 5210 -13055 7566 17455 -4310 -36202 -51003 -36082 -36785 -16467 -1397
14311 -1397 -9145 -4947 5480 38734 48958 14142 -30305 -23395 423 17527 13673 18849 3021
14298 3021 13319 14966 16283 17701 36318 43719 65751 62593 47051 44003 31241 29430 22828
14285 22828 25325 32280 52816 41101 31517 38726 37611 32970 21032 14615 11426 11667 12352 28973
14271 28973 15164 3993 4451 -2192 26496 49891 15060 20951 43224 25415 -1311 -13863
14259 -13863 3068 9533 9272 475 -9376 1743 33258 27868 13346 -5320 22956 24659 6010
14246F010j1760J5531P718k2386r056L175K9528j55k8795J1988J0783r585j1289
14233h293k3379p569J1935K7669r229K968o952k0957R325J4613m546K8831J07
14220A4523l211q423n590o294J5177M290K048R826J6158O885K033k1406j3292
14207A2724k2342j6906k7687K5369L5430L2355M982j0363l1031k9216j3160l3105
14195g2950Q920L5894J1745N638J7717n800k8639J0251l092j8375K4995L0692
14183A6996J8475L14j1496q522k2399J2307K6337j0998k5719k2562L246J4995
14171i026K6928K2718l192k1411j9662j4879L6994L7886j567m1466j8861l453
14159h991K004j6790J5055J0761R000J1429J4210R631O777N278p626j2300r122
$$ plain form
14246 6010 -5750 9781 17499 -4887 -13943 -10768 18760 18605 -10190 1798 12581 2996 -8293
14233 -8293 -31672 -39241 -27306 363 -8866 -5898 -12850 -33807 -24482 -9869 -14415 14416 14523
14220 14523 11312 2889 -2701 -8995 6182 10472 12520 22346 38504 45389 47422 26016 12724
14207 12724 -9618 -26524 -54211 -28842 6588 38943 43925 33562 2531 -26685 -39845 -72950
14195 -72950 -64030 -28136 -16391 -10753 6964 1164 -27475 -17224 -20316 -38691 -13696 16996
14183 16996 35471 35785 24289 15767 -6632 5675 32012 21014 -4705 -27267 -24021 -9026
14171 -9026 17902 40620 37428 16017 -3645 -18524 18470 56356 54789 13323 -5538 -8991
14159 -8991 -6987 -23777 -8722 2039 11039 22468 36678 46309 53086 58364 50738 38438 29316
14146B9316K1812J1558Q349k1184j4280k3246j6662J6285j4246j6832o630Q804
14134a6956J4952J0083N870o82j7819k0663J4660L292j9813J3626K4780m897m6961
14121d0528k0084N534J0820k049K7540K4980k1978L088j532K044j94k372r865
14108b4596M595N131J0141O791j2548q965o637Q749J6114L6373N937j2740P250
14095C5595M178K107O218K579k1102p015r867j3221R110J0220N902j2041M150
14082A6813k227o150l378l470j276j0287r704j7801L1430L5570n09j2453Q940
14069B5498j6445k7647k8645J4495L0341M575m723m943M029R839k0586J3409K3140
14056B2337j7686o250q070P039R860J2455L814l161j5539k1784P493o630Q597
$$ plain form
14146 29316 51128 62686 71035 49851 35571 12325 -4337 11948 -2298 -19130 -25760 -16956
14134 -16956 -2004 8079 13949 13267 -4552 -25215 -10555 -7263 -27076 -13450 11330 6433 -40528
14121 -40528 -60612 -55078 -44258 -46307 -18767 6213 -15765 -12677 -14209 -12165 -12359 -14731 -24596
14108 -24596 -20001 -14870 -4729 2062 -10486 -19451 -26088 -17339 -1225 35148 41085 28345 35595
14095 35595 39773 41880 48098 50677 29575 22560 12693 -528 8582 18802 24704 12663 16813
14082 16813 14586 8436 5058 1588 312 -9975 -19679 -37480 -6050 29520 29011 16558 25498
14069 25498 9053 -18594 -47239 -32744 -2403 2172 -2551 -7494 -3465 6374 -14212 -803 22337
14056 22337 4651 -1599 -9669 -2630 7230 19685 23499 20338 4799 -16985 -9492 -16122 -7525
14043g525o246J746Q355j6809P697K209J138k1759r205M389J3451o875k056L4670
14029C180o774j1530J2140L691J0651J0172l801N63k4391R786O531k9721l4093
14016e3596Q500K0966P011K1457J4886j2173l322j5937L617Q397k979J8178q021
14003F984J424N543q73n362J5940j3315j5302j188J0312K5075K738o212k5090
13990F74q043J8043o837O88K7351r931o577r469k5901J6182J0556K7864j7935
13977A6665l306j7655o77Q325L452k977r291n545R229J1619J7657J0322J3391
13964E1209p818l498l35q946j9590p707j0368J170K8918K0401m5386j8589O611
13951a3928J2498J1970L2653J5365j8698k5742l5496k2964K2977o267J0320N612
$$ plain form
14043 -7525 -13771 -12025 -3670 -20479 -12782 -10573 -9435 -31194 -40399 -36010 -22559 -29434 -31490 3180
14029 3180 -3594 -15124 -2984 707 11358 21530 17729 18292 -6099 3687 10218 -19503 -53596
14016 -53596 -45096 -24130 -17119 4338 19224 7051 3729 -12208 -8591 -194 -3173 15005 6984
14003 6984 8408 13951 13078 7716 23656 10341 -4961 -6149 4163 29238 31976 25764 674
13990 674 -7369 10674 3837 4525 31876 21945 15368 5899 -20002 -3820 6736 34600 16665
13977 16665 13359 -4296 -4973 3352 6804 3827 -5464 -11009 -1780 9839 27496 37818 51209
13964 51209 43391 39893 39558 30612 11022 3315 -7053 -5883 23035 43436 -1950 -20539 -13928
13951 -13928 -1430 10540 43193 58558 39860 14118 -21378 -44342 -21365 -27632 -17312 -11700
13939a1700j1015M000j6823j5861K2433L2555j0285K8047j0138m732J1021j883
13927A5619p506J2860j1403k2591O912O839J2757K504L150j2902K3431L039k9773
13914B936j8268j1227n287j7158J6732M4862K0784n131n937k717j2751r752R788
13901F874J9509r727j8501J183J0577J4245j6112l0513j7706q83J4329J5737l488
13888a4476j6916J806k778J6948k59J1936J7968o186j8529j5913R279K2317k934
13875B263K4996j8098j8855q028J2400M955J9880p786j2328J8056j7475j8604
13863a8624K6466J3178k5511j486J9452j7358j7751k5967r211M696J5264J2334
13851b4518j7979o136K822r653M697L7207Q260R478Q863J2585J0082j474k1975
$$ plain form
13939 -11700 -22715 -18715 -35538 -51399 -28966 3589 -6696 21351 11213 6481 17502 15619
13927 15619 8113 20973 9570 -13021 -6109 730 13487 15991 19141 6239 29670 32709 2936
13914 2936 -15332 -26559 -31846 -49004 -32272 12590 33374 28243 22306 19589 6838 -2914 6874
13901 6874 26383 16656 -1845 -662 9915 24160 8048 -22465 -40171 -41054 -26725 -10988 -14476
13888 -14476 -31392 -29586 -32364 -15416 -15675 -3739 14229 8043 -10486 -26399 -17120 5197 2263
13875 2263 27259 9161 -9694 -17722 -5322 -367 19513 11727 -601 17455 -20 -18624
13863 -18624 7842 21020 -4491 -5977 13475 -3883 -21634 -47601 -56812 -52116 -36852 -24518
13851 -24518 -42497 -48633 -45811 -55464 -50767 -13560 -5300 4178 13041 25626 35708 34234 12259
13838A2259m057k4570j178L3649K8409p85j6054k5791o080k1283j0028L0103L1690
13825B6284j9660n84k530k770k9785j617J6201k3886l0433L6090K5132P670l488
13812c376R13j9015q872P852J7726R220L851R904J806P30J4838j8396j5804k033
13798f56j1882K2916J2018J1242J1712k6624j1174J6043R526m704k4878L100J2671
13785A9310J3160r874n988O407O286J0298N908n211N941k773N280J4184k7552
13772C5376k6692j6656j9923j4660J2389k055K780J3666K1249j1904j698J0484
13760B356p870m3p834l027l529K766l2010m680K4137L4700r47k2273l815K7826
13746E757R994j5149m432Q141q771l7510J3260R591J3690J6936L018R438R36l2019
$$ plain form
13838 12259 8202 -16368 -17546 16103 44512 43727 27673 1882 -4198 -25481 -35509 -5406 26284
13825 26284 6624 6040 3510 740 -29045 -30662 -14461 -38347 -68780 -32690 -7558 112 -3376
13812 -3376 -2463 -21478 -30350 -22498 -4772 4448 8299 18203 20009 20739 35577 17181 1377 -656
13798 -656 -12538 10378 22396 33638 45350 18726 7552 23595 33121 28417 3539 6639 19310
13785 19310 32470 22596 16608 23015 29301 39599 45507 40296 46237 43464 48744 62928 35376
13772 35376 8684 -7972 -27895 -42555 -30166 -32221 -29441 -15775 5474 -6430 -8128 2356
13760 2356 -5514 -5557 -13391 -16418 -19947 -17181 -49191 -53871 -29734 4966 4019 -18254 -22069 5757
13746 5757 15751 602 -3830 4311 -4460 -41970 -28710 -19119 -5429 11507 14525 23963 24899 -7120
13732g120k1023Q112J4172L0438J30l789j7514n131J6681l98J0102k3426j0444
13719i210J732p746K5464K1158J0034N253m1063j5202K5503n972k1416n693J4380
13706b778j5144k5697L748K1869J7944N579r622r253M559K88M55L1210j0941k3062
13692a0845k0689J6047n015p568J9455N290l490P340o042j2669J684J9061P889
13679A0448O566k0784p075k548K0241j0592k194R517L637j8276l9055K1423K3849
13666d843j4072n554N354J0175l954n267K08O604n824j1185l970k9130n194K1060
13652d5592J5468K7737O130k4758J1899K4550p19m1495k7077K198J4842J3374
13640b3443Q177k0361j3157L022L9165k3762j0297Q629j5976J6233R295j9818
$$ plain form
13732 -7120 -28143 -20031 -5859 24579 24709 20920 3406 -1725 14956 14558 24660 1234 -9210
13719 -9210 -7478 -15224 10240 31398 41432 46685 5622 -9580 15923 9951 -11465 -17158 -2778
13706 -2778 -17922 -43619 -39871 -18002 -58 5521 -4101 -13354 -8795 -8507 -8052 23158 12217 -10845
13692 -10845 -31534 -15487 -20502 -28070 -8615 -3325 -6815 525 -5517 -18186 -16502 2559 10448
13679 10448 17014 -3770 -10845 -13393 6848 -3744 -5938 3579 7216 -11060 -50115 -28692 -4843
13666 -4843 -18915 -24469 -19115 -8940 -12894 -18161 -17953 -11349 -17173 -28358 -32328 -61458 -66652 -45592
13652 -45592 -30124 -2387 3743 -21015 -9116 15434 14715 -26780 -53857 -51659 -36817 -23443
13640 -23443 -15266 -35627 -48784 -45762 -6597 -30359 -40656 -32027 -48003 -31770 -22475 -42293
13628d2293j4843P312K2753K8140O223j7538j6953J4256K2845J7423j2479K437
13616A7283L3165p284k1536j7238j6990j8798j3340J6612K3261L3525M936m524
13604B9072q051N465j2731k0318l345r092k2250m908J5353l510J7516J2822k2117
13591b6094j4923K0338K393j2027l0624j1994K7493M2041J9995j8746n819K4452
13579A6485J1497q221m448j628O533j6618k0420j2991j5004k960K5877L1564N145
13566A4811k0500o639j037k3261J1943J8184P638K0871j953k1340k5114j4270
13554d0667n030L4406q279K219L3620O970j0058P486j2568l0781r757K2609J8971
13541I141J740P104k4840j1512J5154K690O219n90K7626k079k7821j3197P64k520
$$ plain form
13628 -42293 -57136 -49824 -27071 1069 7292 -10246 -27199 -12943 9902 27325 14846 17283
13616 17283 50448 43164 21628 4390 -12600 -31398 -44738 -28126 -4865 28660 33596 29072
13604 29072 21021 26486 13755 -6563 -9908 -19000 -41250 -46158 -30805 -34315 -16799 -3977 -26094
13591 -26094 -41017 -20679 -18286 -30313 -60937 -72931 -45438 -3397 16598 -2148 -7967 16485
13579 16485 27982 19761 15313 13685 20218 3600 -16820 -29811 -44815 -47775 -21898 9666 14811
13566 14811 -5689 -12328 -13365 -36626 -24683 -6499 1139 22010 20057 -1283 -26397 -40667
13554 -40667 -45697 -11291 -19570 -17351 16269 23239 13181 20667 8099 -22682 -32439 -9830 9141
13541 9141 10881 17985 -6855 -18367 -3213 -523 5696 5106 32732 30653 2832 -10365 -9601 -12121
13527a2121j1993J1166L6405J4412r749j9809j5008Q166J735J8397k2000k3087
13515b3486L244K8207J4344j1354l6856l031j948r529K4858M6891o495J6301j1849
13502B9297k8527l1516k3953J3936J5150o866J6228J6589M144j5677P443J0650
13490F898l0609o590j5136n150J8398M153j811K1850l866O402K0518J984J1241
13477B8282j7037N636j3651j0854J1945j2065k4001R915L6120L2214K768j0455
13465C8817j4966l4993j1785K3177J24j256L500l1326J3111J9000M26L1720q190
13452B7359j1258n219J3078J5142j0435J4874J6412n157j6229k1270k4885p899
13440a5487j5910o267n994R437r760J3665J7331J0310K2289j9227j6552P176K0056
$$ plain form
13527 -12121 -24114 -12948 23457 37869 28120 8311 -6697 1469 3204 21601 -399 -23486
13515 -23486 -20242 7965 22309 10955 -25901 -28932 -30880 -40409 -15551 31340 24845 41146 29297
13502 29297 770 -30746 -54699 -40763 -25613 -32479 -16251 338 4482 -11195 -3752 6898
13490 6898 -23711 -30301 -45437 -50587 -32189 -28036 -29847 -7997 -11863 -5461 15057 17041 28282
13477 28282 11245 16881 3230 -7624 4321 -7744 -31745 -21830 14290 46504 49272 38817
13465 38817 23851 -11142 -22927 250 374 -882 2618 -28708 -15597 3403 3829 35549 27359
13452 27359 16101 10882 23960 39102 28667 43541 59953 54796 38567 17297 -7588 -15487
13440 -15487 -31397 -37664 -43658 -34221 -43981 -30316 -12985 -2675 19614 387 -16165 -8989 11067
13427A1067k2716j1445J3206n131J0001k496k9922Q411O853J6161J7266M146l488
13414A1913j4491j8863J422J2051M414R70K1888j6744j2307k051J0228N766p808
13401c612j9447K2030L565n770J1065O577q996l4646J2129n22j6038j8775J7983
13388c4457J8071J2333J6481K4684J0874O592j3153m198J2759j6938j0047J667
13376B4668r322J9751n732r380L752l2285o593j9499J1526J1328J250p795m107
13363b2438M043J7037J577r417Q361n040j8669n746M430J7891K5264j2927K907
13350G273r718M73J3065k0878k0160M313k0583K417L518J6558K7952M003J7599
13337B5832j1547q798j3839K096j1465k7480L860L0136O239o660J1397P286j3147
$$ plain form
13427 11067 -11649 -23094 -9888 -15019 -5018 -7514 -37436 -29025 -22172 -6011 11255 15401 11913
13414 11913 -2578 -21441 -20019 -7968 -3554 -2584 19304 2560 -9747 -11798 -1570 4196 -3612
13401 -3612 -23059 -1029 2536 -3234 7831 14408 5412 -29234 -17105 -17627 -33665 -52440 -34457
13388 -34457 -16386 -4053 12428 37112 47986 54578 41425 37227 49986 33048 23001 24668
13376 24668 15346 35097 29365 19985 23737 -8548 -15141 -34640 -23114 -11786 -10536 -18331 -22438
13363 -22438 -18395 -1358 219 -9198 -837 -5877 -24546 -30292 -25862 -7971 17293 4366 7273
13350 7273 -2445 -1972 11093 -9785 -29945 -25632 -46215 -43798 -40280 -23722 4230 8233 25832
13337 25832 14285 5487 -8352 -6256 -17721 -45201 -41341 -11205 -4966 -11626 -229 7057 -6090
13324f090J3955K0652j3773k1346j5254J4447R278l912r655J0192J2464j076q783
13311A099P389j1595k8038j4734p097J3789L0008N6253K5201k3511m3581k1501
13299a6318L988N2693J1912j0577k8779j1946P77N033o158k102j5723j9926Q458
13286b8668L1363J6823r71j2284Q013J0884J7117j7428j7522k3731o416K5818
13274B998K4934N580l12q712j1568J6848L325l3000j9806Q68L1454j9064m098
13261a0553J8222M044j8044k7926L1485q11k9440l0948J3593K7765K568l841j0417
13248c4303K2421j51P91r792R823R974l962N19q296M310J092K2177J6019n078
13234B5544l068j9916j0713J7510K443J1568j1351p626j3094P01K3560m857k4432
$$ plain form
13324 -6090 7865 28517 14744 -6602 -21856 -7409 1869 -2043 -11698 -1506 10958 9882 1099
13311 1099 8488 -3107 -31145 -45879 -52976 -39187 -9179 47074 72275 48764 5183 -16318
13299 -16318 -12330 40363 52275 41698 12919 973 1750 6783 625 -1477 -17200 -37126 -28668
13286 -28668 2695 19518 18547 6263 14276 25160 42277 24849 7327 -16404 -22820 2998
13274 2998 27932 33512 33200 24488 12920 29768 33093 93 -19713 -18845 12609 -6455 -10553
13261 -10553 7669 11713 -6331 -34257 -2772 -3583 -33023 -63971 -50378 -22613 -20045 -23886 -34303
13248 -34303 -11882 -12033 -11242 -21034 -11211 -1237 -5199 -4680 -12976 -8666 -7574 14603 30622 25544
13234 25544 22476 2560 -8153 9357 11800 23368 12017 4391 -8703 -8002 15558 10701 -13731
13221a3731O236l2365r359K4937N449K7223J6661l085q372N292M642j6955k4207
13208a7634K501R615j6574k7181J1102K6530K8276m09j6569Q2P943J5066J97o177
13194A6768m643j6218k6736j1038K878L3518K7226L737k1866l394L306J7004L724
13181B4266o511p647j2511Q303p764R412K015K07j3323K073Q735J6576r107o455
13167H269j0150j4262R299n071L747J234N715O48j3972r826p710r203J5780R795
13153a5707K3431j9510n94l944J6480K6158O844l035k2778l1976j2357k6574j6268
13140g9830J4862K386K3698N104Q662J496k4059j1247O893J7167K0460m143j3147
13127c1698P968M964J8612o906n595K7495K3879M368j3401l0948k7108K387K8263
$$ plain form
13221 -13731 -7495 -39860 -49219 -24282 -18833 8390 25051 21966 13594 18886 23528 6573 -17634
13208 -17634 -15133 -5518 -22092 -49273 -38171 -11641 16635 16226 -343 -261 7682 22748 22945 16768
13194 16768 12125 -4093 -30829 -41867 -38989 -5471 21755 25492 3626 232 3538 20542 24266
13181 24266 17755 10108 -2403 5900 -1864 7548 9563 9770 -3553 -1480 7255 23831 14724 8269
13167 8269 -1881 -16143 -6844 -11915 -8168 -6934 -1219 -571 -14543 -24369 -32079 -41282 -25502 -15707
13153 -15707 7724 -11786 -12380 -16324 156 26314 33158 30123 7345 -24631 -36988 -63562 -79830
13140 -79830 -64968 -62582 -38884 -33780 -25118 -23622 -47681 -58928 -52035 -34868 -14408 -18551 -31698
13127 -31698 -23730 -18766 -154 -7060 -12655 14840 38719 43087 29686 -1262 -28370 -25983 2280
13114B280J5939J9849Q395j8110J2269k9546j1391J6140q889j4998j5997J1609
13102a2450J7633M853j4728J0181Q031k810j0676m398j3249P764j369j2458J1628
13089a2048J4252J2630j3746K729Q611j6614J2128Q075M2J533k4059k9612J1857
13076b4222m673k3308K2896K4552J8542M493J3103P638j1676n113j9666k3689
13064b1123J5030K7846k7525k0439L772J6720J9736K887j8471Q704p233j64o636
13051f896k758k4401P983K3897j8951j7796l973L3923j0816K8384o727j1495j2976
13038b2602Q760K6951J8708j4191k3219k262J3460r961M575K2686K8292r515J9123
13025F0805k4684j4037O999P314j1170j8834J9723J3594N528l5376n0559J986
$$ plain form
13114 2280 18219 38068 46463 28353 40622 11076 -315 15825 6936 -8062 -24059 -12450
13102 -12450 5183 10036 -4692 5489 13520 10710 34 -4364 -17613 -9849 -11218 -23676 -12048
13089 -12048 2204 14834 1088 3817 12428 -4186 7942 16017 16059 17592 -6467 -36079 -24222
13076 -24222 -28895 -52203 -29307 -4755 13787 18280 31383 39021 27345 22232 2566 -21123
13064 -21123 -6093 21753 -5772 -26211 -22439 -5719 14017 16904 -1567 7137 -96 -260 -6896
13051 -6896 -9654 -34055 -26072 -2175 -21126 -38922 -42895 -8972 -19788 8596 1869 -9626 -22602
13038 -22602 -13842 13109 31817 17626 -5593 -7855 5605 -4356 219 22905 51197 41682 60805
13025 60805 36121 22084 29083 36397 25227 6393 26116 39710 45238 9862 -40697 -38711
13013c8711K8955m721J4008M75P42N481r963m567Q838j627m92J4671L2014j5253
12999B9850m1514n650L0541n318M935M942r161q776l266j4517J8654O540j6623
12986i363k0933j5982J9230O991R761J4335L452m951k3593j9832K2677J3868j3891
12973a8231j5580o975N371Q582l126R459L8336R241L49l2254k052L3046J5931
12960D2097j9382k3429k2512N110R997J290K526m504k1271P014L657o602J8526
12947g483j4230q344J1007j2360J7298J6113o665j0338J415K5204j8515k0518
12935b7416J1558P089P803K855n372K1253K9008k5567j6075K8266M3301l825l7897
12922C4981j3323j9544o901J5178o213K25J0030M589k736n750j3781j1347j245
$$ plain form
13013 -38711 -9756 -14477 -469 6 748 6229 -3734 -8301 537 -1090 -1582 13089 45103 29850
12999 29850 -11664 -17314 13227 7909 12844 17786 8625 -151 -3417 -17934 720 7260 -9363
12986 -9363 -30296 -46278 -27048 -20057 -10296 4039 7491 2540 -21053 -40885 -18208 -4340 -18231
12973 -18231 -33811 -40786 -35415 -26833 -29959 -20500 17836 27077 27426 -4828 -6880 26166 42097
12960 42097 22715 -714 -23226 -18116 -8119 -6829 -4303 -8807 -30078 -23064 -19407 -26009 -7483
12947 -7483 -21713 -30057 -19050 -31410 -14112 2001 -4664 -15002 -13587 11617 -6898 -27416
12935 -27416 -15858 -8769 -966 1889 -3483 17770 46778 21211 5136 33402 76703 72878 34981
12922 34981 21658 2114 -4787 10391 4178 4403 14433 19022 16286 10536 -3245 -14592 -15837
12909a5837Q135k4298P328L0836K154j2213r6k2238j8343L506O93K4L3681J9753
12895A3085L771j6855k6035J3248J0126k5299O601L4457k205N603J3324n366q322
12882A6133j6534j9591K4166P670j9179N562K0986j5256q322j1808J609J4660
12870I6p131k723R803J9735M313j2530n259m1434j3606J5408j4350L508J6989
12857b7181O601J8494K4264j4896n502m569J75L639J6155j5529P792k861j5568
12844h986k0660J5115r102R453J9612K6032L6440j9866k1090p754k1474j1924
12832a4204L040M1203Q586r670m796m765r576k873o856K526J621J1921q116L558
12818A1599j2987k1317J916o922J2919J9070J5282R814j1279J2626k2365j2079
$$ plain form
12909 -15837 -7702 -32000 -24672 6164 8318 -3895 -3991 -26229 -44572 -41066 -40373 -40349 -6668 13085
12895 13085 16856 1 -26034 -12786 -2660 -27959 -21358 13099 10894 16497 29821 24455 16133
12882 16133 -401 -19992 4174 11844 -7335 -1773 19213 3957 -4365 -16173 -14564 96
12870 96 -7035 -9758 45 19780 24093 11563 6304 -35130 -48736 -33328 -47678 -44170 -27181
12857 -27181 -20580 -2086 22178 7282 1780 -2789 -2614 1025 17180 1651 9443 6582 -8986
12844 -8986 -29646 -14531 -23633 -14180 5432 31464 67904 48038 26948 19194 -2280 -14204
12832 -14204 -11164 30039 38625 28955 24159 19394 9818 6945 89 2615 4236 16157 8041 11599
12818 11599 -1388 -22705 -20789 -27711 -14792 4278 19560 29374 18095 30721 8356 -3723
12806c723o279m116J2448Q427J1342p69j1872p918j5290j134j199n540P149k4197
12792d2671j6833k0037K3484L1579k681o82J0282J9016O186R24K6903J5077l868
12779D6679j4139j7475Q737j6704K762q16K332k4411O30P65J078J0659Q205k663
12765E639j9263Q150L9148k043p406p057l1493j6547J5037j8041p394j182J6577
12752b5875K215J0913J9526K0874R199j0005k4073j3697j9167p60J0977J9292
12740e81J57J1779R2K0895K1084q151j878k7736k4774N491l668L466J0070j2068
12726e822r298j1410j0998J9968J1981l847o619l807j0077k1605P709K2022J0258
12713a1545k1799K0326K7656o556j7426K980J2758K300P892q212j2251K552k747
$$ plain form
12806 -3723 -10002 -14118 -1670 6757 18099 17330 5458 -2460 -17750 -18884 -20083 -25623 -18474 -42671
12792 -42671 -59504 -79541 -56057 -24478 -27159 -27841 -17559 1457 7643 8567 35470 50547 46679
12779 46679 32540 15065 23802 7098 9860 9044 11376 -13035 -12405 -11640 -10562 97 8302 5639
12765 5639 -13624 -5474 33674 31631 24225 17168 -14325 -30872 -15835 -33876 -41270 -42452 -25875
12752 -25875 -23660 -12747 6779 27653 36852 26847 2774 -10923 -30090 -30850 -19873 -581
12740 -581 -424 11355 11447 32342 53426 45275 43397 15661 -9113 -3622 -7290 -3824 6246 -5822
12726 -5822 -15120 -26530 -37528 -17560 -5579 -9426 -16045 -19852 -29929 -51534 -43825 -21803 -11545
12713 -11545 -33344 -13018 14638 8082 -9344 -6364 6394 8694 16586 8374 -3877 -1325 -4072
12700d072j2140l888J5614r574o517J7582K4302J7805k3751Q007l249k8409m124
12687a2414l42O395J7563K0751J9320l6732M80K8029J232k8871k8021j0908j3105
12674c6623j0764K4085K788J0609M376k5369j555K8993N587j0823j7000O577L6412
12661A7293K4307j4545j0388m301m032k251K5061o781p625k7979M450K3393J3851
12648C0453j71J4037o886k9248j3413r828J9172K5335p713O721l6178j3611l807
12635b5137l158K0453Q337O413n898j2306q907J4190L4488J2398k2080o2101j5793
12622e9101L0150J5396J1499J6416k43n682k416j799Q086o362K1916L5029r74
12609F1915l7890l7458k0397J5046J669J2592M261k173j0028k334l747R054L3368
$$ plain form
12700 -4072 -16212 -20100 -4486 -14060 -20577 -2995 21307 39112 15361 23368 20119 -8290 -12414
12687 -12414 -12756 -6361 11202 31953 51273 14541 15021 43050 44282 15411 -12610 -23518 -36623
12674 -36623 -47387 -23302 -20514 -9905 -5529 -30898 -32453 -3460 2127 -8696 -25696 -19119 17293
12661 17293 41600 27055 16667 12366 8334 6083 31144 24363 16738 -11241 -6791 16602 30453
12648 30453 30282 44319 37433 8185 -5228 -15056 4116 29451 21738 28459 -7719 -21330 -25137
12635 -25137 -28295 -7842 495 6908 1010 -11296 -20203 -6013 28475 40873 18793 -43308 -59101
12622 -59101 -28951 -13555 -2056 14360 14117 8435 6019 4220 12306 5944 27860 62889 61915
12609 61915 24025 -13433 -33830 -18784 -17115 -4523 -262 -2435 -12463 -14797 -18544 -9490 23878
12596B3878K5602q455K750k8523m572l381m921J5870k6751l424L1181L405j0187
12583A2472k402Q393J1694R221j2955j0308l2645l6605j707J9474L4051R295J0704
12570A8682m780K1156j2342N694K1331N352k1912q173l3166j4843L2912L6688
12558D6599r039n136j3554K026K7725j426k233j5568K899K1528k3869l97K9620
12545E9175J2619j361j2966l8059j6343M2558J3589J5963l4770l6642k1476K315
12533a5398K811L944L89J0717m024o110P874k564K4005K5182o125k8059J803J0044
12519B4489k310M171J8654j7607k7324j1876j6756L0358J0572j4294J1013P334
12507A6424J414k5202k695K2214R333k2157j3019l200J0915P023N513R371L99
$$ plain form
12596 23878 49480 41025 43775 15252 10680 7299 2378 18248 -8503 -11927 19254 22659 12472
12583 12472 10070 18463 30157 39378 26423 16115 -16530 -53135 -54842 -35368 -1317 7978 18682
12570 18682 13902 35058 22716 28410 49741 55093 33181 25008 -8158 -23001 9911 46599
12558 46599 37560 32424 18870 20896 48621 47195 44962 29394 32293 53821 29952 29555 59175
12545 59175 71794 70433 57467 19408 3065 45623 59212 75175 40405 3763 -17713 -15398
12533 -15398 -12587 -8643 -8254 2463 -1561 -7671 203 -2361 21644 46826 40701 12642 14445 24489
12519 24489 22179 26350 45004 27397 73 -11803 -28559 1799 12371 -1923 9090 16424
12507 16424 17838 -7364 -10059 12155 21488 -669 -13688 -16888 -5973 1050 6563 15934 16333
12494A6333n868k6971k0578J4904Q370l014M19o422J8616L6035K794M649J3457
12481E2724m054m8678k4235O365J8572J1753j3716M988K0529J0303o872k2372
12469E307R206R52K0202n252m7672J7562J9912j4342R016r78K72J816j1236J1397
12455A6162Q138k2614k0369J4705M860n035k2026K082K6274J242k2q296O475J2863
12441A4439k6032J9953j491j2153K302K143k3966J2237j739m290R630j6411P325
12428a8053K6213K092j1697q092l6212l0668L5015L7344J2105r071j0949N896
12416f077J155j839k4953j5832L2726J0514K1055Q554r004j5815N1j1506m867
12403a5838J1609n242j0821J9794K678j816j7131m142J8328M762J7105J4376k6593
$$ plain form
12494 16333 10465 -16506 -37084 -22180 -13810 -16824 -16405 -22827 -4211 31824 34618 39267 52724
12481 52724 48670 -8 -24243 -17878 694 12447 -1269 3719 24248 34551 27679 5307
12469 5307 14513 15465 35667 30415 -17257 305 20217 5875 14891 13913 14185 16001 4765 16162
12455 16162 24300 1686 -18683 -3978 882 -4153 -26179 -24097 2177 3419 3397 -4899 1576 14439
12441 14439 -11593 8360 6869 -5284 -2982 -839 -24805 -12568 -14307 -18597 -8967 -25378 -18053
12428 -18053 8160 10252 -1445 -9537 -45749 -76417 -41402 -4058 8047 -1024 -11973 -6077
12416 -6077 -4922 -6761 -31714 -47546 -14820 -4306 16749 25303 16299 484 535 -10971 -15838
12403 -15838 -4229 -9471 -20292 -498 2180 364 -16767 -20909 -2581 2181 19286 33662 7069
12390G069j6562M459R419k8279l742L1281L9421j0416j9444j4490N756q191N07
12377c212m121J4715o680Q356J5746M424l7880k5841l672j2311J9576J8183o811
12364a9528J3807L900O179L063K884J6779J9114n579l1539j3929J6310J1954k7737
12351d322O635j1645o978K796L835L897l1076k3517J6965M0544J4540n831k3575
12338a7732Q147k712J4105N5k526k5138n211M724J4239K0011q189o588l865j1010
12324b1690l510j1099l824J9956J049J1705J9384K9107J285K472k3375k7885Q259
12311A834L7054M945j2036l4404O183P530J0334m835o672K1600j767m289k5364
12298A13p594J1951j494P023j2804l497j5M4234K6313j7966k3251R915J225j7325
$$ plain form
12390 7069 -9493 -5034 4385 -23894 -27636 3645 43066 32650 13206 -1284 4472 -3719 -3212
12377 -3212 -7333 7382 702 9058 24804 29228 -8652 -34493 -38165 -50476 -30900 -12717 -19528
12364 -19528 -5721 -1821 4358 7421 10305 27084 46198 40619 9080 -4849 11461 23415 -4322
12351 -4322 2313 -9332 -16310 -13514 -9679 -5782 -36858 -60375 -43410 -2866 11674 5843 -17732
12338 -17732 -9585 -12297 1808 1863 -663 -25801 -31012 -26288 -12049 7962 -227 -6815 -10680 -21690
12324 -21690 -25200 -36299 -40123 -20167 -19118 -7413 11971 41078 42363 44835 21460 -6425 1834
12311 1834 38888 43833 31797 -2607 3576 11106 21440 16605 9933 31533 29766 25477 113
12298 113 -7481 4470 2976 9999 -2805 -6302 -6317 37917 64230 46264 23013 32928 34153 16828
12284A6828q595L196J5328N227p47P834k1496l3674o22J7942K0223j8373l4743
12271c1672l059j2048J4049L4576p191L2565k706k8630o262N194j3279Q421J2607
12258B565n639J8661J096j4031N958r059j8319L008J873k987J4036J5521J0779
12245B3462r194n751M94j4057L270R129Q880k810o172L886J4142N825J1820j812
12231D1112M908k0661J91l846l286L7409P408m0107m777J8262k1314j6685N974
12218D588K9900j8092j3708j8867l957n142K328M9892K6153k0799k9455q924J9019
12205A2936n743n905j195P771q313p751k534n050J7939l81N860K4255J6682O595
12191E5166K1212j313N69o826J0900k4492k5675l779k411M4168J7343k5249j7712
$$ plain form
12284 16828 8233 11429 26757 31984 31237 39071 17575 -16099 -16721 1221 21444 3071 -31672
12271 -31672 -34731 -46779 -32730 1846 -5345 27220 24514 -4116 -10378 -5184 -18463 -10042 2565
12258 2565 -3074 15587 16683 2652 8610 -449 -18768 -15760 -13887 -16874 -2838 12683 23462
12245 23462 14268 8517 9011 -5046 -1776 7353 16233 13423 7251 11137 25279 31104 42924 41112
12231 41112 46020 25359 25550 21704 18418 55827 63235 23128 18351 36613 15299 -1386 4588
12218 4588 34488 16396 2688 -16179 -20136 -25278 -22950 26942 53095 32296 2841 -6083 12936
12205 12936 7193 1288 93 7864 -449 -8200 -10734 -15784 2155 1774 7634 31889 48571 55166
12191 55166 76378 75065 75634 68808 79708 55216 29541 25762 23351 67519 84862 59613 41901
12178D1901j2716k1752o543Q54J5295j0841J2021m686n621m013p366j962P074
12165A645p037O526J410J4864Q114L3180J9634j5569k0214j2388k2755k700L1028
12152C5738K2996K870k0866L472N547J3322o987M466j7943k72J1332J1566k0329
12139D4912j4894J1327K008L216J005M915J8104j8826J2741J589k5367j9017k247
12126A9466K752O552p446p78K1578j1977J041K88o249k4786J078N1600j6278j8420
12112A8421l0940M109K6353J9091L3655j0079o711k6933k5696J3473J8058L376
12100C6177k2968k1290k3682K7244P107K5954O174J4919J0399J2178j6799l3536
12088B1877j6573o694n720r044Q592k951j514j7716l5808J6252K389K2201j7001
$$ plain form
12178 41901 29185 7433 890 1744 17039 6198 18219 13533 7912 3899 -3467 -5429 1645
12165 1645 -5392 1134 2544 17408 25522 58702 78336 62767 42553 30165 7410 4710 35738
12152 35738 58734 61604 40738 44210 49757 63079 56092 60558 42615 42343 53675 65241 44912
12139 44912 30018 41345 43353 46569 47574 52489 70593 51767 64508 66097 40730 21713 19466
12126 19466 22218 28770 21324 20546 42124 30147 31188 31476 25227 441 1519 53119 36841 18421
12112 18421 -12519 -8410 17943 37034 70689 60610 53899 26966 1270 14743 32801 36177
12100 36177 13209 -8081 -31763 -4519 2588 28542 34716 49635 60034 72212 55413 21877
12088 21877 5304 -1390 -7110 -16154 -7562 -10513 -12027 -29743 -65551 -49299 -46910 -24709 -41710
12075d1710q232J9371L5598Q162J8928J221j2378o074R488r795M477k717k1836
12062e497o203l021j358Q357K2113r163Q263Q864p549k6648J519N2090L121j1207
12048C3681p527J939l0040q191K1250J2440J680J4899K813k2073J1960K489l808
12035C1512J3312l1660n595J5638N714j1490k5244k780m95K899Q127k888J0513
12022G563J3063k1K4199q614n530o919m821Q150J5904K288j4909j4504L950k4268
12008d469j8182J3124p803M682J429n199J8953M790k4025m238r217J767R177J6309
11994b902J0174J157J2277K3753J5469j1061j9126O049k3305l499Q601j2329O630
11981A1888K2352q035j8424L1380K659k6677j8338l2179L181J5597J1083K70N346
$$ plain form
12075 -41710 -49942 -30571 5027 13189 32117 33338 20960 14886 24374 14579 19056 16339 -5497
12062 -5497 -11700 -14721 -16079 -7722 14391 5228 13491 22355 14806 -11842 -10323 41767 44888 33681
12048 33681 26154 28093 -1947 -10138 11112 23552 25232 40131 42944 20871 32831 35320 31512
12035 31512 44824 13164 7569 23207 28921 17431 -7813 -10593 -11088 -8189 -62 -2950 7563
12022 7563 20626 20605 44804 36190 30660 23741 18920 27070 42974 45262 30353 15849 19799 -4469
12008 -4469 -22651 -9527 -17330 -12648 -11219 -16418 2535 7325 -16700 -20938 -30155 -28388 -19211 -2902
11994 -2902 7272 8429 20706 44459 59928 48867 29741 35790 12485 8986 17587 5258 11888
11981 11888 34240 26205 7781 39161 41820 15143 -3195 -35374 -32193 -16596 -5513 -5243 103
11968A03j027N384M901j3538j6948j9384K4532J7742J559L086K2016j9538j4166
11955e278m960J99N864r748j3128K004J3325m298N721j0242L3291K0825k7116
11942F459j3322l178P535J1325J801r057J8216M299r99k0589J249m497O461J1028
11928A6731j5430j8987K7133j0562P670j344K922n072J382p981M883k0517R375
11915i797K7246L2364p660j7566k1874p767R824j5394j7811r64N1496K6356j3842
11902C4611k4863k7681R574k4j563J0038J4640r083k2344J2500J2075l335q445
11889c900p387O010R280J8562K61l350k1338M221J8570j091L707J412l1587l473
11875a0103K0374k0531k4192j5270P333K3664j131K500j3043M698J1479j7008
$$ plain form
11968 103 -924 4460 9361 -4177 -21125 -40509 -15977 1765 3324 6410 28426 8888 -5278
11955 -5278 -10238 -10039 -4175 -13923 -27051 -25047 -11722 -16020 -10299 -20541 12750 33575 6459
11942 6459 -6863 -10041 -2506 8819 10620 1563 19779 24078 23079 2490 3739 -758 5703 16731
11928 16731 1301 -17686 9447 -1115 6555 5211 8133 3061 4443 -3538 1345 -19172 -9797
11915 -9797 17449 49813 42153 24587 2713 -5054 4770 -10624 -28435 -29399 22097 48453 34611
11902 34611 9748 -17933 -8359 -8383 -9946 92 14732 5649 -16695 -4195 7880 4545 -3900
11889 -3900 -11287 -5277 4003 22565 22826 19476 -1862 2359 20929 19838 23545 24957 -6630 -10103
11875 -10103 10271 -10260 -34452 -49722 -42389 -18725 -19856 -17356 -30399 -25701 -14222 -31230
11863c1230j266K1214K3581J7027l921l2917J602J9857J9886l787P888j0254r329
11850A8351m314K739j2463p789k3450J1164Q333J4915o173M418j8791k5402J3133
11837b5329m808L285J4651l185j3005j486J8594J9704j0984j2904j724M617J1289
11824a285R384J3298k1139l0187j8564L0999M8888j109j5683j7432p298K750k388
11811i766n00K552m387j0076N34R129K3773L958l0271k6267L920J0061J6582N320
11797e438J462N608j5452M738L1692p873j8239J2774r639k623p803K7687J3118
11784C0012J955j7209q03k703J861K2721K2355K7401J7902j1238j5606q908j5611
11771E2129J1892r953m3647P839N806j7983j7072Q330L312Q568R493Q101J06l3489
$$ plain form
11863 -31230 -32496 -11282 12299 29326 25405 -7512 -5910 13947 33833 30046 37934 27680 18351
11850 18351 14037 16776 4313 -3476 -26926 -15762 -7429 7486 1313 5731 -13060 -38462 -25329
11837 -25329 -30137 -26852 -12201 -15386 -28391 -29877 -11283 8421 -2563 -15467 -17191 -12574 -1285
11824 -1285 8099 21397 258 -29929 -48493 -17494 31394 30285 14602 -2830 -10128 -7378 -9766
11811 -9766 -10266 -7714 -12101 -22177 -21643 -12514 11259 15217 -15054 -41321 -37401 -27340 -10758 -5438
11797 -5438 -3976 1632 -13820 -9082 22610 14737 -3502 9272 -367 -2990 -10793 16894 30012
11784 30012 31967 14758 13955 11252 13113 35834 58189 85590 103492 92254 76648 67740 52129
11771 52129 64021 54068 10421 18260 24066 6083 -10989 -2659 653 9221 18714 26815 26921 -6568
11757f568k39Q735j5359n176J0605J6155J5040o397j4089n0254M814L9988K5809
11744B3064J765j2298k1674J6775J6481L1601N187l7845j2461J4110M2935K5203
11732I2843M5153M1920K1976J1885K725m9247n1048l4918l2541l7217J2135J7726
11720D1392J1546m9345j5514O818R235J1129J5259j3001j2833J4406R266j375
11708B6983O641K7444R648j7927O195j6638p240J2212R757m924k8463k8977J2644
11695G355J5L2666K5812r010r018J2963K3935l401K5501K4919K0687J3724L3608
11682A99756j7501o6639k6056j5536l3377r246K01r579J2834j1796J998K1009
11670D6068J5394J9951P478K2260o986k2783m3723j7406j4537R714L1313J3165
$$ plain form
11757 -6568 -6807 1928 -13431 -18607 -8002 8153 23193 16796 2707 -47547 -42733 -2745 23064
11744 23064 24829 12531 -9143 7632 24113 55714 60901 23056 10595 24705 67640 92843
11732 92843 137996 179916 201892 213777 216502 167255 116207 81289 48748 11531 23666 41392
11720 41392 52938 3593 -11921 -5103 4132 15261 30520 17519 4686 19092 28358 26983
11708 26983 33624 61068 70716 52789 58984 42346 35106 47318 57075 52151 23688 -5289 7355
11695 7355 7370 40036 65848 56838 47820 60783 84718 81317 106818 131737 152424 166148 199756
11682 199756 182255 115616 89560 74024 40647 31401 31602 22023 34857 23061 25059 46068
11670 46068 61462 81413 88891 111151 104165 81382 37659 20253 5716 15430 46743 59908
11658E9908J04j0628j8751K274J9453J5234J5473o687k2758j4094N656K9485r07
11645G3762k6586L473K6780J0528J6697J8749J816k1606p481l129j818j9179k3140
11632D8866j845J6446N285r052j9412J6106L725K8281M4780L403j711K3585j0162
11619A48295q173J7688J1505k518J0635J5017J6229k8127k7853j0479K841n999
11607A39061J7564L1677k4617j2214L7364N2790P256M3428P3541N2075L5722L0871
11595D84518N3625J19453J22259J30230Q5085L9686J1614o4157j02916j48703
11585G30694j26080j09459j06763n9876L29l2600k4565m9664k9951j1827R165
11574A89403N769j8657k9741P451K114N283L1447N2376P203l6875K4326O2393
$$ plain form
11658 59908 60012 49384 30633 32907 52360 67594 83067 76380 53622 39528 45184 74669 73762
11645 73762 47176 50649 77429 87957 104654 123403 125219 103613 96132 93003 91185 72006 48866
11632 48866 47021 63467 68752 59700 40288 56394 60119 88400 133180 136583 134872 158457 148295
11619 148295 140122 157810 169315 166797 177432 192449 208678 180551 152698 142219 145060 139061
11607 139061 156625 188302 163685 151471 188835 241625 248881 292309 365850 417925 453647 484518
11595 484518 538143 657596 779855 910085 995170 1034856 1046470 982313 879397 730694
11585 730694 604614 495155 388392 328516 328845 296245 271680 222016 192065 180238 189403
11574 189403 195172 176515 146774 154225 156339 161622 193069 245445 252648 215773 240099 302492
11562C02492K3867J0821O0198P9767N1427N4618M3068M7392O4025P2778R7698
11551I08151J44201J89475K40345L12970L32338L81071L89770L05853J49159p1633
11541C281700l32470n03716n09328m08115l15196k18907j34767j33544r9127p6886
11531E49644p7726o4308n3250q132R19o421m0947r746K7055j6642p3l740K960
11518B99593L505M7423L1481P422L3197J9395M7265P1094M0573N1619P1411P4138
11506G98116J22419J46757J61562K00589K73965L39850L67214M13376L86376K51083
11496C461307M2367k92717m71417n35580m36526l77177k74896j93209j53405j15629
11486F53118r9543q7389q2729l0044m1125n1383n1728j8872K2495n369l7365p706
$$ plain form
11562 302492 326359 337180 397378 477145 528572 583190 626258 673650 737675 810453 908151
11551 908151 1052352 1241827 1482172 1795142 2127480 2508551 2898321 3204174 3353333 3281700
11541 3281700 2949230 2445514 1936186 1528071 1212875 993968 859201 725657 626530 549644
11531 549644 471918 407610 354360 346228 347147 340726 299779 290033 317088 300446 300373 296633 299593
11518 299593 303098 350521 382002 389424 422621 442016 489281 560375 600948 652567 723978 798116
11506 798116 920535 1067292 1228854 1429443 1703408 2043258 2410472 2823848 3210224 3461307
11496 3461307 3503674 3210957 2739540 2203960 1767434 1390257 1115361 922152 768747 653118
11486 653118 553575 466186 383457 353413 312288 260905 209177 190305 212800 207431 170066 162360
11474A62360J4868j0095N419J524j0211K6773K9000j9019M40K304K1884L8542
11462B63789K1116L1543M3534M8064M2288O4881Q4139J15741J13740J38927J13213
11451A080975Q8031M2265o1736j29416j71272j63572j29034j27315p0269o2815
11441B95842m7342n1195k1565m3511j6320j0781q128k2543l5912P981K591J4538
11429F3655j523K096j2907J0994L672J8956q552q125Q122j3499m02j491q772l8014
11415A4210k3804l296R845L1278p670J3900l452n2300p882J3672Q099L0311q271
11402A4640l5055L206K2967L470k5951J4899K1714N219j5311j8223L5800L2546
11390E9921p260j1848k1642J3012J6019k407J2209o543O962j2056j0933j2017
$$ plain form
11474 162360 177228 167133 172552 174076 163865 190638 219638 200619 201059 203363 225247 263789
11462 263789 284905 316448 359982 408046 450334 515215 599354 715095 828835 967762 1080975
11451 1080975 1169006 1211271 1149535 1020119 848847 685275 556241 428926 358657 295842
11441 295842 248500 197305 175740 132229 115909 105128 97000 74457 38545 46526 49117 63655
11429 63655 62132 64228 51321 62315 65987 84943 76391 68266 76388 62889 62487 60996 52224 14210
11415 14210 -9594 -12890 -3045 28233 20563 34463 31011 -21289 -29171 -15499 -7400 22911 14640
11402 14640 -20415 -17209 5758 9228 -16723 -1824 19890 25109 9798 -8425 27375 59921
11390 59921 52661 40813 19171 32183 48202 45795 58004 51461 58423 46367 35434 23417
11378B3417j6863k587K484r182k2705P388M275J0296Q114j920K1267J3060n381
11365C1663k0344o333J0481L1268J021j6307p881p688N292l067n2427M809L3592
11352D079J865K0552L8305n29k8566j9232j2630O27J9195M70l623J1152Q89j3236
11338A9318k6978J1276M858j4769p072m459j6727J4250L8321K6208j9563j7244
11326G419O036p912k224J5608k0114p81R336k0571k186L478m680J8711L7934O296
11312D6350J878M717j6957j4187k593j4275K5287J1517q637L542j016j482m559
11299B9585l3044K504K593P907L5613K1492k8196K564j7142k1329J1473q554o234
11286g68K1552j1402O90j8440k6463K1074K1849J2362J9449O936j5938j3694j2380
$$ plain form
11378 23417 6554 3967 6451 -2731 -25436 -18048 -13773 -3477 4637 2717 23984 37044 31663
11365 31663 11319 4986 15467 46735 47756 31449 23568 15880 21172 18105 -34322 -29513 4079
11352 4079 5944 26496 64801 64272 35706 16474 3844 4471 23666 24136 20513 31665 32554 19318
11338 19318 -7660 3616 8474 -6295 -13367 -17826 -34553 -20303 18018 44226 24663 7419
11326 7419 13455 5543 3319 18927 -1187 -1968 7368 -13203 -15389 -11911 -16591 2120 40054 46350
11312 46350 48228 52945 35988 21801 19208 4933 30220 41737 33100 36642 35626 34144 29585
11299 29585 -3459 -955 1638 9545 45158 66650 38454 41018 23876 2547 14020 5466 -768
11286 -768 20784 9382 10072 -8368 -34831 -13757 8092 20454 39903 46839 30901 17207 4827
11273D827M903j1795J9327J9647j2917j252K1751J9987j8392l9108l4406k672
11261c0100k432p939K4638m822j416J6467l68j2271K7187L3120k5108j5226o8
11248A662J344j6223J4978N760j4808k847N169j1453J8061J6231J9581j7420o711
11235A3324J6825J6876k0094k8058L1602K6587J830p156l1493k3569K3115j1795
11223G994j437p094M372J1082p252j0554j8916k996M575K8120J4723J5675M468
11210D2760k4531l2089l2242J170K1500J7766N19j999j1469n779K4595J7220j5493
11197A928j5758K7206q441q690k1230N09J2011q405n764P162O638M840J1633n643
11183b004j6077J4247J3031J523r521n585J4916j2532r409o197J1957j1895j149
$$ plain form
11273 4827 9730 -2065 17262 36909 23992 22740 44491 64478 46086 6978 -27428 -30100
11261 -30100 -32532 -40471 -15833 -20655 -22071 -5604 -5972 -18243 8944 42064 16956 1730 1662
11248 1662 3006 -13217 1761 7521 -7287 -10134 -4965 -16418 1643 17874 37455 20035 13324
11235 13324 30149 47025 26931 -1127 30475 57062 58892 51736 20243 -3326 19789 7994
11223 7994 6557 -537 3835 14917 7665 -2889 -21805 -24801 -20226 7894 22617 38292 42760
11210 42760 18229 -13860 -46102 -44932 -23432 -5666 -5147 -7146 -18615 -24394 201 17421 1928
11197 1928 -13830 13376 4935 -3755 -24985 -24476 -12465 -20870 -26634 -19472 -12834 -7994 3639 -2004
11183 -2004 -18081 -3834 9197 10720 1199 -4386 10530 -2002 -11411 -17608 -5651 -17546 -18695
11170a8695j1292L778J0790K285n497J2840k46R536K047k4748R491n813k5383
11157d0907l107p310J5922K4443p455r943N633l427N336J6958M094j798l813M540
11143h34O43J542K6259J3407k4464J3407j4049j0055j5253K1080K1587o311j39
11130B6820J5521M544l8599N885J0356M943m242J4463Q277L549k7842l1361k430
11117a0116k643j06K0907L841P0K3709J250P020M584j4472k780n854j789J4397
11103C8018J874k298n315L28q530q366Q630R874n3p084J4362p774j5330j8911
11089e75J9016K030J749N621j160q441P824p571P065l669j2104o697L073M854
11075A1015k2306j8236k013j201Q802Q126q434j1858J6359M9051M606j1038r244
$$ plain form
11170 -18695 -29987 -26209 -15419 -13134 -18631 -5791 -6037 3499 5546 -19202 -9711 -15524 -40907
11157 -40907 -44014 -51324 -35402 -10959 -18414 -28357 -22724 -26151 -20815 -3857 237 -1561 -5374 -834
11143 -834 -191 1351 27610 41017 16553 29960 15911 5856 -9397 11683 33270 26959 26820
11130 26820 42341 46885 8286 14171 24527 29470 25228 39691 47968 51517 23675 -7686 -10116
11117 -10116 -12759 -12865 8042 11883 11953 35662 36912 43932 48516 34044 31264 25410 23621 38018
11103 38018 39892 37594 32279 32607 24077 15711 24341 34215 34162 27078 41440 33666 18336 -575
11089 -575 18441 20471 22220 27841 26681 18240 26064 18493 25558 21889 9785 3088 6161 11015
11075 11015 -11291 -29527 -31540 -32741 -23939 -15813 -24247 -36105 -19746 29305 33911 22873 13629
11062A3629j549Q501N57N83p594k6126j4662j6078L3676J4933j773q817J6148
11049A1428J1486K2583L3793j2341j9023J868L641k3142k0738o438J9175k671
11037A9621K5296j3932j3585K1232K1612n520R593K1406n639k5196k4792j1195
11025A8901j7988J3443k757K325m409j0918m130k423j4960o367L5869L190J380
11012A1156M761j275j2323J6162N820L3398j17k7432l56l3642j8213K4137K1749
10999B3825j5579M132j723J5323J4560J0427L286N259O291j4984j3485m1840n400
10986i908K2998j3492l6417J7523K8677N653J2510K634Q289j1409l6891r429k170
10973b1432N944j7191p955l348p878J7348J3049K2011L5664n967k3837j3215K0315
$$ plain form
11062 13629 12080 20581 21138 21721 14127 -11999 -26661 -42739 -9063 5870 4097 -4720 11428
11049 11428 22914 45497 79290 66949 47926 49794 53435 30293 9555 3117 22292 19621
11037 19621 44917 30985 17400 38632 60244 54724 64317 85723 80084 54888 30096 18901
11025 18901 913 14356 11599 13924 9515 -1403 -5533 -7956 -22916 -29283 6586 9776 11156
11012 11156 15917 14642 2319 18481 24301 57699 57582 30150 29794 -3848 -22061 2076 23825
10999 23825 8246 12378 10655 25978 40538 50965 54251 59510 65801 50817 37332 -4508 -9908
10986 -9908 13090 -402 -36819 -19296 9381 15034 27544 30178 38467 27058 -9833 -19262 -21432
10973 -21432 -15488 -32679 -40634 -43982 -51860 -34512 -21463 548 36212 30245 6408 -6807 13508
10960A3508L660j4344K23l581k7852j1153K1571K7868j0232m299J3286k7341P217
10947a1469J2980p025K131K1967j3081J8369N284j319j0560O850K0558M2038j6635
10934G0088k4516j7917j0187j6249O69r412O600R574l690j0903j2917K3031K5881
10921C0052l0604J6874K8095k8243l2883j529M3437J5665k9982m1599j9903J2979
10909c7641L4411L0202J3317j0912j2639p68n857j0744J1229L3788K4371o219
10897F2538j6895j6425k3078K656r506N369J9768k1505j8942J7948p38J70O388
10884G748k922K819J0283o300m526j5062q359J2328J0130j2841k4646r819l481
10871d4648Q490L2701J7596k1259j4362L107N767L989K1802J9260J8750Q87j9011
$$ plain form
10960 13508 17168 2824 3047 -534 -28386 -39539 -17968 9900 -332 -4631 8655 -18686 -11469
10947 -11469 1511 -5514 -3383 18584 5503 23872 29156 27837 17277 24127 44685 86723 70088
10934 70088 45572 27655 17468 1219 1888 -7524 -924 8650 4960 -5943 -18860 4171 30052
10921 30052 -552 16322 44417 16174 -16709 -18238 25199 40864 10882 -30717 -50620 -37641
10909 -37641 -3230 26972 40289 29377 16738 15970 10113 -631 10598 44386 68757 62538
10897 62538 45643 29218 6140 8796 -710 4659 24427 2922 -16020 1928 1190 1360 7748
10884 7748 4826 7645 17928 11628 7102 -7960 -16319 -3991 6139 -6702 -31348 -41167 -44648
10871 -44648 -36158 -3457 14139 -7120 -21482 -18375 -12608 -8619 13183 32443 51193 52080 33069
10858C3069P033R281O636j2217k3388o698J6714Q144J1244n504N529k3880j5537
10845A0426j3212K169k4134K1980J1737q470k1800l570J6110J2788q857k5267
10833c0100m9760j3350j5368k8433j1259j2667k796J4572k0678m889M7816L2535
10821i4377J3682N481K6220J1606J6316q729m270K9134o960j0535L401j62J3605
10808e588r656k8685J0997O454K0880N571L571J1882J590J704J4044J4736K844
10795E0344J2872j6331k8502j283k1778K6361K5280j2591R26L1688j6921O671
10783E6736K3431N381m334n625L7342K5659j708J2594J1252K8863K8941K6365
10771B44897K6981L9190O9834P2727Q8874J46982J38781J89789J62077J26462
$$ plain form
10858 33069 40102 49383 56019 43802 20414 13716 30430 38574 49818 44314 49843 25963 10426
10845 10426 -2786 -617 -24751 -2771 8966 496 -21304 -24874 -8764 4024 -4833 -30100
10833 -30100 -79860 -93210 -108578 -137011 -148270 -160937 -163733 -149161 -169839 -174728 -126912 -94377
10821 -94377 -80695 -75214 -48994 -37388 -21072 -29801 -34071 -4937 -11897 -22432 -19031 -19193 -5588
10808 -5588 -15244 -43929 -32932 -26478 -5598 -27 3544 15426 17016 18720 32764 47500 50344
10795 50344 63216 46885 18383 17100 -4678 21683 46963 34372 35298 66986 50065 56736
10783 56736 80167 85548 81214 75589 112931 138590 136882 149476 160728 189591 218532 244897
10771 244897 271878 311068 380902 453629 542503 689485 828266 1018055 1180132 1306594
10761A306594J20444Q0083J5000n5596j37863j77920j67155j74773j58751j12340
10751E37723j39326j04970o9126l2906m0322k2525r590j421J073k68k5936l0213
10739F2193j5987k057l5383k0206k987k436o56K2295J6133r258P667Q313R089
10726C6720q711j4016j7475J75j6094Q635R646J834j6334m4531o478M2231L5692
10713A1294J9516k951j3537j0888J7393J4567L5643m216j6982j7861k1497k2363
10701a1882J0485m065l1429J626J2298M50m292J4194J1743o540K3401k2178k1962
10688b8151K42L381K77j2569k4466p420J3795n326k4471L476N198K4072J677k854
10674e3139L8176L8409K3056M7660M6634M3561M9435L1846Q161L0547N092j9544
$$ plain form
10761 1306594 1427038 1507121 1522121 1466525 1328662 1150742 983587 808814 650063 537723
10751 537723 398397 293427 224301 191395 151073 128548 118958 117537 118610 118342 92406 62193
10739 62193 46206 44149 8766 -11440 -14427 -16863 -17519 4776 20909 11651 19318 27631 36720
10726 36720 28009 13993 -3482 -3307 -19401 -10766 -1120 714 -15620 -60151 -66629 -24398 11294
10713 11294 30810 27859 14322 3434 20827 35394 71037 66821 49839 31978 10481 -11882
10701 -11882 -1397 -5462 -36891 -35265 -22967 -22517 -26809 -12615 -872 -7412 15989 -6189 -28151
10688 -28151 -27909 -24528 -24251 -36820 -61286 -68706 -54911 -60237 -84708 -81232 -76034 -51962 -50285 -53139
10674 -53139 -14963 23446 46502 94162 140796 184357 233792 265638 273799 304346 309438 289894
10662B89894q516j5261n1025j4962j0071l0423k2222j6938j1749L20N623j8054
10650I6616k780j1465J8287k907j1686o0j1063l442r574q092N845j4129k5609
10637A9941o638K3019j0333L163J0111L6360K3688N820L531K0498j2001j6281
10625A00878k1864O01L6452J1077j9733m355J0638m256L300L1791J1319M6680
10613B02528L5337j4393j3908J376K6226r703J318j6602k8957j1538j685n4433
10601A15566m6183j6093P482J6037J8041n277k938m342j4685l1377O701j781J7407
10588E8558J5114J4994J3747l3573l596J3355k3455L582j9969k9878J3918J5002
10576C7799J2124J3845K6363J0603K1807O109rJ7333j3962n0612j8358J8209N779
$$ plain form
10662 289894 281378 266117 215092 200130 190059 159636 137414 120476 108727 109047 114670 96616
10650 96616 93836 82371 100658 97751 86065 86005 74942 71500 61926 53834 59679 45550 19941
10637 19941 13303 36322 25989 29152 39263 75623 99311 105131 108662 129160 117159 100878
10625 100878 79014 79615 116067 127144 107411 103056 113694 109438 112738 144529 155848 202528
10613 202528 237865 223472 209564 210940 237166 227463 228781 212179 183222 171684 169999 115566
10601 115566 69383 53290 60772 76809 94850 89573 86635 82293 67608 36231 42932 41151 58558
10588 58558 73672 88666 102413 68840 65244 78599 55144 58726 38757 8879 22797 37799
10576 37799 49923 63768 90131 100734 122541 128650 128641 145974 132012 81400 63042 81251 87030
10563H7030j3574J879m0269l687J6725n916o295N35n555n713L5479k799J678P903
10549F7421P106K0109j4649l0594L3704K3100j0403k15m304q714m1755n2947r405
10536b1546j1554j1194J8089j3433r699j3999L268K0168J793j4931Q378j740l7280
10523h3680k3106o3753n8057m8226k6054l1424k7605L1812N7556N8021P3807Q0781
10511e9928J00668J08317O5637N6558L0281K9528P757J1440j8574r054K009K810
10499C27449j194N928K2525k9782l5085o129o515Q349O780P811k4071l7816j2601
10486B25649p280m9189n4981j140M1817L4735L1279M0727K7715L9159K1869K2707
10474C73067N6313Q814p904l6460k0046j6889R480j6836K9692J577N743K8556
$$ plain form
10563 87030 73456 75335 35066 31379 48104 42188 35893 36428 30873 25160 60639 57840 59518 67421
10549 67421 74527 94636 79987 49393 83097 106197 95794 95579 91275 82561 40806 -12141 -21546
10536 -21546 -33100 -44294 -26205 -39638 -49337 -63336 -60068 -39900 -38107 -53038 -44660 -46400 -83680
10523 -83680 -106786 -170539 -228596 -276822 -302876 -334300 -361905 -330093 -272537 -214516 -140709 -59928
10511 -59928 40740 149057 214694 271252 301533 331061 338818 350258 331684 322630 324639 327449
10499 327449 326255 332183 354708 324926 289841 283712 277197 285546 292326 300137 276066 238250 225649
10486 225649 218369 169180 114199 113059 154876 189611 220890 261617 289332 328491 350360 373067
10474 373067 429380 438194 430290 393830 373784 356895 366375 349539 379231 380808 386551 415107
10462D15107Q180l210J4113L0749J1420K4596J2088k549j3962j0887k6432o05
10450D58608m187J2779J6336j1766K0472k6K271L5952L0915J4881K4773J110n111
10437E97007o411J2929L5861M5226J8145J2237L0400L9817L0542L0018N1239P9960
10425I76970M4325L5731L1396O2520N0156K1531j5042J3320K9709L1673K9701
10414A311990L3201L9268L3973L5249P3640O5321L4145K7479N1831M9353P7931
10403A833381J24939J11604J32363J58104J62227J96519K05682J82770K06481
10394C314070K34255K74980L09490L28197L63911M37201N19428O01713P15677
10385G098922Q55907R72887J145188J363125J607492J793160J937477K082211
$$ plain form
10462 415107 423287 420077 434190 464939 476359 500955 513043 510494 496532 485645 459213 458608
10450 458608 454421 467200 483536 471770 492242 492216 494487 530439 561354 576235 601008 602118 597007
10437 597007 590596 603525 639386 684612 702757 714994 745394 785211 815753 845771 897010 976970
10425 976970 1021295 1057026 1088422 1150942 1201098 1222629 1207587 1220907 1250616 1282289 1311990
10414 1311990 1345191 1384459 1418432 1453681 1527321 1592642 1626787 1654266 1706097 1755450 1833381
10403 1833381 1958320 2069924 2202287 2360391 2522618 2719137 2924819 3107589 3314070
10394 3314070 3548325 3823305 4132795 4460992 4824903 5262104 5781532 6383245 7098922
10385 7098922 7954829 8927716 10072904 11436029 13043521 14836681 16774158 18856369
10377A8856369K226228K401931K533201K734840L084156L600768M492051N976662
10369D5906206Q328545J1502299J5581794K1009212K7075544L0686877L1455841
10362A91546318K9703668K5465768K1022839J3030284L928306r922694k1335558
10355B53438931k8351371l1921207l2083659l2160499k9880643k6535965k0524720
10348E1980867j3616189q605471n597018l774387k606256j927604j487064j267974
10340A3098904j142936j057824r87699r70309r36609q73612p91773p11194o17788
10331E009160n10463m08303l14637k25867j87045j26532p5571m2067J8716L9655
10321C177046M8300L5313N110k5629q0585j04176j57887j92616k05626k11543
$$ plain form
10377 18856369 21082597 23484528 26017729 28752569 31836725 35437493 39929544 45906206
10369 45906206 54234751 65737050 81318844 102328056 129403600 160090477 191546318
10362 191546318 221249986 246715754 267738593 280768877 284697183 274774489 253438931
10355 253438931 225087560 193166353 161082694 128922195 99041552 72505587 51980867
10348 51980867 38364678 29759207 24162189 20387802 17781546 15853942 14366878 13098904
10340 13098904 11955968 10898144 9910445 8940136 8003527 7129915 6338142 5626948 5009160
10331 5009160 4498697 4090394 3775757 3549890 3362845 3236313 3160742 3118675 3137391 3177046
10321 3177046 3225346 3260659 3265769 3240140 3159555 3055379 2897492 2704876 2499250 2287707
10311B287707k32531k40085k20251j65422j26364j00598q7921p7309o6648l5032
10301I35546l1356l6738k6402j8896O987o955j1198J374J880j7358p773k7151
10289G61960l4852l0850n6242l3208j8646M830k2963m7870k2510j9629l356n860
10277D70804k0453M621l452k4097k6540P415j0604J5558J4618l0228j518P793
10265D03917r218r490l6195m0858j345L532m8974k4395P740k2516l2469j0070
10253A79659k4835n435q641j6407j1707k8801P422J215j9195p459R276J6886J3479
10240A05457L1890N0920J9601K4240N9333J9346J1000L6753K6470N935m5293l7296
10228C08356l4234m9894n6746m8033l2477j6418l744o386J1540k4528q149N721
$$ plain form
10311 2287707 2055176 1815091 1594840 1429418 1303054 1202456 1114535 1037226 970578 935546
10301 935546 904190 867452 841050 822154 829141 822186 810988 812362 814242 796884 789111 761960
10289 761960 727108 696258 640016 606808 588162 592992 570029 522159 499649 480020 476664 470804
10277 470804 450351 454972 451520 427423 400883 408298 397694 413252 427870 397642 396124 403917
10265 403917 394699 385209 349014 308156 306811 310343 261369 236974 244714 222198 189729 179659
10253 179659 154824 149389 140748 124341 112634 83833 91255 92470 73275 65816 75092 91978 105457
10240 105457 137347 188267 207868 232108 291441 310787 321787 358540 385010 390945 345652 308356
10228 308356 274122 224228 167482 119449 86972 70554 66810 60424 71964 47436 39287 45008
10216D5008m152l0594q603J7491J0037J3830M724M0360N7859Q6423Q2862P2652
10204C87897P3193R9668Q6242M5609j2888l9059m1951n8646m1369k0215n1407
10193D27074l4601o0832l6540o212j7536O167p332m877j0923j5699O76Q352R064
10180B56781l0325m4619n892j716l776r155j709m477M464p450j5906j1672J1969
10167A36517j0025J01J8141J9775J6705J5134j9690n015l1575k4082J278j654
10155A15610R396k2608j4976o363Q956J4049j0970k2526J238o065J9934K4658
10143A10333j3933j5901K2706J3533q859j0873j2584M1804J1998r441kj4889p414
10130A06478K5777j5661j752J4988J7329j9822j1275m487l634n748j8755j7347
$$ plain form
10216 45008 40856 10262 1659 19150 29187 43017 47741 88101 145960 232383 315245 387897
10204 387897 461090 560758 647000 692609 679721 640662 598711 540065 498696 478481 427074
10193 427074 392473 331641 295101 288889 271353 277520 270188 265311 254388 238689 239365 247717 256781
10180 256781 226456 181837 175945 174229 170453 161298 159589 155112 159576 152126 136220 124548 136517
10167 136517 126492 126593 144734 164509 181214 196348 176658 171643 140068 115986 117264 115610
10155 115610 125006 102398 87422 81059 90015 104064 93094 70568 71806 65741 85675 110333
10143 110333 96400 80499 103205 116738 107879 97006 84422 126226 138224 128783 128781 113892 106478
10130 106478 132255 116594 114842 129830 147159 127337 116062 111575 107941 102193 83438 66091
10118F6091J821J2527j1855p689J6282J2980K149j0017n641J2114J5793l3913
10106G0642j9363K3781q166k1566k3535J3605J5136J786j7473k1949k7887k8235
10094d3224m011M5044N1778Q039M876j4672k1799R963p232J6417J2503j6081j5507
10081B6094r813R238O142j413R816J0756j3963J0285l459k0670l0956m839n194
10068a7976Q377J3534l8686k5429j1757K332O063K452L6934n049n7224k9687m0919
10055a57035j5256N287j3963j8378R017J1106L7404M0662M8046O1986M7753L5651
10043I2280K2689K0735N5427K3591j9306l762L7l991N882k5138j8829m887l773
10030A40955k1119j8688j905n286Q921J2612O775L0153L7881o582j7392k0417
$$ plain form
10118 66091 67912 80439 68584 60895 77177 90157 92306 82289 76648 88762 104555 70642
10106 70642 51279 75060 66894 45328 21793 35398 50534 52320 34847 12898 -14989 -43224
10094 -43224 -47235 -2191 49587 57626 62502 47830 26031 35994 28762 45179 57682 41601 26094
10081 26094 16281 25519 31661 30248 40064 50820 36857 47142 43683 23013 -7943 -12782 -17976
10068 -17976 -9599 3935 -34751 -60180 -71937 -69605 -63542 -61090 -24156 -29205 -86429 -116116 -157035
10055 -157035 -172291 -167004 -180967 -199345 -190328 -179222 -141818 -101156 -53110 8876 56629 92280
10043 92280 114969 135704 191131 214722 195416 191654 191691 187700 193582 168444 149615 144728 140955
10030 140955 119836 101148 99243 93957 102878 115490 122265 152418 190299 183717 166325 145908
10018A45908j1331K6586j2455m0198j0890j16L934l877j0167j0781m307m592L705
10005G1419J4741l342j5600k2543K4670L3178J9098R18k5350j9066j162R104P573
9992I3638J3714J9483m351q39k0423l8121j5725L1974K225k4925m256J7895j299
9979F8990K5131Q274K1033K5787J0940r0J3994J0817n42P868q078L8373J7502
9966B39999M2300M6578J3768R292N9592Q0664J04338J27651J35498J67883J49551
9955A177114J26268J38047R5352L3153k4614q3396j17638j77353j76069j67059
9945H23805j52503j65677r7006r2483o0546o6103m1856j1564k0039K4243L1222
9934A71493n820m468m247o371r799l2234q107j4432j3058k39J9586j3590k246
$$ plain form
10018 145908 134577 161163 148708 108510 97620 97504 101438 97561 87394 76613 72306 67714 71419
10005 71419 86160 82818 67218 44675 69345 102523 121621 122539 97189 78123 76961 86065 93638
9992 93638 107352 126835 122484 121645 101222 63101 47376 79350 81575 56650 52394 70289 68990
9979 68990 94121 102395 123428 149215 160155 160065 174059 184876 184334 192202 184124 222497 239999
9966 239999 282299 328877 342645 351937 411529 492193 596531 724182 859680 1027563 1177114
9955 1177114 1303382 1441429 1536781 1569934 1545320 1461924 1344286 1166933 990864 823805
9945 823805 671302 505625 408619 316136 255590 189487 147631 136067 116028 140271 171493
9934 171493 165673 161205 156958 150587 140788 108554 100447 86015 72957 72718 92304 78714 76468
9921G6468J0729k623K2689j1849R265j1489j2284M148p531k0032j1630J917m394
9908D3384L5727K2005j5163j7897O216L4316R330k4982J7539J1234K8956J8037
9896A68702J7637q042M2085J4159J5261K4590L062P903k2670k0402j4735J1951
9884B39501J758J470q444j0894o0698m6075j9533q944j2267k5986J7427J1061
9872G8376j422P455q825r33j9001J6522K948l129J4418M0614j3478m5159j5779
9859E2607Q031K2010J4264k8829m869J1349j0308k3207Q95n21J0689J4067K0963
9846H7141j0196O549L4946m068l6888j896n958k5129j8072p734K966r11K1135
9833D1885J5350N587q010M104J2041Q159K007j9490l630Q567J0650N568j8059
$$ plain form
9921 76468 87197 84574 107263 95414 104679 93190 80906 85054 77523 57491 45861 47778 43384
9908 43384 79111 101116 85953 68056 74272 108588 117918 92936 110475 121709 150665 168702
9896 168702 186339 178297 220382 234541 249802 274392 277454 285357 262687 242285 227550 239501
9884 239501 241259 242729 234285 223391 162693 116618 97085 88141 75874 49888 67315 78376
9872 78376 76954 84409 75584 74651 55650 72172 75120 71991 86409 127023 113545 68386 52607
9859 52607 60638 82648 96912 68083 63214 74563 64255 41048 41943 41422 52111 66178 87141
9846 87141 76945 83494 118440 114372 77484 75588 69630 44501 26429 18695 21661 20750 41885
9833 41885 57235 62822 54812 58916 70957 79116 81123 61633 58003 66570 77220 82788 64729
9820F4729k0059j0123L599P83J997J3080P753k6932k1073j3261k661M799Q758
9807A1389J8073K4998K7341P008o95k0633k3536K4300j0039q484q423J1953K5289
9794G8541k254J2876J3351k0471m643J6673j8438m3500q412j8668l3313J9695
9782h563N1896J6385K8363M19j91j3933P854M663j7413l7956p06K780K7195K8375
9768H9168k0533j0429J1700K657j532K943P564q891J2494J2520j1886j026K967
9755H7716k7656k4117j3830J7832J3692P851J885k3223j8033R370K4007Q732l3689
9742C0537K506K1433r697K462r896k546M004L4339p506m2875m432J0767K3381
9729E2477L8283J7565K641P638k9655j5487j8109J0644k958j9029p194L2928N253
$$ plain form
9820 64729 44670 34547 38146 38929 40926 54006 61759 34827 13754 493 -2168 2631 11389
9807 11389 29462 54460 81801 88809 88114 67481 43945 68245 58206 49722 41299 53252 78541
9794 78541 76287 89163 102514 82043 77400 94073 75635 32135 23723 5055 -28258 -8563
9782 -8563 43333 59718 88081 88500 88309 74376 82230 86893 69480 31524 30818 33598 60793 89168
9768 89168 68635 58206 69906 72563 71031 73974 81538 72647 85141 97661 85775 84749 87716
9755 87716 60060 35943 22113 39945 53637 61488 63373 40150 22117 31487 55494 64226 30537
9742 30537 33043 54476 44779 47241 37345 34799 38803 73142 65636 22761 18329 29096 52477
9729 52477 90760 108325 110966 118604 88949 73462 55353 65997 63039 44010 36816 69744 74997
9716G4997k1176N056j1488O125K896r950O116Q843p007J5057r645L297J2702r662
9702F6161o546J4679K693l1862p407K8184J5767P4j7684j5233K2828K623j8215
9689E6062k5348O857O116R142K136J1328k5117j2347J6372K0444K3737O279l00
9676I5361p672k4010J2692j3507k1601j2219N471M1081j3773m241K581M745j2627
9663E2281n624Q267M0472k80j9195j2154p017J1343r189K8703j216j835P984K56
9649I2796K3009P59j6429K700j5182l0259J8239L1218q159j4500k6824M630J3283
9636G5281R80q389L9411K6852j1919R32m277N898Q2Q252P230l626N590R294K215
9621A53806l1599k7722N932J248q544j3167p367j2672K7146K1048N455m791j8940
$$ plain form
9716 74997 53821 58877 47389 53514 56410 46460 52576 61419 54412 69469 59824 63121 75823 66161
9702 66161 59615 74294 76987 45125 37718 65902 81669 81743 64059 48826 71654 74277 56062
9689 56062 30714 37571 43687 52829 54965 66293 41176 28829 45201 65645 89382 95661 95361
9676 95361 87689 63679 76371 62864 41263 29044 34515 75596 61823 57582 60163 64908 52281
9663 52281 46657 54924 95396 95116 75921 63767 56750 68093 58904 87607 86391 84556 92540 92796
9649 92796 115805 116564 100135 102835 87653 57394 75633 106851 98692 84192 57368 61998 75281
9636 75281 76261 67872 107283 134135 122216 123148 118871 124769 124851 133103 140333 136707 142297 151591 153806
9621 153806 122207 94485 100417 101665 93121 79954 72587 59915 87061 108109 113564 108773 89833
9608H9833k8643k1302J4260J4730j2847J261J6907L6120J7349M720p210j1486
9596A13692J7144K319k3537l0476j93N7078J2335M347k9865j6430J8547p509j3911
9583A03541o151n475Q686J1418K3198J2682K894j3547l053M2926J416q604N695
9570A75626o434m128k8838P488N523J5514p9Q634M255K2863K3170k2319k3025
9557A78250r9J0021L4007K5381j386p718o412m131j0148o020J009Q152k8622j0526
9543A81758O740j1360k0225K783K0045J3702J1588j1294j0864J347N370M5645
9531B35235K5480m995k090M852k2364K1043M614j2879q086P116k071R171K1079
9518B76105j5168n594J4850Q944P308K533L121m920n81j8603J1072M766K562q940
$$ plain form
9608 89833 61190 39888 54148 68878 56031 57292 74199 110319 127668 132388 125178 113692
9596 113692 130836 133155 109618 79142 78949 136027 148362 152709 122844 106414 124961 117452 103541
9583 103541 97390 91915 100601 112019 135217 147899 150793 137246 134193 177119 178535 169931 175626
9570 175626 169192 165064 136226 143714 149237 164751 164672 173306 177561 200424 223594 201275 178250
9557 178250 178151 188172 222179 247560 246174 238456 232044 227913 217765 211745 212754 220906 192284 181758
9543 181758 188498 177138 156913 159696 179741 193443 205031 193737 182873 184220 189590 235235
9531 235235 260715 255720 253630 258482 236118 257161 261775 248896 240810 247926 245855 255026 276105
9518 276105 260937 255343 270193 279137 286445 288978 292099 287179 286598 267995 279067 283833 286395 277455
9504B77455M4J069M533j481J2038K754o554k0684K3981j3298J388N524q560O570
9490B84779j124r603J7095L307M393j9364l852r973K7289J8217J8579Q184J6211
9477C54138K555J6728j0035N828k3019j7887j2091J1017L0892j8624j1999J309
9465C28812k993k4843O427k559k0360K6932K6147P747j787J4130q719j8890m443
9452C25601M0335K2776J378j0851k0576J0337L9492J8952K5790j4341m3673p071
9440C88149j237J2631L882Q066k240n092j3901j4086L0691L7743K2403J1097k686
9427D75420K1862K2327l899l055N860j360J0574Q085j4991k2776J3854L1959J2686
9414E56546M734J5684l070p453N719R953L4049N2713L8213K3442K2265j2520N046
$$ plain form
9504 277455 277499 278568 283101 281620 293658 296412 289858 269174 293155 279857 281245 286769 278209 284779
9490 284779 283655 274052 291147 294454 298847 279483 275631 265658 292947 311164 329743 337927 354138
9477 354138 356693 373421 363386 369214 346195 328308 316217 327234 358126 339502 327503 328812
9465 328812 325819 300976 307403 304844 284484 311416 337563 345310 343523 357653 348934 330044 325601
9452 325601 365936 388712 390090 379239 358663 369000 408492 427444 453234 438893 395220 388149
9440 388149 386912 399543 403425 411491 409251 404159 390258 376172 406863 444606 467009 478106 475420
9427 475420 497282 519609 515710 512655 518515 517155 527729 535814 520823 498047 511901 543860 556546
9414 556546 561280 576964 573894 566441 572160 582113 616162 668875 707088 730530 752795 740275 745321
9401G45321j7399P496J430K0198J1938R229L3614J4930J8066M409M1847J6334
9389I07413P962l1941k0498J4172j1936K1827M7869K6687J8580K0683J4878J2659
9377A028355J2534M1883L3195j6037j839J4243J7462J5958K7999K5679L7511M4249
9365A281192M5550J9023K8265J4408M982J6613L8309L6063L3536P4992K4170J7995
9353A635098K0146M5891J9933Q879L2531M5209L919M3941O4542M2855L4999M5933
9341B043876O4311M8244O1031L8469O0783P8134O4488N9760M9329Q4037O8651
9330B721113M5455O3238P8898Q4412Q1908J32459Q5161P4098Q3358R8302J08911
9319C657313J04286J38498J16073J19145J44114J48640J61202J64048J74500J63986
$$ plain form
9401 745321 727922 735418 736848 757046 768984 778213 811827 826757 844823 849232 891079 907413
9389 907413 915375 883434 862936 877108 865172 886999 934868 961555 980135 1000818 1015696 1028355
9377 1028355 1040889 1082772 1115967 1099930 1098091 1112334 1129796 1145754 1173753 1199432 1236943 1281192
9365 1281192 1326742 1345765 1374030 1388438 1393420 1410033 1448342 1484405 1517941 1592933 1617103 1635098
9353 1635098 1655244 1701135 1721068 1729947 1762478 1807687 1811606 1855547 1920089 1962944 1997943 2043876
9341 2043876 2108187 2156431 2217462 2255931 2316714 2394848 2459336 2519096 2568425 2652462 2721113
9330 2721113 2766568 2829806 2908704 2993116 3075024 3207483 3292644 3366742 3450100 3548402 3657313
9319 3657313 3761599 3900097 4016170 4135315 4279429 4428069 4589271 4753319 4927819 5091805
9309E091805J91320J72604K04617K23911K31297K40958K67930K83826L00551K64238
9299G473057L34440L79598L60707L34569L69892M28132M01153M65780N47285N49626
9289A1644239N56020N93890O38604O69207P32054P85406P91585Q15539Q91579
9280A8118123R54614R96273J076495J119749J146886J214532J244021J245539
9272B7116232J267900J315244J315338J304371J281740J253705J150486J058770
9264C7063786R60059Q02846N91631M33855K25114J364k55978m81492o70342q34563
9254C7836280r66408j129143j226486j333887j374229j427331j400364j412591
9246B7565841j398266j359575j307910j225666j180827j102700j060362j003356
$$ plain form
9309 5091805 5283125 5455729 5660346 5884257 6115554 6356512 6624442 6908268 7208819 7473057
9299 7473057 7807497 8187095 8547802 8882371 9252263 9680395 10081548 10547328 11094613 11644239
9289 11644239 12200259 12794149 13432753 14101960 14834014 15619420 16411005 17226544 18118123
9280 18118123 19072737 20069010 21145505 22265254 23412140 24626672 25870693 27116232
9272 27116232 28384132 29699376 31014714 32319085 33600825 34854530 36005016 37063786
9264 37063786 38023845 38826691 39418322 39852177 40077291 40078655 39822677 39341185 38670843 37836280
9254 37836280 36869872 35740729 34514243 33180356 31806127 30378796 28978432 27565841
9246 27565841 26167575 24808000 23500090 22274424 21093597 19990897 18930535 17927179
9238A7927179r42440q79239q18617q03976p61310p27159o48448n84064n55386
9229A1206540n48044n02706m59899m47034m00117l62339l80573l60245l38541
9220G407042l01487k86196k76731k60604k20290k28124k20662k08907k16159j75743
9210E012139j75658j51097j59030j40503j50304j33158j16257j32773j41321j31698
9200C580340j26035p8229r7307j02504j08256o6851k9261p5710q3787j15211q7128
9189B610061m2193o3245p6552q9005n4950o6079n5749n1676m1447m8467m3361
9178A977337o9680k3046k1615n3304l8075k7436m4854m1917o9892k0009m5629
9167A521880k3214p083m0128k3565l9289m6394m8159k0081n438j6526j1879l0594
$$ plain form
9238 17927179 16984739 16105500 15286883 14482907 13721597 12994438 12345990 11761926 11206540
9229 11206540 10658496 10155790 9695891 9248857 8848740 8486401 8105828 7745583 7407042
9220 7407042 7105555 6819359 6542628 6282024 6061734 5833610 5612948 5404041 5187882 5012139
9210 5012139 4836481 4685384 4526354 4385851 4235547 4102389 3986132 3853359 3712038 3580340
9200 3580340 3454305 3376076 3278769 3176265 3068009 3001158 2971897 2896187 2812400 2697189 2610061
9189 2610061 2567868 2504623 2428071 2339066 2284116 2218037 2162288 2110612 2069165 2020698 1977337
9178 1977337 1907657 1884611 1862996 1809692 1771617 1744181 1699327 1657410 1587518 1567509 1521880
9167 1521880 1498666 1491583 1451455 1427890 1388601 1342207 1294048 1273967 1268529 1252003 1240124 1209530
9155A209530m1881j6291k943k5796k2709k520k5272k9828L025k5343l4312k8987
9143I56673Q400j6029q887J641k4216k1272p593k6953q148o267k3154k5562k9542
9130G69091p86l286j2240j3735j4431j4104L208J5934j0974l1557j7560j4246
9118F55314K4197K1848m714k6246n1685l116r13L3284J9348j6138k7772k0799
9106F02608n353L59J371j6302j5560J0441k676j506O365o806l203k786j0937J7068
9092E73083j0260j4304l2599k215r652l457K4228k3498l0750P996j5460L601J1769
9079D78482j6475n774P035n36m5578k6087J6647L4144Q838k5329p995J2055j8708
9066D10719k0070j4540j8319J3113N922l5169n964j9571Q134l060m856J5851o42
$$ plain form
9155 1209530 1167649 1151358 1148415 1122619 1099910 1097390 1072118 1042290 1045315 1019972 985660 956673
9143 956673 965073 949044 940157 941798 917582 896310 888717 861764 853616 847349 824195 798633 769091
9130 769091 768305 765019 752779 739044 724613 710509 713717 729651 718677 687120 669560 655314
9118 655314 679511 701359 696645 670399 618714 615598 614685 647969 667317 651179 623407 602608
9106 602608 597255 597614 598985 582683 567123 577564 574888 573382 579747 572941 569738 566952 556015 573083
9092 573083 562823 548519 515920 513705 504053 500596 524824 501326 470576 478572 463112 466713 478482
9079 478482 462007 456233 463268 462732 417154 391067 407714 441858 450696 425367 417372 429427 410719
9066 410719 390649 376109 357790 370903 376825 341656 335692 316121 324255 321195 316339 332190 331548
9053C31548j321P04K305M798P302j336j6156j2501j8123o147J9492J6787k1471
9040C05881l1474m268r002K3626l014O487K978r33j5372J345q029P03K668l6797
9026B34799L944j1785M433K3450K2133m835k5941q576R521l2443k3046q954O108
9013A88808J2792J3397J0680k4498L435P805j8410k4959J3623J4823l824R771
9001B03443L721k1737m66k7883N752L8922N5j4765j3306M367k3895J3286J4494
8988A81988K8824Q659k2610L228r287k5269j3084L8371K2525P142q664n244j3576
8975A93003j3278l91p676l2144J0655P309J9209J9918L522l2961l1586q851L6638
8962A63367J8524P043K7010l952k1296j7929j5183l0445p997L1158L5699Q860
$$ plain form
9053 331548 330227 330931 333236 338034 345336 344000 327844 315343 297220 291073 310565 327352 305881
9040 305881 274407 270139 261137 284763 281749 288236 291214 290281 274909 276254 268225 268928 271596 234799
9026 234799 238743 226958 231391 254841 276974 272139 246198 237622 247143 214700 191654 182700 188808
9013 188808 201600 214997 225677 201179 204614 212419 194009 169050 182673 197496 193672 203443
9001 203443 207164 185427 184961 157078 162830 201752 201807 187042 173736 178103 154208 167494 181988
8988 181988 210812 219471 196861 200089 190802 165533 152449 190820 213345 220487 211823 206579 193003
8975 193003 179725 179334 171658 139514 150169 157478 176687 196605 200127 167166 135580 126729 163367
8962 163367 181891 188934 215944 211992 190696 172767 157584 127139 119142 150300 185999 194859
8950A94859j1911j1907n261l2076k2749K1785K7076L163o71m319j349J154j3145
8937A44649Q879J1794J6029K8441k887k6561j018K463j7417j0799o836L476j5141
8924A35072Q215O832J8140j0672L734J6590J8542k6949k0276Q445j344J7494K8597
8911B02420J0293J395Q007j3044k994J1069j2808m706n753l626q58k659l56J2826
8897A99206M075O326j6090o072k6301k2019K8727J7047l447K89j0886j1714K0838
8884A79979p995J6162p062K265O376r716J351J5166R672j9331j117J415K4053
8871B11218J6432m300k5784L0146K7288j1513l128k710N966J4816J5823P816K8531
8858C10601K1201J7463L5745L3159K9918M1332O644o181M2592O7410N2460M8870
$$ plain form
8950 194859 182948 171041 165780 133704 110955 132740 159816 162979 162308 157989 156640 157794 144649
8937 144649 153528 165322 181351 209792 206905 180344 179326 181789 164372 153573 146737 150213 135072
8924 135072 143287 150119 168259 157587 161321 177911 196453 169504 149228 157673 156329 173823 202420
8911 202420 212713 214108 222115 209071 206077 217146 204338 199632 193879 190253 189395 186736 186380 199206
8897 199206 203281 209607 193517 187445 161144 139125 167852 184899 181452 181741 170855 159141 179979
8884 179979 171984 188146 181084 183349 189725 180009 181360 196526 206198 186867 185750 187165 211218
8871 211218 227650 223350 197566 227712 255000 243487 240359 237649 243615 258431 274254 282070 310601
8858 310601 331802 349265 385010 418169 448087 489419 496063 489882 532474 599884 652344 701214
8846G01214O8987R5534J16055J58465K03254K53378L65982M73730N39215N70897
8836C546711N05503K57911j53124n17304p18821o67133n22079l58401k59754j55518
8826I57991j05446q2482q7523q9476j4360k3628k9017k7737j5881O210J9568j4391
8814D93828l8244K6932O1523K9812J1939K2090M5541N7939O1956M6849P8692R3288
8802I92145J10376J13705J22263J52613J94777K56172L57971M82454O39762Q37279
8792D259517J039291J187038J197738Q67232K386j031839j523151j439691j130714
8783C427807q12113n60066l67813k79354k20883j50900j07952r7406q9832l3034
8773G08454j1191m7317m6116l9327l9066m2825m241k6315L747J1721L0519O893
$$ plain form
8846 701214 770201 865735 981790 1140255 1343509 1596887 1962869 2436599 2975814 3546711
8836 3546711 4052214 4310125 4157001 3639697 2920876 2253743 1731664 1373263 1113509 957991
8826 957991 852545 770063 682540 593064 578704 555076 526059 498322 482441 488651 508219 493828
8814 493828 455584 482516 544039 573851 585790 607880 653421 711360 773316 820165 898857 992145
8802 992145 1102521 1216226 1338489 1491102 1685879 1942051 2300022 2782476 3422238 4259517
8792 4259517 5298808 6485846 7683584 8550816 8553202 7521363 5998212 4558521 3427807
8783 3427807 2615694 2055628 1687815 1408461 1187578 1036678 928726 831320 741488 708454
8773 708454 697263 649946 603830 564503 525437 482612 478371 452056 455803 467524 498043 504936
8761E04936p454J9001R793M3610L5463M7219P2014N2299N9001R0286R3143J32453
8749A151764J91834K48628L42837M30807M87049N24874M44146J66279k30870n76954
8739C180394o68289o12500m50514l13998k23117j83462j37925r1543o5714o3474
8729C69858l0324o060l4460m5684k1085j4028J7362j9721j5067o698p716n303
8717A81074J152J9966J5405j9945j4335k0957m5089j715N665P989j6517k3371
8705H9322P596R251k5946j0847N544M557j097j4596n1498J5758K5371m655j7018
8692C1742O240J9025j771j8949j3220J586L3406K4947J4373n958l9994j4466J1127
8679D8088J9745M4616M807j8898J1271k1561r174K1922P431l760k501j1389k0875
$$ plain form
8761 504936 497482 516483 526276 569886 605349 652568 724582 776881 835882 926168 1019311 1151764
8749 1151764 1343598 1592226 1935063 2365870 2852919 3377793 3821939 3988218 3757348 3180394
8739 3180394 2512105 1899605 1449091 1135093 911976 728514 590589 499046 433332 369858
8729 369858 339534 333474 299014 253330 232245 218217 235579 215858 200791 194093 186377 181074
8717 181074 182226 202192 217597 197652 183317 162360 117271 115556 121221 129210 112693 89322
8705 89322 96918 106169 80223 69376 74920 79477 78380 63784 12286 28044 53415 48760 31742
8692 31742 37982 57007 55236 36287 23067 24653 58059 83006 97379 91421 51427 36961 48088
8679 48088 67833 112449 117256 98358 109629 88068 78894 100816 108247 104487 101986 90597 69722
8666F9722j3359j4187K9446j4782J4925L937N066J1046J0712j9287j8944k2895
8654D1400R938P124O326J020j0352R412K5006P88j5346K0510J5133R003q815l1137
8640H0010k5368n574q114K2481O799K334R857K452j2100P638K165k8184j8147
8627C6249K5149q703j4991K2515L1032k1582n922J2104j7833j7904J1087L3802
8615H5003J2747m471j3078J5r549j5376R907K1703j1733k5761J565r790L841K6918
8601G1941K8193K0789j1607J2605p266j1764j5842K6532L346n583J449o635k878
8588A03280J5765j4222l1994L2739L4764m167j2687l5011j3471K8204q805l9057
8576E5338j8441K2263J5334j1008Q288m299k8098j8318J7659J0715L6484K4049
$$ plain form
8666 69722 56363 42176 71622 56840 71765 75702 80768 91814 102526 83239 64295 41400
8654 41400 51338 58462 64788 65808 55456 64868 89874 90662 75316 95826 110959 119962 111147 80010
8640 80010 54642 49068 40954 63435 70234 72568 82425 84877 72777 80415 82580 54396 36249
8627 36249 61398 52695 37704 60219 91251 69669 63747 75851 58018 40114 51201 85003
8615 85003 97750 93279 80201 80216 70667 55291 65198 86901 75168 49407 50972 41182 45023 71941
8601 71941 100134 120923 109316 121921 114655 102891 87049 113581 116927 111344 112793 106158 103280
8588 103280 119045 104823 72829 105568 140332 136165 123478 88467 74996 103200 94395 55338
8576 55338 36897 59160 74494 63486 71774 67475 39377 21059 38718 49433 85917 109966
8564A09966o054n287m3738k0059p588J965J6268P685M335R497j9376m399K1624
8551F4839K6652n279j6625o481J341n815J154N360J8244k3973o909j5006n672
8538C1830K6430J9536r557m1138J2978K4161j4958K861m0788k5505P90K8809j7952
8525b503j2328J3860J1996K884K6990k358J6821k3472k5972p949r104J0703J3754
8512A3322m02o131n104L47j8136P237J2393R715J546O943o983r24q691L6657J1914
8497E3703j9948m867m633l519q263j9314J8655K2210r694m3289O003R590q898
8484a2264J107Q252j2210J9006J8674J2084J653K215k0538M36Q220K2328m919
8471D4044J528j3738j2910Q409N238K272l3455P167k787J7914J6739J7088m151
$$ plain form
8564 109966 103912 98625 54887 34828 27240 29205 45473 53158 57493 66990 47614 43215 64839
8551 64839 91491 86212 69587 63106 64447 58632 59786 65146 83390 59417 52508 37502 31830
8538 31830 58260 77796 68239 27101 40079 64240 49282 52143 11355 -14150 -13360 15449 -2503
8525 -2503 -14831 -971 11025 13909 40899 38541 55362 31890 5918 -2031 -11135 -432 13322
8512 13322 12920 6789 1685 2032 -16104 -8867 3526 13241 14787 21730 14747 13823 5132 41789 53703
8497 53703 33755 28888 24255 20736 12473 -6841 11814 34024 24330 -18959 -12956 -3366 -12264
8484 -12264 -11157 -2905 -15115 3891 22565 34649 36302 38517 17979 18415 26635 48963 44044
8471 44044 45572 31834 18924 27333 32571 34843 1388 8555 5768 23682 40421 57509 53358
8458E3358j4824j6249j1916J0412L7478J2865l1384k6585K000j3030n397J6609
8446A3337L711J7213P547k1564j7833J6625j124p667q179K6699J1331P953J8509
8433F6558m409m168q032l312r195K446K522K7859O4809M2547K7744J7744l608
8420B19505j7792o1990m8676k4023j3141k290j0831Q800J4392n590l981L9036
8408I3419K4119k9438m4156m5859j215L0119J6228J550L059j1021m331K2535J5555
8395G0564j320j971K3337j5725k2987j2382K5918J936P947J1397n849R002R154
8382I9021L4761O9438P9207N7343K7601N8256J683r0570q1382q6241p4409m9372
8370D5336j2201P499j1218r653j6935j9218K0750K951J1541R260j6342j0119P37
$$ plain form
8458 53358 38534 22285 10369 20781 58259 71124 39740 13155 15155 2125 -3272 13337
8446 13337 17048 34261 41808 20244 2411 19036 17912 10245 2066 28765 40096 48049 66558
8433 66558 62149 57981 49949 46637 37442 39888 42410 70269 135078 177625 205369 223113 219505
8420 219505 201713 139723 91047 67024 53883 51593 40762 49562 63954 58364 54383 93419
8408 93419 117538 88100 43944 -1915 -3130 26989 43217 44767 47826 36805 32474 55009 70564
8395 70564 69244 67273 90610 74885 51898 39516 65434 67370 75317 86714 80865 89867 99021
8382 99021 133782 203220 282427 339770 367371 425627 427310 336740 255358 169117 94708 45336
8370 45336 33135 40634 29416 19763 2828 -16390 4360 7311 18852 28112 11770 1651 2388
8357B388k8841Q310L5590Q149J259K5510L53j957J948J0495J4030J2638J1334
8344A01206k0061l785N464K379L673J8124j2026l3878P721M1421N1133O1299R178
8331B31848j2891p361k5060o8697n8181j8695k811O086M721k792k2088R86J7325
8318D2390q594j7550J7176J4409j1886l4217J1292L613k6447j7672K9590J3354
8306A5458n490L2393K2862K3997k0814q842L695J0571M162j9711j5656j9812k400
8293B0413m669J3016j0307k5734K437L0938M7525P526p50j3864K6849J4081n59
8280A06902n858k3291r733k3273j5888m7480M038K7318J371l48K810k81k3014
8267f727j8647Q631J5502K3007J3480p307o38J698R790p552r346M354K1864M417
$$ plain form
8357 2388 -26453 -18143 17447 25596 26855 52365 52718 50761 52709 63204 77234 89872 101206
8344 101206 81145 77360 82824 85203 88876 107000 94974 61096 68817 110238 161371 222670 231848
8331 231848 218957 211596 186536 117839 59658 40963 38152 44238 48959 46167 24079 25065 42390
8318 42390 33796 16246 33422 47831 35945 1728 13020 16633 -9814 -27486 2104 15458
8306 15458 9968 42361 65223 89220 68406 59564 63259 73830 77992 58281 42625 22813 20413
8293 20413 15744 28760 18453 -7281 -4844 26094 73619 81145 80395 66531 93380 107461 106902
8280 106902 101044 77753 68020 44747 28859 -18621 -14583 12735 14106 13758 16568 16287 -6727
8267 -6727 -25374 -16743 -1241 21766 35246 27939 27301 28999 38789 31237 21891 26245 48109 52526
8253E2526o412J9332p973k2580j1024K225j823n706j0929L2137J9004J5040j409
8240G2408J8415L1162K3524r529n4887l4583k2993j6682j7673j4938J5020J8019
8228G263K1842J8442N418k3666l3821M488j3014j1327j1044J6613J7603n175k28
8215f606J0093M965M079j3264J4967o423j8355l441K2104J4056k8182j7430O542
8202a6895K6159K0773q722p692L514J5365j2201n398j7328j1761Q394K625j3739
8189a6906L585K2662N196N177M250J07n933L935J4234j2732K782j8110m6412M262
8175c3903M31K1420J6656j210J3073Q846N994p282m924J357p325J2001l079M056
8161B6111J7511K2446n954m2541P24l438N206O631p574r492k2203K2397j640R692
$$ plain form
8253 52526 46114 65446 57473 34893 23869 26094 24271 18565 7636 39773 58777 73817 72408
8240 72408 90823 121985 145509 135980 81093 46510 23517 6835 -10838 -25776 -10756 7263
8228 7263 29105 47547 52965 29299 -4522 -34 -13048 -24375 -35419 -18806 -1203 -6378 -6606
8215 -6606 3487 8452 12531 -733 14234 7811 -10544 -13985 8119 22175 -6007 -23437 -16895
8202 -16895 9264 30037 21315 13623 17137 32502 20301 14903 -2425 -14186 -5792 -3167 -16906
8189 -16906 -13321 9341 14537 19714 23964 24071 18138 22073 36307 23575 26357 8247 -38165 -33903
8175 -33903 -33472 -12052 4604 3394 16467 25313 31307 24025 19101 20458 13133 25134 22055 26111
8161 26111 43622 66068 60114 17573 18297 14859 20065 26696 19122 9630 -12573 9824 8184 17876
8147A7876J2297k1848n916J8448J078J6794n984k2538k7813N253j649J548q684
8134b1138R142J7623L8814L8063j4505k3694K551K1948j7558k7075J2093R604
8122D5868q463j6560K5733J9168j5522j6853l799J0332j0984r969n752j8210n691
8109a0702Q877J0021j6952J7151q34R152J5981j4443l4099k2584J6182K6019m347
8096e78k8807J28j4025p697J9754J5015K6532K2234j085k3082q275J6901M066
8083B1081k5993J5642m280k0684L7476R585J1053R70n613M903j4736Q541J8328
8070E6273P22k0865q632o335J5863n138l0455k1364J0388K1944K781p820q592
8057a230m0467J6940K7868r610n306K4958J8587K3399p240k5952l6753J0130M616
$$ plain form
8147 17876 30173 8325 2409 20857 21935 38729 32745 10207 -17606 -12353 -14002 -12454 -21138
8134 -21138 -11996 5627 44441 82504 67999 44305 46856 68804 51246 24171 36264 45868
8122 45868 37405 20845 46578 65746 50224 33371 29572 39904 28920 18951 13199 -5011 -10702
8109 -10702 -1825 8196 -8756 8395 7561 16713 32694 18251 -15848 -38432 -22250 3769 -578
8096 -578 -29385 -29257 -43282 -50979 -31225 -16210 10322 32556 31471 8389 114 17015 21081
8083 21081 -4912 10730 6450 -14234 23242 32827 43880 44850 39237 44140 29404 37945 56273
8070 56273 56995 36130 27498 21163 37026 31888 1433 -19931 -9543 12401 15182 7362 -1230
8057 -1230 -41697 -24757 3111 -6499 -11805 13153 31740 55139 47899 21947 -14806 -4676 -60
8044f0n855q170j1184j3789K0495L2856M010j1317N20K5056J3694m85q983j3508
8030B3280R54J4350j8326k5101n493P650j2321j7948K972l018k89K3750J8434
8017H894j0362k810J1602J3663J3797K9542o654k4188J4703J724l2698j2275K4086
8004B9024l297j0779j9623M345j3551j8857J7530J5339J9427J5004J7948K489
7992E4999j3211j535n466O768k711R626L714J6794j2545l3741Q313J6221j8119
7979B9107k0048o284L0563J5481J570r045k4372j7092m989O305j5157J5577K5986
7966B7602J2598p733j2124k4837j1781J8837L1156K6386j9387l9335L292R696
7954A4370P754J85M796p91j9115J171l878K896K2925J9991J4794K3933j6330l1509
$$ plain form
8044 -60 -5915 -14085 -25269 -39058 -18563 14293 18303 6986 7506 32562 46256 45771 36788 23280
8030 23280 24234 38584 20258 -4843 -10336 -2686 -15007 -32955 -29983 -33001 -33290 -9540 8894
8017 8894 -1468 -4278 7324 20987 34784 64326 57672 33484 48187 49911 17213 4938 29024
8004 29024 25727 14948 -4675 -330 -13881 -32738 -15208 131 19558 34562 52510 54999
7992 54999 41788 40253 34787 41555 38844 48470 52184 68978 56433 22692 31005 47226 29107
7979 29107 9059 2775 33338 48819 50389 41344 16972 -120 -5109 1196 -13961 1616 27602
7966 27602 40200 32467 20343 -4494 -16275 2562 33718 60104 40717 1382 4674 14370
7954 14370 22124 22309 27105 26314 7199 8370 4492 7388 30313 50304 65098 89031 72701 41192
7940D1192m0231J5032M036K945M8217J358m4123K387rj2195J77J1088j2027k5867
7926h020j3680L701K2885K4821q57j3070o033l0427O042J6168L739j8853J5194
7913A610J7877K7097R511l46M6K974L788k6420L45J9059j2130k4459j9585q150
7899h783L165J3152L5615K9014j6456j4674j6687Q182J8744k933J759O622n203
7886E1517j5051r469m240Q457j3868m008R022k6663k5078K561N867l8069j4350
7873g3372J6236K3903J9572J162P37r990O977K1150J688k2467J3823J3984j394
7860A2009m027j6533N490p3j0064R193O267J879J6003j8804n036P758Q287j7376
7846e027j2812J3357J793k6894j0477L5343J6349j7227j8645j0022j2082L6147
$$ plain form
7940 41192 961 15993 20029 22974 71191 72549 28426 30813 30804 18609 18786 29874 17847 -8020
7926 -8020 -21700 -17999 4886 29707 28850 15780 9747 -20680 -14638 1530 5269 -13584 1610
7913 1610 19487 46584 56095 55749 55795 58769 62557 36137 36482 55541 43411 18952 -633 -8783
7899 -8783 -5618 7534 43149 72163 55707 41033 24346 32528 51272 48339 50098 56720 51517
7886 51517 36466 26997 22757 31214 17346 13338 22360 -4303 -29381 -26820 -20953 -59022 -73372
7873 -73372 -57136 -33233 -13661 -12499 -11762 -21752 -14775 6375 8063 -14404 -581 13403 12009
7860 12009 7982 -8551 -3061 -3134 -13198 -4005 2262 4141 20144 1340 -3696 4062 12349 -5027
7846 -5027 -17839 -4482 -2689 -29583 -40060 -4717 11632 -5595 -24240 -34262 -46344 -10197
7834a0197L5408J304m1319k7041j663O578L8992K8454j9400j1646O563L185Q421
7821A7639j1183J2472M025L3406J829k1266k8802j9413k762j6577j2108j005J2018
7808c1727K2471J8920P028p724k2654m1811L872M3022J1426k4849J1448J4935
7796D357R053r893J5259j1977L922k7331j3182J6346M636j0283K2041M438j6764
7783i378M794R234M073k7706J1571J3319K7219k115k7057k2711l861j2625J166
7770c4077L1706K0120R82P087l640k42j9686q380J1434J7314O975j7892N711P204
7756B4616K619J15Q169j564l8530J284K3197m121j5712O956L8604K5283j4952
7743E5964l0551l2681J2378K3473K9102j190l1458l1957o714K664L269j2986q350
$$ plain form
7834 -10197 25211 26515 -14804 -41845 -43508 -36930 2062 30516 11116 -530 6033 9218 17639
7821 17639 6456 18928 22953 56359 58188 36922 8120 -11293 -14055 -30632 -42740 -43745 -31727
7808 -31727 -9256 9664 16692 8968 -13686 -55497 -51625 -8603 2823 -22026 -10578 4357
7796 4357 13410 3517 18776 6799 10721 -16610 -29792 -13446 -8810 -19093 2948 7386 -9378
7783 -9378 -4584 4650 8723 -18983 -7412 5907 33126 31011 3954 -18757 -22618 -35243 -34077
7770 -34077 -2371 17749 18731 25818 22178 21936 2250 -6130 5304 22618 29593 11701 17412 24616
7756 24616 27235 27350 35519 33955 -4575 -3291 19906 15785 73 7029 45633 70916 55964
7743 55964 25413 -7268 5110 28583 57685 56495 25037 -6920 -13634 -10970 -7701 -20687 -29037
7730b9037J9513j5337K8226L5096k4680j5557p417q317o832l381j2554n156o322
7717e1755M624K2380O110J1859J230j4667J233Q440q064J362K3455m750P148L7797
7703D6402J076j8091m665j4975l663K7839O513K475k2744k6290l1726j3279J2366
7690c8762J9906M405Q846K0476J338j6402r753J2795k2796k4604J7450R439j4236
7677c1898j035J7849l529J8187K7082k4380L730K4837j4789k963l331k4248K4400
7664I912J3116l107j450j3539l6583P558K6694J3849k0458k3087r755j7098O952
7651d6996M6015K9342k1411p221q070k0707K1954O505p924J6214O647L065J4798
7638C2211J2515j7796k0480r477J1496n387j966O083M826q885j4892R27j477J1201
$$ plain form
7730 -29037 -9524 -24861 3365 38461 13781 -1776 -9193 -17510 -24342 -27723 -40277 -45433 -51755
7717 -51755 -47131 -24751 -18641 -6782 -5552 -20219 -18986 -10546 -18610 -17248 6207 1457 8605 46402
7703 46402 47478 29387 24722 9747 6084 33923 40436 42911 20167 -6123 -37849 -51128 -38762
7690 -38762 -18856 -14451 -5605 14871 16209 -193 -9946 2849 -19947 -44551 -27101 -17662 -31898
7677 -31898 -32933 -15084 -18613 -426 26656 2276 6006 30843 16054 13091 9760 -14488 9912
7664 9912 23028 19921 18471 4932 -31651 -24093 2601 16450 -4008 -27095 -36850 -53948 -46996
7651 -46996 -981 28361 6950 -271 -8341 -29048 -7094 -589 -8513 7701 14348 17413 32211
7638 32211 44726 26930 6450 -3027 8469 3082 1116 7199 12025 3140 -11752 -10825 -12302 -1101
7624a101K6188P706J5088k307j0398J934J492l3452l3784K5258p00j3933k1708
7611c9717L285J583K5296L0754m340k898m1191l8793M695P980L0604K2509r11
7598a144L9086q968j4920k189R355J3950l700J9849J4428l8261j6973K2380j3215
7585A9678k6429j1944Q294K4097Q001r302R423J7237j4485l5694k7723k352J244
7572c9955J8035j0567R056j979J2282L1805m705L661K741k9260O377Q130q513
7559b892j2544N841K257J5707n146k0336M663J5704J9867M779J4096K351k0832
7546B3515j2042m058l022O467J8831q863N15l1827o017R63k5637K7108J5003J7657
7532A8593p798m694J4274l1235o164R917J5706K072K690J2462j3658k655K6252
$$ plain form
7624 -1101 25087 32793 47881 45574 35176 37110 38602 5150 -28634 -3376 -4076 -18009 -39717
7611 -39717 -36432 -34849 -9553 21201 16861 13963 -27228 -66021 -61326 -53346 -22742 -233 -1144
7598 -1144 37942 28974 14054 11865 21220 35170 31470 51319 65747 27486 10513 32893 19678
7585 19678 -6751 -18695 -10401 13696 21697 12395 21818 39055 24570 -11124 -38847 -41199 -39955
7572 -39955 -21920 -32487 -23431 -25410 -13128 18677 13972 17633 20374 -8886 -2509 5621 -2892
7559 -2892 -15436 -9595 -7338 8369 3223 -17113 -12450 3254 23121 27900 41996 44347 23515
7546 23515 11473 7415 4393 10860 29691 20828 21343 -10484 -16501 -15538 -41175 -14067 936 18593
7532 18593 10795 6101 20375 -10860 -17024 -7107 8599 10671 13361 25823 12165 9510 35762
7519C5762J5814j0211m240j8517l1120m105l96q894O4Q357J7106l993j5418K0840
7505A049Q388j1556k395m190P29k12K1571n218Q821L695Q304j1034j4147L44O214
7490A0363J4442j3114j0101j424j1177l436J6230l908O562j967k1533K1251K0910
7477B3098J6245K476k7125j6504K978m729K4048R976m878R234o013p433K3364
7464D4737m0758k5689k1864K245J4106L89j110k4554j4325M4455M8149Q826m207
7451C0400j6112j3684O280K5784j4058k5896j313n505K376l010n241M914r698
7438b4763K377j0537k163J047N488r880O826k6973j0284O117P402Q310P945J9761
7424a9327N212M83L5457J357j9148k4903j2375k1532J1207K0698K1131j180k6373
$$ plain form
7519 35762 51576 41365 37125 18608 -12512 -16617 -17013 -25907 -25843 -17486 -380 -4373 -19791 1049
7505 1049 9437 -2119 -4514 -8704 -7975 -8187 13384 8166 16987 20682 28986 17952 3805 4149 10363
7490 10363 24805 11691 1590 166 -11011 -14447 1783 -2125 4437 2470 -19063 2188 23098
7477 23098 39343 41819 14694 -1810 1168 -3561 20487 30463 25585 34819 28806 21373 44737
7464 44737 3979 -21710 -43574 -41329 -27223 -26834 -27944 -52498 -66823 -22368 25781 34607 30400
7451 30400 14288 604 6884 32668 18610 -7286 -8599 -14104 -11728 -14738 -19979 -15065 -24763
7438 -24763 -22386 -32923 -35086 -34039 -28551 -38431 -31605 -58578 -68862 -62745 -55343 -47033 -39088 -19327
7424 -19327 -14115 -13632 21825 23182 4034 -20869 -33244 -54776 -43569 -22871 -1740 -2920 -29293
7411b9293l3242j1928J4246K3461j7949k2972K4779J4796p964R413K1995M2808
7399B8150N674j9609k6315n909q53j818R906L287j6634k6810N295O144k566j009
7385d3067j9763L5537N6582P995m3387O960N287k3069j9396K1498J8789J2607
7373A6573k188J2712j1342k0254p316N646L2610L0639r752q130M005j7199k3372
7360B632l1783l3779k2638R91L1816K0409M133j992M2377N016m1658j5320q022
7347d7818K4858R350J1770o33k0135m603R714k474r614K2484M034J0455j2020
7334d632J0802L1328J3091k2924m974m170N617j6716l1957J9438J2525N406j0506
7321B328j5154k0420J4951K2903K4879J0407k0512p679k5157P37J2274O649J4668
$$ plain form
7411 -29293 -62535 -74463 -60217 -36756 -54705 -77677 -52898 -38102 -46066 -36653 -14658 28150
7399 28150 33824 14215 -12100 -18009 -18862 -20680 -10774 -7487 -24121 -50931 -45636 -39492 -42058 -43067
7385 -43067 -62830 -27293 29289 37284 -6103 857 6144 -16925 -36321 -14823 3966 16573
7373 16573 14385 27097 15755 -4499 -11815 -6169 26441 57080 47328 39198 43203 26004 2632
7360 2632 -29151 -62930 -85568 -84577 -52761 -32352 -28219 -30211 12166 17182 -24476 -39796 -47818
7347 -47818 -22960 -13610 -1840 -2473 -22608 -27211 -17497 -19971 -29585 -7101 -3067 7388 -4632
7334 -4632 6170 37498 50589 27665 22691 18521 24138 7422 -24535 -5097 7428 12834 2328
7321 2328 -12826 -33246 -18295 4608 29487 39894 19382 11703 -13454 -12717 -443 6206 20874
7308B0874K2445P750k3213k8111o178k5725j5077K1889L0840J278o187k953O433
7295D065J0852J32L034p462q533M679k0599l548J8685l152P096j888n495J3289
7281A1155j4049o985R831j5363N382k653J6704j1308j0329M702J6445r805P886
7268A613j0034l620l0439N277L1872j8678r63K1049k704j0732K8112L4876j5388
7255C0241l3643j1329j1017O272n826k4932J8837L0922L0271K692k4734k0250
7243a2496O20j0431j3240K1451K8615J0807O861m420l0850k7509K5239J5957j1274
7230f70K507j6751Q386K3957j2418J1824n112k2767l229L2295J8992J218q194
7217C0038m2057j7997l045n56K1723K2076j727k075L659J5159M233k4060j2878
$$ plain form
7308 20874 43319 51069 27856 -255 -6433 -32158 -47235 -25346 5494 6772 585 -2368 4065
7295 4065 14917 15049 18083 10621 2088 6767 -13832 -17380 1305 -1847 5249 3361 -2134 11155
7281 11155 -2894 -9879 -48 -15411 -10029 -12682 4022 -7286 -17615 -12913 3532 -6273 1613
7268 1613 -8421 -12041 -42480 -37203 -5331 -24009 -24972 -3923 -6627 -17359 10753 45629 30241
7255 30241 -3402 -14731 -25748 -19476 -25302 -50234 -31397 -475 29796 32488 7754 -12496
7243 -12496 -11876 -22307 -35547 -14096 14519 25326 32187 27767 -3083 -30592 -5353 10604 -670
7230 -670 1837 -14914 -6528 17429 5011 16835 11723 -11044 -14273 18022 37014 38232 30038
7217 30038 -12019 -30016 -33061 -33617 -11894 10182 8455 6380 10039 25198 29431 5371 -7507
7204g507L207M011j1071m658m883o235l221K3916l82P178J0335j9437K375j3458
7190a9830j4334K5959R621k53O054O447L306j5488l516K5622r343j6790j828J829
7176b544k2326j4655J3331Q987k2834K106J9762K3178l4235k4577L0591K6331
7164C115P417j5489k3822j5558N338J4571p445L938L6501j7673J447r895J4296
7151c259J2944j1488N859J2395N705L995k3023p572L671L1227k170J0094J184
7138C9562j3143j5843j7053m347R246j7862J2272J1811J9196J8084j6737l0866
7126e680j6702O482r689J807J7248r316J422L1569L413j5772j4383p899n724J008
7112b2216K0582J0977j5217J6438J4115p817r032j2897l363j0640M705M099J4204
$$ plain form
7204 -7507 -4300 -289 -11360 -16018 -20901 -27136 -30357 -6441 -6823 355 10690 -8747 -6372 -19830
7190 -19830 -34164 -8205 1416 1163 7217 13664 16970 1482 -2034 23588 14245 -2545 -4373 -2544
7176 -2544 -24870 -39525 -26194 -17207 -40041 -37935 -18173 5005 -29230 -53807 -23216 3115
7164 3115 10532 -4957 -28779 -44337 -38999 -24428 -31873 -27935 8566 -9107 -7660 -17555 -3259
7151 -3259 9685 -1803 4056 16451 22156 26151 3128 -4444 -773 30454 28284 38378 39562
7138 39562 26419 10576 -6477 -10824 -1578 -19440 -7168 4643 23839 41923 25186 -5680
7126 -5680 -22382 -15900 -25589 -23782 -6534 -15850 -14428 17141 20554 4782 -9601 -17500 -23224 -22216
7112 -22216 -1634 9343 -5874 10564 24679 16862 7830 -5067 -8430 -19070 -14365 -10266 3938
7099C938L0477M322k1751j3701j6221n802j6149k1292J5052K4904J2954j457j1076
7086a5802j5071j0760L2791m299L693k9182J9K9207J2540j0796j8182k3957j0231
7073f0030k871j5809J558M3005J9944m770K6191Q181J1461j7357K586j2224k5322
7060b5457m899J2357O783n135j4493L3104K8244r804j1466J6428M176J9648k5336
7047B4150k464j2095L737j8860k5077J0976l243k9374m100J1100n86K3203L583
7034a9050j4524j8139J5996Q515J2124J0194k3046j1974L2922l113k3584J1287
7022b2392n406M733J5758L3782k380j0598j5522l2589L589J0694K2459K0r558
7009g410J8387J0407R069J6223p892p651N896n556j1184k1934j1540J811J9882
$$ plain form
7099 3938 34415 38737 16986 3285 -12936 -18738 -34887 -56179 -41127 -16223 -3269 -4726 -15802
7086 -15802 -30873 -41633 -8842 -13141 -9448 -38630 -38611 -9404 3136 -7660 -25842 -49799 -60030
7073 -60030 -62901 -78710 -77152 -34147 -14203 -18973 7218 15399 26860 9503 12089 -135 -25457
7060 -25457 -30356 -17999 -11216 -16351 -30844 2260 30504 20700 9234 25662 29838 49486 24150
7047 24150 21686 9591 13328 -5532 -30609 -19633 -22876 -52250 -56350 -45250 -45836 -22633 -19050
7034 -19050 -33574 -51713 -35717 -27202 -15078 -4884 -27930 -39904 -6982 -10095 -33679 -22392
7022 -22392 -27798 -23065 -7307 26475 24095 13497 -2025 -34614 -31025 -20331 2128 2148 -7410
7009 -7410 10977 21384 30453 46676 38784 31133 37029 31473 20289 -1645 -13185 -11374 8508
6996H508J7689J398l8576j9946K0341K8412K9654j0697j7609n632k0907j0015
6984a7380J2511k1427k0567J5714J4517M246k553k333q178m3534k074L0928J9967
6971b0163n74j0108j3493j4169J7540K0586j4536L784M583Q387j7540p331P035
6958c5999J264R942J2773J0795K6449J8872k6369j9587j048k641j6778p58P720
6945a5365n153P930P877k7312j0094L5717Q937k9124J3952J5347q928M67P05l95
6931e439j9220l190k6523J313J9072M917j1400r94m980n50N295o968p319P165
6917d8821k4703J3372R678K7425J9820K0223p232j1018o678p355J8140J0715k6001
6904a2435l6687j135K015K0928j44M698J2007j1292J1733k425l582m665j971J4238
$$ plain form
6996 8508 26197 27595 -10981 -30927 -10586 17826 47480 36783 19174 13542 -7365 -17380
6984 -17380 -4869 -26296 -46863 -31149 -16632 -12386 -14939 -17272 -25450 -68984 -71058 -40130 -20163
6971 -20163 -20737 -30845 -44338 -58507 -40967 -20381 -34917 -31133 -26550 -18163 -35703 -43034 -35999
6958 -35999 -34735 -24793 -12020 -1225 25224 44096 17727 -1860 -2908 -5549 -22327 -23085 -15365
6945 -15365 -20518 -12588 -4711 -32023 -42117 -6400 2537 -26587 -12635 2712 -6216 -5749 -5044 -5439
6931 -5439 -24659 -27849 -54372 -53059 -33987 -29070 -40470 -41464 -46444 -46994 -41699 -48667 -55986 -48821
6917 -48821 -73524 -60152 -50474 -23049 -3229 16994 9762 -1256 -7934 -15289 2851 13566 -12435
6904 -12435 -49122 -50257 -48242 -27314 -27458 -22760 -10753 -22045 -10312 -12737 -16319 -20984 -22955 -8717
6890h717M104N581k800M712k5654m691R955J740J2049k609k3147l32P447P739
6876a4623N490K3601L794J333k8156j2895p423J325l556M6182N791l0833j398
6863a1368K2142J5326N572l5785j1883N52j2085k56j24r782l3175N301J4118Q825
6849d2622N215j6046J178R720o292L1852K4618j321j0897J5048P956p208l2500
6836b1299J525P327J1514N843j4969j5860k246m075O02j3719J4801J1726M0223
6823B1393j3452k5959J085J6473j5049p874k2951l706j746O020L0512q093r616
6810c2963J149k098M909J3654K5760R432l8L3682R25j087k0831k6165m1984J0934
6796b4721J3219j4979J163K5131k742J6307P816j6200k0148J4979q181j146J1226
$$ plain form
6890 -8717 -4613 968 -1832 2880 -22774 -27465 -17510 -15770 -3721 -6330 -29477 -29809 -22362 -14623
6876 -14623 -9133 14468 18262 19595 -8561 -21456 -28879 -27554 -31110 15072 20863 -9970 -11368
6863 -11368 10774 26100 31672 -4113 -15996 -15444 -27529 -27785 -27909 -37691 -70866 -65565 -51447 -42622
6849 -42622 -37407 -53453 -52275 -42555 -48847 -16995 7623 6302 -4595 10453 18409 11201 -21299
6836 -21299 -19774 -12447 -933 4910 -10059 -25919 -28165 -32240 -31638 -45357 -30556 -18830 21393
6823 21393 7941 -18018 -16933 -460 -15509 -23383 -46334 -50040 -51786 -45766 -15254 -23347 -32963
6810 -32963 -31814 -33912 -29003 -15349 10411 19843 19805 53487 54412 53325 32494 6329 -35655 -24721
6796 -24721 -11502 -26481 -25318 -187 -2929 13378 21194 4994 -15154 -175 -8356 -9502 1724
6783A724l189j0132j8865q12J7519o581k9835n95L5164K3973K3322k3074R82L44
6769I945K7364k0679l0701J589j2284N571J0629j6785l789K639o782k864M841
6756c1306N227J5975K509L8052L9658r029l9518m5582k0477M598J4039j5361K0783
6743b0432K274p957J560J9795l579j101j1648K3129j4670k6734j7802M1156M1559
6730B5550J0143j0153r284j4778n209k439k0689N031J309j8209j7004K8545K4744
6717b443K3402j880o44j9724j1418j545j0687j344k0078k9926J5570J6138L4907
6704i672j0621k1717k814J8773m033K121J572K2284K4328P493m360l434K512J493
6690B3925k4697k681j8885j81K2030j376J7422L0003j2241l4632M314M035j5214
$$ plain form
6783 1724 -1465 -11597 -30462 -31274 -13755 -20336 -50171 -50766 -15602 8371 31693 8619 9601 9945
6769 9945 37309 16630 -14071 -12482 -24766 -19195 -8566 -25351 -29140 -26501 -33283 -36147 -31306
6756 -31306 -26079 -10104 -7595 30457 70115 61086 21568 -24014 -44491 -39893 -25854 -41215 -20432
6743 -20432 -18158 -26115 -24555 -4760 -8339 -9440 -21088 2041 -12629 -39363 -57165 -16009 25550
6730 25550 35693 25540 16256 1478 -3731 -6170 -26859 -21828 -20519 -38728 -55732 -27187 -2443
6717 -2443 20959 19079 18435 -1289 -12707 -14252 -24939 -26283 -46361 -76287 -60717 -44579 -9672
6704 -9672 -20293 -42010 -44824 -26051 -30084 -27963 -26391 -4107 20221 27714 23354 19920 22432 23925
6690 23925 -772 -3453 -22338 -22519 -489 -1865 15557 45560 33319 -1313 3001 7036 -8178
6677h178j480j926p166L861j5046O637R237O433K275k842o4J3633p957r795J1370
6662a008K5859j7807l8583L659K0499j2242q273J2575j4139L456K7818J8732j6861
6649C685j5903M73J0293j6087n010l7M926K739m417L915n667k2708J6187J7399
6635a0212K2898K0672k5922j5534J2186N791o037K586j4606j9121K9762J0275
6623A2738k251k0385j2983L012j53K287J9120J2805l0318n990J7764j7285r160
6610c0799Q832J6344n17r857Q347k0787l2895K2750O2782M5855j4917j4173k7017
6597A3948j4849l379K7323j1342j5167Q10L3801J3798k9625k2753M358J1956r96
6584G883p813j1523j1098r898k4288O923J5682K4406J302k4096k082j2925l5152
$$ plain form
6677 -8178 -9658 -11584 -18750 -14889 -29935 -23298 -14061 -7628 -5353 -8195 -8259 5374 -2583 -12378 -1008
6662 -1008 24851 7044 -31539 -27880 -7381 -19623 -27896 -15321 -29460 -26004 1814 20546 3685
6649 3685 -12218 -11745 -1452 -17539 -22549 -22586 -17660 -14921 -19338 -15423 -21090 -43798 -27611 -10212
6635 -10212 12686 33358 7436 -8098 4088 9879 3842 6428 -8178 -27299 2463 12738
6623 12738 10487 -9898 -22881 -19869 -20022 -17735 1385 14190 -16128 -22118 -4354 -21639 -30799
6610 -30799 -21967 -5623 -6140 -15997 -7650 -28437 -61332 -38582 24200 70055 55138 40965 13948
6597 13948 -901 -4280 23043 11701 -3466 -2656 31145 44943 15318 -7435 -3077 8879 7883
6584 7883 70 -11453 -22551 -32449 -56737 -49814 -34132 -9726 -8424 -32520 -34602 -47527 -82679
6571h2679Q760K5540K0926n338K3802M52l064P376P115J7279M426j8973k1364
6558a5742j334L19J308j5465k5023P828J1939O361k131K4M133L4429m933j1395
6544i682Q334J4645J4895k8560r506J1342P244k670o809O043m063M497J4129N749
6530B5588m759q970k719J9111K261Q871J246j9440j409j8519k0503j4115j5076
6517d8433L5095K0418M677k566M155O878j5000P936j5965k5268K307k346J2281
6504a5831J1876J0541J1604M59n542j1947k1360r863m960J5706K6512j2027n164
6491i996k6995j7638J7344L7273J0247j8030K0131K1469K4373Q809k0555l373
6479D3059j2814k3237k963j2149j6850Q282M1l212K145q354K5594j900J8595K4901
$$ plain form
6571 -82679 -73919 -48379 -27453 -32791 -8989 -8537 -11601 -4225 2890 20169 24595 5622 -15742
6558 -15742 -17076 -16757 -15449 -30914 -55937 -48109 -36170 -29809 -31940 -31916 -27783 6646 1713 -9682
6544 -9682 -1348 13297 28192 -368 -9874 1468 8712 6042 -767 5276 1213 5710 19839 25588
6530 25588 20829 11859 9140 28251 30512 39383 40629 21189 19780 1261 -19242 -33357 -48433
6517 -48433 -13338 7080 11757 9191 13346 20224 5224 13160 -2805 -28073 -25766 -28112 -15831
6504 -15831 -3955 6586 18190 18649 13107 1160 -20200 -30063 -35023 -19317 7195 -4832 -9996
6491 -9996 -36991 -54629 -37285 -12 10235 -7795 12336 33805 58178 66987 46432 43059
6479 43059 30245 7008 4045 -8104 -24954 -16672 -16631 -19843 -17698 -26052 -458 -2358 16237 41138
6465D1138j81J619j8712j227k553k0569P364j5940J1800J5863j6972p664j4176
6452b0210k0274O580J2595N596K1017J2346j0957m901l3404j7915J4680K2626
6440a2221j7115j9120l368J7419J5308J1998J4402k904q972k794J8335o860m502
6427c94l942J585k4160j2161O377l869J0320J9048J4227j931j1261j8553J0621
6414a4093J0992J0633J1320L6890j108k6304m7382j9523j4372R642J7714J8695
6402f896Q535j3136P992L685R455M809j562p397m811O279r408j3758j0868Q802
6388a8279N354L0519K232j1796M431K2048j5548P99R685N546P98J966J807j6923
6374B2639j3672l812K5257o192j4304P294k8835M45O189m324k2013J0814K4137
$$ plain form
6465 41138 40957 42576 23864 22637 20084 -485 6879 -9061 2739 18602 1630 -6034 -20210
6452 -20210 -40484 -33904 -21309 -15713 5304 17650 6693 1792 -31612 -49527 -34847 -12221
6440 -12221 -29336 -48456 -51824 -34405 -19097 -7099 7303 4399 -4573 -7367 10968 4108 -394
6427 -394 -4336 -2751 -26911 -39072 -32695 -36564 -26244 -7196 7031 5100 -6161 -24714 -14093
6414 -14093 -3101 7532 18852 55742 54634 28330 -19052 -38575 -52947 -43305 -25591 -6896
6402 -6896 1639 -11497 -3505 180 9635 14444 12882 5485 674 6953 -2455 -16213 -27081 -18279
6388 -18279 -12925 17594 19826 8030 12461 34509 18961 19760 29445 34991 35789 37755 39562 22639
6374 22639 8967 5155 30412 24220 9916 17210 -11625 -11180 -4991 -9315 -31328 -20514 3623
6361C623N285L510l6643j1863J2097J1408J0951K6601L769k3390j4527j1716j0782
6348c1677J6078K7929P661j5523J2416j4285j7808j926J6987L527q755m370J9326
6335I580J5928J0511J4960j0239p530p402k5499j4288l427L960J2170L1105k44
6322B9585M887l264o771k5052m64Q132r456k6397K8776J0781J3481Q724j3314
6309A9648p200n120J2117l400k9647P948M1748J8577k4683l1168k5874J958K2256
6296b840R24k638L947j5205m097j6689o405j6986K1477J6682N279k547l21J7094
6282b325L1538J8819k0991k1054l5288j5472P351L0145L926j4939j5599R421L705
6269b0763J1478p141K642o922L327L9352O031l3360k2426J3100K8615p183P01
$$ plain form
6361 3623 8908 12418 -24225 -36088 -23991 -12583 -1632 24969 28738 5348 -9179 -20895 -31677
6348 -31677 -15599 12330 19991 4468 16884 2599 -15209 -17135 -148 3379 -5376 -9746 9580
6335 9580 25508 36019 50979 40740 33210 25808 309 -13979 -17406 -13446 -1276 29829 29585
6322 29585 34472 31208 24437 -615 -1079 7053 -2403 -28800 -24 10757 24238 32962 19648
6309 19648 12448 7328 19445 16045 -13602 -5654 36094 54671 29988 -1180 -27054 -25096 -2840
6296 -2840 -1916 -4554 -607 -15812 -19909 -36598 -43003 -59989 -38512 -21830 -16551 -19098 -19419 -2325
6282 -2325 29213 48032 27041 5987 -29301 -44773 -37422 -7277 -3351 -18290 -33889 -24468 -20763
6269 -20763 -9285 -16426 -13784 -20706 -17379 21973 28004 -5356 -27782 -14682 13933 6750 7451
6256G451P719Q581L928K780P312r657q915k6937k7269l269j3828P812K7430K3327
6242F465K4750l612k2381k3379R117R627J4558K0558q293k2285p880m7135j0884
6229f0774K5125P102l1568j1686K7945L8487K0088K555m945j2045L511K2780Q764
6216C5339l0217J6838M594k915j7649l1576r3J5180m347m567l3631L635J705K6481
6202b1223R387k00J4224J4449r54K2061j2394n5423j5970L8377K390r095J5188
6189H17J6974J4689j0794L777l582k4J2880p159j9779q212j7508q656J4354k544
6175a4767N058j2419k2687J433q589j3616K4388K0311L922J430N59j5639r927
6162d0543Q411l0050r565L8366j2742L160K3407O499N331k667J8600k1042k2696
$$ plain form
6256 7451 15170 23751 27679 30459 37771 28114 19199 -7738 -35007 -38276 -52104 -44292 -16862 6465
6242 6465 31215 27603 5222 -18157 -9040 587 15145 35703 27410 5125 -2755 -49890 -60774
6229 -60774 -35649 -28547 -60115 -71801 -43856 -5369 14719 17274 12329 284 3795 26575 35339
6216 35339 5122 21960 26554 23639 5990 -25586 -25679 -10499 -14846 -19413 -53044 -49409 -47704 -21223
6202 -21223 -11836 -12036 2188 16637 15683 37744 25350 -30073 -46043 -7666 -5276 -14371 817
6189 817 17791 32480 21686 25463 21881 21857 34737 27578 7799 -413 -17921 -26577 -12223 -14767
6175 -14767 -9709 -22128 -44815 -43382 -51971 -65587 -41199 -20888 -16966 -15536 -14977 -30616 -40543
6162 -40543 -32132 -62182 -71747 -33381 -46123 -42963 -19556 -13057 -7726 -10393 8207 -12835 -35531
6149c5531n911n320P915M213k41N609K8421R769j6047K0718J6072O901j5338L834
6135B5064k182j7493l5895M671N820k829K0009J1875O268k4130J1210J4976o029
6122A1335M39K970j5515J2427P937j0629n449k273J0430L866j4373m69J1475o66
6108A1505n494N601k5223O970l04J343N277J2024m129k0976j4388n647J2393L1313
6094A0265J4544l008j4793p549L524J013J3808o86J767j6620Q280m503p532K4848
6080B3358L2276k1806k6919r52j8013j7639M357R380L26L733o988j4607M1952
6067H458K7073o730k5657K1438L214L335O096l1646j7506J0756J9287R767p248
6054B0637m826k6995q842P901L575K8282M665l9498r027J839q120J6150K4596
$$ plain form
6149 -35531 -41442 -46762 -38847 -34634 -34875 -29266 -845 8924 -7123 13595 29667 36568 21230 25064
6135 25064 22882 5389 -30506 -25835 -20015 -22844 -2835 9040 15308 -8822 2388 17364 11335
6122 11335 11774 14744 -771 11656 19593 8964 3515 1242 11672 15538 1165 696 12171 11505
6108 11505 6011 11612 -13611 -6641 -6945 -5602 -325 11699 7570 -13406 -27794 -33441 -21048 10265
6094 10265 24809 21801 7008 -541 2983 3996 17804 17118 18885 2265 10545 6042 -1490 23358
6080 23358 55634 33828 6909 5957 -12056 -29695 -25338 -15958 -15632 -11899 -18887 -33494 8458
6067 8458 35531 28801 3144 24582 27796 31131 37227 5581 -11925 -1169 18118 27885 20637
6054 20637 15811 -11184 -20026 -12125 -8550 19732 24397 -15101 -24128 -22289 -30409 -14259 10337
6041A0337K039k295k4429m108q481l887m033j7814L0601L384j2208L790P061k2795
6027d2838j2739L025K1180J8399Q602k794O014j0901O463k021M241K1067J7773
6014C5471l2667m471R581J5846Q63j652o428n413q759j8498R003P290J8198K5792
6000D4156j5857k6039j4409n503M700J7097j6245j5647p767J0844K6068K1884
5988B3282l826k0684N363K2879R909k8820k5083J0200k656Q777q772R560O349
5975F478r407l943j0353J2826l364J797J1788m029q802J2998J1706j3382n275
5962i62K003N297o74j5499j456M654K2349J2274j2964P14M165L094l1255l6031
5948d4291J4343J3883J299p100O605J1771J1012L672M950J3147l4788q593L0875
$$ plain form
6041 10337 12376 10081 -14348 -18456 -26937 -30824 -34857 -52671 -22070 -18686 -30894 -27104 -20043 -42838
6027 -42838 -55577 -52552 -31372 -12973 -4371 -7165 -1151 -12052 -5589 -7610 -3369 17698 35471
6014 35471 2804 -1667 7914 23760 24623 22971 16543 11130 2371 -16127 -7124 166 18364 44156
6000 44156 28299 2260 -12149 -17652 -12952 4145 -12100 -27747 -35514 -24670 1398 23282
5988 23282 19456 -1228 4135 27014 36923 8103 -16980 -6780 -9436 -659 -9431 129 6478
5975 6478 -2929 -6872 -17225 -4399 -7763 -5966 5822 1793 -7009 5989 17695 4313 -962
5962 -962 1041 6338 5664 -9835 -11291 -6637 15712 27986 15022 15736 19901 22995 -8260 -44291
5948 -44291 -29948 -16065 -14766 -21866 -15261 -3490 7522 11194 16144 29291 -5497 -14090 16785
5935A6785M190n094l5121j6677K1048j4309N493K6482q123j9166K304j3467q769
5922d4424J9552K7579l9303k1740O505J8694J5070P928p821k5946j2184O750M06
5909d8934K150j9233K04K6104K5718P042R297K5152l44k2622o73o012j82k3003
5895b5336J5999K3819k5214o517M651L775j8863j2390J6412J2675k6062q340M8862
5882C471J9969n027K750Q42j1307r755j0033j385m83j508K7848K0683q747l4010
5868f692O306k2656j1223r947R814J234J3068J1573k6084m670j1339j7163J1599
5855e6180K7758L2233j9306k45P574J5023K007k0689j086J763L285m576j1118
5842b3557j5589L0135M092l7624j5010N678L2874K2463J0733L695M195K5613K5432
$$ plain form
5935 16785 20975 15881 -19240 -35917 -14869 -29178 -23685 2797 -5326 -24492 -22188 -35655 -44424
5922 -44424 -24872 2707 -36596 -58336 -51831 -33137 -18067 -10139 -17960 -43906 -56090 -49340 -48934
5909 -48934 -46784 -66017 -65813 -39709 -13991 -6949 2348 27500 27156 4534 3861 -2151 -2333 -25336
5895 -25336 -9337 14482 -10732 -17249 -12598 -8823 -27686 -40076 -23664 -10989 -37051 -45391 3471
5882 3471 23440 18413 21163 22005 10698 943 -9090 -10475 -10958 -12466 15382 36065 27318 -6692
5868 -6692 -386 -23042 -34265 -44212 -34398 -33164 -20096 -8523 -34607 -39277 -50616 -67779 -56180
5855 -56180 -28422 3811 -15495 -15740 -8166 6857 8864 -11825 -12911 -11148 -7863 -12439 -23557
5842 -23557 -39146 -9011 -4919 -42543 -57553 -51875 -19001 3462 14195 17890 22085 47698 73130
5829G3130j8630p688l0996l2105J0186l051K9780k0301l2060k429K3476K2848
5817A2160m79k0732j1612J1699J794K4195J5675j8673k5910J0473J2924N677o49
5804A6542k2763n738k7706K8412J3595k648J2280R524K0840j2773j2786l2945
5792a6166k6511P531K6493j0823r525K6809k48k9583L7154n336l8921q523J5607
5779c2042P43o483j0917l604L1586q305k711J3413M545R819N82j0181k4959k277
5765d0791J7547K1431k0127j2351J8490J4383L4484P573k2592j4667J540j2816
5753g896j2510Q704j0537r798M937K34J1454l69J0175l326j7681N859J794j960
5739b0920r339J994n038l270K40J428M1956n916j5967N759K6024J8593k6559l3209
$$ plain form
5829 73130 54500 46812 15816 -16289 -6103 -9154 20626 325 -31735 -34164 -10688 12160
5817 12160 11681 -9051 -20663 -8964 -7170 17025 32700 14027 -11883 -1410 11514 17191 16542
5804 16542 -6221 -11959 -39665 -11253 2342 -306 11974 21498 42338 29565 16779 -16166
5792 -16166 -42677 -35146 -8653 -19476 -29001 -2192 -2440 -32023 5131 -205 -39126 -47649 -32042
5779 -32042 -31299 -37782 -48699 -52303 -20717 -29022 -31733 -18320 -13775 -3956 -3374 -13555 -38514 -40791
5765 -40791 -23244 -1813 -21940 -34291 -15801 -1418 33066 40639 18047 3380 4920 -7896
5753 -7896 -20406 -11702 -22239 -32037 -27100 -26866 -15412 -15781 -5606 -8932 -26613 -20754 -18960 -20920
5739 -20920 -30259 -28265 -33303 -36573 -36333 -34905 7051 1135 -14832 -9073 16951 35544 8985 -24224
5725b4224J378K2477K4951j2499j6214r593Q023K1150j5604j1288k3236l021q604
5712d6304J9426M4252J1825P573o242n704j2012M134Q687K67J4180n540j6948
5699A7594j7455J264n307J8811K6024j1057p396M453J0585P647l861j3704j2650
5686A4948K1444J1307o00k1503m2476L40N948J2738r404j8117K8599L8595j3242
5673B8577o491p036j2859J6482q43L761K0637Q36k9624j1525m674L9830K4892
5660F1963j5657j9856R77k5617k0223o02m942q256J84P709K7519J9296Q055j6519
5646A4031l73l8K989J2539J3016k2157k2578J3696J5194j1175n564k7699j6658
5633c4777J4984M8196K148k6458k0133J1114K3087N725j3537K2159J0255l0308
$$ plain form
5725 -24224 -22846 -369 24582 12083 -4131 -13724 -5701 15449 -155 -11443 -34679 -37700 -46304
5712 -46304 -26878 17374 29199 36772 30530 24826 12814 16948 25635 25902 40082 34542 17594
5699 17594 139 1403 -3904 14907 40931 29874 22478 26931 37516 45163 41302 27598 14948
5686 14948 36392 47699 47099 25596 -16880 -16540 -10592 2146 -7258 -25375 3224 41819 28577
5673 28577 22086 15050 2191 18673 17830 21591 42228 43064 13440 1915 -2759 37071 61963
5660 61963 46306 26450 27427 1810 -18413 -19015 -23957 -32213 -32029 -24320 3199 22495 30550 14031
5646 14031 13658 13620 16609 29148 42164 20007 -2571 11125 26319 15144 9580 -18119 -34777
5633 -34777 -19793 28403 30551 4093 -16040 -4926 18161 23886 10349 32508 42763 12455
5621A2455r937n544K9566O231o893k856K4459R809q23j7545n873p166J377J1440
5607C8700l1046l4453k8070K1597L3444J913j282j3730J4283m340m028J2101J5760
5594B0849j2410K3199J2721j0993k5023k3532j2871K48o604k1181J0637j2785
5582e7745j1888N689L7517R778r156j0554J7264K5228O530m2r723l6731L184M5420
5568A4771J4483l2196Q11J9629r850k094P393l641J335K6021j5739j7234j1403
5555g714m3722R999K132K9671J3494j2370l706l418N32J3072J8294j0936j0588
5542e260J3566J1143K2174j6170k2747k6284l294K20O816R559K4462K2543k20
5529C6508k5811l5873M547J311N421Q911O755l1650k7922J2623R625J694j5973
$$ plain form
5621 12455 2518 -3026 26540 32771 25878 23022 47481 57290 56467 38922 33049 25883 27260 38700
5607 38700 7654 -26799 -54869 -33272 172 2085 803 -12927 1356 -2984 -7012 5089 20849
5594 20849 8439 31638 44359 33366 8343 -15189 -28060 -27812 -34416 -55597 -44960 -57745
5582 -57745 -69633 -63944 -26427 -16649 -25805 -36359 -19095 6133 12663 12621 2898 -33833 -30649 14771
5568 14771 29254 -2942 -2131 17498 7648 5554 12947 9306 10641 36662 20923 3689 -7714
5555 -7714 -51436 -41437 -39305 -9634 3860 -8510 -12216 -15634 -15102 -2030 16264 5328 -5260
5542 -5260 8306 19449 41623 25453 2706 -23578 -26872 -26652 -19836 -10277 14185 36728 36508
5529 36508 10697 -25176 -20629 -19318 -13897 -4986 1769 -29881 -57803 -45180 -35555 -33861 -49834
5516d9834J5647L2088J9280J320q407J905L788r364L953j3938k0118O224N397
5503a2059O106r018j1801k662R260K0048J0321j5199k5022j9105K6627O499j2767
5490b8772N704O480K4458R125j7887k1722r584R626N162J1083J4663M0005R353
5477E7694k3098j0103Q437M693k3499j5863m985J0508J382q990j004j7713o841
5464b9382K86J0318M781J271J0855K934l303l3545J4013K1088j8918j1976j8146
5451d9724M612K3912L022q395N688K637L7173l078j0503M057K758K2224l468l2365
5437a450o040J0415k1840n386J010j3536J075L2919K2444k5107r463J4397J1010
5424A0448j3098k9654j9572O190K3683J0412R114L7293k5958j035J3116k8422
$$ plain form
5516 -49834 -34187 -2099 17181 18501 10094 11999 15787 6423 10376 -3562 -23680 -17456 -12059
5503 -12059 -5953 -14971 -26772 -29434 -20174 -126 10195 -5004 -30026 -49131 -22504 -16005 -28772
5490 -28772 -23068 -16588 7870 16995 -892 -22614 -32198 -22572 -17410 -6327 8336 48341 57694
5477 57694 34596 24493 32930 37623 14124 -1739 -6724 3784 5166 -3824 -4828 -22541 -29382
5464 -29382 -29096 -18778 -13997 -12726 -1871 1063 -2240 -35785 -21772 -684 -19602 -31578 -49724
5451 -49724 -45112 -21200 -18178 -26573 -20885 -18248 18925 15847 5344 9401 12159 34383 30915 -1450
5437 -1450 -7490 2925 -18915 -24301 -23291 -36827 -35752 -2833 19611 -5496 -14959 -562 10448
5424 10448 -2650 -32304 -51876 -45686 -22003 -11591 -2477 34816 8858 7823 20939 -7483
5412g483Q126K58k6873N155J3323j5682m201J2185K329k8132k9731L651L4368
5399c2707L6138L8933j8550l0611j4910N982J7751O561N335M81R90J513J1113
5386B8019j8219k1337J6583k853k893j2364k9531J4906J2349L59l139j8711r578
5373d6409l13p109L2977J0515o549p943k0398r370K0516J1201l383J1522L696
5360a1047j4336m933M346L9494R351l462j480K0873O024l9219j8372N0596p144
5347C0691l4879L510K181J5598j3244O65L183J392L329L742Q714J925k6571n810
5333e574p909R957n635m312J5075q301j6196o482J9145L6106O760k4841j7528
5320i735o291L519J2137r579o012J2680j5773m405J7427j0448j7005P723K2743
$$ plain form
5412 -7483 643 901 -25972 -20817 -7494 -23176 -27377 -15192 -12863 -40995 -70726 -67075 -32707
5399 -32707 3431 42364 23814 -6797 -21707 -15725 2026 8587 13922 14403 15393 16906 28019
5386 28019 9800 -11537 5046 2193 -700 -13064 -42595 -27689 -15340 -14981 -18120 -36831 -46409
5373 -46409 -46722 -53831 -20854 -10339 -16888 -24831 -45229 -54599 -34083 -22882 -26265 -14743 -11047
5360 -11047 -25383 -30316 -25970 13524 22875 19413 17933 38806 44830 5611 -12761 37835 30691
5347 30691 -4188 -678 1503 17101 3857 4522 7705 9097 12426 16168 24882 26807 236 -5574
5333 -5574 -13483 -3526 -9161 -13473 1602 -6699 -22895 -29377 -10232 25874 32634 7793 -9735
5320 -9735 -16026 -12507 -370 -9949 -15961 -3281 -19054 -23459 -6032 -16480 -33485 -25762 -3019
5307c019R212p412m122R618j9418N631L141N492K2705n219J0067L22j8434k4938
5293a6374j131L234q778L146L4316P590J2070j7153j2487j9835k1551K8227p63
5280i489L311L6909j5336Q623J8576k3800k2357K0369J3689l6817j8375j0052
5268c4749k6781K2546L9394K2171K704n867j1291M200j4747j4971J0001K7735
5256B0345P416k7396q591k1385o810q395M1205J7207J929N023M699r527p636K7040
5242C5124j1883p135J6276j4542P697m91k0787m858J0906J0089J10L339J294j7693
5228G446k6045j626K5312R061k8210m68j3726K8020K7098r714j193l745j5664
5215c454P445j798k0865q185k365J7170k3361l158Q799j2142o186J1107J5961
$$ plain form
5307 -3019 6193 -1219 -5341 4277 -15141 -9510 -6369 -877 21828 16609 26676 26998 8564 -16374
5293 -16374 -17505 -14271 -23049 -19903 14413 22003 34073 16920 4433 -15402 -36953 -8726 -9489
5280 -9489 -6178 30731 15395 24018 42594 18794 -3563 16806 30495 -6322 -24697 -34749
5268 -34749 -61530 -38984 410 22581 25285 19418 8127 12327 -2420 -17391 -7390 20345
5256 20345 27761 365 -8226 -29611 -36421 -44816 -3611 13596 15525 20548 25247 15720 8084 35124
5242 35124 23241 16106 32382 17840 25537 25046 4259 -599 10307 20396 20506 23845 25139 7446
5228 7446 -18599 -20225 5087 14148 -14062 -14530 -28256 -236 26862 17148 15955 12210 -3454
5215 -3454 3991 2193 -18672 -26857 -29222 -12052 -35413 -38571 -29772 -41914 -48100 -36993 -21032
5202b1032J0547m281J6684M973k4880J7465N1226k5941j0616j4007j4030m4790
5190e8682J0878K9272j2006l517k18k254M567J9970K5792L9901k230l1515l7059
5177a7101O879p227K853L1918m972k1636k5697J024L1500K0698j504j7393k1431
5164b2089l8741K7513O602K1163O514K4907j8021j5698L6471J2j8094j3349J8946
5151A6136R02r439J9002p652M528K075j3103j1930r406k1027j1422J1907r25K723
5137b7631j0350J9835K4621J4397j5751o815j3011j5011J2121L5355P124j6301
5125H583P577l306j258j1589q708j682Q94j1465J7944q261J1875j2228j4822j5846
5111d2292J394N1264L0556l5081n048J8058j9894O291Q835K94p48J196J9197j7847
$$ plain form
5202 -21032 -10485 -14766 1918 6891 -17989 -524 50702 24761 14145 138 -13892 -58682
5190 -58682 -47804 -18532 -30538 -34055 -34273 -36527 -31960 -11990 13802 53703 51473 19958 -17101
5177 -17101 -10222 -17449 -14596 17322 12350 -9286 -34983 -33959 -2459 18239 16735 -658 -22089
5164 -22089 -60830 -33317 -26715 -5552 962 25869 7848 -7850 28621 28633 10539 -2810 16136
5151 16136 17038 7599 26601 18949 23477 25552 12449 519 -8887 -29914 -41336 -29429 -30354 -27631
5137 -27631 -37981 -18146 6475 20872 5121 -1694 -14705 -29716 -17595 17760 24884 8583
5125 8583 16160 12854 11596 7 -8701 -10383 -9489 -20954 -3010 -11271 604 -11624 -26446 -42292
5111 -42292 -40898 10366 40922 5841 793 18851 -1043 5248 14083 14377 13629 14825 34022 16175
5097A6175p932K541r290o462J0035L164k1223L470m116N347l733K5508P024j6429
5083D079J0242k3468k1900L931K9865M125o512o229j8522m837J8888L0096J2390
5070C2148L616l7076l0585K7498K4367j8731k7064M522k6369q933K6433J4966
5058a5208j6934J81K3162L5918j484k5201k0208M50R46q372j7457J0478M132L060
5044b6537J9720j955k2304l1550k4457N944J5762R260M0182J5250J0936j1436
5032a185k676j368q550J5596j8083K1304J5268J342k2245j4139M721N684K4222
5019A9891L4796j6387m8446k9251K5570R153J7159q76k023n895k9175l7620J5580
5006d7524L4940J8573n822k042r546k255J2808J2849J1653O633r656j5643J9602
$$ plain form
5097 16175 8243 10784 1494 -4968 5067 8231 -12992 -9522 -13638 -8291 -12024 13484 20508 4079
5083 4079 14321 -9147 -31047 -27116 2749 6874 362 -5867 -24389 -29226 -10338 19758 32148
5070 32148 35764 -1312 -31897 -4399 19968 1237 -25827 -21305 -47674 -56607 -30174 -15208
5058 -15208 -32142 -31961 -8799 27119 25635 434 -19774 -19324 -18378 -26750 -44207 -33729 -29597 -26537
5044 -26537 -6817 -8772 -31076 -62626 -87083 -81139 -65377 -56117 -15935 -685 10251 -1185
5032 -1185 -3861 -5229 -13779 1817 -16266 5038 20306 21648 -597 -14736 -10015 -4331 19891
5019 19891 54687 38300 -10146 -39397 -13827 -4674 12485 11609 9586 3691 -25484 -63104 -47524
5006 -47524 -12584 5989 167 -1875 -11421 -13676 -868 11981 23634 30267 20611 4968 24570
4993B4570Q633j3495k0549K615M00k7921k5620J2756J1919J2404j4483m431j6410
4980d9612j2500J5536K1369n380q288J1121q033K3442K7759r154j8838J3159K4851
4967B5432K282r050j7978m516k0323j5610K5257Q676j630J2225J3447p031K87
4954A1468P062p73P272P362K249M430k0171j9875j2342L931p070L517Q809K253
4940a878M005P225j4465k2078l891J1732J8732R848r61j609J1914j5112m122l103
4926c763j744J0202J1215Q081p2k574l6396j4033l482O6244J968m9193r81J2749
4912a779P426K5918J155k222Q533j0103J2797j2280k9938J9568p736r335O351
4899H355J0260j3084p123r7r500j6693K020k1174p464J7337K4996j2221P605J322
$$ plain form
4993 24570 33203 19708 -841 1774 2174 -25747 -51367 -38611 -26692 -14288 -28771 -33202 -49612
4980 -49612 -62112 -46576 -25207 -30587 -38875 -27754 -35787 -12345 15414 6260 -12578 581 25432
4967 25432 27714 18664 686 -3830 -24153 -39763 -14506 -5830 -7460 4765 18212 11181 11468
4954 11468 18530 17757 25029 32391 34640 39070 18899 -976 -13318 -9387 -16457 -12940 -4131 -1878
4940 -1878 2127 9352 -5113 -27191 -31082 -19350 -618 9230 8269 6660 18574 3462 -660 -3763
4926 -3763 -5507 4695 15910 23991 23919 21345 -15051 -29084 -32566 33678 35646 -13547 -14528 -1779
4912 -1779 5647 31565 32720 30498 39031 28928 41725 29445 -493 19075 11339 2004 8355
4899 8355 18615 5531 -1592 -1689 -11189 -27882 -25862 -47036 -54500 -37163 -12167 -24388 -16783 -15461
4885a5461j2485o777p739L8853M640K074l351j744O915J8340l656m6287j5271
4872d1949K1467P38K321M523K5934j770L889j3888j822J4260j0245l4971o278
4859c7791L0356J3992j1603M138P903j9656k9140L998M8304K0953j0641q382J2118
4846B4549l613n409m642J0312l6559k4995O874K0325k505k2354k7335p319L5061
4833c7610J4266o58J1233j0665L3813J5721l4668j5960J1927O48k6827K6596J9469
4820G285K0076J9451l249k583k8419r795R612K093n62l4677k0017L8485J1948
4807I648o146j6249k5588K7272M401M701k162q853O2R10n22J4318K8075J157j3533
4792A7491o169M465k7048j8419m775J6237J6643j0578j594p439k1774J5087L5070
$$ plain form
4885 -15461 -27946 -34723 -42462 -3609 1031 3105 -246 -1990 4925 23265 19609 -26678 -41949
4872 -41949 -20482 -19744 -17423 -12900 13034 11264 15153 1265 -557 13703 3458 -31513 -37791
4859 -37791 -7435 6557 -5046 -908 6995 -12661 -41801 -37803 10501 31454 20813 12431 24549
4846 24549 20936 15527 10885 21197 -15362 -40357 -33483 -13158 -15663 -38017 -65352 -72671 -37610
4833 -37610 -23344 -24002 -12769 -23434 10379 26100 -8568 -24528 -12601 -11953 -38780 -12184 7285
4820 7285 27361 46812 43563 40980 12561 2766 12378 14471 13909 -20768 -40785 -2300 9648
4807 9648 3502 -12747 -38335 -11063 -6662 -1961 -4123 -12976 -12914 -12004 -12526 1792 29867 31024 17491
4792 17491 11322 15787 -11261 -29680 -34455 -18218 -1575 -12153 -13747 -21186 -42960 -27873 7197
4779G197p8j1176M885P631j3982N296J1886k8178j6657k274J917L8499K6231j7482
4765A3715j6663k896o829j7146l570L1563L0244j7578l0308n733P787K7636k673
4752G549l4135N857q033r289j0466O819J5431J0718o880j7929L690P189J441J1935
4738a6103K2546K5947L0730l115k1992k8157l6091M778K9711J1252n500j4693
4726f87N441q570p235K0317N233J538j9756l2467n5L2069k9346q73K4309j0137
4712b0219k4960J3480j122p137j943q548K763L867K6173K3352K2091k4774l7770
4699c4747j08P205j332R045Q118K5487J2519k0134k5257q3J934K3267L242R1N924
4684A5171k2559k2648j9422l891J1605K842L238J5478P791K5308j5362L213k2657
$$ plain form
4779 7197 7119 -4057 828 8459 -5523 -227 11659 -16519 -33176 -35450 -33533 4966 31197 13715
4765 13715 -2948 -5844 -12673 -29819 -33389 -1826 28418 10840 -19468 -25201 -17414 10222 7549
4752 7549 -26586 -20729 -28762 -38051 -48517 -41698 -26267 -15549 -22429 -40358 -36668 -29479 -28038 -16103
4738 -16103 6443 32390 63120 60005 38013 9856 -26235 -21457 8254 19506 14006 -687
4726 -687 4754 -3816 -11051 9266 14499 16037 -3719 -36186 -36241 -4172 -33518 -34391 -10082 -20219
4712 -20219 -45179 -31699 -32821 -39958 -41901 -50449 -47686 -43819 -17646 5706 27797 3023 -34747
4699 -34747 -34855 -27650 -28982 -19937 -11819 13668 26187 6053 -19204 -19287 -17353 5914 9156 9247 15171
4684 15171 -7388 -30036 -49458 -53349 -41744 -38902 -35664 -20186 -12395 12913 -2449 764 -21893
4671b1893k5253K4303J6540J2006Q106Q096J3417j0924l7437J782K9758Q109k575
4658B4035k6709j5143K5240m232O725K4374o26j8381j1465k5554Q302O334j0770
4645a7870K070K3234K8576p357l6956j8053K3813J2364j7471J0454L6636P452
4633D6892k0611j3911L669Q56j6425j2151K0599K8632j5532r505j3543q100n042
4620a4172J8008J4881M059j0004R073r582l0677r188j213j1937J6618j2541Q187
4607b8488M3200J6216k9881J7206L3661j4551l6680k3723J960r922J0895J3517
4595f590J087k8635p437J4929R515k3045j756J8815J4388J8247L118j79n858p229
4581f30k3678K1239J5779l29j0147L682M0876K0562k7342k1768J5819J962m823
$$ plain form
4671 -21893 -47146 -22843 -6303 5703 13809 21905 35322 24398 -13039 -11257 18501 26610 24035
4658 24035 -2674 -17817 7423 3191 9916 34290 33664 15283 3818 -21736 -13434 -7100 -17870
4645 -17870 -15800 7434 36010 28653 -8303 -26356 -2543 9821 -7650 2804 39440 46892
4633 46892 26281 12370 16039 16895 470 -11681 8918 37550 22018 12513 -1030 -9130 -14172
4620 -14172 3836 18717 22776 12772 21845 12263 -18414 -27602 -28815 -40752 -24134 -36675 -28488
4607 -28488 14712 30928 1047 18253 51914 37363 683 -23040 -21080 -31002 -20107 -6590
4595 -6590 -5503 -34138 -41575 -26646 -17131 -40176 -41932 -23117 -8729 9518 12636 12457 6599 -630
4581 -630 -24308 -3069 12710 12381 2234 5916 46792 67354 40012 18244 34063 36025 31202
4568C1202j2301r17m1500j2246K0153j6152k8318m496p89K8021L0476o006j6360
4555b9233l653K8219K5087l2787l311M823J1278n500J1226P446j973J5255J2169
4542C9046j5292j3575k6626p302O609K2884j3442k0315K469K8176P993O862j2748
4529D739k7397o95K0429o302l4033K3665J8119l0418j0168n239K1071K6190J8877
4516A8838k4309l151K5118N974r00j2140k4219J832R501J3400k1199n754L7406
4503B0397J3035j0556k8302J0747k6394R006K1822n104K1609j5372m2594j4309
4491d6015K0771M4910J8508J40o810J7799j0423k7859N682J566p789J0387r816
4478A1051k9275k97P264J4097j36n277P143j107j1048j0107K3605j702J6929j9250
$$ plain form
4568 31202 18901 17984 -23516 -35762 -15609 -31761 -60079 -64575 -65364 -37343 -6867 -12873 -29233
4555 -29233 -32886 -4667 20420 -12367 -15678 -10855 423 -5077 6149 13595 11622 26877 39046
4542 39046 23754 10179 -16447 -23749 -17140 5744 -7698 -28013 -25544 2632 10625 17487 4739
4529 4739 -22658 -23353 -2924 -9226 -43259 -19594 -1475 -31893 -42061 -47300 -26229 -39 18838
4516 18838 -5471 -8622 16496 22470 21570 9430 -14789 -12957 -3456 9944 -11255 -17009 20397
4503 20397 33432 22876 -5426 5321 -21073 -12067 9755 4651 26260 10888 -31706 -46015
4491 -46015 -25244 19666 38174 38314 31504 49303 38880 11021 16703 18269 10480 20867 11051
4478 11051 -18224 -18521 -11257 2840 2704 -2573 4570 3463 -7585 -17692 5913 4211 21140 1890
4464A890j345K0616p425j479Q180J4428J6812k0306k504k0124j6962J6973P315
4451A6069j8285j1399n933J7051J0693j7182p879J2067j1719q599N901K8357L2771
4438D1913p141l01j949n440k5206l0112j9288J95n709K9233k3886l797M0442k542
4424a3588Q434K5404Q044j3034m4160m197L5846o82R703K91p417j2915j2271J0327
4410a0215j1341o283J3639J3282Q949q512N811j3203j5523J3458P873P12J7507
4397A6154K4748J9123k5260l7166k9858n24L0660J6031J3547j1557j1490j2001
4385g593k1720R651J3496J6099L5344j5631j3098O385n539P582K474j8991k3987
4372a5528l2090L2806L0194K273k2859l031k331j0267J8669k302j0670m424N626
$$ plain form
4464 1890 545 21161 13736 12257 20437 34865 51677 31371 28867 8743 -8219 8754 16069
4451 16069 -2216 -13615 -19548 -2497 8196 -8986 -16865 -4798 -16517 -25116 -19215 9142 41913
4438 41913 34772 34471 32522 27082 1876 -28236 -47524 -47329 -53038 -23805 -47691 -51488 -11046 -13588
4424 -13588 -5154 20250 28294 15260 -28900 -33097 2749 2067 11770 12061 4644 -8271 -20542 -10215
4410 -10215 -21556 -27839 -14200 -918 8031 -481 5330 -7873 -23396 -9938 -2065 -1353 16154
4397 16154 40902 60025 34765 -2401 -32259 -32783 -2123 13908 27455 15898 4408 -7593
4385 -7593 -29313 -19662 -6166 9933 45277 29646 16548 22933 17394 24976 27450 8459 -15528
4372 -15528 -47618 -14812 15382 17655 -5204 -8235 -10566 -20833 -2164 -4466 -15136 -19560 -13934
4359a3934K612j3795k0232J2443J8891P554o844j7919j813K2694j664j3873k8103
4346e3983J894O399J9291O753J961J802k8108L816M766J8164P338o720l091J2263
4332g455J9778L2187k7731j402J1436j1599j6489J29L870p192m819Q758M351O419
4318A0241O18o03K893k2026k9367n025R89K0382R254l742J685k312j4827J6856
4304a4984J2609k762p721O329L8779o556m255j0635k6855M393O989J8604J5892
4291B9827l2020k784j0712K4392K5207Q74L350k8948j9848L1403R56l028k6174
4278g505j6780N416R238J2107m863P234j4791J7810O234j5871j5816J848K4735
4265H996K0475m35j7560k1986J2957N15k3020j2376M422R323K1921J5801l062
$$ plain form
4359 -13934 -11322 -25117 -45349 -32906 -14015 -6461 -13305 -31224 -33037 -10343 -12007 -25880 -53983
4346 -53983 -52089 -45690 -26399 -19646 -17685 -15883 -43991 -40175 -35409 -17245 -9907 -16627 -19718 -7455
4332 -7455 12323 44510 16779 15377 26813 15214 -1275 -1146 2724 -4468 -9287 -529 3822 10241
4318 10241 10859 10256 13149 -8877 -38244 -43269 -42280 -21898 -12644 -16386 -14701 -17013 -31840 -14984
4304 -14984 -2375 -5137 -12858 -6529 32250 25694 21439 10804 -16051 -11658 -4669 13935 29827
4291 29827 -2193 -4977 -15689 8703 33910 34784 38134 9186 -10662 20741 21697 18669 -7505
4278 -7505 -24285 -18869 -9631 2476 -2387 4847 -9944 7866 14100 -1771 -17587 -15739 8996
4265 8996 29471 29036 11476 -10510 2447 2962 -20058 -32434 -28012 -18689 3232 19033 15971
$$ [...]
##END NTUPLES=NMR SPECTRUM
##END=
