##TITLE=Analysis number 315318
Compound Code rh 01231
Project Code adrs
Chemist Name hixia
##JCAMPDX= 6.0         $$ Bruker NMR JCAMP-DX V2.0
##DATA TYPE= NMR SPECTRUM
##DATA CLASS= NTUPLES
##ORIGIN= Bruker BioSpin GmbH
##OWNER= NMR
$$ XWIN-NMR		Version 3.5
$$ Tue Nov 15 09:27:57 2005 GMT Standard Time (UT+0h)  MAYBRIDGE\NMR@NMR_250MHZ
##.OBSERVE FREQUENCY= 250.131544655141
##.OBSERVE NUCLEUS= ^1H
##.ACQUISITION MODE= SIMULTANEOUS (DQD)
##.ACQUISITION SCHEME= undefined
##.AVERAGES= 16
##.DIGITISER RES= 18
##SPECTROMETER/DATA SYSTEM= dpx250
##.PULSE SEQUENCE= zg30
##.SOLVENT NAME= DMSO
##.SHIFT REFERENCE= (INTERNAL, DMSO, 0, 16.522)
##AUDIT TRAIL= $$ (NUMBER, WHEN, WHO, WHERE, WHAT)
$$ ##TITLE= Audit trail, XWIN-NMR		Version 3.5
$$ ##JCAMPDX= 5.01
$$ ##ORIGIN= Bruker BioSpin GmbH
$$ ##OWNER= NMR
$$ C:\u/data/dgb/nmr/ADRS/12360/pdata/1/auditp.txt
$$ ##AUDIT TRAIL=  $$ (NUMBER, WHEN, WHO, WHERE, WHAT)
(   1,<2005-11-15 09:27:38.40 +000>,<MAYBRIDGE\NMR>,<NMR_250MHZ>,
      <created by zg, POWCHK disabled, PULCHK disabled
       configuration hash MD5:
       62 19 C7 07 E1 42 D1 B7 37 6C 3D D0 77 39 F9 E6
       data hash MD5: 64K
       91 77 57 60 01 35 E1 63 69 28 22 7E 40 27 1C E7>)
(   2,<2005-11-15 09:27:49.21 +000>,<MAYBRIDGE\NMR>,<NMR_250MHZ>,
      <Start of raw data processing
       ef LB = 0.3 FT_mod = 6 PKNL = 1 SI = 32K 
       data hash MD5: 32K
       3D CE 0B A7 33 36 38 9F 70 F7 8E 9E A5 9E F3 FD>)
(   3,<2005-11-15 09:27:51.06 +000>,<MAYBRIDGE\NMR>,<NMR_250MHZ>,
      <apk 
       data hash MD5: 32K
       25 ED 62 7B 99 C8 9C 26 51 3B E5 EA B7 76 26 F5>)
(   4,<2005-11-15 09:27:51.81 +000>,<MAYBRIDGE\NMR>,<NMR_250MHZ>,
      <abs ABSG = 5 
       data hash MD5: 32K
       83 23 CF 48 94 8D 18 B3 9F B7 B0 0F 59 B4 DA F2>)
$$ ##END=
$$ 
$$ hash MD5
$$ 65 18 78 5E 20 12 FD E8 A5 44 A6 74 79 B3 97 BA
##$RELAX= 
##$RELAX= 
##$RELAX= 
##$RELAX= 
##$RELAX= 
##$RELAX= 
##$RELAX= 
$$ Bruker specific parameters
$$ --------------------------
##$DU= <C:\u>
##$EXPNO= 12360
##$NAME= <ADRS>
##$PROCNO= 1
##$TYPE= <nmr>
##$USER= <dgb>
##$AMP= (0..31)
100 100 100 100 100 100 100 100 100 100 100 100 100 100 100 100 100 100 
100 100 100 100 100 100 100 100 100 100 100 100 100 100 
##$AQSEQ= 0
##$AQ_mod= 3
##$AUNM= <au_zg>
##$AUTOPOS= <9 >
##$BF1= 250.13
##$BF2= 250.13
##$BF3= 250.13
##$BF4= 250.13
##$BF5= 500.13
##$BF6= 500.13
##$BF7= 500.13
##$BF8= 500.13
##$BYTORDA= 1
##$CFDGTYP= 0
##$CFRGTYP= 5
##$CHEMSTR= <none>
##$CNST= (0..31)
1 1 145 1 1 1 1 1 1 1 1 1 1 1 1 1 1 1 1 1 1 1 1 1 1 1 1 1 1 1 1 1 
##$CPDPRG= <>
##$CPDPRG1= <>
##$CPDPRG2= <>
##$CPDPRG3= <>
##$CPDPRG4= <mlev>
##$CPDPRG5= <mlev>
##$CPDPRG6= <mlev>
##$CPDPRG7= <mlev>
##$CPDPRG8= <mlev>
##$CPDPRGB= <>
##$CPDPRGT= <>
##$D= (0..31)
0 1 0 0 0 0 0 0 0 0.06 0 0 0 0 0 0 0.0002 0 0 0 0 0 0 0 0 0 0 0 0 0 0 
0 
##$DATE= 1132046857
##$DBL= (0..7)
120 120 120 120 120 120 120 120 
##$DBP= (0..7)
150 150 150 150 150 150 150 150 
##$DBP07= 0
##$DBPNAM0= <>
##$DBPNAM1= <>
##$DBPNAM2= <>
##$DBPNAM3= <>
$$ [...]
##$SUBNAM7= <"">
##$SUBNAM8= <"">
##$SUBNAM9= <"">
##$SW= 20.6930455092707
##$SWIBOX= (0..15)
0 0 3 0 0 0 0 0 0 0 0 0 0 0 0 0 
##$SW_h= 5175.983436853
##$TD= 65536
##$TD0= 1
##$TE= 294.16
##$TE2= 300
##$TE3= 300
##$TEG= 300
##$TL= (0..7)
0 120 120 120 120 120 120 120 
##$TP= (0..7)
150 150 150 150 150 150 150 150 
##$TP07= 0
##$TPNAME0= <>
##$TPNAME1= <>
##$TPNAME2= <>
##$TPNAME3= <>
##$TPNAME4= <>
##$TPNAME5= <>
##$TPNAME6= <>
##$TPNAME7= <>
##$TPOAL= (0..7)
0.5 0.5 0.5 0.5 0.5 0.5 0.5 0.5 
##$TPOFFS= (0..7)
0 0 0 0 0 0 0 0 
##$TUNHIN= 0
##$TUNHOUT= 0
##$TUNXOUT= 0
##$USERA1= <user>
##$USERA2= <user>
##$USERA3= <user>
##$USERA4= <user>
##$USERA5= <user>
##$V9= 5
##$VALIST= <valist>
##$VCLIST= <CCCCCCCCCCCCCCC>
##$VD= 0
##$VDLIST= <DDDDDDDDDDDDDDD>
##$VPLIST= <PPPPPPPPPPPPPPP>
##$VTLIST= <TTTTTTTTTTTTTTT>
##$WBST= 1024
##$WBSW= 4
##$XGAIN= (0..3)
0 0 0 0 
##$XL= 0
##$YL= 0
##$YMAX_a= 526531
##$YMIN_a= -401511
##$ZGOPTNS= <>
##$ZL1= 120
##$ZL2= 120
##$ZL3= 120
##$ZL4= 120
##$ABSF1= 16.522
##$ABSF2= -4.171173
##$ABSG= 5
##$ABSL= 3
##$ALPHA= 0
##$AQORDER= 0
##$ASSFAC= 0
##$ASSFACI= 0
##$ASSFACX= 0
##$ASSWID= 0
##$AUNMP= <proc_1d>
##$AZFE= 0.1
##$AZFW= 0.1
##$BCFW= 0
##$BC_mod= 0
##$BYTORDP= 0
##$COROFFS= 0
##$CY= 12.5
##$DATMOD= 1
##$DC= 0
##$DFILT= <>
##$DTYPP= 0
##$F1P= 14.0000005364418
##$F2P= -0.99999901652339
##$FCOR= 0.5
##$FTSIZE= 32768
##$FT_mod= 6
##$GAMMA= 0
##$GB= 0
##$INTBC= 1
##$INTSCL= 1
##$ISEN= 128
##$LB= 0.3
##$LEV0= 0
##$LPBIN= 0
##$MAXI= 10000
##$MC2= 0
##$MEAN= 0
##$ME_mod= 0
##$MI= 0
##$NCOEF= 0
##$NC_proc= -4
##$NLEV= 6
##$NOISF1= 0
##$NOISF2= 0
##$NSP= 0
##$NTH_PI= 0
##$NZP= 0
##$OFFSET= 16.522
##$PC= 1
##$PHC0= 72.26772
##$PHC1= 7.975981
##$PH_mod= 1
##$PKNL= yes
##$PPARMOD= 0
##$PSCAL= 4
##$PSIGN= 0
##$REVERSE= no
##$SF= 250.13
##$SI= 32768
##$SIGF1= 0
##$SIGF2= 0
##$SINO= 400
##$SIOLD= 32768
##$SREGLST= <1H.DMSO>
##$SSB= 0
##$STSI= 32768
##$STSR= 0
##$SW_p= 5175.98343685301
##$SYMM= 0
##$S_DEV= 0
##$TDeff= 65536
##$TDoff= 0
##$TI= <Analysis number 999999
Compound Code 99
Book Reference 9
Project Code 9>
##$TILT= no
##$TM1= 0
##$TM2= 0
##$TOPLEV= 0
##$USERP1= <user>
##$USERP2= <user>
##$USERP3= <user>
##$USERP4= <user>
##$USERP5= <user>
##$WDW= 1
##$XDIM= 32768
##$YMAX_p= 527836202
##$YMIN_p= -640127
$$ End of Bruker specific parameters
$$ ---------------------------------
##NTUPLES= NMR SPECTRUM
##VAR_NAME=  FREQUENCY,     SPECTRUM/REAL,   SPECTRUM/IMAG
##SYMBOL=    X,             R,               I
##VAR_TYPE=  INDEPENDENT,   DEPENDENT,       DEPENDENT
##VAR_FORM=  AFFN,          ASDF,            ASDF
##VAR_DIM=   32768,         32768,           32768
##UNITS=     HZ,            ARBITRARY UNITS, ARBITRARY UNITS
##FACTOR=    0.157963299565203, 1,           1
##FIRST=     4132.6476996994, 0,             0
##LAST=      -1043.33573715361, 0,           0
##MIN=       -1043.33573715361, -640127,     0
##MAX=       4132.6476996994, 527836202,     0
$$ Real data points
##PAGE= N=1
##DATA TABLE= (X++(R..R)), XYDATA
$$ [...]
17437a2014j00958J4607k2197J05974J20456n9685j7873j6079M7504q1446r8086
$$ -12014 -112972 -98365 -120562 -14588 105868 46183 28310 12231 59735 -21711 -119797
17426a19797j1038m615J9448J0308N6484O5960M2739m1682L00N1694J3661j4803
$$ -119797 -130835 -135450 -116002 -105694 -49210 16750 59489 17807 18107 69801 83462 68659
17414F8659r9122p0613J4126O9208J3379n368J0891K8505K8185J9634n9177k2239
$$ 68659 -30463 -101076 -86950 -17742 -4363 -9731 1160 29665 57850 77484 18307 -3932
17402c932Q9252Q019K591J7047m5460M4791Q670j28434p2578L8206K6924J04014
$$ -3932 85320 93339 95930 112977 67517 112308 120978 -7456 -80034 -41828 -14904 89110
17390H9110m0149m6713J1368l6501m657K9368J03226M4811J543L37N549J10745
$$ 89110 48961 2248 13616 -22885 -27542 1826 105052 149863 151406 151743 157292 268037
17378B68037j7154j01308o6604k9247J8407j1026l0267R699n944R4188n2934m1098
$$ 268037 250883 149575 82971 53724 72131 61105 30838 40537 34593 128781 75847 34749
17366C4749r109K717j3809j06552m4761j003M390R0628N8256k0756m0546K4624
$$ 34749 25640 28357 14548 -92004 -136765 -137768 -133378 -42750 15506 -5250 -45796 -21172
17354b1172r478M5210J2614O7819m9792o7126O8361p894o8200k1805N6425L7952
$$ -21172 -30650 14560 27174 94993 45201 -21925 46436 38542 -29658 -51463 4962 42914
17342D2914J5383m7240o0329LO6425k2397N5697P2921l412j10651K2835N2921
$$ 42914 58297 11057 -49272 -49269 17156 -5241 50456 123377 119965 9314 32149 85070
17330H5070N4655M0688l8103m6649j9334j9693j1676L6126L4324R562o089R5499
$$ 85070 139725 180413 142310 95661 76327 56634 44958 81084 115408 124970 118881 214380
17318B14380P5833q5838o6210j2042L827k5314k470j82J082o307M5875K0287m0355
$$ 214380 290213 204375 138165 126123 129950 104636 102166 101984 103066 96759 142634 162921 122566
17305A22566p0693L945j08099N2145J32528j203M3415J24078l706p5983P822K798
$$ 122566 51873 55818 -52281 -136 132392 131189 174604 298682 294976 218993 226815 229613
17293B29613K745o9833n7420m3990m2828K7485n8043l3543P2323J5783k6226l1462
$$ 229613 232358 162525 105105 61115 18287 45772 -12271 -45814 26509 42292 16066 -15396
17281a5396q3107M0753Q7800j1027m0063m6293L5470N9912L2234K366M215l6720
$$ -15396 -98503 -57750 30050 19023 -21040 -67333 -31863 28049 60283 62649 66864 30144
17269C0144k7368N3781k3901l0638Q018k3761K8584R2801l2349k3419j4812O7303
$$ 30144 2776 56557 32656 2018 10036 -13725 14859 107660 75311 51892 37080 104383
17257A04383J8873J1841J2505q891l8842p2493K16J00926M5209l0396l7607M8424
$$ 104383 123256 135097 147602 138711 99869 27376 27592 128518 173727 143331 105724 154148
17245A54148o7463P637J1003J818L5528l7797l187j9379l4338L5526J4044k2164
$$ 154148 86685 94322 105325 107143 142671 104874 101687 82308 47970 83496 97540 75376
17233G5376k237L1323P5048N6857l370l7693K4281o7971k4070Q2j9083N085J26391
$$ 75376 73139 104462 179510 236367 232997 195304 219585 151614 127544 127626 108543 113628 240019
17220B40019J4332p8942o7868n9764o0301L9480M2224k1836r9759J06652P3563
$$ 240019 254351 175409 107541 47777 -12524 26956 69180 47344 -52415 54237 127800
17209A27800M937p7390J0335N6391J9743q7442p1228J2991L404j3382k9453M7083
$$ 127800 132737 55347 65682 122073 141816 54374 -16854 -3863 -459 -13841 -43294 3789
17197C789o3124Q06M736M7931P4795P3252l5649p5925j7279Q0150j3856L6574
$$ 3789 -59335 -58529 -53793 -5862 68933 142185 106536 30611 13332 93482 79626 116200
17185A16200R5663j3279O3928m98j14271q8573r9724p0619L5162O1580P7602N7742
$$ 116200 211863 198584 262512 262014 147743 59170 -40554 -111173 -76011 -14431 63171 120913
17173A20913k1175J9188M5888K6955L0800q0273p1249K3315j1699k9224M4210
$$ 120913 99738 118926 164814 191769 222569 142296 71047 94362 82663 53439 97649
17162I7649J1275j1089k8745L2947J6455r5928L447J8630m8004J13483P8723n2934
$$ 97649 108924 97835 69090 102037 118492 22564 26011 44641 -3363 110120 188843 135909
17150A35909l8819o044Q091J3187n8705m3322p0630m036J05686O740k7498m382
$$ 135909 97090 91046 99137 112324 53619 10297 -60333 -64369 41317 48057 20559 16177
17138A6177l0816J7165J4216J3347m5214q917O7847j2933q0475K8954J1056n0717
$$ 16177 -14639 2526 16742 30089 -15125 -24042 43805 30872 -49603 -20649 -9593 -60310
17126f0310q8419m3840J06203J37423K8042l1036j794J2333O7259M9358p330k5227
$$ -60310 -148729 -192569 -86366 51057 79099 48063 46269 58602 125861 175219 167889 142662
17114A42662p1913j9680j6152L8714j8836n3155O7307k7557k6536l21j0376L3836
$$ 142662 70749 51069 34917 73631 54795 1640 68947 41390 14854 14533 4157 37993
17102C7993r2925k6571K7245N2200O6963k084o2175J4888r0794r731Q4911n4289
$$ 37993 -54932 -81503 -54258 -2058 64905 62821 646 15534 -75260 -84991 -80 -54369
17090e4369J860N6961N8890J2916p5261m3580L4410L5443N3358j0211n9962n4989
$$ -54369 -52509 4452 63342 76258 997 -42583 -8173 27270 80628 70417 10455 -44534
17078d4534J4999j3290l8256N8874J14248j6863l6109m5171n0008L5747M4225
$$ -44534 -29535 -42825 -81081 -22207 92041 75178 39069 -6102 -56110 -20363 23862
17067B3862N0487m4881k6084M4986k3052m0581p606j0431k1700J7011P1335M1241
$$ 23862 74349 29468 3384 48370 25318 -15263 -22869 -33300 -55000 -37989 33346 74587
17055G4587j1415J6827J0061m1885o7019k2584j1387R036K6458o825k7301n3911
$$ 74587 63172 79999 90060 48175 -18844 -41428 -52815 -43779 -17321 -24146 -51447 -105358
17043a05358K1078J25302N5068n2486p550r206p4320n3317j06191L0609O8767
$$ -105358 -84280 41022 96090 43604 36054 26848 -47472 -100789 -206980 -176371 -107604
17032a07604j8293K8118p4026J08287Q3172m4333K3219k5482L9797O6450q8403
$$ -107604 -125897 -97779 -171805 -63518 19654 -24679 -1460 -26942 12855 79305 -9098
17021i098J4523j1336n4485l0838j4919K1458j6009K3175k9472L0082J8681k0391
$$ -9098 5425 -5911 -60396 -91234 -106153 -84695 -100704 -77529 -107001 -76919 -58238 -78629
17009g8629J10763R0419J6246J7455j22826j70814n4647Q982P2437Q8799K3674
$$ -78629 32134 122553 138799 156254 33428 -137386 -192033 -183051 -110614 -21815 1859
16998A859r138Q573n6674q8515Q079J39550j2810j5012O4553m3490q7917k3962
$$ 1859 -7279 1294 -55380 -143895 -135816 3734 -9076 -24088 40465 -3025 -90942 -114904
16986a14904K0269k7770N742N7449M8758N7401N2932o3887k3905k8921M365N2101
$$ -114904 -94635 -122405 -116663 -59214 -10456 46945 99877 35990 12085 -16836 -12471 39630
16974C9630k6547L0885K4420P628n535O479j1565o7440J1665j9774m2430m0161
$$ 39630 13083 43968 68388 76016 70481 76960 65395 -2045 9620 -10154 -52584 -92745
16962i2745k7038p905R1941P863k856J5454k938r6324q6071K8844M7741O4025
$$ -92745 -119783 -127688 -35747 -27884 -30740 -15286 -18224 -114548 -200619 -171775 -124034 -60009
16950f0009K0007L689M077K160J4865m9854l5P3994J8176m9147l7211j2775p423
$$ -60009 -40002 -36313 -32236 -30076 -15211 -65065 -65100 8894 27070 -22077 -59288 -72063 -79486
16937g9486M8410j6808J1639L2219R364p9379p6923L9450N8149P197j0924K1777
$$ -79486 -31076 -47884 -36245 -4026 5338 -74041 -150964 -111514 -53365 -46168 -57092 -35315
16925c5315P871O2873Q058n5715K7346J03673M4903l2927k951j7965j25835j20838
$$ -35315 -27444 35429 43487 -12228 15118 118791 163694 130767 127816 109851 -15984 -136822
16913a36822N769O4985K1443n7490r6392m0052R6757P6132n5267q4110Q1609P0015
$$ -136822 -131053 -66068 -44625 -102115 -198507 -238559 -141802 -65670 -120937 -205047 -123438 -53423
16901e3423j649j0416k720J9358M7866Q6162K1450j7165q5147k9681N6176J1170
$$ -53423 -55072 -65488 -68208 -48850 -984 85178 106628 89463 4316 -25365 30811 41981
16889D1981q0877k5355j8022j0444o1069M4991K2677J1010l4415o7490R759K5269
$$ 41981 -38896 -64251 -82273 -92717 -153786 -108795 -86118 -75108 -109523 -177013 -167254 -141985
16877a41985P3755L4100m4243j5149L5541J1274p1556M4436L8289l844k9603J5487
$$ -141985 -68230 -34130 -78373 -93522 -57981 -46707 -118263 -73827 -35538 -39382 -68985 -53498
16865e3498O648n6598M27N7477K4800N5356r285J1573N7364k2672n4637l7870
$$ -53498 -46850 -103448 -103021 -45544 -20744 34612 25327 36900 94264 71592 16955 -20915
16853b0915j4496K7689Q1586m2458p6301J1907l5419l7658M8920N3285K7180n5943
$$ -20915 -35411 -7722 73864 31406 -44895 -32988 -68407 -106065 -57145 -3860 23320 -32623
16841c2623r5198J868L6266Q076j819o8910j7085O3073J34753R9160l5034j11465
$$ -32623 -127821 -125953 -89687 -81611 -83430 -152340 -169425 -106352 28401 127561 92527 -18938
16829a8938n983L2753k5618J656l6006L6646J8561p00M0926n9456M210L5719J8337
$$ -18938 -24921 7832 -17786 -16130 -52136 -15490 3071 2371 43297 -16159 -11949 23770 42107
16816D2107m243L2145q7999P58L0798J5232k5372j1836l0286k9746o8797N5112
$$ 42107 37864 70009 -17990 -17232 13566 28798 3426 -8410 -38696 -68442 -137239 -82127
16804h2127R4064K4327m7558m6320r0790J2691j24p0966l6619P2135J40137L2106
$$ -82127 11937 36264 -11294 -57614 -148404 -135713 -135837 -206803 -243422 -171287 -31150 956
16792I56M6425R323m0613n1678l4113o2663J0796N8277P1691J8565L2476k1939
$$ 956 47381 56704 16091 -35587 -69700 -132363 -121567 -63290 8401 26966 59442 37503
16780C7503L2439k8111M77M9855o9880j30474r8495K851j1032k7864N9673O3581
$$ 37503 69942 41831 42308 92163 22283 -108191 -206686 -203835 -214867 -242731 -183058 -119477
16768a19477j247J4217K8996N9259K4485p5276j3172j9318M6847L6499o0546m550
$$ -119477 -120724 -106507 -77511 -18252 6233 -69043 -82215 -101533 -54686 -18187 -78733 -83283
16756h3283P2121R6226L0903m2240p8393j4127O3346r395J7041R3096p587k8121
$$ -83283 -11162 85064 115967 73727 -4666 -18793 44553 35158 52199 145295 137708 109587
16744A09587N069L2047l4427p2324J9112m7185M5140L1407M5150p086p9171r2382
$$ 109587 114656 146703 112276 39952 59064 11879 57019 88426 133576 126490 47319 -45063
16732d5063n6336j3010N0488m5013J4843J06609O0625j5334J9220K725o7464o8450
$$ -45063 -101399 -114409 -63921 -108934 -94091 12518 73143 57809 77029 79754 12290 -56160
16720e6160P8304K9141J9874m9738J794O1433o5752j4280N2032J7749m7425p0717
$$ -56160 22144 51285 71159 21421 23215 84648 18896 4616 56648 74397 26972 -43745
16708d3745o6551j24162K4791P9149J11936J22479Q3505n5500n8727j6989n0097
$$ -43745 -110296 -234458 -209667 -130518 -18582 103897 187402 131902 73175 56186 6089
16697F089r1426n899M7154L8372J2142L1157K0238m1194j5436R898J8240Q5588
$$ 6089 -85337 -91236 -44082 -5710 6432 37589 57827 16633 1197 11095 29335 114923
16685A14923k428j6917o9310l6889O1810L3220j120j22440p5171Q4212J08418
$$ 114923 112495 95578 26268 -10621 51189 84409 83289 -39151 -114322 -30110 78308
16674G8308P0982l1574q6883o2933l3713P5948O0802k3946l3660j2198r517n6728
$$ 78308 149290 117716 30833 -32100 -65813 10135 70937 46991 13331 1133 -8384 -65112
16662f5112J1660J6979N3571K4318m7003o7443o263k2022L7429K5873j4923k962
$$ -65112 -53452 -36473 17098 41416 -5587 -73030 -79293 -101315 -63886 -38013 -52936 -55898
16650e5898n6010O8986O1066j8256k0382L7540m0735n8077K8814Q557J9865Q3739
$$ -55898 -111908 -42922 18144 -112 -20494 17046 -23689 -81766 -52952 -44395 -24530 59209
16638E9209l4617j6156N8723n3263j36879K0569r611L9460O6155L5955j9615p3045
$$ 59209 24592 8436 67159 13896 -122983 -102414 -112025 -72565 -6410 29545 9930 -63115
16626f3115l49J7555j6715P6693N3703o430r557O143l8605j4906j1352L4129P5958
$$ -63115 -63464 -45909 -62624 14069 67772 61342 51785 57928 19323 4417 -6935 27194 103152
16613A03152k5414m7792J7717m9093J4245p928O4210J8316m0693J1000m7621k2637
$$ 103152 77738 29946 47663 -1430 12815 4887 69097 87413 46720 57720 10099 -12538
16601a2538j7706m0046l1558j0719k7803J7140k3913k3698K1296j7844K1025O7178
$$ -12538 -30244 -70290 -101848 -112567 -140370 -123230 -147143 -170841 -149545 -167389 -146364 -79186
16589g9186K9332L4797r6586o1232J479P6286J19267M9401r655j761j787p1749
$$ -79186 -49854 -15057 -111643 -172875 -171396 -95110 24157 73558 63903 62142 60355 -11394
16577a1394K8029J3354p1277m6417k7077m5130P3557K5072P0031K0097m9388P375
$$ -11394 16635 29989 -41288 -87705 -114782 -159912 -86355 -61283 8748 28845 -20543 -13168
16565a3168p8030Q8665j1414N700R0210n5101K0077K7470k9306j0521O1268k4129
$$ -13168 -91198 -2533 -13947 -8247 81963 26862 46939 74409 45103 34582 95850 71721
16553G1721J3311m0570j32455k5791L194l8231L5618Q2499j9734L5961M3273j0126
$$ 71721 85032 44462 -87993 -113784 -110590 -148821 -113203 -30704 -50438 -14477 28796 18670
16541A8670p1718P3897Q3755n9208m3509J499l064j2627Q294k3594q7316j9633
$$ 18670 -53048 20849 104604 45396 1887 3386 322 -12305 -4011 -27605 -114921 -134554
16529a34554M9412M2764m6767l8223R4157K7040p6938m6482J0219k8011O7482
$$ -134554 -85142 -42378 -89145 -127368 -33211 -6171 -83109 -129591 -119372 -147383 -79901
16518g9901L9209L1794j4944m9953M9209l1755N3043J00620n293l7013o9872n4831
$$ -79901 -40692 -8898 -23842 -73795 -24586 -56341 -3298 97322 92029 55016 -14856 -69687
16506f9687M9112K2366o3200m8884l8322o064K1167k7260K0612o87Q8124L3070
$$ -69687 -20575 1791 -61409 -110293 -148615 -154679 -133512 -160772 -140160 -140847 -52723 -19653
16494a9653o2412K8061P5808J424k8622O5783M2808k8033r4491j1775L202j4830
$$ -19653 -82065 -54004 21804 23228 -5394 60389 103197 75164 -19327 -31102 -27900 -42730
16482d2730M7747r590m1309L767L8994J1128k8859m9877p4278L0233N3698R7536
$$ -42730 5017 -4573 -45882 -42115 -3121 8007 -20852 -70729 -145007 -114774 -61076 36460
16470C6460k8603n3030l0947l9307L7109J9216N9499O9481l2063q3828l630K9012
$$ 36460 7857 -45173 -76120 -115427 -78318 -59102 397 69878 37815 -46013 -49643 -20631
16458b0631j5236O5291O4698L5787L3702p0356p7092L2462j9485o0906N8808L4495
$$ -20631 -35867 29424 94122 129909 163611 93255 16163 48625 29140 -31766 27042 61537
16446F1537l125N7741n6462m5396j18852j09966J3506M4332N3802M3114J1490
$$ 61537 58412 116153 59691 14295 -104557 -214523 -201017 -156685 -102883 -59769 -48279
16435d8279M1629M0679K3438j50840j8365j369K1561J04124L651j21q8352p2681
$$ -48279 -6650 34029 57467 -93373 -111738 -113107 -91546 12578 16229 16108 -72244 -144925
16423a44925K4721L6857K7307q2428j451P2504O5940K6230r619j7035k9777j2967
$$ -144925 -120204 -83347 -56040 -138468 -139919 -67415 -1475 24755 15136 -1899 -31676 -44643
16411d4643J0282k5399N664O1421L7943l459K5952l1510n6691n2630j000J2106
$$ -44643 -34361 -59760 -54096 7325 45268 41809 67761 36251 -20440 -73070 -74070 -61964
16399f1964O0779O7513n9613n8720L804N9798k3677K5871j8234K9255P952K3251
$$ -61964 -1185 66328 6715 -52005 -48201 11597 -12080 13791 -4443 24812 32764 56015
16387E6015K1031n7587J2555j6331j23545L3309R8120m317J6636q695n756J7901
$$ 56015 77046 19459 32014 15683 -107862 -74553 23567 19250 35886 27191 21435 39336
16375C9336k9926n1163O346L7064J2643P9675j02632j07635Q8786J5870k8675
$$ 39336 9410 -41753 -35407 1657 14300 93975 -8657 -116292 -27506 -11636 -40311
16364d0311K1553j1469k2475P7964O0190M7262p9462q3255j7733M4762J2830m1980
$$ -40311 -18758 -30227 -52702 25262 85452 132714 53252 -30003 -47736 -2974 9856 -32124
16352c2124J0986n2253J5618P9739K3803p1444m9536J20768Q0151K5992p837m9728
$$ -32124 -21138 -73391 -57773 21966 45769 -25675 -75211 45557 125708 151700 143863 94135
16340I4135k0138L4883r879o0280n1356N8053p1077r5770L4660P8472K4551o8952
$$ 94135 73997 108880 99001 38721 -12635 45418 -25659 -121429 -86769 -8297 16254 -52698
16328e2698M2382p7215n0838J18520J26910n9838q6397n5928K8172o398N1625
$$ -52698 -10316 -87531 -138369 -19849 107061 47223 -39174 -95102 -66930 -73328 -21703
16317b1703k397M3516j9866j3526j0272j5669l383O903K2151K3886k3789p1233
$$ -21703 -24100 19416 -450 -13976 -24248 -39917 -43300 -36397 -14246 9640 -14149 -85382
16305h5382M7811J03643k2219l7766l8760j8827O6577r339p5659k0886J3671r3097
$$ -85382 -37571 66072 43853 6087 -32673 -51500 15077 5738 -69921 -90807 -77136 -170233
16293a70233n2057O1125N7349M3811l023O5683J0154j5571r490o864M1625K499
$$ -170233 -222290 -161165 -103816 -60005 -63028 2655 12809 -2762 -12252 -19116 22509 25008
16281B5008k2545N2979j9662p8946j23783k9197J27103M6240J1133L3909O761
$$ 25008 2463 55442 35780 -43166 -166949 -196146 -69043 -22803 -11670 22239 29000
16270B9000o6539k8950M1197P7655k3530l9941j01208O7880N5480o4493K0452
$$ 29000 -37539 -66489 -25292 52363 28833 -11108 -112316 -44436 11044 -53449 -32997
16259c2997K0324j4637l394l7553K1173P3223l0287R113M053l5713p407R493N427
$$ -32997 -12673 -27310 -30704 -68257 -47084 26139 -4148 4965 9018 -26695 -34102 -24609 -19182
16246a9182J7957j15778k5621R2240j9598J118M4582P0023l1182o7652l1415j8605
$$ -19182 -1225 -117003 -142624 -50384 -69982 -68864 -24282 45741 14559 -53093 -84508 -103113
16234a03113l2690k043J9750J6890L6590j5985m1907O2028J1307j7462K4458r896
$$ -103113 -135803 -137846 -118096 -101206 -64616 -80601 -122508 -60480 -49173 -66635 -42177 -52073
16222e2073J147J8510K9042l8956m5613K1049K4796o889m1716K7248K7287J06908
$$ -52073 -50926 -32416 -3374 -42330 -87943 -66894 -42098 -48987 -90703 -63455 -36168 70740
16210G0740O3734p4297n6029n0734N3525K2373J1542O799J3415l2400r9053n2761
$$ 70740 134474 60177 4148 -46586 6939 29312 40854 47653 61068 28668 -70385 -123146
16198a23146J5444L0204O9497L5089j5972J1907J4019k4804j8189O3774o187m9174
$$ -123146 -107702 -77498 -8001 27088 11116 23023 37042 12238 -5951 57823 51636 2462
16186B462p5325k7253K5136l4873k8663o113j5954j6499R876N2483R4848N0268
$$ 2462 -72863 -100116 -74980 -109853 -138516 -144629 -160583 -177082 -167206 -114723 -19875 30393
16174C0393p2973m163K4363j1796n8925R364L1038R1574j7906k2595j4312j4334
$$ 30393 -42580 -46743 -22380 -34176 -93101 -83737 -52699 38875 20969 -1626 -15938 -30272
16162c0272j0027k7961q140j3000j5787n9036K2259J20699P8454j04445k5222
$$ -30272 -40299 -68260 -76400 -89400 -105187 -164223 -141964 -21265 57189 -47256 -72478
16151g2478N587P1178M0222j7355Q1562Q589q3279j38035l3684M1719j3217Q366
$$ -72478 -66891 4287 44509 27154 108716 117305 34026 -104009 -137693 -95974 -109191 -100825
16139a00825j03811l0570O3082N3068N7512n8746m6681R7493J28912N5179r3232
$$ -100825 -204636 -235206 -172124 -119056 -61544 -120290 -166971 -69478 59434 114613 21381
16128B1381m6740L4868Q9651l4636j51584o0126K7000L2134O8038L6169O4365
$$ 21381 -25359 9509 99160 64524 -87060 -147186 -120186 -88052 -20014 16155 80520
16117H0520N9894l0269o5709j21192m345Q8525l4494o7545m9347N0703K7489P8622
$$ 80520 140414 110145 44436 -76756 -81101 7424 -27070 -94615 -143962 -93259 -65770 12852
16105A2852M6650J6855q8291M7510k6943o5842j0148k89k3703P1931M1043J0842
$$ 12852 59502 76357 -11934 35576 8633 -57209 -67357 -67646 -91349 -19418 21625 32467
16093C2467K7718Q546q4201l4270J5696l5613M4673J07766J05059o9950j0195
$$ 32467 60185 68731 -15470 -49740 -34044 -69657 -24984 82782 187841 117891 107696
16082A07696l7464l90r151q4336k8767m177L8397j07037k0065N0776J8175L9679
$$ 107696 70232 69842 60691 -23645 -52412 -56589 -18192 -125229 -145294 -94518 -76343 -36664
16070c6664l649K6160p627l6502K3467K3473M2008j5529r8386K6445J11020k5547
$$ -36664 -40313 -14153 -21780 -58282 -34815 -11342 30666 15137 -83249 -56804 54216 28669
16058B8669m9222p1063l3500j2806R9368L4002j05271R813P3193K1058m910J6854
$$ 28669 -20553 -91616 -125116 -137922 -38554 -4552 -109823 -100010 -26817 -5759 -10669 6185
16046F185K9930M4039N6782l3199l8909k1171K701N3594M0847l9801m4635J6097
$$ 6185 36115 80154 136936 103737 64828 43657 46358 99952 140799 100998 56363 72460
16034G2460L0029O249m7828j49335l9209J47971L046O4n6971m4654M297K1142
$$ 72460 102489 108738 60910 -88425 -127634 20337 23383 23447 -33524 -78178 -73881 -52739
16022e2739k3923K6374R637J2348j8365P0301J072r9738j2265M891O4621K9996
$$ -52739 -76662 -50288 -40651 -28303 -46668 23633 24705 -75033 -87298 -82407 -17786 12210
16010A2210n8193q664M4686K6262k2088l6596o739m9004O001o0324l6831J2230
$$ 12210 -45983 -54647 -9961 16301 -5787 -42383 -49122 -98126 -92125 -152449 -189280 -177050
15998a77050K6078N9763k6633p585m2338o088K0078K9273M3930K5503j5837n4093
$$ -177050 -150972 -91209 -117842 -125427 -167765 -173853 -153775 -124502 -80572 -55069 -70906 -124999
15986a24999l1738J00554K4186j764k2180n4148J8412M9269R859q4161l0428L2246
$$ -124999 -156737 -56183 -31997 -33761 -55941 -110089 -91677 -42408 -32549 -116710 -147138 -114892
15974a14892J4292L2257K6631j00485O3575O362J9016N2781J04630Q5013l2439
$$ -114892 -100600 -68343 -41712 -142197 -78622 -72260 -53244 -463 104167 189180 156741
15963A56741j0070l8636p6569o8162K7494M3377O3043L1l7215j03590j11727j1671
$$ 156741 146671 108035 31466 -36696 -9202 34175 97218 97249 60034 -43556 -155283 -166954
15951a66954N0320O6480M0456L5643o9113k2565n2699o248J8532P7713M8111L1291
$$ -166954 -116634 -50154 -9698 25945 -43168 -65733 -118432 -124680 -106148 -28435 19676 50967
15939E0967K5848M4620m6057l6914o6296L763m1947k3313k6757k9222O340N2025
$$ 50967 76815 121435 75378 38464 -27832 -24069 -66016 -89329 -116086 -145308 -138968 -86943
15927h6943N3240n0235m9807p206k6519J08211J13954L2229l4320p4242o1952
$$ -86943 -33703 -83938 -133745 -140951 -167470 -59259 54695 86924 52604 -21638 -83590
15916h3590M5928R7865L792j2147r390m7420j8281m0565M42M2914j6842m6643
$$ -83590 -37662 60203 63995 51848 42458 -4962 -23243 -63808 -63366 -20452 -37294 -83937
15904h3937m760M4310K5580q89K87L4746m5298m3449K4204Q3570Q6708J4734j29567
$$ -83937 -88697 -44387 -18807 -19696 -19409 15337 -29961 -73410 -49206 34364 121072 135806 6239
15891F239R169r3567l5192O1609L9639k2580k1652j1928k6769j671K5339l0223
$$ 6239 15408 -78159 -113351 -51742 -12103 -34683 -56335 -68263 -95032 -96703 -71364 -101587
15879a01587K9214j8490Q4719m5602n3032l5577O5854J3342j9269r6616M3149
$$ -101587 -72373 -90863 -6144 -51746 -104778 -140355 -74501 -61159 -80428 -177044 -133895
15868a33895K6032j514k1323j4486P1472Q4941N2667o1569o699J0184J11907m1202
$$ -133895 -107863 -109377 -130700 -145186 -73714 11227 63894 2325 -4374 5810 117717 76515
15856G6515p5957j1112q82n1716O635R548L2520M4382l8101o0447M269M8640l1120
$$ 76515 558 -10554 -11436 -63152 -56517 -46969 -14449 29933 -8168 -68615 -64346 -15706 -46826
15843d6826P745L444N779J2323K5744q3813J4465L5448J4715O0853L1412o7063
$$ -46826 -39081 -35637 -29858 -17535 8209 -75604 -61139 -25691 -10976 49877 81289 14226
15831A4226l2858q4269l1722L4506M765L7051O2057J14830K3335m8462K996j5973
$$ 14226 -18632 -102901 -134623 -100117 -95352 -58301 3756 118586 141921 93459 96455 80482
15819H0482r501J23433L0543q8961j10410L4358R5617L715l9216j4856n2562p4349
$$ 80482 70981 194414 224957 135996 25586 59944 155561 159276 120060 105204 52642 -21707
15807b1707J1056l0565K2555L00r594K3603l861j41376O7304R4326l1214j3580
$$ -21707 -10651 -41216 -18661 -18361 -27955 -4352 -8213 -149589 -82285 12041 -19173 -32753
15795c2753K803N4375j2863n2078J1243K9818J8406O6385R7622n3852j19222l8967
$$ -32753 -29950 24425 11562 -40516 -29273 545 18951 85336 182958 129106 9884 -29083
15783b9083n7550r3984m2777N6229M9526L9066l298n439J9524O3678P761L4120
$$ -29083 -86633 -180617 -223394 -167165 -117639 -78573 -81871 -87310 -67786 -4108 3653 37773
15771C7773n0892j05162J4107J0289M3245L9397k5195j448k1373P6137m4679p3674
$$ 37773 -13119 -118281 -104174 -93885 -50640 -11243 -36438 -37886 -59259 16878 -27801 -101475
15759a01475R1080k8946P951J6541J8209j199m7475O148m7764P945J27175R2112
$$ -101475 -10395 -39341 -31390 -14849 3360 2161 -45314 -39166 -86930 -78985 48190 140302
15747A40302p569J11957K37841L60478M53672L25343j35095k87576j87834k33903
$$ 140302 132733 244690 482531 843009 1296681 1622024 1486929 1199353 1011519 777616
15737G77616l19144k66210j36998n4994j7029K4370k9931L8275J7585k3637l2167
$$ 777616 458472 192262 55264 270 -16759 7611 -22320 15955 33540 9903 -22264
15726b2264O37O1973M818J7941L7435k6684j9697l6013N7475N1918O6380n5525
$$ -22264 -21627 40346 45164 63105 100540 73856 54159 18146 75621 127539 193919 138394
15714A38394j9428k538o513l7404J881j05173j54663j5968K9570K6083K8685P9533
$$ 138394 118966 116428 109915 72511 74392 -30781 -185444 -201412 -171842 -145759 -117074 -37541
15702c7541L6685l9246r0368j4830N3081J03774K1010j14977j18683N4575R0530
$$ -37541 -856 -40102 -130470 -145300 -92219 11555 32565 -82412 -201095 -146520 -55990
15691e5990N816L0609N10k9405R662L4877k0477m9423O451L6576L3270p176k2055
$$ -55990 -50174 -19565 -19055 -48460 -38798 -3921 -24398 -73821 -67370 -30794 2476 -4700 -26755
15678b6755L6614n934m5817l1943n8619l5637K421Q9444Q491P5752n4539q1391
$$ -26755 9859 3925 -41892 -73835 -132454 -168091 -165670 -76226 -67735 8017 -46522 -127913
15666a27913J5835n701J21106j7595K0595q7679j4680M2508M9163J4270q9662
$$ -127913 -112078 -117779 3327 -14268 6327 -81352 -96032 -53524 -4361 9909 -79753
15655g9753k3810L5130l9730J12460J4611k9904M4154l1801k8022L1733n2719
$$ -79753 -103563 -68433 -108163 4297 18908 -10996 33158 1357 -26665 5068 -47651
15644d7651m7721o108m0957J7711N0699L1503M2214k2340k7612q032j3879K2693
$$ -47651 -95372 -101480 -142437 -124726 -74027 -42524 -310 -22650 -50262 -58294 -72173 -49480
15632d9480J8829m9933r119J07523J0741j00749L4175M6005m44q811p1821m2002
$$ -49480 -30651 -80584 -89703 17820 28561 -72188 -38013 7992 7548 -1263 -73084 -115086
15620a15086M2969P094K4249J532N5931L4515J2589p8953j0366K3859J315p935
$$ -115086 -72117 -65023 -40774 -39242 16689 51204 63793 -15160 -25526 -1667 -352 -8287
15608h287m3445J0358j3891L457J0400L442k6371K0079N304n63K5807n7209k0549
$$ -8287 -51732 -41374 -55265 -51808 -41408 -37966 -64337 -44258 -38954 -39517 -13710 -70919 -91468
15595i1468P2573N833L4105o5766j03614O6744n065P318M7791K2404p799M461
$$ -91468 -18895 -13062 21043 -44723 -148337 -81593 -86658 -79340 -31549 -9145 -16944 -12483
15583a2483j3063K4668J9247M0075J1105k0205l9297m5814o8098l5722L6059K4042
$$ -12483 -25546 -878 18369 58444 69549 49344 10047 -35767 -103865 -139587 -103528 -79486
15571g9486N0850R6957n4095j80396l6702J5431M1421Q8878L869j9123J8232l915
$$ -79486 -28636 68321 14226 -166170 -202872 -187441 -146020 -57142 -53273 -72396 -54164 -58079
15559e8079J0745Q8866O1239k8702o2231l6981l0365N4818M4939j0364j5878j07485
$$ -58079 -47334 41532 102771 74069 11838 -25143 -55508 -690 44249 33885 18007 -89478
15547h9478o2242M4603Q8528L8810J6999n5193l1921K1168p7600j1816L2786M9452
$$ -89478 -151720 -107117 -18589 20221 37220 -17973 -49894 -28726 -106326 -118142 -85356 -35904
15535c5904O391r1407j3128N6154m0702J8153P7288M7521l6291J9749K8703K2785
$$ -35904 -29513 -120920 -134048 -77894 -118596 -100443 -23155 24366 -11925 7824 36527 59312
15523E9312q361n0899m7224K834k7708m9060N5727K1348R0924J2964l2017j3353
$$ 59312 50951 52 -47172 -44338 -72046 -121106 -65379 -44031 46893 59857 27840 14487
15511A4487l7815k654o339o1551L401j6107o9119q540Q2027M5305j0972o164l5344
$$ 14487 -23328 -25982 -32321 -93872 -90471 -106578 -175697 -184237 -102210 -56905 -67877 -74041 -109385
15498a09385j1935j8801m3551L0632M9911L5856K3602m5901M346L3191K1719M0089
$$ -109385 -121320 -140121 -183672 -153040 -103129 -67273 -43671 -89572 -85226 -52035 -30316 9773
15486I773m8101P4506J08879n7364r0398l8307J1626l0392L5881O9191L2034j2231
$$ 9773 -38328 36178 145057 87693 -2705 -41012 -29386 -59778 -23897 45294 77328 65097
15474F5097o523P0712J9290q973k8450q1768J002K6989p3074K4080M0240q024
$$ 65097 58574 129286 148576 139603 111153 29385 30387 57376 -15698 8382 48622 40598
15462D0598o1652n9325k3084k8259q335O6163O0243K1075m3035o927o6188m2028
$$ 40598 -21054 -80379 -103463 -131722 -140057 -73894 -13651 7424 -35611 -42538 -108726 -150754
15450a50754Q8831l988q760k9369J7829O6454j596J9472J3645R0012n36l7190
$$ -150754 -61923 -65911 -74671 -104040 -86211 -19757 -21353 -1881 11764 101776 101240 64050
15438F4050m1075p1115k9015M9315K1803k5994k4689M5530O4111K4583L4342l246
$$ 64050 22975 -48140 -77155 -27840 -6037 -32031 -56720 -11190 52921 77504 111846 108600
15426A08600k8277l1885N123N968k6954o1650p4464N9254m7232l2585N5245N4550
$$ 108600 80323 48438 53561 59529 32575 -29075 -103539 -44285 -91517 -124102 -68857 -14307
15414a4307J7167m8294M7177O866m8506K3566m4051J0619P683j0047l287n8126
$$ -14307 2860 -45434 1743 8609 -39897 -16331 -60382 -49763 -42080 -52127 -55414 -113540
15402a13540Q758K9016P7598N999q2840l6685J226j8291M163N8036m3410K2560
$$ -113540 -104782 -75766 1832 7831 -75009 -111694 -110468 -128759 -124596 -66560 -109970 -87410
15390h7410M4694K1380J8555l3572o1187O4461J54392r9777l2732K7874l7077
$$ -87410 -42716 -21336 -2781 -36353 -97540 -33079 121313 21536 -11196 16678 -20399
15379b0399k4733J0676l2379R037N1928Q5318L2932o6105j31K8120m1657m6517
$$ -20399 -45132 -34456 -66835 -57798 -5870 79448 112380 46275 46144 74264 32607 -13910
15367a3910o9527L8571J09006j560o2058K132J20411J3964r8438j15539k559K4499
$$ -13910 -83437 -44866 64140 62580 522 2654 123065 137029 38591 -76948 -79507 -55008
15355e5008J5963M7609J552J1438m1704k4255k6741k6574J5693n5855j042P9341
$$ -55008 -39045 8564 10116 21554 -20150 -44405 -71146 -97720 -82027 -137882 -138924 -59583
15343e9583M8045j4168N4241l7141n5935k1517r522O4440N2502L356L4907J8012
$$ -59583 -11538 -25706 28535 -8606 -64541 -86058 -95580 -31140 21362 24718 59625 77637
15331G7637j3585n0386o6990L3597N678j2122o667J8323n165l0327L3508K4712
$$ 77637 64052 13666 -53324 -19727 -14049 -26171 -32838 -14515 -19680 -50007 -16499 8213
15319H213J1182J562O1854J6237k5994l708k0261k0199k5390o1210m1125M0965
$$ 8213 19395 20957 82811 99048 73054 69346 49085 28886 3496 -57714 -98839 -57874
15307e7874N6248L4164n4481O584k7946K0138Q8036l3515n8879j2260O070N458
$$ -57874 -1626 32538 -21943 -15359 -43305 -23167 64869 31354 -27525 -39785 -33715 -28257
15295b8257L1174O5868J0598j2968k1162P8580K5434l972o0694n9934n693P308
$$ -28257 2917 68785 79383 66415 45253 123833 149267 145295 84601 24667 18974 26282
15283B6282m3991n7340k358M6948l7581j4718m475q668M4692l4408P8720k7135
$$ 26282 -17709 -75049 -77407 -30459 -68040 -82758 -87233 -95901 -51209 -85617 -6897 -34032
15271c4032k4481N7324L9287m2788p8664P223L5597L7218l6103N0969k2664l0836
$$ -34032 -58513 -1189 38098 -4690 -83354 -76131 -40534 -3316 -39419 11550 -11114 -41950
15259d1950k3315J7469J7838J02026M296O5750M5030j07813j01775n647j5968
$$ -41950 -65265 -47796 -29958 72068 76364 142114 187144 79331 -22444 -28091 -44059
15248d4059p6566O6949j4004k6448M726N7793l3683l4152p116Q547p9601j3462
$$ -44059 -120625 -53676 -67680 -94128 -89402 -31609 -65292 -99444 -106560 -98013 -177614 -191076
15236a91076N8084J44953N5916o9807L2857L6134j0703l4450k2345l8706j0516
$$ -191076 -132992 11961 67877 -1930 30927 67061 56358 21908 -437 -39143 -49659
15225d9659Q892L4981K3520j6866M885L7272L4482j2922j3891K8971K4441R685
$$ -49659 -40767 -5786 17734 868 5753 43025 77507 64585 50694 79665 104106 113791
15213A13791O78n6144j6698J5252j5145m1833P8379r041l3693q6439K2248k734
$$ 113791 114469 58325 41627 56879 41734 -99 78280 69239 35546 -50893 -28645 -31379
15201c1379K3024Q060j3056l6891j5213p9787K0147m4293O3783K3997n4955m3673
$$ -31379 -8355 -295 -13351 -50242 -65455 -145242 -125095 -169388 -105605 -81608 -136563 -180236
15189a80236j4144R8585J32379j8236J0953K1063M3656n3573m4028m4206M0206
$$ -180236 -194380 -95795 36584 18348 29301 50364 94020 40447 -3581 -47787 -7581
15178g581N3349j4394Q540N851j3522n5314Q177j195m0923k6006J38224P5142
$$ -7581 45768 31374 39914 45765 32243 -23071 -14894 -16089 -57012 -83018 55206 130348
15166A30348j4993o9167n1806m3152l4363j7628N4438j8524l5758j9379l5868
$$ 130348 115355 46188 -5618 -48770 -83133 -100761 -46323 -64847 -100605 -119984 -155852
15155a55852l0772m6231N1917P1417L0774l875k6098L1393N3341K4796q111n6771
$$ -155852 -186624 -232855 -180938 -109521 -78747 -82622 -108720 -77327 -23986 810 -7301 -64072
15143f4072j24329l8966L5123R3179J02849J057l5150J1079q550r939O0212K2696
$$ -64072 -188401 -227367 -192244 -99065 3784 4841 -30309 -19230 -27780 -37719 22493 45189
15131D5189j5302M019k1965K8115N6760l1491j24750K648j0172K3012P5010q107
$$ 45189 29887 33906 11941 40056 96816 65325 -59425 -56777 -66949 -43937 31073 22966
15119B2966m770J0778K9683N8134M1463n9111q6830K5992O3965r6070j09755J1837
$$ 22966 18196 28974 58657 116791 158254 99143 12313 38305 102270 6200 -103555 -91718
15107i1718Q4084j8683L9314M011q670o2046k3311J06201Q5588R4041n0932l1029
$$ -91718 -7634 -26317 12997 17008 8338 -53708 -77019 29182 114770 208811 157879 126850
15095A26850m4277l1433q7061n0179q24K8988l0864r8902M4626J19958L0047j5078
$$ 126850 82573 51140 -35921 -86100 -86924 -57936 -88800 -187702 -143076 -23118 6929 -8149
15083h149J9649J3509j2532M8838O7634j08318L8807K3396r9695n9507L8402k15
$$ -8149 11500 25009 12477 61315 128949 20631 59438 82834 -16861 -76368 -37966 -38181
15071c8181L2904M0442p5420q2437L9308M4163p2042j4317R185N4796N8724j9246
$$ -38181 -5277 35165 -40255 -122692 -83384 -39221 -111263 -125580 -116395 -61599 -2875 -22121
15059b2121J7379K9723L0556k3220k1121j8545J7475l0405m8170q232m3761N9728
$$ -22121 -4742 24981 55537 32317 11196 -7349 10126 -20279 -68449 -76681 -120442 -60714
15047f0714p501l678N7296j9793L2070M6214o3224j1476n9199j1946O9893L8957
$$ -60714 -68215 -71893 -14597 -34390 -2320 43894 -19330 -30806 -90005 -101951 -32058 6899
15035F899p0494n3104J2574M0246Q3739n1631p9170l3704p1304l0485J00953J04726
$$ 6899 -63595 -116699 -104125 -63879 19860 -31771 -110941 -144645 -215949 -246434 -145481 -40755
15023d0755j6352k8071J547J7584j7569l5055L3689Q6863L8275r772k3865m3281
$$ -40755 -57107 -85178 -83631 -66047 -83616 -118671 -84982 1881 40156 30384 6519 -36762
15011c6762L0875L8080l706k0775k2888n3023J2573L1441P5879l6515Q19k1239
$$ -36762 -5887 32193 28487 7712 -15176 -68199 -55626 -24185 51694 15179 15998 -5241
14999e241L2645k674j2655j9777N1248m9836l9236K8434P6698P3125k3919l1827
$$ -5241 27404 24730 12075 -7702 43546 -6290 -45526 -17092 59606 132731 108812 76985
14987G6985p771n7297l5111N0655O1607j54k5752J2021K5677M062O058q312q6320
$$ 76985 69214 11917 -23194 27461 89068 88914 63162 75183 100860 104922 110980 102668 16348
14974A6348o1641R981Q3973n7165o3860L8924J7037l532n0652L9742K6474p4289
$$ 16348 -45293 -35312 48661 -8504 -72364 -33440 -16403 -19935 -70587 -30845 -4371 -78660
14962g8660r993J6390M0035j8043k5644l6841L3532J06058K4042j08595l2462
$$ -78660 -88653 -72263 -32228 -50271 -75915 -112756 -79224 26834 50876 -57719 -90181
14951i0181L5401J16423l7794n9582N4365O1176n5191p0555r9494L650K3612P3056
$$ -90181 -54780 61643 23849 -35733 18632 79808 24617 -45938 -145432 -141782 -118170 -45114
14939d5114J7622k7411j9093k3758J2939K1462L6656L8044K6678l3507n8383J8717
$$ -45114 -27492 -54903 -73996 -97754 -84815 -63353 -26697 11347 38025 4518 -53865 -35148
14927c5148K2835m4862J8531P8249J06644N0251j5080o1273k8974K3227J2185
$$ -35148 -12313 -57175 -38644 39605 146249 196500 181420 120147 91173 114400 126585
14916A26585K6687m9232j00141m6551J3994l9331K1218m0910m6244J6700K2139
$$ 126585 153272 104040 3899 -42652 -28658 -67989 -46771 -87681 -133925 -117225 -95086
14905i5086k1087L3463J44911N4273J6328j3167p0064n4114n893M0107p8026l2429
$$ -95086 -116173 -82710 62201 116474 132802 119635 49571 -4543 -10436 29671 -48355 -80784
14893h0784L7893J40030M5609p1737m9972j09689k5406K7314O3863n023j9450
$$ -80784 -42891 97139 142748 71011 21039 -88650 -114056 -86742 -22879 -27902 -47352
14882d7352l6139Q5044Q2331O883j3207n4212q9296L7273N7254j2619K0355j4543
$$ -47352 -83491 1553 83884 90767 77560 23348 -65948 -28675 28579 15960 36315 21772
14870B1772m5820N7808o0668J5220K8000L040k3239N3722q97N433q2985k0692
$$ 21772 -24048 33760 -26908 -11688 16312 19352 -3887 49835 48938 54371 -28614 -49306
14858d9306k7205J18220k106m74m991o5022l1861p357m1469l7828P3708J0555
$$ -49306 -76511 41709 39603 39129 34138 -30884 -62745 -70102 -111571 -149399 -75691 -65136
14846f5136n5299P5722Q0211o5422j6708J32213Q3977j24365k9250P6501j308
$$ -65136 -120435 -44713 35498 -29924 -46632 85581 169558 45193 15943 92444 91136
14835I1136o2147l6716l9637K720j4278K7237l1001K8094J003Q8447K6548m3033
$$ 91136 28989 -7727 -47364 -44644 -58922 -31685 -62686 -34592 -33589 54858 81406 38373
14823C8373p2711L2657L7425P7546K9220m6761k2292p8286M3863Q3140n921l8142
$$ 38373 -34338 -1681 35744 113290 142510 95749 73457 -4829 39034 122174 116253 78111
14811G8111l6863q0610m5428L7192O7743M6329p1636q8507k7215O0167J33791
$$ 78111 41248 -39362 -84790 -47598 20145 66474 -5162 -93669 -120884 -60717 73074
14800G3074M6424q4049j6382j13376L0732L9677M0662M5116K0161J981k3461n9999
$$ 73074 119498 35449 19067 -94309 -63577 -23900 16762 61878 82039 84020 60559 560
14788E60j9031j5230k3833o052J9072M2521k9960r3977K9865Q7349o779K9973
$$ 560 -18471 -33701 -57534 -63586 -44514 -1993 -31953 -125930 -96065 -8716 -15495 14478
14776A4478L2305j19008j10784P6889Q0427n7783m269P6793J3713j3313j1717
$$ 14478 46783 -72225 -183009 -106120 -25693 -83476 -87745 -10952 2761 -10552 -22269
14765b2269J7292n6647o2263K4988Q7561P2322l7621j06692L5978P5248m2564
$$ -22269 -4977 -61624 -123887 -98899 -11338 60984 23363 -83329 -47351 27897 -14667
14754a4667Q7250O2481j23047p4325K2577O1782N8184m8449J9764N3040n4735
$$ -14667 72583 135064 12017 -62308 -39731 22051 80235 31786 51550 104590 49855
14743D9855r0054j17916p486r4487J3808J24259J27279p524j3805N6861k9603
$$ 49855 -40199 -158115 -165601 -260088 -246280 -122021 5258 -2266 -16071 40790 11187
14732A1187j10380K3940K079m5082J482K88Q4936p014l7999J9865p0291n059P7887
$$ 11187 -99193 -75253 -73174 -118256 -116774 -116486 -31550 -38564 -76563 -56698 -126989 -132048 -54161
14719e4161j2556k8623J7012L8063N1920J28972j6405r5614o025l6631N2743j0655
$$ -54161 -66717 -95340 -78328 -40265 11655 140627 124222 28608 22583 -14048 38695 28040
14707B8040o8541n134Q7297J30855p4152j23805k9226N0681L4300L7084j27829
$$ 28040 -40501 -45635 41662 172517 98365 -25440 -54666 -3985 30315 67399 -60430
14696f0430j5117K3109J9612o755K9977J365p543l3569J6789N7878j082m2842
$$ -60430 -75547 -52438 -32826 -39581 -9604 -8239 -15782 -49351 -32562 25316 24234 -18608
14684a8608Q4419K7246p1927m4670m2646K3564j1539p7293m153K5431J6846m919
$$ -18608 65811 93057 21130 -23540 -66186 -42622 -54161 -131454 -135607 -110176 -93330 -98249
14672i8249k2095j957P3470j062j4928L1694N7155j4789n8075L3284k9259j42375
$$ -98249 -120344 -122301 -48831 -49893 -64821 -33127 24028 9239 -48836 -15552 -44811 -187186
14660a87186K2429R1896R0693P413O3945O2622j4062j18620M5967k0194p1407
$$ -187186 -164757 -72861 17832 25245 89190 151812 137750 19130 65097 44903 -26504
14649b6504l3309L7627K46l9606J7926N6036m4334m4481O0498J1393j1550K3996
$$ -26504 -59813 -22186 -21940 -61546 -43620 12416 -31918 -76399 -15901 -4508 -16058 7938
14637G938r285J0711P309n1209p8980l1935M2012O8047j5022k048P2709O8505
$$ 7938 -1347 9364 16673 -34536 -113516 -145451 -103439 -35392 -50414 -52462 20247 88752
14625H8752l9826p7697q22n277J1119L6301K7609O989m6937m4292L8486K4115
$$ 88752 48926 -28771 -29593 -34870 -23751 12550 40159 47148 211 -44081 -5595 18520
14613A8520m0078K349j3230m5335L1431K0427K3971L7547K5725N0365k5084j65177
$$ 18520 -21558 -19209 -32439 -77774 -46343 -25916 -1945 35602 61327 111692 86608 -78569
14601g8569q4426k8911M6653P5551N9412l6156n6297l2121M6957l6185l4727N5087
$$ -78569 -162995 -191906 -145253 -69702 -10290 -46446 -102743 -134864 -87907 -124092 -158819 -103732
14589a03732l3234m0306Q5852P0812J25994n7516p7403p0983L3140q77Q5314j943
$$ -103732 -136966 -177272 -91420 -20608 105386 47870 -29533 -100516 -67376 -68253 17061 15118
14577A5118n1398j8373q8351j1473J12704P0094j9627k3915j02241r025L3637
$$ 15118 -36280 -54653 -143004 -154477 -41773 28321 8694 -15221 -117462 -126487 -92850
14566i2850R012j8771O8842K8454K5747M025k2207o1718r6033R077P6363J9064
$$ -92850 -83838 -102609 -33767 -5313 20434 24459 2252 -59466 -155499 -146422 -70059 -50995
14554e0995M7291M7977k9977O7503N3265j7422k8966j8549l790K1762j6878p1427
$$ -50995 -3704 44273 14296 81799 135064 117642 88676 70127 66337 88099 71221 -206
14542b06p087j4043l190r334Q069J888l2139N7376p0357j8842j5471J690P7350
$$ -206 -7293 -21336 -24526 -33860 -25791 -23903 -56042 1334 -69023 -87865 -103336 -101646 -24296
14529b4296M0998J3482m4486j22378J8029J48528J16536p8128J242N5608J4814
$$ -24296 16702 30184 -14302 -136680 -118651 29877 146413 68285 69527 125135 139949
14518A39949r5359q6647q8716m0046K9284R4831L0502K6125j4939j8297j2403
$$ 139949 44590 -42057 -130773 -170819 -141535 -46704 -16202 9923 -5016 -23313 -35716
14507c5716k5322N9048k2627l3426J2712M7102K9226o315j3439p5786j6129Q342
$$ -35716 -61038 -1990 -24617 -58043 -45331 1771 30997 24682 11243 -64543 -80672 -72330
14495g2330Q9351L4211k6843l5333n397k817j3028m677m5826M5306J1164J02676
$$ -72330 17021 51232 24389 -10944 -16341 -19158 -32186 -36863 -82689 -37383 -26219 76457
14483G6457J9588j6168J6316Q939J6941l9213l1831o855o1186j07332k1734j6512
$$ 76457 96045 79877 96193 105132 122073 82860 51029 44174 -17012 -124344 -146078 -162590
14471a62590K2315N5993k8496l0466K7340P9024J33025L1129K5697m0992j83335
$$ -162590 -140275 -84282 -112778 -143244 -115904 -36880 96145 127274 152971 111979 -71356
14460g1356r2184k8918P582O4685n929J66029K0639r4180n5103M3440J2031J4699
$$ -71356 -163540 -192458 -184876 -120191 -126120 39909 60548 -33632 -88735 -45295 -33264 -18565
14448a8565J5811l9495p693l4726L5506r5049k7599j5693N5909K2593M2824j4647
$$ -18565 -2754 -42249 -49942 -84668 -49162 -144211 -171810 -187503 -131594 -109001 -66177 -80824
14436h0824K793j3108n3532n4563k8322J26573k4408N627k9474o3831O0457J35204
$$ -80824 -78031 -91139 -144671 -199234 -227556 -100983 -125391 -119764 -149238 -213069 -152612 -17408
14424a7408P3052r147j04275k5290J7058K7802q650q1791N41M1420j2730l8163
$$ -17408 55644 46497 -57778 -83068 -66010 -38208 -46858 -128649 -128108 -86688 -99418 -137581
14412a37581Q5919J6206k1471J9704k0353j5728m7233J5235R3588J795M1162m1673
$$ -137581 -51662 -35456 -56927 -37223 -57576 -73304 -120537 -105302 -11714 -9919 31243 -10430
14400a0430o4805L2660K4125n235Q115J6260k3482p1034l2306P8475J12396j4752
$$ -10430 -75235 -42575 -18450 -23685 -15570 690 -22792 -93826 -126132 -47657 64739 49987
14388D9987j6366j5211L0437k4845k1391R5162M4828j7339k648q3483m4745K724
$$ 49987 33621 18410 48847 24002 2611 97773 142601 125262 122614 39131 -5614 -2890
14376b890P0708N6877n8994j16663N5931R1964k4921O88n7655n3436L7411o9400
$$ -2890 67818 124695 65701 -50962 4969 96933 72012 72700 15045 -38391 -980 -70380
14364g0380M2365J8062J1866J0375L6128l1599m1668o7103N018n3931K994J00832
$$ -70380 -28015 -9953 1913 12288 48416 16817 -24851 -91954 -86936 -140867 -137873 -37041
14352c7041M5330M0757O4154K1481k9124o6836m6791p4688L5549M0626k6489k5406
$$ -37041 8289 49046 113200 134681 105557 38721 -8070 -82758 -47209 -6583 -33072 -58478
14340e8478o2056L1246P3241n915k8872j0002J00729M3054n3493k7577j10236
$$ -58478 -120534 -89288 -16047 -21962 -50834 -60836 39893 82947 29454 1877 -108359
14329a08359k3448L9856M3301Q704k1439K4119L2756m4676q4028o802K9306J6851
$$ -108359 -131807 -91951 -48650 -39946 -61385 -37266 -4510 -49186 -133214 -140016 -110710 -93859
14317i3859J8546k2868o6021J3665K2925J29639R9382l4006j6837k946K4710M021
$$ -93859 -75313 -98181 -164202 -150537 -127612 2027 101409 67403 50566 47620 72330 76351
14305G6351k5600q599O6670M722l7060j07153p9549J4451K7572k4431O7314j2490
$$ 76351 50751 42152 108822 113544 76484 -30669 -110218 -95767 -68195 -92626 -25312 -37802
14293c7802K0708k4049p6987l092R0938P1124l8966m6320n9201q047J3925K2416
$$ -37802 -17094 -41143 -118130 -121222 -30284 40840 1874 -44446 -103647 -111694 -97769 -75353
14281g5353O1206P0551K0759m9623l7427j2703p841K0375m3120L1709j5388k6784
$$ -75353 -14147 56404 77163 27540 -9887 -22590 -30431 -10056 -53176 -21467 -36855 -63639
14269f3639p779j8274K7952J9656L3940L8358r795r329l441O0616m599k6749N0524
$$ -63639 -71418 -89692 -61740 -42084 -8144 30214 20419 11090 7649 68265 63666 36917 87441
14256H7441L2155p924n6697k5501j3082L4981k4933j6466n2142p2462O6161N7648
$$ 87441 119596 111672 54975 29474 16392 51373 26440 9974 -42168 -114630 -48469 9179
14244I179O8018L1222j09389j917N9564J0703p2022l5070R5591M6229L5073n8950
$$ 9179 77197 108419 -970 -2887 56677 67380 -4642 -39712 55879 102108 137181 78231
14232G8231j10555J225j0709M0108Q267r5060o3369M7943J6260K7932J01170Q8636
$$ 78231 -32324 -31099 -41808 -1700 6567 -88493 -151862 -103919 -87659 -59727 41443 130079
14220A30079q8346l1413k442n0040O672Q3304k9627m8142M1322k4999l3047j3997
$$ 130079 41733 10320 7878 -42162 -35490 47814 18187 -29955 11367 -13632 -46679 -60676
14208f0676J21152N1639O2776J5505k7440P3706J4307k2539m9111j4231n7365
$$ -60676 60476 112115 174891 190396 162956 236662 250969 228430 179319 165088 107723
14197A07723l3044m4481l2715m9171N4551J0883N05M3521K1919k0638n9409l8071
$$ 107723 74679 30198 -2517 -51688 2863 13746 14251 57772 79691 59053 -356 -38427
14185c8427m4938k0580P7634p166P986q8019j7939P9290P846P3324J9469j03410
$$ -38427 -83365 -103945 -26311 -33477 -25491 -113510 -131449 -52159 -44313 29011 48480 -54930
14173e4930j0770J385m2808l0612R0706n347n65O0776k683o2891k4528J4814n0686
$$ -54930 -65700 -64315 -107123 -137735 -47029 -52376 -52941 7835 5152 -57739 -82267 -67453 -118139
14160a18139k7280O0624K8076j6718l5682J4103r228n5955N1230N5633L8049J23494
$$ -118139 -145419 -84795 -56719 -73437 -109119 -95016 -104244 -160199 -108969 -53336 -15287 108207
14148A08207O5501n066L7445L3460m4869l2350n0758j3272L1033J3658K0761K490
$$ 108207 173708 168642 206087 239547 194678 162328 111570 98298 129331 142989 163750 166240
14136A66240l3325o2556q1048L7210K639m0695O6313L4928p2656p3240J3548M1351
$$ 166240 132915 70359 -10689 26521 29160 -11535 54778 89706 17050 -56190 -42642 -1291
14124a291Q789o5890l0102L0312J28487R2260k0396n3589J5639j19292j0725O3172
$$ -1291 7498 -58392 -88494 -58182 70305 162565 142169 88580 104219 -15073 -25798 37374
14112C7374m9174o1058O0737l0013k3605J28466M5909k9570j5423p8952k3770
$$ 37374 -11800 -72858 -12121 -42134 -65739 62727 108636 79066 63643 -15309 -39079
14101c9079M2680L9877j0587L5321j13329n9440J5721P798J11098K9661M056k2069
$$ -39079 3601 43478 32891 68212 -45117 -104557 -88836 -81038 30060 59721 63777 41708
14089D1708M3L4594n3232q475j4805O47L4869o296J0283j22451m3058N2569J21957
$$ 41708 41751 76345 23113 14638 -167 480 35349 29053 39336 -83115 -126173 -73604 48353
14076D8353k2840J6103N2897j1946l9683l6350o2765n661m6315M7246R2158K8743
$$ 48353 25513 41616 94513 82567 42884 6534 -56231 -61892 -108207 -60961 31197 59940
14064E9940j6799n791p5272n6554k2498P8831R2529j3996q1769N3162k1369j36518
$$ 59940 43141 37350 -37922 -94476 -116974 -38143 54386 40390 -41379 11783 -9586 -146104
14052a46104O237J4344k2225M2935j4874n4305k3612k559M1620O5079j3476l7197
$$ -146104 -139867 -125523 -147748 -104813 -119687 -173992 -197604 -200163 -158543 -93464 -106940 -144137
14040a44137O924N1712N8546k6273q1955m9712M0866N635M7873R346q899K1783
$$ -144137 -137213 -85501 -26955 -53228 -135183 -184895 -144029 -138394 -90521 -81175 -90074 -68291
14028f8291J13697L5701j29677o7946O4669J5601l2465J9682J3060J4855l0233
$$ -68291 45406 81107 -48570 -116516 -51847 -36246 -68711 -49029 -35969 -21114 -51347
14017e1347P1508O5646J1648j1038k8331L4797j489p0491n6134j800Q359N8246
$$ -51347 20161 85807 97455 86417 58086 92883 91394 20903 -35231 -37031 -28672 29574
14005B9574K0183L3510j3865m3801P646o6691o6962P7025J05062O4480l3232n2376
$$ 29574 49757 83267 69402 25601 33247 -33444 -100406 -23381 81681 146161 112929 60553
13993F0553j24853n4678Q7678J06288o380P3479p791j32604k6169K055M4123l0114
$$ 60553 -64300 -118978 -31300 74988 68608 142087 134296 1692 -24477 -22422 21701 -8413
13981h413L5363K520l2835L8783l969M978L0585l1843k2683N6445o7501j12958
$$ -8413 26950 29470 -3365 35418 31449 36427 67012 35169 12486 68931 1430 -111528
13969a11528N2522O3026J3066K9286M1030q9194K8729l1717m0761Q5633L5214
$$ -111528 -59006 4020 17086 46372 87402 -1792 26937 -4780 -45541 40092 75306
13958G5306l8208j2510r541K3600O3994K1115q3908j4221m035n4104L1875L4607
$$ 75306 37098 24588 15047 38647 102641 123756 39848 25627 21592 -32512 -637 33970
13946C3970K3085m9436O8048K6626j3420l5810R208K0044r1780j36865M9629R0826
$$ 33970 57055 7619 75667 102293 88873 53063 62271 82315 -9465 -146330 -96701 -5875
13934e875l3910l0203J1825M5384J529N9000k8568j08662Q573J8154L511L9515
$$ -5875 -39785 -69988 -58163 -12779 -11250 47750 19182 -89480 -80907 -62753 -59242 -19727
13922a9727o324K9649J4075o4002J9762L3916r891N196o3722j7090Q713L7952
$$ -19727 -26051 3598 17673 -46329 -26567 7349 -2542 2654 -61068 -78158 -69445 -31493
13910c1493K9136j7164Q844l9852m7504o6696O1965Q0878K2910P8508J0972m8583
$$ -31493 -2357 -19521 -10677 -50529 -98033 -164729 -102764 -21886 1024 79532 90504 41921
13898D1921k8745J6854K8509j0992j11193l858J7747K7231J03759R6072K6696
$$ 41921 13176 30030 58539 47547 -63646 -67504 -49757 -22526 81233 177305 204001
13887B04001j2706K6279J8238q3732l0741K2656J09140K3735l4371m7954k1785
$$ 204001 191295 217574 235812 152080 121339 143995 253135 276870 242499 194545 172760
13876A72760p1969j14881l8581O8168K0963q96m2782l6478m8347j441K4607j3537
$$ 172760 100791 -14090 -52671 15497 36460 35564 -7218 -43696 -92043 -93484 -68877 -82414
13864h2414L5782J324P8524k0433l5198K9039j7137l6043N0778k931J8652K0610
$$ -82414 -46632 -45308 33216 12783 -22415 6624 -10513 -46556 4222 1291 19943 40553
13852D0553l6575L7072n7576j4694K7241L3532K9629O5930M1700m211K2116m9745
$$ 40553 3978 41050 -16526 -31220 -3979 29553 59182 125112 166812 162601 184717 134972
13840A34972m0599Q316k7449K1014K7591L983M6343L4472j4801q8854j8269M0605
$$ 134972 94373 102689 75240 96254 123845 127828 174171 208643 193842 104988 86719 127324
13828A27324O590q385m0987q1878j9858j8108N5482P083k2294j9755q042m2255
$$ 127324 133914 125529 84542 2664 -17194 -35302 20180 27263 4969 -14786 -22828 -65083
13816f5083P7943l155m5222L862N2216K5175J8286k1998J2648K4661K0289M3311
$$ -65083 12860 9705 -35517 -31655 20561 45736 64022 42024 54672 79333 99622 142933
13804A42933k0228j13934Q2452K2576j00684l0013K4557P353l0339j2797L0041
$$ 142933 122705 8771 91223 113799 13115 -16898 7659 15012 -15327 -28124 1917
13793A917N8655M4646R6291N9393Q6617M9078j2105p0122O7121n3616p5307r6790
$$ 1917 60572 105218 201509 260902 347519 396597 384492 314370 381491 327875 252568 155778
13781A55778n8655K673J8898k1291m0648P465N5141n446N296j10238p2240N4993
$$ 155778 97123 99796 118694 97403 56755 64220 119361 113915 119211 8973 -63267 -8274
13769h274J04724O0834J1884K9535j2399n4062o9277o6471M8315O4762R583J549
$$ -8274 96450 157284 169168 198703 186304 132242 62965 -3506 44809 109571 119154 120703
13757A20703o92J2535J2618k2653n3525j547L8271N2226O5210J7921O2526J13407
$$ 120703 120011 132546 145164 122511 68986 67439 105710 157936 223146 241067 303593 417000
13745D17000J55937J44514K28986J40748n5547j06489j11098l8418j77639j16989
$$ 417000 572937 717451 946437 1087185 1031638 925149 814051 775633 597994 481005
13735D81005j29521o647j0903p577n4388n3636j5095O0603p1594p0300o7636k4340
$$ 481005 351484 344837 333934 326357 271969 218333 203238 263841 192247 121947 54311 29971
13723B9971L7012j3479j462L1009J6604k7403M9586l4981j210R9119M0662k5436
$$ 29971 66983 53504 52042 83051 99655 72252 121838 86857 85647 184766 225428 199992
13711A99992l0074j01283N162P1631K8425n493M3786M6674P2860P3181N4216J42907
$$ 199992 169918 68635 73797 145428 173853 168360 212146 258820 331680 404861 459077 601984
13699F01984K17642K02649J45569M1171j03728j23667j80596j35929j60477j45157
$$ 601984 819626 1022275 1167844 1209015 1105287 981620 801024 665095 504618 359461
13689C59461p5543M1078O0872j20189k15688m493j4666N268L5674J03487l5833
$$ 359461 283918 324996 385868 265679 49991 45498 30832 36100 71774 175261 139428
13678A39428p3866L8506J2183K9424J5362j731L6065k8650l5662L0128k5977L7643
$$ 139428 65562 104068 116251 145675 161037 159306 195371 166721 131059 161187 135210 172853
13666A72853L7169k3747j1582N4342L1356j06750l6201j8754n7557M7156J00243
$$ 172853 210022 186275 174693 229035 260391 153641 117440 98686 41129 88285 188528
13655A88528J05910Q1200Q0418K6532k9922l566m8568r95p8045j13259m1142J7073
$$ 188528 294438 375638 456056 482588 452666 449100 400532 399537 321492 208233 167091 184164
13643A84164n97q3527j5820k489K0971k0668m6941J4053J1799k2952K0334J02971
$$ 184164 183567 100040 84220 81731 102702 82034 35093 49146 60945 37993 58327 161298
13631A61298M4616k9126k6973J16142R8595M7255L7173j172j740M1362n0154r0214
$$ 161298 205914 176788 149815 265957 364552 411807 448980 447808 446068 487430 437276 347062
13619C47062p8218j53422j10803Q3450P8951K2667n0284o5091p2708n6160O772
$$ 347062 268844 115422 4619 88069 167020 189687 139403 74312 1604 -54556 -47784
13608d7784j8370K4506K8071N462L5150P1385k0467n16J2767J6042J6759l0201
$$ -47784 -66154 -41648 -13577 -8115 27035 98420 77953 77437 90204 106246 123005 92804
13596I2804q858J3368J3685j7729O3105q523l6698P8531Q1298N0409J1596K4561
$$ 92804 83946 97314 110999 93270 156375 147852 111154 189685 270983 321392 332988 357549
13584C57549j6101k4578N0707J54411K5312M704K0899L2888J2710k2509j568N273
$$ 357549 341448 316870 367577 521988 547300 552004 572903 605791 618501 595992 594424 599697
13572E99697R210o618j4028N4096N1718Q4116l4993l6520M894l4010o085j26699
$$ 599697 608907 602289 588261 642357 694075 778191 743198 706678 711572 677562 671477 544778
13560E44778j08541j3022L8334M5297L8036l4074k7945l8049o2791k4372L2225
$$ 544778 436237 423215 461549 506846 544882 510808 482863 444814 382023 357651 389876
13549C89876L2480l0930Q2063J00039P3680M7203O9121J35805J55109J28041P8452
$$ 389876 422356 391426 473489 573528 647208 694411 763532 899337 1054446 1182487 1260939
13538A260939J20925J64209J00263j89p7444j0642o8110j55196j56124j23916
$$ 1260939 1381864 1546073 1646336 1646147 1568703 1558061 1489951 1334755 1178631 1054715
13528A054715p4531k8366m3308j11990q3668p2703l5372n3825l5469J577K1893
$$ 1054715 980184 951818 908510 796520 712852 640149 604777 550952 515483 517060 538953
13517E38953o9330j13416p4836K4806J81119J45816j8293J6792Q0301J8506j2002
$$ 538953 469623 356207 281371 306177 487296 633112 614819 631611 711912 730418 718416
13506G18416M4309J04672J7274l9930o4746J4243j0327n572l761j42804l9312
$$ 718416 762725 867397 884671 844741 779995 794238 783911 778339 774578 631774 592462
13495E92462J6076j46027q8255M869n977J6828k1723K0064p3831m0583q112J3291
$$ 592462 608538 462511 374256 379125 373148 389976 368253 388317 314486 273903 265791 279082
13483B79082M3717Q0636m8075k725p0078q015N9095K0050n341p7472j22096k6184
$$ 279082 322799 403435 355360 352635 282557 274542 333637 353687 348346 270874 148778 122594
13471A22594Q3985j6132R902o5406R6301m7312m6592O6649o485q7234l445N0809
$$ 122594 206579 190447 200349 134943 231244 183932 137340 203989 197504 110270 106825 157634
13459A57634O3474N1216n5621Q66L1831q6319M621J16212K2429l0554K6915J05450
$$ 157634 221108 272324 216703 217569 249400 163081 167702 283914 306343 275789 302704 408154
13447D08154q615o8766m6756Q479O1551j6198l8215p83o960q115m890L1897Q155
$$ 408154 399539 330773 284017 292496 354047 337849 299634 298851 291891 283776 278886 310783 318938
13434C18938k8990J5850l9873k0046K3317p4546k0196O2433m0409L0136J283k4645
$$ 318938 289948 305798 265925 245879 269196 194650 174454 236887 196478 226614 227897 203252
13422B03252r461L5616M7397K2945n2320k8090R1943M2375m2718J2402j2946K0911
$$ 203252 193791 229407 276804 299749 247429 219339 311282 353657 310939 323341 310395 331306
13410C31306K3518J17301l5614m2381L6694O0780j4516J3564N30M5344L1396m6176
$$ 331306 354824 472125 436511 394130 430824 491604 477088 490652 491182 536526 567922 521746
13398E21746n4338N1506K0612K5224K7353k4700O5611l1169j6947m6844K3133
$$ 521746 467408 518914 539526 564750 592103 567403 633014 601845 584898 538054 561187
13387E61187J5626o4224q258o6235o0940m1137J18270J85796K8879K3623K5880
$$ 561187 576813 512589 504331 438096 377156 336019 454289 640085 668964 692587 718467
13376G18467N1404K5995n5101p6524p7397p369m976K6935O6394M4174M7228J89333
$$ 718467 769871 795866 740765 664241 586844 579475 574499 601434 667828 712002 759230 948563
13364I48563N3196m3536J6097r312J21377j7492k148M9612Q0071J28208J64672
$$ 948563 1001759 958223 974320 965008 1086385 1068893 1066745 1116357 1196428 1324636 1489308
13353A489308J2043J4641P867J4457J30692J60980N5492J7231K00960L12203K06704
$$ 1489308 1501351 1515992 1523859 1538316 1669008 1829988 1885480 1902711 2103671 2415874 2622578
13342B622578J83171J89913L05834M03519M31804M95939O92148Q62448J063489
$$ 2622578 2805749 2995662 3301496 3705015 4136819 4632758 5324906 6187354 7250843
13333G250843J453025J772247K066872K726746L771277N442976P899836J0945571
$$ 7250843 8703868 10476115 12542987 15269733 19041010 24483986 32383822 43329393
13325D3329393J3100803J1014531L907069l279662o884098q314966r162829r018948
$$ 43329393 56430196 67444727 71351796 68072134 61188036 52873070 43710241 34691293
13317C4691293p580036n685583m002776k773038k016967j537996j231012q95861
$$ 34691293 27111257 21425674 17422898 14649860 12632893 11094897 9863885 8968024
13309H968024o58010n81233l56159k45796j99814j08764k9966k975J33673J62799
$$ 8968024 8310014 7728781 7372622 7126826 6927012 6818248 6788282 6785307 6918980 7081779
13299G081779K13473L40324M69258N95422P68316R23218J213184J513433J876772
$$ 7081779 7295252 7635576 8104834 8700256 9468572 10391790 11604974 13118407 14995179
13290A4995179K447710L350882M269347N306209O408961Q022773J1016796J6414342
$$ 14995179 17442889 20793771 25063118 30369327 36778288 44801061 55817857 72232199
13282G2232199K4691038L6559984M6911185M1042567J2495199j5562501k6075373
$$ 72232199 96923237 133483221 180394406 221436973 233932172 218369671 192294298
13275A92294298k8249301l1101048l1343735k5659311j7942683j2125614q362863
$$ 192294298 164044997 132943949 101600214 75940903 57998220 45872606 37509743
13268C7509743o108315m728112l606343k812679k415963j872165j423082j132033
$$ 37509743 31401428 26673316 23066973 20254294 17838331 15966166 14543084 13411051
13260A3411051q47075o27499m44942m54292l13185k39704o7475J15850K41036
$$ 13411051 12563976 11936477 11491535 11037243 10724058 10484354 10416879 10532729 10773765
13251A0773765M07275N99156P92604R55601J491931J964554K454926L400396M354585
$$ 10773765 11181040 11780196 12572800 13528401 15020332 16984886 19439812 22840208 27194793
13242B7194793N282617O437921Q144711J1434676J6722029K5205275L7098011
$$ 27194793 32477410 38915331 47060042 58494718 75216747 100422022 137520033
13235A37520033M7539309M1438770J2286430j6330049k7063744k8997307l1750534
$$ 137520033 185059342 226498112 238784542 222454493 195390749 166393442 134642908
13228A34642908l1956808k6201483j8425798j2342926q552197o203628m798264
$$ 134642908 102686100 76484617 58058819 45715893 37163696 30960068 26161804
13221B6161804l801313l066113k559715j987268j605708j268735j022585q41609
$$ 26161804 22360491 19294378 16734663 14747395 13141687 11872952 10850367 10008758
13213A0008758o61941o20896m81228m74801l63140j96712j47148n9361Q9985K07465
$$ 10008758 9346817 8725921 8244693 7769892 7406752 7210040 7062892 7003531 7093516 7300981
13203G300981L00939M80458O35242Q28913J134422J427199J772627K262644K865659
$$ 7300981 7601920 8082378 8717620 9546533 10680955 12108154 13880781 16143425 19009084
13194A9009084L986916N657450Q299026J1511924J3579006J1118241L413283m276082
$$ 19009084 22996000 28653450 36952476 48464400 62043406 73161647 76574930 72298848
13186G2298848p965457r226548r989350r763834q149566n983307m198774l007736
$$ 72298848 64333391 55106843 45117493 35353659 27204093 21220786 17022012 14014276
13178A4014276k328059j753897j427060j066559q34422p52236o58245n52553l11537
$$ 14014276 11686217 9932320 8505260 7438701 6604279 5852043 5193798 4641245 4329708
13169D329708k92683k35180k78831l53787k88868k07878j86643j64870j69470
$$ 4329708 4037025 3801845 3523014 3169227 2880359 2672481 2485838 2320968 2151498
13160B151498j51886j8156j7444r2772j18958r3875n5934j13696n9602O175L3016
$$ 2151498 1999612 1981456 1964012 1871240 1752282 1658407 1602473 1488777 1429175 1435350 1468366
13149A468366N5005J1579n0613n8056k9396j08040o7144j14259l0496q4804R51
$$ 1468366 1523371 1534950 1484337 1426281 1396885 1288845 1221701 1107442 1076946 992142 993093
13138I93093m9961j6930K8615k2716k4327N0728J02242J20893O4228o9588j20
$$ 993093 943132 926202 954817 932101 907774 958502 1060744 1181637 1245865 1176277 1176157
13127A176157K4704l305r0156J2047Q6818Q2348q3363q8816r3858p0913l3634
$$ 1176157 1200861 1197556 1107400 1119447 1206265 1288613 1205250 1116434 1022576 951663 918029
13116I18029p4634m7499r868m655q5235J2132P6329M325K4803L486m9661J0652
$$ 918029 843395 795896 786028 781373 696138 708270 784599 788924 813727 817213 767552 778204
13104G78204K4851o5982j7656j1125K0387q1367J0444k8436k5788k7066K3215
$$ 778204 803055 737073 719417 708292 728679 647312 657756 629320 603532 576466 599681
13093E99681L346j770m9976o4100P7675R4021K1514K5241O329J7015m075k9905
$$ 599681 603027 601257 551281 487181 564856 658877 680391 705632 711961 728976 724901 694996
13081F94996J7980L5714J39797J70179L7936k2324r0391j27206j67741l5801J129
$$ 694996 712976 748690 888487 1058666 1096602 1074278 983887 856681 688940 653139 654268
13070F54268p142J2479l8546r9304J8936P4714j450N0043m6692l4471o7198j57638
$$ 654268 647126 659605 621059 521755 540691 615405 613955 663998 617306 582835 515637 357999
13058C57999p6779R3342P7525j05462m9202L3951L8071L0108Q735M3269o0039
$$ 357999 281220 374562 452087 346625 297423 331374 369445 399553 408288 451557 391518
13047C91518r8510M4220O0919J09516M5351j7995n7341N5719O2373k2259q4051
$$ 391518 293008 337228 398147 507663 553014 535019 477678 533397 595770 573511 489460
13036D89460j4914J9070K0316n7383K0711J6671q0105J2492k8208j3656N681n1222
$$ 489460 474546 493616 513932 456549 477260 493931 413826 426318 398110 384454 390135 338913
13024C38913J8606k5366O0759O1329n3572n4269l8950m2939M4376O4705L0425
$$ 338913 357519 332153 392912 454241 400669 346400 307450 264511 308887 373592 404017
13013D04017q2963j35063O764L8450l5695k5900P1900R4002J4473L8556p7445
$$ 404017 321054 185991 192755 231205 195510 169610 241510 335512 349985 388541 311096
13002C11096q1354N0320O9136l0098K515K5894k443j0342j8827n8041L3409o68
$$ 311096 229742 280062 349198 319100 321615 347509 345066 334724 315897 257856 291265 290597
12990B90597l1867L4664M1794j6929K5451j3184L1113O6575k6045K9077m4316
$$ 290597 258730 293394 335188 318259 343710 330526 361639 428214 402169 431246 386930
12979C86930l0880N7232j7021l6761J9707m0913n1305k6174o6991K1087Q0143
$$ 386930 356050 413282 396261 359500 379207 338294 286989 260815 193824 214911 295054
12968B95054P56o3215n1N6147k747J4423j9680k4254L6592k8838j15000m3761
$$ 295054 295810 232595 232544 288691 285944 300367 280687 256433 293025 264187 149187 105426
12956A05426Q1967J9397M5040K9054l3397k1527j9293n815L0863M2626J4236K8512
$$ 105426 187393 206790 251830 280884 247487 225960 206667 200852 231715 274341 288577 317089
12944C17089o3970m6092M5680k3253L5325p826J0434K4885j4836k3904L504M541
$$ 317089 253119 207027 252707 229454 264779 256953 267387 292272 277436 253532 257036 261577
12932B61577j03045M5752L2930k0414q3304o977j6009o306O3832J6088l680L1882
$$ 261577 158532 204284 237214 216800 133496 126519 110510 104204 168036 184124 180444 212326
12920B12326n0843O9910J19041P3934Q7333l7966j9180K9301o9971K3113l2279
$$ 212326 161483 231393 350434 424368 511701 473735 454555 483856 413885 436998 404719
12909D04719n6392n7467q8066q0873N2173J5936j05150m483L8513N4075L1778
$$ 404719 348327 290860 202794 121921 174094 190030 84880 80397 118910 172985 204763
12898B04763K3998N813k9146L6683J00458L9187k5643m2906R600j8902k9167k3680
$$ 204763 228761 234574 205428 242111 342569 381756 356113 313207 322807 303905 274738 251058
12886B51058n4174K2968j087l5607j04304l8144P4972O1838O731k6681m617n227
$$ 251058 196884 219852 218765 183158 78854 40710 115682 177520 184251 157570 152953 147726
12874A47726M4084J09562K2322L2111l7595j2760O0168N3103L204l2177r5967
$$ 147726 191810 301372 323694 355805 318210 305450 365618 418721 421925 389748 293781
12863B93781k0871L2290J8117o4637j0326P6144J7320n5676O0208L5586L6346
$$ 293781 272910 305200 323317 258680 248354 324498 341818 286142 346350 381936 418282
12852D18282o961l0985N7717N2331K6986l042o1429j30286j9937l4526r3013l8950
$$ 418282 411321 380336 438053 490384 517370 514328 452899 322613 302676 268150 175137 136187
12840A36187P0071N2927p8924r9639P599r483J14458K4139o4485j9282J2851l519
$$ 136187 206258 259185 180261 80622 88221 78738 193196 217335 152850 133568 146419 142900
12828A42900K6710M0540m6799K5619k1309m0095J9750j2704L5717k0253j00333
$$ 142900 169610 210150 163351 188970 167661 127566 147316 134612 170329 150076 49743
12817D9743l0219n566M9650J09045J35796J58422O4810N1104J36619K22820J57849
$$ 49743 19524 13958 63608 172653 308449 466871 531681 582785 719404 942224 1100073
12806A100073P0654j752q4889j97907k14619q3961k5338o4213k8452q5779j8394
$$ 1100073 1170727 1168975 1084086 886179 671560 587599 562261 498048 469596 383817 365423
12795C65423L6908r6316q1471p3170J8917l0193n4480K0071R0709o970j2959m1226
$$ 365423 402331 306015 224544 151374 170291 140098 85618 105689 196398 189428 176469 135243
12783A35243J7004r3600O284Q4946O3975n1549j4001J8330P6804N3794N2071N4443
$$ 135243 152247 58647 64931 149877 213852 162303 148302 166632 243436 297230 349301 403744
12771D03744n7941n7961J30235J891n8070N0733J45526K49283J50191J22475k7384
$$ 403744 345803 287842 418077 419968 361898 412631 558157 807440 957631 1080106 1052722
12760A052722K1449k3424j34752j59818j72527j31259j70358j8987L6486r011
$$ 1052722 1074171 1050747 915995 756177 583650 452391 282033 263046 299532 290521
12750B90521j00313m5505o3956n6863J7052J6432k6155N411l989J5405k8618m6197
$$ 290521 190208 144703 80747 23884 40936 57368 31213 36624 32635 48040 19422 -26775
12738b6775P5935L9813K8900M1297m419p7079p4149O5247J00685m1203o5849k6907
$$ -26775 49160 88973 117873 159170 154751 77672 3523 68770 169455 128252 62403 35496
12726C5496n1474M8834J17981L2049k5390P5709N4092J7459q9799Q7440P4686
$$ 35496 -15978 32856 150837 182886 157496 233205 287297 304756 214957 302397 377083
12715C77083P2761J2340l6636p1446j07554n7249j7862j7625J9810L5173l3861
$$ 377083 449844 462184 425548 354102 246548 189299 171437 153812 173622 208795 174934
12704A74934j07291j8220m729m164k074J6763m1542O5721j5242q834j1900K0557
$$ 174934 67643 49423 44694 40530 38456 55219 13677 79398 64156 55322 43422 63979
12692F3979J04459P5893k8551n9379m1114l1260p2373j3312J9176P2333j27957
$$ 63979 168438 244331 215780 156401 115287 84027 11654 -1658 17518 89851 -38106
12681c8106q3533p7948L3787N7204L7913J08133Q4437k8215j35112j6046n13Q2
$$ -38106 -121639 -199587 -165800 -108596 -70683 37450 121887 93672 -41440 -57486 -57999 -57917
12669e7917J03357k5879L2123p3831n6163N4386M3762K1241N7907L7415J325j7226
$$ -57917 45440 19561 51684 -22147 -78310 -23924 19838 41079 98986 136401 137726 120500
12657A20500K5220J2204o4867l785M8390O6704l6712j42965q7604K3112J00759
$$ 120500 145720 157924 93057 89272 137662 204366 167654 24689 -62915 -39803 60956
12646F0956K3540k1913l9694p6746m8450L241O5682O5450M4609l400j0134M1526
$$ 60956 84496 62583 22889 -53857 -102307 -99066 -33384 32066 76675 73275 63141 104667
12634A04667k7551j03769p644J3521J0690L7745N2464n2631K9310P672o1658j36410
$$ 104667 77116 -26653 -34297 -20776 -10086 27659 80123 27492 56802 64474 2816 -133594
12622a33594Q276O7471O6071R2863P3261j32019r4643K2836L4706N4040J52j3550
$$ -133594 -125318 -57847 8224 101087 174348 42329 -52314 -29478 5228 59268 59420 45870
12610D5870K7454k5994R803L710m9208k9953l6667m2161J02211j2211n450O828
$$ 45870 73324 47330 57133 60843 11635 -18318 -54985 -97146 5065 -7146 -12596 -5768
12598e768K9101J2319j5342J7645m9423l4331Q674r155J3640N626j1290R1822
$$ -5768 23333 35652 20310 37955 -11468 -45799 -37125 -46280 -32640 -27014 -38304 53518
12586E3518J19375m940p9771p0284j05447r7504J45523J30363M4449L9150k6399
$$ 53518 172893 167953 88182 17898 -87549 -185053 -39530 90833 135282 174432 148033
12575A48033o6695r5105k2397J07366J08208o8243o4295k9547m4381J4415k9947
$$ 148033 81338 -13767 -36164 71202 179410 111167 46872 17325 -27056 -12641 -42588
12564d2588L6728N7015M7245o1945L0264L7002n6671L2044j1049J5169k2369n993
$$ -42588 -5860 51155 98400 36455 66719 103721 47050 79094 68045 83214 60845 54852
12552E4852M1664L7418n0384K8928J6827j08031n4962R2576j424K614Q9923Q6798
$$ 54852 96516 133934 83550 112478 129305 21274 -33688 58888 57464 60078 150001 236799
12540B36799L3029Q477J8030P2520N7672R2509o3597q7297j31931o5956J3101
$$ 236799 269828 278305 296335 368855 426527 519036 455439 368142 236211 170255 183356
12529A83356o720J87293K23430J65911K16252J76604m32m0007n0925j51844j75620
$$ 183356 176636 363929 587359 753270 969522 1146126 1145694 1105687 1054762 902918 727298
12518G27298k01799k06317j26341l3667L556j0227j08948l9826M9658l4225J7239
$$ 727298 525499 319182 192841 159174 162730 152503 43555 3729 53387 19162 36401
12507C6401m480p177K9277K8185M9114m620m7686l5676q9553J766N0835L9714
$$ 36401 31921 24744 54021 82206 131320 126700 79014 43338 -46215 -44449 6386 46100
12495D6100j53270l5213J03760j0707k1662J16411P3977K0183p8431l5073N9793
$$ 46100 -107170 -142383 -38623 -49330 -70992 45419 119396 139579 61148 26075 85868
12484H5868M2271J4071j3171n6680j14810K7147j8330q695j2686M765P633L3202
$$ 85868 128139 142210 129039 72359 -42451 -15304 -33634 -42329 -55015 -50250 -42617 -9415
12472i415J6267L3070Q5065P0067k3447K564q7810M7434O3455m6219K8815R1820
$$ -9415 6852 39922 124987 195054 171607 174171 86361 133795 197250 151031 179846 271666
12460B71666J7455J1818r440m2437j18047J2492J8636O1419k2642j69131o0880
$$ 271666 289121 300939 291499 249062 131015 143507 162143 223562 200920 31789 -29091
12449b9091n4188J6471P4035o5544L2522J3477J2283r15K1441O7559k4318r4450
$$ -29091 -83279 -66808 7227 -58317 -25795 -12318 -35 -950 20491 88050 63732 -30718
12437c0718j2267R1769J59400j5579p7959n657m5105k0696L7372l93l1545J3625
$$ -30718 -42985 48784 208184 192605 114646 108989 63884 43188 80560 80167 48622 62247
12425F2247n0896Q233R3223p536o9744l8645k0036L8775Q294N3316k3898j5752
$$ 62247 11351 19584 112807 105271 35527 -3118 -23154 15621 23915 77231 53333 37581
12413C7581P015n5090j6145O0603M2069K3415l0306J1786M0229l3859p1421l8005
$$ 37581 44596 -10494 -26639 33964 76033 99448 69142 80928 121157 87298 15877 -22128
12401b2128l192N2212J2960K0781L954O1019k1042n5748j6371N404q6447p0992
$$ -22128 -25320 26892 39852 60633 64587 125606 104564 48816 32445 37849 -48598 -119590
12389a19590Q9903N3311Q3859L5751l7358m7480p7031j2634P9345k9499L1764
$$ -119590 -29687 23624 107483 143234 105876 58396 -18635 -31269 48076 18577 50341
12378E0341L0220q8901k6965O4730q0942k4382k6154L324j855n87O3866M9640
$$ 50341 80561 -8340 -35305 29425 -51517 -75899 -102053 -98729 -100584 -101171 -37305 12335
12366A2335R2348l521j5955J6448J7741L6766K7247j6250j44938p7259L0519Q2467
$$ 12335 104683 101162 85207 101655 119396 156162 183409 167159 22221 -55038 -24519 57948
12354E7948L2614k8313L4075o9558P6757K6127j18756R1153j2675o2062q0384
$$ 57948 90562 62249 96324 26766 103523 129650 10894 102047 89372 27310 -53074
12343e3074l9812J024j7296o7270Q6985J30899M0490J2713j9394k7712p585j4584
$$ -53074 -92886 -91862 -109158 -176428 -89443 41456 81946 94659 75265 47553 39968 25384
12331B5384Q3103j1382p4426k2712K3441r791K444o2331k9906L7738k1360j1618
$$ 25384 108487 97105 22679 -33 23408 13617 16061 -46270 -76176 -38438 -59798 -71416
12319g1416R9871O6170r752k9273J5033l219j2134o877m5485m4247L5024M1559
$$ -71416 28455 94625 84873 55600 70633 67414 55280 48403 2918 -41329 -6305 35254
12307C5254J9266n7804l6440J2394J27092P0485L5007o1093q21J9104l7653j18324
$$ 35254 54520 -3284 -39724 -27330 99762 170247 205254 144161 143340 162444 124791 6467
12295F467l1652J13985N9045P323l684L974l2603m8616k0093N2335M823k921j8399
$$ 6467 -25185 88800 147845 155168 151484 155458 122855 74239 54146 106481 111304 108383 89984
12282H9984M3057k9063m6064o356m3352m5057n179M2853J3778J07199o756p8254
$$ 89984 133041 103978 57914 51558 8206 -36851 -42030 823 14601 121800 115044 36790
12270C6790P6538J0686n3826M635k1014j3352O8575N4960m3057n238j6285n9735
$$ 36790 113328 124014 70188 74823 53809 40457 109032 163992 120935 115697 99412 39677
12258C9677o84L1694L97R218N0191k4758j4988l4547j01242l8659n7480j4305
$$ 39677 38993 70687 71084 80302 130493 105735 90747 56200 -45042 -83701 -141181 -155486
12246a55486M3585Q8792P9148m0377l6066J7089o5935O9625J1491K2507l9105
$$ -155486 -111901 -23109 56039 15662 -20404 -3315 -69250 375 11866 34373 -4732
12235d732m7163J7799n928l961p680K28N2231J55190R7656K2723j601o127N7012
$$ -4732 -51895 -34096 -40024 -43985 -51665 -51437 794 155984 253640 276363 274762 268635 325647
12222C25647l8141p2389k7213J2354J7848L0732j12278l9009K0102K0545p9837
$$ 325647 287506 215117 187904 200258 218106 248838 136560 97551 117653 138198 58361
12211E8361m0481J3526M3619N1819k0372M6492K3933J474j16052p5203L189N7856
$$ 58361 17880 31406 75025 126844 106472 152964 176897 178371 62319 -12884 -9695 48161
12199D8161Q6277J13919N5759p3742q7780m9457J4577l7292J01238M9638o0867
$$ 48161 134438 248357 304116 230374 142594 93137 107714 70422 171660 221298 160431
12188A60431p1711M3643M4268K3003k8189q4983q9162L8314J18536J29442L6008
$$ 160431 88720 132363 176631 199634 171445 86462 -2700 35614 154150 283592 319600
12177C19600p9909k3858R021L9157j0104J17526Q3426J2044L6201j17561J009
$$ 319600 239691 215833 224854 264011 253907 371433 454859 466903 503104 385543 386552
12166C86552N4102p4524j16760r27l9081k8700l0840O5090J3235P0783O3681M0835
$$ 386552 440654 366130 249370 248443 209362 180662 149822 214912 228147 298930 362611 403446
12154D03446m6567l897L7983J15330O3202q445J06264m4401n2452j2449l4298
$$ 403446 356879 352982 390965 506295 569497 561052 667316 622915 570463 558014 523716
12143E23716m2693K4565o546j44605j14848M6435R2550J1264n9761l3916k9068
$$ 523716 481023 505588 499042 354437 239589 286024 378574 389838 330077 296161 267093
12132B67093j1083M7014n0740K5332J7508M4807o7326j3546L979J0588N0598M2861
$$ 267093 256010 303024 252284 277616 295124 339931 272605 259059 263038 273626 324224 367085
12120C67085O9450J71610M5916K0737O8089j3380j19985p3463j00877j6282J14926
$$ 367085 436535 608145 654061 674798 742887 729507 609522 536059 435182 418900 533826
12109E33826J54938P2234J67455J72908K23746K54516J03818p7990j57372j42697
$$ 533826 688764 760998 928453 1101361 1325107 1579623 1683441 1605451 1448079 1305382
12099A305382j01924o2780p8437j08409j29228j32033m3639n7224n7740q2690
$$ 1305382 1203458 1140678 1062241 953832 824604 692571 648932 591708 533968 451278
12089D51278L7342P78k5011j0635j6230l3853O5546l4145m3961R481J12082O2858
$$ 451278 488620 489398 464387 453752 437522 403669 469215 435070 391109 400590 512672 575530
12077E75530J7054j7237j299N4016J23645K36977J84317P4127l5126j23077r1453
$$ 575530 592584 575347 574048 628064 751709 988686 1173003 1247130 1212004 1088927 997474
12066I97474K2405R5124j1631L4631J18557J17890J73390P7616o2849p0256o2395
$$ 997474 1019879 1115003 1103372 1138003 1256560 1374450 1547840 1625456 1562607 1492351 1429956
12055A429956q1687j43672j33495r0774j25213k3843n5679l349J37937J37087
$$ 1429956 1348269 1204597 1071102 980328 855115 831272 775593 772244 910181 1047268
12045A047268N2714p433K0360M6997O50l0537J6765L7027p697j3604K0125R3990
$$ 1047268 1099982 1092549 1112909 1159906 1160556 1130019 1146784 1183811 1176114 1162510 1182635 1276625
12033A276625P6920O0098J18802J78938J20862n710o8106m140l0734j24664k22078
$$ 1276625 1353545 1413643 1532445 1711383 1832245 1826535 1758429 1754289 1723555 1598891 1376813
12022A376813j37357j15396k0000j8351r970P6062O7087q132l9883r143m2572
$$ 1376813 1239456 1124060 1104060 1085709 1075739 1151801 1218888 1210756 1170873 1161730 1119158
12011A119158l09j7540o4697q303j8427m8687r805q3409J2886K650O8595l0877
$$ 1119158 1118849 1101309 1036612 1028309 1009882 961195 951390 867981 880867 883517 952112 921235
11999I21235k0303l2336L6254j6236Q576J23952K7827j7687K6490L9496o514O2980
$$ 921235 900932 868596 904850 888614 897190 1021142 1048969 1031282 1057772 1097268 1090754 1153734
11987A153734J58928P5324Q2334k1321l778N5472l5266N2284N7893m5197K005
$$ 1153734 1312662 1387986 1470320 1448999 1445221 1500693 1465427 1517711 1575604 1530407 1532412
11976A532412k4872O464J3629n0256J323J10074J01368Q1534J27178J09529Q7929
$$ 1532412 1507540 1514004 1527633 1477377 1478700 1588774 1690142 1771676 1898854 2008383 2096312
11965B096312O4348Q2225P7795Q4358k4307o0778O721J25811K36265J93689J94864
$$ 2096312 2160660 2242885 2320680 2405038 2380731 2319953 2326674 2452485 2688750 2882439 3077303
11954C077303J24295K07656L18239K72278L23025L39293K34102K95532M01651
$$ 3077303 3201598 3409254 3727493 3999771 4322796 4662089 4896191 5191723 5593374
11945E593374L89362L54883L43533N22521N93506N82419P71585Q83566J043108
$$ 5593374 5982736 6337619 6681152 7203673 7797179 8379598 9151183 10034749 11077857
11936A1077857J225172J460230J657909K026731K544236L164747L964859M976063
$$ 11077857 12303029 13763259 15421168 17447899 19992135 23156882 27121741 32097804
11928C2097804O463581Q488554J1325877J5515339K1896437L1279187M5544438
$$ 32097804 38561385 47049939 58375816 73891155 95787592 127066779 172611217
11921A72611217O6536527R0656437R7307094O0300870j326468m2735703n7574979
$$ 172611217 239147744 329804181 427111275 487412145 486085677 443349974 385774995
11914C85774995o5062724o8879740o1751441m7265939l3641782k3594636j6894575
$$ 385774995 320712271 251832531 190081090 142815151 109173369 85578733 68684158
11907F8684158j2493508r447505p196032n674510m628415l707111k990871k471535
$$ 68684158 56190650 46743145 39547113 33872603 29244188 25537077 22546206 20074671
11899B0074671k073991j759093j533875j415278j199544j077525q69349p78904
$$ 20074671 18000680 16241587 14707712 13292434 12092890 11015365 10146016 9367112
11891I367112p84580o06536m32594m08874l72834l04682k05889l07533k07142
$$ 9367112 8582532 7975996 7543402 7134528 6761694 6457012 6251123 5943590 5736448
11882E736448j59337j74074j50181j07432j46393k62523k66205j67033k68914
$$ 5736448 5577111 5403037 5252856 5145424 4999031 4736508 4470303 4303270 4034356
11873D034356k51281j89611k33727k63203k54833j03404j78681k24489j84500
$$ 4034356 3783075 3593464 3359737 3096534 2841701 2738297 2559616 2335127 2150627
11864B150627j34049o1683n630k0922j23292j00584n9747m6445o8356k9895M0036
$$ 2150627 2016578 1954895 1949265 1928343 1805051 1704467 1644720 1598275 1529919 1500024 1540060
11853A540060N5195N184j16074j62635r89J04269n4938k3648n5342q8724p8270
$$ 1540060 1595255 1600439 1484365 1321730 1320741 1425010 1370072 1346424 1291082 1202358 1124088
11842A124088j6615q5895o9124k1799j5505R04J5637M9436M3645m9157m8268n6267
$$ 1124088 1107473 1021578 952454 930655 915150 916054 931691 981127 1024772 975615 927347 871080
11830H71080j48174o0834Q5926k4931m3397k2734N517M6717N5715n6799l3201
$$ 871080 722906 662072 747998 723067 679670 656936 662453 709170 764885 708086 674885
11819F74885n1235k1175L5028L5342L6990J2506o2872j2445r8039q9275K7589
$$ 674885 623650 602475 637503 672845 709835 722341 659469 647024 548985 459710 487299
11808D87299N5696j7929p7319J5567K3709k3881J295l9066o1347J95J19809O4482
$$ 487299 542995 525066 447747 463314 487023 463142 464437 425371 364024 364219 484028 548510
11796E48510P645j19535k6194l7767o419M6212K5815m2829n112M5111p3490q5856
$$ 548510 556155 436620 410426 372659 366240 412452 438267 395438 390326 435437 361947 276091
11784B76091K6518R7939n799J6792j2017P3570N5872o5568q9256m9N102K5959
$$ 276091 302609 400548 394749 411541 399524 473094 528966 463398 374142 374093 379195 405154
11772D05154l726m4977L6728L0596M2845L9600L1983J21567J60620Q9010R4820
$$ 405154 401428 356451 393179 423775 466620 506220 538203 659770 820390 909400 1004220
11761A004220O3197n125j87683k66038r3374k8270M1283k1124n8679j39547l2969
$$ 1004220 1067417 1062292 874609 608571 515197 486927 528210 507086 448407 308860 275891
11750B75891P2772R134n5391j26846l9253n2864k8042L3941J2394L0247N7629
$$ 275891 348663 357797 302406 175560 136307 83443 55401 89342 101736 131983 189612
11739A89612k660o270j8674j19395m3726L5377J06830J2077K5522O9369O1330
$$ 189612 186952 180682 162008 42613 -1113 34264 141094 153171 178693 248062 309392
11728C09392o7897j16723m0406N2332L9135K1358L1962J1284l7112m8448l2050
$$ 309392 241495 124772 84366 136698 175833 197191 229153 240437 203325 154877 122827
11717A22827n0951m0356j9329j950Q4467J19621K7263n7021k1073J1541N259k9962
$$ 122827 71876 31520 12191 10241 94708 214329 241592 184571 163498 175039 180298 150336
11705A50336m1725n9856M9687M6709l5215P3857j8495o3206m7779j0540l1634
$$ 150336 108611 48755 98442 145151 109936 183793 165298 102092 54313 43773 12139
11694A2139R3023M7491J3155L8116M5517j1426l1979n1955N8789Q5059o4231j9079
$$ 12139 105162 152653 165808 203924 249441 238015 206036 154081 212870 297929 233698 214619
11682B14619J4551j9324j8104O4857K9271K4649r0834j42064m992M732j5730O7480
$$ 214619 229170 209846 191742 256599 285870 310519 219685 77621 72629 77361 61631 129111
11670A29111P426J2060LK2735q260O783M2579J6979o2956j10537k0792O0737L8066
$$ 129111 136537 148597 148600 171335 163075 169858 212437 229416 166460 55923 35131 95868 133934
11657A33934M6765K8648M1655k3878k7179m933k8399n3521m3241o5647Q304K2232
$$ 133934 180699 209347 251002 227124 199945 195012 166613 113092 69851 4204 12508 34740
11645C4740K4816k7337J2946k0871N9189J8744j1163L0074P590k4345l5130M5437
$$ 34740 59556 32219 45165 24294 83483 102227 91064 121138 128728 104383 69253 114690
11633A14690L2569l1406J1503j02404q7826J55745O8357j30377n8249L5541K0619
$$ 114690 147259 115853 127356 24952 -62874 92871 161228 30851 -27398 8143 28762
11622B8762j6852k1654l014K6414p700p2552P1598M2143n0699M441m6069m2026
$$ 28762 11910 -9744 -12758 13656 5956 -66596 5002 47145 -3554 887 -45182 -87208
11610h7208K5199O0887l8718j35536k899J42407L3674M1560R6378K1535J4745
$$ -87208 -62009 -1122 -39840 -175376 -178275 -35868 -2194 39366 135744 157279 172024
11599A72024K221J3528K2017j0021l8654l3331R731L38J9785M209L2186k1235
$$ 172024 174245 187773 209790 199769 161115 127784 137515 137853 157638 161847 194033 172798
11587A72798j9585o585N9909P0972J13697j36974j44030q2493L3080M7216K1855
$$ 172798 153213 146628 206537 277509 391206 254232 110202 27709 60789 108005 129860
11576A29860K3830K4806J3185l2228p029o3195K9401L9022o3705j33195K6088
$$ 129860 153690 178496 191681 159453 152424 89229 118630 157652 93947 -39248 -13160
11565a3160N7580J7771j3806n7965N4252L9874k2316j4722J1404Q940O7831l1625
$$ -13160 44420 62191 48385 -9580 44672 84546 62230 47508 58912 67852 135683 104058
11553A04058m4608o6083o0031O0819J844l683O445k5877k3839J09860J04196m343
$$ 104058 59450 -6633 -66664 -5845 -4001 -7684 -1239 -27116 -50955 58905 163101 158758
11541A58758k5210m8105n764k5721j0682K7413P2464j4736o7992J00927J05927
$$ 158758 133548 85443 79679 53958 43276 70689 143153 128417 60425 161352 267279
11530B67279n7773j24340k7740p168k7667m6270O3548K7976J0451L6791n3638
$$ 267279 209506 85166 57426 50258 22591 -23679 39869 67845 78296 115087 61449
11519F1449r1955r517M2754L0215J6241j01370j185M055o5593r4071J4704M7855
$$ 61449 -30506 -40023 2731 32946 49187 -52183 -53368 -49313 -114906 -208977 -194273 -146418
11507a46418L4501J20231Q2695r041o0469j18051J00112N8391K0629n7710p0543
$$ -146418 -111917 8314 91009 81968 21499 -96552 3560 61951 82580 24870 -45673
11496d5673m0242q228K6332Q6709L6239M578k4604O9126P0152m6734j99811k1929
$$ -45673 -85915 -94143 -67811 18898 55137 59715 35111 104237 174389 127655 -72156 -94085
11484i4085q116m6466m3776J09874N8038l1100M0387M2952L5725p8198j28053
$$ -94085 -102201 -148667 -192443 -82569 -24531 -55631 -15244 27708 63433 -14765 -142818
11473a42818J0945J00094O9587o7657l0956m879N5909J9051k5371K6178Q6257
$$ -142818 -131873 -31779 37808 -29849 -60805 -65684 -9775 9276 -16095 10083 96340
11462I6340k3564j7230r5150l682p945L6941j3567O6409M1004k4058J260k5218
$$ 96340 72776 55546 -39604 -43286 -51231 -14290 -27857 38552 79556 55498 56758 31540
11450C1540o858k7448p474k1146l9826Q1762m1088n7635m0813P3708k8378n6955
$$ 31540 24682 -2766 -10240 -31386 -71212 10550 -30538 -88173 -128986 -55278 -83656 -140611
11438a40611L7610O4757M347j7024l2745N3649j3462k4705K3039J6073L9718q253
$$ -140611 -103001 -38244 -33897 -50921 -83666 -30017 -43479 -68184 -45145 -29072 10646 2393
11426B393j5123j3370K8042L1295j9873l8452j661J0884L1165l6222P6979L1303
$$ 2393 -12730 -26100 1942 33237 13364 -25088 -26749 -15865 15300 -20922 56057 87360
11414H7360M1666K2471j8579n8516j03839Q263K7198o4563n2336L284k3937L6717
$$ 87360 129026 151497 132918 74402 -29437 -21174 6024 -58539 -110875 -107591 -131528 -94811
11402i4811r098j0094O1165l0674j9107n7937r454J11697J14785L1092J0661k2388
$$ -94811 -103909 -114003 -52838 -83512 -102619 -160556 -170010 -58313 56472 87564 98225 75837
11390G5837r3694m2772l4745o293M5629J09792q383j6960J9790O6005K6306L0724
$$ 75837 -17857 -60629 -95374 -101667 -56038 53754 45371 28411 48201 114206 140512 171236
11378A71236j3921j6125n04q5585R497l1373l222K43l7782J6267J724J21702J1889
$$ 171236 157315 141190 140686 55101 64598 33225 30003 30246 -7536 8731 10455 132157 144046
11365A44046l3341J492m3887n9489n6247J1391O9438J0964j39821j55828M7755
$$ 144046 110705 112197 68310 8821 -47426 -36035 33403 44367 -95454 -251282 -203527
11354b03527J05206j4419j1877q4462K9943k96O5591L9710r668J8618M8061l285
$$ -203527 -98321 -112740 -124617 -209079 -179136 -179432 -113841 -74131 -83799 -65181 -17120 -20405
11342b0405j1949j09699J7148j352J2406P1464k03M5485J4873P731L1529J5698
$$ -20405 -32354 -142053 -124905 -126257 -113851 -42387 -42590 2895 17768 25499 57028 72726
11330G2726o1365k1354k0890k947l6851k1936o056j8010K5174N7814P3536J034
$$ 72726 11361 -9993 -30883 -33830 -70681 -92617 -98673 -116683 -91509 -33695 39841 40875
11318D0875m2383q2771r464O7071R3700M9662O408L0409k5077k140l9479l3471
$$ 40875 -1508 -84279 -93743 -26672 67028 116690 123098 153507 128430 126290 86811 53340
11306E3340n5848j6521l8091l7044Q501L8640J3020k7707m242L2928M9881j709
$$ 53340 -2508 -19029 -57120 -94164 -85663 -47023 -34003 -61710 -65952 -33024 16857 15148
11294A5148L4758O059L6758Q04n8329n8817p1989J4469l0028j11057n8100J17251
$$ 15148 49906 55965 92723 93527 35198 -23619 -95608 -81139 -111167 -222224 -280324 -163073
11282a63073J50795M8638n4277o4705r7621m2984P4281N8007k596P7488M3131
$$ -163073 -12278 36360 -17917 -82622 -180243 -223227 -148946 -90939 -93535 -16047 27084
11271B7084K0579O4350l0966k5962N4793p0990K562p2382k2255O516J1494L0810
$$ 27084 47663 112013 81047 55085 109878 38888 41450 -30932 -53187 -46671 -35177 -4367
11259d367K5642n408j13291n9530M7082P8437N1837k4513j8689p962L585k2101
$$ -4367 21275 15867 -97424 -156954 -109872 -31435 20402 -4111 -22800 -30762 -27177 -49278
11247d9278M9329K4090q6188j5682l6203K5109r463r588O8400K9319j4138Q096
$$ -49278 51 24141 -62047 -77729 -113932 -88823 -98286 -107874 -39474 -10155 -24293 -16197
11235a6197m2192M4005j8527j7483q73N2757R130l3892J5034J1312M15o0049n6767
$$ -16197 -58389 -14384 -32911 -50394 -51267 1490 10620 -23272 -8238 3074 3489 -56560 -113327
11222a13327J16727O2790k9109K9139n1185m0612J10120R8994m2050j45126q9996
$$ -113327 3400 66190 37081 66220 15035 -25577 84543 183537 141487 -3639 -93635
11211i3635N5465M0249K1370L967M1301k9480j5774k6416l2717M5525K1785L2471
$$ -93635 -38170 2079 23449 27416 68717 39237 23463 -2953 -35670 9855 31640 64111
11199F4111n919O7873K0846k1274n8933j1439l1809j36698l1977p9599K0678L8074
$$ 64111 58192 126065 146911 125637 66704 55265 23456 -113242 -145219 -224818 -204140 -166066
11187a66066J00719L337K651L7311P7921p312j10823M9931R5881m6969q6003J3130
$$ -166066 -65347 -62010 -59359 -22048 55873 48561 -62262 -12331 83550 36581 -49422 -36292
11175c6292j1030j303p362N3142q275o6115P843O2137M1292N7628O672P42m581
$$ -36292 -47322 -48625 -55987 -2845 -11120 -77235 -69392 -7255 34037 91665 98337 99079 94498
11162I4498l794m1988K7861j7452j06848p9258K7835O412M2160Q3707M0244j06864
$$ 94498 90704 48716 76577 59125 -47723 -126981 -99146 -92734 -50574 33133 73377 -33487
11150c3487l430j8496k5160O9700N1466l309m6238M6761J1479r8249R672N7696
$$ -33487 -36917 -55413 -80573 -10873 40593 37284 -8954 37807 49286 -48963 -39291 18405
11138A8405j6807o7868p321L550Q0456K4603l1612j6511P9442M3663j2720m0522
$$ 18405 1598 -66270 -73591 -70041 10415 35018 3406 -13105 66337 110000 97280 56758
11126E6758r4026j4360R962M217O7207O1847N6444q1476k0926j9756J0596K1841
$$ 56758 -37268 -51628 -41666 -37449 29758 91605 148049 66573 45647 25891 36487 58328
11114E8328L6526j0053n2697q8896k4891O3359L8622m4528n4561L6463K4636m0238
$$ 58328 94854 84801 32104 -56792 -81683 -18324 20298 -24230 -78791 -42328 -17692 -57930
11102e7930l6840m0802R905N7892L6878R2658L654K0197m7411o0718k6256m5618
$$ -57930 -94770 -135572 -125667 -67775 -30897 61761 65415 85612 38201 -22517 -48773 -94391
11090i4391l0210k881j6868Q240P6267K5957q563J2206J6058K1044p821n258J65287
$$ -94391 -124601 -127482 -144350 -136110 -59843 -33886 -42449 -30243 -14185 6859 -962 -6220 159067
11077A59067N3568p2668q1701K5436k6758l0056r0552m7234m4707j0661J7231
$$ 159067 212635 139967 58266 83702 56944 26888 -63664 -110898 -155605 -166266 -149035
11066a49035O3229L1746M3375o539N8731j525n7949J2756K7153J6224J93k1902
$$ -149035 -85806 -54060 -10685 -17224 41507 39982 -17967 -5211 21942 38166 38359 16457
11054A6457o118j3366o9375k6603M5482k9676n3755k6730n9031m5995P0706R5023
$$ 16457 10339 -3027 -72402 -99005 -53523 -83199 -136954 -163684 -222715 -268710 -198004 -102981
11042a02981j1536O4525O3167J56133K7660j8306n5187N4141P116P187L8591p1966
$$ -102981 -114517 -49992 13175 169308 196968 178662 123475 177616 184732 191919 230510 158544
11030A58544P7702J01458k877P5866J38718P7314p9731j23632j04222m1944P5181
$$ 158544 236246 337704 334827 410693 549411 626725 546994 423362 319140 277196 352377
11019C52377O77n4333K2514M2106O9912J48208J49578j477j16198j08885n8854
$$ 352377 353054 298721 321235 363341 433253 581461 731039 729562 613364 504479 445625
11008D45625p6873l8900n5291N068R6389j256k615k165k9367m1324N8660m3830
$$ 445625 368752 329852 274561 279629 376018 374762 372147 369982 340615 299291 357951 314121
10996C14121j00428p260l3743o6199l2620j8492K9951r612N757p513Q69M0476
$$ 314121 213693 206433 172690 106491 73871 55379 85330 75718 81475 73962 74831 115307
10984A15307n8442L8501j7261p4179k8625J0338M1098J1042q3228P932L0783j8344
$$ 115307 56865 95366 78105 3926 -24699 -14361 26737 37779 -45449 -37517 -6734 -25078
10972b5078j9210q528o316L7666l270l8393j22165m0184M0468R438O4980p580
$$ -25078 -44288 -52816 -59132 -21466 -24736 -63129 -185294 -225478 -185010 -175572 -110592 -118172
10960a18172m6906q632O8110N5937k1690q5334L3725J41806p143j5099n1523l379
$$ -118172 -165078 -173710 -105600 -49663 -71353 -156687 -122962 18844 11701 -3398 -54921 -58300
10948e8300J38726k8336j3624k1806J6321J5338m6007N2927N3269q2302l0601
$$ -58300 80426 52090 38466 16660 32981 48319 2312 55239 108508 26206 -4395
10937d395L2314K2275l8421m6157K8665J5596p4694R800J7324q0793K4287J22700
$$ -4395 27919 50194 11773 -34384 -5719 9877 -64817 -55017 -37693 -118486 -94199 28501
10925B8501Q6071O2248R201n5725p1857k2352O7485K8044J2343N542P0509O660
$$ 28501 114572 176820 186021 130296 58439 36087 103572 131616 143959 149501 220010 226670
10913B26670j08430l6900j819k3305p6643M8900l6783J3099M2432k624L4388O5827
$$ 226670 118240 81340 79521 56216 -20427 28473 -8310 4789 47221 44597 78985 144812
10901A44812l9579k8878L6813q6353O591m5242r9000M143J18055N7781o7515L5426
$$ 144812 105233 76355 113168 26815 33406 -11836 -110836 -106693 11362 69143 1628 37054
10889C7054j3843M6166j4886j7022J0917K384K8360K0613O4463J09297m238p6441
$$ 37054 23211 69377 54491 37469 48386 50770 79130 99743 164206 273503 269265 192824
10877A92824l1296K1790K9267O7041l6111o8920l5829q6576j05916K2353P6777
$$ 192824 161528 183318 212585 279626 243515 174595 138766 52190 -53726 -31373 45404
10866D5404N6598j2878r2546r7090q8368J03744N3366Q9617R3211l3309n6264
$$ 45404 102002 89124 -3422 -100512 -188880 -85136 -31770 57847 151058 117749 61485
10855F1485L8410O158L4480j9598M6550p6837l4491r0812k4786N9712j0223p804
$$ 61485 99895 106053 140533 120935 167485 90648 56157 -34655 -59441 271 -9952 -17756
10843a7756M6661R9119P8744K2830M1811n8951q6270K8498L2521L55k6328j1720
$$ -17756 28905 128024 206768 229598 271409 212458 126188 154686 187207 187562 161234 149514
10831A49514l4952m0088o4247J3990L6326L4747k90j469m9082l4750m7041r623
$$ 149514 114562 74474 10227 24217 60543 95290 95000 93531 44449 9699 -37342 -46965
10819d6965P1578R7013M6123K5553k809p7387j01122l2869l5385k3313N6387l588
$$ -46965 24613 121626 167749 193302 190493 113106 11984 -20885 -56270 -79583 -23196 -26784
10807b6784j843j5478K1159L2094J1891P6927Q8196l3996r1805j00052N7954K3961
$$ -26784 -28627 -44105 -22946 9148 21039 97966 186162 152166 60361 -39691 18263 42224
10795D2224L8363K4997k3359m1912m1944J3R82K3431j0018k664J7414O5577m0612
$$ 42224 80587 105584 82225 40313 -1631 -1618 -636 22795 12777 10113 27527 93104 52492
10782E2492j9430o6989n4177M7054R6304p7408j24815p042J55359M8674r1219
$$ 52492 33062 -33927 -88104 -41050 55254 -22154 -146969 -154011 1348 50022 -41197
10771d1197n8619K3924O0322j9636m3873L1883J1750M4399N5606q4877q2557n6186
$$ -41197 -99816 -75892 -15570 -35206 -79079 -47196 -35446 8953 64559 -20318 -102875 -159061
10759a59061m1687J0807P7439K7573k2412L7788N4586l1048m9405j01042J9563
$$ -159061 -200748 -189941 -112502 -84929 -107341 -69553 -14967 -46015 -95420 -196462 -176899
10748a76899l9503j216M0072P4863K0983l5899N722J8935N41n9660m8673J7129
$$ -176899 -216402 -217618 -177546 -102683 -81700 -117599 -111877 -92942 -92401 -152061 -200734 -183605
10736a83605K3550N7180O7048N7638J7869j15748r6657m3123J06877j8902L6447
$$ -183605 -160055 -102875 -35827 21811 39680 -76068 -172725 -215848 -108971 -127873 -91426
10725i1426O1895L3439p128K2664L7096O1015j00709l8001J5131J3542k183N0151
$$ -91426 -29531 3908 -3220 19444 56540 117555 16846 -21155 -6024 7518 5335 55486
10713E5486Q4466J4960J8288j4068J2374k6878q2163M5185Q1831j310k0369J3476
$$ 55486 139952 154912 173200 159132 171506 144628 62465 107650 189481 188171 167802 181278
10701A81278m9661k3763O1974J33410m4502r6060n3331J1550P5135K562m1917
$$ 181278 131617 107854 169828 303238 258736 162676 109345 120895 196030 198592 156675
10690A56675j9626L7791K4635O0510o5182k4692k3383M7604L3174n8123q7670
$$ 156675 137049 174840 199475 259985 194803 170111 146728 194332 227506 169383 81713
10679H1713o9847O980M9258J0700P9634P4886l3445q9401m5717j0673O3324M4705
$$ 81713 11866 18846 68104 78804 158438 233324 199879 110478 64761 54088 117412 162117
10667A62117O2148M7581k9274O636R4417L840q3401r8426O6884J30983J28411
$$ 162117 224265 271846 242572 249208 343625 347465 264064 165638 232522 363505 491916
10656D91916K4645q2015j67398r2777N0292J00591J6170q8522k3634Q5804P9587
$$ 491916 516561 434546 267148 174371 224663 325254 341424 252902 229268 315072 394659
10645C94659N3399J2368P5100K5583L5984j231K8116R1636M6909K290j1119r555
$$ 394659 448058 460426 535526 561109 597093 595862 623978 715614 762523 764813 753694 744139
10633G44139N2149j3749o583J22618R1346Q1183J96080J52007J67763K11354J60023
$$ 744139 796288 782539 775956 898574 989920 1071103 1267183 1419190 1586953 1798307 1958330
10622A958330J91630K14037K08295K93668K99283N12391P91251J016562J367963
$$ 1958330 2149960 2363997 2572292 2865960 3165243 3677634 4468885 5485447 6853410
10613F853410J969144K587292L372264M463562N334018N095259L760272J892208
$$ 6853410 8822554 11409846 14782110 19245672 24579690 29674949 33435221 35327429
10605C5327429L05136m34441o13524j06142J004982K877283N472705Q434940J0491881
$$ 35327429 35632565 35198124 34584600 34478458 35483440 38360723 43833428 52268368 62760249
10596F2760249R679318N654164P77462k372124l854252m259078l424749j125057
$$ 62760249 72439567 78093731 78871193 76499069 72644817 68385739 64960990 63835933
10588F3835933K299934O527493J0682140J3172071J1051197M292873k938119p257326
$$ 63835933 66135867 72663360 83345500 96517571 107568768 111861641 108923522 101666196
10580A01666196r074545r617747q779854o224439k575743J268569M544155O245040
$$ 101666196 92591651 82973904 74194050 67969611 65393868 66662437 71206592 77451632
10572G7451632M533116k7804m666629p201975p975942q111985p308928n435961
$$ 77451632 81984748 81956944 77290315 70088340 62112398 54000413 46691485 41255524
10564D1255524l158845j062200N07249J097708L40071j477728l159543m165372
$$ 41255524 38096679 37034479 37541728 38639436 38979507 37501779 34342236 30176864
10556C0176864m513997m557444m105193l409762k655726k043140j492446j174052
$$ 30176864 25662867 21105423 17000230 13590468 10934742 8891602 7399156 6225104
10548F225104q58109p07805n72926n08293m25073l08170k12948k69979k57196
$$ 6225104 5366995 4659190 4086264 3577971 3152898 2844728 2631780 2361801 2104605
10539B104605k23704j57327j30154j15685n0474p9030q1129q3086l3545p7683
$$ 2104605 1880901 1723574 1593420 1477735 1427261 1348231 1267102 1184016 1150471 1072788
10529A072788k8575m8432N0805n1919m6200k5573q9579j02275j3883o2313l7498
$$ 1072788 1044213 995781 1046586 994667 948467 922894 833315 731040 717157 654844 617346
10518F17346o3271j5836J0108P2218J15946j01973o0933p8864P455n4946o6416
$$ 617346 554075 538239 548347 620565 736511 634538 573605 494741 502196 447250 380834
10507C80834p0582k2979J0219J4412r907j3752L5518P151j9844k5078j5373n6985
$$ 380834 310252 287273 297492 311904 301997 288245 323763 330914 311070 285992 270619 213634
10495B13634m686J40066O0192L0481l0206n1541r3977k6808K4288L8619j6430
$$ 213634 208948 349014 409206 439687 409481 357940 263963 237155 261443 300062 283632
10484B83632K737M9615j12643o4991q418m3111l6426L2384J8541l4736J9164Q3691
$$ 283632 286369 335984 223341 158350 149932 106821 70395 102779 121320 86584 105748 189439
10472A89439L1752o7863o9065O4743l1225J3903N8832j7476m0914l5682M355N5269
$$ 189439 221191 153328 84263 149006 117781 131684 190516 173040 132126 96444 100799 156068
10460A56068l5482m5220P3330L4870q907l9503N9166O7225j2838m7522k5425l0604
$$ 156068 120586 75366 148696 183566 174659 135156 194322 261547 248709 201187 175762 145158
10448A45158J05273Q1428N651m8759M6141K6029k7269k1865J0887m2324l9158
$$ 145158 250431 331859 337510 288751 334892 360921 333652 311787 322674 280350 241192
10437B41192L8260o526n162J5404N280k8100K2512Q9041M6779j18324r2917M0775
$$ 241192 279452 272926 267764 283168 288448 260348 282860 371901 418680 300356 207439 248214
10425B48214j3700K1233k6004m9229k748J8113J498j2691k2421p813N2098L6365
$$ 248214 234514 255747 229743 180514 177766 195879 197377 184686 162265 154452 206550 242915
10413B42915j6217m7919k4232n2059m3216j9476o8559o2495k7225Q5361J30929
$$ 242915 226698 178779 154547 102488 59272 39796 -28763 -91258 -118483 -33122 97807
10402I7807k3228n1199k432j9478l8569m4216N2366Q8674N0921k4693n7132k0326
$$ 97807 74579 23380 20948 1470 -37099 -81315 -28949 59725 110646 85953 28821 8495
10390H495j8158N8778J4477k5321J7617J6346N7039P2590M337m1529k5155l3976
$$ 8495 -9663 49115 63592 38271 55888 72234 129273 201863 206200 164671 139516 105540
10378A05540m81R5375M4902k7900m9929P4772J5327j5091L2076L8393Q8260o1808
$$ 105540 105059 200434 245336 217436 167507 242279 257606 242515 274591 312984 401244 339436
10366C39436j56494k4584k6302J3782L3961L9051l050Q0680m942j47768p5325
$$ 339436 182942 158358 132056 145838 179799 218850 215800 296480 291538 143770 68445
10355F8445K1734m0329K4270P6695k4541o4414j06990q5580q633J0835J13121
$$ 68445 90179 49850 74120 150815 126274 61860 -45130 -130710 -139343 -128508 -15387
10344a5387M2552O581j7496k4603q4924q310Q3211L6860J9797O1289k8209l0350
$$ -15387 27165 33746 16250 -8353 -93277 -101587 -18376 18484 38281 99570 71361 41011
10332D1011q6940p2338J37430J47942q6542m1169J1618P4029Q0231n331o1607
$$ 41011 -45929 -118267 19163 167105 80563 39394 51012 125041 205272 199941 138334
10321A38334m4159J2773N4396K9386o8032p3338q3787R234J4730P6462m2865o2126
$$ 138334 94175 106948 161344 190730 122698 49360 -34427 -25193 -10463 65999 23134 -38992
10309c8992k3480Q5664M6538k1202n1705l6372Q9398J5760n0640M103O158n6885
$$ -38992 -62472 23192 69730 48528 -3177 -39549 49849 65609 14969 19072 25230 -31655
10297c1655K2127K1653p6770J5771K0883L8305l6463k2193l9502l7N058j1126
$$ -31655 -9528 12125 -64645 -48874 -27991 10314 -26149 -48342 -87844 -87881 -82823 -93949
10285i3949N0574j8442M1120m7919M2688M6648O8860N7459L8466M5596l1262k389
$$ -93949 -43375 -61817 -20697 -68616 -25928 20720 89580 147039 185505 231101 199839 197450
10273A97450L3502K2779l7847m733L4520j3714m4910j3512r4308p3220j4961N1969
$$ 197450 230952 253731 215884 211151 245671 231957 187047 173535 79227 6007 -8954 43015
10261D3015Q2992J03759j0348r7070L025r681j0310p7446n9493l5328q870M4573
$$ 43015 126007 229766 219418 122348 125373 115692 105382 27936 -31557 -66885 -75755 -31182
10249c1182J10393J32439L7156o2772j35094q498l7146m045L2415K9335j3776
$$ -31182 79211 211650 248806 186034 50940 42442 5296 1251 33666 63001 49225
10238D9225k5023k5575n0160O8335L4116j9288K242p0251j9752K8837L1270Q3976
$$ 49225 24202 -1373 -51533 16802 50918 31630 33872 -36379 -56131 -27294 3976 87952
10226H7952Q0935j35735p9507o2252l6602K203P3029K5998P5380K4676j4221L6321
$$ 87952 168887 33152 -46355 -108607 -145209 -143006 -69977 -43979 31401 56077 41856 78177
10214G8177k314k6109j4951K3395l748J414Q254p3503j6065M6542M1031l8037
$$ 78177 75863 49754 34803 58198 54450 55864 64118 -9385 -25450 21092 62123 24086
10202B4086r3184R6955J38689Q0360O3220J26457P6293L9739M8132J19857J13323
$$ 24086 -69098 27857 166546 246906 310126 436583 512876 552615 600747 720604 833927
10191H33927O6352K1022J42437L0967o6252o7497j50614j42024j27224m4619m9194
$$ 833927 900279 921301 1063738 1094705 1028453 960956 810342 668318 541094 496475 447281
10180D47281o5803r9236l4131M9276M3327Q7561R2529J82072K56151J95563M4910
$$ 447281 381478 282242 248111 297387 340714 428275 520804 702876 959027 1154590 1199500
10169A199500j26753j43945q1376j11462k8556j23191j62660m9061P4438J10136
$$ 1199500 1072747 928802 847426 735964 707408 584217 421557 372496 446934 557070
10159E57070P0342k2479j29656r4309L6998O570K5434m806Q7914M1792L3845J55084
$$ 557070 627412 604933 475277 380968 417966 424536 449970 445164 533078 574870 608715 763799
10147G63799L9464q3731j04113o5689o2816k8734L6889l5595m2843m7934J3956
$$ 763799 803263 719532 615419 549730 486914 458180 495069 459474 416631 368697 382653
10136C82653J6646K6143k7697m0537k163j5700K453l0452o409m0738n0512q2883
$$ 382653 399299 425442 397745 357208 355045 339345 341798 311346 304937 264199 213687 130804
10124A30804l3639M2999O6474J14188m3299m3384o4600P6817J83766K44131O8701
$$ 130804 97165 140164 206638 320826 277527 234143 169543 246360 430126 674257 742958
10113G42958O613m7352j41095j66128j04824l6003o6241l0758o306p2777m7381
$$ 742958 749571 702219 561124 394996 290172 254169 187928 157170 150864 78087 30706
10102C0706M3852K1648l2872j1613j6689O4850j6222n691m2208k1525n0268l5831
$$ 30706 74558 96206 63334 51721 35032 99882 83660 77969 35761 14236 -36032 -71863
10090g1863l68J8922k7293j4852L8454N3361l3203m4535o1895l2633K2774M3430
$$ -71863 -72231 -53309 -80602 -95454 -57000 -3639 -36842 -81377 -143272 -175905 -153131 -109701
10078a09701P0958J5758r7621Q5446L965m8698j2001N9454L4618l7625o1487J1362
$$ -109701 -38743 -22985 -120606 -35160 -31195 -79893 -91894 -32440 2178 -35447 -96934 -85572
10066h5572N3728J0135o5952j3963j885J7970k5106O7188l1515m5453N9599N1078
$$ -85572 -31844 -21709 -87661 -101624 -103509 -85539 -110645 -43457 -74972 -120425 -60826 -9748
10054i748K3180l874J7049N3500m2082p6559Q7204N5261m1971J3466m0537J8302
$$ -9748 13432 9558 26607 80107 38025 -38534 48670 103931 61960 75426 34889 53191
10042E3191l669J837P3369k7546J2615j9537n9413J3829N9882k5405k1774m0466
$$ 53191 49522 51359 124728 97182 109797 90260 30847 44676 104558 79153 57379 16913
10030A6913o5536L3335j1689k1185K7129P9296N8404n3112o6097n0559J7262m6096
$$ 16913 -48623 -15288 -26977 -48162 -21033 58263 116667 63555 -2542 -53101 -35839 -81935
10018h1935k1142M4775J4458n5255j2071r6655Q1836J62500o2665n6609M3463
$$ -81935 -103077 -58302 -43844 -99099 -111170 -207825 -125989 36511 -26154 -82763 -39300
10007c9300P6444P0540j1746o6898l6921l8139j8179j893j1947J8283J11931P5453
$$ -39300 37144 107684 95938 29040 -7881 -46020 -64199 -66092 -78039 -59756 52175 127628
9995A27628j11355r9674m8966O4557K7142l7800L6510N2742p4508n4915K888P5025
$$ 127628 16273 -83401 -132367 -67810 -40668 -78468 -41958 10784 -63724 -118639 -115751 -40726
9983d0726L1374M1787k7215n0321o0536j467l489J1472K2304N2339J0998O8847
$$ -40726 -9352 32435 5220 -45101 -105637 -107104 -110593 -99121 -76817 -24478 -13480 55367
9971E5367k5545k5671L7847m8789j07996k0409P9829K9326n5010o8632r991M4980
$$ 55367 29822 4151 41998 -6791 -114787 -135196 -55367 -26041 -81051 -149683 -159674 -114694
9959a14694Q381K2932R254o287L1999K8662R804r526k8896p113o2842L662m388
$$ -114694 -106313 -83381 -74127 -80414 -48415 -19753 -9949 -19475 -48371 -55484 -118326 -114664 -119052
9946a19052k7815j0651K2020n3356k7147M8508j3383n4558m1762P3903J62102
$$ -119052 -146867 -157518 -135498 -188854 -216001 -167493 -180876 -235434 -277196 -203293 -41191
9935d1191P8022J4501K0579q9332j24069o3018N0116L4391J24234M7160k5710
$$ -41191 36831 51332 71911 -17421 -141490 -204508 -154392 -120001 4233 51393 25683
9924B5683n105N6743m1750j7769m5944L9881P1384m0617k0234q1029p1741K2052
$$ 25683 20578 77321 35571 17802 -28142 11739 83123 42506 22272 -58757 -130498 -108446
9912a08446Q6646j1275r4903M2340L6051k3311L5796J9570j7408o1262o6071O2111
$$ -108446 -21800 -33075 -127978 -85638 -49587 -72898 -37102 -17532 -34940 -96202 -162273 -100162
9900a00162R3294J964l4962M8652K7529j03693j14825K5794J93336J9919l7770
$$ -100162 -6868 -4904 -39866 8786 36315 -67378 -182203 -156409 36927 56846 19076
9889A9076J5846J317r643j8145o7948M8689k3875Q5348J5704r3048n408O6688
$$ 19076 34922 36239 26596 8451 -59497 -10808 -34683 50665 66369 -26679 -32087 34601
9877C4601P0533M3892Q249O2457r0344q0681o4866L1641J0410q7338k1404k0286
$$ 34601 105134 149026 157275 219732 129388 48707 -16159 15482 25892 -61446 -82850 -103136
9865a03136r9350P9986P4661L3085k6926r7907q9724M9559J343Q4573P2640O0480
$$ -103136 -202486 -122500 -47839 -14754 -41680 -139587 -229311 -179752 -178409 -93836 -21196 39284
9853C9284n3551n9049M67K8572Q5267L9287L0069N740m2576m4227j9866J2037
$$ 39284 -14267 -73316 -72849 -44277 40990 80277 110346 116086 73510 29283 9417 21454
9841B1454k2688r688L5398n9332O011m0085j7909M3028M6026k0827k4104J2493
$$ 21454 -1234 -10922 24476 -34856 -28845 -68930 -86839 -43811 2215 -18612 -42716 -30223
9829c0223n2025l5075ln517J12287N2180p9942j6740N705R4451P161q1236k752
$$ -30223 -82248 -117323 -117326 -122843 -10556 41624 -38318 -55058 -49353 45098 52259 -28977 -31729
9816c1729P0438m7806q537m3252q0698n880N1925O5173L5742J2192N4274o4725
$$ -31729 38709 -9097 -17634 -60886 -141584 -147464 -95539 -30366 5376 17568 71842 7117
9804G117M8148j4865J0134k9709n8158q848M0024R340k914J7609l9086j449M3055
$$ 7117 55265 40400 50534 20825 -37333 -46181 -6157 3183 269 17878 -21208 -22657 20398
9791B0398M3933j2328n6417L6700K1257L5908M144m1775m0713j753m9038o7907
$$ 20398 64331 52003 -4414 32286 53543 89451 93595 51820 11107 9354 -39684 -107591
9779a07591M5936R0784J9358l7806l2383L9520J28502K11680J59068K01004K0550
$$ -107591 -61655 29129 48487 10681 -21702 17818 146320 358000 517068 718072 738622
9768G38622j36265j20817p2732m8844m1352q7865j04230n5335l3233k6531M4851
$$ 738622 602357 481540 408808 359964 318612 230747 126517 71182 37949 11418 56269
9757E6269N3312l7643k1397j9945K0006j2690p2386l885P2279j24552O89Q3428
$$ 56269 109581 71938 50541 30596 50602 37912 -34474 -38359 33920 -90632 -89943 -6515
9745f515L5819p1019j2933M6593m1516j8049L6407K5764R787m3526o7665J3890
$$ -6515 29304 -41715 -54648 -8055 -49571 -67620 -31213 -5449 4338 -39188 -106853 -92963
9733i2963r1632L0069P7562P3131M9543l4842o8856k2074J02747n5496l0950q874
$$ -92963 -184595 -154526 -76964 -3833 45710 10868 -57988 -80062 22685 -32811 -63761 -72635
9721g2635M1547j3489r5382K9084K6544J9691K1495j2873M9541M3832K9699m0100
$$ -72635 -31088 -44577 -139959 -110875 -84331 -64640 -43145 -56018 -6477 37355 67054 26954
9709B6954m8334n810r2169L3810Q1006k8756m1205Q4793P4361O691o7763j02908
$$ 26954 -21380 -27190 -119359 -85549 -4543 -33299 -74504 10289 84650 91341 23578 -79330
9697g9330j3407J8464K3665p440o4665P065k8107r4K4814K62l3710L5984J02213
$$ -79330 -92737 -74273 -50608 -58048 -122713 -115648 -143755 -143849 -119035 -118773 -152483 -116499 -14286
9684a4286K5544k7848o0780k8883j1003M0494j5879l851N842M9620K4570k0168
$$ -14286 11258 -16590 -77370 -106253 -117256 -76762 -92641 -96492 -90650 -41030 -16460 -36628
9672c6628q4881J882J34009Q4506m8588J2004k505J7934n2513k4178L4461P158
$$ -36628 -121509 -119627 14382 98888 50300 62304 59799 77733 25220 1042 35503 42661
9660D2661k4681k9521J8258j5452P5707Q6840l6925j23292j02434l3049J9309
$$ 42661 17980 -11541 6717 -8735 66972 153812 116887 -6405 -108839 -141888 -122579
9649a22579n144O2002J5673O4261l9588J9231M2823l2824k7483L0479P821P20
$$ -122579 -127723 -65721 -50048 14213 -25375 -6144 36679 3855 -23628 6851 14672 15392
9637A5392J1600L7599m8179L1950P6979Q987q5440n8941l9668p1462j4027K4136
$$ 15392 26992 64591 16412 48362 125341 134328 48888 -10053 -49721 -121183 -135210 -111074
9625a11074R3087M7644l9734m5707N4732J9129K0494J4215K6801n4696n3532O769
$$ -111074 -17987 29657 -10077 -55784 -1052 18077 38571 52786 79587 24891 -28641 -21872
9613b1872M9714O600K355p0838l6863n8770O8893R7831k3895j28847j1851M1314
$$ -21872 27842 34442 36797 -34041 -70904 -129674 -60781 37050 13155 -115692 -127543 -86229
9601h6229J12988K4017J8309k8354L3697j2483p2188j21185K9782J02313L596
$$ -86229 26759 50776 69085 40731 74428 61945 -10243 -131428 -101646 667 4263
9590D263o8453l008j3732q281q785R4642l323k5942M1489M6015K8226k9425l1805
$$ 4263 -64190 -67198 -80930 -89211 -97996 -3354 -6677 -32619 8870 54885 83111 53686 21881
9577B1881N3441R595r2465m3891j3605O593J8598N7559n599m6702Q658O4997K7434
$$ 21881 75322 84917 -7548 -51439 -65044 -58451 -39853 17706 12107 -34595 -25937 39060 66494
9564F6494J9512k5513k2184J4685k6491m0390n2977J4305l7707o3015l0964J02890
$$ 66494 86006 60493 38309 52994 26503 -13887 -66864 -52559 -90266 -153281 -184245 -81355
9552h1355O0907k3659K0420n2907M0008M7085J6208m2492N0672N276p0988o7465
$$ -81355 -20448 -44107 -23687 -76594 -36586 10499 26707 -15785 34887 40163 -30825 -98290
9540i8290l8530P9675J7448L0293K0634l2680O159N2558j3935k9076j744Q634
$$ -98290 -136820 -57145 -39697 -9404 11230 -21450 -15291 37267 23332 -5744 -7488 1146
9528A146k9150q6703J3092L8361K3431j5949o307M373M0822K4512m4854n1934
$$ 1146 -28004 -114707 -101615 -63254 -39823 -55772 -62079 -57706 -16884 7628 -37226 -89160
9516h9160M5510L2451M7211J6933K998j12192q5826J13443K651p0467n65J9073
$$ -89160 -43650 -11199 36012 52945 55943 -56249 -142075 -28632 -25981 -96448 -97013 -77940
9504g7940P7407M8993Q2382J5123n2181l3210m3610P2122L2264r6286p1436k625
$$ -77940 -533 48460 130842 145965 93784 60574 16964 89086 121350 25064 -46372 -48997
9492d8997O5098l8578M328l6777P27J1969m5530j2043R7927L5821j06229n8003
$$ -48997 16101 -22477 -18149 -54926 -54199 -42230 -87760 -99803 -1876 33945 -72284 -130287
9480a30287K8331J4636K6900M5438j7740p889n4034O1286L42k3941J24654q1187
$$ -130287 -101956 -87320 -60420 -14982 -32722 -40611 -94645 -33359 -33017 -56958 67696 -13491
9468a3491r1377k4629Q4322N5019L8375j4097q1464q743M176M0620r98q0565P1565
$$ -13491 -104868 -129497 -45175 9844 48219 34122 -47342 -56085 -51909 -11289 -12287 -92852 -21287
9455b1287j0319o5M7211K3080K5810K2776K2842j4424j11m6320k1720J6906n938
$$ -21287 -31606 -31671 15540 38620 64430 87206 110048 95624 95513 49193 27473 44379 38441
9442C8441k9614l4588N253k4699M6392N1162J7087L966p1029P017k0170k6784
$$ 38441 8827 -25761 -20508 -45207 1185 52347 69434 73400 2371 9388 -10782 -37566
9430c7566l652N586J822O0295M6065R2942k3600n7143m1158o1148n830r004n3453
$$ -37566 -41218 -35632 -33810 26485 72550 165492 141892 84749 43591 -17557 -23387 -32391 -85844
9417h5844O01R1428k3417O480o928K1247K1787N0082J3518q1367k9147J7616R106
$$ -85844 -85243 6185 -17232 -10752 -17680 3567 25354 75436 88954 7587 -21560 -3944 5162
9404E162L4801j6308j2308l7952M9472K9818j3554L6966l0827p2291K3457M3376
$$ 5162 39963 23655 11347 -26605 22867 52685 39131 76097 45270 -27021 -3564 39812
9392C9812m7986l6377O5655n1825M8495L3902l4142M0q034p593Q8904q744n5365
$$ 39812 -8174 -44551 21104 -30721 17774 51676 17534 17574 9540 1947 90851 82107 26742
9379B6742p0061m6342K8698m0527j03997m679L4063L7601l918K7033L0121K2117
$$ 26742 -43319 -89661 -60963 -101490 -205487 -210166 -176103 -138502 -142420 -115387 -85266 -63149
9367f3149K5371o983J0526M1139n71K8663J33125J8549o9718p3569n2064L1163
$$ -63149 -37778 -44761 -34235 6904 6333 34996 168121 186670 116952 43383 -8681 22482
9355B2482l7520j6490j1084O2575P7502N7660m5597K255L893p0255q2121p0724
$$ 22482 -15038 -31528 -42612 19963 97465 155125 109528 111783 115676 45421 -36700 -107424
9343a07424j0074N0410J1905m0681l7787O5477J0166K4027l9621L6372M1910L4060
$$ -107424 -117498 -67088 -55183 -95864 -133651 -68174 -58008 -33981 -73602 -37230 4680 38740
9331C8740N488q2637k9613l5690m876k1097n0559P5273Q8124k5577o8079j898
$$ 38740 44228 -38409 -68022 -103712 -108588 -129685 -180244 -104971 -16847 -42424 -110503 -112401
9319a12401K3961M030P275M059Q3666M8010l0693m8783n0422K3364j8324j727
$$ -112401 -88440 -84410 -77135 -73076 10590 58600 27907 -20876 -71298 -47934 -66258 -67985
9307f7985J26455l858o1627m1419m8k8636J579J0565R2733K2829j889L3645L1302
$$ -67985 58470 54612 -7015 -48434 -48482 -77118 -75539 -64974 27759 50588 48699 82344 113646
9294A13646N934L4496p3953L065M4779o1176m1935J446q543j5526M5003r76m5068
$$ 113646 119580 154076 80123 83188 127967 66791 24856 26302 17759 2233 47236 46260 1192
9281A192r6291Q5745N4379k1493N5627l759k389J8930n6610o1990M624K7191o7851
$$ 1192 -95099 -9354 45025 23532 79159 75400 73011 91941 35331 -26659 -22035 5156 -62695
9268f2695j00767N6008N1797J1535K1447j3473n580Q6415O861m9254k7426p5618
$$ -62695 -163462 -107454 -55657 -44122 -22675 -36148 -41728 44687 51548 2294 -25132 -100750
9256a00750r65J05033q473n3535L6615O3630L9422j8938L3930L3813K5109m2745
$$ -100750 -101715 3318 -5155 -58690 -22075 41555 80977 62039 95969 129782 154891 112146
9244A12146k2687o68o694k289J5417p1014l7329K1502k623O7453Q033p6761k8424
$$ 112146 89459 88791 82097 79808 95225 24211 -13118 8384 5761 73214 81247 4486 -23938
9231b3938K4241L5766L0277p3961M969L3401p6567j9624M0246L1908j1405j7736
$$ -23938 303 36069 66346 -7615 -2646 30755 -45812 -65436 -25190 6718 -4687 -22423
9219b2423m7319q0948J0293K3278M9945J41932P1181k8092j23807m0203N0806
$$ -22423 -69742 -150690 -140397 -117119 -67174 74758 145939 117847 -5960 -46163 4643
9208D643N0557N1959m6413l8762J09664k1793k3100l2295l2951P2713j3907j6104
$$ 4643 55200 107159 60746 21984 131648 109855 86755 54460 21509 94222 80315 64211
9196F4211k6923k8734M5028L6050O2596l9886k3093J4526o728r4747k1260R3949
$$ 64211 37288 8554 53582 89632 152228 112342 89249 103775 97047 2300 -18960 74989
9184G4989j4314j8062j0408M3365M9810r8550o0948k4273K2909o198k8904l9296
$$ 74989 60675 42613 32205 75570 125380 26830 -34118 -58391 -35482 -41680 -70584 -109880
9172a09880n1069R3277M3381K1279m858j3763J7148O836K0264J00978q8462j03317
$$ -109880 -160949 -67672 -24291 -3012 -7870 -21633 -4485 2351 22615 123593 35131 -68186
9160f8186J939j2448j176l8694j3122L04O5199K3388N3423r0597J3062N1175O9834
$$ -68186 -66247 -78695 -79871 -118565 -131687 -131383 -66184 -42796 10627 -79970 -66908 -15733 54101
9147E4101J1375o8789l3972M2580J555M6450M4661j8142L4969J740l0235M821
$$ 54101 65476 -3313 -37285 5295 6850 53300 97961 79819 114788 116528 86293 91114
9135I1114m2976j1139O4199L1895k9624j41066l1876R2219J7859l0780k1586r549
$$ 91114 48138 36999 101198 133093 103469 -37597 -69473 22746 40605 9825 -11761 -21310
9123b1310M7608j8698j0855q4820K168P8861K0748J2498N2278K1480n0946l5904
$$ -21310 26298 7600 -3255 -88075 -85907 -7046 13702 26200 78478 99958 49012 13108
9111A3108m9347J2156k4069l9517q4001L5211N2170O194j8438N5648l951j3588
$$ 13108 -36239 -24083 -48152 -87669 -171670 -136459 -84289 -78095 -96533 -40885 -44836 -58424
9099e8424J2665J09341J8168j1452J3653j0714L8637J9534j4979l4365l8952p5516
$$ -58424 -45759 63582 81750 70298 83951 73237 111874 131408 116429 82064 43112 -32404
9087c2404J1410R8069j7700l9710p715K1953K8158J8167J4986m5415O5706r03
$$ -32404 -20994 77075 59375 19665 11950 33903 62061 80228 95214 49799 115505 114602
9075A14602J5863K584l8566L620q9141n4931k372J6640n9569K4451M4304O5920
$$ 114602 130465 133049 94483 98103 8962 -45969 -48341 -31701 -91270 -66819 -22515 43405
9063D3405L0145j1897n5717k2482J09500J4664l7026q1123J2197q761J0260M9738
$$ 43405 73550 61653 5936 -16546 92954 107618 70592 -10531 1666 -7095 3165 52903
9051E2903J30157P16N9191N7735M9552R0410J89867J84008J66917K24227J28393
$$ 52903 183060 183776 242967 300702 350254 440664 630531 814539 981456 1205683 1334076
9040A334076n3915k02341j92129j38350j05261j32877j21689q3209o5206j08227
$$ 1334076 1280161 1077820 885691 747341 642080 509203 387514 304305 239099 130872
9030A30872m6980P436m9845k7852M8226N9516n9076m5466m9863O1631L1167l0357
$$ 130872 83892 91328 41483 13631 61857 121373 62297 16831 -33032 28599 59766 29409
9018B9409j092k5314J5965m488J9378m785M1901J13992k0460l7778l1157N5681
$$ 29409 28317 3003 18968 14480 33858 29073 70974 184966 164506 126728 95571 151252
9006A51252O2481R3946J45735O4023J09595K48269K31910L43277N22713M98423
$$ 151252 213733 307679 453414 517437 627032 875301 1107211 1450488 1973201 2471624
8996B471624J85020k27039l05718l08351l35579l64644l18820k18035j32198q7718
$$ 2471624 2656644 2429605 2123887 1815536 1479957 1115313 796493 578458 446260 358542
8986C58542j34182J6216m9214j7713n9036J2191J1331M4056K464o1920k7648o882
$$ 358542 224360 240576 191362 173649 114613 126804 138135 182191 184655 122735 95087 88205
8974H8205K5556n470N0054P9651N819L0018j4220R9242n035j04548l8740n1068
$$ 88205 113761 108291 158345 237996 243815 273833 259613 358855 353820 249272 210532 159464
8962A59464o9070M5140N9753M9319p15N9322J19173K37313K33238K10332K12222
$$ 159464 90394 135534 195287 244606 243891 303213 422386 659699 892937 1103269 1315491
8951A315491M7698n3498p7350k43814k69521k66188q5811N2327k3410m2012p6203
$$ 1315491 1363189 1309691 1232341 988527 719006 452818 367007 419334 395924 353912 277709
8940B77709j7377k3348m9264J1154l2632j0774k6652k8530l2447L4538J3060r8708
$$ 277709 260332 236984 187720 198874 166242 155468 128816 100286 67839 102377 115437 16729
8928A6729o5432O4505J2005j51412l2004J07699Q8964Q2562j3294n2714r277J9742
$$ 16729 -48703 15802 27807 -123605 -155609 -47910 41054 123616 110322 57608 48331 68073
8916F8073j01757k356m8644J3059P3898J5756m867J9379M3925N0416L9259K4731
$$ 68073 -33684 -36040 -84684 -71625 2273 18029 13162 32541 76466 126882 166141 190872
8904A90872m0299k1364K6666n4953R890K5671K6785M3748j9342l7956n7216J0843
$$ 190872 150573 129209 155875 100922 110812 136483 163268 207016 187674 149718 92502 103345
8892A03345O7571J7035m3531K1592n20k7540n7187L7043o3593j12336j4327r2491
$$ 103345 170916 187951 144420 166012 165492 137952 80765 117808 54215 -58121 -72448 -164939
8880a64939N989P3267M9926q526J8229m6725P2685J05786M9979j7827j4806l9284
$$ -164939 -158950 -85683 -35757 -44283 -26054 -72779 -94 105692 155671 137844 123038 83754
8868H3754P8893N3336r0861j2347r145R5197O4676N964k5896Q14J9797j3426l8439
$$ 83754 162647 215983 125122 112775 103630 198827 263503 269467 243571 244385 264182 250756 212317
8855B12317q4640O222j1046N8900M5753n1447P9618k3897k7569O7788J16011n2901
$$ 212317 127677 133899 122853 181753 227506 176059 255677 231780 204211 271999 388010 335109
8843C35109j0273J3901o5995k9297O0502o732j68327q4092O5304j4776J1345J8515
$$ 335109 324836 338737 272742 243445 303947 297215 128888 44796 110100 95324 106669 125184
8831A25184M6726n2783J836P6947J64495N4246m098J100q9216r7166n4889r84
$$ 125184 171910 119127 120963 197910 362405 416651 412553 413653 324437 227271 172382 171398
8819A71398q262P617m3023j9352M8124M8671Q1028R4932l537J5421j4735q8468
$$ 171398 163136 170753 127730 108378 156502 205173 286201 381133 377596 393017 378282 289814
8807B89814o1976j12171q1297L4384l5455n8743m2023K8126k6058K8742O4846
$$ 289814 227838 115667 34370 68754 33299 -25444 -67467 -39341 -65399 -36657 28189
8796B8189K5028m0870r9503j8058R3029O5277L6660P3967k8091L4117M6532m5178
$$ 28189 53217 12347 -87156 -105214 -12185 53092 89752 163719 135628 169745 216277 171099
8784A71099P4172L3496n5938n0870p6696p990M4907M7900J15118J3771j6525J3698
$$ 171099 245271 278767 222829 171959 95263 87273 132180 180080 295198 308969 292444 306142
8772C06142K6281m1395M338J55154J73161K87136K42743l1240n1934k1522k37917
$$ 306142 332423 291028 295366 450520 623681 910817 1153560 1122320 1070386 1048864 810947
8761H10947k17422j67030k47823j49769k6073j39858k63131k15187k4781J19740
$$ 810947 593525 426495 178672 28903 2830 -137028 -400159 -615346 -640127 -520387
8751e20387P9862J17892J11491J12786O5943O8931Q923Q4027J88998J20827n9197
$$ -520387 -440525 -322633 -211142 -98356 -32413 36518 45441 129468 318466 439293 380096
8740C80096q6454J2079M1273O3424L431o9687o129k5649j6597J5605J06225K05398
$$ 380096 293642 305721 346994 410418 413849 344162 338033 312384 295787 311392 417617 623015
8728F23015J87908J06189O6368j3809l7149O9494J54249Q5202Q0130o6405j01897
$$ 623015 810923 917112 983480 969671 932522 1002016 1156265 1241467 1321597 1255192 1153295
8717A153295q8837m1011r3856k01083j92168l740K27j26565k0874K1170l2384
$$ 1153295 1064458 1023447 929591 728508 536340 532600 532827 406262 385388 406558 374174
8706C74174j9662P7984J20139R5010N6597J07379J03722M6058k0458J17697Q5039
$$ 374174 354512 432496 552635 647645 704242 811621 915343 961401 940943 1058640 1143679
8695A143679j2637O7558J51823n5042l2034Q8645N2857M4152Q2960J25554J48081
$$ 1143679 1131042 1198600 1350423 1295381 1263347 1351992 1404849 1449001 1531961 1657515 1805596
8684A805596J75338J12261J00109J24700K6614j6714j3798O3201J13532M9741
$$ 1805596 1980934 2093195 2193304 2318004 2344618 2327904 2314106 2377307 2490839 2540580
8674B540580J2033J60076J18588M4363J63209J95734J75278K63914L48096L69975
$$ 2540580 2552613 2712689 2831277 2875640 3038849 3234583 3409861 3673775 4021871 4391846
8664D391846K60154L04079N83389N99816P09555R54860J366093J593866J605605
$$ 4391846 4652000 4956079 5539468 6139284 6848839 7803699 9169792 10763658 12369263
8655A2369263J794210K198676L013273M177515N709065P514619R888647J3899770
$$ 12369263 14163473 16362149 19375422 23552937 29262002 36776621 46665268 60565038
8647F0565038K1268960L2935817M7332437N2134231L0561181m123991k3765897
$$ 60565038 81833998 114769815 162102252 214236483 244797664 240673673 216907776
8640B16907776k8194308l1043720l3981728l0795858k3016885j5863446j0763894
$$ 216907776 188713468 157669748 123688020 92892162 69875277 54011831 43247937
8633D3247937p545764n441222m014493k894046k096080j549742j221391j080693
$$ 43247937 35702173 30260951 26246458 23352412 21256332 19706590 18485199 17404506
8625A7404506r17131p41784n03211m05188k82389j56954M9591K33731L66380O59221
$$ 17404506 16487375 15745591 15242380 14837192 14554803 14397849 14447440 14681171 15047551 15706772
8615A5706772R86837J379428J822957K277913K695425L216808M051218N535525
$$ 15706772 16693609 18073037 19895994 22173907 24869332 28086140 32137358 37672883
8607C7672883P674429J0754709J3845267J7902733K5839494M0825446O7786489
$$ 37672883 45347312 56102021 69947288 87850021 113689515 154514961 222301450
8600B22301450J09246230J29838408O6450114k5474688o0825268n9980093o7063702
$$ 222301450 331547680 461386088 527836202 502361514 441536246 381556153 314492451
8593C14492451p6803431o6858540m6606027l0321102k0048571j3768228j0022767
$$ 314492451 237689020 170830480 124224453 93903351 73854780 60086552 50063785
8586E0063785p201262n283495l818502k892540k385623k160799k036105j976836
$$ 50063785 42862523 37579028 33760526 30867986 28482363 26321564 24285459 22308623
8578B2308623j642120j366974j140493q17321n67938m36751l55805n0340K13334
$$ 22308623 20666503 19299529 18159036 17341715 16773777 16337026 15981221 15930881 16144215
8569A6144215L09366N75985Q42815J193578J647105K153226K989766M099109N568564
$$ 16144215 16453581 17029566 17872381 19065959 20713064 22866290 25856056 29955165 35523729
8560C5523729P219472R577754J3680278K0592408L1590397M4962165M8735101
$$ 35523729 42743201 52320955 66001233 86593641 118184038 163146203 211881304
8553B11881304K7084165o290639k4504030k8362679l0952349l3442726k9897043
$$ 211881304 238965469 232674830 208170800 179808121 148855772 115413046 85516003
8546H5516003k2149735j5005476j0170534p114256n216028l824387k798612k166223
$$ 85516003 63366268 48360792 38190258 31076002 25859974 22035587 19236975 17070752
8538A7070752j715469j436006j173467j093450j015313q69527q88595p92352n64840
$$ 17070752 15355283 13919277 12745810 11652360 10637047 9767520 8878925 8086573 7521733
8529G521733m73261k89540m01171m31564k72942k91690k94139k37374k81865j94290
$$ 7521733 7048472 6758932 6357761 5926197 5653255 5361565 5067426 4830052 4548187 4353897
8519D353897j75549j78004j30226l4065j11601j11984j02649j4453q3776j42105
$$ 4353897 4178348 4000344 3870118 3836053 3724452 3612468 3509819 3495366 3411590 3269485
8509C269485j38719r1619n3706L1000m6659k01568j86588j23407l6472O761R353
$$ 3269485 3130766 3039147 2985441 3016441 2969782 2768214 2581626 2458219 2421747 2428508 2437861
8498B437861j13882p8910o0952j645K591J3798k7503k0523k7784j3619l208j9651
$$ 2437861 2323979 2245069 2184117 2182472 2185063 2198861 2171358 2150835 2123051 2109432 2106224 2086573
8486B086573J7395K405j1204j5239q0818J018R4162n048k0920Q037m4588k2597
$$ 2086573 2103968 2106373 2095169 2079930 1999112 2000130 2094292 2089244 2068324 2076361 2031773 2009176
8474B009176o2693j28315j3941K1614j41656q5868k7089N6818k4998o7854J6524
$$ 2009176 1946483 1818168 1804227 1825841 1684185 1598317 1571228 1628046 1603048 1535194 1551718
8463A551718J360P8789j9565o3131n6598p8783m9422o2786j44738L826M4871M876
$$ 1551718 1553078 1631867 1612302 1549171 1492573 1413790 1364368 1301582 1156844 1160670 1205541 1210417
8451A210417m7737N7193Q9310J25792Q9205J18096P6533J8394J38115O0683m8690
$$ 1210417 1162680 1219873 1309183 1434975 1524180 1642276 1718809 1737203 1875318 1936001 1887311
8440A887311r2415j30384p7156o4105n7954n6261j04538J2962O093k731R1725
$$ 1887311 1794896 1664512 1587356 1523251 1465297 1409036 1304498 1317460 1323553 1320822 1412547
8429A412547R1762N6562L5394L7435n2182p2113r6293j02714q3081q1496p9459
$$ 1412547 1504309 1560871 1596265 1633700 1581518 1509405 1413112 1310398 1227317 1145821 1066362
8418A066362m5719j0642r434k321k2597o54o8625o2840o0870m425L0277R0070
$$ 1066362 1020643 1010001 1000567 998246 975649 974995 906370 843530 782660 778235 808512 898582
8406H98582J9498R157J3755Q7924O6055l0522m8884J738Q8120j0336L279p217
$$ 898582 918080 927237 940992 1028916 1094971 1064449 1015565 1017303 1105423 1095087 1098366 1091149
8394A091149m1472r1274n8959p5062j04731J7076O2793q3949Q1188J29288P0858
$$ 1091149 1049677 958403 899444 824382 719651 736727 799520 715571 796759 926047 996905
8383I96905L3390M2841m3050k3895m1769r2372Q435k5911o1049j03656l9153K512
$$ 996905 1030295 1073136 1030086 1006191 964422 872050 880485 854574 793525 689869 650716 653228
8371F53228p0819m3673K053O7309Q5052k5194r9948M419m628O5189M6545k2944
$$ 653228 582409 538736 540789 608098 693150 667956 568008 572427 567799 632988 679533 656589
8359F56589N6528o159m3415J8967l7516m2113p0872L9771Q8865M9093J1797m360
$$ 656589 713117 706958 663543 682510 644994 602881 532009 571780 660645 709738 721535 717175
8347G17175q3115k7897Q8526j3298j592k604N9494J32430J40032J78136K10806
$$ 717175 634060 606163 694689 681391 679799 677195 736689 869119 1009151 1187287 1398093
8336A398093N58027R99759J534030R31752m47325q04055n42515n75887p43924
$$ 1398093 1956120 2955879 4489909 5421661 4974336 4170281 3627766 3051879 2307955
8327B307955o29897l69095j66590o9687j15314q8910p1382k2725j8971o1122l4083
$$ 2307955 1678058 1308963 1142373 1072686 957372 868462 797080 774355 755384 694262 660179
8316F60179K6392n0578J9468k3801O110J8214K8371J1071j1501R763N1302j13078
$$ 660179 686571 635993 655461 631660 637770 655984 684355 695426 683925 693688 744990 631912
8304F31912p0777L7203r2322M0643R5687P6515L1149O4208J12231J31040L37050
$$ 631912 561135 598338 506016 546659 642346 718861 750010 814218 926449 1057489 1394539
8293A394539M66071Q11912J734138L105621K401229l64200j481937j058988j027134
$$ 1394539 1860610 2672522 4406660 7512281 9913510 9549310 8067373 7008385 5981251
8284E981251j480436j451810r81544n07798k04082j91135r0391q5425n4716r7268
$$ 5981251 4500815 3049005 2067461 1559663 1355581 1164446 1074055 988630 933914 836646
8274H36646j27269k1433j142j9595K0840K3217l7788l7712n1251K388K2599o264
$$ 836646 709377 687944 686802 667207 688047 711264 673476 635764 584513 586901 609500 603236
8262F03236L9787n4072r6102J0997J6379n0882K7011N4306q860J03032L4063M4415
$$ 603236 643023 588951 492849 503846 520225 469343 496354 550660 541800 644832 678895 723310
8250G23310N7340K33927L73650P99475J295470J405955M12575n33649n61447l58849
$$ 723310 780650 1014577 1388227 2187702 3483172 4889127 5301702 4768053 4206606 3847757
8240C847757l42468m85410m87166l93765l06079k55655k34508k34390k04616j87082
$$ 3847757 3505289 3019879 2532713 2138948 1832869 1577214 1342706 1108316 903700 716618
8230G16618j09506o4631k2517K64K2936k6603N7890j6048j42239p5870M5932m5762
$$ 716618 607112 542481 519964 520228 543164 516561 574451 558403 416164 340294 386226 340464
8218C40464K9396M351m4957l9107k1250n3954j269M5425l5681K7285Q4916K6366
$$ 340464 369860 374211 329254 290147 268897 214943 213674 259099 223418 250703 335619 361985
8206C61985K1632r211N5860K604M0608L7263J01580R9330J45878L12312M94040
$$ 361985 383617 374406 430266 432870 473478 510741 612321 711651 857529 1169841 1663881
8195A663881P15554M99087R043k45180l84381l82918l62530k78120k61506j81974
$$ 1663881 2379435 2878522 2887565 2642385 2258004 1875086 1512556 1234436 972930 790956
8185G90956j38390j13688j13472n4388n918O598O255k6297O8746j08746o8955
$$ 790956 652566 538878 425406 371018 365100 371698 377953 351656 420402 311656 242701
8174B42701k3731o0572k5175K6250N5604j2842m6796N3712o409n1613j484p8078
$$ 242701 218970 158398 133223 159473 215077 202235 155439 209151 202742 151129 149645 71567
8162G1567L0490P8823N2080j4503N1413Q4163N8761P7186M6563J13345K35565
$$ 71567 102057 180880 232960 218457 269870 354033 412794 489980 536543 649888 885453
8151H85453K08751K10359J60299N2163j00063j47252j66098k19282j72085j60459
$$ 885453 1094204 1304563 1464862 1517025 1416962 1269710 1103612 884330 712245 551786
8141E51786j03731p0823o4617m2962k5107O7929J34046N4645p8033p5080o7802
$$ 551786 448055 377232 312615 269653 244546 312475 446521 501166 423133 348053 280251
8130B80251p0321m3123m8885M5550K1626r8913m6564j0052J10008K9689m0333
$$ 280251 209930 166807 117922 163472 185098 86185 39621 29569 139577 169266 128933
8119A28933l9786m2265P3162P2947N8972N4371J4862k4094j27220q6278L1554
$$ 128933 89147 46882 120044 192991 251963 306334 321196 297102 169882 83604 115158
8108A15158k185O0790K7499j0161l9880o0792n4341J06917M2368k2089k2051M1597
$$ 115158 112973 173763 201262 191101 151221 90429 36088 143005 185373 163284 141233 182830
8096A82830n1200l7606N5988m90l7016M0146J5524n8674q5498j3376O8134R7287
$$ 182830 131630 94024 150012 149522 112506 152652 168176 109502 24004 10628 78762 176049
8084A76049O6454L3522r209j05018M1784l7617j67007K1118R3677K6990K6637
$$ 176049 242503 276025 266816 161798 203582 165965 -1042 20076 113753 140743 167380
8073A67380p9704L6536N4977J1042o1280o9688L700l333K8522j7839L2985K0668
$$ 167380 87676 124212 179189 190231 128951 59263 62963 59630 88152 70313 103298 123966
8061A23966p96K6664J1763M731n5204o6321m6126k9630j716p0n513K9398Q7763
$$ 123966 123170 149834 161597 166328 111124 44803 -1323 -30953 -32669 -32739 -38252 -8854 78909
8048G8909Q4231K5102n4061j03354m3902j6488J3804k6821M8249N8092Q6718J5078
$$ 78909 163140 188242 134181 30827 -13075 -29563 -15759 -42580 5669 63761 150479 165557
8036A65557o8655k8906J798j07M3185m6578k8255j9505j6697N4946J9073l7518
$$ 165557 96902 67996 69794 69687 112872 66294 38039 18534 1837 56783 75856 38338
8024C8338J114J5564p219M1208L7185J3560M5882l2312L7582P923m5281P7258
$$ 38338 39452 55016 47797 89005 126190 139750 185632 153320 190902 198825 153544 230802
8012B30802K214N3813O1474o093p5981J4879N2060k9041k8597j1144m9128j06652
$$ 230802 233016 286829 348303 342210 266229 281108 333168 304127 275530 264386 215258 108606
8000A08606l9016l4656J10695O9284K2693J1743l499o8755o6724j3596N5914P2580
$$ 108606 69590 34934 145629 214913 237606 249349 245850 177095 110371 96775 152689 225269
7988B25269K8383o2616j2908J11922M4742J05783K61448J03023M6383R6446J75344
$$ 225269 253652 191036 178128 290050 334792 440575 702023 805046 851429 947875 1123219
7977A123219P2439j25362j06209j70043k55462j13474l5662J259l4603m2422L1924
$$ 1123219 1195658 1070296 964087 794044 538582 425108 389446 390705 356102 313680 345604
7966C45604M5537n6270j05382J8130M5241L1641J773j09423o4011o131N5926Q5761
$$ 345604 391141 334871 229489 247619 292860 324501 326274 216851 152840 146709 202635 288396
7954B88396o7354n604p714o137k9334k3714o6636L0612J0056L210R4041P4116
$$ 288396 221042 215438 207724 201587 172253 148539 81903 112515 122571 125781 219822 293938
7942B93938M7897K766M3473R5920P8968J0589J05117R6950L7283m5313o0407q0437
$$ 293938 341835 344601 388074 483994 562962 573551 678668 775618 812901 767588 707181 626744
7930F26744j20552m4212j69522j18581O4747M3975M756q5152o086Q5490j0899
$$ 626744 506192 461980 292458 173877 238624 282599 287355 202203 196117 281607 270708
7919B70708n460k3116J9855l4754l3575q781j04696J0668J3635M1739O6027N8817
$$ 270708 265248 242132 261987 227233 193658 184877 80181 90849 104484 146223 212250 271067
7907B71067m7099l8927L3062n0840r8368M6038N8660O2949J7365m4735r4086k7467
$$ 271067 223968 185041 218103 167263 68895 114933 173593 236542 253907 209172 115086 87619
7895H7619M0456k0715q4761N5018J01264N6295p1583J1346N0224n7627n3627j5125
$$ 87619 128075 107360 22599 77617 178881 235176 163593 174939 225163 167536 113909 98784
7883I8784L8214O3125J9990j6343o3922m0151j20467j02020N0928J41172k3996
$$ 98784 136998 200123 220113 203770 139848 99697 -20770 -122790 -71862 69310 45314
7872D5314l7925l8353Q4584O0586r2036p0209N0027J2977r391Rp15O9327j8976
$$ 45314 7389 -30964 53620 114206 22170 -48039 1988 14965 5574 5583 4868 74195 55219
7859E5219j7599J1494M5327J8650J2734l8357j01642j3477J70K0306N5521K951
$$ 55219 37620 49114 94441 113091 125825 87468 -14174 -27651 -27481 -7175 48346 51297
7847E1297K5195q555K0370M6163j1910o0936k7555J9770O3780q9328n6477P1953
$$ 51297 76492 67937 88307 134470 122560 61624 34069 53839 117619 28291 -28186 43767
7835D3767J02344K4106J9023r689n707r0876o6227L244j8324N4239k4723q4385
$$ 43767 146111 170217 189240 179551 173844 82968 16741 19985 1661 55900 31177 -53208
7823e3208k1633L3062N6184J40052J21579j24424j70245l4289O0599j1223L3246
$$ -53208 -74841 -41779 14405 154457 276036 151612 -18633 -52922 7677 -3546 29700
7812B9700K6211k1550L8672j6193L7057l0240k6528p4711l6725R6963P9099L6087
$$ 29700 55911 34361 73033 56840 93897 63657 37129 -37582 -74307 22656 101755 137842
7800A37842L6015p64L9996o2957l1192J5466K5734L385L1863P928j33460m9405
$$ 137842 173857 173093 213089 150132 118940 134406 160140 163525 195388 203316 69856 20451
7788B0451R9897N8624k5005j9799K480k6926q7328j00263j4008J17644O408k645
$$ 20451 120348 178972 153967 134168 136648 109722 22394 -77869 -91877 25767 32175 29530
7776B9530m704n0024o6757M9223L6981O7912m519J8750J5776j3012k4758j09851
$$ 29530 24826 -25198 -91955 -42732 -5751 62161 57642 76392 92168 79156 54398 -55453
7764e5453m8775R7938K7607M6982Q8633k7954j17894J6731k2470L4199P9305n3095
$$ -55453 -104228 -6290 21317 68299 156932 128978 11084 27815 5345 39544 118849 65754
7752F5754p5706n1657L0662J5507N0876L2702J7056K4617j256k8792K8320k0223
$$ 65754 -9952 -61609 -30947 -15440 35436 68138 85194 109811 108555 79763 108083 87860
7740H7860m8048K4921m6849J5697N9393l0913k3844n151l4598l3888N3585P9300
$$ 87860 39812 64733 17884 33581 92974 62061 38217 33066 -1532 -35420 18165 97465
7728I7465K4904o7635l4015j4132N3539K1646k5968M5439O898k9813L7150n1056
$$ 97465 122369 54734 20719 6587 60126 81772 55804 101243 108141 78328 115478 64422
7716F4422n6748p0879L7439L7584l9722P5412P7974p5317o1052N7437P7503J3478
$$ 64422 7674 -63205 -25766 11818 -27904 47508 125482 50165 -10887 46550 124053 137531
7704A37531o4083p9381n0880N0807L077p8729P98J2438P4897Q7457J4933J9812
$$ 137531 73448 -5933 -56813 -6006 -2929 -81658 -80860 -68422 6475 93932 108865 128677
7692A28677j18951l1660J09070k5795p3635p5431j8459Q7919R686N6421J44839
$$ 128677 9726 -21934 87136 61341 -12294 -87725 -106184 -18265 -8579 47842 192681
7681A92681p7338r8003j7046o5871r7329M2176P985N467M6982L8078M3163J2856
$$ 192681 115343 17340 294 -65577 -162906 -120730 -112745 -107278 -60296 -22218 20945 33801
7669C3801L9450R030O4324N2879Q549m2191j01132P928K4853j9456l7365n2475
$$ 33801 73251 82281 146605 199484 208033 165842 64710 72638 97491 78035 40670 -11805
7657a1805k7886q4072O2320J14600o0950j1316n330m9070m1536K8237K4338n2589
$$ -11805 -39691 -123763 -61443 53157 -7793 -19109 -24439 -73509 -115045 -86808 -62470 -115059
7645a15059j1228O2485k2759n4762P8670J0480M3848J3726j604p7531j7602L6384
$$ -115059 -126287 -63802 -86561 -141323 -62653 -52173 -8325 5401 3797 -73734 -91336 -54952
7633e4952J2104L2434o316k1994m1050P5388K7352K7034l019M1730l982q0731
$$ -54952 -42848 -10414 -16730 -38724 -79774 -4386 22966 50000 46981 88711 84729 3998
7621C998k4197J8815O7667J5701O326k7184J6653r073L6772q9234n7454J1054
$$ 3998 -20199 -1384 66283 81984 88310 61126 77779 68706 105478 16244 -41210 -30156
7609c0156L4174j2118m4205n4888M7465M7989M3174k7319J2692P207o4047j18807
$$ -30156 4018 -8100 -52305 -107193 -59728 -11739 31435 4116 16808 24015 -40032 -158839
7597a58839K0363J24498N6761k8889M0059j6278l8966n3509O7445l8307q890J50619
$$ -158839 -138476 -13978 42783 13894 53953 37675 -1291 -54800 12645 -25662 -34552 116067
7585A16067N4627K3630P775n0774q651J862l6835l6245n9461J9169J4622L4260
$$ 116067 170694 194324 202099 151325 142674 144536 107701 71456 11995 31164 45786 80046
7573H0046o8972K3586M6671K9947L0237l9888k6317O422K095l0281m0193j7127
$$ 80046 11074 34660 81331 111278 141515 101627 75310 81732 83827 53546 13353 -3774
7561c774L7183r2766o5486L4580O6616P4589K6918N106m7378l7277K2631J7883
$$ -3774 33409 -59357 -124843 -90263 -23647 50942 77860 82966 35588 -1689 20942 38825
7549C8825j6903K5672j9945k6055o6285J2244M1967K3824n481m3043J0212j8341
$$ 38825 21922 47594 27649 1594 -64691 -52447 -10480 13344 7863 -35180 -24968 -43309
7537d3309O5272J7671r1561K0478J4903R243k5244k1477O4572J8696n7088l4249
$$ -43309 21963 39634 -51927 -31449 -16546 -7303 -32547 -54024 10548 29244 -27844 -62093
7525f2093J1876j0601L3650k358J711L0561L1966O2156N3381j03967j4881M2639
$$ -62093 -50217 -60818 -27168 -29526 -27815 2746 34712 96868 150249 46282 31401 74040
7513G4040j15935k8896P8546k821n7548J6815L2551l3804l6751J10496o4188k2721
$$ 74040 -41895 -70791 7755 4934 -52614 -35799 -3248 -37052 -73803 36693 -27495 -50216
7501e0216l6921o3695N6158L1620O1731N8055L7332l1371j28918j246j696P2248
$$ -50216 -87137 -150832 -94674 -63054 -1323 56732 94064 62693 -66225 -67471 -69167 3081
7489C081Q103k4044p0837l1497Q6650J7040K3277M3326k1784k3166L5635N8143
$$ 3081 11184 -12860 -83697 -115194 -28544 -11504 11773 55099 33315 10149 45784 103927
7477A03927o6594l4642j4080J8538L5361k0419l989K6458q3020j49434O4413P1594
$$ 103927 37333 2691 -11389 7149 42510 22091 18102 44560 -38460 -187894 -123481 -51887
7465e1887p873K2156P6888L2085L0938K8043m928o6616m4787K2526M5461o9674
$$ -51887 -59760 -37604 39284 71369 102307 130350 125422 58806 14019 36545 82006 12332
7453A2332J230j0628j5541J0712R824J4404l0295N6032J10595l1542o5757J4271
$$ 12332 13562 2934 -12607 -1895 7929 22333 -7962 48070 158665 127123 61366 75637
7441G5637m2239K7652n496l1290j3648j485m9531j33703l3621P1150J9636L4053
$$ 75637 33398 61050 55554 24264 10616 9131 -40400 -174103 -207724 -136574 -116938 -82885
7429h2885L6220M6062K6589k8240q0205m9390P4259L7332o183l2207j8120J3175
$$ -82885 -46665 -603 25986 -2254 -82459 -131849 -57590 -20258 -26441 -58648 -76768 -63593
7417f3593K4457Q7226P9845n5055j2998j968j0667K1421j4738O2663j1916n3830
$$ -63593 -39136 48090 127935 72880 59882 57914 47247 68668 53930 116593 104677 50847
7405E0847n5253q1374n287j2932j996R731M3369k1766O2998N8674j6786m0438
$$ 50847 -4406 -85780 -91067 -103999 -105995 -96264 -52895 -74661 -11663 47011 30225 -10213
7393a0213M1103J4897k3989l5712l6143k6064R0624J36149k2398n0300o5655j366
$$ -10213 30890 45787 21798 -13914 -50057 -76121 14503 150652 128254 77954 12299 10933
7381A0933n5499n4490m1902K5073K9325J4645K5198p6730o354N4084K6983J3355
$$ 10933 -44566 -99056 -140958 -115885 -86560 -71915 -46717 -123447 -129801 -75717 -48734 -35379
7369c5379k8018L1866Q0471o5056m3982J2061K7041J985M0153k7291n6227L1309
$$ -35379 -63397 -31531 48940 -16116 -60098 -48037 -20996 -19011 21142 -6149 -62376 -31067
7357c1067J03326j3128l2612r984o582j3074k8211l940j5493R5310N9813m2608
$$ -31067 72259 59131 26519 16535 9953 -3121 -31332 -35272 -50765 44545 104358 61750
7345F1750j5214n2386j04109K3897N2969k5650j5401L1567P0551j0398M9081k2141
$$ 61750 46536 -5850 -109959 -86062 -33093 -58743 -74144 -42577 27974 17576 66657 44516
7333D4516l7418l3484r9152N3494K7179l9589k7718L9160M5035J2820m6019j3635
$$ 44516 7098 -26386 -125538 -72044 -44865 -84454 -112172 -73012 -27977 -15157 -61176 -74811
7321g4811L7709O6819j2265j8197N2966p4736q7041j2465J1661m6453M439R4648
$$ -74811 -37102 29717 17452 -745 52221 -22515 -109556 -122021 -110360 -156813 -152374 -57726
7309e7726L0231J30296Q276j02138k4721J5190l9280M1543l0036l7366M5465O1853
$$ -57726 -27495 102801 111077 8939 -15782 -592 -39872 1671 -28365 -65731 -20266 41587
7297D1587O0988k0121m3638K304L5604m2217p8279l1906j3506o2455P8367Q548
$$ 41587 102575 82454 38816 41120 76724 34507 -43772 -75678 -89184 -151639 -73272 -64724
7285f4724P8057J2589M4102N7509p190j0777p8329J9708k7014l2797m3472K2674
$$ -64724 13333 25922 70024 127533 120343 109566 31237 50945 23931 -8866 -52338 -29664
7273b9664O2141L5128k7447n813K0055R9645j038r7093p4696l5383n3772o5266
$$ -29664 32477 67605 40158 34345 54400 154045 153007 55914 -18782 -54165 -107937 -173203
7261a73203M9775L3632O3855K7242n542j1925P957J6792j3404l2756j8944r5249
$$ -173203 -123428 -89796 -25941 1301 -4241 -16166 -8209 8583 -4821 -37577 -56521 -151770
7249a51770M1261L2922m0358l9827L4087J5826J01793J5297o5074q3738q975J02232
$$ -151770 -110509 -77587 -117945 -157772 -123685 -107859 -6066 9231 -55843 -139581 -148556 -46324
7237d6324J39561M3905p531l2746m3165j4613p2733p339O140k5585M009K9p6667
$$ -46324 93237 137142 129611 96865 53700 39087 -33646 -40985 -34845 -60430 -56421 -56392 -133059
7224a33059J09948M5305O9619Q3285k8948j29991q2909N2146L73O7663M1611J7294
$$ -133059 -23111 22194 91813 175098 146150 16159 -66750 -14604 -14231 53432 95043 112337
7212A12337k606p6197l8261K81k8929K1021o9314q5972L7622R6824o2908o9943
$$ 112337 109731 33534 -4727 -4446 -33375 -12354 -81668 -167640 -130018 -33194 -96102 -166045
7200a66045Q0211J19316M4089m3714l1886n2388L2975M9056j9011L0967J4340
$$ -166045 -85834 33482 77571 33857 1971 -50417 -17442 31614 12603 43570 57910
7189E7910l2334J0916m4756K809K2547n3815k5853K0700k4170M9925M447J4081
$$ 57910 25576 36492 -8264 -5455 17092 -36723 -62576 -41876 -66046 -16121 -11674 2407
7177B407L661J1976K3242L1282n9752j1857P5724N6445m760M7196j18337r0177
$$ 2407 6068 18044 41286 72568 12816 959 76683 133128 128368 175564 57227 -32950
7165c2950K5054Q5874L7501k3962O0736j0635p2175l5927O9515o7158j21420Q330
$$ -32950 -7896 77978 115479 91517 152253 141618 69443 33516 103031 35873 -85547 -77217
7153g7217R1770m1765p280l956K6886J2743O975J05224L6344o3260J8558r228
$$ -77217 14553 -27212 -34492 -38448 -11562 1181 8156 113380 149724 86464 105022 95794
7141I5794l9573k3479k1921l5530p23O4990n3520m2068N1638l602N7968M8562
$$ 95794 56221 32742 10821 -24709 -25432 39558 -13962 -56030 -4392 -7994 49974 98536
7129I8536n1424P299L4633q323p2621K2146q021m3524k0165j0296L8458r0207
$$ 98536 47112 54411 89044 80721 8100 30246 22225 -21299 -41464 -51760 -13302 -103509
7117a03509n5319L2807L3160O3356R2431l4724j4844K6700m8921q9628m3188Q1926
$$ -103509 -158828 -126021 -92861 -29505 62926 28202 13358 40058 -8863 -98491 -141679 -59753
7105e9753Q4358N8122K3741k6810o2378p9107j4937J1699m466K2034M571r117
$$ -59753 24605 82727 106468 79658 17280 -61827 -76764 -65065 -69531 -47497 -42926 -52043
7093e2043l236O7844J7538j5147l6318p533O6590P1848l7013q7883l4728l7269
$$ -52043 -55279 12565 30103 14956 -21362 -28895 37695 109543 72530 -15353 -50081 -87350
7081h7350k1437K473P446L9262O1877M4130m2225l3337K4269P050l6548l8327
$$ -87350 -108787 -106314 -98868 -59606 2271 46401 4176 -29161 -4892 2158 -34390 -72717
7069g2717l0584j8938M2641K9516M4804J3163J5977l4619O0683M650n5020k0623
$$ -72717 -103301 -122239 -79598 -50082 -5278 7885 23862 -10757 49926 54576 -444 -21067
7057b1067k0908l1402j3133K6326K4026m377M899q355J9884n8591p927N0493K2164
$$ -21067 -41975 -73377 -86510 -60184 -36158 -40535 -35636 -43991 -24107 -82698 -90625 -40132 -17968
7044a7968J9033J2709o5583r6241M3953l2189m1626M4686N4972j9017k7478M760
$$ -17968 1065 13774 -51809 -148050 -104097 -136286 -177912 -133226 -78254 -97271 -124749 -119989
7032a19989P4831J3288o9359j1996M3305J1151J727L7077Q834o9409o7742l6534
$$ -119989 -45158 -31870 -101229 -113225 -69920 -58769 -57042 -19965 -11131 -80540 -148282 -184816
7020a84816K3409O7909J6469m8796k4708J2324o4j779N5581N460N5808l797N3320
$$ -184816 -161407 -93498 -77029 -125825 -150533 -138209 -138273 -140052 -84471 -79011 -23203 -27000 26320
7007B6320J7769p4519P85J8558N6476k4292l6478p0100j23063k6888J09842N1473
$$ 26320 44089 -30430 -29645 -11087 45389 21097 -15381 -85481 -208544 -235432 -125590 -74117
6995g4117L4873N6716L6526o766q4120m7506M6014O8758k2443l1920M4719M852
$$ -74117 -39244 17472 53998 47232 -36888 -84394 -38380 30378 7935 -23985 20734 25586
6983B5586l8662r7512m8098N5958Q5657R4070j3112k6699K4343j20747l2977M7076
$$ 25586 -13076 -110588 -158686 -102728 -17071 76999 63887 37188 61531 -59216 -92193 -45117
6971d5117m4727m3373K7886n6207M4825M9043n7086J1858P1128k6366k2450m7743
$$ -45117 -89844 -133217 -105331 -161538 -116713 -67670 -124756 -112898 -41770 -68136 -90586 -138329
6959a38329l4215r460J0237L9793k153L946k8461N1107k4204n7332K9908P6087
$$ -138329 -172544 -182004 -171767 -131974 -134127 -130181 -158642 -107535 -131739 -189071 -159163 -83076
6947h3076K320r368K5905P6814L2154k8199K4434K5728Q28M1547l0926p6863K2080
$$ -83076 -80756 -90124 -64219 12595 44749 16550 40984 66712 67540 109087 78161 1298 23378
6934B3378K6755j6577k8760J0932K9827k7941N3793O9004n272j23812j8041J00502
$$ 23378 50133 33556 4796 15728 45555 17614 71407 140411 135139 11327 -6714 93788
6922I3788K1288k7691o3479j7318J5311n4793q5209J257R2580N3395l7415k0201
$$ 93788 115076 87385 23906 6588 21899 -32894 -118103 -116846 -24266 29129 -8286 -28487
6910b8487O018M5957p327l1252M2274j2562l5356K7637N5483Q1271L3510j06913
$$ -28487 -22469 23488 16161 -15091 27183 14621 -20735 6902 62385 143656 177166 70253
6898G0253j2291N359n7538K4610j7317j2998J2632K6883p5753o6825J2212N144
$$ 70253 57962 63321 5783 30393 13076 78 12710 39593 -36160 -102985 -90773 -85629
6886h5629P5814Q773M1248O0807L8733q303p6261l8739R1874L1180q1041o8128
$$ -85629 -9815 -1042 40206 101013 139746 131443 55182 16443 108317 139497 58456 -9672
6874i672j16623l5419M1879K5595M1088J6690k4544J4741k1280m8200Q442N6952
$$ -9672 -126295 -161714 -119835 -94240 -53152 -36462 -61006 -46265 -67545 -115745 -107303 -50351
6862e0351P1678L3199k6376m7419J8680L0130j824j6505n338J6488L0181m5939
$$ -50351 21327 54526 28150 -19269 -589 29541 27717 11212 5874 22362 52543 6604
6850F604J850k9997l5553L6327J0053L1685o53K1306N5763n3503o5737L2957J7029
$$ 6604 8454 -21543 -57096 -20769 -10716 20969 20316 41622 97385 43882 -21855 11102 28131
6837B8131K9248J521M7420N024l2953l2156J1240l937p0381o0068Q957K8937J2471
$$ 28131 57379 58900 106320 111344 78391 46235 57475 53538 -16843 -76911 -67954 -39017 -26546
6824b6546M570j2308r8540j634K4273L3213K765P2008j14875l3992J11540J34226
$$ -26546 -21976 -34284 -132824 -134458 -110185 -76972 -74207 -2199 -117074 -151066 -39526 94700
6812I4700N8546q5859n3744j5191n2919k327M4803k2435j7505N7016o0523k7425
$$ 94700 153246 67387 13643 -1548 -54467 -56794 -11991 -34426 -51931 5085 -55438 -82863
6800h2863N2263J4692l0623j8794n7140L7015O0830k4009o0361n1568M335Q1178
$$ -82863 -30600 -15908 -46531 -65325 -122465 -85450 -24620 -48629 -108990 -160558 -156223 -75045
6788g5045Q4352J22034l6792j3637j523n4785K2973n774p9621K7054j0036m8135
$$ -75045 9307 131341 94549 80912 79389 24604 47577 41803 -37818 -10764 -20800 -68935
6776f8935N8306J7291P912q148n1497j3558r774k9134R385m7121O5485n6515M7603
$$ -68935 -10629 6662 14574 6426 -45071 -58629 -68403 -97537 -88152 -135273 -69788 -126303 -78700
6763g8700N9348K184K9456Q0222J6825r1142k7746J746q794p5552N8103N8278
$$ -78700 -19352 -17168 12288 92510 109335 18193 -9553 -7807 -16601 -92153 -34050 24228
6751B4228N6700N8797q6156o6829J1128o8003m1667L6513j1704O5704J8937o4359
$$ 24228 80928 139725 53569 -13260 -2132 -70135 -111802 -75289 -86993 -21289 -2352 -66711
6739f6711L9633o731P321N1945p772l6486n0382N9962J5726j1758o5200l0540
$$ -66711 -27078 -33809 -26488 25457 17685 -18801 -69183 -9221 6505 -5253 -70453 -100993
6727a00993N6351O696j9448J5930l3100m0483N4168J13475K5227j20191o6332
$$ -100993 -44642 -37946 -57394 -41464 -74564 -115047 -60879 52596 77823 -42368 -108700
6716a08700J03792J06430P5501n2609p5661q4952J4935l0347q5076M0359J52844
$$ -108700 -4908 101522 177023 124414 48753 -36199 -21264 -51611 -136687 -96328 56516
6705E6516J45421l8725j5586J0177O928m7225R768j2678o4324r7447k3806M5293
$$ 56516 201937 163212 147626 157803 164731 117506 127274 114596 50272 -47175 -70981 -25688
6693b5688O3482L6075K4139l8615j04764p8904O0321O6599M0192m9528k9407J5951
$$ -25688 37794 73869 98008 59393 -45371 -124275 -63954 2645 42837 -6691 -36098 -20147
6681b0147O03l6160j17051k7142M5761L2183P6856N1280O7763o2453m0640o8234
$$ -20147 -19544 -55704 -172755 -199897 -154136 -121953 -45097 6183 73946 11493 -29147 -97381
6669i7381j0925j1360J7464M9411N1340K3486J05107L3558J8574m8282l3782n8844
$$ -97381 -108306 -119666 -102202 -52791 -1451 22035 127142 160700 179274 130992 97210 38366
6657C8366m4283L2387Q868j03324l031R8265R3783N760l3365k7902j1436o0317
$$ 38366 -5917 26470 35338 -67986 -71017 27248 121031 126791 93426 65524 54088 -6229
6645f229o5419M544M4663N6361M5633k5918J22246P9967l0189p0401P032j08006
$$ -6229 -71648 -67104 -22441 33920 79553 53635 175881 255848 225659 155258 162290 54284
6633E4284m541K9215j1024j7214m2401J7511k2568k774k0700n806Q1315k2984
$$ 54284 49743 78958 67934 50720 8319 25830 3262 488 -20212 -26018 55297 32313
6621C2313j1298L9l9016K7162M946m0663L5539J1007l0327P4327P0854m6839n3991
$$ 32313 21015 21054 -17962 9200 14146 -26517 9022 20029 -10298 64029 134883 88044 34053
6608C4053o2273n7748J07149O8590l5175n9427L3444J00062j04427k5062j6316
$$ 34053 -28220 -85968 21181 89771 54596 -4831 28613 128675 24248 -814 -17130
6597a7130r8320o901O5134N5376j3630J2361P0284R0632M2771p8604p951K3634
$$ -17130 -115450 -122351 -57217 -1841 -15471 -3110 67174 157806 200577 121973 114022 137656
6585A37656p3007J775l581k8377M581J4494L2285l0758J1587k3562m0280L2550
$$ 137656 64649 66424 62843 34466 39047 53541 85826 55068 66655 43093 2813 35363
6573C5363M0538l2376m5886o5942L7736J22029L3475k5155O7133n05j8198l3242
$$ 35363 75901 43525 -2361 -68303 -30567 91462 124937 99782 166915 166410 148212 114970
6561A14970m3873N896L8511j2375p3177k5394m3095m4679p9009M2398J40372n910
$$ 114970 71097 76993 115504 103129 29952 4558 -38537 -83216 -162225 -119827 20545 14635
6549A4635n8141M0477R9359j2036o8677q573k7854R905N6514j9026n7946j10076
$$ 14635 -43506 -3029 96330 84294 15617 7044 -20810 -10905 45609 26583 -31363 -141439
6537a41439J2168j7497N3279R7359p71k9265L4565m2484M3930L7036n4530l7320
$$ -141439 -129271 -146768 -93489 3870 3099 -26166 8399 -34085 9845 46881 -7649 -44969
6525d4969n4191J3828J93999N3562l8515P324n0253m3458K7745r749m4088o599
$$ -44969 -99160 -85332 108667 162229 123714 131038 80785 37327 65072 55323 11235 4636
6513D636j3686p0747l0577m2362M8480k2432N1090m1228r0719J25372J56820K7725
$$ 4636 -9050 -79797 -110374 -152736 -104256 -126688 -75598 -116826 -207545 -82173 74647 102372
6501A02372j0805p9049k1535K3050L0272l0394N901n21J5543l8910m6711o749
$$ 102372 91567 12518 -9017 14033 44305 13911 19812 19291 34834 -4076 -50787 -57536
6489e7536L2185O3356k3789j8650n457p3827K8547M189m8812k1114N2376O5309
$$ -57536 -25351 38005 14216 -4434 -9891 -83718 -55171 -50982 -99794 -120908 -68532 -3223
6477c223n270P2035q760j13115k4913M9504N9094q8141j5661P3176Q5821K7600
$$ -3223 -8493 63542 54782 -58333 -83246 -33742 25352 -62789 -78450 -5274 80547 108147
6465A08147k2880m1021n2387l0434j8352m3953M4665R8493q328j0244O2868o6999
$$ 108147 85267 44246 -8141 -38575 -56927 -100880 -56215 42278 33950 23706 86574 19575
6453A9575o540N8995J0782O6364K0067M505j9149q2749j4469l3526r4340m2927
$$ 19575 13035 72030 82812 149176 169243 173748 154599 71850 57381 23855 -70485 -113412
6441a13412l090m9107j5072N929N8932K4510n154j6038N9001Q6648P4556m4101
$$ -113412 -116502 -165609 -180681 -174752 -115820 -91310 -96464 -112502 -53501 33147 107703 63602
6429F3602p1112n1827L4113N7578n7662k1909J8845k7524O6640R0247M078r6570
$$ 63602 -7510 -59337 -25224 32354 -25308 -47217 -28372 -55896 10744 100991 105069 8499
6417H499m6371k1444L4646J1091K7035J7850n3812K715n0263m4467J18109O3523
$$ 8499 -37872 -59316 -24670 -13579 13456 31306 -22506 -19791 -70054 -114521 3588 67111
6405F7111k3483q2053j4216p4378l818O919M9913L243M6128L2860j98N9226m9031
$$ 67111 43628 -38425 -52641 -127019 -130837 -123918 -74005 -70762 -24634 8226 8028 67254 18223
$$ [...]
##END NTUPLES=NMR SPECTRUM
##END=
