##TITLE=Analysis number 314681
Compound Code rh 01494
Project Code adrs
Chemist Name molekula
##JCAMPDX= 6.0         $$ Bruker NMR JCAMP-DX V2.0
##DATA TYPE= NMR SPECTRUM
##DATA CLASS= NTUPLES
##ORIGIN= Bruker BioSpin GmbH
##OWNER= NMR
$$ XWIN-NMR		Version 3.5
$$ Mon Oct 24 11:50:14 2005 GMT Daylight Time (UT+1h)  MAYBRIDGE\NMR@NMR_250MHZ
##.OBSERVE FREQUENCY= 250.131544655141
##.OBSERVE NUCLEUS= ^1H
##.ACQUISITION MODE= SIMULTANEOUS (DQD)
##.ACQUISITION SCHEME= undefined
##.AVERAGES= 16
##.DIGITISER RES= 18
##SPECTROMETER/DATA SYSTEM= dpx250
##.PULSE SEQUENCE= zg30
##.SOLVENT NAME= DMSO
##.SHIFT REFERENCE= (INTERNAL, DMSO, 0, 16.522)
##AUDIT TRAIL= $$ (NUMBER, WHEN, WHO, WHERE, WHAT)
$$ ##TITLE= Audit trail, XWIN-NMR		Version 3.5
$$ ##JCAMPDX= 5.01
$$ ##ORIGIN= Bruker BioSpin GmbH
$$ ##OWNER= NMR
$$ C:\u/data/dgb/nmr/ADRS/11280/pdata/1/auditp.txt
$$ ##AUDIT TRAIL=  $$ (NUMBER, WHEN, WHO, WHERE, WHAT)
(   1,<2005-10-24 11:49:40.69 +100>,<MAYBRIDGE\NMR>,<NMR_250MHZ>,
      <created by zg, POWCHK disabled, PULCHK disabled
       configuration hash MD5:
       62 19 C7 07 E1 42 D1 B7 37 6C 3D D0 77 39 F9 E6
       data hash MD5: 64K
       66 01 DC F5 92 70 47 F9 84 13 39 EF A5 5D F3 3F>)
(   2,<2005-10-24 11:49:55.89 +100>,<MAYBRIDGE\NMR>,<NMR_250MHZ>,
      <Start of raw data processing
       ef LB = 0.3 FT_mod = 6 PKNL = 1 SI = 32K 
       data hash MD5: 32K
       75 57 C8 43 C9 E4 69 03 80 BD 38 61 6D D7 F2 12>)
(   3,<2005-10-24 11:50:01.39 +100>,<MAYBRIDGE\NMR>,<NMR_250MHZ>,
      <apk 
       data hash MD5: 32K
       6A 83 C4 EE 38 98 7D 00 CD FA 02 70 A4 59 25 81>)
(   4,<2005-10-24 11:50:03.05 +100>,<MAYBRIDGE\NMR>,<NMR_250MHZ>,
      <abs ABSG = 5 
       data hash MD5: 32K
       B1 75 DE DA E4 BE E7 71 0F 6C E9 02 40 45 0E 38>)
$$ ##END=
$$ 
$$ hash MD5
$$ A8 AA 36 8B 85 7E D7 6F 97 43 72 74 40 9A DE F7
##$RELAX= 
##$RELAX= 
##$RELAX= 
##$RELAX= 
##$RELAX= 
##$RELAX= 
##$RELAX= 
$$ Bruker specific parameters
$$ --------------------------
##$DU= <C:\u>
##$EXPNO= 11280
##$NAME= <ADRS>
##$PROCNO= 1
##$TYPE= <nmr>
##$USER= <dgb>
##$AMP= (0..31)
100 100 100 100 100 100 100 100 100 100 100 100 100 100 100 100 100 100 
100 100 100 100 100 100 100 100 100 100 100 100 100 100 
##$AQSEQ= 0
##$AQ_mod= 3
##$AUNM= <au_zg>
##$AUTOPOS= <16 >
##$BF1= 250.13
##$BF2= 250.13
##$BF3= 250.13
##$BF4= 250.13
##$BF5= 500.13
##$BF6= 500.13
##$BF7= 500.13
##$BF8= 500.13
##$BYTORDA= 1
##$CFDGTYP= 0
##$CFRGTYP= 5
##$CHEMSTR= <none>
##$CNST= (0..31)
1 1 145 1 1 1 1 1 1 1 1 1 1 1 1 1 1 1 1 1 1 1 1 1 1 1 1 1 1 1 1 1 
##$CPDPRG= <>
##$CPDPRG1= <>
##$CPDPRG2= <>
##$CPDPRG3= <>
##$CPDPRG4= <mlev>
##$CPDPRG5= <mlev>
##$CPDPRG6= <mlev>
##$CPDPRG7= <mlev>
##$CPDPRG8= <mlev>
##$CPDPRGB= <>
##$CPDPRGT= <>
##$D= (0..31)
0 1 0 0 0 0 0 0 0 0.06 0 0 0 0 0 0 0.0002 0 0 0 0 0 0 0 0 0 0 0 0 0 0 
0 
##$DATE= 1130150978
##$DBL= (0..7)
120 120 120 120 120 120 120 120 
##$DBP= (0..7)
150 150 150 150 150 150 150 150 
##$DBP07= 0
##$DBPNAM0= <>
##$DBPNAM1= <>
##$DBPNAM2= <>
$$ [...]
##$SUBNAM7= <"">
##$SUBNAM8= <"">
##$SUBNAM9= <"">
##$SW= 20.6930455092707
##$SWIBOX= (0..15)
0 0 3 0 0 0 0 0 0 0 0 0 0 0 0 0 
##$SW_h= 5175.983436853
##$TD= 65536
##$TD0= 1
##$TE= 296.16
##$TE2= 300
##$TE3= 300
##$TEG= 300
##$TL= (0..7)
0 120 120 120 120 120 120 120 
##$TP= (0..7)
150 150 150 150 150 150 150 150 
##$TP07= 0
##$TPNAME0= <>
##$TPNAME1= <>
##$TPNAME2= <>
##$TPNAME3= <>
##$TPNAME4= <>
##$TPNAME5= <>
##$TPNAME6= <>
##$TPNAME7= <>
##$TPOAL= (0..7)
0.5 0.5 0.5 0.5 0.5 0.5 0.5 0.5 
##$TPOFFS= (0..7)
0 0 0 0 0 0 0 0 
##$TUNHIN= 0
##$TUNHOUT= 0
##$TUNXOUT= 0
##$USERA1= <user>
##$USERA2= <user>
##$USERA3= <user>
##$USERA4= <user>
##$USERA5= <user>
##$V9= 5
##$VALIST= <valist>
##$VCLIST= <CCCCCCCCCCCCCCC>
##$VD= 0
##$VDLIST= <DDDDDDDDDDDDDDD>
##$VPLIST= <PPPPPPPPPPPPPPP>
##$VTLIST= <TTTTTTTTTTTTTTT>
##$WBST= 1024
##$WBSW= 4
##$XGAIN= (0..3)
0 0 0 0 
##$XL= 0
##$YL= 0
##$YMAX_a= 532639
##$YMIN_a= -535522
##$ZGOPTNS= <>
##$ZL1= 120
##$ZL2= 120
##$ZL3= 120
##$ZL4= 120
##$ABSF1= 16.522
##$ABSF2= -4.171173
##$ABSG= 5
##$ABSL= 3
##$ALPHA= 0
##$AQORDER= 0
##$ASSFAC= 0
##$ASSFACI= 0
##$ASSFACX= 0
##$ASSWID= 0
##$AUNMP= <proc_1d>
##$AZFE= 0.1
##$AZFW= 0.1
##$BCFW= 0
##$BC_mod= 0
##$BYTORDP= 0
##$COROFFS= 0
##$CY= 12.5
##$DATMOD= 1
##$DC= 0
##$DFILT= <>
##$DTYPP= 0
##$F1P= 14.0000005364418
##$F2P= -0.99999901652339
##$FCOR= 0.5
##$FTSIZE= 32768
##$FT_mod= 6
##$GAMMA= 0
##$GB= 0
##$INTBC= 1
##$INTSCL= 1
##$ISEN= 128
##$LB= 0.3
##$LEV0= 0
##$LPBIN= 0
##$MAXI= 10000
##$MC2= 0
##$MEAN= 0
##$ME_mod= 0
##$MI= 0
##$NCOEF= 0
##$NC_proc= -3
##$NLEV= 6
##$NOISF1= 0
##$NOISF2= 0
##$NSP= 0
##$NTH_PI= 0
##$NZP= 0
##$OFFSET= 16.522
##$PC= 1
##$PHC0= -81.83672
##$PHC1= 4.995441
##$PH_mod= 1
##$PKNL= yes
##$PPARMOD= 0
##$PSCAL= 4
##$PSIGN= 0
##$REVERSE= no
##$SF= 250.13
##$SI= 32768
##$SIGF1= 0
##$SIGF2= 0
##$SINO= 400
##$SIOLD= 32768
##$SREGLST= <1H.DMSO>
##$SSB= 0
##$STSI= 32768
##$STSR= 0
##$SW_p= 5175.98343685301
##$SYMM= 0
##$S_DEV= 0
##$TDeff= 65536
##$TDoff= 0
##$TI= <Analysis number 999999
Compound Code 99
Book Reference 9
Project Code 9>
##$TILT= no
##$TM1= 0
##$TM2= 0
##$TOPLEV= 0
##$USERP1= <user>
##$USERP2= <user>
##$USERP3= <user>
##$USERP4= <user>
##$USERP5= <user>
##$WDW= 1
##$XDIM= 32768
##$YMAX_p= 422433762
##$YMIN_p= -397262
$$ End of Bruker specific parameters
$$ ---------------------------------
##NTUPLES= NMR SPECTRUM
##VAR_NAME=  FREQUENCY,     SPECTRUM/REAL,   SPECTRUM/IMAG
##SYMBOL=    X,             R,               I
##VAR_TYPE=  INDEPENDENT,   DEPENDENT,       DEPENDENT
##VAR_FORM=  AFFN,          ASDF,            ASDF
##VAR_DIM=   32768,         32768,           32768
##UNITS=     HZ,            ARBITRARY UNITS, ARBITRARY UNITS
##FACTOR=    0.157963299565203, 1,           1
##FIRST=     4132.6476996994, 0,             0
##LAST=      -1043.33573715361, 0,           0
##MIN=       -1043.33573715361, -397262,     0
##MAX=       4132.6476996994, 422433762,     0
$$ Real data points
##PAGE= N=1
##DATA TABLE= (X++(R..R)), XYDATA
$$ [...]
16207A1868j0169k9285Q343J2336R732J6464O032J658l2339O733q775j0332p675
$$ 11868 1699 -27586 -19243 -6907 2825 19289 25321 26979 -5360 1373 -7402 -17734 -25409
16194b5409J4652p078j1688K3990J9492J5140k1734r489o02j4609j1583J9214
$$ -25409 -10757 -17835 -29523 -5533 13959 29099 7365 -2124 -2726 -17335 -28918 -9704
16182i704R53j9117J1403J7251M0690j071j947k0819l0309j8330J3510J1310K6968
$$ -9704 -8751 -27868 -16465 786 41476 40405 38458 17639 -12670 -31000 -17490 -6180 20788
16169B0788l878o962J0971p635k530N303j0054O30j509o509j665j6199K617k527
$$ 20788 16910 9948 20919 13284 10754 16057 6003 6633 5124 -1385 -3050 -19249 -16632 -19159
16155a9159q038O151L5039K7547j6740j4380J4615R849j0169J881j288j857j7303
$$ -19159 -27197 -21046 13993 41540 24800 10420 25035 34884 24715 26596 25308 23451 6148
16142F148o037J7176j5608k2964N764J9066J8111M195j983k6483j5092j0081Q390
$$ 6148 111 17287 1679 -21285 -15521 3545 21656 25851 23868 -2615 -17707 -27788 -19398
16129a9398R654p455l059J7835p494k2146n258j0188M565M031R467P71j5928j2694
$$ -19398 -9744 -17199 -20258 -2423 -9917 -32063 -37321 -47509 -42944 -38913 -29446 -28675 -44603 -57297
16115e7297K187r023K7837K0702L3400J2072l49j5335k008l3788q123P769K8092
$$ -57297 -55110 -64133 -36296 -15594 17806 29878 29529 14194 12186 -21602 -29725 -21956 6136
16102F136L7187L372n601j9925l825m25n482r928k884K308J8171K522j1171j9435
$$ 6136 43323 46695 41094 21169 17344 16919 11437 1509 -1375 933 19104 21626 10455 -8980
16088h980p510n060j0008o331J00L491K468N508n571O691M790j0073J5546J6057
$$ -8980 -16490 -21550 -31558 -37889 -37789 -34298 -31830 -26322 -31893 -25202 -20412 -30485 -14939 1118
16074A118j4397K671J3149m107p1o917J5496J5691M753J5041q628k5261J5469
$$ 1118 -13279 -10608 2541 -1566 -1637 -8554 6942 22633 27386 42427 33799 8538 24007
16061B4007J4019j8727l5333O030o523k9257J6123K6007k432j0903j2918J8422
$$ 24007 38026 19299 -16034 -10004 -16527 -45784 -29661 -3654 -6086 -16989 -29907 -11485
16049a1485O324p934o27P430M186J4038P756p434J1323k993J4403N490k629n592
$$ -11485 -5161 -13095 -13722 -6292 -2106 11932 19688 12254 23577 20584 34987 40477 37848 32256
16035C2256j1638J4278q073k9230R161R858j0271l138j3373r354k660m167J515
$$ 32256 20618 34896 26823 -2407 6754 16612 6341 3203 -10170 -19524 -22184 -26351 -24836
16022b4836R839j2647P763L579K0718o152L976o345j7145r59n0j6380r49P148
$$ -24836 -14997 -27644 -19881 -16302 4416 -1736 2240 -4105 -21250 -22209 -22259 -38639 -39588 -32440
16008c2440J606K7113J2495J0122p075q704j6780O907L185j4289k660j3856J8255
$$ -32440 -30834 -3721 8774 18896 11821 3117 -13663 -6756 -3571 -17860 -20520 -34376 -16121
15995a6121J3537J0258J0829M778k900k8285n187J5293M165O451o722j7443k5270
$$ -16121 -2584 7674 18503 23281 20381 -7904 -13091 2202 6367 12818 6096 -11347 -36617
15982c6617m841J0100J9426K5826Q044j3799j9105K6385R644j5028m705L604R609
$$ -36617 -41458 -31358 -11932 13894 21938 8139 -10966 15419 25063 10035 5330 8934 18543
15969A8543J4084O636j6732j3282p020j1258J0880o15j8343R718Q009M552j6611
$$ 18543 32627 39263 22531 9249 2229 -9029 1851 1236 -17107 -7389 620 5172 -11439
15956a1439J1894l805R584K549l2921q88J7086j3797m805J9591j1585l0414P592
$$ -11439 455 -3350 6234 8783 -24138 -25026 -7940 -21737 -26542 -6951 -18536 -48950 -41358
15943d1358M2383L080j9554j8700K0779K1251m225j5600j873O260k1695l87K8040
$$ -41358 1025 4105 -15449 -34149 -13370 7881 3656 -11944 -13817 -7557 -29252 -29639 -1599
15930a599J0964J4730J1568r391j2224r668J4768o932J29j4520p253n718J6094
$$ -1599 9365 24095 35663 26272 14048 4380 19148 12216 12345 -2175 -9428 -15146 948
15917I48M447J1206l662J9574l558j2945l2742j102l399J0093Q011j4084R446
$$ 948 5395 16601 12939 32513 28955 16010 -16732 -17834 -21233 -11140 -3129 -17213 -7767
15904g767R217j2084k3373k507J8440J421N359J5302K4806L111P344j7273n851
$$ -7767 1450 -10634 -34007 -36514 -18074 -16653 -11294 4008 28814 31925 39269 21996 16145
15891A6145o526k1519p377J8149O401K721K0799k0923k8130k171Q15l511J1560
$$ 16145 9619 -11900 -19277 -1128 5273 7994 28793 7870 -20260 -22431 -21616 -25127 -13567
15878a3567O463J1734M672k198k5535J3406K6341p657k9908P222n375r713j0933
$$ -13567 -7104 4630 9302 7104 -18431 -5025 21316 13659 -16249 -9027 -14402 -24115 -35048
15865c5048k2561R99K7397L4392m656j4281j4850K927J2221r730j6096J553J2619
$$ -35048 -57609 -56610 -29213 5179 523 -13758 -28608 -25681 -13460 -23190 -39286 -37733 -25114
15852b5114K3105j267r48k647J3864K2512q541j2141K689P892J8762m812j2566
$$ -25114 -2009 -3276 -4224 -6871 6993 29505 20964 8823 11512 19404 38166 33354 20788
15839B0788l6307M211l973J8418K4662P589j6287j2566k850K5487J8274k3169
$$ 20788 -15519 -11308 -15281 3137 27799 35388 19101 6535 3685 29172 47446 24277
15827B4277J669j7501l3760k3673l125J856K0130K0953P533J3881Q651k1178o611
$$ 24277 25946 8445 -25315 -48988 -52113 -50257 -30127 -9174 -1641 12240 20891 -287 -6898
15814f898j4863j2371L0342K4296j0812L868L0711J2872P078j22j1240m5250k0414
$$ -6898 -21761 -34132 -3790 20506 9694 13562 44273 57145 64223 64101 52861 7611 -12803
15801a2803K4540K1402N558J5144K0651L523k0869l7843m01M143j0107m025k6622
$$ -12803 11737 33139 38697 53841 74492 78015 57146 19303 18902 23045 12938 8913 -17709
15788a7709n324K9262l773k1175m440L5951J1365k2809k6467L308l852J1104j6096
$$ -17709 -23033 6229 2456 -18719 -23159 12792 24157 1348 -25119 -21811 -25663 -14559 -30655
15775c0655Q018J1525N393K6698J855j5102N614J5667j859R244K2812r123j0693
$$ -30655 -22637 -11112 -5719 20979 22834 7732 13346 29013 27154 36398 59210 50087 39394
15762C9394l5896l5814l683K3789L016K870j204j1353j7323j0816j8366L081K5844
$$ 39394 3498 -32316 -35999 -12210 -9194 -6324 -7528 -18881 -36204 -47020 -65386 -62305 -36461
15749c6461R337K2852J3871K86M208K9341j3043l8430l602j3320n028K708N890
$$ -36461 -27124 -4272 9599 9885 14093 43434 30391 -8039 -11641 -24961 -29989 -27281 -21391
15736b1391L514K2259J1793m055r607o384j651r457j5084j3356J7939P690L2528
$$ -21391 -17877 4382 16175 12120 2513 -3871 -5522 -14979 -30063 -43419 -25480 -17790 14738
15723A4738j6100j2867P291o923k2377q578L302R909j6625K7365L4589j3161k2857
$$ 14738 -1362 -14229 -6938 -13861 -36238 -44816 -41514 -31605 -48230 -20865 13724 563 -22294
15710b2294j5470R836N766J4433K2635K8007k1552q782P260j8436j7871O951J071
$$ -22294 -37764 -27928 -22162 -7729 14906 42913 21361 12579 19839 1403 -16468 -9517 -8446
15697h446j267l6389j4390K8503L2108L4589k4648j825K1065k2551k0877j4182
$$ -8446 -9713 -46102 -60492 -31989 119 34708 10060 8235 29300 6749 -14128 -28310
15685b8310J2005K4259J8670r750k4752k4088N141O748Q352K2621J3182o864m0751
$$ -28310 -16305 7954 26624 16874 -7878 -31966 -26825 -20077 -11725 10896 24078 17214 -23537
15672b3537K83L8516J3643k6833l6837o802j636J0496J7689K4028m6796k5984
$$ -23537 -23254 15262 28905 2072 -34765 -41567 -43203 -32707 -15018 9010 -37786 -63770
15660f3770K1726L2613l665q300J052P177L298r941o347j2541m177K4533P606
$$ -63770 -42044 -9431 -13096 -21396 -20344 -13167 -9869 -19810 -26157 -38698 -42875 -18342 -10736
15647a0736O205n955j1576j0451J0103j1369m028L650l9027Q038J4953K3607K7483
$$ -10736 -4531 -10486 -22062 -32513 -22410 -33779 -37807 -34157 -73184 -65146 -50193 -26586 897
15634H97M543J729o054j7843r292J6702K2078m773q420j6009O575l630J4325j849
$$ 897 5440 7169 1115 -16728 -26020 -9318 12760 7987 -433 -16442 -9867 -13497 828 -1021
15620a021l11J0327j3559j0024P398L235j5354l03P532J8775L1022k2364k4874
$$ -1021 -1332 8995 -4564 -14588 -7190 -3955 -19309 -19612 -12080 6695 37717 15353 -9521
15607i521J7531Q960l351j7623K1437J4471L670n496n26j2878j2585k883q66l834
$$ -9521 8010 16970 13619 -4004 17433 31904 35574 30078 29552 16674 4089 1206 340 -3494
15593c494k946K453o178J24K7725J3626M650j130k1836p655m064j0598N480j118
$$ -3494 -6440 -3987 -10165 -10041 17684 31310 35960 34830 12994 5339 1275 -9323 -3843 -4961
15579d961L845p212j2615m8057J7409K6503K4834q545j7419M0782J3619P830r029
$$ -4961 -1116 -8328 -20943 -69000 -51591 -25088 -254 -8799 -26218 14564 28183 36013 26984
15566B6984k2054l4955j3451r22K5806P587l471J6927o762M115J1019M767j7638
$$ 26984 4930 -30025 -43476 -44398 -18592 -11005 -14476 2451 -4311 -196 10823 15590 -2048
15553b048k1440j2345K4773j6923r275J0706J2262J8324J883L613J1208K090j1460
$$ -2048 -23488 -35833 -11060 -27983 -37258 -26552 -14290 4034 5917 9530 20738 22828 11368
15540A1368Q138j961j4565q694j1916J679J7044j0825j4628r201j8830J9246L8028
$$ 11368 19506 17545 2980 -5714 -17630 -15951 1093 -9732 -24360 -33561 -52391 -33145 4883
15527D883L158P509l3735k1480J7020p583K4839r42j0933q061J6415K2182m932
$$ 4883 8041 15550 -18185 -39665 -22645 -30228 -5389 -6331 -17264 -25325 -8910 13272 8340
15514H340j9356J1466P305l399j1928J0787j4896o090K5566Q030N103o577l030
$$ 8340 -11016 450 7755 4356 -7572 3215 -11681 -17771 7795 15825 20928 14351 11321
15501A1321p84j8831P606J9785j2355j7935M667Q082N889Q240M821k7698n6045
$$ 11321 10537 -8294 -688 19097 6742 -11193 -6526 1556 7445 15685 20506 -7192 -63237
15488f3237J5526L3868P554j3110K6636L3266Q509j8697j5593m6221k4080N049
$$ -63237 -47711 -13843 -6289 -19399 7237 40503 49012 30315 14722 -31499 -55579 -50530
15476e0530J1803L024J2162j1482k285j6009l429L0478M2690j037j0817m8160
$$ -50530 -38727 -35703 -23541 -35023 -37308 -53317 -56746 -26268 16422 15385 4568 -43592
15464d3592k6313M8827K1469N937k8863K5655J8766P819j1435l3315j3152P204
$$ -43592 -69905 -21078 391 6328 -22535 3120 21886 29705 18270 -15045 -28197 -20993
15452b0993m6j6919J3567J4147j856j427j1823k890j9289p536J7524L1349N598
$$ -20993 -21039 -37958 -24391 -10244 -12100 -13527 -25350 -28240 -47529 -55065 -37541 -6192 -594
15439e94P455J007J1004N881j7494J289J0010m977q741q165n786K3761j683r607
$$ -594 6861 7868 18872 24753 7259 8548 18558 13581 4840 -3325 -9111 14650 12967 3360
15425C360q846k306m283M88p648m77R691K707n098J5664N423j1000q835J6781
$$ 3360 -5486 -7792 -12075 -11587 -19235 -19712 -10021 -7314 -12412 3252 8675 -2325 -11160 5621
15411E621o337N389J3383J7837l61M733O79l4441j5308j5350L1350O935o229n086
$$ 5621 -716 4673 18056 35893 35532 40265 40944 6503 -8805 -24155 7195 14130 7901 2815
15397B815q888J6905K1022j4350k0626l7340N234K88o082L4873J4871n803J257
$$ 2815 -6073 10832 31854 17504 -3122 -40462 -35228 -34940 -41022 -6149 8722 2919 4176
15384D176p490k322K4661q869j8846O985J9492l10l913j4401J368m588j7269r227
$$ 4176 -3314 -5636 19025 10156 -8690 -1705 17787 17477 13564 -837 531 -4057 -21326 -30553
15370c0553j4782p118J7847J2005j2383J5922O8j2273j5589J1470J5877K7705
$$ -30553 -45335 -52453 -34606 -22601 -34984 -19062 -18994 -31267 -46856 -35386 -19509 8196
15358H196L6364R843k2812j7001j6190N478l6541j5091m868l370J8415O2347J5371
$$ 8196 44560 54403 31591 14590 -1600 3878 -32663 -47754 -52622 -55992 -37577 24770 40141
15345D0141r871l6943j6858L111K8116J0016j9898j7545M7983J7432j6256j7555
$$ 40141 30270 -6673 -23531 -20420 7696 17712 -2186 -19731 28252 45684 29428 11873
15333A1873R431m806j2678k0867o926J380r269J5046J5273j258k7j965o980j2126
$$ 11873 21304 16498 3820 -17047 -23973 -22593 -31862 -16816 -1543 -2801 -2828 -4793 -11773 -23899
15319b3899n300J7718O46n216k0509R468J7946q244m430j6572P536Q708J3815
$$ -23899 -29199 -11481 -10835 -16051 -36560 -27092 -9146 -17390 -21820 -38392 -30856 -22148 -8333
15306h333N1273n083j9274k1486r353M916r7j6891J2281L3695K5272j2051K105
$$ -8333 42940 37857 18583 -2903 -12256 -7340 -7437 -24328 -12047 21648 46920 34869 36974
15293C6974j8868l6035j723K222J2978k546j1637k50J1054O195K1892j5234j7667
$$ 36974 18106 -17929 -19652 -17430 -4452 -6998 -18635 -18885 -7831 -1636 20256 5022 -12645
15280a2645n286r64N113K637p032J8946M43p332J5199j4965j7257J3125Q069r932
$$ -12645 -17931 -18895 -13782 -11145 -18177 769 1212 -6120 9079 -5886 -23143 -10018 -1949 -11881
15266a1881k2967N662K9323j3121J29j1617L9k741J7948N778j1685j6536J4914
$$ -11881 -34848 -29186 137 -12984 -12855 -24472 -24433 -27174 -9226 -3448 -15133 -31669 -16755
15253a6755J5509p479K1096K0815j1438j5815l2050o006K0602J3648k1175k4449
$$ -16755 -1246 -8725 12371 33186 21748 5933 -26117 -32123 -11521 2127 -19048 -43497
15241d3497L930N0493j3809j583J0889L866j7925j2412K6284K1358j5128l2769
$$ -43497 -39567 10926 -2883 -4466 6423 10289 -7636 -20048 6236 27594 12466 -20303
15229b0303M625J8799Q549K1694q166n487j5693j3106N083l692L844j3280j1504
$$ -20303 -15678 3121 11670 33364 25198 19711 4018 -9088 -4005 -7697 -3853 -17133 -28637
15216b8637J6584k335K086K1126j1173q991n735p980J0401j749O539K5323j1997
$$ -28637 -12053 -14388 -12302 8824 -2349 -11340 -17075 -25055 -14654 -16403 -9864 15459 3462
15203C462k6505n830O423M7723m780j2155K43j7731j4068k447j16R940J6282k700
$$ 3462 -23043 -28873 -22450 25273 20493 8338 8581 -9150 -23218 -25665 -25781 -15841 441 -2259
15189b259l0382p107J8610J2413J3778k7508K0737J2347J4204k4460k414l801
$$ -2259 -32641 -39748 -21138 -8725 5053 -22455 -1718 10629 24833 373 -2041 -5842
15177e842j8677j5650m157L5137K5950j2237k2655o833N826n636k27J1763m987
$$ -5842 -24519 -40169 -44326 -9189 16761 4524 -18131 -24964 -19138 -24774 -25001 -13238 -18225
15164a8225O734K2279n413J5991k144j7214j0467M547L7745J9699j1914k6151
$$ -18225 -11491 10788 5375 21366 19222 2008 -8459 -3912 33833 53532 41618 15467
15152A5467J0563L0848J2720j975M455n56m764r453Q94j9598q57R182O118n004
$$ 15467 26030 56878 69598 67623 72078 71522 66758 57305 58199 38601 37744 46926 53044 48040
15138D8040K386L654J0472k619m00P195L0445Q802k7064l0192n874P144Q342j3397
$$ 48040 50426 54080 64552 61933 61533 68728 99173 107975 80911 50719 44845 51989 60331 46934
15124D6934J393J6761L0691L637j1777J0551q181m903L803k329o0k1813m7048
$$ 46934 48327 65088 95779 99416 87639 98190 90009 85106 88909 86580 86520 64707 17659
15111A7659j356M7422L800M102J0131m675j4528l3666J066K5866p538R699Q84
$$ 17659 16303 63725 67525 71627 81758 77083 62555 28889 29955 55821 48283 57982 58866
15098E8866k409K918Q690J4068P32k1878J1878m194k4471J4068J4126k489j8040
$$ 58866 56457 59375 68065 82133 82865 60987 72865 68671 44200 58268 72394 69905 51865
15085E1865L335L0060J3354k4840k0669k8886j914K050J0982M172j0828q493Q105
$$ 51865 55200 85260 98614 73774 53105 24219 22305 24355 35337 39509 28681 20188 28293
15072B8293J6686M568J4050J2940r283m795k726j1561j4583O018P80K3219O81
$$ 28293 44979 49547 63597 76537 67254 62459 59733 48172 33589 39607 40387 63606 64287
15059F4287k0409l2155J7656K2051J9520k1799L425L183q257L242Q248j7181P722
$$ 64287 43878 11723 29379 51430 70950 49151 52576 55759 47502 50744 58992 41811 49533
15046D9533p632j1807O535J7790n187J6376m2541k734P970J679k8800j3893j5486
$$ 49533 41901 30094 36629 54419 49232 65608 23067 20333 28303 29982 1182 -12711 -28197
15033b8197N839K3017K6476J1265J503n611k5227j0109K891o591K2788L3260j5038
$$ -28197 -22358 659 27135 38400 39903 34292 9065 -1044 1847 -4744 18044 51304 36266
15020C6266k4346P760K005k0717P962j6190J8584O053k2458j5109K121j0058K1710
$$ 36266 11920 19680 21685 968 8930 -7260 11324 17377 -5081 -20190 -18069 -28127 -6417
15007f417O888l702J3003K400K9663L4084l616j4920k2750r896k4962r598j152
$$ -6417 471 -3231 9772 12172 41835 75919 72303 57383 34633 24737 -225 -9823 -10975
14994a0975M954J5646j5890q455K372K7464N744k1386o744K0545J9021p629j7071
$$ -10975 -6021 9625 -6265 -14720 -12348 15116 20860 -526 -7270 13275 32296 24667 7596
14981G596j1046j6932p895K0613J8933n978q51o355k1385r600K3641P233k2269
$$ 7596 -3450 -20382 -28277 -7664 11269 5291 4440 -1915 -23300 -32900 -9259 -2026 -24295
14968b4295j3905K0038L7210k0408k8201l17R118M1757J2542p723k0439q753j4805
$$ -24295 -38200 -18162 19048 -1360 -29561 -29878 -20760 20997 33539 25816 5377 -3376 -18181
14955a8181l426J1208Q375j4095Q395K329J3613J9042L623o091k2929k6754K887
$$ -18181 -21607 -10399 -2024 -16119 -7724 -5395 8218 27260 30883 24792 1863 -24891 -22004
14942b2004J1836J3063P859J3862K440J1925l653o088k5552K2116N982j1099j4907
$$ -22004 -10168 2895 10754 24616 27056 38981 35328 29240 3688 25804 31786 20687 5780
14929E780O961J2238Q564j777j6928l4355p676L5887J1485L838j448P640j4341
$$ 5780 12741 24979 33543 31766 14838 -19517 -27193 8694 20179 24017 22569 30209 15868
14916A5868j2238j227J2202J6123j1472q839r476j8038k0276J0989j7285m583
$$ 15868 3630 2403 14605 30728 19256 10417 941 -17097 -37373 -26384 -43669 -48252
14904d8252K2500J7335Q180P999K975j5201q030o977j2862M446m387J4674K2342
$$ -48252 -25752 -8417 -237 7762 10737 -4464 -12494 -19471 -32333 -27887 -32274 -17600 4742
14891D742p187P132K925r847l1920J1992K3341J8066L456j719l1845j9947r180
$$ 4742 -2445 4687 7612 -2235 -34155 -22163 1178 19244 22700 20981 -10864 -30811 -39991
14878c9991J3907J9459J6826n269j5888P533q287j2221L660M3952J4838j5428
$$ -39991 -26084 -6625 10201 4932 -10956 -3423 -11710 -23931 -20271 23681 38519 23091
14866B3091j4960k6654q245O393J4485J2403n76m889j3967R705K4440J075r142
$$ 23091 8131 -18523 -26768 -20375 -5890 6513 5937 1048 -12919 -3214 21226 22301 13159
14853A3159l8030j4712P298K7431J2112P622J0364J925J0277k4603k6407k2722
$$ 13159 -24871 -39583 -32285 -4854 7258 14880 25244 27169 37446 12843 -13564 -36286
14841c6286j1082N626J7838M5081J5145j8527j7893j0033j8091k111j5747j35
$$ -36286 -47368 -41742 -23904 21177 36322 17795 -98 -10131 -28222 -30333 -46080 -46215
14829d6215K6838L226j1614j2734K2677K1434j2918O02J2101J0447R213j0350
$$ -46215 -19377 -16151 -27765 -40499 -17822 3612 -9306 -8704 3397 13844 23057 12707
14817A2707J7701J3479l2296o3j5643r790j0542J3182k4779k1751N917M322O878
$$ 12707 30408 43887 11591 11528 -4115 -13905 -24447 -11265 -36044 -57795 -51878 -47556 -40678
14804d0678j665o870j6177L0053L8948j2055k2772J4181l195l413L851r569j1536
$$ -40678 -42343 -49213 -65390 -35337 3611 -8444 -31216 -17035 -20230 -23643 -19792 -29361 -40897
14791d0897J9702J8461N68j1725k2381N304L2855K4359r101k9567j5184q850L2593
$$ -40897 -21195 -2734 -2166 -13891 -36272 -30968 1887 26246 17145 -12422 -27606 -36456 -3863
14778c863J9356K2586P761Q332M849j4610m5072j3911J4987L8544J8373k3844
$$ -3863 15493 38079 45840 54172 59021 44411 -661 -14572 415 38959 57332 33488
14766C3488l3891j9224j2053R165N155N173k112p48J176J3141l040j8856q43J4936
$$ 33488 -403 -19627 -31680 -22515 -17360 -12187 -14299 -15047 -13871 -730 -3770 -22626 -23469 -8533
14752h533O597n54K4310j4166j0252j3743p205L00j3628O292J1032J3109J503
$$ -8533 -1936 -2490 21820 7654 -2598 -16341 -23546 -23246 -36874 -30582 -19550 -6441 -4938
14739d938J930J2243q540m407J6741q231l0612j6487Q711L0058K0585J470M675
$$ -4938 -3008 9235 695 -3712 13029 4798 -25814 -42301 -33590 -3532 17053 18523 23198
14726B3198j0933m771R873j8377J9696J8038j3934j9637Q54K3915j0376l1041
$$ 23198 12265 7494 17367 -1010 18686 36724 22790 3153 4007 27922 17546 -13495
14714a3495n127k1589j914J8152K7532R040n684k6385l8620r303J2097J9610j1289
$$ -13495 -18622 -40211 -42125 -23973 3559 12599 6915 -19470 -58090 -67393 -55296 -35686 -46975
14701d6975l129P337L2635M5506j007j9538l3515j305K0251R367r094R606N479
$$ -46975 -50104 -42767 -10132 35374 34367 14829 -18686 -19991 260 9627 533 10139 15618
14688A5618l7209k6573O725L7505N707j2302L004j8125j1896L7019K7907J0754
$$ 15618 -21591 -48164 -41439 -3934 1773 -10529 -7525 -25650 -37546 -527 27380 38134
14676C8134Q63J338J2450M7698N9651M6805M1640L7235K4865K3229K0631l078
$$ 38134 38997 40335 52785 100483 160134 206939 248579 285814 310679 333908 354539 351461
14664C51461l0028n1719n8522m5190m7876l3167j2447k7562l2763P022R423J5555
$$ 351461 321433 269714 211192 166002 118126 84959 72512 44950 12187 19209 28632 44187
14652D4187j5422l2871J5309M578K397j803j6130p937n014R256J174r740k2007
$$ 44187 28765 -4106 11203 15781 18178 16375 245 -7692 -12706 -3450 -2276 -12016 -34023
14639c4023l4479k0360r30J5177L2063L3562l204j328J2741J264n677M271J4105
$$ -34023 -68502 -88862 -89792 -74615 -42552 -8990 -12194 -13522 -781 483 -5194 -923 13182
14626A3182O539J3742K1175l7525m166K8352j6970j2886j4106K150P308p107J7542
$$ 13182 19721 33463 54638 17113 12947 41299 24329 11443 -2663 -513 6795 -312 17230
14613A7230o394j3407j1216k6659J296M9712J9559k7288J8084K0606j0147k6194
$$ 17230 10836 -2571 -13787 -40446 -39150 10562 30121 2833 20917 41523 31376 5182
14601E182n974P533N156k172P938j0850k690n905l2451j0210J4543K5887J4315
$$ 5182 -792 6741 11897 9725 17663 6813 4123 -1782 -34233 -44443 -29900 -4013 10302
14588A0302K326o809J120m325K59o033Q125j812K802K0225K045k3622j4264O318
$$ 10302 12628 5819 6939 2614 2873 -3160 4965 3153 5955 26180 28225 4603 -9661 -3343
14574c343j0084j7958m564P807o388K3026J1208Q518j914K4614n734k1356n896
$$ -3343 -13427 -31385 -35949 -28142 -34530 -11504 -296 8222 6308 30922 25188 3832 -2064
14561b064o322J830J0919N111M03k1868j4446j3171L04L4340l446j5844j531Q065
$$ -2064 -8386 -6556 4363 9474 9877 -11991 -26437 -39608 -39304 -4964 -8410 -24254 -25785 -17720
14547a7720J1461j2581J1705O658Q764l418J0010Q230l0183q067L55P441K008
$$ -17720 -6259 -18840 -7135 -477 8287 4869 14879 23109 -7074 -15141 -14786 -7345 -5337
14534e337J3172Q8l871j109j6733J792Q188j1736r807J2382J2477k8638j0599
$$ -5337 7835 7923 4052 2943 -13790 -11998 -3810 -15546 -25353 -12971 -494 -29132 -39731
14521c9731l318j4188N122K9714K5200n291j5827j3873j2686J1300L4722J8890
$$ -39731 -43049 -57237 -52115 -22401 2799 -2492 -18319 -32192 -44878 -33578 1144 20034
14509B0034J239j4557q318j3914k183P045L226J0365o860L815R663m481K0404
$$ 20034 21273 6716 -1602 -15516 -17699 -10654 -7428 2937 -3923 -108 9555 5074 25478
14496B5478j0811j2708J9893q004j6369M878K0214l661J1241J1729P470j078j0482
$$ 25478 14667 1959 21852 13848 -2521 2357 22571 18910 30151 41880 49350 48272 37790
14483C7790k084j3186j3876R3o073m215j7046Q44K400m468j3684j4171M2156M8336
$$ 37790 35706 22520 8644 8737 2664 -1551 -18597 -17753 -15353 -19821 -33505 -47676 -5520 42816
14469D2816J6638k5224m387m175j7311J1634M347k1016P695J4303q995J4274q246
$$ 42816 59454 34230 29843 25668 8357 19991 24338 3322 11017 25320 16325 30599 22353
14456B2353j1260j1444j3258L208j8405J1965j0299K376J1073P592r225Q445K7828
$$ 22353 11093 -351 -13609 -10401 -28806 -16841 -27140 -24764 -13691 -6099 -15324 -6879 20949
14443B0949M556j4002P962M27j7751k8862j672J0497j6140Q76K7610J5968p060
$$ 20949 25505 11503 19465 19892 2141 -26721 -28393 -17896 -34036 -33160 -5550 10418 3358
14430C358q180k8868J0137K2006n430m601J928L158O508k8146J3771M1266O953
$$ 3358 -4822 -33690 -23553 -1547 -6977 -11578 -9650 -6492 16 -28130 -14359 26907 33860
14417C3860j8320J053P588k6724q22N274J507J4035N630q887J1195O512q169j4276
$$ 33860 15540 16593 24181 -2543 -3365 1909 3416 17451 23081 14194 25389 31901 23732 9456
14403I456k0537j3080J3654J4032j578j7690K5168J7388k3443k6897K07j9180
$$ 9456 -11081 -24161 -10507 3525 1947 -15743 9425 26813 3370 -23527 -23320 -42500
14391d2500m810J4086j4172M837n554J834J9660q171j7533m81J5714Q69J150O466
$$ -42500 -47310 -33224 -47396 -42559 -48113 -46279 -26619 -34790 -52323 -52804 -37090 -36221 -35071 -28605
14377b8605J979Q019l65j69M375J4872J1135J4310O870j0095L487r653J333Q888
$$ -28605 -26626 -18607 -18972 -19141 -14766 106 11241 25551 32421 22326 25813 16160 17493 26381
14363B6381j5987k5940j5500J1704L4026O088j2647j4018m438m166j5056M985
$$ 26381 10394 -15546 -31046 -19342 14684 20772 8125 -5893 -10331 -14497 -29553 -24568
14351b4568j4121J6748J6726J156Q925p535k7219l007Q228j4972Q255L1401P028
$$ -24568 -38689 -21941 -5215 -4059 4866 -2669 -29888 -32895 -24667 -39639 -31384 17 7045
14338G045k7534k1148J1203L9604l0046k6511J5108j7799J3339l373n457J0828
$$ 7045 -20489 -41637 -30434 9170 -20876 -47387 -32279 -50078 -36739 -40112 -45569 -34741
14326c4741J7771K0134l054q357L6048k885O419l495k7626k0294K894J0275O439
$$ -34741 -16970 3164 110 -8247 27801 24916 31335 27840 214 -20080 -17186 -6911 -472
14313d72N684j7820K8398k661k9974j531o543J3482J2966O444J0060j4124m347
$$ -472 5212 -12608 15790 13129 -16845 -18376 -24919 -11437 1529 7973 18033 3909 -438
14300d38p129J4158k256j2958P144J2100j0377j8635p718p133K5534j24J6055
$$ -438 -7567 6591 4335 -8623 -1479 10621 244 -18391 -26109 -33242 -7708 -7832 8223
14287H223J7604m052m596r021l150J2571j4021j3357q372m714k4691R177J8521
$$ 8223 25827 21775 17179 8158 5008 17579 3558 -9799 -18171 -22885 -47576 -38399 -19878
14274a9878K204J1661j1765J8928R372k3160r26N192L530k2316K513K0108m142
$$ -19878 -17674 -6013 -17778 1150 10522 -12638 -13564 -8372 -4842 -27158 -24645 -4537 -8679
14261h679M785j3o367n099l278k5407m747l883R092K9796K0088K8045M821j9171
$$ -8679 -3894 -3907 -10274 -15373 -18651 -44058 -48805 -52688 -43596 -13800 6288 34333 39154 19983
14247A9983J5235j7377k4202k8706K9137J6699K528K4921Q315l633m346r617j5797
$$ 19983 35218 17841 -6361 -35067 -5930 10769 13297 38218 46533 42900 38554 28937 13140
14234A3140K146L66j6869J6044J0674j2141m2663J4979M3451k1354j9285J7211
$$ 13140 15286 15652 -1217 14827 25501 13360 -29303 -14324 29127 7773 -11512 5699
14222E699J4778n012k0663j3864J6624R555O178J4070m32j3614M452q702Q3K5010
$$ 5699 20477 15465 -5198 -19062 -2438 7117 13295 27365 26933 13319 17771 9069 9152 34162
14208C4162J111n2360q381o616l105L700J0043J3950J3619K6967j2342j6058j4212
$$ 34162 35273 -17087 -25468 -32084 -35189 -31489 -21446 -7496 6123 33090 20748 4690 -9522
14195i522l795k974P619J7562J8118r487l157k2303K1871M112j286o288o1j3537
$$ -9522 -13317 -16291 -8672 8890 27008 17521 14364 -7939 13932 18044 16758 10470 10409 -3128
14181c128n795K350k3435j7982j0731L0025J9587k221k3398J0133M601L201J809
$$ -3128 -8923 -6573 -30008 -47990 -58721 -28696 -9109 -11330 -34728 -24595 -19994 -16793 -14984
14168a4984K2070o325o958l0397k0807J679j748K1799J5561P780O158J6719j2299
$$ -14984 7086 761 -6197 -36594 -57401 -55722 -57470 -35671 -20110 -12330 -6172 10547 -1752
14155a752K200L0364j467J542j071j3673J6512L017m701j5092k1360J3625L4066
$$ -1752 448 30812 29345 30887 29816 16143 32655 35672 30971 15879 -5481 8144 42210
14142D2210q068q750Q793L817j795k3885o504q772j9583Q579r51J0940j4134l0466
$$ 42210 34142 25392 34185 38002 36207 12322 5818 -2954 -22537 -13958 -14909 -3969 -18103 -48569
14128d8569j3172K8296K5267K1011J235k2145o827P912m934K708R327k9066m077
$$ -48569 -61741 -33445 -8178 12833 14068 -8077 -14904 -6992 -11926 -9218 109 -28957 -33034
14115c3034P943M460O446O536j0029k8323O013J5865m148J2939j0338N81j019
$$ -33034 -25091 -20631 -14185 -7649 -17678 -46001 -39988 -24123 -28271 -15332 -25670 -25089 -26108
14102b6108J2711K3817L9912p07k9745m460N764p437k2047l1949k2706L2081J3846
$$ -26108 -13397 10420 50332 49625 19880 15420 21184 13747 -8300 -40249 -62955 -30874 -17028
14089a7028l011R559L5089J784k6161k7366O754Q502J1741p173q108j3243l5892
$$ -17028 -20039 -10480 24609 26393 232 -27134 -20380 -11878 -137 -7310 -15418 -28661 -64553
14076f4553k891K6543P720p187J6257J1202o515k6278N3m520M668M1809Q666p55
$$ -64553 -67444 -40901 -33181 -40368 -24111 -12909 -19424 -45702 -45649 -50169 -45501 -3692 4974 4219
14062D219J4113j4224m2596j9132J033n192J1013k3138r988M2731L4320m551J061
$$ 4219 18332 4108 -38488 -57620 -56587 -61779 -50766 -73904 -83892 -41161 -6841 -11392 -10331
14049a0331Q008M240L397N264k2928p534j6017Q058J3094O215j7962j6303J4987
$$ -10331 -2323 1917 5314 10578 -12350 -19884 -35901 -27843 -14749 -8534 -26496 -42799 -27812
14036b7812k16j76j0578N916K0066J0899k1332o628l189J5604m349m870J2354
$$ -27812 -28028 -28204 -38782 -32866 -12800 -1901 -23233 -29861 -33050 -17446 -21795 -26665 -14311
14023a4311j2250l111L4311p611j3988J2454l590j5419j2626J2019L164P485K751
$$ -14311 -26561 -29672 4639 -2972 -16960 -4506 -8096 -23515 -36141 -24122 -20958 -13473 -10722
14010a0722r792J0167M975K0254j546j2586p610J0767Q006p702O252O532k1603
$$ -10722 -20514 -10347 -5372 14882 13336 750 -6860 3907 11913 4211 10463 16995 -4608
13997d608P359P072o0O547k643k7819m084K3243n718l6062Q593K5220n229K7215
$$ -4608 2751 9823 9763 16310 13667 -14152 -18236 5007 -711 -36773 -28180 -2960 -8189 19026
13983A9026K290j0783j7429q50J60j2214J4960O308k073Q927j2245k3923j3474
$$ 19026 21316 10533 -6896 -7746 -7586 -19800 -4840 1468 -605 8322 -3923 -27846 -41320
13970d1320J0840R767J2591J9027K4818J5559k2574m832K370q744q331j5148p549
$$ -41320 -30480 -20713 -8122 10905 35723 51282 28708 23876 26246 17502 9171 -5977 -13526
13957a3526j7723j2121N858J0226L352K3237j37k878J0064r961m466N433l981
$$ -13526 -31249 -43370 -37512 -27286 -23934 -697 -834 -3712 6352 -3609 -8075 -2642 -6623
13944f623P398p923m477m249L251k982l9097k8038J3495M2541J8921j2611j2236
$$ -6623 775 -7148 -11625 -15874 -12623 -15605 -54702 -82740 -69245 -26704 -7783 -20394 -32630
13931c2630n411p901j9076k1215j7461J1692J5970L2281J8609J2359n6j480N202
$$ -32630 -38041 -45942 -65018 -86233 -103694 -92002 -76032 -43751 -25142 -12783 -12839 -14319 -9117
13918i117J1163j969j6063L62J3440J4723J7109j7637k5015J9681p698N737Q539
$$ -9117 2046 77 -15986 -15624 -2184 12539 29648 12011 -13004 6677 -1021 4716 13255
13905A3255k4563j9657K1612K1493J4861j7092k3603j7289K1839K9208j810q481
$$ 13255 -11308 -30965 -9353 12140 27001 9909 -13694 -30983 -9144 20064 18254 9773
13893I773J2442L739o419k8514l0916J3455J9344J4570o888k2104j086J00J141
$$ 9773 22215 25954 19535 -8979 -39895 -26440 -7096 7474 586 -21518 -22604 -22504 -21363
13880b1363p975j5440k606N056M275J6973K5325J7293J27l666J531J5515o64j8218
$$ -21363 -29338 -44778 -47384 -42328 -38053 -21080 4245 21538 21665 17999 19530 35045 34381 16163
13866A6163j7476j4371j3104J4729J8789J1373j4167r776J1535M121k5870o968
$$ 16163 -1313 -15684 -28788 -14059 4730 16103 1936 -7840 3695 7816 -18054 -25022
13854b5022r52J2980k582j0578k377j8298P502J2603K4560K7204K1129m908j1363
$$ -25022 -25974 -12994 -15576 -26154 -28531 -46829 -39327 -26724 -2164 25040 46169 41261 29898
13841B9898P075j7381k2200n912P594j8684j8361J8499K2382M783K5223k910l0526
$$ 29898 36973 19592 -2608 -8520 -926 -19610 -37971 -19472 2910 7693 32916 30006 -520
13828e20j7490k273j38m82j058l32J192K6938J0594M363J9676j0513k2255j052
$$ -520 -18010 -20283 -20421 -20903 -21961 -22293 -21101 5837 16431 20794 40470 29957 7702 6650
13814F650J5258j2189j5843L3007J7556K904n493J5348K70o189j2677J0896p112
$$ 6650 21908 9719 -6124 26883 44439 47343 41850 57198 57468 51279 38602 49498 42386
13801D2386p121j4715J4301J071P715K7222k388J8405k435o954K2442J5528J5412
$$ 42386 35265 20550 34851 35922 43637 70859 68471 86876 84441 77487 99929 115457 130869
13788A30869P321K3150J6569J8440j009j9074J0048N9405M2515J4844J228j0545
$$ 130869 138190 161340 177909 196349 195340 176266 186314 245719 288234 303078 304306 293761
13776B93761M178K1399J5509L7650M4735m984Q867N291J1604l224j2557J4710
$$ 293761 297939 319338 334847 372497 417232 412248 421115 426406 438010 434786 422229 436939
13764D36939K4240R998J4512J3098q956j2647l139j6403l542j7284j9823k1987
$$ 436939 461179 471177 485689 498787 489831 477184 474045 457642 454100 436816 416993 395006
13752C95006q579P42m5830k9300j3774q465j4768k5063k3602j2222K34k3850m569
$$ 395006 386427 387169 341339 312039 298265 289800 275032 249969 226367 214145 214379 190529 185960
13739A85960k1437k9561j2757n889k2021j4276j2869j1097n271j5896L666J2265
$$ 185960 164523 134962 122205 116316 94295 80019 67150 56053 50782 34886 38552 50817
13727E0817L073j1345o728Q322j4297o276k3181k161l195j8860K0160K8170j2596
$$ 50817 53890 42545 35817 44139 29842 23566 385 -1776 -4971 -23831 -3671 24499 11903
13714A1903P147Q954J2658k020l8612p023J6809J0868n444j169K79K3248j352
$$ 11903 19050 28004 40662 38642 30 -6993 9816 20684 15240 14071 14350 37598 36246
13701C6246P04o918j050l1057l2330R231M050L1627K0296k3691j9020q7P364Q090
$$ 36246 36950 30032 28982 -2075 -34405 -25174 -21124 10503 30799 7108 -11912 -11999 -4635 3455
13687C455j3570j440O613J0672k345m309j509J523j36Q158R685q569j2926j5539
$$ 3455 -10115 -11555 -4942 5730 3385 -924 -2433 -910 -1046 7112 16797 8228 -4698 -20237
13673b0237l6721J640L8495Q065L2824J5138j3712k9183n866m341k4419j7512
$$ -20237 -56958 -55318 -16823 -8758 24066 39204 25492 -3691 -9557 -13898 -38317 -55829
13661e5829J4244M0430M383l972P353k5697j7078J4344L0212M761O358j4279k6512
$$ -55829 -41585 -1155 3228 -744 6609 -19088 -36166 -21822 8390 13151 19509 5230 -21282
13648b1282J12K823p24K091Q495J629J1722J765J000n410p504J8179K4577L5798
$$ -21282 -21170 -18347 -19071 -16980 -8485 -6856 4866 6631 7631 2221 -5283 12896 37473 73271
13634G3271j9315k9522O395o938K435j197j8844k0002M103J5886r48o40m009k6343
$$ 73271 53956 24434 30829 23891 26326 25129 6285 -13717 -9614 6272 5324 4684 675 -25668
13620b5668m456j3387j0506J1907L5418L1259M739k343O94Q746J4074q120l1178
$$ -25668 -30124 -43511 -54017 -42110 -6692 24567 29306 26963 27657 36403 50477 42357 11179
13607A1179k1565K75J3933N583j0172N308j6286J0708J4331q145l1738K9564K2094
$$ 11179 -10386 -10111 3822 9405 -767 4541 -11745 -1037 13294 5149 -26589 2975 25069
13594B5069j759M628l0056j3944L247j1091p584J0780m664J5733R231k256r832
$$ 25069 23310 27938 -2118 -16062 -12815 -23906 -31490 -20710 -25374 -9641 -410 -2666 -12498
13581a2498L012l191l905M771R624l470p730m894J995j2166k167K151O181J2086
$$ -12498 -9486 -12677 -16582 -11811 -2187 -5657 -13387 -18281 -16286 -28452 -30619 -28468 -22287 -10201
13567a0201j6665p25J1519Q973L651m479J9803K3745l5573k5565k7657r464J0040
$$ -10201 -26866 -27591 -16072 -7099 -3448 -7927 11876 35621 48 -25517 -53174 -62638 -52598
13554e2598J7068Q973j5979q053K6241K60j9732q948k6693m106L951J4369O537
$$ -52598 -35530 -26557 -42536 -50589 -24348 -24088 -43820 -52768 -79461 -83567 -79616 -65247 -58710
13541e8710K9747Q867J4050J0158K5005q513k1664l4664k2927J2819K2822n238
$$ -58710 -28963 -20096 -6046 4112 29117 20604 -1060 -35724 -58651 -45832 -23010 -28248
13529b8248j4006J7394J1535K1306k1021j6789J7218J5347J533l761q125j0400
$$ -28248 -42254 -24860 -13325 7981 -13040 -29829 -12611 2736 4269 508 -7617 -18017
13517a8017j3904J855P830Q219L161k6452j7268K5595M5879M158l100j8633j3618
$$ -18017 -31921 -30066 -22236 -14017 -10856 -37308 -54576 -28981 16898 21056 17956 -677 -14295
13504a4295K428K4784L8407J877k1623K217k0919j4894l44J8392K873l5394k3975
$$ -14295 -11867 12917 51324 53201 31578 33795 12876 -2018 -2362 16030 18903 -16491 -40466
13491d0466Q40L262K3211M807n160l887N029q056J955P417J1557m332o264l6761
$$ -40466 -39626 -36364 -13153 -8346 -13506 -17393 -12364 -20420 -18465 -11048 509 -3823 -10087 -46848
13477d6848N98R819J6287n317O686j4016j5915j7446O639N152J2136J1383K792
$$ -46848 -46250 -36431 -20144 -25461 -18775 -32791 -48706 -66152 -59513 -54361 -42225 -30842 -28050
13464b8050L3943J3794j7939M260N627O035L929j7089r688j3494p578R368J7660
$$ -28050 5893 19687 1748 6008 11635 17670 21599 4510 -5178 -18672 -26250 -16882 778
13451G78q3l3232R101K2637j324j3789r170L128M569p120k5034p902J3408J4911
$$ 778 695 -32537 -23436 -799 -2123 -15912 -25082 -21954 -17385 -24505 -49539 -57441 -44033 -29122
13437b9122K3881K7507j2444l2437J6435O394J6218P582k5685k301j0107J3316
$$ -29122 -5241 22266 9822 -22615 -6180 214 16432 24014 -1671 -3972 -14079 -763
13425g63K0965j491j3691k2038k5982j1422N380K2855J6457P468L0668j25q85
$$ -763 20202 18711 5020 -17018 -43000 -54422 -49042 -26187 -9730 -2262 28406 28281 27396
13412B7396k9745j9661j9251K2680K2099k281m309j1965l250J0725q126l051J6757
$$ 27396 -2349 -22010 -41261 -18581 3518 1237 -3072 -15037 -18287 -7562 -15688 -18739 -1982
13399a982K9582m336l5964j4271P589J0033p71J4611J2333m928j4541K2866R507
$$ -1982 27600 23264 -12700 -26971 -19382 -9349 -10120 4491 16824 11896 -2645 20221 29728
13386B9728j6446j1370j2888J8730J7401j4453j7985j2679j3273r603K0933J4538
$$ 29728 13282 1912 -10976 7754 25155 10702 -7283 -19962 -33235 -42838 -21905 -7367
13374g367J6879m980j6032R132M2579J1711Q595k7783j6536r521J0974j363N877
$$ -7367 9512 4532 -11500 -2368 40211 51922 60517 32734 16198 6677 17651 16288 22165
13361B2165M666O866j6213l3817j7654o295K9854J2364j0917k1356K7638L660
$$ 22165 26831 33697 17484 -16333 -33987 -40282 -10428 1936 -8981 -30337 -2699 961
13349I61k2856Q509m383J4639J2150K745J2060J1400m282o881j2633K421k893
$$ 961 -21895 -13386 -17769 -3130 9020 11765 23825 35225 30943 24062 11429 13850 10957
13336A0957m476l482K8581m814l4819N835L9952r824j4721O296K698j6429k1810
$$ 10957 6481 2999 31580 26766 -8053 -2218 37734 27910 13189 19485 22183 5754 -16056
13323a6056L42m192J6238P137n55P673O139M281n151N680M993J4555J297l547
$$ -16056 -15714 -19906 -3668 3469 2914 10587 16726 21007 15856 21536 26529 41084 42381 38834
13309C8834j8849q046r440j0724K0643O201L668K116k201K048p409J8840j0518
$$ 38834 19985 11939 2499 -8225 12418 18619 22287 24403 22202 24250 16841 35681 25163
13296B5163j7785k971j2411k115J0341r50Q651J9697j326k9039J8485j4945k6408
$$ 25163 7378 4407 -8004 -10119 222 -728 7923 27620 26294 -2745 15740 795 -25613
13283b5613q751r246n609J1776K5362m192k1899m139J8324K0846K5865l828n095
$$ -25613 -34364 -43610 -49219 -37443 -12081 -16273 -38172 -42311 -23987 -3141 22724 18896 13801
13270A3801Q12j1000j4657j9855r742K5475K1258o661j9434j0757J0367p086O155
$$ 13801 14613 3613 -11044 -30899 -40641 -15166 6092 -569 -20003 -30760 -20393 -27479 -21324
13257b1324j972j3463J4400K5530J0307j1793l1731l239K5080k9959n653K0405
$$ -21324 -23296 -36759 -22359 3171 13478 1685 -30046 -33285 -8205 -38164 -43817 -23412
13245b3412P394k5674j0010K5405R450J6963J7469j7892j1985O783j6392p498
$$ -23412 -16018 -41692 -51702 -26297 -16847 116 17585 -307 -12292 -5509 -21901 -29399
13233b9399J3049J9417K6364J3713j665K508J141j838k129J15k406J8304k693
$$ -29399 -16350 3067 29431 43144 41479 43987 45128 43290 41161 41276 38870 57174 54481
13220E4481j481j7347q049L517o820J5080J6836k8994j7442K420r240J650J2264
$$ 54481 53000 35653 27604 31121 24301 39381 56217 27223 9781 12201 2961 4611 16875
13207A6875n431M423M503j2218k356M589M887K1868M693k9768P567j2334M908
$$ 16875 11444 15867 20370 8152 5796 10385 15272 37140 41833 12065 19632 7298 12206
13194A2206L2346p253k3560q269Q661Q566O337j5914o862l377K0109K8727J169
$$ 12206 44552 37299 13739 5470 14131 22697 29034 13120 6258 2881 22990 51717 52886
13181E2886P569p098J1656J3407k6507o633m93L0014j046j5674R286q221j4017
$$ 52886 60455 53357 65013 78420 51913 45280 44787 74801 73755 58081 67367 59146 45129
13168D5129n707m21m734K14K2985J261J9384j071j4237o414n910j0474K722j123
$$ 45129 39422 39001 34267 34481 57466 58727 78111 77040 62803 56389 50479 40005 42727 41604
13154D1604k087k2745j1404L4564K6117L211N096J418Q27k4776j4623j672j0361
$$ 41604 39517 16772 5368 39932 66049 69260 74356 75774 76601 51825 37202 35530 25169
13141B5169J426o777q527j1074M583K087M603L8233L0470n676l0361j0534J3776
$$ 25169 26595 19818 11291 217 4800 6887 11490 49723 80193 74517 44156 33622 47398
13128D7398K0529j479P042J186j5484j382J3943l3891k5235p687M932j2998J0560
$$ 47398 67927 66448 73490 74676 59192 57810 71753 37862 12627 4940 9872 -3126 7434
13115G434N192l308P159n054m952K385Q544J868J1107J87l16K2696L978k0059
$$ 7434 12626 9318 16477 11423 6471 8856 17400 19268 30375 30562 30246 52942 56920 36861
13101C6861l913L849j6265j8727Q156K8675J0567k5236J224Q450J6384j6628j515
$$ 36861 32948 36797 20532 1805 9961 38636 49203 23967 25191 33641 50025 33397 31882
13088C1882K6983M667J7798k4661j5215K7641k740k8226N644K8409k4064q845
$$ 31882 58865 63532 81330 56669 41454 69095 66355 38129 43773 72182 48118 39273
13076C9273j7213k5456k9459j2736K7114L0036J5421j0092j2125j1748j4130K310
$$ 39273 22060 -3396 -32855 -45591 -18477 11559 26980 16888 4763 -6985 -21115 -18805
13064a8805N144r018j0657K0181J4535n712K5995Q408j7688k2666o973J0109l9003
$$ -18805 -13661 -22679 -33336 -13155 1380 -4332 21663 30071 12383 -10283 -17256 -7147 -46150
13051d6150N909P716Q351J1297k590j1746j1509j6455P337L1279K4861J5236l232
$$ -46150 -40241 -32525 -24174 -12877 -15467 -27213 -38722 -55177 -47840 -16561 8300 23536 20304
13038B0304l0762l398j3420R715m463m957J2556j811q483K637K7384r573m534
$$ 20304 -10458 -13856 -27276 -17561 -22024 -26981 -14425 -16236 -24719 -22082 5302 -4271 -8805
13025h805K079J5148K2266J1245j6117K646L5536j0146l1477l5374l192R283j0719
$$ -8805 -6726 8422 30688 41933 25816 28462 63998 53852 22375 -12999 -16191 -6908 -17627
13012a7627j4492j8510j3769K9896O0344K147m814K6795J224l1127j7850k0612
$$ -17627 -32119 -50629 -64398 -34502 25842 27989 23175 49970 51194 20067 2217 -18395
13000a8395J05m488n24l326K6724J8014K9449P34j5497j9428j8302o100m225l536
$$ -18395 -18290 -22778 -23302 -26628 96 18110 47559 48293 32796 13368 -4934 -11034 -15259 -18795
12986a8795N288J335J7242l292j4101O504K3090M524k7523o377K8930j1198J208
$$ -18795 -13507 -12172 5070 1778 -12323 -5819 17271 21795 -5728 -12105 16825 5627 6835
12973F835k0345j9774J5271K7764k9294L51J6400R651Q645O121j9484q944J1704
$$ 6835 -13510 -33284 -18013 9751 -19543 -19192 -2792 6859 15504 21625 2141 -6803 4901
12960D901o130o915J2288k158k1357P481j128J3909L620J040k0681j1853K180
$$ 4901 -1229 -8144 4144 1986 -19371 -11890 -13018 891 4511 5551 -15130 -26983 -24803
12947b4803J8786K482Q920q210k133j999l1978M20R379j2276j636m055n430J1313
$$ -24803 -6017 -3535 5385 -2825 -4958 -6957 -38935 -38515 -29136 -41412 -43048 -47103 -52533 -41220
12933d1220j288j232j5694J9125K2867R867j7034j0024J307K5681j2091j808J2041
$$ -41220 -42508 -43740 -59434 -40309 -17442 -7575 -24609 -34633 -33326 -7645 -19736 -21544 -9503
12920i503M049k3128o974M069J0254j8613j5104j7185m214J8650J1051k012J2358
$$ -9503 -5454 -28582 -35556 -31487 -21233 -39846 -54950 -72135 -76349 -57699 -46648 -48660 -36302
12907c6302O261J3559P172k9743j1881N595Q728O376J1534J9887j202J2570m0405
$$ -36302 -30041 -16482 -9310 -39053 -50934 -45339 -36611 -30235 -18701 1186 -16 12554 -27851
12894b7851p838K9744K4265j2498j5442j0606q451j3232L895N993Q442K1121J8499
$$ -27851 -35689 -5945 18320 5822 -9620 -20226 -28677 -41909 -38014 -32021 -23579 -2458 16041
12881A6041j717l6177o310o812j0030n201K6217l818l634M249J0540j6537j8301
$$ 16041 14324 -21853 -28163 -34975 -45005 -50206 -23989 -27807 -31441 -27192 -16652 -33189 -51490
12868e1490Q953K5081R063j5061j66K234j2649P997o81p97m559J5353j633l22
$$ -51490 -42537 -17456 -8393 -23454 -23620 -21386 -34035 -26038 -26719 -27516 -32075 -16722 -18355 -18677
12854a8677j5187j5463L921K4643J8089O338J9795l146O744l169k9172q379K4368
$$ -18677 -33864 -49327 -45406 -20763 -2674 3664 23459 20313 27057 23888 -5284 -13663 10705
12841A0705J2865j4163p680o012k0016j3621k644R418O673J795J2400p920K6929
$$ 10705 23570 9407 1727 -4285 -24301 -37922 -40566 -31148 -24475 -22680 -10280 -18200 8729
12828H729P856k8623Q675q465l3246m622J155Q049J0883O644R499K642j7581n730
$$ 8729 16585 -12038 -3363 -11828 -45074 -49696 -48541 -40492 -29609 -22965 -13466 -10824 -28405 -34135
12814c4135L697Q688r723j3960j110J1296m478L0303j797l3233J2146K9401J7262
$$ -34135 -30438 -21750 -31473 -45433 -46543 -35247 -39725 -9422 -11219 -44452 -32306 -2905 14357
12801A4357k3964j7002P743K1430P413p08K884k0929j8779L189K5059K9623P408
$$ 14357 -9607 -26609 -18866 2564 9977 9269 12153 -8776 -27555 -24366 693 30316 37724
12788C7724Q484j0677Q265L272l8825J062n438l0296j2460J7422K0411k3148N898
$$ 37724 46208 35531 43796 47068 8243 9305 3867 -26429 -38889 -21467 -1056 -24204 -18306
12775a8306O209J537Q936p736l732K6869k1366l0330p646K872J512J7285J1708
$$ -18306 -12097 -10560 -1624 -9360 -13092 13777 -7589 -37919 -45565 -42693 -41181 -23896 -12188
12762a2188O367N428J324J485l6317l1266K6890K8262k0826k5376J563p493K710
$$ -12188 -5821 -393 931 2416 -33901 -65167 -38277 -10015 -30841 -56217 -54654 -62147 -59437
12749e9437J5098J4625O896M473J32j1663j2828O173J7888Q256Q057o379j0334
$$ -59437 -44339 -29714 -22818 -18345 -18213 -29876 -42704 -36531 -18643 -10387 -2330 -8709 -19043
12736a9043R538k4872m116L256M025J2232J4143j2154k9217J6578K1728K4454
$$ -19043 -9505 -34377 -38493 -35237 -31212 -18980 -4837 -16991 -46208 -29630 -7902 16552
12724A6552j586k5971j2108J648q916K6846M558j9546Q157J1702O489K3009j526
$$ 16552 14966 -11005 -23113 -21465 -30381 -3535 1023 -18523 -10366 1336 7825 30834 29308
12711B9308j0418j9673j4010P819k795J1604M083k7164k4378R405m494K4351K8759
$$ 29308 18890 -783 -14793 -6974 -9769 1835 5918 -21246 -45624 -36219 -40713 -16362 12397
12698A2397J09J6032j0298j2631K3572o270o763P878p876L837j3150j1495o92
$$ 12397 12506 28538 18240 5609 29181 22911 16148 24026 16150 19987 6837 -4658 -5350
12685e350O116J9205J4558q972k8408J4712J5157o594l1841k2496L072o915L2932
$$ -5350 766 19971 34529 25557 -2851 11861 27018 20424 -11417 -33913 -30841 -37756 -4824
12672d824K0480J59k00k0054j6538j2071q351J2836n277q00K443j3411m643J8158
$$ -4824 15656 15815 15615 -4439 -20977 -33048 -41399 -28563 -33840 -34640 -32197 -45608 -50251 -32093
12658c2093J6945L61m552N895j4498O058j2865j6774R106J3700J0170j7822q599
$$ -32093 -15148 -14787 -19339 -13444 -27942 -21884 -34749 -51523 -42417 -28717 -18547 -36369 -44968
12645d4968q894L529M4419P195J2243R959j6037k6116r258J3222L68k3787L379
$$ -44968 -53862 -50333 -5914 1281 13524 23483 7446 -18670 -27928 -14706 -14338 -38125 -34746
12632c4746N228J7960R435k9732j3707K3490Q299Q9O474M351J8115N557k892k2621
$$ -34746 -29518 -11558 -2123 -31855 -45562 -22072 -13773 -13684 -7210 -2859 15256 20813 17921 -4700
12618d700l7196j6871l806n556K7244L4666L609m460l806j4858l853L424O049
$$ -4700 -41896 -58767 -62573 -68129 -40885 -6219 -2610 -7070 -10876 -25734 -29587 -26163 -20114
12605b0114Q82q173O118N828l28j463j572l1748k8268K1514K4379r21R290l0j4557
$$ -20114 -19232 -27405 -21287 -15459 -15787 -17250 -18822 -50570 -78838 -57324 -32945 -33866 -24576 -24606 -39163
12590c9163j41k109J1085L740j088K084m074J6606K3752J0710j3767j8005J5739
$$ -39163 -39304 -41413 -30328 -26588 -27676 -25592 -29666 -13060 10692 21402 7635 -10370 5369
12577E369J0146j6286j1050j945k3959j0028J8860K2101J3345p454p6p553j0053
$$ 5369 15515 -771 -11821 -13766 -37725 -47753 -28893 -6792 6553 -901 -977 -8530 -18583
12564a8583N406n241O577J4919L6567M996j2655j6441k1408k8162J0591J045J3857
$$ -18583 -13177 -18418 -11841 3078 39645 44641 31986 15545 -5863 -34025 -23434 -22389 -8532
12551h532l945J739j4256j2120N330P486j646P912N58k851J6925k0728J2569J0057
$$ -8532 -12477 -10738 -24994 -37114 -31784 -24298 -25944 -18032 -17474 -20325 -3400 -24128 -11559 -1502
12537a502j3025j7890M846J8508Q649J8469Q545Q193M496K1494j1807k4547m054
$$ -1502 -14527 -32417 -27571 -9063 -414 18055 26600 34793 39289 60783 48976 24429 20375
12524B0375k053m75k7809l4349J536L518Q145K7960J1935q097k0935q022M420
$$ 20375 18322 17847 -9962 -44311 -42775 -39257 -31112 -3152 8783 686 -20249 -28271 -23851
12511b3851J5653P864Q550K0510L811j1101k3005j9983K3846J4802q58j9447J3794
$$ -23851 -8198 -334 8216 28726 32537 21436 -1569 -21552 2294 17096 16238 -3209 10585
12498A0585L5283J5724l6191j1650M0403J900k5344k860p958m696J231L642k3425
$$ 10585 45868 61592 25401 13751 54154 56054 30710 27850 19892 15196 16427 20069 -3356
12485c356P958L1705r297J6929k388l7139j5375M901l4584J1934M4028j1519k4646
$$ -3356 4602 36307 27010 43939 41551 4412 -10963 -6062 -40646 -28712 15316 3797 -20849
12472b0849r005p350J4287L568j9168n647K081j4071J5209J4529N876K4377l327
$$ -20849 -29854 -37204 -22917 -19349 -38517 -44164 -42083 -56154 -40945 -26416 -20540 3837 510
12459E10k7984j5349l747K2461J9398k377j6368J4852J5110N506J9464O517q990
$$ 510 -27474 -42823 -46570 -24109 -4711 -7088 -23456 -8604 6506 12012 31476 37993 29003
12446B9003j4933J1192R834J679k5070l0306j5341l546o687J6516l12l268m955
$$ 29003 14070 25262 35096 36775 11705 -18601 -33942 -37488 -44175 -27659 -27971 -31239 -36194
12433c6194o383r557n154J3559m957J3982J8245k696k5253J2994J3298R294J0962
$$ -36194 -42577 -52134 -57288 -43729 -48686 -34704 -16459 -19155 -44408 -31414 -18116 -8822 2140
12420B140j1415K163r997p337n155j2760M473J8068J4029N944J0657J720j1604
$$ 2140 -9275 -7112 -17109 -24446 -29601 -42361 -37888 -19820 -5791 153 10810 12530 926
12407I26j691K5274N284N515P10j3206L027L534j133p592k5423o229k4489K4481
$$ 926 -765 24509 29793 35308 36018 22812 25839 29373 28240 20648 -4775 -11004 -35493 -11012
12393a1012J8979K1242n084l4873J16K1503J2440q397J8846q034q142J8263j8029
$$ -11012 7967 29209 24125 -10748 -10632 10871 23311 14914 33760 25726 17584 35847 17818
12380A7818j7065j1700J6902P502J9307j8749O684J3748N054k6073j3487r511
$$ 17818 753 -10947 5955 13457 32764 14015 20699 34447 39501 13428 -59 -9570
12368i570m750q411j0363R467J0045p661K6288J3685Q979j5279k0374R842P025
$$ -9570 -14320 -22731 -33094 -23627 -13582 -21243 5045 18730 27709 12430 -7944 1898 8923
12355H923K507k6231j2472j697J9295L8873K5511k215o104j4267m326O037J101
$$ 8923 11430 -14801 -27273 -28970 -9675 29198 54709 52494 46390 32123 27797 33834 34935
12342C4935j6203l5330p758N146J8955k3781j7510Q745J5798K449p080l878j2671
$$ 34935 18732 -16598 -24356 -19210 -255 -24036 -41546 -32801 -17003 -14554 -21634 -25512 -38183
12329c8183K4096K4109j1509K579K0892j2713r742j6116K855J3922M640k0830
$$ -38183 -14087 10022 -1487 1092 21984 9271 -471 -16587 -13732 190 4830 -16000
12317a6000K0608j5383j2191P490M049j5435J6292K2502j9267K6020L1368m649
$$ -16000 4608 -10775 -22966 -15476 -11427 -26862 -10570 11932 -7335 18685 50053 45404
12305D5404j2590j3178j7151r092J340N204K8027J2369k769j3279j1563o78r05
$$ 45404 32814 19636 2485 -6607 -5267 -63 27964 40333 37564 24285 12722 12044 11139
12292A1139J5378J938l125j3309l958m937L895j1008M226j8120j3358o737K5185
$$ 11139 26517 28455 25330 12021 8063 3126 7021 -3987 239 -17881 -31239 -37976 -12791
12279a2791N838m828k083J8119m786o033K3420j480o691r665J2587j1788P783
$$ -12791 -6953 -11781 -13864 4255 -531 -6564 16856 15376 8685 -980 11607 -181 7602
12266G602n715k2801j7713p254L4842J1683j7135R66O247o281m6J3320R935j456
$$ 7602 1887 -20914 -38627 -45881 -11039 644 -16491 -15525 -9278 -15559 -15605 -2285 7650 6194
12252F194l137k0689K2953L926N738L1667j056k0675j0637k783o213j3729K308
$$ 6194 3057 -17632 5321 9247 14985 46652 45596 24921 14284 11501 5288 -8441 -6133
12239f133L85N258k676J4355j3522r303j2428R793J7715J8076J605j185j0940
$$ -6133 -5748 -490 -3166 11189 -2333 -11636 -24064 -14271 3444 21520 23125 21940 11000
12226A1000o699m401J3532R373K0846j0020l7442j3251L643m607k094j1897j5164
$$ 11000 4301 -100 13432 22805 43651 33631 -3811 -17062 -13419 -18026 -20120 -32017 -47181
12213d7181J3747L3753J2535j8183p583j0394J3763R608Q145P551J8042M347Q629
$$ -47181 -33434 319 12854 -5329 -12912 -23306 -9543 65 8210 15761 33803 38150 46779
12200D6779j5662J0313M87l8792j5602K3129J2108l3805j252L1413K6515Q45n347
$$ 46779 31117 41430 41917 3125 -12477 10652 22760 -11045 -12297 19116 45631 46476 41129
12187D1129R131r781J70k3483j5538j8553j2334J4250K4691J3359j7988J1616
$$ 41129 50260 40479 40649 17166 1628 -16925 -29259 -15009 9682 23041 5053 16669
12175A6669K509J8209L290k0474R052j021P298j0541l224j00l598j3638J9906
$$ 16669 19178 37387 40677 20203 29255 28234 35532 24991 21767 21667 18069 4431 24337
12162B4337K4410j3764j1322M94j3041J1759K418j647j972K2785J5155o947P18
$$ 24337 48747 34983 23661 24155 11114 22873 25291 23644 21672 44457 59612 52665 53383
12149E3383R921j5375K892p500N782M7l1181k3413J0171K722k878j6959J4005
$$ 53383 63304 47929 50821 43321 49103 49150 17969 -5444 4727 7449 4571 -12388 1617
12136A617J2164J0028p263k5921M249J6799L2699l077k0180j6424J3673K6696
$$ 1617 13781 23809 16546 -9375 -5126 11673 44372 41295 21115 4691 18364 45060
12124D5060o373k712K4811N708k7868O449J071j0703k9294O357K4949J8064L884
$$ 45060 38687 35975 60786 66494 38626 45075 46146 35443 6149 12506 37455 55519 59403
12111E9403P791K5048J0055l5602k8553l795K0873j6740J1602L570p112r97j3622
$$ 59403 67194 92242 102297 66695 38142 34347 55220 38480 50082 53652 46540 45543 31921
12098C1921J1012Q15K4381Q327j4846J2545j0026O252K592R526k4530j3700M432
$$ 31921 42933 43748 68129 76456 61610 74155 64129 70381 72973 82499 57969 44269 48701
12085D8701o938M710j0289n545l466j1399J6932J1525K2263J0451J308J0250L5599
$$ 48701 41763 46473 36184 30639 27173 15774 32706 44231 66494 76945 78253 88503 124102
12072A24102J2034j6053j0120J2998O242O858K2228m410j982K0400J4562l4632
$$ 124102 136136 120083 109963 122961 129203 136061 158289 153879 151897 172297 186859 152227
12060A52227l8677j4500J2313L7848K7606J539L097J8596K0059J2842l754p912
$$ 152227 113550 99050 111363 149211 176817 178356 181453 200049 220108 232950 229196 221284
12048B21284r197k1161K109K0069L938j4457J4813K9511J2934K385J2903K051
$$ 221284 212087 190926 193035 213104 217042 202585 217398 246909 259843 262228 275131 277182
12036B77182q088L002K7350O322j4932J0949L166r60K3663K7263P738k5751j0119
$$ 277182 269094 272096 299446 305768 290836 301785 304951 303991 327654 354917 362655 336904 326785
12023C26785R99L2838K7703j7136j0003P208L443K0977J5077j4584p395O7245
$$ 326785 327784 360622 388325 371189 361186 368394 371837 392814 407891 393307 385912 453157
12011D53157J2043J928J8162K7389J2247j2539O837L7976O6538J5525r468L6328
$$ 453157 465200 467128 485290 512679 524926 512387 519224 557200 623738 639263 629795 666123
11999F66123K3362L0612K5408J2469K0732K8927K8338M3749M4908M8186L7090
$$ 666123 689485 720097 745505 757974 778706 807633 835971 879720 924628 972814 1009904
11988A009904N3002M7842M9810Q0087Q5887O2250N5904Q7045J07736J16058R1315
$$ 1009904 1062906 1110748 1160558 1240645 1326532 1388782 1444686 1531731 1639467 1755525 1846840
11977A846840Q9809R9057J08375J61742K07892K19366K07257K26014K69768K44149
$$ 1846840 1936649 2035706 2144081 2305823 2513715 2733081 2940338 3166352 3436120 3680269
11967C680269L19771L53591M04522M67530N21783N92724O72513P85125Q36239
$$ 3680269 4000040 4353631 4758153 5225683 5747466 6340190 7012703 7797828 8634067
11958H634067R40210J066035J195175J254244J329557J377738J350942J211038
$$ 8634067 9574277 10640312 11835487 13089731 14419288 15797026 17147968 18359006
11950A8359006R74412P08865L59171l4646l80019o44251q81968j017087j080191
$$ 18359006 19333418 20042283 20401454 20366808 19986789 19342538 18460570 17443483 16363292
11941A6363292j086233j074282j013221r62145q95845q11406p19350o77697o39678
$$ 16363292 15277059 14202777 13189556 12227411 11331566 10520160 9800810 9123113 8483435
11932H483435n83958n20136m79441m31332m32842m12503l65435l36349l48445
$$ 8483435 7899477 7379341 6899900 6468568 6035726 5623223 5257788 4921439 4572994
11923D572994l31878k83920k39872k21517k00814k17898k11962j49533j46030
$$ 4572994 4241116 3957196 3717324 3495807 3294993 3077095 2865133 2715600 2569570
11914B569570j84030j62588j19848r7195p9379j12789j00285p3944j03030q3286
$$ 2569570 2385540 2222952 2103104 2005909 1926530 1813741 1713456 1639512 1536482 1453196
11904A453196q8110m9138n4115q9867l4357o9651o1672m5677m6301k6328j2662
$$ 1453196 1365086 1315948 1261833 1171966 1137609 1067958 1006286 960609 914308 887980 875318
11893H75318k5443n3948n2729j3988q531k7753k5889k7431n7270m6134l049M605
$$ 875318 849875 795927 743198 729210 720679 692926 667037 639606 582336 536202 533153 537758
11881E37758q151R978k5474l0134l2659k6142j4881j3119j8725P181l969k4734
$$ 537758 529607 539585 514111 483977 451318 425176 410295 397176 378451 385632 381663 356929
11869C56929j8958K2747J0895j1819k1181j0020K398N422k8250L46K2022j3857
$$ 356929 337971 360718 371613 359794 338613 328593 330991 336413 308163 308509 330531 316674
11857C16674m1117k0046j7286r475J281J5875j9389l4636m672J593o088j2053
$$ 316674 275557 255511 238225 228750 230031 245906 226517 191881 187209 188802 182714 170661
11845A70661K5167K1982j9541j5145k0546j1195O617k0384q46P769j8996p173
$$ 170661 195828 217810 198269 183124 162578 151383 158000 137616 136770 144539 125543 118370
11833A18370O689J8559o773j2839j27m048O459m479k3086J342J1055k554j8391
$$ 118370 125059 143618 136845 124006 123879 119831 126290 121811 98725 100067 111122 108568 90177
11820I0177R079L3681N114Q624K14j8109p639J4169K5504k719j0678O102R41R027
$$ 90177 99256 132937 138051 146675 146889 128780 121141 135310 160814 158095 147417 153519 154460 163487
11806A63487l3329o555K9054N374j8932k9671K348M365k1468r342K3296K71k0307
$$ 163487 130158 123603 152657 158031 139099 109428 111776 116141 94673 85331 108627 108898 88591
11793H8591O810R612J3757J5222R719j5314l0400m4631O965L2867n635L110p340
$$ 88591 95401 105013 118770 133992 143711 128397 97997 53366 60331 93198 87563 90673 83333
11780H3333P276j505k3786p201P667R478j7912q388J559k6749m595K2058j1994
$$ 83333 90609 89104 65318 58117 65784 75262 57350 48962 50521 23772 19177 41235 29241
11767B9241mR400J8765k490L577J1781p46J6083J4988j9152k1268j0379n382J1727
$$ 29241 29237 38637 57402 54912 58489 70270 69524 85607 100595 81443 60175 49796 44414 56141
11753E6141K7475M171k1291j1611r074r405m861J5228L80K601o344j3065m158
$$ 56141 83616 87787 66496 54885 45811 36406 31545 46773 47153 49754 43410 30345 26187
11740B6187m632p960K0606K3746k427P875Q05j1511j5362p079R572p994k1017
$$ 26187 21555 13595 34201 57947 55520 63395 64200 52689 37327 30248 39820 31826 10809
11727A0809M422K880R248J4773M875j1664q215J1316m315k496n547J2685L976
$$ 10809 15231 18111 27359 42132 47007 35343 27128 38444 34129 31633 26086 38771 42747
11714D2747j7543j8861R356K0520J1404J3341J2645J1974j3946j0355l722k4849
$$ 42747 25204 6343 15699 36219 47623 60964 73609 85583 71637 61282 57560 32711
11702C2711J3002J8514j5390k2842P267L1832K6432k0801j4114R747J3592j1511
$$ 32711 45713 64227 48837 25995 33262 65094 91526 70725 56611 66358 79950 68439
11690F8439l850j2667J2109J5014J2919Q819j7886m251p89o617M645N313j7866
$$ 68439 64589 51922 64031 79045 91964 100783 82897 78646 77857 71240 75885 81198 63332
11677F3332M943L6765J2539P465K1128K2072P791J3179K0344Q823L8396N4702
$$ 63332 68275 105040 117579 125044 146172 168244 176035 189214 209558 218381 256777 311479
11665C11479N90K2287P2259M9342J5179o714J7481L2730K8150K9433M0493M4438
$$ 311479 312069 334356 406615 455957 471136 464422 481903 514633 542783 572216 612709 657147
11653F57147P877k025j2293N93J7994J8737j6340R94j7766l5141j2796M3710J3058
$$ 657147 665024 662999 650706 651299 669293 688030 671690 672684 654918 619777 606981 650691 663749
11640F63749k5648m3293k5561m5300n1414n407m5379p7875k9486k6026k458J222
$$ 663749 638101 594808 569247 523947 472533 467126 421747 343872 314386 288360 285902 287124
11628B87124j3286o094K600j9014j8038j3193k3746l1984k2156l2631l1470L246
$$ 287124 273838 267744 270344 251330 233292 220099 196353 164369 142213 109582 78112 81358
11616H1358R967j6696j686j1894q071J4434L0822o441k7572j8473k2685q744K3232
$$ 81358 91325 74629 72943 61049 52978 67412 98234 91793 64221 45748 23063 14319 37551
11603C7551J6921j5545o61O678K7375n680k3504k6132k0879R165J7912n312k742
$$ 37551 54472 38927 38266 44944 72319 66639 43135 17003 -3876 5289 23201 17889 15147
11590A5147j020k4800j9514r141O042J4150J142p673j175J60k030j3281k5164
$$ 15147 14127 -10673 -30187 -39328 -33286 -19136 -17994 -25667 -26842 -26682 -28712 -41993 -67157
11577f7157p478J6432K4486R719P033J1820j5302Q237K570p842J2209K007l119
$$ -67157 -74635 -58203 -33717 -23998 -16965 -5145 -20447 -12210 -9640 -17482 -5273 -3266 -6385
11564f385J7365Q652J0102l95j9239k0091J2294j1556k53J133L951N577K30J7674
$$ -6385 10980 19632 29734 29339 10100 -9991 2303 -9253 -9506 -8373 -4422 1155 1385 19059
11550A9059J7653q718j2275l685Q555J4320j0186p606J1647J7837n913J157m854
$$ 19059 36712 27994 15719 12034 20589 34909 24723 17117 28764 46601 40688 41845 36991
11537C6991j9073q106K034Q524R745p709j2965q656N789l252j1678J5364j6226
$$ 36991 17918 9812 11846 20370 30115 22406 9441 785 6574 3322 -8356 7008 -9218
11524i218n623j2491K14K6733k1211k0001K036K8642J0979P932p018r966Q30J7044
$$ -9218 -14841 -27332 -27118 -385 -21596 -41597 -39561 -10919 60 7992 974 -8992 -8162 8882
11510H882l637j7598K992L1995O368j8296k0977L614Q171L2324K2067j7301m1299
$$ 8882 5245 -12353 -9361 22634 29002 10706 -10271 -6657 1514 33838 55905 38604 -2695
11497b695j4131N143k071l147M9056O530j6048P445j4143j5754K6253M525q746
$$ -2695 -16826 -11683 -13754 -16901 32155 38685 22637 30082 15939 185 26438 30963 22217
11484B2217J620K0185j2000k0459j699k8862J2118L6122N698k550k4197j2370
$$ 22217 23837 44022 32022 11563 9864 -18998 -6880 29242 34940 32390 8193 -4177
11472d177K3367Q491l730j2069j8384k0516r688n361J2839J2310k581P942J704
$$ -4177 19190 27681 23951 11882 -6502 -27018 -36706 -42067 -29228 -16918 -19499 -11557 -9853
11459i853K9285J5760m628k3404k2278j2476O414O645k0356r423j937L0783Q396
$$ -9853 19432 35192 30564 7160 -15118 -27594 -21180 -14535 -34891 -44314 -46251 -15468 -7072
11446g072J6207k0651j2678J0838J9164J4706L030l651j1646J0859J3322k2220
$$ -7072 9135 -11516 -24194 -13356 5808 20514 23544 19893 8247 19106 32428 10208
11434A0208l2399p774J0449K2982R248Q498j2358j7391P412K4737K187j2605P845
$$ 10208 -22191 -29965 -19516 3466 12714 21212 8854 -8537 -1125 23612 25799 13194 21039
11421B1039j2923l0693l525J306o246J3482L014J4271n798Q940k962j4216N788
$$ 21039 8116 -22577 -26102 -24796 -31042 -17560 -14546 -275 -6073 2867 -95 -14311 -8523
11408h523j4252K8700L0972k4025M756l776k642n724J0139K376Q492j5032K3M876
$$ -8523 -22775 5925 36897 12872 17628 13852 11210 5486 15625 18001 26493 11461 11484 16360
11394A6360p335l499l430j0344l84N249k971O43m165k132J5620J5232J5614j3912
$$ 16360 9025 5526 2096 -8248 -8632 -3383 -6354 -5711 -9876 -12008 3612 18844 34458 20546
11380B0546l6440j6684N402Q273K2338K0867q592j8409J9750j193k4273j8381
$$ 20546 -15894 -32578 -27176 -18903 3435 24302 15710 -2699 17051 15858 -8415 -26796
11368b6796n931J0510J0585Q142N480K3959L347k442M426k7288k7590j355j4439
$$ -26796 -32727 -22217 -11632 -3490 1990 25949 29296 26854 31280 3992 -23598 -24953 -39392
11355c9392r41Q378L2726K7527j1594j5834o277K4402j0629m249L299L434K4167
$$ -39392 -40333 -31955 771 28298 16704 870 -5407 18995 8366 4117 7416 10850 35017
11342C5017j8966j3160M274l321J1189q721k2344P500K5568K305j6027O425l420
$$ 35017 16051 2891 7165 3844 15033 6312 -16032 -8532 17036 19341 3314 9739 6319
11329F319j9412l293P062P249N032K1215O123q028N530p878m254k2268j5177J730
$$ 6319 -13093 -16386 -9324 -2075 2957 24172 30295 22267 27797 19919 15665 -6603 -21780 -20050
11315b0050Q230M019J12n134o105N817k2939J020m305O710M930R516J5541J2993
$$ -20050 -11820 -7801 -7689 -12823 -18928 -13111 -36050 -35030 -39335 -32625 -27695 -18179 -2638 10355
11301A0355o838j6562O055J6022l0616r257J1675J9111M147J4935l372j090p408
$$ 10355 3517 -13045 -6990 9032 -21584 -30841 -19166 -55 4092 19027 15655 14565 7157
11288G157k0296j6055P58J9826P862K6832J1653j1977o373K2131m109q226J7344
$$ 7157 -13139 -29194 -28436 -8610 -748 26084 37737 25760 19387 41518 37409 29183 46527
11275D6527j5302j2561J4893N081l8925l0604J8688J2196J0584K3592J1947j4463
$$ 46527 31225 18664 33557 38638 -287 -30891 -12203 -7 10577 34169 46116 31653
11263C1653l8774j9968J3241L1043K2123p108j7224o653R785J026M851P148j2119
$$ 31653 -7121 -27089 -13848 17195 39318 32210 14986 8333 18118 19144 23995 31143 19024
11250A9024K3068L088l6097k767M828J900K2631j0538j2824O984J5312k4381k2282
$$ 19024 42092 45180 9083 6316 11144 13044 35675 25137 12313 19297 34609 10228 -12054
11237a2054j562Q774J7361J1054q905k2489L146j1317J6367K9958K5292J4566
$$ -12054 -13616 -4842 12519 23573 14668 -7821 -4675 -15992 375 30333 55625 70191
11225G0191l7515k3374m429l895J74J8444r557L0J3106J8828p437l4940l3940
$$ 70191 32676 9302 4873 978 1152 19596 10039 10069 23175 42003 34566 -374 -34314
11212c4314r05K5091j2081K9415L3888q829L0748j1345p6885j1349j720J9639
$$ -34314 -35219 -10128 -22209 7206 41094 32265 63013 51668 -25217 -36566 -38286 -18647
11200a8647J9659Q938Q529J0397l6055k8188L1341O677j319l842K654J6900Q49
$$ -18647 1012 9950 18479 28876 -7179 -35367 -4026 2651 1332 -2510 144 17044 17893
11187A7893k7961j5902K4065j8473k6546K52J0573K2650J4113M381J30K7510L418
$$ 17893 -10068 -25970 -1905 -20378 -46924 -46672 -36099 -13449 664 5045 5175 32685 36103
11174C6103j8921j7375n337J965P788K7623k7687p953o004J3536K6921j7597j1922
$$ 36103 17182 -193 -5530 -3565 4223 31846 4159 -3794 -9798 3738 30659 13062 1140
11161A140j1297k317k717J3473l999n585m500J0172J6315q229j0423Q000R148
$$ 1140 -10157 -12474 -15191 -1718 -5717 -11302 -15802 -5630 10685 2456 -7967 33 9181
11148I181J5719q781j4408Q660l867l1587o816J8338n886j5998J6663N249K2447
$$ 9181 24900 16119 1711 10371 6504 -25083 -31899 -13561 -19447 -35445 -18782 -13533 8914
11135H914J1153n555O133q136k2838n38K1217p061K8566j4574j6893L092k072
$$ 8914 20067 14512 20645 12509 -10329 -10867 10350 3289 31855 17281 388 3480 1408
11122A408K0j5921k2036J2656K4075R685K147K57N149p875O923J0715j7422M131
$$ 1408 1428 -14493 -36529 -23873 202 9887 12034 12291 17440 9565 16488 27203 9781 13912
11108A3912j6698N040K723k5544N138K9294J3777p492J2442j0253j0509M0930
$$ 13912 -2786 2254 4977 -20567 -15429 13865 27642 20150 32592 22339 11830 52760
11096E2760j0541k4659J2648j5904k1174q519j9062K508J3899J2040J1756j1352
$$ 52760 42219 17560 30208 14304 -6870 -15389 -34451 -31943 -18044 -6004 5752 -5600
11084e600o199j250J0757J531m1578j174L7930J5261R914k987r842l589q982j61
$$ -5600 -11799 -13049 -2292 -761 -42339 -43513 -5583 9678 19592 16605 6763 3174 -5808 -5969
11070e969j6804m786J1074L1084J8241P716L73k2110l973k0054j4938Q168L1976
$$ -5969 -22773 -27559 -16485 14599 32840 40556 40929 18819 14846 -5208 -20146 -11978 19998
11057A9998N338r530n312L931K2941K2104k4632k2492L0889L2815Q925j5757k5375
$$ 19998 25336 15806 10494 14425 37366 59470 34838 12346 43235 76050 84975 69218 43843
11044D3843l1722q653L0325J0671k658R299L426K6876J0979J9002K0299P301J1329
$$ 43843 12121 3468 33793 44464 41806 51105 54531 81407 92386 111388 131687 138988 150317
11031A50317K436k4725q228Q011j4895J9563J6907L0233J6496k2466M157l810
$$ 150317 152753 128028 119800 127811 112916 132479 149386 179619 196115 173649 177806 173996
11019A73996l847r048l156P804m859r694j0267j1803L6175P910j5336j6853l3713
$$ 173996 170149 161101 157945 165749 160890 151196 140929 129126 165301 173211 157875 141022 107309
11006A07309j4066k2964n146l475r96j5035Q268K1484L2982j3965k35j1476k4440
$$ 107309 93243 70279 65133 61658 60662 45627 53895 75379 108361 94396 94161 82685 58245
10993E8245j7682K0174o203k3304j5430j2945J3460o659j0634r222M569R988r42
$$ 58245 40563 60737 54534 31230 15800 2855 16315 9656 -978 -10200 -5631 4357 3415
10980C415p805R558J9763P684r604L750J3945n408O276p96l630j3265P359m063
$$ 3415 -4390 5168 24931 32615 23011 26761 40706 35298 41574 40778 37148 23883 31242 27179
10966B7179j2963K1209N986k1613Q386M188M910J4361l260j8044m2855k4875Q179
$$ 27179 14216 35425 41411 19798 28184 32372 37282 51643 48383 30339 -12516 -37391 -29212
10953b9212K6062K1868K5546p753q954j7531j3996L446K1157l772q329J9856J8659
$$ -29212 -3150 18718 44264 36511 27557 10026 -3970 -524 20633 16861 8532 28388 47047
10940D7047q141Q224R975K604k0847k961k0754l0462l084O815M495L2494l176
$$ 47047 38906 47130 57105 59709 38862 35901 15147 -15315 -18399 -11584 -7089 25405 22229
10927B2229K992j3034n03k2541J3284N828j4948Q68K1420k6276o278K7697J4200
$$ 22229 25221 12187 11684 -10857 2427 8255 -6693 -5825 15595 -10681 -16959 10738 24938
10914B4938J0525j8375k4052j1537L3639K6421J5039k5340j1350K5635L1832k4573
$$ 24938 35463 17088 -6964 -18501 15138 41559 56598 31258 19908 45543 77375 52802
10902E2802j3921j9193k0080L577J5550k947n484Q009q019j939j5828N087J8133
$$ 52802 38881 19688 -392 3185 18735 15788 10304 18313 10294 8355 -7473 -2386 15747
10889A5747J4704K377j4433J3602j1317L456j2046n993r920j4261j4439K6213
$$ 15747 30451 32828 18395 31997 20680 24136 12090 6097 -3823 -18084 -32523 -6310
10877f310L7021J7793j7870L03K7151j9725k3231L526K5476j0440l0237p479N473
$$ -6310 30711 48504 30634 30937 58088 38363 15132 18658 44134 33694 3457 -4022 1451
10864A451q173k133K7429K6503K4020j946R87j1553o241j377K2892j6854j1557
$$ 1451 -6722 -8855 18574 45077 69097 67151 68138 56585 50344 48967 71859 55005 43448
10851D3448O790K5344J3405p443j2935j1234O475K463R507j0468N059J2469N519
$$ 43448 50238 75582 88987 81544 68609 57375 63850 66313 75820 65352 70411 82880 88399
10838H8399j8774l5666J7576k253j0669n882m477N340K583j8508R560K3983k112
$$ 88399 69625 33959 51535 49282 38613 32731 28254 33594 36177 17669 27229 51212 49100
10825D9100L716j2542o500J9815k0250o820J7908j1274j0285K2239K1465j6529
$$ 49100 52816 40274 33774 53589 33339 26519 44427 33153 22868 45107 66572 50043
10813E0043j1946o470k3712k983J6718l489j8454j0588j0396Q436O822j3433J0571
$$ 50043 38097 31627 7915 4932 21650 18161 -293 -10881 -21277 -12841 -6019 -19452 -8881
10800h881n903K8415o51j3519q726l532l005L207p436K3752K0866R242r705N653
$$ -8881 -14784 13631 12980 -539 -9265 -12797 -15802 -12595 -20031 3721 24587 33829 24124 29777
10786B9777j5292j6494M030k2327k650O363r954j062O706R923J0597J6564J8199
$$ 29777 14485 -2009 2021 -20306 -22956 -16593 -26547 -27609 -20903 -10980 -383 16181 34380
10773C4380M2342J1382m7554l2288k6798J1301L0043N682J4148O466m681k204
$$ 34380 76722 88104 40550 8262 -18536 -7235 22808 28490 42638 49104 44423 42219
10761D2219O942K8598j2801k4263j9432j50K3228J3142j6989o630j7632j1860
$$ 42219 49161 77759 64958 40695 21263 21113 44341 57483 40494 33864 16232 4372
10749D372P243k0225K043L3605K7987N858m624j1502j8701K1328K5274q235p001
$$ 4372 11615 -8610 -6567 27038 55025 60883 56259 44757 26056 47384 72658 64423 57422
10736E7422k038j3438N708J2819q674l490J5861K2692k8302J4668Q261J4891k3602
$$ 57422 55384 41946 47654 60473 51799 48309 64170 86862 58560 73228 81489 96380 72778
10723G2778m1262n5585l3650J0498J2809J5189k5370K2307J5451j0737J4002J2210
$$ 72778 31516 -24069 -57719 -47221 -34412 -19223 -44593 -22286 -6835 -17572 -3570 8640
10711H640J6777j3049j6142K0496K4685L4368K5148l767j7182L6570p919p155
$$ 8640 25417 12368 -3774 16722 41407 75775 100923 97156 79974 116544 108625 101470
10699A01470J2545K0814M425J1672O291J1038n923K5972q146l3865P755P979l1921
$$ 101470 114015 134829 139254 150926 157217 168255 162332 188304 180158 146293 154048 162027 130106
10686A30106l6978o23j2062l3800J6235L2780L0729j831j2451k0141J4239K5144
$$ 130106 93128 92505 80443 46643 62878 95658 126387 124556 112105 91964 106203 131347
10674A31347R132N060K6457K0756J9467J1421j3745M4312J6666J8778L6537L4502
$$ 131347 140479 145539 171996 192752 212219 223640 209895 254207 270873 289651 326188 360690
10662C60690O3672R2245J09175J34087K11819L17440L22492L14200K67646J66374
$$ 360690 424362 516607 625782 759869 971688 1289128 1611620 1925820 2193466 2359840
10652B359840K9120q7903k00579k79116k83858k40804j91861j30012o1604l3896
$$ 2359840 2388960 2301057 2100478 1821362 1537504 1296700 1104839 974827 913223 879327
10642H79327j3729j8868k1318L0414K3429L1961Q02K6680L2054N2857Q1800R5097
$$ 879327 865598 846730 825412 855826 879255 911216 912018 938698 970752 1023609 1105409 1200506
10630A200506J17250J64271J80192K65301L68467M84813O28117P32259Q27563
$$ 1200506 1317756 1482027 1662219 1927520 2295987 2780800 3408917 4141176 4968739
10621D968739R32739J038235J187221J272802J199820R13066L85536j57835m67538
$$ 4968739 5901478 6939713 8126934 9399736 10599556 11512622 11898158 11740323 11272785
10612A1272785l93116n1673L74475R20649J593968K290162K762407K788029K090741
$$ 11272785 10879669 10827996 11202471 12123120 13717088 16007250 18769657 21557686 23648427
10603B3648427O57204q40913j646002j497788q49004P875R60744J967956K888595
$$ 23648427 24305631 23464718 21818716 20320928 19471924 19479799 20440543 22408499 25297094
10594B5297094L474211L275632K015374j87060k410297l437842l184018k307573
$$ 25297094 28771305 32046937 34062311 33875251 31464954 28027112 24843094 22535521
10586B2535521j282385l15468N62322J296972J707477J490865N28740j000247
$$ 22535521 21253136 20937668 21499990 22796962 24504439 25995304 26524044 25523797
10578B5523797k393897k928383k644153j978720j303840p25310k27232J18149
$$ 25523797 23129900 20201517 17557364 15578644 14274804 13549494 13322262 13440411
10570A3440411K57699J22286l15409r29386j481770j623070j508561j256063j002559
$$ 13440411 13698110 13820396 13504987 12575601 11093831 9470761 7962200 6706137 5703578
10561E703578p95254o07966m82891l75978k92382k50950k19791k13403k45656
$$ 5703578 4908324 4300358 3817467 3441489 3149107 2898157 2678366 2464963 2219307
10552B219307k21576j78055j56946j63082j55955j30516p8996r2887q4809o8000
$$ 2219307 1997731 1819676 1662730 1499648 1343693 1213177 1134181 1041294 956485 888485
10542H88485o5934k4695m8830l9471l3378k4942k6185n6386n5452n4773l9557
$$ 888485 822551 797856 749026 709555 676177 651235 625050 568664 513212 458439 418882
10531D18882p2670l2910j9397k8043k674J8592K0745K5467L4932M5726J02669
$$ 418882 346212 313302 293905 265862 263188 281780 302525 327992 362924 408650 511319
10520E11319P5373N9854R9263Q3166L7769k5155l3556m8722n0220l4589j2845
$$ 511319 586692 646546 745809 828975 866744 841589 808033 759311 709091 674502 661657
10509F61657k1554l9758k6694n1147j2124k237m1875l3940k3430j1791l3838k5945
$$ 661657 640103 600345 573651 522504 510380 508143 466268 432328 408898 397107 363269 337324
10497C37324J4865N378j9730j7859k4218k4783j4950J2318o358L928K2952K4123
$$ 337324 352189 357567 337837 319978 295760 270977 256027 268345 261987 265915 288867 312990
10485C12990L2247K2530L1678N3599M4299K6271L7543O9528J09459J52362J95793
$$ 312990 345237 367767 399445 453044 497343 523614 561157 630685 740144 892506 1088299
10474A088299K04233K37063K59153K47462K20525J62770N5268o1046j81221k35433
$$ 1088299 1292532 1529595 1788748 2036210 2256735 2419505 2474773 2413727 2232506 1997073
10464A997073k38400k11013k38950k12708j44351q9769o6699o0420l2568k7366
$$ 1997073 1758673 1547660 1308710 1096002 951651 861882 795183 734763 702195 674829
10454F74829j5169k3066r588k7275m6832j6983n3385p1841p8128o4053k5036j1253
$$ 674829 659660 636594 627006 599731 552899 535916 482531 410690 332562 268509 243473 232220
10442B32220k952L6197M4081K9957L1678M8041M170J0351j5536k3522k5490j2989
$$ 232220 229268 265465 309546 339503 371181 419222 423392 433743 418207 394685 369195 356206
10430C56206j4521j2393k0326l5113k7099m3943J909M5455J7532j6522M561J1835
$$ 356206 341685 329292 308966 273853 246754 202811 204720 250175 267707 251185 255746 267581
10418B67581q72q702r540m5107k3655q887l9497l7246n4610n5117j5686j2274
$$ 267581 266709 258007 248467 203360 179705 170818 131321 94075 39465 -15652 -31338 -43612
10406d3612j7486j7568K1766l677J0930j823q778O09o248j3770r445J9787J8187
$$ -43612 -61098 -78666 -56900 -60577 -49647 -51470 -60248 -59639 -65887 -79657 -89102 -69315 -51128
10393e1128q614j5443l4660n7008n5631o1320o1381m9386k691P9503J54965J96889
$$ -51128 -59742 -75185 -109845 -166853 -222484 -283804 -345185 -394571 -397262 -317759 -162794 34095
10381C4095J78624J90880J50463R0977L2959j3398l2119m1015o5086k0925k6598
$$ 34095 212719 403599 554062 645039 677998 664600 632481 591466 526380 505455 478857
10370D78857m171j0599p327K0606N0216o786J4151J1868L43Q613N263J774l3025
$$ 478857 474686 464087 456760 477366 527582 520796 534947 546815 547158 555771 561034 562808 529783
10357E29783j1177j3804l6912m2576n3444p0374l8340M3436J60169J70569J64556
$$ 529783 518606 504802 467890 425314 371870 301496 263156 306592 466761 637330 801886
10346H01886J90692J42724J02103P8737K4342q741l6104l2752j3203K1052L4816
$$ 801886 992578 1135302 1237405 1316142 1340484 1331743 1295639 1262887 1249684 1270736 1305552
10335A305552J8940J5519K814K8431L4334j989K774L0691j908K8733L0307O0374
$$ 1305552 1324492 1340011 1342825 1371256 1405590 1403601 1406375 1437066 1435158 1463891 1494198 1554572
10323A554572N2394N1052M8809N2963M2578N8019N3991M9361N6984O4614J1086
$$ 1554572 1606966 1658018 1706827 1759790 1802368 1860387 1914378 1963739 2020723 2085337 2096423
10312B096423J4993N4768N4754N9590M1478M8041P1701P9114Q2765O2820M5542
$$ 2096423 2111416 2166184 2220938 2280528 2322006 2370047 2441748 2520862 2603627 2666447 2711989
10301B711989P5243Q8246J20329J70370J78049J69995K19107K43838K41695K27303
$$ 2711989 2787232 2875478 2995807 3166177 3344226 3514221 3733328 3977166 4218861 4446164
10291D446164K27999K13542K30875K89481L21338L46106M24222N10018N79824
$$ 4446164 4674163 4887705 5118580 5408061 5729399 6075505 6499727 7009745 7589569
10282G589569O80421Q06096R45029J028854J111661J180314J234578J342379J521739
$$ 7589569 8269990 9076086 10021115 11049969 12161630 13341944 14576522 15918901 17440640
10273A7440640J801338K184878K692779L386379M302371N451590P058935R433043
$$ 17440640 19241978 21426856 24119635 27506014 31808385 37259975 44318910 53751953
10265E3751953J3068214J8594319K6548452L7008719M8712201N8327208O0928407
$$ 53751953 66820167 85414486 111962938 148971657 197683858 256011066 316939473
10258C16939473N2499902L3789901R021044j6514774l7887924n1414675n5450894
$$ 316939473 369439375 403229276 412250320 395735546 357847622 306432947 250982053
10251B50982053n0321704l9290905k7922576j9150010j3046326r035035o563034
$$ 250982053 200660349 161369444 133446868 114296858 101250532 92215497 85652463
10244H5652463n231818m657446m414128m295039m052373l628230k961636k077708
$$ 85652463 80420645 75763199 71349071 67054032 63001659 59373429 56411793 54334085
10236E4334085j077833P8498J379951K912247M977812P906656J2382602J9124410
$$ 54334085 53256252 53334750 54714701 57626948 62604760 70511416 82894018 102018428
10228A02018428K8874731M1438480N4375570O2697809O0472732M6540604K5187872
$$ 102018428 130893159 172331639 226707209 289405018 349877750 396418354 421606226
10221D21606226Q27536k3370784m2667911n5137038n8397743n1435591l8677941
$$ 421606226 422433762 399062978 356395067 301258029 242860286 191424695 152746754
10214A52746754k6822540j8337168j2790950r389867p356071o233605n632058
$$ 152746754 125924214 107587046 94796096 85406229 78050158 71816553 66184495
10207F6184495n354564n131070m895244m618113m250692l864783l488287l164735
$$ 66184495 60829931 55698861 50803617 46185504 41934812 38070029 34581742 31417007
10199C1417007k918523k716493k485201k245691j975707j724659j490409j326395
$$ 31417007 28498484 25781991 23296790 21051099 19075392 17350733 15860324 14533929
10191A4533929j168131j019674q90957q32959p53454p01052o32161n80863n23688
$$ 14533929 13365798 12346124 11455167 10622208 9868754 9167702 8535541 7954678 7430990
10182G430990m65319m22735m19404l65240l39638l17856l07240k78551k94682
$$ 7430990 6965671 6542936 6123532 5758292 5418654 5100798 4793558 4515007 4220325
10173D220325k64157k15235j83454j74607j68399j36819j20604j12178j53910
$$ 4220325 3956168 3740933 3557479 3382872 3214473 3077654 2957050 2844872 2690962
10164B690962j24599q2191j08001p1295m4801m6249n8236l9960n0413p3278o6265
$$ 2690962 2566363 2484172 2376171 2304876 2260075 2213826 2155590 2115630 2065217 1991939 1925674
10153A925674o1047q3080p2487m8760L202Q152n5947n9635n5508n1398n3686l9496
$$ 1925674 1864627 1781547 1709060 1660300 1663502 1671654 1615707 1556072 1500564 1449166 1395480 1355984
10141A355984l9766p5954j03997j03679j00572j08535j01017r2511o4631J9247
$$ 1355984 1316218 1240264 1136267 1032588 932016 823481 722464 629953 565322 584569
10131E84569J25683J81889J88517J90238J53866Q1314Q822l5494m7041n9643n5652
$$ 584569 710252 892141 1080658 1270896 1424762 1506076 1514898 1479404 1432363 1372720 1317068
10120A317068p3786k5961n1423q80O021K6084J4508m1640m9775l8075k1872l0108
$$ 1317068 1243282 1217321 1165898 1165018 1171039 1197123 1211631 1169991 1120216 1082141 1060269 1030161
10108A030161p1374n9312k9388m9125k5323k4894r5097j34604r9007p0735k3915
$$ 1030161 958787 899475 870087 820962 795639 770745 675648 541044 442037 371302 347387
10097C47387O5647J28534K14704K23659K05170J28284O5347L6543m5835o8690
$$ 347387 413034 541568 756272 979931 1185101 1313385 1378732 1415275 1369440 1300750
10087A300750o1288n4781m3824k5509j3526R211r598k2013P538K424R920p84j0356
$$ 1300750 1239462 1184681 1140857 1115348 1101822 1111033 1101435 1079422 1086960 1089384 1099304 1098520 1088164
10074A088164j6262J5644n424M141k0066j4953l1200l2177l5235k9075n0388o4125
$$ 1088164 1071902 1087546 1082122 1086263 1066197 1051244 1020044 987867 952632 923557 873169 809044
10062H09044n3797m7678j7548k9387Q482J1173j9289k6432k5695M886j8268P121
$$ 809044 755247 707569 690021 660634 669116 680289 661000 634568 608873 613759 595491 602612
10050F02612R406K148J9501l071j2274j2900J938J2540k9622P093M4276m656l91
$$ 602612 612018 614166 633667 630596 618322 605422 607360 619900 590278 597371 641647 636991 636600
10037F36600J4524l6l82j4698m8207j6524l4681l5470n7089n9784l9379o314j7961
$$ 636600 651124 651088 650706 636008 587801 571277 536596 501126 444037 384253 344874 338560 320599
10024C20599N100J2304j1694j0978k3360K892m3227j7784J2571j1841K5434L8364
$$ 320599 325699 338003 326309 315331 291971 294863 251636 233852 246423 234582 260016 298380
10012B98380K7073K034k3281j2552K1690K5922L8749Q315k5788R61j6900j4534
$$ 298380 325453 327487 304206 291654 313344 339266 378015 386330 360542 361503 344603 330069
10000C30069m182j5528L209O57j789p591j721L049K431l405L0099j6891k2953
$$ 330069 325887 310359 313568 314225 312436 304845 303124 306173 308604 305199 335298 318407 295454
9987B95454O027j1016j0402M364J4675l732j0323J2094K1270K2222M7047L9818
$$ 295454 301481 290465 280063 284427 299102 295370 285047 297141 318411 340633 387680 427498
9975D27498Q0010J27602J63559J62497J01053l3229j26321j72393j37283q0501
$$ 427498 507508 635110 798669 961166 1062219 1028990 902669 730276 592993 512492
9965E12492n1213j4874J8116p163j5589l1083k2345l707Q905L3794N91N555O0
$$ 512492 461279 446405 464521 457358 441769 410686 388341 384634 393539 427333 427924 433479 433539
9952D33539L512Q743j0673j6810n0815o6010l0206j1335q651j0237M472k3047
$$ 433539 437051 445794 435121 418311 367496 301486 271280 259945 251294 241057 245529 222482
9940B22482Q219l335J0538o612k0287J746J1873J0250l901J4724K2288L857j7508
$$ 222482 230701 227366 237904 231292 211005 212751 224624 234874 230973 245697 267985 271842 254334
9927B54334q128o443R282k4417M017K0186J7641P216L7512J7615j453j3632k3917
$$ 254334 246206 239763 249045 224628 228645 248831 266472 273688 311200 328815 327362 313730 289813
9914B89813p362J0922l9544m3073j3602M293m561j7611j6504K4413J3954R03P559
$$ 289813 282451 293373 253829 210756 197154 201447 196886 179275 162771 187184 201138 202041 209600
9901B09600K1399k3937j3319k03J9091K512J0589N544j3791k3778k3967k568R543
$$ 209600 230999 207062 193743 193540 212631 215143 225732 231276 217485 193707 169740 167172 176715
9888A76715j3177J629K1887k617K8811Q216m804m23M816k4778K7990K0040Q840
$$ 176715 163538 165167 187054 184437 213248 221464 216660 216237 221053 196275 224265 244305 253145
9875B53145j3661l8407j531K2737n182p768J2000K1929L7393N7986P5964N5587
$$ 253145 239484 201077 199546 222283 217101 209333 221333 243262 280655 338641 414605 470192
9863D70192N9598J21975J44276J93566K57303L24957L21992K56973J36344J008
$$ 470192 529790 651765 796041 989607 1246910 1571867 1893859 2150832 2287176 2288184
9853B288184j29441k26849k92499k54455k28879j73408j14858j00209o1637o7870
$$ 2288184 2158743 1931894 1639395 1384940 1156061 982653 867795 767586 705949 638079
9843F38079n7857m3863k3571K842l300j4045k2984m850k9969m0290j4043m130
$$ 638079 580222 536359 512788 515630 512330 498285 475301 470451 440482 400192 386149 382019
9831C82019k1774K3527M116M1818P7139Q7486J05721J35668K00689K73762L00789
$$ 382019 360245 383772 387888 429706 506845 594331 700052 835720 1036409 1310171 1610960
9820A610960L33353K86951J74160L2231j22184k17382k54943l05831k76712k20583
$$ 1610960 1944313 2231264 2405424 2437655 2315471 2098089 1843146 1537315 1260603 1040020
9810A040020j82073r5297q2806n1807m4038m5402n1650j2098k3692j0496N030
$$ 1040020 857947 762650 679844 628037 583999 538597 486947 474849 451157 440661 445691
9799D45691o424j8320l1713l2446k4729k2830k2226j8845k4817j3551k9518p528
$$ 445691 439267 420947 389234 356788 332059 309229 287003 268158 243341 229790 200272 192744
9787A92744n383j3230m3499j1626K6855j3228p943k920J0133j8697r703O599j9311
$$ 192744 187361 174131 130632 119006 145861 132633 124690 121770 131903 113206 103503 110102 90791
9774I0791j2946J0430J3232N527J4585J4041l178j8664J0193J023p890j19J9916
$$ 90791 77845 88275 101507 107034 121619 135660 132482 113818 124011 125034 117144 117025 136941
9761A36941K6411N821j6482j7403j742l080m0495k7465j9405r412J270k0107j7126
$$ 136941 163352 169173 152691 135288 133546 130466 89971 62506 43101 33689 34959 14852 -2274
9748b274o142K5139J3356K0069J2238j9890P749L871N394j364R211J3693J0364
$$ -2274 -8416 16723 30079 50148 62386 42496 50245 54116 59510 58146 67357 81050 91414
9735I1414k7976l2726K394j1477J7762Q836J0425O369R698J3922p256j3992l134
$$ 91414 63438 30712 33106 21629 39391 48227 58652 65021 74719 88641 81385 67393 64259
9722F4259n876j1905j3070k1255R759K9227N777n092o952p458j3477J6541L7871
$$ 64259 58383 46478 33408 12153 21912 51139 56916 51824 44872 37414 23937 40478 78349
9709G8349K3606l4303k9340j0059J6272R151j8035l314J8593J5572l342j1637
$$ 78349 101955 67652 38312 28253 44525 53676 35641 32327 50920 66492 63150 51513
9697E1513P117M593l1742j0883K1708L0091K4670r586j2579J0051l486k8072Q447
$$ 51513 58630 63223 31481 20598 42306 72397 97067 87481 74902 84953 81467 53395 61842
9684F1842K1292m383M807P200k4110l9960j1489N241P911P898J2791K0696j9077
$$ 61842 83134 78751 83558 90758 66648 26688 15199 20440 28351 36249 49040 69736 50659
9671E0659J9346J0243l3200j9109o215J5699j4346k895j7483P777M6288K0451
$$ 50659 70005 80248 47048 27939 21724 37423 23077 20182 2699 10476 56764 77215
9659G7215k0010n396J2362j833j4643L65j5852J125J8266P025j6902q589P266
$$ 77215 57205 51809 64171 62338 47695 48060 32208 33333 51599 58624 41722 33133 40399
9646D0399j105K0503j1552n138N980j5708K307J4595J571P138o223j2071k3819
$$ 40399 39294 59797 48245 43107 49087 33379 35686 50281 51852 58990 52767 40696 16877
9633A6877N642K5576J9535q842k519P701k6586j4625m211P018K7543J0256Q392
$$ 16877 22519 48095 67630 58788 56269 63970 37384 22759 18548 25566 53109 63365 71757
9620G1757l1007J5889J0581J269k5067j0943N478k6469n230R176M9919K528p761
$$ 71757 40750 56639 67220 68489 43422 32479 37957 11488 6258 15434 65353 67881 60120
9607F0120R921O652K1046J9790L954O690K5171R007M1510L7841K4753K7856J0955
$$ 60120 70041 76693 97739 117529 121483 128173 153344 162351 203861 241702 266455 294311 305266
9594C05266j9431k1466l8599l2505n3251k6419K5809J210J1052l6903j2179P724
$$ 305266 285835 264369 225770 193265 140014 113595 139404 140614 151666 114763 102584 110308
9582A10308k2529o348oj6855Q956O407l4010l2572J9263Q539j8529P088j537m745
$$ 110308 87779 81431 81425 64570 73526 79933 45923 13351 32614 41153 22624 29712 28175 23430
9568B3430K9273k53p999R614J4739J6621j7963m3106K779J6994P211k1410k3621
$$ 23430 52703 52450 44451 54065 68804 85425 67462 24356 27135 44129 51340 29930 6309
9555F309j3892l745J7158j308j43K1313K5690J6633q299m4772k3426k415N378
$$ 6309 -7583 -11328 5830 4522 4379 25692 51382 68015 59716 14944 -8482 -10897 -5519
9542e519o870J6223J102j5851l029K9238L8442K1523j5326l846j3478j1003Q985
$$ -5519 -12389 3834 4936 -10915 -13944 15294 53736 75259 59933 56087 42609 31606 40591
9529D0591r636p749Q784p934J2371J3500J671Q623k3369k2994m404m563J4572
$$ 40591 30955 23206 31990 24056 36427 49927 51598 60221 36852 13858 9454 4891 19463
9516A9463K0562K847J9091M476p62m2504J4145M945j0169l0583J4398k1571l0217
$$ 19463 40025 42872 61963 66439 65677 23173 37318 42263 32094 1511 15909 -5662 -35879
9503c5879R848K2326J6113M322p202J7232K6679P480j4706l852J963m184k3293
$$ -35879 -26031 -3705 12408 16730 9528 26760 53439 60919 46213 42361 44324 40140 16847
9490A6847J1485m023J284O847j5935M589K7928p96n070j2971Q783o043J993L20
$$ 16847 28332 24309 25593 32440 16505 21094 49022 48226 43156 30185 38968 32925 34918 35238
9476C5238O192l269j2422J3811r593J0971k5222k2411J2098N819K5993J2383o563
$$ 35238 41430 38161 25739 39550 29957 40928 15706 -6705 5393 11212 37205 49588 43025
9463D3025J3876L287K518J5460k548q262j0252Q596j0062j2386N76j1458n85J5665
$$ 43025 56901 60188 62706 78166 75618 67356 57104 65700 55638 43252 43828 32370 31785 47450
9449D7450r836J5165J2582M904j3654J2706J2143Q291K779j165k5057n421j1822
$$ 47450 37614 52779 65361 70265 56611 69317 81460 89751 92530 91365 66308 60887 49065
9436D9065Q229J4918R31K0652K5902N4081j0079l0967r550K9309K2633J2521n613
$$ 49065 57294 72212 73143 93795 119697 173778 163699 132732 123182 152491 175124 187645 182032
9423A82032m034L0454P0575J06104J63233K03106L09732M45038N62739N97168
$$ 182032 177998 208452 279027 385131 548364 751470 1061202 1506240 2068979 2666147
9413B666147M09678J24342j1067p3231k48054n21588n62646m41009k92381j78460
$$ 2666147 3075825 3200167 3189100 3115869 2867815 2346227 1783581 1342572 1050191 871731
9403H71731r8320q7227o1697o1148m2910k1773j8988m4688p3318m0648l8876k2603
$$ 871731 773411 686184 624487 563339 520429 498656 479668 434980 361662 321014 282138 259535
9391B59535o965r476k2108l5799o044q768k0839r539j9833k1937Q944j8014l0740
$$ 259535 252570 243094 220986 185187 179143 170375 149536 139997 120164 98227 107171 89157 58417
9378E8417j5915m08J4482O185j3383o030r079j2519K090K0184L3157o243j0139
$$ 58417 42502 42094 56576 62761 49378 43348 34269 21750 23840 44024 77181 70938 60799
9365F0799J8326K4059k873o792j2094j2685k7211J1588n563r981j4180j2864o259
$$ 60799 79125 103184 100311 93519 81425 68740 41529 53117 47554 37573 23393 10529 4270
9352D270J0118K386k0477j3445J1779q53K3173p815J856Q782L389J8271P71k9021
$$ 4270 14388 16774 -3703 -17148 -5369 -6222 16951 9136 10992 19774 23163 41434 42205 13184
9338A3184j5626j823K0862K3604j7818k7258J8046k22j4879p789K4687K6234O03
$$ 13184 -2442 -4265 16597 40201 22383 -4875 13171 12949 -1930 -9719 14968 41202 41805
9325D1805j6074j7084p940N023J0301K2315L2939j1814k2491j1127R907j2686
$$ 41805 25731 8647 707 5730 16031 38346 71285 59471 36980 25853 35760 23074
9313B3074j6494q805K922R913j1956j2450k1751P976K6700L0321P078k3335L522
$$ 23074 6580 -2225 697 10610 -1346 -13796 -35547 -27571 -871 29450 36528 13193 16715
9300A6715J4492j1122k2612J2577P714R608J1153k1753j3086J884m496k8560r819
$$ 16715 31207 20085 -2527 10050 17764 27372 38525 16772 3686 5570 1074 -27486 -37305
9287c7305j6772P74J0904K3766J7687J9038o490k6611k901L7503K9778n604m0518
$$ -37305 -54077 -53303 -42399 -18633 -946 18092 11602 -15009 -17910 19593 49371 43767 3249
9274C249J798M6881N721k5906J2747o442n163l064J3862j4579l682J6454q718
$$ 3249 5047 51928 57649 31743 44490 38048 32885 29821 43683 29104 25422 41876 33158
9261C3158K473l708q302L002P491l815Q938j0476j2310K930K7463L931N5k6947
$$ 33158 35631 31923 23621 26623 34114 30299 39237 28761 16451 19381 46844 50775 50830 23883
9247B3883j9025q151Q62K2120j0307j3334P85j66M454K2532R50o800k516r808
$$ 23883 4858 -3293 -2431 19689 9382 -3952 -3167 -3333 1121 23653 24603 17803 15287 5479
9233E479R271M884l232p270j4099o040M538M665K1442K931r678j97J6833k3719
$$ 5479 14750 19634 16402 9132 -4967 -11007 -6469 -1804 19638 22569 12891 12694 29527 5808
9219E808P045J4913l762Q669J2092R486J0859l464N517r034j0182k0463r314j6476
$$ 5808 12853 27766 24004 32673 44765 54251 65110 61646 67163 58129 47947 27484 18170 1694
9205A694j7161j6634K6973J8829K632j3232k2144J4606K1516q434k9113k6255
$$ 1694 -15467 -32101 -5128 13701 16333 3101 -19043 -4437 17079 8645 -20468 -46723
9193d6723k948k029K9689K6198J6497R479k2048l813J3257N206l2310l536J2501
$$ -46723 -49671 -51700 -22011 4187 20684 30163 8115 4302 17559 22765 -9545 -13081 -580
9180e80J7083j044J5946J7756N201M650j9162K4772K0826m5967l5779q01P446
$$ -580 16503 15459 31405 49161 54362 59012 39850 64622 85448 39481 3702 2901 10347
9167A0347K9744j542l175n268l748j9509q003K4619N900k6048J5594J301k5092
$$ 10347 40091 38549 35374 30106 26358 6849 -1154 23465 29365 3317 18911 20212 -4880
9154d880J5923q930j6262M441K013l351Q545M576J1190k514r297k1062J4284j4780
$$ -4880 11043 2113 -14149 -9708 -7695 -11046 -2501 2075 13265 10751 1454 -19608 -5324 -20104
9140b0104P393J80J6337J361J6144K4790j0821j0841Q737J5014m057m482j0417
$$ -20104 -12711 -12531 3806 5167 21311 46101 35280 24439 33176 48190 44133 39651 29234
9127B9234j4239k6319k389O184J776J638J7111K5000j8037l0374j023j6834J0180
$$ 29234 14995 -11324 -13713 -7529 -5753 -4115 12996 37996 19959 -10415 -11438 -28272 -18092
9114a8092k962o840L397M8320J5297m0371M77P700J168j6898J3996M372j178R562
$$ -18092 -21054 -27894 -24497 23823 39120 -1251 -774 6926 8094 -8804 5192 9564 8386 17948
9100A7948J3475k6239j5142J7249K8976j4410k7734r09K589K6399r042J3964L2377
$$ 17948 31423 5184 -9958 7291 36267 21857 -5877 -6786 -4197 22202 13160 27124 59501
9087E9501k1150j5308q914M13o606j1367K877L83k361J9996Q308q101P674n072
$$ 59501 38351 23043 14129 14542 7936 -3431 -554 -171 -2532 17464 25772 17671 25345 20273
9073B0273q116M587j732j3469K433J1513P554k341j9911k4188J3739k882j5579
$$ 20273 12157 16744 15012 1543 3976 15489 23043 20702 791 -23397 -9658 -12540 -28119
9060b8119J5939k310J6932R003k839j0527o080J8056p963m069j1786m631l36N076
$$ -28119 -12180 -14490 2442 11445 8606 -1921 -8001 10055 2092 -1977 -13763 -18394 -18730 -13654
9046a3654l083K813M580K8743J6451N828k2666r562k734J8539J6637M160K906
$$ -13654 -16737 -13924 -9344 19399 35850 41678 19012 9450 6716 25255 41892 46052 48958
9033D8958j3526k5565l1782J2877M262K1917o100M882k056j3628j96J3100L283
$$ 48958 35432 9867 -21915 -9038 -4776 17141 11041 15923 13867 239 43 13143 16426
9020A6426N213j8596j2809o121k198L555J8884n439j9647J3515K0968j0336J3101
$$ 16426 21639 3043 -9766 -15887 -18085 -14530 4354 -1085 -20732 -7217 13751 3415 16516
9007A6516K0846N274J6516J77n061R53J0355l5095j8626k215k1406K126K0060
$$ 16516 37362 42636 59152 59329 54268 55221 65576 30481 11855 9640 -11766 -9640 10420
8994A0420K996p956Q189j6145j0356Q191r194M083J339j543J7796J6175j0661
$$ 10420 13416 5460 13649 -2496 -12852 -4661 -13855 -9772 -8433 -9976 7820 23995 13334
8981A3334k1058j380J9831j0996j4494r387k690K832m68l51M1664M921k013n288
$$ 13334 -7724 -9104 10727 -269 -14763 -24150 -26840 -24008 -24476 -24827 16837 21758 19745 14457
8967A4457j2055k6046J9047L125j2068j2737J0553m37J8204J925P682k3550k36
$$ 14457 2402 -23644 -4597 -1472 -13540 -26277 -15724 -16161 2043 3968 11650 -11900 -12136
8954a2136N683P881j8108j6505m280K5486J0542l1378P707K0997Q249j0863j984
$$ -12136 -6453 1428 -16680 -33185 -37465 -11979 -1437 -32815 -25108 -4111 4138 -6725 -8709
8941h709Q218L446l826J5219j418K4535P45r324o916j6045j8271J6643J3879L6192
$$ -8709 -491 2955 -871 14348 12930 37465 38210 28886 21970 5925 -12346 4297 18176 54368
8927E4368k4925j4534m869j0689J2416k299O306L238k268N11j0430O015Q058k778
$$ 54368 29443 14909 10040 -649 11767 9468 15774 19012 16744 17255 6825 12840 20898 18120
8913A8120l76P474m654l458k3888m733J2613j9571P162o071N429P841J5024J0729
$$ 18120 17744 25218 20564 17106 -6782 -11515 1098 -18473 -11311 -17382 -11953 -4112 10912 21641
8899B1641k120l07o168q443j7628J4747M6277J8960j6658k3297l6400j8915R512
$$ 21641 19521 19214 13046 4603 -13025 1722 47999 66959 50301 27004 -9396 -28311 -18799
8886a8799k415K7283j0939k741R208J8296K5894k6137l2562J0364J1780k5611
$$ -18799 -21214 6069 -4870 -7611 1597 19893 45787 19650 -12912 -2548 9232 -16379
8874a6379k2524J4965J8908K219n54Q937k7863j6060J020J9718q163k791L947
$$ -16379 -38903 -23938 -5030 -2811 -3365 5572 -22291 -38351 -37331 -17613 -25776 -28567 -24620
8861b4620q030J628m76J4802O057J2797N525k9009k0526K7490j0650J0836J827
$$ -24620 -32650 -31022 -31498 -16696 -10639 2158 7683 -21326 -41852 -14362 -25012 -14176 -12349
8848a2349J661j5868N279L0881r676j5245j8538j3970j2047j8169K400K4836M6194
$$ -12349 -10688 -26556 -21277 9604 -72 -15317 -33855 -47825 -59872 -78041 -75641 -50805 -4611
8835d611L4288L927Q07k8499o152J1953J1320L217k0758K842P233J5689n045J3520
$$ -4611 29677 33604 34411 5912 -240 11713 23033 26250 5492 8334 15567 31256 26211 39731
8821C9731k2713j2919k1236N446N057K4989k915o031J0849J2936N594k117n523
$$ 39731 17018 4099 -17137 -11691 -6634 18355 15440 9409 20258 33194 38788 36671 31148
8808C1148j8881K475J0199j1293J2667r841R391j680n197k8898L64j16j3111J079
$$ 31148 12267 14742 24941 13648 26315 16474 25865 24185 18988 -9910 -9546 -9662 -22773 -21694
8794b1694J0757R735O98K5991O61l722k6220R747k708o526K3807J9654q87j2256
$$ -21694 -10937 -1202 -504 25487 26148 22426 -3794 5953 3245 -3281 20526 40180 39293 27037
8780B7037l0627M430K6108L0691m592k7331j1938j4722J2349P594J7838r25j3142
$$ 27037 -3590 840 26948 57639 53047 25716 13778 -944 11405 18999 36837 35912 22770
8767B2770k9379k4156k0242J7968K5696R717J2191K310J6101k495J4919O375j1860
$$ 22770 -6609 -30765 -51007 -33039 -7343 2374 14565 16875 32976 30481 45400 51775 39915
8754C9915r153k2522J5271K298k8428j7615K3333n455j6946J5602J3326j4577
$$ 39915 30762 8240 23511 25809 -2619 -20234 3099 -2356 -19302 -3700 9626 -4951
8742d951j7542J0748j5996j4714J4818L7278k988j9325J3008J6644m235k3531
$$ -4951 -22493 -11745 -27741 -42455 -27637 9641 6653 -12672 336 16980 12745 -10786
8730a0786N671N167M463K415j2118r836n266m14N181Q23J4072J8234j1793o892
$$ -10786 -5115 52 4515 6930 -5188 -15024 -20290 -20704 -15523 -14700 -628 17606 5813 -1079
8716a079M211M613j4609K1312L0888L466k5985j3354j6458r116J8250j6953M380
$$ -1079 3132 7745 -6864 14448 45336 48802 22817 9463 -6995 -16111 2139 -14814 -10434
8703a0434L830r713m817n342M3572J6537j0184k8058Q589J3723K296R751J0065
$$ -10434 -6604 -16317 -21134 -26476 17096 33633 23449 -4609 3980 17703 19999 29750 39815
8690C9815k2013k9079q232O676J0486K0268j418j406k20K0178R724o117J3514
$$ 39815 17802 -11277 -19509 -12833 -2347 17921 16503 15097 14877 35055 44779 38662 52176
8677E2176N9K030j0152j8741J6726P561j7028k6265l3262J024L2812J6586p336
$$ 52176 52235 54265 44113 25372 42098 49659 32631 6366 -26896 -25872 6940 23526 16190
8664A6190Q508j5575L199O21M639J3308j7023j595J8496j957n745q086q202l177
$$ 16190 24698 9123 12322 12943 17582 30890 13867 12272 30768 28811 23066 14980 6778 3601
8650C601j9772M1L0953J9621k975k0518r40J3929P454l691k0713j8586P107K0379
$$ 3601 -16171 -16130 14823 34444 31469 10951 10011 23940 31394 27703 6990 -11596 -4489 15890
8636A5890k841q755o572j3413m181K1321p193j064O923K0422m814K2411N080n064
$$ 15890 13049 4294 -2278 -15691 -19872 1449 -5744 -6808 115 20537 15723 38134 43214 38150
8622C8150J316R313j1747k6726J0436j4749j6396o381k2628J3602J1132J8045
$$ 38150 39466 48779 37032 10306 20742 5993 -10403 -16784 -39412 -25810 -14678 3367
8610C367J3202m265N187P344j7113k7371P492P219L487n634J0008K6738K0546
$$ 3367 16569 12304 17491 24835 7722 -19649 -12157 -4938 -1451 -7085 2923 29661 50207
8597E0207j5364k5558j4936j5995j5123O840K6084q542p737o108j9597J5669q477
$$ 50207 34843 9285 -5651 -21646 -36769 -29929 -3845 -12387 -20124 -26232 -45829 -30160 -38637
8584c8637K327P266j63J8637p261O314K4122K3294o423j4012j7831j2027J2788
$$ -38637 -36310 -29044 -29207 -10570 -17831 -11517 12605 35899 29476 15464 -2367 -14394 -1606
8571a606J6094K959k2480M956m907n575Q519K0575N554j377j779O015j6055j5667
$$ -1606 14488 17447 -5033 -77 -4984 -10559 -2040 18535 24089 22712 20933 26948 10893 -4774
8557d774k404l632M170n822M946j0259j466k972j7903J0487l202J3235K3030J5286
$$ -4774 -7178 -10810 -6640 -12462 -7516 -17775 -19241 -22213 -40116 -29629 -32831 -19596 3434 18720
8543A8720L2714p276j7652M820j2506k0703j3974k5813J8254L5331J8123j6833
$$ 18720 51434 44158 26506 31326 18820 -1883 -15857 -41670 -23416 11915 30038 13205
8531A3205J2428K3240j4907k9164r541J9407O652m792L483J0685j2110j681J576
$$ 13205 25633 48873 33966 4802 -4739 14668 21320 16528 20011 30696 18586 16905 18481
8518A8481L6073l608k1005j0136J9594j348j9246j2294K918j3575J0271J0408
$$ 18481 54554 50946 29941 19805 39399 38051 18805 6511 9429 -4146 6125 16533
8506A6533j9829k1570k1321R516m834M725M0544K2651j685k9116n298K3317R659
$$ 16533 -3296 -24866 -46187 -36671 -41505 -36780 3764 26415 24730 -4386 -9684 13633 23292
8493B3292l1761j0666n632J673J5139l611K3669J9499k7119l8512K0450L0142
$$ 23292 -8469 -19135 -24767 -23094 -7955 -11566 12103 31602 4483 -34029 -13579 16563
8481A6563J4389R90k0977l4767J6374J2664J5169J9252J8842k2730l5877K438
$$ 16563 30952 31942 10965 -23802 -7428 5236 20405 39657 58499 35769 -108 2330
8469B330J6685J5771p28k1079j7076n14O443R528j3369j48K0389j6170J6170M945
$$ 2330 19015 34786 34058 12979 -4097 -4611 1832 11360 -2009 -2157 18232 2062 18232 23177
8455B3177J5089j4054j5670K7664R753j3807j1716M539J1447j2456k8995m965
$$ 23177 38266 24212 8542 36206 45959 32152 20436 24975 36422 23966 -5029 -9994
8443i994J0307M579K7321L2990J489j5478k239J892P855j8183N878k0843j8683
$$ -9994 313 4892 32213 65203 66692 51214 48975 50867 58722 40539 46417 25574 6891
8430F891n941J8372Q615L0025m267j3974m580J1793J524j107k4286o490m689r241
$$ 6891 950 19322 27937 57962 53695 39721 35141 46934 48458 47351 23065 16575 11886 2645
8416B645l282q816J1941M8624R863k824k7782r694j0615J5330r790m157K0708
$$ 2645 -637 -9453 2488 51112 60975 58151 30369 20675 10060 25390 15600 11443 32151
8403C2151M603o40J1086r095k3577j3064j0251J7642J7526k5563k0245K4138J888
$$ 32151 36754 36114 47200 38105 14528 1464 -8787 8855 26381 818 -19427 4711 6599
8390F599O984o28q076o742J7807K4537j9358k7796k4142q151J8467N618q168O763
$$ 6599 13583 12955 4879 -1863 15944 40481 21123 -6673 -30815 -38966 -20499 -14881 -23049 -16286
8376a6286J8660J0252P272n841k4072j4203J6444J3309o993J117N977J8722O795
$$ -16286 2374 12626 19898 14057 -10015 -24218 -7774 5535 -1458 -341 5636 24358 31153
8363C1153O095o319k3037J408K6365q461r102j1004J737P114K1811j7917k6882
$$ 31153 37248 30929 7892 9300 35665 27204 18102 7098 8835 15949 37760 19843 -7039
8350g039J324j8973K1595N89p744l653r502q635j6366j915P195L6143R426q25
$$ -7039 -5715 -24688 -3093 -2504 -10248 -13901 -23403 -32038 -48404 -50319 -43124 -6981 2445 1620
8336A620j764q592K5305J4074j9552j7609j184K461K754Q456Q934j5805m471J404
$$ 1620 -144 -8736 16569 30643 11091 -6518 -7702 -5241 -2487 5969 14903 -902 -5373 -3969
8322c969q303Q064J2231M237Q899q210j2638J405J294m922j2767m876J6398p680
$$ -3969 -12272 -4208 8023 12260 21159 12949 311 1716 3010 -1912 -14679 -19555 -3157 -10837
8308a0837k2311J9284J8084J1575K0179l157r088L995r584j6180J2508L907m994
$$ -10837 -33148 -13864 4220 15795 35974 32817 23729 27724 18140 1960 14468 18375 13381
8295A3381k6114k501K1472K2178K8916k8845k1581J5352q777N23j6257j423J0425
$$ 13381 -12733 -15234 6238 28416 57332 28487 6906 22258 13481 14004 -2253 -3676 6749
8282F749O641k11p813K40j9060j1085p548J0247q319k433J5104j4353j3011J5998
$$ 6749 13390 13179 5366 5606 -13454 -24539 -32087 -21840 -30159 -32592 -17488 -31841 -44852 -28854
8268b8854K3473P87P116J2544L354q320J466L3725J4405l1476N651O785r497j6236
$$ -28854 -5381 -4594 2522 15066 18420 10100 11566 45291 59696 28220 33871 40656 31159 14923
8254A4923k1841l0281K392J2933j0732J8998K4534L637j8529M976K0085k579r060
$$ 14923 -6918 -37199 -34807 -21874 -32606 -13608 10926 14563 -3966 1010 21095 18516 9456
8241I456j4988o023J6986l956J8833m255J9849q672j3995j4974J6577q935j8662
$$ 9456 -5532 -11555 5431 1475 20308 16053 35902 27230 13235 -1739 14838 5903 -12759
8228a2759j9683M4397N735k2132K1402J1420j2917k1522l183J5961j3337j1239
$$ -12759 -32442 11955 17690 -4442 16960 28380 15463 -6059 -9242 6719 -6618 -17857
8216a7857j566L0246J9486k1490k3978m164Q342k296n633J01O094P523j979m140
$$ -17857 -19423 10823 30309 8819 -15159 -19323 -10981 -13277 -18910 -18809 -12715 -5192 -7171 -11311
8202a1311j8313r367m233K5008N242R372j325P250j1539j5918K232n839J0677
$$ -11311 -29624 -38991 -43224 -18216 -12974 -3602 -4927 2323 -9216 -25134 -22902 -28741 -18064
8189a8064k274l3332n847L4312K0534m264l6931K3440K5749R497L9758L366o116
$$ -18064 -20338 -53670 -59517 -25205 -4671 -8935 -45866 -22426 3323 12820 52578 55944 49828
8176D9828j0264j9305O535k935q652j0074j0714j6608K4236j7177P623K2122J8781
$$ 49828 39564 20259 26794 23859 15207 5133 -5581 -22189 2047 -15130 -7507 14615 33396
8163C3396J1203j2309m1227j0575K3580m209l8723J3771K1042M658k084R480p475
$$ 33396 44599 32290 -8937 -19512 4068 -141 -38864 -25093 -4051 607 -1477 8003 528
8150E28j6275K2721R314l0525j9726J4184j3359q217N227L1439K4618J1585J0374
$$ 528 -15747 6974 16288 -14237 -33963 -19779 -33138 -41355 -36128 -4689 19929 31514 41888
8137D1888j2296k7218j6589P682J1048j3475j2570J2468L316R053J7048M707j0531
$$ 41888 29592 2374 -14215 -6533 4515 -8960 -21530 -9062 -5746 3307 20355 25062 14531
8124A4531J4343j9974m481q059J1787M739q957k9183P831J8839M929Q431n442
$$ 14531 28874 8900 4419 -3640 8147 12886 3929 -25254 -17423 1416 6345 14776 9334
8111I334k565j2560j6502K2782K3456k912N528J700m054o955Q810J62J142K9923
$$ 9334 6769 -5791 -22293 489 23945 21033 26561 28261 24207 17252 26062 26224 27366 57289
8097E7289p526k7933k5756J1261J2792J1377J4841Q445q057r865j580n099p349
$$ 57289 49763 21830 -3926 7335 20127 31504 46345 54790 46733 36868 35288 30189 22840
8084B2840o464J0002N650j5872Q028j7469n013P272k1075p734j3297o222o55p930
$$ 22840 16376 26378 32028 16156 24184 6715 1702 8974 -12101 -19835 -33132 -39354 -40009 -47939
8070d7939K1795L0290j5013j0456N287q259j0440K134K4508P571K086R420M649
$$ -47939 -26144 4146 -10867 -21323 -16036 -24295 -34735 -32601 -8093 -522 1564 10984 15633
8057A5633J244K134J2209r187r197j4646J5613J4290j3673k9033K149j8006o894
$$ 15633 16877 19011 31220 22033 12836 -1810 13803 28093 14420 -14613 -12464 -30470 -37364
8044c7364M219J3076K7436K0109R87j2990l7905l7477O451K5775K4945J6210K5868
$$ -37364 -33145 -20069 7367 27476 28463 15473 -22432 -59909 -53458 -27683 -2738 13472 39340
8031C9340R792k0643j5400J4507P681j1450M21Q870r979j0449N237j2895m786
$$ 39340 49132 28489 13089 27596 35277 23827 24248 33118 23139 12690 17927 5032 246
8018B46J9464M117j3988l550j3563j2929J950J2376L405j4126M3482j8465k1946
$$ 246 19710 23827 9839 6289 -7274 -20203 -18253 -5877 -2472 -16598 26884 8419 -13527
8005a3527J8173N982k8598p436J7689N231n013r427k4066j8791L3026L6515l362
$$ -13527 4646 10628 -17970 -25406 -7717 -2486 -7499 -16926 -40992 -59783 -26757 9758 6396
7992F396q046O381l546J3651L0285l498k6287r0r324M658n369j6163n560J4057
$$ 6396 -1650 4731 1185 14836 45121 41623 15336 15246 5922 10580 5211 -10952 -16512 -2455
7978b455l29M437N140M945J0735q524J5119J6864j7516R869p451j4376k369r083
$$ -2455 -2784 1653 6793 11738 22473 13949 29068 45932 28416 38285 30834 16458 14089 5006
7964E006k5143j85K5829J9121J05o992R891j6583l1831p018P211K5094j9689K415
$$ 5006 -20137 -20322 5507 24628 24733 17741 27632 11049 -20782 -27800 -20589 4505 -15184 -12769
7950a2769J1195r058N336J8844j3564J7443r196K1926J3380l0573j0281j6696
$$ -12769 -1574 -10632 -5296 13548 -16 17427 8231 30157 43537 12964 2683 -14013
7938a4013P482k1364j8796J6105K1473l59n115K6777K3976R494J101J6532o812
$$ -14013 -6531 -27895 -46691 -30586 -9113 -9472 -14587 12190 36166 45660 46761 63293 56481
7925E6481j193j916k8658Q955N463R54j5860k0575o754l640k7388k491L3082J0103
$$ 56481 55288 53372 24714 33669 39132 40086 24226 3651 -3103 -6743 -34131 -36622 -3540 6563
7911F563j445O108l814p563o578L881J0906k1326L148J8578J6168K157j5775j9514
$$ 6563 5118 11226 7412 -151 -6729 -2848 8058 -13268 -10120 8458 24626 26783 11008 -8506
7897h506J4296K8928n551j6546p866J7521j4297j4426K584N453J2344R850j2937
$$ -8506 5790 34718 29167 12621 4755 22276 7979 -6447 -3863 1590 13934 23784 10847
7884A0847J353K9144Q543p926j5845j6058N719J7260j1632l4608m295J2877Q203
$$ 10847 12200 41344 49887 41961 26116 10058 15777 33037 21405 -13203 -17498 -4621 3582
7871C582j0364l4347J4165O652R813Q599j1216J88n966k720J0511J5816o886k1073
$$ 3582 -6782 -41129 -26964 -20312 -10499 -1900 -13116 -12928 -18894 -21614 -11103 4713 -2173 -23246
7857b3246K603K4628K9774J8346l739p994O644j4167m066l885o548k2384k0538
$$ -23246 -20643 3985 33759 52105 48366 40372 47016 32849 28783 24898 18350 -4034 -24572
7844b4572q262K4195J7431K2292M730m730k9649k6018K0697J9310M423P156J6034
$$ -24572 -32834 -8639 8792 31084 35814 31084 1435 -24583 -3886 15424 19847 27003 43037
7831D3037j7314l0247K9119J5463k0456j4846K5330Q591o901p314k0700J5521
$$ 43037 25723 -4524 24595 40058 19602 4756 30086 38677 31776 24462 3762 19283
7819A9283n709O5n324j2425K244m549j4507J0347N658j9698l57M0788J2794j1904
$$ 19283 13574 13639 8315 -4110 -1866 -6415 -20922 -10575 -4917 -24615 -24972 15816 28610 16706
7805A6706J203k6481j7152J1502N864l0561p830K827n404N677N944l063L9988
$$ 16706 17909 -8572 -25724 -14222 -8358 -38919 -46749 -43922 -49326 -43649 -37705 -40768 -780
7792g80J4086l178J0934M041M3110o593k0217K6381P090l3412j8536j937o51J474
$$ -780 13306 10128 21062 25103 68213 61620 41403 67784 74874 41462 22926 20989 20338 21812
7778B1812Q88q837j0764p909J2097O113j2600L480k522j1886K2668J8897k5922
$$ 21812 22700 13863 3099 -4810 7287 13400 800 4280 1758 -10128 12540 31437 5515
7765E515m156K0034Q044r886J868q817J3302j4539j2363M922J4754j3679j4691
$$ 5515 1359 21393 29437 19551 21419 12602 25904 11365 -998 3924 18678 4999 -9692
7752i692K625p228L4801J52r027J0112k54k8292j412O786K6445J0611k018J1345
$$ -9692 -7067 -14295 20506 20658 11631 21743 21489 -6803 -8215 -1429 25016 35627 33609 44954
7738D4954k9700p179R676l2683J1054L4621L763k0790J1276K8005K3661J4656
$$ 44954 15254 8075 17751 -14932 -3878 30743 34506 13716 24992 52997 76658 91314
7726I1314j8558k3795j8900j3040j7849J5238O893k6288k4665J056L3882K2026
$$ 91314 72756 48961 30061 17021 -828 14410 21303 -4985 -29650 -28594 5288 27314
7714B7314K600P059q418j8256N188K2859R745m1246m542J8861N874p810m851j6943
$$ 27314 29914 36973 28555 10299 15487 38346 48091 6845 2303 21164 27038 19228 14377 -2566
7700b566r882j8602p096J399M701P209J5960O480J494O123J5196l2088j8079k886
$$ -2566 -12448 -31050 -38146 -36747 -32046 -24837 -8877 -2397 -903 5220 20416 -11672 -29751 -32637
7686c2637L921J7333o535R956O247K908N90m660j2646j855r456j6937R592J9462
$$ -32637 -28716 -11383 -17918 -7962 -1715 1193 1783 -2877 -15523 -17378 -26834 -43771 -34179 -14717
7672a4717J3827K7249p705k3340j5496J687J2297K0527Q552R53j4631k8737J1212
$$ -14717 -890 26359 18654 -4686 -20182 -18495 -6198 14329 22881 23834 9203 -19534 -8322
7659h322K3483P58k3467l3415K0415J8274J5713n512L016Q689M04j4564J3500
$$ -8322 15161 15919 -7548 -40963 -20548 -2274 13439 7927 10943 19632 20036 5472 18972
7646A8972L2974J4732l7526j26J291j4110m4030o291Q698J1620M803J8740J936
$$ 18972 51946 66678 29152 29026 30317 16207 -27823 -34114 -25416 -13796 -8993 9747 11683
7633A1683k0948K2252J8597q198j6457j9820J0766M270l3090j7704J1280L2570
$$ 11683 -9265 12987 31584 23386 6929 -12891 -2125 2145 -30945 -48649 -37369 -4799
7621d799j1548j8618O260l730j0371K948j0438n485J1492o533J2669K7661j3481
$$ -4799 -16347 -34965 -28705 -32435 -42806 -39858 -50296 -55781 -44289 -50822 -38153 -10492 -23973
7608b3973k5578L881K2598L599k295L106K02j56L3880J9631M355k3306J4984M995
$$ -23973 -49551 -45670 -23072 -19473 -21768 -18662 -18460 -18616 15264 34895 39250 15944 30928 35923
7594C5923j3614L161O055k139j6782k7292J0031J2204j2002K1977J1052j1677
$$ 35923 22309 25470 31525 29386 12604 -14688 -4657 7547 -4455 17522 28574 16897
7582A6897K0291M375k0272kM40M5r302k0199L216J1727N810p511j3876q096J8936
$$ 16897 37188 41563 21291 21289 21729 21774 12472 -7727 -4511 7216 13026 5515 -8361 -16457 2479
7567B479L5116J3517n4756m3645j4442M19J2376J5659j9402o433K1876J8044k3742
$$ 2479 37595 51112 -3644 -47289 -61731 -61312 -48936 -33277 -52679 -59112 -37236 -19192 -42934
7554d2934Q76M1590N203K404l0454j5027J038J6116N179o213J3322J0138L536
$$ -42934 -42058 -468 4735 7139 -23315 -38342 -37304 -21188 -16009 -22222 -8900 1238 4774
7541D774j9368r303r115p367K9230J4218k083o237K1361J4936j4406n059l0723
$$ 4774 -14594 -23897 -33012 -40379 -11149 3069 986 -5251 16110 31046 16640 11581 -19142
7528a9142j514j920L0250J7909j3870l8484r755M3666o192P319K7972j7242k3582
$$ -19142 -20656 -22576 7674 25583 11713 -26771 -36526 7140 948 8267 36239 18997 -4585
7515d585j0034J0888P30J9276l591k0073J7196J6559k770r153l9245m026J9463
$$ -4585 -14619 -3731 -3001 16275 12684 -7389 9807 26366 23596 14443 -24802 -28828 -9365
7502i365J6391K8979J4822n039m4451k22R70R2Q023j2019P89p916m760q515J5444
$$ -9365 7026 36005 50827 45788 1337 1115 2085 2177 10200 -1819 -1030 -8946 -13706 -22221 -6777
7487f777l460j4966L2271M0251j2641n618n544j1770n383Q274Q319l2901o05J1907
$$ -6777 -10237 -25203 7068 47319 34678 29060 23516 11746 6363 14637 22956 -9945 -10550 1357
7473A357j574k4142k2752j4528r750j9534O4661M4897K227j5140k0630N867n726
$$ 1357 -217 -24359 -47111 -61639 -71389 -90923 -26262 18635 20862 5722 -14908 -9041 -14767
7460a4767N440n495o783K9229J13p420j0181j3871J407K5113M673n231j1925j0556
$$ -14767 -9327 -14822 -21605 7624 7737 317 -9864 -23735 -22328 2785 7458 2227 -9698 -20254
7446b0254l1701r979L693K8115p876J4227O693J0868j1591N235K869j0747j5516
$$ -20254 -51955 -61934 -58241 -30126 -38002 -23775 -17082 -6214 -17805 -12570 -9701 -20448 -35964
7433c5964l977K3645J8616J0614k4414K111L9469j0135m7659j0793J2363J0978
$$ -35964 -39941 -16296 2320 12934 -11480 -9369 30100 19965 -27694 -38487 -26124 -15146
7421a5146K8364K9302k6641j7404J3307J9579jm0200j8561j4907j2061K5318L4258
$$ -15146 13218 42520 15879 -1525 11782 31361 31360 -8840 -27401 -42308 -54369 -29051 5207
7408E207J3684K4594J8180m7397j2071J013P425J6743M823j1344k367o40K767
$$ 5207 18891 43485 61665 14268 2197 3210 10635 27378 32201 20857 18490 17850 20617
7395B0617p277l522j194j0027j2528J0571J5877l045k1797j652L172L2840J0994
$$ 20617 13340 9818 8624 -1403 -13931 -3360 12517 9472 -12325 -13977 -10805 22035 33029
7382C3029k3524m21J9460j1211j5604l4187m869O273J5792O780q434o968k849
$$ 33029 9505 9084 28544 17333 1729 -32458 -37327 -31054 -15262 -8482 -16916 -23884 -26733
7369b6733j058j3778Q472J3775J5967R717l875l56K0030p100m433P728j4090j6712
$$ -26733 -27791 -41569 -33097 -19322 -3355 6362 2487 2131 22161 15061 10628 18356 4266 -12446
7355a2446N390L5525R143k0140m214o998K6002J9796K1279k779k6229k2057j1976
$$ -12446 -7056 28469 37612 17472 13258 6260 32262 52058 73337 70558 44329 22272 10296
7342A0296M873o692l9676P465P954O856p527R417K610O151K1081o831J029j7063
$$ 10296 15169 8477 -31199 -23734 -15780 -8924 -16451 -7034 -4424 1727 22808 15977 17006 -57
7328e7M413J1302K3232K804k0001k1503r251L6256K5135l1917j8386k1671j1840
$$ -57 4356 15658 38890 41694 21693 190 -9061 27195 52330 20413 2027 -19644 -31484
7315c1484j0647k0986J4944L8067j943L424N139m753j6698K3868J6589J6288J7217
$$ -31484 -42131 -63117 -48173 -10106 -12049 -8625 -3486 -8239 -24937 -1069 15520 31808 49025
7302D9025l846k4479q055k897O247p226n139n141J970Q472j1876O345O164r446
$$ 49025 45179 20700 12645 9748 15995 8769 3630 -1511 459 8931 -2945 3400 9564 118
7288A18K181j4314l0718P958J5104j1421j9279J1716N372j0734J8235j2686J2222
$$ 118 2299 -12015 -42733 -34775 -19671 -31092 -50371 -38655 -33283 -44017 -25782 -38468 -26246
7275b6246L320J2414M5030J6927j8475j8575k81n271J1969k337m8665l0140R035
$$ -26246 -22926 -10512 34518 51445 32970 14395 14114 8843 20812 18475 -30190 -60330 -51295
7262e1295Q600K0990M306J8356r327j2774L3577R683R90j4049J5954J9648q651
$$ -51295 -42695 -21705 -17399 957 -8370 -21144 12433 22116 23106 9057 25011 44659 36008
7249C6008k4431L56O741j4831l429r689j2952k506n836p051K4615J6851j0605
$$ 36008 11577 11933 18674 3843 414 -9275 -22227 -24733 -30569 -37620 -13005 3846 -6759
7236f759Q534J4166K224l082K880j2149j4309M1689Q945l6823l4487j0489J2057
$$ -6759 1775 15941 18165 15083 17963 5814 -8495 33194 42139 5316 -29171 -39660 -27603
7223b7603J5471j7173k957O543J6550n879n898k203J602J2676K8239J3361j5274
$$ -27603 -12132 -29305 -32262 -25719 -9169 -15048 -20946 -23149 -21547 -8871 19368 32729 17455
7210A7455l696J1114j0000k1981j0916j7222R529N1857R028O892j7029K1021r623
$$ 17455 13759 24873 14873 -7108 -18024 -35246 -25717 26140 35168 42060 25031 46052 36429
7197C6429l1792k646n10k011K377k5373o480J4203J6612k0602j4091j8204Q458
$$ 36429 4637 1991 1481 -530 1847 -23526 -30006 -15803 809 -19793 -33884 -52088 -43630
7184d3630K56J2104M6513Q286q806J6611L1775J2315k1213l6684p723j94P122
$$ -43630 -43374 -31270 15243 23529 14723 31334 63109 75424 54211 17527 9804 9610 16732
7171A6732r455k1192l2327J373R085L728k748q187o787N302Q482L4133j4392P699
$$ 16732 7277 -13915 -46242 -44869 -35784 -32056 -34804 -42991 -49778 -44476 -35994 -1861 -16253 -8554
7157h554J7008J5354L513J3173k2586j1126m396J0794P949K290j2371j2864J3358
$$ -8554 8454 23808 27321 40494 17908 6782 2386 13180 21129 23419 11048 -1816 11542
7144A1542n602j0991J1152J7711Q080j6229J1607j7452r340L6165J5788j5073
$$ 11542 5940 -5051 6101 23812 31892 15663 27270 9818 478 36643 52431 37358
7132C7358m580j4278n278L82j5461M30n964r042K9156J5494r84j4360j6468J1493
$$ 37358 32778 18500 13222 13604 -1857 -1427 -7391 -16433 12723 28217 27233 12873 -3595 7898
7118G898j7761o392M984K778P346k583R24j2332J5536j6247l0014j5965l050K5989
$$ 7898 -9863 -16255 -11271 -8493 -1147 -3730 -2806 -15138 398 -15849 -45863 -61828 -64878 -38889
7104c8889P901j449J5013J5158q086K1194j6887k0591o654M054J955J8565q437
$$ -38889 -30988 -32437 -17424 -2266 -10352 10842 -6045 -26636 -33290 -29236 -27281 -8716 -17153
7091a7153k9164M303J3148k2575r317J1587j8786m861K7648J4595l590J920K5641
$$ -17153 -46317 -42014 -28866 -51441 -60758 -49171 -67957 -72818 -45170 -30575 -34165 -32245 -6604
7078f604o296k5389J0747J7126R096j3879J1902K6402j0467J1568N647j9618J3554
$$ -6604 -12900 -38289 -27542 -10416 -1320 -15199 -3297 23105 12638 24206 29853 10235 23789
7065B3789l49k299J220P011l4248J6325K1668m42q239J1812k0614j6354J2127
$$ 23789 23440 21141 22361 29372 -4876 11449 33117 32675 24436 36248 15634 -720 11407
7052A1407J0710j950O941P602J5898K4560j8578k3191k9039J1158j4248j1558
$$ 11407 22117 20167 27108 34710 50608 75168 56590 33399 4360 15518 1270 -10288
7040a0288J4588K1549l255j0301J2661R175l864m3274m012J5928o349j0599N831
$$ -10288 4300 25849 22594 12293 24954 34129 30265 -13009 -17021 -1093 -7442 -18041 -12210
7027a2210M080J3901p729j7612K3345J0912j779l519J3535k288j3886J6114K469
$$ -12210 -8130 5771 -1958 -19570 3775 14687 12908 9389 22924 20636 6750 22864 25333
7014B5333L141K1479k7452M224P252k5914m082l569J5276K6416j5356k4833j2508
$$ 25333 28474 49953 22501 26725 33977 8063 3981 412 15688 42104 26748 1915 -10593
7001a0593M167O284J0569L9308j1212k0303j3300K1964O161q0k4236n520M090
$$ -10593 -6426 -142 10427 49735 38523 18220 4920 26884 33045 32965 8729 3209 7299
6988G299J2781j4755n496J2929k5765l4222L968J0211o491P626J4490k3518J1418
$$ 7299 20080 5325 -171 12758 -13007 -47229 -43261 -33050 -39541 -31915 -17425 -40943 -29525
6975b9525K8485k318l8706k3386N073M0576L6203L457rQ189k6479m914J643p776
$$ -29525 -1040 -3358 -42064 -65450 -60377 -19801 16402 19859 19850 28039 1560 -3354 -1711 -9487
6961i487J1669J414r320J8169J209k3764o401M069K6801j4865O445J9764j7932
$$ -9487 2182 3596 -5724 12445 13654 -10110 -16511 -12442 14359 -506 5939 25703 7771
6948G771n331L350R826O409j1745P21N584R83m842k4034J52n085L314O480m460
$$ 7771 2440 5790 15616 22025 10280 11001 16585 17568 12726 -11308 -11156 -16241 -12927 -6447 -10907
6933a0907J3170k9547k6010L3457O292J6000J1866j646k3574k2975k531J4682
$$ -10907 2263 -27284 -53294 -19837 -13545 2455 14321 12675 -10899 -33874 -36405 -21723
6921b1723j3372r13J15K4633J6088o636k087J9149j638l4225n347n340q539j2472
$$ -21723 -35095 -36008 -35893 -11260 4828 -1808 -3895 15254 13616 -20609 -25956 -31296 -39835 -52307
6907e2307K0652K3760Q095p611J7478M3484o106L566l1930k1957n355k1470l026
$$ -52307 -31655 -7895 200 -7411 10067 53551 47445 51011 19081 -2876 -8231 -29701 -32727
6894c2727P326M063r280K3156o74m833l659k2810K0912K2623J0048r06J4451J809
$$ -32727 -25401 -21338 -30618 -7462 -8136 -12969 -16628 -39438 -18526 4097 14145 13239 27690 29499
6880B9499o475p142p593k0407j7304L282K0006o545N043J2391J2367n249J78j5504
$$ 29499 23024 15882 8289 -12118 -29422 -26140 -6134 -12679 -7636 4755 17122 11873 12051 -3453
6866c453k9638q723M453N101R478p201k452K3192K5617o148j4234l9990p509L827
$$ -3453 -33091 -41814 -37361 -32260 -22782 -29983 -32435 -9243 16374 10226 -4008 -43998 -51507 -47680
6852d7680J5038J558K9394Q858O866n139j0401J4952K1224k0437k8733J6830L047
$$ -47680 -32642 -31084 -1690 7168 14034 8895 -1506 13446 34670 14233 -14500 2330 5377
6839E377j5931l3599j646j5774J0829J5790p065O814N934J6703j0292j0334O420
$$ 5377 -10554 -44153 -45799 -61573 -50744 -34954 -42019 -35205 -29271 -12568 -22860 -33194 -26774
6826b6774Q665P573j7637O835j9028K623J5300J6758j0593m888j0173L6648l448
$$ -26774 -18109 -10536 -28173 -21338 -40366 -37743 -22443 -5685 -16278 -21166 -31339 5309 1861
6813A861m8538k2977K2986M1382K7750j0874p474J3571k909m0984k3825J0482
$$ 1861 -46677 -69654 -46668 -5286 22464 11590 4116 17687 14778 -26206 -50031 -39549
6801c9549J8266K1899q513k7876j8430J9166l64J4201L6439J6041j5777J102m279
$$ -39549 -21283 616 -7897 -35773 -54203 -35037 -35401 -21200 15239 31280 15503 16605 12326
6788A2326k6614r28k1289j8683K3650K1131K1195J7024k5919J3462K902r724o640
$$ 12326 -14288 -15216 -36505 -55188 -31538 -10407 10788 27812 1893 15355 18257 8533 1893
6775A893k4757j3597q518J2189n800J750K2020M95M463J7167K29Q627N079k1428
$$ 1893 -22864 -36461 -44979 -32790 -38590 -36840 -14820 -14325 -9862 7305 7534 16161 21240 -188
6761a88p399R896J5047J0966o994j221M868o486N452j3920n041L375j5451j199
$$ -188 -7587 2309 17356 28322 21328 20107 24975 18489 23941 10021 4980 8355 -7096 -8295
6747h295J4150k530k3743j1307K4556J2654o896k7208l4466K813o667K9074K6470
$$ -8295 5855 3325 -20418 -31725 -7169 5485 -1411 -28619 -63085 -60272 -66939 -37865 -11395
6734a1395N502j3706J7066J0219Q206r416r0k317k063K1937k5824p523j7k2851
$$ -11395 -5893 -19599 -2533 7686 15892 6476 6386 4069 2006 23943 -1881 -9404 -9421 -32272
6720c2272j2424j1686J0099K941J806O992P840p847q700J3531K3882L3187j3168
$$ -32272 -44696 -56382 -46283 -43342 -41536 -34544 -26704 -34551 -43251 -29720 -5838 27349 14181
6707A4181m1309j2932K9289J6521j3537N372k083M948k2157k4419Q87J497J1427
$$ 14181 -27128 -40060 -10771 5750 -7787 -2415 -4498 450 -21707 -46126 -45239 -43742 -32315
6694c2315K2465o069j9356K017Q137J4155j6211j2586M7976K4090p226o962n674
$$ -32315 -9850 -15919 -35275 -33258 -25121 -10966 -27177 -39763 8213 32303 25077 18115 12441
6681A2441k2534Q283L3238R578j9313O907j1824k1472O931O320J984j1409o920
$$ 12441 -10093 -1810 31428 41006 21693 28600 16776 -4696 2235 8555 10539 -870 -7790
6668g790P958M066K0490K4056Q384k361q753j9504k3987p313j1359j4660p379
$$ -7790 168 4234 24724 48780 57164 54803 46050 26546 2559 -4754 -16113 -30773 -38152
6655c8152K2522K1130L4N174q68K2685l210l1471l2453j2815K7990K7905j789
$$ -38152 -15630 5500 5534 10708 9840 32525 29315 -2156 -34609 -47424 -19434 8471 6682
6642F682q747r06K809P408n7k015Q572J6437Q753k0584Kj6586j8471J9292L2790
$$ 6682 -2065 -2971 -162 7246 7189 5174 13746 30183 38936 18352 18354 1768 -16703 2589 35379
6627C5379J058q518N63j4333J4353k791k2521N564K8601j7671j2205j30j4231
$$ 35379 36437 27919 28482 14149 28502 25711 3190 8754 37355 19684 7479 7349 -6882
6614f882r425l107p248K5985K7489j7939k0112r564K2484K0190j1495j6922j75
$$ -6882 -16307 -19414 -26662 -677 26812 8873 -11239 -20803 1681 21871 10376 -6546 -6721
6601f721o504j8153j5352m624K7153L036R594R985L197j3951J0762j0466n848
$$ -6721 -13225 -31378 -46730 -51354 -24201 -21165 -11571 -1586 1611 -12340 -1578 -12044 -17892
6588a7892P859m336k889k2089l545J083J2486J1297O130J6911k1529j5432K4903
$$ -17892 -10033 -14369 -17258 -39347 -42892 -41809 -29323 -18026 -11896 5015 -16514 -31946 -7043
6575g043R285k8543l842Q867N975J1551n631J9864L04k3245j0642l04J4239m713
$$ -7043 2242 -26301 -30143 -21276 -15301 -3750 -9381 10483 10787 -12458 -23100 -23404 -9165 -13878
6561a3878p225k498K1080K716l5275j5492J2314r329k8989R704K9080P830K3938
$$ -13878 -21103 -23601 -2521 195 -35080 -50572 -38258 -47587 -76576 -66872 -37792 -29962 -6024
6548f024k411j5504O834K3550K2683J5156j4606o078j3985j7939j0624J5247K2306
$$ -6024 -8435 -23939 -17105 6445 29128 44284 29678 23600 9615 -8324 -18948 -3701 18605
6535A8605l823K0596J5927j0176j8531k05J686r971k0262j6752K3471k960k8920
$$ 18605 14782 35378 51305 41129 22598 22393 24079 14108 -6154 -22906 565 -2395 -31315
6522c1315l3565k7818J9752K8560J0427K9728J9156Q383N931j5846J146R326M747
$$ -31315 -64880 -92698 -72946 -44386 -33959 -4231 14925 23308 29239 13393 14539 23865 28612
6509B8612j511J667j8027j1468p961k1621j1197K610M6153K0488P707m172n934
$$ 28612 27101 28768 10741 -727 -8688 -30309 -41506 -38896 7257 27745 35452 31280 25346
6496B5346p882k3089k4280K30J4547L859j859k3958J1926K9442K4169O507m980
$$ 25346 17464 -5625 -29905 -29675 -15128 -11269 -13128 -37086 -25160 4282 28451 34958 29978
6483B9978R470q010k4901O311p348j1804J2399o417k331P921M917O883K773j1689
$$ 29978 39448 31438 6537 12848 5500 -6304 6095 -322 -2653 5268 10185 17068 19841 8152
6469H152N90J0991O884k1118j7472j7280O133p10L429J6535p474R409K2857J2973
$$ 8152 8742 19733 26617 5499 -11973 -29253 -23120 -23830 -20401 -3866 -11340 -1931 20926 33899
6455C3899P945M989P6J807o834k8705k2900M602R709J7170J7338m597j3349j1000
$$ 33899 41844 46833 46909 48716 41882 13177 -9723 -5121 4588 21758 39096 34499 21150 10150
6441A0150J8633J1039n838k4310k2821j62J1682K315J0106R860J0600k2312j5674
$$ 10150 28783 39822 33984 9674 -13147 -13309 -1627 688 10794 20654 31254 8942 -6732
6428f732o575J1759Q05L873j0753J2957K8137J7694P571j4153J2706M199k2091
$$ -6732 -13307 -1548 -743 3130 -7623 5334 33471 51165 58736 44583 57289 61488 39397
6415C9397m0804N461j1225J5916J7377M713m0506l3699R930O474M174j4579J5460
$$ 39397 -1407 4054 -7171 8745 26122 30835 -9671 -43370 -33440 -26966 -22792 -37371 -21911
6402b1911J2527n43K116J0713J621n00q897O245j673R879O943k2596o795p551
$$ -21911 -9384 -9927 -7811 2902 4523 4023 -4874 1371 -302 9577 16520 -6076 -12871 -20422
6388b0422p065J5592j6792J064J9252J3426K3346j4262j3856l361n553M28J0212
$$ -20422 -27487 -11895 -28687 -27623 -8371 5055 28401 14139 283 -3078 -8631 -8203 2009
6375B009j5207q731j0664o914K2305J9724N619J3555j4916n537o51j5979n446
$$ 2009 -13198 -21929 -32593 -39507 -17202 2522 8141 21696 6780 1243 592 -15387 -20833
6362b0833K5248K8052l8186P164j903o938n849R305l957l008J4337j5684l75J2257
$$ -20833 4415 32467 -5719 1445 -458 -7396 -13245 -3940 -7897 -10905 3432 -12252 -12627 -370
6348c70R714q667j6017K8953o857O682L3903j7975m0794j0230k804P726k260K2280
$$ -370 9344 677 -15340 13613 6756 13438 47341 29366 -11428 -21658 -24462 -16736 -18996 3284
6334C284Q538r951Q588Q486j806J3399L411j8946j9579m014k929O09J4966N972
$$ 3284 11822 1871 10459 18945 17139 30538 33949 15003 -4576 -8590 -11519 -10910 4056 10028
6320A0028n319O94l1705k5804L78K8054K4210J7906j9075m208L980l798L082J7212
$$ 10028 4709 5403 -26302 -52106 -51728 -23674 536 18442 -633 -4841 -861 -4659 -1577 15635
6306A5635P166m75l169k6168r055J0705K402j959J624J3168J600M310J1875M073
$$ 15635 22801 22326 19157 -7011 -16066 -5361 -2959 -4918 -3294 9874 11474 15784 27659 31732
6292C1732k2578k0057L649P319j1973j907j753Q834J1853j0417r754J2704L322
$$ 31732 9154 -10903 -7254 65 -11908 -13815 -15568 -6734 5119 -5298 -15052 -2348 974
6279I74k1802j6707L466Q777J4195m387J317m655L1684k2770k2158J4630J2656
$$ 974 -20828 -37535 -34069 -25292 -11097 -15484 -14167 -18822 12862 -9908 -32066 -17436 -4780
6266d780N668L260R546j4193q846r064k5490L829M835J1726J1897l430J8186r306
$$ -4780 888 4148 13694 -499 -9345 -18409 -43899 -40070 -35235 -23509 -11612 -15042 3144 -6162
6252f162n645l358K1752J3598J0609n839j6406j525j6129p715m502k214l0477
$$ -6162 -11807 -15165 6587 20185 30794 24955 8549 7024 -9105 -16820 -21322 -23536 -54013
6239e4013j685J7553k894q883J3175K312l839K1547j4100l001q232l692L0350
$$ -54013 -55698 -38145 -41039 -49922 -36747 -34435 -38274 -16727 -30827 -33828 -42060 -45752 -15402
6226a5402K1566K564k943k4323M486M525J0671j2584k1112p471m077j4649K8047
$$ -15402 6164 8728 5785 -18538 -14052 -9527 1144 -11440 -32552 -40023 -44100 -58749 -30702
6213c0702N3612K4606j0288l5497k5900J5400L5545P06k0890m890P786k5249j1765
$$ -30702 22910 47516 37228 1731 -24169 -8769 26776 27482 6592 1702 9488 -15761 -27526
6200b7526j3198j4515m134K2430O955J3481n35L05J9936l102k4058j8352J3824
$$ -27526 -40724 -55239 -59373 -36943 -29988 -16507 -17042 -16737 3199 97 -23961 -42313 -28489
6187b8489K7355K5074L398p808k4278m857j3876L664o699K7120M876k221L405
$$ -28489 -1134 23940 27338 19530 -4748 -9605 -23481 -19817 -26516 604 5480 3259 6664
6174F664k1213N417q579j3818J2067L3078K8587j1117l1528j0116n448o268K3994
$$ 6664 -14549 -9132 -17711 -31529 -19462 13616 42203 31086 -442 -10558 -16006 -22274 1720
6161A720J3452k8889j2897P370l580k0170k563O788L7318r523j1518J4529R440
$$ 1720 15172 -13717 -26614 -19244 -22824 -42994 -45557 -38769 -1451 -10974 -22492 -7963 1477
6148A477J4485j7644k3560j8382J3687J0648J144M116k1135r16N043K1045K0301
$$ 1477 15962 -1682 -25242 -43624 -29937 -19289 -18145 -14029 -35164 -36080 -31037 -9992 10309
6135A0309j5826l4412m223J6392L377J8266L751K1137N389p5k5609N11J1727N92
$$ 10309 -5517 -39929 -44152 -27760 -24383 -6117 -2366 18771 24160 24085 -1524 -1013 10714 11306
6121A1306Q618k7380M786P135j9370j2081J146Q824J7136R034m863j4689J633
$$ 11306 19924 -7456 -2670 4465 -14905 -26986 -25840 -17016 120 9154 4291 -10398 -8765
6108h765j0082O233J101j1106J1350J9515P172J6293L4425j6698l4015l9852K4196
$$ -8765 -18847 -12614 -11513 -22619 -11269 8246 15418 31711 66136 49438 15423 -24429 -233
6095b33j95j2494j417L5814k139k2582J7229J0352j961K975j3573q442k0102k7098
$$ -233 -428 -12922 -14339 21475 19336 -3246 13983 24335 22374 25349 11776 3334 -16768 -43866
6081d3866J6133J6068p714O338j5128J7878l474o104J730J736L748J8012q148
$$ -43866 -27733 -11665 -19379 -13041 -28169 -10291 -13765 -19869 -18139 -16403 -12655 5357 -2791
6068b791p086J7841o493j4448j8605m615M404M9445J7013j0421k844k4708J2698
$$ -2791 -9877 7964 1471 -12977 -31582 -36197 -31793 17652 34665 24244 21400 -3308 9390
6055I390K707k34k928l35m942r820J1007j5615m128o56K2100n512n357o062J417
$$ 9390 12097 11863 8935 8600 3658 -6162 4845 -10770 -14898 -15554 6546 1034 -4323 -10385 -8968
6040h968l753J2487Q736L073P987k6682N978J1669l908j3005k7194P640K0940
$$ -8968 -12721 -234 8502 11575 19562 -7120 -1142 10527 6619 -6386 -33580 -25940 -5000
6027e000n708J1894J4258j502J7625L044J7117j4482j4563l446M616O454J487
$$ -5000 -10708 1186 15444 13942 31567 34611 51728 37246 22683 19237 23853 30307 31794
6014C1794M317J0156l3164J696K746j6368p061J230r813Q14r694p16M93Q341p441
$$ 31794 36111 46267 13103 14799 17545 1177 -5884 -4654 -14467 -13653 -23347 -24063 -23570 -15229 -22670
5999b2670O968J1671j5181O526P782O194J1485n758J2732j1038q202Q247K5183
$$ -22670 -15702 -4031 -19212 -12686 -4904 1290 12775 7017 19749 8711 509 8756 33939
5986C3939p18o3q377k4998k5498J8140L0559l142M897q01j8254l6075n563J5516
$$ 33939 33221 33158 24781 -217 -25715 -7575 22984 19842 24739 23938 5684 -30391 -35954 -20438
5972b0438J1691j6623J1935N148R169J3002j7469J7233P676j4529j6887j013J7722
$$ -20438 -8747 -25370 -13435 -8287 882 13884 -3585 13648 21324 6795 -10092 -11105 6617
5959F617O18k9486j4995J1989L449Q08R156j352q358k7575n040J5316R172l725
$$ 6617 7235 -22251 -37246 -25257 -21808 -21000 -11844 -13196 -21554 -49129 -54169 -38853 -29681 -33406
5945c3406J7938J3604J4863K763k1516j9346j3532k2868j9481J1996N7977J1081
$$ -33406 -15468 -1864 12999 15762 -5754 -25100 -38632 -61500 -80981 -68985 -11008 73
5933G3L026n275K480q199P955K0701K408Q648k0434p059R393O726Q40l88n465
$$ 73 3099 -2176 304 -7895 60 20761 23169 31817 11383 4324 13717 20443 21283 20895 15430
5918A5430J4632r534r186j4238K7387r871j6280j1974o571L7606J8708k1108q186
$$ 15430 30062 20528 11342 -2896 24491 14620 -1660 -13634 -20205 17401 36109 15001 6815
5905F815J0783J0987j7338p742j4198O887M31Q15P318n309j684J8468J1627j1561
$$ 6815 17598 28585 11247 3505 -10693 -3806 -3375 -2560 4758 -551 -2235 16233 27860 16299
5891A6299o496j1827j553N108K876j3965K007J104k557n854j9993J1373r190Q867
$$ 16299 9803 -2024 -3577 1531 4407 -9558 -7551 -6447 -9004 -14858 -34851 -23478 -32668 -23801
5877b3801J0080M317m231n585k1596J4551M79J0817K162J0451q907j708J4209
$$ -23801 -13721 -9404 -13635 -19220 -40816 -26265 -25786 -14969 -12807 -2356 -11263 -12971 1238
5864A238J139M962M0303j9378l8698N855R975m738k3940j0719R221K0408K975
$$ 1238 2377 7339 47642 28264 -10434 -4579 5396 658 -23282 -34001 -24780 -4372 -1397
5851a397j4900j3815k462K3474L986j3305Q821l780k096M556n894K4580J5084
$$ -1397 -16297 -30112 -32574 -9100 -5114 -18419 -9598 -13378 -15474 -10918 -16812 7768 22852
5838B2852j5392j3691Q796o192P181L321K579M226j8542r831j346J2417M437m31
$$ 22852 7460 -6231 2565 -3627 3554 6875 9454 13680 -4862 -14693 -16039 -3622 815 384
5824C84O198L088k0617k1292M911O909J2286K8209K9961J0882k767l4942k9772
$$ 384 6582 9670 -10947 -32239 -27328 -20419 -8133 20076 50037 60919 58152 23210 -6562
5811f562l011Q048j0383K960n855J3393j5155l763j4846j5668K7133L3923M980
$$ -6562 -9573 -1525 -11908 -8948 -14803 -1410 -16565 -20328 -35174 -50842 -23709 10214 15194
5798A5194J5794J688j9355N306k1798j4283K4936j0976m989J0963M717m657J9745
$$ 15194 30988 32676 13321 18627 -3171 -17454 7482 -3494 -8483 2480 7197 2540 22285
5785B2285k2757r632K739k8404q167N416L5474J624n957M970J1436p186m057j3739
$$ 22285 -472 -10104 -7365 -35769 -43936 -38520 -3046 -1422 -7379 -2409 9027 1841 -2216 -15955
5771a5955j0084K1940K6134J0132o074l281k2199j5245J4407J857K736o154r272
$$ -15955 -26039 -4099 22035 32167 26093 22812 613 -14632 -225 1632 4368 -1786 -11058
5758a1058K1831J9537j9154J3220K3116r62j4709m7789q60J9692n267o20j3475
$$ -11058 10773 30310 11156 24376 47492 46530 31821 -15968 -16828 2864 -2403 -3023 -16498
5745a6498J7316J9135j3690o784j3795n72m595j789J7420j142K0876M703r502
$$ -16498 818 19953 6263 -521 -14316 -14888 -19483 -21272 -3852 -4994 15882 20585 11083
5732A1083N438j5656j7156K255p212Q713J5096M220m917l8798j5038j2647N3177
$$ 11083 16521 865 -16291 -14036 -21248 -12535 2561 6781 1864 -36934 -51972 -64619 -11442
5719a1442J9070Q796K5147O926j4663L774r771k1774k0293l937P225O474J150
$$ -11442 7628 16424 41571 48497 33834 37608 27837 6063 -14230 -18167 -10942 -4468 -3318
5706c318J1693R706P641O184N990m105k1597j7627J5807J0179J9945K3834l0412
$$ -3318 8375 18081 25722 31906 37896 33791 12194 -5433 10374 20553 40498 64332 33920
5693C3920l3030J7596J6120K53k3194j7777N840L414j906q135j4927J7212J0462
$$ 33920 890 18486 34606 34859 11665 -6112 -272 3142 1236 -6899 -21826 -4614 5848
5680E848q298O346J2159j9521J1035r659p481j0548K0893K5196N091j1742j8328
$$ 5848 -2450 3896 16055 -3466 7569 -2090 -9571 -20119 774 25970 31061 19319 991
5667I91P166j7018q128J9416o037k5627K465J6862M139p616R193M163l320j2841
$$ 991 8157 -8861 -16989 2427 -3610 -29237 -26772 -9910 -5771 -13387 -4194 -31 -3351 -16192
5653a6192N58j7768p259K2073K5622j7359k1636J499L3353J9422Q377Q304j1078
$$ -16192 -15634 -33402 -40661 -18588 7034 -10325 -31961 -30462 2891 22313 30690 38994 27916
5640B7916k5874k5120k8J141R283l6177R424J1676K6060K3755O823j6177R757
$$ 27916 2042 -23078 -23106 -21965 -12682 -48859 -39435 -27759 -1699 22056 28879 12702 22459
5627B2459m0l701K734R1P15j7000k6246n696K24P936K8863J2637j3829M567J9601
$$ 22459 22419 18718 21452 21543 22258 5258 -20988 -26684 -26460 -18524 10339 22976 9147 13714 33315
5612C3315j5803j3338k5111j09J8217M367Q638j1420j241j3004o736k206k6608
$$ 33315 17512 4174 -20937 -21046 -2829 1538 10176 -1244 -2485 -15489 -22225 -24431 -51039
5599e1039J5317K2940J2197J2897p089n262q161j5628j4060l620J7935L2426n796
$$ -51039 -35722 -12782 -585 12312 5223 -39 -8200 -23828 -37888 -41508 -23573 8853 3057
5586C057L491p86k614K132K3269P309J439M77J298l1422p428r92J4031J4919q005
$$ 3057 6548 5762 3148 5280 28549 35858 37297 37774 39072 7650 222 -770 13261 28180 20175
5571B0175M896j3566k3107P324k16J335N459o0j5063j6707P505m07j976J4355
$$ 20175 25071 11505 -11602 -4278 -4494 -3159 2300 2240 -12823 -29530 -22025 -22432 -24408 -10053
5557a0053J4372j4643J1451r297q604O039J4529L977j2392J6470N307j9357j6041
$$ -10053 4319 -10324 1127 -8170 -16774 -10735 3794 7771 -4621 11849 17156 -2201 -18242
5544a8242j9733k5052K4663K3927o330j5713L0139K9801N988j2651q245j4172
$$ -18242 -37975 -63027 -38364 -14437 -20767 -36480 -6341 23460 29448 16797 8552 -5620
5532e620r732j27l9836j0519P868j7930k550M1810Q765p709J3902J1985J9833
$$ -5620 -15352 -15479 -55315 -65834 -57966 -75896 -78446 -36636 -27871 -35580 -21678 -9693 10140
5519A0140K065r963P144N67N117k280M399J6698k0317J813K582k0275J4922j1823
$$ 10140 12205 2242 9386 9953 15070 12790 17189 33887 13570 15383 17965 -2310 12612 789
5505G89j7840j5980j3936k3895j9988K7417M8357R353j6507j5728J6469K8464
$$ 789 -17051 -33031 -46967 -70862 -90850 -63433 -15076 -5723 -22230 -37958 -21489 6975
5493F975P168o827K2383O879k1527q18k0306n663k856j6765K9568m422q293L374
$$ 6975 14143 7316 29699 36578 15051 14233 -6073 -11736 -14592 -31357 -1789 -6211 -14504 -11130
5479a1130J3211K962j9079n484K4974k687j4699J629n267j7613J0952Q749P863
$$ -11130 2081 5043 -14036 -19520 5454 2767 -11932 -10303 -15570 -33183 -22231 -13482 -5619
5466e619J81j9548P58M577j897k243K9962q422k1070l632O498K2207l267m667
$$ -5619 -5438 -24986 -24228 -19651 -21548 -23791 6171 -2251 -23321 -26953 -20455 1752 -1515 -6182
5452f182n23R018k3784j0770K5879J1292j0837j3921j2123J4223o013j9410K7214
$$ -6182 -6705 2313 -21471 -32241 -6362 4930 -5907 -19828 -31951 -17728 -23741 -43151 -15937
5439a5937O299J6600j87l5143j6544J0519J8301j0317J8031K3569J9601q306Q679
$$ -15937 -9638 6962 6775 -28368 -44912 -34393 -16092 -26409 -8378 15191 34792 26486 35165
5426C5165j0475j1030k5627o047K2682K0920L431j8327l066o778j4616R911j579
$$ 35165 24690 13660 -11967 -18014 4668 25588 29019 10692 7626 848 -13768 -3857 -5436
5413e436p641K292J593J1662j4653j2680L7427l292q269j0041j4575K3674r106
$$ -5436 -13077 -10785 -9192 2470 -12183 -24863 12564 9272 1003 -9038 -23613 61 -9045
5400i045m423K902j3247j0947K4918J6470k5364r246K4711m578K4612R892P385
$$ -9045 -13468 -10566 -23813 -34760 -9842 6628 -18736 -27982 -3271 -7849 16763 26655 34040
5387C4040k7372k6966J6583J9983j0543O476p762j8298L04k0450j2223R119J4827
$$ 34040 6668 -20298 -3715 16268 5725 12201 4439 -13859 -13555 -34005 -46228 -37109 -22282
5374b2282r067R736L2777o190j289m155j0357j6317j3146K780K2233l021K289
$$ -22282 -31349 -21613 11164 4974 3685 -470 -10827 -27144 -40290 -37510 -15277 -18298 -16009
5361a6009l616O90J0613j1726n937O466p05K0336J2499p218O831j8543k2745o254
$$ -16009 -19625 -18935 -8322 -20048 -25985 -19519 -20224 112 12611 5393 12224 -6319 -29064 -35318
5347c5318J3441L4038J6056j735k6084o503k558j3718L718K3431Q109K1002j451
$$ -35318 -21877 12161 28217 26482 398 -6105 -8663 -22381 -18663 4768 12877 33879 32428
5334C2428l0548j9290k146j2572K6035K4440M577j485o622J0560L221O033l417
$$ 32428 1880 -17410 -19556 -32128 -6093 18347 22924 21439 14817 25377 28598 34631 31214
5321C1214j5220J2779j6362O549q26q847l166N200K4452K0349q708j7071N778
$$ 31214 15994 28773 12411 18960 18134 9287 6121 11321 35773 56122 47414 30343 36121
5308C6121Q758j4011j6280k2015K343K463M2015P857j9436j0382l5293j3191K6474
$$ 36121 44879 30868 14588 -7427 -5084 -2621 39394 47251 27815 17433 -17860 -31051 -4577
5295d577J764K4211m367j9195o452N885j974j2217J0565K5171r074O268k1130
$$ -4577 -2813 21398 17031 -2164 -8616 -2731 -4705 -16922 -6357 18814 9740 16008 -5122
5282e122q525M810J8414k7886j1812K709p303m624K9248N949j8992k0695J9192
$$ -5122 -13647 -8837 9577 -18309 -30121 -27412 -34715 -39339 -10091 -4142 -23134 -43829 -24637
5269b4637j6697J6751P945j348L0083J2646r777k286j1291j3262K0808q884m008
$$ -24637 -41334 -24583 -16638 -17986 12097 24743 14966 12680 1389 -11873 8935 51 -3957
5256c957o454J1400K5695J0683j3999k1376j0131j1881j1817q177m750Q492p858
$$ -3957 -10411 989 26684 37367 23368 1992 -8139 -20020 -31837 -40014 -44764 -36272 -44130
5243d4130K7405J2519l5311j2424K5087L8678J0433o312k3907m1037K953P147
$$ -44130 -16725 -4206 -39517 -51941 -26854 11824 22257 15945 -7962 -48999 -46046 -38899
5231c8899J3848K8782r80l548j9671j1434o185J4274J6089m113q606J8041N375
$$ -38899 -25051 3731 2751 -797 -20468 -31902 -38087 -23813 -7724 -11837 -20443 -2402 2973
5218B973R324j4592r798K0010J394P501j607l117K848l749P020o795j8097q515
$$ 2973 12297 -2295 -12093 7917 9311 16812 15205 12088 14936 11187 18207 11412 -6685 -15200
5204a5200L3609K7913k8928l2057j368M054J7379O403P499R42k3503j1421J7565
$$ -15200 18409 46322 17394 -14663 -16031 -11977 5402 11805 19304 20246 -3257 -14678 2887
5191B887J1496N621J1139K724j637j7067q769k1167m868O168q101l393J7758K3989
$$ 2887 14383 20004 31143 33867 32230 15163 6394 -14773 -19641 -13473 -21574 -24967 -7209 16780
5177A6780J012j1661j8082J9758R400j1218N057k514o214J2492j6039j5906M72
$$ 16780 17792 6131 -11951 7807 17207 5989 11046 8532 2318 14810 -1229 -17135 -16663
5164a6663J8768J1448J5074J8712l1178j2129l8470L493M186l345j45m285k8385
$$ -16663 2105 13553 28627 47339 16161 4032 -34438 -30945 -26759 -30104 -30249 -34534 -62919
5151f2919R737J9720J1044k364N220m729J0715L5195J0508M980j7562N171j8819
$$ -62919 -53182 -33462 -22418 -24782 -19562 -24291 -13576 21619 32127 37107 19545 24716 5897
5138E897j3938j0625j92O905o408M608l3370n260M624O009K0765J7874j9047k1478
$$ 5897 -8041 -18666 -18858 -11953 -18361 -13753 -47123 -52383 -47759 -41750 -20985 -3111 -22158 -43636
5124d3636K0231K6811L123m3806p414L1024L5901J2374J5573k1816k6405Q522
$$ -43636 -23405 3406 6529 -37277 -44691 -13667 22234 34608 50181 28365 1960 10482
5112A0482K1155n76o195p429k5057J1501R609j6704j4421K083j6214J197K1791
$$ 10482 31637 31061 24866 17437 -7620 3881 13490 -3214 -17635 -15552 -31766 -30569 -8778
5099h778J2538K185K668m4j7069r881m398o744L779K6937k0137O932K967P017
$$ -8778 3760 5945 8613 8569 -8500 -18381 -22779 -29523 -25744 1193 -18944 -12012 -9045 -2028
5085b028k2774P902q730j7925L1938J4954j3328j3400K5603LJ4145Q79k6112k996
$$ -2028 -24802 -16900 -25630 -43555 -11617 3337 -9991 -23391 2212 2215 16360 17239 -8873 -11869
5071a1869M729J8439J464j4579j335N59j9467k0520J2879r17o426l0269j3744
$$ -11869 -7140 11299 12763 -1816 -3151 -2592 -22059 -42579 -29700 -30617 -37043 -67312 -81056
5058h1056L9420L2261n938q55M541j521J6912J6649l928j0952j2513K6084q239
$$ -81056 -41636 -9375 -15313 -16168 -11627 -13148 3764 20413 16485 5533 -6980 19104 10865
5045A0865q491j3721r996l83j2581j6575q103J7235K9357K2097l783M386k328
$$ 10865 2374 -11347 -21343 -21726 -34307 -50882 -58985 -41750 -12393 9704 5921 10307 7979
5032G979o585K89O940j15K02p238j3514R950L5666l991k3646J9851j5757j397
$$ 7979 1394 1683 8623 8508 8710 1472 -12042 -2092 33574 29583 5937 25788 10031 8634
5018H634J0495j6129k1562J539r563P050p93j1468L1879P087Q258m693j985m0071
$$ 8634 19129 3000 -18562 -17023 -26586 -19536 -20329 -31797 82 7169 15427 10734 8749 -31322
5004c1322k174J0327J2197J0962J716J8560P092l6738j4935K0238K1204j762j1773
$$ -31322 -33496 -23169 -10972 -10 1706 20266 27358 -9380 -24315 -4077 17127 15365 3592
4991C592k5988m881O551j0138N380L3721L9012j4668j4844L239r495k0390j136
$$ 3592 -22396 -27277 -20726 -30864 -25484 8237 47249 32581 17737 20976 11481 -8909 -10045
4978a0045O542K8223l855k6874L776j2585j7493j5995O200J7229j2352M856j5883
$$ -10045 -3503 24720 20865 -6009 -2233 -14818 -32311 -48306 -42106 -24877 -37229 -32373 -48256
4965d8256j9439j4105K5480J3576m716J9855L2309K1143k0107r262M858Q808K3534
$$ -48256 -67695 -81800 -56320 -42744 -47460 -27605 4704 25847 5740 -3522 1336 10144 33678
4952C3678L0477j0134l0123l1516l88J5948J7842p776m582Q748J573k4629j3394
$$ 33678 64155 54021 23898 -7618 -8006 7942 25784 18008 13426 22174 23747 -882 -14276
4939a4276K0111J386j1276l238p17P345k1921o838J3231j4852m592j8632l4849
$$ -14276 5835 7221 -4055 -7293 -8010 -665 -22586 -29424 -16193 -31045 -35637 -54269 -89118
4926h9118K6428M3595J9892k781q666N272Q242K1848m209j3457Q917O795o444
$$ -89118 -62690 -19095 797 -1984 -10650 -5378 2864 24712 20503 7046 15963 22758 16314
4913A6314N044l0104k1226L148J6071M906q565p060m246r43K1440n386j5833j9212
$$ 16314 21358 -8746 -29972 -26824 -10753 -5847 -14412 -21472 -25718 -26661 -5221 -10607 -26440 -45652
4899d5652K1315j0254j1905J2717K184K5965m112j4120J6181K0144q511k084K6536
$$ -45652 -24337 -34591 -46496 -33779 -31595 -5630 -9742 -23862 -7681 12463 3952 1868 28404
4886B8404K0746k4795m484O942l6828j4607J6675O756o972J7680J1883N077k580
$$ 28404 49150 24355 19871 26813 -10015 -24622 -7947 -1191 -8163 9517 21400 26477 23897
4873B3897R509J7672j9809J1666R828l4554p341n4m495j909J2927m083j8449O775
$$ 23897 33406 51078 31269 42935 52763 18209 10868 10814 6319 4410 17337 13254 -5195 1580
4859A580L267J9866m209j2682j0146m848N942j8059p602Q539N726J176L08j8468
$$ 1580 4847 24713 20504 7822 -2324 -7172 -1230 -19289 -26891 -18352 -12626 -11450 -11142 -29610
4845b9610j1322L860N250p084J9531K090j2814j5590R188p214p398N282P049K7231
$$ -29610 -40932 -37072 -31822 -38906 -19375 -17285 -30099 -45689 -36501 -43715 -51113 -45831 -38782 -11551
4831a1551K484m0273n955K5854J8133j3052j631L43J1250L872N793J0226l892
$$ -11551 -9067 -49340 -55295 -29441 -11308 -24360 -25991 -25648 -14398 -10526 -4733 5493 1601
4818A601r324P730L441r619k951p020j2739J2307J0034r594J0243J5162j4466
$$ 1601 -7723 7 3448 -6171 -9122 -16142 -28881 -16574 -6540 -16134 -5891 9271 -5195
4805e195l2464L681J6499K1237N588j3885o181j8579k572K0732K3403J1434k5968
$$ -5195 -37659 -33978 -17479 3758 9346 -4539 -10720 -29299 -31871 -11139 12264 23698 -2270
4792b270m554J2647m254J952k8146Q436J2849k5452n034J3340J2159k555j1319
$$ -2270 -6824 5823 1569 3521 -24625 -16189 -3340 -28792 -33826 -20486 -8327 -10882 -22201
4779b2201J1132P912J3209k3308j0623J6929J8158O348j2864j55l770R526L529
$$ -22201 -11069 -3157 10052 -13256 -23879 -6950 11208 17556 4692 4537 767 10293 13822
4766A3822R508n107j627n516j971O587j9079O977p875q547P032q182p107J6410
$$ 13822 23330 18223 16596 11080 9109 15696 -3383 3594 -4281 -12828 -5796 -13978 -21085 -4675
4752d675R138o010l3401k741J7012J6796P083q614j5975m679j814P347L106K9472
$$ -4675 4463 -1547 -34948 -37689 -20677 -3881 3202 -5412 -21387 -26066 -27880 -20533 -17427 12045
4738A2045K8517k4539j2552N10P968k2304j5078j6773J0824J4315L2695j3386
$$ 12045 40562 16023 3471 3981 11949 -10355 -25433 -42206 -31382 -17067 15628 2242
4726B242K39R459P975o970p737k5425l1261K4152j2914J9079K7990J9142j6638
$$ 2242 2481 11940 19915 12945 5208 -20217 -51478 -27326 -40240 -21161 6829 25971 9333
4713I333J2449r355j4967k1619q686J6101Q940l1604J4903j0496j6306K3134J7978
$$ 9333 21782 12427 -2540 -24159 -32845 -16744 -7804 -39408 -24505 -35001 -51307 -28173 -10195
4700a0195j328j9698O103J5548q002J0726r469K3212M262k0612l8029M457K3105
$$ -10195 -11523 -31221 -25118 -9570 -17572 -6846 -16315 6897 11159 -9453 -47482 -43025 -19920
4687a9920p930j9223j453L1022K5068M757j1138R791J228J739J7643O036l0725
$$ -19920 -27850 -47073 -48526 -17504 7564 12321 1183 10974 12202 13941 31584 37620 6895
4674F895K206J8583k6885j3383l343r553l56K3804L6168k7378r108J9897L1379
$$ 6895 9101 27684 799 -12584 -15927 -25480 -25836 -2032 34136 6758 -2350 17547 48926
4661D8926j173j0412p672k4461j9509J2314J1529m267o617J2291k0142n840J6244
$$ 48926 47753 37341 29669 5208 -14301 -1987 9542 5275 -1342 10949 -9193 -15033 1211
4648A211k776j8764j529K6538l890L859J432j8284j7202J952J0063Q891j1689
$$ 1211 -1565 -20329 -21858 4680 790 4649 6081 -12203 -29405 -27453 -17390 -8499 -20188
4635b0188j6861k9926M158K5188k186o454J8077q74j7667Q43L1026J4670P68j099
$$ -20188 -37049 -66975 -62817 -37629 -39815 -46269 -28192 -29066 -46733 -45890 -14864 -194 574 -525
4621e25l890K5838K635J279J9632j3181k3957L31K8871O019j9006k3052n1047
$$ -525 -4415 21423 24058 25337 44969 31788 7831 8162 37033 43052 24046 994 -50053
4608e0053P994J3263p172J7541K2877J7022n245j9620j0564M667Q784Q401k821
$$ -50053 -42059 -28796 -35968 -18427 4450 21472 16227 -3393 -13957 -9290 -506 7895 5074
4595E074j2656k3603j6564J8577K7875J6784j5269j2384k416p653N362p421L728
$$ 5074 -7582 -31185 -47749 -29172 -1297 15487 218 -12166 -14582 -22235 -16873 -24294 -20566
4582b0566L1689J3620K7393L0432M984n693k7421j7903l7448j1635P788L859P791
$$ -20566 11123 24743 52136 82568 87552 81859 54438 36535 -913 -12548 -4760 -901 6890
4569F890j2487L146R032j4211j0616n623K7095L0803N89j9738l6002j162j8792
$$ 6890 -5597 -2451 6581 -7630 -18246 -23869 3226 34029 34618 14880 -21122 -22284 -41076
4556d1076J8330M7648L607m1480j6092K2106J6163K0203k9070o483k2018j8992
$$ -41076 -22746 24902 28509 -12971 -29063 -6957 9206 29409 339 -6144 -28162 -47154
4544d7154O759r692K3346K9636j8435l7591P721K3063J6144N128Q481q226P46
$$ -47154 -40395 -50087 -26741 2895 -15540 -53131 -45410 -22347 -6203 -1075 7406 -820 -74
4531g4R551K2360o358m9047j8600L0451P836k2980J4493j0724o43J4367J1079
$$ -74 9477 31837 25479 -23568 -42168 -11717 -3881 -26861 -12368 -23092 -23735 -9368 1711
4518A711L91j626j694o375K91L0038r525k0978m074j9011O403O512J4758k059
$$ 1711 2102 476 -1218 -7593 -7302 22736 13211 -7767 -11841 -30852 -24449 -17937 -3179 -5238
4504e238k86r360J1799j313k2696p131m188J0418J7505K0521Q115k5612o985k807
$$ -5238 -5524 -14884 -3085 -4398 -27094 -34225 -38413 -27995 -10490 10031 18146 -7466 -14451 -17258
4490a7258p321J1139j419q405J892K0413R719K0957q077q56J912N912j3960j1026
$$ -17258 -24579 -13440 -14859 -23264 -21372 -959 8760 29717 21640 20784 22696 28608 14648 3622
4476C622j0404j9007j2800l861K0151M202Q575m00L139J1697k721n190k401R914
$$ 3622 -6782 -25789 -38589 -42450 -22299 -18097 -9522 -9922 -6783 4914 2193 -2997 -5398 4516
4462D516N901j1098j5297Q023K7698j7489k1433q687K202n069J7792n96N601r243
$$ 4516 10417 -681 -15978 -7955 19743 2254 -19179 -27866 -25664 -30733 -12941 -13537 -7936 -17179
4448a7179j957L653l822M915k022n290L096J7871M582k5713r551J5267m400l2926
$$ -17179 -19136 -15483 -19305 -14390 -16412 -21702 -18606 -735 3847 -21866 -31417 -16150 -20550 -53476
4434e3476J297K2641J2752O210J3707n55q971K0891j6438j1437l2209j2002M2385
$$ -53476 -52179 -29538 -16786 -10576 3131 2576 -6395 14496 -1942 -13379 -45588 -57590 -15205
4421a5205M5719q657k9705p972o976K58Q233r380K8210L4310L22l9798j9684p366
$$ -15205 30514 21857 -7848 -15820 -22796 -22538 -14305 -23685 4525 38835 39157 -641 -20325 -27691
4407b7691m870l839J0935P091l2205j1115J7809k2213l5501K6087K1960M857J3168
$$ -27691 -32561 -36400 -25465 -18374 -50579 -61694 -43885 -66098 -101599 -75512 -53552 -48695 -35527
4394c5527J0870P530J6182J3137J1501j3712k6481j263n291r614j3182k5565K6908
$$ -35527 -24657 -17127 -945 12192 23693 9981 -16500 -17763 -23054 -32668 -45850 -71415 -44507
4381d4507J5230K646j9497P104J1866J5624j5182j730j193P759J3599K4458j7573
$$ -44507 -29277 -26631 -46128 -39024 -27158 -11534 -26716 -28446 -29639 -21880 -8281 16177 -1396
4368a396k3993m40k2361j767o990P447J8866Q91J4075J7357J9423l745J045r483
$$ -1396 -25389 -25829 -48190 -49957 -56947 -49500 -30634 -29743 -15668 1689 21112 17367 18412 8929
4354H929M995j5902Q665k0246j4841L3499N1055m7837j8543M925o486J9294K0814
$$ 8929 13924 -1978 6687 -13559 -28400 5099 56154 8317 -10226 -5301 -11787 7507 28321
4341B8321J186K858p407q162j8411j3779l446O710J1295J6391J6954j8493j531
$$ 28321 29507 32365 24958 16796 -1615 -15394 -18840 -12130 -835 15556 32510 14017 12486
4328A2486L1198o740o969p003j5304j4863k004O326J9144L4805J3473l3489l5135
$$ 12486 43684 36944 29975 22972 7668 -7195 -9199 -2873 16271 51076 64549 31060 -4075
4315d075J6796j6073j5128Q011m411K481q462K515J1322J1672k426J776o962k0701
$$ -4075 12721 -3352 -18480 -10469 -14880 -12399 -20861 -18346 -7024 4648 2222 3998 -2964 -23665
4301b3665k675P824J4603K2643p785K0950j5657k8338J0907J3112r2P100k6268
$$ -23665 -26340 -18516 -3913 18730 10945 31895 16238 -12100 -1193 11919 11827 18927 -7341
4288g341Q190M943j1233j9720M150m091K7965L8788j7779J008K626l245p17K047
$$ -7341 849 5792 -5441 -25161 -21011 -25102 2863 41651 23872 24880 27506 24261 23544 25591
4274B5591K0208J0361r143j9860l9724j8795M951K3937K5654j5472N56N514j8365
$$ 25591 45799 56160 47017 27157 -12567 -31362 -26411 -2474 23180 7708 8264 13778 -4587
4261d587k4809Q970K4556J0698J1817o915j7928j2610o505p314n301J390P7K5072
$$ -4587 -29396 -20426 4130 14828 26645 19730 1802 -10808 -17313 -24627 -29928 -28538 -28461 -3389
4247c389M373L414L240l8167o956K1123J6309Q607J500R89R483J1771j5930k3465
$$ -3389 984 4398 7638 -30529 -37485 -16362 -53 8554 10054 11043 20526 32297 16367 -7098
4233g098j0239J8693N05L211J4144J0218j5308j6785j0633o080J8795K0584K8
$$ -7098 -17337 1356 1861 5072 19216 29434 14126 -2659 -13292 -19372 -577 20007 20035
4220B0035O030M747k7934j8884O494K5189j4127K9969k349k4344j0064K3597J1781
$$ 20035 26065 30812 2878 -16006 -9512 15677 1550 31519 29170 4826 -5238 18359 30140
4207C0140j9046l4125L2608J6114j8218k8389k6586r009J4080M3625L600k506
$$ 30140 11094 -23031 9577 25691 7473 -20916 -47502 -56511 -42431 1194 4794 2288
4195B288J7859j0703q709J1367j9159q13R743j7509k725k725k6570j6520J7217
$$ 2288 20147 9444 735 12102 -7057 -7870 1873 -15636 -18361 -21086 -47656 -64176 -46959
4182d6959J9588M495R231M341l009j8192J552J5847K6722q967l674Q805k3019
$$ -46959 -27371 -22876 -13645 -9304 -12313 -30505 -28953 -13106 13616 4649 975 9780 -13239
4169a3239J7600J92k64j141N128P383P540M213q673j9226j5338O764J801O46J8199
$$ -13239 4361 4553 4289 3148 8276 15659 23199 27412 18739 -487 -15825 -9061 -7260 -6614 11585
4154A1585J8645L659L437l9542l6296o841K3005K5384R7J3328K8539r687p407
$$ 11585 30230 33889 37326 -2216 -38512 -45353 -22348 3036 3133 16461 45000 35313 27906
4141B7906J021j038j6037k8145L961J9950l432n838P338N086N278L2701K9528
$$ 27906 28927 27889 11852 -16293 -12332 7618 4186 -1652 5686 10772 16050 48751 78279
4128G8279l3389k1609o934K2165M826J970N175k2788l1633j2776Q559K2819o65
$$ 78279 44890 23281 16347 38512 43338 45308 50483 27695 -3938 -16714 -8155 14664 13999
4115A3999r01J8399j0871k9367j4369K20K489L1132r36K2243P71j4092n79k2648
$$ 13999 13098 31497 20626 -8741 -23110 -22890 -20401 10731 9795 32038 32809 18717 18138 -4510
4101d510j1307k87O388j3696M644j1237L6387J7185k2712O653J4047R686m003
$$ -4510 -15817 -16104 -9716 -23412 -18768 -30005 6382 23567 855 7508 21555 31241 27238
4088B7238o056M473N564p360J5731o720j1793l035j6357J813O278r603l899q775
$$ 27238 21182 25655 31219 23859 39590 32870 21077 18042 1685 3498 9776 173 -3726 -12501
4074a2501N501K0377j7342j8511j6298R073J1168p531p216l629M273J1510J7497
$$ -12501 -7000 13377 -3965 -22476 -38774 -29701 -18533 -26064 -33280 -36909 -32636 -21126 -3629
4061c629k494l195J7865j4962o526K3203Q41N543k1844J0769K2479j7862J3516
$$ -3629 -6123 -9318 8547 -6415 -12941 10262 11103 16646 -5198 5571 28050 10188 23704
4048B3704K0132J7223l711p496l3932k4356k867J1310n087k1795J9864J5080K1768
$$ 23704 43836 61059 57348 49852 15920 -8436 -11303 7 -5080 -26875 -7011 8069 29837
4035B9837j94J64j3157j4423k0555k2571R577L4557L6550K2175p597k5243j2603
$$ 29837 29643 29807 16650 2227 -18328 -40899 -31322 3235 39785 61960 54363 29120 16517
4022A6517N214m876R189j9717l3980o233L441K4503M529j7597q350k879j7087
$$ 16517 21731 16855 26044 6327 -27653 -33886 -30445 -5942 -1413 -19010 -27360 -30239 -47326
4009d7326L0119L2650p433o628j4395p67K5178J2575j8628l6601N745K6275j1395
$$ -47326 -17207 15443 8010 1382 -13013 -13780 11398 23973 5345 -31256 -25511 764 -10631
$$ [...]
##END NTUPLES=NMR SPECTRUM
##END=
