##TITLE=Analysis number 318455
Compound Code rjc 01246
Project Code adrs
Chemist Name af chempharm
##JCAMPDX= 6.0         $$ Bruker NMR JCAMP-DX V2.0
##DATA TYPE= NMR SPECTRUM
##DATA CLASS= NTUPLES
##ORIGIN= Bruker BioSpin GmbH
##OWNER= nmr
$$ XWIN-NMR		Version 3.5
$$ Wed Mar 29 12:19:17 2006 GMT Daylight Time (UT+1h)  MAYBRIDGE\nmr@NMR_250MHZ
##.OBSERVE FREQUENCY= 250.131544655141
##.OBSERVE NUCLEUS= ^1H
##.ACQUISITION MODE= SIMULTANEOUS (DQD)
##.ACQUISITION SCHEME= undefined
##.AVERAGES= 16
##.DIGITISER RES= 18
##SPECTROMETER/DATA SYSTEM= dpx250
##.PULSE SEQUENCE= zg30
##.SOLVENT NAME= DMSO
##.SHIFT REFERENCE= (INTERNAL, DMSO, 0, 16.522)
##AUDIT TRAIL= $$ (NUMBER, WHEN, WHO, WHERE, WHAT)
$$ ##TITLE= Audit trail, XWIN-NMR		Version 3.5
$$ ##JCAMPDX= 5.01
$$ ##ORIGIN= Bruker BioSpin GmbH
$$ ##OWNER= nmr
$$ C:\u/data/dgb/nmr/ADRS/1660/pdata/1/auditp.txt
$$ ##AUDIT TRAIL=  $$ (NUMBER, WHEN, WHO, WHERE, WHAT)
(   1,<2006-03-29 12:18:53.94 +100>,<MAYBRIDGE\nmr>,<NMR_250MHZ>,
      <created by zg, POWCHK disabled, PULCHK disabled
       configuration hash MD5:
       84 BC 41 DB A1 6E 1D 46 DA 25 12 A5 C1 ED C5 3A
       data hash MD5: 64K
       62 D0 8D 89 7E 32 E3 87 CA 8F 7F FC BE A8 04 E8>)
(   2,<2006-03-29 12:19:07.77 +100>,<MAYBRIDGE\nmr>,<NMR_250MHZ>,
      <Start of raw data processing
       ef LB = 0.3 FT_mod = 6 PKNL = 1 SI = 32K 
       data hash MD5: 32K
       B1 A5 16 27 C6 58 98 A7 83 79 70 19 8D 08 0E 24>)
(   3,<2006-03-29 12:19:09.34 +100>,<MAYBRIDGE\nmr>,<NMR_250MHZ>,
      <apk 
       data hash MD5: 32K
       02 04 3C F7 90 9F FA 16 C9 C2 28 B6 82 ED 70 59>)
(   4,<2006-03-29 12:19:10.06 +100>,<MAYBRIDGE\nmr>,<NMR_250MHZ>,
      <abs ABSG = 5 
       data hash MD5: 32K
       65 52 D1 B8 C8 5C 77 7F 27 4F 4B 9C 20 92 4E 43>)
$$ ##END=
$$ 
$$ hash MD5
$$ 86 EE 48 77 EE C5 ED 06 24 44 04 88 D4 9E 23 FE
##$RELAX= 
##$RELAX= 
##$RELAX= 
##$RELAX= 
##$RELAX= 
##$RELAX= 
##$RELAX= 
$$ Bruker specific parameters
$$ --------------------------
##$DU= <C:\u>
##$EXPNO= 1660
##$NAME= <ADRS>
##$PROCNO= 1
##$TYPE= <nmr>
##$USER= <dgb>
##$AMP= (0..31)
100 100 100 100 100 100 100 100 100 100 100 100 100 100 100 100 100 100 
100 100 100 100 100 100 100 100 100 100 100 100 100 100 
##$AQSEQ= 0
##$AQ_mod= 3
##$AUNM= <au_zg>
##$AUTOPOS= <20 >
##$BF1= 250.13
##$BF2= 250.13
##$BF3= 250.13
##$BF4= 250.13
##$BF5= 500.13
##$BF6= 500.13
##$BF7= 500.13
##$BF8= 500.13
##$BYTORDA= 1
##$CFDGTYP= 0
##$CFRGTYP= 5
##$CHEMSTR= <none>
##$CNST= (0..31)
1 1 145 1 1 1 1 1 1 1 1 1 1 1 1 1 1 1 1 1 1 1 1 1 1 1 1 1 1 1 1 1 
##$CPDPRG= <>
##$CPDPRG1= <>
##$CPDPRG2= <>
##$CPDPRG3= <>
##$CPDPRG4= <mlev>
##$CPDPRG5= <mlev>
##$CPDPRG6= <mlev>
##$CPDPRG7= <mlev>
##$CPDPRG8= <mlev>
##$CPDPRGB= <>
##$CPDPRGT= <>
##$D= (0..31)
0 1 0 0 0 0 0 0 0 0.06 0 0 0 0 0 0 0.0002 0 0 0 0 0 0 0 0 0 0 0 0 0 0 
0 
##$DATE= 1143631132
##$DBL= (0..7)
120 120 120 120 120 120 120 120 
##$DBP= (0..7)
150 150 150 150 150 150 150 150 
##$DBP07= 0
##$DBPNAM0= <>
##$DBPNAM1= <>
##$DBPNAM2= <>
$$ [...]
##$SUBNAM7= <"">
##$SUBNAM8= <"">
##$SUBNAM9= <"">
##$SW= 20.6930455092707
##$SWIBOX= (0..15)
0 0 3 0 0 0 0 0 0 0 0 0 0 0 0 0 
##$SW_h= 5175.983436853
##$TD= 65536
##$TD0= 1
##$TE= 294.16
##$TE2= 300
##$TE3= 300
##$TEG= 300
##$TL= (0..7)
0 120 120 120 120 120 120 120 
##$TP= (0..7)
150 150 150 150 150 150 150 150 
##$TP07= 0
##$TPNAME0= <>
##$TPNAME1= <>
##$TPNAME2= <>
##$TPNAME3= <>
##$TPNAME4= <>
##$TPNAME5= <>
##$TPNAME6= <>
##$TPNAME7= <>
##$TPOAL= (0..7)
0.5 0.5 0.5 0.5 0.5 0.5 0.5 0.5 
##$TPOFFS= (0..7)
0 0 0 0 0 0 0 0 
##$TUNHIN= 0
##$TUNHOUT= 0
##$TUNXOUT= 0
##$USERA1= <user>
##$USERA2= <user>
##$USERA3= <user>
##$USERA4= <user>
##$USERA5= <user>
##$V9= 5
##$VALIST= <valist>
##$VCLIST= <CCCCCCCCCCCCCCC>
##$VD= 0
##$VDLIST= <DDDDDDDDDDDDDDD>
##$VPLIST= <PPPPPPPPPPPPPPP>
##$VTLIST= <TTTTTTTTTTTTTTT>
##$WBST= 1024
##$WBSW= 4
##$XGAIN= (0..3)
0 0 0 0 
##$XL= 0
##$YL= 0
##$YMAX_a= 372482
##$YMIN_a= -573493
##$ZGOPTNS= <>
##$ZL1= 120
##$ZL2= 120
##$ZL3= 120
##$ZL4= 120
##$ABSF1= 16.522
##$ABSF2= -4.171173
##$ABSG= 5
##$ABSL= 3
##$ALPHA= 0
##$AQORDER= 0
##$ASSFAC= 0
##$ASSFACI= 0
##$ASSFACX= 0
##$ASSWID= 0
##$AUNMP= <proc_1d>
##$AZFE= 0.1
##$AZFW= 0.1
##$BCFW= 0
##$BC_mod= 0
##$BYTORDP= 0
##$COROFFS= 0
##$CY= 12.5
##$DATMOD= 1
##$DC= 0
##$DFILT= <>
##$DTYPP= 0
##$F1P= 14.0000005364418
##$F2P= -0.99999901652339
##$FCOR= 0.5
##$FTSIZE= 32768
##$FT_mod= 6
##$GAMMA= 0
##$GB= 0
##$INTBC= 1
##$INTSCL= 1
##$ISEN= 128
##$LB= 0.3
##$LEV0= 0
##$LPBIN= 0
##$MAXI= 10000
##$MC2= 0
##$MEAN= 0
##$ME_mod= 0
##$MI= 0
##$NCOEF= 0
##$NC_proc= -5
##$NLEV= 6
##$NOISF1= 0
##$NOISF2= 0
##$NSP= 0
##$NTH_PI= 0
##$NZP= 0
##$OFFSET= 16.522
##$PC= 1
##$PHC0= 158.9696
##$PHC1= 5.853938
##$PH_mod= 1
##$PKNL= yes
##$PPARMOD= 0
##$PSCAL= 4
##$PSIGN= 0
##$REVERSE= no
##$SF= 250.13
##$SI= 32768
##$SIGF1= 0
##$SIGF2= 0
##$SINO= 400
##$SIOLD= 32768
##$SREGLST= <1H.DMSO>
##$SSB= 0
##$STSI= 32768
##$STSR= 0
##$SW_p= 5175.98343685301
##$SYMM= 0
##$S_DEV= 0
##$TDeff= 65536
##$TDoff= 0
##$TI= <Analysis number 999999
Compound Code 99
Book Reference 9
Project Code 9>
##$TILT= no
##$TM1= 0
##$TM2= 0
##$TOPLEV= 0
##$USERP1= <user>
##$USERP2= <user>
##$USERP3= <user>
##$USERP4= <user>
##$USERP5= <user>
##$WDW= 1
##$XDIM= 32768
##$YMAX_p= 281042663
##$YMIN_p= -723585
$$ End of Bruker specific parameters
$$ ---------------------------------
##NTUPLES= NMR SPECTRUM
##VAR_NAME=  FREQUENCY,     SPECTRUM/REAL,   SPECTRUM/IMAG
##SYMBOL=    X,             R,               I
##VAR_TYPE=  INDEPENDENT,   DEPENDENT,       DEPENDENT
##VAR_FORM=  AFFN,          ASDF,            ASDF
##VAR_DIM=   32768,         32768,           32768
##UNITS=     HZ,            ARBITRARY UNITS, ARBITRARY UNITS
##FACTOR=    0.157963299565203, 1,           1
##FIRST=     4132.6476996994, 0,             0
##LAST=      -1043.33573715361, 0,           0
##MIN=       -1043.33573715361, -723585,     0
##MAX=       4132.6476996994, 281042663,     0
$$ Real data points
##PAGE= N=1
##DATA TABLE= (X++(R..R)), XYDATA
$$ [...]
22773d7194J03445j4182l9986J49208P593j21797q4101j35918j16421J36447J53973
22762h933K7396j13778J11369N8905K7553K6266r9967j38849p1892R1292J493
22751h9145Q7075m9168J5415k3533j9220Q5306J1039o6658l7630n8087Q6159J1012
22739d7435K2664l0647k8890j0526L0754l5634l5169J5139K9196R033k4416o2562
22727a68493p4386Q4919J1485k2832R9071R3505L0245M8527j2570j16445j29228
22716a56202K5743L8333k4216J6445j5120O3581k6826m2591O1261k1485k2538
22705a03615O4629K9103k4456L2299m3133k2345n0347R1001L0366k6748n3460
22694g6706j4380P4785J15104p6693l4894M2754M5165k05M777o8815m1512o8191
$$ y = [-47194, 56251, 42069, 2083, 151291, 158884, 37087, -47014, -182932, -299353, -162906, -8933, 18463, -95315, 16054, 74959, 102512, 128778, 28811, -110038, -181930, -90638, -89145, -2070, -51238, -35823, -59356, -78576, 6730, 17769, -48889, -86519, -144606, -58447, -47435, -24771, -55418, -84308, -94834, -64080, -99714, -134883, -119744, -90548, -81515, -105931, -168493, -242879, -157960, -146475, -169307, -70236, 23269, 53514, 102041, 89471, -26974, -156202, -130459, -92126, -116342, -99897, -115017, -51436, -78262, -120853, -59592, -81077, -103615, -38986, -9883, -34339, -2040, -45173, -67518, -117865, -26864, 3502, -23246, -76706, -91086, -16301, 98803, 22110, -12784, 29970, 75135, 74930, 79707, 10892, -30620, -98811]
22682i8811n5754j8796N303J3471R5645J79966K736j31515o1367N6204N4749M5211
22670H7042j2776K8204J6067n6668r636k1146J6535J02689m1210l6774p7002K2051
22658A7376J8493m7499o9134o012N7232J02095J8938L158j20937K665L5444M5152
22646E6971n137p752O811o3803o5928l734N1231l8126N3446L815p2610j41698
22634b26514Q9557K1993j0104J5498R6016k9242o0763Q7679P69o8719K2900R4170
22622C3240q168P520n0929k1326K6439j6553M0320k6242P613J7551k6948q4583
22610a02066j4357q167r5798N041O1220j1094K1204m2017O9376J19678J09437
22599A12457K789j06654o0803O3184M294O8182p3279k0636L274m2550j145n9081
$$ y = [-98811, -154565, -173361, -168058, -154587, -58942, 121024, 123760, -7755, -69122, -12918, 41831, 87042, 74266, 102470, 118537, 61869, 52233, 31087, 47622, 150311, 109101, 72327, -4675, 17376, 35869, -11630, -80764, -86776, -29544, 72551, 91489, 94647, -26290, -23625, 11819, 56971, 51834, 44082, 50893, -12910, -78838, -82572, -31341, -69467, -16021, -12206, -84816, -226514, -136957, -114964, -125068, -109570, -13554, -42796, -103559, -15880, -15111, -83830, -60930, 33240, 25072, 32592, -18337, -39663, -13224, -29777, 10543, -15699, -8086, 9465, -17483, -102066, -116423, -124590, -220388, -215347, -154127, -165221, -144017, -186034, -116658, 3020, 112457, 115246, 8592, -52211, 10973, 15267, 83449, 10170, -10466, -7192, -49742, -50887, -109968]
22587a09968k6199J16383J01141R720q8324K078K6007P768o219q4004j22976L2818
22575a41775p973Q8014j0199k4974k1344J14481P7704m8286j4350J0107k6929
22564e524L7909n9241O8361L3071J9295j15902p4991P140o2305k6697J65536J234
22552a2114o9245j10688n5570O2861O1816l2138l6609J25225j531P5152J42283
22541A49442o1886p1427j34693j15257q549J01889L067n1232N5280R3741J37347
22530I7722j398r9328p0091N688l2324O1292m3737j98L2832q3022L0665J06515
22518D616m5797O083M005L2121o7148o2247K776L8943L9039m495O8285J3177j8959
22505A0399n579n3690P3693L1419j5777k8898j41054j03856J11612L1405N6455
$$ y = [-109968, -136167, -19784, 81357, 91077, 2753, 4831, 30838, 38606, 32387, -51617, -174593, -141775, -149748, -61734, -71933, -96907, -118251, -3770, 73934, 25648, 11298, 21405, -5524, 32385, -26856, 41505, 74576, 93871, -22031, -97022, -89882, -152187, -178884, -13348, -12114, -81359, -192047, -247617, -184756, -122940, -155078, -191687, -66462, -67993, 7159, 149442, 87556, 16129, -118564, -233821, -242370, -140481, -137414, -188646, -133366, -39625, 97722, 96324, -3004, -73095, -67407, -99731, -38439, -82176, -82374, -49542, -132564, -101899, 4616, -41181, -35098, -31093, 1028, -66120, -128367, -125591, -86648, -47609, -52104, 16181, 29358, 10399, 4820, -48870, 24823, 56242, 40465, 11567, -129487, -233343, -121731, -90326, -33871]
22494c3871M7299L7197P8457l6961j58598j06988q770J72387P0680l368k331j04451
22482d9318m4384N4761P616p7420j37000o5671P519J25390P0823k6085m1O1699
22470g2111o8653O6836J6946r5871m3418q016J43003n860K5984P4282j08516j57804
22458b33198m3096Q8939J74614O8617K2629j7412M1261p1046M810K0589n7634
22447i27K5551L822p1101k4693P6771l0458M0902K2956K9519k9417l7087o5633
22435e9795p2398k8977J57637j5750J7307K5754k7326o3171J4617K0461M2654
22424A1013O3154l0596L2877m7620q3987K4331k5208O9397O269n1500q7541j34989
22412b54400P3075J20766P2327L8532K1290p1828N3246m2693q4554L6982Q8633
$$ y = [-33871, 13428, 50625, 129082, 92121, -66477, -173465, -182235, -9848, 60832, 57464, 55133, -49318, -93702, -38941, -31325, -108745, -245745, -311416, -303897, -178507, -107684, -133769, -133810, -72111, -140764, -73928, -56982, -152853, -196271, -204287, -61284, -67144, -41160, 33122, -75394, -233198, -276294, -187355, -12741, 55876, 78505, 61093, 102354, 31308, 36118, 56707, -927, 24624, 28446, -42655, -67348, 9423, -21035, 19867, 42823, 72342, 42925, 5838, -59795, -132193, -161170, -3533, -19283, -1976, 23778, -3548, -66719, -52102, -31641, 11013, 74167, 43571, 76448, 28828, -55159, -30828, -56036, 13361, 19630, -31870, -119411, -254400, -181325, -60559, 11768, 50300, 71590, -238, 53008, 10315, -74239, -37257, 51376]
22401E1376N8246l9503r3060O25k6445K7072l3961l7082J1732K1392P8521J04189
22389A23102L8317j1019j10579m9111J20681o4622j43147J3089O8097N159l8325
22378d8358L9437R0676o264m667J01457j0527j78809j26192K5863N5446N3694
22367h244l5422O184J09250l482o9956j3173k964j6627L1419l6508n7849j20459
22355b17831q977K7965R2568M853L2439J25204j15801j1898J7229L0025P6793
22344E2569P7654M1663n3368j31921p6383Q036j36603P3814O0382N5669K5497
22333b991j03931l4262M03r938O1106J0678J21060O4258l2017q2853l3823M5689
22321C379n8134q1721M7867J00063l8526o8473q6445J16724K02049k6222r2967
$$ y = [51376, 109622, 70119, -22941, -22316, -48761, -21689, -55650, -92732, -81000, -59608, 18913, 123102, 161419, 150400, 39821, -9290, 111391, 46769, -96378, -83289, -15192, -10033, -48358, -8921, 81755, 75491, 70824, 172281, 161754, -17055, -143247, -117384, -61938, -8244, -43666, -37482, 71768, 68286, -1670, -14843, -17807, -34434, -3015, -39523, -97372, -217831, -226808, -198843, -106275, -101422, -68983, 56221, -59580, -71478, -54249, -24224, 52569, 130223, 171886, 118518, -13403, -89786, -81750, -218353, -144539, -84157, -28488, -2991, -106922, -141184, -140781, -150719, -89613, -78935, 42125, 106383, 74366, -8487, -42310, 3379, -54755, -136476, -88609, 11454, -27072, -95545, -181990, -65266, 136783, 110561, 17594]
22310A7594q6001n0676J42869K8407Q6799J1514M668l1439J3098p6375m0923j9262
22298B73M9977Q2401K0319l4735j14043j5904P1098R1411J12826r9635n7709j08414
22286b135o7169J8772m07k761j6607n6456r4652R7297J1209k3218K0578R2132
22274b3417o488k2960O1228O2801k06m5278n2896p8463J0645J36349L2187l3909
22262C9593M871o9021k7626R8037p1456k1884k6625j778K1460K7621J6631L5038
22250B4861n4719L2897j7839l9194K3690L5963J4430r5834n4572O8884O6476o4700
22238e9657j5104m2011O0179J18670j4562l3669J24078M5707j10243o8300O270
22227A1358n9423j876k3952K1177M6229j0934j4451j0027J37352j16504p5921
$$ y = [17594, -68407, -119083, 23786, 52193, 138992, 150506, 155174, 123735, 136833, 60458, 19535, 273, 50250, 132651, 152970, 118235, 4192, -11712, 59386, 150797, 263623, 163988, 106279, -2135, -69304, -50532, -50939, -53700, -70307, -126763, -221415, -124118, -112909, -136127, -115549, -23417, -29905, -52865, 8363, 71164, 70958, 25680, -27216, -105679, -95034, 41315, 73502, 39593, 44464, -24557, -52183, 45854, -25602, -47486, -74111, -75889, -54429, -26808, -10177, 24861, -29858, 3039, -14800, -53994, -30304, 5659, 20089, -75745, -130317, -61433, 5043, -59657, -74761, -116772, -56593, 62077, 47515, 13846, 137924, 183631, 73388, 5088, 11358, -48065, -49941, -73893, -52716, -6487, -17421, -31872, -41899, 95453, -21051, -96972]
22216i6972N610J4258K683N8713k2325J021n03K7307o1238P728J5928j4038l73
22203f2201J2981L3565J2451q4579R606L4855l1984J722J9056l6265P350J80048
22191I6605m9655j46430q5853N2329M7196J9250J386n0032j16947L2644R8471
22180a01036K7808k7183P9287L6412K3223L7823N6457q4155q8247R0897j0857
22169D0429L5975J9788r0789j55677o9028M749P2931R8284R2053k9845m6290n1415
22157g8835R0792j5828q6477k2422o0592J1166P8248k0159M6382P6241p0269o9372
22145a21125L0994N6090N2313M5971n7299n1480N033O4461K3462m4649p8716J14276
22133C9331M5689j09995N8603J30502p489q3979j31650P9625L3043j09035j02550
$$ y = [-96972, -91362, -77104, -74421, -15708, -38033, -37012, -37515, -10208, -71446, -63718, -47790, -61828, -62201, -49220, -15655, -3204, -87783, -78177, -43322, -75306, -73584, -54528, -90793, -83443, 96605, 46950, -99480, -185333, -133004, -85808, -66558, -65172, -115204, -232151, -199507, -101036, -73228, -100411, -21124, 15288, 38511, 76334, 132791, 48636, -39611, 51286, 40429, 76404, 96192, 5403, -150274, -219302, -214553, -141622, -43338, 48715, 18870, -27420, -78835, 11957, -3871, -90348, -112770, -173362, -162196, -83948, -104107, -57725, 18516, -51753, -121125, -90131, -34041, 18272, 64243, 6944, -44536, -39503, 24958, 48420, 3771, -74945, 39331, 85020, -24975, 33628, 164130, 156641, 72662, -58988, 20637, 53680, -55355, -157905]
22122a57905k8961P5938N0119q3070n1758P7644O1556L6353M2101k2796K9267
22111B8488L5206l6117l9576l6687J59880O5317j05925j10483q2037l3856J1350
22100a44440P4128o572r3777n618P3979l374K2187m8348Q3809J4620r8588L0876
22088a01118R7913M8803Q556n8550j22332m4234L6776J7362O5507N3060j6731
22077a4988j4356K218o2391l7546J6455P3624K4292o8257p6201M6306n3017j08205
22065b72066n0622Q009Q3440Q3947M6372J10779J2712J08674P6205k7625m989
22054A74836N7495q619m3995j30756o1385j0340k9640L8500p239n8782j28976
22043b08901M2281J26469K4427Q2694l8186L3894J81752k6049n1026q1332J6240
$$ y = [-157905, -186866, -110928, -60809, -143879, -195637, -117993, -56437, -20084, 22017, -779, 28488, 63694, 27577, -11999, -48686, 111194, 176511, 70586, -39897, -121934, -155790, -144440, -70312, -76884, -170661, -176279, -102300, -105674, -83487, -131835, -48026, -33406, -131994, -101118, -3205, 45598, 54154, -4396, -126728, -170962, -134186, -116824, -51317, 1743, -14988, -29344, -27126, -89517, -127063, -110608, -36984, -12692, -80949, -157150, -110844, -163861, -272066, -322688, -314679, -231239, -147292, -100920, 9859, 22571, 131245, 207450, 179825, 174836, 232331, 223712, 179717, 48961, -12424, -22764, -52404, -13904, -21143, -79925, -208901, -166620, -40151, -15724, 66970, 28784, 62678, 244430, 218381, 167355, 86023, 102263]
22032A02263l1755O3663j03144j34088n4332R0925k7842L0463l0468k9449m5478
22021a69242o6344p3004o2815J06296Q6931O1043K4942O3756P6626m0754o1270
22010e3835L0702l805l5117Q1374L7469J8746k5695m454k5465j07007j05116n073
21998a97276M3012J10923J36455P176j0314m6079k4921J2212K7592r4329k7500
21987f3049M2866n1364m2367M7774O6671j9472m6420m6659q4415l786J03471N4535
21975d2215j6183n3421N424m0688k3341N3484P9909o914k6776n7912J011R7736
21963b9886K6476p2596o2986r3726o835m3269O3352N894L2177O3281M229Q1465
21951c2424o9846m9618N2718M5548J7399r1138m5505m1331k7167J24763J17060
$$ y = [102263, 70508, 134171, 31027, -103061, -157393, -66468, -94310, -63847, -94315, -123764, -169242, -235586, -308590, -371405, -265109, -178178, -117135, -92193, -28437, 48189, 7435, -53835, -23133, -26938, -62055, 19319, 56788, 75534, 49839, 45385, 19920, -87087, -192203, -197276, -154264, -43341, 93114, 100290, 89976, 43897, 18976, 31188, 58780, -35549, -63049, -20183, -71547, -113914, -66140, 531, -18941, -65361, -112020, -196435, -200221, -96750, -42215, -58398, -111819, -106395, -147083, -170424, -116940, -37031, -43945, -70721, -128633, -127622, -29886, -3410, -76006, -138992, -232718, -239553, -282822, -219470, -213576, -181399, -118118, -113889, -32424, -102270, -151888, -99170, -53622, -36223, -127361, -172866, -214197, -241364, -116601, 459]
21940D59N6970L5808l8168P266N6277M539n252n9538k8973l4937R1060k4013p4260
21927a2762k7146J8305P4628j05718o3072l7676l8237J14399J76458J28695P6542
21916C04416k3935q1442j40133o2566l5012L3209O7575J7931j43421j09098l1914
21905b04390M2123P4276n0118n7036J03316J10288Q2455J13143k6579j24207j61659
21894i8388n1215N4208j0726k5140k683J02888l826q1942r8688k4428J6495J21744
21882a01701j0076m323n3778R8144J7115J647L1656K0081p627n9697P9121O2479
21870G3041k4495l2103l6941l5488R6119J51218n7912n9130l3731M338L8825j05392
21858b1651k4892N8575n4100p5400N333J88815M1896l3858m8712m6808J16381
$$ y = [459, 57429, 93237, 55069, 62335, 118612, 123151, 117899, 58361, 29388, -5549, 85511, 61498, -12762, -39908, -21603, 53025, -52693, -115765, -153441, -191678, -77279, 99179, 227874, 304416, 280481, 199039, 58906, -3660, -38672, -5463, 62112, 80043, -63378, -172476, -204390, -162267, -87991, -138109, -195145, -91829, 18459, 100914, 214057, 187478, 63271, -98388, -149603, -95395, -106121, -131261, -133944, -31056, -34882, -116824, -215512, -239940, -223445, -101701, -111777, -116100, -169878, -71734, -54619, -52972, -21316, -1235, -8862, -68559, 10562, 73041, 48546, 16443, -20498, -55986, 40133, 191351, 133439, 74309, 40578, 44916, 83741, -21651, -46543, 12032, -42068, -117468, -112135, 76680, 118576, 84718, 36006, -10802, 105579]
21847A05579J3484r3923m8178n289j3714l0538p642Q5950J2567o3716N4410m9781
21835d0791J8987n9246M8178J16535r018J5863Q4127q2028j21508j02680J1611
21824a19970r974n6024J8046N8626j22426K9464J9581l9692N8169O6978P6005
21813b1217Q5028K9058j14709k10559J2901J40398P5104m486q4959q2386k8346
21802b04173J20966J08801Q9163k4097j8385L3652O4498J00571p5243l2999m684
21791A58070p9765l8330P1329l8421m4330L1571r62K1107l8879M8648j7223j01475
21779b8660j03310P1371Q7308l1155J9821M2703o2382r1652n4579J1896j0202
21768a48841N424K00542R5658l2969o4984R2157L1925m2832j5036r1464l0846
$$ y = [105579, 119063, 25140, -23038, -28327, -42041, -72579, -80221, 5729, 18296, -45420, 8990, -40791, -21804, -81050, -32872, 83663, 74645, 90508, 174635, 92607, -28901, -131581, -119970, -129944, -185968, -167922, -109296, -231722, -202258, -182677, -222369, -164200, -97222, -21217, 63811, 92869, -21840, -232399, -219498, -79100, -3996, -8482, -93441, -175827, -204173, -83207, 25594, 114757, 90660, 72275, 105927, 170425, 270996, 195753, 162754, 158070, 78305, 39975, 111304, 72883, 28553, 60124, 59162, 80269, 41390, 90038, 72815, -28660, -131970, -60599, 26709, -4446, 15375, 58078, -4304, -95956, -150535, -138639, -148841, -143417, 57125, 152783, 119814, 54830, 146987, 178912, 136080, 121044, 29580, -1266]
21757a266Q2359j3730q0823L4714N4230m8966n8536N737M8748j5890l9964l7789
21745g1176l1412M1687K4076O0243k5951p2372l6605M3036k12k9913O2631P4216
21733C8248j01271J2570K7301Q1318r6488p2972L199J3363K1215l2379l2921O3280
21721g5537k502N49L9846N7162j9935J00001J14614n5915o9753l0995q0427K9889
21709F997L0576l2188l3024l509j0607L5989q3355O9273J53765K5600j06848j27756
21697g5087J0646j6558o5360P4776R9039k4905k992J2174P5119N8988o9269o6688
21685I883K0889M9900l7607k3271j34444O1734L3195N0517M0974n317l6308J051
21673C1196p8984p3375j4716k776k8255l1230Q4887J0034j8191M2629p994M6462
$$ y = [-1266, 81093, 67363, -13460, 21254, 75484, 26518, -32018, -26281, 22467, 6577, -33387, -71176, -102588, -60901, -36825, 23418, -2533, -74905, -111510, -68474, -68686, -98599, -35968, 38248, -63023, -50453, -23152, 58166, -38322, -111294, -108095, -94732, -73517, -105896, -138817, -75537, -78039, -77490, -37644, 19518, -417, 99584, 214198, 158283, 88530, 57535, -22892, 6997, 37573, 5385, -27639, -31148, -41755, -5766, -89121, -19848, 133917, 159517, 52669, -75087, -64441, -80999, -146359, -71583, 27456, 2551, -441, 11733, 86852, 145840, 76571, 9883, 30772, 80672, 43065, 19794, -114650, -52916, -19721, 30796, 71770, 66453, 30145, 31196, -47788, -121163, -135879, -138655, -166910, -198140, -113253, -103219, -121410, -78781, -86775, -40313]
21661d0313m1963M4947j9951n4606m7242K2253J65902R2126o0248j66988J4774
21650i1309J02034L3439j165O5065p986j02093r6031k7741J9693k606Q4621J20048
21638I5969l2212j8383R915N875l4625K1279O7839l2193J559P7855o3188q8976
21626A0714J9081o321R2019O132n7264o9316j6662L824l0721l3599o1558k8517
21614a72188L9188K4756J03479L6814o5796l0109l96k0373j9655k9098j2960M4345
21602a01993Q6507Q4479K8158k5173J01217r2429o9140l8928k0486M6053Q8279
21591H6544R2795q8403r4752k5200j16841j10792K3140P4944J06076r19l191J09837
21579E3238m7243j2981k2167P0262L6769j20527l9715k917m965N7171M6609N5778
$$ y = [-40313, -82276, -37329, -57280, -111886, -159128, -136875, 29027, 121153, 60905, -106083, -91309, 10725, 44164, 42999, 108064, 100078, -2015, -98046, -125787, -106094, -108700, -24079, 95969, 63757, 45374, 55289, 61164, 26539, 47818, 115657, 83464, 85023, 162878, 99690, 10714, 29795, 23474, 115493, 121625, 64361, -4955, -21617, -17793, -48514, -82113, -143671, -172188, -133000, -108244, -4765, 32049, -33747, -63856, -64252, -84625, -104280, -133378, -146338, -101993, -15486, 68993, 97151, 71978, 173195, 80766, 11626, -27302, -47788, -1735, 86544, 179339, 90936, -3816, -29016, -145857, -256649, -233509, -158565, -52489, -53408, -56599, 53238, 5995, -6986, -29153, 41109, 77878, -42649, -82364, -85281, -90246, -33075, 13534, 69312]
21567F9312K5277l3311o3232k0659o9900K7474k3874J1901n0027k0486M1669j06463
21555b12319j8567N7436O7043N826p5980K1372N8154j3272P055M4122N9400K2606
21543B2876O6892L6317o3155l5020m3979j8559M7677J16599p2561o4993O1414
21532E3508J41639n2739r3630n0510p9693l1190K3826J32695K3322P725J7483
21521I2436k1306Q247o0654J32909J16396o6793J7445Q852q5984n3903Q595K8927
21509A25167J1883o8925n5848j5565o0405j361l9843J3255J18138N4004M8858
21498A29358j35207j6536N2915K5021l2017j14247L3853Q0382J10833L6096r8959
21487G1492L9472j04860j00407L1553J07127J8536o9267q6614M8764N9091J17601
$$ y = [69312, 94589, 61278, -1954, -22613, -92513, -65039, -88913, -77012, -127039, -147525, -105856, -212319, -230886, -173450, -106407, -100581, -176561, -155189, -97035, -110307, -103252, -59130, 270, 22876, 89768, 126085, 62930, 27910, -16069, -34628, 13049, 129648, 57087, -7906, 53508, 195147, 142408, 48778, -1732, -81425, -112615, -88789, 43906, 67228, 74953, 92436, 71130, 79377, 18723, 151632, 268028, 201235, 218680, 227532, 141548, 87645, 96240, 125167, 137050, 68125, 12277, -3288, -63693, -65054, -104897, -91642, 26496, 80500, 129358, -5849, -22385, 30530, 55551, 23534, -90713, -56860, 23522, 134355, 170451, 71492, 110964, 6104, -94303, -62750, 44377, 62913, -6354, -92968, -44204, 14887, 132488]
21476A32488R3710l6269j55368j66911O0431J87004J06275l9829o8482n4049l835
21465E5165J99823J34196j10301j48798n4731k8314p3660K4613J17887K1523q3254
21454E4149q8936l3028m3524L4445j5692O5832L8293Q2955O5185l9557m6551m2316
21442C1255j60302R721J9689J36607J7357N7487j8694m9108j09186J42606k7648
21431D9784j1423k2426J2975k950J56034k3059R449j675j5344j79969Q0850K7620
21419G9866J0215j23000q1828L7266M2618q1358q6201l8960k0124K6500P9962
21408a55044J2135J15344l0438o0014Q603R5641J21880r3192L2251K2519P1015
21397A40700J2617P5941j7979n8408p8389o8434j852n9495j9193L0999p952l3220
$$ y = [132488, 226198, 189929, 34561, -132350, -71919, 115085, 221360, 181531, 113049, 59000, 55165, 254988, 389184, 278883, 130085, 75354, 47040, -26620, -2007, 115880, 137403, 54149, -34787, -67815, -111339, -76894, -92586, -26754, 11539, 94494, 159679, 120122, 73571, 31255, -129047, -119326, -99637, 36970, 54327, 111814, 93120, 44012, -65174, 77432, 49784, 38361, 15935, 28910, 25960, 181994, 158935, 168384, 166709, 151365, -28604, 52246, 79866, 90081, -32919, -114747, -77481, -34863, -116221, -202422, -241382, -261506, -235006, -155044, -142909, -27565, -58003, -118017, -109414, -13773, 108107, 14915, 47166, 69685, 140700, 153317, 229258, 211279, 152871, 74482, 6048, 4196, -55299, -74492, -43493, -51445, -84665]
21385h4665l3977P5230N0431o1422k1135L8616l861q170K0401R354R6258l5430
21373D1630n9864m7957M725Q0230O8366J330r7817J0411J166l6700J14389J4654
21361I4563n6969n6520J3705N4939J1569j88692J482J77865l2993j2394l8081
21350c1526n2353j8024P5274p4408m1059n8642o5874j6081o7587L2451P1061N3726
21338a93042M1491R1350l6076l521P8428O7690n573j9548k1634J9161Q175M3679
21326G0580M0978j06793m5480J30405l4137L105M9528j5394n5126J04210O26l1597
21314A10905K217m8613L2638J615m1851p9718k4356L8355n1340j1192M9590P055
21302a4695p8841n8369L5938L2008Q7255P6359j901m2098o5214j43229o856Q1400
$$ y = [-84665, -118642, -43412, 7019, -54403, -75538, -36922, -40783, -48953, -28552, -19198, 77060, 41630, -18234, -66191, -61466, 18764, 87130, 88460, -9357, 1054, 2220, -34480, 79909, 94563, 37594, -18926, -5221, 49718, 61287, -127405, -125923, 51942, 18949, 6555, -31526, -83879, -101903, -26629, -101037, -142096, -200738, -266612, -282693, -350280, -317829, -246768, -193042, -151551, -60201, -96277, -99798, -21370, 46320, 40747, 21199, -435, 18726, 26901, 70580, 111558, 4765, -40715, 89690, 55553, 58658, 108186, 92792, 37666, 141876, 142502, 110905, 113122, 64509, 97147, 98762, 56911, -22807, -47163, -8808, -60148, -71340, -21750, -14695, -93536, -151905, -115967, -83959, 3296, 79655, 77754, 35656, -29558, -172787, -179643, -98243]
21290i8243q41L3369l261k1207l7849o1306q2761N3973l6254k9185O9860J12678
21278a01027R3215l0680K4806q8314k5566j8600j81276m7980J27361J00218P5074
21267g2769O5402q5247j82388k0423J54677P874J28442q7843j10815n6180Q572
21256b50698R7313Q4133O9508J08940j2265k1835r7328l6202k6607P3203Q9808
21245G7970N69J6284J16541L027r1789k38814p3654Q0027o790m1908L3228j2219
21233a37528K5841P6222l5680L8087J39059m802j76891n6681o1638N4140m742
21222a44613n8313L3137J42172K3826J9646q5868r4787n8231J35258j4172n2918
21211a54863k4642n507O8563J30793P4119l3978m5203N862n0965m1210L6606n7297
$$ y = [-98243, -99084, -65715, -68976, -90183, -128032, -189338, -272099, -218126, -254380, -283565, -213705, -101027, -7812, -38492, -13686, -102000, -127566, -146166, -327442, -375422, -248061, -147843, -72769, -7367, -92614, -275002, -295425, -140748, -132874, -4432, -92275, -203090, -259270, -250698, -153385, -69252, 256, 109196, 96931, 75096, -22232, -58434, -85041, -11838, 77970, 78539, 94823, 211364, 214391, 122602, -116212, -189866, -109839, -116629, -158537, -125309, -137528, -111687, -35465, -71145, -33058, 106001, 101199, -75692, -132373, -194011, -139871, -144613, -202926, -169789, -27617, -3791, 15855, -70013, -164800, -223031, -87773, -101945, -154863, -179505, -185012, -116449, 14344, 88463, 54485, 9282, 15144, -35821, -77031, -40425, -97722]
21199i7722m207n4780J55170N7529j4338q7205n2170N804Q5630J10788j2737r3322
21187a560p5523l9992p834R9103J1646P1436L166o2138R441J2657m1111k7956
21175d8665L4217M1234m143K765N9221m393n7667J6662M2005l3565o4559J2646
21163d242R3889J9418m9161M0j09257r735k4132j33594p3552Q4694Q1009k6556
21151a51179j150n5155O885N2920l0512J28634N1726n0328m4490J0610L2644l4621
21139h4016o8388R959r937J0572m9238R7446J34723L5535l3644n8779l2443K2916
21127b5294j2957K8786k3393L7119j13487r2576l1624L9002J8082n824k5543P1748
21115a35961O4975K7847R1831J02799J21019r5260j40745n5753q2275J5940M8980
$$ y = [-97722, -101929, -156709, -1539, 55990, 41652, -45553, -97723, -91919, -6289, 104499, 91762, -1560, -77083, -117075, -124909, -25806, -14160, 57276, 60442, -1696, 7745, 20402, -20709, -48665, -14448, 26786, 22643, 25408, 84629, 80236, 22569, 39231, 81236, 47671, -16888, -4242, 89647, 109065, 59904, 59944, -49313, -59048, -83180, -216774, -290326, -205632, -124623, -151179, -152329, -207484, -200599, -147679, -178191, -49557, 2169, -48159, -92649, -82039, -49395, -84016, -152404, -142445, -152382, -141810, -191048, -93602, 41121, 76656, 43012, -15767, -48210, -25294, -38251, -9465, -32858, 4261, -109226, -201802, -233426, -194424, -176342, -182166, -207709, -135961, -70986, -43139, 48692, 151491, 272510, 177250, 36505, -19248, -101523, -85583, -36603]
21104c6603m8271j16687J3789J53291J0048j1938M422r4139Q136J19613K8332
21093B9993M6499n5183m5997o8441Q628j4026m1928J6537R8792j3618N2739J40385
21081A54380K8739r9415r2766n762L3696R8335J14999j32536K2966N1493j06417
21070F7712m3673L8827q742k6840k2912n0056L9563O574K627j10145j8449j8380
21058a43894M6636P1245N5913k6904l3888l5065n7920r5908O1619J57258j5568
21047a6476o9471P4638O6915o5012q9237N2064L1476M642P887L1537k7198J3202
21035A4967n9880L8916P2604J6040p1219l8519P4763m1867l2842j5909m018o8136
21023a15100J272j9019o1189K0694Q9747M6108n3379k301M548j8094P972j1914
$$ y = [-36603, -84874, -201561, -187772, -34481, -24433, -36371, -31949, -126088, -117952, 1661, 29993, 76492, 21309, -24688, -93129, -84501, -98527, -140455, -123918, -25126, -38744, 13995, 154380, 183119, 83704, -9062, -14824, 18872, 117207, 232206, 99670, 122636, 174129, 67712, 24039, 62866, 54124, 27284, 4372, -45684, -6121, 453, 3080, -107065, -125514, -143894, -97258, -26013, 29900, 2996, -30892, -65957, -123877, -219785, -158166, -908, -16476, -85947, -11309, 55606, -9406, -98643, -46579, -15103, -10461, -2574, 28963, 1765, 14967, -44913, -5997, 66607, 82647, 11428, -27091, 47672, 5805, -27037, -42946, -46964, -115100, -113828, -132847, -194036, -173342, -83595, -37487, -90866, -93167, -88619, -106713, -98741, -110655]
21011a10655n9135K4953k9910R5221M6661n6791J5095N6835M6319P4765k7891
21000G5467K5133j06882N967J38146Q8092j00751j7309R3389O000j1312j29464
20989F6476J01493j8451o2645r1982K9686M6793k8153k5642J07206R0298n6544
20978A58535M732n8302j91868j33620R6032L7933P7557L3676L3310m79m0269N0233
20966F7470K0173O6212M4906M31m8390K3698M1306r7861j86866n8015N7448j2237
20954h1725j37824k0220J74886J15043K9655J0808J8046j05286n1921P1686P9966
20943A03114O733j7871O6004M5063j39193L500P4204o0762j3766j2932p200p2840
20931b5946j39908R989J60433K5245j28296J48930k6870p4694O7934P698n1995
$$ y = [-110655, -169790, -144837, -174747, -79526, -32865, -89656, -74561, -17726, 28593, 103358, 75467, 100600, -6282, -315, 137831, 225923, 125172, 107863, 201252, 207252, 195940, 66476, 167969, 149518, 86873, -5109, 24577, 71370, 43217, 17575, 124781, 215079, 158535, 163267, 104965, -86903, -220523, -124491, -86558, -9001, 24675, 57985, 57506, 17237, 67470, 87643, 153855, 198761, 199192, 150802, 174500, 215806, 117945, -68921, -126936, -69488, -81725, -219549, -239769, -64883, 50160, 79815, 90623, 108669, 3383, -48538, 23148, 103114, 109847, 91976, 157980, 203043, 63850, 67350, 141554, 80792, 67026, 54094, 46894, -25946, -165854, -155865, 4568, 29813, -98483, 50447, 23577, -51117, 16817, 24515, -27480]
20920b7480O8666q745k7502o6060j1256n2145J2882K9069P205j4431K8679p8276
20908a39394k0335O1089L2471m8960m0425J35574K8358R4099p6140q2264n7029
20897a12956j7283k4102L9536m2831O8980m5192O5153M5000N276j76527J4210
20886a80736L4991j8472M5278J418M3894J00818L5344N3266M7112m3831j25080
20875e998k3958m6940p3743L9676J89916O3977o2016k1035l1237O4027n5638M6230
20863H3261k1211q8670q4709M4610J20441M9137L9136l8424j83393k510m391R91
20851h5732N8998J02790m3742q2054m946L051J40387K9161n5184j35446O480L8408
20839b7829N1907l5643p9893l9849M7829J50265J2435J1210n5883O2109m6892
$$ y = [-27480, 41186, 32441, 4939, -61121, -72377, -124522, -111640, -82571, -75366, -89797, -61118, -139394, -159729, -98640, -66169, -115129, -155554, -19980, 8378, 102477, 26337, -55927, -112956, -130239, -154341, -114805, -157636, -88656, -133848, -68695, -23695, -18419, -194946, -180736, -145745, -164217, -118939, -117521, -73627, 27191, 62535, 115801, 162913, 119082, -5998, -29956, -76896, -150639, -110963, 78953, 142930, 80914, 59879, 28642, 92669, 37031, 83261, 62050, -26620, -111329, -66719, 53722, 102859, 141995, 103571, -79822, -82332, -86723, -85732, -26734, 76056, 32314, -49740, -54686, -51635, 88752, 117913, 62729, -72717, -66237, -27829, 24078, -11565, -91458, -131307, -83478, 66787, 79222, 90432, 34549, 96658, 49766]
20828D9766K9537j1344k4015k4821q9639K0965J11957k750p8506K7750N6357j54814
20816h9557r5860M6407K5149J03773K1204P4155J0770j45582n2152K2149P5153
20805d391R5741P5734J4132l6343l0789l4234K8107r0054k3941j12782k4498P0294
20793g3024M6240o1852p9940R3128O261P8603J0460N0955J7527L7979J3773N108
20781A45218o7747l8052m9662q0694J42797J6797m1798L1837M659j71973J9201
20770h9417M4892q1024r4902Q1846J04331N4743j21798j17489r0266l3440L1729
20759c10795O8663J29343J23942L2551J3844n3600r9984J3182k2355l8649J6815
20748a27043L8326j8874m7064l8898K7631J25691L4292K5768j4402j01771K5074
$$ y = [49766, 79303, 67959, 43944, 19123, -70516, -49551, 62406, 59656, -18850, 8900, 65257, -89557, -185417, -139010, -113861, -10088, 11116, 85271, 96041, -49541, -101693, -79544, -4391, 91350, 167084, 181216, 144873, 114084, 79850, 107957, 17903, -6038, -118820, -143318, -73024, -26784, -88636, -168576, -75448, -69187, 9416, 19876, 70831, 88358, 126337, 140110, 145218, 77471, 39419, -10243, -90937, 51860, 68657, 26859, 58696, 63355, -108618, -89417, -44525, -125549, -220451, -138605, -34274, 20469, -101329, -218818, -309084, -342524, -310795, -242132, -112789, 11153, 43704, 57548, 3948, -96036, -82854, -105209, -143858, -127043, -88717, -107591, -154655, -193553, -165922, -40231, -5939, 19829, 5427, -96344, -71270]
20737g1270K7367l0951p0992K4120m0513K3008O5015j00429N7909J07486L1590
20726B2340j60636j31989K5201K7826J36650J40142k8464m1032o4398q4858K7866
20715a31352L3541n9370j16839P5821J08068J53574N2242j44726l4733K697l1198
20704i2275O9092O9186L1984m2713j5021K3435j19506o5395Q6926M0579M6485
20693C2777K0967n3697K5365j7580L6778K7160Q8061L3570r1163j57144k9673
20682h4579N1269j0731Q7755P3827q8748j99809j0622P7285P2406Q6697K0306
20671G5056q3503p4877K3151J2595J78531n6767j80698l5088O2686o5610L5150
20660a09374J28564O5761j24187L0488P065o4320m5226O7729P1994q985L6624
$$ y = [-71270, -43903, -74854, -145846, -121726, -162239, -139231, -74216, -174645, -116736, -9250, 22340, -138296, -270285, -245084, -217258, -80608, 59534, 31070, -9962, -74360, -159218, -131352, -97811, -157181, -274020, -198199, -90131, 63443, 115685, -29041, -63774, -61077, -92275, -23183, 46003, 77987, 35274, 20253, 43688, -75818, -141213, -54287, -13708, 32777, 53744, 47, 25412, 7832, 44610, 71770, 159831, 193401, 102238, -54906, -84579, -33310, -44041, 43714, 117541, 28793, -171016, -181638, -104353, -31947, 54750, 75056, -8447, -83324, -60173, -47578, 130953, 74186, -106512, -141600, -78914, -144524, -109374, 19190, 84951, -39236, -8748, -1683, -66003, -111229, -43500, 28494, 19509, 56133]
20649E6133l0504N8670n6770K9453M0257M2861k0361j5202O5052q5222q1391r5526
20637i2550K2613M4775n5725o1807n4564j9537J43652J68894K014o4913L1947
20626F4799O7708o8043j58242N1738R6914p5656p7007j1847o724p6896k8644J7278
20614b04622J8938N0007N4850P7124N0229N0961p9327l3479O7483q9631j36490
20603a73957O162J02168p703n5773Q1547Q6250n7803n0711J0567M5775j73K8099
20591A4448j7530j8481q2086l1403M8446K8835L4626J01284J6901k1459m8671
20580B4910j17159m3877l1483R476N5208O9596L4138M922P1794J7486q8177J3783
20568B0617r470j00130J5188J13360O5688n726n5236j8074M4788O5809K0515j7015
$$ y = [56133, 25629, 84299, 27529, 56982, 97239, 140100, 119739, 104537, 169589, 84367, 2976, -92550, -69937, -25162, -80887, -142694, -197258, -216795, -73143, 95751, 97765, 32852, 64799, 132507, 64464, -93778, -42040, 54874, -20782, -97789, -109636, -116360, -193256, -221900, -204622, -185684, -135677, -80827, -3703, 46526, 97487, 18160, -15319, 52164, -37467, -173957, -167795, -65627, -73330, -129103, -47556, 38694, -19109, -69820, -59253, -13478, -13651, 14448, -3082, -21563, -103649, -135052, -86606, -57771, -23145, 78139, 95040, 73581, 24910, -92249, -136126, -167609, -158133, -102925, -33329, 809, 5731, 77525, 95011, 6834, 20617, 11147, -88983, -73795, 39565, 105253, 99527, 44291, 26217, 71005, 136814, 157329, 140314]
20556A40314K7761j4983r1323j10220j60281k4682J35117J74930o867o7905N156
20545G017K1153M0993L5755M6285j53350n045L2958N0043p6713o4257Q947R6767
20533D0553J15605j647j01914p0165p4421R0149J12358j2839j14295j20994Q567
20522a29043j309k0712L9382Q5273J22626k8964r392Q9839J4255o7346m5005o0018
20510a0414J7267M2711m6182j04662K5441J5135m2716N0774j9128p8053J5216
20499a34611Q4670O4495L5407K1194P8299q9453o5994p0486j5131j0152k5927
20488a27689k9579l1353O309j9397R8400L2609j6199m3288J32640q274k5126J0159
20476b0788p675l4609p5692l1453o2897N9490K12792J75423k6966p4916q1510
$$ y = [140314, 168075, 153092, 61769, -48451, -208732, -233414, -98297, 76633, 69766, 1861, 7017, 28170, 69163, 104918, 151203, -2147, -7192, 25766, 75809, -904, -65161, -56214, 40553, 156158, 154511, 52597, -17568, -91989, -1840, 110518, 97679, -16616, -137610, -129043, -130352, -151064, -111682, -26409, 96217, 67253, 57861, 147700, 161955, 94609, 49604, -10414, 6853, 49564, 3382, -101280, -75839, -60704, -103420, -52646, -71774, -149827, -134611, -49941, 14554, 49961, 71155, 149454, 60001, -5993, -76479, -91610, -101762, -127689, -157268, -188621, -182312, -201709, -103309, -70700, -86899, -130187, 2453, -5821, -30947, -20788, -28463, -63072, -138764, -170217, -233114, -173624, 39168, 214591, 187625, 112709, 31199]
20465C1199p101P5889L0218K1592q4555M9887p3233j30391M1261k4671J1634O2788
20453D517N0746n6063J5117N9850q4903q2528L2667J49726L6424j08545j44060
20442a27052j9387R2600Q4366r5247K3465N9399p0212N2921O5086j1561p0559
20431a6181m7943J08527K2490P5777M9623j09385m719N5381l2016l1261J9025
20420H9318O174K6530q4152m504J9483p4614m6770N3218k9726j3364J39625L1821
20408A13039j43975j14426K8977L3476k5070p6217m5058O4647J9160k1751l5695
20397b02893J1004M8468L2283p594M8834j955Q2660n1847l4209o5335L9708M3525
20385e7351P2723M3515N300q9659q1979j1132J17179J16571M6430r7949L3864
$$ y = [31199, 24098, 99987, 130205, 151797, 67242, 117129, 43896, -86495, -45234, -69905, -58271, 4517, 55263, -800, 14317, 74167, -10736, -93264, -60597, 89129, 125553, 17008, -127052, -146439, -53839, 30527, -64720, -41255, 18144, -52068, 853, 65939, 54378, -16181, -64124, 44403, 66893, 142670, 192293, 82908, 78189, 133570, 101554, 70293, 89318, 95492, 122022, 37870, 33366, 52849, -21765, -68535, -15317, -45043, -58407, 81218, 113039, -30936, -145362, -116385, -82909, -107979, -184196, -229254, -164607, -145447, -167198, -202893, -191889, -143421, -111138, -118732, -69898, -71853, 10807, -41040, -75249, -140584, -100876, -57351, 15372, 58887, 64187, -25472, -107451, -118583, -1404, 115167, 161597, 63648, 97512]
20374I7512J4907j8801l5942q1610l3366K2677K0163M6691N0087J4494K3772j9265
20362A01319r0598K9025O0107M5134O2470J6426o3954l9592k230O3108j12022
20351F9193j38738R6969J07605Q1058j11843q0290N292J2297P7140p2149j16272
20340f9738P3649J1015p9445k8699R4943l6023j21098K2305P1749m3947l8802
20329a44091K6287q9525l6568k1566J92927R4156r5864p9548j7981K05148R3108
20318A26483n5783n6437J2783J7578r782j6143k916n7123K1049m0824j1791N455
20306f7451Q0099K4739j7132j8555m6894j1861n0024j0568J04618N1833l3189
20295E615J16932K3273j19734j29793K3854N6832m3118k6389N5K4907N3847N965
$$ y = [97512, 112419, 93618, 57676, -23934, -57300, -34623, -14460, 32231, 82318, 96812, 120584, 101319, 10721, 39746, 99853, 144987, 207457, 223883, 159929, 120337, 118107, 181215, 69193, -69545, 27424, 135029, 216087, 104244, 23954, 29246, 41543, 118683, 46534, -69738, 3911, 14926, -64519, -93218, 1725, -34298, -155396, -133091, -61342, -105289, -144091, -117804, -207329, -243897, -265463, -72536, 21620, -74244, -153792, -171773, 33375, 126483, 70700, 14263, 27046, 44624, 34842, 18699, 15783, -41340, -20291, -61115, -72906, -67451, 12648, 37387, 20255, 1700, -45194, -57055, -107079, -117647, -13029, 38804, 5615, 122547, 145820, 26086, -103707, -79853, -23021, -66139, -92528, -92473, -67566, -13719, -7754]
20283g754M0687q4515J324k867Q5325N0337m7274r6M8920P8668j4689m0574j08328
20270h36l1787J17161J0731j32550n5870M8004Q5640P8930r2481q8806N9175J4032
20258A1343k9014m1348M4641K695n7777o3237R397M9131N7321Q1398k9569N403
20246D0384l8894J3108L1397K0587k74k8578q8499q3103R2196J74991l2820p7823
20234B2672n4290O82l8977l1599k7198K6554J37230R5118j10976k10284M025K9144
20222a57899M6698o353n6179m3843O1192J51137K7638K298Q2058j46816j02280
20211a42349N5157m2857l5372N8191J08465J24888q8030P928q1950o4261O4540
20200c5650N9629p71L8171M7453J6367j50884n9903p2608p4337P8790J41454k2422
$$ y = [-7754, 32933, -51582, -50258, -53125, 32200, 82537, 35263, 35167, 84087, 162755, 148066, 107492, -836, -32623, 84538, 95269, -37281, -93151, -45147, 40493, 119423, 26942, -61864, -2689, 11343, -17671, -59019, -14378, -11683, -69460, -132697, -123300, -74169, -16848, 64550, 34981, 40384, 1490, 14598, 45995, 66582, 66308, 37730, -50769, -133872, -41676, 133315, 100495, 22672, -31618, -30936, -69913, -101512, -128710, -102156, 35074, 130192, 19216, -191068, -187043, -157899, -111201, -117554, -173733, -217576, -156384, -5247, 22391, 24689, 106747, -40069, -142349, -87192, -130049, -165421, -107230, 1235, 126123, 38093, 46021, -35929, -100190, -35650, 23979, 23208, 61379, 108832, 125199, -25685, -85588, -158196, -232533, -153743, -12289, -34711]
20188c4711m9762L9198K1974m966n0304j32518J11277J13413N6510j07556r9236
20177a36681m6758j4937J0318J35786N6088P7801L8861m5487j37722m0362J26879
20166B3786J36099k838k0863j8847m8299J0958K3796p549k1253j47841n9441J11945
20154b0347k9198j08449O7797J27427p841p4849L3118L6054R3707N2739p0365
20143I9793m272N1146Q537j13122q1578k0230J17446M1103r5531j5812k2650J1087
20131b4083k3164R661M282P326R3762J6724j43314j55548K7193o6157J39701O3618
20119d9999r4205M9214n5m2149Q4000J6695n1970N505K8600p226M9309R3019N5977
20106A36715r635j31523j18532M8654J59315P3679J3071j33566o6621l0048M3675
$$ y = [-34711, -84473, -45275, -23301, -28267, -78571, -211089, -99812, 13601, 70111, -37445, -136681, -183439, -198376, -188058, -52272, 3816, 81617, 120478, 74991, -62731, -103093, 23786, 159885, 157047, 136184, 117337, 69038, 79996, 103792, 96243, 74990, -72851, -132292, -20347, -49545, -157994, -90197, 37230, 29389, -45460, -12342, 23712, 117419, 170158, 99793, 95521, 146667, 155204, 42082, -39496, -59726, 57720, 98823, 3292, -12520, -35170, -24083, -47247, -37586, -33304, -25978, 67784, 84508, -58806, -214354, -187161, -253318, -113617, -49999, -144204, -94990, -95045, -137194, -53194, -36499, -88469, -82964, -54364, -61590, -12281, 80738, 136715, 127080, -4443, -122975, -74321, 84994, 158673, 171744, 38178, -28443, -58491, -14816]
20095a4816L3324o2633l4440J07567l7652o6462Q7870R8288m8399r8484q1642
20084a17479o4309o4462K932P9404O8935Q3148J14389J6717r7502p6519q3594
20073a38340O6077Q9699M0872K7326l953n7800p938M9555j8634o2938r3108m1784
20061a50966P7325J1069j44965J5101J58881J24027k9235q2492K4941m678R5302
20050I4310p701N7562m2645m1619j63507k6144J36652P5979P5407O8961p2145
20039A55110q2198r9866o1866m7799k1508J1499O1568M1145k1213l7807L0913
20028g2022j7377M3293L1000R8728O3121k0089k5102M5060r4836M0287n257q4569
20016B237m2040J01655r621n178O8820K1768J0359l6664n2361q8225r7668L9129
$$ y = [-14816, 18508, -44125, -78565, 29002, -8650, -75112, 12758, 111046, 62647, -35837, -117479, -181788, -246250, -243318, -163914, -94979, -11831, 102558, 119275, 21773, -54746, -138340, -72263, 17436, 58308, 85634, 81681, 23881, 15943, 65498, 46864, -16074, -109182, -150966, -73641, -62572, -207537, -192436, -33555, 90472, 61237, -21255, 3686, -992, 94310, 86609, 144171, 101526, 59907, -103600, -129744, 6908, 82887, 158294, 227255, 155110, 72912, -26954, -88820, -136619, -158127, -146628, -85060, -43915, -65128, -102935, -72022, -89399, -46106, -15106, 83622, 146743, 126654, 101552, 146612, 51776, 92063, 86806, 2237, -39803, 61852, 52231, 47053, 115873, 137641, 148000, 111336, 58975, -29250, -126918, -87789]
20004h7789J46446L604l5327Q0354p2988j60312m1713R9377J82660J63783o7173
19993B10922n4066k8600r2531l4348J07201J38193l7062q9895O7302P9946r1348
19982A75714j31519L8378j1537M1467P5502J904j7731j17308j69989M9768O8290
19971B939l8629O4186L9141J8897j4222k1681r0548l3788l7520N9754Q1282R3542
19959A23353k3259j03070m5216J303k9959Q3309J32p7934j84825L2140P7895R5831
19947e0300J78722q5831j47733j86450n4376J32814O6880R9294L1341p2337K3258
19936f4718P0704j7423n5115r8228l6048m42r990m2967N4346Q7369Q7011Q1184
19924E5683J0685j4221q4005J46656J19503j8997m5762q3330J0722M7037k3113
$$ y = [-87789, 58657, 62261, 26934, 107288, 34300, -126012, -167725, -68348, 114312, 278095, 210922, 156856, 128256, 35725, 1377, 108578, 246771, 209709, 119814, 187116, 267062, 175714, 44195, 82573, 71036, 112503, 188005, 189909, 172178, 54870, -115119, -65351, 2939, -35690, 28496, 67637, 86534, 72312, 50631, -39917, -73705, -111225, -51471, 29811, 123353, 100094, -2976, -48192, -46889, -76848, 6461, 6593, -71341, -256166, -224026, -146131, -50300, 128422, 42591, -105142, -291592, -345968, -213154, -146274, -46980, -15639, -87976, -64718, 5986, -11437, -66552, -164780, -200828, -201270, -211260, -254227, -199881, -112512, -25501, 55683, 66368, 52147, -31858, 114798, 234301, 215304, 169542, 86212, 96934, 143971, 120858]
19913A20858j29446L398M0142o8591K0126n8587n6001K4761P1789J25165O283
19902I9897r4152q3143m687M5332j06557M1171Q6458L219q461n4308P2177P5197
19890G2143p1021l9383l8118j1710J62964L2118N610j65345j10642k0808M950
19879a79242L6898o6034J1234J90419J10197M6708M4774j17159l0500m5209m280
19868b194L2136j1313l4137M7560l8052j6250l1439o8134j51580L6840J01901
19857a34662L704P0359L9187r3027j9452P4625l138L5010J0371m6162O4173k4400
19845b3412n9929L6626P7587J127K4815j46295r535R0461l1074l5710o683N7863
19833b4159R7161Q071o7323L0290L0180L810Q8925n7714j59640N8674K4304p2689
$$ y = [120858, -8588, -5190, 34952, -33639, -13513, -72100, -128101, -103340, -31551, 93614, 99897, 5745, -77398, -82085, -36753, -143310, -102139, -15681, -12462, -20923, -75231, -3054, 72143, 1122, -38261, -76379, -88089, 74875, 106993, 112603, -52742, -163384, -184192, -179242, -142344, -208378, -197144, -6725, 103472, 150180, 194954, 77795, 47295, 2086, -2194, 29942, 18629, -15508, 32052, -6000, -22250, -53689, -121823, -273403, -236563, -134662, -130958, -60599, -21412, -114439, -133891, -59266, -62404, -27394, -17023, -63185, 988, -23412, -83341, -46715, 30872, 31999, 56814, -89481, -99016, -8555, -39629, -75339, -82022, -24159, 73002, 81073, 13750, 44040, 74220, 78030, 166955, 109241, -50399, 8275, 32579, -40110]
19821d0110q957L5817R3693j0201k20027q1056k2596J27408M4748j9971o0918
19810a62170n2868J18591J44997l4771L973k7182j14717l8736R9229J0394Q0485
19799B7225Q1713J61817n7020j32891j3416j02596J2926R7714K8318p9944Q8722
19788A12568K5522Q874Q308Q9752j68072q6902J20523p4760j42508k0296Q4183
19777d2808R0086M5439o012k2547K7082n8237q5185j49848j7070J14464N9703
19766d4933n918o8587n6993M0025O5607L2074j16443j17525L0127j6543j67877
19755d26986J33617J36212J950P2737P0786K0358j60994j33365Q0824J49291M7695
19744g875r164P5930K8760q7385J7680p981k6914K9091n7318J46522N3553j20926
$$ y = [-40110, -49067, -13250, 80443, 70242, -149785, -230841, -253437, -126029, -81281, -101252, -162170, -215038, -96447, 48550, 13779, 17752, -9430, -124147, -162883, -63654, -53260, 27225, 108938, 270755, 213735, 80844, 67428, -35168, -22242, 75472, 103790, 23846, 112568, 138090, 146964, 155272, 245024, 76952, -9950, 110573, 35813, -106695, -126991, -42808, 47278, 92717, 86705, 64158, 91240, 33003, -52182, -202030, -219100, -104636, -44933, -50851, -119438, -176431, -136406, -70799, -38725, -155168, -272693, -242566, -259109, -426986, -293369, -157157, -155207, -82470, -11684, 8674, -152320, -285685, -204861, -55570, -7875, -17039, 58891, 87651, 266, 17946, 9965, -16949, 12142, -45176, 101346, 154899, 33973]
19732C3973j20047k6260M1965J3172j03517L5572k0020o5886K1459J78314O9178
19721E7903M2214Q9871n8266P148L86j10269p2508j160j0006P6358P8508m0694
19709E9485k1476J8950o5327p1613J5604J14985N4920j19238k3143L2868j6455
19698b0440m560K7782m3794k6485k0786O3169M8771j5665L6973p3911l1878K6328
19686c4496K2843O792L0466K9158j516o9418M1774K9728q3605o3491k6823R821
19674a08767k8221Q7193l9478Q1291l8844j03717m4328k27J00423K0177K9881
19663d4617j6862q5463j2014M1785K9178M8728q883M3894j3993K1309J3521K4692
19651D1275K355l180j99738o3091K15O4769Q8803L5577l4754o0824o9367l6574
$$ y = [33973, -86074, -112334, -70369, -57197, -160714, -125142, -145162, -211048, -189589, -11275, 57903, 100117, 189988, 131722, 138870, 139256, 28987, -43521, -44681, -54687, 21671, 100179, 59485, 38009, 56959, -8368, -79981, -64377, 50608, 105528, -13710, -36853, -3985, -20440, -25000, 2782, -41012, -67497, -88283, -25114, 23657, 7992, 44965, -28946, -60824, -34496, -11653, -4861, 25605, 54763, 53247, -16171, 25603, 55331, -28274, -91765, -118588, -108767, -136988, -49795, -89273, -7982, -46826, -150543, -194871, -195098, -94675, -74498, -44617, -61479, -146942, -158956, -117171, -87993, -39265, -48148, -4254, -18247, 3062, 16583, 41275, 43630, 40450, -159288, -222379, -222164, -157395, -68592, -33015, -67769, -128593, -197960, -234534]
19639b34534M9972J24619L3735Q7496K2195n6062p663p1405j19595p6854J29142
19628a18954O0442J07247K3125R5022l035m4808k9814j9805M0245M0626l7628
19617A12663J2721j6105j32404p6426j49930O9231J11623M5801L3563r3647O6464
19606a6446J74235l6860n2372m150m1806K9570L0414r7924J6518k5753k9427R384
19594d4617n3781q1497P3767O9806m900N2430J6284P0010M4764M37Q340L5338
19582A86381m4436k6570l7630n9903M9170Q0742o830Q9196n9105j84864j07653
19571a21502J31229j768n9311o1654J1156j7323J26713P5785Q922p6834m8231
19560c2818J20799N012j38091m340K3814L1661L6825J6006M394j7884j1059R0670
$$ y = [-234534, -184562, -59943, -26208, 61288, 83483, 27421, 19758, -51647, -171242, -248096, -118954, -58512, 48735, 71860, 166882, 163847, 119039, 89225, 69420, 109665, 150291, 112663, 125384, 109279, -23125, -99551, -249481, -180250, -68627, -22826, 10737, -82910, -16446, 157789, 120929, 68557, 64407, 22601, 52171, 82585, -15339, 1179, -24574, -54001, -44617, -98398, -179895, -106128, -36322, -41222, 11208, 27492, 97502, 142266, 142703, 151043, 186381, 141945, 115375, 77745, 17842, 67012, 147754, 140924, 230120, 171015, -13849, -121502, 9727, 7959, -51352, -113006, -101850, -119173, 7540, 83325, 92247, 15413, -32818, 87981, 92993, -45098, -49438, -25624, 6037, 42862, 58868, 63262, 45378, 34319, 124989]
19548A24989p3048j3584J23588Q1135l5645r9670K8093R339k9771j32148O2339
19537D5617J64195q9498n6785q152M1044P106j11516M7079k2324J4637J35622
19526A67025p438k1316m1336j82494J9677J45653Q655n4721L0257j2060K7306
19515G9208J01200M2572P6138n072r8475n4967K0568M1910P3508p5046k7887o686
19503A66971J33907m045q2646n1318p1731m5804N6174p9500q1425k4783k6428
19492a10628N7561P0651O4003N4913l54q9790l2869j2458L8797M7098o3815R93
19480B4102P0363P1785j20416j02970M549p4662R3187O5132K4612O0944M5084
19469A61710o3106p9383p8121O9466J28907q4388K8913M0859M466k4465J9583
$$ y = [124989, 51941, 38357, 161945, 243080, 207435, 107765, 135858, 145197, 115426, -16722, 45617, 209812, 120314, 63529, 55377, 96421, 103527, -7989, 39090, 16766, 31403, 167025, 159587, 138271, 96935, -85559, -65882, 79771, 88426, 33705, 63962, 51902, 79208, 180408, 222980, 299118, 294046, 195571, 140604, 161172, 203082, 276590, 201544, 173657, 166971, 300878, 296833, 214187, 162869, 91138, 45334, 101508, 22008, -59417, -84200, -110628, -53067, 17584, 81587, 136500, 136146, 46356, 13487, 1029, 39826, 86924, 23109, 24102, 94465, 166250, 45834, -57136, -52587, -127249, -34062, 31070, 55682, 116626, 161710, 98604, 19221, -58900, 10566, 139473, 55085, 83998, 124857, 129323, 104858, 124441]
19458A24441K1759L0244J23119j03286q2804j8924L0456o0190j75002l2192J21542
19447b0837q875n9255K2480l4364p1288R9685J05259R1107N8692k4174p6119j18997
19435c6686r0468j6652J18391P5319J939q315r1246o0788q1822Q3331J3323L1440
19423f2234L8914P087l9490p3575N2682J19607r9227l9507M8066K3844M7056L8448
19411F1671j15784N0335O0950K8684l3599p4477k4837J180p46J19538J38958q1055
19399A30818j74586K9226M8543N4389l0233n5509j00772j7830l9082J0866J20962
19388b3208k143Q5528Q1507L4949J1688M2808j01037J7388l6020J05506M3363
19377B60329J566j04389l4470J23323k7859q2333n5592m5500n3377O6676j3454
$$ y = [124441, 146200, 176444, 299563, 196277, 113473, 94549, 125005, 64815, -110187, -142379, -20837, -29712, -88967, -66487, -100851, -172139, -72454, 32805, 123912, 182604, 158430, 82311, -36686, -127154, -143806, -25415, 49904, 51843, 43528, -47718, -108506, -190328, -106997, -93674, -62234, -23320, -16233, -55723, -129298, -76616, 42991, -56236, -95743, -47677, -23833, 23223, 61671, -54113, -3778, 57172, 85856, 52257, -22220, -47057, -45877, -46623, 72915, 211873, 130818, -43768, -14542, 34001, 88390, 58157, 2648, -98124, -115954, -155036, -144170, -23208, -25351, 60177, 141684, 176633, 188321, 231129, 130092, 147480, 111460, 216966, 260329, 261895, 157506, 123036, 246359, 218500, 136167, 80575, 35075, -18302, 48374, 34920]
19366C4920O5303K2841J6808j0272l2321n3517j8544O1789l8061l6938l5902P3848
19354D9954O471p4234K7127N1394p6096p7913j7959M8751M3736k9564p6314k9882
19342a54529O3496P2039J079J0740J01235M9631l5082N2548L1083J5428J0926
19331B18594p284j4774l5703K439M6549k0813k8546k5425k00818n8769R5023j9165
19319d8692o9213K0307Q7443Q6338j04530k0776K3542M9067K7730K1537J9915
19308I2668K9939J9719p6786j12176O8866J8938R8040r3596q2358k4723J00876
19297C9407J60723l4575q1845j740k9609r6653m9962M6091Q938Q8558N0320L3550
19285A33203M3983N467j28564j3866j2052j5376q1717Q1524M0472j35679m6312
$$ y = [34920, 100223, 123064, 139872, 129600, 97279, 43762, 25218, 87007, 48946, 12008, -23894, 49954, 56425, -17809, 9318, 60712, -15384, -93297, -111256, -62505, -18769, -48333, -124647, -154529, -91033, -18994, -17915, -7175, 94060, 143691, 108609, 161157, 192240, 207668, 218594, 211310, 196536, 160833, 163272, 209821, 189008, 160462, 135037, -65781, -124550, -29527, -48692, -117905, -97598, -10155, 76183, -28347, -49123, -25581, 23486, 51216, 72753, 92668, 122607, 142326, 65540, -46636, 22230, 41168, 139208, 45612, -36746, -61469, 39407, 200130, 165555, 83710, 81970, 52361, -44292, -94254, -48163, -39225, 49333, 99653, 133203, 177186, 182653, 54089, 40223, 28171, 12795, -68922, 12602, 53074, -82605, -128917]
19274a28917N2007N050q8246O5855O9973K1038n0826r8811M152O9111J27241N4917
19262A02544m7330r5377m4271q7459P6115L6325n1217J7343R6049J14460K7472
19251A44654O3492j00082n8153j0594n7263p6343Q5688J02301R5875q1059j15521
19240g005n5290j1549R6672R3499l7922J9902n117j7219l1548O0028M947k0990
19228H8408r0747j26217r2357J13918J56565O9002P9403p6922j35433l4050j8069
19217f6499J16472j11057m8450R4433J37513p1278k8309R5444J00198J0895r2429
19206A36933r9906q467M3529J33089R0855o9937l2192N8014j69457j23776q495
19195d9810l7363K0121J04582R8019L9514l2830m4753k8721m1537M4577o9276
$$ y = [-128917, -76910, -71860, -160106, -94251, -24278, -3240, -54066, -152877, -148725, -79614, 47627, 102544, 55214, -40163, -84434, -171893, -95778, -59453, -110670, -93327, 2722, 117182, 144654, 208146, 108064, 49911, 39317, -17946, -94289, -8601, 93700, 189575, 108516, -7005, -62295, -73844, 22828, 116327, 78405, 98307, 93190, 75971, 44423, 104451, 109398, 88408, -2339, -128556, -220913, -106995, 49570, 118572, 197975, 121053, -14380, -48430, -66499, 49973, -61084, -109534, -15101, 122412, 51134, 22825, 118269, 218467, 229362, 136933, 37027, 28560, 72089, 205178, 296033, 226096, 193904, 251918, 82461, -41315, -49810, -87173, -67052, 37530, 135549, 175063, 142233, 97480, 68759, 27222, 71799, 2523]
19184B523k9767Q0463j2244j7661j7439K0529k4698K1816O0304l7658L9554K5575
19172A11297q2852r9710j0012J07585N19M3132k0977O3211j3924j24654N5822
19161B9437K5889r2742L0821J51785K8171k6919K351k0614L5673r1141j8493j9120
19149C5098j3348n073L6393L0176j09472p4936m893J46325m2616l0009L3124P5918
19137G6687M9876m723m3843R7479M0782n7101m7064M1196J2693j20702p2808J23395
19125I5867J8806j5983k7720N0116p6233j36040n1693k1882q6134N4491M1092
19114a55313J09734J2394J22231O3464q6597l9259P512r330o0125L1221L3894
19103B9826J33111j7170j12540L9911Q2805k1373j33012l517P9693m7027j1791
$$ y = [2523, -27244, 53219, 40975, 23314, 5875, 26404, 1706, 23522, 83826, 46168, 85722, 111297, 28445, -71265, -81277, 26308, 26827, 69959, 48982, 112193, 98269, -26385, 29437, 55326, -37416, -6595, 145190, 173361, 146442, 148793, 128179, 163852, 72711, 54218, 35098, 21750, 16677, 53070, 83246, -26226, -101162, -106055, 40270, -2346, -32355, 769, 76687, 126563, 121840, 77997, 175476, 216258, 159157, 112093, 153289, 165982, 45280, -27528, 95867, 114673, 98690, 70970, 121086, 44853, -91187, -142880, -164762, -250896, -196405, -155313, -45579, -33185, 89046, 152510, 65913, 26654, 34166, 24836, -35289, -4068, 29826, 162937, 145767, 33227, 73138, 155943, 134570, 1558, -1959, 77734, 30707, 18916]
19092A8916L5268P158n5325o7042L8565J1131o7036N5301J34082k6085J3294j10585
19080a2358l1588Q5573J1207J3218L9502K6562J1241N790n8126p1808J07019j7026
19068A09206j1693m3043J7424M139L8028j6817l0427n9771O4602L1861l6796n3367
19056A3346L6653J11901K753J8836K2084n7882J8126O4819K2219k3618n4958m1679
19044A32600k0676q5165p0931j8979K3020R9Q8709Q2220n0188M0884J6190j1423
19032A26360r3829r7493L7849m7372K4164M8808M9887J6420j04450j6103R6713
19021D0954J21505r8580J923N5881k6988j08138l7288m75N514J2564l5974j03315
19009a72417J5791n0217j3586M9223j9157R781N7456o8919n3546O3373J46376
$$ y = [18916, 54184, 61342, 6017, -61025, -22460, -11329, -78365, -23064, 111018, 84933, 98227, -12358, -43946, 41627, 52834, 66052, 105554, 132116, 143357, 149147, 91021, 19213, 126232, 109206, 97513, 54470, 71894, 76033, 114061, 97244, 66817, 7046, 71648, 103509, 66713, 13346, 49999, 161900, 164653, 183489, 205573, 147691, 165817, 230636, 252855, 229237, 174279, 132600, 111924, 26759, -44172, -63151, -40131, -40032, 48677, 130897, 80709, 121593, 137783, 126360, 32531, -64962, -27113, -74485, -50321, -1513, 48374, 64794, -39656, -55759, 40954, 162459, 63879, 65802, 121683, 94695, -13443, -50731, -51206, -45692, -33128, -69102, -172417, -156626, -206843, -220429, -171206, -190363, -180582, -123126, -192045, -245591, -182218, -35842]
18998c5842j3860o549N3259J37639R2469j6497q157J8622j5785j74799j32018
18987a01518L6775K5755Q9161K4034O159o8891L6314j5346l1876n3899M2794J6426
18975E888k7325o172K5313J00764K3949L766o1917j4314k1854M6266O5114L4225
18963A73703J01722K9359m5542n0354p8905oM1701j15767o094J2624K9817O85
18951I2943M1220L3827k6432p4819M2681o3972p5223N3132m7350L4987J0239J28767
18939A50000m0032N700n1040K5724O6216r9783r8344N4927j2138P9770J01878
18928A82878l5354j1233P1293N175Q074K917j38318n7198O2601P8615r2764m8780
18916B7906M1151N9178N862m6217j39750l3787N9230M3960or193q644L3658Q8646
$$ y = [-35842, -49702, -56251, -2992, 134647, 227116, 210619, 202462, 221084, 205299, 30500, -101518, -64743, -38988, 50173, 74207, 80366, 11475, 47789, 32443, 567, -53332, -10538, 5888, -21437, -27609, -2296, 98468, 122417, 126183, 64266, 49952, 28098, 74364, 139478, 173703, 275425, 304784, 259242, 208888, 129983, 129977, 171678, 55911, 49817, 62441, 92258, 92943, 134163, 167990, 141558, 66739, 109420, 45448, -29775, 23357, -23993, 10994, 21233, 150000, 109968, 115668, 64628, 90352, 156568, 56785, -41559, 13368, 1230, 81000, 182878, 147524, 136291, 207584, 212759, 220833, 223750, 85432, 28234, 90835, 169450, 76686, 27906, 69057, 128235, 134097, 87880, -51870, -85657, -26427, 17533, 17527, 8334, -310, 33348, 121994]
18903A21994j7130k3343r7653m830J05521J33566J8243r7971j05954M1324K1882
18892I5649m1951Q53J51239J5156J0140m5476K925m2232l4821R0141M0349K3954
18880B65926n2530J0243j684N6789o800j51563j9816J328k5222N561o1787K9315
18868D9760R3825J5405J8512p3450o13r9166j5107J1999J34335K2463k6105j21713
18856A0145p1471O8382Q5719N9893m7440k0523Q9275K6078j05398L5191j58540
18845b8689p5886J8965O8819m5308N8602J56196J01851N1598p8861p6925J36166
18834B86528J18376n6701r6649j11241L7905K6716O7463q4621k1747L7198q048
18823A95179j67113j39512O1509M426L1357P4240P4050L4243j28511q9149p742
$$ y = [121994, 104864, 81521, -16132, -20962, 84559, 218125, 236368, 138397, 32443, 73767, 95649, 53698, 54551, 205790, 220946, 231086, 185610, 188535, 146303, 111482, 201623, 241972, 265926, 213396, 223639, 221955, 278744, 271944, 120381, 100565, 101893, 76671, 82232, 20445, 49760, 143585, 158990, 177502, 104052, 103439, 4273, -10834, 1165, 135500, 157963, 131858, 10145, -61326, 7056, 92775, 152668, 105228, 84705, 173980, 200058, 94660, 129851, -28689, -104575, -85610, -16791, -62099, -3497, 152699, 254550, 306148, 227287, 150362, 286528, 404904, 348203, 251554, 140313, 178218, 204934, 272397, 187776, 166029, 203227, 195179, 28066, -111446, -49937, -45511, -14154, 60086, 134136, 168379, 39868, -49281, -57023]
18812e7023K1361M3973p011m0971J7848L0442K2554L6553r4662K651J4769L1052
18800B1536K4045L0844o0783k23K8046K30N60J31390M1242k6020k4351m1053J94
18787A25657n5804k0402M3446l2946K3345J1992n7584M7490O7155K1715l4727
18776A39337j12068j02927j4880J51190N0768j03408N2605L9647p1221k9214N349
18765E178J15933k2873M997J05371N0156j6399m9204L0546j31699j37449J4551
18754c0892J45669m1790k3451j9211P4008L7594q9273l2070j3064O6984M8060
18743A22564J3680n391l8074K6846n2670o1551J828L6665n782J4325M583J29969
18731A86992k8039j63645o7133J22549K4001l5254L8240J04130J03215j07904
$$ y = [-57023, -35662, 8311, 1300, -39671, -21823, 8619, 31173, 67726, -26936, -24285, -9516, 21536, 45581, 76425, 15642, 15419, 43465, 43695, 44255, 175645, 216887, 190867, 166516, 125463, 125657, 69853, 49451, 92897, 59951, 83296, 95288, 37704, 85194, 152349, 174064, 139337, 27269, -75658, -90538, 60652, 111420, 8012, 60617, 100264, 29043, -171, 5178, 121111, 98238, 103235, 208606, 258762, 242363, 193159, 223705, 92006, -45443, -30892, 114777, 72987, 49536, 30325, 104333, 141927, 52654, 20584, 7520, 74504, 122564, 136244, 130853, 92779, 119625, 66955, 5404, 7232, 43897, 38115, 52440, 57023, 186992, 158953, -4692, -71825, 50724, 74725, 39471, 77711, 181841, 285056, 177152]
18721A77152k9412n8774j02501p6025R75L174M1967Q8386Q9492O6522n8904q3719
18709E8333j6594N386k4454R597K4313N2657l0977j8193N6161M5989l5889o8714
18697E7615L4659L5148k5041N0434R7822r2727j3763j6321o12J7858j26175n2535
18685c3638M0900q1034N9162N8972J47488J41402O795L126r7291m8979q0949p1830
18673D4124J8235o798m618j67385K7724R0514L4487m0235l7417l6006P0895J23271
18661A16791p9072l2147L0436n527k7952O3905Q9990m3674m296j49892k0896J44734
18649H2400J42858j19963j8907j435l4854l3669Q134J48257j55j13678J8247K9879
18637A07114K904J245J50800J03653k9516j9747l0653p3691L6765j9396j1315
$$ y = [177152, 147740, 88966, -13535, -89560, -88585, -85411, -43444, 44942, 134434, 200956, 142052, 58333, 41739, 47125, 22671, 32268, 56581, 109238, 78261, 60068, 116229, 162218, 126329, 57615, 92274, 127422, 102381, 152815, 250637, 157910, 144147, 127826, 127214, 145072, 18897, -33638, 7262, -73772, -14610, 44362, 191850, 333252, 340047, 343173, 245882, 196903, 115954, 44124, 62359, 55561, 50943, -116442, -88718, 1796, 36283, -3952, -41369, -77375, -6480, 116791, 37719, 5572, 36008, 30481, 2529, 66434, 156424, 112750, 108454, -41438, -62334, 82400, 225258, 105295, 86388, 84953, 50099, 16430, 24564, 172821, 172666, 58988, 77235, 107114, 110018, 111263, 262063, 365716, 336200, 316453, 285800, 212109, 248874, 229478, 218163]
18626B18163n3559J3267K719p14j2100J1164M008J6911j47587n2684P1546r2560
18614b1426j00679o0997M7322O8247L4550P9202K8881l574m3697o5941N9891J7661
18602C9440Q5494Q5812k5038n3607q4677n1868l3766Q3917M5154J7646r1113R8789
18590A16183M7418J01240L7057j3914p7737m8546q556J0263o2952o2176P6081
18579A14361K7878L3766O7674l4418m7050j07819N8641M1183k5080m5799r196
18568G4141K5665J753M4435R5364O8072j16651r6571r5157l0670M4035K9384M4615
18556H8415Q266n2035m2628j614l3800Q9942K275o7506p7217J1216Q5186J04203
18544A14703K4461R117N1252N9808m944k8347j6119j22790O3514M790j24217j3836
$$ y = [218163, 164604, 177871, 180590, 179876, 167776, 178940, 182948, 199859, 52272, -412, 71134, -21426, -122105, -183102, -135780, -67533, -32983, 46219, 75100, 71526, 27829, -38112, 21779, 39440, 124934, 210746, 185708, 132101, 47424, -4444, -38210, 45707, 90861, 108507, 17394, 116183, 163601, 264841, 301898, 287984, 210247, 161701, 153145, 163408, 100456, 38280, 114361, 142239, 176005, 243679, 209261, 162211, 54392, 113033, 154216, 129136, 83337, 74141, 99806, 101559, 145994, 241358, 309430, 192779, 96208, 1051, -29619, 14416, 43800, 88415, 96681, 44646, 2018, 404, -33396, 56546, 58821, -8685, -85902, -74686, 10500, 114703, 139164, 148281, 199533, 259341, 254397, 226050, 209931, 87141, 150655, 155445, 31228, 17392]
18532A7392N3251J4429m6972K5482J31427O8349m6645n7407n7832n9970J12050
18521A53554Q7738m0026O7745k1493j68581k6219J3656J25320O4417K8830M1612
18510C26553o7014q6826p7968J6236L3469q1042l9778L6284j1713Q6412Q0652
18499B15265o0004k0946J5272L9346k7496O1952P2028j1485j01280p2752k5956
18488H3944K8837K8446N0046K2276j6610q817P9550o7793J884R447L3159Q800
18476B53169j09466j7843O5119L4075j7537j64996l1840N9429l7262M8288Q689
18465H9825m150Q6430P895l3519j23288J22326N3597L5014O646p5674J3023k7256
18453A50869J5515L6046o9120m2775L9680n958J21417L6318j54719j8903r4242
$$ y = [17392, 70643, 85072, 38100, 63582, 195009, 263358, 216713, 159306, 101474, 41504, 153554, 241292, 201266, 269011, 247518, 78937, 52718, 66374, 191694, 256111, 284941, 326553, 259539, 172713, 94745, 110981, 144450, 63408, 23630, 59914, 48201, 134613, 215265, 155261, 134315, 149587, 188933, 161437, 223389, 295417, 283932, 182652, 109900, 83944, 112781, 141227, 191273, 213549, 196939, 188122, 267672, 199879, 201763, 211210, 244369, 253169, 143703, 125860, 190979, 225054, 207517, 42521, 10681, 70110, 32848, 81136, 89825, 85675, 172105, 180000, 146481, 23193, 145519, 199116, 234130, 240776, 165102, 178125, 150869, 166384, 202430, 133310, 90535, 130215, 124257, 245674, 281992, 127273, 108370, 14128]
18442A4128m974j9262M4372J1412j14625L2440O1622l8041K934P9684k4366j0008
18430C5316Q8177k7589K9713M6958Q270J4946l7060q1890j6636M0304n9181n3787
18418a2459L3993m2597k382R34J08392J74646K8650l5100j55703k9987J32511
18407B00898R6519K2098r0862k0484N0763J6418j72632P5340P8583j0324N9949
18396C06266J1031j9077J4325J4834L2744k1907K7854o3304R6277J83881m1788
18385E41136m6249n84J3219j36010j24607j67826J01444J53933N929m5144k1444
18374B73797N8499J27706J2667l6790J48980J05099r2077q9636n3096l4797J23
18363D20475j2419q1344o997K0128l2887L1950J55076J27333M4025n8261j21356
$$ y = [14128, 9154, -10108, 34264, 45676, -68949, -36509, 25113, -12928, -9994, 69690, 45324, 35316, 123493, 95904, 125617, 172575, 180845, 195791, 158731, 76841, 60205, 100509, 41328, -12459, 21534, -21063, -23445, -22511, 85881, 260527, 289177, 254077, 98374, 68387, 200898, 297417, 319515, 228653, 208169, 258932, 275350, 102718, 178058, 256641, 246317, 306266, 317297, 298220, 312545, 327379, 360123, 338216, 366070, 302766, 399043, 582924, 541136, 494887, 494303, 507522, 371512, 246905, 79079, 180523, 334456, 340385, 295241, 273797, 332296, 460002, 472669, 435879, 584859, 689958, 597881, 508245, 455149, 420352, 420475, 408056, 326712, 319715, 339843, 306956, 338906, 493982, 621315, 665340, 607079, 485723]
18352D85723J8291K2826j6113o503J8120r4556k4446O128O5581L9266o9488N5379
18340E00208J16819J9846n3535R8993k0549m3090J4909J42059L1564J7219N3378
18329H77821K4520Q1115M1317P6606o0878r3085q8496l8753J7117N9190o9302
18318H27172j50749j95525j4504J28433R51l7420o4055p3560J7566n8414j5166
18307C64729O744J0717j02129J12091J61613N7059Q0940q859M8482O7291O2598
18296H61276J19446J23554J09214M3874L8327K3920K4141R4700k2644n9540J07967
18285A464235L622m0159n8097k6363l6726O2133m1307p9464m1555q9696P6301
18274A192924J00680L7959p2170r9027P479K7858j6830p1570j33727l0895J506
$$ y = [485723, 504014, 526840, 510727, 504224, 522344, 427788, 403342, 409470, 475051, 514317, 444829, 500208, 617027, 636873, 583338, 682331, 661782, 618692, 633601, 775660, 807224, 824443, 877821, 902341, 983456, 1024773, 1101379, 1040501, 947416, 858920, 820167, 837284, 896474, 827172, 676423, 480898, 466394, 594827, 595778, 558358, 494303, 420743, 438309, 379895, 364729, 371473, 382190, 280061, 392152, 553765, 610824, 691764, 682905, 731387, 798678, 861276, 980722, 1104276, 1213490, 1257364, 1295691, 1319611, 1343752, 1438452, 1415808, 1356268, 1464235, 1467857, 1427698, 1369601, 1343238, 1306512, 1368645, 1327338, 1247874, 1206319, 1116623, 1192924, 1293604, 1331563, 1259393, 1160366, 1167845, 1195703, 1178873, 1107303, 973576, 942681, 944187]
18263I44187p3115K5868Q1149N144R8106J3307p1583L1020L3931l7318j03984
18252I46712R2356J21753P7539o2650J0929J97922N9441j29123q4175J5241k6612
18241A219333J0391n1518m1658J1709k3082O70J5731L2841l5972l4650j08663
18230I95132n9094J8866M9829O1874o0117j7573J1981o8694P535l4720K1531J58413
18218A084963K6955J6313j31648k4799J58409P0425q354n0169q6686K028l386
18207A054051j7635k97139r9831J34519Q0818M4811l7446r7393p3006p0566L9066
18196F60249j06415l5093M555n3k230Q2069o6120j04653o076N5755P4429j16918
18184D39499p9024Q295L8648N2558N0705m992k1212k412m4247K678M6544Q089
$$ y = [944187, 871072, 896940, 978089, 983233, 1081339, 1094646, 1023063, 1054083, 1088014, 1050696, 946712, 1039068, 1160821, 1238360, 1175710, 1186639, 1384561, 1444002, 1314879, 1230704, 1245945, 1219333, 1229724, 1178206, 1136548, 1148257, 1125175, 1125845, 1141576, 1174417, 1138445, 1103795, 995132, 936038, 954904, 1004733, 1066607, 1006490, 988917, 1000898, 932204, 939739, 905019, 926550, 1084963, 1111918, 1128231, 996583, 971784, 1130193, 1200618, 1192264, 1142095, 1055409, 1057437, 1054051, 1036416, 739277, 639446, 773965, 854783, 899594, 862148, 764755, 691749, 621183, 660249, 553834, 518741, 523296, 523243, 521013, 603082, 536962, 432309, 426233, 481988, 556417, 439499, 360475, 368770, 407418, 459976, 510681, 505689, 484477, 482065, 437818, 440496, 487040, 495129]
18172D95129j9896p8840p3906R4344R1103M8384M5329r0224q9826J27167J86625
18161G35389m1089j08871O0862k8802j4446M870o07K468P2292J2329J60581L3790
18149H88766p2839p0760l1142o6996o8425L6865M5410j4811k9585l4947n1332
18138E30204K5612J37528l7839p6884j06234M7897M4959j0218R2p6402k503R8228
18126E74440O4543p9771k1753N5007J1009r228M2422k7193k7978L0072J01553
18115G13123L9016Q9609j6097M5684L3888m0949m7821n5591K4602n03K8661o7947
18103G45675N9122K6595m1235J9166K268j5084m261o2132l6674n8241L0425l5025
18091F30599J9450J3907Q2536Q067J435r1412n1436o5791j0668L3887J33961J60801
$$ y = [495129, 475233, 396393, 322487, 416831, 507934, 556318, 601647, 511423, 421597, 548764, 735389, 694300, 585429, 646291, 617489, 603043, 607913, 607306, 609774, 682066, 694395, 854976, 888766, 815927, 745167, 714025, 647029, 578604, 615469, 660879, 646068, 616483, 581536, 530204, 555816, 693344, 655505, 578621, 472387, 520284, 565243, 555025, 555117, 478715, 476212, 574440, 638983, 559212, 537459, 592466, 603475, 594247, 636669, 609476, 581498, 611570, 713123, 752139, 841748, 825651, 871335, 905223, 864274, 816453, 760862, 785464, 784961, 813622, 745675, 804797, 831392, 790157, 809323, 811591, 796507, 792246, 730114, 693440, 635199, 665624, 630599, 650049, 663956, 746492, 754559, 755994, 664582, 613146, 547355, 536687, 570574, 704535, 865336]
18079H65336J04121J55379R1610M562l8357j09122j36228p3009p442l8138J1884
18068H30596p359m3418J63909J52721J37475J82171l5897q8856k2588q30j62794
18057A105130k2360k2226l290l3659j18641j14581j9086r5296m1585p746j43557
18046D83103k6868J66875J35753j5332l5918k5654l1305L3369k1764k2372O9047
18035G08934R6367n6696j08746J19775J07964l3146K2707J24008J304J5246O9715
18024A067432j3694n4253L7324J1994p7474M8001J24372J3019J59347J16463p2089
18013A360442k1667P1430J6250k0745m2998l2441J14656Q2887K6144J0811J62766
18002A727535J71356J66506N2978j7374n2905o2122O2625R065j5729j2720p3278
$$ y = [865336, 969457, 1124836, 1216446, 1221008, 1182651, 1073529, 937301, 864292, 856850, 818712, 830596, 823237, 779819, 943728, 1096449, 1233924, 1416095, 1380198, 1291342, 1268754, 1267924, 1105130, 1082770, 1060544, 1057254, 1023595, 904954, 790373, 771287, 675991, 634406, 626660, 483103, 456235, 623110, 758863, 743531, 707613, 681959, 650654, 684023, 662259, 639887, 708934, 805301, 748605, 639859, 759634, 867598, 834452, 857159, 981167, 982471, 997717, 1067432, 1053738, 999485, 1036809, 1048803, 971329, 1019330, 1143702, 1156721, 1316068, 1432531, 1360442, 1338775, 1410205, 1426455, 1405710, 1362712, 1330271, 1444927, 1527814, 1553958, 1564769, 1727535, 1898891, 2065397, 2118375, 2101001, 2048096, 1985974, 2048599, 2057664, 2041935, 2029215, 1955937]
17991A955937l0338J3862m5611n383J04102K0132J11092L5040j3854m0622K4867
17980B129224M2836k8034q625O9686K4865j32248k11733j10464o0509j61942n7350
17969A495706J50936J39407J12421P4126L15o4344o2222j6429n5209O2650O6357
17958A903714J13531N7271P3556J5941l932J52859J21941L2952J10699M7282L6138
17947B661952Q3771L3256M4657K28761J66556q163q119L1227O6530K4542O1699
17936C386669r00p6774Q363P0987Q4448n0265j02743M8787j70900k54334j30535
17925B812803m1121n0114K5302k1949n8107Q8061J53476J63363O9378J13292R9581
17914C353965J04439J48160J92325J32156N9493J36360J67539J59075K17687K15694
$$ y = [1955937, 1925599, 1939461, 1893850, 1888467, 1992569, 2012701, 2123793, 2158833, 2144979, 2104357, 2129224, 2172060, 2144026, 2135401, 2205087, 2229952, 2097704, 1885971, 1775507, 1714998, 1553056, 1495706, 1646642, 1786049, 1898470, 1972596, 1972911, 1908567, 1846345, 1829916, 1774707, 1837357, 1903714, 2017245, 2074516, 2148072, 2164013, 2160081, 2312940, 2434881, 2467833, 2578532, 2625814, 2661952, 2745723, 2778979, 2823636, 3052397, 3218953, 3210790, 3202671, 3233898, 3300428, 3324970, 3386669, 3385769, 3308995, 3317358, 3388345, 3472793, 3422528, 3319785, 3368572, 3197672, 2943338, 2812803, 2771682, 2721568, 2746870, 2724921, 2666814, 2754875, 2908351, 3071714, 3141092, 3254384, 3353965, 3458404, 3606564, 3798889, 3931045, 3990538, 4126898, 4294437, 4453512, 4671199, 4886893]
17904D886893J83869J06658L09062M72155M40610M23409M74259P80399J157974
17895I235288J322311J699615K461134L632278M720501N585191O124269O621169
17887D1401756P294060O861388M064355J48984k462642k502118q59426Q59640
17879E4805997J849056K466329L422053M920936N659365L370029j776891o116111
17871F8600763p924520p661850p117315o781218o107945n025179l895972k741106
17863B1345658j910055j385874r72538p41599n97262n56455m29939l15487p8728
17854A4357721J88680M14642O82323R39399J348599K129931K862354L885089N328625
17845C2137363O665079P702552Q924143J0370005J2114948J2374453R301296N379847
$$ y = [4886893, 5070762, 5177420, 5486482, 5958637, 6399247, 6822656, 7296915, 8077314, 9235288, 10557599, 12257214, 14718348, 18350626, 23071127, 28656318, 34780587, 41401756, 48695816, 55557204, 59621559, 59770543, 57307901, 54805783, 53946357, 54805997, 56655053, 59121382, 62543435, 67464371, 73123736, 76493765, 74716874, 68600763, 60676243, 53014393, 45897078, 39115860, 33007915, 27982736, 24086764, 21345658, 19435603, 18049729, 17077191, 16335592, 15738330, 15181875, 14751936, 14436449, 14357721, 14546401, 14961043, 15643366, 16582765, 17931364, 20061295, 22923649, 26808738, 32137363, 38802442, 46504994, 55429137, 65799142, 77914090, 90288543, 99589839, 104969686]
17837A04969686L387208M596854O151713N125815K899000K087325L791046P332807
17829A40341454J0620857J0804342O834403K318966n13333l684693r347255j5126262
17821A42248479j7765036j6875429j4738857j2855804j0824173q139620n167705
17814E5881855k178157M54970K741617M776363O198389P410946Q794763J0574075
17806I4654821J2229112J2120836R420539O444655N505452N506918L832776M28032
17798A50143141k233451j783315J410586N278852P359149O192716L180196J418128
17790A70966002K46743k990475p792051j0651104r766592o577507l376314j022409
17782A29036293M49412K353248N634312Q396705O338673j490305r762510j4573012
$$ y = [104969686, 108356894, 112953748, 119105461, 124231276, 127130276, 129217601, 133008647, 140341454, 150962311, 161766653, 168601056, 170920022, 170406689, 166721996, 157374741, 142248479, 124483443, 107608014, 92869157, 80013353, 69189180, 61049560, 55881855, 53703698, 54158668, 56900285, 61676648, 67875037, 75285983, 84080746, 94654821, 106883933, 119004769, 128425308, 134869963, 140375415, 145882333, 149715109, 150143141, 147909690, 146126375, 147536961, 152815813, 160174962, 166367678, 169547874, 170966002, 171212745, 168222270, 160430219, 149779115, 140012523, 133435016, 130058702, 129036293, 129485705, 131838953, 137473265, 145869970, 152208643, 150718338, 140955828, 126382816]
17774A26382816j4790907j3677074j2798821j1548520r189459o472870l357452
17767E4547713n80131K100338M707758O857240Q522120R722286J1745487J4708172
17759A12330983J7377693J7092265J2726202P616702O300284Q097027P262656
17752A88803812N77193p464335j1148215q959399m307458j185414j406789m831147
17744A50078248q337326r437921r170655r310870j0249964j1096292j1083328
17737H1391892j0311442r481468q599336p888155o855486n751076m657860l539074
17729B4307995k800856k273662j871876j622884j421749j140542j029621r37848
17721A1208957q34081p11758o90475p21179n40836n03614n39668m70262l17259
$$ y = [126382816, 111591909, 97914835, 85116014, 73567494, 64378035, 57905165, 54547713, 53967582, 56067920, 60775678, 67632918, 76155038, 85877324, 97622811, 112330983, 129708676, 146800941, 159527143, 167143845, 173444129, 181541156, 188803812, 189381005, 181916670, 170768455, 161809056, 157501598, 156316184, 154909395, 150078248, 141740922, 132303001, 123132346, 113821476, 103571512, 92475220, 81391892, 71080450, 61598982, 52999646, 45111491, 38256005, 32504929, 27847069, 24307995, 21507139, 19233477, 17361601, 15738717, 14316968, 13176426, 12146805, 11208957, 10374876, 9663118, 8972643, 8251464, 7710628, 7207014, 6667346, 6197084, 5879825]
17712E879825l03750l23989m90208l86558k32843k06319j20790k82961j85495
17703C346912r8803j26043j03362k05877k11567j26574r337p7675p3116o872j14234
17692B193452j69540k32820j53543j05956P2410m0724j82330m9708q2600j44505
17682A104136j47050j09435K1996j760j03444j29755R1258M0207r5612o688k3340
17671F40513M6695J3358j57816j43422K4175m2924K7597m4535j6079J20901L2324
17660E00787R3468K2255m378M658n3995m5666J1217N0805m2337j33341j3112r9466
17648B90895j18423r5232l2727m7246K7550m9254p5583P378k7343J2717J596J8012
17636h7660O510P9648O538L2033L8967J0711O8989N0542L3381J25506J28234l1884
$$ y = [5879825, 5576075, 5252086, 4761878, 4375320, 4142477, 3936158, 3815368, 3532407, 3346912, 3248109, 3122066, 3018704, 2812827, 2601260, 2474686, 2465349, 2387674, 2314558, 2307686, 2193452, 2023912, 1791092, 1637549, 1531593, 1604003, 1563279, 1380949, 1331241, 1248641, 1104136, 957086, 847651, 869647, 867887, 764443, 634688, 725946, 766153, 670541, 663853, 640513, 687208, 700566, 542750, 399328, 423503, 380579, 408176, 363641, 347562, 468463, 500787, 594255, 616510, 612132, 616790, 562795, 517129, 528346, 579151, 536814, 403473, 390361, 290895, 172472, 77240, 44513, -2733, 24817, -24437, -100020, -92642, -119985, -107268, -105672, -87660, -81150, -1502, 5036, 37069, 76036, 86747, 155736, 206278, 239659, 365165, 493399, 461515]
17624D61515j06156m9382j9525n5857J05715O8567J22816O2033J1088n5709n4618
17613D90487P0249Q8845J2040k1500n1229j0999o2338R6501J94264J27969O2635
17602I96924j9888O4443J9525p9329N957J30748O1032j3450J10243Q3113L8735
17591A398053P7860K7911r5732P7324R6137n7369n5613k4516k0886m5306K9601
17580A407464Q4891l3476r8826r7565p6026O3649O8735J06170J55500j7578q4874
17569A478064r3449m1261o82n4598N0373K218Q8757jP3983N0699j3406J2414Q5083
17556A638194r033K3008L4268J05813J27718P5182P3573N7604n65L1562K7816
17545B185140J4610J19600j9219P6304Q6668j15467j56660k19976m3471R3419
$$ y = [461515, 355359, 305977, 286452, 230595, 336310, 404877, 527693, 589726, 600814, 545105, 490487, 560736, 649581, 661621, 640121, 588892, 577893, 515555, 612056, 806320, 934289, 996924, 977036, 1041479, 1061004, 981675, 987632, 1118380, 1179412, 1165962, 1276205, 1359318, 1398053, 1475913, 1503824, 1408092, 1485416, 1581553, 1524184, 1468571, 1444055, 1423169, 1377863, 1407464, 1492355, 1458879, 1360053, 1262488, 1186462, 1250111, 1318846, 1425016, 1580516, 1562938, 1478064, 1384615, 1343354, 1342672, 1288074, 1338447, 1340665, 1429422, 1429421, 1503404, 1554103, 1540697, 1553111, 1638194, 1629161, 1652169, 1686437, 1792250, 1919968, 1995150, 2068723, 2126327, 2125762, 2157324, 2185140, 2199750, 2319350, 2300131, 2376435, 2463103, 2347636, 2190976, 1971000, 1927529, 2020948]
17535B020948L6799q194o0830L4881Q0382L5718p2015k7482K7007p6594j24269
17524A866351j00851K1905N2413R5279m207r1236j0810J54895Q0435j1576Q29
17513B053427K13088J95930k6579J03301P8719J2057J6101P265O3461J0666J64921
17502B892357K32967j7251M5498K03796K74758L71008L32787K61971K20310O7038
17492D885239j28666l674K46602L13330L29059L56498M10989M87048N11404M73464
17482G881293P81358J017603J453009K022733K565044L471801N005634P277662
17474C1476137J0829503J5474735K0098625K1545090J5291536L128462o910163
17467A10933925r279532l250358P091985J7187292K2071651J5141550l078260
$$ y = [2020948, 2057747, 2049553, 1988723, 2023604, 2103986, 2139704, 2067689, 2040207, 2067214, 1990620, 1866351, 1765500, 1787405, 1839818, 1935097, 1930890, 1839654, 1828844, 1983739, 2064174, 2052598, 2053427, 2266515, 2462445, 2435866, 2539167, 2617886, 2629943, 2646044, 2653309, 2716770, 2727436, 2892357, 3125324, 3108073, 3153571, 3357367, 3632125, 4003133, 4335920, 4597891, 4818201, 4885239, 4756573, 4752899, 4999501, 5312831, 5641890, 5998388, 6409377, 6896425, 7407829, 7881293, 8662651, 9680254, 11133263, 13155996, 15721040, 19192841, 24198475, 31476137, 42305640, 57780375, 77879000, 99424090, 114715626, 117844088, 110933925, 101654393, 98404035, 105496020, 122683312, 144754963, 159896513, 156818253]
17460A56818253k0697613k8900520k6309560j9401074j3215145q966864o053453
17453C3274024m199750k962099k118810j731029j524307j226937j054549o47611
17445A7808932m78383m59184k89992L7459L7501J90422M31335N86548P76582J051617
17435A9692837J425590J837304K444312L527765M817334O766121R623919J4050979
17427F4186161J9936158K6231358K8642372K1553917P401684m959104p950662
17420A55041884m04937J3003483K6493828L3793540L0582628J7032096l746845
17413B71795677j9981019k3762723j4984827N2691J3367473J9022308J7295190
17406B62804770J2307480N930413l244750j2823743j8185056j7721359j5697155
$$ y = [156818253, 136120640, 107220120, 80910560, 61509486, 48294341, 39327477, 33274024, 29074274, 26112175, 23993365, 22262336, 20738029, 19511092, 18456543, 17808932, 17330549, 16871365, 16581373, 16618832, 16656333, 16846755, 17278090, 17864638, 18641220, 19692837, 21118427, 22955731, 25400043, 28927808, 33745142, 40511263, 50135182, 64186161, 84122319, 110353677, 138996049, 160549966, 167951650, 162992546, 155041884, 154636947, 167640430, 194134258, 227927798, 258510426, 275542522, 271795677, 251814658, 228051935, 213067108, 213119799, 226487272, 245509580, 262804770, 275112250, 281042663, 277797913, 264974170, 246789114, 229067755, 213370600]
17399B13370600j6286700j7576931j7618057j6747364j7265735j7983640j7503428
17392I2388745j5390174j2459103r589024p026963n048671l875430k704270j633239
17384C4661871o53741N80213K110004M046737O558304R904468J2565244J1614230
17376H1387330N418171k065253n869214l942438J985940R014397J4349259J3811236
17368A14089428M922528p084310j4856534j5194447j0232596m170475J865763
17361F9339357Q304695J5125061K1677665K6775771K6671817K1062008J2783563
17354B01739937K324967o802440j0852579r398117n363028m342483o165988r178463
17346A51961806j2912341j6842284j9492558j9443386j6826642j3408483j0142415
$$ y = [213370600, 197083900, 179506969, 161888912, 145141548, 127875813, 109892173, 92388745, 76998571, 64539468, 54950444, 47923481, 42874810, 38999380, 36295110, 34661871, 34008130, 34588343, 36698347, 40745084, 47303388, 57207856, 69773100, 81387330, 86805501, 84740248, 78871034, 74928596, 76914536, 85928933, 100278192, 114089428, 119011956, 111927646, 97071112, 81876665, 71644069, 67473594, 69339357, 77644052, 92769113, 114446778, 141222549, 167894366, 188956374, 201739937, 204064904, 197262464, 186409885, 177011768, 171648740, 167306257, 161140269, 151961806, 139049465, 122207181, 102714623, 83271237, 66444595, 53036112, 42893697]
17339D2893697p448069n578548m157731l267107k564331k248347j833879j561161
17331A4234524j320447j136532r74323q85173o83961o68243m99795m62579m38942
17322G164529l09782m23059l63712l47930k46495j72068o5136o5087j67685k81767
17312D721808k14931m00435l73550l51240k69141k28658j11598K9879L9770r250
17302B832654j2000K4034L3561m0392k18262j02539j32768m6023J4892J9025j52235
17291B219947j01343j40269j81206q8648R5276q8368j96285k13790j49603j19576
17281A036135l1332j74835r4644l6916l3067r8521j31427J5919m3054l1739l3727
17270C42792l3593l0661r4792J7946K3477J9384M381j17400p5096q6572k6433
$$ y = [42893697, 35445628, 29867080, 25709349, 22442242, 19877911, 17629564, 15795685, 14234524, 12914077, 11777545, 10803222, 9918049, 9234088, 8565845, 8066050, 7603471, 7164529, 6854747, 6431688, 6067976, 5720046, 5473551, 5301483, 5236347, 5171260, 5003575, 4721808, 4506877, 4106442, 3732892, 3381652, 3112511, 2883853, 2772255, 2802134, 2841904, 2832654, 2820654, 2844688, 2878249, 2837857, 2619595, 2517056, 2384288, 2338265, 2353157, 2372182, 2219947, 2118604, 1978335, 1797129, 1708481, 1803757, 1715389, 1519104, 1305314, 1155711, 1036135, 1004803, 829968, 735324, 698408, 665341, 566820, 435393, 451312, 408258, 376519, 342792, 309199, 278538, 183746, 201692, 225169, 244553, 248934, 131534, 56438, -30134, -56567]
17259e6567K3525n996M8182R5177l194n6002K297m7386j8779J8701L2777n9138
17247b6403r2627l7545J471m1046J4605R3311k4296l7509N8027l3386j05716N7966
17235a73148o8101o7275r3805l0977J41100K3062o4726m7751j13158o8303o3440
17224f26522k615L6505O476j03341J4252N1797m8030M1611J7075K2155O7641j07075
17212f30071o0426l3088O4420J06363J67421M1679o6335L8224J01052L1354M0273
17201a99134j43464j57275l7821k8684j6672J8915j115P4099M5399m6890m8701
17190e41343l0035P4850l317P6915J43187P2049K6765k8010N008j4695o7032j5465
17178c01123l2220J29259Q8015K0727k6409M8887l8362n5505j1724o1586p6636
$$ y = [-56567, -33042, -39038, 9144, 104321, 101127, 45125, 47422, 36, -18743, -42, 32735, -26403, -119030, -156575, -155104, -196150, -181545, -88234, -112530, -150039, -92012, -125398, -231114, -173148, -241249, -308524, -402329, -433306, -292206, -269144, -333870, -381621, -494779, -563082, -626522, -629137, -592632, -586156, -689497, -675245, -623448, -671478, -629867, -612792, -590637, -522996, -630071, -690497, -723585, -659165, -552802, -385381, -343702, -410037, -371813, -270761, -239407, -199134, -342598, -499873, -537694, -566378, -583050, -564135, -565250, -491151, -445752, -492642, -541343, -571378, -496528, -499845, -422930, -279743, -207694, -180929, -208939, -203931, -218626, -285658, -301123, -333343, -204084, -116069, -95342, -121751, -72864, -111226, -166731, -178455, -240041, -316677]
17167c16677n8447p5852J3963O5496l585O7988j3603P4745K2904L1209Q9181O7316
17155c5362P4326L7913r0342J8221j3999J5198N2762j1439n8869J32523J17618
17144B38550j01000l5284k4576L2187j24400o2896N1924j6462k1418L6302M8581
17133B1508K7782j4233K7072j00839q7728l7426R920R4066J01508n3812L1821
17122A9639p396M0108O6300o384K2400N8107J06796l6337n2639k6126M8070j0720
17110B21818q3079J1942p402n8583j6172K3932M0139l4971q9270N790o7428N8572
17098E288L2707N3917m2069k5517Q678n0922o514Q0876K395m1201O444o936p4479
17085e7333k7176q0263M3451L8453N3293l9808q8022J16182q3638n4327L0921
$$ y = [-316677, -375124, -450976, -437013, -371517, -375102, -307114, -320717, -245972, -223068, -191859, -102678, -35362, 38964, 76877, -13465, 4756, -9243, 5955, 58717, 47278, -11591, 120932, 238550, 137550, 102266, 77690, 109877, -14523, -77419, -25495, -41957, -63375, -27073, 21508, 49290, 35057, 62129, -38710, -126438, -163864, -153944, -59878, 41630, -12182, 19639, 12243, 52351, 118651, 112267, 134667, 192774, 299570, 263233, 210594, 184468, 232538, 221818, 138739, 150681, 143279, 84696, 68524, 92456, 132595, 97624, 8354, 14144, -53284, 5288, 37995, 91912, 49843, 24326, 33004, -17918, -24432, 56444, 58839, 17638, 24082, 17146, -57333, -84509, -164772, -121321, -82868, -29575, -69383, -157405, -41223, -124861, -179188, -148267]
17074a48267L5696n920Q0290K0449m9598m7063J39981O6506n2884n1054M8656
17063C6792J03384O3029p2964p0803j17612M2104M913j25686o8483m2981p7626
17052c25933R5323J03924K6447K1163P6108P6304r689K4227j40630k5365M671
17041g3450J8167M9940q2732m4831j3343o7901J42397L3988r2306N2259M7211
17030c0601o7197o2038j9344J09215l2510j28676o9659j3631P0942P7986K061
17019a63452m2738J0177Q5299k9584q9122m8531N0134N4533Q072l4859K0184n0833
17007b30720J70512j6959k6388J0654k0925m8387R0975J44559o691q1538k5971
16996d0879p9970l0848N9971j9964N6817J0967l0232J7255J4720m4359l5584J897
$$ y = [-148267, -112571, -118491, -38201, -17752, -67350, -114413, 25568, 92074, 39190, -11864, 36792, 140176, 203205, 130241, 59438, -58174, -16070, -11157, -136843, -205326, -248307, -325933, -230610, -126686, -100239, -79076, -2968, 73336, 63647, 87874, -52756, -78121, -73450, -55283, -5343, -88075, -132906, -146249, -214150, -71753, -37765, -130071, -77812, -30601, -97798, -159836, -179180, -69965, -102475, -231151, -300810, -314441, -243499, -165513, -163452, -206190, -196013, -110714, -140298, -229420, -277951, -227817, -173284, -165212, -200071, -179887, -230720, -60208, -77167, -103555, -92901, -113826, -162213, -71238, 73321, 66630, -14908, -40879, -120849, -151697, -91726, -111690, -54873, -43906, -74138, -56883, -42163, -86522, -122106, -120209]
16984a20209O0052M2515r517m1403p780j07006m4229K888j9856k8127j8025n1278
16972c41975R1341J23972p6167m14M6048N5224j356J21092R8919N5242P8445N2600
16960C02971P6786N397n329j03943l2562L3004L7607J707m0791M2699k3196m3130
16948B51220r3629p0256j8434J9946l8509j15855r7832J8384M5135r7830m9176
16937b46836Q8056J6391J8191l1154J03589L438J04867L589Q369l5881L3832Q9945
16925A56396k6939M3241J6904p587J29199J16416O5661J98165R7649N5709O406
16914H51220J20446L9129p7802j03588m0912R9823O4047O6933J36806Q1806o0794
16903A177114J6158K2551N3671m1862r1790p036L0123L5725j6742n9834r5991
$$ y = [-120209, -60157, -17642, -27159, -68562, -76342, -183348, -227577, -224689, -244545, -272672, -290697, -341975, -250634, -126662, -202829, -203243, -157195, -101971, -103327, 17765, 116684, 171926, 250371, 302971, 379757, 385154, 379825, 275882, 243320, 276324, 313931, 315638, 274847, 317546, 294350, 251220, 157591, 87335, 68901, 88847, 50338, -65517, -163349, -144965, -99830, -197660, -246836, -158780, -142389, -124198, -155352, -51763, -48325, 56542, 60131, 68500, 32619, 66451, 156396, 129457, 172698, 189602, 182015, 311214, 427630, 493291, 691456, 789105, 844814, 851220, 971666, 1010795, 932993, 829405, 788493, 888316, 952363, 1019296, 1156102, 1237908, 1177114, 1193272, 1215823, 1269494, 1227632, 1135842, 1128806, 1158929, 1194654, 1177912, 1118078, 1022087]
16892A022087o5374j02775j78561j46604p2951J4855l4292j04669o2842l8717
16882B30157l2758k3319j9161J1036J17366J0977L2280p0604j20081j6617N4925
16871A74201J83531N5257n370K8565j26188r887P8498J6208J4662j6885L0458
16860D23050O0985m6719k2919M4854K8512j6847n6267L1498L1205K60513K86956
16849A024821k89j05083o4896M1910M0276j7708l9413r8431n2146j2914j40657
16838E75470j70419j54569j05299l4730r1796L9494L6310m7772J146N9355r1921
16827A5269l0738J01961j6899q1385m5153m2567N2510N8127J9042j0617m5900
16816b6350l852L3856J9775p9567J6996k392K4297o2369M3796N9913J3332j02405
$$ y = [1022087, 956713, 853938, 675377, 528773, 455822, 470677, 436385, 331716, 268874, 230157, 197399, 174080, 154919, 165955, 283321, 294298, 326578, 255974, 135893, 119276, 174201, 357732, 412989, 407619, 436184, 309996, 300109, 378607, 394815, 409477, 392592, 423050, 484035, 437316, 414397, 459251, 487763, 470916, 414649, 446147, 477352, 737865, 1024821, 1024532, 919449, 854553, 896463, 936739, 919031, 879618, 781187, 729041, 716127, 575470, 405051, 250482, 145183, 110453, 18657, 58151, 94461, 46689, 47835, 107190, 15269, -15469, 86492, 69593, -11792, -56945, -99512, -47002, 11125, 30167, 19550, -26350, -30202, 3654, 23429, -56138, -39142, -41534, -17237, -79606, -35810, 24103, 37435, -64970]
16804f4970l9850L2039l9522O0983N0032o9538j1260P0428p3144p7616M8483O704
16792a07231m954M4321p5344M7892J05428m1734k5923m6810n8076q3743M9728
16781a96446L4041l7966j4057J52929P4644j8548j70260L4753P2758J5697J3690
16770c8765J30519n5462k8491k0788r5829j037p0815j32365j5765R3095r942j1559
16758b57204m8454J07912N7359R4530R269n1736L4177N3579o5430q9896J4084
16747a41810l9459R338m7750m6875L4388m0261k2970k2423J44668Q0204N7052
16736c5898M4880k6619n3319n3978j02610Q4910N5901N8100j2403j909J8206L4633
16724I894m8856J3955j9499j18334M2111k1041O61K3019k1076m7059J07726L7157
$$ y = [-64970, -104820, -72781, -112303, -51320, -1288, -70826, -82086, -11658, -84802, -162418, -113935, -107231, -112185, -67864, -143208, -95316, 10112, -31622, -57545, -104355, -162431, -246174, -196446, -162405, -200371, -214428, -61499, 13145, -5403, -175663, -140910, -68152, -52455, -38765, 91754, 36292, 7801, -12987, -108816, -109853, -180668, -313033, -328798, -235703, -245645, -257204, -305658, -197746, -140387, -45857, -36588, -88324, -54147, -568, -65998, -155894, -141810, -181269, -171931, -219681, -266556, -232168, -272429, -295399, -317822, -173154, -92950, -35898, 8982, -17637, -70956, -124934, -227544, -142634, -86733, -28633, -41036, -42945, -24739, 9894, -38962, -25007, -44506, -162840, -120729, -141770, -141109, -118090, -139166, -186225, -78499, -41342]
16712d1342L6275o4174m7996m5112M3412R7820J00145n8909r2611M0513M6442
16701A4463Q5990J5448l5739q274j992j27326J0562L3521m0014k1599O5238Q723
16689i99M330l8913J9786M038m9688K2054l0321j40346j6271M7465J81104J25797
16677A28036L6270q9178q0502K5752o2751n9904p956L4812l9411K3317j14814
16666b06329J334J2578K9697o0053P9265M2082j2852j3004k0323k4893Q2965O2549
16654b6984j5026N7792k9769P567m3302M5414p7721k2373P2547j6538j10601M6486
16642a12508m3068J4244O754j855O0161l1932J9968o8273J7047P7637j03208Q5454
16630g9579n3750m4367N0126j42767n3459K5994p3525K8327R9451Q4524J1745
$$ y = [-41342, -5067, -69241, -117237, -162349, -118937, -21117, 79028, 20119, -72492, -31979, 14463, 100453, 115901, 80162, 71888, 69896, -57430, -46868, -13347, -53361, -74960, -9722, -999, 3331, -35582, -15796, -11758, -61446, -39392, -69713, -210059, -226330, -178865, 2239, 128036, 164306, 75128, -5374, 20378, -42373, -102277, -110233, -75421, -114832, -91515, -206329, -204995, -192417, -162720, -222773, -143508, -101426, -114278, -127282, -147605, -172498, -89533, -26984, -42010, 15782, -13987, -6420, -49722, -4308, -82029, -104402, -31855, -48393, -158994, -112508, -155576, -141332, -134578, -136433, -76272, -108204, -88236, -156509, -139462, -61825, -165033, -79579, -133329, -177696, -127570, -270337, -323796, -297802, -371327, -343000, -243549, -159025, -147280]
16619a47280L8926K6130K5808j9136K8146K2539Q2811r4842r4690J1546k9075
16608a49117M7623O4453p0427j48953r07O2489O0237J5700M5180q519j22750N5621
16596a49370P5254L9042n7215k170q0915j9455k7386N9528N7508q1991J06578
16585h0592O5404q9074k2641O8625M926L2858K0472k8181Q82J1995l1787M815
16573d2298N814O419K2387P7051m0592n2091J4154N7087o7466j99261j32954n683
16561c57433M0205K04566O0009J0756K5305O3582M2424L0525O1090m9256j38655
16550f882k34475m9148R0892O604P1857J38846L0040p1566j1120N2695P6835o6430
16538B8148j9146o4615O2294j6975o7588j53324L2809R6105Q3132P8716J460p1312
$$ y = [-147280, -108354, -82224, -56416, -75552, -47406, -24867, 57944, -36898, -131588, -120042, -149117, -101494, -37041, -107468, -256421, -257328, -194839, -134602, -118902, -73722, -82241, -204991, -149370, -74116, -35074, -92289, -94459, -175374, -194829, -222215, -162687, -105179, -187170, -80592, -15188, -104262, -126903, -58278, -53352, -20494, -22, -28203, -27321, -15326, -47113, -42298, -36484, -30065, -7678, 69373, 28781, -23310, -9156, 47931, -19535, -218796, -351750, -357433, -317228, -112662, -52653, -41897, -16592, 46990, 89414, 119939, 181029, 131773, -6882, -241357, -290505, -199613, -193009, -121152, 17694, 47734, -23832, -34952, 17743, 94578, 28148, 9002, -55613, 6681, -10294, -77882, -231206, -198397, -102292, -19160, 59556, 61016, -10296]
16526a0296j45019J4048O9029K902P9574k039m3388J7003J8199k6054l0644r7440
16514a54125l356M2299p696M3239K7217r9922n2058P7319R8294n4535j31344p3269
16502b87937L7660J36182Q3114o8970j3118Q6970m8524j69260J1882J00526j0019
16491a41494O2925J2274Q719J3130k5653q6777L0474P6812j36004J06165J39772
16480F0343k6069j0696j28721j7665J47144K9904N1620M5381N2755j03023l9959
16469F1014m4709m4194J6458p4234k5881l6600k2700l8897q31N4573R184p6974
16457b23791m5410p7436P3011J98799J60108j3403j61584m5539j27339O5066M2091
16446a55427j7125J5174M0481O6252J780j06176o4554K9357J08967j243M3520
$$ y = [-10296, -155315, -141267, -72238, -69336, 10238, 8199, -35189, -18186, 13, -26041, -56685, -154125, -157481, -115182, -122878, -79639, -52422, -152344, -204402, -127083, -28789, -83324, -214668, -287937, -250277, -114095, -30981, -99951, -113069, -26099, -74623, -243883, -232001, -131475, -141494, -78569, -66295, -57576, -44446, -70099, -156876, -126402, -49590, -185594, -79429, 60343, 34274, 23578, -105143, -122808, 24336, 54240, 105860, 151241, 203996, 100973, 61014, 16305, -27889, -11431, -85665, -111546, -148146, -170846, -209743, -210574, -156001, -146817, -223791, -269201, -346637, -273626, -74827, 85281, 71878, -89706, -135245, -262584, -197518, -155427, -172552, -157378, -116897, -50645, -48865, -155041, -219595, -190238, -81271, -82514, -38994]
16435c8994K6447k44P6711j21953r1584M785K8267n2521J52523K0838k30024n3259
16423b79008K4342J14770M1619K8465q4179m7931Q300l8515M0658J9763J837J9337
16411a50542M4276K6199j00056N6136K1040J9950j8069n6837p6255J3561J704
16400b18893j537p4104k3165j8415O5734O0141Q3333P6332m6157J8788J10957
16389C3014J724j26196r5121L446P8035K1227p499Q6279O51m6104J0789p946L7286
16376a0415p4466j43242J03511R3320N4362k6548j18354j6471r4934o5067j37243
16365d35547Q4971K60088j8123j1754k2213J68784l1957k08162o4444P1849Q3624
16354a22884n4815J07623J06252R4116J7236p6975o2247R307r9612n8005L5998
$$ y = [-38994, -12547, -12791, 63920, -58033, -149617, -144832, -116565, -169086, -16563, 4275, -225749, -279008, -254666, -139896, -98277, -69812, -153991, -201922, -193622, -232137, -191479, -171716, -169879, -150542, -106266, -80067, -180123, -123987, -102947, -82997, -101066, -157903, -234158, -220597, -218893, -220430, -294534, -317699, -336114, -270380, -210239, -126906, -50574, -96731, -77943, 33014, 34738, -91458, -186579, -183133, -105098, -83871, -91370, -5091, -4440, -50544, -39755, -47701, -10415, -84881, -228123, -124612, -31292, 23070, -3478, -121832, -138303, -233237, -298304, -435547, -350576, -90488, -108611, -120365, -142578, 26206, -5751, -213913, -278357, -206508, -122884, -177699, -70076, 36176, 130292, 147528, 70553, 8306, 17613, -81999, -140004, -104006]
16343a04006n7532L7796m2984K7061K7368q5699n230j5753l7649J9603K8676J4046
16331a94303K8393R1057k1398o5642K444P0440R2779P7732N003o4172J0251M7577
16319H0161L2921K2529o2415j34501j34561n581Q2216o252M2059K8101j21092
16308a76415N819K25494J136J1225K1899l1358m0692r3673O0848J32312L9576
16297A56171n3395j06032J01622m8394K817k1879p1719o2825n6223q3417j4582
16286b57856m6017P5800R5511n2509N9234K3644j14519L8417O8713M0897l2303
16275a00988K8575n8629k7603o2440q909k2655M7006M6619N6563O7597L9933q8507
16263h3438L2511k0813m0481J496o0553q8496Q1294M7723N4109K5628l1435M1999
$$ y = [-104006, -161538, -123742, -166726, -139665, -112297, -197996, -203226, -218979, -256628, -237025, -208349, -194303, -165910, -74853, -96251, -161893, -159449, -89009, 3770, 81502, 86505, 22333, 32584, 80161, 113082, 135611, 73196, -61305, -195866, -201447, -119231, -125483, -83424, -55323, -176415, -170596, 54898, 56034, 67259, 89158, 57800, 17108, -76565, -15717, 116595, 156171, 102776, -3256, 98366, 49972, 52789, 30910, -40809, -103634, -159857, -243274, -257856, -303873, -228073, -132562, -185071, -125837, -102193, -216712, -178295, -109582, -68685, -100988, -72413, -131042, -158645, -221085, -229994, -252649, -205643, -159024, -102461, -34864, 5069, -83438, -50927, -71740, -112221, -110725, -171278, -259774, -178480, -130757, -76648, -51020, -82455, -40456]
16251d0456K7048j38045p5741J67642L8090J9792n1670k1297n9651K5965L2414
16240g5909J20186o6182M2788M8630L7770q7749q0786N1219r719k0416p5826p1964
16228a87958k6383J1790O7082L4532k5453O9501k1550L1368M3274K4672l7075
16217a6200j5277l9530o8256m6464M4418L0220k9764M1148J0977J7400K7474j2103
16205e5957J9273o6673q0800m14R0144m9020j4833M8867j03713o6761M9128R9222
16193a31537K320L7213O4113l615n77J02466R9212n8071r3575j77785j3183J35483
16181c7536o5224j74322j43138R3294K43424K5269l9911j673J1805m3492J0114
16170a21390n7268o9917K5879O4237p7751o9507N8194K5201j6889n4285L0218
$$ y = [-40456, -13408, -151453, -227194, -59552, -21462, -1670, -53340, -74637, -134288, -108323, -75909, 44277, -21905, 20883, 69513, 107283, 19534, -61252, -10033, -19752, -40168, -115994, -187958, -214341, -202551, -135469, -100937, -126390, -56889, -78439, -47071, -3797, 20875, -16200, -31477, -71007, -139263, -185727, -141309, -111089, -140853, -99705, -88728, -71328, -43854, -55957, -36684, -103357, -184157, -184571, -94427, -143447, -158280, -109413, -213126, -279887, -230759, -131537, -129217, -92004, -27891, -31506, -32083, 70383, 169595, 111524, 17949, -159836, -173019, -37536, -102760, -277082, -420220, -326926, -83502, -58233, -98144, -99817, -88012, -131504, -121390, -178658, -248575, -222696, -158459, -236210, -305717, -247523, -222322, -239211, -293496, -263278]
16159b63278O5930N1237j290o594R1551K17499K8016j19095o7304p8966j25398
16148b07692N6800R2206q4561j0374M1316M8505p8167L7629R3353N332m539k6025
16136c6217l8587N641R3671N2303l647o7152j51662K2236O1831K9880p5834m8061
16124a55598N3744J51054J53921M4351j27683o5279l0960K396Q9911k7151j05936
16113a7230o7844N980m7257K3050M8692Q2012K4505o5396J20870M273k641j0035
16101I8979k4923q4892N9012Q1555N6437m5509j49426k0226J07175n3434l5749
16090a1001k5223O3433N9151p2141j0387q3989r0947K0796j6771q626m4741Q9581
16078a30865Q8632K603j4908q2842Q8647N8540j13971P25L8747J429j95022n5466
$$ y = [-263278, -197348, -146111, -147401, -153995, -62444, 155055, 183071, 63976, -3328, -82294, -207692, -150892, -58686, -143247, -153621, -112305, -63800, -141967, -104338, -10985, -5653, -10192, -36217, -74804, -69163, 24508, 76811, 73164, 6012, -145650, -123414, -61583, -31703, -107537, -155598, -101854, 49200, 203121, 247472, 119789, 54510, 23550, 25946, 115857, 88706, -17230, -85074, -79094, -126351, -103301, -54609, 27403, 51908, -13488, 107382, 111655, 109014, 98979, 74056, -10836, 48176, 129731, 186168, 140659, -8767, -28993, 78182, 24748, -11001, -36224, 27209, 86360, 14219, 3832, -80157, -171104, -150308, -167079, -175705, -220446, -130865, -42233, -39630, -54538, -137380, -48733, 9807, -104164, -103439, -64692, -63263, -258285, -313751]
16066c13751K2740J64111Q7979q0087n3013L3326n0L3359O4100R4478m296K7518
16054G6414l9136j16922M7319l6232O2075J05849J00068j21213j64638p2130R7883
16043f0663R8745m6069r8251J4582N0888J0348P5322o0813k1754m5824j3017M6915
16031d9591J29191K1905j0684r2963R500J04626O713j3520M1422l5888j4056n0003
16019D6652l3913k8666j07263n1846J835J09680J7820M7758L4180j1525L8460
16008F3172r2150n5300L6925l3317j6381j5926Q8768J0315o4118l9578O1431Q8960
15996C2801N6380Q6381l8068j29107o3914M087O9374l1187j21869q882J39354
15985d650O8600O6630k1785j50173j24694p701o9389Q691k0414J83059J82164
$$ y = [-313751, -291011, -126900, -38921, -119008, -172021, -138695, -138745, -105386, -41286, 53192, 48896, 76414, 37278, -79644, -32325, -68557, -6482, 99367, 199435, 78222, -86416, -158546, -60663, 38082, -7987, -106238, -91656, -40768, -30420, 44902, -15911, -37665, -83489, -96506, -49591, 79600, 101505, 90821, -2142, 7358, 111984, 118697, 105177, 146599, 110711, 96655, 46652, 12739, -15927, -123190, -175036, -173201, -63521, -45701, 2057, 36237, 24712, 63172, -28978, -84278, -47353, -80670, -97051, -112977, -24209, -13894, -78012, -117590, -56159, 32801, 89181, 175562, 137494, 8387, -55527, -51440, 17934, -13253, -135122, -144004, -4650, 63950, 130580, 108795, -41378, -166072, -173773, -243162, -234471, -254885, -71826, 110338]
15974A10338k0991m8965k2320P1465N7091o7058K410L812l6703j33512k6817P5810
15962c5440N4205j99142K4931J34358J20467J36418R2361r3090j25374j47761
15952c8067m4323L5704m1463k7547K2558O4842n522o7327R6688L7941o8163R8351
15940F3672o1955l6105L9099O413M5836l4794L4823n6337P2692q1101j46295N1318
15928a02734J14211n6199K15N2055L9158n608K1978Q297o4649k0916k2268L9900
15916C440m6593L373j1891m0077J4795J44514k2664N629K386R6289m2626p6909
15904B9666j45236Q3420J94527L6558p7666M727k7934k2581m2128j29884p6310
15893a72841o9024M28J19180J63711R7164m4472L3382j10480j2363J57795M2764
$$ y = [110338, 89347, 40382, 18062, 89527, 146618, 79560, 81970, 85782, 49079, -84433, -111250, -35440, 18765, -180377, -155446, -21088, 99379, 235797, 328158, 235068, 109694, -38067, -82390, -46686, -88149, -115696, -93138, -28296, -33818, -101145, -4457, 33484, -34679, 63672, 1717, -34388, 4711, 11124, 56960, 22166, 56989, 652, 73344, -7757, -154052, -102734, 11477, -44722, -44507, 7548, 46706, 41098, 63076, 71373, 6724, -14192, -36460, 3440, -43153, -39780, -51671, -91748, -76953, 67561, 44897, 50526, 52912, 149201, 106575, 29666, -115570, -32150, 162377, 198935, 121269, 125996, 98062, 75481, 33353, -96531, -172841, -241865, -241437, -122257, 41454, 138618, 94146, 127528, 17048, 4685, 162480, 205244]
15882B05244J453m6059j32927n7599K5124M687j4637J17925k9435n1771K683m5915
15870b1227K0786Q1872O299K0850J0241M7689k9789o1364j7662k9356o5109Q573
15858b8197k5715m9932P4125r344j2619J49659J52647p6480j16532j53817o2788
15847a58993M4579N9865K0010k6817m9111n1249o1964j7964L2548Q0096K195o9178
15835a95983n2149J18399P4999J03198j05194M1759M6871m9896j00240k6073l57
15824a44666O2426P9909j1935P6641j0446m5422N5135j274q2698m4607M651j4149
15812g6435l5396J0754j0495j00882L4191J02855N8961j20247j09699R8859J09965
15801c7569L7552o193L4857o3964j05259o55K194Q9357K3639o7201n1345J01750
$$ y = [205244, 206697, 160638, 27711, -29888, -4764, -77, -14714, 103211, 73776, 22005, 24688, -21227, -441, 81431, 87730, 108580, 118821, 166510, 136721, 75357, 57695, 28339, -36770, -28197, -53912, -103844, -29719, -39063, -51682, 97977, 250624, 174144, 57612, -96205, -158993, -114414, -54549, -34539, -61356, -110467, -161716, -223680, -241644, -209096, -129000, -126805, -195983, -248132, -129733, -54734, 48464, -56730, -14971, 31900, -17996, -118236, -144309, -144666, -82240, -2331, -14266, 62375, 51929, 6507, 61642, 60368, -22330, -66937, -62286, -76435, -111831, -101077, -111572, -212454, -178263, -75408, -16447, -136694, -246393, -147534, -37569, -17, -6210, 28647, -35317, -140576, -141231, -139037, -49680, -26041, -93242, -144587, -42837]
15789d2837J16890Q3685J08743J26594j01845j65097k34711K5499o1358l5902
15779a80339Q6471J82805J64080r265j02191j35650K9379P8403L0489K5068j4644
15768A54606q2507N2290J20880N8381q5885j40835j26242K1075J63175P8234j16804
15757I6368L1889J5487j21124j19561O3056J13323J2298O938J7314O3570K9535
15746B09093l3562J89348K78566L14313J88162m3228j42928k76298k38034k36002
15736B09430j41657R694L9386J4548m0453k303j959j8189O4374P8831o9584k01228
15724e9110J3462n4626j18463J07580J11811n5689P3331M9697q1165k7452K7739
15713a2885q81L5910n7201m2409p9229k2662P9292J45703J1031q4300n9221O9855
$$ y = [-42837, 74053, 157738, 266481, 393075, 291230, 126133, -108578, -83079, -144437, -180339, -93868, 88937, 253017, 243752, 141561, 5911, 35290, 113693, 144182, 169250, 154606, 72099, 124389, 245269, 303650, 217765, 76930, -49312, -28237, 134938, 213172, 96368, 128257, 143744, 22620, -96941, -33885, 79438, 91736, 98674, 115988, 179558, 209093, 175531, 364879, 643445, 957758, 1145920, 1102692, 959764, 683466, 445432, 209430, 67773, 77467, 116853, 131401, 90948, 88645, 86686, 68497, 132871, 211702, 142118, -59110, -45648, -100274, -218737, -111157, 654, -55035, 18296, 67993, -13172, -40624, -12885, -13766, 22144, -35057, -77466, -156695, -179357, -100065, 45638, 56669, -27631, -86852, -16997]
15701a6997k626j8571n0273J24961Q0793n7401k8073N3759N7618j72036k4824
15690e3670P4639K0405M972j05056j0624R2313J6608J1618P8282L8768M2898l6264
15678A74889K784Q8889n1152m0787n7618n3244j12375p6027N5150P4631R831R7863
15666A12834n0665n3612j026L320L4647j15512N7004Q9738l3229m9634J4534J2398
15654B0797k0800r9062J3213J29919K9234n6946O2764Q2588n5526j73968j60288
15643b28075M5584k3689M3321M5683K3453l3745o8451n965P2842L4503l1916J0901
15631a15554o2536n1758K76K31698P3282o6386m6895K9492N4063m8464q7223J04862
15619A4857Q0529n9115K4621L0999o2320o2148p0448j1509P7932p523n9445m0820
$$ y = [-16997, -19623, -38194, -88467, 36494, 117287, 59886, 31813, 85572, 143190, -28846, -53670, 20969, 41374, 46346, -58710, -69334, 22979, 39587, 51205, 129487, 168255, 211153, 174889, 177673, 266562, 215410, 174623, 117005, 63761, -48614, -124641, -69491, 5140, 14971, 112834, 62169, 8557, 7531, 10851, 45498, -70014, -13010, 76728, 43499, -6135, 8399, 20797, -3, -99065, -85852, 44067, 73301, 16355, 79119, 161707, 106181, -67787, -228075, -182491, -206180, -162859, -117176, -93723, -127468, -195919, -201884, -129042, -94539, -126455, -115554, -178090, -229848, -229572, 2126, 75408, 9022, -37873, -8381, 45682, -2782, -90005, 14857, 95386, 36271, 60892, 91891, 29571, -32577, -103025, -114534, -36602, -44125, -103570, -144390]
15607a44390l7150J22306R1963l8597J8987J19219L1657l0045j14271M127J9708
15596D3514o9400M544j0911n1909J5213p2888L8057j1285L9191j3371p0285j2376
15584a71906O5531J8051q194p6535O9531J30430j969k173n500J2253p59j2659
15572A6101M2924L5904J9379Q0157O7222j680q1343j22301l1447p6330r3367m6988
15560a91769L4154J14808R8492L6988m511j12186n5971j5017k827J17894Q3770
15549A03825n2328n6356n3607o8069j1206J698J131p9856P0994J62916P0057O3987
15537A53186k4405q2808q9943K6073Q8797p3865q0942k1936J0694N1209O3810
15526A9870K9034L4441M1565o947j20526q5151j3409N7799M7339N5949R8927k0306
$$ y = [-144390, -181540, -59234, 32729, -5868, 13119, 132338, 163995, 133950, 19679, 23806, 43514, -25886, -21342, -32253, -84162, -68949, -141837, -103780, -115065, -75874, -89245, -159530, -171906, -106375, -88324, -96518, -173053, -103522, 26908, 24939, 22766, 17266, 29519, 28760, 16101, 59025, 94929, 114308, 194465, 261687, 260007, 178664, 56363, 24916, -51414, -144781, -191769, -157615, -42807, 55685, 92673, 88162, -24024, -79995, -95012, -97839, 20055, 103825, 51497, -4859, -58466, -126535, -137741, -136043, -134912, -214768, -143774, 19142, 89199, 153186, 128781, 45973, -43970, -17897, 70900, -2965, -83907, -105843, -95149, -43940, 19870, 48904, 83345, 124910, 117963, -2563, -87714, -101123, -43324, 4015, 59964, 158891, 138585]
15514A38585r4015j7558q1335j2252O6734m7863J14072O3921r8541q0210J1521
15503c6941J27266K0621m6426r9122M6370R2772K3276o3815j0096J0197m7823
15492A6279J0681n366J1471r551N1763m303l5727J26167M6426q287l2355q0773
15480H6425k8264K5606M4276k081n949m7731n7767l552L4594M9173l0854M5745
15468A09621J46915o0323j16029j03915j41282L7437N6613O2774J53519m6685
15458I8645r5744j35135J1385l5632q254K1783J08643R6675L0690r5931k8834
15447c1709K7594Q5037k507M7668R2658K1668j66054j54030p0520r4583N3290
15436a91488J30252J30240K248k1557K5188N9251o8711K5540L2291J6299L8793
$$ y = [138585, 44570, 27012, -54323, -66575, 159, -47704, 66368, 130289, 31748, -48462, -36941, 90325, 110946, 64520, -34602, 11768, 104540, 127816, 64001, 53905, 64102, 16279, 26960, 21594, 33065, 23514, 75277, 70974, 35247, 161414, 207840, 199553, 167198, 86425, 58161, 83767, 128043, 125962, 120013, 72282, 14515, 10963, 45557, 94730, 63876, 109621, 256536, 196213, 80184, -23731, -165013, -127576, -70963, -8189, 145330, 98645, 2901, -132234, -120849, -156481, -164735, -142952, -34309, 62366, 93056, -2875, -31709, -4115, 80922, 78415, 126083, 218741, 240409, 74355, -79675, -150195, -244778, -191488, -61236, 69004, 71252, 49695, 74883, 134134, 65423, 90963, 123254, 139553, 178346]
15425A78346J0639m2098r8432j67505l2049N4009J70856N3644J6210q3577o3611
15414c568J3221L0927o9931q7815N8369m2257k7947O2482M9005P6868k4192m1922
15402f760O5929R151j9270j5647J54020O2741q0321p729j6143q3434j7890p9865
15390c5218j52307M1743M1739R1380j361O781J4776m7005n5620M1165J17381m0916
15378B2538j5161J6635o9049p0103m6240N3411O0793O340k6081J2336N9972J1425
15366A6816N6894p4767j77381K3437P00L1079J14073Q2880j5805j7091q3541k5055
15354f7761J08065o348N3068p7476K4996M0988j07974R9996O6036Q8489q1151
15343A40928p2775q3257m9106L6345j90K6611k5991n7958l9682J8117m7516J09862
$$ y = [178346, 188985, 146887, 48455, -119050, -151099, -97090, 73766, 127410, 143620, 60043, -3568, 9653, 40580, -29351, -117166, -58797, -101054, -129001, -66519, -17514, 59354, 35162, -6760, 59169, 68320, 49050, 33403, 187423, 250164, 169843, 162114, 145971, 62537, 44647, -35218, -187525, -145782, -104043, -12663, -14024, -7243, 7533, -39472, -95092, -53927, 63454, 22538, 7377, 24012, -45037, -115140, -161380, -107969, -47176, -40836, -66917, -54581, 5391, 16816, 73710, -1057, -178438, -155001, -154301, -123222, -9149, 73731, 57926, 40835, -42706, -67761, 40304, 33956, 87024, 9548, 34544, 75532, -32442, 67554, 133590, 222079, 140928, 68153, -15104, -64210, -27865, -28055, -1444, -27435, -85393, -125075, -106958, -154474, -44612]
15331d4612J42844n2101o8164o8986J1946J62405N286q3329J8656P1366J1887
15320A07198o2261q4826j4059o823k4373m364L0904j4703K2533q3611L7812L0065
15308f6508o388L0432L9466o9334R4740J42809K2597j06645j45781P1347Q3010
15297H9745l1098J4295q781R996k8156j48995J25046M9981n4539m3445K3427l8085
15285d0609r708P7377R9606k8381l0594O3464J1180L0129Q2524m9657q3120K0984
15273A43195j5707n4019q268O1710r620m3522M3425k4460k0688J9064j10051J4742
15261d199K74645N6523m9447K2738m0188n3512o5766k8983J312k6144n1309M4481
15249H0151N5572l7636K6235k5674L908j230N9744n7686K3533J06938l5349o9954
$$ y = [-44612, 98232, 46131, -22033, -91019, -79073, 83332, 88618, 5289, 23945, 95311, 107198, 44937, -39889, -53948, -60771, -85144, -89508, -58604, -73307, -50774, -134385, -96573, -66508, -72896, -42464, -2998, -72332, 22408, 165217, 187814, 81169, -64612, 6735, 89745, 58647, 72942, 64161, 74157, 46001, -102994, 22052, 72033, 17494, -25951, -2524, -40609, -50317, 27060, 126666, 98285, 67691, 131155, 142335, 172464, 254988, 205331, 122211, 143195, 127488, 73469, 65201, 126911, 117291, 73769, 117194, 92734, 72046, 91110, -18941, -4199, 270446, 326969, 277522, 300260, 260072, 206560, 140794, 111811, 113123, 86979, 35670, 80151, 135723, 98087, 124322, 98648, 102556, 101326, 161070, 103384, 126917, 233855, 198506, 128552]
15237A28552J6878J573L3685P0745k6649o8862K7064O0379O4635q0235k8268K927
15225B02424k1714r2805j6199m5455M3799o418r9005o789o5108n7154j1134J65750
15213i808J93147k3269l0304J5459J9843j14971j3188J5905P5692Q9218K4773
15202B42497k465n2177p2590q0528j3126L4202Q0303j5072k882N8196K9317p6070
15190A29605n47K259m5291R3370l4334j19204p2269m1489J23557J60077k9156
15179A66578r9954j71076k145J58126N2222j13823J5931n8437R1974N9470n4017
15168D4849l3639N6889J3435L5963o0894j15880J8179O771Q8765J21445P5471
15157B51354n27j6592n3552p3087P289m5739n9238m8060L9258N4564Q9714O8131
$$ y = [128552, 145430, 147003, 180688, 251433, 224784, 155922, 182986, 243365, 308000, 227765, 199497, 202424, 180710, 87905, 71706, 26251, 70050, 63632, -35373, -42162, -107270, -164424, -175558, -9808, 183339, 160070, 129766, 145225, 165068, 50097, 36909, 52814, 128506, 217724, 242497, 240032, 187855, 115265, 34737, 21611, 55813, 136116, 121044, 118162, 176358, 205675, 129605, 129058, 131317, 86026, 179396, 145062, 25858, -46411, -87900, 35657, 195734, 166578, 66624, -104452, -106597, 51529, 103751, -10072, 5859, -52578, 39396, 98866, 44849, 11210, 68099, 81534, 117497, 56603, -59277, -41098, -34327, 54438, 175883, 251354, 250827, 234235, 180683, 107596, 114885, 69146, 9908, -38152, 1106, 55670, 145384, 213515]
15145B13515j11992j18626j7306n6167K5496N6835n5684J7085l7017N9087P7665
15134E2891L855P1605M4888J184k3959J7749Q1346k9633p822J988O7258l5546
15122B45804K1231k1210n0900o2371k2846K1294o1784q5560N9421R2912J4243
15111A50234L2689j13024j08090O8745n277n012j3398Q2891K8229N9j3199k9607
15099G5240n5200n2332J7453M3664K9868K868N1964L4674Q5136j15706j31160
15088a3531l1104N4273Q6446M6299k0949m8411K192j5863k07558J0216J25638
15077a2352O2704p914l0532J1920O1337M9261m968j66760Q7865J26388n612o8604
15065A02733m517P6405J0320q4409j6561Q625j7939K6320Q3769J03675L9527j15875
$$ y = [213515, 101523, -17103, -34409, -90576, -65080, -8245, -63929, -46844, -83861, -24774, 52891, 56746, 128351, 173239, 174423, 150464, 168213, 249559, 219926, 212104, 214092, 281350, 245804, 267035, 245825, 194925, 132554, 109708, 131002, 69218, -16342, 43079, 135991, 150234, 182923, 69899, -38191, 30554, 25277, 20265, 6867, 89758, 117987, 118046, 104847, 75240, 20040, -32292, -14839, 28825, 58693, 61561, 113525, 148199, 233335, 117629, -13531, -44635, 9638, 96084, 142383, 121434, 73023, 75215, 59352, -148206, -137990, -12352, 50352, 42438, 11906, 23826, 85163, 134424, 129456, -37304, 50561, 176949, 171337, 102733, 98216, 174621, 184941, 100532, 83971, 92596, 74657, 100977, 184746, 288421, 327948, 212073]
15053B12073p1025m5752J4270J5508Q9753K7136K9898M4924M5589l2385j22485
15042B07504m3790K3933o2539K950N9046k2593K642m7520J8596o9420r0977l6379
15030e8547o0631O1724j0600J9360L9444K1879J9620P0270L5428o0010O534L4703
15018A19174j05570N451J82508l8154m3793N2826J95758J23503l7791j50930q3155
15007B19827K6849j10637j04191k4756K682j3552L407P067n8124K4977P9054O2646
14995A15249N3369O9052j18663r7689J7707j0248j0916j12385M1765N2047N762
14984E050k4255P1359o222N3373m641m6262M6Q1999m594q9753n255P9968N276
14971A16089J314o2853j08600j67574Q2758J88429M8932n9871P4628l3257r1651
$$ y = [212073, 141048, 95296, 109566, 125074, 214827, 241963, 271861, 316785, 362374, 329989, 207504, 163714, 187647, 125108, 128058, 187104, 164511, 167153, 119633, 138229, 68809, -22168, -58547, -119178, -57454, -68054, -48694, -9250, 12629, 32249, 102519, 137947, 77937, 84471, 119174, 13604, 19055, 201563, 163409, 119616, 172442, 368200, 491703, 453912, 302982, 219827, 246676, 136039, 31848, 7092, 9774, -3778, -371, 6696, -51428, -26451, 52603, 115249, 168618, 237670, 119007, 21318, 39025, 28777, 17861, -94524, -52759, -712, 5050, -19205, 52154, 45932, 99305, 94664, 48402, 48448, 130447, 125853, 36100, 30845, 110813, 116089, 117403, 54550, -54050, -221624, -138866, 49563, 98495, 38624, 113252, 79995, -11656]
14960a1656L5699k7696k5021P8042J15371J5937q0076k4193J59096O5278m5207
14949B55574l4509k834n7193Q17l1173l3175p5379l5220l9636q2669R8286P5103
14937C7992q9862n169M8385J02013Q3664n9910o5389m418j00085j72992p483L2053
14925b01201J27271J07648m4698j6055P0147P5171k9714j13928m8872n0014L1292
14914i2953Q4045O8496M9839J8502j2378N9032J02727j33934j08174J4266j63657
14903a14189L0552R5188J7720R432L2965p0797m8526K74n2755K3994J30345Q8601
14891A42804L932j45795q4822M5126J55491k0003j27911j24739k6460j6744Q5107
14880a14014L1617Q8119M0562R392q206N3574N3812P83j33949L0427R8702J4726
$$ y = [-11656, 24043, -3653, -28674, 49368, 164739, 180676, 100600, 76407, 235503, 300781, 255574, 221065, 218231, 161038, 161855, 130682, 97507, 22128, -13092, -52728, -135397, -37111, 37992, -51870, -57039, -8654, 93359, 177023, 117113, 51724, 47306, -52779, -225771, -233254, -201201, -73930, 33718, -10980, -27035, 43112, 118283, 88569, -25359, -74231, -124245, -92953, -8908, 59588, 109427, 127929, 115551, 174583, 277310, 143376, 35202, 49468, -114189, -83637, 11551, 29271, 38703, 71668, 871, -47655, -47381, -100136, -76142, 54203, 142804, 146736, 941, -83881, -38755, 116736, 96733, -31178, -155917, -182377, -199121, -114014, -82397, 5722, 46284, 55676, 47470, 101044, 154856, 155639, 21690, 52117, 150819, 165545]
14868A65545j6665M4219m8481j0906J8367K9686L6809j75053m252K4549K0867
14857H4685n8954j4833l2522J24444N4698m5588j30670K3725o4372o4922K6964
14846i7345M9879R8783n9448p349N6656K5283L2096J738l2513J53005n2126n9130
14834A09529K7254L1030L4291j39336k9456J10752L486q9146J3790N2578P774
14823A32546j02527k4483N1230N7623n1397j12949j7573J15019Q7686j19770q0437
14812f5032P1157O6647k6454L9910j5367j65951J4465O9165j24m9368M873p966
14800f4045N4550N9912N1021m4751j12947n0891L2614j5497J09698L821n4084
14789c0599M9703q632l7258n9993O1526J35078L1877N4273P7982r9870j47812
$$ y = [165545, 148880, 193099, 144618, 133712, 152079, 181765, 218574, 43521, 39269, 63818, 84685, 25731, 10898, -21624, 102820, 157518, 111930, -18740, 4985, -59387, -124309, -97345, -47466, 51317, -8131, -15480, 41176, 66459, 98555, 100293, 67780, 220785, 168659, 109529, 136783, 167813, 202104, 62768, 33312, 144064, 147550, 58404, 72194, 124772, 132546, 30019, 5536, 56766, 114389, 62992, -49957, -67530, 47489, 135175, 15405, -65032, 6125, 72772, 46318, 86228, 70861, -95090, -80625, -11460, -11584, -60952, -56079, -64045, -9495, 50417, 101438, 56687, -56260, -107151, -74537, -90034, 19664, 23485, -30599, 19104, 10472, -26786, -86779, -25253, 109825, 141702, 195975, 273957, 174087, 26275]
14778B6275K6462L4181k9316N3990M1626k6707Q830k1382K1264M4216J341M7945
14766B28725j10768p2336q494J9013m5355K3717k1646J4836l8718r1625N9708
14755d2943J35709J08737O38J6408m704J8323l7746m1216k9958K1206j1079K4826
14743A58201M4168k2378L107m753J1974J12372J55247q1242j87662o2666o1872
14732F4496p7952j1124N3278M6569J4614k5922l5903n3906R9533j580J099O674
14720G9876L8443j9014l4615l1528r7418p7033P7626M2812K2700J1547k4008j5159
14708b5771k5535O5620R4994M7748j4478j55244J689P9888q0519L7416Q3368L2
14696A09208m4920j4600l2326R2763J05805J8412P067M8009J800l3722K3524k9823
$$ y = [26275, 52737, 86918, 57602, 111592, 153218, 126511, 135341, 113959, 135223, 179439, 180780, 228725, 117957, 45621, 37127, 56140, 10785, 34502, 12856, 27692, -11026, -102651, -42943, 92766, 201503, 202141, 218549, 213845, 232168, 194422, 153206, 123248, 144454, 133375, 158201, 202369, 179991, 183098, 178345, 190319, 302691, 457938, 376696, 189034, 126368, 64496, -13456, -24580, 28698, 75267, 89881, 63959, 28056, -25850, 73683, 72103, 73202, 79876, 118319, 99305, 64690, 33162, -64256, -141289, -63663, -20851, 1849, 13396, -10612, -25771, -51306, 14314, 109308, 157056, 142578, -12666, -10977, 68911, -11608, 25808, 109176, 109208, 64288, 49688, 17362, 110125, 215930, 234342, 241409, 289418, 291218, 257496, 281020, 251197]
14684B51197l4360J15652R1023J63601R1089n9931J3179J8553k4085l9253O0341
14673F47006J0963r1829j04383j48535J1040L671q4344K4693R2258K3191j39321
14662B44410m8147q8959J05197J14828J75253J13189O0915n916R1866J3867J47108
14651I23611J0303o8646o3044j79057j59054N7281J39796P2510M1774J24350J8435
14640I18259m8678O0246M7180l887q7729l1123j28173j95321j06665l548l9325
14629C81236j9554J15571O3816j11208k8475l9349r585l4707J8749k9489J43218
14618D50223J15279J03132J50443n866L2979o285k5939m5615l7683p0752J23747
14607G83663o9678k67282j09581j36258l8363O6854P6129l6519P013j2651k1638
$$ y = [251197, 216837, 332489, 423512, 587113, 678202, 618271, 631450, 650003, 625918, 586665, 647006, 657969, 566140, 461757, 313222, 324262, 327933, 243589, 268282, 360540, 383731, 244410, 196263, 107304, 212501, 327329, 502582, 615771, 676686, 670770, 762636, 776503, 923611, 933914, 865268, 802224, 623167, 464113, 521394, 661190, 733700, 775474, 899824, 918259, 869581, 929827, 977007, 973120, 885391, 854268, 726095, 530774, 424109, 420561, 381236, 361682, 477253, 541069, 429861, 401386, 362037, 352452, 317745, 336494, 307005, 450223, 565502, 668634, 819077, 813211, 846190, 839905, 813966, 768351, 730668, 659916, 783663, 713985, 446703, 337122, 200864, 162501, 229355, 305484, 268965, 275978, 263327, 241689]
14596B41689m3842N1188P6953J03062l5112q6913r6399p7634r814m3073j5737
14585F4368n5222K4799N2183O0837j32534M010P7869l3921J16053l7581n3836
14574H7025M2906n9027K4647J01174q1032p9943k0302n1198J14128N9087N259
14563A42724n283O751k4114r1487N0125J64127O2249p0311j91901l1200N7032
14552F8712L2373k7307M3552P6758O1760q2423k9785q940l1425j17508K8106M6208
14540F0081P4737O2163o1070k9036p75N8713N4809p754m5242m7581J54290L5350
14528C08685M189k499l8703k7651M8093j00014l8089P3440M178m1279O1197q3508
14516A68039K0292J5143j21661Q325J43329K29079L9p2375l0487O2411k3828o1001
$$ y = [241689, 197847, 249035, 325988, 429050, 393938, 307025, 210626, 132992, 123178, 80105, 64368, 9146, 33945, 86128, 146965, 14431, 18441, 96310, 62389, 178442, 140861, 87025, 129931, 70904, 95551, 196725, 115693, 35750, 15448, -35750, 78378, 137465, 142724, 137441, 144192, 120078, 28591, 78716, 242843, 305092, 234781, 42880, 11680, 68712, 101085, 73778, 117330, 194088, 255848, 173425, 143640, 134700, 103275, -14233, 13873, 60081, 134818, 196981, 135911, 106875, 106100, 164813, 219622, 211868, 166626, 119045, 273335, 308685, 312874, 310375, 271672, 244021, 292114, 192100, 154011, 227451, 231629, 190350, 251547, 168039, 188331, 203474, 81813, 90138, 233467, 462546, 462585, 390210, 359723, 422134, 398306, 337305]
14504C37305j68992j09058N3210P4203N1578M5705j5372j17561m6699p0461j9723
14493A4135n0210p2862P189J88518O1962q907P6371q194q4822O5760N4240N3424
14481B96604Q8503J4996j6647j17580J0199m872n0077M7464L7420M5313j9608
14470C31715r4156j38254K7992J03944K1745j16760q2742O49M2286l1954Q0012
14459A44477L4451J7084N9043N84o4988j5983m3433L8855P4792K5110q0253q3610
14447A06129p381J16538L7785q7233m577K3323r493j0955q592K7047R315k2254
14435A69652j08964Q8L4655K3406p8293K3594J28778Q2090N8034j26835N7168
14424B63373K8070j28847O1536J0195p0319K1512J06968q6129p083N8467q91K5655
$$ y = [337305, 168313, 59255, 112465, 186668, 238246, 283951, 268579, 151018, 104319, 33858, 14135, -36075, -108937, -101748, 86770, 148732, 139825, 216196, 208002, 123180, 188940, 243180, 296604, 385107, 400103, 383456, 265876, 276075, 271203, 221126, 268590, 306010, 351323, 331715, 237559, 99305, 127297, 231241, 252986, 136226, 53484, 54133, 96419, 64465, 144477, 178928, 196012, 255055, 255639, 190651, 174668, 131235, 170090, 244882, 269992, 189739, 106129, 98748, 215286, 253071, 165838, 161261, 184584, 175091, 164136, 155544, 182591, 191906, 169652, 60688, 60776, 95431, 118837, 40544, 64138, 192916, 275006, 333040, 206205, 263373, 291443, 162596, 224132, 234327, 164008, 185520, 292488, 206359, 199276, 257743, 256852, 282507]
14412B82507j0966O2108N9322n5995j49371o6319q079L6484J28120l250j17298
14401A57263p3702R6257J52668J73076L7191O8047m2108r31m2376l8237q633n1371
14389D27144N0050j23972m010R8210n803L6791m0251j03267j05706R077k9805
14378B08458m0966J36177R2901N5180oQ0895M0077J01492O7135J37616J9096j75679
14366G22376K0861K5596j24329r298K0697M7419l3063N7265O4506P0787P4543
14355I37360j50437q8793K2283K6464L2461r5134j33443k6964J55929Q3318J2100
14344G75144j30120N350K2443j238J32815K00429J80306L6188r5524n0372p3926
14333A001495M0535N661p027l6771L8011N2575m1524j12585p0018O4729K4504
$$ y = [282507, 271541, 333649, 392971, 336976, 187605, 121286, 113207, 149691, 277811, 274561, 157263, 83561, 179818, 332486, 505562, 542753, 610800, 568692, 567761, 525385, 487148, 478515, 427144, 477194, 353222, 349212, 447422, 441619, 478410, 438159, 334892, 229186, 238263, 208458, 167492, 303669, 396570, 451750, 451744, 532639, 572716, 674208, 741343, 878959, 898055, 722376, 743237, 768833, 644504, 635206, 655903, 703322, 670259, 727524, 792030, 862817, 937360, 786923, 698130, 720413, 746877, 779338, 684204, 550761, 523797, 679726, 763044, 775144, 645024, 650374, 672817, 671579, 804394, 1004823, 1185129, 1221317, 1125793, 1075421, 1001495, 1042030, 1047691, 1040664, 1003893, 1041904, 1094479, 1052955, 940370, 870352, 935081, 959585]
14322I59585L4204j0495M563q3549P4109k9737k01138j15820m4109l4495k4089
14311E29029J49731J9188J3159n0606k4724r9740p6671L8582J04542R5281N7845
14300G55616N9327Q5964O9726M9841J7887r6750J906r4556o2619l201n348l5472
14288G42321o4598n9121J0374K6671l7515L204N1938L0550J45578J43968k9364
14277I64006o670M4718P308j1738J1888N7362O3966N8336J5807J38161K44860
14266A588004P4652p1009j87236l0551l7249L2437k199M2898J19495j3044j03670
14255A412528l9107P6405R1856J10705P531k4031J00951J76163J93367J62718
14245B269086K04980Q0310K4668M025K5037M9600J31503N8803N2197Q0563J77071
$$ y = [959585, 993789, 983294, 987857, 904308, 978417, 948680, 747542, 631722, 587613, 553118, 529029, 678760, 697948, 711107, 660501, 635777, 536037, 459366, 497948, 602490, 697771, 755616, 814943, 900907, 970633, 1020474, 1038361, 941611, 943517, 848961, 786342, 783141, 777793, 742321, 677723, 618602, 628976, 655647, 618132, 621336, 673274, 703824, 849402, 993370, 964006, 957336, 1002054, 1009362, 997624, 1009512, 1066874, 1130840, 1189176, 1204983, 1343144, 1588004, 1662656, 1591647, 1404411, 1373860, 1336611, 1369048, 1366849, 1409747, 1529242, 1516198, 1412528, 1373421, 1449826, 1541682, 1652387, 1659918, 1635887, 1736838, 1913001, 2106368, 2269086, 2474066, 2554376, 2579044, 2583069, 2608106, 2657706, 2789209, 2848012, 2900209, 2980772, 3157843]
14234C157843K65799L78781L38299J31832K90568L67939L78888O26237P74858
14225F711044Q67016J034689J084172J218343J518021J755152J974821K467452
14217A8630710L406895M648534O497429Q943021J2162000J5804269J8528393J7942194
14209A06563445J3760233P890788J856902m145001r716899j3712282j5283465
14202H7213721j4094329j1215478q193516o002179m303346k786889j569084q14365
14194C8234535k99925M54645J389647K514409M251060O600906R782667J4081969
14186G7009913J8501687K1022295J8842181J2681092N219266j788848q350342
14179A43137244j4087890j7118760j6091407j1944500o649008j128382M660407
$$ y = [3157843, 3423642, 3802423, 4140722, 4272554, 4563122, 4931061, 5309949, 5936186, 6711044, 7578060, 8612749, 9696921, 10915264, 12433285, 14188437, 16163258, 18630710, 22037605, 26686139, 33183568, 42126589, 54288589, 70092858, 88621251, 106563445, 120323678, 128214466, 130071368, 125926367, 116209468, 102497186, 87213721, 73119392, 61903914, 53710398, 47708219, 43404873, 40617984, 39048900, 38234535, 37934610, 38389255, 39778902, 42293311, 46544371, 53145277, 62927944, 77009913, 95511600, 116533895, 135376076, 148057168, 153276434, 151487586, 143137244, 129049354, 111930594, 95839187, 83894687, 77245679, 76117297, 80777704]
14172H0777704J1188381J7774187K1720614J9915785J3329409O252480n29178
14165A70429382r669727j9545286k5335813k4620574j9124751j3057494q473030
14158E0602707n363804l436691k113554j190932l85737K38933Q82501J668811
14150D0902234K984515M907080P223094J0239863J3683706J6396341J6695244
14143A13032077J3478832P867191J761032m389997j1065977j6187723j8206529
14136H6288906j7004508j3830602j0386278p684355n655092m223442l235480k607328
14128B1661821k336447k025583j723095j526048j416167j392626j257277j023030
14120H961548q21937p81548p36490n77531n81524m38690k85634m07072k91306
$$ y = [80777704, 91966085, 109740272, 131460886, 151376671, 164706080, 170958560, 170429382, 160759655, 141214369, 115878556, 91257982, 72133231, 59075737, 50602707, 45238903, 41802212, 39688658, 38497726, 38111989, 38350922, 39233423, 40902234, 43886749, 48793829, 56016923, 66256786, 79940492, 96336833, 113032077, 126510909, 134378100, 136139132, 131749135, 120683158, 104495435, 86288906, 69284398, 55453796, 45067518, 37383163, 31728071, 27504629, 24269149, 21661821, 19325374, 17299791, 15576696, 14050648, 12634481, 11241855, 9984578, 8961548, 8139611, 7358063, 6621573, 6044042, 5462518, 5023828, 4738194, 4331122, 4039816]
14111D039816j86919k04224k30181l00113j77925j61184j04926r8131j29716j69676
14101B276821j04906j68216q8557q3066j61542R775O0608K5559p2653j51154j20058
14090A422611r8497p4938j08285j6246j4018m7634m6127M0801J3319l0393p4068
14079I66525p5163o316Q840p8306k619m4888o9000m5281j12816q0904O6757Q8991
14067F15820L0018L0556j58800j42517J4633n0429n7415j7609j2851J9582R949
14056B80937j11855n2403o1691j25034m8693j7846m9549M4595J34362J2212j27129
14045a22094k423Q3441m1945J0683J12072L0007N4178o651o7424j7752N1446o1068
14033B2470l9265l9756m1892l3239j06678p7446o5982q8500n4956P3208L5169
$$ y = [4039816, 3852897, 3648673, 3418492, 3118379, 2940454, 2779270, 2674344, 2576213, 2446497, 2276821, 2171915, 2003699, 1915142, 1832076, 1670534, 1680309, 1740917, 1766476, 1693823, 1542669, 1422611, 1324114, 1249176, 1140891, 1124645, 1110627, 1062993, 1016866, 1057667, 1070986, 1040593, 966525, 891362, 885046, 893886, 815580, 812961, 768073, 699073, 653792, 540976, 460072, 526829, 615820, 645838, 676394, 517594, 375077, 389710, 339281, 281866, 264257, 251406, 270988, 280937, 169082, 116679, 54988, -70046, -118739, -136585, -186134, -141539, -7177, 5035, -122094, -124517, -41076, -83021, -72338, 39734, 69741, 123919, 117268, 49844, 32092, 83538, 22470, -16795, -56551, -98443, -131682, -238360, -315806, -381788, -470288, -525244, -452036, -416867]
14022d16867R0393J35304l9503q9944N5166N1166k5895q8083n1304j66970j25977
14011f72514J37770M9641K9028P459N5264J24647P0647m5219K9590k7951P5201
14000a66437Q3902l3878o6774O421l3775k3944j0700r4264J9101Q4169m984o1931
13988c03094j2500L9327l228r7041j35034m0196l3539L3129M3142J48554J5095
13977c45385k7366L0744j0053J86982J53327j5516K1474J7708k1813K0782p205
13966C679q9916r1954m8220o1666l9349O7171J2584J00303m5502m792P7719O3253
13954e6690P9346m0754m0200j4339p3845m2129K30262n1456o1606l621Q8852l159
13942A0661O8571o603o7927R8947P1669Q4727J164L5204J0767M531j08816n0274
$$ y = [-416867, -326474, -191170, -230673, -320617, -265451, -214285, -240180, -328263, -379567, -546537, -672514, -534744, -485103, -456075, -448616, -393352, -268705, -198058, -243277, -213687, -241638, -166437, -82535, -116413, -183187, -176766, -210541, -234485, -245185, -339449, -320348, -236179, -241163, -303094, -315594, -276267, -279495, -376536, -511570, -551766, -585305, -552176, -509034, -360480, -345385, -372751, -342007, -352060, -165078, -11751, -27267, -5793, 11915, -9898, 10884, 3679, -86237, -178191, -226411, -288077, -327426, -260255, -247671, -147368, -192870, -197662, -119943, -56690, 22656, -18098, -58298, -72637, -146482, -188611, 41651, -9805, -71411, -75032, 13820, 10661, 79232, 72629, 4702, 103649, 175318, 260045, 261209, 296413, 307180, 311711, 202895, 152621]
13930A52621N6768J4820m1745j5582J37646N327k8918j49553J7171o2813j47922
13919f2180J21037Q9676m0594o9813R0125P3754J2725j05601n6034J6177Q6112
13908A55384o6218j58J16082K2294q3382L720J9489j00008m1687N2309k980K2801
13896I7646Q8612n869k153J5983N1348L0218j06963R430L0050p839O316J2129
13884B18908n0409k0209j9676N189r8589K1096P5547n9271l2885J11346L6153
13873A87200j35885q4550p6731J33610M0474K259r1380j0450O764M9173J02685
13862A23169j4596j24670o8751J00657N4473K8514M6024M8741Q667o1922o5321
13851G4985q5625q1277r0520P7555J79251P6115k193j4728m7683p5359M332M4412
$$ y = [152621, 209389, 224209, 182464, 166882, 304528, 309855, 280937, 131384, 148555, 85742, -62180, 58857, 148533, 107939, 38126, 128251, 202005, 214730, 109129, 53095, 69272, 155384, 89166, 89008, 205090, 227384, 144002, 147722, 167211, 67203, 25516, 77825, 74845, 97646, 186258, 180389, 178236, 194219, 245567, 275785, 168822, 178252, 208302, 200463, 206779, 218908, 168499, 148290, 128614, 133803, 35214, 56310, 131857, 72586, 39701, 151047, 187200, 51315, -33235, -109966, 23644, 64118, 66377, -25003, -35453, -28689, 20484, 123169, 108573, -16097, -84848, 15809, 70282, 98796, 144820, 193561, 202228, 140306, 74985, -10640, -91917, -182437, -104882, 74369, 150484, 148291, 133563, 85880, 10521, 14853, 59265]
13839E9265r6677m945R465k0799K7291p9765k8265n6498P511K4758J34971m970
13827b8658o9542r2049J9618J02682K7621M8546r0432P1m8871K0965Q2709j017
13815b8357l781L8434j1663l817M212r2935k1326Q4399K0382j1004m329q0234
13803a10019p2778M7659N1916k312M662K1140P6431k0365L9695q646q338q209
13791A0836Q1511q3530j03400J4005Q9232J45802m3080j18059N4762J9529p7429
13780i821j0421j5467J0086m4532p584N0506J28102J7568q0764j07313j0364l9591
13768a19595J68922L6829m4244m0726P54k2117O050o2061O6459P7877L3590j16139
13756a4401k85076K2260Q2312M7812R0159k9525P8487k9551j12316K4185J09584
$$ y = [59265, -37412, -42357, -32892, -53691, -26400, -106165, -134430, -190928, -183417, -158659, -23688, -28658, -98200, -190249, -170631, -67949, -40328, 8218, -82214, -82143, -131014, -110049, -27340, -28357, -32138, 6296, -5367, -9184, -4972, -97907, -119233, -34834, -14452, -25456, -29785, -110019, -182797, -135138, -83222, -85534, -80872, -59732, 16699, -3666, 36029, 27383, 19045, 10836, 92347, 8817, -94583, -80578, 8654, 154456, 111376, -6683, 48079, 67608, -9821, -20242, -35709, -25623, -70155, -77739, -27233, 100869, 118437, 37673, -69640, -80004, -119595, 49327, 86156, 41912, 1186, 1940, -20177, -14127, -76188, -9729, 68148, 101738, -14401, -299477, -277217, -194905, -147093, -56934, -86459, -7972, -37523, -149839, -125654, -16070]
13745a6070M0484O4745r3627O4898J79369r2460n2648Q9482p877P3840J0860J99781
13733D60777J33839K4292M742R6711J26480j31498m5276j02504j31726M54j19940
13722C16351j13612r8891n8939J0441J3641Q6345J09190Q7903J8053l2178j4045
13711C24259m222l9108k6142O3232J50709P8539J01317P4831K6487j23910j52678
13700D73314p4626Q9984K8983q8699j0712k551M1354P3811J33812J51590J42044
13689I58304J2838j00069k22571p7398m7729L2156j37271j21454n7303q6962J04459
13678B57000L3907j29038n4494M4522M5269M0681l9722J21379Q370K5306j5818
13667C37362l4111Q0604J57096Q6500O5936J3021N0339o2132k09763j34382m7416
$$ y = [-16070, 24414, 89159, -4468, 60430, 239799, 147339, 94691, 184173, 176296, 250136, 260996, 460777, 594616, 618908, 623650, 720361, 846841, 715343, 670067, 567563, 435837, 436291, 316351, 202739, 103848, 44909, 55350, 68991, 155336, 264526, 352429, 370482, 338304, 324259, 320037, 280929, 254787, 318019, 468728, 547267, 648584, 723415, 749902, 625992, 473314, 398688, 488672, 517655, 428956, 418244, 415693, 457047, 530858, 664670, 816260, 958304, 971142, 871073, 648502, 571104, 523375, 555531, 418260, 296806, 239503, 152541, 257000, 290907, 161869, 107375, 151897, 197166, 237847, 198125, 319504, 327874, 353180, 337362, 303251, 383855, 540951, 627451, 693387, 706408, 756747, 694615, 484852, 350470, 303054]
13656C03054r561q8258n1311j22833p862R1423Q3975m8553J4069l8776o4214L371
13644F4524q1047o4926O5957N1271j24980K8258k2217O5000q196l5379P4510L154
13632A5929r7165j01273M9300J23489N7046o5085n8314k3050J40481J49660q5396
13621A05622j3645N6061O4198q6715p1311n6900l295k7969L9801o1807p5992M4560
13609h7392k452J31779R3138k4615j07163j04463R5209N4534l5830M167l7703
13598b0791Q7978L4091k646K4298M3720m5839j30207k8419R0788M0128l8357o2744
13586h000l1740P1205q1883r2669K514k3180K8523J04890J2062n6603p9998M2613
13574a12266j4861n5704M9806O1679N7770N4641l796N326Q6667L3582o2549n187
$$ y = [303054, 293493, 205235, 153924, 31091, 23229, 114652, 198627, 150074, 164143, 125367, 61153, 64524, -16523, -81449, -15492, 35779, -89201, -60943, -83160, -18160, -26356, -61735, 12775, 15929, -81236, -182509, -133209, -9720, 47326, -17759, -76073, -99123, 41358, 191018, 105622, 91977, 148038, 212236, 125521, 54210, -2690, -5985, -33954, 5847, -55960, -131952, -87392, -89844, 41935, 135073, 110458, 3295, -101168, -5959, 48575, 12745, 16912, -20791, 67187, 101278, 98632, 122930, 166650, 120811, -9396, -37815, 52973, 93101, 54744, -8000, -39740, 31465, -50418, -143087, -140573, -163753, -135230, -30340, -18278, -74881, -154879, -112266, -127127, -182831, -133025, -71346, -13576, 41065, 37269, 42595, 129262, 162844, 100295, 95108]
13562I5108P2428l3501n1597o6752M8619L2266P1107n5658o0424L2730m1128l4812
13550H386o237J1673J25631J26269J34167m3813o1304q6547n2707Q9468k4923
13539B20063L924N3437k4413r934j5825j10673j02725r5043L3293P7615Q8652
13528A18371p7684K5963k13j10649p9401j195M7910J12614m1575j664L6760O099
13516C5336j555j0042Q4621k4268J4685n6826o0731j2585M4275J509L4980J33489
13504A82888r0939j31147j4533l9075r0593L3531N0712l0326K3326R8042k1704
13493b9818l6764q0511P6133J09641r284J6621Q0268l6389m1401q3131j3767n1051
13481i9453J3822O6745K9743l7467j34347j6737j5954O0381J1298Q9901K1122
$$ y = [95108, 167536, 134035, 82438, 15686, 64305, 96571, 167678, 112020, 51596, 84326, 43198, 8386, 2149, 13822, 139453, 265722, 399889, 356076, 294772, 208225, 155518, 244986, 220063, 223987, 277424, 253011, 243077, 227252, 116579, 13854, -81189, -47896, 29719, 118371, 40687, 66650, 66437, -44212, -123613, -124808, -76898, 35716, -5859, -7523, 29237, 35336, 33781, 23739, 108360, 84092, 98777, 41951, -18780, -31365, 12910, 14419, 49399, 182888, 91949, -39198, -53731, -92806, -183399, -149868, -99156, -129482, -106156, -8114, -29818, -66582, -147093, -70960, 38681, 29397, 46018, 126286, 89897, 48496, -34635, -48402, -99453, -85631, -18886, 10857, -26610, -160957, -177694, -193648, -133267, -121969, -32068, -10946]
13470a0946l1478O6327K9218q8753L9806l9874O7477K6265m2533J2351N8879j01796
13458a5057j54443o7385L5889N3279J22220L0372M7642j6035Q0276J4089j42272
13447a1425m6675J353Q9717j5702j02346K3134J28172P6281n5064j41827j57457
13436b11839L3737R4759L4689m4207j06912M7553Q8474J5728K6587M6266Q781
13425C3616k7146l3348J7873K2966M1111M1723j81917m4425J23917P2664O477
13414G3511l8740k1935r3040P5033m0950j05137R1866R1213r0634m731k4764J284
13402h7024L7437l8563o912J41067Q5502J8070j6316o2935m2762m5068j0713J33601
13390A05384R6019k3824p4246p690j10556O121Q3358O0891m9168o71j6656M4557
$$ y = [-10946, -42424, 23903, 53121, -35632, 4174, -35700, 31777, 58042, 15509, 27860, 86739, -15057, -169500, -236885, -200996, -147717, -25497, 4875, 52517, 36482, 116758, 130847, -11425, -58100, -56747, 32970, 17268, -85078, -61944, 66228, 142509, 87445, -54382, -211839, -178102, -83343, -48654, -92861, -199773, -152220, -63746, -48018, -21431, 24835, 33616, 6470, -26878, -9005, 13961, 55072, 96795, -85122, -129547, -5630, 67034, 73511, 34771, 12836, -80204, -5171, -46121, -151258, -59392, 31821, -58813, -63544, -88308, -87024, -49587, -88150, -95062, 46005, 131507, 149577, 133261, 70326, 27564, -17504, -28217, 105384, 201403, 177579, 103333, 95643, -14913, -8792, 74566, 135457, 86289, 85618, 68962, 113519]
13378A13519O5141j526L21j5893k0259l2868l7045l3018M4176l0640p0545o5218
13366h3855P5542M0429j1358n6692k1958N4341n7556P991M8627N61n452J5331
13354E951P5222o0540N3979K880N5573k8324n5107r171j0715P9074N7218K2306
13342A88346m5416j41288L2213j482J1384N9998p5051o4949O5987K9195r8813
13331c9876K388J05484J25748r7763m5054L8382n8506N768N7162O2537R314j2803
13319A52781P9763k9096N896o4816j1930j9832p2531m4080J5112N503r7183O6003
13307a4410P8752R9043o8952q2204j6217R3801k664p1643j26022O6732O1638j28882
13295a11028k6745j8714Q4314Q6968L5692M5477k4610q6539J3001P7294j8196
$$ y = [113519, 178660, 177134, 177455, 161562, 141303, 108435, 71390, 38372, 82548, 51908, -18637, -83855, -8313, 32116, 20758, -35934, -57892, -3551, -61107, -53116, -4489, -3928, -9380, 5951, 81173, 20633, 74612, 77492, 133065, 104741, 49634, 40463, 29748, 108822, 166040, 188346, 142930, 1642, 33855, 32373, 43757, 103755, 28704, -36245, 29742, 58937, -39876, -37488, 67996, 193744, 95981, 50927, 89309, 30803, 36571, 93733, 156270, 165584, 152781, 232544, 203448, 209344, 144528, 132598, 112766, 40235, -3845, 11267, 16770, -80413, -14410, 64342, 163385, 94433, 12229, -3988, 89813, 87149, 15506, -110516, -43784, 17854, -111028, -137773, -156487, -72173, 14795, 50487, 95964, 71354, -15185, -2184, 75110, 56914]
13284E6914N5711k3885p8932o4248J963M5349J3603M0662r3307m6501R7167j00646
13272i6150o2228l883Q5599M7624Q3765k8015r4584m4613J7643M0499L7006J4314
13260c023P3668Q9714m7923m5218l2168M9778j1049j5278K7793R0938M4232r223
13248B12241n9380l3447J4533j7249L8531n4840N3715m1234r8356j4030K3120
13237B3604L9772K999N0107R0912k1953q1736j33161k3088Q3414J32419j4299
13226A48990k5778j54952m5906j17617k328J86121Q9130M8594P787p3078q7121
13215b6158M5387L1794m8471m0848m9541r0395J974J22976J33723j1899k04697
13204a36155M551M3303O1184O5559L7256j77127q5939Q4165Q0199j02766m5417
$$ y = [56914, 112625, 88740, 9808, -54440, -52477, -7128, 6475, 47137, -46170, -92671, 4496, -96150, -158378, -162261, -76662, -29038, 54727, 26712, -67872, -112485, -94842, -54343, -17337, -3023, 70645, 160359, 112436, 67218, 35050, 84828, 73779, 58501, 86294, 177232, 221464, 212241, 152861, 119414, 133947, 116698, 155229, 100389, 154104, 112870, 14514, 484, 23604, 63376, 66375, 116482, 207394, 185441, 103705, -29456, -52544, 30870, 163289, 148990, 123212, -31740, -77646, -195263, -197591, -11470, 77660, 126254, 134041, 60963, -26158, 19229, 51023, 2552, -38296, -87837, -178232, -176258, -53282, 80441, 68542, -136155, -131604, -88301, -27117, 38442, 75698, -101429, -187368, -103203, -23004, -125770, -171187]
13193a71187R3794J01305P1987k5640q2349n953O0748M1487J9342j1786J7140
13182A08888M7791m0733o5907j5470m0720l5659j9757J1341Q1978n1245p0746
13171i0239j45353j8812J16402R129p721l1491M7403M2916N7936k4786P1818J27752
13159A54954Q3985L2944j08936o0787L3970Q0924L4974j14142M0197n5704l3535
13148H8844K8546q445k2244J45408K0620o0671m1158N0352M0492p7397p0886J01762
13136A95223M167l1638K4362K5097p5914m0614o0090N7254L071K1810P1932R611
13124B04271n7172o7742m473m6153o4188j4146k6134n6687j7295L8870N9331l130
13112e4648J16334l5475r0247M1409Q7877j4617r9262j8820P585O843j754J43824
$$ y = [-171187, -77393, 23912, 95899, 70259, -12090, -18043, 42705, 84192, 103534, 91748, 108888, 156679, 115946, 50039, 34569, -6151, -41810, -61567, -50226, 31752, -19493, -90239, -235592, -254404, -138002, -128873, -136594, -168085, -120682, -77766, -19830, -44616, 27202, 154954, 238939, 271883, 162947, 102160, 136130, 217054, 252028, 137886, 178083, 122379, 88844, 117390, 108945, 86701, 232109, 252729, 192058, 150900, 201252, 241744, 164347, 93461, 195223, 199390, 167752, 192114, 217211, 141297, 100683, 40593, 97847, 100918, 122728, 194660, 204271, 147099, 79357, 74884, 28731, -35457, -49603, -75737, -132424, -149719, -110849, -51518, -54648, 61686, 26211, -64036, -22627, 65250, 50633, -48629, -67449, -59864, -53021, -54775, 89049]
13100H9049M7119j01789M7698L5015j592n07N7843n9695r7421P9517L4258n0982
13088G8513j37116K5855p6994r142j3410k7127k3113N7801J43861k879l0356J7207
13076C100J3172k9535M7836P757n3074n4638l125J18766N7991Q881j58574J8940
13064b2503P9721M45j00634j1882J0289r3096J9431J20925K2481m0922l9871L9139
13052a6477J18458Q1341J05794J09138n3036j30918j47489l6086Q4284J54687
13042B69696k6821n5804j86042n1229N5055n016O4112O6017Q9782N7468p7368
13031A99850r5742p3531K3077M8647m2687p236k4461n0092J09462m1121K8155
13020G4321p8542J5935o568q7863L0193K4930m1619o7222O5904N6092k3826M6016
$$ y = [89049, 136168, 34379, 82077, 117092, 115500, 114993, 172836, 113141, 15720, 95237, 129495, 78513, -58603, -32748, -109742, -118884, -132294, -159421, -182534, -124733, 19128, 16249, -14107, 3100, 16272, -13263, 34573, 42330, -10744, -65382, -68507, 50259, 108250, 117131, -41443, -22503, 57218, 57663, -42971, -54853, -44564, -137660, -118229, 2696, 25177, -15745, -55616, -16477, 101981, 183322, 289116, 398254, 345218, 214300, 66811, 30725, 115009, 269696, 242875, 187071, 1029, -50200, 4855, -161, 63951, 129968, 219750, 277218, 199850, 104108, 30577, 53654, 102301, 59614, 52378, 27917, -22175, 87287, 46166, 74321, -4221, 11714, 5146, -82717, -52524, -27594, -69213, -136435, -70531, -14439, -38265, 7751]
13008G751M7899k2743n4462n7907N8957L6876O2591L3509L1866q3441o2433o6532
12996f8069O5712l023o1445k6562J6215J79540J8296n0823n8498P6751Q7566m1218
12984A34442J834K139k7040n1785L9431o5249L3052M6813j5073k8540o1207L6053
12972D4870L8362P2007j21232P863M6668J11555O2l3293k4967j8259k4791o6029
12960C2816p317L5528K1465o9688P1770j3679j41435k6294J1109P6512M4243R334
12948D4364l7789J5031J21423r4086O1456O0991L8064j00781j27934J00903P1275
12937A52917K1154n5636j42855J0746N1419L5505L6348p1195M1103L0094L5760
12926A45360K1480j1711m5697p8883l0160J19779J12576R649l7139l3624q8841
$$ y = [7751, 55650, 32907, -21555, -79462, -20505, 16371, 78962, 112471, 144337, 60896, -1537, -68069, -2357, -5380, -66825, -93387, -77172, 102368, 120664, 69841, 11343, 88094, 175660, 134442, 136276, 138415, 111375, 59590, 99021, 33772, 66824, 113637, 98564, 70024, 8817, 44870, 83232, 155239, 34007, 41870, 88538, 200093, 200155, 166862, 141895, 123636, 98845, 32816, 25499, 61027, 82492, 12804, 84574, 70895, -70540, -96834, -85725, -9213, 35030, 44364, 6575, 21606, 143029, 48943, 110399, 171390, 209454, 108673, -19261, 81642, 152917, 174071, 118435, -24420, -13674, 37745, 73250, 109598, 38403, 79506, 109600, 145360, 166840, 155129, 109432, 30549, 389, 120168, 232744, 242393, 205254, 171630, 82789]
12915H2789l545L3129R8085j1183j17290n4078O6713J16109J5286j20584j07105
12904a674L7079r618K1578K0178J5401n4266J83524O7326L9707k0080j35183o8286
12892I5686j9983l2201k6292k2940N9697R1664o841q4997o0023o2869K8516P3447
12880C2864R4507O643j3343L6293k0278j6533j6942r0347r6122J24437O0889m0866
12868F1202K1954K3063k8291n6788J26033j01380j9161j25529n5309J5860N0159
12857h8187Q4721J10508K7966q1566j02248M8011J22512J7265j10193j02738K4941
12846d9008P2592p872P7746n1534j9755J15457j196p6772q7010J14008M7983k7854
12834A06785O4789M6735j29938L8857J19451P0434j09184p3440R208n4139r545
$$ y = [82789, 79244, 112373, 210458, 199275, 81985, 27907, 94620, 210729, 226015, 105431, -1674, 35405, 25787, 47365, 67543, 82944, 28678, 212202, 279528, 319235, 299155, 163972, 95686, 75703, 43502, 17210, -5730, 53967, 145631, 138790, 53793, -6230, -69099, -40583, 32864, 127371, 134014, 120671, 156964, 136686, 120153, 103211, 12864, -83258, 41179, 102068, 61202, 83156, 106219, 77928, 21140, 147173, 45793, 26632, -98897, -154206, -138346, -88187, -3466, 107042, 135008, 53442, -48806, -795, 121717, 138982, 28789, -73949, -49008, 23584, 15712, 93458, 41924, 22169, 137626, 136430, 59658, -27352, 86656, 134639, 106785, 171574, 218309, 88371, 127228, 246679, 317113, 207929, 134489, 143697, 89558, 80013]
12823H0013J6610M7480k3843J674K4586J4213j1295P799K7022Q949o5442j3506
12811A14260J15359J7066k8189M4821J2694j05312J859O863k9003o8715J4141
12800I5844K9322m663n4906m6518o6681N1018Q5043m8969M3394O2188N0567n9292
12788A36347l255r225j961K2m3041L0767Q8436N2418p3666o5864j9954r2761l8413
12775d0150N3757j3864m3204L3006M6004O2808n8386J3712J6367P6833l6565m5759
12763F4559M9806J31126N2542j04748m1547J7512J0548j12900j31445r2594J65990
12752H849P7157J9508J46104N0526O3968j02374j14811m1268l5736n2586R380
12741B8717R3276K6858k4923M1832K0223K3602k5792j69782p1557K1590J03213
$$ y = [80013, 96623, 144103, 120260, 121934, 146520, 160733, 149438, 157237, 184259, 193208, 127766, 114260, 229619, 246685, 218496, 263317, 276011, 170699, 172558, 179421, 150418, 81703, 95844, 125166, 120503, 65597, 19079, -47602, 3416, 88459, 39490, 82884, 145072, 195639, 136347, 133092, 123867, 121906, 121928, 78887, 109654, 198090, 250508, 176842, 110978, 91024, -1737, -40150, 13607, -257, -43461, -10455, 35549, 98357, 39971, 53683, 70050, 146883, 110318, 64559, 114365, 245491, 298033, 193285, 151738, 169250, 179798, 66898, -64547, -157141, 8849, 86006, 105514, 251618, 302144, 366112, 263738, 148927, 107659, 71923, 19337, 28717, 121993, 148851, 123928, 165760, 185983, 209585, 183793, 14011, -57546, -35956, 67257]
12730F7257j5723L8294M1337m5855p0201N55j3692J139N3464J38894R9599j04668
12718A90400J6638j43296j9027L5531o9274r2800l277J08893K9524R966j25773
12707f2495k4196L0099R99j6402j0344K3957J15308M7740K1097O143k7648K7278
12695A31536M9037k6177r920L3142O862Q9394q2940r5081L2546L6676j3577O8993
12683B20491R839J4782K0718p6429m3118L4410q1246k9267J02615l7410j2126
12672A23259O7219n3166M1720O5697M6487k8089J558r3483j5724k0746o8555j145
12660F5032m85K4679P2134M1330K8829o3336j23918j46985J33948J44024o8980
12649A06272m9200J32496Q5473o8388p3532l307n2664K9872M518P63o5409k8908
$$ y = [67257, 51534, 89828, 131165, 85310, 15109, 15664, 1972, 3111, 56575, 195469, 295068, 190400, 207038, 63742, 44715, 80246, 10972, -81828, -85105, 23788, 53312, 63278, -62495, -86691, -56592, -55593, -71995, -82339, -58382, 56926, 104666, 125763, 131906, 104258, 131536, 180573, 154396, 144476, 177618, 184480, 273874, 190934, 95853, 128399, 165075, 151498, 220491, 230330, 245112, 265830, 189401, 146283, 180693, 99447, 70180, 172795, 135385, 123259, 190478, 137312, 179032, 244729, 291216, 263127, 264685, 171202, 155478, 134732, 66177, 65032, 64547, 89226, 161360, 202690, 231519, 168183, 44265, -102720, 31228, 175252, 106272, 57072, 189568, 275041, 206653, 133121, 129814, 77150, 107022, 111540, 112303, 46894, 17986]
12637A7986q0038q8495N3888J63942J24434M7932n4354j468M3762O2876J16663
12626D07128l0075M713j75683q0951J14996o3025j3355k9101j8537m0395R6116
12615A71831L8006q1089j27922L8310J0304k908M4050m7884k8248P6736J1459
12604A02645Q2021O2776N6255J834j32933l4416J8755P0035P4870J11022o0629
12593C52235m6543j20937o1172j4079N091O2147J23360K2295p5939Q56o3508J7170
12581B00976J51274J12155N301L0389N0o0298q4142k4614k8477j4365l4551k3419
12569B30279k6254m9442N0669N0857N9389O8073L2687j3171j41150j9608N1226
12558B93555j36097j17281o764N5006r3397R164M9131L776R3384k5184O314M5031
$$ y = [17986, -62052, -150547, -96659, 67283, 191717, 239649, 185295, 183827, 227589, 290465, 407128, 377053, 381766, 206083, 125132, 240128, 177103, 163748, 134647, 116110, 75715, 171831, 209837, 128748, 826, 39136, 49440, 46532, 90582, 42698, 14450, 91186, 102645, 184666, 247442, 303697, 305531, 172598, 138182, 156937, 226972, 301842, 412864, 352235, 305692, 184755, 123583, 109504, 114595, 176742, 300102, 322397, 246458, 247314, 183806, 200976, 352250, 464405, 469706, 500095, 500145, 439847, 355705, 331091, 302614, 288249, 253698, 230279, 204025, 154583, 205252, 256109, 315498, 383571, 416258, 403087, 261937, 242329, 293555, 157458, 40177, 33413, 88419, -4978, 4186, 53317, 57093, 150477, 125293, 131607, 176638]
12546A76638n709p8285K2538R8397J1358o8224M176n9140P3542R2242l3088j0299
12534B24146m4075K5636N7842O6336k8066Q0621J5365M1716q0465p7783k6197
12523B55076n4747j05368M9381o832m3167k7883M6945O0728N7525K2635o3611
12512A90682j26072K9181P7280K4484K1496n2816j07948p5656M0985O5906L2829
12501A20351n1315o1976j12449l2149J46594J62526N9936r9897j5889N472k0259
12490A00945K832O8263K4954Q4733J1659L2232O3919m7813j13482p4308k7310
12479A26624Q0645J29270J3350L6948J8840K12535K44107R8771K8296j25427k50128
12468F13831j87869K9961r709j1354j6810r8078j20274J5304J08252L9717l6818
$$ y = [176638, 170929, 92644, 115182, 213579, 224937, 156713, 160889, 101749, 175291, 267533, 234445, 224146, 180071, 205707, 263549, 329885, 301819, 382440, 397805, 439521, 359056, 281273, 255076, 200329, 94961, 144342, 137510, 94343, 66460, 113405, 174133, 231658, 254293, 190682, 64610, 93791, 171071, 195555, 217051, 164235, 56287, -19369, 21616, 87522, 120351, 69036, 7060, -105389, -137538, 9056, 171582, 231518, 131621, 115732, 121204, 100945, 103777, 172040, 196994, 281727, 293386, 325618, 389537, 341724, 228242, 153934, 126624, 207269, 336539, 349889, 386837, 405677, 618212, 862319, 961090, 989386, 863959, 613831, 425962, 455923, 446214, 434860, 418050, 319972, 199698, 215002, 323254, 362971, 326153]
12457C26153m1775K3500N1414R9870M9117l4229l8560J4190l5350M7272M2614
12446E04216l9386N6939j4661l4004M107m7087k2102l3358J8753P3884M9448m901
12434E11848l5930r5408J9221M8055M9846l8819j71706K2807O8112n322n1210
12423C21494k8908L7470N25j8284k8720o483K6262m3817O3255M4533m382j1976
12411C50969k047O5292K14581j11876q3006J9631J12776p242p9407q1315l4596
12400C63760L9568m0006m634J1024N0992M9049l6930n2869q5324p1062J7976M21
12388B41965o5455m052J2993M1326Q4943J44913k5324k3025O9078o3170k6922
12377C87270r5365m2297o3918M279q8455O4497O4833L5099j1704J21210l3439
$$ y = [326153, 284378, 307878, 359292, 459162, 508279, 474050, 435490, 449680, 414330, 461602, 504216, 464830, 521769, 507108, 473104, 477211, 430124, 408022, 374664, 393417, 467301, 516749, 511848, 475918, 380510, 399731, 447786, 497632, 458813, 287107, 309914, 378026, 372704, 321494, 292586, 330056, 330581, 312297, 283577, 277094, 303356, 259539, 322794, 367327, 362945, 350969, 348922, 414214, 628795, 516919, 433913, 453544, 566320, 559078, 479671, 398356, 363760, 403328, 363322, 358688, 369712, 420704, 469753, 432823, 379954, 294630, 223568, 241544, 241965, 176510, 172458, 185451, 226777, 311720, 456633, 431309, 408284, 477362, 414192, 387270, 291905, 249608, 185690, 189969, 101514, 166011, 230844, 265943, 254239, 375449, 342010]
12366C42010J6809J2952q1535J71121N1366n3430k0039k1540j42073J02179O5178
12355D42998L2535m5391j2250Q9670K9157J475p431r4877l1747J6467k7060O6052
12343D59598k7906j0776m8115O1313K9312N05n6832n7718m3088q191J9536J08395
12331D26033o123p6889p2470J12532J3003P0380L7185J9577M964J518l0631p4522
12319D24557R584N1548K8770j09534q1764J02469m4278K219K3055q1525j26362
12308A98739q98J49094J19165M4505j3103J2484J12297J8077p4287q8997K3176
12297E00252O5622P9366L8690K6299p1859j45208j38491k0010J6551J14009Q9993
12286E55214n9646J01198N0057l4014p2980j20684m3343J12708M8671l2610j14910
$$ y = [342010, 358819, 371771, 290236, 461357, 512723, 459293, 439254, 417714, 275641, 377820, 442998, 475533, 430142, 417892, 507562, 536719, 538194, 530763, 435886, 404139, 420606, 393546, 459598, 431692, 420916, 372801, 434114, 463426, 463931, 407099, 349381, 306293, 298102, 317638, 426033, 419910, 343021, 270551, 383083, 396086, 466466, 503651, 523228, 528192, 529710, 499079, 424557, 434141, 485689, 514459, 404925, 323161, 425630, 381352, 383571, 406626, 325101, 198739, 197841, 346935, 466100, 510605, 497502, 509986, 622283, 640360, 566073, 477076, 500252, 565874, 645240, 683930, 710229, 638370, 493162, 354671, 334661, 351212, 465221, 555214, 495568, 596766, 646823, 612809, 539829, 419145, 375802, 488510, 537181, 504571, 389661]
12275C89661j02347J40341K7965K918j0701l693k7770L0921K2162l4868q2427
12264C52162R6779j2777P8289L4658L7662L1080p6296J11487Q38p285K307q0207
12252E68697j52126M583L5942N6000M1993R2090K1741l5169p283J01548n8315
12241F69701j28677j00611M6501J63193n0266q1996m6786K9034P7693J867Q1828
12230F61481j0521j1664j17460J6987j1893o451J35340J05586m0071p3115O085
12219F54304r2064j54730j2876N7368J17133J34884j04028m8430Q3886K7200j1943
12208F50704p6178k7474J7728Q0641N6281O5512J03788M2939q3299k4240k2118
12197G84284O6349k9293K0945J01848R656j40773j351P121o384J0241J6249m7096
$$ y = [389661, 287314, 427655, 455620, 458538, 447837, 444144, 416374, 447295, 469457, 434589, 352162, 448941, 436164, 514453, 549111, 586773, 617853, 541557, 653044, 653882, 646597, 648904, 568697, 416571, 421154, 457096, 513096, 555089, 647179, 668920, 633751, 626468, 728016, 669701, 541024, 440413, 486914, 650107, 599841, 517845, 471059, 500093, 577786, 579653, 661481, 650960, 639296, 521836, 538823, 526930, 520479, 655819, 761405, 721334, 648219, 654304, 562240, 407510, 394634, 452002, 569135, 704019, 599991, 551561, 635447, 662647, 650704, 574526, 547052, 564780, 645421, 701702, 767214, 871002, 913941, 830642, 806402, 784284, 850633, 821340, 842285, 944133, 953789, 813016, 811665, 818786, 812402, 822643, 838892, 791796]
12185G91796q2662K5699N3409J24514Q6917j08722j13502M1378N5959J14957J6759
12174A006502N804R1975n702p4198K5132p9946l2331J5423l7098Q4248J22951
12163A122760n3349R4807N7116k0046l2722q920o529k5266j8512p2666o6341J38550
12151A108882R7451J1374q750Q8887j3711p1259J1348N0906n105j7455Q0786n6470
12139A276884j5874L0984L3459m4959m2646J04770K46555Q4894j19056k7579r671
12128A517761p8704l5367k6260L3766P7084j05463m2447J22043J11700k2466k8234
12117A523413J44241M9934L0192m4194J0146n4512J1225j4858l2204J50219n3508
12106A720094j13778Q1390J19356m3420r3399L8836o1106n1162J40354J51119
$$ y = [791796, 709134, 734833, 788242, 912756, 999673, 890951, 777449, 818827, 874786, 989743, 1006502, 1012306, 1104281, 1098579, 1024381, 1049513, 969567, 937236, 952659, 915561, 999809, 1122760, 1069411, 1164218, 1221334, 1201288, 1168566, 1159646, 1153117, 1127851, 1109339, 1036673, 970332, 1108882, 1206333, 1217707, 1208957, 1297844, 1284133, 1212874, 1224222, 1275128, 1270023, 1252568, 1333354, 1276884, 1261010, 1291994, 1325453, 1280494, 1237848, 1342618, 1589173, 1674067, 1555011, 1527432, 1517761, 1439057, 1403690, 1377430, 1411196, 1488280, 1382817, 1340370, 1462413, 1574113, 1551647, 1523413, 1667654, 1717588, 1747780, 1703586, 1713732, 1659220, 1670445, 1655587, 1623383, 1773602, 1720094, 1606316, 1687706, 1807062, 1763642, 1670243, 1709079, 1647973, 1596811, 1737165, 1888284]
12096A888284K8334o6279P9620L9490N3392N557l5434K6599J18233Q215k7496
12085B118515j04396j9092L8046N0030L7640K2828K0449J10844J05068L1026L0598
12074B441556q9456m0208N1951N6273J18256j3393l8710L3235J07884j8471p6018
12063B532899K3640R1098J6241k7768P5357J52534k0906j15370K5550K14570N6866
12052C024711k8906N566P2894N5722N3280L7747Q1009N301R1005J11975J24100
$$ y = [1888284, 1916618, 1850339, 1929959, 1969449, 2022841, 2028398, 1992964, 2019563, 2137796, 2146011, 2118515, 2014119, 1995027, 2033073, 2083103, 2120743, 2143571, 2164020, 2274864, 2379932, 2410958, 2441556, 2352100, 2311892, 2363843, 2420116, 2538372, 2524979, 2486269, 2519504, 2627388, 2608917, 2532899, 2556539, 2647637, 2663878, 2636110, 2711467, 2864001, 2843095, 2727725, 2753275, 2967845, 3024711, 2995805, 3001371, 3074265, 3129987, 3183267, 3221014, 3302023, 3307324, 3398329, 3510304, 3634404]
$$ [...]
##END NTUPLES=NMR SPECTRUM
##END=
