##TITLE=Analysis number 317572
Compound Code rjc 01494
Project Code qc-cat
Chemist Name aldrich
##JCAMPDX= 6.0         $$ Bruker NMR JCAMP-DX V2.0
##DATA TYPE= NMR SPECTRUM
##DATA CLASS= NTUPLES
##ORIGIN= Bruker BioSpin GmbH
##OWNER= nmr
$$ XWIN-NMR		Version 3.5
$$ Fri Feb 24 08:31:34 2006 GMT Standard Time (UT+0h)  MAYBRIDGE\nmr@NMR_250MHZ
##.OBSERVE FREQUENCY= 250.131544655141
##.OBSERVE NUCLEUS= ^1H
##.ACQUISITION MODE= SIMULTANEOUS (DQD)
##.ACQUISITION SCHEME= undefined
##.AVERAGES= 16
##.DIGITISER RES= 18
##SPECTROMETER/DATA SYSTEM= dpx250
##.PULSE SEQUENCE= zg30
##.SOLVENT NAME= DMSO
##.SHIFT REFERENCE= (INTERNAL, DMSO, 0, 16.522)
##AUDIT TRAIL= $$ (NUMBER, WHEN, WHO, WHERE, WHAT)
$$ ##TITLE= Audit trail, XWIN-NMR		Version 3.5
$$ ##JCAMPDX= 5.01
$$ ##ORIGIN= Bruker BioSpin GmbH
$$ ##OWNER= nmr
$$ C:\u/data/dgb/nmr/ADRS/16790/pdata/1/auditp.txt
$$ ##AUDIT TRAIL=  $$ (NUMBER, WHEN, WHO, WHERE, WHAT)
(   1,<2006-02-24 08:31:05.26 +000>,<MAYBRIDGE\nmr>,<NMR_250MHZ>,
      <created by zg, POWCHK disabled, PULCHK disabled
       configuration hash MD5:
       84 BC 41 DB A1 6E 1D 46 DA 25 12 A5 C1 ED C5 3A
       data hash MD5: 64K
       FA 84 31 E9 96 BD 17 BD 4D 15 B6 26 6F 00 AC BF>)
(   2,<2006-02-24 08:31:21.98 +000>,<MAYBRIDGE\nmr>,<NMR_250MHZ>,
      <Start of raw data processing
       ef LB = 0.3 FT_mod = 6 PKNL = 1 SI = 32K 
       data hash MD5: 32K
       E4 DF 70 EB 8F 6D 10 D4 09 F9 37 81 FA F8 B0 97>)
(   3,<2006-02-24 08:31:23.79 +000>,<MAYBRIDGE\nmr>,<NMR_250MHZ>,
      <apk 
       data hash MD5: 32K
       98 C4 3A A5 26 79 95 B0 BA 78 99 2B 9C B5 FA F3>)
(   4,<2006-02-24 08:31:24.49 +000>,<MAYBRIDGE\nmr>,<NMR_250MHZ>,
      <abs ABSG = 5 
       data hash MD5: 32K
       2A 64 31 E6 15 B0 26 AA 92 11 52 B5 C1 7A F1 72>)
$$ ##END=
$$ 
$$ hash MD5
$$ 0C 5A 8E 1E 41 47 DF 01 3B 0C DE E6 81 42 87 D8
##$RELAX= 
##$RELAX= 
##$RELAX= 
##$RELAX= 
##$RELAX= 
##$RELAX= 
##$RELAX= 
$$ Bruker specific parameters
$$ --------------------------
##$DU= <C:\u>
##$EXPNO= 16790
##$NAME= <ADRS>
##$PROCNO= 1
##$TYPE= <nmr>
##$USER= <dgb>
##$AMP= (0..31)
100 100 100 100 100 100 100 100 100 100 100 100 100 100 100 100 100 100 
100 100 100 100 100 100 100 100 100 100 100 100 100 100 
##$AQSEQ= 0
##$AQ_mod= 3
##$AUNM= <au_zg>
##$AUTOPOS= <1 >
##$BF1= 250.13
##$BF2= 250.13
##$BF3= 250.13
##$BF4= 250.13
##$BF5= 500.13
##$BF6= 500.13
##$BF7= 500.13
##$BF8= 500.13
##$BYTORDA= 1
##$CFDGTYP= 0
##$CFRGTYP= 5
##$CHEMSTR= <none>
##$CNST= (0..31)
1 1 145 1 1 1 1 1 1 1 1 1 1 1 1 1 1 1 1 1 1 1 1 1 1 1 1 1 1 1 1 1 
##$CPDPRG= <>
##$CPDPRG1= <>
##$CPDPRG2= <>
##$CPDPRG3= <>
##$CPDPRG4= <mlev>
##$CPDPRG5= <mlev>
##$CPDPRG6= <mlev>
##$CPDPRG7= <mlev>
##$CPDPRG8= <mlev>
##$CPDPRGB= <>
##$CPDPRGT= <>
##$D= (0..31)
0 1 0 0 0 0 0 0 0 0.06 0 0 0 0 0 0 0.0002 0 0 0 0 0 0 0 0 0 0 0 0 0 0 
0 
##$DATE= 1140769863
##$DBL= (0..7)
120 120 120 120 120 120 120 120 
##$DBP= (0..7)
150 150 150 150 150 150 150 150 
##$DBP07= 0
##$DBPNAM0= <>
##$DBPNAM1= <>
##$DBPNAM2= <>
$$ [...]
##$SUBNAM7= <"">
##$SUBNAM8= <"">
##$SUBNAM9= <"">
##$SW= 20.6930455092707
##$SWIBOX= (0..15)
0 0 3 0 0 0 0 0 0 0 0 0 0 0 0 0 
##$SW_h= 5175.983436853
##$TD= 65536
##$TD0= 1
##$TE= 293.16
##$TE2= 300
##$TE3= 300
##$TEG= 300
##$TL= (0..7)
0 120 120 120 120 120 120 120 
##$TP= (0..7)
150 150 150 150 150 150 150 150 
##$TP07= 0
##$TPNAME0= <>
##$TPNAME1= <>
##$TPNAME2= <>
##$TPNAME3= <>
##$TPNAME4= <>
##$TPNAME5= <>
##$TPNAME6= <>
##$TPNAME7= <>
##$TPOAL= (0..7)
0.5 0.5 0.5 0.5 0.5 0.5 0.5 0.5 
##$TPOFFS= (0..7)
0 0 0 0 0 0 0 0 
##$TUNHIN= 0
##$TUNHOUT= 0
##$TUNXOUT= 0
##$USERA1= <user>
##$USERA2= <user>
##$USERA3= <user>
##$USERA4= <user>
##$USERA5= <user>
##$V9= 5
##$VALIST= <valist>
##$VCLIST= <CCCCCCCCCCCCCCC>
##$VD= 0
##$VDLIST= <DDDDDDDDDDDDDDD>
##$VPLIST= <PPPPPPPPPPPPPPP>
##$VTLIST= <TTTTTTTTTTTTTTT>
##$WBST= 1024
##$WBSW= 4
##$XGAIN= (0..3)
0 0 0 0 
##$XL= 0
##$YL= 0
##$YMAX_a= 537596
##$YMIN_a= -502683
##$ZGOPTNS= <>
##$ZL1= 120
##$ZL2= 120
##$ZL3= 120
##$ZL4= 120
##$ABSF1= 16.522
##$ABSF2= -4.171173
##$ABSG= 5
##$ABSL= 3
##$ALPHA= 0
##$AQORDER= 0
##$ASSFAC= 0
##$ASSFACI= 0
##$ASSFACX= 0
##$ASSWID= 0
##$AUNMP= <proc_1d>
##$AZFE= 0.1
##$AZFW= 0.1
##$BCFW= 0
##$BC_mod= 0
##$BYTORDP= 0
##$COROFFS= 0
##$CY= 12.5
##$DATMOD= 1
##$DC= 0
##$DFILT= <>
##$DTYPP= 0
##$F1P= 14.0000005364418
##$F2P= -0.99999901652339
##$FCOR= 0.5
##$FTSIZE= 32768
##$FT_mod= 6
##$GAMMA= 0
##$GB= 0
##$INTBC= 1
##$INTSCL= 1
##$ISEN= 128
##$LB= 0.3
##$LEV0= 0
##$LPBIN= 0
##$MAXI= 10000
##$MC2= 0
##$MEAN= 0
##$ME_mod= 0
##$MI= 0
##$NCOEF= 0
##$NC_proc= -4
##$NLEV= 6
##$NOISF1= 0
##$NOISF2= 0
##$NSP= 0
##$NTH_PI= 0
##$NZP= 0
##$OFFSET= 16.522
##$PC= 1
##$PHC0= 236.3893
##$PHC1= 4.456668
##$PH_mod= 1
##$PKNL= yes
##$PPARMOD= 0
##$PSCAL= 4
##$PSIGN= 0
##$REVERSE= no
##$SF= 250.13
##$SI= 32768
##$SIGF1= 0
##$SIGF2= 0
##$SINO= 400
##$SIOLD= 32768
##$SREGLST= <1H.DMSO>
##$SSB= 0
##$STSI= 32768
##$STSR= 0
##$SW_p= 5175.98343685301
##$SYMM= 0
##$S_DEV= 0
##$TDeff= 65536
##$TDoff= 0
##$TI= <Analysis number 999999
Compound Code 99
Book Reference 9
Project Code 9>
##$TILT= no
##$TM1= 0
##$TM2= 0
##$TOPLEV= 0
##$USERP1= <user>
##$USERP2= <user>
##$USERP3= <user>
##$USERP4= <user>
##$USERP5= <user>
##$WDW= 1
##$XDIM= 32768
##$YMAX_p= 320328068
##$YMIN_p= -262052
$$ End of Bruker specific parameters
$$ ---------------------------------
##NTUPLES= NMR SPECTRUM
##VAR_NAME=  FREQUENCY,     SPECTRUM/REAL,   SPECTRUM/IMAG
##SYMBOL=    X,             R,               I
##VAR_TYPE=  INDEPENDENT,   DEPENDENT,       DEPENDENT
##VAR_FORM=  AFFN,          ASDF,            ASDF
##VAR_DIM=   32768,         32768,           32768
##UNITS=     HZ,            ARBITRARY UNITS, ARBITRARY UNITS
##FACTOR=    0.157963299565203, 1,           1
##FIRST=     4132.6476996994, 0,             0
##LAST=      -1043.33573715361, 0,           0
##MIN=       -1043.33573715361, -262052,     0
##MAX=       4132.6476996994, 320328068,     0
$$ Real data points
##PAGE= N=1
##DATA TABLE= (X++(R..R)), XYDATA
$$ [...]
16240a8757m745j9509K2216N0229j8968n580k9122n9137K6821P0648K2928l0417
$$ -18757 -23502 -43011 -20795 29434 10466 4886 -24236 -83373 -56552 14096 37024 6607
16228F607K2901k6714q6753k9541M7711l0449n5809J4865M9068j6077l5789Q3992
$$ 6607 29508 2794 -83959 -113500 -65789 -96238 -152047 -137182 -88114 -104191 -139980 -55988
16216e5988P5719O755j7155o280L988l3151p1891J1725J910J07062Q6738J6495
$$ -55988 19731 26486 9331 3051 7039 -26112 -98003 -86278 -84368 22694 109432 125927
16204A25927k3237l5654p526o2828o8443p490k9306K3229P2950K6215k8316N433
$$ 125927 102690 67036 59510 -3318 -71761 -79251 -108557 -85328 -12378 13837 -14479 -9046
16192i046L1587N3849L1013j12752k6553K7013l3432n5454K0950K6473j7365k5626
$$ -9046 22541 76390 107403 -5349 -31902 -4889 -38321 -93775 -72825 -46352 -63717 -89343
16180h9343k1557q3932L1194N1327J8206M6354K3628J174o6284L8950L7009L6812
$$ -89343 -110900 -194832 -163638 -112311 -94105 -47751 -24123 -22949 -89233 -50283 -13274 23538
16168B3538p610j7626O7282l7543n6967L6149J0807j5408q1292j3026N8061M7267
$$ 23538 15928 -1698 65584 28041 -28926 7223 18030 2622 -78670 -91696 -33635 13632
16156A3632q054m2334K0915l082N3081K9588L6370j0216p7723r501Q189j3284
$$ 13632 5578 -36756 -15841 -18923 34158 63746 100116 89900 12177 2676 10865 -2419
16144b419J3949n3525k7706O37L3181N3147k3718k5260J201p752N5828J1617k39
$$ -2419 11530 -41995 -69701 -69064 -35883 17264 -6454 -31714 -30513 -38265 17563 29180 28941
16131B8941q6169m1725J8274K4029K9711j4021k5587k0827l5103J4602m1247J767
$$ 28941 -57228 -98953 -80679 -56650 -26939 -40960 -66547 -87374 -122477 -107875 -149122 -147355
16119a47355J6933J4068n400p596K2260L3502L0399k0521q807R764K1367K5674
$$ -147355 -130422 -116354 -121754 -129350 -107090 -73588 -43189 -63710 -72517 -62753 -41386 -15712
16107a5712J212Q868K5401J208n8118j0532N4206K0764R636J9359Q859p547N853
$$ -15712 -14500 -5632 19769 20977 -37141 -47673 6533 27297 36933 56292 65151 57604 63457
16094F3457j5476L2803m3025j0471K2911K8332n9371j2587L410Q515j7364j9668
$$ 63457 47981 80784 37759 27288 50199 78531 19160 6573 9983 18498 1134 -18534
16082a8534m4748K0253j1885R918R20l4810P5226O1607j0704l137j1154l8997
$$ -18534 -63282 -43029 -54914 -44996 -44076 -78886 -3660 57947 47243 44106 32952 -6045
16070f045J7302K3926j875k6800j8744K4789N7870M476K2755L4425m7457J3979
$$ -6045 11257 35183 33308 6508 -12236 12553 70423 74899 97654 132079 84622 98601
16058I8601j7126n8061r6986m5187O3857k307l1614N8216M7916j8171l7924K581
$$ 98601 81475 23414 -73572 -118759 -54902 -57209 -88823 -30607 17309 -862 -38786 -36205
16046c6205Q107k7817L6222K6671k669q539j5175K6119J7380J0008n013k1579
$$ -36205 -28098 -55915 -19693 6978 4309 -4230 -19405 6714 24094 34102 29089 7510
16034G510n671J4464j2528j8628k0915k1340L298O8782l446L4923l339m861Q9845
$$ 7510 1839 16303 3775 -14853 -35768 -57108 -53810 14972 11526 46449 43110 38249 128094
16021A28094K1480j9738p6831r752J3114L1687o1671q0297M6761K5026m8713l9826
$$ 128094 149574 129836 53005 43253 56367 88054 26383 -53914 -7153 17873 -30840 -70666
16009g0666P821k7531j4184L8355J2251j2386o3124j3465M9043m939L3800N7885
$$ -70666 -62845 -90376 -104560 -66205 -53954 -66340 -129464 -142929 -93886 -98825 -65025 -7140
15997g140L8624l0397l5019j9264J3009K4672J8196j1098k7520R5009j0750m6181
$$ -7140 31484 1087 -33932 -53196 -40187 -15515 2681 -8417 -35937 59072 48322 2141
15985B141l6110m6125Q0172M4032k6840n0274M102m964K4838J0987M8337n2263
$$ 2141 -33969 -80094 78 44110 17270 -33004 -28902 -33866 -9028 1959 50296 -1967
15973a967n4646L8913N6524K8600q894n6918j2046K2591n2926m3225k4589L1375
$$ -1967 -56613 -17700 38824 67424 58530 1612 -10434 12157 -40769 -83994 -108583 -77208
15961g7208N9147K969j9084K4497J5588L4663k6919j7045O8581m3186m3227n5307
$$ -77208 -18061 -15092 -34176 -9679 5909 40572 13653 -3392 65189 22003 -21224 -76531
15949g6531J2383M7174l7376J2765l0393l3056L6071L4408l8839j8810M6262k163
$$ -76531 -64148 -16974 -54350 -41585 -71978 -105034 -68963 -34555 -73394 -92204 -45942 -48105
15937d8105l3398L4575J7903P116O296J4569N6796m6465n5750K6413N5038L4764
$$ -48105 -81503 -46928 -29025 -21909 -15613 -1044 55752 9287 -46463 -20050 34988 69752
15925F9752j08369k4485N8463N3136p0075j4580J2103k200N4750K1229K0717n1145
$$ 69752 -38617 -63102 -4639 48497 -21578 -36158 -24055 -26255 28495 49724 70441 19296
15913A9296o5645J1814Q6900O9686J3957j4789M267k3258n9205m9555L1524J9345
$$ 19296 -46349 -34535 52365 122051 136008 121219 125486 102228 43023 -6532 24992 44337
15901D4337N1490L0755l9453l751L3766n9573m1201O816N0110R75m6178k6656
$$ 44337 95827 126582 87129 83378 117144 57571 16370 23186 73296 74271 28093 1437
15889A437r07n137J966M9330N4038n886j9524K046K3584K8522m3450q748j0861
$$ 1437 530 -4607 -2641 46689 100727 94841 75317 77363 100947 129469 86019 77271 66410
15876F6410q3480m8222J3303k776k5433N2257N1407j8006j0877l1756l393L8021
$$ 66410 -17070 -65292 -51989 -54765 -80198 -27941 23466 5460 -5417 -37173 -40566 -2545
15864b545J9878k8885q8354J1492Q5625M3150K943j02116k4793n6856J3814Q1109
$$ -2545 17333 -11552 -99906 -88414 -2789 40361 43304 -58812 -83605 -140461 -126647 -45538
15852d5538P499p5242j3843Q2055J04452m2001l2919j6561m6740L0797K5886j7010
$$ -45538 -38039 -113281 -127124 -45069 59383 17382 -15537 -32098 -78838 -48041 -22155 -39165
15840c9165k0932k7070J1885R8277O1699J1123n0030o6153k8646K5934p054K4019
$$ -39165 -60097 -87167 -75282 22995 84694 95817 45787 -20366 -49012 -23078 -30132 -6113
15828f113L877o6538n3104M0671K4724M6392k551K0451J9478n0691k3003J5192
$$ -6113 -2236 -68774 -121878 -81207 -56483 -10091 -12642 7809 27287 -23404 -46407 -31215
15816c1215J00156R4149K3946j08501q3174L4229Q4849N049n2417j5747K7518
$$ -31215 68941 163090 187036 78535 -4639 29590 114439 119488 67071 51324 78842
15805G8842m4433m9474j4422N533K6683J6290j3827k4524m3785L7107R617l1378
$$ 78842 34409 -15065 -29487 -23954 2729 19019 5192 -19332 -63117 -26010 -16393 -47771
15793d7771k4483K204L3571M1614k4013k5839l209N131m3302l555K2435L5621
$$ -47771 -72254 -70050 -36479 5135 -18878 -44717 -47926 -42795 -86097 -89652 -67217 -31596
15781c1596M7544J228l7797K7480K6351n5126L8890J1006l6706J8779J8943K8809
$$ -31596 15948 17176 -20621 6859 33210 -21916 16974 27980 -8726 10053 28996 57805
15769E7805k0612j6135p351M5194j9547n4391k8616J8433K0097k9412N974J1105
$$ 57805 37193 21058 13707 58901 39354 -15037 -43653 -25220 -5123 -34535 -28561 -17456
15757a7456l6963o6843O295K6593K214L1241k2953r462L4208L6951l116l2836
$$ -17456 -54419 -121262 -114967 -88374 -86160 -54919 -77872 -87334 -53126 -16175 -19291 -52127
15745e2127j6049J4609j0836J9255L929k1102j1056K087j3980R963q779p486J4221
$$ -52127 -68176 -53567 -64403 -45148 -41219 -62321 -73377 -71290 -85270 -75307 -84086 -91572 -77351
15732g7351L1953q18J1894J4497k9997l2022K4301J1714J0175M4635P4887k7455
$$ -77351 -45398 -46216 -34322 -19825 -49822 -81844 -57543 -45829 -35654 8981 83868 56413
15720E6413J1486N3285p4868o5874n4551J317R3650N0257l8082j4026m6486J5386
$$ 56413 67899 121184 46316 -19558 -74109 -72792 20858 71115 33033 19007 -27479 -12093
15708a2093O0074o5431l2738k6126L1111N5790k8563o921k8968J9832M1958Q885
$$ -12093 47981 -17450 -50188 -76314 -45203 10587 -17976 -24897 -53865 -34033 7925 16810
15696A6810l0544j6331M8686K0012q2479j900L3643L0706l5502K1050j915m346
$$ 16810 -13734 -30065 18621 38633 -43846 -45746 -12103 18603 -16899 4151 2236 -2110
15684b110l0648p605Q925n6083l8369J08443M4755J7965l8796n5450j2071k5471
$$ -2110 -32758 -40363 -31438 -87521 -125890 -17447 27308 45273 6477 -48973 -61044 -86515
15672h6515K1556J8985n9007k284R0977Q0388q954m3206k6019N6243L728l2888
$$ -86515 -64959 -45974 -104981 -107265 -16288 64100 55146 11940 -14079 42164 45892 13004
15660A3004n5282j0094j0977R170Q7540L1031m3407l5528j3029L1584J9725K512
$$ 13004 -42278 -52372 -63349 -54179 33361 64392 20985 -14543 -27572 4012 23737 26249
15648B6249l3313l1586n9100M4430N2316N643J1953q749n9185O028J1219J5057
$$ 26249 -7064 -38650 -97750 -53320 -1004 4639 16592 7843 -51342 -45314 -34095 -19038
15636a9038J6196m0931n450j4994J6528M1650l079r885j6177O902J9706K6567
$$ -19038 -2842 -43773 -49223 -64217 -47689 -6039 -9118 -19003 -35180 -28278 -8572 17995
15624A7995j9969l3334k1137P5849M8830q9826l4677N6800l5017o0255K1591L5071
$$ 17995 -1974 -35308 -56445 19404 68234 -21592 -56269 531 -34486 -94741 -73150 -38079
15612c8079J8606m5116L2284P1367K6284m3456j4045n1830n40M4404P400o4646
$$ -38079 -19473 -64589 -32305 39062 65346 21890 7845 -43985 -44525 -121 7279 -57367
15600e7367j3163J211P6130J4893r0168J661J02406j1358l9071l3559m1695L3914
$$ -57367 -70530 -69319 6811 21704 -68464 -66803 35603 24245 -14826 -48385 -90080 -56166
15588e6166O7864K3635j921r911K166j7662p3074k7045K3311r426O2244J7681
$$ -56166 11698 35333 33412 23501 25667 8005 -65069 -92114 -68803 -78229 -15985 1696
15576A696J9953k0539L3795j260m0622k9608K0839m4139m5995J655n2747N4532
$$ 1696 21649 1110 34905 33645 -6977 -36585 -15746 -59885 -105880 -104225 -156972 -102440
15564a02440O8686M8260L4016M3660p5382k8587M166n2543M6461M1762m8475k2150
$$ -102440 -33754 14506 48522 92182 16800 -11787 -7621 -60164 -13703 28059 -20416 -42566
15552d2566Q7700m1351k9402k4847L4832O8665r692q6508m845M8610K5528J9314
$$ -42566 45134 3783 -25619 -50466 -15634 53031 43339 -43169 -48014 596 26124 45438
15540D5438k6226n1717j4430K3724j4164K339q9580l6645m189N9502P3120O6288
$$ 45438 19212 -32505 -46935 -23211 -37375 -35036 -124616 -161261 -165450 -105948 -32828 33460
15528C3460K6193l2918j0288j617j5351r576m5444j1970N4469L3168j7127r3457
$$ 33460 59653 26735 16447 14830 -521 -10097 -55541 -67511 -13042 20126 2999 -90458
15516i0458J9399J7244n144r15M0585k125N171M9632l0337n7688K6400N4430L9062
$$ -90458 -71059 -53815 -58959 -59874 -19289 -21414 -16243 33389 3052 -54636 -28236 26194 65256
15503F5256J5939k5481n3297l6145j0995Q020m925k160J3716M0835L6546k9925
$$ 65256 81195 55714 2417 -33728 -44723 -36703 -41628 -43788 -30072 10763 47309 17384
15491A7384m4476j3008q0623J4131R0864L8057k5751j119l9861j4818k0703O556
$$ 17384 -27092 -40100 -120723 -106592 -15728 22329 -3422 -4541 -44402 -59220 -79923 -73367
15479g3367J18573L4996l6683n0404j0603j2100j8765M797L0476j610P337k7927
$$ -73367 45206 80202 43519 -6885 -17488 -29588 -48353 -43556 -13080 -14690 -7353 -35280
15467c5280J641M2458o1968j2533K2852O1541l2142m8975J0117J9344p510j7207
$$ -35280 -33639 8819 -53149 -65682 -42830 18711 -13431 -62406 -52289 -32945 -40455 -57662
15455e7662K2585L987J8539P0621k6514n25k3127p884L5039K7515L1915j1775
$$ -57662 -35077 -31090 -12551 58070 31556 31031 7904 20 35059 62574 94489 82714
15443H2714m01L1791N6255o2172m3767K801L1795K4519l6209k5033m5081l7356
$$ 82714 82313 114104 170359 108187 64420 67221 99016 123535 87326 62293 17212 -20144
15431b0144M2767M3303m1913r589j1886k0846J0757K4356j7082L9424K8881Q715
$$ -20144 22623 65926 24013 14424 2538 -18308 -7551 16805 -277 39147 68028 76743
15419G6743p9201m2691N6318N8695k7030l4571k7199k0005j4800L7782p062L3473
$$ 76743 -2458 -45149 11169 69864 42834 8263 -18936 -38941 -53741 -15959 -23021 10452
15407A0452j4099K752J9724n5238k6668k3687J5146k4035M5145L4177J7091P3815
$$ 10452 -3647 -895 18829 -36409 -63077 -86764 -71618 -95653 -50508 -16331 760 74575
15395G4575L8434L1293M683j8191n3743q0393n3297p430J8766J5643J7978o34
$$ 74575 113009 144302 148985 130794 77051 -3342 -56639 -64069 -45303 -29660 -11682 -12316
15383a2316n23O6126O1809n4112n1387k8906n153L9232k129K2822J1004m1879
$$ -12316 -12839 53287 115096 60984 9597 -19309 -24462 14770 12641 35463 46467 4588
15371D588l4133j0691M694Q091P59K2928M9682j3143k1148K3853J915j3164j5189
$$ 4588 -29545 -40236 -35542 -27451 -26692 -3764 45918 32775 11627 35480 37395 24231 9042
15358I042K2220M5425j4463J929p159L9989N8266l8808n5573n1963m6860J6502
$$ 9042 31262 76687 62224 64153 56994 96983 155249 116441 60868 8905 -37955 -21453
15346b1453L1708n3567O061P2734l0253k6009J08379N6841o2140m7063k4368n8220
$$ -21453 10255 -43312 -37251 35483 5230 -20779 87600 144441 82301 35238 10870 -47350
15334d7350k4940P942M5743k8217l264N4692M0403O543q611q706l5984O504j4103
$$ -47350 -72290 -64348 -18605 -46822 -50086 4606 45009 51552 42941 34235 -1749 4755 -9348
15321i348p7712K8439Q2157M9363M077m1952k6125j8151n3221J0212N7941P2907
$$ -9348 -87060 -58621 23536 72899 76976 35024 8899 -9252 -62473 -52261 5680 78587
15309G8587M3344J5602k6419o0875m0005p07k1148N0127N308j05888p6325N5243
$$ 78587 121931 137533 111114 50239 10234 9527 -11621 38506 43814 -62074 -138399 -83156
15297h3156o801m035P1623M3826k9977J1461M785j9857J4028O5123J3391l0181
$$ -83156 -89957 -93992 -22369 21457 -8520 2941 7726 -12131 1897 67020 80411 50230
15285E0230r886K48j8436N069Q2429L5792m5619r527k1000m8475k3606q7k3593
$$ 50230 40344 40592 22156 27225 109654 145446 99827 90300 69300 20825 -2781 -2868 -26461
15272b6461k8554K0078n4375L1193M1536M4916J8794O284K3422j4021k3997K7240
$$ -26461 -55015 -34937 -89312 -58119 -16583 28333 47127 53411 76833 62812 38815 66055
15260F6055Q1334J3766p293k884m872K7107p7602p0798N011K3633p4001m5436
$$ 66055 147389 161155 153862 150978 146106 173213 95611 24813 29824 53457 -20544 -65980
15248f5980L8294K3092M1876J4002K8197K7487o3879m1071K0016o8522j9934l59
$$ -65980 -27686 -4594 37282 51284 79481 106968 43089 2018 22034 -46488 -66422 -66781
15236f6781k0584M8976R254M8277k7942J1483l649m2324L7730Q7546M28j375K7945
$$ -66781 -87365 -38389 -29135 19142 -8800 2683 -966 -43290 -5560 81986 82414 81039 108984
15223A08984m7423m2297j3071J6721K1116j5200n9193J248j7460q783l249o938
$$ 108984 61561 19264 6193 22914 44030 28830 -30363 -29115 -46575 -55358 -58607 -65545
15211f5545K1175N271M3322j7147Q2496n522J551n5752L1431K4892o514M2690
$$ -65545 -44370 -39099 4223 -12924 69572 64050 65601 9849 41280 66172 59658 102348
15199A02348J4573k1262O437j1641N715R80p4584L7380N9622R885L382l0826j8173
$$ 102348 116921 95659 102096 90455 96170 97150 22566 59946 119568 129453 132835 102009 83836
15186H3836J7027M0246m5591o2526o8489K8057L3483n4114l6831L7592P0797J8192
$$ 83836 100863 141109 95518 32992 -35497 -7440 26043 -28071 -64902 -27310 43487 61679
15174F1679K9181n645j6108p064o130J1153m8851n4397l985j1971K1253K5350
$$ 61679 90860 85215 69107 62043 55913 67066 18215 -36182 -40167 -52138 -30885 -5535
15162e535m995k1822K2617K7020j6827j9014j0682J3327O5728q205q5305n019
$$ -5535 -10530 -32352 -9735 17285 458 -18556 -29238 -15911 49817 41612 -43693 -48712
15150d8712M1040j8492l193K7327L0620j466q790m4600O4264J7616K7879J3755
$$ -48712 -7672 -26164 -29357 -2030 28590 27124 18334 -26266 37998 55614 83493 97248
15138I7248l8457l6233k6568J274K1898n329N985P0205J0590m1713n1232m3959
$$ 97248 58791 22558 -4010 -2736 19162 13833 19818 90023 100613 58900 7668 -36291
15126c6291k6619Q7247Q3529l9071n4778o677N457N7583o317p7054M4186P2565
$$ -36291 -62910 24337 107866 68795 14017 7340 12797 70380 64063 -12991 31195 103760
15114A03760M3302r1130m9551J0593j8272j1340o7480m2074K0401N0653M6259
$$ 103760 147062 55932 6381 16974 -1298 -12638 -80118 -122192 -101791 -51138 -4879
15103d879n7334k6597K1209K5139L7240L8404K134l2152n4624L9282K068J6983
$$ -4879 -62213 -88810 -67601 -42462 -5222 33182 35316 3164 -51460 -12178 -10110 6873
15091F873j367K312K6580K8223K3812o059N084L7646N8694L7828P7955O9793P6250
$$ 6873 5506 7818 34398 62621 86433 80374 85458 123104 181798 219626 297581 367374 443624
15078D43624Q2430J5098N0776o6062p0075J6136O1727k1343o5336p3610q2587
$$ 443624 526054 541152 591928 525866 455791 471927 533654 512311 446975 373365 290778
15067B90778r1108p0768l2417K4715l7656m3020p4528l587N3873N3582K7709l8431
$$ 290778 199670 128902 96485 121200 83544 40524 -34004 -37591 16282 69864 97573 59142
15055E9142n1342k0106O6577Q3016n3762j04494m2924j1379Q8495L6716j447o3645
$$ 59142 7800 -12306 54271 137287 83525 -20969 -63893 -75272 13223 49939 48492 -15153
15043a5153l887P468k6320P94l6669j8445O6358J10926L4376n7298n0960k8996
$$ -15153 -19040 -11572 -37892 -37098 -73767 -92212 -25854 85072 119448 62150 11190 -17806
15031a7806N1486J1656k6068J1417N1756j5287l1138m2506N6184Q0047K1729o1749
$$ -17806 33680 45336 19268 30685 82441 67154 36016 -6490 49694 129741 151470 89721
15019H9721o4710L8516J4204n1328k4210O991P4022L5557q8503j2225J819K4217
$$ 89721 25011 63527 77731 26403 2193 9184 83206 118763 30260 18035 19854 44071
15007D4071k5971p1190O991R141M9209M358N084j8053o3038l3940L4329O6904
$$ 44071 18100 -53090 -46099 -36958 12251 16609 21693 3640 -59398 -93338 -59009 7895
14995G895M2064k0842o710o6486L7596P2441J733N268j5393k1231m984L2281K6052
$$ 7895 49959 29117 22407 -44079 -6483 65958 67691 72959 57566 36335 31351 63632 89684
14982H9684m5101m2311J9274P9268L4918O0231q6613L2839Q1100R617L1328O6000
$$ 89684 44583 2272 21546 100814 135732 195963 109350 142189 223289 232906 264234 330234
14970C30234L3250N2400J13786O1936J28649K22479K84757L70601O04654P67589
$$ 330234 363484 415884 529670 591606 720255 942734 1227491 1598092 2202746 2970335
14960B970335Q76029Q65171O86596M83518J88774k8651k30408n09112p23363q52045
$$ 2970335 3846364 4711535 5398131 5881649 6070423 6041772 5811364 5302252 4578889 3726844
14950C726844p78935o60237n48203l97746k97469j58200j07306j38588j36662
$$ 3726844 2947909 2287672 1739469 1341723 1044254 886054 778748 640160 503498
14941E03498j07276m053j6981k0636k1212k6161m3605j6130q74p0454l6697m6984
$$ 503498 396222 392169 375188 354552 333340 307179 263574 247444 246570 176116 139419 92435
14929I2435M93m849N0084J6173m4451k5236M8189N2301j3197k8471o719J8484
$$ 92435 92928 88079 138163 154336 109885 84649 132838 185139 171942 143471 136752 155236
14917A55236J3176q0836k6475J8020Q603j0212j3914j1114K7664K4364M5486P951
$$ 155236 168412 87576 61101 79121 87724 77512 63598 52484 80148 104512 149998 157949
14905A57949m8728m3246J0270O1144K9251n8339m9338q2067j0203P232J3404k0019
$$ 157949 109221 65975 76245 137389 166640 108301 58963 -23104 -33307 -26075 -12671 -32690
14893c2690n7935K7128L2719L2791P3302n065r2966j5913K9654L3600N811q9172
$$ -32690 -90625 -63497 -30778 2013 75315 70250 -22716 -38629 -8975 24625 30436 -58736
14881e8736K3762L6206O305J0716K2091k8155l7018L0430J916m0301q3627N3808
$$ -58736 -34974 1232 7537 18253 40344 12189 -24829 5601 7517 -32784 -116411 -62603
14869f2603M1721m597m0293Q973P9573l3326N049P866k1786J997j5715K7577M8039
$$ -62603 -20882 -25479 -65772 -56799 22774 -10552 -5503 2363 -19423 -17426 -33141 -5564 42475
14856D2475K5744m3288j6920n9092p206O6930L3630l659k9151r068j0148o9675
$$ 42475 68219 24931 8011 -51081 -58287 8643 42273 38614 9463 395 -9753 -79428
14844g9428k2616K5749Q475K4083K7562J469j8389L2413j4765o923J9861K5871
$$ -79428 -102044 -76295 -67820 -43737 -16175 -14706 -33095 -682 -15447 -22370 -2509 23362
14832B3362O2312J8037l9088n1604l6984K6942N3528M825m3584J7251p595n507
$$ 23362 85674 103711 64623 13019 -23965 2977 56505 61330 17746 34997 27402 21895
14820B1895o8694r9033k5351J7028O8747M9821O2331J0266M6109L2643K6535l0486
$$ 21895 -46799 -145832 -171183 -154155 -85408 -35587 26744 37010 83119 115762 142297 111811
14808A11811o2990P68J1025M0607Q2126L5813n9130l5222j3144n0628l3894K1049
$$ 111811 48821 49589 60614 101221 183347 219160 160030 124808 111664 61036 27142 48191
14796D8191m3604k4540J1266R802k4830j1807o5138k8636N8171j0528M1231L7867
$$ 48191 4587 -19953 -8687 1115 -23715 -35522 -100660 -129296 -71125 -81653 -40422 -2555
14784b555J3330M8763m2282p6687O114p760l8739l2746L5029M1075L6882L9133
$$ -2555 10775 59538 17256 -59431 -53317 -61077 -99816 -132562 -97533 -56458 -19576 19557
14772A9557q551J5937J5233k9704j8990O159L4783M7993J0977m9283j6164n2452
$$ 19557 11006 26943 42176 12472 -6518 -359 34424 82417 93394 44111 27947 -24505
14760b4505J3508l6369J0019K6431L8427k8983o0187N773P4975N3219J3444l230
$$ -24505 -10997 -47366 -37347 -10916 27511 -1472 -61659 -55886 19089 72308 85752 82522
14748H2522l1250m9012o642M9832J6668m6213N5929J455M0996j7586J1768k8098
$$ 82522 51272 2260 -4382 45450 62118 15905 71834 73289 114285 96699 108467 80369
14736H0369J815j90M2281l605l5160r0279l3952K7002k1451j2811N3058M3569
$$ 80369 82184 81994 124275 120670 85510 -4769 -38721 -11719 -33170 -45981 7077 50646
14724E0646j8359q0876J7429l2323l148L241K5994J6794k1348J6557k952N544
$$ 50646 32287 -48589 -31160 -63483 -66631 -63390 -37396 -20602 -41950 -25393 -28345 -22801
14712b2801J9759k0294L5795k3175l2950M6544P0651K3330j0213m0026r876K9782
$$ -22801 -3042 -23336 12459 -10716 -43666 2878 73529 96859 86646 46620 36744 66526
14700F6526l5119q602l7704O911J9963M761k9558O520p668m9511J0425K4034m8162
$$ 66526 31407 22805 -14899 -7988 11975 16736 -12822 -6302 -13970 -63481 -53056 -29022 -77184
14687g7184m1252J2785O9414j8695j3392Q386K2141N611n148K5505L3937m9341
$$ -77184 -118436 -105651 -36237 -54932 -68324 -59938 -37797 -32186 -37334 -11829 22108 -27233
14675b7233n5093J1742K9516l7328j4543K1048K5332M4847J4480q926K5219N5509
$$ -27233 -82326 -70584 -41068 -78396 -92939 -71891 -46559 -1712 12768 3842 29061 84570
14663H4570L8531k2797l6559l1529J0870k9899j06625l5625P917M8605L8740K8140
$$ 84570 123101 100304 63745 32216 43086 13187 -93438 -129063 -121146 -72541 -33801 -5661
14651e661M0280L64p4282O8254k1424j5367j5292l0902J0413J8983P546K9387
$$ -5661 34619 34983 -39299 28955 7531 -7836 -23128 -54030 -43617 -24634 -17088 12299
14639A2299j075j9105p497o0966r4764M938M7118L2666M5383j542M2930P839K1168
$$ 12299 11224 -7881 -15378 -76344 -171108 -166170 -119052 -86386 -41003 -42545 385 8224 29392
14626B9392K878n0634p740M2689m7794M578p5345K2990R4012j3759J1689p273
$$ 29392 32270 -18364 -26104 16585 -31209 -26631 -101976 -78986 15026 1267 12956 5683
14614E683m8103j2344n726M5406Q6846o331o5964o0257K628N9063N3839p315n8193
$$ 5683 -42420 -54764 -60490 -15084 71762 65431 -533 -60790 -58162 901 54740 47425 -10768
14601a0768Q60M866l4008L5507L3658J3768p288n726N1223o651m2379K5268o1392
$$ -10768 -9908 -5042 -39050 -3543 30115 43883 36595 30869 82092 75441 33062 58330 -3062
14588c062j2602Q8483k4166n3401m1418L6139K6006R383j05198n7564O8166R9218
$$ -3062 -15664 72819 48653 -4748 -46166 -10027 15979 25362 -79836 -137400 -69234 29984
14576B9984l7408m2062J3639M7228L1474l8187J0255N90k6660M8887R811P261
$$ 29984 -7424 -49486 -35847 11381 42855 4668 14923 15513 -11147 37740 47551 54812
14564E4812j1242p1189k349j3216K5504K4242l26K5521l9834k8004M581L080m2884
$$ 54812 43570 -27619 -29968 -43184 -17680 6562 6236 31757 -8077 -36081 -31500 -28420 -71304
14551g1304K7732J00693N2390k0611N147k999m7158N660n5838k3543M4983j5540
$$ -71304 -43572 57121 109511 88900 94047 91048 43890 49550 -6288 -29831 15152 -388
14539c88J8985J9269m4640p891J0055k8873k4964M8335J7685J6170k8756J1808
$$ -388 18597 37866 -6774 -14665 -4610 -33483 -58447 -10112 7573 23743 -5013 6795
14527F795L3008m9130n4746J4481M6791l08R046J4484L2649k1263k9224m8494
$$ 6795 39803 -9327 -64073 -49592 -2801 -3109 5937 20421 53070 31807 2583 -45911
14515d5911K1222L6651N4406o11l1092j3505k9014o6563N2536J08558p7014n5490
$$ -45911 -24689 11962 66368 65757 34665 21160 -7854 -74417 -21881 86677 9663 -45827
14503d5827l7252O150N1437j5164J0397K005J012J0620j0253m4239p0825L1434
$$ -45827 -83079 -76929 -25492 -40656 -30259 -28254 -27242 -16622 -26875 -71114 -141939 -110505
14491a10505N3966O778J4458P905M9629K3063n9137L386N0389j8031k754K1349
$$ -110505 -56539 -49761 -35303 -27398 22231 45294 -13843 -10457 39932 21901 19147 40496
14479D0496L1265J7597k4917k8917Q3671n860n9453j16190j304M7053J1748N2147
$$ 40496 71761 89358 64441 35524 119195 113335 53882 -62308 -63612 -16559 -4811 47336
14467D7336J8841M4548n174q9660n8086M373O2877K2663O387M506l7543m0350
$$ 47336 66177 110725 105551 15891 -42195 -37822 25055 47718 54105 58611 21068 -19282
14455a9282o649k1568j3174K4697P3541k5154j3720m1752j3810k3659J5264O849
$$ -19282 -25931 -47499 -60673 -35976 37565 12411 -1309 -43061 -56871 -80530 -65266 -58417
14443e8417o347M3139j2935j5821J8766l6494K6694K4603R617K1322j2549k4242
$$ -58417 -64764 -21625 -34560 -50381 -31615 -68109 -41415 -16812 -7195 14127 1578 -22664
14431b2664J6433j831m2205J438P3555n940p944K9155J8462P519K1235j7143J8233
$$ -22664 -6231 -8062 -50267 -48829 24726 18786 10842 39997 58459 65978 87213 70070 88303
14418H8303J2447l0499n122q634l6046R739l1870j0363M879m2412j9540N8603
$$ 88303 100750 70251 65129 56495 20449 30188 -1682 -12045 -7166 -49578 -69118 -10515
14406a0515K0905o5223k6073L3832K7533J5057k5558K833M2949J317N5592L8430
$$ -10515 10390 -54833 -80906 -47074 -19541 -4484 -30042 -27209 15740 17057 72649 111079
14394A11079r2599o2905p316N527J2555k2631m0449l7110j8188M8554M2500J2530
$$ 111079 18480 -44425 -51741 -46214 -33659 -56290 -96739 -133849 -152037 -103483 -60983 -48453
14382d8453Q3789K2849n2130J3608L5792p321q832m535j0633m3946K0262j4431
$$ -48453 35336 58185 6055 19663 55455 48134 39302 34767 24134 -19812 450 -13981
14370a3981q302N0721j9658l164K9902J8811P3809N4973k4569j14690r0861L063
$$ -13981 -22283 28438 8780 5616 35518 54329 128138 183111 158542 43852 -47009 -43946
14358d3946L1449k3435m9094M2176J5257j3069j423J5437N5994k4414l1575K2184
$$ -43946 -12497 -35932 -85026 -42850 -27593 -40662 -42085 -26648 29346 4932 -26643 -4459
14346d459m3899k2780J8352J5837O0915m7543K9725M3431l5884k8264J5677o559
$$ -4459 -48358 -71138 -52786 -36949 23966 -23577 6148 49579 13695 -14569 1108 -5451
14334e451j7169J5490L7571j5620K6989M012l6865l9148N364M8261r171k5839
$$ -5451 -22620 -7130 30441 14821 41810 45822 8957 -30191 -24827 23434 14263 -11576
14322a1576L5970N1918l3340q4177m8405J1524L3014J2528Q2927Q736p617J596
$$ -11576 24394 76312 42972 -41205 -89610 -78086 -45072 -32544 50383 59119 51502 53098
14310E3098n1218m9165P8048L7768l5561K8197P3685M3259k7317p3521q7413l4327
$$ 53098 1880 -47285 30763 68531 32970 61167 134852 178111 150794 77273 -10140 -44467
14298d4467l8558k5476K0100O0807J1818p4632j7105q4078k5692K8947P6680J2958
$$ -44467 -83025 -108501 -88401 -27594 -15776 -90408 -107513 -191591 -217283 -188336 -111656 -98698
14286i8698K937L2468l54j7452L637J026J8396n4824M2957M4985K0946L5465k0134
$$ -98698 -95761 -63293 -63647 -81099 -77462 -76436 -58040 -112864 -69907 -24922 -3976 31489 11355
14273A1355j298K2233K090l3049j0247k0857J1121l1046j2134P2060N2539K6196
$$ 11355 10057 32290 34380 1331 -8916 -29773 -18652 -49698 -61832 10228 62767 88963
14261H8963L0253k2472j3098J9356k8200J7533q887m8468j7206k2238J5349J853
$$ 88963 119216 96744 83646 103002 74802 92335 83448 34980 17774 -4464 10885 12738
14249A2738L4202l74k2035q0673j6112l349n810L2064L2442L6768m127m4407P223
$$ 12738 46940 46566 24531 -56142 -72254 -75603 -81413 -49349 -16907 19861 15734 -28673 -21450
14236b1450k081Q115M0884J0692N6841l4830l8691L176m8246o7449J4507L5374
$$ -21450 -23531 -15416 25468 36160 93001 58171 19480 22656 -25590 -93039 -78532 -43158
14224d3158o282m3383o231M4931Q71j2445k1064K3473J8877K642k0083q8589K0829
$$ -43158 -49440 -92823 -99054 -54123 -53252 -65697 -86761 -63288 -44411 -41769 -61852 -150441 -129612
14211a29612J24984M658k6801k596n409L457k6417j08861M7105M8284l4338k9702
$$ -129612 -4628 30 -26771 -29367 -34776 -31319 -57736 -166597 -119492 -71208 -105546 -135248
14199a35248l0594O107L1463m072l1164J8404K4458O8001n018j9906l4622j3008
$$ -135248 -165842 -159735 -128272 -132344 -163508 -145104 -120646 -52645 -57663 -77569 -112191 -125199
14187a25199N0231L6916J281N9140M294m7465n2304j3940M6184r456j7915J4065
$$ -125199 -74968 -38052 -36771 22369 26663 -20802 -73106 -87046 -40862 -50318 -68233 -54168
14175e4168k3376N5177M3759K3731l0302j0908r8988q483O7706J042K3822N8088
$$ -54168 -77544 -22367 21392 45123 14821 3913 -95075 -103558 -35852 -34810 -10988 47100
14163D7100l3950m738j4385J1995J099m7517l2113K3313k963J5260n1157l4613
$$ 47100 13150 8412 -5973 6022 7121 -40396 -72509 -49196 -52159 -36899 -88056 -122669
14151a22669L7816N6933J6239J0989J9784o256p9669n7828L9317L2861L1978J8111
$$ -122669 -84853 -27920 -11681 -692 19092 12836 -66833 -124661 -85344 -52483 -20505 -2394
14139b394K7381L019L9838J910r0955J6219K837K3635j0834m1629J7946L0945
$$ -2394 24987 28006 67844 69754 -21201 -4982 -2145 21490 10656 -30973 -13027 17918
14127A7918L6193N1712M1648k0443l2560l4353m6187M9169L3533m0276k7995J5383
$$ 17918 54111 105823 147471 127028 94468 60115 13928 63097 96630 56354 28359 43742
14115D3742j6561j1584m639l7473m3716K1842m292N1969L3943P2195n652l6753
$$ 43742 27181 15597 10958 -26515 -70231 -48389 -52681 -712 33231 105426 99774 63021
14103F3021m0250L6979l1327j8804j5791l0013m494M699L9887K9610K6702K7343
$$ 63021 22771 59750 28423 9619 -6172 -36185 -40679 -35980 3907 33517 60219 87562
14091H7562j1668J4116n125p7280j4372j5049m6696K1960n454L9347J5758j6458
$$ 87562 75894 90010 84885 7605 -6767 -21816 -68512 -46552 -52006 -12659 3099 -13359
14079a3359J9517O62j8942p215J1895j0700o4892k3489K4206K3680K0734L7211
$$ -13359 6158 6820 -12122 -19337 -7442 -18142 -83034 -106523 -82317 -58637 -37903 -692
14067f92l4058n250p595K5287l039l3782K8724N2776k069k5573r474k257Q977
$$ -692 -34750 -40000 -47595 -22308 -25347 -59129 -30405 22371 20302 -5271 -14745 -17002 -8025
14054h025l3603j4912L4495J805Q7523p026m1249j2498J5385j7457K7161j3418
$$ -8025 -41628 -56540 -22045 -20240 67283 60257 19008 6510 21895 4438 31599 18181
14042A8181q096k5682N5152K3848L7875o2024n5929j6169K0306L3920R736l5511
$$ 18181 10085 -15597 39555 63403 101278 39254 -16675 -32844 -12538 21382 31118 -4393
14030d393K0929L1776J5564N9315J07601R0579K4811L2014l2735j00277n2764
$$ -4393 16536 48312 63876 123191 230792 321371 346182 378196 345461 245184 192420
14019A92420q3665l4400l844J5876L6417l3748p0649K3112P20j0471k2408m2509
$$ 192420 108755 74355 70511 86387 122804 89056 18407 41519 42239 31768 9360 -33149
14007c3149k2395k2880M0981J01251J8600L297j5784k90J8894R532J3479k5941
$$ -33149 -55544 -78424 -37443 63808 82408 85705 69921 69631 88525 98057 111536 85595
13995H5595l8928m1577k0402K2969R059J8421j9643p38K6286l8707k9201L2872
$$ 85595 46667 5090 -15312 7657 16716 35137 15494 14756 41042 2335 -26866 6006
13983F006j5475L0267j7643J21077O2493m3883p8231k4971r9823J5618M3829J7791
$$ 6006 -9469 20798 3155 124232 186725 142842 64611 39640 -60183 -44565 -736 17055
13971A7055j4031N8769P1546k0778l6798k0534J9587J1831L8766L3444N9612N5132
$$ 17055 3024 61793 133339 112561 75763 55229 74816 86647 125413 158857 218469 273601
13959B73601k2261K0504K4375J8481P5781J01799Q2956M8791J19011J84200K09950
$$ 273601 251340 271844 296219 314700 390481 492280 575236 624027 743038 927238 1137188
13948A137188K79810L55174L42301K18916K10696R1656L0136j16564k49331k69529
$$ 1137188 1416998 1772172 2114473 2333389 2544085 2635741 2665877 2549313 2299982 2030453
13938B030453l47521k99214l25871j90623j46340j45582j04618K2477j8262r904
$$ 2030453 1682932 1383718 1057847 867224 720884 575302 470684 493161 474899 464995
13928D64995j00727j09111n6334m3268M2446j4899k8610m7410o9623J6105N7367
$$ 464995 364268 255157 198823 155555 198001 183102 154492 107082 37459 53564 110931
13917A10931m965j4181O636j2857K5459j2439k8715m6255L245O3767K3843K8899
$$ 110931 105966 91785 98421 85564 111023 98584 69869 23614 26859 90626 114469 143368
13905A43368k078k8220j0509K934M1406k5726l2546M85j3658q529J7572k1877
$$ 143368 141290 113070 102561 105495 146901 121175 88629 89114 75456 66927 84499 62622
13893F2622j3687k5962K6079J1459j9314o56M259j529j801N107J4449l4462l6352
$$ 62622 48935 22973 49052 60511 41197 40541 44800 43271 41470 46577 61026 26564 -9788
13880i788l1606J6229p209L0543l8223K1150k49l3203R366K7258L1711K1576N0552
$$ -9788 -41394 -25165 -32374 -1831 -40054 -18904 -19153 -52356 -42990 -15732 15979 37555 88107
13867H8107P04j8355l2581Q864k605K5539L2562l4386J7532r184J9458K7849k0087
$$ 88107 88811 70456 37875 46739 44134 69673 102235 67849 85381 76197 95655 123504 103417
13854A03417l4283k6946j5971P354M2141m9925l5338m7180Q214L6782M995k3470
$$ 103417 69134 42188 26217 33571 75712 25787 -9551 -56731 -48517 -11735 -6740 -30210
13842c0210N003L9398o298k2841L521j4956j378l5187L9298K8340l1705o4351
$$ -30210 -25207 14191 7893 -14948 -11427 -26383 -27761 -62948 -23650 4690 -27015 -91366
13830i1366o8260n834L7487M4280j69o030L5963J5699K7058L0962m0773k6318
$$ -91366 -159626 -165460 -127973 -83693 -83862 -89892 -53929 -38230 -11172 19790 -20983 -47301
13818d7301M7668L592m8830m7130K2490J5137j2519J8585n795K3770k2434P9099
$$ -47301 367 3959 -44871 -92001 -69511 -54374 -66893 -48308 -54103 -30333 -52767 26332
13806B6332L8076k0808p8590O040m850J4642N3738N6395j288j9308r0720l7444
$$ 26332 64408 43600 -34990 -28950 -33800 -19158 34580 90975 89687 70379 -20341 -57785
13794e7785L9011J7374r703j9313O2235O5114Q76m3801j7735k3881K8305k8139
$$ -57785 -18774 -1400 -11103 -30416 31819 96933 97809 54008 36273 12392 40697 12558
13782A2558M64M3541K3999k2515q445q833k9293o324k6363K9530j7061m8557Q39
$$ 12558 13022 56563 80562 58047 49602 40769 11476 5152 -21211 8319 -8742 -57299 -56460
13769e6460Q9491M4094l5521n2245K1354j8932o1058K8867J12431N3865o2610
$$ -56460 33031 77125 41604 -10641 10713 -8219 -69277 -40410 72021 125886 63276
13758F3276n4856o0898k1111j0503N0619J994n9949j2271L381L7623J4905j4585
$$ 63276 8420 -52478 -73589 -84092 -33473 -31479 -91428 -103699 -100318 -62695 -47790 -62375
13746f2375J1450k0774L7729j0108K8809k1385M0485N9809n3113j6199L4410N5306
$$ -62375 -50925 -71699 -33970 -44078 -15269 -36654 3831 63640 10527 -5672 28738 84044
13734H4044k1798o6445M9583m0360m1795M0375J1336J8400j8187m3357K0876Q4665
$$ 84044 62246 -4199 45384 5024 -36771 3604 14940 33340 15153 -28204 -7328 77337
13722G7337k2545l0127m8955o9059Q603Q612J1348P4252L7159l4911k8681l1573
$$ 77337 54792 24665 -24290 -93349 -84746 -76134 -64786 9466 46625 11714 -16967 -48540
13710d8540K6107p20M3426O0130j0797n8090J3300L8717P911l9913j2477K63L9096
$$ -48540 -22433 -23153 20273 80403 69606 11516 24816 63533 71444 31531 19054 19317 58413
13697E8413l1143q276N2716L7836r301J3115j1144n9383l7534l0721k8223M9054
$$ 58413 27270 18994 71710 109546 100245 113360 102216 42833 5299 -25422 -53645 -4591
13685d591K5965O46l3609m0514L7018m9373K9014L071k5210K3182J978k5254j785
$$ -4591 21374 22020 -11589 -52103 -15085 -64458 -35444 -32373 -57583 -34401 -32423 -57677 -59462
13672e9462L4078j1123m928K012K8898K068J4524l7621l0459m1931o8169N4522
$$ -59462 -25384 -36507 -41435 -39423 -10525 -8457 6067 -31554 -62013 -103944 -172113 -117591
13660a17591O2218O7910M5881K5672j0016m9769m1344J9660K3067r0581o5555
$$ -117591 -55373 12537 58418 84090 74074 24305 -17039 2621 25688 -64893 -130448
13649a30448k8369J7819N0241N8400P063L247M1763l2571m8146j9996Q6080J506
$$ -130448 -158817 -140998 -90757 -32357 -25294 -22047 19716 -12855 -61001 -80997 5083 6589
13637F589J9972l76j7688j9736l229K4618L7920j0605n9643K2487O2300J2431
$$ 6589 26561 26185 8497 -11239 -14468 10150 48070 37465 -22178 309 62609 75040
13625G5040l4178j7253N1417o915l293j7663j960j0941l0450K5058n0876j3199
$$ 75040 40862 23609 75026 68111 64818 47155 45195 34254 3804 28862 -22014 -35213
13613c5213q932K4734q077l9769Q9098Q695n8015M9879O4234p471m7681m1337
$$ -35213 -44145 -19411 -27488 -67257 21841 30536 -27479 22400 86634 79163 31482 -9855
13601i855j2048J4560M638j09646j7241P1312K3512p28K6675J9827L1154m677
$$ -9855 -21903 -7343 -2705 -112351 -129592 -58280 -34768 -35496 -8821 11006 42160 37483
13589C7483l0318l6358n9633m7137k0562L7428Q2616j2104n9253K2968N9057K792
$$ 37483 7165 -29193 -88826 -135963 -156525 -119097 -36481 -48585 -107838 -84870 -25813 -23021
13577b3021J239o088J6318N273l6902m6245J8060M8368Q193J8651m4630q7559
$$ -23021 -21782 -27870 -11552 -6279 -43181 -89426 -71366 -22998 -14805 3846 -40784 -128343
13565a28343M3005J9389K5070P8490O1452q669p5568l8900j682M5868j5240j5569
$$ -128343 -85338 -65949 -40879 37611 99063 90394 14826 -24074 -25756 20112 4872 -10697
13553a0697K1731l8899m0965J725j4341m5784N8773m910l340L7091J6200K9398
$$ -10697 11034 -27865 -68830 -67105 -81446 -127230 -68457 -73367 -76707 -39616 -23416 5982
13541E982O7038J8349l9773j5849p212M6531J2462J1569l3456k3528j5680J5882
$$ 5982 73020 91369 51596 35747 28535 75066 87528 99097 65641 42113 26433 42315
13529D2315J2512k2421j5433K1233n5565o9943j2722K1574K3825J7574M3563K2359
$$ 42315 54827 32406 16973 38206 -17359 -87302 -100024 -78450 -54625 -37051 6512 28871
13517B8871p6379m0136N0068L3001N378O207j8494O4684L5374j8295j4226m3157
$$ 28871 -47508 -87644 -37576 -4575 803 7010 -11484 53200 88574 70279 56053 12896
13505A2896k3329J0864J2573K9294l507m6530K462j2180R816M3622L9560K4252
$$ 12896 -10433 431 13004 42298 38791 -7739 -5277 -17457 -7641 35981 75541 99793
13493I9793k2452q6623J0812L4063K5583m614k4219m2142R821O5314P1780o0314
$$ 99793 77341 -9282 1530 35593 61176 56562 32343 -9799 22 65336 137116 76802
13481G6802n9905m2215n832L3022n564o4404J0666j3619K6061l3771j5919M5743
$$ 76802 16897 -25318 -31150 1872 -3692 -68096 -57430 -71049 -44988 -78759 -94678 -48935
13469d8935L8889J2858J9741J1000M171j3329q2222k1728O7491J19132R8733l4753
$$ -48935 -10046 2812 22553 33553 37724 24395 -57827 -79555 -12064 107068 205801 171048
13457A71048p2389p8252q884M6784M7869J5163m7645n5712j0159k7880m968m5034
$$ 171048 98659 20407 11523 58307 106176 121339 73694 17982 7823 -20057 -25025 -70059
13445g0059k2578K1167K0512k599l6356J5499K8398j1520O1127L0485l4640O898
$$ -70059 -92637 -71470 -50958 -53557 -89913 -74414 -46016 -57536 3591 34076 -564 6334
13433F334o639k3335l582J9928K2916j8126N866k6938l6543m186J4149L0965J0029
$$ 6334 -305 -23640 -27222 -7294 15622 -2504 3362 -23576 -60119 -64305 -50156 -19191 -9162
13420i162m8362J4301Q2896n948m9518n4355J9463L7402j1503r867M6832O7519
$$ -9162 -57524 -43223 39673 33725 -15793 -70148 -50685 -13283 -24786 -34653 12179 79698
13408G9698K0394n2268n318P5469J1706J4427K6743n7206L469J4662P8938K1387
$$ 79698 100092 47824 42506 117975 129681 144108 170851 113645 117114 131776 210714 232101
13396B32101o7795m2648R957m0090J352O3308j9084l6928m880M842j0578j1228
$$ 232101 164306 121658 131615 91525 92877 156185 137101 100173 95293 100135 89557 78329
13384G8329J6849m0017l0391m600J8654L4543k0776N227o2801q7747J9250K2804
$$ 78329 95178 55161 24770 20170 38824 73367 52591 57818 -4983 -92730 -73480 -50676
13372e0676N0639K2935j4573L7980n8440k1305P6699J511l9472J4682m0489l9700
$$ -50676 -37 22898 8325 46305 -12135 -33440 43259 44770 5298 19980 -20509 -60209
13360f0209O62P300J6805K8625J3661m9786k8910N8916O3193J2397l910j1467
$$ -60209 -59547 -52247 -35442 -6817 6844 -42942 -71852 -12936 50257 62654 58744 47277
13348D7277K3538K8479j8793P627j3771k4569m2766r523L4204J0560K6270J7578
$$ 47277 70815 99294 80501 88128 74357 49788 7022 -2501 31703 42263 68533 86111
13336H6111l044p3552K5032K1408q150J2581J7685k6605l8183M1074N2124m2394
$$ 86111 83067 9515 34547 55955 47805 60386 78071 51466 13283 54357 106481 64087
13324F4087L616o0956l9850j7808N201m2479m7571M585R2224N7995J0939j4524
$$ 64087 67703 6747 -33103 -50911 -45710 -88189 -135760 -131175 -38951 19044 29983 15459
13312A5459Q9374j3755n2474k5770m4538j0330K2352k2713L4377N9881k2437q776
$$ 15459 104833 91078 38604 12834 -31704 -42034 -19682 -42395 -8018 51863 29426 20650
13300B0650m980l8321P305J4449N1348r602k8808Q05J9632M2550j6833k8471O4717
$$ 20650 15670 -22651 -15346 -897 50451 40849 12041 12846 32478 75028 58195 29724 94441
13287I4441J6384j5440n3351j7383K2035j9307p9695k5305M1785Q1974M3308l7461
$$ 94441 110825 95385 42034 24651 46686 27379 -52316 -77621 -35836 46138 89446 51985
13275E1985m3838m4605J7871O488q997J083n998J0144K3028L6636k1336l0053
$$ 51985 8147 -36458 -18587 -12099 -21096 -20013 -26011 -15867 7161 43797 22461 -7592
13263g592K1815J5310m4424l1586K7649m1685N3633J0575j9661k1172j2203j8427
$$ -7592 14223 29533 -14891 -46477 -18828 -60513 -6880 3695 -15966 -37138 -49341 -67768
13251f7768k8735j0040J4330k845J6611N7250K4794J9254J1372q3317J5182M245
$$ -67768 -96503 -106543 -92213 -95058 -78447 -21197 3597 22851 34223 -49094 -33912 -29667
13239b9667K4233J9130L5293l2324l2363N9598J4824J7865m4805k347l100k7231
$$ -29667 -5434 13696 48989 16665 -15698 43900 58724 76589 31784 29437 26337 -894
13227h94k469O1636k6158j0128P5936m0112m555K1517n0424L502o690k7304J6421
$$ -894 -3363 58273 32115 21987 97923 57811 53256 74773 24349 27851 21161 -6143 10278
13214A0278J3025K486J516K5106j5728k4696n531j4103k7907K6678p002N5138
$$ 10278 23303 25789 27305 52411 36683 11987 6456 -7647 -35554 -8876 -15878 39260
13202C9260l2498o4564L0105p436M4282L007L6167J7337J9192m6010p3393l6420
$$ 39260 6762 -57802 -27697 -35133 9149 12156 48323 65660 84852 38842 -34551 -70971
13190g0971O3924J1607l4704k8989k2162P921P35l5802k8761N4709J13434L6388
$$ -70971 -7047 4560 -30144 -59133 -81295 -73374 -72639 -108441 -137202 -82493 30941 67329
13178F7329o7447j597j2825j2420J255L4373j3041N6045k5313k2861L6271m0666
$$ 67329 -118 -1715 -14540 -26960 -25705 8668 -4373 51672 26359 3498 39769 -897
13166h97k7605L8011M3174j4106k183M8952j4399Q362o4364p9259m4197J1576
$$ -897 -28502 9509 52683 38577 36394 85346 70947 79309 14945 -64314 -108511 -96935
13154i6935O0882k352J9442L3274L779j3715l2523k4954k3096j5414K7995K4160
$$ -96935 -36053 -38405 -18963 14311 18090 4375 -28148 -53102 -76198 -91612 -63617 -39457
13142c9457K0026L8323n4737j0977L2539P2352P6855j6733j14390r634l0527k3919
$$ -39457 -19431 18892 -35845 -46822 -14283 58069 134924 118191 3801 -5833 -36360 -60279
13130f0279M4728R868m3486o2575K0292L2272M6065J07825L565m8389m7532K8455
$$ -60279 -15551 -5683 -49169 -111744 -91452 -59180 -13115 94710 98275 49886 2354 30809
13118C0809m1858J439N0613O4036L7325n6412m1611M0890P9085j7497o3081o2667
$$ 30809 -11049 -9610 41003 105039 142364 85952 44341 85231 164316 146819 83738 21071
13106B1071K1528N2962j863k6046l3958l9891K8378M1134M0877J3317k0911k8042
$$ 21071 42599 95561 93698 67652 33694 -6197 22181 63315 104192 117509 96598 68556
13094F8556K0579l4516n7870m0375N4725N6565K8246o2779m5934O2817O7214K2423
$$ 68556 89135 54619 -3251 -43626 11099 67664 95910 33131 -12803 50014 117228 139651
13082A39651q4950K983M6123P0567k6086q3204l8572K5399L2647M0517k0576m542
$$ 139651 54701 57684 103807 174374 148288 65084 26512 51911 84558 125075 104499 99957
13070I9957n7650j4235O7483M2223r912k6596l9559l3227M5981L4107J0592K5480
$$ 99957 42307 28072 95555 137778 127866 101270 61711 28484 74465 108572 119164 144644
13058A44644j7278m6807j6709j2237l0398l0095p157J2791O222P1608L2509k446
$$ 144644 127366 80559 63850 51613 21215 -8880 -16037 -3246 2976 74584 107093 104647
13046A04647l4381p108K5094j2377j3317n8384l86K2743L5939j6927n1248J8922
$$ 104647 70266 63158 88252 75875 62558 4174 3788 26531 62470 45543 -5705 13217
13034A3217q20L3084m5746n2953k4959L8109L8660o6K6279M2437l9524k4321N2400
$$ 13217 12397 45481 -265 -53218 -78177 -40068 -1408 -1474 24805 67242 27718 3397 55797
13021E5797M126n4277N945k2681k7413K0656L3373R5855R7044o7765j77562p7649
$$ 55797 59923 5646 11591 -11090 -38503 -17847 15526 111381 208425 140660 -36902 -114551
13009a14551j0574K1211R1790Q3997K4280o7837r841L5435N5725j2181K3025O184
$$ -114551 -125125 -103914 -12124 71873 96153 28316 18475 53910 109635 97454 120479 126663
12997A26663k9618N0583J2329n2188k7482j6666n0647n0366l509N1279K4493P411
$$ 126663 97045 147628 159957 107769 80287 63621 12974 -37392 -40901 10378 34871 42282
12985D2282k6260l2360l7170k2755M551q7M3138K6246K8736J7598p134L523q441
$$ 42282 16022 -16338 -53508 -76263 -71712 -71799 -28661 -2415 26321 43919 36785 40308 31867
12972C1867K115O7765l025n3172K9320j3817k5020p755J4230J1861l0840o266
$$ 31867 33982 101747 98722 45550 74870 61053 36033 28278 42508 54369 23529 17263
12960A7263k2252N9366M2482q814l732K8809j8984K7590J5972Q050m3887m3833
$$ 17263 -4989 54377 96859 88045 84313 113122 94138 121728 137700 145750 101863 58030
12948E8030j3118J2327j4248m0564j4917j608p954j1390O024K1477n3740K5891
$$ 58030 44912 57239 42991 2427 -12490 -14098 -22052 -33442 -27418 -5941 -59681 -33790
12936c3790O179m3532l5003M0018M67J2063O6182K8174O252K4695K3296L0809
$$ -33790 -27611 -71143 -106146 -66128 -65661 -53598 12584 40758 47010 71705 95001 125810
12924A25810n199r3339L5601J0731k913K1771Q917n2343n4277m8741L8863Q2844
$$ 125810 120611 27272 62873 73604 70691 92462 101379 49036 -5241 -53982 -15119 67725
12912F7725L0278n868j4121k4581p783J8061j5021n5526O286N6786K2111L0829
$$ 67725 98003 92135 78014 53433 45650 63711 48690 -6836 -550 56236 78347 109176
12900A09176k3730l2864o7285N0202N2308L1164P652j9092k1474K7088l0645o5913
$$ 109176 85446 52582 -14703 35499 87807 118971 126623 107531 86057 113145 82500 16587
12888A6587m5260p1765m1701P9901L5768O190o223M7711L6938J9141k448K5375
$$ 16587 -28673 -100438 -142139 -62238 -26470 -20280 -26503 21208 58146 77287 74839 100214
12876A00214n2091o6201k117M6775J603l2284L3220L1580k1101l8184P3729M1756
$$ 100214 48123 -18078 -20195 26580 28183 -4101 29119 60699 39598 1414 75143 116899
12864A16899m0207J1389J4860o9136m7292j1467J9861M1790P1075o8941L1659
$$ 116899 76692 88081 102941 33805 -13487 -24954 -5093 36697 107772 38831 70490
12853G0490j7484j1401M3267o3155n8573L6044Q2924N2805k6864l2906k2878M908
$$ 70490 53006 41605 84872 21717 -36856 -812 82112 134917 108053 75147 52269 57177
12841E7177L5587N349N323N3659O041k5730n8952n2900j966K0108k4863P663J2814
$$ 57177 92764 98113 103436 157095 163136 137406 78454 25554 23588 43696 18833 26496 39310
12828C9310m034P871J9317R074k1231J2734J7579m4767m3562O8781K574j1729
$$ 39310 35276 43147 62464 71538 50307 63041 80620 35853 -7709 61072 63646 51917
12816E1917l245n519j0328m0332K7715M2979M8542j040j8489j133k194j3751j1523
$$ 51917 48672 43153 32825 -7507 20208 63187 111729 110689 92200 91067 88873 75122 63599
12803F3599j3457L4655l6097q0455K7086k639o380L1466J02556M923o5202n5864
$$ 63599 50142 84797 48700 -31755 -4669 -7308 -13688 17778 120334 125257 60055 4191
12791D191L4462P4315M6131m6895k4562j0744j2579K0621l7105n1589l8913K3900
$$ 4191 38653 112968 159099 112204 87642 76898 64319 84940 47835 -3754 -42667 -18767
12779a8767N6674L6984l1168j7919K7373K0762K5762m0032q0105j180P778N1333
$$ -18767 37907 74891 43723 25804 53177 73939 99701 59669 -20436 -21616 -13838 37495
12767C7495J4736k7515m4908k2267K6495L8300J1603k4102l2260k6147j4549J0137
$$ 37495 52231 24716 -20192 -42459 -15964 22336 33939 9837 -22423 -48570 -63119 -52982
12755e2982K8501K7641o996j3949l1588L9977Q8524l7108l492L4535m3098J6662
$$ -52982 -24481 3160 -3836 -17785 -49373 -9396 79128 42020 38528 73063 29965 46627
12743D6627o901n0634P616K3251j2146k3188l3022M5132M3454K1149k3103k4136
$$ 46627 39726 -10908 -3292 19959 7813 -15375 -48397 -3265 40189 61338 38235 14099
12731A4099M935L8561O7648L2870p0428k8605m0521L2460N8949J887j8639m2098
$$ 14099 19034 57595 125243 158113 87685 59080 18559 51019 109968 111855 93216 51118
12719E1118k8061J7254M9236M5896N114o2179o7309j9673O0735K2637l3990K7434
$$ 51118 23057 40311 89547 135443 140557 78378 11069 -8604 52131 74768 40778 68212
12707F8212O7085j0159k27J4853N960M0843j1397r8578r8813J4456l0694N9169
$$ 68212 135297 125138 124911 139764 145724 186567 175170 76592 -22221 -7765 -38459 20710
12695B0710K4900m6405P2790N1384L1959L386l9260l0968m4701l5015Q485j4608
$$ 20710 45610 -795 71995 123379 155338 158724 119464 88496 43795 8780 17265 2657
12683B657P2738P3885N8551l8255L0509k4004o8606l3364j8218p337K0070N7685
$$ 2657 75395 149280 207831 169576 200085 176081 107475 74111 55893 48556 68626 126311
12671A26311L2227o979m687l7652m0401k1679k2214J357J0436K4560l5528L3247
$$ 126311 158538 151559 146872 109220 68819 47140 24926 26283 36719 61279 25751 58998
12659E8998J2476n37M066R51M6743m521j07929J9282L5940l9852Q717K9627Q5005
$$ 58998 71474 70937 75003 75954 122697 118176 10247 29529 65469 25617 34334 63961 148966
12646A48966K5431q606m1681k2317M7027o338j9272M6438K2840p2363q3770N1429
$$ 148966 174397 165791 124110 101793 148820 142482 123210 169648 192488 120125 36355 87784
12634H7784K6453N6248K5348n2510n7321o614j796K3342l1677o438J11788J5756
$$ 87784 114237 170485 195833 143323 86002 79388 77592 100934 69257 62819 174607 190363
12622A90363o7402l7150R769K8750L1312N7596k5499j5556q0592n1186M2483k1531
$$ 190363 122961 85811 95580 124330 155642 213238 187739 172183 91591 40405 82888 61357
12610F1357K0965L4129l4506K2506j1743j6052m3579J8625M9780K8393L6303j3357
$$ 61357 82322 116451 81945 104451 92708 76656 33077 51702 101482 129875 166178 152821
12598A52821L9386N790n6227k8592J0236L4592J0973k9236R442j3049m2638K2991
$$ 152821 192207 197997 141770 113178 123414 158006 168979 139743 149185 136136 93498 116489
12586A16489l3569k2726M7666j9825m0985J2880m6630o768M490K4709K0037n3346
$$ 116489 82920 60194 107860 88035 47050 59930 13300 6532 11022 35731 55768 2422
12574B422J4161J05312j4904k7271l6364j0721L9894P1339K7138J4270R59o541
$$ 2422 16583 121895 106991 79720 43356 32635 72529 143868 171006 185276 186235 179694
12562A79694r69J363q904J0516m61r170m7383q054M3127k321K5693N070Q88r2338
$$ 179694 178725 180088 171184 181700 181239 172069 124686 116632 159759 157438 183131 188201 189089 96751
12548I6751q47p668j6530O2574M5518l5245k9944j3614j1725J3058P999k672N8700
$$ 96751 95904 88236 71706 134280 179798 144553 114609 100995 89270 102328 110327 107655 166355
12535A66355M3463o45j4729K55o121l3074J9067M8989J5967j2064n7246o6697
$$ 166355 209818 209173 194444 194699 188578 155504 174571 223560 239527 227463 170217 103520
12523A03520l867K4471L4540R272o0004L525P644j423R9426N0458l1617l8153
$$ 103520 99653 124124 158664 167936 107932 111457 119101 117678 217104 267562 235945 197792
12511A97792n33J9114J3154l1951j9304j2333R151j8454L0541M0423l1996o7955
$$ 197792 197259 216373 229527 197576 178272 165939 175090 156636 187177 227600 195604 127649
12499A27649k7384K799K3069k8212L2284K7736j817O195j2095J9191j2574j1671
$$ 127649 100265 103064 126133 97921 130205 157941 156124 162319 150224 169415 156841 145170
12487A45170K3998m6880p192N1363J4075j1106K2958K0499J7695K0668l8883o6894
$$ 145170 169168 122288 115096 166459 180534 169428 192386 212885 230580 251248 212365 145471
12475A45471o2088L6764M2424L7423j8999p6234k0177P2656M204o396R8999K2669
$$ 145471 83383 120147 162571 199994 180995 104761 84584 157240 161444 155048 254047 276716
12463B76716l8380r837j4442k0364J1911K1286K6625k5208K0469j823n980N0429
$$ 276716 238336 228499 214057 193693 205604 226890 253515 228307 248776 246953 240973 291402
12451B91402M2526J8722O611k7228n6289K1126n9915l8839M2638N8873m1995n0392
$$ 291402 333928 352650 359261 332033 275744 296870 236955 198116 240754 299627 257632 207240
12439B07240M9655R698K2538l0270l1375m4139m366N6791K4186N176k3018n1230
$$ 207240 256895 266593 289131 258861 227486 183347 178981 235772 259958 265134 242116 190886
12427A90886m0619M283L4773j3658k065j5315L6231M0159k4975O073k1485J9901
$$ 190886 150267 154550 189323 175665 173600 158285 194516 234675 209700 215773 194288 214189
12415B14189o148L1694k280O948L0959k5611l0366r6154K4798J7093L4871J4184
$$ 214189 208041 239735 237455 244403 275362 249751 219385 123231 148029 165122 199993 214177
12403B14177m1591K7455k719L1920K3749N83K6775m1711q4799J6034M9865K2772
$$ 214177 172586 200041 197322 229242 252991 253574 280349 238638 153839 169873 219738 242510
12391B42510O8124L5126n7152k9674p0179K1354J4384M2149K7196p4947k8088
$$ 242510 310634 345760 288608 258934 188755 210109 224493 266642 293838 218891 190803
12380A90803K8755q950j3242P932L555M9086K2743r531m679l9837k0419Q8606
$$ 190803 219558 210608 197366 205298 208853 257939 280682 271151 266472 226635 206216 294822
12368B94822Q6535p5506j9627K5565l3892j1496K7160n9627m7881K9154P5858
$$ 294822 381357 305851 286224 311789 277897 266401 293561 233934 186053 215207 291065
12357B91065l7109J6545q430K9216P5114n8617n1409L1897L2117K485k4789J3443
$$ 291065 253956 270501 262071 291287 366401 307784 256375 288272 320389 322874 298085 311528
12345C11528m082o348j3474j5753k0518K1927J167N1119Q1059P3062L6304l9549
$$ 311528 307446 301098 287624 271871 251353 273280 274447 325566 406625 479687 515991 476442
12333D76442q160j4524k576k6179m4054n956j5845J9345l2905m7298o199L5045
$$ 476442 468282 453758 451182 425003 380949 374993 359148 378493 345588 298290 292091 327136
12321C27136M1888l8056l1852j5648j0862P3612K4954o1117J0498K1980k5301
$$ 327136 369024 330968 299116 283468 272606 346218 371172 310055 320553 342533 317232
12310C17232n319K0988L9452M0006K710J7897l1182k8452P112R758m0339o4213
$$ 317232 311913 332901 372353 412359 415069 432966 401784 373332 380444 390202 349863 285650
12298B85650r791L1828j8341M6412n526j1359L8723J00647n720n0121l4707m930
$$ 285650 275859 307687 289346 335758 330232 318873 357596 458243 452523 402402 367695 362765
12286C62765O9108k8343m5028k3387J5983k7359j2468L2382M1461K4289L237L8640
$$ 362765 431873 403530 358502 335115 351098 323739 311271 343653 385114 409403 412640 451280
12274D51280l375j989k3585j2659L9884N5988J8165p7539m858R783L3123l9861
$$ 451280 447905 445916 422331 409672 449556 505544 523709 446170 441312 451095 484218 444357
12262D44357O9413P281j1895l0335R486j6199M3282o929j9940K4795J05k0087
$$ 444357 513770 521051 509156 478821 488307 472108 515390 508461 488521 513316 513421 493334
12250D93334K565K9637M1689J0575J9809q606m8644R55p125k6211k3037j4048
$$ 493334 495899 525536 567225 577800 597609 589003 540359 541314 534189 507978 484941 470893
12238D70893K644J3355P3701P6546l1294m6739r462L7349K4510l8842j3392m245
$$ 470893 473537 486892 560593 637139 605845 559106 549644 586993 611503 572661 559269 555024
12226E55024K6783j3050j5767l6101M9098P7700k4947J4885k0162o019O6024L1826
$$ 555024 581807 568757 552990 516889 565987 643687 618740 633625 613463 607444 673468 705294
12214G05294l5067r681J6904j0966m6777J0597Q041k402M7761Q4120L251k0526
$$ 705294 670227 660546 677450 666484 619707 630304 638345 635943 683704 767824 771075 750549
12202G50549p2851n9614q009L2854k871L3658J9052N6144L005r999k8438K6548
$$ 750549 677698 618084 610075 642929 640058 673716 692768 748912 751917 741918 713480 740028
12190G40028N9192M5793r827l8526o5376j8146N1277L1357N5967P142m5157K0990
$$ 740028 799220 845013 835186 796660 731284 713138 764415 795772 851739 858881 813724 834714
12178H34714j0407l2859M8375M6583k19K1103q0403r7000k1304Q8326N7796n885
$$ 834714 824307 791448 839823 886406 886187 907290 826887 729887 708583 796909 854705 848820
12166H48820M8236K5787q716l3277J8725M4411m500m4779K0334l0806J9615K5589
$$ 848820 897056 922843 914127 880850 899575 943986 939486 894707 915041 884235 903850 929439
12154I29439q015R693m970M3182j5825J1952j0945j2127Q0874R2878k5009p0989
$$ 929439 921424 931117 926147 969329 953504 965456 954511 942384 1023258 1116136 1091127 1020138
12142A020138j6122N4835j3400J2676r269O348k1324K214J6725l6209j4567k4862
$$ 1020138 1004016 1058851 1045451 1058127 1048858 1055206 1033882 1036096 1052821 1016612 1002045 977183
12130I77183L0842R4917L634J1106M4752L8699J9082K241n3812o5965J1284n7132
$$ 977183 1008025 1102942 1106576 1117682 1162434 1201133 1220215 1222456 1168644 1102679 1113963 1056831
12118A056831J8654R9377N4324j7477k0570K8915q283j9761N9053R2017J7075
$$ 1056831 1075485 1174862 1229186 1211709 1191139 1220054 1211771 1192010 1251063 1343080 1360155
12107A360155K9732l9598K8231J4292j0576l1158j1336K8321k8964l8875P9505
$$ 1360155 1389887 1350289 1378520 1392812 1382236 1351078 1339742 1368063 1339099 1300224 1379729
12096A379729R3430K3627O9528l8895p5450R005k077J7715K7401K7896j7318l6478
$$ 1379729 1473159 1496786 1566314 1527419 1451969 1460974 1458897 1476612 1504013 1531909 1514591 1478113
12084A478113L6495N5482M6390m0853L967k041N6074K8263n5518m0094L5635M3896
$$ 1478113 1514608 1570090 1616480 1575627 1579594 1577553 1633627 1661890 1606372 1566278 1601913 1645809
12072A645809R6230L0590m2981M3128K4662J542L0192L1762k4605m689q18L45
$$ 1645809 1742039 1772629 1729648 1772776 1797438 1798980 1829172 1860934 1836329 1831640 1830822 1831167
12060A831167L2761J2862M400k514q119K899L8711Q5365K3343n8922j4726N1753
$$ 1831167 1863928 1876790 1881190 1878676 1870557 1873456 1912167 1997532 2020875 1961953 1947227 1998980
12048A998980L7848o052l1629k2292N1442R7108R2665m149L2569j7562k470N3501
$$ 1998980 2036828 2030776 1999147 1976855 2028297 2125405 2218070 2213921 2246490 2228928 2226458 2279959
12036B279959r389M1564K1733j0142L0568M1658L8548J4639j0537M4349k761k1530
$$ 2279959 2270570 2312134 2333867 2323725 2354293 2395951 2434499 2449138 2438601 2482950 2480189 2458659
12024B458659P071N1761L0090q474m0218J7555O7590l694K1569o795m3O273J5355
$$ 2458659 2465730 2517491 2547581 2539107 2498889 2516444 2584034 2580340 2601909 2595114 2595071 2601344 2616699
12011B616699J1646P1254L9927o1901O876J3648P3978J03056N8280N227l1217
$$ 2616699 2628345 2699599 2739526 2677625 2684501 2698149 2772127 2875183 2933463 2938690 2907473
12000B907473K1853O8126N2989k4325l0073k4184O9035M3037K0414k1666L4543
$$ 2907473 2929326 2997452 3050441 3026116 2996043 2971859 3040894 3083931 3104345 3082679 3117222
11989C117222R4249M5840m3795k7170k2422K6445m7932P639K4950O918J9990M4784
$$ 3117222 3211471 3257311 3213516 3186346 3163924 3190369 3142437 3150076 3175026 3181944 3201934 3246718
11977C246718M3891L580K8882N5595J7852l201m0906l624j336L2200K112j1291
$$ 3246718 3290609 3294189 3323071 3378666 3396518 3393317 3352411 3348787 3347451 3379651 3381763 3370472
11965C370472J0321L5652L0062P750q335Q9538N2662J4744P634j8347l6712K6272
$$ 3370472 3380793 3416445 3446507 3454257 3445922 3535460 3588122 3602866 3610500 3592153 3555441 3581713
11953C581713M7491p944K0075J0719n0255m2878j2259L8357K7587j9476K7718
$$ 3581713 3629204 3621260 3641335 3652054 3601799 3558921 3546662 3585019 3612606 3593130 3620848
11942C620848K6419O2j1168k090l7904K0065n6908k1476J8224L4830M723k3748
$$ 3620848 3647267 3647329 3636161 3634071 3596167 3616232 3559324 3537848 3556072 3590902 3595625 3571877
11930C571877K5597m73k2234P3072Q981n7412k6858J5283J2507k981j3160o5843
$$ 3571877 3597474 3597001 3574767 3647839 3656820 3599408 3572550 3587833 3600340 3597359 3584199 3518356
11918C518356l0758j0710l9167p1409M9496p515j2540j7415n3241J1929P06k7862
$$ 3518356 3487598 3476888 3437721 3366312 3415808 3408293 3395753 3378338 3325097 3337026 3337732 3309870
11906C309870k5632J1677n857k4558J9654j9052K8000j8256o474n6813M9760J1286
$$ 3309870 3284238 3295915 3290058 3265500 3285154 3266102 3294102 3275846 3269372 3212559 3262319 3273605
11894C273605j06190p3498K3734O940J0909r55M5327o8723j1986N1308J3790q3477
$$ 3273605 3167415 3093917 3117651 3124591 3135500 3134545 3179872 3111149 3099163 3150471 3164261 3080784
11882C080784l9155p196k9606j2132l263k2969o1970p4411k9677J989M0068k6641
$$ 3080784 3041629 3034433 3004827 2992695 2989432 2966463 2904493 2830082 2800405 2802394 2842462 2815821
11870B815821J1868j2385K2776l5267R168R0694Q0343J43893O0749j6809j4878
$$ 2815821 2827689 2815304 2838080 2802813 2811981 2902675 2983018 3126911 3187660 3170851 3155973
11859C155973k7130n8726k4611o8519l0286l1124m6892q8888l1845k4586j17333
$$ 3155973 3128843 3070117 3045506 2976987 2946701 2915577 2868685 2779797 2747952 2723366 2606033
11848B606033r4797j4512r0294j2042K110q049Q9161J3653K9371m0137o5251j45318
$$ 2606033 2511236 2496724 2406430 2394388 2396498 2388449 2477610 2491263 2520634 2480497 2415246 2269928
11836B269928m8543m4494l4079j9505L0267M8910k9097K870J523k3925J4237L3626
$$ 2269928 2221385 2176891 2142812 2123307 2153574 2202484 2173387 2176257 2177780 2153855 2168092 2201718
11824B201718k9132L152N6117M2684O5605R4685J30375R9960J26059J36499M2090
$$ 2201718 2172586 2175738 2231855 2274539 2340144 2434829 2565204 2665164 2791223 2927722 2969812
11813B969812j82K7774j5389p1396n8219k0208j09793j27748j53352j51016p9726
$$ 2969812 2969630 2997404 2982015 2910619 2852400 2832192 2722399 2594651 2441299 2290283 2210557
11802B210557p4299o2657N7003J02403M3282m664o1834j03486j36040j11492n4762
$$ 2210557 2136258 2073601 2130604 2233007 2276289 2271625 2209791 2106305 1970265 1858773 1804011
11791A804011o0179p0525o2871p255J7637k4216r667q8176j3272O6570k301p277
$$ 1804011 1743832 1673307 1610436 1603181 1620818 1596602 1586935 1498759 1485487 1552057 1549756 1542479
11779A542479r3061k7209P1227Q0792J9124J4807l1568O680R8738J25292J63710
$$ 1542479 1449418 1422209 1493436 1574228 1593352 1608159 1576591 1583271 1682009 1807301 1971011
11768A971011O739L9327M518n2010k8425n0767J6543q0516p9984r6860l2875J5818
$$ 1971011 1977750 2017077 2021595 1969585 1941160 1890393 1906936 1826420 1746436 1649576 1616701 1632519
11756A632519Q7637J01888L9331k003m6604l7718m4028j09904j44742j40468q3598
$$ 1632519 1720156 1822044 1861375 1859372 1812768 1775050 1731022 1621118 1476376 1335908 1252310
11745A252310l6620j2390n0089K2377j9183l1743n6990L8796k393j07779l4022
$$ 1252310 1215690 1203300 1153211 1175588 1156405 1124662 1067672 1106468 1104075 996296 962274
11734I62274L9708J2613P3484N3983n0110J1894l1110m900O7483j6357l8679m8278
$$ 962274 1001982 1014595 1088079 1142062 1091952 1103846 1072736 1067836 1135319 1118962 1080283 1032005
11722A032005m0954q1419n649N8162K1298Q744O219l4758K8278O1091L9543O2053
$$ 1032005 991051 909632 903983 962145 983443 992187 998406 963648 991926 1053017 1092560 1154613
11710A154613J43498Q1475n2965k4744n3615j17615o9113m0211m9124n463J4572
$$ 1154613 1298111 1379586 1326621 1301877 1248262 1130647 1061534 1021323 972199 966736 981308
11699I81308M6894j0014k900J3343j8045r9161n1611k0594j1800K3461O2502k6066
$$ 981308 1028202 1018188 1015288 1028631 1010586 911425 859814 839220 827420 850881 913383 887317
11687H87317n0454J889L5251p924L0119l9286M657K25o0768o3700n0594p865O0671
$$ 887317 836863 838752 874003 866079 896198 856912 861569 861794 801026 737326 686732 678867 739538
11674G39538M5595k4401m399k6844k3367K654M7902q546L6945r120Q997L6540
$$ 739538 785133 760732 756333 729489 706122 708776 756678 748132 785077 775957 784954 821494
11662H21494n860k3784o0622o768L2926K5902L3001L9425L3816j6410k6292n2890
$$ 821494 815634 791850 731228 724460 757386 783288 816289 855714 889530 873120 846828 793938
11650G93938K9063k629k6732k2363k2239j4906J8563M289K5669R276k2521k99
$$ 793938 823001 820372 793640 771277 749038 734132 752695 756984 782653 791929 769408 769109
11638G69109L3568l0449k7188J9415l7923j596R6227M2730m4223K8288J04703
$$ 769109 802677 772228 745040 764455 726532 724936 821163 863893 819670 847958 952661
11627I52661P3981J77887R8255m3412j31332p4069J1574n8355n3978n8182j03799
$$ 952661 1026642 1204529 1302784 1259372 1128040 1053971 1065545 1007190 953212 895030 791231
11616G91231j5390l7128O5787Q208q3624n8010K4514Q8118k0489N2185k1666m6359
$$ 791231 775841 738713 804500 812708 729084 671074 695588 783706 763217 815402 793736 747377
11604G47377l4390k0740K5961J1998m5427k5580L0188N8966Q0764L5579j834N4608
$$ 747377 712987 692247 718208 730206 684779 659199 689387 748353 829117 864696 862862 917470
11592I17470J9389p288J5786j6960l5970l507K3377j3795K168o9080q4669m8020
$$ 917470 936859 929571 945357 928397 892427 888920 912297 898502 900670 831590 746921 698901
11580F98901L1698M9636O4676J4129p907m2253l9599q8133r3094j2248M8295J4936
$$ 698901 730599 780235 844911 859040 851133 808880 769281 681148 588054 575806 624101 639037
11568F39037q167p8386j5438P0736n8064m4004O9535L756m053o136k1401p35L881
$$ 639037 630870 552484 537046 607782 549718 505714 575249 579005 574952 568816 547415 546680 550561
11555E50561P2881N4787R04k4575m6252K8954l6960L7087j150P930L059J4415
$$ 550561 623442 678229 679133 654558 608306 637260 600300 637387 636237 644167 647226 661641
11543F61641M1012P5365K2061L104p110O7578Q2979j7237J1656O2036J6536Q0282
$$ 661641 702653 778018 800079 803183 796073 863651 946630 929393 941049 1003085 1019621 1099903
11531A099903q6768j4689O6180K8577k8531k0091j614j3775R503M0249k1621J7197
$$ 1099903 1013135 998446 1064626 1093203 1064672 1044581 1042967 1029192 1038695 1078944 1057323 1074520
11519A074520J19922Q6533P0991q471P3689Q5121Q1760k2526l9108J8190k2062
$$ 1074520 1194442 1280975 1351966 1343495 1417184 1502305 1584065 1561539 1522431 1540621 1518559
11508A518559o5620j02761j40552o0824l2581o2018j00988j0173O6770J130O4095
$$ 1518559 1452939 1350178 1209626 1148802 1116221 1054203 953215 943042 1009812 1010942 1075037
11497A075037N9366l462O099K9701N7852L4145M3657P7885J11469R6170L0183
$$ 1075037 1134403 1130941 1137040 1166741 1224593 1258738 1302395 1380280 1491749 1587919 1618102
11486A618102R3927R9383Q8763R3482R1319P2069R4489J34643J72723L54482L31758
$$ 1618102 1712029 1811412 1900175 1993657 2084976 2157045 2251534 2386177 2558900 2913382 3245140
11475C245140L68622M59050M84783N83947O23777O05250P95770P81920P01753
$$ 3245140 3613762 4072812 4557595 5141542 5765319 6370569 7166339 7948259 8650012
11466H650012O82267P30163P77192R29233J146298J425683J959943K807469M086449
$$ 8650012 9332279 10062442 10839634 11768867 12915165 14340848 16300791 19108260 23194709
11457B3194709N931767Q131600J0067731J1097011J1229290J0359715Q668404
$$ 23194709 29126476 37258076 47325807 58422818 69652108 80011823 88680227
11450H8680227O725173M578307K114110o0459k019110m316822o463202q678006
$$ 88680227 95405400 99983707 102097817 102037358 100018248 95701426 89238224 80560218
11442H0560218j0443599j1030998j0490697r067797p078844n244257l796470k746821
$$ 80560218 70116619 59085621 48594924 39527127 32448283 27204026 23407556 20660735
11434B0660735j951943j408788j053903q33411m65857k70578l8669J38242K41595
$$ 20660735 18708792 17300004 16246101 15412690 14946833 14676255 14637586 14775828 15017423
11425A5017423L47005N21261O93071Q69049J010851J147964J343541J542499J918087
$$ 15017423 15364428 15885689 16578760 17447809 18458660 19606624 20950165 22492664 24410751
11416B4410751K493689L296482M563654O164677Q135966J1019131J5212121J9956602
$$ 24410751 26904440 30200922 34764576 40929253 49065219 60084350 75296471 95253073
11408I5253073K4219554K6748334K6502527K3190330J7529463J0882455M931858
$$ 95253073 119472627 146220961 172723488 195913818 213443281 224325736 229257594
11401B29257594L82001k797572o137764j0548607j6190514k1807386k5667210
$$ 229257594 229639595 226842023 220704259 210155652 193965138 172157752 146490542
11394A46490542k6366787k3884452j9420684j4428257j0096007p140514n424951
$$ 146490542 120123755 96239303 76818619 62390362 52294355 45153841 39728890
11387C9728890m423974l558528l063651k521960j917525j650044j293331j055861
$$ 39728890 35304916 31746388 28682737 26160777 24243252 22593208 21299877 20244016
11379B0244016q89413p00008n03454k04235j12272J3873K08655L40141M83674
$$ 20244016 19354603 18654595 18151141 17946906 17834634 17848507 18057162 18397303 18880977
11370A8880977P56636J139859J677663K423111L428536N079214P293573J0194933
$$ 18880977 19637613 20777472 22455135 24878246 28306782 33385996 40679569 50874502
11362E0874502J3223459J5161505J5534106J3962952J0741965P236689M250073
$$ 50874502 64097961 79259466 94793572 108756524 119498489 126735178 130985251
11355A30985251J592099l31164k392649n330196q681288j1970663j4442014j5105011
$$ 130985251 132577350 132246186 129853537 124523341 115842053 103871390 89429376 74324365
11347G4324365j4129768j2056086r444701o940578n112671l775829k865959k181523
$$ 74324365 60194597 48138511 38693810 31753232 26640561 22864732 19998773 17817250
11339A7817250j797324j470438j249642j100824r89633q94239q87491q57504o96573
$$ 17817250 16019926 14549488 13299846 12199022 11209389 10315150 9427659 8570155 7873582
11330G873582n59651n10159n05293m49687l91058l28875k94249l19775k97949
$$ 7873582 7313931 6803772 6298479 5848792 5457734 5128859 4834610 4514835 4216886
11321D216886k75071k58229j71656j09061j73426j94710k07930q6691q6613j30074
$$ 4216886 3941815 3683586 3511930 3402869 3229443 3034733 2826803 2740112 2653499 2523425
11311B523425j22930j19320n6752L0015j2547j08683j59425p0342J6597m0139
$$ 2523425 2400495 2281175 2224423 2254438 2241891 2133208 1973783 1903441 1920038 1879899
11301A879899k9536m5120j9870l4955o5768n5333o9228j12499n0127o372L2412
$$ 1879899 1850363 1805243 1785373 1750418 1684650 1629317 1560089 1447590 1397463 1391091 1423503
11290A423503o2799n3390L9964o220l0395k886K6059l969p9910n5480k7821j02777
$$ 1423503 1360704 1307314 1347278 1341058 1310663 1307777 1333836 1329867 1249957 1194477 1166656 1063879
11278A063879j6100l0732n7966m1790o2269l1064j08109P0773K8521P4114J11733
$$ 1063879 1047779 1017047 959081 917291 855022 823958 715849 786622 815143 889257 1000990
11267A000990J54742K1055r7854j36048r2590n6771j20304p7629l3816R845N0337
$$ 1000990 1155732 1176787 1078933 942885 850295 793524 673220 595591 561775 571620 621957
11256F21957O4729J5627M379k577k8364L2754M9577J6962K167r9369j9818L0583
$$ 621957 686686 702313 706692 704115 675751 708505 758082 775044 777211 677842 658024 688607
11244F88607j548k8626q277M8496J01417l9569l6604m0811J2517N1900k7035j2313
$$ 688607 687059 658433 650156 698652 800069 760500 723896 683085 695602 747502 720467 708154
11232G08154q958k0122j15357m3187j7841P0517Q4955N2571o4857n617P5385L9900
$$ 708154 699196 679074 563717 520530 502689 573206 658161 710732 645875 640258 715643 755543
11220G55543J7475J1957J8120P790O349M0714Q3706J52739J44438J57795J81375
$$ 755543 773018 784975 803095 810885 817234 857948 941654 1094393 1238831 1396626 1578001
11209A578001L13208M29797M65709M71452O06603O50187P51610R96492J297836
$$ 1578001 1891209 2321006 2786715 3258167 3864770 4514957 5266567 6263059 7560895
11200G560895J964690L123289N477458R924450J6560674K0843395J8475211J3872067
$$ 7560895 9525585 12648874 18126332 28050782 44611456 65454851 83930062 97802129
11192I7802129Q983367j786388j3262514j7585261j7987553j6569434j2577735
$$ 97802129 106785496 104999108 91736594 74151333 56163780 39594346 27016611
11185B7016611q080076m742659k927093j934329j324872r72456p74120n85787
$$ 27016611 18936535 14193876 11266783 9332454 8007582 7035126 6261006 5675219
11177E675219n49372o16926o06005n17790m58104l32167k34418j87974j57783
$$ 5675219 5125847 4508921 3902916 3385126 2927022 2594855 2360437 2172463 2014680
11168B014680j28889j84249j56285j11284o9788j00055k6024m8681p3684k6785
$$ 2014680 1885791 1701542 1545257 1433973 1364185 1264130 1238106 1189425 1115741 1088956
11158A088956k4944K1457O7385n2091r1669r092K0952n8444o676J0995O7891L1364
$$ 1088956 1064012 1085469 1152854 1100763 1009094 1000002 1020954 962510 955834 966829 1034720 1066084
11146A066084M655P3261J40684Q8965J8496L7307L3359L384j8673j7863n9657
$$ 1066084 1070739 1144000 1284684 1373649 1392145 1429452 1462811 1466195 1447522 1429659 1370002
11135A370002n2235n0194n6526q2000m7408o5812q3370p9273p36p3337l3139j1130
$$ 1370002 1317767 1267573 1211047 1129047 1081639 1015827 932457 853184 852448 779111 745972 734842
11123G34842r2523q1163K924K2763M723o6549O753j8937K3346O4288L3848k5270
$$ 734842 642319 561156 564080 586843 591566 525017 531770 512833 536179 600467 634315 609045
11111F09045p2011P991M3714q120L1053J5954M4102L4174O9636N966L9077J35116
$$ 609045 537034 545025 588739 580619 611672 627626 671728 705902 775538 781504 820581 955697
11099I55697J13946J44203K03985J18370P0163l245q5736q6272m0379N1515K4121
$$ 955697 1069643 1213846 1417831 1536201 1606364 1603119 1517383 1431111 1390732 1442247 1466368
11088A466368J00O3098K2934l3398j20199j26281j53250o5627o8540k2653L4761
$$ 1466368 1466468 1529566 1552500 1519102 1398903 1272622 1119372 1053745 985205 962552 997313
11077I97313k0321m9546o5130M376n148L928P573j38350q5445m9898p5494n6417
$$ 997313 976992 927446 862316 866692 861544 865472 873045 734695 649250 599352 523858 467441
11065D67441j2837q4295n8352l6038k0035O0635J6533q002N3624L4426k954k4675
$$ 467441 454604 370309 311957 275919 255884 316519 333052 325050 378674 413100 410146 385471
11053C85471K3626Q3692N1786P9548M3553M033L2806M5570k0405L7417M1625P4699
$$ 385471 409097 492789 544575 624123 667676 671709 704515 750085 729680 767097 808722 883421
11041H83421M1431J3548K2286l687K2054Q4j0410l3168o5942j9290L659o0500
$$ 883421 924852 938400 960686 956999 979053 979137 968727 935559 869617 850327 853986 793486
11029G93486N693j247K2303P1532P9179O3733k9514o1433o6396o6269o7557K724
$$ 793486 799179 797932 820235 891767 970946 1034679 1005165 943732 877336 811067 743510 746234
11017G46234N3227K7351O1641O1774N3673K4614k9862n4212m6802r1100q3561
$$ 746234 799461 826812 888453 950227 1003900 1028514 998652 944440 897638 806538 722977
11006G22977q3843M342P7796K2080K1844Q3684Q0145J06048k0933L9185M6633
$$ 722977 639134 643476 721272 743352 765196 848880 929025 1035073 1014140 1053325 1099958
10995A099958Q5373R3896L1320N9439L9336J33604M6711K7628R415j5714l7723
$$ 1099958 1185331 1279227 1310547 1369986 1409322 1542926 1589637 1617265 1626680 1610966 1573243
10984A573243j35148k4272n7922J9242m853p8765o9290o2994n9683m8945n9639
$$ 1573243 1438095 1413823 1355901 1375143 1370290 1291525 1222235 1159241 1099558 1050613 990974
10973I90974j5197N6315P6427j843n7109l302J00798Q1200L6349P6797P0651J64451
$$ 990974 975777 1032092 1108519 1106676 1049567 1046265 1147063 1228263 1264612 1341409 1412060 1576511
10961A576511J18342J11498J51097K64518L54143M95125O39149Q21797R29664
$$ 1576511 1694853 1806351 1957448 2221966 2576109 3071234 3710383 4532180 5461844
10952E461844J127058J512086K373172L932551O977653J2423015J8116782J7181291
$$ 5461844 6588902 8100988 10474160 14406711 21384364 33807379 51924161 69105452
10944F9105452R963422O025000O210909K231410o488337j2253946j4060609j5065666
$$ 69105452 79068874 85093874 91304783 93536193 87047856 74793910 60733301 45667635
10936D5667635j3718374r680871n856264l438241k169368j482359j016182o76795
$$ 45667635 31949261 22268390 16412126 12973885 10804517 9322158 8305976 7629181
10928G629181n06223m91493m84381m63732m35593m87219n48482n58735m19857
$$ 7629181 7122958 6631465 6147084 5683352 5247759 4760540 4212058 3653323 3233466
10919C233466l61860k33106k05919j80407r5204j16793j72834r9065r6722p3476
$$ 3233466 2871606 2638500 2432581 2252174 2156970 2040177 1867343 1768278 1671556 1598080
10909A598080j28462q5151p7360m2787p0557k8509P9522J7808p5472k1446L8837
$$ 1598080 1469618 1384467 1307107 1264320 1193763 1165254 1244776 1262584 1187112 1165666 1204503
10898A204503M7592o850p561j4466q6601n9819q952J8474J4403M1928J66211J05739
$$ 1204503 1252095 1245245 1237684 1223218 1136617 1076798 1067846 1086320 1100723 1142651 1308862 1414601
10886A414601J92587L55240N28397O07970M78842L65007K18820l9590k39597l87242
$$ 1414601 1607188 1962428 2490825 3098795 3577637 3942644 4161464 4121874 3882277 3495035
10876C495035l70468m25410m06071l81220k78401j54217k1060q2610j02026j9421
$$ 3495035 3124567 2699157 2293086 1911866 1633465 1479248 1458188 1375578 1273552 1254131
10866A254131o3555l5775K3825k681m9925l6603m7353o4439q2862n8334k5852
$$ 1254131 1190576 1154801 1178626 1175945 1126020 1089417 1042064 977625 894763 836429 810577
10855H10577n769j02624J922J5761p6038o691M4349L2649n2798N3554Q7774M9618
$$ 810577 804808 702184 704106 719867 643829 637138 681487 714136 661338 714892 802666 852284
10843H52284Q2580P7557J00099N4504Q5323J06289J63094J79627J83108J44772
$$ 852284 934864 1012421 1112520 1167024 1252347 1358636 1521730 1701357 1884465 2029237
10833B029237Q0521k8803j40621j84780j51966j26150j60842n5099m8356L9745
$$ 2029237 2109758 2080955 1940334 1755554 1603588 1477438 1316596 1261497 1213141 1252886
10823A252886R591l9258K9813j4657p4462j3723l1327j01496q1115n1069p6004
$$ 1252886 1262477 1223219 1253032 1238375 1163913 1150190 1118863 1017367 936252 885183 809179
10812H09179j04098n8473o3138p3521J025l4398l9381P2721R1001M2275K2085
$$ 809179 705081 646608 583470 509949 510974 476576 437195 509916 600917 643192 665277
10801F65277M6065O141j4124R1694M7174O1498K3677l029l0664k939L006L7280
$$ 665277 711342 717483 703359 795053 842227 903725 927402 924373 893709 890770 893776 931056
10789I31056N1678Q9475J00765M9850P301M3122J19052K6492m3435K3147J23179
$$ 931056 982734 1072209 1172974 1222824 1230125 1273247 1392299 1418791 1375356 1398503 1521682
10778A521682J06722K7126L8537J07437J10066Q7961J17935J60645J63735J07254
$$ 1521682 1628404 1655530 1694067 1801504 1911570 1999531 2117466 2278111 2441846 2549100
10768B549100Q3057M8622R5862J62333J81240K32830L36035M32996N37833N36812
$$ 2549100 2632157 2680779 2776641 2938974 3120214 3353044 3689079 4122075 4659908 5196720
10758E196720N67898O14779O36813P16429P40547Q36790R93149J055887J274413
$$ 5196720 5764618 6379397 7016210 7732639 8473186 9309976 10303125 11359012 12633425
10749A2633425J507692J874376K551448L460276M812251O763316R628335J4178179
$$ 12633425 14141117 16015493 18566941 22027217 26839468 33602784 43231119 57409298
10741E7409298K0630894K7404136L0160382K6025411J8029451P010194p701717
$$ 57409298 78040192 105444328 135604710 161630121 179659572 186669766 178968049
10734A78968049j9656142k5216113k6275208k3808650j8915919j3800010r763730
$$ 178968049 159311907 134095794 107820586 84011936 65096017 51296007 41532277
10727D1532277o934416m980739l558413k592745k004858j593722j293894j121552
$$ 41532277 34597861 29617122 26058709 23465964 21461106 19867384 18573490 17451938
10719A7451938r90455p25695n27282l22931o3143K35968L44659L07914K85841
$$ 17451938 16461483 15735788 15208506 14885575 14822432 15058400 15403059 15710973 15996814
10710A5996814M24708O25437Q36477J081118J311858J680542K196117L015494
$$ 15996814 16421522 17046959 17883436 18964554 20276412 21956954 24153071 27168565
10702B7168565M319982N533065N922867O162756P989506J1689589J8451824K9717411
$$ 27168565 31488547 37021612 42944479 49107235 57096741 68786330 87238154 116955565
10694A16955565M3673695N2189125M9449415L7943242K0117026j875559k4628981
$$ 116955565 160629260 212818385 262267800 300211042 320328068 318452509 293823528
10687B93823528l9408473m4016887m1945940l5986663k8534471k1264745j5795312
$$ 293823528 254415055 210398168 168452228 132465565 103931094 82666349 66871037
10680F6871037j1969880q851278o328941m614047l456525k825088k455820k238321
$$ 66871037 54901157 46049879 39720938 35106891 31650366 28825278 26369458 24131137
10672B4131137j931064j631090j312371r83870p20513o29824n60679n55689m33124
$$ 24131137 22200073 20568983 19256612 18272742 17552229 16922405 16361726 15806037 15372913
10663A5372913l32345k32272q9708K6304K16630M51379O33566R60735J349372
$$ 15372913 15040568 14808296 14718588 14744892 14961522 15412901 16046467 17007202 18356574
10654A8356574J861113K645525L702045N340018P848547J1619845J6765601K2070241
$$ 18356574 20217687 22863212 26565257 31905275 39753822 51373667 68139268 90209509
10646I0209509K3171920J8418372J2089536N027145n350399j4819371j9304081
$$ 90209509 113381429 131799801 143889337 148916482 143566083 128746712 109442631
10639A09442631k0564946j9461736j6065417j1886708q371181n896615m227298
$$ 109442631 88877685 69415949 53350532 41463824 33092643 27196028 22968730
10632B2968730k981681k111295j598639j358381j141061j012465q87646p24668
$$ 22968730 19987049 17875754 16277115 14918734 13777673 12765208 11877562 11152894
10624A1152894n77906l84919k99341k94446k98279k76494k11778r368J63256L01398
$$ 11152894 10574988 10190069 9890728 9596282 9298003 9021509 8809731 8800363 8963619 9265017
10614I265017O08516R66539J413793K109024K956686L875401M615617M652392
$$ 9265017 9873533 10840072 12253865 14362889 17319575 21194976 25810593 30462985
10606C0462985L627714K063085M57197p45109j071366m99510P88021K673963M965131
$$ 30462985 34090699 36153784 36610981 35865872 34794506 34294996 35083017 37756980 42722111
10597D2722111P644316R545203R176506O105632J646419k206128m657019n239524
$$ 42722111 50366427 59911630 69088136 75193768 76840187 74634059 69977040 64737516
10589F4737516l788461j057092K328566O120844R911874J2149278J0731500N338219
$$ 64737516 60949055 59891963 62220529 68341373 78253247 90402525 101134025 106472244
10581A06472244j276924o810362j0164145j0668061q726253n547622j920282J606144
$$ 106472244 105195320 98384958 88220813 77552752 68826499 63278877 61358595 62964739
10573F2964739M494129N939822M660729Q13139l678674p005766q767704q758654
$$ 62964739 67458868 73398690 78059419 78872558 75193884 68188118 59420414 50661760
10565E0661760p137621m862371k579451p12641O52086J187984N10404j090241
$$ 50661760 43524139 38661768 36082317 35369676 36021762 37209746 37720150 36629909
10557C6629909k787321m087514m723056m560085l919336l095205k365234j758916
$$ 36629909 33842588 29755074 25032018 20471933 16552597 13457392 11092158 9333242
10549I333242j336116j087197p72655o15825m24599l26715l63830l44070l51203
$$ 9333242 7997126 6909929 6137274 5521449 5096850 4770135 4406305 4062235 3711032
10540C711032l84418l35254j76763j51035j38859p2609m5567j24462p6354j18162
$$ 3711032 3326614 2991360 2814597 2663562 2524703 2452094 2406527 2282065 2205711 2087549
10530B087549n5538n0262j22576q9967n5751r8339j00758j09335j09525K4437
$$ 2087549 2032011 1981749 1859173 1769206 1713455 1615116 1514358 1405023 1295498 1319935
10520A319935Q879j15392j16307j02155m498n2795q9202k2956K2515L8498K0512
$$ 1319935 1328814 1213422 1097115 994960 990462 937667 848465 825509 848024 886522 907034
10509I07034l6182p4217L7497P1919p846l2319l4763l6607l9232k0418L4444l5092
$$ 907034 870852 796635 834132 906051 898205 865886 831123 794516 755284 734866 769310 734218
10497G34218k1340k1212q7325N116j572J2680J5968P145N8014N3775m7041l1992
$$ 734218 712878 691666 604341 609457 607885 620565 636533 643678 701692 755467 708426 676434
10485F76434p69j0982O454n2662m4113o4509l0603k2388L9175p957n081m1284
$$ 676434 675665 664683 671137 618475 574362 509853 479250 456862 496037 488080 482999 441715
10473D41715n443N144o018K326L3770j7028r898k3889K2238R159K7756m0809J7588
$$ 441715 436272 441416 435398 437724 471494 454466 444568 420679 442917 452076 479832 439023 456611
10460D56611l6845n7193j12083p2627j9460L6931k8828k6697j7531l3883O3653
$$ 456611 419766 362573 250490 177863 158403 195334 166506 139809 122278 88395 152048
10449A52048P8942P8435R6880l7518j09807k6007j4024J2254K8729J6373j4192
$$ 152048 230990 309425 406305 368787 258980 232973 218949 231203 259932 276305 262113
10438B62113J5895P1727O8063P0549L9384n3489k6749o1773l2181N183o8476K947
$$ 262113 278008 349735 417798 488347 527731 474242 447493 385720 353539 358722 290246 293193
10426B93193J741J0654N6816L0200j5344m9900n7850m1382M751n5191n7522l5521
$$ 293193 294934 305588 362404 392604 377260 327360 269510 228128 232879 177688 120166 84645
10414H4645L9949L4903Q907j6725o8137o0581n3436L2895J1002L7905J4396R0410
$$ 84645 124594 159497 168404 151679 83542 22961 -30475 2420 13422 51327 65723 156133
10402A56133L4392l1719M9928K3765M3700J5930j09916p4391j2234l9114p0L6672
$$ 156133 190525 158806 208734 232499 276199 292129 182213 107822 95588 56474 56404 93076
10390I3076P4390N4842O1470J02430Q5713O0600r0426m8021j4493m8231J1492
$$ 93076 167466 222308 283778 386208 471921 532521 442095 394074 379581 331350 342842
10379C42842K1536m9770k7770M5888o3071J865P148m7002M0192O1209M5976j0143
$$ 342842 364378 314608 286838 332726 269655 271520 278668 231666 271858 333067 379043 368900
10367C68900m2109l341L4589l3942o416L7635Q667L0973M1505P837m2517q0476
$$ 368900 326791 323450 358039 324097 317681 355316 363983 394956 436461 444298 401781 321305
10355C21305m8684j4754J7115N0288o981N782r503m5834p8206n7933j265J6173
$$ 321305 272621 257867 274982 325270 318289 324071 314568 268734 190528 132595 131330 147503
10343A47503P2265L4785M418J1202M6444l3589O0064J06414K8648m3090k7951
$$ 147503 219768 254553 258971 270173 316617 283028 343092 449506 478154 435064 407113
10332D07113L8952J11301J22478J54962J42920R0277J8172k8201j02960j59629
$$ 407113 446065 557366 679844 834806 977726 1068003 1086175 1057974 955014 795385
10322G95385j15536j28458j00132r1580K8720p5475k3489l530q583l5347n9422
$$ 795385 679849 551391 451259 359679 388399 312924 289435 285905 277322 241975 182553
10311A82553L002K3974l1850l3583J2499L5131j880l004M4947P3140M9634m9785
$$ 182553 185555 209529 177679 144096 156595 191726 189846 186842 231789 304929 354563 304778
10299C04778k9131n3006k1202J3013m4641L0278J05740P8173o655J1415r57K9923
$$ 304778 275647 222641 201439 214452 169811 200089 305829 384002 377347 388762 387805 417728
10287D17728L6552J01241J92695K49015K56242K57777K11086M6832n0962j73361
$$ 417728 454280 555521 748216 997231 1253473 1511250 1722336 1769168 1718206 1544845
10277A544845j82736k97560k49877j63618j15751p4394q2488q2879p147k9507
$$ 1544845 1362109 1064549 814672 651054 535303 460909 378421 295542 288395 258888
10267B58888j2148k1182k6448K2176P721k0509l4441J6407K0121k3205Q233P3915
$$ 258888 246740 225558 199110 221286 229007 208498 174057 190464 210585 187380 195613 269528
10255B69528R5337L0825m9738k4912j2727J188J8400r061m692j0290k53j2196
$$ 269528 364865 395690 345952 321040 308313 309501 327901 318840 314148 303858 303605 291409
10243B91409R661l9269j9323O5265R6339J07714J30093J15889J28399K2321q0289
$$ 291409 301070 261801 242478 307743 404082 511796 641889 757778 886177 908498 828209
10232H28209n0383p9193p4257p4619o0444o4841j14307l8446J6431l163J3093
$$ 828209 777826 698633 624376 549757 489313 424472 310165 271719 288150 284987 298080
10221B98080p7158j087P10j5392l1465k374l9905m520R844J7739O7316k9044l5410
$$ 298080 220922 219835 220545 205153 173688 171314 131409 126889 136733 154472 221788 192744 157334
10208A57334N361j4403J4871J8675n5886p940o4678n461L3524N3881L1831k4476
$$ 157334 162695 148292 163163 181838 125952 118012 53334 47873 81397 135278 167109 142633
10196A42633P277O257k0979N370j0919j476J1049Q620j0221J3405N4434l3544
$$ 142633 149910 156167 135188 140558 129639 128163 139212 147832 137611 151016 205450 171906
10184A71906q3427l2826K722P9733K966j558l2161J54P0175O1707K1246l2269
$$ 171906 88479 55653 58375 138108 141074 139516 107355 107509 177684 239391 260637 228368
10172B28368l7462K4970j9704j074L6506K6887L5769n1245m6776O91N1842K9096
$$ 228368 190906 215876 196172 195098 231604 258491 294260 243015 196239 196930 248772 277868
10160B77868L9205N2652J03695O993l3528l677l0125K6186K5208l9047n6246M9676
$$ 277868 317073 369725 473420 480413 446885 443208 413083 439269 464477 425430 369184 418860
10148D18860N9465P2689P5099K1175k9187p9214j8870l2408p7431J0227m834k0416
$$ 418860 478325 551014 626113 647288 618101 538887 520017 487609 410178 420405 415571 395155
10136C95155P283N0149m230l2489L6619k7710q6142n4512J6296O0579M8999n7982
$$ 395155 402438 452587 448357 415868 452487 424777 338635 284123 300419 360998 409997 352015
10124C52015o1265k0881K9705L0433m0419n3575q2710R73P028r5452o4610J6707
$$ 352015 290750 269869 299574 330007 289588 236013 153303 154276 161304 65852 1242 17949
10112A7949M2851O58p0242M8528N1226N2390j7863L7956J2940p2892k2992J0211
$$ 17949 60800 61458 -8784 39744 90970 143360 125497 163453 176393 103501 80509 90720
10100I0720N9833J9153J9788Q896L5030O6887m4599o4433r5949p8684o905j7732
$$ 90720 150553 169706 189494 198390 233420 300307 255708 191275 95326 16642 9737 -7995
10088g995M1254n0402o96O8661N1333N4848L0379l0068j3238m6620k7652k0417
$$ -7995 33259 -17143 -17839 50822 102155 157003 187382 157314 144076 97456 69804 49387
10076D9387n249N380o0101L5073O5645K4715L418J2790j7646m6235j6589j7K3984
$$ 49387 44138 49518 -10583 24490 90135 114850 118268 131058 113412 67177 50588 50571 74555
10063G4555M1759j0081J7074J873J398o1485j6569M728L7575K0381M9103k0668
$$ 74555 116314 106233 123307 125180 126578 65093 48524 53252 90827 111208 160311 139643
10051A39643p4072j0187K4886j6862m3995m1636j6553M3861J2509J8446l2290
$$ 139643 65571 55384 80270 63408 19413 -22223 -38776 5085 17594 36040 3750
10040C750k9427M9870L7750M4708L3450K3515m9989r4526o4836O470P1055M2165
$$ 3750 -25677 24193 61943 106651 140101 163616 113627 19101 -45735 -39265 31790 73955
10028G3955J8026K4729N2288q078l2747k0111j8970n922N002O4298o379Q002q3412
$$ 73955 91981 116710 168998 160920 128173 108062 89092 83170 88172 152470 146091 154093 70681
10015G0681n4716J042M7551K7215q874n8166K1435k1580K419N0354J3604L4088
$$ 70681 15965 17007 64558 91773 82899 24733 46168 24588 27007 77361 90965 125053
10003A25053j7446k4001n7401J8698L3470j2315n505j7207q072m0837J0240Q470
$$ 125053 107607 83606 26205 44903 78373 66058 60553 43346 35274 -5563 4677 13147
9991A3147k1899L4031k0451r17R4573k8591j1446K1263j162m6704l2462Q4465
$$ 13147 -8752 25279 4828 3911 98484 69893 58447 79710 78548 31844 -618 83847
9979H3847N2220J3050j9201l0958k7403j8530m6409n731N632Q868p202l0975J2836
$$ 83847 136067 149117 129916 98958 71555 53025 6616 885 6517 15385 8183 -22792 -9956
9966i956L4228M8644r028k2653j4575L955K7744j3975N7030j4702L1827L0177
$$ -9956 24272 72916 63888 41235 26660 30615 58359 44384 101414 86712 118539 148716
9954A48716J4402J3699l2503n5846q2954K5165N3986l8792n8594K6924O0908r193
$$ 148716 163118 176817 144314 88468 5514 30679 84665 45873 -12721 14203 75111 65918
9942F5918J6338J3978N7962N4625k6239K5324K789j5266n853q273j5269j8878
$$ 65918 82256 96234 154196 208821 182582 207906 210695 195429 189576 181303 166034 147156
9930A47156l6413l1834p1096r910M0072L5738J0849k4066J2926j490n2016r985
$$ 147156 110743 78909 7813 -2097 37975 73713 84562 60496 73422 71932 19916 9931
9918I931M1778N0447j7839k0649O3613j1894O681N263j6570n5966K8907j9264
$$ 9931 51709 102156 84317 63668 127281 115387 122068 127331 110761 54795 83702 64438
9906F4438j9911L4171P948j3147J3860J3205l4888l774L1302R4271M3268R3017
$$ 64438 44527 78698 86646 73499 87359 100564 65676 61902 93204 187475 230743 323760
9894C23760P3888l9682p2808m4087l2190m9066l6448m2432l1213k3449J0894K8999
$$ 323760 397648 357966 285158 241071 208881 159815 123367 80935 49722 26273 37167 66166
9882F6166M2097j1544k9819L026k673r592m5993J5212L6547P8898J1886J9339
$$ 66166 108263 96719 66900 69926 67253 57661 11668 26880 63427 142325 154211 173550
9870A73550l1277k6073R422j4228j279k593n6216O8271L6586j05277n9860P3941
$$ 173550 142273 116200 125622 111394 110115 107522 51306 119577 156163 50886 -8974 64967
9858F4967J6201N5153Q5907K9257L5302l475k1939p6926l4354m4306j4926K6536
$$ 64967 81168 136321 222228 251485 286787 283312 261373 184447 150093 105787 90861 117397
9846A17397O653J0601M252j45J290P3663J6637n0662m0686R925q944n0291n2917
$$ 117397 124050 134651 138903 138758 140048 213711 230348 179686 139000 148925 139981 89690 36773
9833C6773L473O0726P307l3194O8051l7490p2936j8515L6454n6382R06L9868J06755
$$ 36773 40246 100972 108279 75085 143136 105646 32710 14195 50649 -5733 -4827 35041 141796
9820A41796N719m8881l1558J6135O1954m695n5321m5851l3700K2628P3512l6220
$$ 141796 147515 98634 67076 83211 145165 140470 85149 39298 5598 28226 101738 65518
9808F5518m8300n4674o564O8989M6159j7194J9016J6710j04603l1167O8108M9222
$$ 65518 17218 -37456 -44020 24969 71128 53934 72950 89660 -14943 -46110 21998 71220
9796G1220K1915J8774O8982L1633j3388o9992n7155k3079J1538M1976k146R260
$$ 71220 93135 111909 180891 212524 199136 129144 71989 48910 60448 102424 100278 109538
9784A09538m684k715m1730j6807L4486m1338l9436J2578n7301R683N7952o7667
$$ 109538 104854 102139 60409 43602 78088 36750 -2686 9892 -47409 -37726 20226 -47441
9772d7441p7613K8875P6296J3934k163o645N5926L2606K8225N212l4448j4487
$$ -47441 -125054 -96179 -19883 -5949 -8112 -14757 41169 73775 102000 107212 72764 58277
9760E8277J02588l01m7678j4590m3864L996L463M5220Q811p9651l5388N0302M3602
$$ 58277 160865 160564 112886 98296 54432 58428 61891 107111 115922 36271 883 51185 94787
9747I4787k4201J390L610l0378q38k0822N9565N4393p7755k3734J4500k1342k7899
$$ 94787 70586 71976 75586 45208 44370 23548 83113 137506 59751 36017 50517 29175 1276
9734A276k5733N9088o667p006L1286j6148M503L7592M385J1891J3176k1009m0905
$$ 1276 -24457 34631 27964 20958 52244 36096 40599 78191 82576 94467 107643 86634 45729
9721D5729K2180K2646j6817o9750o3205K2536O128m975l4052J1597P0660K9967
$$ 45729 67909 90555 73738 3988 -59217 -36681 -30553 -35528 -69580 -57983 12677 42644
9709D2644j2010o2585O2240M1290l2658k7341k0351k9779L3107m376O0050J0372
$$ 42644 30634 -31951 30289 71579 38921 11580 -8771 -38550 -5443 -9819 50231 60603
9697F0603K3403J3666n8319o0388o905n197k5633Q8501L7392p279l477M5629Q5767
$$ 60603 84006 97672 39353 -21035 -27940 -33137 -58770 29731 67123 59844 56367 101996 187763
9684A87763o5437j34755n6991K5184k3919j2049L8262J08339J0489l8855j2969
$$ 187763 122326 -12429 -69420 -44236 -68155 -80204 -41942 66397 76886 38031 25062
9673B5062M1145l1424r370L0785m3308P685L5496o7871K5240O6368l2514k0840
$$ 25062 66207 34783 25413 56198 12890 20575 56071 -11800 13440 79808 47294 26454
9661B6454O5057N2069k6504k3884j1158o7859n0954j2339K1167K3692K2927J6566
$$ 26454 91511 143580 117076 93192 82034 14175 -36779 -49118 -27951 -4259 18668 35234
9649C5234M9795M6599J05955Q1505J42552K05040L2045J866l8376j56746k02816
$$ 35234 85029 131628 237583 319088 461640 666680 698725 700591 662215 505469 302653
9638C02653r5315q1316o6305l0828Q7444j0608o920k1008n151j1364k9710l6666
$$ 302653 207338 126022 59717 28889 116333 105725 98805 77797 72646 61282 31572 -5094
9626e094m6668r368J2526n63K9365N141m232K1588J3320l9328j4650O4914J9996
$$ -5094 -51762 -61130 -48604 -49167 -19802 -14661 -18893 2695 16015 -23313 -37963 26951 46947
9613D6947L9823J7534j0011J17N0926J7170l6460m5826j2981k2763p3590K0534
$$ 46947 86770 104304 94293 94410 145336 162506 126046 80220 67239 44476 -29114 -8580
9601h580j8401n123j80L0026K1621k5512O656J2310L2826K5152l366j5842N989
$$ -8580 -26981 -32104 -32284 -2258 19363 -6149 507 12817 45643 70795 67429 51587 57576
9588E7576j2330m5743M9275O951r145l708j8766k9491K8533M1103J8445k5424
$$ 57576 45246 -497 48778 55729 46584 42876 24110 -5381 23152 64255 82700 57276
9576E7276p1483Q814L9453k0490p2482r850L5863M5252K5759O789m0418m8904
$$ 57276 -14207 -5393 34060 13570 -58912 -68762 -32899 12353 38112 44901 4483 -44421
9564d4421L9757K9477J5456l0193J6042r794m2997l5987J5948N6875O7411K5341
$$ -44421 -4664 24813 40269 10076 26118 16324 -26673 -62660 -46712 10163 77574 102915
9552A02915n7302j5451n405q124O0364L0568L2900k5230n5403o440n4919L4279
$$ 102915 45613 30162 24757 16633 76997 107565 140465 115235 59832 53392 -1527 32752
9540C2752j8528j9928R2656m2379n0233j3779N0696l0874J961n63K3038P918O61
$$ 32752 14224 -5704 86952 44573 -5660 -19439 31257 383 2344 1781 24819 32737 33398
9527C3398N421L0148m4090j7514K8694K8413L5904O924k4895m5500r009j9189
$$ 33398 38819 68967 24877 7363 36057 64470 100374 107298 82403 36903 27894 8705
9515H705L8550K4503m6055n2955M8428m493n352j8679m9237o7926Q0044K969R489
$$ 8705 47255 71758 25703 -27252 21176 16683 11331 -7348 -56585 -124511 -44467 -41498 -32009
9502c2009O0975J0209r168J1342J8175l6667n285l3617m9101J7527R999n003K0651
$$ -32009 28966 39175 30007 41349 59524 22857 17572 -16045 -65146 -47619 -37620 -42623 -21972
9489b1972N534l3495m8406r640P4729Q2132l5233r4818k0277J8668k8429L8769
$$ -21972 -16438 -49933 -98339 -107979 -33250 48882 13649 -81169 -101446 -82778 -111207 -72438
9477g2438K6323n0520m1053k3517L7112O6661k4550l3063J086J10389J5038k7322
$$ -72438 -46115 -96635 -137688 -161205 -124093 -57432 -81982 -115045 -113959 -3570 11468 -15854
9465a5854j03847L1539J09043P9750l183k8434n0451J2686M8491k2916o0739n2082
$$ -15854 -119701 -88162 20881 100631 97448 69014 18563 31249 79740 56824 -3915 -55997
9453e5997K2780O6839j093j3607n0574L5791J568k137j9756m6962k877N8520L1598
$$ -55997 -33217 33622 32529 18922 -31652 4139 5707 3570 -16186 -63148 -66025 -7505 24093
9440B4093J3623n4592k6930M7562L331j631o2013l7414q374M2474L7222J7090
$$ 24093 37716 -16876 -43806 3756 7087 5456 -56557 -93971 -102345 -59871 -22649 -5559
9428e559J3034M4279m97j3078m0379k1710n0085L988L0932M8934o48J0951j4846
$$ -5559 7475 51754 51257 38179 -2200 -23910 -73995 -70007 -39075 9859 9211 20162 5316
9415E316k4981m3833l0960M5291N9777j622j76M2676J3525l5880l8237J7860L3889
$$ 5316 -19665 -63498 -94458 -49167 10610 8988 8812 51488 65013 29133 -9104 8756 42645
9402D2645j9605K5497K779o9488n1417K1358r171J9190J3560N5836M5553l1287
$$ 42645 23040 48537 51316 -18172 -69589 -48231 -57402 -38212 -24652 31184 76737 45450
9390D5450j2559k3292K2375O66N3203l7964o1385K2052n0138o447J8420K0611
$$ 45450 32891 9599 31974 32640 85843 47879 -13506 8546 -41592 -48039 -29619 -9008
9378i008K2747L1738N793l0920R938L4688o8596k6923P5802l2837k7767J6153
$$ -9008 13739 45477 51270 20350 30288 64976 -3620 -30543 45259 12422 -15345 808
9366H08J8196J161M7993M8343R000j3011K4094Q33r8979n9419M9772N9241m7304
$$ 808 19004 20165 68158 116501 125501 112490 136584 137417 38438 -20981 28791 88032 40728
9353D0728k1706k7995K7286K9936M6504L0536l8559m3978k2211K917M0309L2356
$$ 40728 19022 -8973 18313 48249 94753 125289 86730 42752 20541 23458 63767 96123
9341I6123K2742o321n9009p3931J6037p558k2929l6146K3583j019J2529L3208
$$ 96123 118865 112544 53535 -20396 -4359 -11917 -34846 -70992 -47409 -48428 -35899 -2691
9329b691K8372j2423j455J2807l4318P015m0127k6008n3005J6745K5468L7613
$$ -2691 25681 13258 11803 24610 -9708 -2693 -42820 -68828 -121833 -105088 -79620 -42007
9317d2007M7392m462J4185o7153J2412k9252M8977O10M970m2004M057K9150N0886
$$ -42007 5385 923 15108 -52045 -39633 -68885 -19908 -19298 -14328 -56332 -52275 -23125 27761
9304B7761j0507j7572k6208K4385k7458q0079Q5964R6302j5324j0691j3731L2662
$$ 27761 17254 -318 -26526 -2141 -29599 -109678 -23714 72588 57264 46573 32842 65504
9292F5504J2996o5163q7755l934n047L108j2706k6884M9831L5530K377k7856K3591
$$ 65504 78500 13337 -74418 -78352 -83399 -80291 -92997 -119881 -70050 -34520 -32143 -59999 -36408
9279c6408N8272o427J576p766l4488l0479J6468J4459j3404M0798k4582n9332
$$ -36408 21864 15437 17013 9247 -25241 -55720 -39252 -24793 -38197 2601 -21981 -81313
9267h1313l158o219j6725J1535M2287L2976r835j3082l1361K2823M5897j1710
$$ -81313 -84471 -90690 -107415 -95880 -53593 -20617 -30452 -43534 -74895 -52072 -6175 -17885
9255a7885j0897J9238m287l7233r642l084j7922j0667L3734L8708j0896k3161
$$ -17885 -28782 -9544 -13831 -51064 -60706 -63790 -81712 -92379 -58645 -19937 -30833 -53994
9243e3994K2111J1923M5306J1890O868k4556K5168K387O3365N5716o5665n0196
$$ -53994 -31883 -19960 25346 37236 44104 19548 44716 47103 110468 166184 100519 50323
9231E0323m7m750o828n060l3631j9007j8613p7067L1071R7384N111k3131k7060
$$ 50323 50276 45526 38698 33638 7 -19000 -37613 -114680 -83609 13775 18886 -4245 -31305
9218c1305k7562L7963j6900k8879m1256l2123P487M2501J12684N6896L371k3546
$$ -31305 -58867 -20904 -37804 -66683 -107939 -140062 -132575 -90074 22610 79506 82877 59331
9206E9331n2339m8212L6627L352l4440p566k1264m7332O404m032k0538R0111R956
$$ 59331 6992 -41220 -4593 -1241 -35681 -43247 -64511 -111843 -105439 -109471 -130009 -39898 -29942
9193b9942k6050J5639K0481L8635N0620K724p6553o6400N4364P0006k5381k1725
$$ -29942 -55992 -40353 -19872 18763 69383 72107 -4446 -70846 -16482 53524 28143 6418
9181F418l4321K457J7884n800L8026l1141J3257J1193J8176o9728m7925N403J1367
$$ 6418 -27903 -25446 -7562 -13362 24664 -6477 6780 17973 36149 -33579 -81504 -76101 -64734
9168f4734m3500j563J6088k428j6155l5155O057L4306K8321n1332k3820L3633
$$ -64734 -108234 -109797 -93709 -96137 -112292 -147447 -141390 -107084 -78763 -130095 -153915 -120282
9156a20282R8169L8317K6234k8102J85O449K1615o0415k4178l5884P5167M8173
$$ -120282 -22113 16204 42438 14336 14521 20970 42585 -17830 -42008 -77892 -2725 45448
9144D5448L6605K1313J2311o2906m7526M8713K6707M7804J4502K3760r758n0594
$$ 45448 82053 103366 115677 52771 5245 53958 80665 128469 142971 166731 156973 106379
9132A06379n0788k3132J2025j4761m1648K8829J6124Q983K6889P646j5103j7400
$$ 106379 55591 32459 44484 29723 -11925 16904 33028 42011 68900 76546 61443 44043
9120D4043k4367r883j896J4069L4455l0394l1590m5406P0542J9084n6233q5764
$$ 44043 19676 9793 7897 21966 56421 26027 -5563 -50969 19573 38657 -17576 -103340
9108a03340m5763L2486K5782k0316N960P6072J09152m0749m4246L1061K716K3982
$$ -103340 -149103 -116617 -90835 -111151 -105191 -29119 80033 39284 -4962 26099 28815 52797
9096E2797k7966n352l7130q100J426P8831o800l8564m2996m5040J3484J6931j052
$$ 52797 24831 19479 -17651 -25751 -24325 54506 47706 9142 -33854 -78894 -65410 -48479 -49531
9083d9531J2668M2988J1696N1355k7721l5887j0858K6816K2742N4857L3988J2436
$$ -49531 -36863 6125 17821 69176 41455 5568 -5290 21526 44268 99125 133113 145549
9071A45549n1567n6122j8776j3041M4800N9145m1473k5314o5273J8961M9286M8159
$$ 145549 93982 37860 19084 6043 50843 109988 68515 43201 -22072 -3111 46175 94334
9059I4334l7739n2380n0450m6497j6431L4681N2126k2561K6862L7215n738l9416
$$ 94334 56595 4215 -46235 -92732 -109163 -74482 -22356 -44917 -18055 19160 13422 -25994
9047b5994K9036j6816L0987k3804L9270j1149j8100L1383M8171K1774K2k3568
$$ -25994 3042 -13774 17213 -6591 32679 21530 3430 34813 82984 104758 104780 81212
9035H1212J4555n1983o1495p4673K188K6726k2404p559O4268J01168L20Q505o4113
$$ 81212 95767 43784 -17711 -92384 -90196 -63470 -85874 -93433 -29165 72003 72323 80828 16715
9022A6715j6505m638K5415Q4199J2619k7939j8392j49n3404n3805N01K5917L8550
$$ 16715 210 -4428 20987 105186 117805 89866 71474 71325 17921 -35884 -35383 -9466 29084
9009B9084N560L4426k8758M5779J1947k0890n8784m1355m04j0914k2535O259j3660
$$ 29084 34644 69070 40312 86091 98038 77148 18364 -22991 -23395 -34309 -56844 -50585 -64245
8996f4245l7291l2805O8585J5030j9835o445J6610J05050K1306J9782l759j7703
$$ -64245 -101536 -134341 -65756 -50726 -70561 -77006 -60396 44654 65960 85742 81983 64280
8984F4280j2478l5843J6654j9176J3475M9729k8897k2270J3616l3136m5271J0241
$$ 64280 51802 15959 32613 13437 26912 76641 47744 25474 39090 5954 -39317 -29076
8972b9076M005m163J4655L0297m8851J2886K0928J6892n3597p271L1704k3804
$$ -29076 -25071 -29234 -14579 15718 -33133 -20247 681 17573 -36024 -43295 -11591 -35395
8960c5395m028Q927O651R020L9348o833k5615K3833K9393K2051l232k1794K5757
$$ -35395 -39423 -30496 -23845 -14825 24523 17690 -7925 15908 45301 67352 64120 42326 68083
8947F8083M9718m3878m2000K1168l3524k2980k0671l237k8006L406K8067j223
$$ 68083 117801 73923 31923 53091 19567 -3413 -24084 -27321 -55327 -51921 -23854 -25077
8935b5077L0219R650n3857q826P4860O8687J9336q42L08l9331M214P306l5744
$$ -25077 5142 14792 -39065 -47891 26969 95656 114992 114150 114458 75127 79341 86647 50903
8922E0903p511K8000M0460k4369q2542l982J3250L0044j5194m7742L6425j8274
$$ 50903 43392 71392 111852 87483 4941 959 14209 44253 29059 -18683 17742 -532
8910e32k2970k9493P480J4911k3055N1870K8667q254m1357L6688m9406r8494N2035
$$ -532 -23502 -52995 -45515 -30604 -53659 -1789 26878 18624 -22733 13955 -35451 -133945 -81910
8897h1910J8077j1803J9565J5116J8805J3686j096L4264J5155P145l4306O4260
$$ -81910 -63833 -75636 -56071 -40955 -22150 -8464 -9560 24704 39859 47004 12698 76958
8885G6958k5849l8389m843j8428p618J2245K7868n1086j6160N1335L2816R593
$$ 76958 51109 12720 7877 -10551 -18169 -5924 21944 -29142 -45302 6033 38849 48442
8873D8442n8608k6058k4705q433K4144Q466K9971j1870L3641K7531O9131L6358
$$ 48442 -10166 -36224 -60929 -69362 -45218 -36752 -6781 -18651 14990 42521 111652 148010
8861A48010r2262j17614R055M7731J1264N711l6799k5300j4561L3825J0580m210
$$ 148010 55748 -61866 -52811 -5080 6184 11895 -24904 -50204 -64765 -30940 -20360 -24570
8849b4570j2392m57m697N9249L4866K9316m7133m7020L5929J0905l4401o6409
$$ -24570 -36962 -37419 -42116 17133 51999 81315 34182 -12838 23091 33996 -405 -66814
8837f6814j073j7188L5868O787j7785j8584L0294Q2678M6050n8392m5724L3198
$$ -66814 -67887 -85075 -49207 -42420 -60205 -78789 -48495 34183 80233 21841 -23883 9315
8825I315m527K8739J4284M4036j4361l8656r3261n1602N047M6269R502k4843m0202
$$ 9315 4788 33527 47811 91847 77486 38830 -54431 -106033 -100986 -54717 -45215 -70058 -110260
8812a10260J1784O4544J7662J0844L4853J4093j1658k6841P064j4722m1593K4900
$$ -110260 -98476 -33932 -16270 -5426 29427 43520 31862 5021 12085 -2637 -44230 -19330
8800a9330K569k4948j8235K3748k3088J8704K4074P1405n1231j531K8955K4301
$$ -19330 -16761 -41709 -59944 -36196 -59284 -40580 -16506 54899 3668 2137 31092 55393
8788E5393j4373j3747L658L0195j2671q142m2272K3303j4403l5225j3705k0555
$$ 55393 41020 27273 30931 61126 48455 40313 -1959 21344 6941 -28284 -41989 -62544
8776f2544r012J9947j5411L9589N3763k0136j4721M5219K0765J944k2860k4328
$$ -62544 -71556 -51609 -67020 -27431 26332 6196 -8525 36694 57459 59403 36543 12215
8764A2215j9074k1336j5304N7256K0066j5858l6685l5504m5875R804N3161J2194
$$ 12215 -6859 -28195 -43499 13757 33823 17965 -18720 -54224 -100099 -90295 -37134 -24940
8752b4940L892M4283J6448p5884O602N52k2819P830K7799J3852M456k6068K466
$$ -24940 -21048 23235 39683 -36201 -29599 -29047 -51866 -44036 -16237 -2385 2071 -23997 -21531
8739b1531R413M2222q43m0325l3355m2711K7579p354L8693L3178L8159q0998l3730
$$ -21531 -12118 30104 29261 -11064 -44419 -87130 -59551 -66905 -28212 4966 43125 -37873 -71603
8726g1603O5075L9856J0393O590K2231n3503l8378K6350K7950j0001m580k6681
$$ -71603 -6528 33328 43721 50311 72542 19039 -19339 7011 34961 24960 20380 -6301
8714f301J523j7934k0038Q372L1991L5673L6072J5218j8331k3046m1452j3066
$$ -6301 -4778 -22712 -42750 -34378 -2387 33286 69358 84576 66245 43199 1747 -11319
8702a1319n4080j2383L6139R8187O518L4778l0273n4545K7760L7334j6138J2046
$$ -11319 -65399 -77782 -41643 56544 63062 97840 67567 13022 40782 78116 61978 74024
8690G4024k5254k8183L367K2343j5066n559o513m1626N730M320k3671j214k6953
$$ 74024 48770 20587 23954 46297 31231 25672 19159 -22467 -16737 -12417 -36088 -37302 -64255
8677f4255l7201q353L4722K0078k4010k6995l0070M0420K4119O886J3525N726
$$ -64255 -101456 -109809 -75087 -55009 -79019 -106014 -136084 -95664 -71545 -64659 -51134 -45408
8665d5408J8975J6795l6731K1512k5825j0473j7743l1630l8910N1432k8812j9633
$$ -45408 -26433 -9638 -46369 -24857 -50682 -61155 -78898 -110528 -149438 -98006 -126818 -146451
8653a46451J0520Q2722M1192k1440k2811L02q412R382L3059p782J3084M5864j3257
$$ -146451 -135931 -53209 -12017 -33457 -56268 -55966 -64378 -54996 -21937 -29719 -16635 29229 15972
8640A5972k288k0512J6821J2744r245J609J2451K094N734N553R948n152r900L794
$$ 15972 13684 -6828 9993 22737 13492 15101 27552 29646 35380 40933 50881 45729 35829 39623
8626C9623k6897k3101o9336r449j795J9932O1623J2791n2807N7369j29j6751N3316
$$ 39623 12726 -10375 -79711 -89160 -90955 -71023 -9400 3391 -49416 7953 7824 -8927 44389
8613D4389K4291R958m2776K0117L0603n7060k5054M465J8532Q1109j4996p3022
$$ 44389 68680 78638 35862 55979 86582 29522 4468 8933 27465 108574 93578 20556
8601B0556j5029K9527j6865m6849J2983K4091l9179l0639l3173L8207M0333J0705
$$ 20556 5527 35054 18189 -28660 -15677 8414 -30765 -61404 -94577 -56370 -16037 -5332
8589e332P814N222k0790N1457l2361k0580J52P941N3387M9770n6388r6121l3382
$$ -5332 2482 7704 -13086 38371 6010 -14570 -14418 -6477 46910 96680 40292 -55829 -89211
8576h9211J19458N8532m5321j3225j4829j2170J6367J1026K4366Q523J1680m0191
$$ -89211 30247 88779 43458 30233 15404 3234 19601 30627 54993 63516 75196 35005
8564C5005o1840l8197j3644L8906Q1032J6417l973K6261l7026p9549M6338k8834
$$ 35005 -26835 -65032 -78676 -39770 41262 57679 53706 79967 42941 -36608 9730 -19104
8552a9104m470K588o693L0680N3347P646o7479l2027P6539M9793N6890n9352o0480
$$ -19104 -23574 -20986 -27679 3001 56348 63994 -3485 -35512 41027 90820 147710 88358 27878
8539B7878n7395n6087J8576M8026k9395o2752M994K0716K6806N4007J4852m472
$$ 27878 -29517 -85604 -67028 -19002 -48397 -111149 -106155 -85439 -58633 -4626 10226 5754
8527E754p580n5576N6582J5605J680j6997j00491k3736M9086L6637Q023J0742
$$ 5754 -1826 -57402 -820 14785 16465 -532 -101023 -124759 -75673 -39036 -31013 -20271
8515b0271o3366O2377Q2402N4446M908l0694n5658l1902P670J0426j8301M8291
$$ -20271 -83637 -21260 61142 115588 120496 89802 34144 2242 9912 20338 2037 50328
8503E0328J159o537J5452j4296L0201K0258j7660p6064j6555N5865J1037P6796
$$ 50328 51487 44950 60402 46106 76307 96565 78905 2841 -13714 42151 53188 129984
8491A29984l1596k9507K1630o588k757k2911K1509J7576k8856j00828N006J1437
$$ 129984 98388 68881 90511 83923 81166 58255 79764 97340 68484 -32344 -27338 -15901
8479a5901O0242m846j9882J1708l6881l5330K1290k5471k1069L8060K4997J7394
$$ -15901 44341 39495 19613 31321 -5560 -40890 -19600 -45071 -66140 -28080 -3083 14311
8467A4311n8787q0246K1542O2274k4141p990M948K0058K1924O458J2860j3150
$$ 14311 -44476 -124722 -103180 -40906 -65047 -73037 -68089 -48031 -26107 -19649 -6789 -19939
8455a9939K394j9943k6403O0119K3023n191k2363N1897P0366p323k0393J9218
$$ -19939 -17545 -37488 -63891 -3772 19251 14060 -8303 43594 113960 106637 86244 105462
8443A05462K2660L9401J6161p2570j00721j3427k9227l2609l840N4559M4393L2932
$$ 105462 128122 167523 183684 111114 10393 -3034 -32261 -64870 -68710 -14151 30242 63174
8431F3174j5256j4315J836N393K0590m3241o3495o2718N1903J05907L7033q6264
$$ 63174 47918 33603 35439 40832 61422 18181 -45314 -108032 -56129 49778 86811 547
8419E47p2418P3356P110n552K389J9896k5252K1892K9295q969J0266L021j3270
$$ 547 -71871 1485 8595 3043 5432 25328 76 21968 51263 42294 52560 55581 42311
8406D2311k3394o714n574o949k993P963P705m1468j5218P311N2266M0930k3267
$$ 42311 18917 12203 6629 -320 -3313 4650 12355 -29113 -44331 -37020 15246 56176 32909
8393C2909N323K5057M5451O9488N9577R4132J0764k2998n6524j24179j6068m0204
$$ 32909 38232 63289 108740 178228 237805 331937 342701 319703 263179 139000 122932 82728
8381H2728m1463l7284p262J7000j3024j84J0987j5305Q421l0062l5435P6320K4061
$$ 82728 41265 3981 -3281 13719 695 511 11498 -3807 4614 -25448 -60883 15437 39498
8368C9498n7825J1244L5015N43k6580K2029P5991j3707p2321p4610K8156K0896
$$ 39498 -18327 -7083 27932 28475 1895 23924 99915 86208 13887 -60723 -32567 -11671
8356a1671m8719K3696M3467L3281L2091J7288M4173n4870j0303K1432N2520N2147
$$ -11671 -60390 -36694 6773 40054 72145 89433 133606 78736 68433 89865 142385 194532
8344A94532J22021K33530J93904J1227p9972q7679j27181j60873j14525r6433
$$ 194532 316553 550083 743987 755214 675242 587563 460382 299509 184984 88551
8334H8551j2477P24n0402J5141p443N3115j717n3389k0862j9767j7106P0011J2054
$$ 88551 76074 76798 26396 41537 34094 87209 85492 32103 11241 -8526 -25632 44379 56433
8321E6433k0362M8293L7764l6987o1702j9114J2230R187J8685j6095p4852n8032
$$ 56433 36071 84364 122128 85141 23439 4325 16555 25742 44427 28332 -46520 -104552
8309a04552K6068P1997l4370J2162O643j8199Q821L3257J07482O3764P7250N217
$$ -104552 -78484 -6487 -40857 -28695 -22052 -40251 -31430 1827 109309 173073 250323 255540
8297B55540P8450R6697l7165n0519o3322n3513m4628j3908j4776J1434n2464k0806
$$ 255540 333990 430687 393522 343003 279681 226168 181540 167632 152856 164290 111826 91020
8285I1020k2438J7219O4101k115l2784n9150Q954M345p7842k0454L1216N6975
$$ 91020 68582 85801 149902 147787 115003 55853 64807 69152 -8690 -29144 2072 59047
8273E9047L5991m435n46J8360O3l6795L6671M8382J03825J15174O4442m7627r4454
$$ 59047 95038 90603 90057 108417 108480 71685 108356 156738 260563 375737 440179 392552 298098
8260B98098o1271r0937m4383p079K4313j6221j4695j1027k6200R577Q336k6922
$$ 298098 236827 145890 101507 94428 118741 102520 87825 76798 50598 60175 68511 41589
8248D1589L1135m6756L402l739k1310O5850j8978Q059Q206n2975p43r183J5779
$$ 41589 72724 25968 29370 25631 4321 70171 51193 59252 67458 14483 13740 4557 20336
8235B0336k5673K122L8150K1059L834J70K1986J8628o561O5362k574k4179J2957
$$ 20336 -5337 -3215 34935 55994 59828 59998 81984 100612 94051 159413 156839 132660 145617
8222A45617P0580J31255J56742O8556L6020J478j6125n8038j07210j24394j02431
$$ 145617 216197 347452 504194 572750 608770 610248 594123 536085 428875 304481 202050
8211B02050j1805o9092o8045m6869k2514K4102k1905n2429P8149K0731N035l2226
$$ 202050 190245 121153 53108 6239 -16275 7827 -14078 -66507 11642 32373 37408 5182
8199E182m0522P644j1297L2599K239n6629K0695o499l2954J4124o744J0208O9332
$$ 5182 -35340 -27696 -38993 -6394 -4155 -60784 -40089 -46588 -79542 -65418 -72162 -61954 7378
8186G378O9721k0587l4526K4408K4252Q855m4031J7079N4997K6632P8643N6727
$$ 7378 77099 56512 21986 46394 70646 79501 35470 52549 107546 134178 212821 269548
8174B69548j5999M4972J1179r48q5325j15809p3747k3435K3173n6179j05969m4496
$$ 269548 253549 298521 309700 308752 223427 107618 33871 10436 33609 -22570 -128539 -173035
8162a73035J3603R0663J15694J1406N2018M2356n792q2877l8899q263O50l768
$$ -173035 -159432 -68769 46925 58331 110349 152705 146913 64036 25137 16874 17524 13756
8150A3756N576l7361l7996j7993N3198r196P137J4070r07J2045O816k6953l3350
$$ 13756 19332 -18029 -56025 -74018 -20820 -30016 -22879 -8809 -9716 2329 9145 -17808 -51158
8137e1158J1892M4400M773m6901j0225m0697K061K4322M5999L1779k1209k1253
$$ -51158 -39266 5134 9907 -36994 -47219 -87916 -85855 -61533 -15534 16245 -4964 -26217
8125b6217M3708L3638K5868p317p9017J5593N6277l341j9865q6097m5901K4035
$$ -26217 17491 51129 76997 69680 -9337 6256 62533 59192 39327 -46770 -92671 -68636
8113f8636J6026M0110M2106K5880o409J9389l9055m3823k7075M5198M9560j6186
$$ -68636 -52610 -12500 29606 55486 49077 68466 29411 -14412 -41487 3711 53271 37085
8101C7085P144L9904j19458m3399Q8712M5492Q736l7514L6207P612M221n5746
$$ 37085 44229 84133 -35325 -78724 9988 55480 64216 26702 62909 70521 74742 18996
8089A8996j8261j2411m845l2239Q443O8491M0943K1933j9907J0067l8747p6011
$$ 18996 735 -11676 -16521 -48760 -40317 28174 69117 91050 71143 81210 42463 -33548
8077c3548j903k5931J9643O8740k8187L6653M0379N0083j4545o230m0105n7876
$$ -33548 -35451 -61382 -41739 27001 -1186 35467 75846 125929 111384 105154 65049 7173
8065G173L4426R4449M0138J4918J50336K40632J70938O8438j9693p6181j51104
$$ 7173 41599 136048 176186 191104 341440 582072 753010 821448 801755 725574 574470
8054E74470j31584q1899q7264j1401j0221k5739l9140o0304j2234L2596K0612
$$ 574470 442886 360987 273723 262322 252101 226362 187222 126918 114684 147280 167892
8043A67892m2154k0662k5126k3825j0929K3831l279N3110j4415n1718l0134N4926
$$ 167892 125738 105076 79950 56125 45196 69027 65748 118858 104443 52725 22591 77517
8031G7517N3983k2589q155J6355M7056j5468o1803k4604M9083K8009R2418J27584
$$ 77517 131500 108911 100756 117111 164167 148699 86896 62292 111375 139384 231802 359386
8019C59386J45704J60918R6764j5720p7501r5361j03112j35747j04106m298r7829
$$ 359386 505090 666008 762772 747052 669551 574190 471078 335331 231225 226927 129098
8008A29098p4919J7278N5872O6978j2008m1692k000Q719l0347m7070L6456p374
$$ 129098 54179 71457 127329 194307 182299 140607 138607 147326 116979 69909 106365 98991
7996I8991o3622l1329n2547J9061L1088O350K629R992j8848m2473K5278J1146
$$ 98991 35369 4040 -48507 -29446 1642 7992 10621 20613 1765 -40708 -15430 -4284
7984d284n4096k5279L2308J0640N665J8382J208J7708o0651q7235j8112R3228
$$ -4284 -58380 -83659 -51351 -40711 -35046 -16664 -15456 2252 -58399 -145634 -163746 -70518
7972g0518J328J0273P0565P6120r079l6471o8028J7401J08538K9233k3218k5765
$$ -70518 -69190 -58917 11648 87768 78689 42218 -25810 -8409 100129 129362 106144 80379
7960H0379p0734K6346N1533L610k5013l1772k7496l7156J2307o295L9179m0888
$$ 80379 9645 35991 87524 91134 66121 34349 6853 -30303 -17996 -24291 14888 -26000
7948b6000k0788R246l3984p2246K1240O6225L7835j7410P173J0257k0693k9389
$$ -26000 -46788 -37542 -71526 -143772 -122532 -56307 -18472 -35882 -28709 -18452 -39145 -68534
7936f8534m633l953j7663l48K002K286K7135j4864q258o100L3843O5699P450m1329
$$ -68534 -73167 -77120 -94783 -95131 -93129 -90843 -63708 -78572 -86830 -92930 -59087 6612 14062 -27267
7922b7267k004K8097o266j4420j8420n92K7617P836o295R71K4678p746L0966K41
$$ -27267 -29271 -1174 -7440 -21860 -40280 -40872 -13255 -5419 -11714 -10743 13935 6189 37155 37396
7908C7396k9786l9967r577N5772O1192j6813j5638q9232k4186N7339N4163m1134
$$ 37396 7610 -32357 -41934 13838 75030 58217 42579 -46653 -70839 -13500 40663 -471
7896d71J738m271m4888n9823j1246R4927N6069m115O5544K6157l1448l9157M704
$$ -471 1267 -3004 -47892 -107715 -118961 -24034 32035 27920 93464 119621 88173 49016 53720
7883E3720N8060j8967m8862m4095R36J4411J2077o0487n895K7035l3141l7468
$$ 53720 111780 92813 43951 -144 792 15203 27280 -33207 -39102 -12067 -45208 -82676
7871h2676O9785J9378l4115k6106L0765o775l1286N2711P4950K2059n5241j6108
$$ -82676 -12891 6487 -27628 -53734 -22969 -29744 -61030 -8319 66631 88690 33449 17341
7859A7341K8258m0141p0431K8204O6609K5339k9403m0960k8822J4966o476K8994
$$ 17341 45599 5458 -64973 -36769 29840 55179 25776 -15184 -44006 -29040 -35516 -6522
7847f522K8442J5520K3269r6455o7368O1110L5377N972r157N0548P2696l7742
$$ -6522 21920 37440 60709 -35746 -103114 -42004 -6627 -655 -9812 40736 113432 75690
7835G5690q0275M5492j7824n0732m273p908j4820N7331L1951L1872j8813l389
$$ 75690 -4585 40907 23083 -27649 -31922 -39830 -54650 2681 34632 66504 47691 44302
7823D4302p4783l3474j3417m961k4745k0000l0481k6047O4321M9917N9405J02111
$$ 44302 -30481 -63955 -77372 -82333 -107078 -127078 -157559 -183606 -119285 -69368 -9963 92148
7811I2148m7856j9429k884K1691J2040j9920l498m4610m5959J5036K9391k5319
$$ 92148 44292 24863 21979 43670 55710 35790 32292 -12318 -58277 -43241 -13850 -39169
7799c9169L0768o332q6576l7944N8732L4694J3263J5319J2064M3706L6957K8863
$$ -39169 -8401 -14733 -101309 -139253 -80521 -45827 -32564 -17245 -5181 38525 75482 104345
7787A04345K4421m0671l3645K1061L8015j8m7290p9297l4937j917l4957K2807
$$ 104345 128766 88095 54450 75511 113526 113508 66218 -13079 -48016 -49933 -84890 -62083
7775f2083K5148K087K262N4674O2771M9025l1686n1935M8716o530q2571n9158
$$ -62083 -36935 -34848 -32586 22088 84859 133884 102198 50263 98979 92449 9878 -49280
7763d9280N6624M8409k4239k4848J1956K2759l8090j3526K1213P232k2106k2560
$$ -49280 7344 55753 31514 6666 18622 41381 3291 -10235 10978 18210 -3896 -26456
7751b6456K1320K3620K0657k5112l5729P762r321l4910K0223L9333K6745m1190
$$ -26456 -5136 18484 39141 14029 -21700 -13938 -23259 -58169 -37946 1387 28132 -13058
7739a3058J79M87K836n729M9066N2211k2948r274K7635n5653n6510K1187L3464
$$ -13058 -12879 -12392 -9556 -15285 33781 85992 63044 53770 81405 25752 -30758 -9571 23893
7726B3893J3993l5707j3136K429n738j0004j3355r095L8875N8516j8054k6650
$$ 23893 37886 2179 -10957 -8528 -14266 -24270 -37625 -46720 -7845 50671 32617 5967
7714E967K6968j2431j04602R23J8503k0626k5051P7267K2600m860o3417j7849
$$ 5967 32935 20504 -84098 -83175 -64672 -85298 -110349 -33082 -10482 -15342 -78759 -96608
7702i6608L4383L0810p4748k4130K0604O1703l0123r0562L3775J05942N8969k0626
$$ -96608 -62225 -31415 -106163 -130293 -109689 -47986 -78109 -168671 -134896 -28954 30015 9389
7690I389j8698O639j3146l3204j7811J6414M4545k6000k665R376k8810L248L0829
$$ 9389 -9309 -2670 -15816 -49020 -66831 -50417 -5872 -31872 -34537 -25161 -53971 -50723 -19894
7677a9894j3600L7014j3269p1827O7387J1923o135M9190l0119m2233j0331j6425
$$ -19894 -33494 3520 -9749 -81576 -14189 -2266 -8401 40789 10670 -31563 -41894 -58319
7665e8319L6060O8182N1740k6466k7415r4484m1634N4159j0611J4939L8513j509
$$ -58319 -22259 45923 97663 71197 43782 -50702 -92336 -38177 -48788 -33849 4664 3155
7653C155n5129n4395M74Q931n977j7341P53Q0793M2229j5342k7175o0435r675
$$ 3155 -51974 -106369 -105895 -96964 -102941 -120282 -119529 -38736 3493 -11849 -39024 -99459 -109134
7640a09134L3l7733L4214N2887K9656j279K1499J1820k6423J8416K4181j4577
$$ -109134 -109101 -146834 -112620 -59733 -30077 -31356 -9857 1963 -24460 -6044 18137 3560
7628C560J4994J5311K8156M5935Q482M689o1910m9018p6036k9977l2366m1698
$$ 3560 18554 33865 62021 107956 116438 121127 59217 10199 -65837 -95814 -128180 -169878
7616a69878P9606P8036L466o8281k5816O4614J2478M2496M3011j7274m2208l0697
$$ -169878 -90272 -12236 -8770 -77051 -102867 -38253 -25775 16721 59732 42458 250 -30447
7604c0447m6372j528p6105j2193N5147M5118J4187N2954L7418k1538j9144J9456
$$ -30447 -76819 -78347 -154452 -166645 -111498 -66380 -52193 761 38179 16641 -2503 16953
7592A6953j616r6917j1959Q7627k2096l0513J2020l7316L1156j1428J5409j3284
$$ 16953 15337 -81580 -93539 -5912 -28008 -58521 -46501 -83817 -52661 -64089 -48680 -61964
7580f1964o8143K625N1000K8836k8105m1172M8294k6750n9610J4670Q014K7206
$$ -61964 -130107 -127482 -76482 -47646 -75751 -116923 -68629 -95379 -154989 -140319 -132305 -105099
7568a05099N0756k5166L384q425K3404M0436J072q377L0472N060m3291P3396M9455
$$ -105099 -54343 -79509 -76125 -84550 -61146 -20710 -19638 -28015 2457 7517 -35774 37622 87077
7555H7077o8333l7218p287k013k5205J9113K8144L8204J6685P855k579l561M1438
$$ 87077 18744 -18474 -25761 -27774 -52979 -33866 -5722 32482 49167 57022 54443 50882 92320
7542I2320k5415r7083k6837P4639L8634L6262k0040k7137L3138m5506m127P662
$$ 92320 66905 -30178 -57015 17624 56258 92520 72480 45343 78481 32975 28848 36510
7530C6510o1267m1200K2732J824k8062k1573J9959O525j2670N680M1853J6611
$$ 36510 -24757 -65957 -43225 -41401 -69463 -91036 -71077 -64552 -77222 -71542 -29689 -13078
7518a3078m872k0395J5442l1350k9816j4103N2221J770j9094J2573O7538l601
$$ -13078 -17950 -38345 -22903 -54253 -84069 -98172 -45951 -44181 -63275 -50702 16836 13235
7506A3235m2521n3541K0622k3680k2785L7519N925M7232p113j2469m1121l9927
$$ 13235 -29286 -82827 -62205 -85885 -108670 -71151 -65226 -17994 -25107 -37576 -78697 -118624
7494a18624l747N3309Q467J1879k0152l3655J183J7515K8799k3328k1512J2309
$$ -118624 -122371 -69062 -60595 -48716 -68868 -102523 -101340 -83825 -55026 -78354 -99866 -87557
7482h7557p343j4o3109k4789O0237K0571R442j4881Q77M585q503M9509K5326N5756
$$ -87557 -94900 -94914 -158023 -182812 -122575 -102004 -92562 -107443 -106566 -101981 -110484 -60975 -35649 20107
7468B0107K6859K5626J5477K2223p2756m2537k9257k6476N161m434O751J088J8691
$$ 20107 46966 72592 88069 110292 37536 -5001 -34258 -60734 -55573 -60007 -53256 -52168 -33477
7455c3477j9774l0933K0333K9043J2095K1862J8750j1844l4783J8302M751L0830
$$ -33477 -53251 -84184 -63851 -34808 -22713 -851 17899 6055 -28728 -10426 -5675 25155
7443B5155l709o1026M67N8939m4179J3907M8547M4448k2404n3829r1591n5349
$$ 25155 21446 -39580 -39113 19826 -24353 -10446 38101 82549 60145 6316 -85275 -140624
7431a40624K8011n4343j5332J14373K3916N936M0251J5284o0634j03385m0986
$$ -140624 -112613 -166956 -182288 -67915 -43999 -38063 2188 17472 -43162 -146547 -187533
7420a87533M5157M8796k0844K0331L8034Q602q340N4423k0726k9119k704M752
$$ -187533 -142376 -93580 -114424 -94093 -56059 -47457 -55797 -1374 -22100 -51219 -53923 -49171
7408d9171J1568L6024L8267Q678p0525m7682j8290l468k1j0004k9620J2609L4278
$$ -49171 -37603 -1579 36688 45366 -25159 -72841 -91131 -94599 -94620 -104624 -134244 -121635 -87357
7395h7357M6277K6753J0405p038L714M321K289n9626l1489K1877J3030M2710O5493
$$ -87357 -41080 -14327 -3922 -10960 -7246 -2925 -636 -60262 -91751 -69874 -56844 -14134 51359
7382E1359n343m9266m6861K8730j9755o4540K5032N8872n0398m805R690M766N1539
$$ 51359 46016 -3250 -50111 -21381 -41136 -105676 -80644 -21772 -72170 -76975 -67285 -62519 -10980
7369a0980j0813L9273O5297J3450o3422l7917q015M8150L9898K2859L5834m30
$$ -10980 -21793 17480 82777 96227 32805 -5112 -13127 35023 74921 97780 133614 133184
7357A33184j3291m8570q604k1190m8235J4835L0090m2861K0091O0671j4221o1543
$$ 133184 119893 71323 62719 41529 -6706 8129 38219 -4642 15449 76120 61899 356
7345C56j0614K0221r725m3219k0435J6126N9311M6149o219j9049m8249k763N4757
$$ 356 -10258 9963 238 -42981 -63416 -47290 12021 58170 51951 32902 -15347 -18110 36647
7332C6647L440m1218r967l6551m445L0416J1510L4244K3268o2657q2645M5720
$$ 36647 40087 -1131 -11098 -47649 -52094 -21678 -10168 24076 47344 -15313 -97958 -52238
7320e2238N0249J8544k5597r832J4932K1596m9903j9324K8626m725l421k206l7541
$$ -52238 -1989 16555 -9042 -18874 -3942 17654 -32249 -51573 -22947 -27672 -31093 -33299 -70840
7307g0840k6062M0223l0266J7973K3885m7946J2645L9222N8948O2204J6024m0051
$$ -70840 -96902 -56679 -86945 -68972 -45087 -93033 -80388 -41166 17782 79986 96010 55959
7295E5959k0189k2472k1581J5312J9534m9541M3216l168k9299k7433l5009k3284
$$ 55959 35770 13298 -8283 7029 26563 -22978 20238 17070 -12229 -39662 -74671 -97955
7283i7955L4185J8530m67N6002j3898k5374l2477K3996N3516O4980k9981p6512
$$ -97955 -63770 -45240 -45707 10295 -3603 -28977 -61454 -37458 16058 81038 51057 -25455
7271b5455J0317Q0758l8437p7347O987J8670l3857P4961N6184O628m6373l6172
$$ -25455 -15138 65620 27183 -50164 -43177 -24507 -58364 16597 72781 79409 33036 -3136
7259c136j1312k9758K2884R047j2961j3538l1735k8899K1172M7146P4440l7143
$$ -3136 -14448 -44206 -21322 -12275 -25236 -38774 -70509 -99408 -78236 -31090 43350 6207
7247F207o4407m6035J4264j105M5968r900k19l1597P365L7924o156P0442L5460
$$ 6207 -58200 -104235 -89971 -91076 -45108 -55008 -55227 -86824 -79459 -41535 -47691 22751 58211
7234E8211J085K7862M0587K0475o3127p8138j6168j2229N4582N0487m2273l4661
$$ 58211 59296 87158 127745 148220 85093 6955 -9213 -21442 33140 83627 41354 6693
7222F693k187j3265l1342j6081J4261j0474j8717N4236J0924n4032Q310J1456
$$ 6693 4506 -8759 -40101 -56182 -41921 -52395 -71112 -16876 -5952 -59984 -51674 -40218
7210d0218M212r2414p525M2436K0054k259L7886N5564L8567m7614l3246M9241
$$ -40218 -36006 -128420 -135945 -93509 -73455 -75714 -37828 17736 56303 8689 -24557 24684
7198B4684O8777k5323o1385J7284n6334J330k1977J9766N4540O624j7126m2865
$$ 24684 93461 68138 6753 24037 -32297 -30967 -52944 -33178 21362 27986 10860 -32005
7186c2005j5629K3538p541J4085L7486J7272q5580j1903K8486j9576O541M2740
$$ -32005 -47634 -24096 -31637 -17552 19934 37206 -48374 -60277 -31791 -51367 -44826 -2086
7174b086O193k6166m5334k3831L9383J0068j2574l0687q65l702L4756j1513j6720
$$ -2086 4107 -22059 -67393 -91224 -51841 -41773 -54347 -85034 -85899 -89601 -54845 -66358 -83078
7161h3078L2281N0279N8514m6934Q404p0926p6065K2367J31482L2936l3726m5073
$$ -83078 -50797 -518 57996 11062 19466 -51460 -127525 -105158 26324 59260 25534 -19539
7149a9539l2747j3438m2024p5801J0823O7364L6835k0889j5888L0728J0616N128
$$ -19539 -52286 -65724 -107748 -183549 -172726 -105362 -68527 -89416 -105304 -74576 -63960 -58832
7137e8832N5277L8629j2053n7757K9421K2559j6367j5345L7898n4244p654N1288
$$ -58832 -3555 35074 23021 -34736 -5315 17244 877 -14468 23430 -30814 -38468 12820
7125A2820N2479L0586L1487P636n3074n6184L2823l0794k2654N116O938J8197
$$ 12820 65299 95885 127372 135008 81934 25750 58573 27779 5125 10241 17179 35376
7113C5376J4502o2883j0329O8750J5329k1907n1576K7952q354N3323n5532p1110
$$ 35376 49878 -13005 -23334 45416 60745 38838 -12738 15214 6860 60183 4651 -66459
7101f6459N3657M4017l5802p7687n8068R6007O8138J8488o2896k2591M5663L1646
$$ -66459 -12802 31215 -4587 -82274 -140342 -44335 23803 42291 -20605 -43196 2467 34113
7089C4113l8870j1227K9566L2616Q327r769p5525m0709K1409L0535j4112J5373
$$ 34113 -4757 -15984 13582 46198 54525 44756 -30769 -71478 -50069 -19534 -33646 -18273
7077a8273n341M9166p690j6862J2717n2892K0982P593l7990k8031J5635J1409
$$ -18273 -23614 25552 17862 1000 13717 -39175 -18193 -10600 -48590 -76621 -60986 -49577
7065d9577j4820l0827l1261M5808R1618O1943l8811m9933k0726n46j3730K3472
$$ -49577 -64397 -95224 -126485 -80677 10941 72884 34073 -15860 -36586 -37132 -50862 -27390
7053b7390J15528L5076m8520j9012M2324J0263j7257j4607m8758n8141n0913P5216
$$ -27390 88138 123214 74694 55682 98006 108269 91012 76405 27647 -30494 -81407 -6191
7041f191M0815m5486m3553j0408L1366L3779K7735L5288m2313l0938j2381l9561
$$ -6191 34624 -10862 -54415 -64823 -33457 322 28057 63345 21032 -9906 -22287 -61848
7029f1848m6216J8941M6592K3287o562M2894L6039J0748m0435L0899j5019p8985
$$ -61848 -108064 -89123 -42531 -19244 -25806 17088 53127 63875 23440 54339 39320 -39665
7017c9665m3859j1101j5503J9273L5435J8608m297M808m1335m323M8162L9597
$$ -39665 -83524 -94625 -110128 -90855 -55420 -36812 -41109 -36301 -77636 -81959 -33797 5800
7005E800Q771M7311J0883N3632k4145n5765m4730L4610J4529J0678n1370j1584
$$ 5800 14571 61882 72765 126397 102252 46487 1757 36367 50896 61574 10204 -1380
6993a380k5370L1294l8151p8659K7696M8884K5521K8874K4835L2927J5312k6866
$$ -1380 -26750 4544 -33607 -112266 -84570 -35686 -10165 18709 43544 76471 91783 64917
6981F4917R212k2755m6364n779J8330K0859k5783k9287r086l9371J3219L7518
$$ 64917 74129 51374 5010 -769 17561 38420 12637 -16650 -25736 -65107 -51888 -14370
6969a4370M9415M5875q5391p9968j3050P1840L6010m1971l3546J8917K8211L8748
$$ -14370 35045 80920 -4471 -84439 -97489 -25649 10361 -31610 -65156 -46239 -18028 20720
6957B0720n897k4805j3266N4521L2098l7107m2116j3095k1961j0035O6903L5094
$$ 20720 14823 -9982 -23248 31273 63371 26264 -15852 -28947 -50908 -60943 5960 41054
6945D1054l5298n1681n3693jM3005O5414j1201m4137P091L2363k79l8498p6401
$$ 41054 5756 -45925 -99618 -99619 -56614 8800 -2401 -46538 -39447 -7084 -7363 -45861 -122262
6932a22262K4191k0702j9181K3330M0052P8251k3107m540M3208k3767l5958M3303
$$ -122262 -98071 -118773 -137954 -114624 -74572 3679 -19428 -23968 19240 -4527 -40485 2818
6920B818K6050J8125K0424p3844k5893N3829L5408k8105m3866P694p3203k7598
$$ 2818 28868 46993 67417 -6427 -32320 21509 56917 28812 -15054 -7360 -80563 -108161
6908a08161Q5005P2672m5869K3585L9450m2752l29k1645n2968l0266L7810L7843
$$ -108161 -23156 49516 3647 27232 66682 23930 23601 1956 -51012 -81278 -43468 -5625
6896e625J2322N376K9493K8067L9917K3240n404m0405l796n6558j707K1364m1959
$$ -5625 6697 12073 41566 69633 109550 132790 127386 86981 83185 26627 24920 46284 4325
6883D325R585k0120k2343J3676k638M0895J2168J4741O159j8047n5173p5518M4814
$$ 4325 13910 -6210 -28553 -14877 -17515 23380 35548 50289 56448 38401 -16772 -92290 -47476
6870d7476P5786N0463j7715q5496J3097J1526q928n7086L8820O4948O289r07q131
$$ -47476 28310 78773 61058 -24438 -11341 185 -8743 -65829 -27009 37939 44228 43321 35190
6857C5190j4370j7357o2090n9014L0435N0055P8740K8924J398r485n811m7337
$$ 35190 20820 3463 -58627 -117641 -87206 -37151 41589 70513 71911 62426 56615 9278
6845I278l8110l7084o0676L0864L3386L1614L8111j7083l3665Q184o09n247k7174
$$ 9278 -28832 -65916 -126592 -95728 -62342 -30728 7383 -9700 -43365 -35181 -35790 -41037 -68211
6832f8211K2326l1063K4259J9057L4035P24R568k9393r203K3412K2056m3707M984
$$ -68211 -45885 -76948 -52689 -33632 403 1127 10695 -18698 -27901 -4489 17567 -26140 -21156
6819b1156Q3157K0855p4865l1151J6313m1730K2492j1544p095J3517m430m310
$$ -21156 62001 82856 7991 -23160 -6847 -48577 -26085 -37629 -44724 -31207 -35637 -39947
6807c9947n211J0697J8954Q5379L4395n6340m2652M9454K8945J077n6042n5987
$$ -39947 -45158 -34461 -15507 69872 104267 47927 5275 54729 83674 84751 28709 -27278
6795b7278m7903L0349R99j907L105n7110N1729P663p7635j1744J8059K2245O997
$$ -27278 -75181 -44832 -43833 -45740 -42635 -99745 -48016 -40353 -117988 -129732 -111673 -89428 -82431
6782h2431K2665P4100K8657k7067K8499K6072o5301n9477M0894J8356o7780q432
$$ -82431 -59766 14334 42991 15924 44423 70495 5194 -54283 -13389 4967 -62813 -71245
6770g1245J6807m393k0790j4888L3836M7241K4944k8711l96K5680L0591J72K7158
$$ -71245 -54438 -58831 -79621 -94509 -60673 -13432 11512 -17199 -17595 8085 38676 38848 66006
6757F6006N414J4783k1892Q461l9655J157j2429l182k3607j8683P7756l4245o4052
$$ 66006 71420 86203 64311 72772 33117 34274 21845 18663 -4944 -23627 54129 19884 -44168
6744d4168q898J1394l3249L3824J5275n0041J9660N0496P454k903m6938Q240m045
$$ -44168 -53066 -41672 -74921 -41097 -25822 -75863 -56203 -5707 1747 -1156 -48094 -39854 -43899
6731d3899m0393M9583N6634K9661K2963K982m041l3714m6129l4816j9655l3284
$$ -43899 -84292 -34709 21925 51586 74549 77531 73490 39776 -6353 -41169 -60824 -94108
6719i4108j799M965J7250K634K3579k0355m756Q8501R888n7332n4761Q775P582
$$ -94108 -95907 -90942 -73692 -71058 -47479 -67834 -72590 15911 25799 -31533 -86294 -77519 -69937
6706f9937l046n8397M5415M5739j6798K2972K9694J3155N1034M6701J2397j6064
$$ -69937 -72983 -131380 -85965 -40226 -57024 -34052 -4358 8797 59831 106532 118929 102865
6694A02865l3444k7127n4672j5345L4727J1354K0473k8619m2925J1701O2043j1550
$$ 102865 69421 42294 -12378 -27723 7004 18358 38831 10212 -32713 -21012 41031 29481
6682B9481K1051n1977M676k127o0243R100j2896l792L7611K0362M5521o449j9130
$$ 29481 50532 -1445 3231 1104 -59139 -50039 -62935 -66727 -29116 -8754 36767 30318 11188
6669A1188O151l6393l7100n2074K7157O6369K4820K432m9269l9770k5943j4863
$$ 11188 17339 -19054 -56154 -108228 -81071 -14702 10118 12550 -36719 -76489 -102432 -117295
6657a17295O2369P3961K7964m6393k4475j2610L8967K5545Q966k2606L914n171
$$ -117295 -54926 19035 46999 606 -23869 -36479 2488 28033 36999 14393 18307 13136
6645A3136l6989q8429l7540R0428J2075j2360K613j0789J2703L9558j7287q215
$$ 13136 -23853 -112282 -149822 -59394 -47319 -59679 -57066 -67855 -55152 -15594 -32881 -41096
6633d1096J1619k1993k6335J7778M2142L0227p060o9368n0485L0226R8253Q9677
$$ -41096 -29477 -51470 -77805 -60027 -17885 12342 5282 -64086 -114571 -84345 13908 103585
6621A03585m8241J0746K1991j9962l3098m2799n5447L2179j9197p333J3434k3085
$$ 103585 55344 66090 88081 68119 35021 -7778 -63225 -31046 -50243 -57576 -44142 -67227
6609f7227L015J8868K3518O1778Q6574j7375j05107n3450L2194N6934k5652L8704
$$ -67227 -64212 -45344 -21826 39952 126526 109151 4044 -49406 -17212 39722 14070 52774
6597E2774j9878n2086M5762K8602k6376k3414l1881m7556P5421O6886M6953l6759
$$ 52774 32896 -19190 26572 55174 28798 5384 -26497 -74053 1368 68254 115207 78448
6585G8448j09470l4829l5884K9075O4115N789j7390j1889K4869L0086O5322l9599
$$ 78448 -31022 -65851 -101735 -72660 -8545 -2756 -20146 -32035 -7166 22920 88242 48643
6573D8643l5349l5630j03307K7240P5143n8282O0880R6860l5641l2157q8512M845
$$ 48643 13294 -22336 -125643 -98403 -23260 -81542 -20662 76198 40557 8400 -80112 -75267
6561g5267O1871n6884l2836J2370N9673L7062J7531J3240r623r339K7906K6815
$$ -75267 -13396 -70280 -103116 -90746 -31073 5989 23520 36760 27137 17798 45704 72519
6549G2519j1464l7418k1866L8291j8043m2392O6891J985N010j1287l9670L1238
$$ 72519 61055 23637 1771 40062 22019 -20373 46518 48503 53513 42226 2556 33794
6537C3794J8919j4294l0180k9984j2654L2201L5588k9197k1988K7666J3733M7677
$$ 33794 52713 38419 8239 -21745 -34399 -2198 33390 4193 -17795 9871 23604 71281
6525G1281P12J9328k8151k7445N5158j9080m9986p5413M3930L3490k7035J1748
$$ 71281 71993 91321 63170 35725 90883 71803 21817 -53596 -9666 23824 -3211 8537
6513H537Q766p2702o9766l848P4497J9946J5079L6827J03145J3470p9533j9451
$$ 8537 17303 -55399 -125165 -129013 -54516 -34570 -19491 17336 120481 133951 54418 34967
6501C4967j2113p989j9140K9853J0971p6387J8735K9521J4719k5027m4070L207
$$ 34967 22854 14865 -4275 25578 36549 -39838 -21103 8418 23137 -1890 -45960 -42753
6489d2753n5878M7616Q6493p244r600j3938j2844L6462j6870l4559K8826R674
$$ -42753 -98631 -51015 35478 28234 18634 4696 -8148 28314 11444 -23115 5711 15385
6477A5385N8837K5416n0859O871R087o3804o2682K4999p001m3325o50N133N0957
$$ 15385 74222 99638 48779 55650 64737 933 -61749 -36750 -43751 -87076 -87726 -82593 -31636
6464c1636K5236k4468k000Q893l767O766L4472N3102R590l7030o9580j7042n4309
$$ -31636 -6400 -30868 -32868 -23975 -27742 -20976 13496 66598 76188 39158 -30422 -47464 -101773
6451a01773L5638q415K9588J2694k3160R705J9392K9363M8406M3028m8036J5537
$$ -101773 -66135 -74550 -44962 -32268 -55428 -45723 -26331 3032 51438 94466 46430 61967
6439F1967k088m7082p296k6170J2409L7118J7781j9537l2978k7225r84M2732J5942
$$ 61967 59879 12797 5501 -20669 -8260 28858 46639 27102 -5876 -33101 -34085 8647 24589
6426B4589Q0638o886n3106j9079R7122K8853p2334j9785L811o5746l3826J3772
$$ 24589 105227 98341 45235 26156 123278 152131 79797 60012 63823 -1923 -35749 -21977
6414b1977K1247n6894J9040L437j2377o232L6327o278j7973M2594R1166j3467
$$ -21977 -730 -57624 -38584 -35147 -47524 -53756 -17429 -23707 -41680 914 92080 78613
6402G8613j18695j5764j2154k8557l2090O3508Q7475M9560l880m9396l2732M518
$$ 78613 -40082 -55846 -68000 -96557 -128647 -65139 22336 71896 68016 18620 -14112 -9594
6390i594o0009l1335M4311O9532k4704J0210L4735o875m2288m9074K2339k8052
$$ -9594 -69603 -100938 -56627 12905 -11799 -1589 33146 26271 -16017 -65091 -42752 -70804
6378g0804L9164M462m2854q6119J1230R5215Q9306L770k9125J0429M3446J9358
$$ -70804 -31640 -27178 -70032 -156151 -144921 -49706 39600 43370 14245 24674 68120 87478
6366H7478k2785l347O5174k8305n3525o5460k2989L2456Q798j0857r879j3096
$$ 87478 64693 61346 126520 98215 44690 -20770 -43759 -11303 -2505 -13362 -23241 -36337
6354c6337l8191O8893P0076L0688o0490j2835k4363l5079j9789R769M6139K0785
$$ -36337 -74528 -5635 64441 95129 34639 21804 -2559 -37638 -57427 -47658 -1519 19266
6342A9266l1653K0892J6724l6227l2346k4775L076k447J1720L9168P8547J553
$$ 19266 -12387 8505 25229 -10998 -43344 -68119 -65043 -67490 -55770 -16602 61945 63498
6330F3498J9893j1858J2973K5336j8030l4855m791L888k8363K2082K9390r1196
$$ 63498 83391 71533 84506 109842 91812 56957 52166 56054 27691 49773 79163 -12033
6318a2033r7112J9518M1127n3147J2408J0432N71K1078P9351K2351J5374m2020
$$ -12033 -109145 -89627 -48500 -101647 -89239 -78807 -78236 -57158 22193 44544 59918 17898
6306A7898o4882J5554p628j7300L3097J6319M8165q0540k4055L1154j2501k9868
$$ 17898 -46984 -31430 -39058 -56358 -23261 -6942 41223 -39317 -63372 -32218 -44719 -74587
6294g4587M1551O4533M7450K2586k547j8374O0462l1064p3534m5731r275k5843
$$ -74587 -33036 31497 78947 101533 98986 80612 141074 110010 36476 -9255 -18530 -44373
6282d4373L5798M9719r026o8232J098K103k966L8082O3377K3582m9030o6601P281
$$ -44373 -8575 41144 32118 -36114 -35016 -32913 -35879 2203 65580 89162 40132 -26469 -19188
6269a9188o542k0560R9401R6158n5197j04568l2431M5746P9505J4762l0044k3801
$$ -19188 -25730 -46290 53111 149269 94072 -10496 -42927 2819 82324 97086 67042 43241
6257D3241k0810l3976k883N5390Q0134l0371q0472r3424M027L1371M3154O3074
$$ 43241 22431 -11545 -14428 40962 121096 90725 10253 -83171 -79144 -47773 -4619 58455
6245E8455J2661p3555J7099l6136K8298M5192m0110K5055l4990k7333o421j8332
$$ 58455 71116 -2439 14660 -21476 6822 52014 11904 36959 1969 -25364 -31785 -50117
6233e0117m0588M0397j3524j07040L1460J00774R2325K1034l765p0090m1359m8450
$$ -50117 -90705 -50308 -63832 -170872 -139412 -38638 53687 74721 70956 866 -40493 -88943
6221h8943j7230K1163L8317Q872k8030r973k2537j7457P736O7842O0274m7724
$$ -88943 -106173 -85010 -46693 -37821 -65851 -75824 -98361 -115818 -108082 -40240 20034 -27690
6209b7690L9648L0100l1454J871J886n7493L5301l0529O043J2969M3729J6842
$$ -27690 11958 42058 10604 12475 14361 -43132 -7831 -38360 -32317 -19348 24381 41223
6197D1223j6186n4886j3921N2218J7398l0412O559j5230j8813J6876l3149m9113
$$ 41223 25037 -29849 -43770 8448 25846 -4566 1993 -13237 -32050 -15174 -48323 -97436
6185i7436l5004j0654j2154j7860L8479O7047M0395p2123k435K9215K4039O4489
$$ -97436 -132440 -143094 -155248 -173108 -134629 -67582 -27187 -99310 -101745 -72530 -48491 15998
6173A5998K7199o5755j8561K4707j0955k9016k5424j9719M0826L5306j1509j7623
$$ 15998 43197 -22558 -41119 -16412 -27367 -56383 -81807 -101526 -60700 -25394 -36903 -54526
6161e4526M065J9708k6570J7291m3584J7163L4399K3866J0191k9897m7363M8388
$$ -54526 -50461 -30753 -57323 -40032 -83616 -66453 -32054 -8188 2003 -27894 -75257 -26869
6149b6869O4006n818k7259Q9208j9859r5257k3375O7518N8277o3114O712N8006
$$ -26869 37137 31319 4060 93268 73409 -21848 -45223 22295 80572 17458 24170 82176
6137H2176l8853n6390M8962O828p3327M4480L7523j132j6973p4996L3334r021
$$ 82176 43323 -13067 35895 42723 -30604 13876 51399 50267 33294 -41702 -8368 -17389
6125a7389k0168K0713l7547K613J8397Q0814J2842j4564j1054K6649J4208L6860
$$ -17389 -37557 -16844 -54391 -51778 -33381 47433 60275 45711 34657 61306 75514 112374
6113A12374p8932m1530O956K1564j6487j210K4603k0567m7042l3072M6412M4180
$$ 112374 33442 -8088 -1132 20432 3945 2735 27338 6771 -40271 -73343 -26931 17249
6101A7249j7205J6223K7690M487j7497j460k1203L1212L3210n479l8012k9739
$$ 17249 44 16267 43957 48444 30947 29487 8284 39496 72706 67227 29215 -524
6089e24J865L2922L852p364n3081N7511L714k2062K1033J3979k1367k4941K8745
$$ -524 1341 34263 38115 30751 -22330 35181 38895 16833 37866 51845 30478 5537 34282
6076C4282m942j9074o2433k1924m5381K6263m0190O7334L9621J3985l3329j6027
$$ 34282 29340 10266 -52167 -74091 -119472 -93209 -133399 -66065 -26444 -12459 -45788 -61815
6064f1815P68O3147N3108M9983O937m0931m6353j5838m3487k1615J893N0085M5780
$$ -61815 -61047 2100 55208 105191 112128 71197 24844 9006 -34481 -56096 -54203 -4118 41662
6051D1662l7831n2957L1727O708J1970J462j6678j9133M7314l42O1604Q897l0944
$$ 41662 3831 -49126 -17399 -10691 1279 2741 -13937 -33070 14244 13902 75506 84403 53459
6038E3459J3329p0415m0821N426J7565J816m3888M0748l5436q1790J7585M8074
$$ 53459 66788 -3627 -44448 -39022 -21457 -19641 -63529 -22781 -58217 -140007 -122422 -74348
6026g4348L5248l3453l1527M2743M9283p493K913j9219M4537O5841O918J1005
$$ -74348 -39100 -72553 -104080 -61337 -12054 -19547 -16634 -35853 8684 74525 81443 92448
6014I2448Q000m7929j2481K5602J6120q6887o5906N5839J9127n5788L9202Q1497
$$ 92448 100448 52519 40038 65640 81760 -5127 -71033 -15194 3933 -51855 -12653 68844
6002F8844K4738O740l0503k7550r106J0479j6408J1362k0430l0405m0605K5129
$$ 68844 93582 100322 69819 42269 33163 43642 27234 38596 18166 -12239 -52844 -27715
5990b7715L6730J8634J0647J2791m0230k029J9891M6004p420j3241k6675m8928
$$ -27715 9015 27649 38296 51087 10857 8828 28719 74723 67303 54062 27387 -21541
5978b1541l2977N6608P3316k7471o1478q1352L0848L6738m0525k8142L1935J0048
$$ -21541 -54518 2090 75406 47935 -13543 -94895 -64047 -27309 -67834 -95976 -64041 -53993
5966e3993L6928Q038r270J6610n6563J5542M1581n76m2994K211K1583J3471l123
$$ -53993 -17065 -9027 -18297 -1687 -58250 -42708 -1127 -1703 -44697 -42486 -20903 -7432 -10555
5953a0555o6L4272K6396j472L7809j5139j1140N072K419n897O18R291n3816m5276
$$ -10555 -10621 23651 50047 48575 86384 71245 60105 65177 67596 61699 62317 71608 17792 -27484
5939b7484N167J2355J0835L996Q458K2687J4693O764l4912R154J4825p064j5688
$$ -27484 -22317 -9962 873 4869 13327 36014 50707 57471 22559 31713 46538 39474 23786
5926B3786j9661P884O253n2801l4779J9257K1310Q6954q471o6941m605M0204j6982
$$ 23786 4125 12009 18262 -34539 -69318 -50061 -28751 58203 49732 -17209 -21814 18390 1408
5913A408K3226N6512L755p9093q220M835n0039l9894L524K2119k2136L5283N9568
$$ 1408 24634 81146 84901 5808 -2412 2423 -47616 -87510 -83986 -61867 -84003 -48720 10848
5900A0848O955m9649r435m1516l017L7076k6M4785L9325K4003l0925n7038o955
$$ 10848 17803 -31846 -41281 -82797 -85814 -48738 -48764 -3979 35346 59349 28424 -28614 -35569
5887c5569Q5421k2666j5898k0411m6351o1046M1994J5805k508M7335M7767L8077
$$ -35569 49852 27186 11288 -9123 -55474 -116520 -74526 -58721 -61229 -13894 33873 71950
5875G1950n4563N664M8995M6500m4550o3306o1080k5889L4421L6736K7686P2474
$$ 71950 17387 23051 72046 118546 73996 10690 -50390 -76279 -41858 -5122 22564 95038
5863I5038J9670l446k8182m6786L317K4963O481q796j8681j5191N6666l2784P612
$$ 95038 114708 111262 83080 36294 39611 64574 71055 62259 43578 28387 85053 52269 59881
5850E9881o4202k3359L9464p0503m4984L1115L2416j5752J8039M2211K1378k0857
$$ 59881 -4321 -27680 11784 -58719 -103703 -72588 -40172 -55924 -37885 4326 25704 4847
5838D847O0342l729n711j0754J0609k7408p4046k2123j0110p287L734P8365O2224
$$ 4847 65189 61460 55749 44995 55604 28196 -45850 -67973 -78083 -85370 -81636 -3271 58953
5825E8953J5239j00743q6404M8068L3419R121k3594l3260p8725N012P6188P8944
$$ 58953 74192 -26551 -112955 -64887 -31468 -22347 -45941 -79201 -157926 -152914 -76726 2218
5813B218K3245p3859p570R0097j491j4409J426o4122q216M2681M3482O410l3495
$$ 2218 25463 -48396 -55966 34131 32640 18231 19657 -44465 -52681 -10000 33482 39892 6397
5800F397n7488l6437o124k3718K959L8719J7341k2899L3630J8946l2136k9910
$$ 6397 -51091 -87528 -93652 -117370 -114411 -75692 -58351 -81250 -47620 -28674 -60810 -90720
5788i0720J7017K2724j7204r089M3627L2983J2524K370K1318J3996j0448m646
$$ -90720 -73703 -50979 -68183 -77272 -33645 -662 11862 14232 35550 49546 39098 34452
5776C4452n993l6678N531o668n5605J5807O129l4257K0814j7215k2653J2760K0487
$$ 34452 28459 -8219 -2688 -9356 -64961 -49154 -43025 -77282 -56468 -73683 -96336 -83576 -63089
5763f3089P9349j1632l5953m5399M1728k371k4348L1288M8101p829m3326J8652
$$ -63089 16260 4628 -31325 -76724 -34996 -37367 -61715 -30427 17674 9845 -33481 -14829
5751a4829k765J0069K1415r027j0257k7294R09K5623l4497l5903j8691J7626O0957
$$ -14829 -17594 -7525 13890 4863 -5394 -32688 -31779 -6156 -40653 -76556 -95247 -77621 -16664
5738a6664L6463L3920j1973j7357n6070K0825K4608J6262N3674j186j1026K9477
$$ -16664 19799 53719 41746 24389 -31681 -10856 13752 30014 83688 82502 71476 100953
5726A00953J0948o8451K1348K8524j957k310K1600j6501m685N8534L896p6024
$$ 100953 111901 43450 64798 93322 91365 89055 110655 94154 89469 148003 151899 75875
5714G5875m2915J3884J8817l2777j336K0273L34j7924L2765o55n3601o0618j2434
$$ 75875 32960 46844 65661 32884 31548 51821 52155 34231 66996 66341 12740 -47878 -60312
5701f0312K6721O8367n0894l0937L8554N216l2377L514J8053o075l3070M774J0955
$$ -60312 -33591 34776 -16118 -47055 -8501 -3285 -35662 -32148 -14095 -20170 -53240 -48466 -37511
5688c7511K3482N1454j7546k271K8075j953k2431j1495o102J940J3182K9312Q83
$$ -37511 -14029 37425 19879 17608 45683 43730 21299 9804 3702 5642 18824 48136 49019
5675D9019Q019L2219k5273l2877M32K8060M025j4371k2786J2561J8448L0443k1411
$$ 49019 57038 89257 63984 31107 31539 59599 63624 49253 26467 39028 57476 87919 66508
5662F6508m8419L7916k986k970j2172J8900l8185j24868p50J5336m6224J8993
$$ 66508 18089 56005 53019 50049 37877 56777 18592 -106276 -107026 -91690 -137914 -118921
5650a18921N6783L2107O512J309N388o5154L7346M7932k4272J2381N7843j9149
$$ -118921 -62138 -30031 -23519 -22210 -16822 -81976 -44630 3302 -20970 -8589 49254 30105
5638C0105L21m5218l8487j809J8774j2544n020J0144P0810m4439m7223N7250k9690
$$ 30105 30426 -14792 -53279 -55088 -36314 -48858 -53878 -43734 27076 -17363 -64586 -7336 -37026
5625c7026q2090q217J4967R2916p00L387p6369l3088J7648n771J7209J07066M3952
$$ -37026 -119116 -127333 -112366 -19450 -20150 -16763 -93132 -126220 -108572 -114343 -97134 9932 53884
5612E3884m5917m6294o4528J4564Q6554o053l1346K0059k3128l6204R195M8971
$$ 53884 7967 -38327 -102855 -88291 -1737 -7790 -39136 -19077 -42205 -78409 -69214 -20243
5600b0243n6782N3068l905P664N8192K2815j0568j4882m5686m3645l737O6665
$$ -20243 -77025 -23957 -27862 -20198 37994 60809 50241 35359 -10327 -53972 -57709 8956
5588H956j7666r372j4387r051M5027k291j0133j3985J9011M1958L6286j1680m8177
$$ 8956 -8710 -18082 -32469 -41520 3507 1216 -8917 -22902 -3891 38067 74353 62673 14496
5575A4496K545j4068K87M194K042L9635n264r41q048o495p3620j7773k3218J4165
$$ 14496 17041 2973 3260 7454 9496 49131 43867 42926 34878 28383 -45237 -63010 -86228 -72063
5561g2063L1712l0281k8747J5953L0994R5138K4973l0153J4498K1747j0119m8180
$$ -72063 -40351 -70632 -99379 -83426 -52432 42706 67679 37526 52024 73771 63652 15472
5549A5472p2188J1640j7801k6821m45J3008J530l3324m4104M9700O2454o2912
$$ 15472 -56716 -45076 -62877 -89698 -90143 -77135 -75605 -108929 -153033 -103333 -40879 -103791
5537a03791n0794J9856L9813M9525L7791L36m8595N158k0173P225L3771R983l8810
$$ -103791 -154585 -134729 -94916 -45391 -7600 -7264 -55859 -50701 -70874 -63649 -29878 -19895 -58705
5524e8705l4657J8696p0359k4776P2777K9787J5669k1492k3504K1038O0722J6492
$$ -58705 -93362 -74666 -145025 -169801 -97024 -67237 -51568 -73060 -96564 -75526 -14804 1688
5512A688N30L767J058n6826m4734K6791L4717O9038K9516k2921k1669k0266j9078
$$ 1688 2218 5985 7043 -49783 -94517 -67726 -33009 36029 65545 42624 20955 689 -18389
5499a8389L264r247j533O145j8362k5910L9307k4302L2979J3272J1701k9650K4169
$$ -18389 -15125 -24372 -25905 -19760 -38122 -64032 -24725 -49027 -16048 -2776 8925 -20725 3444
5486C444L3717L1421J762J0012r684K2260J2988l1595M589J5227M995r915k487
$$ 3444 37161 68582 70344 80356 70672 92932 105920 74325 78914 94141 99136 89221 86734
5473H6734r327L191k5355k5095l8355o8861j8263j7453N6958L9509M9873N9598
$$ 86734 77407 80598 55243 30148 -8207 -77068 -95331 -112784 -55826 -16317 33556 93154
5461I3154J7533L380n2144p7187Q214L7693K6336j4670o2606P747J6897R592o2969
$$ 93154 110687 114067 61923 -15264 -7050 30643 56979 42309 -20297 -12550 4347 13939 -49030
5448d9030l1440M0377N4898K7341r749j068m1606M3050R0184l1455k6043p2907
$$ -49030 -80470 -40093 14805 42146 32397 31329 -10277 32773 122957 91502 65459 -7448
5436g448K8824P174L3202o913M9758L537n3816m3691q909r580P270m970j9065
$$ -7448 21376 28550 61752 54839 104597 108134 54318 10627 1718 -7862 -592 -5562 -24627
5423b4627n0611N3776L8501l5874j278J7141m0392O803N9657R25o6657J859O8799
$$ -24627 -75238 -21462 17039 -18835 -20113 -2972 -43364 -36561 23096 24021 -42636 -40777 28022
5410B8022j4614l5390j2571P423O499q788J3081p964l535m5881k445M3866P7996
$$ 28022 13408 -21982 -34553 -27130 -20631 -29419 -16338 -24302 -27837 -73718 -76163 -32297 45699
5397D5699M763k7994l9892L1728l3588m0875l1294l6321J17074J5384l9589L5763
$$ 45699 50462 22468 -17424 14304 -19284 -60159 -91453 -127774 -10700 4684 -34905 858
5385H58L323k4972L2903m0282L4141j2208J591j1707N134o489L8986K6492j2000
$$ 858 4181 -20791 12112 -28170 5971 -6237 -4646 -16353 -11219 -17708 21278 47770 35770
5372C5770l6743O821m5040m3336K743M2651N5200K780n1798J4724N5391m2784
$$ 35770 -973 5848 -39192 -82528 -79785 -37134 18066 20846 -30952 -16228 39163 -3621
5360c621J2798m721j8332k8442N3254J3053m1738K0882M2351J2339J3340l6274
$$ -3621 9177 4456 -13876 -42318 10936 23989 -17749 3133 45484 57823 71163 34889
5348C4889m1269J4992l1615R503m894N8526N5659m9835j05196n4312j7911P6492
$$ 34889 -6380 8612 -23003 -13500 -18394 40132 95791 45956 -59240 -113552 -131463 -54971
5336e4971K1718n1009J255q945j7761O8050L2660j319o4539N673O2311J7806p7700
$$ -54971 -33253 -84262 -83007 -91952 -109713 -41663 -9003 -10322 -74861 -69188 -6877 10929 -66771
5323f6771m1753N1844K1082n440j5033k8559n959L8764L4194K9301N0824m7796
$$ -66771 -108524 -56680 -35598 -41038 -56071 -84630 -90589 -51825 -17631 11670 62494 14698
5311A4698q740j0448k8769k3975Q965P102l551l3468j9687N9602N1247M9552m2153
$$ 14698 5958 -4490 -33259 -57234 -48269 -41167 -44718 -78186 -97873 -38271 12976 62528 20375
5298B0375N492l1172j6040M6048m2960m549M8529j1907n1841J6956j7718J0625
$$ 20375 25867 -5305 -21345 24703 -18257 -22806 25723 13816 -38025 -21069 -38787 -28162
5286b8162M4801J5134M9636J2008o3366R419o2536j01310J5110L3829k4039K8508
$$ -28162 16639 31773 81409 93417 30051 39470 -23066 -124376 -109266 -75437 -99476 -70968
5274g0968P082L3533L4436K3688l210j6847j7094j7934K3961P7627j4054p3550
$$ -70968 -63886 -30353 4083 27771 24561 7714 -9380 -27314 -3353 74274 60220 -13330
5262a3330O402K0884J1071O421k298Q507o2598l6000O8922K5848k3119n061K3894
$$ -13330 -6928 13956 25027 31448 29150 37657 -24941 -60941 7981 33829 10710 5649 29543
5249B9543r073j2847P001k8337m3547j9513o619L1661J0030k8594q315n5846R7849
$$ 29543 20470 7623 14624 -13713 -57260 -76773 -83392 -51731 -41701 -70295 -78610 -134456 -36607
5236c6607L9639m466O1585L7901k4596n6285J3296J3211n3453K080L625N0937
$$ -36607 3032 -1434 60151 98052 73456 17171 30467 43678 -9775 -7695 -4070 46867
5224D6867k120k0945r475k4913J3860J7366j9319K4649o1235l9309m1620L1112
$$ 46867 44747 23802 14327 -10586 3274 20640 1321 25970 -35265 -74574 -116194 -85082
5212h5082l93L358L1012L2722p672m5123J8873L3079j4430P085J7484l3869l1668
$$ -85082 -85475 -82117 -51105 -18383 -26055 -71178 -52305 -19226 -33656 -26571 -9087 -42956 -74624
5199g4624N8940k0062k629K4676l7260j6268J8383O4j748m6547K7815J06290L871
$$ -74624 -15684 -35746 -38375 -13699 -50959 -67227 -48844 -48780 -50528 -97075 -69260 37030 40901
5186D0901k6517l7898m286K0003N3745K2895M6838Q09p8019o5546J1964M5489
$$ 40901 14384 -23514 -27800 -7797 45948 68843 115681 116490 38471 -27075 -15111 30378
5174C0378N1023L8124m4937J2535J3322k6378K5651j4994J1506l6445j7148J1879
$$ 30378 81401 119525 74588 87123 100445 74067 99718 84724 96230 59785 42637 54516
5162E4516L9001k0542p7451m3723K0243L2149p387K5446J729j3267K539k0054
$$ 54516 93517 72975 -4476 -48199 -27956 4193 -3194 22252 23981 10714 13253 -6801
5150f801M3301M8847l0308j08584l02j747k4600m2451J8199K1888J0792N0391
$$ -6801 36500 85347 55039 -53545 -53847 -55594 -80194 -122645 -104446 -82558 -71766 -21375
5138b1375K9736n7107K5609P2588o0938l5453j8511L1051J0364o4536L042N7626
$$ -21375 8361 -48746 -23137 49451 -11487 -46940 -65451 -34400 -24036 -88572 -85530 -27904
5126b7904l1972J0759L2736J3261m5719l3917L6477P127K4996k2330m7040j6904
$$ -27904 -59876 -49117 -16381 -3120 -48839 -82756 -46279 -39152 -14156 -36486 -83526 -100430
5114a00430J5461O7974P5275L5680J6802j7499l8843m3857o069j8157n2132l9113
$$ -100430 -84969 -16995 58280 93960 110762 93263 54420 10563 4494 -13663 -65795 -104908
5102a04908O0616N2376J4375Q445P074J9288j7190K2248M621N454k4668K7941
$$ -104908 -44292 8084 22459 30904 37978 57266 40076 62324 66945 72399 47731 75672
5090G5672L1515j24581k9637K2839k5077j117K4049M3412K0817R143l6843q0532
$$ 75672 107187 -17394 -47031 -24192 -49269 -50386 -26337 17075 37892 47035 10192 -70340
5078g0340M605k104J7633P982j2954M9116J509R441P561m5141j3207L8324L7593
$$ -70340 -65735 -67839 -50206 -42224 -55178 -6062 -4553 4888 12449 -32692 -45899 -7575 30018
5065C0018j5886k8467L029L073M6697k3512L0009k1988J7703K698l4539N8561
$$ 30018 14132 -14335 -11306 -8233 38464 14952 44961 22973 40676 43374 8835 67396
5053F7396k9610m0237p0534P5827J7582m1727k6328J8745K5259J4364P6522J9721
$$ 67396 37786 -2451 -72985 2842 20424 -21303 -47631 -28886 -3627 10737 87259 106980
5041A06980n8237m8266M7091K2063m0456l5673L6385j985l4918q264m169m6971
$$ 106980 48743 477 47568 69631 29175 -6498 29887 27902 -7016 -15280 -19449 -66420
5029f6420l875M6279K2068J0393j909N2963q3720n0336L3554K1858j6806j8348
$$ -66420 -70295 -24016 -1948 8445 6536 59499 -24221 -74557 -41003 -19145 -35951 -54299
5017e4299O7125m3058k1837L5079L8851r299l9388k6832r545r38N3692N0123L342
$$ -54299 12826 -30232 -52069 -16990 21861 12562 -26826 -53658 -63203 -64141 -10449 39674 43016
5004D3016l5495o530K8264m2428m34P313k1705L7151L3539M4452l0455n5251L432
$$ 43016 7521 991 29255 -13173 -13607 -6294 -27999 9152 42691 87143 56688 1437 4869
4991D869m0360K366L0449N6600j4168J4295l810q1556k2089L6390K9655M6826
$$ 4869 -35491 -33125 -2676 53924 39756 54051 50241 -31315 -53404 -17014 12641 59467
4979E9467j5576L4051r685j7675K1876o670q3033K2327Q729o1977j5326j7550
$$ 59467 43891 77942 68257 50582 72458 65788 -17245 5082 13811 -48166 -63492 -81042
4967h1042L2085J7058J0352M1175n0552j8455P0043R6493O024j09695r1336n341
$$ -81042 -48957 -31899 -21547 19628 -30924 -49379 20664 117157 123181 13486 -77850 -83191
4955h3191M9345J5549O9121J0445j6439J1189J4589l3673k7013o725k5067L1867
$$ -83191 -33846 -18297 50824 61269 44830 56019 70608 36935 9922 3197 -21870 9997
4943I997M7297j3143m3284m3640q50M2199l7351K6493K2290J7747Q440k0358L45
$$ 9997 57294 44151 867 -42773 -43623 -1424 -38775 -12282 10008 27755 36195 15837 16182
4930A6182m1330N217J2936K0026l6887j6415O7896o5850p9462N7962l8249r089
$$ 16182 -25148 -19931 -6995 13031 -23856 -40271 27625 -38225 -117687 -59725 -97974 -107063
4918a07063P2438J8512K8197j8587J1337N6000K3002l5386j6129J4271O982o2760
$$ -107063 -34625 -16113 12084 -6503 4834 60834 83836 48450 32321 46592 53574 -9186
$$ [...]
##END NTUPLES=NMR SPECTRUM
##END=
