##TITLE=Analysis number 319371
Compound Code s 03337
Project Code adrs
Chemist Name ugmt
##JCAMPDX= 6.0         $$ Bruker NMR JCAMP-DX V2.0
##DATA TYPE= NMR SPECTRUM
##DATA CLASS= NTUPLES
##ORIGIN= Bruker BioSpin GmbH
##OWNER= nmr
$$ XWIN-NMR		Version 3.5
$$ Thu May 11 12:57:06 2006 GMT Daylight Time (UT+1h)  MAYBRIDGE\nmr@NMR_250MHZ
##.OBSERVE FREQUENCY= 250.131544655141
##.OBSERVE NUCLEUS= ^1H
##.ACQUISITION MODE= SIMULTANEOUS (DQD)
##.ACQUISITION SCHEME= undefined
##.AVERAGES= 16
##.DIGITISER RES= 18
##SPECTROMETER/DATA SYSTEM= dpx250
##.PULSE SEQUENCE= zg30
##.SOLVENT NAME= CDCl3
##.SHIFT REFERENCE= (INTERNAL, CDCl3, 0, 16.522)
##AUDIT TRAIL= $$ (NUMBER, WHEN, WHO, WHERE, WHAT)
$$ ##TITLE= Audit trail, XWIN-NMR		Version 3.5
$$ ##JCAMPDX= 5.01
$$ ##ORIGIN= Bruker BioSpin GmbH
$$ ##OWNER= nmr
$$ C:\u/data/dgb/nmr/ADRS/4170/pdata/1/auditp.txt
$$ ##AUDIT TRAIL=  $$ (NUMBER, WHEN, WHO, WHERE, WHAT)
(   1,<2006-05-11 12:56:44.25 +100>,<MAYBRIDGE\nmr>,<NMR_250MHZ>,
      <created by zg, POWCHK disabled, PULCHK disabled
       configuration hash MD5:
       84 BC 41 DB A1 6E 1D 46 DA 25 12 A5 C1 ED C5 3A
       data hash MD5: 64K
       06 79 E7 E1 79 00 A7 AD F8 AF 4A DD BE 5D 68 E2>)
(   2,<2006-05-11 12:56:57.55 +100>,<MAYBRIDGE\nmr>,<NMR_250MHZ>,
      <Start of raw data processing
       ef LB = 0.3 FT_mod = 6 PKNL = 1 SI = 32K 
       data hash MD5: 32K
       AC 1B B1 8E 33 3B 46 B4 F3 55 1C 72 22 00 A3 BD>)
(   3,<2006-05-11 12:56:59.33 +100>,<MAYBRIDGE\nmr>,<NMR_250MHZ>,
      <apk 
       data hash MD5: 32K
       DC 0D 7C C0 AE DB B8 F6 7D 2A 06 F6 F9 80 78 EF>)
(   4,<2006-05-11 12:57:00.05 +100>,<MAYBRIDGE\nmr>,<NMR_250MHZ>,
      <abs ABSG = 5 
       data hash MD5: 32K
       3F 49 47 62 A4 85 E3 67 27 DA 32 DE 06 9B F6 F7>)
$$ ##END=
$$ 
$$ hash MD5
$$ E1 B4 88 78 09 46 E0 99 7C 88 44 44 4D 6C 25 B5
##$RELAX= 
##$RELAX= 
##$RELAX= 
##$RELAX= 
##$RELAX= 
##$RELAX= 
##$RELAX= 
$$ Bruker specific parameters
$$ --------------------------
##$DU= <C:\u>
##$EXPNO= 4170
##$NAME= <ADRS>
##$PROCNO= 1
##$TYPE= <nmr>
##$USER= <dgb>
##$AMP= (0..31)
100 100 100 100 100 100 100 100 100 100 100 100 100 100 100 100 100 100 
100 100 100 100 100 100 100 100 100 100 100 100 100 100 
##$AQSEQ= 0
##$AQ_mod= 3
##$AUNM= <au_zg>
##$AUTOPOS= <29 >
##$BF1= 250.13
##$BF2= 250.13
##$BF3= 250.13
##$BF4= 250.13
##$BF5= 500.13
##$BF6= 500.13
##$BF7= 500.13
##$BF8= 500.13
##$BYTORDA= 1
##$CFDGTYP= 0
##$CFRGTYP= 5
##$CHEMSTR= <none>
##$CNST= (0..31)
1 1 145 1 1 1 1 1 1 1 1 1 1 1 1 1 1 1 1 1 1 1 1 1 1 1 1 1 1 1 1 1 
##$CPDPRG= <>
##$CPDPRG1= <>
##$CPDPRG2= <>
##$CPDPRG3= <>
##$CPDPRG4= <mlev>
##$CPDPRG5= <mlev>
##$CPDPRG6= <mlev>
##$CPDPRG7= <mlev>
##$CPDPRG8= <mlev>
##$CPDPRGB= <>
##$CPDPRGT= <>
##$D= (0..31)
0 1 0 0 0 0 0 0 0 0.06 0 0 0 0 0 0 0.0002 0 0 0 0 0 0 0 0 0 0 0 0 0 0 
0 
##$DATE= 1147348603
##$DBL= (0..7)
120 120 120 120 120 120 120 120 
##$DBP= (0..7)
150 150 150 150 150 150 150 150 
##$DBP07= 0
##$DBPNAM0= <>
##$DBPNAM1= <>
##$DBPNAM2= <>
##$DBPNAM3= <>
$$ [...]
##$SUBNAM7= <"">
##$SUBNAM8= <"">
##$SUBNAM9= <"">
##$SW= 20.6930455092707
##$SWIBOX= (0..15)
0 0 3 0 0 0 0 0 0 0 0 0 0 0 0 0 
##$SW_h= 5175.983436853
##$TD= 65536
##$TD0= 1
##$TE= 295.16
##$TE2= 300
##$TE3= 300
##$TEG= 300
##$TL= (0..7)
0 120 120 120 120 120 120 120 
##$TP= (0..7)
150 150 150 150 150 150 150 150 
##$TP07= 0
##$TPNAME0= <>
##$TPNAME1= <>
##$TPNAME2= <>
##$TPNAME3= <>
##$TPNAME4= <>
##$TPNAME5= <>
##$TPNAME6= <>
##$TPNAME7= <>
##$TPOAL= (0..7)
0.5 0.5 0.5 0.5 0.5 0.5 0.5 0.5 
##$TPOFFS= (0..7)
0 0 0 0 0 0 0 0 
##$TUNHIN= 0
##$TUNHOUT= 0
##$TUNXOUT= 0
##$USERA1= <user>
##$USERA2= <user>
##$USERA3= <user>
##$USERA4= <user>
##$USERA5= <user>
##$V9= 5
##$VALIST= <valist>
##$VCLIST= <CCCCCCCCCCCCCCC>
##$VD= 0
##$VDLIST= <DDDDDDDDDDDDDDD>
##$VPLIST= <PPPPPPPPPPPPPPP>
##$VTLIST= <TTTTTTTTTTTTTTT>
##$WBST= 1024
##$WBSW= 4
##$XGAIN= (0..3)
0 0 0 0 
##$XL= 0
##$YL= 0
##$YMAX_a= 690445
##$YMIN_a= -914716
##$ZGOPTNS= <>
##$ZL1= 120
##$ZL2= 120
##$ZL3= 120
##$ZL4= 120
##$ABSF1= 16.522
##$ABSF2= -4.171173
##$ABSG= 5
##$ABSL= 3
##$ALPHA= 0
##$AQORDER= 0
##$ASSFAC= 0
##$ASSFACI= 0
##$ASSFACX= 0
##$ASSWID= 0
##$AUNMP= <proc_1d>
##$AZFE= 0.1
##$AZFW= 0.1
##$BCFW= 0
##$BC_mod= 0
##$BYTORDP= 0
##$COROFFS= 0
##$CY= 12.5
##$DATMOD= 1
##$DC= 0
##$DFILT= <>
##$DTYPP= 0
##$F1P= 14.0000005364418
##$F2P= -0.99999901652339
##$FCOR= 0.5
##$FTSIZE= 32768
##$FT_mod= 6
##$GAMMA= 0
##$GB= 0
##$INTBC= 1
##$INTSCL= 1
##$ISEN= 128
##$LB= 0.3
##$LEV0= 0
##$LPBIN= 0
##$MAXI= 10000
##$MC2= 0
##$MEAN= 0
##$ME_mod= 0
##$MI= 0
##$NCOEF= 0
##$NC_proc= -2
##$NLEV= 6
##$NOISF1= 0
##$NOISF2= 0
##$NSP= 0
##$NTH_PI= 0
##$NZP= 0
##$OFFSET= 16.522
##$PC= 1
##$PHC0= 163.9439
##$PHC1= 6.658267
##$PH_mod= 1
##$PKNL= yes
##$PPARMOD= 0
##$PSCAL= 4
##$PSIGN= 0
##$REVERSE= no
##$SF= 250.13
##$SI= 32768
##$SIGF1= 0
##$SIGF2= 0
##$SINO= 400
##$SIOLD= 32768
##$SREGLST= <1H.CDCl3>
##$SSB= 0
##$STSI= 32768
##$STSR= 0
##$SW_p= 5175.98343685301
##$SYMM= 0
##$S_DEV= 0
##$TDeff= 65536
##$TDoff= 0
##$TI= <Analysis number 999999
Compound Code 99
Book Reference 9
Project Code 9>
##$TILT= no
##$TM1= 0
##$TM2= 0
##$TOPLEV= 0
##$USERP1= <user>
##$USERP2= <user>
##$USERP3= <user>
##$USERP4= <user>
##$USERP5= <user>
##$WDW= 1
##$XDIM= 32768
##$YMAX_p= 316851054
##$YMIN_p= -228713
$$ End of Bruker specific parameters
$$ ---------------------------------
##NTUPLES= NMR SPECTRUM
##VAR_NAME=  FREQUENCY,     SPECTRUM/REAL,   SPECTRUM/IMAG
##SYMBOL=    X,             R,               I
##VAR_TYPE=  INDEPENDENT,   DEPENDENT,       DEPENDENT
##VAR_FORM=  AFFN,          ASDF,            ASDF
##VAR_DIM=   32768,         32768,           32768
##UNITS=     HZ,            ARBITRARY UNITS, ARBITRARY UNITS
##FACTOR=    0.157963299565203, 1,           1
##FIRST=     4132.6476996994, 0,             0
##LAST=      -1043.33573715361, 0,           0
##MIN=       -1043.33573715361, -228713,     0
##MAX=       4132.6476996994, 316851054,     0
$$ Real data points
##PAGE= N=1
##DATA TABLE= (X++(R..R)), XYDATA
$$ [...]
22673a644P67k944m32N104K475l781j978m452J033k020m222P229J541m090k815
22658a0229P167N478j582L33R51p23J003N81k879n736l533L615K529N428M862
22643G265L621l434l022j881k977l369k504n06N898Q522J586n657o092k425j353
22628f328M789j083j885N20M307J016q666q569L579R610k76q88L512m357p297
22613a2016N087M968q36k124l206n90k222M285N390J955L290l352j14r39P43M349
22597D668K128r657J573M201n76o299j945L436r99K501k901k651r2j0306M926
22582a1993O390R781R08p244K40p438m76N139N259N98k6K687K550l141r567k674
22566i007m019k981O904j398j1967k399R651J2760P220l745n06n308L048Q927
$$ plain form
22673 -1644 -877 -3821 -4253 851 3326 -455 -2433 -6885 -5852 -7872 -12094 -4865 -3324 -7414 -10229
22658 -10229 -3062 2416 834 1167 2118 1395 2398 2979 100 -5636 -9169 -5554 -3025 2403 7265
22643 7265 10886 7452 4430 2549 -428 -3797 -6301 -6807 -909 7613 9199 3542 -2550 -4975 -6328
22628 -6328 -1539 -2622 -4507 -3987 320 1336 -7330 -15899 -12320 -2710 -2986 -3874 -362 -4719 -12016
22613 -12016 -6929 -1961 -2797 -4921 -8127 -8717 -10939 -6654 -1264 691 3981 629 515 -424 319 4668
22597 4668 6796 -2861 -1288 2913 2337 -3962 -5907 -2471 -3470 -969 -3870 -6521 -6613 -16919 -11993
22582 -11993 -5603 4178 5086 -2158 -1918 -9356 -9832 -4693 566 1164 1138 3825 6375 3234 -6333 -9007
22566 -9007 -13026 -16007 -9103 -10501 -22468 -24867 -15216 -2456 4764 1019 513 -4795 -1747 7180
22552G180n287l12J587K769L159l060j3223J154k90m43L764o161l206n330L371
22537a4328M951J012L997l09j329o706l231L580M317M734O342k058l920Q66J865
22522b17J495q652r085o09O60O310O981K817j791N156K444m588k272l729j645
22507f725p9L989J977K075L351o382j0928O459J987m022j53L501k275o562R76
22492a2811Q62L660J540O27l451m877n0J328N177L285j087l976O212m078N606
22477b033K10L786M80L429l529m0L023j563n59r197l85O080o496m83L601N82K763
22460c31O143R86k917m95M298n820k425K682n041r160j446J0905K282q074m493
22445a2906L474K946K837O231j260l799j18P700L999j1478q001j808j013N527
$$ plain form
22552 7180 1893 1581 3168 5937 9096 6036 -7187 -6033 -6323 -6766 -3002 -9163 -12369 -17699 -14328
22537 -14328 -9377 -8365 -4368 -4677 -6006 -12712 -15943 -12363 -8046 -3312 3030 972 -2948 -2082 -217
22522 -217 1278 -7374 -16459 -17068 -16408 -10098 -3117 -300 -2091 3065 5509 921 -1351 -5080 -6725
22507 -6725 -6804 -2815 -838 1237 4588 -1794 -12722 -6263 -4276 -8298 -8451 -4950 -7225 -13787 -12811
22492 -12811 -11949 -8289 -6749 -6122 -9573 -14450 -14500 -13172 -7995 -4710 -5797 -9773 -3561 -7639 -2033
22477 -2033 -1823 1963 2443 5872 2343 2303 5326 3763 3204 -5993 -6378 -298 -6794 -7277 -3676 -3094 -331
22460 -331 5812 6798 3881 3386 7684 1864 -561 2121 -2920 -12080 -13526 -2621 -339 -8413 -12906
22445 -12906 -9432 -6486 -3649 2582 1322 -2477 -2595 5105 9104 -2374 -10375 -12183 -13196 -7669
22431g669N883M066k433m719q795r073J1395J3808j745l603l777k643l847n18
22417a3670J0876P592L508J687q10k349n112K686n176L721m76q812j710K122j237
22402g160o458k702L955m579J853Q997j437k712K79L627M869J516r8M58m912m016
22386h520k85m804n59M799L355N315Q421m87m070J115P136j848j131k946l440
22371B051j809l232K52l010l006J349p16J494L830M321L4q189N06K758m42J498
22355b311q13k004J559K320o60l062K793K521O84N674o946r342m593L534O069
22340d577L11Q954l484l771k245Q45l173K254r01N817r78m504M514R036j216o367
22324E15r957k877J94M576m50L559R571m099k838m314N072N680l473q636P57j457
$$ plain form
22431 -7669 -1786 2280 -153 -4872 -13667 -22740 -11345 2463 718 -2885 -6662 -9305 -13152 -13670
22417 -13670 -2794 4798 8306 9993 9183 6834 1722 4408 -768 2953 2477 -6335 -8045 -5923 -7160
22402 -7160 -13618 -16320 -12365 -16944 -15091 -6094 -7531 -10243 -9964 -6337 -1468 48 -50 408 -4504 -8520
22386 -8520 -8805 -13609 -14168 -9369 -6014 -699 7722 7235 3165 4280 11416 9568 8437 5491 2051
22371 2051 242 -2990 -2738 -5748 -8754 -7405 -8121 -6627 -2797 1524 1558 -6631 -6125 -3367 -3809 -2311
22355 -2311 -3124 -5128 -3569 -1249 -1909 -4971 -2178 343 1027 6701 -245 -9587 -14180 -10646 -4577
22340 -4577 -4266 4688 1204 -2567 -4812 -3967 -7140 -4886 -5787 30 -948 -5452 -938 8098 6882 515
22324 515 -9442 -12319 -12125 -7549 -7999 -4440 5131 1032 -1806 -6120 -1048 4632 1159 -7477 -6720 -8177
22308h177l632Q37m382J2507J0146K962l578l436K129J8l632m09K907k886l184
22293a810l679l358k087J642K994L376k379l12R04l125J2965j75m023J376o277
22278c968o732l441L265P106O84k501K94Q147N97n447p095j230j582J2026O217
22263F340J803q34q891K620P572M449l972K484j377o579j716L014k487l427r683
22248a0684k164R204j648n066m465O033O616j773p025r74P92k67K815j511O563
22233c554N132j808j706K808J722k680j697m525r16L705k020k024J584O020L40
22218C81J899q04J740k111m489k793k18K301j615l990P621J731O74n982k777K645
22202e787n564p200K861J0230L412K848l094k686j661Q49O90L085n397m923K65
$$ plain form
22308 -8177 -11809 -10972 -15354 -2847 7299 10261 6683 3247 5376 5394 1762 1353 4260 1374 -1810
22293 -1810 -5489 -8847 -10934 -9292 -6298 -2922 -5301 -5613 -4709 -7834 5131 4956 933 2309 -3968
22278 -3968 -10700 -14141 -10876 -3770 -3086 -5587 -5293 2854 3451 -1996 -9091 -10321 -11903 123 6340
22263 6340 8143 7309 -1582 1038 8610 13059 9087 11571 10194 3615 1899 4913 2426 -1001 -10684
22248 -10684 -12848 -3644 -5292 -10358 -14823 -8790 -2174 -3947 -10972 -11946 -11154 -11421 -8606 -10117 -3554
22233 -3554 1578 -230 -1936 872 2594 -86 -1783 -6308 -7224 -3519 -5539 -7563 -5979 41 381
22218 381 2280 1476 3216 1105 -3384 -6177 -6395 -4094 -5709 -9699 -2078 -347 327 -5655 -8432 -5787
22202 -5787 -11351 -18551 -15690 -5460 -2048 800 -2294 -4980 -6641 -5792 -5102 -2017 -7414 -12337 -12072
22187a2072M086R06n641l09J396M090N880Q891k933p933L753L146k85m741K577
22172H11P225N23m406L225J59j868p596P381L196o083k224L988k592q467j254
22157g982j391k553L399J356P910p2L283n265n09J0306J60n190m908j053l595
22142f104J0640J407K057P175O100J2507K9535M4982N0464M8072J7362k0962m3135
22129A60100m6263k5645j6568j4802j2864k346j0313o804n376j231j789J458L78
22116A7935J636M95l109J910j275l576m927r450K303K421m76N66J843j596J0341
22101A5041M199p320J480l948n075j075k119K4L193L86l667n997K70Q195L498
22086G085l246m899p80J848O60K625K449L11l34k706m953n845k875M093Q380M715
$$ plain form
22187 -12072 -7986 -7080 -12721 -13030 -11634 -7544 -1664 7227 4294 -3639 114 3260 2975 -1766 811
22172 811 8036 8559 4153 7378 7537 5669 -1927 5454 8650 2567 343 4331 1739 -6728 -7982
22157 -7982 -9373 -11926 -8527 -7171 739 667 3950 -1315 -1824 8482 8642 3452 -1456 -2509 -6104
22142 -6104 4536 5943 8000 15175 21275 33782 63317 108299 158763 206835 224197 203235 160100
22129 160100 113837 88192 71624 56822 43958 41612 31299 24495 19119 17888 16099 17557 17935
22116 17935 19571 20066 16957 18867 17592 14016 9089 -361 1942 4363 3887 4453 6296 4700 15041
22101 15041 19240 11920 13400 9452 4377 3302 1183 1207 4400 4786 1119 -4878 -4608 3587 7085
22086 7085 3839 -1060 -1840 8 668 3293 5742 6053 5719 3013 -1940 -7785 -10660 -6567 1813 6528
22070F528p281n242R08J743j889N828j236j381L024J583j0017q644O046o52J532
22055i150J260O536N899l290o409PM966Q06M205Q70j226L628l048o48j456l024
22039g4L22j978j835K695k590K762m918k271j888q83K181J1116K051m650l92k795
22023c147J717o75J428L886l98j376K032K172L16m830o596j74k637M749K203P010
22007E680L646J13r183j4340K479M504j288k679j573j055J0428R082L297o579
21993B532l774J156l570q351m122L047O532R00K390O154k634n437n606l815M822
21978i776N533q2n603L79O506k13J618m596j460M570L635l137l088L91m16J749
21962c990r169q302j425K256Q696P270n25k621K990j300q57n991J732j741k637
$$ plain form
22070 6528 -753 -5995 -5087 -3344 -5233 595 -641 -2022 1002 2585 -7432 -16076 -10030 -10682 -9150
22055 -9150 -7890 -1354 4545 1255 -5154 -5147 -181 625 4830 5700 4474 8102 5054 4406 2950 -74
22039 -74 248 -1730 -3565 -870 -3460 -698 -5616 -7887 -9775 -10658 -8477 2639 4690 40 -352 -3147
22023 -3147 -1430 -2105 -677 3209 2811 1435 3467 5639 5955 1125 -5471 -5645 -8282 -3533 -1330 5680
22007 5680 9326 9439 256 -14084 -11605 -7101 -8389 -11068 -12641 -13696 -3268 5814 9111 2532
21993 2532 -1242 -86 -3656 -12007 -16129 -13082 -6550 -5650 -3260 2894 260 -5177 -10783 -14598 -9776
21978 -9776 -4243 -4325 -9928 -9549 -3043 -3256 -1638 -6234 -7694 -3124 511 -2626 -5714 -5323 -5739 -3990
21962 -3990 -13159 -21461 -22886 -20630 -11934 -4664 -5189 -7810 -4820 -6120 -6977 -12968 -11236 -12977 -15614
21947a5614J922J658K505R444M017m846K230l55O92j209K145m899k219J286J795
21932a448o45m8n9M308J466J513k907o510l929j234j78J114n85J389N703m968
21916g018j724N885R50m994l257M27n57k014j19Q62O492L771k41p254k523M305
21900g009M426j16K315O855j409M517l928m526L84J372O731n016o524m281j932
21885h141N02J158R20M816P798p795m968K188l453p357L253J193K879j012p326
21870a5345k456j500P359J886j715K543J959M573J2795m4p720k694J189l06n348
21855d824O24M889m535j029M036j136n785m565j213k281J823P170P429J521l438
21840a314k686k441j964j919k587O05K393l47K158j407r11L182L203j918K227
$$ plain form
21947 -15614 -13692 -12034 -9529 -85 3932 -914 1316 961 1653 444 2589 -2310 -4529 -3243 -1448
21932 -1448 -2093 -2141 -2200 2108 3574 5087 2180 -4330 -8259 -9493 -9671 -8557 -9142 -7753 -2050 -7018
21916 -7018 -8742 -2857 -1907 -6901 -10158 -9731 -10288 -12302 -12421 -11559 -5067 -1296 -1537 -8791 -11314 -7009
21900 -7009 -2583 -2699 -384 6471 5062 9579 5651 1125 1509 2881 9612 4596 -1928 -6209 -8141
21885 -8141 -7639 -6481 -5561 -745 7053 -742 -5710 -3522 -6975 -14332 -11079 -9886 -7007 -8019 -15345
21870 -15345 -17801 -19301 -11942 -10056 -11771 -9228 -7269 -2696 10099 10055 2335 -359 830 524 -4824
21855 -4824 -4200 689 -3846 -4875 -839 -1975 -7760 -12325 -13538 -15819 -13996 -6826 603 2124 -1314
21840 -1314 -4000 -6441 -8405 -10324 -12911 -12306 -9913 -10260 -8102 -9509 -10420 -7238 -4035 -5953 -3726
21825c726P750o473k103l166L498R423k245j693o840k160L967P323M87k978M061
21810E125O889j337k655l289K853K763p315j59m755j1926o27J5138Q754J558l858
21795G159j651l286k715l379K922O379M411N78j0400n103J255P83Q20j0206j548
21780a3981M2R185P7l180N902M556k864m578o05M018J446K043J326Rm651l239
21764d494J60L837M408k066p519L635O908l908o556o631K832j47J216K765k446
21749h006r22k411m941N811K216M57q92L806N546k535L909k453p697K355J0971
21734E214N94n535n201j452J905k690J523j20o018R55M796l376m957k685j682
21719a8729P367O108O828M66l159J66M43j852m767j491m15l384J082M766L515
$$ plain form
21825 -3726 4024 -2449 -4552 -7718 -4220 5203 2958 1265 -5575 -7735 -3768 3555 4042 1064 5125
21810 5125 12014 10677 8022 4733 7586 10349 3034 2875 -1880 -13806 -14433 705 9459 11017 7159
21795 7159 5508 2222 -493 -3872 -950 5429 9840 10418 18 -5085 -3830 -3047 -2227 -12433 -13981
21780 -13981 -13939 -4754 -4677 -7857 -1955 2601 -263 -4841 -5446 -1428 18 2061 3387 3396 -1255 -4494
21764 -4494 -4334 -497 3911 1845 -5674 -2039 4869 961 -5595 -12226 -9394 -9541 -8325 -5560 -8006
21749 -8006 -8928 -11339 -16280 -10469 -8253 -7796 -8688 -4882 664 -1871 2038 -415 -8112 -5757 5214
21734 5214 5808 273 -4928 -6380 -4475 -7165 -5642 -5762 -11780 -10825 -6029 -9405 -14362 -17047 -18729
21719 -18729 -11362 -5254 1574 2040 -1119 -953 -510 -2362 -7129 -8620 -9035 -12419 -11337 -6571 -3056
21704c056J395l320n68N768L759L32J661j746o284j737P458J284O955m007p729
21689A65M87J07j760n23j137l982k506L520K047m85K738J225j212k111j630k728
21673g785k221P98R1P57l234L988K084l399j944m778J1273J1601k354p483L428
21658H22n497k250M42L269Q123M296m968q415o780K754O282N256L61l030m474
21643c809K689M623M970K39l838q436n916m093L307M586R78o106K406L555L732
21628a113k199L490p92l724j867L424l40j920k554J444J584N755L184j291m534
21613a453K736j294K376J103k261J109J25J267O24Q78p857J181L23k41O73J452
21597G41K003j194N020j595L70J296n934n797L245k116K311k204L048m175K3l678
$$ plain form
21704 -3056 -1661 -4981 -5549 219 3978 4310 5971 4225 -2059 -3796 3662 4946 11901 7894 165
21689 165 652 759 -1001 -1524 -2661 -6643 -9149 -5629 -3582 -4067 -1329 -104 -1316 -3427 -5057 -7785
21673 -7785 -10006 -9208 -9117 -8360 -11594 -7606 -5522 -8921 -10865 -15643 -4370 7231 4877 -2606 822
21658 822 -4675 -6925 -6483 -3214 4909 9205 4237 -4178 -10958 -8204 -1922 3334 3695 665 -3809
21643 -3809 -1120 3503 8473 8712 4874 -3562 -9478 -13571 -10264 -5678 -4700 -10806 -8400 -4845 -1113
21628 -1113 -3312 178 -614 -4338 -6205 -2781 -3121 -5041 -7595 -6151 -4567 1188 4372 3081 -1453
21613 -1453 1283 -11 2365 3468 1207 2316 2441 3708 4332 5210 -2647 -1466 -1143 -1384 -711 741
21597 741 2744 1550 6570 4975 5345 6641 707 -5090 -1845 -3961 -1650 -3854 -806 -4981 -4958 -8636
21581h636P403j318L117M543O80N25m099k068J566L111j030N731M790m422j0018
21566a25n526L199m153N74J391p93L484N070l799J7L026J240l119r079j948K909
21550g632j687K173J022O493N7j400k896N92J1167M688o269o33Q14K821n296p056
21534c042j750m455J190M735k263j487r41N81P966J192J177J979j609j989k704
21519a420N696O384o664n406k46k132K382M316L238q726l655O616N287r3K563
21504H140o810l227P512j242l170k965r359p85Q015N638l809o665k42M954L74
21489c641L258j035j511j690l039K886k277P95L479L502j172m995j983j954J114
21474h263L417N597p38l834n528k570l691K851R888N790P576M04p431j680L661
$$ plain form
21581 -8636 -1233 -2551 566 5109 5789 6314 2215 147 1713 4824 3794 9525 14315 9893 -125
21566 -125 -5651 -2452 -6605 -6031 -4640 -5433 -1949 3121 -678 -661 2365 3605 486 -8593 -10541 -7632
21550 -7632 -9319 -7146 -6124 369 426 -974 -3870 -3278 7889 12577 6308 5675 6489 9310 4014 -3042
21534 -3042 -4792 -9247 -8057 -3322 -5585 -7072 -8013 -7432 534 1726 2903 4882 3273 1284 -1420
21519 -1420 4276 10660 3996 -1410 -1656 -3788 -1406 2910 6148 -2578 -6233 383 5670 5577 8140
21504 8140 1330 -1897 5615 4373 1203 -1762 -11121 -11906 -3891 1747 -2062 -8727 -8969 -4015 -3641
21489 -3641 -383 -1418 -2929 -4619 -7658 -4772 -7049 -6254 -2775 727 -445 -5440 -7423 -9377 -8263
21474 -8263 -4846 751 13 -3821 -9349 -11919 -15610 -12759 -2871 2919 10495 10899 3468 1788 5449
21459E449j470L39Q77r655l389P010J792r109J342K405J014O41m27m142m527P43
21443a1107N231l03R76k413N29k779M532J288j0080k349q7o030M115K931K189
21428a3357L347N452k878R003Q501l868m799j1760j052K975J827K530m419K039
21414f459O43N212J2478R85o954p511l439m206M251M703M448J455M574L526j542
21399A2164j1410n167M104O40k923j560Q88o971J88m413l499L995O081K285J201
21384d397m167n028L237K528j917k923l33K090K641m67m600J456O328j266O75
21369f143N965j372J475o482j996K060j0918L272K965k707K807O616n79p987l27
21354a3351Q373J396m44P12P80K577o158K757K444l032L634l16k319q91q908n597
$$ plain form
21459 5449 3979 4318 5195 -4460 -7849 -839 953 -8156 -6814 -4409 -3395 -2754 -3181 -7323 -11850 -11107
21443 -11107 -5876 -6179 -5203 -7616 -7087 -9866 -5334 -4046 -14126 -16475 -16562 -22592 -18477 -15546 -13357
21428 -13357 -10010 -4558 -7436 1567 10068 6200 1401 -10359 -11411 -8436 -6609 -4079 -8498 -6459
21414 -6459 -5816 -604 11874 12859 5905 -1606 -5045 -9251 -5000 -297 4151 5606 10180 13706 12164
21399 12164 754 -4413 -309 331 -2592 -4152 -3264 -10235 -10047 -14460 -17959 -13964 -7883 -5598 -4397
21384 -4397 -8564 -13592 -10355 -7827 -9744 -12667 -13000 -10910 -8269 -8736 -13336 -11880 -5552 -6818 -6143
21369 -6143 -178 -1550 -75 -6557 -8553 -6493 -17411 -14139 -11174 -13881 -11074 -4458 -5037 -13024 -13351
21354 -13351 -4978 -3582 -4026 -3314 -2534 43 -6115 -3358 -914 -3946 -312 -628 -2947 -3838 -12746 -18343
21338a8343J210K681Q933J0604k352o260j303m480J075L174M951j227J27L464
21324B254N807q190j5268j889N325K791j638k447K024M000j97o57P826O130J838
21309G709p146j422j976p280q02N024J976J636n425n589N084J947L837L70l327
21294e384r82O290K606l819p245k622K847P316K416n366l395j849J060l470k654
21279a4251P115Q235L395r53k351n571m92p93j9k776K033J092J038M220m25j1114
21263a1617j255N597R66J097O341j809j168l523k303J129K227l435j051O527R652
21248G375J2036l70j4819j0706O066j211k461M25L42O649k961j737l227l043L975
21233c667K439P639l908N226R89j70R89p625j710K493M731o529n671n37j790o96
$$ plain form
21338 -18343 -17133 -14452 -5519 5085 2733 -3527 -4830 -9310 -8235 -5061 -110 -1337 -1210 2254
21324 2254 8061 -129 -15397 -17286 -11961 -9170 -10808 -13255 -11231 -7231 -7428 -8085 -259 5871 7709
21309 7709 563 -859 -2835 -10115 -10917 -5893 -3917 -2281 -7706 -13295 -8211 -6264 -2427 -2057 -5384
21294 -5384 -6366 -76 2530 -1289 -8534 -11156 -8309 -993 1423 -3943 -7338 -9187 -8127 -11597 -14251
21279 -14251 -7136 1099 4494 3541 1190 -4381 -4873 -5666 -5685 -8461 -6428 -5336 -4298 -78 -503 -11617
21263 -11617 -12872 -7275 -6309 -5212 1129 -680 -1848 -5371 -7674 -6545 -4318 -7753 -8804 -2277 7375
21248 7375 19411 19041 4222 -6484 -418 -1629 -4090 -3665 -3323 3326 365 -1372 -4599 -7642 -3667
21233 -3667 -1228 6411 2503 7729 8718 8548 9537 1912 202 2695 7426 897 -4774 -5311 -7101 -7797
21217g797L968J369j380L063l215r622N811L618m07J348o04K972J441k070p125
21202h630j111L988Q722j696m596K662K813J121j613k82l669l527o985M79M176
21187h148L157L124L122p92j1437k171J650L144O120L169o87m012q54P505m110
21172a220j867M545O868k107n628o788K867Q700K363o533n000o77L921K336M404
21157F184l163L201p309p777J600J890L563L310n68o820o575j561N642J598L789
21142b996L489K081L360J887n421q31J213K136k646q557j074Q329O908l242n924
21127a288n798l151J072N1k024j683M34K79k17L089N921L131J987L93p731n60
21111f095L011K831J27N110L000n427K637j157p665K15k372P52M694M46K937K226
$$ plain form
21217 -7797 -3829 -2460 -3840 -777 -3992 -13614 -7803 -4185 -4592 -3244 -3848 -876 565 -1505 -8630
21202 -8630 -9741 -5753 2969 1273 -3323 -661 2152 3273 1660 1378 -2291 -5818 -12803 -12324 -8148
21187 -8148 -4991 -1867 1255 463 -10974 -13145 -11495 -8351 -2231 938 251 -3761 -4615 2890 -1220
21172 -1220 -3087 1458 8326 6219 591 -6197 -3330 5370 7733 1200 -3800 -4477 -556 1780 6184
21157 6184 3021 6222 -1087 -8864 -7264 -5374 -1811 1499 931 -5889 -12464 -14025 -8383 -6785 -2996
21142 -2996 493 2574 5934 7821 2400 1569 2782 4918 2272 -6285 -7359 970 7878 4636 -1288
21127 -1288 -7086 -10237 -9165 -9114 -11138 -12821 -12387 -12108 -12325 -9236 -3315 -184 1803 2196 -5535 -6095
21111 -6095 -3084 -253 -126 4984 7984 2557 5194 4037 -3628 -3413 -5785 -5033 -339 107 3044 5270
21095E270M157N953l719J318r3q706p653n037K608M718k902j472n33J831m227
21080h487K929M126M02n785O51K234J821o96k702j86R650K424k566k14l288p357
21064g044j005O126K733N91j832J331n05k54p786j694P709k108n456P850O346
21049E002l907j1937k450Q253L751k702m700O01j497N236Q271K570q92m549j318
21034b68N012k585K203J995j1129j0831J459n41P922N790n864L226O531K044j807
21019C157k971J689l991p419L055K098m226o128q06P791p9M790l797K118J87m079
21003h611l630m22O069Q908l557m414L651K745P239m029j3179k795N542M137K425
20988G9L285o750q68J674k02L58l237q04j559K325j723N223o36n17l173j674L067
$$ plain form
21095 5270 9427 15380 11661 12979 12886 4180 -3473 -8510 -5902 -1184 -4086 -5558 -6091 -4260 -8487
21080 -8487 -5558 -1432 -1030 -6815 -6164 -3930 -2109 -2805 -5507 -5693 3957 6381 3815 3601 313 -7044
21064 -7044 -8049 -1923 810 1401 -431 900 395 141 -7645 -9339 -1630 -3738 -9194 -1344 5002
21049 5002 1095 -10842 -13292 -5039 -1288 -3990 -8690 -8089 -9586 -4350 3921 6491 5599 1050 -268
21034 -268 4744 2159 4362 6357 -4772 -15603 -14144 -14685 -6763 -973 -6837 -3611 2920 4964 3157
21019 3157 186 1875 -2116 -9535 -6480 -4382 -8608 -14736 -15542 -7751 -7830 -3040 -6837 -4719 -4532 -8611
21003 -8611 -12241 -12663 -6594 2314 -1243 -5657 -2006 739 7978 3949 -9230 -12025 -6483 -2346 79
20988 79 3364 -3386 -4254 -2580 -2782 -2424 -5661 -6465 -8024 -5699 -7422 -2199 -2835 -3352 -6525 -8199 -5132
20971e132K826l8J240J611L95k869m95j421L426K042l922K610M197l715L964M159
20955H878M64k879q021k85K92q85k240K337Q807l564k294j781n009P64K484J39
20939b793L884J121J249N225L48j959o591p343K045J452n948k998K060k234j632
20924a4114L219L939K191l56N296m957L82j658O074L661n888k462N142k814n1
20909b396K085l592j860K171Q27J681r2n391k584m717N662K722J739L083L478
20894B816L655P35N62J192o655l117J12m128k321n593J724O70J321L101M009O860
20878D943J2n396M013Q29l358m025P595o15j986M236j699p39m358j315M523K513
20862E173n467J472R93p793q333R849O044l146l105J974k141p282K679K993j730
$$ plain form
20971 -5132 -2306 -2344 -1104 507 902 -1967 -2462 -3883 -457 1585 -2337 273 4470 755 4719 8878
20955 8878 9342 6463 -1558 -1843 -1551 -2436 -4676 -2339 6468 2904 610 -1171 -6180 -5416 -2932 -2793
20939 -2793 1091 2212 3461 8686 9034 7075 484 -6859 -4814 -3362 -9310 -12308 -10248 -12482 -14114
20924 -14114 -10895 -6956 -4765 -5121 175 -4782 -4400 -6058 16 3677 -2211 -4673 469 -2345 -2396
20909 -2396 -311 -3903 -5763 -3592 -2765 -1084 -1176 -6567 -9151 -13868 -8206 -5484 -3745 -662 2816
20894 2816 6471 7206 7768 8960 2305 -812 -700 -4828 -7149 -12742 -11018 -10348 -9027 -5926 -1917 4943
20878 4943 4955 -441 3572 4401 1043 -2982 4613 3998 2012 6248 4549 3810 -548 -1863 2660 5173
20862 5173 -294 1178 2171 -5622 -13955 -4106 1938 -1208 -4313 -2339 -4480 -11762 -9083 -6090 -7820
20847g820l708O89L663K635j73r91N15M00Q62M182J763j523L013j124r240o71
20831g528N135k15m728N806K775j274k843J609m797M27J793M693Q46k745N736
20816D690r398j682M852M459J044L888j730r312o407j455J351O878R58k777J587
20801c054K74q61j603j396M038k852J528P924J732k093l990o740m867O205Q69
20786d886o953M374P886j0052Q31L134l668K213O647N185j107m470r44J682P990
20771G862j830l27n172N13l213o316o454M443M971Q78l852O009k854l015n390
20756a3747k971K907K864k804P005P882J764K797M144k7l034k299K673m82p308
20741f36p591r97p04K654P743m75K70J541k706J554l991n352j189K312O416N077
$$ plain form
20847 -7820 -11528 -10839 -7176 -4541 -4714 -5705 -5190 -4790 -3928 254 2017 494 3507 2383 -6857 -7528
20831 -7528 -2393 -2608 -7336 -1530 1245 -29 -2872 -1263 -6060 -5633 -3840 853 1699 -1046 4690
20816 4690 -4708 -6390 -1538 2921 3965 7853 6123 -3189 -9596 -11051 -9700 -2822 -1864 -4641 -3054
20801 -3054 -2780 -3641 -5244 -6640 -2602 -5454 -3926 3998 5730 3637 -353 -7093 -11960 -5755 -4886
20786 -4886 -11839 -7465 421 -9631 -8800 -5666 -9334 -7121 -474 4711 3604 -866 -1810 -128 7862
20771 7862 6032 5705 533 1046 -2167 -8483 -14937 -10494 -5523 -4645 -8497 -2488 -5342 -8357 -13747
20756 -13747 -16718 -13811 -10947 -13751 -6746 1136 2900 5697 9841 9814 6780 4481 7154 6672 -636
20741 -636 -8227 -9224 -9928 -7274 469 -6 264 1805 -901 653 -3338 -8690 -9879 -7567 -1151 3926
20725C926K931j747n377Q35K496j299m658O80J460j472k749l274j095K605M586
20710b152o765P225P589k011r940j931Q647K232l682L750r00j100R58K06K749
20695D875j0515j629L085j90n378l977M482K385O65L120j677r608K891O583k885
20680g773m940K375M155j093N699Q99J418O338l398o102n156L187J447K812l112
20665c244m288J696N784M913L546m527j591j430p094j0119l248M277K881l20k324
20650a5088j204M590J809J886N39j206P40k478L96L574M733m41K93Q118K931p875
20634A317m89L238l751R8o69j0591p92Q6L340N323M033l336m096N149P817l592
20618C085o520P83M20K400j728k156q12k187P26K074o93k741K086P598M964p96
$$ plain form
20725 3926 6857 5110 -267 568 3064 1765 -2893 -2213 -753 -2225 -4974 -8248 -9343 -6738 -2152
20710 -2152 -8917 -1692 5897 3886 -6054 -7985 662 2894 -788 2962 2062 962 1920 2126 4875
20695 4875 -5640 -7269 -4184 -4374 -9752 -13729 -9247 -6862 -6197 -3077 -4754 -14362 -11471 -4888 -7773
20680 -7773 -12713 -10338 -6183 -7276 -1577 -678 740 7078 3680 -2422 -7578 -4391 -2944 -132 -3244
20665 -3244 -7532 -5836 -52 4861 8407 3880 2289 859 -6235 -16354 -19602 -15325 -12444 -12764 -15088
20650 -15088 -16292 -11702 -9893 -8007 -7468 -8674 -7934 -10412 -10016 -6442 -1709 -2150 -1857 6261 9192 1317
20634 1317 828 4066 315 413 -256 -10847 -11639 -11553 -8213 -2890 1143 -2193 -6289 -1140 6677 3085
20618 3085 -3435 -2652 -2232 168 -1560 -3716 -4528 -6715 -5989 -3915 -4608 -7349 -5263 2335 7299 6503
20602F503l801m019J487j890M229M526k179o767o788q95R67L262O188o385J358
20587d204J545j23l055p264O167j624m002J097Q199K56l053l542J827n504L811
20572i469K859p176m957J0431P673Q133n392q987Q86O66L93J954n78k397R87l306
20556h280l18l81N72K60r29K734k527Q75N44m323M634J0112R067k217k594r230
20540b001o38O026o299K079N735l973l478k675R3M837L109J309n90k359l865q93
20524c583R35l14J194P69J61q31m261P867M447l982l240j75M275J935j2327j0782
20508a7912m753O957O103K068O80m561m451J037M417L661K803j560k360K070M482
20493a319K524j716J984o231o511J681K179L303J605l789j064K185K982l400k983
$$ plain form
20602 6503 2702 -1317 170 -1720 2509 7035 4856 -1911 -8699 -9594 -8627 -5365 823 -5562 -4204
20587 -4204 -2659 -2782 -5837 -13101 -6934 -8558 -12560 -11463 -3264 -3008 -6061 -9603 -7776 -13280 -9469
20572 -9469 -6610 -13786 -18743 -8312 -639 7494 2102 -6885 -5999 -5333 -4940 -2986 -3564 -5961 -4974 -8280
20556 -8280 -8598 -8979 -8407 -8147 -9076 -6342 -8869 -7994 -7450 -11773 -7139 2973 12040 9823 7229 -2001
20540 -2001 -2639 3387 -2912 -833 4902 929 -2549 -5224 -5131 -294 2815 4124 3534 1175 -2690 -3583
20524 -3583 -2648 -2962 -1768 -999 -838 -1669 -5930 1937 6384 2402 -838 -1013 3262 5197 -7130 -17912
20508 -17912 -22665 -15708 -9605 -7537 -6857 -11418 -15869 -14832 -10415 -6754 -3951 -5511 -7871 -5801 -1319
20493 -1319 1205 -511 1473 -4758 -11269 -9588 -7409 -4106 -2501 -6290 -7354 -5169 -2187 -5587 -8570
20478h570J868K177k763O29M964l887p578j642K407J411J74k678N175K504M157
20463a652N058j986j36K880N408n280J969M167r237Q59k410M877q831j4648l980
20448b2942p45M134O533Q037R267O182J68j660m012J637L966p885J086O199L602
20433A3567j526l626n806j198n001o497J144M420q30n530j532k79O194J0082n359
20418a777J134n63r92m9k572m785K350N221p000J722P840k443o755m672K306n560
20402a6595k610M908p2O32O221M84m091L220m45K359L742j618j362M463J125J348
20386A709m89n60n030m044j320K767P036n179j868M663O276L662k041k254o557
20371c229j756k340P37k098N428O741K62N63N307l525n764K90J292K378J564J378
$$ plain form
20478 -8570 -6702 -4525 -7288 -6659 -1695 -5582 -13160 -14802 -12395 -10984 -10810 -13488 -8313 -5809 -1652
20463 -1652 3406 1420 1284 4164 9572 4292 6261 10428 1191 2050 -360 4517 -4314 -18962 -22942
20448 -22942 -23687 -19553 -13020 -4983 4284 10466 10634 8974 4962 6599 10565 2680 3766 9965 13567
20433 13567 12041 8415 2609 1411 -3590 -10087 -8943 -4523 -5353 -10883 -12415 -12694 -6500 3582 -1777
20418 -1777 -643 -1206 -2198 -2247 -4819 -9604 -7254 -2033 -9033 -7311 529 -1914 -8669 -13341 -11035 -16595
20402 -16595 -19205 -14297 -14369 -13737 -7516 -7032 -11123 -7903 -8348 -5989 -2247 -3865 -5227 -764 361 1709
20386 1709 1220 660 -4370 -8414 -9734 -6967 69 -5110 -6978 -2315 3961 7623 5582 3328 -3229
20371 -3229 -4985 -7325 -6588 -8686 -3258 3483 3745 4308 9615 6090 326 616 1908 4286 5850 7228
20355G228m334m079n295l258N056r99P180K68m494q3j373M481R132N446m038r470
20339A368K158K488p090N413l840j941l700j301q194j588J2865K534L35K277N031
20324F815K061j102n495J505l431l330N461r574j497O700j604L257m078m140O015
20309b437k446l909j764n006J157M703K755m90m063l148J736L641N978Q19O72
20294a802n48q902j1789J889L864J507P998M236M519J057k218k331n904k959K346
20279i037Q970j127l968J473l163q025j529o75J91L186N557J481r81j85k036l463
20263a3331K28K853L80k299N231N189P232L175p922j411l572k223r421N388L459
20248g044J690P296N534k677n157n924q765J861M768L273j974p352J446J824O914
$$ plain form
20355 7228 2894 -1185 -6480 -9738 -4682 -5681 1499 1767 -2727 -2810 -4183 298 9430 14876 10838 1368
20339 1368 3526 6014 -1076 4337 497 -1444 -5144 -6445 -14639 -16227 -3362 -828 -493 1784 6815
20324 6815 8876 7774 2279 3784 353 -2977 2484 -7090 -8587 -1887 -3491 -234 -4312 -8452 -2437
20309 -2437 -4883 -8792 -10556 -15562 -14405 -9702 -6947 -7437 -11500 -14648 -12912 -9271 -3293 -2474 -1802
20294 -1802 -2350 -11252 -23041 -21152 -17288 -15781 -7783 -3547 972 2029 -189 -2520 -8424 -11383 -9037
20279 -9037 -67 -1194 -5162 -3689 -6852 -14877 -16406 -17081 -16890 -13704 -8147 -6666 -7647 -7832 -9868 -13331
20263 -13331 -13103 -10250 -9870 -12169 -6938 -1749 5483 8658 736 -675 -4247 -6470 -15891 -10503 -7044
20248 -7044 -5354 1942 7476 4799 -358 -6282 -15047 -13186 -8418 -5145 -7119 -14471 -13025 -11201 -4287
20233d287M685p14j398R04k460m08J252j2191k378N363j818K416N948L565j510
20218c031p227j08j608N940N603k116l548j706k0j057J125J222Q43m274J931L216
20202d815K838K553k265J774n056l425L958J270p380k35O43J952P66m687K348
20187i761N631N673Q001p631o903m57m447K659J965p28K78N58L49j256N31J436
20171d102M855O258q025j042J900o21l248p197k926K550J2538k211j952M136j527
20156f14q529Q04K327k838K383K895L823J281L160q886n348N64K736m643K804
20141h081R587r73K6m93n724l316o44n90J62M243O500M052j351l686j463J09k205
20124c847j902j002K062l344J854L994M822k049K115J476m07K223q738m575L958
$$ plain form
20233 -4287 398 -316 -1714 -810 -3270 -3678 -2426 -14617 -16995 -11632 -13450 -11034 -5086 -1521 -3031
20218 -3031 -10258 -10366 -11974 -6034 -431 -2547 -6095 -7801 -7821 -8878 -7753 -6531 -5688 -9962 -8031 -4815
20202 -4815 -1977 576 -1689 85 -4971 -8396 -4438 -3168 -10548 -10783 -10140 -8188 -7422 -12109 -9761
20187 -9761 -4130 1543 9544 1913 -4990 -5447 -9894 -7235 -5270 -5998 -5720 -5162 -4813 -6069 -5538 -4102
20171 -4102 753 7011 -1014 -2056 -156 -777 -4025 -11222 -14148 -11598 940 -1271 -3223 913 -614
20156 -614 -9143 -8339 -6012 -8850 -6467 -3572 251 1532 4692 -4194 -9542 -8978 -6242 -10885 -8081
20141 -8081 1506 533 559 66 -5658 -8974 -9618 -10208 -10046 -5803 697 4749 3398 -288 -1751 -1642 -3847
20124 -3847 -5749 -6751 -4689 -8033 -6179 -2185 2637 588 2703 4179 3772 5995 -2743 -7318 -3360
20109c360m857L95l205L077L131R53N225j12K270l440p561q72n385l674j099J11
20093a8403M900L226k7j724L035n31N151O638L808l039m630p75N095L570q212
20078a918o601l039J776q14K794l88M829M198M800p977j097K319j438K302K370
20063B116J174k790j209j706N729R81k913j638J560k07l370n427n70L345j181
20048f106K288K76l117j714M634K045p28n55j023j159l232n936K920P706j46K006
20032a841m13J085J438J2057j0236p837j059N879M065Nm556l397M256P36n376
20017e194m76N317K624l706M77J082j1676j679P605Q716j374r579L524L094N01
20002g44Q11R79n246j28K626m211n672J750J378K001J540J973L319K302j055J745
$$ plain form
20109 -3360 -8217 -7822 -11027 -7950 -4819 -3866 1359 1247 3517 77 -7484 -8356 -13741 -17415 -18514 -18403
20093 -18403 -13503 -10277 -10304 -12028 -8993 -9524 -4373 2265 6073 3034 -1596 -2371 2724 6294 -1918
20078 -1918 -8519 -11558 -9782 -10596 -7802 -8190 -3361 837 5637 -2340 -3437 -1118 -2556 -254 2116
20063 2116 3290 500 -709 -2415 3314 4295 1382 -256 1304 1097 -2273 -7700 -8270 -4925 -6106
20048 -6106 -3818 -3542 -6659 -8373 -3739 -1694 -2422 -2977 -4000 -5159 -8391 -14327 -11407 -3701 -3847 -1841
20032 -1841 -2254 -1169 269 12326 2090 -5747 -6806 -927 3138 3143 -1413 -4810 -554 182 -5194
20017 -5194 -5670 -353 2271 -1435 -958 124 -11552 -13231 -5626 3090 1716 -7863 -4339 -1245 -744
20002 -744 67 1046 -4200 -4328 -1702 -5913 -11585 -9835 -8457 -6456 -4916 -2943 376 2678 1623 3368
19986C368l793K569J58j83M635j786l205L682N933K622p309o85l612m369q405
19971a0380o201K660j419K733m22K932M575Q286k778l088O89o369k429P199K491
19956a521o904O18j330L366k313j670O26N32R858N964L832l918n864k028l256
19941d008k192q10J32o460k103J54k829N303Q159M887l32J313k797k311K882K883
19925A871j487n33K477j849J266j656j279K644k106j636j825n76Q445M579M257
19910A2592o028r371M396M388J771n76k602l882p381p538K441L044O766M815j102
19895A733p169k231N309J097Q37O85l732K795J533j865q174o448J13O23P55K789
19879a1350Q248j13p42R033K744k552q85m286K587J507p45n866k532K508L136
$$ plain form
19986 3368 -425 2144 2302 2119 6754 4968 1763 5445 11378 14000 6691 6006 2394 -1975 -10380
19971 -10380 -16581 -13921 -15340 -12607 -13029 -10097 -5522 2764 -14 -3102 -2413 -8782 -11211 -4012 -1521
19956 -1521 -8425 -7807 -9137 -5771 -8084 -9754 -9128 -8596 1262 7226 11058 7140 1276 -752 -4008
19941 -4008 -6200 -7010 -6878 -13338 -15441 -15287 -18116 -12813 -4654 233 -99 1214 -1583 -3894 -1012 1871
19925 1871 384 -149 2328 479 1745 89 -1190 1454 -652 -2288 -4113 -4689 3756 8335 12592
19910 12592 6564 -2807 1589 5977 7748 7172 4570 688 -6693 -14231 -11790 -8746 -1980 2835 1733
19895 1733 -5436 -7667 -2358 -1261 -424 261 -3471 -676 857 -1008 -9182 -15630 -15517 -14894 -14139 -11350
19879 -11350 -3102 -3215 -3957 5076 7820 5268 4383 97 2684 4191 3446 -2420 -4952 -2444 692
19864F92N180M124k586m817n870q400N193o7p220l914O796Q402R645l891O61n805
19848a877J427K936K599m15j4872o408K121O397k191l081O125P617N718o084l015
19833c003P297Q982K063o141m295N68n24n221p526M0J0827J93L08o7j431N259
19817G329j692K039L306j336o995k927J008m122j096j777J420M857K895K28l198
19802f1k542n23O165k298j055k615P99O75M2J439K982Q333K004m509l177k679
19786B980R07J932j506K33O245L528L123J02k267m922k733L417r22k773j365q362
19770b383m292K33K063N294R14j610j818k43Q467J2037k084o157k53M95n748j483
19754C432o297K577M69k842j124q44q577K597M154N362K670K378O036l05n105
$$ plain form
19864 692 5872 9996 7410 2593 -3277 -11677 -6484 -6551 -13771 -17685 -10889 -2487 7158 3267 3928 -1877
19848 -1877 -450 2486 5085 4670 -10202 -16610 -14489 -8092 -10283 -13364 -7239 378 6096 12 -3003
19833 -3003 4294 13276 15339 9198 4903 5471 4947 -274 -7800 -7760 3067 3260 3568 3501 2070 7329
19817 7329 5637 7676 10982 9646 2651 -276 732 -3390 -4486 -6263 -4843 14 2909 3137 -61
19802 -61 -2603 -3126 3039 741 -314 -2929 -2130 -1455 -1413 26 3008 11341 13345 8836 5659 2980
19786 2980 3887 5819 4313 4546 10791 14319 17442 17544 15277 10355 7622 11039 10117 7344 5979 -2383
19770 -2383 -6675 -6442 -4379 915 1829 219 -1599 -1842 6625 18662 16578 10421 10168 10663 4915 3432
19754 3432 -2865 -288 181 -2661 -3785 -4629 -13206 -10609 -6455 -1093 1577 3955 9991 9686 4581
19739D581m811p102m335J687J648P606j484O38o25l539q102N507J5847K118l608
19724F026k205r59K317k396q254J23J031K164J144p054q01j044O07O148j613m600
19708i366q62L501n465k772J0865M746K400k064n357Q060q22l740P745J3357j618
19693A8608n267l142k855l376j679j947N970O207j0093n623l930K05k78j622P255
19678a567L590J214K988n590R02Q4L412j856j693p507k49K028N949J127J996L870
19662H698o309n420n162Q81J52N679k501m616k147O641L503K891M00p573p60J790
19646c853j305m265L873j783J133L586L552k511j065n045k987L349K374L39K08
19631d400l387NM061M579J974n863o219J748K670M241N934k152p485j994J058
$$ plain form
19739 4581 -230 -7332 -11667 -9980 -8332 -726 -2210 -1572 -2197 -5736 -13838 -8331 7516 9634 6026
19724 6026 3821 2862 5179 2783 -5471 -5348 -4317 -2153 -1009 -8063 -8864 -9908 -9301 -3153 -4766 -9366
19708 -9366 -10228 -6727 -12192 -14964 -4099 647 3047 983 -4374 3686 2864 -876 6869 20226 18608
19693 18608 13341 10199 7344 3968 2289 342 6312 12519 2426 -3197 -7127 -6922 -7200 -8822 -1567
19678 -1567 2023 3237 6225 635 1537 1621 5033 3177 1484 -6023 -6272 -4244 1705 2832 4828 8698
19662 8698 2389 -3031 -8193 -7312 -7160 -1481 -3982 -8598 -10745 -4104 -601 2290 2690 -4883 -5643 -3853
19646 -3853 -5158 -9423 -5550 -7333 -6200 -2614 938 -1573 -2638 -7683 -10670 -7321 -4947 -4608 -4400
19631 -4400 -7787 -7782 -3721 858 2832 -3031 -9250 -7502 -4832 -591 5343 3191 -4294 -6288 -5230
19616e230K570O693L965K189q67n411q062r97o82K787N014o87p097J907K430k932
19600d410k878P954R25n313m242R161R135l445j1402N800P018o807k449N434R51
19585E432o069k149K811j187r049l049O386N455j475P246k466r48O1L28P58J17
19569B202k74j084k195q575o067J556j717j078M828J2367k683k316L206K358M492
19554E020l84l251l547k093l91M338M992L952J967l587k894j901l434M744L936
19539G467L52M97k207l619Q456n92m70r54r955K041R09L431k667p792K015N58
19523b530m49m00J33K213j586K701K644p75J300j83n978j293M954L722j937Q89
19507C425j687m909m061n136l857k554O233J0085j815k216n428L709O126Q00J072
$$ plain form
19616 -5230 -2660 4033 7998 10187 9320 3909 -4153 -5150 -5832 -3045 1969 1282 -5815 -3908 -1478 -4410
19600 -4410 -7288 666 1591 -3722 -7964 1197 10332 6887 -4515 1285 8303 1496 -953 4481 5432
19585 5432 -637 -2786 25 -1162 -10211 -13260 -6874 -1419 -2894 4352 1886 938 999 1327 2085 2202
19569 2202 1928 844 -1351 -9926 -15993 -14437 -16154 -17232 -12404 -37 -2720 -5036 -1830 528 5020
19554 5020 4636 1385 -2162 -4255 -4646 -308 4684 8636 10603 7016 4122 2221 -1213 3531 7467
19539 7467 7819 8316 6109 2490 10946 10354 9884 8930 -1025 1016 1925 5356 2689 -5103 -3088 -2530
19523 -2530 -2979 -3379 -3246 -1033 -2619 82 2726 1951 3251 3068 -2910 -4203 751 4473 2536 3425
19507 3425 1738 -3171 -7232 -12368 -16225 -18779 -12546 -2461 -4276 -6492 -11920 -8211 -2085 -1285 -213
19492b13m82m111j872N14o425L805L049L997k727k965q49L201Q895rj669m147
19476b008r893K754r02P42J1248M230n122m900l699m626J388M634J387R363P773
19461A2369n06p351p281j273J391j078J876m376l179J547M456k674N326O071J810
19446G128m211J156l65K802J489k734K138L958K521P00k682m546n743M74J02J094
19430C281N337r98J226K914j0514p701q199L514Q244N244L12n10N202K174L318
19415A2844m911p45l904l981k620n901j990P491K596N120k103p203j666j330k941
19400a1244L32J857k265L615J083l819j342N420N636J449r34k990l298K266J647
19385b587P533K732n4j29l560l518r62J485Q84q157n913n014k729R79L841M201
$$ plain form
19492 -213 -695 -4806 -6678 -6164 -12589 -8784 -5735 -1738 -4465 -7430 -8279 -5078 3817 3808 2139 -2008
19476 -2008 -11901 -9147 -10049 -9307 1941 6171 1049 -3851 -7550 -12176 -10788 -6154 -4767 4596 12369
19461 12369 11863 4512 -2769 -4042 -2651 -3729 -1853 -6229 -9408 -7861 -3405 -6079 -753 5318 7128
19446 7128 2917 4073 3708 6510 7999 5265 7403 11361 13882 14582 11900 7354 1611 2085 2187 3281
19430 3281 8618 7620 8846 11760 1246 -6455 -14654 -11140 -2896 2348 2660 2150 7352 9526 12844
19415 12844 7933 7188 3284 -697 -3317 -9218 -11208 -3717 -1121 3999 1896 -5307 -6973 -8303 -11244
19400 -11244 -10912 -9055 -11320 -7705 -6622 -10441 -11783 -6363 -727 722 -212 -3202 -6500 -4234 -2587
19385 -2587 4946 7678 7624 7495 3935 417 -545 940 1824 -6333 -12246 -17260 -19989 -19010 -15169 -10968
19369a0968O102K124j058j074j349N762K608L942q15r50n162n20L537o881k151
19354f853R58Q931J521N830N81j1365l361L46q597m677P88M246q72K612O374L597
19338E9K091O119P89m768m459q604K145O601O49r28M492Q373N257q065m180k508
19322C063n292n575K690J936K497O690Q61k615J111l100p074Q49R301J726J317
19307H385l990k68Q702o557j3024p328K386M967L127K742l12K01M694K211j264
19292D672j838q749k176L714O468J837m438m213l836m4P335M795L537K455j722
19277G797o524Q79l912j496L708K415l862J790n062J749J1323r85m466n802KR401
19261F955j641n911N15n92j546m723N174J0721M334o053o556N656M012k058k594
$$ plain form
19369 -10968 -4866 -2742 -3800 -4874 -6223 -461 2147 6089 5274 4324 -838 -1358 2179 -4702 -6853
19354 -6853 -5895 3036 4557 10387 10968 -397 -3758 -3412 -12009 -16686 -15898 -11652 -12524 -9912 -3538 59
19338 59 2150 8269 9058 4290 -169 -8773 -6628 -27 622 -306 4186 12559 17816 9751 5571 3063
19322 3063 -2229 -7804 -5114 -3178 -681 6009 6870 4255 5366 2266 -4808 -3959 5342 7068 8385
19307 8385 4395 4127 12829 6272 -6752 -14080 -11694 -6727 -3600 -858 -1170 -969 3725 5936 4672
19292 4672 2834 -5915 -8091 -4377 2091 3928 -510 -4723 -8559 -8603 -1268 3527 7064 9519 7797
19277 7797 1273 2152 -1760 -3256 452 2867 -995 795 -4267 -2518 8805 7820 3354 -2448 -2446 6955
19261 6955 5314 -597 -82 -674 -2220 -6943 -1769 8952 13286 7233 677 6333 10345 8287 5693
19246E693k311j639j591R41l83K135R37M851n79l041o672J578K684M603J260J052
19230I518l602K627K205l830p031K872J391p354o189J609R091j752j542l420j838
19215g245N236N755o927m442j158j329O362r69K26K997M109J949n913L184k2O11
19199B424l073J287N546J566k571l774O10M837O815q39n062n868m321K427K387
19184B391M39p104k421O336n284l331k41L56P067r81L534L929r10L095L542J146
19168A1563p752m270L195N125q847k620l420P009N92K225k028l269j064K034K816
19153A289m222P68J254k190Q86K270j533K649k207K718M185o952l381O19J68J874
19137a805J239J167J687M137J231q338J936J539j8K090J380J411j711m345j0312
$$ plain form
19246 5693 3382 1743 152 1093 710 2845 3782 8633 8054 5013 -1659 -81 2603 7206 8466 9518
19230 9518 5916 8543 10748 6918 -113 2759 4150 -3204 -9393 -7784 1307 -445 -1987 -5407 -7245
19215 -7245 -2009 3746 -3181 -7623 -8781 -10110 -3748 -4717 -4491 -1494 2615 4564 -1349 1835 1813 2424
19199 2424 -649 638 6184 7750 5179 1405 2015 6852 13667 12828 7766 1898 -2423 4 2391
19184 2391 2830 -4274 -6695 -359 -5643 -8974 -9215 -8859 -1792 -2773 761 4690 3780 6875 10417 11563
19168 11563 3811 -459 2736 7861 -986 -3606 -7026 -17 575 2800 772 -2497 -3561 -1527 1289
19153 1289 -2933 -2165 -911 -3101 -2215 55 -1478 1171 -1036 1682 5867 -1085 -4466 -3847 -3679 -1805
19137 -1805 -566 601 2288 6425 7656 -682 1254 2793 2775 4865 6245 7656 5945 1600 -8712
19122h712J666L37j442K156M782M653J432K05o519k109J12o068q84J182L771J369
19106d069K102n8O60L266K27k738q271O167L367l373o486l921L794n38K056N028
19090b787K273j1347K702M930N206K104Q39l801J217Q211m020l341l838Q23q44
19075a673Q77j083k772O83N721O443J982J06o439p068j553M299M686o201k962
19060d954Q736L754p399j838Q041O453r905q850l963K922P467P081k034p204K053
19045C60n098K317Q623R511J009P89l804l703k33k812j120P892r6j394J748k214
19029A1775q974m64n18n710K119K680M303k817Q10m484k941J809P806q58M667
19014I203O503j469o146r027O356K922k951l092J087J633O007P98m861o109L611
$$ plain form
19122 -8712 -7046 -6709 -8151 -5995 -1213 3440 4872 5077 -1442 -3551 -3439 -9507 -10391 -9209 -5438 -4069
19106 -4069 -1967 -2025 -1365 1901 2128 -610 -8881 -2714 653 -2720 -9206 -13127 -9333 -9871 -7815 -2787
19090 -2787 -514 -11861 -9159 -4229 977 3081 3920 119 1336 9547 5527 2186 -1652 -829 -1673
19075 -1673 -796 -1879 -4651 -3968 1753 8196 10178 10284 3845 -3223 -4776 -477 4209 -1992 -4954
19060 -4954 3782 7536 137 -1701 6340 12793 2888 -5962 -9925 -7003 464 7545 5511 -1693 360
19045 360 -4738 -2421 6202 15713 16722 17511 13707 10004 9771 6959 5839 13731 13635 12241 13989 11775
19029 11775 2801 2337 1819 -3891 -1772 908 5211 2394 3204 -1280 -4221 -2412 5394 4536 9203
19014 9203 15706 14237 8091 -936 5420 8342 5391 2299 3386 5019 11026 11824 6963 854 4465
18999D465m368J082J417n195K420n513N173R021j941N033k55j2462n445J244l688
18984i012M666R229k69J873j475m46J214o690M904J177l527N256L823o673o129
18969b079K767L887K211P365P584On613p043l350r986k361J388K182J1100p46
18954G312j4824p55M496M959o978L45N821N146q75K118n94L975l12n281m017j014
18938d78p75K726m375l534l249K764P83R96O686r10p77k841l986Q857L673l342
18922B218j448P50n242Q86N026R325n467l948O643M716k076o507L334k059K611
18907H762m125k924p67J326L216J070m786m333n14k52n607M489J059J083N820
18892C517J37m220r18n434j81K177O564R418l48k928q13o415l901J161P727K022
$$ plain form
18999 4465 97 1179 2596 -2599 -179 -5692 -519 8502 6561 11594 11339 -1123 -6568 -5324 -9012
18984 -9012 -4346 4883 4614 6487 5012 4566 5780 -910 3994 5171 1644 6900 10723 4050 -2079
18969 -2079 688 4575 6786 14151 21735 21741 16128 9085 5735 -4251 -6612 -5224 -3042 8058 7312
18954 7312 -7512 -8267 -3771 1188 -5790 -5445 376 5522 4647 6765 6171 10146 9834 4553 536 -478
18938 -478 -1253 1473 -2902 -6436 -9685 -6921 -6138 -5142 1544 634 -143 -2984 -6970 1887 5560 2218
18922 2218 770 1520 -3722 -2836 2190 11515 6048 2100 8743 13459 11383 4876 8210 6151 8762
18907 8762 4637 1713 946 2272 5488 6558 1772 -2561 -3075 -3327 -8934 -4445 -3386 -2303 3517
18892 3517 3654 -566 -1484 -6918 -7099 -4922 1642 11060 10712 7784 6971 556 -3345 -2184 5543 7565
18876G565p46J606k153j128K336l648K072L372r93j0843l8O689O375o773J882
18861E575R43m47N076j167K511o38m74n55j371n471j487J306k245J140j084N494
18845G106O815r97r664o048J901M842l128q47m93j490k216M376p55N21N992N65
18829F480R00j215j11k626N949p04k877J111j701M230r45K151K087j0286m181
18814a738j546J402M924p609j021O777m73M463k654j734N387l206L2M950K75j809
18798F420l570J960n89j688l313m264O069K60k812K603j552K12L433j815K133
18783C487R299L999m997l405L952k776k542m585J677N829J699o039k981k952M784
18768D449R685P550L645J0801J160k875n435r98j3323n902J196L041p82J170n64
$$ plain form
18876 7565 6819 8425 6272 5144 7480 3832 5904 9276 8283 -2560 -2598 4091 10466 3693 5575
18861 5575 6518 6071 11147 9980 12491 11853 11379 10824 9453 3982 2495 3801 1556 2696 1612 7106
18845 7106 13921 12924 3260 -2788 -887 3955 827 -20 -513 -2003 -4219 157 -598 -77 5915 6480
18829 6480 7380 6165 6054 3428 9377 8673 5796 6907 5206 9436 8491 10642 12729 2443 -1738
18814 -1738 -3284 -1882 3042 -4567 -5588 1189 716 5179 2525 791 6178 2972 3004 7954 8229 6420
18798 6420 2850 4810 4221 2533 -780 -5044 1025 1285 -1527 1076 -476 -264 3169 1354 3487
18783 3487 12786 16785 11788 8383 12335 9559 7017 2432 4109 9938 11637 5598 2617 -335 4449
18768 4449 14134 21684 25329 36130 37290 34415 28980 27982 14659 8757 9953 12994 12212 13382 12818
18753A2818l077k204M265l06o054L139L890L587n743o451O794j668l630p94O0
18738D626J796K3K575r039p893O61Q405K602J668O965K9l216J736Q190r397k596
18722G135P9j218o04L354K431M988J553j1621n860R83K821J779m99R0j04L877
18706I184k262o792q610j018J0744o53J41M994o025q232K437J855N250R535R14
18691A1462o829M039J986p717K78l284M069N778k197n197q59J467O010J893L267
18676A4166P193K283m196j0109l178l752K574k567P89n06j363J285J936j185j595
18661A775k541o736K52K859n997L211R044N82M74k369j451N30K644k754j964N405
18645B964K841l147K222J293j24M029o693p414M149J2043N185J297m116j0050
$$ plain form
18753 12818 9741 7537 11802 11496 5442 8581 12471 16058 10315 3864 10658 8990 5360 4566 4626
18738 4626 6422 6445 9020 -19 -7912 -7251 1154 3756 5424 12389 12418 9202 10938 19128 9731 7135
18722 7135 7214 5996 5392 8746 11177 16165 17718 6097 237 1220 4041 5820 5321 5411 5307 9184
18706 9184 6922 130 -8480 -9498 1246 593 734 5728 -297 -8529 -6092 -4237 1013 10548 11462
18691 11462 4633 8672 10658 2941 3219 -65 4004 9782 7585 2388 1529 2996 9006 10899 14166
18676 14166 21359 23642 19446 9337 6159 2407 4981 2414 3203 2697 1334 2619 4555 3370 1775
18661 1775 -766 -7502 -7250 -4391 -10388 -7177 1867 2449 2923 554 -897 -367 2277 -477 -2441 2964
18645 2964 5805 2658 4880 6173 6049 10078 3385 -4029 120 12163 17348 18645 14529 4479
18631D479k284k031J168P533Q753L779n067k013m211l976K590J888m615M07M97
18616F897j747J428k382m51Q49l111j522m23j01J681N574J121l206j332k281k046
18600a052j217j973K253N573j065L367N575L642p713l7N09K351m103n258J663
18585B515o296Q4L43N79N778n070p39L175O29o82L880K388K479l453K197O419
18569A4226Q57j377q099o02m51K107j797m584J643J0261L035J235r590k031K175
18554G008J022j445J104M403R13M87j1171r36K495P7n221p021l607R443J0119
18539G670R127N124N986o650j0510k644l44Q93Q701M365n439L220N264j087j377
18524B2299J755m54m630M92p674k830j052N68l296O38J389J430J847J38j829L359
$$ plain form
18631 4479 2195 164 1332 8865 17618 21397 16330 14317 10106 6130 8720 10608 5993 6400 6897
18616 6897 5150 6578 4196 3745 4594 1483 -39 -462 -563 1118 6692 7813 4607 3275 994 -1052
18600 -1052 -2269 -4242 -1989 3584 2519 5886 11461 15103 7390 7353 7862 10213 6110 852 2515
18585 2515 -3781 -3697 -3354 -2775 3003 -2067 -2806 369 998 316 4196 6584 9063 5610 7807 14226
18569 14226 15083 13706 5607 5005 4554 6661 4864 280 1923 12184 15219 16454 6864 4833 7008
18554 7008 8030 6585 7689 12092 13005 13492 2321 1385 3880 3957 -1264 -8285 -11892 -2449 7670
18539 7670 16797 21921 27907 21257 10747 8103 7759 8652 17353 21718 16279 19499 24763 23676 22299
18524 22299 24054 23600 18970 19462 11788 8958 7906 8474 5178 5816 7205 8635 10482 10620 8791 12150
18508A2150j835K300J753k551o278J922L85N34J617j23m381m246Q37L828K530
18493H442j953Q873P30k139l6L523k66p246L39J2084J183l068n563O14j037m864
18477I616j724P737L016J516n664q949M240J0949O69o411n468N185Q80l791l051
18462H750Q0O079M117n652m175O134p024m274J346l208L993K566m9J127M198m513
18446I495L144L236j69n943m086N240k925m182K855M801K447n130k995K9m117
18431A700M626K244q565n04Q143m675M305P770l728j0499j024O633N63m890N35
18416B634o40O012p97J670O148N823P938m120o066m792n3j749l174j415j652O366
18400A2133M03q105k406P224o89L721l326L695P073k393n606l75r63l761o342
$$ plain form
18508 12150 10315 12615 14368 11817 5539 7461 7846 8380 9997 9874 5493 1247 2084 5912 8442
18493 8442 6489 15362 16092 13953 13917 17440 17174 9928 10267 22351 23534 20466 14903 15517 14480 9616
18477 9616 7892 15629 18645 20161 14497 5548 9788 20737 21406 14995 9527 14712 15592 11801 8750
18462 8750 8830 14909 19026 13374 9199 15333 8309 4035 5381 2173 6166 8732 8683 9810 14008 9495
18446 9495 12639 15875 15706 9763 5677 10917 7992 3810 6665 11466 13913 8783 5788 5817 1700
18431 1700 6326 8570 5 -499 7644 2969 7274 15044 11316 817 -207 6426 6989 2099 2634
18416 2634 1994 8006 7209 8879 15027 20850 28788 24668 18602 13810 13757 12008 8834 7419 5767 12133
18400 12133 12536 4431 2025 9249 8560 12281 8955 12650 19723 17330 11724 11349 10386 6625 283
18385B83J795L728L875J350J400K419r0p336L252J946Q303J42n53N097R019J2384
18369D7014l084P872K759n437r612n988O98P015P493Q720J9775M430k244j0948
18355F8463j1532o452l324q449m264K48l270r236m801K486m796J443L318J672
18341B1506J746K368K139j259K83j82l511l169P681l695o031m656K196L187N090
18326B3693j06j622q93L028J0418M913L046J2404J0665K12l650o259q050R29O320
18311E5048N571J1586J1264N638K271o678j1869j3420j4336j1124n775n10P16
18298B8382K441Q50o26k654j542m239n922l82Q107m566j621J18L286m7K147O3
18282B3795n89l569Q20P321n431m035n00q48n543K085P350l672j267M054k39J691
$$ plain form
18385 283 2078 5806 9681 11031 12431 14850 14760 7424 10676 12622 20925 21067 20514 25611 34630 47014
18369 47014 43930 51802 54561 49124 39512 33524 34222 41237 48730 57450 77225 81655 79411 68463
18355 68463 56931 50479 47155 38706 34442 34690 31420 22184 17383 19869 15073 16516 19834 21506
18341 21506 23252 25620 27759 26500 26783 26601 23090 19921 27602 23907 17876 13220 15416 18603 23693
18326 23693 23587 21965 21072 24100 34518 39431 42477 54881 65546 65758 62108 55849 47799 48728 55048
18311 55048 60619 72205 83469 89107 91378 84700 72831 59411 45075 33951 28176 27666 28382
18298 28382 30823 31673 31047 28393 26851 22612 16690 16308 24415 19849 18228 18346 21632 21585 23732 23795
18282 23795 23206 19637 20457 27778 22347 18312 17812 16964 11421 13506 20856 17184 15917 19971 19732 21423
18266B1423k239q61R561Q463j55l468P506J5J0811J4280o379j0773j6540j5682
18252A5962m157p340j86N591R51J904P261k950m037n79J172N234n614K607P839
18237B3658L940L964m98k000N444L63m127m170j912k898K386K640L605K382j029
18222C1748J902k37j853L073P329R850J8603K2161K0984J3715L323r538j0674
18209A10386j1786j5307r28O850O066J1920J4978J0684l694o385j8474j8597j6223
18196F9490j3695n627m986j145L609J014K645m728M763N43j1123P63N886M316
18182E1725n671j256N49j909J885r010J053J1552L026O03l420m690J891K264K446
18167E1038j2N911N7l383p628j411Q29l43L463l846p08J326J138L793L092K040
$$ plain form
18266 21423 19184 18323 27884 36347 36192 32724 40230 40245 51056 65336 58957 48184 31644 15962
18252 15962 11805 4465 4279 9870 10821 12725 19986 17036 12999 12420 13592 18826 13212 15819 23658
18237 23658 27598 31562 31064 29064 34508 34871 30744 26574 24662 21764 24150 26790 30395 32777 31748
18222 31748 33650 33413 31560 34633 41962 51812 70415 92576 113560 127275 130598 121060 110386
18209 110386 98600 83293 82365 89215 95281 107201 122179 132863 129169 122784 104310 85713 69490
18196 69490 55795 50168 45182 44037 47646 48660 51305 46577 51340 51883 40760 41523 47409 51725
18182 51725 46054 44798 45347 43438 45323 36313 37366 48918 51944 52547 49127 44437 46328 48592 51038
18167 51038 51026 56937 56994 53611 45983 44572 45401 45058 48521 44675 43967 45293 46431 50224 53316 55356
18151E5356m843K179j924k77L752k176r742j429J150J824J0198N932j97O60r77
18136E9486l552q53J0811L196J935P009M493J640M305O000Q867O890k724l333
18122A04170j774L377Q443J2066K2066L4917L8038L6048M0155O9737J08994J77038
18110F53275L12958O17670J110631J556028J463814Q58984J2296j183870j621666
18101C780120j169334o95003m12224k44620j67820j25821r2137p1033m7121l4827
18091G20180l7571l4550l6932m8736l7693l2803j8366j4338j5175r038j6453r403
18079D09122j0216q525m185n484j2093j7651j6350n265p021o627o64n17m124q045
18065C02355n962n610j3383p565m730j0240Q33K763k291j1827j0059k816l133
$$ plain form
18151 55356 50513 52692 50768 50491 54243 52067 42325 40896 42046 43870 54068 60000 59803 60463 59486
18136 59486 55934 55081 65892 69088 71023 78032 82525 84165 88470 94470 103337 110227 107503 104170
18122 104170 102396 105773 114216 126282 148348 183265 221303 257351 297506 367243 476237 653275
18110 653275 966233 1583903 2694534 4250562 5714376 6573360 6585656 5401786 3780120
18101 3780120 2610786 1915783 1503559 1258939 1091119 965298 873161 802128 755007 720180
18091 720180 682609 648059 611127 562391 524698 491895 473529 459191 444016 434978 418525 409122
18079 409122 398906 390381 386196 380712 368619 350968 334618 329353 322332 315705 315041 314524 310400 302355
18065 302355 296393 290783 277400 269835 265105 254865 255698 258461 256170 244343 234284 231468 228335
18052B28335l486k545R11J056l173n640n635k952n980n620o971k649M564l620
18038A86595l282l522j680M129n08m361j915j215n97o106k986m438L90j171j50
18023A59183j604n281l945l123J670l69q758K136K407j428R03J329o498r366q718
18008A18538M737M236J408l2m236K143N54m047n238m395j142N720J754m377r111
17993A06512Q374J9081r20j1788j1429q79j3P366P02o289M390L182O12n271k486
17978A11144j805J114l497n770J858q070m12n536p636j793j419l70J570o9M119
17963H3428j549p339m527J409L303K622j161J8L574O32J467l68p4n828r899M588
17947G0296J1069l227j3326m285l65R210J285Q21k26P729Q000l59M178O432k822
$$ plain form
18052 228335 224849 222304 223215 224271 221098 215458 209823 206871 200891 195271 188300 185651 190215 186595
18038 186595 183313 179791 178111 182240 181732 177371 175456 174241 173644 167538 164552 160114 160504 159333 159183
18023 159183 157579 152298 148353 145230 146900 146531 137773 139909 142316 140888 141791 143120 136622 127256 118538
18008 118538 123275 127511 128919 128887 124651 126794 127348 123301 118063 113668 112526 118246 120000 115623 106512
17993 106512 114886 133967 133047 121259 109830 108951 108938 116304 117006 110717 115107 118289 118901 113630 111144
17978 111144 109339 110453 106956 101186 103044 94974 94562 89026 81390 79597 78178 77808 79378 79309 83428
17963 83428 81879 74540 70013 71422 74725 77347 76186 76204 79778 80410 81877 81509 81435 75607 65708 70296
17947 70296 81365 78138 64812 60527 60162 69372 70657 71478 71252 78981 86981 86622 90800 97232 94410
17932I4410n947j820k688j430M322J0806k19K835K400J706n440n130n34l978m842
17917H4451N902O731m329m770K788P456M862K0580K5309K3356L4889M1621N3657
17904C02503M3121J5455l393j1651j7388k7569m5661l7361l3874j8568q422m946
17892A52246j1017l17j206M746L975l123O052L415P590K2752K1958K6505K6755
17879B60331K8443K5883K8574L3369L4052K1683J1930J1886Q590j910o129j0078
17867D46624j0950k472j1337k0487j6154k8786j9402j86J4951J8029K4915M4075
17855D38820N3531L9511K0593k026k0150l1988l4185l7574l1495k8498k4405j3357
17843C28777j0035l550j2182q686L43L742J267j836mj4051k3666r897p917j3152
$$ plain form
17932 94410 88463 86643 83955 82525 86847 97653 97434 100269 102669 104375 98935 93805 93271 89293 84451
17917 84451 90353 97084 92755 87985 90773 98229 103091 123671 148980 172336 207225 248846 302503
17904 302503 345624 361079 357686 346035 328647 301078 255417 218056 184182 165614 157192 152246
17892 152246 141229 140912 139706 144452 148427 145304 151356 154771 162361 185113 207071 233576 260331
17879 260331 288774 314657 343231 376600 410652 432335 444265 456151 464741 462831 456702 446624
17867 446624 435674 433202 421865 401378 385224 356438 337036 336850 351801 369830 394745 438820
17855 438820 492351 531862 552455 550429 530279 498291 464106 426532 395037 366539 342134 328777
17843 328777 318742 315192 303010 294324 294667 298409 299676 297840 297836 283785 260119 250222 242305 229153
17829B29153j7944j6136r675r635N34k634m948r622j188l114j0181l433O448K976
17815A50601j54n346n102j792J681K268j240r13M802k442L388J6909J5326J7766
17801A95752J6284K0072J4904K284j91p049m104o603K120J3849L305K260Q872
17788B61755J194K462N748J0547k203j3160j8178j9669j8015k6296k0740n407
17776A58038r80j1419n189l293j438J178j325n2m668p298j1587j1045j820K993
17762A02095J2510R55J978o001m216K993J714k832j66l307l02Q840l518j3415
17748I7328m784R445M845n012j37Q99j760L52J362j1290J689O745M825K036M263
17733A10806M065M527R61m173q62k411n042K327n375m778J425K230k307n376R64
$$ plain form
17829 229153 211209 195073 185398 175763 176297 173663 168715 159093 157905 154791 144610 141177 147625 150601
17815 150601 150447 145101 139999 138207 139888 142156 140916 140003 144805 142363 145751 162660 177986 195752
17801 195752 212036 232108 247012 249296 249105 242056 237952 231349 233469 247318 250623 252883 261755
17788 261755 262949 265411 271159 281706 279503 266343 248165 228496 210481 184185 163445 158038
17776 158038 157058 145639 140450 137157 135719 136897 135572 135520 130852 123554 111967 100922 99102 102095
17762 102095 114605 115560 117538 111537 107321 110314 112028 109196 109030 105723 105421 114261 110743 97328
17748 97328 92544 101989 106834 101822 101685 102584 100824 101176 102538 91248 92937 99682 104507 106543 110806
17733 110806 114871 119398 120359 116186 115324 112913 107871 110198 104823 100045 101470 103700 101393 96017 96981
17718I6981L008r10J0933o02Q72J150N47k145j956j312M2j660m494K563m216k920
17702I5881k612j566N445n879L59N549N36J0222J397k714r770k97O144k299n092
17687I5304q25j365L72k999l58P192K459O416J970n408l422N516J0455P988k419
17672A20876q358M55m434P86m329L545K102o48k155m600k781j091N239p503r672
17657H7432j125N306l276N17q81j0Q269K583n933j45J650m906M71l041k886L9
17641H4064K830l509n521n223J82l095K808K878n12N787Q006l695n58K545m24
17626H6563j1211K952J0823O160M963M350J789K218O135P075K148J37O59O310
17612A31071L953O57L980n811L366M677J3674J9157J5088J2709K1961K2694M353
$$ plain form
17718 96981 99989 99079 110012 109410 110282 111432 111979 109834 107878 106566 106608 104948 100454 103017 98801 95881
17702 95881 93269 91703 97148 91269 91628 97177 97713 107935 109332 106618 96848 96551 102695 100396 95304
17687 95304 94479 93114 93486 90487 90129 97321 99780 106196 108166 102758 99336 104852 115307 123295 120876
17672 120876 112518 112973 108539 109325 104996 108541 110643 109995 107840 103240 100459 99368 104607 97104 87432
17657 87432 86307 91613 88337 88854 87973 87963 96232 98815 92882 92737 94387 89481 89952 86911 84025 84064
17641 84064 86894 83385 77864 72641 72823 69728 72536 75414 74902 80689 88695 85000 84442 86987 86563
17626 86563 75352 78304 89127 95287 100250 104600 106389 108607 114742 121817 123965 124102 124761 131071
17612 131071 135024 135681 139661 133850 137216 141893 155567 174724 189812 202521 224482 247176 251529
17599B51529j0353k7665j4483j0692o386j3267q589l917j707j0386j593P7n393
17586A37175l61J1011O727K477J976l71Q822Q70k479M360K718j304k215k128K582
17571A69860o57j0950r674q394K413r043o618k891o029n584j838L003K32L866
17557A17696p48m96J8292K6662J8330N729L513j2292j3907k1499j7463j3426m22
17544A09969j1150j3985j4556K110J2538L198O821K639n833j3282k8974q879J7091
17531E7707L4912J1824n463K858N381J0287R351M125K794K072J34q250r002j0438
17517A08292j482J2783O8m78k446J373M371L935k687m213Q493J1334J1787J4921
17503A66051J5418L524Q96K517O331J0165M570J2232J7552K2409K5576R933J686
$$ plain form
17599 251529 241176 213511 199028 188336 181950 168683 160094 156177 154470 144084 142491 142568 137175
17586 137175 136814 147825 154552 157029 159005 158634 167456 168326 165847 170207 172925 171621 169406 167278 169860
17571 169860 169203 158253 148579 140185 142598 133555 126937 124046 118017 112433 110595 113598 113830 117696
17557 117696 116948 116452 134744 161406 179736 185465 188978 176686 162779 141280 123817 110391 109969
17544 109969 98819 84834 70278 72388 84926 88124 94945 97584 91751 78469 49495 40616 57707
17531 57707 92619 104443 98980 101838 107219 117506 126857 130982 133776 135848 135982 127732 118730 108292
17517 108292 106810 119593 119661 119183 116737 118110 122481 126416 123729 119516 128009 139343 151130 166051
17503 166051 181469 184993 185889 188406 194737 204902 209472 221704 239256 261665 287241 297174 298860
17490B98860J6195K0718N372N58j5191j4373q811k287J4433J5463L277m9j448
17477C32717k568l792O656P190J8674M7045M0694o327l6076l5468k0817j4533
17465C33395l153o212k649M604Q837J8360K4704J7809J2668K1544J6886K0006
17453D66799K2579K0457K1682K8021L0445J8345J3939K184r168k673J2806M6874
17441F72290Q3368J07331J11021P8191L0027k3088n5164o3448n6630k7954N456
17430H61400M1733N9048P2157J19773J94061K58763L04251K81026J97422P6796
17420B466430n9826j33284j25259n6490O7177K01908L31747M33775M23390K73233
17410C822801P4447j32828l09942l50093k85249j66232m123J59213L57352O23496
$$ plain form
17490 298860 315055 335773 341145 341703 326512 312139 303328 301041 315474 330937 334214 334165 332717
17477 332717 330149 326357 333013 340203 358877 405922 446616 440289 404213 368745 347928 333395
17465 333395 330242 324030 321381 325985 334822 353182 377886 395695 408363 429907 446793 466799
17453 466799 489378 509835 531517 559538 589983 608328 622267 624451 615283 612610 625416 672290
17441 672290 755658 862989 974010 1052201 1082228 1059140 1003976 940528 883898 855944 861400
17430 861400 903133 962181 1034338 1154111 1348172 1606935 1911186 2192212 2389634 2466430
17420 2466430 2406604 2273320 2148061 2091571 2158748 2360656 2692403 3126178 3549568 3822801
17410 3822801 3897248 3764420 3454478 3104385 2819136 2652904 2648781 2807994 3165346 3788842
17400C788842J049240J744134K639587L153510K742700J903296P80918l12693
17392A7489534m57269m16172q39694j805822k347521j829419j047305n47266k72159
17383G926907j66402j38955j08541o1792J0996J01433K30171M35262P69597J324217
17373A0322893K084334K875581L730089M790135N537291N700457N691057N238086
17365D5969923M473604L713966K863116K166942R83652L50635J331560K396671
17357F4250069K948504L487633L313268K144588J013493j369796l904627k969331
17349F8913801M96179O146434J3779636J7584696J3831386O555277m368179j2553283
17341A10385947j1527172q168495p532603r902358j0371341o654791j729013K443069
$$ plain form
17400 3788842 4838082 6582216 9221803 12375313 15118013 17021309 17802227 17489534
17392 17489534 17032265 16616093 15776399 13970577 11623056 9793637 8746332 8199066 7926907
17383 7926907 7760505 7621550 7513009 7451217 7462213 7563646 7793817 8229079 8998676 10322893
17373 10322893 12407227 15282808 19012897 23803032 29340323 35040780 40731837 45969923
17365 45969923 50443527 54157493 57020609 59187551 60171203 60521838 61853398 64250069
17357 64250069 67198573 70686206 73999474 76144062 77157555 75787759 71883132 68913801
17349 68913801 69409980 75556414 89336050 106920746 120752132 127307409 122939230 110385947
17341 110385947 98858775 90690280 83157677 73255319 62883978 56229187 54500174 56943243
17333E6943243N248245P105887P865609O037493L211036R82290k587395m990015
17325G9816393m056550k955302k550438j272492m87498p88418j332249l279170
17317F3094276n536269n763495n331548n338562m784094l680806k691577j965329
17309B8002596j465845j150200r81914q82040q35100q33187q09827p20052o05932
17300A9718499n39690n17383n13166m78935m45491l91613l28469k86477k72626
17291A5944649k49338k69419k65794j87025q3477K8717J66726L44113N15830O61981
17281A6606963Q41425R08486O62906L60489Q2555l66655n22051l25979k22605
17272A8025534j71053p841L3205m3058j85246o47508j027184j020688j004282
$$ plain form
17333 56943243 62191488 69297375 77162984 83200477 86411513 87393803 84806408 79816393
17325 79816393 75759843 72804541 70254103 68981611 68494113 67705695 66373446 63094276
17317 63094276 57558007 51794512 46462964 41124402 36340308 32659502 29967925 28002596
17309 28002596 26536751 25386551 24404637 23522597 22687497 21854310 21044483 20324431 19718499
17300 19718499 19178809 18661426 18148260 17669325 17223834 16832221 16503752 16217275 15944649
17291 15944649 15695311 15425892 15160098 14973073 14889596 14918313 15085039 15429152 15944982 16606963
17281 16606963 17448388 18356874 19019780 19380269 19462824 19096169 18574118 18248139 18025534
17272 18025534 17854481 17846640 17879845 17836787 17651541 17004033 15976849 14956161 13951879
17263A3951879j095431j011276p71006n66335m29284l35676k80020k51301k22219
17254H989331k00251j97210j89433j93171j76708j76029j81571j70983j60731
17245G343244j46950j35915j40736j33599j31911j25930j22969j35082j32565
17236F137587j24601j16047j17940j18143j11128j08364j02291j00777j02646
17227E135650j00191r3550q8514r2020r1853r0620r4397q4191p4823o4499o2204
17216D198788q0323j07394q7944p3362n8733o2904o8152o8790o0585m5348n3701
17205C431552n5731n3864m6181n6561n9465o6763o3259o3914n9526m9646m4184
17194B812458m6277m0379l5813m6102m7161n0818o2562n4727m4658l8490l5433
$$ plain form
17263 13951879 12856448 11845172 11074166 10507831 10078547 9742871 9462851 9211550 8989331
17254 8989331 8789080 8591870 8402437 8209266 8032558 7856529 7674958 7503975 7343244
17245 7343244 7196294 7060379 6919643 6786044 6654133 6528203 6405234 6270152 6137587
17236 6137587 6012986 5896939 5778999 5660856 5549728 5441364 5339073 5238296 5135650
17227 5135650 5035459 4941909 4853395 4761375 4669522 4578902 4484505 4400314 4325491 4260992 4198788
17216 4198788 4118465 4011071 3923127 3849765 3791032 3728128 3659976 3591186 3530601 3485253 3431552
17205 3431552 3375821 3321957 3275776 3219215 3159750 3092987 3029728 2965814 2906288 2856642 2812458
17194 2812458 2766181 2725802 2689989 2643887 2596726 2545908 2483346 2428619 2383961 2345471 2310038
17183B310038l8765m2358k8800j7947j7268k6645k7121k8026k9842k1340l5172
17172A996754l6062l3149k9186k6344k2574k5651k3236k4482k7669k7442k6919
17161A694040l3431l2028j7261q862K411j5922l8185l7637j9361j2736j6586k7129
17149A437313l5129k4884j5963k2263k8621j9129k2423k0018r108j3659k9583
17138A196533k4340j5411k4099k6828j7091j0962l668j7554j9835j3955j8505
17127A004285k4496j3755j8001j5311j6980j2615j4783j8875k5892j5105j3124
17116H15348j0543j3501j6211q202l401q396j0467j0282p658l019p283o874m431
17103G05080q047j5342r881q511j3679r743j0396r402j756o280j0123o015n211
$$ plain form
17183 2310038 2271273 2228915 2200115 2182168 2164900 2138255 2111134 2083108 2053266 2031926 1996754
17172 1996754 1960692 1927543 1898357 1872013 1849439 1823788 1800552 1776070 1748401 1720959 1694040
17161 1694040 1660609 1628581 1611320 1602458 1604869 1588947 1550762 1513125 1493764 1481028 1464442 1437313
17149 1437313 1402184 1377300 1361337 1339074 1310453 1291324 1268901 1248883 1239775 1226116 1196533
17138 1196533 1172193 1156782 1132683 1105855 1088764 1077802 1074134 1056580 1036745 1022790 1004285
17127 1004285 979789 966034 948033 932722 915742 903127 888344 869469 843577 828472 815348
17116 815348 804805 791304 775093 766891 763490 755094 744627 734345 726687 723668 716385 709511 705080
17103 705080 697033 681691 671810 663299 649620 639877 629481 620079 618323 612043 601920 595905 590694
17090E90694q729j2595j2176q20j87l298l911p436j0395m463p192q115r875q983
17076D92519j0029p169n071Q90m127p997q480q437r882j2505n335j1295Q0m97
17062D02665Q28k797r540j8198m024N993j202n003j4024p047q20K843Q70j0364
17048C40180r025o906n987k690n085q814n021j178O80r153j6699j0005l474l077
17034B53746J53j576J520l566n611n415j482q475n283k22j468l778m816o094n42
17019B07091J114j3111r233p440Q9n096J069K438L058o268m522n817m739o176
17005A52457l931j660o281R10K453p696k368m973m463K078l086l855l610Q741
16991A24716L135J583N39L379K352j750N84o9p505o974j0399j0010k845J174M2
$$ plain form
17090 590694 581965 569370 557194 556374 556187 552889 548978 541542 531147 526684 519492 511377 501502 492519
17076 492519 482490 475321 470250 471140 467013 459016 450536 442099 432217 419712 414377 403082 403162 402665
17062 402665 403493 400696 391156 372958 368934 374927 373725 368722 354698 347651 346831 349674 350544 340180
17048 340180 331155 324249 318262 315572 310487 301673 296652 295474 296154 287001 270302 260297 256823 253746
17034 253746 253899 252323 253843 250277 244666 239251 237769 229294 224011 223789 222321 218543 213727 207633 207091
17019 207091 208205 195094 185861 178421 178510 173414 174483 176921 179979 173711 169189 163372 158633 152457
17005 152457 148526 146866 140585 141495 143948 136252 133884 128911 124448 126526 123440 119585 115975 124716
16991 124716 127851 129434 129973 133352 135704 133954 134538 134469 126964 119990 109591 99581 96736 97910 97952
16976I7952m246O955r08j106P979M791k596p417q426m603L617J473k744j0037
16962H0684q485m067J0583O816m362j486N792M184n832m934L885L991q099n892
16948G2778n877j382J260l919p127l634O974J663k506N011k452o736K051j828
16934E4276p342k814K566O618L919m534r48q82P267N285r38j915J17q51o571q74
16918E2379J858L918k964L298L887o353k327M492M568o403m954o107L2P791P656
16903F0771k281n480k229L129j182o358j24L494M262j631l93O68O381N309j679
16888F2657m53M077o769q800l143l025L422O252l792q407k511O134L373N475O680
16873F1170M453n637q954m637p18N376J3389J0557K677J1935J1334J5113K4313
$$ plain form
16976 97952 93706 100661 99753 98647 106626 111417 108821 101404 92978 88375 91992 93465 90721 80684
16962 80684 72199 68132 78715 85531 81169 79683 85475 89659 83827 78893 82778 86769 78670 72778
16948 72778 66901 65519 66779 62860 55733 52099 59073 60736 58230 63241 60789 54053 56104 54276
16934 54276 46934 44120 46686 53304 57223 52689 51741 50859 58126 63411 62473 60558 60675 59824 53253 52379
16918 52379 54237 58155 55191 58489 62376 56023 53696 58188 62756 56353 51399 45292 45324 53115 60771
16903 60771 58490 53010 50781 53910 52728 46370 46246 49740 54002 52371 51978 52646 59027 64336 62657
16888 62657 62204 66281 59512 50712 47569 44544 47966 54218 50426 42019 39508 45642 49015 54490 61170
16873 61170 65623 59986 51032 46395 45677 51053 64442 74999 77676 89611 100945 116058 140371
16860A40371L8887M9636O7690P4080N5165L9661K1748k242j0210r602q895m388
16848D51901j208j4024j3277k092r284j2989p467P316N971M658J4226J9114N400
16835D48245N29n93j1620k6400j5535j6385j7752j0618j5825k1142r419l166l581
16822B96738l326m010k192L856j998n666r233n476L72L49j533n8J3920K7137M2184
16807C51064L5690L1221J5519j1643l1538l7572m5757m5069l1933k2046j8441
16796A89495j4388j2786p43l391q421m416O63J060n278o88J5371J2337K0538J1532
16782B00885K089J0627N684L733Q030n32r538r381o266j090k188l104L917J1058
16768B13924M310n427j0392p681m827p383j5520j2792j2062j3568j6137j1901
$$ plain form
16860 140371 179258 228894 296584 370664 425829 465490 487238 484996 474786 465184 456289 451901
16848 451901 450693 436669 423392 421300 412016 399027 391560 398876 404847 409505 423731 442845 448245
16835 448245 448774 448181 436561 410161 394626 378241 360489 349871 334046 312904 303485 300319 296738
16822 296738 293412 289402 287210 291066 289068 283402 274169 268693 269065 269414 267881 267823 281743 308880 351064
16807 351064 386754 417975 433494 421851 390313 352741 306984 261915 229982 207936 189495
16796 189495 175107 162321 161578 158187 149766 145350 146013 147073 141795 141107 156478 168815 189353 200885
16782 200885 202974 213601 219285 223018 231048 230516 220978 211597 205331 204241 202053 198949 202866 213924
16768 213924 218234 212807 202415 194734 189907 182524 167004 154212 142150 128582 112445 100544
16756A00544k942n559l996K077J922M61j304n99m421j474k218l667j694j500J482
16741G7112J326J916l366q493O90K188k571j143q355o179n235N588L552K233o298
16726E2965J042m097L735K895q78J464M010j237r765m418j946O23l093o07Q670
16711D9363M382O037m369q885K20N779N235j615j064K246n087m533l075l507l426
16696C7701k453p644p032k294R08M214K398M99lj231N079J239K507l618r007J390
16680B2653M295L299J67j89o557n255l506J338q99p125o93J738K349M743L860
16665B0218J083L901J270m449j771k241K879M752M145K389o418K92J1115N481
16651D2646l632n534J395L356p961n459j56M392K276j47K484J880K914K350j10
$$ plain form
16756 100544 97602 92043 88047 90124 92046 92507 91203 90604 86183 84709 82491 78824 77130 75630 77112
16741 77112 78438 80354 76988 68495 69185 71373 68802 67659 59304 53125 47890 53478 57030 59263 52965
16726 52965 54007 49910 53645 56540 55662 57126 61136 59899 50134 45716 43770 44393 41300 40693 49363
16711 49363 53745 59782 55413 46528 46748 52527 57762 56147 55083 57329 52242 47709 44634 41127 37701
16696 37701 35248 27604 20572 18278 19186 23400 25798 26297 26294 25063 30142 31381 33888 30270 21263 22653
16680 22653 26948 30247 30414 30225 23668 18413 14907 16245 15346 8221 7528 9266 11615 16358 20218
16665 20218 21301 25202 26472 22023 20252 18011 20890 25642 29787 32176 25758 26050 37165 42646
16651 42646 39014 33480 34875 38231 30270 24811 24655 29047 31323 31176 33660 35540 38454 40804 40694
16636D0694J0310j615m734k297m421N846L228K795k571M095N898J1694J6680K9124
16622A14726K7414K1586K8349M1068N5305J00001J78304K91631L83441L31590
16612A573415J73116n4574l13123l84233k73997j62084r9932o8402m7350k8876
16602C13960k6839k4483j9449k1709j7524o968q540j6276r010j598p913m837j0461
16589A38353j0616n837j932k615l796m284l602L123O587M158K62P701k739r318
16575A15445q053K336J864l448j18K328l291l609l100j2211o100m410j411k684
16561G3538n130P052O50n42J127j4721K871L412k962M16L582J621q086n391n057
16546E2380k12O359K646o663m260L74K271R61M317J327o21p313o251N510K785
$$ plain form
16636 40694 51004 49389 44655 42358 37937 43783 47011 49806 47235 51330 57228 68922 85602 114726
16622 114726 142140 163726 192075 233143 288448 388449 566753 858384 1241825 1573415
16612 1573415 1746531 1691957 1378834 994601 720604 558520 458588 390186 342836 313960
16602 313960 287121 262638 243189 221480 203956 196988 188448 172172 163162 161564 153651 148814 138353
16589 138353 127737 121900 119968 117353 113557 109273 105671 108794 115381 119539 119801 127502 124763 115445
16575 115445 107392 109728 111592 108144 108026 110354 107063 103454 100354 88143 82043 77633 76222 73538
16561 73538 68408 75460 76110 75568 76695 61974 64845 68257 65295 65711 69293 70914 62828 57437 52380
16546 52380 52168 58527 61173 54510 50250 50624 52895 53856 58173 59500 58879 51566 45315 50825 53610
16531E3610o643o64N351j203k649l382r169J052J0137j170j746k504K543L593
16517D7156P295j347R42P327q711o751k39l308q93j5J583k711o051n051m134j055
16501B4037P95j544M56O327L131o2o398k098L704j526K274N798m47j683m269j298
16485B7197N481J3307R500q33j167k863M17q08m871l611l914n145l882o36M142
16470C2314N6j542L523M240N234P514Q01M180o784J046l930j026O580M884l70
16455E6720o795N62k911m067l513j3901j379K843q98l09k646j355K50L261J445
16440B7307k433Q943j293K570M890M824P130l638q26M747k896J61K250j678j5194
16425C4864p413L540R625M735L963r33M90J142J448K787k38n434j076m559N99
$$ plain form
16531 53610 46967 46303 51654 50451 47802 44420 35251 36303 46440 45270 43524 41020 43563 47156
16517 47156 54451 53104 54046 61373 52662 45911 45672 42364 41471 41456 43039 40328 34277 29226 25092 24037
16501 24037 24832 23288 23744 30071 33202 33140 26742 24644 28348 26822 29096 34894 34447 32764 28495 27197
16485 27197 32678 45985 55485 54652 53485 50622 51039 50231 45360 41749 37835 32690 28808 28172 32314
16470 32314 32370 30828 34351 38591 43825 51339 52140 56320 49536 50582 46652 45626 52206 57090 56720
16455 56720 49925 50487 47576 43509 39996 26095 24716 27559 26661 26352 23706 22351 22601 25862 27307
16440 27307 24874 33817 32524 35094 39984 44808 51938 48300 47474 52221 49325 49486 51736 50058 34864
16425 34864 27451 30991 40616 45351 49314 48381 48871 50013 51461 54248 54010 48576 47500 42941 43540
16410D3540n125K253O216l270p881k212K697M553K515O336O287N288N571j42j366
16395F5260K702k650k605K668j203o86j563j479k720J642j490n008K505M860J093
16380F1326m492J429m542j1991j3899q733L300J683m309K160P734k245k320m223
16366B0878o356m173o878j923o05o137l443R739J1966M947N204J1032K498J846
16352C8595R91j045n351k105N83R8k989R86M455j323J166Q30k227k29n066n22
16336B6847L808L04p31l051Q63L773N172Q476O443R892P880L749M0341P3976M9656
16321B37398q021j7633n779l1033k1471m741m46k4448k7486j4794j0889j3777
16309E6880q963m676O768J778k794q513K546J0149L151Q126J4059J5012J3044
$$ plain form
16410 43540 38415 40668 46884 43614 35733 33521 36218 40771 43286 49622 55909 61197 66768 66626 65260
16395 65260 67962 65312 62707 65375 64172 63486 61923 60444 57724 59366 57876 52868 55373 60233 61326
16380 61326 56834 58263 53721 41730 27831 19098 22398 24081 19772 21932 29666 27421 25101 20878
16366 20878 14522 10349 3471 1548 943 -5194 -8637 1102 13068 18015 23219 34251 36749 38595
16352 38595 39586 38541 33190 31085 31668 31766 28777 29763 34218 32895 34061 34891 32664 32435 27369 26847
16336 26847 30655 30959 30228 27177 28040 31813 36985 45461 51904 61796 69676 73425 113766 187742 237398
16321 237398 229377 211744 205965 174932 153461 148720 148274 123826 96340 81546 70657 56880
16309 56880 47917 43241 50009 51787 48993 40480 43026 53175 56326 64452 78511 93523 106567
16296A06567m127L456M437r152l973J914j451o982j0483l510K092n23o138p216
16282F4911m002R69K137O782L697M193R156O019m182%m764q946r557j4858m434
16267D7121j4830k8325k1513k0410r633l956M951J2408K183j2173o5283r0122
16255a99582k9131P9260J17292N7930J6377n551o914o177l059r09M32Q386J8278
16242D6632J8564M858N116j745p624k725n116K138N711L765M908J6645J2038Q016
16228A11181Q83R333J3940J1j4584j8239Q533L3110O6923J06166J11555P8838
16216E07650M1393k1485q6535q3230n1944l4645j5727j7906j4829j5374q770K700
16204B01298J9535K8628L1509L6361L4023K6893K4091L7047K6801O8215J53262
$$ plain form
16296 106567 102440 105896 110333 101181 97208 99122 97671 90689 80206 76696 78788 78265 72127 64911
16282 64911 60909 61878 64015 70797 74494 78687 87843 93862 89680 89680 84916 75970 66413 51555 47121
16267 47121 32291 3966 -17547 -37957 -47590 -51546 -46595 -34187 -32004 -44177 -109460 -199582
16255 -199582 -228713 -149453 -32161 25769 42146 36595 29681 23504 20445 19536 19968 28354 46632
16242 46632 65196 70054 75170 73425 65801 63076 57960 60098 65809 69574 74482 91127 103165 111181
16228 111181 112064 121397 135337 135348 120764 102525 111058 144168 211091 317257 428812 507650
16216 507650 549043 527558 441023 357793 305849 271204 255477 237571 222742 207368 198598 201298
16204 201298 220833 249461 280970 317331 351354 378247 402338 439385 466186 534401 687663
16193F87663P7927r5762j79067j94794j38400o6186q923J1386J4159P697Q82L053
16181A19635N026L490P522M623M113J2234J7311K4049J6362L810M9K133k785L668
16167B21240L011J533P545N442J0886N672O034Jj9483j2702k562j2257j5737j1705
16153A86918j192J7249K2742J4436N164l826j3242j8638k0658o302J7275K7522
16141B27448L2554L3088K8701J4220k391P893K4390Q390m717L967L0449L0912
16129D34904P006n08n730J3300K7790K1618L48o400J0389K9493K8284L0869L1384
16116F22747L6637L7400K1148k484j0157P850M5078O1841O3491O8073P4912P7948
16104A104484N4081N3554P9481J11853Q9334M0968J1923L6015J11689J94636K15760
$$ plain form
16193 687663 765590 669828 490761 295967 157567 91381 82458 93844 108003 115700 116582 119635
16181 119635 124661 128151 135673 140296 144409 156643 173954 198003 214365 218175 218224 220357 217572 221240
16167 221240 224251 225784 233329 238771 249657 255329 261363 261364 241881 229179 226617 214360 198623 186918
16153 186918 185726 202975 225717 240153 245317 241491 228249 209611 188953 182651 199926 227448
16141 227448 260002 293090 321791 336011 333620 341513 365903 374293 369576 373543 403992 434904
16129 434904 441910 441402 435672 448972 476762 498380 498728 492328 502717 532210 560494 591363 622747
16116 622747 659384 696784 717932 715448 705291 713141 758219 820060 883551 951624 1026536 1104484
16104 1104484 1158565 1212119 1291600 1403453 1492787 1533755 1545678 1581693 1693382 1888018 2103778
16093B103778K21840K69119K90675K64848K47211K67127K91477K99825K86158
16084D542058K74381M00110O45900J023890J523825K218071L314243M605496N455469
16075B4003443N826083O359103P599215J2366254K4541983M5685304O7271566
16068A93652951O7955888M3372197J1870018l6617312p0483949o1242136l8916193
16061A09591464k3525219j4594783j0081261p735046n940077m334484l212215
16054D0168379k633800k240632k002972j918012j902775j837876j638677j400074
16046B4593561j181112j025452r28303q00970o84248o38390o20406n65102m95963
16037A7653615m91829n06601n09142m87424m22788l77357l52986l29285l02096
$$ plain form
16093 2103778 2325618 2594737 2885412 3150260 3397471 3664598 3956075 4255900 4542058
16084 4542058 4816439 5216549 5862449 6886339 8410164 10628235 13942478 18547974 24003443
16075 24003443 29829526 36188629 43787844 56154098 80696081 126381385 193652951
16068 193652951 261608839 304981036 316851054 280233742 209749793 148507657 109591464
16061 109591464 86066245 71471462 61390201 53655155 47715078 43380594 40168379
16054 40168379 37534579 35293947 33290975 31372963 29470188 27632312 25993635 24593561
16046 24593561 23412449 22386997 21458694 20657724 19973476 19335086 18714680 18149578 17653615
16037 17653615 17161786 16655185 16146043 15658619 15235831 14858474 14505488 14176203 13874107
16028A3874107k80213k76962l04898l24823k98128k60518k64928k85101k86569
16019A1291967k71659k51230k38179k35860k16348j90517j82096k03193k07844
16010I295041j82723j55956j42780j51053j61798j47356j09264n7096j0674j7972
16000H158369o8404j31894k06777k66457k58173k10792j73531j39004j15554j11745
15990F476038j15892j16982j29529j34319j22103j16233j20708j15967r4439q2952
15980E326914r2431j07505j03722j01892j01969j02798j07348j02459r2415q3546
15970D330829q2677q2853p3364o2409n9364o6402p4638p1856o6184m9959n3851
15959C587272n6015m1301m4259n1864m3642m3390n9525n9563m4146m8918n0599
$$ plain form
16028 13874107 13593894 13316932 13012034 12687211 12389083 12128565 11863637 11578536 11291967
16019 11291967 11020308 10769078 10530899 10295039 10078691 9888174 9706078 9502885 9295041
16010 9295041 9112318 8956362 8813582 8662529 8500731 8353375 8244111 8187015 8176341 8158369
16000 8158369 8089965 7958071 7751294 7484837 7226664 7015872 6842341 6703337 6587783 6476038
15990 6476038 6360146 6243164 6113635 5979316 5857213 5740980 5620272 5504305 5409866 5326914
15980 5326914 5234483 5126978 5023256 4921364 4819395 4716597 4609249 4506790 4414375 4330829
15970 4330829 4248152 4165299 4091935 4029526 3970162 3903760 3829122 3757266 3691082 3641123 3587272
15959 3587272 3531257 3489956 3445697 3393833 3350191 3306801 3247276 3187713 3143567 3094649 3044050
15948C044050m9358m7817l8800l1282m6920p4937r0484m5263Q021q321r7518j69428
15936B351943j44194r4432m0312j3302j3957j8410k0168j4201k5019k9981k8605
15925A909362l2692l1871l2031k7929l1916l5417k3238p576J749J068N31j012
15913A689028k3932m1298n3886o9691o7493l6902j4885q502k8249k4253k1182
15902A298755j4890j5517k3564k2832k3360j6437j9270k3984k5115k5644j4531
15891A073611j480M68j137m192j0607j0796j6931k0080j4895L808J7206M8781
15879A063756O6887m552q0013o9907L128n854k1747o696k553j8573k6330l4989
15867H62557l0972k1557k5496j7647j7334k1446j7701j6418k3134k4379j0285
$$ plain form
15948 3044050 2994692 2946875 2908075 2876793 2829873 2754936 2664452 2619189 2627210 2618889 2521371 2351943
15936 2351943 2207749 2113317 2073005 2059703 2045746 2027336 2007168 1992967 1967948 1937967 1909362
15925 1909362 1876670 1844799 1812768 1784839 1752923 1717506 1694268 1686692 1688441 1689509 1690040 1689028
15913 1689028 1665096 1623798 1569912 1500221 1432728 1395826 1380941 1372439 1344190 1319937 1298755
15902 1298755 1283865 1268348 1244784 1221952 1198592 1182155 1162885 1138901 1113786 1088142 1073611
15891 1073611 1072131 1072599 1071462 1067270 1056663 1045867 1028936 1008856 993961 997769 1014975 1063756
15879 1063756 1130643 1126091 1046078 976171 979299 973445 951698 945002 942449 923876 897546 862557
15867 862557 831585 810028 784532 766885 749551 728105 710404 693986 670852 646473 636188
15856F36188m004M3k527m174p944r093o560r608j4768j0415j6393j1228j8423
15843E21094j0874p612j6368j9653j0739q264m428p626M579J4027J2431k442L51
15830D64476K203l275l137K020m076j0998p959j0994j2499j5023j5873j0276k496
15817C72093P584R009j001l680m183p436l446k938o845q704r637k576l549p862
15803C26829j4962p773l849k893o354q43K702l039l372o628k227r107r148l933
15789B55403o948r566k314m284M599k123n866K57n63k043J369o474q839o037M937
15774B11508Q644L671L87R99n1j938m080K76o282q924o595L81n027J990P352k01
15758B02110j0406n556n689n507p762j1382n710q198p226m861o22l486L624j686
$$ plain form
15856 636188 632184 632227 629700 625526 617582 608489 601929 592321 577553 567138 550745 539517 521094
15843 521094 510220 502608 486240 466587 455848 447584 443156 435530 440109 454136 466567 464125 464476
15830 464476 466679 463404 460267 462287 458211 447213 439254 428260 415761 400738 384865 374589 372093
15817 372093 379677 388686 387685 384005 379822 372386 368940 366002 359157 350453 340816 338240 334691 326829
15803 326829 311867 304094 300245 297352 290998 290155 292857 289818 286446 279818 277591 268484 259336 255403
15789 255403 248455 238889 236575 232291 236890 234767 228901 229158 228595 226552 227921 221447 212608 206571 211508
15774 211508 220152 223823 224210 225209 225158 223220 219140 219416 213134 204210 197615 197996 192969 194959 202311 202110
15758 202110 191704 186148 180459 174952 167190 155808 150098 141900 134674 129813 129191 125705 129329 127643
15744A27643j1821r479m236k648m399k483M574N381l521p008l978L583M730k50
15730I6088k546M489K545j703j2071o234o984k201n25n613o949J434M77K809M418
15715F7434K266K858m055q815N805N447m9k241p006p852L604k967k737L014o798
15700D7908q12K138J705L566r965j659P057R497L054m401p31l652k277k404l222
15685D5802k867M374O67J422k383m722l552q536k892K621O896j173o891k877o08
15670B5281n43L575O944m304k786R56l470J870K144m324q234m605m04L589L204
15655A8893q059o257k937L429L937Q308K860m58Q460N643K399J681j158l780k292
15640C0669L350N411j574N64l147M277L411o208j521j384n922p211n913K196N763
$$ plain form
15744 127643 115822 106343 102107 99459 95060 92577 97151 102532 99011 92003 88025 91608 96338 96088
15730 96088 93542 98031 100576 98873 86802 80568 73584 71383 70858 65245 58296 59730 60207 63016 67434
15715 67434 69700 72558 68503 59688 65493 70940 70891 68650 61644 53792 57396 54429 51692 54706 47908
15700 47908 47096 49234 50939 54505 44540 42881 49938 59435 62489 58088 57357 53705 51428 49024 45802
15685 45802 42935 47309 47976 49398 47015 42293 38741 30205 27313 29934 36830 35657 28766 25889 25281
15670 25281 24738 28313 35257 30953 28167 29123 25653 27523 29667 25343 17109 12504 12100 15689 18893
15655 18893 10834 4577 1640 5069 9006 17314 20174 19716 28176 33819 36218 37899 36741 32961 30669
15640 30669 34019 39430 37856 38420 35273 39550 42961 36753 35232 33848 27926 20715 14802 16998 22761
15625B2761K863p434j774R245M631J529m992q027j0628n95R047L023q13k357N270
15610B1749N172J340L47l121n056n293N985K610m193m880m19M106l195p594j605
15595E953M896L454J9L242j108n0J785L087r93M37k168k642m64K234M182R49n51
15578B2262j393M9n169o625q175J79O525L864l79m714l631k07J325K241J669L40
15562H161K163J034M375L563m422p422J04j86L693J808L655p471m689N272N355
15547A4993J645k789j357J160m839r633N657L942j872L314M437K860r8m85J024
15532A7959N713p02M973J386J017N75N772J1429J7577K2413L3267L6434L0941
15519A88754M0736O4169J10878K21616L37942L87665K93835J08920j48186l60175
$$ plain form
15625 22761 25624 18190 16416 25661 30292 31821 26829 18802 8174 7579 16626 19649 18836 16479 21749
15610 21749 26921 28261 28608 25487 20431 15138 21123 23733 19540 14660 14241 18347 15152 7558 5953
15595 5953 10849 14303 14322 17564 16456 16406 18191 21278 20285 20722 18554 15912 15448 17682 21864 22813 22262
15578 22262 20869 20918 15749 9124 949 1128 7653 11517 11138 6424 2793 2586 3911 6152 7821 8161
15562 8161 10324 11358 15733 19296 14874 7452 7556 7370 11063 12871 16526 9055 4366 9638 14993
15547 14993 16638 13849 12492 13652 8813 -820 4837 8779 6907 10221 14658 17518 17420 16935 17959
15532 17959 23672 22970 27943 29329 30346 30921 36693 48122 65699 88112 121379 157813 188754
15519 188754 229490 293659 404537 626153 964095 1351760 1645595 1754515 1606329 1246154
15509A246154l48534k34516j50101r9240o1477m1446l5415k7971j9867k0674j4627
15498A92286j3532j2668l539q600j3434j2644k694m336j760l212m685j763J249
15485A10668q716j5643l303r38j301Q506O718j0051j1179l052J279n107m221N972
15471F9632m450j31j633n818p924K258L907L747K804Q17m075o108l141l220O579
15456E3244L14K013l620l883K047J414K332k597n058lK587j1267O4j442K96k227
15440C4214r801n650L425P064P064o632o138O37J992J626p153K94l692o192L712
15425A4770N217k211n551J930J879K329L657K675m209j343l268N0L717j677J920
15410A9885K755N353Q13N698L424K611l65j055m636p739K089p942j1533l418K551
$$ plain form
15509 1246154 897620 663104 513003 413763 352286 310840 275425 247454 227587 206913 192286
15498 192286 178754 166086 162547 153947 140513 127869 125175 120839 119079 115867 111182 109419 110668
15485 110668 101952 86309 83006 82068 80767 89273 95991 85940 74761 71709 72988 67881 63660 69632
15471 69632 65182 65051 63418 57600 49676 51934 55841 59588 62392 63209 59134 53026 49885 46665 53244
15456 53244 53558 55571 51951 48068 50115 51529 53861 51264 46206 46203 48790 37523 37587 36145 36441 34214
15440 34214 24413 18763 22188 29252 36316 29684 23546 24183 26175 27801 20648 20942 17250 11058 14770
15425 14770 19987 17776 12225 14155 16034 18363 22020 24695 20486 19143 15875 15925 19642 17965 19885
15410 19885 22640 27993 28806 34504 37928 40539 40174 39119 34483 26744 28833 20891 9358 5940 8491
15395H491p011J137m59m894M308Q259L354l620l729m828J231m76J863Q52L465
15380G943M766m072n542J065J490P653Q074k063q159m529O879K725n377j809K188
15365A1232l280L41R26N465o96j832N796R47j165p898j464L57j637m763nM501
15349F825L027M889J001k766m454j3250k761J933O669n669m740K261N30N659Q535
15334G689M539r39l598n590N56J999o030O38m281J544L520l35m707R82K747Q70
15318c96L692K004J062m475j701O85K012p267m924M601J957j077l910K991M339
15303d07q752l712O005J3186m27l955j449K922j500K991L049J582l440J87j582
15288D698n24K899m201r874P300J0339N732j386j045L690k984p538K033r985L406
$$ plain form
15395 8491 1480 2617 2158 -2736 1572 9831 13185 9565 5836 1008 2239 1763 3626 4478 7943
15380 7943 12709 8637 3095 4160 5650 13303 21377 19314 11155 6626 13505 16230 10853 9044 11232
15365 11232 7952 8293 9219 14684 13988 12156 17952 18899 17734 9836 8372 8729 7092 2329 2324 6825
15349 6825 9852 14741 15742 12976 8522 -4728 -7489 -5556 1113 -4556 -9296 -7035 -6505 -846 7689
15334 7689 12228 11289 7691 2101 2657 4656 -1374 -736 -5017 -3473 47 -288 -4995 -4013 -1266 -396
15318 -396 3296 5300 6362 1887 186 871 2883 -4384 -9308 -4707 -2750 -3827 -7737 -4746 -407
15303 -407 -9159 -12871 -6866 6320 5893 1938 489 3411 1911 4902 7951 9533 6093 6280 4698
15288 4698 4174 7073 2872 -7002 298 10637 16369 14983 13938 17628 14644 7106 9139 -846 2560
15273B560N744l872q940O431J865o139j195J137J429q38k107k577O695O851l769
15258C275p415R05J660K884L234k81r71j851L976M533o620r34J411J37m541l158
15242c756j531K695R219M237P39n547N076K015p614r564l637N102N389N330m636
15227C517l659J059n044l805k91j522l009J360j892n63Q397K494m236n830l838
15212a6862K893O906m693K905M961l11K028j921K511J705N151K432J747q638m296
15197c482l976K915K090q91J185R117j900K131r01n132l025n336K04O58K812k543
15181f074o696n29l840K442P595R138L921p594r8L548k381l124N838P182r679
15166c51p376L919N185k452k314J076J454J0087m77l459l558K081J696Q372l497
$$ plain form
15273 2560 8304 4432 -4508 1923 3788 -2351 -3546 -2409 -980 -1818 -3925 -6502 193 7044 3275
15258 3275 -4140 -3235 -1575 1309 4543 4262 3291 1440 5416 9949 3329 2395 3806 3943 -598 -3756
15242 -3756 -5287 -2592 6627 10864 11603 6056 11132 13147 5533 -4031 -7668 -2566 2823 8153 3517
15227 3517 -142 917 -4127 -7932 -8223 -9745 -12754 -11394 -13286 -13849 -5452 -2958 -7194 -13024 -16862
15212 -16862 -13969 -7063 -11756 -8851 -3890 -4201 -2173 -4094 -1583 122 5273 7705 9452 814 -3482
15197 -3482 -7458 -4543 -2453 -3344 -2159 6958 5058 7189 6288 1156 -1869 -7205 -7001 -6343 -3531 -6074
15181 -6074 -12770 -13299 -17139 -14697 -7102 2036 5957 -1637 -1735 1813 -568 -3692 2146 9328 -351
15166 -351 -7727 -3808 1377 -1075 -3389 -2313 -859 9228 8751 5292 1734 3815 5511 13883 10386
15151A0386r680k779k458K74l517l342m96k822L31Q473K930o580l530m487O694
15136a0603Q497J907J174j302M441J548r404n619L54j66n077l250J2396q72l690
15121i666J003J0872m506j0132P516L594L888j923o564j646O092M836J259k881
15107A742o679M81J811p155K337j7n476K86Q08J943K287J53n933M941Q816O03
15091I48L223K827k631r14p611n950j85J04K070O36K862L126J194n392Q7j544
15075g150O190K300m300p281J288l05Q44L72m972l85P826P391J500Q46j692l86
15059B086K680l415k082O00j671m280O33M117k901N72O755M969o20n692n403k355
15043f007M345r19J272L668l335n446m212M051J354O181J811J823m790K775K400
$$ plain form
15151 10386 706 -2073 -4531 -4257 -7774 -11116 -11612 -14434 -14103 -5630 -2700 -9280 -12810 -17297 -10603
15136 -10603 -2106 -199 975 -327 4114 5662 -3742 -9361 -9007 -9173 -14250 -17500 -5104 -5976 -9666
15121 -9666 -8663 2209 -2297 -12429 -4913 -1319 2569 646 -5918 -7564 -1472 3364 4623 1742
15107 1742 -4937 -4456 -2645 -9800 -7463 -7480 -12956 -12670 -11862 -9919 -7632 -7479 -13412 -8471 345 948
15091 948 4171 6998 4367 3453 -4158 -10108 -10293 -10189 -8119 -7483 -4621 -1495 -301 -5693 -5606 -7150
15075 -7150 -960 1340 -2960 -10241 -8953 -9258 -8414 -8042 -13014 -13399 -5573 1818 3318 4164 2472 2086
15059 2086 4766 1351 -731 -131 -1802 -6082 -5449 -1332 -4233 -3661 3094 8063 7443 1751 -3652 -6007
15043 -6007 -1662 -2581 -1309 2359 -976 -6422 -10634 -6583 -5229 952 2763 4586 -204 2571 4971
15028D971K73o872J705L404J074N25k035O871L10q401o792N36K71Q434R166j362
15012A2078j469K09k847j649L247l35j80l226k689n41p030m480k709J447J782
14997h392M000N118Q77k695q90M123o052k69L123L947q30J439q870K649j552k887
14981g161L02O745L386J064Q70j69m48k665n431N451L191n167J033l618K303M306
14965C992j868Q91o624l505L31P757L731m190p704M218M671o092r402l422J964
14950a5252M672P077M141PP79L747n162j494M7j347l734J258K199J670k795L870
14934c17L237k919p116K781Q276O0m567l135M122p632l899O052K649O647L959
14919H198j856J415l548q036l583k708r39J55Q984M530K114k725o47p35k533l316
$$ plain form
15028 4971 5244 -1628 77 3481 4555 5080 3045 9916 10226 1825 -4967 -4431 -4160 4274 13440 12078
15012 12078 10609 10818 7971 6322 9569 9234 9054 5828 3139 2598 -4432 -8912 -11621 -10174 -8392
14997 -8392 -4392 726 1603 -1092 -1982 2141 -3911 -4180 -1057 2890 2060 3499 -5371 -2722 -4274 -7161
14981 -7161 -6859 -114 3272 4336 5206 5037 4589 1924 -3507 1944 5135 -32 1001 -2617 -314 3992
14965 3992 2124 3015 -3609 -7114 -6783 974 4705 515 -7189 -2971 1700 -4392 -13794 -17216 -15252
14950 -15252 -10580 -3503 638 645 1424 5171 9 -1485 -1438 -2785 -6519 -5261 -3062 -1392 -4187 -317
14934 -317 2920 1 -7115 -4334 3942 4002 -565 -3700 422 -7210 -11109 -5057 -2408 4239 8198
14919 8198 6342 7757 4209 -3827 -7410 -10118 -11057 -10902 -1918 2612 4726 2001 1354 619 -1914 -5230
14903e230K438L169J707L024N50J32l037k826N20k436n929R00P262k943m28O485
14887C358L526p559j114M844P300M417O740m941l878n883l825Q03P34j87k323
14872B012n196k625j408m522n208R059M144J768L494m587m920J419M968Q033k639
14857C792n442l456J115r65Q77K53L503Q72K132O39m253O56L103L990m096l703
14841i83M682l447j584J613l381J89P742J1668n37q157j0474r160l107L826j519
14826a2629k607l086L430J0057J1883L767j316n862q279J594R164N764j729k244
14812G907o056MN337l330K617P836N073K005p031l672M598J016q436j0764j885
14797d781J952O53M042N868j83j385M29O415J3645p49k298j1741j4395j658P186
$$ plain form
14903 -5230 -2792 377 2084 5108 5658 5790 2753 -73 447 -1989 -7918 -7018 244 -2699 -3127 3358
14887 3358 6884 -675 -1789 3055 10355 14772 21512 16571 12693 6810 2985 3788 4522 4335 2012
14872 2012 -3184 -5809 -7217 -11739 -16947 -7888 -3744 -1976 1518 -3069 -7989 -6570 -1602 6431 3792
14857 3792 -1650 -5106 -3991 -4956 -4079 -3826 -323 549 2681 3320 -933 -277 2826 6816 2720 -983
14841 -983 3699 252 -1332 281 -3100 -2911 4831 16499 15962 7805 -2669 -11829 -14936 -11110 -12629
14826 -12629 -15236 -18322 -14892 -4835 7048 10815 9499 3637 -4642 -3048 6116 11880 10151 7907
14812 7907 1851 1855 7192 3862 6479 14315 19388 21393 14362 10690 15288 16304 7868 -2896 -4781
14797 -4781 -2829 -2176 1866 7734 7551 6166 6595 13010 26655 25906 23608 11867 -2528 -4186 3000
14782C000O76N130K830M17k724l55j839m659J805R711m014l116o245J107O721
14767H445j977m162Q961K959P835J634j1931l907l675R99M98l95n129p88M363
14752C730L948J141n641K810L587n406J348K098n52o73L22K764j236P355J0241
14737B5836m396p936m481J682j326L174j274J698K5J326k929n5R53k432j518l999
14721D348l825m111O165P100J018l552L361J021m176k943N675j97J308L87r720
14706A859j955K18k972r73K762O480K415n664K104K001k645k735R40Q777L578
14691A4190J01j0681n018N124K86L624J488m646k250J543K765P143j624m099P905
14676A5851M724j105j839m51m699j408M521L14K177k251m652N88K089L025o653
$$ plain form
14782 3000 3676 8806 11636 12053 9329 8974 7135 2476 4281 13992 9978 6862 617 1724 8445
14767 8445 6468 2306 11267 14226 22061 23695 11764 7857 4182 5181 5679 5284 155 -633 3730
14752 3730 7678 8819 3178 5988 9575 4169 5517 7615 7063 6390 6712 9476 8240 15595 25836
14737 25836 21440 13504 9023 10705 9379 12553 11279 12977 13002 14328 11399 11344 12297 9865 8347 4348
14721 4348 523 -3588 2577 9677 10695 7143 10504 11525 7349 4406 10081 9884 11192 11579 1859
14706 1859 -96 122 -2850 -3823 -1061 5419 7834 2170 4274 6275 3630 895 1835 10612 14190
14691 14190 14291 3610 -1408 3716 4002 7626 9114 4468 2218 3761 6526 13669 12045 7946 15851
14676 15851 20575 19470 17631 17180 12481 11073 15594 15908 18085 15834 11182 11770 13859 16884 10231
14661A0231m191L361L178O768O329j663k873k886l266P52J509Q790p491J316j315
14646A8549j567q32O21j764m367M147J805J280Q15J985K629n097j09l435k266
14631A2394M760k784j191L26N643k83L220l532J479Q815M012N02k768m738j641
14616B4214r056k858L212K679n81j471J684q77l412O491M625J671M767p589n500
14601A7999N007L354K093l623r212l381O883J460m466O24J735K99J283p36M43
14586A9762j584q52Q767O39n151n593M07J0152p276m566n430O170K77j354j685
14571A2683k890L992k770O45Q62k359K687P441O532k038m29P77m249J79L394L167
14555B7624J517n533n441M741N598L774M707M471l394n579k177o971l23r46o694
$$ plain form
14661 10231 6040 9401 12579 19347 25676 24013 21140 18254 14988 15740 17249 26039 18548 19864 18549
14646 18549 16982 16150 16771 15007 10640 14787 16592 17872 18687 20672 23301 18204 18095 14660 12394
14631 12394 17154 14370 13179 13505 19148 18865 22085 18553 20032 28847 32859 33361 30593 25855 24214
14616 24214 15158 12300 15512 18191 17610 16139 17823 16946 13534 20025 24650 26321 31088 23499 17999
14601 17999 23006 26360 28453 24830 15618 12237 19120 20580 16114 16738 18473 18772 20055 19319 19762
14586 19762 18178 17326 26093 26732 21581 15988 16395 26547 19271 14705 9275 15445 15722 14368 12683
14571 12683 9793 13785 11015 11660 12522 10163 12850 20291 26823 24785 24356 25133 20884 21063 24457 27624
14555 27624 29141 23608 18167 22908 28506 32280 36987 41458 38064 32485 30308 23337 23014 22068 15374
14540A5374N028R605L956j985q145l872p629J794M151k423K067O450K858j574
14526B5655k437p231M093L852L900Q06J182j740L982o3l700N85j020j990l505
14511B2369p33J709p520n496j727K265L366N206O627q849k405K267K936J743J484
14496B3242k18l982O073L809k296j1933m115Q694P916J277O333n42p824j081N676
14481C1029M89r574M215j091k842j773J937K290K120l221J886K187k806m486k899
14466A7461L717J1189M806n13L062q31m257j79r6M186l668n304N78M410l766K572
14450C3367K554j272M133M88L661K369l928q007m219l87J20K991L120M630L380
14435D3000o054k739j257k33J72K881o37P98j528L485j825J264N589l390k976
$$ plain form
14540 15374 20402 30007 33963 31978 23833 19961 12332 14126 18277 15854 17921 24371 27229 25655
14526 25655 23218 15987 20080 23932 27832 28638 29820 28080 32062 31999 28299 28884 27864 25874 22369
14511 22369 21636 23345 15825 10329 8602 10867 14233 19439 26066 17217 14812 17079 20015 21758 23242
14496 23242 23024 19042 25115 28924 26628 14695 10580 19274 27190 28467 34800 34258 26434 25353 31029
14481 31029 31518 21944 26159 25068 22226 20453 22390 24680 26800 23579 25465 27652 24846 20360 17461
14466 17461 21178 32367 37173 36660 39722 38891 34634 34455 34359 38545 34877 29573 30151 34561 30795 33367
14450 33367 35921 34649 38782 39270 42931 45300 41372 33365 29146 28759 28879 31870 34990 39620 43000
14435 43000 36946 34207 32950 32717 32889 35770 35133 35931 34403 37888 36063 37327 42916 39526 36550
14420C6550k057L198k730J406j563n622L299Q001J625k520K314N105J0987j705
14406E6288j2022K159j374k057J646k527j992l415l002M119j736l985L576j935
14392C3743n911j618R882J2055O495n166k201k379O756L014k536J847P058J328
14378F2367K754p887m563L6J609R87J008o723k852L009k494m811M388j537j166
14363D4125l173k936L167N236Q437p457o777K856K076K741j298O093J0497P321
14349G0908Q871M659L348Q642N203J21O567R109K0979K4347L9549O6303R3552
14336C62158J28818J49855J62523J62996J28491Q0120K3195o0758j23153j45342
14326H68903j45540j34031j10010o8161n2118l5899k7874j9157k0767k2197p459
$$ plain form
14420 36550 34493 37691 34961 36367 34804 29182 32481 40482 42107 39587 41901 47006 57993 56288
14406 56288 44266 46425 45051 42994 44640 42113 40121 36706 33704 37823 36087 32102 35678 33743
14392 33743 27832 26214 36096 48151 54646 49480 47279 44900 51656 54670 52134 53981 61039 62367
14378 62367 65121 57234 52671 52707 54316 55303 56311 49588 46736 49745 47251 42440 46828 45291 44125
14363 44125 40952 38016 41183 46419 54856 47399 40622 43478 45554 48295 46997 53090 63587 70908
14349 70908 79779 84438 87786 96428 101631 101752 108319 117428 138407 162754 202303 268606 362158
14336 362158 490976 640831 803354 966350 1094841 1174961 1198156 1137398 1014245 868903
14326 868903 723363 589332 479322 411161 359043 323144 295270 276113 255346 233149 225690
14315B25690r494j7640q160j0907j4243q183j3185J036k545k363j785m026n827
14302A28368l501J799n670k807m057p522m73J967N891o91m077J031O86R61k552
14287A09353J183n14p068l478l588o591J159O942l337l469N58j977n284n548M271
14272H2612J564m650J795J572J0871L630m459r360l879L655l758R66J092q019
14258G3632m377k732j855K96R12L621P276j323o103L504O266J0238K419M827n229
14243I1372q766m47J987l630k400j289K250J213p943l546O950n3K70m921l588
14228F7459J213n31N6j860R221O144j2141p273j254K009N142o563r049j237J201
14213E2537K837M502p58l017j528J012M393O237k474N253R994K976m058J555K600
$$ plain form
14315 225690 216196 198556 190396 179489 165246 157063 143878 144914 142369 140006 138221 134195 128368
14302 128368 124867 126666 120996 118189 114132 106610 106137 108104 113995 113304 109227 110258 110944 111905 109353
14287 109353 110536 110022 102954 99476 95888 89297 90456 97398 94061 90592 91150 89173 83889 78341 82612
14272 82612 84176 79526 81321 82893 93764 97394 92935 83575 79696 83351 79593 80559 81651 73632
14258 73632 69255 66523 64668 64964 65876 69497 76773 75450 69347 72851 79117 89355 91774 96601 91372
14243 91372 82606 82159 84146 80516 78116 76827 79077 80290 72347 68801 75751 75698 75968 71047 67459
14228 67459 68672 68141 68197 66337 75558 81702 69561 62288 61034 63043 68185 61622 52573 51336 52537
14213 52537 55374 59876 59118 56101 54573 55585 59978 66215 63741 68994 78988 81964 77906 79461 82061
14198H2061k481r53O51J090O09j170Q1l465k451l624n431n294j0047j2562j467
14183C5547L281K306J51n656p8j042k661o136l338O18R498K764k831o028Q69K439
14167B9703J809L084J038R121k126K374J749l369j09k453r951K670P428j533j602
14152C7833P17o0p701K700J529O673L253r78P961K817O988k346O569J81N111J710
14136G2957J4270J8306R283K1963K2436J5718K567l887N70r29j5119j6543p474
14123A34118j0005j2236p658n372j3958j4572o164m677j119L178M935K423N423
14110G4316L057J2152M972R80O774J2324J0789q149j0008n447k745J805m637l723
14096I2460k185k045j001j0879O207M783o866k46O786K895J596O004J07k628q262
$$ plain form
14198 82061 79580 78627 79278 80368 80977 79807 79888 76423 73972 70348 64917 59623 49576 37014 35547
14183 35547 38828 41134 41285 35629 35551 34509 31848 25712 22374 22992 32490 35254 32423 26395 27264 29703
14167 29703 31512 34596 35634 44755 42629 45003 46752 43383 43274 40821 30870 33540 40968 39435 37833
14152 37833 38550 38490 30789 33489 35018 41691 44944 43966 51927 54744 61732 59386 65955 66136 71247 72957
14136 72957 87227 105533 114816 136779 159215 174933 177500 173613 174183 173254 158135 141592 134118
14123 134118 124113 111877 104219 98847 84889 70317 64153 59476 58357 61535 66470 68893 74316
14110 74316 77373 89525 94497 95477 102251 114575 125364 117215 107207 101760 99015 100820 96183 92460
14096 92460 90275 88230 87229 76350 82557 87340 80474 80228 87014 89909 91505 97509 97616 94988 86726
14081H6726j3737l780n996p866j9093j3981o871j7841q778k533q23j1820j6211
14068d2604j4322r683j2458j3089L677J8914J7105J2786K0342K3304K5095J3636
14056D2703j715n567J0697Q104P725M434K616l842o141n83O694m538k574Q009
14042F6022J3204Q242q1K538N470P973O062J106k397j0470n969m245p102j173
14028G9180J4479N001J349Q660K0789J8423J0938R39O340N80m918p081P503O819
14014A69001J2149J0100R587J5970K2497K7619L7129N1691N4054L8371L0354K6965
14002E05487m782l8038n0328o4097o9055n8340m8672k7120j2953j2277L761O148
13990A29734O840K083l11P138Q798J4854J3961K117J0576R169R933Q650Q569O290
$$ plain form
14081 86726 72989 69209 63213 55347 36254 22273 15402 -2439 -11217 -13750 -14573 -26393 -42604
14068 -42604 -56926 -66609 -79067 -92156 -88479 -69565 -52460 -39674 -19332 3972 29067 42703
14056 42703 40988 35421 46118 54222 61947 66381 68997 65155 59014 58431 65125 60587 58013 66022
14042 66022 79226 87468 87387 89925 95395 103368 109430 110536 108139 97669 91700 87455 80353 79180
14028 79180 93659 98660 100009 108669 129458 147881 158819 159758 166098 166678 161760 154679 162182 169001
14014 169001 181150 191250 200837 216807 239304 266923 304052 355743 409797 448168 478522 505487
14002 505487 500705 462667 412339 348242 279187 220847 172175 145055 132102 119825 123586 129734
13990 129734 136574 138657 138346 145484 154282 169136 183097 185214 195790 204959 214892 223542 232111 238401
13976B38401O730J094l465K804P043O225P023r81l074r106o180l123k15k559m439
13961B36178N799O806K552M591j810r060m128J240J3033J3544J7788K4473K6053
13948C37059K5867K2111K1859J3765K1297J7234J2646J6087J3300J7460O487l373
13936E21799N473O687J5149J6421J5363J3723J6032K2512K7779L0015L1663K7900
13924G50516K2421K0752K8003L1798L1499M7192N2759N4893O2072P2130Q2212
13913A256247Q2116O9890P8702Q6126Q8037R8081J12953J27695J64113K03097
13903B367057K22091K44819L05873L54145L91618M48740N52311O63264Q00090
13894F350008R40861J061567J170980J270173J334196J430993J646954K088031
$$ plain form
13976 238401 245131 246225 242760 245564 252607 258832 265855 264874 261800 252694 246514 243391 243176 240617 236178
13961 236178 241977 248783 251335 255926 254116 245056 240928 242168 255201 268745 286533 311006 337059
13948 337059 362926 385037 406896 420661 441958 459192 471838 487925 501225 518685 525172 521799
13936 521799 527272 533959 549108 565529 580892 594615 610647 633159 660938 690953 722616 750516
13924 750516 772937 793689 821692 853490 884989 932181 984940 1039833 1101905 1174035 1256247
13913 1256247 1338363 1408253 1486955 1573081 1661118 1759199 1872152 1999847 2163960 2367057
13903 2367057 2589148 2833967 3139840 3493985 3885603 4334343 4886654 5549918 6350008
13894 6350008 7290869 8352436 9523416 10793589 12127785 13558778 15205732 17293763
13886A7293763K919991M416662P090375J1545781J7674998K3807805K7942294
13879A12691669L0263444K9282915K2169466J3067646M153341q676675k0086838
13872A82864968k3725200k4690717k5360032k1899285j5816465j0648074p147809
13865E3577386m937606l662396k954175k527798k312026k222075k149838k055847
13857C0755625j959060j835643j648022j433713j248654j069055r01154p85329
13849A9874995p13859o55233n96151n66305n41776n15648m88353m51371m23613
13840A4922686m02114l75989l44517l26047l11320k91186k97013k99508k86948
13831A1988044k79052k77428k72044k61296k50126k46872k41197k31933k20659
$$ plain form
13886 17293763 20213754 24630416 31720791 43266572 60941570 84749375 112691669
13879 112691669 142955113 172238028 194407494 207475140 211628481 202951806 182864968
13872 182864968 159139768 134449051 109089019 87189734 71373269 60725195 53577386
13865 53577386 48639780 44977384 42023209 39495411 37183385 34961310 32811472 30755625
13857 30755625 28796565 26960922 25312900 23879187 22630533 21561478 20660324 19874995
13849 19874995 19161136 18505903 17909752 17343447 16801671 16286023 15797670 15346299 14922686
13840 14922686 14520572 14144583 13800066 13474019 13162699 12871513 12574500 12274992 11988044
13831 11988044 11708992 11431564 11159520 10898224 10648098 10401226 10160029 9928096 9707437
13822I707437k10328k04460j94003j90209j89660j80210j70951j74390j67826
13813H025400j56592j51742j43800j34066j31288j40360j37482j30848j27887
13804F771335j25302j13287j07250j01163j08043j11821j11610j11686j07392
13795E773781j00904r8723j03844j07753r6659q9254r0047r3752j01431j00285
13785D791129r8899r8528r6523q7871q5986q0931q4245p7546p0467p7757o6050
13774C866326o2311o6023n7047n9829n6527m9744m6325m7443l8116l5679m6010
13763C301272l7449l7081n0761n6265n7842o0109n3968n6658n9328m8209m7553
13752B736049m1414n1740o1701n9896o0936o9601p0976p3650p3801o0247n0968
$$ plain form
13822 9707437 9497109 9292649 9098646 8908437 8718777 8538567 8367616 8193226 8025400
13813 8025400 7868808 7717066 7573266 7439200 7307912 7167552 7030070 6899222 6771335
13804 6771335 6646033 6532746 6425496 6324333 6216290 6104469 5992859 5881173 5773781
13795 5773781 5672877 5574154 5470310 5362557 5265898 5176644 5086597 4992845 4891414 4791129
13785 4791129 4692230 4593702 4497179 4409308 4323322 4242391 4158146 4080600 4010133 3932376 3866326
13774 3866326 3804015 3737992 3680945 3621116 3564589 3514845 3468520 3421077 3382961 3347282 3301272
13763 3301272 3263823 3226742 3175981 3119716 3061874 3001765 2947797 2891139 2831811 2783602 2736049
13752 2736049 2694635 2642895 2581194 2521298 2460362 2390761 2319785 2246135 2172334 2112087 2061119
13741B061119l2426k4232k3998j8604j9484k7179l0279l4458l6485l3116l3706
13730A747152k0582j0253j7708j9542k1095j6460j3645k3578l0886k9097l1236
13719A513070l8972l4913k6056k8617l2021j9430j3707k3766k2730j7310j5115
13708A240433j9581j8524j1194j5370k6593k7026j3150o846j0021j6085j5430
13697A060613j4275q753r84o510q552q475L852l080P826R266p412l0651j4522
13684I78343R52k3555k2475j5829j4952j5475k0339j5602k1164j9008j7273k0652
13672G72971k3494k2265j8912j4010j1739q097o833m694n638j9092j6442r114
13660F12641m887j0947j3334j2172j0577j0403q899j4996j0847m881j0442j0662
$$ plain form
13741 2061119 2028693 2004461 1980463 1961859 1942375 1915196 1884917 1850459 1813974 1780858 1747152
13730 1747152 1726570 1716317 1698609 1679067 1657972 1641512 1627867 1604289 1573403 1544306 1513070
13719 1513070 1474098 1439185 1413129 1384512 1352491 1333061 1319354 1295588 1272858 1255548 1240433
13708 1240433 1220852 1202328 1191134 1175764 1149171 1122145 1108995 1102149 1092128 1076043 1060613
13697 1060613 1046338 1037585 1036601 1030091 1021539 1013064 1016916 1013836 1021662 1030928 1023516 992865 978343
13684 978343 979295 955740 933265 917436 902484 887009 866670 851068 829904 810896 793623 772971
13672 772971 749477 727212 708300 694290 682551 674454 667621 662927 657289 638197 621755 612641
13660 612641 607754 596807 583473 571301 560724 550321 541422 526426 515579 510698 500256 489594
13648D89594j490q019o932q977k120K009J064q224J161O977q74l912K01m082Q96
13633D57272q499j8697j5054m917l543n707j89J31j402J779q53n752q512l74J304
13618C86987n632j1719j4698j1538r603k790k064K563o271n911o454r154m239
13605B99477p942j322j53k343J91n837k240n347m629p844m449m860l110k901R12
13590B47603l704N086j96K051n31n28q52J08O066k343m750k99m851o599o565j705
13574B27991k634l744K272R067J1539J1691J8734K6550M1324N5167O3086M1128
13562E02171R860l1581n2861o8151n3539l6357j9036j7952q285n351o62l650j14
13549B14492n009j5795p272m715j0265o341l051J0151L866n202L626L48m241k892
$$ plain form
13648 489594 488104 480085 473153 464176 462056 464065 465129 456905 458066 465043 464169 460257 460458 456376 457272
13633 457272 448773 430076 415022 410105 406562 400855 400666 400797 399395 401174 400321 394569 386057 385683 386987
13618 386987 381355 369636 354938 343400 333797 331007 328943 331506 325235 319324 312870 303716 299477
13605 299477 291535 290213 290060 287717 287908 282071 279831 274484 269855 262011 257562 252702 249592 246691 247603
13590 247603 243899 248985 248789 250840 250309 249781 248929 249037 255103 252760 248010 247711 242860 236261 229696 227991
13574 227991 225357 221613 223885 232952 244491 256182 274916 301466 342790 397957 461043 502171
13562 502171 512031 480450 427589 359438 305899 269542 250506 232554 224269 218918 218256 214606 214492
13549 214492 209483 193688 186416 181701 171436 165095 162044 172195 176061 170859 174485 174833 170592 167700
13535A67700o3m501j019Q579J4180J0701J1890K0679K0569K4779K7488K5265N2351
13522C78598O4278Q4929J54619J96958J68565Q7902k4502j57526k12448j68504
13512E72869j09590p5932m9644k8766j2509j3115j0090j3909j5899j8010l428
13501B21977L87J731j926m568r043j4877j3605j171K891k685m729r851l324J472
13487A62679N921K128j884k768M52R304J1431J0219J9281L3051N3230R5924J60136
13474E59104K13717J99051J26023J0399j36217k15653j89630j22981p6362m1647
13464C25804l0071k5248k1800j8022j5310l227N446O827K140j453n853j8961j5620
13451A84652p236o878m170M15n402o208m650j627J631l016r86J360L452K242l068
$$ plain form
13535 167700 167637 163136 162117 170696 184876 195577 207467 228146 248715 273494 300982 326247 378598
13522 378598 442876 527805 682424 879382 1047947 1135849 1111347 953821 741373 572869
13512 572869 463279 387347 337703 308937 296428 283313 273223 259314 243415 225405 221977
13501 221977 222364 224095 222169 217601 208558 193681 180076 178905 181796 179111 174382 164531 161207 162679
13487 162679 168600 170728 168844 166076 166528 175832 187263 197482 216763 249814 303044 398968 559104
13474 559104 772821 971872 1097895 1108294 972077 756424 566794 443813 367451 325804
13464 325804 295733 270485 248685 230663 215353 212126 217572 224399 226539 225086 219233 200272 184652
13451 184652 177416 170538 166368 166783 161381 155173 150523 148896 150527 147511 146525 147885 151337 153579 150511
13436A50511l629J1163J2076J5629J4688L0919N1057P2933P7722N2292K2685k2078
13424D85968n0252m6858r475K2940N0769R4180J32738J63647J72181J41481Q4865
13413A242184P893m1941q3471r5347j07279j32972j29045j04763p4884m5810l3989
13402D00576k0555j8403j3917k0864j9884j6016j5894j6003j2010j2865j3893
13391B20272q987j35j945r691r121k76o33q652n114l832p142k760m312o860m742
13376A46070o094Q76O477J1909Q527j896J551P580J2129J8450J6168N327M039
13363B31113J2951J1157J094O30m624j1627j4252j1266p630j0344o143p282k57
13350A83520p932q557j1600o211q197j262l207o940r711m617L283Q024J0094K467
$$ plain form
13436 150511 146882 158045 170121 185750 200438 231357 282414 355347 433069 485361 508046 485968
13424 485968 435716 388858 379383 402323 453092 547272 680010 843657 1015838 1157319 1242184
13413 1242184 1250077 1208136 1124665 1029318 922039 789067 660022 555259 480375 434565 400576
13402 400576 380021 361618 347701 326837 306953 290937 275043 259040 247030 234165 220272
13391 220272 211285 211150 209205 199514 190393 190117 189484 180832 175718 171886 164744 161984 157672 150812 146070
13376 146070 139976 140852 147329 159238 167765 165869 167420 175000 187129 205579 221747 227074 231113
13363 231113 244064 255221 256315 256945 252321 240694 226442 215176 207546 197202 191059 183777 183520
13350 183520 175588 167031 155431 149220 141023 139761 136554 129614 119903 115286 118569 126593 136687 139154
13336A39154J2021K902m724M460O769o76Q861J1041P09k397Q979Q914L864R59
13322B00836L012N622k362l685q193j0602j2677j0759j1214j0060n790q590p909
13309A17629l052o922r292p422k284k89L732K47k843m26o318o293l316K964j791
13294G4324m404j2846j0525N192J3804k382r562l234J815J71n281q808J946L410
13280D3620K439P902l5j270m072O429M555q633m750K023l754L348N569j0269q498
13265C4604j677J236O463L473L211J862k12n919p128q640P334L833M80N284k401
13250D1803K109P20l297L536M733l69j2084l796N056N094m62R83j587J045k864
13235D0620K910O891o0j158l51M378Q6O295r55k817o720k469P517Q360K842J997
$$ plain form
13336 139154 151175 154077 149353 153813 160582 159906 168767 179808 180517 178120 187099 196013 199877 200836
13322 200836 203848 209470 207108 203423 195230 184628 171951 161192 149978 139918 134128 125538 117629
13309 117629 114577 107655 98363 90941 88657 88368 92100 92347 89504 89078 82760 76467 73151 76115 74324
13294 74324 69920 57074 46549 51741 65545 63163 53601 50367 52182 52353 47072 38264 40210 43620
13280 43620 46059 53961 53926 52656 48584 55013 59568 50935 46185 48208 44454 47802 53371 43102 34604
13265 34604 32927 34163 40626 44099 47310 49172 48960 43041 35913 27273 34607 38440 38920 44204 41803
13250 41803 43912 44632 41335 44871 49604 49235 37151 33355 38411 43505 43043 44026 42439 43484 40620
13235 40620 43530 50421 50361 49203 48852 53230 53316 59611 58656 55839 49119 46650 54167 62527 65369 67366
13219F7366k436k540o141j282j649q50j255k645l789q709k100N3o33J0349O829
13204E0568k426j0290n498L403M130j845q93Q604Q393m01k607J504M303N883N034
13189F7862L622N981L940J0821R496Q869N506K0J127P174J732j2027j0969q111
13175I5043o176m856R56o77n774m543l315p834j0152l773J87k2m739L906N817
13160E4048J15o91j917O415J11n022m47N967K081M849N532J444m927M206k266
13145F9498R337J3130J1567Q178K858P589R248J1051L619j116o931l602j0141
13132A24285r069k563m565j695n254K65J855k176n539k553K582M45N87J19P424
13117A04148R439P432J1504J4824K2348K8781K8601K9448K9439K6892J6129Q132
$$ plain form
13219 67366 64930 62390 56249 54967 53318 52468 51213 48568 44779 36070 33970 34023 33390 43739 50568
13204 50568 48142 37852 32354 35757 39887 38042 37149 45753 54146 53745 51138 52642 56945 62828 67862
13189 67862 71484 77465 81405 92226 101722 110591 116097 116117 117244 124418 126150 114123 103154 95043
13175 95043 88867 84011 84967 84290 78516 73973 70658 62824 52672 48899 49086 49064 44325 48231 54048
13160 54048 54163 53472 51555 57970 58081 53059 52612 58579 60660 65509 71041 72485 67558 71764 69498
13145 69498 78835 91965 103532 111710 114568 122157 131405 142456 146075 144959 138028 134426 124285
13132 124285 115216 112653 108088 106393 101139 101404 103259 101083 95544 92991 95573 96018 96605 96724 104148
13117 104148 113587 121019 132523 147347 169695 198476 227077 256525 285964 312856 328985 337117
13105C37117R140J6800K7518M0030O5116J06485J62135K73533M66052P56839J091345
13094C352110J357768J455109J198345O45397j9307p14612j145113j233714j136831
13085C759152q84664n82082l70144k51805j74786j16003q4903o5013m6109m1081
13075A142562m8321m9578n5597o5736o0554n4930n2123l8452l7803l4409k3354
13064F21705k2096j4238k2686j7965k0381j1006q882j7149j6866j4195j1397j4817
13052D30027p107l884j0815j4271j2800r427r890j3989q08k772n607m112k023
13039C32522p143j0740j0283q642q706q214o091m578m728m822p202l213n848j0065
13025B32247p397J681j589l792l897m394o628k527m467q436J51n487N105n008
$$ plain form
13105 337117 346257 363057 390575 430605 495721 602206 764341 1037874 1503926 2260765 3352110
13094 3352110 4709878 6164987 7363332 8008729 7989422 7274810 6129697 4895983 3759152
13085 3759152 2874488 2292406 1922262 1670457 1495671 1379668 1294765 1229752 1183643 1142562
13075 1142562 1094241 1044663 989066 923330 862776 807846 755723 717271 679468 645059 621705
13064 621705 599609 585371 562685 544720 524339 513333 504451 487302 470436 456241 444844 430027
13052 430027 422920 419036 408221 393950 381150 371723 361833 347844 347036 344264 338657 334545 332522
13039 332522 325379 314639 304356 295714 287008 278794 272703 268125 263397 258575 251373 248160 242312 232247
13025 232247 224850 226531 224942 221150 217253 212859 206231 203704 199237 190801 190952 185465 190570 185562
13011A85562o493j855k13M52m495l695n680j334P24O449j398j5207j0311j83J251
12996A43574P77K050k82l16j703n342j496m600q548m504m481k672j115p33J037
12981A11646l596m479k340p366N594P681m045l332Q69J764k855q849k064o960
12967H1668j3518k425J71m262J129j743l085m593j334O850k707n016k236J355
12953E0254j086L560k33l56j775R72K554m856k834m82n601m95N979m349m576J490
12937C8166Q709K99p467j849J445l38q50J572J94r69L183l058J64J056K777j134
12921D1900l130m496M106M915J608j864J760K98n622K506r4j0970n844m041N283
12906B6315K508P240J101n316l745L102L281L026q830o005K506p476L62n7M040
$$ plain form
13011 185562 179069 177214 177001 177453 172958 169263 163583 162249 162973 169422 168024 152817 142506 142323 143574
12996 143574 144351 146401 146119 145803 144100 138758 137262 132662 124114 119610 115129 112457 111342 110609 111646
12981 111646 108050 103571 101231 93865 99459 107140 103095 99763 100632 102396 99541 90692 88628 81668
12967 81668 68150 65725 65896 61634 62763 61020 57935 53342 52008 58858 56151 51135 48899 50254
12953 50254 49168 52728 52495 52139 50364 51336 53890 49034 46200 45718 40117 39622 45601 41252 36676 38166
12937 38166 46875 47174 39707 37858 39303 38965 38115 39687 39881 38912 42095 39037 39201 40257 43034 41900
12921 41900 38770 34274 38380 43295 44903 43039 44799 45097 39475 41981 41887 30917 25073 21032 26315
12906 26315 28823 36063 37164 31848 28103 31205 34486 37512 28682 22677 25183 17707 18069 18012 22052
12891B2052O47R23p09o556n960N651M071p949p236N665L948M561O578N351p466
12876B3571q686o138J539R017l406r534N745R189K042k332j802k630o968m744
12862D863o72N875O081l114r297M431p75n988O604Q363l079l601l422j940J755
12847F084L053l807n758l645J574J0472Q37j032J274l059l634o21K211l090l128
12832b269m13k728L775M72j258N622M998n46L173l010l719K18L519L477M778L159
12816A9248l251k286m978p549p917Q143M117N266Q587m819k307K365O154L889
12802B4662k582J346l716j0440N813N220p103m948o19n496o435N757M854J441
12788G754M369n02j305L48q68j350L96l493o639l395j183O40J850Q893O586o35
$$ plain form
12891 22052 22699 23622 22913 16357 10397 16048 20119 12170 4934 10599 14547 19108 25686 31037 23571
12876 23571 14885 8747 10286 19303 15897 6363 12108 21297 23339 21007 19205 16575 9607 4863
12862 4863 4191 10066 16147 13033 3736 8167 7392 1404 8008 16371 13292 9691 6269 4329 6084
12847 6084 9137 5330 -428 -4073 -2499 7973 8810 7778 9052 5993 2359 1738 3949 859 -2269
12832 -2269 -2682 -5410 -1635 -1163 -2421 3201 8199 7653 10826 7816 4097 4315 7834 11311 16089 19248
12816 19248 15997 13711 8733 1184 -6733 1410 5527 10793 19380 14561 12254 14619 20773 24662
12802 24662 22080 23426 19710 9270 15083 20303 13200 8252 7633 2137 -4298 1459 6313 7754
12788 7754 12123 11621 10316 10664 9796 8446 8842 5349 -1290 -4685 -5868 -5228 -3378 5515 12101 11466
12772A1466m702o839m154M20J405k067N66K524K880k18N982L402l924Q52Q0r66
12756F707K049j397N22j0211j579M469J935K911J820r363O15j402J441J377n753
12741e859M346O768m44l285N703pm876P609M513j407j954k709o769n991L709O438
12725E785K415p49p569j782L964N26Q65j945l805j299M581M041p39l452k750l161
12709e074n397M598O710K324k789j829l632m103j609K420j998J779n423J677N01
12694a1845M55L867P682l17k058m724L495Q457M617k460p778l627J11m030j352
12679i507Q383O355l479k937j784r83O322L795M667M396L068l356n482k100o446
12664I12n956o97J976J458k263Q668J640K970K89j677O66L307k492M23J1026N827
$$ plain form
12772 11466 6764 -75 -4229 -3809 -2404 -4471 -3905 -1381 1499 1281 7263 10665 6741 7593 7673 6707
12756 6707 8756 7359 7881 -2330 -3909 560 2495 5406 7226 -2137 -1522 -2924 -1483 -106 -5859
12741 -5859 -1513 5255 4811 1526 7229 7222 2346 9955 14468 13061 11107 8398 1629 -4362 -653 5785
12725 5785 8200 7451 -118 -1900 2064 2590 3455 1510 -2295 -3594 987 5028 4289 837 -1913 -5074
12709 -5074 -10471 -5873 837 3161 372 -1457 -5089 -9192 -10801 -8381 -10379 -8600 -14023 -12346 -11845
12694 -11845 -11390 -7523 159 -158 -2216 -6940 -3445 5012 9629 7169 -609 -4236 -4125 -8155 -9507
12679 -9507 -1124 5231 1752 -1185 -2969 -3952 2370 6165 10832 15228 18296 14940 9458 7358 912
12664 912 -5044 -5741 -3765 -2307 -4570 4098 5738 8708 8997 7320 7986 11293 8801 9224 20250 26077
12648B6077j24K520J01J998L015j1861j5824k754O72J058L759J23J06o357P819
12633A0328M583j164P29L263J64M432P205R450K469M56r77m266j2070j0030M423
12618A8995J718j1858q378O25K855P85P714J092l696j869l6n384j820k419N619
12603C943J2086M982K571P534k964o197p369j1579k468P491J305k257K315n118
12589D275o141o243L548L647N692L835m69m680P891m469j688m671k433J0605J56
12574H855k993o415j544J023j357n415O882N851l392L863l597q090j711j924L186
12559f778j723M383Q260J739M081k328k551J359p47l206l815m410P987Q881n150
12544E982J01j197j881k279K401J0452k949n41j321o658K39k892q404m347M631
$$ plain form
12648 26077 25953 28473 28574 30572 33587 21726 5902 3148 3820 4878 8637 8760 8866 2509 10328
12633 10328 14911 13747 14476 17739 17903 22335 29540 38990 41459 41915 40938 36672 24602 14572 18995
12618 18995 20713 8855 477 1102 3957 4742 12456 13548 9852 7983 7947 2563 743 -1676 3943
12603 3943 16029 21011 23582 31116 28152 21955 14586 3007 539 8030 9335 7078 9393 4275
12589 4275 -1866 -8109 -4561 -914 4778 8613 8144 3464 11355 6886 5198 527 -1906 8699 8855
12574 8855 5862 -553 -2097 -1074 -2431 -7846 -964 4887 1495 5358 1761 -6329 -8040 -9964 -6778
12559 -6778 -8501 -4118 4142 5881 9962 7634 5083 6442 5695 2489 -1326 -5736 2251 11132 5982
12544 5982 6083 4886 3005 726 3127 13579 10630 10089 8768 2110 2349 -543 -8947 -13294 -8663
12529h663R515M304K429k279j30r644m634R904L160k477m244q77n79j353K543
12514c025O867m921n751k27K302J855n139O653P04m698j045O65k08M138R278K400
12498I848j895n086J087j569n332M10j621p644M736J1679K781j007n739N179j396
12483D431o728j152O3o033l316O55J831J434M234M897L854K671o538l644k85o560
12467a0186L048R12P139J292J995n53j716O90k065o769J357K469o497L618O09
12452d657l672K068J530M689K557M31m624k438J011j008N800l011n60j664j345
12437d893K769j033p00L221L19Pl384J676Q527o747j791l30P76m616l281O54R584
12420G58j571n21N075l657j043j853L36l450l22O432M260n588j503N793M363K867
$$ plain form
12529 -8663 852 5156 7585 5306 5176 -4468 -9102 802 3962 1485 -2759 -3636 -4215 -5568 -3025
12514 -3025 3842 -1079 -6830 -7057 -4755 -2900 -8039 -1386 -682 -5380 -6425 -5760 -5968 -1830 7448 9848
12498 9848 7953 2867 3954 2385 -2947 -2537 -4158 -11802 -7066 4613 7394 6387 648 5827 4431
12483 4431 -2297 -3449 -3386 -9419 -12735 -12080 -10249 -8815 -4581 316 4170 6841 303 -3341 -3626 -10186
12467 -10186 -7138 -6226 913 2205 4200 3647 1931 2621 556 -6213 -4856 -2387 -8884 -5266 -4657
12452 -4657 -8329 -6261 -4731 -42 2515 2946 -1678 -4116 -3105 -4113 1687 -1324 -1884 -3548 -4893
12437 -4893 -2124 -3157 -3857 -636 -317 -310 -3694 -2018 6509 -238 -2029 -2359 -1583 -6199 -9480 -8826 758
12420 758 -813 -1334 3741 84 -959 -2812 -2476 -5926 -6248 184 4444 -1144 -2647 3146 7509 10376
12404A0376p22m921J52N963n081n502r018J590L731q13m897l563J259l624m039
12389a9109k233L267R487N677l158P048J640p588m345Q898N479m444r211P405
12375a187J1931K819P80M543O609P137J72q385K523K192m926j3690m101l636R37
12360C718o25P82k459N730m699m749m095N302o04j390p36j149k088k774r52Q126
12344b662k283j966L418L638m701l848Q62j094L423n455k881N747k477P64N237
12329d278P371J851m158j0091l176N053M520k57L720P560o01k047K049k382j885
12314C249m511k13p86p53o688j306k148n362r22N465N118N304M937L874M906L195
12298A3359q12Jj922J890n125j503K488m118n021m32j945J655j804m689M372O993
$$ plain form
12404 10376 9654 4733 4885 10848 5767 265 -8753 -7163 -3432 -4245 -9142 -12705 -11446 -15070 -19109
12389 -19109 -21342 -18075 -8588 -2911 -6069 979 2619 -4969 -9314 -416 5063 619 -8592 -1187
12375 -1187 10744 13563 14343 18886 25495 32632 32804 24419 26942 29134 24208 10518 6417 2781 3718
12360 3718 3093 3875 1416 7146 2447 -2302 -6397 -1095 -1699 -3089 -3825 -4974 -7062 -9836 -10788 -2662
12344 -2662 -4945 -6911 -3493 145 -4556 -8404 -7542 -8636 -5213 -10668 -13549 -7802 -10279 -9515 -4278
12329 -4278 3093 4944 786 -9305 -12481 -7428 -2908 -3165 555 8115 7514 5467 7516 5134 3249
12314 3249 -1262 -1475 -2261 -3014 -9702 -11008 -13156 -18518 -19440 -13975 -8857 -3553 1384 5258 10164 13359
12298 13359 12547 12548 10626 12516 7391 5888 8376 4258 -763 -1195 -3140 -1485 -3289 -7978 -3606 3387
12282C387j579q007P166R2k596L64L743N518n77J258J809j487O961n879K592j476
12266A1289m320J806k975q29j798k148l258p30K776K571L258m687k122K337O877
12251H047k989o744n556j633K182R19J769l956J19j367L437M138J385k9l844k235
12235f357n521j73O927n92P41J220k802K588m501N172J861l680L835l835k616
12220g733N135N489J108p800L901L04l619K69l216l890J519O583O083J596j866
12205C863m051n019o440j703J0228k342n98K743K44R144K259p74n165k451n129
12190e191m287l672M883K657J990P074Q306k351J657j136m514n118l462J1471
12176H307P21J633N902p935n268r22p861K844O414L265K265R35q76o698m965j407
$$ plain form
12282 3387 1808 -6199 967 1059 -1537 -1173 2570 8088 7511 8769 10578 9091 16052 10173 12765 11289
12266 11289 6969 8775 5800 4971 3173 1025 -2233 -2963 -187 2384 5642 955 -1167 1170 8047
12251 8047 5058 -1686 -7242 -8875 -6693 -5774 -4005 -7961 -7842 -9209 -5772 -1634 -249 -278 -4122 -6357
12235 -6357 -11878 -12051 -5124 -5716 -4975 -3755 -6557 -3969 -8470 -3298 -1437 -5117 -1282 -5117 -7733
12220 -7733 -2598 2891 3999 -3801 100 404 -3215 -2946 -6162 -10052 -8533 -1950 4133 5729 3863
12205 3863 -188 -5207 -11647 -13350 -3122 -5464 -6062 -3319 -3075 6069 8328 7554 2389 -62 -5191
12190 -5191 -9478 -13150 -8267 -5610 -3620 3454 11760 9409 11066 9930 5416 298 -3164 8307
12176 8307 9028 10661 16563 8628 3360 2438 -5423 -2579 3835 7100 9365 10300 9424 2726 -2239 -3646
12160c646P6k919N790N007J061p87n78r5K325l358o506n894L131O299n255k06
12144e555N894L125J5465R147j947j2586k255O43k437k885L79J991J151l527M66
12129G069o488J418k929N26L100l496k707J446K827k358j860j302L712m238M001
12114a279j186q795m061l53q35N801N081n12k273j769K672Q201K354j290Ok056
12098b94O379R09k577k192K96P813j791p469j387K131L518m021q95k248m060J5156
12082I268j634p626r529N503M900r63q400K693K630K377L793n442l869P24m2K233
12066c384J430m61O667N053M531o490J195K192j317l962n577m872j046N54l850
12051i337j340r79O730L309M800o142n139P425l711N43K042J244k28m443M52K128
$$ plain form
12160 -3646 -3570 -6489 -699 4308 5369 4582 4004 3909 6234 2876 -3630 -9524 -6393 -94 -5349 -5555
12144 -5555 339 3464 18929 28076 26129 13543 11288 11931 9494 6609 6988 8979 10130 6603 7069
12129 7069 581 1999 -930 -404 2696 -800 -3507 -2061 766 -1592 -3452 -4754 -1042 -5280 -1279
12114 -1279 -2465 -11260 -15321 -15674 -16509 -10708 -5627 -6139 -8412 -10181 -7509 692 3046 1756 1762 -294
12098 -294 6085 6994 4417 2225 2521 10334 8543 1074 -313 1818 5336 1315 420 -1828 -5888 9268
12082 9268 7634 8 -9521 -4018 882 -81 -8481 -5788 -3158 -781 3012 -2430 -6299 -5575 -5617 -3384
12066 -3384 -1954 -2415 4252 9305 13836 7346 8541 10733 9416 5454 -123 -4995 -6041 -5487 -9337
12051 -9337 -10677 -11656 -4926 -1617 3183 -2959 -8098 -673 -4384 -3841 -1799 -555 -783 -5226 -4774 -2646
12035b646j676Q81j867q16J671j042K715k926j94l132J774l6n252j089P762N042
12019h31j154P370P807m617j0604l656k51P459N500J291k097r70m764m653l490
12004g660N398L460J77l888o86J413k745L84j765l832R89J1304J475j0349q765
11989a5090k387Q701J957K17K41J596N65Q21n234l698M556m355M003K112O169
11974A74j374n232K123n960l760M975N65l555k884K760q36M347K98p661o441M57
11958b2004Q918J897K432p84q48j172M321M928j943l1j450j689J127Q276r82m328
11942c332k089j608Q34O276M04m527p8j433l385j505Q528N874n182P97L279l566
11926g13O069l143L15K091o639m201k94M792J114k145L431j792q617n823m833
$$ plain form
12035 -2646 -4322 -3441 -5308 -6124 -4453 -5495 -2780 -5706 -5900 -9032 -7258 -7294 -12546 -13635 -5873 -831
12019 -831 -1985 5385 13192 8575 -2029 -5685 -5936 1523 7023 8314 6217 5247 483 -4170 -7660
12004 -7660 -2262 1198 1375 -2513 -3199 -1786 -4531 -4147 -5912 -9744 -8755 2549 4024 -6325 -15090
11989 -15090 -17477 -8776 -6819 -6602 -6361 -4765 -4200 -3379 -8613 -12311 -7755 -12110 -8107 -5995 174
11974 174 -1200 -6432 -4309 -10269 -14029 -9054 -8489 -12044 -14928 -12168 -13004 -8657 -8359 -16020 -22461 -22004
11958 -22004 -13086 -11189 -8757 -9541 -10389 -11561 -7240 -2312 -4255 -4286 -5736 -7425 -6298 1978 996 -3332
11942 -3332 -5421 -7029 -6195 81 485 -4042 -4120 -5553 -8938 -10443 -1915 3959 -1223 -426 2853 -713
11926 -713 5356 2213 2528 4619 -2020 -6221 -6515 -1723 -609 -2754 677 -1115 -9732 -15555 -20388
11911b0388q50L646R398M629l652J106j679N059O583L298o647q60k032k608l716
11896h713q245K496O728K34m87l335J87O173M676p61p99r91p222K415N707k687
11880d624l842m401j186Q61M101M476n116j08N151Q726o22k999M604o156o742
11865g877K862J700K316m746k312M527O666q06n534M056j248k933n767k141M026
11850g211J0286r88k337K69M578r09r723n132K940o80q32q35j47M276M400n773
11834g818n463P214p09m354O68K79j040j5N678m941n355m026l122L680N117O722
11818g485M657r86k484O946O37o79m975l764K205O83m093k511O151R99l018K288
11802e429M52m30P83j528N020N958m121r248m092M164O434M875P093j920l845
$$ plain form
11911 -20388 -21238 -17592 -8194 -3565 -7217 -6111 -7790 -2731 3852 7150 503 -357 -2389 -4997 -8713
11896 -8713 -16958 -14462 -7734 -7500 -7987 -11322 -11135 -4962 -286 -1047 -1846 -2837 -10059 -7644 -1937 -4624
11880 -4624 -8466 -12867 -14053 -13192 -9091 -4615 -9731 -9839 -4688 4038 3416 417 5021 -1135 -7877
11865 -7877 -5015 -3315 -999 -5745 -8057 -3530 3136 2330 -3204 852 -396 -3329 -9096 -11237 -7211
11850 -7211 3075 2087 -250 19 4597 3688 -6035 -11167 -8227 -8907 -9739 -10574 -10721 -6445 -2045 -7818
11834 -7818 -13281 -6067 -6776 -11130 -10462 -10183 -11223 -11238 -5560 -10501 -15856 -19882 -23004 -19324 -14207 -7485
11818 -7485 -2828 -3814 -6298 648 1285 606 -4369 -8133 -5928 -5245 -9338 -11849 -5698 -4699 -7717 -5429
11802 -5429 -4977 -5407 -4624 -6152 -1132 4826 705 -8543 -12635 -8471 -2037 2838 9931 8011 4166
11787D166m644j0242K366M848K508L73l785j716P284j579j618M017l672q730q788
11772a9212R53O497N746N597m77l756o817J050R022K360q22J274l33n99M635J482
11756F600p425l699k35K860L967J895p585j306o364K388M226L120n221K033J454
11741c292O502j020q67l285k33R98J900k61j053M354N123L673j126n716o807k636
11725c746r77L739J789J481L653M300q027o245N81p143J671j56l874k62J483Q644
11709c089K891m311l939m286k239j227k66M479M965O524K902l687p395K25l884
11694a2337K683L61L359O609o67l100J568q68L045M541J962j776k103l796m959
11679e478o584K428R936m223p298K911L838O55o556J231J209q03k700M484r51
$$ plain form
11787 4166 -478 -10720 -8354 -3506 -998 -625 -4410 -6126 1158 -421 -2039 1978 -1694 -10424 -19212
11772 -19212 -18259 -11762 -6016 -419 -896 -4652 -11469 -10419 -1397 963 141 1415 1082 483 5118 6600
11756 6600 -825 -4524 -4759 -1899 2068 3963 -3622 -4928 -11292 -8904 -4678 -1558 -6779 -4746 -3292
11741 -3292 3210 2190 1323 -1962 -2195 -1197 703 442 -611 3743 8866 12539 11413 5697 -1110 -3746
11725 -3746 -4723 -984 805 2286 5939 10239 2212 -4033 -3452 -10595 -8924 -9080 -12954 -13216 -11733 -3089
11709 -3089 -198 -4509 -8448 -12734 -14973 -16200 -16466 -11987 -7022 -498 2404 -1283 -8678 -8453 -12337
11694 -12337 -9654 -9293 -5934 675 8 -3092 -1524 -2392 653 5194 7156 5380 3277 -519 -5478
11679 -5478 -12062 -9634 302 -3921 -11219 -8308 -4470 -3815 -10371 -9140 -7931 -8734 -11434 -6950 -7901
11664g901K991R426J460o665m989J33r81K893m58k446K692O435j876m563k743
11649f592k259M655L129k997K900p725k645k362j550K413O654M528K386m203k364
11634f032j3973K982Q336K948N011m239m009K286N316K761J431j998l292l302
11620e774k574J273m931n600K949M784L238K148l22m634l318j441k359J03J181
11605a5277J139M007L062k090j892N116R669j110r56l32L289J457l634l544o755
11590g851l201p770k7R63L470J20O435N642o132o700O18P225Q27Q97l1P332J617
11573C434k248r364q983P304O074K357J694K13l576K343K85K555k686k649j097
11558d344K914m270k976L157R311Q210k319k464o245o495K624m291o70K833m865
$$ plain form
11664 -7901 -4910 4516 5976 -689 -5678 -5545 -6526 -3633 -4091 -6537 -3845 2590 714 -3849 -6592
11649 -6592 -8851 -4196 -1067 -4064 -1164 -8889 -11534 -13896 -15446 -13033 -6379 -1851 535 -3668 -6032
11634 -6032 -20005 -17023 -8687 -5739 -728 -4967 -8976 -6690 -1374 1387 2818 820 -2472 -5774
11620 -5774 -8348 -7075 -12006 -17606 -14657 -9873 -6635 -4487 -4809 -9443 -12761 -14202 -16561 -16458 -15277
11605 -15277 -14138 -10131 -7069 -9159 -11051 -5935 3734 2624 1668 1336 4625 6082 2448 -1096 -7851
11590 -7851 -11052 -18822 -18849 -17886 -14416 -14296 -7861 -2219 -8351 -15051 -14433 -7208 -6381 -5484 -5515 1817 3434
11573 3434 1186 -8178 -17161 -9857 -3783 -1426 268 481 -3095 -752 -467 2088 -598 -3247 -4344
11558 -4344 -1430 -5700 -8676 -5519 3792 12002 9683 7219 974 -5521 -2897 -7188 -7858 -5025 -9890
11543i890K756K344L144l706l360J074N535k641n598N63K139k292K410Q08J206
11528e508l524p31L24l647R166M059k044k746k628M097J469j0459k922O914m57
11513h637j048ML303K652K058J442n80k700l593M923m121R66Q02M174L841J172
11497D658k153n009p535j253j25j597M081L238J884m97j007K625O807l092l680
11482b655J146J450k703k147J8K820k007n87N245k037o005k522K149L414L632
11467g89O257J445j978L59q10N1l396M48m255n805n229k213J3678O387K191n27
11451E814q307m561J056l962j5682K451M148J1062N37K448K07l480m281K442J005
11436i103j983j339j947k662M311Q435K719L687r491L57j621L92k370q22R250
$$ plain form
11543 -9890 -7134 -4790 -1646 -5352 -8712 -7638 -2103 -4744 -10342 -9779 -7640 -9932 -7522 -6714 -5508
11528 -5508 -9032 -9763 -9439 -13086 -3920 139 -1905 -4651 -7279 -3182 -1713 -12172 -15094 -8180 -8637
11513 -8637 -9685 -9681 -6378 -3726 -1668 -226 -806 -3506 -7099 -2176 -6297 -5331 -4529 -355 3486 4658
11497 4658 2505 -2504 -10039 -11292 -11417 -13014 -8933 -5695 -3811 -4308 -5315 -2690 4117 1025 -2655
11482 -2655 -1509 -59 -2762 -4909 -4891 -2071 -4078 -4665 580 -1457 -7462 -9984 -7835 -4421 -789
11467 -789 5468 6913 4935 5294 4484 4535 1139 1587 -2668 -8473 -13702 -15915 -2237 4150 6341 5814
11451 5814 -2493 -7054 -5998 -9960 -25642 -23191 -19043 -7981 -7444 -4996 -4789 -8269 -12550 -10108 -9103
11436 -9103 -11086 -12425 -14372 -17034 -12723 -4288 -1569 2118 -7373 -7016 -8637 -8245 -10615 -11437 -2187
11421b187K123m338L809l768l963k457m743j283K757O146J2025L730n011m002
11407a162p191k169K766K722R49l933J914N287l505m680o490P07J745m24M698
11392h766M91O881K912m085n787L930R009J757K350k577l611o516J439O307M694
11377H428k674l843k204L762K100o274k417J810L088L438L93j547m280m944P213
11362B049J942N98Q78m404m163m169K56K446J331J768j083j392k861m733M053
11347g484L791J468J04N194M006k180l885m758Q44J0106o95J858O940N876O927
11332B8112j384r022Q41j917l066q451r820n581p03O429M305J093k419k650J671
11317b562J097l350N234P936p24m904o947k198k179O860K615m526l066q49k673
$$ plain form
11421 -2187 -64 -4402 -593 -4361 -8324 -10781 -15524 -16807 -14050 -7904 4121 7851 2840 -1162
11407 -1162 -8353 -10522 -7756 -5034 -4085 -8018 -6104 -817 -4322 -9002 -15492 -14785 -13040 -13464 -8766
11392 -8766 -8275 -1394 1518 -2567 -8354 -4424 4585 6342 8692 6115 2504 -4012 -2573 3734 8428
11377 8428 5754 1911 -293 3469 5569 -705 -3122 -1312 1776 5214 5607 4060 -220 -5164 2049
11362 2049 3991 4589 5467 1063 -3100 -7269 -7013 -4567 -3236 -1468 -2551 -3943 -6804 -11537 -7484
11347 -7484 -3693 -2225 -2121 3073 7079 4899 1014 -3744 -2900 7206 6511 8369 15309 21185 28112
11332 28112 26728 17706 18547 16630 13564 5113 -4707 -10288 -10991 -4562 -257 836 -1583 -4233 -2562
11317 -2562 -1465 -4815 419 8355 7631 2727 -4220 -6418 -8597 -1737 878 -3648 -6714 -7563 -10236
11302a0236p114J052N170j0376M251Q357J571M214J905P22K711L855N498K950
11288A4530P492L269L660m802o825m115m932k920j826O258M584o660p121K107
11274B699N489M046k737n504o437Q62J694r83l945k909l240L287K318O56O357
11259A653L619n111o905L818J948p78J964k537j681o90O583P73N404N497K414
11244A5971j227o312k458N65o58K566J229k643k490M960J107o303j2592l840L916
11229h209L604N927J464k471o201k346k767M568n72j877J427P433N46j994j245
11214b713j363k459J937k819K076M083k119l500J210P18k412O966J1579j832o563
11199B789m149r189l975K957l4K581l404k782K715N78j482j524O722L330K593
$$ plain form
11302 -10236 -17350 -16298 -11128 -21504 -17253 -8896 -7325 -3111 -1206 -484 2227 6082 11580 14530
11288 14530 22022 25291 28951 24149 17324 13209 8277 5357 3531 9789 14373 7713 592 2699
11274 2699 8188 12234 9497 3993 -2444 -1582 112 -871 -4816 -7725 -10965 -7678 -5360 -4704 1653
11259 1653 5272 161 -6744 -2926 -978 -1756 208 -2329 -4010 -4700 1883 2656 8060 13557 15971
11244 15971 14744 8432 5974 6539 5881 8447 9676 7033 4543 9503 10610 4307 -8285 -12125 -8209
11229 -8209 -4605 1322 2786 315 -5886 -8232 -10999 -6431 -7003 -8880 -7453 -20 526 -1468 -2713
11214 -2713 -4076 -6535 -4598 -7417 -5341 -1258 -3377 -6877 -5667 -4949 -7361 -395 11184 9352 2789
11199 2789 -1360 -10549 -14524 -11567 -11601 -9020 -12424 -15206 -12491 -11913 -13395 -14919 -8197 -4867 -2274
11184b274L047l940q76N905n60k028J044J817p153q199N586N860K865K436j111
11169B419p240j115Q810N331p159j261L486N492m52o396O56j930L820p76m811
11154a126O640N79J966l932j188k002R89j723J0j730J757L18M598m50k646j921
11138A39O91r08l125p304k95P062l197j532J841j961L490O833r99l382j632J217
11122c062k491J0738P24K86R43N41o008N003M046j542n544L007Pj617O057j620
11106I468l655k183j98J0602L780p415m894l096k339O568o557l781M697L997j963
11091C031k970P449Q932J709n525p623j503q33N462R013J775j466O96J977n408
11076A4716l427K399J335K351M48o966j304Q377J840K087O443j757o567n826K60
$$ plain form
11184 -2274 773 -3167 -4043 1862 1302 -726 318 2135 -5018 -13217 -7631 -1771 1094 3530 2419
11169 2419 -4821 -5936 2874 8205 1046 -215 3271 8763 8311 1915 2571 641 4461 3685 -1126
11154 -1126 5514 6093 8059 4127 2939 937 1926 203 213 -1517 240 558 5156 4706 2060 139
11138 139 830 -78 -3203 -10507 -10802 -3740 -6937 -8469 -6628 -8589 -5099 1734 735 -2647 -4279 -3062
11122 -3062 -5553 5185 5909 6195 7138 7679 1671 6674 10720 9178 3634 6641 6648 5031 11088 9468
11106 9468 5813 3630 3432 14034 17814 10399 5505 2409 70 6638 81 -3700 997 4994 3031
11091 3031 61 7510 16442 18151 12626 5003 3500 2667 8129 17142 18917 17451 18147 20124 14716
11076 14716 11289 13688 15023 17374 17822 10856 9552 17929 19769 21856 28299 26542 19975 14149 14409
11061A4409p67M769k582r017J645N367k458J196j007m627k609k972J241N730N515
11046A3833M764M478m544n428K077k90j257l199l558l14j082M871K768j397j680
11031A0042l990l763k680O306k356N065J620J194J361j1666r298K424O614J430
11017B303o772N50M334K448J388K045m314L050k726m685J991N351J399p338l286
11002d262O130P56n987k468K561K213k34n48M943L903k29o416j511l043o536o680
10986a7408K09J153L441Q328J098j996J098J636N531j992L04L193K886J322m980
10971C823m150l167M540J562j718j767M49K597J770N43k531k029k790M335L676
10956E143K714l977j350K066P473L131n455o308m791m691M110J0505R88m285o445
$$ plain form
11061 14409 13642 18411 15829 6812 8457 13824 11366 12562 11555 6928 4319 1347 2588 8318 13833
11046 13833 18597 23075 18531 13103 15180 14890 13633 10434 6876 6562 5480 10351 13119 11722 10042
11031 10042 6052 2289 -391 5915 3559 8624 10244 11438 12799 1133 -8165 -5741 873 2303
11017 2303 -4469 -3919 415 2863 4251 6296 1982 5032 2306 -2379 -388 4963 6362 -976 -4262
11002 -4262 1868 2624 -3363 -5831 -3270 -1057 -1291 -1839 3104 7007 6778 362 -1149 -4192 -10728 -17408
10986 -17408 -17199 -16046 -12605 -4277 -3179 -5175 -4077 -2441 3090 1098 1402 4595 7481 8803 3823
10971 3823 -327 -3494 1046 2608 890 -877 -428 2169 3939 4482 1951 -78 -2868 1467 5143
10956 5143 7857 3880 2530 4596 12069 15200 9745 3437 -1354 -6045 -1935 8570 9558 5273 -1172
10941a172l445J588L219o386n88j326j752L023O759n165k504M603LJ449J615L209
10925C130L495k013J054o164n580o347k470l04J0818M598l052l050N390N925O84
10910F114l127K019L79p181N644K638p961J350N789q12n103q23M71L699l013K876
10894B959K109j393P27q16n068J521J269n293k096J498J523j24j7K15j0020l250
10878a6256J334J430O287l896p94Q441J609l410l79L355k160J866P08N116R07
10863D158p772l766l839l913j322j652M329N501j739k258l780N736J0565N206
10849E454m747m051j63M600n225o940J101j643N271O794L097M249k889p757k553
10834e402l972P498O461L12k053l38j723J331q5J367L745M117n591n14j445j137
$$ plain form
10941 -1172 -4617 -3029 190 -6196 -6784 -8110 -9862 -6839 -80 -5245 -7749 -3146 -3143 -1694 -79 3130
10925 3130 6625 4612 5666 -498 -6078 -12425 -14895 -15199 -4381 217 -2835 -5885 -495 5430 6114
10910 6114 2987 5006 5385 -1796 3848 6486 -1475 -125 5664 4852 -251 -1074 -603 3096 83 2959
10894 2959 5068 3675 4402 3586 -1482 39 1308 -3985 -6081 -4583 -3060 -3184 -3201 -2986 -13006 -16256
10878 -16256 -14922 -13492 -7205 -11101 -11895 -3454 -1845 -5255 -5634 -2279 -4439 -2573 -1865 3251 4158
10863 4158 -3614 -7380 -11219 -15132 -16454 -18106 -13777 -8276 -10015 -12273 -16053 -10317 248 5454
10849 5454 707 -3344 -3507 1093 -4132 -11072 -9971 -11614 -6343 451 3548 7797 4908 -2849 -5402
10834 -5402 -9374 -1876 4585 4897 2844 2506 783 2114 2029 3396 7141 11258 5667 5153 3708 2571
10818B571q849o298R29M023M822m008j870J807K514J312J805k275m639k245P084
10803c317L308K4k214K521M034p619l671j234L562K097N886L101n804l394L967
10788A247J3184l709p087j707K710J126R164L104j2658j0271m431R320P385M79
10774G856j0371k633Q075O062J334j924p389n144K854n39k634l461j579k048L565
10759g976O96p393n109O233Q793Q05K510O20O535l919n668K258M352k124j985
10744a372q02o555N538j317n088K670N303m742m00M390j444n102n965K097l47
10729a3136m89l845J661N05j816M728J1769O215o177n414m227K339P4k832L406
10714g239k546l220P911R678J615j055k020k516j017p679Q62m32m538J540j032
$$ plain form
10818 2571 -6278 -12576 -11647 -7624 -2802 -6810 -8680 -6873 -4359 -3047 -1242 -3517 -8156 -10401 -3317
10803 -3317 -9 15 -2199 322 4356 -3263 -6934 -8168 -4606 -2509 3377 6478 674 -2720 1247
10788 1247 14431 10722 3635 1928 4638 5764 14928 18032 5374 -4897 -9328 -8 7377 7856
10774 7856 -2515 -5148 2927 8989 10323 8399 1010 -4134 -1280 -1819 -4453 -7914 -9493 -11541 -7976
10759 -7976 -7280 -14673 -19782 -13549 -4756 -3951 -1441 -821 5714 1795 -3873 -1615 2737 613 -1372
10744 -1372 -2174 -8729 -3191 -4508 -9596 -6926 -1623 -6365 -6765 -2375 -3819 -8921 -14886 -12789 -13136
10729 -13136 -13625 -17470 -15809 -15304 -17120 -12392 -623 5592 -585 -5999 -10226 -7887 -7813 -10645 -7239
10714 -7239 -9785 -13005 -5094 4584 6199 5144 3124 608 -409 -8088 -7226 -7658 -12196 -10656 -11688
10699a1688M872N581J232Q78j213k347l706n13L845n07K273j057m094o33J108
10684e969j820k663j47K006m030l638m762j062J724M437M49q33M983N554O881
10669A110K21p073j927l237J382O989M254M724O99o505l611j216O829N077l802
10654C914n638k926n517o969K995N205M377N995J878m546o95m386J260L965N175
10639D087j727q178K290K890L360j871o377j124L975J852m358j0726k189M666
10625a3430l65k239Q34Q760J705J887r9J805O407l468K808K238p249j745n47j128
10609c826j50j31j896l02J702K447K569J482L962L65l427N08K125o22L01L630
10593H737J088n686m213J054l95k594l089p0p650j918J830M733M570N980J936
$$ plain form
10699 -11688 -6816 -1235 -3 875 -338 -2685 -6391 -6904 -3059 -3566 -1293 -2350 -6444 -7077 -5969
10684 -5969 -7789 -10452 -10599 -8593 -12623 -16261 -21023 -22085 -20361 -15924 -15475 -16308 -11325 -5771 1110
10669 1110 1331 -5742 -7669 -10906 -9524 -2535 1719 6443 7142 637 -2974 -4190 2639 7716 3914
10654 3914 -1724 -4650 -10167 -17136 -14141 -8936 -4559 1436 3314 -1232 -1927 -6313 -5053 -1088 4087
10639 4087 2360 -5818 -3528 -638 2722 851 -5526 -6650 -2675 -823 -5181 -15907 -18096 -13430
10625 -13430 -13795 -16034 -15200 -6440 -4735 -2848 -2947 -1142 5265 1797 4605 6843 -406 -2151 -2698 -3826
10609 -3826 -3976 -4107 -6003 -6305 -4603 -2156 413 1895 5857 6222 2795 3303 5428 4806 5107 8737
10593 8737 9825 4139 -74 980 585 -2009 -5098 -5168 -12818 -14736 -12906 -8173 -3603 2377 4313
10578D313j245k538K134m822J397J157K717K572j0625r44L760L018N7j535q892
10563i476N281K344O118N1K367m328m979k306j823M676m778K503R708O787M788
10548A6933M584o864k004L275n638l899k183j423n025p19j93l529j915K585M231
10533a784p216N62O573N801j768q365m167N205k48j359K010M296K763l759k023
10518c479j0343J066M524Q354Q868l803q906L997l29K945r377n556R301J853k447
10503c332l899M493Q475O920r060n619O04K945J970n799n824j886n633J854O481
10488g310N22Q076L192k212j841R60R056N745L475l163P85j891o934p227L940
10473E173K774k580k411j377K94n737o34P99J329L094j152K912k138j070L141
$$ plain form
10578 4313 3068 530 2664 -2158 -761 396 3113 5685 -4940 -5884 -2124 894 951 -584 -9476
10563 -9476 -4195 -1851 4267 4318 6685 2357 -2622 -4928 -6751 -2075 -6853 -4350 5358 12145 16933
10548 16933 21517 14653 12649 15924 10286 6387 4204 2781 -2244 -2963 -3156 -6685 -8600 -6015 -1784
10533 -1784 -9000 -8438 -1865 3936 2168 -6197 -10364 -5159 -5407 -6766 -4756 -460 2303 -1456 -3479
10518 -3479 -13822 -12756 -8232 122 8990 5187 -3719 278 -51 2894 -6483 -12039 -2738 -885 -3332
10503 -3332 -7231 -2738 5737 12657 3597 -2022 -1418 1527 3497 -2302 -8126 -10012 -15645 -13791 -7310
10488 -7310 -6788 1288 4480 2268 427 1387 10443 16188 19663 16500 17285 15394 8460 1233 5173
10473 5173 7947 5367 2956 1579 1873 -3864 -4498 -3699 -2370 724 -428 2484 346 -724 2417
10458B417O30l361l704k709M713N131l673j733K069K834M00l566m514L14o33M25
10442d960M060M148P19J314q81l246P184L960J691L139O819J3775o423j1806n66
10427A8927o958j603k187J455Q200m159l449l76J700R28j695K08j1447o006j504
10412g966k377J935P70M53L847M838N686O02j0623l720K407j672N119P060o028
10397C31j1249n895L633J1109M379N43k295m678N654M639R48o56N59k348K815
10382G489j866k012k652J461k109k751o626M34N092K208q7N929Q535J55n051n027
10366C122o556k825K853J230l21L332M050l572K536J751M746O983o032j2899n874
10351g476M626M745m873J013R68M050k735l294K149K294n015N877N89l317l330
$$ plain form
10458 2417 3047 -314 -4018 -6727 -2014 3117 -556 -2289 -220 2614 3014 -552 -5066 -4752 -5385 -4960
10442 -4960 -900 3248 3967 5281 4400 1154 8338 12298 13989 17128 23947 37722 31299 19493 18927
10427 18927 11969 10366 8179 9634 17834 13675 10226 9850 11550 12478 10783 10991 -456 -6462 -7966
10412 -7966 -10343 -8408 -7638 -7185 -3338 1500 7186 7788 -2835 -6555 -4148 -5820 -701 6359 331
10397 331 -10918 -16813 -13180 -2071 2308 2851 556 -4122 1532 6171 7119 6463 7022 4674 7489
10382 7489 5623 3611 959 2420 311 -2440 -9066 -8632 -3540 -1332 -1419 4510 13045 13200 8149 3122
10366 3122 -3434 -6259 -3406 -2176 -2497 835 4885 1313 3849 5600 10346 17329 11297 -1602 -7476
10351 -7476 -2850 1895 -2978 -1965 -997 3053 318 -2976 -827 1467 -3548 2329 2918 -399 -3729
10336c729M141N99L934J936j554m584J448R56k246p077n898N306J144J154L119
10321a351L774j640m615r26o224m257L820M048O40k479P489J441J20k270k52L708
10305A026O856j112n123q254k903M656O477l496k416J829O98j808m845J418K728
10290d269J207n125k555J532Q019L5k089l21J676m338k672k965M641N942K596
10275A314n912k418K499M515K582j392r04n594j011k206J439P516M000l014l342
10260a928k575j022K994L586J189L582J817j484k609j1363o498J0380j775n650
10246a1356K658J0650P266l578p554m230L919N206j541k493q380K468L908l789
10232f846k459L832O54K710J606K026q6n617m871M225K052P65K361m096r906K197
$$ plain form
10336 -3729 412 1011 4945 6881 5327 743 2191 3147 901 -6176 -12074 -6768 -5624 -4470 -1351
10321 -1351 2423 783 -3832 -4758 -10982 -15239 -11419 -7371 -6731 -9210 -1721 -280 -160 -2430 -2682 1026
10305 1026 7882 6770 1647 -6607 -9510 -4854 1623 -1873 -4289 -2460 -1762 -3570 -8415 -6997 -4269
10290 -4269 -3062 -8187 -10742 -9210 -1191 -1156 -3245 -3566 -1890 -6228 -8900 -11865 -7224 -1282 1314
10275 1314 -4598 -7016 -4517 -2 2580 1188 284 -5310 -6321 -8527 -7088 428 4428 1414 -1928
10260 -1928 -4503 -5525 -2531 1055 2244 5826 7643 6159 3550 -7813 -14311 -3931 -5706 -11356
10246 -11356 -8698 1952 9218 5640 -1914 -6144 -2225 2981 1440 -1053 -9433 -6965 -3057 -6846
10232 -6846 -9305 -5473 -4819 -2109 -503 1523 1437 -4180 -9051 -4826 -2774 -2009 352 -3744 -13650 -11453
10216a1453P589O999Q045q358k964o77k984o45M583K399J04j495K43j693N199
10201D892J486J967Q765m885k24K407l380q844o603O182J412n589l643K004r613
10186a3666L28O207J264J166P51M722J458o932K289K748M383L466m806o72M98
10171C204M04n914l822J49J684o982k436N043N774L196K945q25M568j229q169
10156b410j1318K611N362m261j361n94o540J727o76K272N343L035M71J943M502
10141A06L794M549m861m310j708K326k143p874J874J04j89l955L385L842L469
10126a591m564K862j08n087M239L223J335L261m782K614j401j966J977j455M57
10111i86L648l851l669N982M208K742p495l08P916J808o22k447J422J746o957
$$ plain form
10216 -11453 -3864 3135 11180 2822 -142 -819 -3803 -4448 135 2534 2638 1143 1386 -307 4892
10201 4892 6378 8345 17110 12225 12001 14408 11028 2184 -4419 1763 3175 -2414 -6057 -4053 -13666
10186 -13666 -13338 -7131 -5867 -4701 -3950 772 2230 -4702 -2413 335 4718 8184 3378 2706 3204
10171 3204 3608 -2306 -6128 -5979 -4295 -11277 -13713 -8670 -2896 300 3245 2420 6988 5759 -2410
10156 -2410 -13728 -11117 -5755 -10016 -11377 -11971 -18511 -16784 -17460 -15188 -9845 -6810 -6339 -4396 106
10141 106 3900 8449 3588 -722 -2430 -104 -2247 -10121 -8247 -8143 -8332 -12287 -8902 -5060 -1591
10126 -1591 -6155 -3293 -3401 -8488 -4249 -1026 309 3570 -1212 1402 1 -1965 12 -1443 -986
10111 -986 2662 -1189 -4858 1124 5332 8074 579 271 8187 9995 9373 6926 8348 10094 3137
10096C137j38k654p67m94J876k175m648k204k327k832J619J1379O757k85m115
10081B129l285K675P199n969l381L025J569k170m887K062J078k137m525N409k324
10066c532l925J367J507K152r95M011p46l329q667J744N086P735p355K208M243
10051A504l112O982l123N321j918K774l156l244J103m604k350L844l412l275K851
10036c815P504P402p22l984j636K150o502j0897k497n772M025N528K697L114P354
10021C949m126m681K143l401j467J93j261j0680L418K789j358M94L621N05l315
10006a3177Q39k455N713P966M432J428J812j04l88m513K389O05p275m813J107
9991f434P638K323k845j966k121k290K691j901j514o08L111K888Q16p274l362
$$ plain form
10096 3137 2999 345 -422 -916 960 -1215 -5863 -8067 -10394 -13226 -11607 -228 6529 6244 2129
10081 2129 -1156 1519 8718 2749 -632 2393 3962 1792 -3095 -1033 45 -2092 -6617 -1208 -3532
10066 -3532 -7457 -6090 -4583 -2431 -3426 585 -161 -3490 -12157 -10413 -5327 2408 -4947 -2739 1504
10051 1504 -1608 5374 2251 7572 5654 8428 5272 2028 3131 -1473 -3823 21 -3391 -6666 -3815
10036 -3815 3689 11091 10369 6385 4749 6899 397 -10500 -12997 -18769 -14744 -9216 -6519 -3405 3949
10021 3949 -177 -4858 -2715 -6116 -7583 -7390 -8651 -19331 -15913 -13124 -14482 -13988 -10367 -9862 -13177
10006 -13177 -12338 -14793 -9080 -1114 3318 4746 6558 6454 6066 1553 3942 4547 -2728 -7541 -6434
9991 -6434 1204 3527 682 -1284 -3405 -5695 -3004 -4905 -6419 -7027 -3916 -1028 -212 -7486 -10848
9976a0848k968k212k595J561r54M555J1416M161n13o742k241k036M709N69O06
9961c532m83p974l216K428N480O362j495J174P152K048J148o05o286n221L50L558
9945H88o989p065K942N992M761m32o698O220O149l59n476Q19R303r65q918j032
9929h60K252l865p841J782J852r02J0626o25o598k887P94L008m905j467k507M280
9913g863M408L473j016p058j897l93L87K471M023K728l947o742n994l082L389
9898a7113J894Q549J913J89L432J229n171k365K33l001j176k027O282J785J53
9883e194N56k179m6N578p58K392L620N922j058j093n462l434k75J648j256L880
9867B841m713J444L595l155J935M958n09J623J613l671l456K49R751j23j144o453
$$ plain form
9976 -10848 -13816 -16028 -18623 -17062 -18016 -13461 -2045 2116 1603 -5139 -7380 -9416 -4707 -4138 -3532
9961 -3532 -4015 -11989 -15205 -12777 -7297 -935 -2430 -1256 5896 7944 9092 8487 2201 -3020 -2670 888
9945 888 -6101 -13166 -10224 -4232 529 97 -6601 -381 5768 5409 -67 752 10055 9090 172 -860
9929 -860 1392 -2473 -10314 -8532 -6680 -7582 3044 2419 -4179 -7066 -6272 -3264 -8169 -9636 -12143 -7863
9913 -7863 -3455 18 -998 -8056 -9953 -10346 -9959 -7488 -3465 -737 -4684 -11426 -17420 -20502 -17113
9898 -17113 -15219 -6670 -4757 -4568 -1136 93 -5078 -7443 -7210 -10211 -11387 -13414 -7132 -5347 -5194
9883 -5194 -4638 -6817 -6863 -1285 -2043 349 3969 9891 8833 7740 2278 -1156 -1431 217 -1039 2841
9867 2841 -1872 -428 3167 12 1947 6905 6396 8019 9632 5961 2505 2754 12505 12382 11238 4785
9851D785l60k038k366k021m202L47j533n771K018K774O089O69p96l89j321J989
9835b126M803P539J45o621k073j462m655K184O34q884j191L127L648O44J038k69
9819c519J237k691R2J950l62J542P4J69k73K634M298n92p599n757j000K09k134
9802a1722O95J071P091P475N609k648n256j315l793k3M69k952M28O233O584j365
9786F581o62m14j386L332m711N859m364q821j925j732j1442N866J0768L388J13
9771D50L155m756q31M010m331o207j276M044K135N424J470K076n622q659l131
9756a2049J347Q67K653N478K840m965n303L6m631m660J941M747L042O81j474l14
9740i764k69l086J886M245J33n748k625o49K429J273J761M594M251M240O67m506
$$ plain form
9851 4785 4425 2387 21 -2000 -6202 -5855 -7388 -13159 -11141 -8367 -2278 -1609 -2405 -2794 -4115 -2126
9835 -2126 2677 10216 10361 3740 1667 205 -4450 -2266 -1632 -10516 -11707 -8580 -4932 -4288 -3250 -3519
9819 -3519 -2282 -4973 -4881 -2931 -3293 -1751 -1677 -1508 -1781 853 5151 4559 -3040 -8797 -9797 -9588 -11722
9802 -11722 -11027 -9956 -2865 4610 10219 7571 2315 1000 -2793 -2816 -2347 -5299 -4871 1362 7946 6581
9786 6581 5919 5505 4119 7451 2740 8599 4235 -4586 -6511 -8243 -19685 -13819 -3051 337 450
9771 450 3605 -1151 -1982 2028 -2303 -8510 -9786 -5742 -3607 1817 3287 5363 -259 -8918 -12049
9756 -12049 -10702 -9835 -7182 -1704 1136 -3829 -9132 -9096 -13727 -18387 -16446 -11699 -8657 -7976 -9450 -9764
9740 -9764 -10033 -13119 -11233 -6988 -6855 -12603 -15228 -15877 -13448 -12175 -10414 -5820 -1569 2671 3338 -1168
9724a168r528n853P80O278J452n522M578L096n862M914l709r66L745O253M275
9709B763L589K520j5369k784L905M489J536M046O349P241p32r099j0281l70M569
9694B372q00k964O698m635m412j900m280N663o08m796L711P77L478K123k080m745
9678f398o191M829m313m119M243J654M309J587M966L662n685k437m916M947N973
9663B111N091k080o427l60l688q281O235P262l837j946J788O587m859o703O04
9648h503M83q074J1249N256M077k557j416M63K728q99j277L17j509n213M795N94
9632E14j517l386N25O261L658q54p386k845j064K173M574J030P308Q788J271q533
9616A0517j1186l764M438J352J252m510J172P365k145k445n428m714l810R100
$$ plain form
9724 -1168 -10696 -16549 -15769 -9491 -8039 -13561 -8983 -5887 -11749 -6835 -10544 -11510 -7765 -1512 2763
9709 2763 6352 8872 -6497 -9281 -5376 -887 649 4695 11044 18285 17553 8454 -1827 -2197 2372
9694 2372 1572 -1392 5306 671 -3741 -5641 -9921 -4258 -4866 -9662 -5951 -5174 -1696 427 -1653 -6398
9678 -6398 -12589 -7760 -12073 -16192 -11949 -10295 -5986 -4399 567 4229 -1456 -3893 -8809 -3862 2111
9663 2111 7202 5122 -1305 -1665 -5353 -13634 -7399 -137 -3974 -5920 -4132 2455 -2404 -9107 -8503
9648 -8503 -8020 -16094 -4845 411 4488 1931 515 978 3706 2807 1530 1847 338 -4875 -80 514
9632 514 -1003 -4389 -3864 2397 6055 5201 -2185 -5030 -6094 -3921 653 1683 8991 17779 19050 10517
9616 10517 -669 -4433 5 1357 2609 -1901 -729 6636 4491 2046 -3382 -8096 -11906 -2806
9602b806N392N09K853k665m698J67K139L467J2n568M502M402o877m149j079k291
9586f690m163j412O89L666L844m203R290O80m762J094R40m537K759K83QN736M213
9569G435m023m682q720q420P760M966K285L410K0o556n745P34r86J633N775K495
9553b619p391r203N796P111K767L026N82K956J606o342m744O159K678J054l843
9538d07Q479L000k685J790k482L042O881k856m837J159L68n618p80j850k748k520
9522b064l356j57l345l171j463N083O595k611L52k104l949M137O755j914n769
9507f981L364L591l510k791k43K870M933J419m81K725j24j857l309m863n945m658
$$ plain form
9602 -2806 2586 3095 5948 3283 -1415 -1248 891 4358 4370 -1198 3304 7706 829 -3320 -4399 -6690
9586 -6690 -10853 -12265 -11576 -7910 -4066 -8269 1021 1701 -3061 -1967 -1027 -5564 -2805 -2522 -2514 3222 7435
9569 7435 3412 -1270 -9990 -18410 -10650 -5684 -3399 11 31 -6525 -12270 -11536 -12522 -10889 -5114 -2619
9553 -2619 -10010 -19213 -13417 -6306 -3539 -513 69 3025 4631 -1711 -6455 -296 2382 3436 -407
9538 -407 8072 11072 8387 10177 7695 10737 17618 14762 9925 11084 11452 5834 5054 3204 456 -2064
9522 -2064 -5420 -5577 -8922 -12093 -13556 -8473 -1878 -4489 -4137 -6241 -10190 -6053 702 -1212 -6981
9507 -6981 -3617 -26 -3536 -6327 -6570 -3700 1233 2652 2171 4896 4772 2915 -394 -5257 -11202 -15860
$$ [...]
##END NTUPLES=NMR SPECTRUM
##END=
