##TITLE=Analysis number 317717
Compound Code sb 00692
Project Code adrs
Chemist Name stores
##JCAMPDX= 6.0         $$ Bruker NMR JCAMP-DX V2.0
##DATA TYPE= NMR SPECTRUM
##DATA CLASS= NTUPLES
##ORIGIN= Bruker BioSpin GmbH
##OWNER= nmr
$$ XWIN-NMR		Version 3.5
$$ Wed Mar  1 11:32:13 2006 GMT Standard Time (UT+0h)  MAYBRIDGE\nmr@NMR_250MHZ
##.OBSERVE FREQUENCY= 250.131544655141
##.OBSERVE NUCLEUS= ^1H
##.ACQUISITION MODE= SIMULTANEOUS (DQD)
##.ACQUISITION SCHEME= undefined
##.AVERAGES= 16
##.DIGITISER RES= 18
##SPECTROMETER/DATA SYSTEM= dpx250
##.PULSE SEQUENCE= zg30
##.SOLVENT NAME= DMSO
##.SHIFT REFERENCE= (INTERNAL, DMSO, 0, 16.522)
##AUDIT TRAIL= $$ (NUMBER, WHEN, WHO, WHERE, WHAT)
$$ ##TITLE= Audit trail, XWIN-NMR		Version 3.5
$$ ##JCAMPDX= 5.01
$$ ##ORIGIN= Bruker BioSpin GmbH
$$ ##OWNER= nmr
$$ C:\u/data/dgb/nmr/ADRS/17190/pdata/1/auditp.txt
$$ ##AUDIT TRAIL=  $$ (NUMBER, WHEN, WHO, WHERE, WHAT)
(   1,<2006-03-01 11:31:50.44 +000>,<MAYBRIDGE\nmr>,<NMR_250MHZ>,
      <created by zg, POWCHK disabled, PULCHK disabled
       configuration hash MD5:
       84 BC 41 DB A1 6E 1D 46 DA 25 12 A5 C1 ED C5 3A
       data hash MD5: 64K
       C2 F0 30 84 23 17 0B F0 A4 FB 28 17 62 CF 27 67>)
(   2,<2006-03-01 11:32:03.14 +000>,<MAYBRIDGE\nmr>,<NMR_250MHZ>,
      <Start of raw data processing
       ef LB = 0.3 FT_mod = 6 PKNL = 1 SI = 32K 
       data hash MD5: 32K
       D2 49 63 59 E6 F1 BB C0 DD 24 0D DA DC 6C 9A 7D>)
(   3,<2006-03-01 11:32:05.11 +000>,<MAYBRIDGE\nmr>,<NMR_250MHZ>,
      <apk 
       data hash MD5: 32K
       CB 39 7A 76 CA B6 B3 D7 0E D6 60 B1 DC A9 C2 AD>)
(   4,<2006-03-01 11:32:05.97 +000>,<MAYBRIDGE\nmr>,<NMR_250MHZ>,
      <abs ABSG = 5 
       data hash MD5: 32K
       D4 40 75 BA 45 0D F0 97 80 35 B2 05 E7 E9 89 4E>)
$$ ##END=
$$ 
$$ hash MD5
$$ A2 12 37 38 6D CE A2 7F 45 39 F4 86 4A 34 DE 0A
##$RELAX= 
##$RELAX= 
##$RELAX= 
##$RELAX= 
##$RELAX= 
##$RELAX= 
##$RELAX= 
$$ Bruker specific parameters
$$ --------------------------
##$DU= <C:\u>
##$EXPNO= 17190
##$NAME= <ADRS>
##$PROCNO= 1
##$TYPE= <nmr>
##$USER= <dgb>
##$AMP= (0..31)
100 100 100 100 100 100 100 100 100 100 100 100 100 100 100 100 100 100 
100 100 100 100 100 100 100 100 100 100 100 100 100 100 
##$AQSEQ= 0
##$AQ_mod= 3
##$AUNM= <au_zg>
##$AUTOPOS= <22 >
##$BF1= 250.13
##$BF2= 250.13
##$BF3= 250.13
##$BF4= 250.13
##$BF5= 500.13
##$BF6= 500.13
##$BF7= 500.13
##$BF8= 500.13
##$BYTORDA= 1
##$CFDGTYP= 0
##$CFRGTYP= 5
##$CHEMSTR= <none>
##$CNST= (0..31)
1 1 145 1 1 1 1 1 1 1 1 1 1 1 1 1 1 1 1 1 1 1 1 1 1 1 1 1 1 1 1 1 
##$CPDPRG= <>
##$CPDPRG1= <>
##$CPDPRG2= <>
##$CPDPRG3= <>
##$CPDPRG4= <mlev>
##$CPDPRG5= <mlev>
##$CPDPRG6= <mlev>
##$CPDPRG7= <mlev>
##$CPDPRG8= <mlev>
##$CPDPRGB= <>
##$CPDPRGT= <>
##$D= (0..31)
0 1 0 0 0 0 0 0 0 0.06 0 0 0 0 0 0 0.0002 0 0 0 0 0 0 0 0 0 0 0 0 0 0 
0 
##$DATE= 1141212709
##$DBL= (0..7)
120 120 120 120 120 120 120 120 
##$DBP= (0..7)
150 150 150 150 150 150 150 150 
##$DBP07= 0
##$DBPNAM0= <>
##$DBPNAM1= <>
##$DBPNAM2= <>
$$ [...]
##$SUBNAM7= <"">
##$SUBNAM8= <"">
##$SUBNAM9= <"">
##$SW= 20.6930455092707
##$SWIBOX= (0..15)
0 0 3 0 0 0 0 0 0 0 0 0 0 0 0 0 
##$SW_h= 5175.983436853
##$TD= 65536
##$TD0= 1
##$TE= 293.16
##$TE2= 300
##$TE3= 300
##$TEG= 300
##$TL= (0..7)
0 120 120 120 120 120 120 120 
##$TP= (0..7)
150 150 150 150 150 150 150 150 
##$TP07= 0
##$TPNAME0= <>
##$TPNAME1= <>
##$TPNAME2= <>
##$TPNAME3= <>
##$TPNAME4= <>
##$TPNAME5= <>
##$TPNAME6= <>
##$TPNAME7= <>
##$TPOAL= (0..7)
0.5 0.5 0.5 0.5 0.5 0.5 0.5 0.5 
##$TPOFFS= (0..7)
0 0 0 0 0 0 0 0 
##$TUNHIN= 0
##$TUNHOUT= 0
##$TUNXOUT= 0
##$USERA1= <user>
##$USERA2= <user>
##$USERA3= <user>
##$USERA4= <user>
##$USERA5= <user>
##$V9= 5
##$VALIST= <valist>
##$VCLIST= <CCCCCCCCCCCCCCC>
##$VD= 0
##$VDLIST= <DDDDDDDDDDDDDDD>
##$VPLIST= <PPPPPPPPPPPPPPP>
##$VTLIST= <TTTTTTTTTTTTTTT>
##$WBST= 1024
##$WBSW= 4
##$XGAIN= (0..3)
0 0 0 0 
##$XL= 0
##$YL= 0
##$YMAX_a= 377699
##$YMIN_a= -582513
##$ZGOPTNS= <>
##$ZL1= 120
##$ZL2= 120
##$ZL3= 120
##$ZL4= 120
##$ABSF1= 16.522
##$ABSF2= -4.171173
##$ABSG= 5
##$ABSL= 3
##$ALPHA= 0
##$AQORDER= 0
##$ASSFAC= 0
##$ASSFACI= 0
##$ASSFACX= 0
##$ASSWID= 0
##$AUNMP= <proc_1d>
##$AZFE= 0.1
##$AZFW= 0.1
##$BCFW= 0
##$BC_mod= 0
##$BYTORDP= 0
##$COROFFS= 0
##$CY= 12.5
##$DATMOD= 1
##$DC= 0
##$DFILT= <>
##$DTYPP= 0
##$F1P= 14.0000005364418
##$F2P= -0.99999901652339
##$FCOR= 0.5
##$FTSIZE= 32768
##$FT_mod= 6
##$GAMMA= 0
##$GB= 0
##$INTBC= 1
##$INTSCL= 1
##$ISEN= 128
##$LB= 0.3
##$LEV0= 0
##$LPBIN= 0
##$MAXI= 10000
##$MC2= 0
##$MEAN= 0
##$ME_mod= 0
##$MI= 0
##$NCOEF= 0
##$NC_proc= -3
##$NLEV= 6
##$NOISF1= 0
##$NOISF2= 0
##$NSP= 0
##$NTH_PI= 0
##$NZP= 0
##$OFFSET= 16.522
##$PC= 1
##$PHC0= -118.9881
##$PHC1= -0.1432699
##$PH_mod= 1
##$PKNL= yes
##$PPARMOD= 0
##$PSCAL= 4
##$PSIGN= 0
##$REVERSE= no
##$SF= 250.13
##$SI= 32768
##$SIGF1= 0
##$SIGF2= 0
##$SINO= 400
##$SIOLD= 32768
##$SREGLST= <1H.DMSO>
##$SSB= 0
##$STSI= 32768
##$STSR= 0
##$SW_p= 5175.98343685301
##$SYMM= 0
##$S_DEV= 0
##$TDeff= 65536
##$TDoff= 0
##$TI= <Analysis number 999999
Compound Code 99
Book Reference 9
Project Code 9>
##$TILT= no
##$TM1= 0
##$TM2= 0
##$TOPLEV= 0
##$USERP1= <user>
##$USERP2= <user>
##$USERP3= <user>
##$USERP4= <user>
##$USERP5= <user>
##$WDW= 1
##$XDIM= 32768
##$YMAX_p= 426533963
##$YMIN_p= -145333
$$ End of Bruker specific parameters
$$ ---------------------------------
##NTUPLES= NMR SPECTRUM
##VAR_NAME=  FREQUENCY,     SPECTRUM/REAL,   SPECTRUM/IMAG
##SYMBOL=    X,             R,               I
##VAR_TYPE=  INDEPENDENT,   DEPENDENT,       DEPENDENT
##VAR_FORM=  AFFN,          ASDF,            ASDF
##VAR_DIM=   32768,         32768,           32768
##UNITS=     HZ,            ARBITRARY UNITS, ARBITRARY UNITS
##FACTOR=    0.157963299565203, 1,           1
##FIRST=     4132.6476996994, 0,             0
##LAST=      -1043.33573715361, 0,           0
##MIN=       -1043.33573715361, -145333,     0
##MAX=       4132.6476996994, 426533963,     0
$$ Real data points
##PAGE= N=1
##DATA TABLE= (X++(R..R)), XYDATA
$$ [...]
$$ plain form
18244 185761 173301 149063 123480 103816 111112 135225 164172 184719 174339 158658 149785 154383
18232 154383 142094 110266 126330 118139 131747 151627 141272 145988 126909 118270 125827 128153
18220 128153 120955 109852 101307 102064 102096 80912 95561 109285 100111 88834 103685 112699 156130
18207 156130 169997 174231 170565 160183 140331 134644 126075 122885 117662 117510 134859 122970 108546
18194 108546 85798 80285 106648 115850 92521 95251 133333 158870 147924 137021 142128 142941 159609
18181 159609 149163 151196 154275 124779 88965 122419 164455 185876 167500 137896 99038 90781
18169 90781 96518 114784 127132 129805 113698 125964 136409 154086 144411 135909 128710 129697 154409
18156 154409 152982 123482 127015 113413 124594 118130 131848 146638 122756 131038 110917 120586
$$ packed form
18244A85761j2460k4238k5583j9664P296K4113K8947K0547j0380j5681q873M598
18232A54383j2289l1828J6064q191J3608J9880j0355M716j9079q639P557K326
18220A28153p198j1103q545P57L2k1184J4649J3724r174j1277J4851R014M3431
18207A56130J3867M234l666j0382j9852n687q569l190n223j52J7349j1889j4424
18194A08546k2748n513K6363R202k3329K730L8082K5537j0946j0903N107Q13J6668
18181A59609j0446K033L079k9496l5814L3454M2036K1421j8376k9604l8858q257
18169I0781N737J8266J2348K673j6107J2266J0445J7677r675q502p199R87K4712
18156A54409j427k9500L533j3602J1181o464J3718J4790k3882Q282k0121R669
$$ plain form
18144 120586 134988 109791 99201 113714 111008 105631 127694 139264 139752 145326 135815 150140 153421
18131 153421 144789 133881 126131 139864 147674 129696 116795 113929 118099 83543 68003 90690
18119 90690 120032 130885 142162 120197 121659 126429 100882 117362 118166 103000 104154 98115 91398
18106 91398 115388 148700 143684 131611 111287 128372 127805 108100 101198 98701 88131 88335 107091
18093 107091 108380 104795 122917 112841 103994 87897 134822 148664 137034 159460 184848 154680
18081 154680 126325 116386 94382 90876 88993 90106 132437 139912 131914 124491 94540 102752 144192
18068 144192 144414 128584 130690 98973 105438 118235 107162 76232 17514 -18016 -15809 -13097 -39056
18055 -39056 -35742 -34945 -63779 -72791 -54658 -32340 -32139 -24365 -6616 21078 9843 -4954 -8362
$$ packed form
18144A20586J4402k5197j0590J4513k706n377K2063J1570M88N574r511J4325L281
18131A53421q632j0908p750J3733P810j7978j2901k866M170l4556j5540K2687
18119I0690K9342J0853J1277k1965J462M770k5547J6480Q04j5166J154o039o717
18106I1398K3990L3312n016j2073k0324J7085n67j9705o902k497j0570K04J8756
18093A07091J289l585J8122j0076q847j6097M6925J3842j1630K2426K5388l0168
18081A54680k8355r939k2004l506j883J113M2331P475p998p423k9951Q212M1440
18068A44192K22j5830K106l1717O465J2797j1073l0930n8718l5530K207K712k5959
18055c9056L314P97k8834r012J8133K2318K01P774J7749K7694j1235j4797l408
$$ plain form
18042 -8362 -2767 12291 15730 15924 49000 58903 60343 57215 54330 12210 2702 23380 63783 78454
18028 78454 88839 78701 49504 77420 64536 15163 -2577 -6629 7108 30351 32824 56594
18016 56594 76547 73464 66673 74817 76151 73869 69273 74906 96344 98309 97001 100547 107479 93923
18002 93923 101946 124624 121980 110520 96576 126297 118175 95737 92449 99605 85510 65943 58710
17989 58710 39941 25559 49700 50179 59365 90094 91076 95919 98535 94316 71059 83580 108303
17976 108303 97717 80461 98300 122054 110359 69870 95336 110354 123687 112081 109883 94333
17964 94333 85859 106017 133835 116423 133271 170041 187863 204543 191280 192304 213305 237325
17952 237325 314252 366054 363426 369266 390966 435941 473609 499950 531515 554668 586295 659869
$$ packed form
18042h362N595J5058L439J94L3076R903J440l128k885m2120r508K0678M0403J4671
18028G8454J0385j0138k9197K7916j2884m9373j7740m052J3737K3243K473K3770
18016E6594J9953l083o791Q144J334k282m596N633K1438J965j308L546O932j3556
18002I3923Q023K2678k644j1460j3944K9721q122k2438l288P156j4095j9567p233
17989E8710j8769j4382K4141M79R186L0729R82M843K616m219k3257J2521K4723
17976A08303j0586j7256J7839K3754j1695m0489K5466J5018J3333j1606k198j5550
17964I4333q474K0158K7818j7412J6848L6770J7822J6680j3263J024K1001K4020
17952B37325P6927N1802k628N840K1700M4975L7668K6341L1565K3153L1627P3574
$$ plain form
17940 659869 731968 790788 877334 1042673 1272881 1546460 1806003 2078413 2309989 2461492
17930 2461492 2526584 2515214 2462254 2463524 2525601 2694315 2971136 3311760 3786010 4390711
17920 4390711 5106113 5957878 6944734 8104103 9489813 11347703 13931773 17646577 23166007
17911 23166007 31470883 43857182 61667773 85041375 110803867 132875905 145258347
17904 145258347 144412327 130989231 109371754 85193871 63450531 46910775 35417309
17897 35417309 27584679 22212793 18484609 15880558 13968309 12488117 11257158 10141339
17889 10141339 9036682 7998816 7082527 6337585 5734949 5331756 5128286 4999620 4912904
17880 4912904 4861039 4820715 4744400 4533542 4218520 3863012 3507982 3138465 2813227 2560267
$$ packed form
17940F59869P2099N8820Q6546J65339K30208K73579K59543K72410K31576J51503
17930B461492O5092j1370n2960J270O2077J68714K76821L40624M74250O04701
17920D390711P15402Q51765R86856J159369J385710J857890K584070L714804N519430
17911B3166007Q304876J2386299J7810591K3373602K5762492K2072038J2382442
17904A45258347q46020j3423096k1617477k4177883k1743340j6539756j1493466
17897C5417309p832630n371886l728184k604051j912249j480192j230959j115819
17889A0141339j104657j037866r16289p44942o02636m03193k03470j28666q6716
17880D912904n1865m0324p6315k10858l15022l55508l55030l69517l25238k52960
$$ plain form
17870 2560267 2374497 2222626 2064848 1921133 1802125 1685459 1573438 1492947 1424582 1363417
17860 1363417 1318786 1259248 1197782 1176737 1150844 1137472 1079925 1018393 946902 912362 873423
17849 873423 851804 844062 815223 780595 738590 717388 687997 690293 678217 641887 613354 626684
17837 626684 611980 610296 601844 604591 600059 599763 600096 558170 480448 475077 526399 512639 507573
17824 507573 510565 487049 468503 448597 449049 484624 465720 418358 417244 396751 391572 415501
17812 415501 405384 387112 391038 379853 382825 401521 366889 334339 323448 302999 286782 309499
17800 309499 342986 352983 343141 363706 373745 357729 347674 333750 339439 335788 302460 298508
17788 298508 316111 337952 330460 305319 295868 283008 285286 285357 284127 300815 311491 284193 274717
$$ packed form
17870B560267j85770j51871j57778j43715j19008j16666j12021q0491o8365o1165
17860A363417m4631n9538o1466k1045k5893j3372n7547o1532p1491l4540l8939
17849H73423k1619p742k8839l4628m2005k1202k9391K296j2076l6330k8533J3330
17837F26684j4704j684q452K747m532k96L33m1926p7722n371N1322j3760n066
17824E07573K992k3516j8546j9906M52L5575j8904m7362j114k0493n179K3929
17812D15501j0117j8272L926j1185K972J8696l4632l2550j0891k0449j6217K2717
17800C09499L3487R997r842K0565J0039j6016j0055j3924N689l651l3328l952
17788B98508J7603K1841p492k5141r451j2860K278P1j230J6688J0676k7298r476
$$ plain form
17775 274717 307809 335564 327376 322971 300836 299043 304601 313603 335733 325430 297777 288637 289082
17762 289082 283332 295500 296956 305717 341810 347935 344011 345737 345588 372697 413680 437687 407021
17749 407021 353184 295571 239238 186725 159161 157738 170058 158813 145930 130464 136086 141841
17737 141841 121040 107311 112818 127776 135446 120466 117052 140436 165753 184865 182274 160905
17725 160905 129930 123765 135575 156052 145685 166251 155368 151303 146597 161907 194495 212090
17713 212090 215717 229766 231391 190521 169986 178223 178715 168096 174684 174105 180929 158575 149799
17700 149799 150579 153289 137657 117414 125812 125497 139656 123593 133627 133168 151830 176073 180219
17687 180219 181456 173930 170466 167098 176007 169070 143265 127648 132482 107243 114085 122978 120113
$$ packed form
17775B74717L3092K7755q188m405k2135j793N558R002K2130j0303k7653r140M45
17762B89082n750J2168J456Q761L6093O125l924J726j49K7109M0983K4007l0666
17749D07021n3837n7613n6333n2513k7564j423J2320j1245j2883j5466N622N755
17737A41841k0801j3729N507J4958P670j4980l414K3384K5317J9112k591k1369
17725A60905l0975o165J1810K0477j0367K0566j0883m065m706J5310L2588J7595
17713B12090L627J4049J625m0870k0535Q237M92j0619O588n79O824k2354q776
17700A49799P80K710j5632k0243Q398l15J4159j6063J0034m59J8662K4243M146
17687A80219J237p526l464l368Q909o937k5805j5617M834k5239O842Q893k865
$$ plain form
17674 120113 138043 127681 136341 145982 133349 115763 106680 115921 124170 131411 143260 140074 130368
17661 130368 123900 130502 127592 97987 107216 111005 114654 159267 161060 158726 162589 136421 111260
17648 111260 107016 110148 109624 105570 114699 136442 159066 149206 139821 162290 149126 129841 135249
17635 135249 137798 140804 121972 113621 109405 117211 102105 112749 94588 65261 70410 62278 88703
17622 88703 103236 79874 66817 76140 106762 119949 122709 126227 122205 113391 89598 72531 45870
17609 45870 52591 57655 68521 104081 122593 119389 121492 132447 168030 177343 154165 159455 202206
17596 202206 205011 180632 165282 139319 122759 142527 130076 106813 115337 135229 129362 124845
17584 124845 107664 120023 100761 122004 130861 97648 123761 128397 108925 93746 89212 109362
$$ packed form
17674A20113J7930j0362Q660R641j2633j7586r083R241Q249P241J1849l186r706
17661A30368o468O602k910k9605R229L789L649M4613J793k334L863k6168k5161
17648A11260m244L132n24m054R129K1743K2624r860r385K2469j3164j9285N408
17635A35249K549L006j8832q351m216P806j5106J0644j8161k9327N149q132K6425
17622H8703J4533k3362j3057R323L0622J3187K760L518m022q814k3793j7067k6661
17609D5870O721N064J0866L5560J8512l204K103J0955L5583R313k3178N290M2751
17596B02206K805k4379j5350k5963j6560J9768j2451k3263Q524J9892n867m517
17584A24845j7181J2359j9262K1243Q857l3213K6113M636j9472j5179m534K0150
$$ plain form
17572 109362 115452 102987 77073 67226 75378 87895 90499 114031 127001 116855 124176 137911
17560 137911 128781 107573 106537 102280 115593 114866 119877 118813 145687 141716 146115 152164 136765
17547 136765 103483 69507 70276 99049 117443 108034 102970 98284 95502 141676 143739 119708 131965
17534 131965 100703 55387 54662 93635 135540 142742 140581 129479 79349 62786 103503 110306
17522 110306 100613 100545 107622 113553 115032 121743 93834 100575 106611 118601 129273 107664 96211
17509 96211 76135 74435 89546 109265 109417 103986 96516 80498 87199 97159 95900 107663 131306
17496 131306 158864 156918 170402 144956 96606 115470 133039 75372 69539 109102 130841 136832
17484 136832 124377 126658 120628 112314 98652 110245 121536 123614 117013 113819 84955 68770 70515
$$ packed form
17572A09362O090j2465k5914r847Q152J2517K604K3532J2970j0146P321J3735
17560A37911r130k1208j036m257J3313p27N011j064K6874l971M399O049j5399
17547A36765l3282l3976P69K8773J8394r409n064m686k782M6174K063k4031J2257
17534A31965l1262m5316p25L8973M1905P202k161j1102n0130j6563M0717O803
17522A10306r693o8P077N931J479O711k7909O741O036J1990J0672k1609j1453
17509I6211k0076j700J5111J9719J52n431p470j6018O701R960j259J1763K3643
17496A31306K7558j946J3484k5446m8350J8864J7569n7667n833L9563K1739N991
17484A36832j2455K281o030q314j3662J1593J1291K078o601l194k8864j6185J745
$$ plain form
17471 70515 74192 87268 108582 123176 99608 79733 91476 106369 119249 95325 106342 120252
17459 120252 98365 96384 119550 110657 68300 53134 67995 71674 56800 46205 33790 22393
17447 22393 27760 57963 60338 64770 105572 110382 86937 108992 130783 112485 79597 58526
17435 58526 32909 29978 54545 69965 58838 50823 44979 46100 53368 46893 51706 40918 17950
17422 17950 37491 73017 81972 107066 122689 106513 95793 128214 133582 127392 148244 146264
17410 146264 171933 189413 219242 321593 422275 481308 562973 609826 608282 564366 527431
17399 527431 478630 432532 371962 340245 292800 244199 229709 226355 190911 152078 147040 138469
17387 138469 147433 154103 132611 137136 140280 146524 161483 141293 138532 122944 92006 116514 131136
$$ packed form
17471G0515L677J3076K1314J4594k3568j9875J1743J4893J2880k3924J1017J3910
17459A20252k1887j981K3166q893m2357j5166J4861L679j4874j0595j2415j1397
17447B2393N367L0203K375M432M0802M810k3445K2055K1791j8298l2888k1071
17435E8526k5617k931K4567J5420j1127q015n844J121P268o475M813j0788k2968
17422A7950J9541L5526Q955K5094J5623j6176j0720L2421N368o190K0852j980
17410A46264K5669J7480K9829J02351J00682N9033Q1665M6853j544m3916l6935
17399E27431m8801m6098o0570l1717m7445m8601j4490l354l5444l8833n038q571
17387A38469Q964O670k1492M525L144O244J4959k0190k761j5588l0938K4508J4622
$$ plain form
17374 131136 138623 140496 112197 98947 97056 99872 108524 85784 74403 73132 59263 65390 88207
17361 88207 110606 82534 53798 55590 60539 67628 82748 80866 92916 97274 95571 81377 92377
17348 92377 65907 31213 46242 61689 85178 97584 82925 69863 97967 114063 100321 95968
17336 95968 107054 109259 77292 53925 64752 91024 124539 122887 101235 57166 38822 36379
17324 36379 48650 59686 60597 99325 104325 98260 81155 33624 11381 19650 22872 13012 27214
17311 27214 78755 71611 31166 3230 -1040 30399 42870 68666 53717 49947 55269 31046
17299 31046 7785 20588 17841 24421 41344 64179 70887 68375 68487 49445 38133 21049 39484
17286 39484 38250 34013 25287 59414 29979 8766 31672 38148 51802 83684 86504 65789 62046
$$ packed form
17374A31136P487J873k8299j3250j891K816Q652k2740j1381j271j3869O127K2817
17361H8207K2399k8072k8736J792M949P089J5120j882J2050M358j703j4194J1000
17348I2377k6470l4694J5029J5447K3489J2406j4659j3062K8104J6096j3742m353
17336I5968J1086K205l1967k3367J0827K6272L3515j652k1652m4069j8344k443
17324C6379J2271J1036R11L8728N000o065j7105m7531k2243Q269L222r860J4202
17311B7214N1541p144m0445k7936m270L1439J2471K5796j4949l770N322k4223
17299C1046k3261J2803k747O580J6923K2835O708k512J12j9042j1312j7084J8435
17286C9484j234m237q726L4127k9435k1213K2906O476J3654L1882K820k0715l743
$$ plain form
17273 62046 86807 99933 97542 84797 72767 52716 64532 59757 58410 70939 63334 55705 57694
17260 57694 37547 59290 60915 64941 61030 44957 40988 45787 54908 30625 13368 33007 31708
17247 31708 17468 56553 96220 92999 115389 117262 104810 81063 42955 35755 42925 40466 44371
17234 44371 55716 76279 71007 75395 77814 78212 67033 61554 55027 59320 62421 31013 18892
17221 18892 42265 38887 16655 17459 35627 43737 28555 24661 33286 9683 16771 25917 32595
17208 32595 38007 28853 50689 45087 46109 94200 109699 100324 93944 51418 56629 68505 80575
17195 80575 90615 74873 82254 97678 98390 86844 35400 13321 30218 61096 52829 53579 63576
17182 63576 56484 42299 27642 23549 49953 61199 66906 81691 78799 68793 58789 31951
$$ packed form
17273F2046K4761J3126k391j2745j2030k0051J1816m775j347J2529p605p629J989
17260E7694k0147K1743J625M026l911j6073l969M799R121k4283j7257J9639j299
17247C1708j4240L9085L9667l221K2390J873j2452k3747l8108p200P170k459L905
17234D4371J1345K0563n272M388K419L98j1179n479o527M293L101l1408j2121
17221A8892K3373l378k2232Q04J8168Q110j5182l894Q625k3603P088R146O678
17208C2595N412r154K1836n602J022M8091J5499r375o380m2526N211J1876J2070
17195H0575J0040j5742P381J5424P12j1546n1444k2079J6897L0878q267P50R997
17182F3576p092j4185j4657m093K6404J1246N707J4785k892j0006j0004k6838
$$ plain form
17170 31951 38992 49736 43116 43691 55443 76529 72509 83614 91400 49137 32942 29900 55963
17157 55963 66899 67772 58677 49612 65078 93440 136125 152752 167934 183120 184750 179457 180134
17144 180134 182347 194068 233054 250413 276731 325046 357745 392712 438385 452850 469430 507424
17132 507424 507902 487459 459836 388789 329668 266392 239789 237926 220378 222967 213369 189281
17120 189281 154648 138719 118513 100181 87211 85134 107360 111644 100331 111083 102553 94395
17108 94395 116317 109345 122174 112517 111906 95846 57581 45773 61602 71901 88855 121983
17096 121983 128629 111043 124446 112400 83685 64281 69432 89352 44839 18242 14368 11293
17084 11293 33839 55639 86347 60329 31815 33271 61669 56945 32688 25615 34636 36795 22600
$$ packed form
17170C1951P041J0744o620N75J1752K1086m020J1105P786m2263j6195l042K6063
17157E5963J0936Q73r095r065J5466K8362M2685J6627J5182J5186J630n293O77
17144A80134K213J1721L8986J7359K6318M8315L2699L4967M5673J4465J6580L7994
17132E07424M78k0443k7623p1047n9121o3276k6603j863j7548K589r598k4088
17120A89281l4633j5929k0206j8332j2970k077K2226M284j1313J0752q530q158
17108I4395K1922o972J2829r657o11j6060l8265j1808J5829J0299J6954L3128
17096A21983O646j7586J3403j2046k8715j9404N151J9920m4513k6597l874l075
17084A1293K2546K1800L0708k6018k8514J456K8398m724k4257p073R021K159j4195
$$ plain form
17071 22600 30632 36796 41097 38981 11582 -13828 -13210 56232 85844 72720 52714 62431 53196
17058 53196 50009 47178 30599 38623 41902 24096 27759 24105 8932 7948 44190 37590 5010
17045 5010 -1693 31556 47868 52237 55052 65358 71244 42360 250 -21893 -23324 -1249 33549
17032 33549 48957 59567 65885 63715 47137 36232 36344 66029 49338 18549 26017 41517 46450
17019 46450 56523 54385 36841 36721 57802 25286 -1170 8199 28431 12181 -37777 -29502 -2100
17006 -2100 20115 28469 36683 17444 -13366 -19998 -34465 -29602 1389 1439 -10796 11586 -6029
16993 -6029 8612 19193 40678 53756 51620 70199 80441 52175 56666 73107 45776 29592
16981 29592 60266 86897 84900 58925 69766 88896 85794 77644 66475 49271 40267 20576
$$ packed form
17071B2600Q032O164M301k116k7399k5410O18O9442K9612j3124k0006R717r235
17058E3196l187k831j6579Q024L279j7806L663l654j5173r84L6242o600l2580
17045E010o703L3249J6312M369K815J0306N886k8884m2110k2143j431K2075L4798
17032C3549J5408J0610O318k170j6578j0905J12K9685j6691l0789P468J5500M933
17019D6450J0073k138j7544j20K1081l2516k6456R369K0232j6250m9958Q275K7402
17006b100K2215Q354Q214j9239l0810o632j4467M863L0991N0j2235K2382j7615
16993f029J4641J0581K1485J3078k136J8579J0242k8266M491J6441k7331j6184
16981B9592L0674K6631j997k5975J0841J9130l102q150j1169j7204r004j9691
$$ plain form
16969 20576 51088 51249 37923 33170 55827 40288 22910 3792 470 2287 20477 44869 45094
16956 45094 67028 76027 43831 29657 43994 55628 40638 41090 30797 -21051 -55921 -51962
16944 -51962 -37403 -37713 -19051 3163 15323 13741 30433 28084 38877 19760 -2091 -19726
16932 -19726 -24576 6256 20715 40789 45266 20370 -28494 6088 19259 5093 -16248 7681
16920 7681 28963 30808 46072 77577 90973 69640 57369 63179 60001 44604 20783 24393 33177
16907 33177 54093 72504 71858 31000 -7035 12849 35262 42295 50737 52938 87927 127452 117435
16894 117435 101063 86855 74112 59937 53396 71009 71381 82560 69620 39633 53555 55429
16882 55429 43434 33211 42782 25412 31293 44891 41650 38063 49921 71564 68227 73657 42548
$$ packed form
16969B0576L0512J61j3326m753K2657j5539j7378j9118l322J817J8190K4392K25
16956D5094K1934Q999l2196j4174J4337J1634j4990M52j0293n1848l4870L959
16944e1962J4559l10J8662K2214J2160j582J6692k349J0793j9117k1851j7635
16932a9726m850L0832J4459K0074M477k4896m8864L4582J3171j4166k1341K3929
16920G681K1282J845J5264L1505J3396k1333j2271N810l178j5397k3821L610Q784
16907C3177K0916J8411o46m0858l8035J9884K2413P033Q442K201L4989L9525j0017
16894A17435j6372j4208j2743j4175o541J7613L72J1179j2940k9987J3922J874
16882E5429j1995j0223R571j7370N881J3598l241l587J1858K1643l337N430l1109
$$ plain form
16869 42548 18122 5437 9578 22079 17715 34639 68856 61581 19010 30905 38045 42606 65424
16856 65424 58173 37113 24594 27058 39537 46665 55039 83948 84549 43521 24691 43273 44798
16843 44798 22357 18175 7750 23885 43245 57155 61486 64741 61037 96513 110175 105959 69481
16830 69481 56051 76155 94135 61942 36809 9044 23739 55619 62132 73612 79389 80676
16818 80676 66313 60395 67394 49310 51495 53929 64294 70538 92135 106065 79007 79785 85467
16805 85467 106259 94029 100011 90288 100023 110428 93788 78802 77804 64602 50584 39730 31807
16792 31807 11750 -20181 -49141 -74951 -94528 -71101 -62595 -62877 -55233 -53501 -30800 -456 8678
16779 8678 -2882 -3568 1256 -34340 -41406 -53134 -50923 -36493 -6721 8073 -26954 -26466 29133
$$ packed form
16869D2548k4426j2685M141J2501m364J6924L4217p275m2571J1895P140M561K2818
16856F5424p251k1060j2519K464J2479P128Q374K8909O01m1028j8830J8582J525
16843D4798k2441m182j0425J6135J9360J3910M331L255l704L5476J3662m216l6478
16830F9481j3430K0104J7980l2193k5133k7765J4695L1880O513J1480N777J287
16818H0676j4363n918O999j8084K185K434J0365O244K1597J3930k7058P78N682
16805H5467K0792j2230N982r723R735J0405j6640j4986r98j3202j4018j0854p923
16792C1807k0057l1931k8960k5810j9577K3427Q506k82P644J732K2701L0344R134
16779H678j1560o86M824l5596p066j1728K211J4430K9772J4794l5027M88N5599
$$ plain form
16766 29133 59443 46320 72998 75830 70463 88537 99129 115964 83693 47065 34962 23563
16754 23563 22662 31386 12814 17612 23885 30269 47252 67029 57519 24046 21830 14049 9053 24959
16740 24959 63691 80495 71890 80601 84192 70694 60317 64849 71954 93964 95502 84760 60987
16727 60987 44951 41880 28698 52699 82516 89384 61321 66433 93516 92919 75542 85438 66308
16714 66308 80188 91582 95461 99101 117347 114737 121202 122097 110777 118158 137876 142532 136915
16701 136915 158988 168418 183677 184028 185261 219462 223912 217429 261130 284214 280248 304698 301096
16688 301096 294129 325504 349848 379610 389091 414542 453720 463984 493546 536941 577691 608757
16676 608757 657245 707392 745836 798016 854955 923673 1002506 1111718 1251453 1418742 1573705
$$ packed form
16766B9133L0310j3123K6678K832n367J8074J0592J6835l2271l6628j2103j1399
16754B3563r01Q724j8572M798O273O384J6983J9777r510l3473k216p781m996J5906
16740B4959L8732J6804q605Q711L591j3498j0377M532P105K2010J538j0742k3773
16727F0987j6036l071j3182K4001K9817O868k8063N112K7083n97j7377R896j9130
16714F6308J3880J1394L879L640J8246k610O465Q95j1320P381J9718M656n617
16701A36915K2073R430J5259L51J233L4201M450o483M3701K3084l966K4450l602
16688C01096o967L1375K4344K9762R481K5451L9178J0264K9562M3395M0750L1066
16676F08757M8488N0147L8444N2180N6939O8718P8833J09212J39735J67289J54963
$$ plain form
16665 1573705 1759886 1998892 2283699 2546082 2818403 3109519 3425773 3709528 3964318
16656 3964318 4256489 4595612 4994859 5495435 6105879 6928613 8027651 9450648 11284683
16647 11284683 13705218 16889479 21076934 26669059 34270917 44618632 58397472 75478308
16639 75478308 94048836 110833307 121884512 124405480 117906109 104266954 86990876
16632 86990876 69591709 54558512 42881687 34304896 28033398 23357931 19822696 17078991
16624 17078991 14854842 12990921 11421882 10150306 9140236 8329477 7674773 7138051
16616 7138051 6665970 6229279 5856089 5517585 5176190 4871235 4520599 4135078 3763436
16607 3763436 3453974 3181431 2949813 2756474 2589042 2444487 2307032 2158303 2050439
$$ packed form
16665A573705J86181K39006K84807K62383K72321K91116L16254K83755K54790
16656C964318K92171L39123L99247N00576O10444Q22734J099038J422997J834035
16647A1284683K420535L184261M187455N592125P601858J0347715J3778840J7080836
16639G5478308J8570528J6784471J1051205K520968o499371j3639155j7276078
16632H6990876j7399167j5033197j1676825q576791o271498m675467l535235k743705
16624A7078991k224149j863921j569039j271576j010070q10759o54704n36722
16616G138051m72081m36691l73190l38504l41395l04955l50636l85521l71642
16607C763436l09462k72543k31618j93339j67432j44555j37455j48729j07864
$$ plain form
16598 2050439 1944564 1805548 1704349 1633566 1543358 1459197 1382943 1319268 1277111 1247609 1189108
16587 1189108 1137892 1084281 1073300 1034930 960824 895594 886910 881353 835767 778907 756782 742723
16575 742723 714220 692909 664955 658178 646720 654733 659874 613013 576419 523797 498844 499054
16563 499054 502189 500893 520854 505057 478450 461159 473327 480547 476294 474560 453638 433041
16551 433041 404708 383361 369787 360562 375289 385973 370196 370439 365876 342571 306849 312384
16539 312384 320936 322122 346963 359605 363617 379594 388776 390493 391530 385652 376848 359641 374833
16526 374833 400468 373322 337358 309556 320583 348157 340092 317989 305689 299977 312819 343773
16514 343773 355058 349331 330919 297787 258982 250727 250367 210212 205100 237187 259322 262864 266044
$$ packed form
16598B050439j05875j39016j01199p0783r0208q4161p6254o3675m2157k9502n8501
16587A189108n1216n3611j0981l8370p4106o5230q684n557m5586n6860k2125j4059
16575G42723k8503k1311k7954o777j1458Q013N141m6861l6594n2622k4953K10
16563D99054L135j296J9961j5797k6607j7291J2168P220m253j734k0922k0597
16551D33041k8333k1347j3574r225J4727J0684j5777K43m563k3305l5722N535
16539C12384Q552J186K4841J2642M012J5977R182J717J037n878q804j7207J5192
16526C74833K5635k7146l5964k7802J1027K7574q065k2103j2300n712J2842L0954
16514C43773J1285n727j8412l3132l8805q255l60m0155n112L2087K2135L542L180
$$ plain form
16501 266044 261173 256012 256932 239046 215527 203861 214043 228086 244701 250476 257501 257809 269864
16488 269864 318035 305278 296842 321607 307591 276788 259043 244380 236478 201425 155934 125819
16476 125819 114602 104322 91352 81516 75575 80546 124132 128494 103600 111374 107644 102421 96003
16463 96003 105875 108538 92089 51078 44426 43339 64886 81024 68370 57006 59715 106196 118780
16450 118780 77836 61235 84930 101453 121624 110585 89763 76398 75425 74498 95071 103792
16438 103792 88773 95105 101317 104530 71138 72376 104158 129175 143229 153369 146779 134846
16426 134846 133050 122329 98339 97216 83049 76426 95775 80322 99521 105424 101941 117445
16414 117445 128677 134377 116502 119594 128262 131615 112751 95612 82011 78325 109345 119483
$$ packed form
16501B66044m871n161R20j7886k3519j1666J0182J4043J6615N775P025L08J2055
16488B69864M8171j2757q436K4765j4016l0803j7745j4663p902l5053m5491l0115
16476A25819j1217j0280j2970r836n941M971M3586M362k4894P774l730n223o418
16463I6003R872K663j6449m1011o652j087K1547J6138j2654j1364K709M6481J2584
16450A18780m0944j6601K3695J6523K0171j1039k0822j3365r73r27K0573Q721
16438A03792j5019O332O212L213l3392J238L1782K5017J4054J0140o590j1933
16426A34846j796j0721k3990j123j4167o623J9349j5453J9199N903l483J5504
16414A17445J1232N700j7875L092Q668L353j8864j7139j3601l686L1020J0138
$$ plain form
16402 119483 98063 89948 103374 115933 106935 93157 90213 68599 44337 52509 57765 50909 66571
16389 66571 77746 72703 93342 105511 103673 100635 98078 64942 75471 120235 134147 87954
16377 87954 44415 36623 59342 86891 83468 84659 88773 59255 74874 79011 52867 66049 72841
16364 72841 86788 100903 89164 75605 76056 54693 47306 35055 35897 28614 44319 79507 74220
16351 74220 54597 70429 76067 87717 60055 36142 19305 16163 34777 15364 9619 22807
16339 22807 18890 34963 66611 67226 58801 69744 69089 87239 78149 49971 46948 69295 73474
16326 73474 74105 80159 70219 60832 37083 55600 92845 116935 93605 55634 47882 47436 24846
16313 24846 6512 32743 61872 67261 60522 60263 58614 27432 17500 30988 21623 23482 21352
$$ packed form
16402A19483k1420q115J3426J2559q998j3778k944k1614k4262Q172N256o856J5662
16389F6571J1175n043K0639J2169j838l038k557l3136J0529M4764J3912m6193
16377H7954m3539p792K2719K7549l423J191M114k9518J5619M137k6144J3182O792
16364G2841J3947J4115j1739j3559M51k1363p387j2251Q42p283J5705L5188n287
16351G4220j9623J5832N638J1650k7662k3913j6837l142J8614j9413n745J3188
16339B2807l917J6073L1648O15q425J0943o55J8150r090k8178l023K2347M179
16326G3474O31O054r940r387k3749J8517L7245K4090k3330l7971p752m46k2590
16313B4846j8334K6231K9129N389o739k59j649l1182r932J3488r365J859k130
$$ plain form
16300 21352 18946 23365 55285 80127 70661 53673 61364 60457 71222 71168 73376 74583 66292 45663
16286 45663 32082 48500 30517 28602 62351 44811 26511 33934 46039 53814 73125 86227
16274 86227 65203 63144 49059 70067 70432 54502 65498 74542 87140 85469 80664 72224 62125
16261 62125 78492 101062 92632 87720 64346 65708 53797 10300 -5348 7180 45965 55386
16249 55386 52222 64366 38511 32553 31211 51785 53683 42873 32019 47968 61486 96053
16237 96053 95510 88934 97067 117371 95543 76600 31999 31233 44665 47800 65040 72734 93319
16224 93319 86006 79694 74080 88944 98383 80541 45002 37146 46520 36888 22608 -857 6722
16211 6722 30192 52521 46961 39535 42480 33713 50653 45174 37504 29639 59052 59726 55278 53434
$$ packed form
16300B1352k406M419L1920K4842r466j6988P691r07J0765n4K208J207q291k0629
16286D5663j3581J6418j7983j915L3749j7540j8300P423J2105P775J9311J3102
16274H6227k1024k059j4085K1008L65j5930J0996R044J2598j671m805q440j0099
16261F2125J6367K2570q430m912k3374J362j1911m3497j5648J2528L8785R421
16249E5386l164J2144k5855n958j342K0574J898j0810j0854J5949J3518L4567
16237I6053n43o576Q133K0304k1828j8943m4601p66J3432L135J7240P694K0585
16224I3319p313o312n614J4864R439j7842l5539p856R374r632j4280k3465P579
16211F722K3470K2329n560p426K945q767J6940n479p670p865K9413O74m448j844
$$ plain form
16197 53434 53413 57286 66911 58852 65688 51894 42281 61551 94496 109500 115446 106130 85373 73820
16183 73820 69686 36783 21292 43138 61220 71132 68959 45351 55348 67667 65859 97566 105163
16170 105163 87373 58451 39061 40040 53605 71516 90231 55507 28220 36800 37478 47685
16158 47685 52664 49203 27937 33149 48685 72439 72195 60399 48211 60017 74645 77062 102707
16145 102707 147930 168967 161492 182779 259991 316338 369671 405648 444822 455842 469623 464650
16133 464650 436377 436774 396497 357575 294446 276445 239416 193539 157821 114488 123023 139703
16121 139703 160817 147990 93023 50541 46247 84586 101494 78659 48746 54984 53468 59845
16109 59845 64259 77654 79436 60990 36615 66390 62756 64652 49934 34878 24522 26017 14999
$$ packed form
16197E3434k1L873R625q059O836j3794r613J9270L2945J5004N946r316k0757j1553
16183G3820m134l2903j5491K1846J8082R912k173k3608R997J2319j808L1707P597
16170A05163j7790k8922j9390R79J3565J7911J8715l4724k7287Q580O78J0207
16158D7685M979l461k1266N212J5536K3754k44j1796j2188J1806J4628K417K5645
16145A02707M5223K1037p475K1287P7212N6347N3333L5977L9174J1020J3781m973
16133D64650k8273L97m0277l8922o3129j8001l7029m5877l5718m3333Q535J6680
16121A39703K1114j2827n4967m2482m294L8339J6908k2835k9913O238j516O377
16109E9845M414J3395J782j8446k4375K9775l634J896j4718j5056j0356J495j1018
$$ plain form
16096 14999 16626 31406 26373 27565 66120 57557 31649 10669 16037 4651 4324 5812 19389
16083 19389 34512 43832 39393 47338 60516 54807 13290 1277 316 6043 2027 -12423 -8956
16070 -8956 -11458 7343 29976 49196 62243 39874 19397 38105 36521 25981 41652 61861
16058 61861 42725 37382 28579 16918 22855 31028 20016 13718 17524 34397 27695 19393 36421
16045 36421 16080 -20986 -6161 4234 -1493 -7811 22948 24410 10723 18077 39508 38443 13192
16032 13192 6123 12790 38635 40375 34049 15323 6605 35817 41768 16064 326 3671 -874
16019 -874 -2311 -10900 -6285 5147 23144 32238 47213 57420 48472 40463 28702 16207 37094
16006 37094 49977 34689 2722 -14874 -4244 20236 12184 18254 13959 5088 13829 40691 35419
$$ packed form
16096A4999J627J4780n033J192L8555q563k5908k0980N368j1386l27J488J3577
16083A9389J5123R320m439P945J3178n709m1517j2013r61N727m016j4450L467
16070h956k502J8801K2633J9220J3047k2369k0477J8708j584j0540J5671K0209
16058F1861j9136n343q803j1661N937Q173j1012o298L806J6873o702q302J7028
16045C6421k0341l7066J4825J0395n727o318L0759J462j3687P354K1431j065k5251
16032A3192p069O667K5845J740o326j8726q718K9212N951k5704j5738L345m545
16019h74j437q589M615J1432J7997R094J4975J0207q948q009j1761j2495K0887
16006C7094J2883j5288l1967j7596J0630K4480q052O070m295q871Q741K6862n272
$$ plain form
15993 35419 13327 -763 -1086 -99 4096 31522 41365 42799 46168 57876 71849 72180 52580 32360
15979 32360 9481 7759 -3747 1562 14495 20655 15212 26235 30248 46264 54252 73390 52226
15966 52226 42539 47467 50949 46346 37616 24287 19486 34838 23200 21476 20632 22815 4478 -1776
15952 -1776 -13189 4763 21922 45133 66974 40233 40780 34533 48025 60811 46273 37582 67425
15939 67425 87533 69660 36046 25281 30524 44614 60358 39342 -15801 -42851 -15524 6620
15927 6620 13438 15203 22512 28822 6737 -2313 -4504 -7358 -25713 -24366 -8009 8609 33048
15914 33048 47016 34709 7762 1699 -32571 -37941 2427 -13413 -20569 6524 16403 22489 10091
15901 10091 -1405 10546 18430 15393 10281 14815 33293 25967 17667 7440 -9855 4183 -22915
$$ packed form
15993C5419k2092j4090l23R87M195K7426R843J434L369J1708J3973L31j9600k0220
15979C2360k2879j722j1506N309J2933O160n443J1023M013J6016P988J9138k1164
15966E2226r687M928L482m603q730j3329m801J5352j1638j724q44K183j8337o254
15952a776j1413J7952J7159K3211K1841k6741N47o247J3492J2786j4538q691K9843
15939F7425K0108j7873l3614j0765N243J4090J5744k1016n5143k7050K7327K2144
15927F620O818J765P309O310k2085r050k191k854j8355J347J6357J6618K4439
15914C3048J3968j2307k6947o063l4270n370M0368j5840p156K7093R879O086j2398
15901A0091j1496J1951P884l037n112M534J8478p326q300j0227j7295J4038k7098
$$ plain form
15888 -22915 -32012 14021 9752 -10720 -3922 12581 -11292 8537 39123 27354 19068 19126 28689
15875 28689 18344 21834 61266 49407 34471 41233 62333 47583 32661 42819 39950 35012
15863 35012 15952 -1679 -21724 -22234 -5462 -32454 -34964 6909 36740 65596 74370 50332
15851 50332 30609 39884 20201 6606 22124 12293 -3250 -5847 6713 14681 14469 23574 26544
15838 26544 31310 -127 -21948 -11713 -11194 -22344 3867 -7747 -6375 -2590 11749 8305 3763
15825 3763 -10102 -13679 -5212 -23568 -23245 -31366 -21363 -21068 -11582 -7209 15580 29314 18277 14863
15811 14863 36226 67246 80200 66109 53443 22289 42302 30360 19963 19097 28611 35122
15799 35122 43662 16343 -7184 237 -5947 -5515 -23982 -30058 7383 25002 5324 6483 28459
$$ packed form
15888b2915r097M6033m269k0472O798J6503k3873J9829L0586j1769q286N8R563
15875B8689j0345L490L9432j1859j4936O762K1100j4750j4922J0158k869m938
15863C5012j9060j7631k0045n10J6772k6992k510M1873K9831K8856Q774k4038
15851E0332j9723R275j9683j3595J5518r831j5543k597J2560P968k12R105K970
15838B6544M766l1437k1821J0235N19j1150K6211j1614J372L785J4339l444m542
15825C763j3865l577Q467j8356L23q121J0003K95R486M373K2789J3734j1037l414
15811A4863K1363L1020J2954j4091j2666l1154K0013j1942j0397q66R514O511
15799C5122Q540k7319k3527P421o184M32j8467o076L7441J7619j9678J159K1976
$$ plain form
15786 28459 12349 -15444 7496 17859 27099 -377 -20825 -16785 -2958 11405 14191 25278
15774 25278 23750 -3691 -29408 -25539 -10571 4480 21494 19617 10994 9962 -5085 15142 34240
15761 34240 33057 31585 19287 17417 13184 31403 38246 31317 30459 15938 -5337 -5681 -6368 -2286
15747 -2286 -35703 -50028 -33817 -21770 -8102 6543 6272 -7352 -22221 -4773 12160 -10470
15735 -10470 4436 14773 21090 10684 9001 25215 35886 17568 38630 40434 18216 32235
15723 32235 60723 59510 54852 51257 32712 20875 2478 -12161 -3023 18967 33282 20047
15711 20047 5396 -20089 -17771 -12434 -15310 1770 22079 4548 -31554 -26469 -12907 -2037
15699 -2037 13737 5732 21255 20963 4731 -18184 -23272 -13430 -23573 -31209 -1058 891 -31 -21645
$$ packed form
15786B8459j6110k7793K2940J0363R240k7476k0448M040J3827J4363K786J1087
15774B5278j528k7441k5717L869J4968J5051J7014j877q623j032j5047K0227J9098
15761C4240j183j472j2298j870m233J8219O843o929q58j4521k1275l44o87M082
15747b286l3417j4325J6211J2047J3668J4645k71j3624j4869J7448J6933k2630
15735a0470J4906J0337O317j0406j683J6214J0671j8318K1062J804k2218J4019
15723C2235K8488j213m658l595j8545j1837j8397j4639R138K1990J4315j3235
15711B0047j4651k5485K318N337k876J7080K0309j7531l6102N085J3562J0870
15699b037J5774q005J5523k92j6232k2915n088R842j0143p636L0151J949r22k1614
$$ plain form
15685 -21645 -27570 -25515 -16259 4839 22974 34103 -4807 -18684 -26107 -27850 -5581 -8352 -27376
15672 -27376 -110 27252 28098 6041 -33420 -31873 -16900 -18366 -45872 -39779 -44078 -36874 -4715
15659 -4715 7373 1679 -14844 -10380 -9689 -6675 -27618 -12530 -13790 -19313 -36139 -27274 23919
15646 23919 38245 1246 27651 22983 11106 6398 -6169 3959 43001 52680 52311 52581 12154
15633 12154 11287 -4909 -37613 -42255 -11564 -3317 -24182 -18384 -18238 -12828 12903 18673 17610 -1860
15619 -1860 2756 14307 14894 6282 10223 10115 30465 50191 23383 7259 -2043 -16362 -19861 -16664
15605 -16664 -36413 -34986 -26519 -49694 -36941 -34119 -34332 -14246 5487 4788 8999 24125 11536
15592 11536 7939 7299 -1397 -40784 -45302 -26967 -3862 -13660 -17326 -8898 22808 16302 4902
$$ packed form
15685b1645n925K055R256K1098J8135J1129l8910j3877p423j743K2269k771j9024
15672b7376K7266K7362Q46k2057l9461J547J4973j466k7506O093m299P204L2159
15659d715J2088n694j6523M464O91L014k0943J5088j260n523j6826Q865N1193
15646B3919J4326l6999K6405m668j1877m708j2567J0128L9042R679l69K70m0427
15633A2154q67j6196l2704m642L0691Q247k0865N798J46N410K5731N770j063j9470
15619a860M616J1551N87q612L941j08K0350J9726k6808j6124r302j4319l499L197
15605a6664j9749J427Q467k3175J2753K822k13K0086J9733o99M211J5126j2589
15592A1536l597o40q696l9387m518J8335K3105r798l666Q428L1706o506j1400
$$ plain form
15579 4902 20872 11213 19525 53403 37022 25182 47817 16226 -3698 -5083 -11849 -1867 15331
15566 15331 -26556 -62856 -44731 -50060 -49756 -44578 -33664 -26168 -21449 -28320 -37140 -21511 -30084
15553 -30084 -38490 -20046 5621 29633 30406 -4510 -18757 -11984 1022 -3085 9970 -5853 -23129
15540 -23129 -45703 -53844 -44167 -26616 -25747 3651 20735 -1121 -9476 -2607 30981 35776 33690
15527 33690 12847 -2582 -8352 -1478 10326 19523 31754 26862 16109 1845 23604 38626
15515 38626 27429 34816 28937 41188 48658 24207 6258 -23578 -7493 7231 5782 8006 -11912
15502 -11912 -21096 2108 31209 24341 -7250 -24579 -2232 -30725 -31923 -16429 6617 9003
15490 9003 -9855 -20963 332 25111 13571 12643 45151 17434 -18578 6996 2212 2236 -2442
$$ packed form
15579D902J5970r659Q312L3878j6381j1840K2635l1591j9924j385o766R982J7198
15566A5331m1887l6300J8125n329L04N178J0914P496M719o871q820J5629q573
15553c0084q406J8444K5667K4012P73l4916j4247O773J3006m107J3055j5823j7276
15540b3129k2574q141R677J7551Q69K9398J7084k1856q355O869L3588M795k086
15527C3690k0843j5429n770O874J1804R197J2231m892j0753j4264K1759J5022
15515C8626j1197P387n879J2251P470k4451j7949k9836J6085J4724j449K224j9918
15502a1912r184K3204K9101o868l1591j7329K2347k8493j198J5494K3046K386
15490I003j8858j1108K1295K4779j1540r28L2508k7717l6012K5574m784K4m678
$$ plain form
15477 -2442 -20149 -11598 10920 -15382 -21239 -10485 2201 -4976 -1118 13573 15071 18081 8561
15464 8561 14186 5648 -4527 -9185 7 2277 -14937 -17047 -329 -10821 -16493 -27256 -15044
15451 -15044 -8047 -21811 -30831 -28260 1322 -17079 -12050 209 27339 24750 12432 -7474 -18480
15438 -18480 -11323 -26315 -26112 -47303 -41192 -34655 -41099 -29963 -50234 -34250 -25390 -18496 -13973
15425 -13973 -30247 -52260 -36126 -19410 -3590 2423 2053 -18510 -29556 2762 1999 1644 -5660
15412 -5660 -5703 -12817 -8310 -5164 2409 13884 10835 10674 15710 33235 29661 34784 9596 -11853
15398 -11853 -15055 -10987 16665 30311 17252 12140 -909 6020 32179 34598 5712 1878 39827
15385 39827 50454 32100 17154 9758 -8752 -34255 -3531 -8347 -36798 -54072 -39342 6273
$$ packed form
15477b442j7707Q551K2518k6302n857J0754J2686p177L858J4691J498L010r520
15464H561N625q538j0175m658R192K270j7214k110J6718j0492n672j0763J2212
15451a5044O997j3764r020K571K9582j8401N029J2259K7130k589j2318j9906j1006
15438a8480P157j4992K03k1191O111O537o444J1136k0271J5984Q860O894M523
15425a3973j6274k2013J6134J6716J5820O013l70k0563j1046L2318p63l55p304
15412e660m3p114M507L146P573J1475l049j61N036J7525l574N123k5188k1449
15398a1853l202M068K7652J3646j3059n112j3049O929K6159K419k8886l834L7949
15385C9827J0627j8354j4946p396j8510k5503L0724m816k8451j7274J4730M5615
$$ plain form
15373 6273 24819 28528 24366 31611 37494 16171 307 31800 12051 13105 4673 -32027 -35677
15360 -35677 -23305 -30558 -54300 -64967 -45758 -28051 -13281 5045 6836 9358 22657 21216
15348 21216 2635 -23708 6293 -3167 -21768 -27033 -16729 -15615 -2318 -1814 -24139 -26197 -23848
15335 -23848 -22734 -10773 -668 -4628 -7033 -31272 -74354 -98615 -65814 -36095 -31786 18091
15323 18091 55454 15378 -11373 -20188 -10297 -6929 -23856 -22406 -21324 -40761 -36822 -14346 -22417
15310 -22417 -29725 -56594 -45408 -35665 -49645 -53375 -55652 -51214 -77534 -71303 -46731 -46171 -59728
15297 -59728 -34995 -13412 25027 25401 -352 8231 5875 -1616 -5789 -10033 -16179 6960 20073
15284 20073 15255 20812 7568 7420 -370 -1718 17445 23764 15650 -13030 -53856 -62596 -62268 -78328
$$ packed form
15373F273J8546L709m162P245N883k1323j5864L1493j9749J054q432l6700l650
15360c5677J2372p253k3742j0667J9209J7707J4770J8326J791K522J3299j441
15348B1216j8581k6343L0001r460j8601n265J0304J114J3297N04k2325k058K349
15335b3848J114J1961J0105l960k405k4239m3082k4261L2801K9719M309M9877
15323A8091L7363m0076k6751q815R891L368j6927J450J082j9437L939K2476q071
15310b2417p308k6869J1186R743j3980l730k277M438k6320O231K4572N60j3557
15297e9728K4733K1583L8439L74k5753Q583k356p491m173m244o146K3139J3113
15284B0073m818N557j3244j48p790j348J9163O319q114k8680m0826q740L28j6060
$$ plain form
15270 -78328 -53127 -42259 -58907 -41199 -53551 -68779 -34050 3243 13634 6112 -28540 -24710
15258 -24710 13978 15237 -1998 6440 21340 15261 1503 -36816 -35193 -18012 -9267 -4615 -8460
15245 -8460 2629 -2594 -30341 -33682 -17770 -26931 -29620 -11797 -17888 -14834 -9381 -43401 -62666
15232 -62666 -58791 -41325 -36403 -21620 -6114 15390 51075 35879 11715 9127 34 -13317
15220 -13317 -27214 -20141 -20198 -10752 -2230 -22199 -29217 -25469 -22800 -28394 -31216 -10403 -8229 -8386
15206 -8386 12309 39252 35259 -6559 -2414 -181 223 -5610 7956 12094 14873 16596 12074 960
15192 960 5261 8554 15042 1797 32992 18286 -12022 -4854 5435 -4640 17452 -4273 -20025
15179 -20025 -19944 -20756 -18428 -31208 -41861 -19901 27940 40987 36066 45794 44738 36695 8729 -8536
$$ packed form
15270g8328K5201J0868j6648J7708j2352j5228L4729L7293J0391p522l4652L830
15258b4710L8688J259j7235Q438J4900o079j3758l8319J623J7181Q745M652l845
15245h460J1089n223k7747l341J5912r161k689J7823o091L054N453l4020j9265
15232f2666L875J7466M922J4783J5506K1504L5685j5196k4164k588r093j3351
15220a3317j3897P073n7R446Q522j9969p018L748K669n594k822K0813K174j57
15206h386K0695K6943l993m1818M145K233M04n833J3566M138K779J723m522j1114
15192I60M301L293O488j3245L1195j4706l0308P168J0289j0075K2092k1725j5752
15179b0025Q1q12K328j2780j0653K1960M7841J3047m921R728j056q043k7966j7265
$$ plain form
15165 -8536 18197 29073 21292 -10803 -26757 -21276 2601 5006 35914 55943 61491 44641 34346
15152 34346 19099 30523 20047 -16437 -20769 2646 -9844 -32926 -12851 25389 17655 10721
15140 10721 33790 55744 46256 49912 50175 34499 12567 -9738 -1335 10642 43528 22302 -9505
15127 -9505 -17590 -16556 -43456 -28621 -13364 -23767 -29411 -7928 -8596 -29695 -35820 -40340 -18590
15114 -18590 -15244 -21492 -34314 -43779 -40175 396 20657 4995 5151 -6089 -4047 1617 6421
15101 6421 11754 22930 23931 25295 22166 31743 37685 4603 -18124 -5967 4387 294 -28818
15088 -28818 -20596 -18721 -31064 -12340 3578 13395 33550 31395 27865 38311 15400 12109 9426
15075 9426 38481 24406 6956 8358 3619 11843 21293 27730 9264 -17460 -30645 -31109 -22199
$$ packed form
15165h536K6733J0876p781l2095j5954N481K3877K405L0908K0029N548j6850j0295
15152C4346j5247J1424j0476l6484m332K3415j2490k3082K0075L8240p734o934
15140A0721K3069K1954r488L656K63j5676k1932k2305Q403J1977L2886k1226l1807
15127i505q085J034k6900J4835J5257j0403n644K1483o68k1099o125m520K1750
15114a8590L346o248j2822r465L604M0571K0261j5662J56j1240K042N664M804
15101F421N333J1176J001J364l129R577N942l3082k2727J2157J0354m093k9112
15088b8818Q222J875j2343J8724J5918R817K0155k155l530J0446k2911l291k683
15075I426K9055j4075j7450J402m739Q224R450O437j8466k6724j3185m64Q910
$$ plain form
15062 -22199 -9668 15462 21076 11553 8674 4473 -18172 3561 37244 35925 -2787 4448 -20901
15049 -20901 -18759 5770 12095 2603 -19283 -13921 5686 3803 -16567 -28232 1138 9633 -14355
15036 -14355 -35487 -8250 -2846 -1838 -2668 -15639 -6496 11247 -1443 -39670 -61188 -57257 -47326
15023 -47326 -25626 -1098 17166 16057 15943 -15135 -34738 -38801 -41607 -39388 -45235 -43633 -26150
15010 -26150 -508 -11502 -21010 -18927 -8968 5037 -26100 -21696 1564 -11008 -22195 -38488
14998 -38488 -2955 3735 -15927 -17620 -10698 -4007 -1397 2095 36316 55742 24714 -6803 -624
14985 -624 14256 -977 -23904 -38643 -33052 -43164 -58735 -41962 -31935 -19315 8534 2557
14973 2557 -7133 -3967 -19680 -21353 -10072 -24999 -31058 -24486 6398 16218 18235 10042 -12487
$$ packed form
15062b2199J2531K5130N614r523k879m201k2645K1733L3683j319l8712P235k5349
15049b0901K142K4529O325r492k1886N362J9607j883k0370j1665K9370Q495k3988
15036a4355k1132K7237N404J008q30j2971R143J7743j2690l8227k1518L931R931
15023d7326K1700K4528J8264j109j14l1078j9603m063k806K219n847J602J7483
15010b6150K5642j0994r508K083R959J4005l1137M404K3260j2572j1187j6293
14998c8488L5533O690j9662j693O922O691K610L492L4221J9426l1028l1517O179
14985f24J4880j5233k2927j4739N591j0112j5571J6773J0027J2620K7849n977
14973B557r690L166j5713j673J1281j4927o059O572L0884R820K017q193k2529
$$ plain form
14960 -12487 -31123 -24964 -28840 -21836 -11510 -3899 -8991 -6350 -17732 -28420 -44323 -5660 37724
14947 37724 31057 -10054 -28178 -7254 11608 9496 -12296 -31423 -19284 3298 -5585 -17576
14935 -17576 -19794 -16258 -5931 -16092 -12203 5807 -3910 -22639 -34812 -37985 -20742 1138 11232
14922 11232 18800 18517 8898 -1301 -12649 -15182 -23634 -9174 3294 7407 12175 4239 -12211
14909 -12211 -32263 -33806 -7765 17799 24094 33011 35365 9690 -12177 3374 9554 -13671 -54495
14896 -54495 -57362 -84763 -101402 -71467 -35733 -10671 -7750 11212 25750 18588 -11044 -13989
14884 -13989 -2609 -384 9251 2817 -14413 -8618 41123 15684 -31738 -43585 -29249 -8939
14872 -8939 -6185 3624 10245 3842 -3267 8407 -14182 -41998 -32390 -15855 -16833 -1509 -1428 -1143
$$ packed form
14960a2487j8636O159l876P004J0326P611n092K641j1382j0688j5903L8663M3384
14947C7724o667m1111j8124K0924J8862k112k1792j9127J2139K2582q883j1991
14935a7576k218L536J0327j0161L889J8010r717j8729j2173l173J7243K1880J0094
14922A1232P568k83r619j0199j1348k533q452J4460J2468M113M768p936j6450
14909a2211k0052j543K6041K5564O295Q917K354k5675k1867J5551O180k3225m0824
14896e4495k867k7401j6639K9935L5734K5062K921J8962J4538p162k9632k945
14884a3989J1380K225R635o434j7230N795M9741k5439m7422j1847J4336K0310
14872h939K754R809O621o403p109J1674k2589k7816R608J6535r78J5324Q1K85
$$ plain form
14858 -1143 9014 -974 -17993 -6795 411 -1500 -1802 8796 16485 23441 9462 -18887 -34588
14845 -34588 -24620 -20209 -25856 -22195 -35407 -34900 -25473 -43627 -44497 -51469 -38976 -16748 -1833 -7788
14831 -7788 13878 26642 27785 25005 4423 -15627 -34540 -34159 -33310 -27551 -10572 9542 -203
14818 -203 -32506 -20832 -661 5897 -27677 -23863 -30709 -29666 -28910 -36588 -43635 -43333 -52376 -27970
14804 -27970 -18853 -32384 -14679 15829 11250 13342 -677 -10534 -3184 -4874 -12550 -30567 -50357
14791 -50357 -32681 -9788 -11260 -10000 -3029 9014 10716 32118 18874 8167 11618 24528 27361
14778 27361 -25266 -40877 -28716 -17569 -11473 -12546 -3520 18169 5817 16878 22685 29314 -2350
14765 -2350 -43233 -69179 -57398 -30449 -28278 -30623 -26591 -13861 -40067 -33315 -26642 -50007 -50350
$$ packed form
14858a143J0157r988j7019J1198P206j911l02J0598P689O956j3979k8349j5701
14845c4588R968M411n647L661j3212N07R427j8154q70o972J2493K2228J4915n955
14831g788K1666J2764J143k780k0582k0050j8913L81Q49N759J6979K0114r745
14818b03l2303J1674K0171O558l3574L814o846J043P56p678p047L02r043K4406
14804b7970R117j3531J7705L0508m579K092j4019r857P350j690p676j8017j9790
14791e0357J7676K2893j472J260O971J2043J702K1402j3244j0707L451J2910K833
14778B7361n2627j5611J2161J1147O096j073R026K1689j2352J1061N807O629l1664
14765b350m0883k5946J1781K6949K171k345M032J2730k6206O752O673k3365l43
$$ plain form
14752 -50350 -38619 -11462 12505 -12081 -30428 -34998 -47363 -35445 -36640 -4717 14574 29478
14740 29478 5882 -26590 -5551 35884 64368 62219 39803 11380 9202 6213 -26184 -12162
14728 -12162 8430 37345 51139 42404 16264 -14930 -12760 -9622 -10564 -12584 -9164 -11201 43706
14715 43706 71218 46878 8678 -14691 7995 13389 -17060 -57106 -44213 -24929 -28931 -41128
14703 -41128 -25947 -8027 -9499 6374 8456 7431 17334 -4032 -31536 -32144 -26175 -9427 -10407
14690 -10407 -26457 -21350 -25372 -13281 -14565 -10230 -277 1039 36436 45732 6219 -18957 -34813
14677 -34813 -50823 -46355 -39334 -30369 4620 -8930 -45963 -48303 -28871 19010 30386 1579
14665 1579 -36386 -52111 -49623 -14024 -5809 -23825 -43678 -50570 -83429 -98904 -68984 -35363
$$ packed form
14752e0350J1731K7157K3967k4586j8347m570j2365J1918j195L1923J9291J4904
14740B9478k3596l2472K1039M1435K8484k149k2416k8423k178k989l2397J4022
14728a2162K0592K8915J3794q735k6140l1194K170L138r42k020L420k037N4907
14715D3706K7512k4340l8200k3369K2686N394l0449m0046J2893J9284m002j2197
14703d1128J5181J7920j472J5873K082j025R903k1366k7504o08N969J6748r80
14690a0407j6050N107m022J2091j284M335R953J316L5397R296l9513k5176j5856
14677c4813j6010M468P021Q965L4989j3550l7033k340J9432M7881J1376k8807
14665A579l7965j5725K488L5599Q215j8016j9853o892l2859j5475K9920L3621
$$ plain form
14653 -35363 5278 14368 -11996 -31024 -30394 -25620 -26594 -29026 -39378 -22438 -1440 14983 10829
14640 10829 -7155 -26832 -27069 -28778 -15503 -3970 -5183 -9359 1921 -13074 -14676 -24297 -16110
14627 -16110 -24480 -43632 -51851 -8045 -7075 957 10004 10708 -26604 -41562 -69516 -78520 -48472
14614 -48472 -38590 -29049 -5952 -1746 -23067 -21937 523 6111 -15876 -16583 -30555 -13629 -8862
14601 -8862 -1730 2482 18318 35155 15487 27496 33511 38265 26644 6166 -8972 -18561 -43704
14588 -43704 -55996 -84562 -96029 -89450 -68588 -35045 -20996 -15674 9518 35027 26769 38122
14576 38122 19554 29910 20377 18228 39467 35611 41421 41834 26524 15946 -3829 -18818 -14135
14563 -14135 -5822 22696 28246 15182 -11164 -45345 -38253 -33440 -27282 -14010 -19296 -4480 5543
$$ packed form
14653c5363M0641R090k6364j9028O30M774r74k432j0352J6940K0998J6423m154
14640A0829j7984j9677k37j709J3275J1533j213m176J1280j4995j602r621Q187
14627a6110q370j9152q219M3806R70Q032R047P04l7312j4958k7954r004L0048
14614d8472R882R541K3097M206k1321J130K2460N588k1987p07j3972J6926M767
14601h862P132M212J5836J6837j9668J2009O015M754j1621k0478j5138r589k5143
14588d3704j2292k8566j1467O579K0862L3543J4049N322K5192K5509q258J1353
14576C8122j8568J0356r533k149K1239l856N810M13j5310j0578j9775j4989M683
14563a4135Q313K8518N550j3064k6346l4181P092M813O158J3272n286J4816J0023
$$ plain form
14550 5543 -12216 -19737 -19209 462 3157 -812 -3526 -16142 -6644 -1019 -20885 -50605 -31493
14537 -31493 -35719 -27613 -52186 -82122 -79510 -51349 -23476 -13565 21257 22868 2360 -14684 -15503
14524 -15503 -28014 -45216 -55497 -44215 -43322 -58389 -52690 -45976 -71142 -94523 -64868 -52955
14512 -52955 -22212 17597 3577 -38987 -52554 -72388 -88346 -85250 -78475 -64211 -39788 -35519
14500 -35519 -49967 -44322 -46240 -53937 -43770 -19560 -2726 13821 29330 45082 29282 -26823
14488 -26823 -47366 -22734 -16003 -38862 -68940 -51041 -12825 -3903 -1577 7046 -3014 -13336
14476 -13336 -9550 -13468 -32062 -40538 -19962 -4559 10830 16904 23277 24781 1593 -14302 -20243
14463 -20243 -5487 -16426 -36738 -32008 -29902 -36054 -36780 -41720 -25356 -8931 -18634 -18762 -34358
$$ packed form
14550E543j7759p521N28J9671K695l969k714j2616R498N625j9866k9720J9112
14537c1493m226Q106k4573k9936K612K8161K7873R911L4822J611k0508j7044q19
14524a5503j2511j7202j0281J1282Q93j5067N699O714k5166k3381K9655J1913
14512e2955L0743L9809j4020m2564j3567j9834j5958L096O775J4264K4423M269
14500c5519j4448N645j918p697J0167K4210J6834J6547J5509J5752j5800n6105
14488b6823k0543K4632O731k2859l0078J7899L8216Q922K326Q623j0060j0322
14476a3336L786l918j8594q476K0576J5403J5389O074O373J504k3188j5895n941
14463b0243J4756j0939k0312M730K106o152p26m940J6364J6425r703j28j5596
$$ plain form
14450 -34358 -19810 -15524 -26241 -27425 -28324 -36469 -30822 -32639 -16180 -11028 -29615 -55399 -61095
14437 -61095 -6720 7821 -3144 -2916 -2782 -30372 -53841 -78770 -71260 -60832 -67661 -69752 -51065
14424 -51065 -49496 -28181 7167 9447 3089 -374 -24207 -42329 -13348 20323 31331 32201 11592
14411 11592 -16417 -39567 -40683 -5173 -13397 -35730 -9937 -8490 -20515 -19252 -25628 -24012 -14619
14398 -14619 -18407 -27218 -42999 -34162 -40718 -43714 -28316 -35130 -45629 -25861 -21480 -28828 -25634
14385 -25634 -38502 -30411 -23587 -11415 -17961 -24126 -23318 -41172 -37178 4222 -8559 6869 6220
14372 6220 11797 -8239 -19762 -20188 -16051 -14991 -22167 -23625 -7378 -8769 -14088 -7770 -27660 -38911
14358 -38911 -30170 -34056 -45595 -43662 -44819 -49208 -54771 -43749 -22714 -58715 -63902 -35207 -9498
$$ packed form
14450c4358J4548M286j0717j184q99q145N647j817J6459N152j8587k5784n696
14437f1095N4375J4541j0965K28J34k7590k3469k4929P510J0428o829k091J8687
14424e1065J569K1315L5348K280o358l463k3833j8122K8981L3671J1008Q70k0609
14411A1592k8009k3150j116L5510q224k2333K5793J447j2025J263o376J616R393
14398a4619l788q811j5781Q837o556k996J5398o814j0499J9768M381p348L194
14385b5634j2868Q091O824J2172o546o165Q08j7854L994M1400j2781J5428o49
14372F220N577k0036j1523m26M137J060p176j458J6247j391n319O318j9890j1251
14358c8911Q741l886j1539J933j157m389n563J1022K1035l6001n187K8695K5709
$$ plain form
14345 -9498 -26952 -42328 -52509 -62921 -45416 -779 -2432 -22561 -21363 -23661 -18497 -23143 -10976
14332 -10976 -29398 -37193 -28671 -16691 -21864 -38623 -44629 -40785 -49998 -37014 -7787 3090 432
14319 432 -6149 -2429 -1473 -14652 -5858 -13149 -18743 -11413 4420 7386 8638 19134 10268 -11569
14305 -11569 -40024 -64461 -86868 -86125 -49498 -19255 -8979 -16675 -39698 -40338 -34928 -36155 -35503
14292 -35503 -37564 -35311 -52099 -47020 -66973 -71147 -71562 -64786 -61028 -48620 -47430 -19328 -16812 -26130
14278 -26130 -28477 -26162 -23412 -37630 -26396 -18748 -19411 8604 22406 5983 -7649 -19843 -8081
14265 -8081 9163 -2986 -4907 -339 2164 -23964 -50081 -12426 10574 29764 21377 17777 260
14252 260 -28485 -28082 7084 3710 9910 16395 -1650 -13534 11057 19172 4498 -10204 -11539
$$ packed form
14345i498j7454j5376j0181j0412J7505M4637j653k0129J198k298N164m646J2167
14332a0976j8422p795Q522J1980n173j6759o006L844r213J2984K9227J0877k658
14319D32o581L720R56j3179Q794p291n594P330J5833K966J252J0496q866k1837
14305a1569k8455k4437k2407P43L6627L0243J0276p696k3023o40N410j227O52
14292c5503k061K253j6788N079j9953m174m15O776L758J2408J190K8102K516r318
14278b6130k347K315K750j4218J1234P648o63K8015J3802j6423j3632j2194J1762
14265h081J7244j2149j921M568K503k6128k6117L7655K3000J9190q387l600j7517
14252B60k8745M03L5166l374O200O485j8045j1884K4591Q115j4674j4702j335
$$ plain form
14239 -11539 13824 -4007 -19601 -55208 -54172 -54065 -68941 -69658 -57967 -65241 -84362 -68864 -62629
14226 -62629 -61736 -63053 -57469 -28829 -16597 -10421 -9473 13565 18393 14803 25391 18764 -9157 -13366
14212 -13366 447 665 -5169 382 -1950 14402 1371 -32472 -43900 -38442 -38289 -42012 -18950
14199 -18950 -866 -6428 5747 -11788 -26764 -29423 -27178 -33677 -62248 -58906 -14121 -5327 7384
14186 7384 21329 13607 5756 27652 36901 35396 17173 11040 12072 10074 -2386 -23525 -30888
14173 -30888 -30031 -6992 8849 -14700 -32225 -12646 23127 41596 48669 26539 -2337 -5443
14161 -5443 -4802 -10276 -39064 -29815 -51514 -54476 -27483 -41131 -68269 -71398 -67147 -62158 -40705
14148 -40705 -26482 -23278 -2061 6814 1932 -6803 -20064 -24050 -18484 -12030 27298 31332 5190
$$ packed form
14239a1539K5363j7831j5594l5607J036J07j4876p17J1691p274j9121J5498O235
14226f2629Q93j317N584K8640J2232O176R48K3038M828l590J0588o627k7921m209
14212a3366J3813K18n834N551k332J6352j3031l3843j1428N458J53l723K3062
14199a8950J8084n562J2175j7535j4976k659K245o499k8571L342M4785Q794J2711
14186G384J3945p722p851K1896R249j505j8223o133J032j998j2460k1139p363
14173c0888Q57K3039J5841k3549j7525J9579L5773J8469P073k2130k8876l106
14161e443O41n474k8788R249k1699k962K6993j3648k7138l129M251M989K1453
14148d0705J4223L204K1217Q875m882q735j3261l986N566O454L9328M034k6142
$$ plain form
14135 5190 -12765 -20014 10880 21538 15634 -2074 -23835 -9510 -18355 -26674 13302 18598 -689
14122 -689 -13758 -26893 -12412 -25349 -36966 -27754 -19409 -7608 1802 12080 2686 -22692 -25564
14109 -25564 -7431 34499 33645 865 -23845 -17723 -21479 -38069 -11367 22687 19683 -10672 -18654
14096 -18654 -13810 -46883 -31913 -12104 -31318 -14327 -40731 -43100 -24266 -48279 -60951 -50923
14084 -50923 -52696 -72830 -51900 -14878 -3051 -20538 -43003 -40687 -33224 -16431 -26218 -31004 -23206
14071 -23206 -33637 -26067 -22090 -30705 -30971 -28092 -31365 -24239 -4420 -6961 5053 -15834 -22810 -40435
14057 -40435 -60496 -39865 -26114 -41930 -64181 -45112 -47179 -40999 -23178 -10459 -22162 -12577
14045 -12577 -24596 -42683 -33824 -6899 16494 27640 28541 27984 5782 -24840 -28228 -17852 -14656
$$ packed form
14135E190j7955p249L0894J0658n904j7708k1761J4325q845q319L9976N296j9287
14122f89j3069j3135J4481j2937j1617R212Q345J1801R410J0278r394k5378k872
14109b5564J8133M1930q54l2780k4710O122l756j6590K6702L4054l004l0355p982
14096a8654M844l3073J4970J9809j9214J6991k6404k369J8834k4013j2672J0028
14084e0923j773k0134K0930L7022J1827j7487k2465K316P463J6793r787m786P798
14071b3206j0431P570L977q615k66K879l273P126J9819k541J2014k0887o976j7625
14057d0435k0061K0631J3751j5816k2251J9069k067O180J7821J2719j1703R585
14045a2577j2019j8087Q859K6925K3393J1146R01n57k2202l0622l388J0376L196
$$ plain form
14032 -14656 9783 31429 38996 -803 -32280 -37570 -44385 -23148 1585 -1412 4514 2576 -3621
14019 -3621 6866 17182 36077 24120 16747 4264 -7064 -41499 -44717 -29235 -37473 -57735
14007 -57735 -62491 -49244 -59835 -72082 -50474 -9550 950 -14192 686 17533 -2601 -1607
13995 -1607 -12174 -24144 -27553 -27493 -39252 -19277 4678 -4373 -18974 -57721 -41326 -17984 -42843
13982 -42843 -41638 -22932 -18066 -12638 -15861 6392 -9870 -17403 -46237 -32379 -49212 -43434 -33304
13969 -33304 -38852 -6645 33537 23851 -29948 -36538 -44420 -65151 -45691 -42857 -36324 -31585 -13219
13956 -13219 -11528 1695 9482 -10124 -16798 -17448 -2857 -7791 -3326 -24435 -6352 -2456 -36658
13943 -36658 -55180 -41473 36 20370 6232 -21885 -12831 -27078 -38863 -19861 -15974 5028
$$ packed form
14032a4656K4439K1646P567l9799l1477n290o815K1237K4733k997N926j938o197
14019c621J0487J0316J8895j1957p373j2483j1328l4435l218J5482q238k0262
14007e7735m756J3247j0591j2247K1608M0924J0500j5142J4878J6847k0134R94
13995a607j0567j1970l409O0j1759J9975K3955r051j4601l8747J6395K3342k4859
13982d2843J205J8706M866N428l223K2253j6262p533k8834J3858j6833N778J0130
13969c3304n548L2207M0182r686n3799o590p882k0731J9460K834O533M739J8366
13956a3219J691J3223P787j9606o674o50J4591m934M465k1109J8083L896l4202
13943c6658j8522J3707M1509K0334j4138k8117R054j4247j1785J9002L887K1002
$$ plain form
13931 5028 12735 32745 61724 61248 49215 12168 972 -1869 -17340 -20790 -29449 -33354 -45363
13918 -45363 -25529 -17219 -30124 -42510 -59481 -50552 -24376 -36583 -36084 -35474 -37249 -25859 -18398
13905 -18398 -13766 -3729 3043 20849 26931 17117 31039 6588 -14072 1842 35671 37254 12627
13892 12627 18294 20030 18323 27602 30575 21755 -8081 -22875 -1567 16798 17765 -3819 419
13879 419 3753 18286 11745 -7373 -14637 -35517 -29922 -11797 -5483 -20081 -4265 -428 896
13866 896 14579 -17860 -54379 -25040 -37165 -56225 -50575 -24723 -30017 -46958 -55001 -33810 -16460
13853 -16460 -26739 -31759 -26917 -30621 -16539 -28717 -53560 -35616 -26503 -18220 -2881 4070 -25893
13840 -25893 -54928 -57983 -60187 -52968 -45733 -38220 -38342 -46629 -47384 -16303 4693 10365 -12396 -28165
$$ packed form
13931E028P707K0010K8979m76j2033l7047j1196k841j5471l450q659l905j2009
13918d5363J9834Q310j2905j2386j6971Q929K6176j2207M99O10j775J1390P461
13905a8398M632J0037O772J7806O082r814J3922k4451k0660J5914L3829J583k4627
13892A2627N667J736j707R279K973q820k9836j4794K1308J8365R67k1584M238
13879D19L334J4533o541j9118p264k0880N595J8125O314j4598J5816L837J324
13866H96J3683l2439l6519K9339j2125j9060N650K5852n294j6941q043K1191J7350
13853a6460j0279n020M842l704J4082j2178k4843J7944R113Q283J5339O951k9963
13840b5893k9035l055k204P219P235P513j22q287p55L1081K0996N672k2761j5769
$$ plain form
13826 -28165 -19921 -5139 -8389 -19393 -22694 85 -17011 -33527 -45729 -41787 -29253 -34545 -32176
13813 -32176 -23191 -34784 -42499 -22151 -27016 -38828 -30256 -34841 -39435 -22967 -14387 -10059 22899
13800 22899 45253 14205 -26616 -71041 -64557 -55369 -47306 -32985 -39870 -31110 -6136 3308 -8560
13787 -8560 3479 -4322 642 23020 10803 9100 4557 5902 4353 -1793 -16499 -16130 15155 25127
13773 25127 23962 12748 14753 16181 24198 25855 13104 8662 2536 -3064 -13996 -32586 -11096
13760 -11096 679 19687 -4126 -33951 -44560 -74126 -83740 -68655 -59276 -40621 -49381 -29861
13748 -29861 -3866 2882 13986 17082 -618 -10272 11553 6978 -3372 -5500 9829 -221 -10466
13735 -10466 -11641 -654 -3525 -10359 -37346 -53655 -61955 -61159 -40774 -21509 -27698 -52262 -40979
$$ packed form
13826b8165Q244J4782l250j1004l301K2779j7096j6516j2202L942J2534n292K369
13813c2176Q985j1593p715K0348m865j1812Q572m585m594J6468Q580M328L2958
13800B2899K2354l1048m0821m4425O484R188Q063J4321o885Q760K4974R444j1868
13787h560J2039p801M964K2378j2217j703m543J345j549o146j4706L69L1285R972
13773B5127j165j1214K005J428Q017J657j2751m442o126n600j0932j8590K1490
13760a1096J1775J9008k3813k9825j0609k9566r614J5085R379J8655q760J9520
13748b9861K5995O748J1104L096j7700r654K1825m575j0350k128J5329j0050j0245
13735a0466j175J0987k871o834k6987j6309q300P96K0385J9265o189k4564J1283
$$ plain form
13722 -40979 -28732 -18364 -26917 -46342 -78904 -46730 -16772 7075 11496 -15553 2876 3780
13710 3780 -19153 -32949 6600 14074 -982 -23539 -36723 7248 21214 -24536 -71106 -59771
13698 -59771 -23591 -21323 -26117 4349 -6685 -41565 -64686 -22064 4165 -11414 -11546 -2965 4937
13685 4937 -20514 -12443 10556 19185 17074 -12464 -15298 -9218 -3179 5944 22813 4362 7261
13672 7261 -11569 -22184 -30480 -22015 -40657 -44955 -16652 -18067 -26272 -24686 -31458 -29005 -22686 -1754
13658 -1754 -20508 -21765 -20957 -68 27465 23834 21724 22091 19490 6996 -14849 -19219 -39257 -62414
13644 -62414 -76273 -49833 -58187 -34435 -17544 -21547 -13452 19410 19738 -1270 -5305 10433 -5014
13631 -5014 -12009 -3492 16572 13734 -24075 -47688 -34264 -65171 -65046 -40853 -50404 -31306 -27677
$$ packed form
13722d0979J2247J0368q553j9425l2562L2174K9958K3847M421k7049J8429R04
13710C780k2933j3796L9549P474j5056k2557j3184M3971J3966m5750m6570J1335
13698e9771L6180K268m794L0466j1034l4880k3121M2622K6229j5579j32Q581P902
13685D937k5451Q071K2999Q629k111k9538k834O080O039R123J6869j8451K899
13672G261j8830j0615q296Q465j8642m298K8303j415q205J586o772K453O319K0932
13658a754j8754j257Q08K0889K7533l631k110L67k601j2494k1845m370k0038k3157
13644f2414j3859K6440q354K3752J6891m003Q095L2862L28k1008m035J5738j5447
13631e014o995Q517K0064k838l7809k3613J3424l0907J25K4193r551J9098L629
$$ plain form
13618 -27677 -33847 -27615 -28597 -39403 -71107 -71184 -42274 -30058 -56564 -43243 -32199 -4789 555
13605 555 8984 13543 26862 39862 10489 2462 -6370 -15886 2658 36168 24043 30000 64930
13592 64930 55523 21704 21839 51928 25812 -7732 -32639 -10256 17816 13584 13346 -11000 -17437
13579 -17437 -23736 -11434 -370 4729 7615 -8101 -6883 -24657 -26856 -23844 20161 9745 954
13566 954 33461 22712 -9157 -30627 -34196 244 -5389 -17217 -35598 -41702 -2098 2640 26798
13553 26798 24524 39571 58944 31296 -11038 -5108 14473 39869 80358 72804 47828 30083
13541 30083 2141 -5477 -15095 -29299 -32621 -21947 -25876 -24498 -32904 -29694 -25725 11467 4395
13528 4395 -26525 -25076 -14122 -33660 -13460 -10208 -15296 16850 4103 -23470 -17124 -17933 -15801
$$ packed form
13618b7677o170O232r82j0806l1704p7K8910J2216k6506J3321J1044K7410N344
13605E55Q429M559J3319J3000k9373q027q832r516J8544L3510j2125N957L4930
13592F4930r407l3819J35L0089k6116l3544k4907K2383K8072m232k38k4346o437
13579a7437o299J2302J1064N099K886j5716J218j7774k199L012M4005j0416q791
13566I54L2507j0749l1869k1470l569L4440n633j1828j8381o104L9604M738K4158
13553B6798k274J5047J9373k7648m2334N930J9581K5396M0489p554k4976j7745
13541C0083k7942p618r618j4204l322J0674l929J378q406L210L969L7192p072
13528D395l0920J449J0954j9538K0200L252n088L2146j2747k7573O346q09K132
$$ plain form
13515 -15801 -36635 -18277 6526 23844 -13003 -39515 -24532 -29038 -44903 -49745 -31338 -25893
13503 -25893 887 -7842 6264 39967 22196 9160 21117 22206 10550 -8384 4795 7354
13491 7354 10768 12956 9850 11951 22996 29558 12933 -1527 -21782 14702 37357 22436 657
13478 657 -10391 -16191 -17394 -12444 -9594 -19589 -14405 5529 -15259 -30161 -33552 -42036 -38934 -22054
13464 -22054 -18071 15487 43461 19383 -26627 826 14386 -10775 -21302 -15313 -16935 -18305
13452 -18305 -47737 -77362 -79912 -62164 -47399 -35567 -27941 -11270 -13927 -29286 -38324 -60197
13440 -60197 -36802 -8664 -1724 -9297 -18402 -16142 -12681 -7155 -13876 -9513 -17489 -2665 35518
13427 35518 29656 -1383 -2922 2025 24021 19361 11114 -1966 -5266 -5653 -7166 -4534 2317 14931
$$ packed form
13515a5801k0834J8358K4803J7318l6847k6512J4983m506j5865m842J8407N445
13503b5893K6780q729J4106L3703j7771j3036J1957J089j1656j8934J3179K559
13491G354L414K188l106K101J1045O562j6625j4460k0255L6484K2655j4921k1779
13478F57j1048n800j203M950K850r995N184J9934k0788j4902l391q484L102J6880
13464b2054L983L3558K7974k4078m6010K7453J3560k5161j0527N989j622j370
13452a8305k9432k9625k550J7748J4765J1832P626J6671k657j5359r038k1873
13440f0197K3395K8138O940p573r105K260L461N526o721M363p976J4824L8183
13427C5518n862l1039j539M947K1996m660q247j3080l300l87j513K632O851J2614
$$ plain form
13413 14931 22933 -2657 -3163 -1613 -8993 -42432 -50685 -27980 -16459 1899 5160 41641 48016
13400 48016 40939 11442 -12575 -10635 1497 6674 9769 18902 44505 30303 2139 6334 8349
13387 8349 -7511 -8141 21982 29297 9746 10588 385 -25070 -9126 1346 -5295 -9877 -12650
13374 -12650 -43188 -35827 -27889 -28194 -36264 -8195 -33269 -52775 -49392 -49385 -24203 -36527 -35608 -39716
13360 -39716 -21846 -8132 -17246 -28940 -59475 -68637 -62234 -68483 -56630 -19441 -1715 16647
13348 16647 18119 1865 -1679 -54 2646 4219 2786 19008 29652 10770 -10681 4542 22320
13335 22320 39207 35596 44502 4422 6610 -1561 -1884 5361 25655 18400 21012 13874 -29709 -44481
13321 -44481 -57879 -53137 -56596 -56841 -61038 -43071 -12071 -4673 -27884 -39700 -39355 -37697 -20465
$$ packed form
13413A4931Q002k5590n06J550p380l3439q253K2705J1521J8358L261L6481O375
13400D8016p077k9497k4017J940J2132N177L095R133K5603j4202k8164M195K015
13387H349j5860o30L0123P315j9551Q42j0203k5455J5944J0472o641m582k773
13374a2650l0538P361P938l05q070K8069k5074j9506L383PK5182j2324R19m108
13360c9716J7870J3714r114j1694l0535r162O403o249J1853L7189J7726J8362
13348A6647J472j6254l544J625K700J573j433J6222J0644j8882k1451J5223J7778
13335B2320J6887l611Q906m0080K188q171l23P245K0294p255K612p138m3583j4772
13321d4481j3398M742l459k45m197J7967L1000P398k3211j1816L45J658J7232
$$ plain form
13308 -20465 -32764 -35145 -51418 -33725 -734 35865 14473 -1900 -14035 -19454 -15711 -18943
13296 -18943 -38456 -26245 -37665 -24733 -2153 -5107 -27946 -25984 -16030 -22808 -31905 -39680 -58574
13283 -58574 -71685 -36220 13406 22687 -3924 -34698 -53668 -46094 -40732 -28717 6736 24196
13271 24196 33849 7584 -53868 -58527 -54545 -46282 -17596 -1294 9336 6772 -1475 -20285 -33660
13258 -33660 -10051 -5441 -7405 995 13398 -2503 -49 -6496 15180 18042 19640 16351 24141
13245 24141 18542 -16009 -26771 -8319 23397 14942 1467 -6329 7426 9141 14299 6314 -2146
13232 -2146 -3339 13537 24733 5021 20636 41959 34492 62188 60084 13692 5058 -11260 -37599
13219 -37599 -45488 -20154 2197 -9198 -30104 -44530 -33189 -15298 -15229 -8629 1462 -9224 -24064
$$ packed form
13308b0465j2299k381j6273J7693L2991L6599k1392j6373j2135n419L743l232
13296a8943j9513J2211j1420J2932K2580k954k2839J962R954o778r097p775j8894
13283e8574j3111L5465M9626R281k6611l0774j8970P574N362J2015L5453J7460
13271B4196R653k6265o1452m659L982Q263K8686J6302J0630k564q247j8810j3375
13258c3660K3609M610j964Q400J2403j5901K454o447K1676K862J598l289P790
13245B4141n599l4551j0762J8452L1716q455j3475p796J3755J715N158p985q460
13232b146j193J6876J1196j9712J5615K1323p467K7696k104m6392q634j6318k6339
13219c7599p889K5334K2351j1395k0906j4426J1341J7891O9O600J0091j0686j4840
$$ plain form
13206 -24064 -25470 -31767 -45065 -36115 5418 4952 -4490 -7474 621 -6843 -7189 -20262 -18707 7746
13192 7746 28026 22849 36966 17168 1936 3171 20819 6180 -7038 -11210 -22440 -40676
13180 -40676 -29721 -4698 9812 15319 21638 19347 -11413 -37148 -42712 -12740 -15509 -38416 -43332
13167 -43332 -47814 -69820 -97667 -73254 -49132 -16781 6496 19574 -869 -19489 -15301 -2978
13155 -2978 9414 -11385 22829 21368 -19678 -31761 -49716 -47890 -43627 -32206 -28926 -24504 -33653
13142 -33653 -39920 -9085 6152 -6176 -9707 25822 35974 18894 -1146 11609 25829 26256
13130 26256 21123 11585 6031 4791 -2186 2559 -18740 -20144 -31995 -47794 -17832 -11991 -1306
13117 -1306 18124 6774 4418 -13099 -12697 4715 25624 41070 14963 10006 -12879 -15201 -16828
$$ packed form
13206b4064j406o297j3298Q950M1533m66r442k984Q095p464l46j3073J555K6453
13192G746K0280n177J4117j9798j5232J235J7648j4639j3218m172j1230j8236
13180d0676J0955K5023J4510N507O319k291l0760k5735n564K9972k769k2907m916
13167d3332m482k2006k7847K4413K4122L2351K3277J3078k0443j8620M188J2323
13155b978J2392k0799L4214j461m1046j2083j7955J826M263J1421L280M422r149
13142c3653o267L0835J5237j2328l531L5529J0152j7080k0040J2755J4220M27
13130B6256n133r538n554j240o977M745k1299j404j1851j5799K9962N841J0685
13117a306J9430j1350k356j7517M02J7412K0909J5446k6107m957k2885k322j627
$$ plain form
13104 -16828 4299 31578 31754 20372 24270 34242 5371 -37192 -13251 13459 17381 -9131 -9863
13091 -9863 19848 55651 61064 50489 23251 6427 17867 9420 4059 -14827 -3058 -15932
13079 -15932 -1901 3486 5344 12132 46624 46828 14732 4151 30172 38584 9763 -4460 -15827
13066 -15827 -7948 -11893 -6384 10494 23398 38630 40104 20095 10538 3261 22552 19105 15413
13053 15413 16340 23359 24306 1462 -1655 11848 43250 57696 60528 55120 45345 25079 -4575
13040 -4575 278 5840 -3088 17125 39639 33537 26220 9914 13654 7046 3913 11147 14187 16224
13026 16224 -4740 -4796 13192 55293 74947 61330 77777 109140 138096 206569 216862 215987 239658
13013 239658 231751 198543 169538 134483 90253 79977 78362 70938 69811 83455 98942 73343
$$ packed form
13104a6828K1127K7279J76j1382L898R972k8871m2563K3941K6710L922k6512p32
13091i863K9711L5803N413j0575k7238j6824J1440q447n361j8886J1769j2874
13079a5932J4031N387J858O788L4492K04l2096j0581K6021Q412k8821j4223j1367
13066a5827P879l945N509J6878J2904J5232J474k0009r557p277J9291l447l692
13053A5413R27P019R47k2844l117J3503L1402J4446K832n408r775k0266k9654
13040d575M853N562q928K0213K2514o102p317j6306L740o608l133P234L040K037
13026A6224k0964n6J7988M2101J9654j3617J6447L1363K8956O8473J0293q75K3671
13013B39658p907l3208k9005l5055m4230j0276j615p424j127J3644J5487k5599
$$ plain form
13001 73343 95288 109157 113295 102666 128144 174894 185992 221701 244209 247790 247576 287754
12989 287754 332558 344809 375616 475258 569288 696676 830399 977546 1168584 1380094
12979 1380094 1551643 1634488 1600501 1529161 1385843 1230009 1066698 919295 822636 716949
12969 716949 624063 556578 464247 376781 312845 250120 217943 190968 145575 119819 127446 122891
12957 122891 138698 147101 139062 113712 84564 80205 109091 114501 89934 84780 71700 45806
12945 45806 44492 35746 58589 64460 58250 51425 30931 55477 48987 47461 50981 64121 44938
12932 44938 61418 75770 66850 55105 68663 88673 104993 106401 118715 119888 112966 126458
12920 126458 131769 102888 88626 74391 48512 28257 5595 -43225 -67474 -60247 -13832 44587
$$ packed form
13001G3343K1945J3869M138j0629K5478M6750J1098L5709K2508L581k14M0178
12989B87754M4804J2251L0807R9642R4030J27388J33723J47147J91038K11510
12979A380094J71549Q2845l3987p1340j43318j55834j63311j47403r6659j05687
12969G16949r2886o7485r2331q7466o3936o2725l2177k6975m5393k5756P627m555
12957A22891J5807Q403q039k5350k9148m359K8886N410k4567n154j3080k5894
12945D5806j314q746K2843N871o210o825k0494K4546o490j526L520J3140j9183
12932D4938J6480J4352q920j1745J3558K0010J6320J408J2314J173o922J3492
12920A26458N311k8881j4262j4235k5879k0255k2662m8820k4249P227M6415N8419
$$ plain form
12908 44587 45822 55920 57918 21079 27785 52243 14194 9432 10364 1319 22938 37598 43452
12895 43452 64014 51707 48822 54687 40169 36798 38495 50650 18946 15821 36510 69515 77927
12882 77927 58389 70116 64139 61675 45454 45692 83218 99319 93619 104869 114604 133216 148016
12869 148016 115052 79934 90435 99206 109153 112307 81229 61904 64680 68889 75827 122547 157186
12856 157186 154478 139278 142723 140268 133609 129866 107877 108963 100280 93408 122641 112007 93469
12843 93469 124158 154640 156944 162890 195233 211420 204451 169355 148466 136756 144218 149737 176311
12830 176311 197178 240377 314723 393117 513642 665170 870237 1121193 1415629 1732669
12820 1732669 1971546 2073459 2008129 1783674 1515048 1228756 959862 777414 645802 526704
$$ packed form
12908D4587J235J0098J998l6839O706K4458l8049m762R32r045K1619J4660N854
12895D3452K0562j2307k885N865j4518l371J697J2155l1704l125K0689L3005Q412
12882G7927j9538J1727n977k464j6221K38L7526J6101n700J1250R735J8612J4800
12869A48016l2964l5118J0501Q771R947L154l1078j9325K776M209O938M6720L4639
12856A57186k708j5200L445k455o659l743k1989J086q683o872K9233j0634j8538
12843I3469L0689L0482K304N946L2343J6187o969l5096k0889j1710P462N519K6574
12830A76311K0867M3199P4346P8394J20525J51528K05067K50956K94436L17040
12820A732669K38877J01913o5330k24455k68626k86292k68894j82448j31612j19098
$$ plain form
12810 526704 438801 364620 321665 273786 258096 265553 268679 256150 267220 275033 240650 209360
12798 209360 203772 210221 209043 205721 190758 184104 182427 209300 225271 216151 222290 221088 201700
12785 201700 199864 195340 202091 210115 205633 209222 203893 198715 198359 252473 267558 252484 273476
12772 273476 298038 302442 260960 219462 212220 219294 229567 230254 222924 226286 184941 174544 184173
12759 184173 192969 165159 164458 190500 188016 168291 190657 207983 194285 211359 202292 166148
12747 166148 157759 186399 160127 143608 163848 167236 138844 119651 126675 148564 164533 163769
12735 163769 174206 151533 104900 98796 100331 88873 92051 107955 141161 150713 129491 163499
12723 163499 166717 181900 198750 198834 208063 203509 217996 222011 203397 189353 166831 180623 218625
$$ packed form
12810E26704q7903p4181m2955m7879j5690P457L126j2529J1070P813l4383l1290
12798B09360n588O449j178l322j4963o654j677K6873J5971r120O139j202j9388
12785B01700j836m524O751Q024m482L589n329n178l56N4114J5085j5074K0992
12772B73476K4562M404m1482m1498p242P074J0273O87p330L362m1345j0397R629
12759A84173Q796k7810p01K6042k484j9725K2366J7326j3698J7074r067l6144
12747A66148q389K8640k6272j6519K0240L388k8392j9193P024K1889J5969p64
12735A63769J0437k2673m6633o104J535j1458L178J5904L3206R552k1222L4008
12723A63499L218J5183J6850Q4R229m554J4487M015j8614j4044k2522J3792L8002
$$ plain form
12710 218625 245663 269963 274638 290894 285881 288099 302617 308714 293974 298249 280881 264044
12698 264044 271835 291965 291959 274405 254456 253235 274971 279377 302586 323643 332178 325112 323131
12685 323131 354277 364615 347631 296016 209756 125277 27134 -65028 -104305 -132148 -145333
12674 -145333 -116739 -102896 -90683 -59809 -32764 -1529 23983 74856 101688 117996 125934 112291
12662 112291 136784 133410 155817 180822 230953 245673 263358 306707 343690 339354 344732 331153
12650 331153 336314 369607 420917 464375 470591 448562 405300 376405 355319 335531 316126 312716
12638 312716 350832 399802 412102 434223 491634 507437 521198 542757 575064 602201 629678
12627 629678 674236 688807 676052 693552 710617 734516 712838 690175 694294 718111 713886 713844
$$ packed form
12710B18625K7038K4300M675J6256n013K218J4518O097j4740M275j7368j6837
12698B64044P791K0130oj7554j9949j221K1736M406K3209K1057Q535p066j981
12685C23131L1146J0338j6984n1615q6260q4479r8143r2162l9277k7843j3185
12674a45333K8594J3843J2213L0874K7045L1235K5512N0873K6832J6308P938j3643
12662A12291K4493l374K2407K5005N0131J4720J7685M3349L6983m336N378j3579
12650C31153N161L3293N1310M3458O216k2029m3262k8895k1086j9788j9405l410
12638C12716L8116M8970J2300K2121N7411J5803J3761K1559L2307K7137K7477
12627F29678M4558J4571j2755J7500J7065K3899k1678k2663M119K3817m225m2
$$ plain form
12615 713844 722718 766005 795137 791672 764045 775992 774801 754360 743110 743507 749281 771273 789889
12602 789889 785704 789689 817221 871764 899974 909152 910049 932444 952095 967555 976086 1010896 1037752
12589 1037752 1071831 1102069 1145773 1199947 1250143 1295114 1351834 1403574 1458475 1541056 1607904
12578 1607904 1668857 1759276 1826123 1890120 1958262 2050583 2158203 2273222 2390011 2510056
12568 2510056 2674369 2850029 2995738 3114553 3233936 3380149 3490482 3571813 3728147 3922975
12558 3922975 4167541 4449464 4742644 5038980 5393742 5781812 6229627 6703412 7229504
12549 7229504 7829190 8522699 9335114 10259426 11297725 12528493 13962356 15595124 17467767
12540 17467767 19694104 22328036 25459749 29152224 33531804 38786355 45330759 53715437
$$ packed form
12615G13844Q874M3287K9132l465k7627J1947j191k0441j1250L97N774K1992J8616
12602G89889m185L985K7532N4543K8210R178Q97K2395J9651J5460Q531L4810K6856
12589A037752L4079L0238M3704N4174N0196M4971N6720N1740N4901Q2581O6848
12578A607904O0953R0419O6847O3997O8142R2321J07620J15019J16789J20045
12568B510056J64313J75660J45709J18815J19383J46213J10333Q1331J56334J94828
12558C922975K44566K81923K93180K96336L54762L88070M47815M73785N26092
12549G229504N99686O93509Q12415R24312J038299J230768J433863J632768J872643
12540A7467767K226337K633932L131713L692475M379580N254551O544404Q384678
$$ plain form
12532 53715437 64649940 79176425 98788892 125264398 160587839 205790289 258328036
12525 258328036 309112722 345818355 359184547 345607245 309707725 261223430 210638401
12518 210638401 166613189 132247653 106534394 87443204 73168831 62322587 53870176
12511 53870176 47110719 41523598 36749749 32635078 29044711 25924522 23259260 21004087
12503 21004087 19113774 17556070 16242451 15105552 14110865 13205434 12401671 11663964 10964088
12494 10964088 10335640 9751162 9218044 8717937 8224911 7719456 7261271 6835676 6442053
12485 6442053 6069003 5717284 5453288 5232195 5010535 4804133 4623053 4455519 4271410
12476 4271410 4118386 3987060 3876202 3752369 3635688 3506849 3355057 3217107 3121480 3039731
$$ packed form
12532E3715437J0934503J4526485J9612467K6475506L5323441M5202450N2537747
12525B58328036N0784686L6705633J3366192j3577302l5899520m8484295n0585029
12518B10638401m4025212l4365536k5713259j9091190j4274373j0846244q452411
12511E3870176o759457n587121m773849m114671l590367l120189k665262k255173
12503B1004087j890313j557704j313619j136899r94687r05431q03763p37707o99876
12494A0964088o28448n84478n33118n00107m93026n05455m58185m25595l93623
12485F442053l73050l51719k63996k21093k21660k06402j81080j67534j84109
12476D271410j53024j31326j10858j23833j16681j28839j51792j37950r5627q1749
$$ plain form
12466 3039731 2971208 2867800 2782156 2714088 2642431 2548471 2501986 2437063 2378526 2343112 2287621
12455 2287621 2177634 2098214 2047740 2010872 1981426 1959813 1932352 1902050 1893192 1863849 1831877
12444 1831877 1829547 1831936 1803318 1776254 1749116 1735857 1733172 1711977 1702451 1696195 1708583 1692921
12432 1692921 1648216 1662383 1688544 1707948 1702260 1698455 1722070 1818687 1891516 1932656 1948852 1990997
12420 1990997 2064522 2131501 2214482 2325133 2445058 2586123 2720604 2865646 3079357 3274663
12410 3274663 3402790 3502686 3571447 3607388 3616875 3630864 3687113 3794039 3937066 4101403 4309532
12399 4309532 4553919 4811963 5109713 5499349 5930770 6407702 6957120 7587261 8367948
12390 8367948 9264746 10315522 11544206 12976744 14635970 16636875 19025220 21784091
$$ packed form
12466C039731o8523j03408q5644o8068p1657r3960m6485o4923n8537l5414n5491
12455B287621j09987p9420n0474l6868k9446k1613k7461l0302q858k9343l1972
12444A831877k330K389k8618k7064k7138j3259k685k1195r526o256J2388j5662
12432A692921m4705J4167K6161J9404n688l805K3615R6617P2829M1140J6196M2145
12420A990997P3525O6979Q2981J10651J19925J41065J34481J45042K13711J95306
12410C274663J28127R9896O8761L5941R487J3989N6249J06926J43027J64337K08129
12399D309532K44387K58044K97750L89636M31421M76932N49418O30141P80687
12390H367948Q96798J050776J228684J432538J659226K000905K388345K758871
$$ plain form
12382 21784091 24962193 28691535 33199374 38926454 46492093 56835585 71331744 92030851
12374 92030851 122048416 165628493 226415906 300693890 370973088 417270553 426533963
12367 426533963 396522016 338270958 267673249 201431807 150699489 115243877 90825751
12360 90825751 73737808 61463329 52422067 45551839 40080479 35497961 31488837 27919383
12352 27919383 24756438 21998968 19657672 17724764 16123899 14805778 13697035 12750105
12344 12750105 11931864 11207564 10541937 9937952 9384926 8834914 8276132 7769070 7335207
12335 7335207 6950072 6587812 6255060 5900197 5560656 5239243 4957282 4695167 4448885
12326 4448885 4231843 4047667 3904266 3785700 3678697 3552295 3407148 3295680 3209713 3119648
$$ packed form
12382B1784091L178102L729342M507839N727080P565639J0343492J4496159K0699107
12374I2030851L0017565M3580077O0787413P4277984P0279198M6297465R263410
12367D26533963l0011947n8251058p0597709o6241442n0732318l5455612k4418126
12360I0825751j7087943j2274479r041262o870228n471360m582518m009124l569454
12352B7919383l162945k757470k341296j932908j600865j318121j108743r46930
12344A2750105q18241p24300o65627o03985n53026n50012n58782n07062m33863
12335G335207l85135l62260l32752l54863l39541l21413k81961k62115k46282
12326D448885k17042j84176j43401j18566j07003j26402j45147j11468q5967r0065
$$ plain form
12316 3119648 3051314 2998385 2981103 2999073 2962330 2868260 2725031 2590244 2404309 2237551
12306 2237551 2122611 2036122 1948399 1874212 1768493 1713020 1709020 1663740 1593525 1540746 1532523
12295 1532523 1492759 1446456 1424575 1402141 1387337 1335282 1303581 1274847 1264366 1241562 1223374
12284 1223374 1188610 1179602 1150771 1113948 1112749 1107689 1080914 1090712 1083644 1042517 990945 957293
12272 957293 957406 953661 926273 919960 913690 929895 973595 1035327 1061381 1033954 1021680 1004164
12260 1004164 944204 896273 879187 875306 875737 868786 869809 873654 870663 854195 868497 853304 807095
12247 807095 771796 739917 737837 741528 732751 746660 742206 748078 751995 767253 746333 731303 722326
12234 722326 726648 736267 756656 775490 778910 768221 798023 800174 807231 836515 858133 901842
$$ packed form
12316C119648o8334n2929j7282J7970l6743r4070j43229j34787j85935j66758
12306B237551j14940q6489q7723p4187j05719n5473m000m5280p0215n2779q223
12295A532523l9764m6303k1881k2434j4804n2055l1701k8734j0481k2804j8188
12284A223374l4764r008k8831l6823j199n060k6775R798p068m1127n1572l3652
12272I57293J13l745k7388o313o270J6205M3700O1732K6054k7427j2274j7516
12260A004164n9960m7931j7086l881M31o951J023L845k991j6468J4302j5193m6209
12247H07095l5299l1879k080L691q777J3909m454N872L917J5258k0920j5030q977
12234G22326M322R619K0389J8834L420j0689K9802K151P057K9284K1618M3709
$$ plain form
12222 901842 930466 970167 1023102 1027320 1038367 1068087 1117524 1150727 1102335 1016088 902990
12211 902990 709766 550439 481719 410845 386854 387711 385921 411707 435268 400284 413456 433908
12199 433908 439266 436347 449527 463366 442930 446918 427717 396538 378764 354000 363066 357668
12187 357668 347015 326458 337505 357345 360776 400885 444447 483420 515987 553801 535291 516072
12175 516072 494602 456721 426238 407916 402796 423687 444073 441346 469874 482529 484279 497227
12163 497227 492538 492959 496411 468793 463610 477677 506666 511521 490052 473770 461426 457103 473274
12150 473274 483702 491810 501304 498795 504773 509962 517221 529866 512821 510555 490920 480628 478042
12137 478042 481938 484024 479745 441850 449038 477216 499019 466219 476851 493733 500522 498689 506751
$$ packed form
12222I01842K8624L9701N2935M218J1047K9720M9437L3203m8392q6247j13098
12211I02990j93224j59327o8720p0874k3991Q57j790K5786K3561l4984J3172K0452
12199D33908N358k919J3180J3839k0436L988j9201l1179j7774k4764R066n398
12187C57668j0653k0557J1047J9840L431M0109M3562L8973L2567L7814j8510j9219
12175E16072k1470l7881l0483j8322n120K0891K0386k727K8528J2655J750J2948
12163D97227m689M21L452k7618n183J4067K8989M855k1469j6282j2344m323J6171
12150D73274J0428Q108R494k509N978N189P259J2645j7045k266j9635j0292k586
12137D78042L896K086m279l7895P188K8178K1803l2800J0632J6882O789j833Q062
$$ plain form
12124 506751 529261 529022 533238 519767 524654 514985 527827 550800 571517 560158 584329 571512
12112 571512 563487 554264 554394 574314 584629 598529 587412 584616 590583 578970 595985 587992 583607
12099 583607 586611 578627 568460 552824 576696 593748 601827 615457 632532 626493 614547 631418
12087 631418 643819 660872 698515 732784 756968 750183 755197 753766 724538 744477 746527 761316
12075 761316 773736 790442 836563 881216 946709 1056712 1142227 1206261 1299159 1471874 1701059
12064 1701059 1897433 2091023 2280691 2394883 2411977 2311002 2151294 1939230 1713675 1513979
12054 1513979 1350691 1224469 1156307 1113818 1112965 1069350 1053949 1048367 1047916 1049020 1028947 1002483
12042 1002483 998797 1002291 1000150 975258 982019 1040969 1081683 1123903 1185525 1188606 1191043 1197202 1152095
$$ packed form
12124E06751K2510k39M216j3471M887r669J2842K2973K0717j1359K4171j2817
12112E71512q025r223J30J9920J0315J3900j1117k796N967j1613J7015p993m385
12099E83607L004p984j0167j5636K3872J7052Q079J3630J7075o039j1946J6871
12087F31418J2401J7053L7643L4269K4184o785N014j431k9228J9939K050J4789
12075G61316J2420J6706M6121M4653O5493J10003Q5515O4034R2898J72715K29185
12064A701059J96374J93590J89668J14192J7094j00975j59708k12064k25555j99696
12054A513979j63288j26222o8162m2489q53m3615j5401n582m51J104k0073k6464
12042A002483l686L494k141k4892O761N8950M0714M2220O1622L081K437O159m5107
$$ plain form
12029 1152095 1088167 1058557 1052029 1072220 1077049 1048549 1064751 1079569 1094636 1121353 1128127 1156361
12017 1156361 1184681 1158707 1164306 1170783 1175674 1194044 1217356 1237367 1240484 1259477 1282599 1273767
12005 1273767 1270825 1308487 1334656 1377583 1376618 1364215 1379299 1417316 1457062 1472231 1492460 1575931
11993 1575931 1656845 1760612 1932323 2086450 2174847 2213531 2184211 2063329 1932815 1810977
11983 1810977 1773874 1753989 1745548 1759480 1802337 1820314 1853706 1888779 1874082 1871938 1876905 1876088
11971 1876088 1874556 1866109 1869076 1898643 1942378 1949984 1953432 1975909 1983183 1991589 1992052 2007244 2046050
11958 2046050 2072204 2106402 2114956 2120199 2141331 2153907 2156079 2190040 2272619 2354955 2431056 2538893
11946 2538893 2681228 2802090 2838652 2793053 2699128 2560532 2464795 2389270 2321269 2278759 2241699
$$ packed form
12029A152095o3928k9610o528K0191M829k8500J6202J4818J5067K6717O774K8234
12017A156361K8320k5974N599O477M891J8370K3312K0011L117J8993K3122q832
12005A273767k942L7662K6169M2927r65j2403J5084L8017L9746J5169K0229Q3471
11993A575931Q0914J03767J71711J54127Q8397L8684k9320j20882j30514j21838
11983A810977l7103j9885q441J3932M2857J7977L3392L5073j4697k144M967q17
11971A876088j532q447K967K9567M3735P606L448K2477P274Q406M63J5192L8806
11958B046050K6154L4198Q554N243K1132J2576K172L3961Q2579Q2336P6101J07837
11946B538893J42335J20862L6562m5599r3925j38596r5737p5525o8001m2510l7060
$$ plain form
11935 2241699 2256158 2276425 2298757 2314042 2321650 2325211 2313092 2311512 2288854 2274052 2278230 2267130
11923 2267130 2258554 2290973 2298158 2331013 2402828 2459872 2557326 2657441 2825134 3060008 3358787
11912 3358787 3672812 3906569 3991987 3917413 3727289 3434223 3131248 2857040 2640709 2498159
11902 2498159 2405157 2339479 2261084 2196777 2121983 2017049 1932758 1872121 1853911 1823526 1789129
11891 1789129 1759596 1724807 1682718 1657333 1651346 1647324 1609132 1552846 1528125 1534926 1513225 1506140
11879 1506140 1501677 1472201 1467148 1427207 1398754 1354369 1326131 1307080 1310522 1291707 1258961 1243589
11867 1243589 1248695 1221828 1175726 1202406 1233435 1234487 1208377 1195395 1177522 1153596 1098172 1069563
11855 1069563 1060605 1061673 1059074 1044462 1030858 1017844 1016140 999588 992237 989425 967045 946674
$$ packed form
11935B241699J4459K0267K2332J5285P608L561j2119j580k2658j4802M178j1100
11923B267130q576L2419P185L2855P1815N7044R7454J00115J67693K34874K98779
11912C358787L14025K33757Q5418p4574j90124k93066l02975k74208k16331j42550
11902B498159r3002o5678p8395o4307p4794j04934q4291o0637j8210l0385l4397
11891A789129k9533l4789m2089k5385n987m022l8192n6286k4721O801k1701p085
11879A506140m463k9476n053l9941k8453m4385k8238j9051L442j8815l2746j5372
11867A243589N106k6867m6102K6680L1029J052k6110j2982j7873k3926n5424k8609
11855A069563q958J068k599j4612j3604j3014j704j6552p351k812k2380k0371
$$ plain form
11843 946674 929721 921353 882242 884349 890346 865674 845809 843717 807049 799404 800785 797679 800916
11830 800916 780159 782611 764745 723917 719898 732036 732337 724891 716941 713269 737560 709195 658629
11817 658629 665929 670186 659889 660963 656582 629044 597967 583084 568980 606948 629886 613600
11805 613600 616893 631242 612042 588153 580054 557292 557633 537478 527525 508686 498776 491440 497538
11792 497538 510067 494027 485174 493087 476798 471621 469411 488295 505070 504108 468678 459526 457609
11779 457609 465066 454503 449510 442289 426489 452060 469333 474608 480301 475878 454368 420449 382433
11766 382433 357123 376827 393585 399476 394290 367269 341379 344294 345595 347080 353433 341457 350737
11753 350737 349111 350419 353950 369089 392561 391231 357718 342122 330265 339495 351484 348687 340172
$$ packed form
11843I46674j6953q368l9111K107N997k4672j9865k092l6668p645J381l106L237
11830H00916k0757K452j7866m0828m019J2138L01p446p950l672K4291k8365n0566
11817F58629P300M257j0297J074m381k7538l1077j4883j4104L7968K2938j6286
11805F13600L293J4349j9200k3889q099k2762L41k0155r953j8839r910p336O098
11792D97538J2529j6040q853P913j6289n177k210J8884J6775r62l5430r152j917
11779D57609P457j0563m993p221j5800K5571J7273N275N693m423k1510l3919l8016
11766C82433k5310J9704J6758N891n186k7021k5890K915J301J485O353j1976R280
11753C50737j626J308L531J5139K3472j330l3513j5596j1857R230J1989k797q515
$$ plain form
11740 340172 337366 313513 337461 341672 320128 321622 325023 330647 341656 324965 311648 317955 308405
11727 308405 307745 290844 273507 282586 278984 270763 276239 281365 290500 298811 305655 290824 263521
11714 263521 253294 246268 263116 253978 217171 227574 235438 213285 224601 252246 236826 225328
11702 225328 199646 228321 244746 240341 236167 220877 223660 227719 233175 218083 206061 208272 173451
11689 173451 152996 170939 174371 161497 157850 163584 192156 198144 226341 215642 193803 183201
11677 183201 180352 191840 190880 172681 190031 191552 205163 196378 221296 214135 217012 231475 230223
11664 230223 211573 212412 235548 256621 238647 222766 231005 204117 199103 197175 191822 192893 194350
11651 194350 187659 195546 197501 179432 161779 165850 174961 206537 214434 205573 189114 229682 273701
$$ packed form
11740C40172k806k3853K3948M211k1544J494L401N624J1009j6691j3317O307r550
11727C08405o60j6901j7337R079l602q221N476N126R135Q311O844j4831k7303
11714B63521j0227p026J6848r138l6807J0403P864k2153J1316K7645j5420j1498
11702B25328k5682K8675J6425m405m174j5290K783M059N456j5092j2022K211l4821
11689A73451k0455J7943L432j2874l647N734K8572N988K8197j0699k1839j0602
11677A83201k849J1488r60j8199J7350J521J3611q785K4918p161K877J4463j252
11664B30223j8650Q39K3136K1073j7974j5881Q239k6888n014j928n353J071J457
11651A94350o691P887J955j8069j7653M071R111L1576P897q861j6459M0568M4019
$$ plain form
11638 273701 288177 318417 355405 348621 352417 345437 312789 270215 227140 191050 185779 191454
11626 191454 193254 203765 202821 207478 187561 165944 156943 111730 109362 116361 126740 121677 124097
11613 124097 129451 136821 136045 139154 110425 115248 108023 120347 133043 152103 165114 152606 164432
11600 164432 167642 147084 139287 144877 132785 141237 131438 119033 119944 106629 98100 117763 142502
11587 142502 129489 129544 155793 150835 128110 146519 166416 151898 101770 74770 95494 101031
11575 101031 102963 98028 103968 108098 93444 103139 123781 119848 116744 104924 97625 105551 82961
11562 82961 88480 95734 109014 132964 146346 145430 124037 108802 117492 130265 119227 116489 101003
11549 101003 106655 80119 65200 87001 91521 95629 112730 122595 105072 82059 71282 69872
$$ packed form
11638B73701J4476L0240L6988o784L796o980l2648m2574m3075l6090n271N675
11626A91454J800J0511r44M657j9917k1617r001m5213k368O999J0379n063K420
11613A24097N354P370p76L109k8729M823p225J2324J2696J9060J3011j2508J1826
11600A64432L210k0558p797N590j2092Q452r799j2405R11j3315q529J9663K4739
11587A42502j3013N5K6249m958k2725J8409J9897j4518n0128k7000K0724N537
11575A01031J932m935N940M130j4654R695K0642l933l104j1820p299P926k2590
11562H2961N519P254J3280K3950J3382r16k1393j5235Q690J2773j1038k738j5486
11549A01003N652k6536j4919K1801M520M108J7101R865j7523k3013j0777j410
$$ plain form
11537 69872 57406 78390 77932 80197 88718 99645 65163 64365 101333 113427 106994 137411 149959
11524 149959 127243 126184 115153 106925 92147 70406 71859 78949 92367 119507 135655 102353
11512 102353 108044 96583 66749 61309 97206 100067 105606 95631 108523 87440 68568 81231
11500 81231 99472 105187 92065 66118 64886 74635 64276 56413 25434 5316 26581 39408
11488 39408 71905 95781 73576 91419 102310 98442 83134 76039 58347 56192 75819 78041
11476 78041 57845 58044 75211 83679 86408 58597 45799 49773 66131 65425 69819 49213 53481
11463 53481 56753 30369 29061 17984 28729 51136 46158 41194 50569 89174 91352 66990 50209
11450 50209 75463 90178 63886 75810 70738 51751 32403 51043 46841 55112 37875 24224
$$ packed form
11537F9872j2466K0984m58K265Q521J0927l4482p98L6968J2094o433L0417J2548
11524A49959k2716j059j1031q228j4778k1741J453P090J3418K7140J6148l3302
11512A02353N691j1461k9834n440L5897K861N539r975J2892k1083j8872J2663
11500H1231J8241N715j3122k5947j232R749j0359p863l0979k0118K1265J2827
11488C9408L2497K3876k2205J7843J0891l868j5308p095j7692k155J9627K222
11476G8041k0196J99J7167Q468K729k7811j2798L974J6358p06M394k0606M268
11463E3481L272k6384j308j1077J0745K2407m978m964R375L8605K178k4362j6781
11450E0209K5254J4715k6292J1924n072j8987j9348J8640m202Q271j7237j3651
$$ plain form
11438 24224 20490 23702 48807 109072 121125 100091 78671 78479 69441 33239 43534 86038 75502
11425 75502 59571 36202 16209 34109 62659 71296 48129 44228 44124 45272 55752 68046 95863
11412 95863 85692 57404 47394 61927 88867 73658 65366 43930 38489 36911 48066 60080
11400 60080 52776 42534 61465 36059 17821 19364 26059 39930 48027 44448 37650 19975 33
11387 33 12689 29380 40775 34766 46946 55024 25190 27114 62251 54098 46393 56119 53694 51555
11373 51555 39782 6318 -9506 9335 25997 29193 31897 27026 31449 18582 37230 75239
11361 75239 93176 99048 76050 81481 63538 55463 52531 58249 45177 43275 51055 37340 9250
11348 9250 11781 9371 -13307 1804 39561 60493 86017 70361 36760 36319 19979 -7968 -29505
$$ packed form
11438B4224l734L212K5105O0265J2053k1034k1420j92r038l6202J0295M2504j0536
11425G5502j5931k3369j9993J7900K8550Q637k3167l901j04J148J0480J2294K7817
11412I5863j0171k8288j0010J4533K6940j5209q292k1436n441j578J1155J2014
11400F0080p304j0242J8931k5406j8238J543O695J3871Q097l579o798j7675j9942
11387C3J2656J6691J1395o009J2180Q078k9834J924L5137q153p705R726k425k139
11373E1555j1773l3464j5824J8841J6662L196K704m871M423j2867J8648L8009
11361G5239J7937N872k2998N431j7943q075k932N718j3072j902P780j3715k8090
11348I250K531k410k2678J5111L7757K0932K5524j5656l3601m41j6340k7947k1537
$$ plain form
11335 -29505 -11035 26757 13042 -4049 -20055 13624 34825 32008 29891 30318 20740 16935 13206
11322 13206 25693 57871 42944 11446 32034 20141 19424 6671 10336 10019 -4968 -9776 14417
11309 14417 33895 23510 28856 51626 47568 63888 90178 92608 72209 48365 55672 52989 22511
11296 22511 30044 42249 42366 42188 37948 20925 15467 18990 16957 11817 39992 46647 48875 34192
11282 34192 29895 37366 36068 53312 63065 92955 86196 50340 22978 49105 68040 76311 70634
11269 70634 75528 73394 49449 24611 42594 52217 32948 24661 29779 23902 28560 42563 35448
11256 35448 41049 18118 18386 28972 40065 64007 91325 64504 68237 38418 -2934 13606
11244 13606 19502 41703 37311 70380 69165 106484 94764 79069 70399 66407 75597 67498 57999
$$ packed form
11335b9505J8470L7792j3715j7091j6006L3679K1201k817k117M27r578l805l729
11322A3206J2487L2178j4927l1498K0588j1893p17j2753L665l17j4987m808K4193
11309A4417J9478j0385N346K2770m058J6320K6290K430k0399k3844P307k683l0478
11296B2511P533J2205J17j78m240j7023n458L523k033n140K8175O655K228j4683
11282C4192m297P471j298J7244R753K9890o759l5856k7362K6127J8935Q271n677
11269G0634M894k134k3945k4838J7983R623j9269q287N118n877M658J4003p115
11256C5448N601k2931K68J0586J1093K3942K7318k6821L733k9819m1352J6540
11244A3606N896K2201m392L3069j215L7319j1720j5695q670l992R190q099r499
$$ plain form
11231 57999 41656 40107 25969 29421 44268 40263 23084 -11362 6723 38589 45483 55619
11219 55619 54629 21077 -4650 1383 16614 19618 38987 14435 35154 53014 60563 35228 6741
11206 6741 10177 16146 48686 90200 68905 55765 45766 60727 74755 61813 27260 49126
11194 49126 49928 37532 5862 1382 11259 26366 38292 43507 36408 31435 12451 20163 3407
11181 3407 -8671 10813 40438 43773 56506 56522 34635 6526 -4239 6456 15789 -1021 5164
11168 5164 21966 30172 35154 31279 17828 21922 30648 64117 57750 54816 60630 50945 49169 40048
11154 40048 16519 29908 43998 42838 46800 34122 30183 24892 13148 -1441 -5431 -8353 -8538
11141 -8538 24531 61285 59978 15571 -29095 -34306 -8577 -3612 -393 25129 42213 30460 20657
$$ packed form
11231E7999j6343j549j4138L452J4847m005j7179l4446J8085L1866O894J0136
11219E5619r90l3552k5727O033J5231L004J9369k4552K0719J7860P549k5335k8487
11206F741L436N969L2540M1514k1295j3140r999J4961J4028j2942l4553K1866
11194D9126Q02j2396l1670m480R877J5107J1926N215p099m973j8984P712j6756
11181C407j2078J9484K9625L335J2733J6k1887k8109j0765J0695R333j6810O185
11168E164J6802Q206M982l875j3451M094Q726L3469o367k934N814r685j776r121
11154D0048k3529J3389J4090j160L962j2678l939n291j1744j4589l990k922j85
11141h538L3069L6754j307m4407m4666n211K5729M965L219K5522J7084j1753r803
$$ plain form
11128 20657 38519 63378 69075 65569 56103 58790 31544 24835 23317 23532 -198 -26391 -33381
11115 -33381 -28732 -6354 -4675 24475 23947 31236 36024 40783 42248 38821 35593 35008 28339 49052
11101 49052 79745 89908 68701 56883 36082 -339 -24594 -37170 -17786 8491 33901 63312
11089 63312 75636 85737 83273 78201 68727 65300 33714 15077 5085 6851 18911 32640 31228
11076 31228 3412 -11360 8213 10726 12032 19136 5173 17598 13904 36418 16696 -13338
11064 -13338 -10032 17154 62038 85834 66716 52898 48132 21027 16224 25597 9337 14164 34254
11051 34254 52743 48790 17980 644 17033 29198 43191 32288 27766 35031 48182 52811
11039 52811 81161 101199 89122 104662 120347 99502 79082 78537 50332 57446 84770 95850
$$ packed form
11128B0657J7862K4859N697l506r466K687k7246o709j518K15k3730k6193o990
11115c3381M649K2378J679K9150n28P289M788M759J465l427l228n85o669K0713
11101D9052L0693J0163k1207j1818k0801l6421k4255j2576J9384K6277K5410K9411
11089F3312J2324J0101k464n072r474l427l1586j8637r992J766J2060J3729j412
11076C1228k7816j4772J9573K513J306P104j3963J2425l694K2514j9722l0034
11064a3338L306K7186M4884K3796j9118j3818m766k7105m803R373j6260M827K0090
11051C4254J8489l953l0810j7336J6389J2165J3993j0903m522P265J3151M629
11039E2811K8350K0038j2077J5540J5685k0845k0420n45k8205P114K7324J1080
$$ plain form
11027 95850 104196 146502 179579 197587 235571 224467 212855 176054 150381 139003 163121 189029
11015 189029 167899 191439 232679 252718 273459 276477 246270 226517 210392 183034 196023 189297
11003 189297 168510 187509 208023 223274 238837 231409 202117 159880 142997 163821 165334 135012
10991 135012 112041 101279 81286 97559 115761 87051 102433 109618 113419 100051 82105 79796
10979 79796 58842 51116 43525 23804 33184 56945 24906 15775 36380 48165 37008 33215 69843
10966 69843 59503 51071 54284 57940 25594 21 2615 50665 72844 70985 61912 65268 49601
10953 49601 40590 70984 76937 70815 52256 50713 52983 40322 17600 19081 20398 23028 43466
10940 43466 51019 43603 42259 31818 55165 90188 45537 19497 22416 34048 44636 35921 31632
$$ packed form
11027I5850Q346M2306L3077J8008L7984j1104j1612l6801k5673j1378K4118K5908
11015A89029k1130K3540M1240K0039K0741L018l0207j9753j6125k7358J2989o726
11003A89297k0787J8999K0514J5251J5563p428k9292m2237j6883K0824J513l0322
10991A35012k2971j0762j9993J6273J8202k8710J5382P185L801j3368j7946k309
10979G9796k0954p726p591j9721R380K3761l2039r131K0605J1785j1157l793L6628
10966F9843j0340q432L213L656l2346k5573K594M8050K2179j859r073L356j5667
10953D9601r011L0394N953o122j8559j543K270j2661k2722J481J317K630K0438
10940D3466P553p416j344j0441K3347L5023m4651k6040K919J1632J0588q715m289
$$ plain form
10927 31632 19729 39902 13363 7751 41549 62447 46380 20093 35886 40862 13026 10731
10915 10731 61348 61188 63071 59415 43654 32490 13287 103 15623 24835 34516 46414 31358
10902 31358 43504 50590 29092 16205 42211 40566 3823 -3669 25071 1065 5895 2131 -8064
10889 -8064 -24130 16033 -2355 2103 -742 -9002 5698 -7653 -51138 -23318 -18721 -39562 -54351
10876 -54351 -60536 -37504 -13258 -4354 -5857 -2650 13919 29044 45192 34003 13481 19304 21968
10863 21968 33767 29054 59751 47679 16853 33512 57782 42454 22112 38785 33468 41849
10851 41849 31165 11439 35042 49328 51248 40071 31872 47508 68936 61702 20102 3706
10839 3706 13287 40971 48864 53811 21955 440 -4118 -7358 5673 14512 32221 34710 53681
$$ packed form
10927C1632j1903K0173k6539n612L3798K0898j6067k6287J5793M976k7836k295
10915A0731N0617j60J883l656j5761j1164j9203j3184J5520R212R681J1898j5056
10902C1358J2146P086k1498j2887K6006j645l6743p492K8740k4006M830l764j0195
10889h064j6066M0163j8388M458k845q260J4700j3351m3485K7820M597k0841j4789
10876e4351o185K3032K4246Q904j503L207J6569J5125J6148j1189k0522N823K664
10863B1968J1799m713L0697j2072l0826J6659K4270j5328k0342J6673n317Q381
10851D1849j0684j9726K3603J4286J920j1177q199J5636K1428p234m1600j6396
10839C706R581K7684P893M947l1856k1515m558l240J3031Q839J7709K489J8971
$$ plain form
10826 53681 47509 35075 23596 36476 65229 74327 73237 62790 42195 37954 54954 44002
10814 44002 27366 29867 35375 46974 35490 23954 25293 55988 57534 64101 68130 90090 91431
10801 91431 78374 81733 74345 73020 52730 42454 49729 73379 56468 40040 47477 27096 36538
10788 36538 40067 25419 19071 29326 30762 55484 87520 75425 73425 93216 73773 37481
10776 37481 2887 9406 40297 42314 53815 69091 90337 105583 92806 92485 91342 65525 52092
10763 52092 38638 68254 97791 89187 60905 59144 37124 31185 35281 59964 85477 93018 95156
10750 95156 71263 29067 23921 33487 50632 32420 4763 -18979 -8607 5112 42303 56208
10738 56208 13653 1363 -7910 -31729 -16513 -13658 -28793 -30460 -14049 -21663 -35755 -13034
$$ packed form
10826E3681o172j2434j1479J2880K8753R098j090j0447k0595m241J7000j0952
10814D4002j6636K501N508J1599j1484j1536J339L0695J546O567M029K1960J341
10801I1431j3057L359p388j325k0290j0276P275K3650j6911j6428P437k0381R442
10788C6538L529j4648o348J0255J436K4722L2036j2095k000J9791j9443l6292
10776C7481l4594O519L0891K017J1501J5276K1246J5246j2777l21j143k5817j3433
10763E2092j3454K9616K9537q604k8282j761k2020n939M096K4683K5513P541K138
10750I5156k3893m2196n146R566J7145j8212k7657k3742J0372J3719L7191J3905
10738E6208m2555j2290r273k3819J5216K855j5135j667J6411p614j4092K2721
$$ plain form
10726 -13034 -26316 -36992 -31733 -9005 -4212 -33780 -15854 -6782 -13164 668 7535 -150 1691
10713 1691 -10617 -12994 -2992 15279 30342 27392 14102 -26843 -29950 4333 19948 31243
10701 31243 31697 2576 -701 4448 26429 52069 63528 70909 70216 63693 66665 36490 10609
10688 10609 29720 33253 55702 43523 44956 16397 -4553 39485 71459 90622 95853 99253
10676 99253 114078 118452 114474 124321 144840 145212 138002 118457 108447 91936 80719 87645 88533
10663 88533 98696 95371 82574 92519 107436 114925 135320 140320 131559 116095 130730 150648 148097
10650 148097 135923 153815 165647 202521 237312 258764 315283 363318 382634 439797 461104
10639 461104 426752 420068 387387 354153 360279 367567 341578 319766 341996 385488 451927 548380
$$ packed form
10726a3034j3282j0676N259K2728M793k9568J7926R072o382J3832O867p685J841
10713A691j2308k377J0002J8271J5063k950j3290m0945l107L4283J5615J1295
10701C1243M54k9121l277N149K1981K5640J1459P381o93o523K972l0175k5881
10688A0609J9111L533K2449j2179J433k8559k0950M4038L1974J9163N231L400
10676I9253J4825M374l978R847K0519L72p210j9545j0010j6511j1217O926Q88
10663H8533J0163l325j2797R945J4917P489K0395N000q761j5464J4635J9918k551
10650A48097j2174J7892J1832L6874L4791K1452N6519M8035J9316N7163K1307
10639D61104l4352o684l2681l3234O126P288k5989k1812K2230M3492O6439R6453
$$ plain form
10627 548380 640196 687394 724737 819269 964523 1071243 1149414 1252072 1348086 1458189 1615876
10616 1615876 1839453 2155451 2543463 3064168 3775472 4744712 5960752 7548335 9438612
10607 9438612 11441678 13221068 14423296 14968141 14894659 14566882 14345551 14558724 15495232
10598 15495232 17309858 20141693 23817051 27695661 30805075 32355816 32229958 30712888
10590 30712888 28571977 26758470 25924760 26457163 28469336 31927401 36569587 41269272
10582 41269272 44402175 45054300 43210791 39407558 34811015 30746080 27959590 26647220
10574 26647220 26774431 28152003 30370866 32520639 33511771 32770395 30436794 26953061
10566 26953061 23092776 19783394 17408225 15967027 15365176 15414230 15786808 16083303 15883162
$$ packed form
10627E48380R1816M7198L7343R4532J45254J06720P8171J02658R6014J10103J57687
10616A615876K23577L15998L88012N20705P11304R69240J216040J587583J890277
10607I438612K003066J779390J202228N44845p3482l27777k21331K13173R36508
10598A5495232J814626K831835L675358L878610L109414J550741j25858j517070
10590C0712888k140911j813507q33710N32403K012173L458065M642186M699685
10582D1269272L132903O52125j843509l803233m596543m064935k786490j312370
10574B6647220J27211J377572K218863K149773R91132p41376k333601l483733
10566B6953061l860285l309382k375169j441198o01851M9054L72578K96495k00141
$$ plain form
10557 15883162 14984209 13453075 11507548 9509759 7685725 6209849 5096422 4265985
10549 4265985 3651931 3168033 2785605 2513620 2304156 2091545 1909251 1719926 1536717
10540 1536717 1408813 1296850 1193237 1109825 1045761 982371 920461 882898 803997 743011 680862
10529 680862 645083 642824 625886 551305 513580 521542 490995 454794 447771 417670 394708 383737
10517 383737 373056 348670 342862 360015 348487 336757 296160 253966 274474 260626 246837 230514
10505 230514 188432 174340 185394 178831 159127 163840 168872 193800 228502 220575 187890 154049
10493 154049 162382 168556 169953 146791 130562 136287 129499 101297 103643 111519 139427 151491 136955
10480 136955 125444 120088 100895 109349 129396 141997 142903 123501 114003 123791 115796 118491 121143
$$ packed form
10557A5883162q98953j531134j945527j997789j824034j475876j113427q30437
10549D265985o14054m83898l82428k71985k09464k12611j82294j89325j83209
10540A536717j27904j11963j03613q3412o4064o3390o1910l7563p8901o0986o2149
10529F80862l5779k259j6938p4581l7725P962l0547l6201p023l0101k2962j0971
10517C83737j0681k4386n808J7153j1528j1730m0597m2194K0508j3848j3789j6323
10505B30514m2082j4092J1054o563j9704M713N032K4928L4702p927l2685l3841
10493A54049Q333O174J397k3162j6229N725o788k8202K346P876K7908J2064j4536
10480A36955j1511n356j9193Q454K0047J2601R06j9402r498R788p995K695K652
$$ plain form
10467 121143 136730 145970 111029 74272 54593 52673 61192 95523 100007 104469 82430 93067
10455 93067 112059 129770 145216 153329 148393 154190 135808 110140 80814 102734 130335 107267
10443 107267 111270 119317 124057 108389 101164 122121 116576 105311 106541 112247 123347 123753 120801
10430 120801 108378 103590 78043 45313 70392 104413 92538 81200 75034 83133 77395 87351
10418 87351 60158 28795 25013 16817 31718 35613 24314 -5296 -295 12197 16430 20398 36112
10405 36112 51580 62787 74208 58165 27117 -5351 -13293 3089 32494 39634 24859 22106
10393 22106 -3288 -8974 6666 28264 38723 26360 -1735 4103 10105 -9541 -7218 -17801
10381 -17801 -4877 10663 25002 16890 1043 -11765 -36271 -31718 2582 8155 25160 15439
$$ packed form
10467A21143J5587R240l4941l6757j9679j920Q519L4331M484M462k2039J0637
10455I3067J8992J7711J5446Q113m936N797j8382k5668k9326K1920K7601k3068
10443A07267M003Q047M740j5668p225K0957n545j1265J230N706J1100M06k952
10430A20801j2423m788k5547l2730K5079L4021j1875j1338o166Q099n738R956
10418H7351k7193l1363l782q196J4901L895j1299k9610N001J2492M233L968J5714
10405C6112J5468J1207J1421j6043l1048l2468p942J6382K9405P140j4775k753
10393B2106k5394n686J5640K1598J0459j2363k8095N838O002j9646K323j0583
10381a7801J2924J5540J4339q112j5847j2808k4506M553L4300N573J7005r721
$$ plain form
10369 15439 -16020 -29697 -10708 15729 33302 33630 7634 -10410 -11715 -8585 -22924 11474
10357 11474 17458 558 10983 48709 64040 35310 15154 26267 56621 53516 50793 32701
10345 32701 23623 31015 47761 64773 58500 68081 62918 55016 53769 32993 6808 29096 49661
10332 49661 45502 16738 34197 23543 18984 30199 38659 50397 48206 42117 36324 26143 -3001
10319 -3001 -17682 10216 17807 17015 18888 27549 40137 9434 -13286 -15310 -9664 -17296 1018
10306 1018 13246 25457 22691 14721 -2891 -7251 -12665 -17064 -20167 -2349 2687 6034 15661 16322
10292 16322 20101 26819 42406 56607 31326 12333 17458 18380 21714 9249 22828 35242 24665
10279 24665 15141 -18764 -27004 -14924 -5921 -5290 10194 25757 14310 -8282 -5203 -9371 8397
$$ packed form
10369A5439l1459j3677J8989K6437J7573L28k5996j8044j305L130j4339L4398
10357A1474N984j6900J0425L7726J5331k8730k0156J1113L0354l105k723j8092
10345C2701r078P392J6746J7012o273R581n163p902j247k0776k6185K2288K0565
10332D9661m159k8764J7459j0654m559J1215Q460J1738k191o089n793j0181k9144
10319c001j4681K7898P591p92J873Q661J2588l0703k2720k024N646p632J8314
10306A018J2228J2211k766p970j7612m360n414m399l103J7818N036L347R627O61
10292A6322L779O718J5587J4201k5281j8993N125R22L334j2465J3579J2414j0577
10279B4665r524l3905q240J2080R003O31J5484J5563j1447k2592L079m168J7768
$$ plain form
10266 8397 14801 9388 28506 8412 -18576 -22599 9338 19190 -4452 -14579 -28887 -20208 -11932
10253 -11932 -3913 -7977 -5603 -18579 -14743 -20713 -4292 192 11919 -9233 -26525 -11397 26928
10240 26928 29908 5563 9414 13455 -3637 -19931 -23509 -28728 -18936 -24384 -23726 -27760 -23299 15376
10226 15376 24950 16084 18115 5291 905 -25140 -11943 -13643 -4440 -750 5066 28615 31922
10213 31922 18057 -25075 -44868 -23688 -21162 -19510 -15807 3692 15625 22240 27134 35961 19037
10200 19037 2370 19809 20576 15195 25769 39336 45165 32106 25238 11744 12006 34780 31299
10187 31299 20637 21779 38837 41463 38037 16293 1455 14486 9304 -16074 -10976 17703 38874
10174 38874 53048 53614 48179 53444 86984 105208 119216 120621 105859 100249 123491 135936 121060
$$ packed form
10266H397O404n413J9118k0094k6988m023L1937R852k3642j0127j4308Q679Q276
10253a1932Q019m064K374j2976L836n970J6421M484J1727k1152j7292J5128L8325
10240B6928K980k4345L851M041j7092j6294l578n219R792n448O58m034M461L8675
10226A5376R574q866K031j2824m386k6045J3197j700R203L690N816K3549L307
10213C1922j3865m3132j9793K1180K526J652L703J9499J1933O615M894Q827j6924
10200A9037j6667J7439P67n381J0574J3567N829j3059o868j3494K62K2774l481
10187C1299j0662J142J7058K626l426k1744j4838J3031n182k5378N098K8679K1171
10174C8874J4174N66n435N265L3540J8224J4008J405j4762n610K3242J2445j4876
$$ plain form
10161 121060 125826 143336 157137 163110 177546 184142 178047 186530 169692 155358 160325 133550 144486
10148 144486 185897 225270 237419 240920 217484 190940 184020 186763 170373 146467 137628 172026
10136 172026 205732 203884 217514 204153 193620 168114 141848 121834 97568 97044 76745 101964
10124 101964 103364 88776 96575 83336 71877 72445 66731 55255 46821 49202 49966 60732 62145
10111 62145 37634 31483 33402 22897 -1715 1040 19360 238 133 15573 -5899 -6692 -135
10098 -135 13190 30083 16595 -9757 -2975 -1687 -4876 -5304 15276 50358 71929 56016 22870
10085 22870 113 -21494 -6589 -10170 5528 8499 7820 23658 37617 33692 26450 19960 17162
10072 17162 26893 10487 -259 -7071 -9607 1238 -23204 -14464 15449 5440 13905 18590 -6236
$$ packed form
10161A21060M766J7510J3801N973J4436O596o095Q483j6838j4334M967k6775J0936
10148A44486M1411L9373J2149L501k3436k6544o920K743j6390k3906q839L4398
10136A72026L3706j848J3630j3361j0533k5506k6266k0014k4266n24k0299K5219
10124A01964J400j4588P799j3239j1459N68n714j1476q434K381P64J0766J413
10111F2145k4511o151J919j0505k4612K755J8320j9122j05J5440k1472p93O557
10098a35J3325J6893j3488k6352O782J288l189m28K0580L5082K1571j5913l3146
10085B2870k2757k1607J4905l581J5698K971o79J5838J3959l925p242o490k798
10072A7162R731j6406j0746o812k536J0845k4442Q740K9913j0009Q465M685k4826
$$ plain form
10059 -6236 -26979 -6275 963 4418 -10757 -5650 -27847 -24312 -1894 14254 -16339 -28127 -12677
10046 -12677 -11438 -11771 -4136 -4877 -11541 -21169 -38581 -31664 -16225 1713 -12966 -50454 -42988 -16143
10032 -16143 -6024 1652 18291 10128 12850 15222 15068 4173 6151 1454 -3572 -20433 -36711
10019 -36711 -15000 -1529 5866 28704 28796 18649 2088 532 -2240 -4170 -2940 -1216 3460 -36705
10005 -36705 -28537 -20256 -5663 -509 12080 9759 2241 22695 55192 71575 55008 28566 36593
9992 36593 54974 54029 10914 18917 10202 23182 17355 11655 16486 25900 47957 31858 9116
9979 9116 -2958 -18113 -15333 -21070 -33214 -14288 -17694 -35533 -18011 24128 32926 40218 44388
9966 44388 25498 21172 29420 23359 5175 10453 -7056 20621 24770 -169 -21039 -36704 -3604
$$ packed form
10059f236k0743K0704P238L455j5175N107k2197L535K2418J6148l0593j1788J5450
10046a2677J239l33P635p41o664r628j7412O917J5439J7938j4679l7488P466K6845
10032a6143J0119P676J6639q163K722K372j54j0895J978m697n026j6861j6278
10019c6711K1711J3471P395K2838R2j0147j6561j556k772j930J230J724M676m0165
10005c6705Q168Q281J4593N154J2589k321p518K0454L2497J6383j6567k6442Q027
9992C6593J8381r45m3115Q003q715J2980n827n700M831R414K2057j6099k2742
9979I116j2074j5155K780n737j2144J8926l406j7839J7522M2139Q798P292M170
9966D4388j8890m326Q248o061j8184N278j7509K7677M149k4939k0870j5665L3100
$$ plain form
9953 -3604 -5237 -22804 1202 11826 25302 26627 11557 18316 18378 43221 58715 63903 33738
9940 33738 10333 -6245 -15630 -11845 -7946 -8494 -11283 3378 14331 -17732 12722 16410 16429 21414
9926 21414 21506 34028 44328 53780 68606 71363 114772 147090 171266 165031 114234 60804 29973
9913 29973 31605 41918 28350 11224 24040 63469 68751 34372 22122 27128 14695 20709 27594
9900 27594 21493 10464 23442 8959 1544 9074 4895 -5788 -11779 9793 12278 21947 30483
9887 30483 22671 17400 -10889 -11362 -16270 -13826 18564 41465 33996 24142 -8137 -25887 -10628
9874 -10628 -8800 -1317 14878 45859 40927 12617 -8854 11059 25429 18276 -3909 -12964 -28643
9861 -28643 -31006 -24640 -6397 40195 46950 45552 39172 26327 12601 -1319 15353 14878 6277
$$ packed form
9953c604j633j7567K4006J0624J3476J325j5070O759O2K4843J5494N188l0165
9940C3738k3405j6578r385L785L899n48k789J4661J0953l2063L0454L688J9M985
9926B1414R2J2522J0300R452J4826K757M3409L2318K4176o235n0797n3430l0831
9913B9973J632J0313j3568j7126J2816L9429N282l4379j2250N006j2433O014O885
9900B7594o101j1029J2978j4483p415P530m179j0683n991K1572K485R669Q536
9887C0483p812n271k8289m73m908K444L2390K2901p469r854l2279j7750J5259
9874a0628J828P483J6195L0981m932k8310k1471J9913J4370p153k2185r055j5679
9861b8643k363O366J8243M6592O755j398o380j2845j3726j3920J6672m75q601
$$ plain form
9848 6277 -17017 -42270 -17240 -954 -32458 -17056 -16569 -32698 -22967 -5910 -7192 -7962 -2709
9835 -2709 -7564 -16447 -487 -7722 -16118 -10165 -17192 -7271 -3016 -12916 -21319 -12900 -4460 -8623 -36334
9820 -36334 -13305 6668 -12196 -26145 -6384 -11021 -25267 -29868 -33630 -34031 -27840 -9657 5872
9807 5872 13533 13814 -11267 14051 11778 -408 14310 25519 49225 39487 11521 2297 -1484
9794 -1484 21909 37494 80120 120415 133534 117969 85698 54620 72212 87994 97580 70242
9782 70242 40776 31869 32610 34965 13712 24390 62228 74217 119721 149558 204879 252088 359604
9769 359604 547417 735946 793227 776397 678467 502972 318114 207960 145618 96339 81687
9758 81687 57164 43991 49467 40456 39549 32875 47148 31547 31179 69014 60790 16958 -12660
$$ packed form
9848F277k3294k5253K5030J6286l1504J5402M87j6129R731J7057j282p70N253
9835b709m855q883J5960p235q396N953p027R921M255r900q403Q419Q440m163k7711
9820c6334K3029J9973j8864j3949J9761m637j4246m601l762m01O191J8183J5529
9807E872P661K81k5081K5318k273j2186J4718J1209K3706r738k7966r224l781
9794a484K3393J5585M2626M0295J3119j5565l2271l1078J7592J5782R586k7338
9782G0242k9466q907P41K355k1253J0678L7838J1989M5504K9837N5321M7209J07516
9769C59604J87813J88529N7281j6830r7930j75495j84858j10154o2342m9279j4652
9758H1687k4523j3173N476r011r07o674J4273j5601l68L7835q224m3832k9618
$$ plain form
9745 -12660 -3706 7504 29690 38025 43782 45643 67595 68832 25320 23104 27543 33634 25030 -4392
9731 -4392 -917 25588 20165 15602 -7467 -21972 -30263 -32024 -44231 -28240 -16994 -17627 -11429 4864
9717 4864 10068 22070 43092 21844 -5372 -6846 -12355 -5058 -10445 7413 -13590 -30423 -5288
9704 -5288 18162 12465 14769 -13778 2806 14458 42992 41460 13217 -13286 10775 7274 -167
9691 -167 -15095 -25462 -47511 -45019 -32943 -19362 -10214 1023 -4493 -28221 -39777 -29446 -32851
9678 -32851 -11044 22908 13862 14161 7860 -6981 -4449 785 19809 21397 477 -5513 -4564 -5289
9664 -5289 9644 -2604 -9389 -18033 -5689 7337 -14596 -13246 -200 -15885 -28201 -30846 -23381
9651 -23381 -27005 -17859 -25498 -14855 6064 65362 157252 231692 279307 289360 229226 139746
$$ packed form
9745a2660Q954J1210K2186Q335N757J861K1952J237m3512k216M439O091q604k9422
9731d392L475K6505n423m563k3069j4505q291j761j2207J5991J1246o33O198J6293
9717D864N204J2002K1022k1248k7216j474n509P297n387J7858k1003j6833K5135
9704e288K3450n697K304k8547J6584J1652K8534j532k8243k6503K4061l501p441
9691a67j4928j0367k2049K492J2076J3581R148J1237n516k3728j1556J0331l405
9678c2851K1807L3952r046K99o301j4841K532N234J9024J588k0920n990R49p25
9664e289J4933j2248o785q644J2344J3026k1933J350J3046j5685j2316k645P465
9651b3381l624R146p639J0643K0919N9298R1890P4440M7615J0053o0134q9480
$$ plain form
9639 139746 82876 50952 31023 8347 -4166 30578 38420 33263 25307 14428 3391 -5035
9627 -5035 17006 7909 -10929 988 718 2987 15723 19176 4690 858 15303 4583 3673 7662
9613 7662 13402 576 -5536 21843 40785 24500 33351 35421 3178 -21506 -23617 -14311 -26123
9600 -26123 -19921 300 2483 21375 1768 -926 24049 23356 12406 -24450 -47150 -40930 -53434
9587 -53434 -37713 -27024 -18703 -5001 5401 7169 11919 39906 19785 3818 10739 21443 26688
9574 26688 18818 -8149 -26216 -35167 -36059 -30930 -30481 -5994 -14440 -39708 -44601 -26344 -17988 -36214
9560 -36214 -38895 -32747 -31 -4532 -10962 -25730 -43216 -34058 -23901 -3643 12561 1111 -18117
9547 -18117 -17018 9139 21019 16523 37284 13855 -5358 14591 30961 30513 46771 38738 37263
$$ packed form
9639A39746n6870l1924j9929k2676j2513L4744P842n157p956j0879j1037q426
9627e035K2041r097j8838J1917k70K269J2736L453j4486l832J4445j0720r10L989
9613G662N740j2826o112K7379J8942j6285Q851K070l2243k4684k111R306j1812
9600b6123O202K0221K183J8892j9607k694K4975o93j0950l6856k2700O220j2504
9587e3434J5721J0689Q321J3702J0402J768M750K7987k0121j5967O921J0704N245
9574B6688p870k6967j8067q951q92N129M49K4487q446k5268m893J8257Q356j8226
9560c6214k681O148L2716m501o430j4768j7486R158J0157K0258J6204j1450j9228
9547a8117J099K6157J1880m496K0761k3429j9213J9949J6370m48J6258q033j475
$$ plain form
9534 37263 31914 47320 46565 29774 30131 12449 11386 -5836 11636 18786 26220 8036 -3605
9521 -3605 17281 38045 54910 49427 23615 19120 11818 22652 26576 23125 23474 18897 36557 24180
9507 24180 1014 -2426 -19555 -28040 -2900 14051 37266 62043 42634 4857 5214 15980 16151
9494 16151 -8526 -19417 -27794 -41566 -37703 -19146 -2638 20981 36268 7998 6758 4376 -4927
9481 -4927 -20979 -11432 -14997 -44582 -51606 -42028 -28698 -14679 -6972 7848 -13465 -25858 -22657
9468 -22657 -7519 -16571 -27507 -13318 31312 58732 50874 35090 10328 -18684 -5737 2251
9456 2251 18074 16252 12272 7303 -9923 29625 44013 18475 13385 33865 9382 -13826 -28458
9443 -28458 -21714 -1698 12734 -7245 15317 33001 14783 34811 41538 30622 17508 -12578
$$ packed form
9534C7263n349J5406p55j6791L57j7682j063j7222J7472P150P434j8184j1641
9521c605K0886K0764J6865n483k5812m495p302J0834L924l451L49m577J7660j2377
9507B4180k3166l440j7129q485K5140J6951K3215K4777j9409l7777L57J0766J71
9494A6151k4677j0891q377j3772L863J8557J6508K3619J5287k8270j240k382r303
9481d927j6052R547l565k9585p024R578J3330J4019P707J4820k1313j2393L201
9468b2657J5138r052j0936J4189M4630K7420p858j5784k4762k9012J2947P988
9456B251J5823j822l980m969j7226L9548J4388k5538n090K0480k4483k3208j4632
9443b8458O744K0016J4432j9979K2562J7684j8218K0028O727j0916j3114l0086
$$ plain form
9431 -12578 -2993 -6474 -22181 -45391 -61266 -37754 -25480 -8628 9841 -11181 -33941 -18133
9419 -18133 -7629 -15637 2551 23831 6575 1580 -5365 -19637 -12367 -3631 -24894 -52242 -47844
9406 -47844 -33039 -27763 1911 31176 31913 32286 3598 -8554 9396 11032 8842 15063 15638 13325
9392 13325 19021 -703 -10235 -12317 -36527 -53428 -36795 -37674 -30205 -38085 -8337 -9479 -16736 -5056
9378 -5056 -381 -42131 -49668 -36163 -40117 -62025 -75500 -83349 -53056 -38411 -34210 -15792 -31026
9365 -31026 -45606 -9628 21049 19602 14227 -7606 -25355 -34059 -14810 -18356 -33801 -38759 -43636
9352 -43636 -22152 -3807 4688 12678 16219 20068 41580 35936 3236 -14299 -20650 -25423 -26453
9339 -26453 -37445 -28986 -24460 -28146 -32748 -24236 -14850 -7218 -8752 -10601 2101 19119 34886 11106
$$ packed form
9431a2578R585l481j5707k3210j5875K3512J2274J6852J8469k1022k2760J5808
9419a8133J0504q008J8188K1280j7256m995o945j4272P270Q736k1263k7348M398
9406d7844J4805N276K9674K9265P37L73k8688j2152J7950J636k190O221N75k313
9392A3325N696j9724r532k082k4210j6901J6633q79P469p880K9748j142p257J1680
9378e056M675m1750p537J3505l954k1908j3475p849L0293J4645M201J8418j5234
9365c1026j4580L5978L0677j447n375k1833j7749q704J9249l546j5445m958m877
9352d3636K1484J8345Q495P990L541L849K1512n644l2700j7535o351m773j030
9339b6453j0992Q459M526l686m602Q512R386P632j534j849J2702J7018J5767k3780
$$ plain form
9325 11106 -8116 -3899 -18235 -27599 -25744 -16011 -22429 -10660 3017 23881 58051 64630 48529
9312 48529 33452 36727 34115 11621 4584 15804 28160 12908 29535 27799 18197 30459 14032
9299 14032 15176 -798 -23722 -30064 -23705 -34111 -55726 -36832 -23312 -11445 866 -3914 -1511
9286 -1511 -5653 5028 27892 8714 -12334 -1702 -6077 -16735 -17797 18126 26840 15090 -35300
9273 -35300 -58116 -47438 -50458 -31817 -4975 11793 16830 8218 -8670 15339 16939 14672 9541
9260 9541 -2588 -19995 -21563 -7499 -6075 5974 33524 24602 494 -24961 -13857 29362 25740
9247 25740 -196 -25038 -42872 -34801 -23556 -31528 -18625 19111 26430 28743 16091 2891 -17372
9234 -17372 -25759 -30989 -40217 -54917 -53282 -54868 -53331 -26884 5998 -7262 -22400 -2205 2830
$$ packed form
9325A1106j9222M217j4336r364J855R733o418J1769J3677K0864L4170O579j6101
9312D8529j5077L275k612k2494p037J1220J2356j5252J6627j736r602J2262j6427
9299A4032J144j5974k2924o342O359j0406k1615J8894J3520J1867J2311m780K403
9286a511m142J0681K2864j9178k1048J0632m375j0658j062L5923Q714j1750n0390
9273c5300k2816J0678l020J8641K6842J6768N037q612j6888K4009J600k267n131
9260I541j2129j7407j568J4064J424J2049K7550q922k4108k5455J1104M3219l622
9247B5740k5936k4842j7834Q071J1245p972J2903L7736P319K313j2652j3200k0263
9234a7372q387n230r228j4700J635j586J537K6447L2882j3260j5138K0195N035
$$ plain form
9221 2830 -2591 13783 -2223 -27226 -11366 1953 4245 27039 30392 7094 -8933 -19039 -8249
9208 -8249 -14818 -36970 -53786 -45103 -28787 -18580 -20644 -29134 -47031 -35639 -35918 -54498 -42501
9195 -42501 -43523 -41017 1563 8540 16222 9481 17837 9900 -17607 -16685 -26356 6922 23279 -17490
9181 -17490 -45254 -29634 -9463 -14415 -15530 3242 -21388 -30286 -46463 -48408 -40798 -43920 -35684
9168 -35684 -14056 -8553 -19076 -14597 -7802 2078 -8762 -6199 -13681 3461 4260 -15633 -59336
9155 -59336 -75486 -61061 -39151 -36892 -23138 -18679 -25214 -42807 -48085 -45414 -83605 -72102 -7587
9142 -7587 14289 22365 -7953 -32783 -25921 -293 6381 -23471 -11905 -15239 -42257 -18849 8926
9129 8926 -9277 -30112 -7105 41889 27854 908 -19047 -7912 -16062 -17095 -3916 9938
$$ packed form
9221B830n421J6374j6006k5003J5860J3319K292K2794L353k3298j6027j0106J0790
9208h249o569k2152j6816Q683J6316J0207k064q490j7897J1392k79j8580J1997
9195d2501j022K506M2580O977P682o741Q356p937k7507R22r671L3278J6357m0769
9181a7490k7764J5620K0171m952j115J8772k4630q898j6177j945P610l122Q236
9168c5684K1628N503j0523M479O795R880j0840K563p482J7142P99j9893m3703
9155e9336j6150J4425K1910K259J3754M459o535j7593n278K671l8191J1503O4515
9142g587K1876Q076l0318k4830O862K5628O674k9852J1566l334k7018K3408K7775
9129H926j8203k0835K3007M8994j4035k6946j9955J1135q150j033J3179J3854
$$ plain form
9117 9938 7590 1190 41112 67558 52734 6469 -10548 -7887 -17277 -48055 -26490 -8029 28698
9104 28698 42273 196 956 -2269 -9593 -7104 -6155 -5851 117 17853 15971 10780 11817 2419 -16278
9089 -16278 -24505 -35245 -4434 30798 -6983 -39112 -21185 -2743 27523 17259 30498 15800
9077 15800 642 -22569 -17596 -11264 -10481 -4993 -23814 -16027 -4726 -22398 -35299 -23232 -21402
9064 -21402 -35061 -24749 -9848 -3753 4294 12703 -3645 -4606 403 -56 6098 9467 14034 11768
9050 11768 13492 -16391 -34341 -5292 32548 20695 5159 -12771 -44210 -33755 -17892 -34561
9038 -34561 -62232 -69519 -19878 -2437 7200 -5625 -11932 -8744 3273 2989 23472 27778 19002
9025 19002 11491 12315 26722 22148 6745 -26903 -27227 -12484 5589 7401 40352 59055 54615
$$ packed form
9117I938k348o400L9922K6446j4824m6265j7017K661r390l0778K1565J8461L6727
9104B8698J3575m2077P60l225p324K489R49L04N968J7736j882n191J037r398j8697
9089a6278q227j0740L0811L5232l7781l2129J7927J8442L0266j0264J3239j4698
9077A5800j5158k3211M973O332P83N488j8821P787J1301j7672j2901J2067J830
9064b1402j3659J0312J4901O095Q047Q409j6348r61N009m59O154L369M567k266
9050A1768J724k9883j7950K9049L7840j1853j5536j7930l1439J0455J5863j6669
9038c4561k7671p287M9641J7441R637j2825o307L188J2017k84K0483M306q776
9025A9002p511Q24J4407m574j5403l3648l24J4743J8073J812L2951J8703m440
$$ plain form
9012 54615 15845 21276 40073 54165 49846 28314 14161 -9394 3439 16721 10164 -3241
9000 -3241 -15501 -39041 -39769 -27867 -12528 -10749 -17820 -14241 -41061 -52244 -49165 -29291 -9750
8987 -9750 6301 9087 -13825 -10493 -32951 -46139 -30783 -18515 -35180 -25134 -5235 -2068 -11594
8974 -11594 -27288 -51217 -47123 -2985 17977 -128 -521 17805 7140 25727 26135 -3097 -16923
8961 -16923 -18337 -20189 -27262 -37094 -11131 -13666 -27193 -22222 -10587 -8278 9092 14238 -23217
8948 -23217 -21386 -25714 -26884 -16655 -21877 -24174 -4229 10002 7195 -18259 -34051 -21162 -21625
8935 -21625 -26525 -8768 20837 36552 19849 -1102 15389 21676 87 -10843 -12969 -19656 -18393
8922 -18393 -15643 -14619 -20579 11381 21024 -4667 -19496 -18916 3501 21422 15266 19343 1195
$$ packed form
9012E4615l8770N431J8797J4092m319k1532j4153k3555J2833J3282o557j3405
9000c241j2260k3540p28J1902J5339J779p071L579k6820j1183L079J9874J9541
8987i750J6051K786k2912L332k2458j3188J5356J2268j6665J0046J9899L167r526
8974a1594j5694k3929M094M4138K0962j8105l93J8326j0665J8587M08k9232j3826
8961a6923j414j852p073r832K5963k535j3527M971J1635K309J7370N146l7455
8948b3217J831m328j170J0229n222k297J9945J4231k807k5454j5792J2889m63
8935b1625m900J7757K9605J5715j6703k0951J6491O287k1589j0930k126o687J263
8922a8393K750J024n960L1960R643k5691j4829N80K2417J7921o156M077j8148
$$ plain form
8909 1195 20294 34804 26486 2180 -27424 -29448 -43017 -10590 10641 21082 11003 3689 12168
8896 12168 39222 30687 4689 6227 -25566 -52966 -30198 26952 34018 30849 37526 21822 -6102
8883 -6102 -39599 -62429 -75790 -53094 -28407 -18421 -7519 -7771 -30192 -36324 -27104 -29634 -18714
8870 -18714 -28578 -30302 -19798 -37099 -34383 -34274 -12797 21619 18435 28930 22831 16912 16020 10915
8856 10915 3614 -2778 11227 18854 7889 -20933 -2667 3502 -3709 2290 3798 -10558 11483
8843 11483 23167 24374 1632 7269 33654 25671 7610 9826 2612 -10115 -11500 -6808 -3251
8830 -3251 -6395 -12544 -13678 -31398 -39758 -43292 -25239 1471 13679 10915 8171 -14946 -31416
8817 -31416 -44364 -49982 -33779 -13239 -11568 2740 4312 -8867 -10760 3918 25191 41282 33751
$$ packed form
8909A195J9099J4510q318k4306k9604k024j3569L2427K1231J0441j0079p314Q479
8896A2168K7054q535k5998J538l1793k7400K2768N7150P066l169O677j5704k7924
8883f102l3497k2830j3361K2696K4687R986J0902k52k2421o132R220k530J0920
8870a8714r864j724J0504j7301K716J09K1477L4416l184J0495o099n919q92n105
8856A0915p301o392J4005P627j0965k8822J8266O169p211N999J508j4356K2041
8843A1483J1684J207k2742N637K6385p983j8061K216p214j2727j385M692L557
8830c251l144o149j134j7720q360l534J8053K6710J2208k764k744k3117j6470
8817c1416j2948n618J6203K0540J671J4308J572j3179j893J4678K1273J6091p531
$$ plain form
8804 33751 19818 42379 35439 13967 10004 21933 41923 21192 2316 8282 75 16783 32652
8791 32652 34767 49698 53399 15633 7972 2478 -4037 -11134 -26558 -19507 1220 14802 -1175
8778 -1175 -9234 -22003 -23277 -30097 -27462 -25521 -21413 -9702 -2358 -19660 -4187 41426 38697 12344
8764 12344 -9002 -27957 -33789 -31629 -28890 -15441 -7913 -1832 6198 -13401 -18879 -1036 1396
8751 1396 -8811 -7013 -15748 -14244 5578 -7475 -16138 2078 -16334 -31491 -19648 -26636 -107
8738 -107 34178 33272 17266 21724 5399 -15030 8008 9443 21864 8139 -16200 -25960 -54518
8725 -54518 -55947 -6402 7379 -2861 -27798 -34539 -27405 -31421 -72509 -55732 -23511 192 26416
8712 26416 60726 67269 49495 50456 36110 5144 8944 18404 41606 56577 28650 -9099 6963
$$ packed form
8804C3751j3933K2561o940k1472l963J1929J9990k0731j8876N966q207J6708J5869
8791C2652K115J4931L701l7766p661n494o515p097j5424P051K0727J3582j5977
8778a175q059j2769j274o820K635J941M108J1711P344j7302J5473M5613k729k6353
8764A2344k1346j8955n832K160K739J3449P528O081Q030j9599n478J7843K432
8751A396j0207J798q735J504J9822j3053q663J8216j8412j5157J1843o988K6529
8738a07L4285r06j6006M458j6325k0429K3038J435J2421j3725k4339r760k8558
8725e4518j429M9545J3781j0240k4937o741P134m016m1088J6777L2221K3703K6224
8712B6416L4310O543j7774R61j4346l0966L800R460K3202J4971k7927l7749J6062
$$ plain form
8699 6963 1367 3792 -3065 -15027 -21706 -10632 8139 25071 22776 35938 36603 19982 11228 11343
8685 11343 29898 42454 44135 37759 11999 -11381 -14223 -7869 42 9096 -10977 -12106 -14640
8672 -14640 -14176 -3174 -38837 -77700 -81962 -57317 -24207 -2544 -33049 -16966 8479 28125
8660 28125 47700 55599 32211 11172 -23628 -43523 -41903 -37138 -16607 -14519 -33543 -68157 -72742
8647 -72742 -60428 -32766 1407 1161 -7789 -8825 72 -27150 -42351 -56400 -52970 -47617 -65442
8634 -65442 -45637 -15017 -23403 -41615 -30090 -6249 8699 4694 -1850 -7684 -6205 -1693 6555
8621 6555 6967 12477 633 -9716 -131 23163 -952 -35800 -52360 -44781 -32327 -47443 -52911
8608 -52911 -22106 -8397 -2292 4271 20474 34256 42189 34162 58856 81858 83354 74190 57874
$$ packed form
8699F963n596K425o857j1962o679J1074J8771J6932k295J3162O65j6621q754J15
8685A1343J8555J2556J681o376k5760k3380k842O354P911R054k0073j129k534
8672a4640M64J1002l5663l8863m262K4645L3110K1663l0505J6083K5445J9646
8660B8125J9575P899k3388k1039l4800j9895J620M765K0531K088j9024l4614m585
8647g2742J2314K7662L4173k46q950j036Q897k7222j5201j4049L430N353j7825
8634f5442J9805L0620q386j8212J1525K3841J4948m005o544n834J479M512Q248
8621F555M12N510j1844j0349R585K3294k4115l4848j6560P579J2454j5116n468
8608e2911L0805J3709O105O563J6203J3782P933q027K4694K3002J496r164j6316
$$ plain form
8595 57874 40618 -4811 -15889 -32149 -29820 -12757 25942 65758 74641 35892 17362 -15850
8583 -15850 -40366 -29269 -24231 435 1852 15842 27594 8076 6640 3823 26232 20663 -42330
8570 -42330 -40753 -18816 -29792 -35422 -32122 -30811 -61682 -58748 -46214 -29256 -3020 34865 39845
8557 39845 32685 15518 22101 4049 -9693 42267 58460 37211 9692 12767 19648 15700 27304
8544 27304 22902 -32720 -28093 3055 26365 36149 28763 7924 -3071 -33525 -60391 -28033 -31468
8531 -31468 -18994 -2351 -19877 -49746 -40892 -2932 15263 61567 70919 62934 107238 171070
8519 171070 215299 207488 192656 184878 155195 105167 100264 81041 48870 22143 29644 43702
8507 43702 46220 19877 13486 32285 35021 31972 41330 38711 26719 -5273 -532 -10217 -9349 11874
$$ packed form
8595E7874j7256m5429j1078j6260K329J7063L8699L9816Q883l8749j8530l3212
8583a5850k4516J1097N038K4666J417J3990J1752j9518j436k817K2409n569o2993
8570d2330J577K1937j0976n630L300J311l0871K934J2534J6958K6236L7885M980
8557C9845p160j7167O583j8052j3742N1960J6193k1249k7519L075O881l948J1604
8544B7304m402n5622M627L1148K3310R784p386k0839j0995l0454k6866L2358l435
8531c1468J2474J6643j7526k9869Q854L7960J8195M6304R352p985M4304O3832
8519A71070M4229p811j4832p778k9683n0028m903j9223l2171k6727P501J4058
8507D3702K518k6343o391J8799K736l049R358k619j1992l1992M741r685Q68K1223
$$ plain form
8493 11874 27151 27802 14528 -3006 1634 17055 11925 30861 59055 50712 43054 60636 77047
8480 77047 85351 106305 143754 164967 218486 338238 413003 391696 367517 335756 252917 182877
8468 182877 125661 90304 51912 34214 57424 63033 32447 32885 13697 5312 13998 33429 45199
8455 45199 43605 35631 20412 -4803 -6087 20041 57420 46351 24781 38493 49709 36613
8443 36613 62914 69986 38422 45405 59112 67118 61096 37127 4950 11909 33835 54243 79002
8430 79002 116298 160711 197389 191549 160153 107389 70559 67667 69512 26873 6057 20616
8418 20616 33062 27937 15892 8099 18788 13315 13434 42130 36390 21963 28046 42330 49077
8405 49077 36745 376 -18319 -21528 -9941 -17672 -17560 106 10471 9745 18316 -3996 -17015
$$ packed form
8493A1874J5277O51j3274j7534M640J5421n130J8936K8194q343p658J7582J6411
8480G7047Q304K0954L7449K1213N3519J19752P4765k1307k4179l1761q2839p0040
8468A82877n7216l5357l8392j7698K3210N609l0586M38j9188q385Q686J9431J1770
8455D5199j594p974j5219k5215j284K6128L7379j1069k1570J3712J1216j3096
8443C6613K6301P072l1564O983J3707Q006o022k3969l2177O959K1926K0408K4759
8430G9002L7296M4413L6678n840l1396n2764l6830k892J845m2639k0816J4559
8418B0616J2446n125j2045p793J0689n473J19K8696n740j4427O083J4284O747
8405D9077j2332l6369j8695l209J1587p731J12J7666J0365p26Q571k2312j3019
$$ plain form
8392 -17015 -4009 25137 53935 114601 239362 421225 581900 696835 694071 623741 467888
8381 467888 306056 185801 148368 115847 68782 39970 14676 19485 27090 9869 10223 35715
8369 35715 23839 34504 35792 -13205 -55384 -3583 20892 11935 -3632 327 12607 6270 16728
8356 16728 24223 31737 55738 56610 52480 73491 68176 68130 100990 151945 219402 333857 480576
8343 480576 751790 1127831 1371881 1394451 1288639 1023370 670422 405461 236119 177368
8333 177368 151460 115588 113170 109815 78166 57711 77898 51371 40945 42120 22977 10051
8321 10051 -464 -6418 -11346 -2652 8672 -5529 -11856 -4098 12247 -7170 -2857 -2707 18114
8308 18114 26123 49031 52996 44336 41396 60660 91209 129348 195521 315746 459619 613138
$$ packed form
8392a7015J3006K9146K8798O0666J24761J81863J60675J14935k764p0330j55853
8381D67888j61832j20255l7433l2521m7065k8812k5294M809P605j7221L54K5492
8369C5715j1876J0665J288m8997m2179N1801K4475q957j5567L959J2280o337J0458
8356A6728P495P514K4001Q72m130K1011n315m6L2860N0955O7457J14455J46719
8343D80576K71214L76041K44050K2570j05812k65269l52948k64961j69342n8751
8333A77368k5908l5872k418l355l1649k0455K0187k6527j0426J175j9143j2926
8321A0051j0515n954m928Q694J1324j4201o327P758J6345j9417M313J50K0821
8308A8114Q009K2908L965q660k940J9264L0549L8139O6173J20225J43873J53519
$$ plain form
8296 613138 663092 642313 565935 431896 312866 254174 197760 186523 156543 101531 86312
8285 86312 77367 73094 65417 30119 1097 34602 59771 27595 14173 7611 11344 28488 33571
8272 33571 30979 -1768 -1827 -3617 1275 -482 -9354 -3611 -2129 -4773 -14956 -14095 10698 35675
8258 35675 51815 49738 61891 56286 56529 28569 10149 712 -17355 -9354 -8120 -3823 -1939 1585
8244 1585 6998 27171 3574 981 -9611 -8977 -13157 -42192 -56183 -61151 -35370 11752 20891
8231 20891 225 18928 -19490 -49661 -24483 3291 3842 -22271 -11293 23732 29854 20960 5490
8218 5490 -12203 -36068 -41646 -27727 -15893 -18488 -49025 -46474 -2297 11150 51 3883 35259
8205 35259 26650 -5671 -21909 -19693 -12802 -10686 18401 34567 32552 14191 -16127 -18016 -22111
$$ packed form
8296F13138M9954k0779p6378j34039j19030n8692n6414j1237k9980n5012j5219
8285H6312q945m273p677l5298k9022L3505K5169l2176j3422o562L733J7144N083
8272C3571k592l2747n9j790M892j757q872N743J482k644j0183Q61K4793K4977
8258C5675J6140k077J2153n605K43k7960j8420r437j8067Q001J234M297J884L524
8244A585N413K0173k3597k593j0592O34m180k9035j3991m968K5781M7122R139
8231B0891k0666J8703l8418l0171K5178K7774N51k6113J0978L5025O122q894j5470
8218E490j7693k3865n578J3919J1834k595l0537K551M4177J3447j1099L832L1376
8205C5259q609l2321j6238K216O891K116K9087J6166k015j8361l0318j889m095
$$ plain form
8192 -22111 -32006 -10986 4205 279 -39056 -39458 -21335 -3959 4190 -8973 15484 23102 26268
8179 26268 1841 -22164 -37828 -59412 -33866 -11122 -10813 -4435 3947 11508 14807 19225 21045
8166 21045 5976 -9312 -25350 1671 -3484 8131 19367 25433 30342 38585 28953 1093 -29337
8153 -29337 -4209 8740 -3653 1278 -7885 -13992 -13269 -23952 -11965 -2279 8493 13367 -9212
8140 -9212 -34969 -17052 3175 568 6949 22017 25867 -5647 -23947 -25998 -17759 -6470 -17134
8127 -17134 -29756 -19843 -16533 -32685 -55133 -78706 -74401 -64388 -48955 -39244 -33853 -20624 -11393
8114 -11393 -2811 8144 32830 8468 -6293 15994 -11035 -31077 -16166 -13480 4051 35777
8102 35777 45096 20624 10465 20592 9732 -1581 -14693 -29913 -49269 -44826 -47752 -42447 -21536
$$ packed form
8192b2111r895K1020J5191l926l9335m02J8123J7376Q149j3163K4457P618L166
8179B6268k4427k4005j5664k1584K5546K2744L09O378Q382P561L299M418J820
8166B1045j5069j5288j6038K7021n155J1615J1236O066M909Q243r632k7860l0430
8153b9337K5128J2949j2393M931r163o107P23j0683J1987R686J0772M874k2579
8140i212k5757J7917K0227k607O381J5068L850l1514j8300k051Q239J1289j0664
8127a7134j2622R913L310j6152k2448k3573M305J0013J5433R711N391J3229R231
8114a1393Q582J0955K4686k4362j4761K2287k7029k0042J4911K686J7531L1726
8102C5777R319k4472j0159J0127j0860j1313j3112j5220j9356M443k926N305K0911
$$ plain form
8089 -21536 -19461 -35525 -35522 -26257 -18486 -7421 -10915 -63324 -64245 -66281 -54186 -42452 -39006 -32936
8075 -32936 -27415 -27282 -24231 2769 25571 18717 23098 4871 -4441 -4452 15029 15226 9479 34574
8061 34574 60539 47491 -4673 -28766 -12386 -7529 -3767 -1722 -29356 -48706 -46516 -32477 -34757
8048 -34757 -10866 -5423 -9594 20974 25492 -2670 -28291 -9683 771 -14608 -30166 -29371 -9826
8035 -9826 -16840 -28663 -337 1716 -16297 -26673 -13871 -32419 -44868 -52000 -16499 21332 28962
8022 28962 27447 923 -7335 -18957 -29787 -8094 -5043 -5719 7520 -3221 -11955 11650 22142
8009 22142 7511 -5897 -33419 -32218 -12572 -12925 -12458 -21677 -23740 -33368 -42406 -41412 -36730 -33947
7995 -33947 -42667 -19369 -36837 -38032 -25420 -16054 -18349 -7189 13343 27661 10369 -7611 -26275
$$ packed form
8089b1536K075j6064LR265P771J1065l494n2409r21k036J2095J1734L446O070
8075c2936N521J33L051K7000K2802o854M381j8227r312j1J9481J97n747K5095
8061C4574K5965j3048n2164k4093J6380M857L762K045k7634j9350K190J4039k280
8048c4757K3891N443m171L0568M518k8162k5621J8608J0454j5379j5558P95J9545
8035i826p014j1823K8326K053j8013j0376J2802j8548j2449p132L5501L7831P630
8022B8962j515k6524q258j1622j0830K1693L051o76J3239j0741q734K3605J0492
8009B2142j4631j3408k7522J201J9646l53M67r219k063r628r038R94M682K783
7995c3947q720K3298j7468j195J2612R366k295J1160K0532J4318j7292j7980j8664
$$ plain form
7982 -26275 -25939 -21557 -11709 -32346 -42973 -23795 -18083 -8256 -29330 -31649 -16013 -16068 -16651 -18260
7968 -18260 -39477 -39601 -13013 9345 7161 -25011 -34592 -16046 2164 588 -10352 7020 51557
7955 51557 41843 16211 5224 471 2506 -23352 -15112 -29453 -21492 -4365 10790 -17422 -25345
7942 -25345 -17973 4521 26494 -611 -33261 -33474 -38403 -48271 -26934 668 -2923 -28347 -23492
7929 -23492 -8124 1744 8115 26164 4821 -12571 -12343 14216 17968 -19886 -38920 -27287 -4838
7916 -4838 15590 5000 -24739 -27294 -39256 -44985 -11173 25397 31897 12330 -21067 2563 43034
7903 43034 52803 38076 43020 72363 68311 27335 12360 11774 -4447 -417 16110 3542 -10614
7890 -10614 -22283 -35494 -37571 -28773 -49789 -47439 -47188 -45526 -17531 -5355 -16327 -24113 -36209
$$ packed form
7982b6275L36M382R848k0637j0627J9178N712R827k1074k319J5636n5n83j609
7968a8260k1217j24K6588K2358k184l2172r581J8546J8210j576j0940J7372M4537
7955E1557r714k5632j0987m753K035k5858Q240j4341P961J7127J5155k8212p923
7942b5345P372K2494K1973k7105l2650k13m929r868K1337K7602l591k5424M855
7929b3492J5368R868O371J8049k1343j7392K28K6559L752l7854j9034J1633K2449
7916d838K0428j0590k9739k555j1962n729L3812L6570O500j9567l3397K3630M0471
7903D3034R769j4727M944K9343m052m0976j4975n86j6221M030J6527j2568j4156
7890a0614j1669j3211k077Q798k1016K350K51J662K7995J2176j0972p786j2096
$$ plain form
7877 -36209 -24844 4391 7432 25209 17783 273 1011 -4176 -12811 -14717 -3265 1925 -16917
7864 -16917 -34044 -39213 -56667 -39787 -24480 -13171 -41138 -47723 -33483 -5795 -58 23197
7852 23197 16717 -16125 -15560 3592 -12513 -21212 -3875 -2489 9365 12970 4116 -24171 -50209
7839 -50209 -25758 -38924 -33629 -8436 19428 30034 39280 33941 -7576 -10677 -4294 -23741 -49283
7826 -49283 -13511 4688 -18756 -51134 -76860 -69185 -51224 -22486 -18804 -41877 -34561 -5232
7814 -5232 18061 19787 1224 -2218 13248 17304 19043 3750 -42245 -54413 -30484 -18053 -20012
7801 -20012 -11663 -22607 -16384 -10002 -12559 -15364 12596 10769 28445 9285 11023 39712 33775
7788 33775 18049 -360 18591 7887 -12096 11855 6120 3632 12925 1644 -15162 -11505 14157
$$ packed form
7877c6209J1365K9235L041J7777p426j7510P38n187q635j906J1452N190j8842
7864a6917j7127n169j7454J6880J5307J1309k7967o585J4240K7688N737K3255
7852B3197o480l2842N65J9152j6105q699J7337J386J1854L605q854k8287k6038
7839e0209K4451j3166N295K5193K7864J0606R246n339m1517l101O383j9447k5542
7826d9283L5772J8199k3444l2378k5726P675J7961K8738L682k3073P316K9329
7814e232K3293J726j8563l442J5466M056J739j5293m5995j2168K3929J2431j959
7801b0012Q349j0944O223O382k557k805K7960j827J7676j9160J738K8689n937
7788C3775j5726j8409J8951j0704j9983K3951n735k488R293j1281j6806L657K5662
$$ plain form
7775 14157 17210 -2158 1974 -13970 -25185 1476 10409 -8691 -13677 12399 5377 5776 -9944
7762 -9944 1220 -3397 -18947 -27217 -21775 -33714 -45116 -60806 -43675 3423 16188 -11861 -49239
7749 -49239 -42836 -30903 -29019 -17859 -29668 -25807 -25440 -8917 1333 -1309 19268 -4625 697
7736 697 11192 -1966 -9340 7099 -7105 -16265 -30959 -38164 -41022 -37604 -31774 -14683 12591
7723 12591 -18636 -20611 -4926 -6177 -4786 -24852 -12449 27883 29430 42442 34610 23477 13234
7710 13234 35888 50620 46483 14998 -3897 -12911 2000 22035 43944 65822 38630 5216
7698 5216 4087 2938 1175 3879 -3987 -16700 -34475 -55570 -31202 -24334 -31484 -42053 -28822
7685 -28822 2669 28432 34882 25487 4113 8213 11013 27956 13911 4111 17395 26033 21534
$$ packed form
7775A4157L053j9368M132j5944j1215K6661Q933j9100m986K6076p022L99j5720
7762i944J1164m617j5550q270N442j1939j1402j5690J7131M7098J2765k8049l7378
7749d9239O403J1933J884J1160j1809L861L67J6523J0250k642K0577k3893N322
7736F97J0495j3158p374J6439j4204r160j4694p205k858L418N830J7091K7274
7723A2591l1227j975J5685j251J391k0066J2403M0332J547J3012p832j1133j0243
7710A3234K2654J4732m137l1485j8895r014J4911K0035K1909K1878k7192l3414
7698E216j129j149j763K704p866j2713j7775k1095K4368O868p150j0569J3231
7685b8822L1491K5763O450r395k1374M100K800J6943j4045r800J3284Q638m499
$$ plain form
7672 21534 19815 10090 6565 11409 10708 -6400 -33101 -23280 -19172 -29038 -6481 29633 53795 47944
7658 47944 6350 -15307 -28553 -33283 -43118 -41950 -75327 -75912 -68039 -53462 -39472 -13138 14897
7645 14897 5429 -6631 -11191 -1675 -15685 -37192 -62010 -59783 -38728 -117 360 -27561 -24003
7632 -24003 -2745 11908 31127 26687 11442 -5043 11180 12294 1 7544 6450 18247 39305
7619 39305 61336 58156 9374 -5703 -19145 -32649 2589 12242 6074 15293 48271 79022 57822
7606 57822 39466 3273 3024 -29038 -44888 -28339 -26742 -6566 9266 31487 17386 17382 -1307
7593 -1307 -23726 -40610 -22208 -8103 -1788 7689 18991 -7893 -24716 -21045 -17408 -26016 -95
7580 -95 3257 -2990 -22864 -15676 2541 13810 33991 27649 13255 12056 13026 17438 20154 -10642
$$ packed form
7672B1534j719r725l525M844p01j7108k6701R821M108r866K2557L6114K4162n851
7658D7944m1594k1657j3246m730r835J168l3377n85P873J4577J3990K6334K8035
7645A4897r468j2060m560R516j4010k1507k4818K227K1055L8611M77k7921L558
7632b4003K1258J4653J9219m440j5245j6485J6223J114j2293P543j094J1797K1058
7619C9305K2031l180m8782j5077j3442j3504L5238R653o168R219L2978L0751k1200
7606E7822j8356l6193k49l2062j5850J6549J597K0176J5832K2221j4101mj8689
7593a307k2419j6884J8402J4105O315R477J1302k6884j6823L671L637q608K5921
7580i5L352o247j9874P188J8217J1269K0181o342j4394j199R70M412K716l0796
$$ plain form
7566 -10642 -13124 7425 9675 9847 -100 -3981 -16806 42 29200 40776 25340 776 -9524
7553 -9524 -5583 -12796 -23375 -37543 -25187 -9354 4577 17412 8959 -18605 1708 15872 -10690
7540 -10690 -18064 9058 46612 30160 5466 -7329 16881 31354 39363 26064 -975 -24405
7528 -24405 18912 24616 -6629 -14510 19165 19568 23025 47412 41699 11271 -7592 -13162 19892
7515 19892 12658 6520 -10346 -11085 13538 35091 45671 22533 -6554 -15280 -36694 -23510 -17036
7502 -17036 -36778 -21743 2640 7855 -4521 -16832 -9667 8496 17581 12458 29412 29425 -7325
7489 -7325 23025 40503 37498 50528 23356 21431 33339 27109 -14680 -37962 -35148 8315 32180
7476 32180 12831 -3510 -21860 -33849 -17562 14595 15057 -9250 -17431 -13811 2676 18445 13537
$$ packed form
7566a0642k482K0549K250J72r947l881j2825J6848K9158J1576j5436k4564j0300
7553i524L941p213j0579j4168J2356J5833J3931J2835q453k7564K0313J4164k6562
7540a0690p374K7122L7554j6452k4694j2795K4210J4473Q009j3299k7039k3430
7528b4405M3317N704l1245p881L3675M03L457K4387n713l0428j8863n570L3054
7515A9892p234o138j6866p39K4623K1553J0580k3138k9087q726k1414J3184O474
7502a7036j9742J5035K4383N215j2376j2311P165J8163R085n123J6954J3l6750
7489g325L0350J7478l005J3030k7172j925J1908o230m1789k3282K814M3463K3865
7476C2180j9349j6341j8350j1989J6287L2157M62k4307q181L620J6487J5769m908
$$ plain form
7463 13537 26460 21842 10518 -13082 -23046 -18385 -29223 -38892 -36901 -32599 -20165 -7184 -1550
7450 -1550 2354 -7115 7360 2605 2815 99 -5634 16361 17515 -13613 -50418 -41097 -21361 8034
7436 8034 13506 -10429 -20829 -25888 -19356 -25687 -39618 -12910 12555 3968 22061 36858 12961
7423 12961 -6722 -9816 -21220 -19084 -9155 -16038 1397 21182 14655 6101 20315 36559 34813
7410 34813 30853 12291 -31829 -42684 -50534 -25056 -17648 -29796 -30314 -39895 -20376 -11033 4342
7397 4342 -5596 -5100 15515 46484 54718 47473 41974 11093 9242 17430 -8945 -9869 10505 25275
7383 25275 19176 19265 20932 20674 37091 37141 25544 -7839 -30510 -35936 -8602 -14748 -11146 -2674 13967
7368 13967 -4481 -25137 -58105 -44790 -33737 -30350 -2884 -11898 -31454 -25341 -15979 -45320 -56976
$$ packed form
7463A3537J2923m618j1324k3600r964M661j0838r669J991M302J2434J2981N634
7450a550L904r469J4475m755K10k716n733K1995J154l1128l6805R321J9736K9395
7436H034N472k3935j0400n059O532o331j3931K6708K5465q587J8093J4797k3897
7423A2961j9683l094j1404K136R929o883J7435J9785o527q554J4214J6244j746
7410C4813l960j8562m4120j0855p850K5478P408j2148n18r581J9519R343J5375
7397D342r938M96K0615L0969Q234p245n499l0881j851Q188k6375r24K0374J4770
7383B5275o099Q9J667k58J6417N0j1597l3383k2671n426K7334o146L602Q472J6641
7368A3967j8448k0656l2968J3315J1053L387K7466r014j9556O113R362k9341j1656
$$ plain form
7355 -56976 -37557 -16910 12786 10789 -8494 3205 29896 9065 -21722 -17175 -2471 -3554
7343 -3554 14597 16533 5035 -179 23339 27927 25360 8326 -12368 2010 19241 10872 -10541
7330 -10541 -25503 -23687 -42583 -33355 -13045 -6390 -14825 -13043 -10733 -23038 -16002 -11471 13523
7317 13523 12847 30015 54184 44538 45639 41424 10481 26053 5607 -20168 -24788 -13434 -1889
7304 -1889 -8015 -587 -6727 -39896 -38698 -26278 5373 26182 11259 6830 17146 -10237 -28388
7291 -28388 -23254 -22485 -16367 12644 26916 27418 20016 19253 28384 26597 -8755 -30371 -57016 -42509
7277 -42509 4565 2279 -18498 -20021 -6653 21881 17414 -17462 -15120 -4321 -32827 -29212 -21419
7264 -21419 -17760 -11841 -5100 -2315 20978 28502 260 -12782 -12617 -16250 3418 3267 14833 26196
$$ packed form
7355e6976J9419K0647K9696j997j9283J1699K6691k0831l0787M547J4704j083
7343c554J8151J936j1498n214K3518M588k567j7034k0694J4378J7231q369k1413
7330a0541j4962J816j8896R228K0310O655q435J782K310j2305P036M531K4994
7317A3523o76J7168K4169r646J101m215l0943J5572k0446k5775m620J1354J1545
7304a889o126P428o140l3169J198J2420L1651K0809j4923m429J0316k7383j8151
7291b8388N134P69O118K9011J4272N02p402p63R131j787l5352k1616k6645J4507
7277d2509M7074k286k0777j523J3368K8534m467l4876K342J0799k8506L615P793
7264b1419L659N919O741K785K3293P524k8242j3042J65l633J9668j51J1566J1363
$$ plain form
7250 26196 19235 34216 15227 12645 -8233 -2368 9987 14255 1476 10558 11006 6982 -13239
7237 -13239 -41021 -12795 5778 -14735 6797 12124 -3673 -16622 -2069 -18638 -28340 -10981
7225 -10981 -1823 5214 -17544 -51169 -46597 -33844 -12437 3975 8015 12434 19517 11184 -14832
7212 -14832 -47632 -28518 -27823 -3935 18889 20279 14311 -3132 -17907 -8383 -5315 -1635 6309
7199 6309 2739 12285 235 7847 31966 5468 2194 31351 48380 51345 51382 43702 17265 27183
7185 27183 44820 43865 -8138 -35917 -27748 -3074 29661 44886 64808 27952 19280 10077 4296
7172 4296 18520 33286 18028 22032 4529 12058 27645 3561 10980 45514 48750 44831 28681
7159 28681 25678 -6875 -16635 -3768 919 6437 -12524 -11438 -17176 -15771 3199 -10031 -15371
$$ packed form
7250B6196o961J4981j8989k582k0878N865J2355M268j2779R082M48m024k0221
7237a3239k7782K8226J8573k0513K1532N327j5797j2949J4553j6569r702J7359
7225a0981R158P037k2758l3625M572J2753K1407J6412M040M419P083q333k6016
7212a4832l2800J9114O95K3888K2824J390n968j7443j4775R524L068L680P944
7199F309l570R546j2050P612K4119k6498l274K9157J7029K965L7p680k6437R918
7185B7183J7637r55n2003k7779Q169K4674L2735J5225J9922l6856q672r203n781
7172D296J4224J4766j5258M004j7503P529J5587k4084P419L4534L236l919j6150
7159B8681l003l2553r760J2867M687N518j8961J086n738J405J8970j3230n340
$$ plain form
7146 -15371 -21529 -26846 -14020 -8828 2199 -22043 -18036 -19578 -20922 -25689 -1448 24914 7348
7133 7348 9293 13653 27289 16711 -17659 2613 5193 24233 31030 12827 -17442 -33579 -14391
7120 -14391 19623 18635 28865 33723 -14722 -20633 -9934 -8297 -4672 -26852 -30367 -11849 -11546 -19926
7106 -19926 -30965 -31845 -21366 -7773 -1021 -16159 -20714 -19844 8929 13935 -2827 11320 18297
7093 18297 14485 14536 17816 16374 30846 -3713 -35487 -2506 11393 14004 4928 23448 -715
7080 -715 -17554 -12907 -4770 30612 21872 14892 -15364 -14236 2013 -972 12026 28341 16286
7067 16286 -27127 -57362 -46395 -19847 15146 26503 15877 8625 -1608 -5238 -9539 -18443 -9758
7054 -9758 31879 40045 19119 38356 36184 16266 13681 -10389 -21053 558 6142 10170 -7228
$$ packed form
7146a5371o158n317J2826N192J1027k4242M007j542j344m767K4241K6362j7566
7133G348J945M360J3636j0578l4370K0272K580J9040O797j8203l0269j6137J9188
7120a4391L4014r88J0230M858m8445n911J0699J637L625k2180l515J8518L03q380
7106a9926j1039q80J0479J3593O752j5138m555Q70K8773N006j6762J4147O977
7093A8297l812N1L280j442J4472l4559l1774L2981J3899K611r076J8520k4163
7080g15j6839M647Q137L5382q740o980l0256J128J6249k985J2998J6315j2055
7067A6286m3413l0235J0967K6548L4993J1357j0626p252j0233l630m301q904Q685
7054i758M1637Q166k0926J9237k172j9918k585k4070j0664K1611N584M028j7398
$$ plain form
7041 -7228 -19476 -11827 -19429 -37892 -36129 -44308 -32290 8658 15974 15428 31764 40224 21455 21847
7027 21847 24284 21989 21104 22412 -22359 -32026 -44681 -49644 -37521 -27699 -15138 14360 13357 1526
7013 1526 -8666 -15911 -11890 -7640 -17870 -19193 -20270 -13459 1160 -781 -9704 -5868 -11219 -19285
6999 -19285 -11533 -24903 -24946 -22591 -31884 -53078 -50385 -33116 -15195 -12824 -25922 -2110 2007 4007
6985 4007 -2937 -12205 -38441 -35146 -3223 -20467 -12832 -5368 -12551 844 14260 7470 -7893
6972 -7893 -25697 -18914 -24135 -24075 -9853 -24288 -34843 -15304 -14849 -17972 -28319 -35326 -34348 -21963
6958 -21963 -25270 -25597 -17682 16301 22012 28866 34793 72726 64506 17675 9129 11774 -8494 -2751
6944 -2751 -2269 -8156 -27527 -48384 -20709 -39008 -17058 -2250 -40020 -42872 -15366 -5865 -9473
$$ packed form
7041g228j2248P649p602j8463J763q179J2018M0948P316n46J6336Q460j8769L92
7027B1847K437k295q85J308m4771r667j2655m963J2123R822J2561K9498j003j1831
7013A526j0192p245M021M250j0230j323j077O811J4619j941q923L836n351q066
6999a9285P752j3370m3K355r293k1194K693J7269J7921K371j3098K3812M117K000
6985D007o944r268k6236L295L1923j7244P635P464p183J3395J3416o790j5363
6972g893j7804O783n221O0J4222j4435j0555J9539M55l123j0347p007R78J2385
6958b1963l307l27P915L3983N711O854N927L7933q220m6831q546K645k0268N743
6944b751M82n887j9371k0857K7675j8299K1950J4808l7770k852K7506R501l608
$$ plain form
6931 -9473 -22428 15776 29029 42770 52647 37276 28451 50407 69122 56417 27177 6311
6919 6311 -13507 5199 464 -703 -243 -1777 5159 16323 17138 13391 8958 -4699 -42374 -35088
6905 -35088 -16310 -19456 -7251 12263 28432 28660 3919 -10975 -9459 -1146 23965 15433 9135
6892 9135 -29685 -23068 -9660 -11166 -35301 -9497 20120 20830 2880 26525 12414 -24820 -44273
6879 -44273 -43387 -49753 -55634 -76361 -49607 -15016 -2800 -31570 -35338 -40307 -36926 -23016 -21357
6866 -21357 -3282 -17143 -43051 -56042 -56480 -36770 -22791 -28109 -28301 -14848 -13555 -19561 -14681
6853 -14681 21993 41520 43062 31213 -14136 -42515 -15720 15122 3346 -12253 -20951 -24862
6841 -24862 -6632 -17367 -33325 -48391 -52724 -31998 -27640 -36073 -44359 -32007 -30844 -9631 2077
$$ packed form
6931i473j2955L8204J3253J3741R877j5371q825K1956J8715j2705k9240k0866
6919F311j9818J8706m735j167M60j534O936J1164Q15l747m433j3657l7675P286
6905c5088J8778l146J2205J9514J6169K28k4741j4894J516Q313K5111q532o298
6892I135l8820O617J3408j506k4135K5804K9617P10j7950K3645j4111l7234j9453
6879d4273Q86o366n881k0727K6754L4591J2216k8770l768m969L381J3910J659
6866b1357J8075j3861k5908j2991m38J9710J3979n318j92J3453J293o006M880
6853a4681L6674J9527J542j1849m5349k8379K6795L0842j1776j5599q698l911
6841b4862J8230j0735j5958j5066m333K0726M358q433q286J2352J163K1213J1708
$$ plain form
6828 2077 5795 -14849 -38011 -45255 -16567 14334 26368 30264 24421 12545 12707 -14537 -10912
6815 -10912 4974 -2715 -41022 -33728 -21872 -23953 -15625 30063 31945 -17426 -25840 -25626 -46590
6802 -46590 -45632 -22839 -17506 -13360 -1168 -15960 -15399 -30923 -33084 -36149 -41913 -44841 -47935 -8164
6788 -8164 -4622 8636 14941 1533 -18508 -11497 7770 10841 20971 11226 -11148 459 19244
6775 19244 16699 15315 17496 54013 57207 27690 17582 44160 65868 55411 31708 -90 7344
6762 7344 -5884 -27720 -9764 15840 23390 17352 -869 -7781 -32664 -41672 -18291 13036 26506
6749 26506 35589 30060 29915 38117 35768 45959 49233 38521 42967 31095 17885 -12677 -9926 2780
6735 2780 -11681 5519 19788 12052 343 12512 17802 27701 13792 -2018 -4368 29148 39803
$$ packed form
6828B077L718k0644k3162p244K8688L0901J2034L896n843j1876J62k7244L625
6815a0912J5886p689l8307P294J1856k081Q328M5688J882m9371q414K14k0964
6802d6590R58K2793N333M146J2192j4792N61j5524k161l065n764k928l094L9771
6788h164L542J3258O305j3408k0041P011J9267L071J0130r745k2374J1607J8785
6775A9244k545j384K181L6517L194k9517j0108K6578K1708j0457k3703l1798P434
6762G344j3228k1836J7956K5604P550o038j8221o912k4883r008K3381L1327J3470
6749B6506R083n529j45Q202k349J0191L274j0712M446j1872j3210l0562K751J2706
6735B780j4461J7200J4269p736j1709J2169N290R899j3909j5810k350L3516J0655
$$ plain form
6722 39803 19611 -10925 -35047 -26659 17231 4199 -136 -8190 -6439 -13693 -18494 -44472 -50572
6709 -50572 -50728 -39143 -30955 -42177 -45554 -46457 -32733 6514 11238 -425 -6841 17659 21264 53
6695 53 -15498 -14339 4030 6974 516 13230 8161 5079 10169 -4234 -17747 -23842 -14728 -11961
6681 -11961 -15291 -31094 -31833 -48281 -40826 -17963 8303 11806 22942 19407 4884 14882 9388
6668 9388 11638 10297 26776 53091 22005 -3643 -1296 -5666 -3943 6976 9496 -9441 -1404
6655 -1404 -9909 -9557 -4113 17570 26141 25758 14533 6834 3932 19896 7068 2929 18964 1141
6641 1141 1642 -10531 -2375 -22084 -25909 -7808 -863 48948 40255 13861 22462 42879 28133
6628 28133 33900 34387 21369 -13257 -27378 -40573 -42100 -12796 -888 30161 12177 -26842 -12467
$$ packed form
6722C9803k0192l0536k4122Q388M3890j3032m335q054J751p254m801k5978o100
6709e0572j56J1585Q188j1222l377r03J3724L9247M724j1663o416K4500L605k1211
6695E3j5551J159J8369K944o458J2714n069l082N090j4403j3513o095R114K767
6681a1961l330j5803p39j6448P455K2863K6266L503J1136l535j4523R998n494
6668I388K250j341J6479K6315l1086k5648K347m370J723J0919K520j8937Q037
6655a404q505L52N444K1683Q571l83j1225p699k902J5964j2828m139J6035j7823
6641A141N01j2173Q156j9709l825J8101O945M9811q693k6394Q601K0417j4746
6628B8133N767M87j3018l4626j4121j3195j527K9304J1908L1049j7984l9019J4375
$$ plain form
6615 -12467 1164 -365 5310 -8712 -22437 -3915 -6082 -19850 -25554 897 17691 25699 8466
6602 8466 8231 5320 -3228 8278 7602 16030 -4238 -18818 -30622 -41221 -31263 -14133 -12641 2042
6588 2042 17545 -10100 -18540 8286 27021 34846 14368 38935 33248 -362 11501 426 -766
6575 -766 -4104 16645 8591 -33519 -26217 -8537 -14330 -3036 -4456 2845 12725 4399 11629 14109
6561 14109 -6100 -5131 11465 11397 19185 46104 14811 -5832 5407 -11383 -29365 -25994 -12994
6548 -12994 8013 8338 21522 44669 54926 50126 52072 31081 4244 -3914 -909 4096 27298
6535 27298 29839 3634 -2725 35869 89630 99871 104758 103577 111124 125375 139865 184444 192811
6522 192811 176861 154520 157842 128967 78117 62051 70879 82966 88915 89539 67911 50638 64216
$$ packed form
6615a2467J3631j529N675j4022j3725J8522k167j3768n704K6451J6794Q008j7233
6602H466k35k911q548J1506o76Q428k0268j4580j1804j0599R958J7130J492J4683
6588B042J5503k7645q440K6826J8735P825k0478K4567n687l3610J1863j1075j192
6575g66l338K0749q054m2110P302J7680n793J1294j420P301R880q326P230K480
6561A4109k0209R69J6596o8P788K6919l1293k0643J1239j6790j7982L371J3000
6548a2994K1007L25J3184K3147J0257m800J946k0991k6837q158L005N005K3202
6535B7298K541k6205o359L8594N3761J0241M887j181P547J4251J4490M4579Q367
6522A92811j5950k2341L322k8875n0850j6066Q828J2087N949O24k1628j7273J3578
$$ plain form
6509 64216 78331 81470 58970 25682 22340 34446 46125 38043 17085 -161 4226 29845 36434
6496 36434 21607 40295 56997 54884 40965 10015 -30297 -23790 -22762 -24622 -8166 10134 2194
6483 2194 7122 -7716 -15562 -26401 1957 -1 14616 2109 11437 15819 31808 31976 30922 13656
6469 13656 1583 8884 14163 5152 1068 18716 605 -14567 -7202 -3518 -26455 -47849 -32878
6456 -32878 7041 12111 13270 -3683 -9865 9088 31341 14156 -11448 -16784 -213 11553 13140
6443 13140 12171 16875 23019 9319 -26191 -44899 -50476 -17147 -14907 -23280 -9633 7837 4959
6430 4959 13734 14468 7974 17876 39850 37678 36864 25105 14068 21421 6075 -14309 -4133 -4367
6416 -4367 851 -3362 20462 -2047 -8616 2007 12409 -17265 -6987 19645 9496 -49511 -55165
$$ packed form
6509F4216J4115L139k2500l3288l342J2106J1679q082k0958j7246M387K5619O589
6496C6434j4827J8688J6702k113j3919l0950m0312O507J028j860J6456J8300p940
6483B194M928j4838p846j0839K8358j958J4617j2507R328M382J5989J68j054j7266
6469A3656j2073P301N279r011m084J7648j8111j5172P365L684k2937k1394J4971
6456c2878L9919N070J159j6953o182J8953K2253j7185k5604n336J6571J1766J587
6443A3140r69M704O144j3700l5510j8708n577L3329K240q373J3647J7470k878
6430D959Q775P34o494R902K1974k172q14j1759j1037P353j5346k0384J0176k34
6416d367N218m213K3824k2509o569J0623J0402k9674J0278K6632j0149n9007n654
$$ plain form
6403 -55165 -41348 -31193 -42429 -34474 -36373 -38170 -35666 -44532 -46292 -32035 -34899 -13021 -3239
6390 -3239 -1450 -13030 -18050 -13787 10830 25170 6770 -1803 14229 27506 14064 8140 6058
6377 6058 8597 16464 12763 17748 -5963 -46567 -38025 -8473 35695 32830 17465 11248 19578 10194
6363 10194 -29436 -34686 -31873 -33136 -38048 -41356 -46967 -51819 -21471 4731 19603 301 1098 -10163
6349 -10163 -4271 22588 -9276 -23916 -30296 -25463 -11006 -17028 11813 37821 17581 -943 7588
$$ packed form
6403e5165J3817J0155j1236P955j899j797K504q866j760J4257k864K1878R782
6390c239J789j1580n020M263K4617J4340j8400q573J6032J3277j3442n924k082
6377F058K539P867l701M985k3711m0604Q542K9552M4168k865j5365o217Q330r384
6363A0194l9630n250K813j263m912l308n611m852L0348K6202J4872j9302P97j1261
6349a0163N892K6859l1864j4640o380M833J4457o022K8841K6008k0240j8524Q531
$$ [...]
##END NTUPLES=NMR SPECTRUM
##END=
