##TITLE=Analysis number 315184
Compound Code sb 00824
Project Code adrs
Chemist Name stores
##JCAMPDX= 6.0         $$ Bruker NMR JCAMP-DX V2.0
##DATA TYPE= NMR SPECTRUM
##DATA CLASS= NTUPLES
##ORIGIN= Bruker BioSpin GmbH
##OWNER= NMR
$$ XWIN-NMR		Version 3.5
$$ Thu Nov 10 14:13:02 2005 GMT Standard Time (UT+0h)  MAYBRIDGE\NMR@NMR_250MHZ
##.OBSERVE FREQUENCY= 250.131544655141
##.OBSERVE NUCLEUS= ^1H
##.ACQUISITION MODE= SIMULTANEOUS (DQD)
##.ACQUISITION SCHEME= undefined
##.AVERAGES= 16
##.DIGITISER RES= 18
##SPECTROMETER/DATA SYSTEM= dpx250
##.PULSE SEQUENCE= zg30
##.SOLVENT NAME= DMSO
##.SHIFT REFERENCE= (INTERNAL, DMSO, 0, 16.522)
##AUDIT TRAIL= $$ (NUMBER, WHEN, WHO, WHERE, WHAT)
$$ ##TITLE= Audit trail, XWIN-NMR		Version 3.5
$$ ##JCAMPDX= 5.01
$$ ##ORIGIN= Bruker BioSpin GmbH
$$ ##OWNER= NMR
$$ C:\u/data/dgb/nmr/ADRS/12190/pdata/1/auditp.txt
$$ ##AUDIT TRAIL=  $$ (NUMBER, WHEN, WHO, WHERE, WHAT)
(   1,<2005-11-10 14:12:37.10 +000>,<MAYBRIDGE\NMR>,<NMR_250MHZ>,
      <created by zg, POWCHK disabled, PULCHK disabled
       configuration hash MD5:
       62 19 C7 07 E1 42 D1 B7 37 6C 3D D0 77 39 F9 E6
       data hash MD5: 64K
       32 A2 12 5E E7 B8 3A 17 8D C2 49 AC 3A F7 75 1C>)
(   2,<2005-11-10 14:12:51.99 +000>,<MAYBRIDGE\NMR>,<NMR_250MHZ>,
      <Start of raw data processing
       ef LB = 0.3 FT_mod = 6 PKNL = 1 SI = 32K 
       data hash MD5: 32K
       23 DF B1 DB 26 42 83 5B FA EF E2 87 A1 07 19 FA>)
(   3,<2005-11-10 14:12:54.07 +000>,<MAYBRIDGE\NMR>,<NMR_250MHZ>,
      <apk 
       data hash MD5: 32K
       1D FF E1 5C 33 38 97 BA DB 89 59 0F 26 6B E3 14>)
(   4,<2005-11-10 14:12:54.97 +000>,<MAYBRIDGE\NMR>,<NMR_250MHZ>,
      <abs ABSG = 5 
       data hash MD5: 32K
       24 75 74 75 6B 30 7A F3 3D 16 7B 1C 94 28 B7 2E>)
$$ ##END=
$$ 
$$ hash MD5
$$ 7D 0C 62 71 5B 9D 72 91 5D B5 84 B7 E4 40 71 F1
##$RELAX= 
##$RELAX= 
##$RELAX= 
##$RELAX= 
##$RELAX= 
##$RELAX= 
##$RELAX= 
$$ Bruker specific parameters
$$ --------------------------
##$DU= <C:\u>
##$EXPNO= 12190
##$NAME= <ADRS>
##$PROCNO= 1
##$TYPE= <nmr>
##$USER= <dgb>
##$AMP= (0..31)
100 100 100 100 100 100 100 100 100 100 100 100 100 100 100 100 100 100 
100 100 100 100 100 100 100 100 100 100 100 100 100 100 
##$AQSEQ= 0
##$AQ_mod= 3
##$AUNM= <au_zg>
##$AUTOPOS= <32 >
##$BF1= 250.13
##$BF2= 250.13
##$BF3= 250.13
##$BF4= 250.13
##$BF5= 500.13
##$BF6= 500.13
##$BF7= 500.13
##$BF8= 500.13
##$BYTORDA= 1
##$CFDGTYP= 0
##$CFRGTYP= 5
##$CHEMSTR= <none>
##$CNST= (0..31)
1 1 145 1 1 1 1 1 1 1 1 1 1 1 1 1 1 1 1 1 1 1 1 1 1 1 1 1 1 1 1 1 
##$CPDPRG= <>
##$CPDPRG1= <>
##$CPDPRG2= <>
##$CPDPRG3= <>
##$CPDPRG4= <mlev>
##$CPDPRG5= <mlev>
##$CPDPRG6= <mlev>
##$CPDPRG7= <mlev>
##$CPDPRG8= <mlev>
##$CPDPRGB= <>
##$CPDPRGT= <>
##$D= (0..31)
0 1 0 0 0 0 0 0 0 0.06 0 0 0 0 0 0 0.0002 0 0 0 0 0 0 0 0 0 0 0 0 0 0 
0 
##$DATE= 1131631955
##$DBL= (0..7)
120 120 120 120 120 120 120 120 
##$DBP= (0..7)
150 150 150 150 150 150 150 150 
##$DBP07= 0
##$DBPNAM0= <>
##$DBPNAM1= <>
##$DBPNAM2= <>
$$ [...]
##$SUBNAM7= <"">
##$SUBNAM8= <"">
##$SUBNAM9= <"">
##$SW= 20.6930455092707
##$SWIBOX= (0..15)
0 0 3 0 0 0 0 0 0 0 0 0 0 0 0 0 
##$SW_h= 5175.983436853
##$TD= 65536
##$TD0= 1
##$TE= 295.16
##$TE2= 300
##$TE3= 300
##$TEG= 300
##$TL= (0..7)
0 120 120 120 120 120 120 120 
##$TP= (0..7)
150 150 150 150 150 150 150 150 
##$TP07= 0
##$TPNAME0= <>
##$TPNAME1= <>
##$TPNAME2= <>
##$TPNAME3= <>
##$TPNAME4= <>
##$TPNAME5= <>
##$TPNAME6= <>
##$TPNAME7= <>
##$TPOAL= (0..7)
0.5 0.5 0.5 0.5 0.5 0.5 0.5 0.5 
##$TPOFFS= (0..7)
0 0 0 0 0 0 0 0 
##$TUNHIN= 0
##$TUNHOUT= 0
##$TUNXOUT= 0
##$USERA1= <user>
##$USERA2= <user>
##$USERA3= <user>
##$USERA4= <user>
##$USERA5= <user>
##$V9= 5
##$VALIST= <valist>
##$VCLIST= <CCCCCCCCCCCCCCC>
##$VD= 0
##$VDLIST= <DDDDDDDDDDDDDDD>
##$VPLIST= <PPPPPPPPPPPPPPP>
##$VTLIST= <TTTTTTTTTTTTTTT>
##$WBST= 1024
##$WBSW= 4
##$XGAIN= (0..3)
0 0 0 0 
##$XL= 0
##$YL= 0
##$YMAX_a= 467847
##$YMIN_a= -470290
##$ZGOPTNS= <>
##$ZL1= 120
##$ZL2= 120
##$ZL3= 120
##$ZL4= 120
##$ABSF1= 16.522
##$ABSF2= -4.171173
##$ABSG= 5
##$ABSL= 3
##$ALPHA= 0
##$AQORDER= 0
##$ASSFAC= 0
##$ASSFACI= 0
##$ASSFACX= 0
##$ASSWID= 0
##$AUNMP= <proc_1d>
##$AZFE= 0.1
##$AZFW= 0.1
##$BCFW= 0
##$BC_mod= 0
##$BYTORDP= 0
##$COROFFS= 0
##$CY= 12.5
##$DATMOD= 1
##$DC= 0
##$DFILT= <>
##$DTYPP= 0
##$F1P= 14.0000005364418
##$F2P= -0.99999901652339
##$FCOR= 0.5
##$FTSIZE= 32768
##$FT_mod= 6
##$GAMMA= 0
##$GB= 0
##$INTBC= 1
##$INTSCL= 1
##$ISEN= 128
##$LB= 0.3
##$LEV0= 0
##$LPBIN= 0
##$MAXI= 10000
##$MC2= 0
##$MEAN= 0
##$ME_mod= 0
##$MI= 0
##$NCOEF= 0
##$NC_proc= -4
##$NLEV= 6
##$NOISF1= 0
##$NOISF2= 0
##$NSP= 0
##$NTH_PI= 0
##$NZP= 0
##$OFFSET= 16.522
##$PC= 1
##$PHC0= 70.56002
##$PHC1= 5.492962
##$PH_mod= 1
##$PKNL= yes
##$PPARMOD= 0
##$PSCAL= 4
##$PSIGN= 0
##$REVERSE= no
##$SF= 250.13
##$SI= 32768
##$SIGF1= 0
##$SIGF2= 0
##$SINO= 400
##$SIOLD= 32768
##$SREGLST= <1H.DMSO>
##$SSB= 0
##$STSI= 32768
##$STSR= 0
##$SW_p= 5175.98343685301
##$SYMM= 0
##$S_DEV= 0
##$TDeff= 65536
##$TDoff= 0
##$TI= <Analysis number 999999
Compound Code 99
Book Reference 9
Project Code 9>
##$TILT= no
##$TM1= 0
##$TM2= 0
##$TOPLEV= 0
##$USERP1= <user>
##$USERP2= <user>
##$USERP3= <user>
##$USERP4= <user>
##$USERP5= <user>
##$WDW= 1
##$XDIM= 32768
##$YMAX_p= 366413280
##$YMIN_p= -638743
$$ End of Bruker specific parameters
$$ ---------------------------------
##NTUPLES= NMR SPECTRUM
##VAR_NAME=  FREQUENCY,     SPECTRUM/REAL,   SPECTRUM/IMAG
##SYMBOL=    X,             R,               I
##VAR_TYPE=  INDEPENDENT,   DEPENDENT,       DEPENDENT
##VAR_FORM=  AFFN,          ASDF,            ASDF
##VAR_DIM=   32768,         32768,           32768
##UNITS=     HZ,            ARBITRARY UNITS, ARBITRARY UNITS
##FACTOR=    0.157963299565203, 1,           1
##FIRST=     4132.6476996994, 0,             0
##LAST=      -1043.33573715361, 0,           0
##MIN=       -1043.33573715361, -638743,     0
##MAX=       4132.6476996994, 366413280,     0
$$ Real data points
##PAGE= N=1
##DATA TABLE= (X++(R..R)), XYDATA
$$ [...]
21637 2489450 2469297 2453899 2363568 2290482 2301821 2287159 2273877 2230056 2136296 2092075 2102950
21626 2102950 2098718 2215028 2190451 2087888 1994587 1974858 1960933 1981753 1939235 1953117 1937548
21615 1937548 1893512 1891100 1920971 1919137 1940055 1957509 1980962 1937064 1915257 1844478 1714149
21604 1714149 1625522 1711884 1751508 1689649 1670500 1765440 1766884 1611951 1534585 1560790 1591494
21593 1591494 1584561 1540795 1567105 1560044 1529418 1493693 1480321 1474353 1464665 1483692 1479625 1395309
21581 1395309 1407217 1378541 1336241 1317238 1332089 1367155 1405758 1381289 1341045 1320124 1349808
21570 1349808 1359712 1348292 1330127 1326287 1266209 1267217 1257320 1328624 1250373 1182205 1154525 1151839
21558 1151839 1162538 1196249 1142975 1135603 1115732 1149705 1180867 1089526 1030521 1083911 1120272
21547 1120272 1115885 1075269 1020418 1062092 1120416 1104546 1082312 1024575 946313 864738 917836
21536 917836 963838 953429 982666 933734 894955 913930 865850 764433 695438 666791 721127
21525 721127 775271 794696 791589 816363 871895 905592 994528 935329 853466 865715 938669 993790
21513 993790 988818 961775 959055 928450 928672 919455 937212 1009998 1129334 1138763 1085611 987555
21501 987555 885198 840289 846646 839223 864000 972432 1004714 971443 882236 891360 919676 874923
21489 874923 796372 756705 785233 667739 577019 650390 711872 694858 758483 766094 771266 822421
21477 822421 799344 733497 744914 662788 685654 718378 648355 575466 584933 639082 678621 584692
21465 584692 619572 676851 652925 600334 538241 495583 483978 532777 531269 545476 620159 657260
21453 657260 597056 533682 482487 483124 558031 623112 585620 519844 510889 478112 545896 590176
21441 590176 571486 624978 622648 572965 481919 472492 408675 393622 441877 479316 534656 634086
21429 634086 541236 507705 552657 578104 507553 476496 485397 507475 481596 465933 469133 516951
21417 516951 524109 541489 471801 474097 490573 472730 479026 439493 436055 437125 444566 440820 412014
21404 412014 437062 456398 473767 414103 366544 352811 335877 394417 412546 363139 347409
21393 347409 395847 415296 433852 396586 354476 308928 332137 286040 220170 199048 294583
21382 294583 348789 340676 435767 477339 459697 323010 298425 289374 327677 377742 417498 320454
21370 320454 330589 342224 303276 310196 310656 361401 348090 329398 425915 477915 417867 431692
21358 431692 414092 347741 308694 387384 435104 393742 333245 259076 281244 273332 270487 370928
21346 370928 345462 292335 248782 313289 368643 282805 186444 146517 127825 181364 257192
21335 257192 306197 316825 288829 260511 328215 352764 330783 261910 223566 230145 255423 302940
21323 302940 274859 212648 235036 241240 282295 259631 275779 314877 280342 250691 284721 235062
21311 235062 151692 178629 201340 281811 312953 289674 276846 301543 303839 315480 327030 343415
21299 343415 341178 327171 298412 261399 274732 278302 383260 356047 316436 292649 325059 254384
21287 254384 248237 217796 215392 184835 177736 255086 275779 222304 207896 258182 254160 202287
21275 202287 222955 236863 283128 247217 286587 311891 271286 284812 382606 429255 329090
21264 329090 283076 225381 216657 207074 188544 138967 180722 248273 222406 217512 208197 115761
21252 115761 152714 180898 157190 243999 356273 331877 232264 265630 258704 275814 257074
21241 257074 175575 168996 208514 277740 304922 279133 263638 285150 284761 267410 267503 202249 99258
21228 99258 53192 144884 221096 187224 161918 183185 193549 138538 118623 135492 196610 119571
21216 119571 90970 11169 -23609 4872 18607 22880 51595 100474 122285 132678 101387 156570
21204 156570 131251 60282 79221 65641 85324 119685 94076 145759 245866 269407 301272
21193 301272 250878 180123 128391 96127 117809 122352 154965 98654 -7041 -15388 17745 51593
21181 51593 -14883 19596 29806 71512 124189 174304 145628 145290 167105 180204 234684 228732
21169 228732 152171 97141 122441 197642 170752 111178 112544 88789 100105 50847 47443 187561
21157 187561 222414 156139 119476 190194 178784 123379 71719 73540 161305 220239 165773 32712
21145 32712 -27413 31467 119165 126849 160913 177868 186801 194599 233966 220305 170345 224573
21133 224573 243258 228558 212873 182987 155460 155880 70831 65563 85833 142661 105100 120162
21121 120162 169992 189845 86992 26775 81101 154539 209856 205725 132918 100340 135163
21110 135163 181763 188022 153812 141336 149567 161708 184250 165047 147090 107868 89456 109941
21098 109941 133103 153289 129150 78727 -22261 10989 107636 125708 53251 16116 61476
21087 61476 93113 162694 179426 172748 162176 94214 94222 81509 93452 89775 81689 121907 168071
21074 168071 148213 104256 20018 6622 91428 161926 126463 32749 4739 137445 285449
21063 285449 283064 307135 300551 269303 254929 238928 183561 193297 226888 227916 200088 73154
21051 73154 13122 -4770 103475 129406 76906 24597 74223 179967 199423 77159 96387
21040 96387 162955 143447 95809 71645 80638 99941 105908 72639 73578 111576 155857 149628 171468
21027 171468 178453 188807 184986 163601 174866 251741 270825 194838 145448 186952 124250 84340
21015 84340 130616 215819 123476 38823 48891 77344 156551 191614 186162 145697 36371 48698
21003 48698 94454 106062 50485 22576 13691 32016 65700 -39871 -126318 -164345 -72645 -49998
20991 -49998 -77853 4827 96269 75977 86078 85906 116384 85889 9031 11628 -10223 -4650
20979 -4650 121808 178423 238042 245838 212098 148439 83443 26272 -53266 -55139 -18733 37491
20967 37491 66215 101523 72474 17603 -45223 -24557 -4477 5056 42056 14411 90058 178418
20955 178418 159023 92105 91301 103574 155805 165944 247314 269168 172980 166469 177523 146767
20943 146767 56310 106052 140188 59631 129454 163628 210361 141054 59202 -30048 6641
20932 6641 39677 43472 90931 119621 147404 134666 65338 49925 62030 56432 23270 46437
20920 46437 65360 152410 217327 169111 225230 200022 144785 108509 117460 87621 26056 78882
20908 78882 60530 143782 266865 212773 123757 142665 112576 137578 146837 157579 119322 54189
20896 54189 82780 104460 28502 33553 -28983 -26060 65630 96452 122406 89418 56406 33259
20884 33259 -69133 -128159 -91639 -50646 -44096 -83812 -21834 -35022 -10040 4399 -46642 -57718
20872 -57718 -118280 -135733 -74207 57284 136089 135741 109680 124159 59128 1899 31748 38697
20860 38697 34544 39196 -15486 -7114 32646 78877 140728 64796 -18243 -41954 -17055 -21567
20848 -21567 -39759 -53835 -61552 3126 56063 38350 89771 186015 218189 149314 56891 42911
20836 42911 53779 58062 2047 -4862 39188 113027 228258 296695 318868 239233 206010 156552
20824 156552 131730 140236 89481 -17882 -7026 -69899 -135236 -109049 -77846 -48639 -42359 -3401
20812 -3401 67127 78817 24553 60563 129529 121114 26239 35364 47045 36122 -6346 22508
20800 22508 -32657 -3348 33984 89052 86953 99810 135274 82904 112337 171976 137578 129146
20788 129146 94139 189712 173575 94978 106818 116637 68945 57381 -10396 -59475 -122445 -131985
20776 -131985 -85473 -27318 -3919 25906 40709 -52115 -7910 21744 -57863 -42543 -23516
20765 -23516 -99496 -90424 -115534 -126613 -103171 -88781 -105323 -1003 -3910 -9473 17970 66000
20753 66000 95880 102705 96156 55419 40238 58571 21045 -45272 -85188 -8065 24988 114957
20741 114957 101941 110611 80069 11559 -7629 48754 102816 86997 -4204 -60026 -29635 -47013
20729 -47013 11033 80521 78444 39185 20740 -9470 -67526 -146411 -55957 33487 23468 -26594
20717 -26594 18094 -18783 -73563 -140548 -159320 -55546 42453 -9979 -99240 -90291 10777
20706 10777 34284 380 -97239 -155978 -81711 22943 45075 84063 44555 16220 16290 50427
20694 50427 42890 46440 71335 134996 172807 119592 24780 -40240 -5415 33822 41828 41969 31427
20681 31427 10409 -39358 -95985 -26559 88869 118568 78140 35429 17077 103938 74654
20670 74654 47895 97337 132069 138564 92908 115350 196818 148949 158323 92266 37222 -17971
20658 -17971 -27927 -46148 -72570 -67946 -45464 -6661 -42775 -10335 29225 12402 -25616 -37656
20646 -37656 -42343 -45166 -32063 -14788 -15384 -53813 -15628 22577 37388 75408 101101 137126
20634 137126 90375 86388 46378 41389 -6091 4593 12572 10746 -23623 -2560 8597 13089
20622 13089 57103 109483 6256 -30500 -42497 -41603 -88183 -97109 -92130 -31955 13467 67960
20610 67960 38951 51786 96300 47790 31256 117764 45147 14580 -34822 -87313 -86073 -131662
20598 -131662 -157089 -144846 -53222 4507 -14075 -46657 -9990 85016 100414 108080 51622 -52195
20586 -52195 -71622 4824 22433 31409 207424 222569 110964 125784 109437 61457 -27135
20575 -27135 -131229 -166046 -109745 -14207 40264 55623 54363 7489 -2586 -7742 -42288 -104865
20563 -104865 -43501 -93035 -86642 -72709 -53284 -6224 92827 97027 46240 89588 85852 24287
20551 24287 56912 52800 18403 12056 -32902 -105714 -87884 -73104 -48484 -52535 -90030 -91800
20539 -91800 3339 -28496 -72258 -27162 -15625 -18935 42533 36042 -23555 -125482 -171552 -104631
20527 -104631 -103015 6619 84780 61991 50900 45929 53296 104994 111330 155350 220116 119771
20515 119771 23459 -5645 -59172 -107097 -165685 -111820 -45821 -3584 80775 70179 25147
20504 25147 -33038 -13642 -19606 23820 -21978 -84351 -60462 -20184 -7279 -47157 -67649 -102208
20492 -102208 -110969 -46812 7990 -23368 -104804 -170480 -201463 -125076 -65283 -60380 -41637 -19128
20480 -19128 -32021 22024 105985 138346 136998 25782 34386 95167 81302 50542 88253 84051
20468 84051 148571 151721 124378 119848 142276 31066 -50129 23345 2482 -86703 -124578 -169123
20456 -169123 -222036 -179178 -121573 -93928 -79243 -58993 -45918 39702 38204 -23727 -57525 -53768
20444 -53768 -90410 -106826 66591 183325 243229 211095 130711 60414 9150 75812 73668
20433 73668 104798 98484 71756 76891 -48306 -138351 -115272 -50313 -50496 -33746 -78525 -93915
20421 -93915 -92270 -111932 -77839 -68091 -86680 -101881 -78946 -111771 -87215 -61636 -155552 -173378
20409 -173378 -142728 -131813 -66508 -50399 -103271 -167460 -202435 -188479 -30736 37155 -19930
20398 -19930 -100801 -113920 -47298 -89494 -140077 -71497 -72945 -67959 78070 79119 76724 11607
20386 11607 -39519 -58688 -4987 -20026 -81969 -54592 -18408 -22302 59951 30363 -36267 -96337
20374 -96337 -67961 -1469 3454 -25983 -90274 -97601 -129551 -63802 -26601 15848 -32443 17600
20362 17600 61692 21583 -55359 -94810 -137673 -132423 -42276 55554 8111 -10077 69 2851
20350 2851 18297 4746 -87594 -92805 -84991 -33787 12631 -4606 -95838 -158002 -146690 -113039
20338 -113039 -60579 -12968 28210 29032 15047 51468 58378 -19970 -38409 34461 68700 85904
20326 85904 132552 199775 160504 85984 73263 -25682 -37377 6712 -36953 -22672 -7018 2407
20314 2407 -124186 -119030 -128937 -89876 -33353 -72979 -109357 -192014 -146486 -125596 -47564 8852
20302 8852 -57843 -105950 -18347 57972 39137 16070 72925 22275 -20266 -127082 -179368 -187892
20290 -187892 -90899 -33171 -58832 -64346 -4130 15118 -21491 -28320 7470 4159 -37978 -53881
20278 -53881 -111648 -48444 -5536 -60765 -139032 -62637 34665 60066 75524 59934 15476 11736
20266 11736 5400 -5980 -20079 -8524 -14396 -43240 -28098 42434 -37262 -118011 -80544 21009
20254 21009 65 76712 149108 88677 36404 -15711 -55261 -127709 -161050 -222351 -255559 -121483
20242 -121483 -120703 -150225 -84344 -102746 -141830 -59613 39515 113307 74607 11421 -54665 -130049
20230 -130049 -137711 -25208 91412 56881 31025 69386 -51138 -121787 -50858 -19335 -83210
20219 -83210 -111977 -83283 -3301 36632 45455 -18004 -57059 -70435 2535 -48416 -98667 -129525
20207 -129525 -141816 2126 32399 30909 77262 61620 -37 -8037 -52220 -83705 -32721 -9232
20195 -9232 1233 124589 110678 64519 18419 -9128 64944 97734 26193 -15325 -13251 -24646
20183 -24646 -66866 -55904 -49559 -70463 -34192 -51738 -40945 -43815 -77354 -107556 -125420 -39305
20171 -39305 -30689 -49470 -71063 -24212 -79445 -58946 -43407 -79285 -113654 -96835 -100279 -142490
20159 -142490 -220813 -273463 -230518 -209951 -145838 -73543 -66672 -117368 -133978 -102519 -24733 7640
20147 7640 -1070 22613 -112592 -122806 -70411 2636 91663 173690 133375 77339 25641 13504
20135 13504 -11110 -67497 -126215 -185995 -186959 -159935 -67416 28992 67570 38365 -64717 -79113
20123 -79113 -49290 -57702 -140016 -121593 -88523 -79419 -73594 -32420 3928 42323 69048 96743
20111 96743 35928 -25222 -41563 2764 -9161 -28834 -29000 -87884 -83720 587 72161 50244
20099 50244 31059 21525 -23334 -3766 -66804 -79099 -58239 -93345 -75968 -81073 -95570 -149626
20087 -149626 -163947 -144975 -75601 -67426 -59608 -35430 -30979 -16949 -67556 -142480 -122651 -119303
20075 -119303 -129084 -123959 -97023 6352 21046 -304 -49383 -57640 16069 19053 -56847 -57192
20063 -57192 -38698 -38618 -88373 -120638 -191330 -166718 -126985 26442 23432 -58345 -70963 -22646
20051 -22646 -26984 -80029 -160969 -200655 -237024 -97102 -10616 28466 -9890 -61720 -5918 4967
20039 4967 -43573 -79393 -83114 -43445 -748 -17370 -32527 -30266 40687 -21988 20937 -1389
20027 -1389 -52408 -34527 40847 145245 212978 200041 165837 113730 70831 -27976 -79988 -103600
20015 -103600 -94632 -84 122822 155635 151421 91478 32097 19828 18581 44226 46304 4113
20003 4113 -112714 -193465 -188250 -167298 -123183 18287 58103 17167 10314 -23604 -73852 -53873
19991 -53873 -54897 -47774 13610 58528 94967 90288 68006 47651 -14770 -59419 -36444 -1600
19979 -1600 -3334 24193 -18925 -56300 -65595 -110745 -93113 16137 -16482 -73999 -82891 -43009
19967 -43009 -18907 -2852 -13633 38220 -23016 -103915 -104336 -152369 -198545 -169952 -163277 -177872
19955 -177872 -167064 -124637 -52283 9452 25778 -62445 -79219 -136964 -162783 -136166 -117648
19944 -117648 -46008 31110 -32915 -175705 -94727 -32184 -141424 -213172 -131643 -36257 6538
19933 6538 26888 -30602 -84912 -109962 -138644 -138019 387 107002 103425 119935 108684 53761
19921 53761 28308 23459 28834 34445 -34571 -71621 -140713 -79685 -95551 -150159 -183895 -157709
19909 -157709 -104505 -34071 26558 9856 -32855 -34967 -96618 -130459 -100050 -66276 4281 41917
19897 41917 34981 -81377 -127334 -114093 -115885 -85439 -121784 -28910 -85202 -176697 -187969 -150347
19885 -150347 -91296 -138970 -148437 -68457 -13889 13479 18392 6028 129414 170735 137202 100618
19873 100618 18321 -49429 -111483 -139603 -100049 -135944 -115987 -153402 -166459 -77793 -63487
19862 -63487 -84253 -35134 -167364 -246626 -236088 -197417 -170389 -95592 -18561 -19246 -55555 -25010
19850 -25010 37163 -33745 -62674 -112132 -117350 -4959 59060 13778 20788 -6871 -6123 7346
19838 7346 14490 2493 -50572 -114608 -131543 -134651 -98061 -124238 -148160 -10089 45436 22466
19826 22466 25758 -41733 -74846 -24770 -76912 -79798 6259 32037 124864 114409 133478 101103
19814 101103 49013 30288 32015 31652 17723 26512 -5745 -14416 -72430 -75559 -104030 -93262 -35208
19801 -35208 32791 84062 89383 75473 55137 6387 -22804 -59847 -57808 -56541 -58487 -60427 -106493
19788 -106493 -125121 -111006 -146438 -158283 -133062 -183003 -215273 -155321 -144318 -169820 -205683
19777 -205683 -122377 -85759 -87298 -60437 -7973 44189 37698 18014 -39552 -38963 -55974 -43013
19765 -43013 -75035 -133530 -41261 15915 -26172 -19273 11677 23103 38343 29803 37951 -27965
19753 -27965 -110855 -96895 -84436 61056 69270 13339 22614 3576 -68138 -184090 -200187 -146560
19741 -146560 -111698 -128873 -141347 -46413 33351 78389 507 -54884 -14719 66893 38101
19730 38101 2758 -21020 -122649 -122177 -58314 -23697 -25123 20845 37085 18337 -61051 -40751
19718 -40751 2586 91804 126190 24417 20518 46646 7117 -66185 -58900 69921 172503
19707 172503 110944 -34948 -5469 23396 70804 216826 261104 243502 153718 -12236 25715
19696 25715 132912 160510 260118 302142 307604 382237 536354 675381 731073 665249 634630
19685 634630 584260 502361 505693 522327 483258 434655 495225 498048 453173 445896 509085 569064
19673 569064 570959 614054 655754 660817 636194 594084 559698 574734 546487 455671 424675 420037
19661 420037 371289 343984 281216 208851 219226 240518 148374 96948 7187 41196 151954
19650 151954 229668 245707 240842 310396 384350 463907 459808 466750 447546 458244 466374 438507
19638 438507 410351 393194 353014 371336 390925 445648 542667 626526 721304 785028 719074
19627 719074 653552 600554 606699 615887 714015 711899 646313 635322 740053 722073 773053 725183
19615 725183 701870 633925 616137 616099 472651 321344 348269 363407 407003 350557 241430
19604 241430 133971 125437 141565 209234 282899 259495 226092 172505 95834 128396 136592 19451
19592 19451 11292 23408 85826 231487 313528 279448 205250 167262 123895 73158 -32048
19581 -32048 20443 83274 58499 53836 98482 103028 94389 92109 11754 -78514 -12735 16587
19569 16587 -61953 -23749 59857 39049 -19786 -33652 -48124 -89309 -62811 -97303 -31023 -33999
19557 -33999 54266 65068 64046 22445 8123 -7065 934 -51421 -26766 -48932 -54437 -116882
19545 -116882 -142933 -111736 -123076 -71515 46277 69110 67936 38764 3164 50128 59972 16538
19533 16538 -40632 3286 -5948 3342 -22736 -36985 -68174 -93463 -77155 -31052 133963 185536
19521 185536 110908 124498 208955 196292 123756 124095 121903 102931 78447 26784 -98248 -140967
19509 -140967 -51914 3124 -20520 52312 73608 70641 10736 14338 37106 13899 -49388 -63722
19497 -63722 -64332 -28597 79205 93367 95355 47078 43641 54475 53161 121324 111376 71457 111914
19484 111914 214116 186995 252470 220823 129588 103507 154145 140912 192936 103508 104578
19473 104578 151057 176756 206160 276546 266029 311732 335501 248203 238023 209117 229069
19462 229069 168832 159155 230392 200431 215296 275486 286896 287606 382749 401483 350953 355711
19450 355711 362985 356181 351455 375668 296203 252766 266355 203939 206088 411685 402305 438737
19438 438737 522192 514794 523560 511531 466917 485034 464514 502125 520847 584763 736305 836421
19426 836421 794385 772655 778322 772184 791020 841350 892813 853695 910593 1039015 1078314 1133675
19414 1133675 1220544 1250440 1284769 1334721 1387233 1406945 1425210 1431418 1555795 1613556 1641393
19403 1641393 1718799 1779947 1817196 1838368 1824601 1927003 2069645 2075542 2103100 2129033 2295204
19392 2295204 2458626 2515427 2589148 2714610 2848043 2946634 3137703 3249220 3261083 3334229
19382 3334229 3468715 3578618 3627264 3799474 3948354 4046993 4170251 4331688 4466564 4420151
19372 4420151 4390540 4416599 4450925 4476203 4485991 4509778 4601217 4654862 4721033 4781928 4749546
19361 4749546 4644784 4481985 4425845 4319242 4255798 4159433 4027049 3872734 3606019 3353773
19351 3353773 3047845 2796657 2695764 2698870 2623242 2589293 2539462 2488926 2452685 2418346 2290930
19340 2290930 2139152 2023744 1947549 1927467 1850277 1775874 1740743 1616012 1492658 1440571
19330 1440571 1391809 1269496 1188613 1184616 1209494 1158148 1118561 1046923 1003533 916528 903712
19319 903712 920932 936823 933051 968731 983089 932247 851365 734441 684201 715834 655153
19308 655153 592099 636144 634835 523675 491534 465516 505905 504960 422634 322350 83170
19297 83170 -110599 -243356 -293746 -301129 -263683 -318353 -414035 -417521 -449870 -449312 -366092 -332363
19285 -332363 -222515 -57496 59893 25970 -39858 2876 26532 54867 66657 36305 -9972
19274 -9972 88665 125711 168813 233535 265203 256417 161269 105774 58979 26699 60185 56944
19262 56944 52719 80256 79956 27530 -23104 -44335 -21295 35747 139301 134223 91692 93921
19250 93921 120937 77761 90118 83045 51581 99101 154402 197554 220704 226942 200797 202754
19238 202754 183466 73888 -21542 -172959 -276633 -284983 -188996 -85373 34772 208966
19228 208966 325293 383504 439013 596950 788868 929763 1002079 1027737 1067721 1054947 1041831
19217 1041831 920914 952509 938366 938743 936382 952561 1010919 990929 997136 1076896 1150782 1313646
19205 1313646 1471033 1528002 1601403 1812405 2077563 2415494 2862118 3382339 3755766 3932047
19195 3932047 3988169 4051308 4102165 4205027 4295903 4448802 4710121 5089403 5802660 6641176
19185 6641176 7833202 9486013 11849448 15436598 20486801 26083492 29826291 30519892
19177 30519892 29332551 27626137 25647562 24116138 23748998 24613803 26959566 31060453
19169 31060453 37687319 47952016 64089635 89767283 130294211 187787805 244930033
19162 244930033 276993066 283246890 272975665 242030233 197346177 156640287 123763727
19155 123763727 98884656 83459582 76601339 77049216 83522518 92407312 96831116 92914329
19147 92914329 83097727 71161987 58746419 47918872 40344554 36025835 34531942 35637548
19139 35637548 38301504 40081070 40000484 39009522 36699724 32944607 29397820 26704225
19131 26704225 24815621 24025585 24487705 26221894 29175265 33464331 39030990 46394882
19123 46394882 56813358 71180240 87079498 98217336 100572458 96203800 89312515
19116 89312515 82267175 77959597 79453201 88876247 108663373 142800576 192327933 248833300
19108 248833300 303053598 345528379 353378726 317388776 261924243 207080428 154171768
19101 154171768 111534992 83115100 65397726 54636675 48486862 44903487 42675394
19094 42675394 41673079 42381467 45085108 49055906 51420183 50336327 47205326 44560135
19086 44560135 43176120 42739477 43323999 44146178 42699767 37763967 31791057 26266771
19078 26266771 21112824 17060038 14364023 12622188 11437957 10626461 9932675 9362071
19070 9362071 8837174 8488123 8367988 8163842 7579233 6916228 6343756 5628739 4835962
19061 4835962 4288872 3975271 3818998 3636895 3519539 3355212 3257503 3241069 3165201 2991201
19051 2991201 2849414 2832608 2795183 2646327 2582835 2623446 2707873 2821690 2967915 3013692
19041 3013692 2913406 2860258 2778076 2619062 2514171 2514954 2566547 2539743 2454858 2457473 2515685
19030 2515685 2509442 2608519 2667817 2629034 2585893 2435356 2388194 2441413 2543748 2488859 2346414
19019 2346414 2150714 1871457 1750821 1681043 1528169 1324030 1247966 1243124 1261636 1291302
19009 1291302 1399882 1405434 1383632 1364657 1312556 1291559 1302461 1220816 1091531 1121304 1069019
18998 1069019 979016 966898 1022583 1022990 948082 929318 1054647 1114161 1214118 1250409 1239176
18987 1239176 1216759 1314805 1451397 1515375 1635210 1755465 1865316 2032409 2101329 2237538
18977 2237538 2270595 2197900 2084448 2027019 1934210 1844969 1755156 1568631 1416982 1322516 1201394
18966 1201394 1044229 1020254 987902 962274 1024942 946626 828519 850035 872460 828535 792870
18955 792870 736363 760628 810694 734011 759665 751100 698308 753605 840392 795080 676324
18944 676324 601996 620105 581101 675543 728340 705611 739471 676918 687928 690833 729131 696994
18932 696994 712915 707824 702899 761652 733645 701746 691576 763573 772835 806341 843361 876051
18920 876051 874871 875664 880093 860238 747699 508583 376487 349973 315259 159772 14401
18909 14401 61812 79478 88064 152440 220713 218593 197545 250875 350935 344620 298380 335921
18897 335921 371324 298019 302065 392683 331061 293611 321922 354514 339711 321626 327970 409124
18885 409124 487472 493355 420379 386469 383339 343999 355895 362225 340828 309299 409000 413944
18873 413944 367602 341425 321078 385927 382975 356845 323794 387891 465808 381543 296593 267947
18861 267947 296094 317593 312390 264823 234555 279625 402430 364908 312414 222025 157554
18850 157554 181822 162787 131192 192165 235211 260795 187296 169417 155296 194802 281113
18839 281113 361474 386196 422924 373679 341557 327363 309256 320779 324227 345852 323944 294423
18827 294423 300680 320916 266888 283381 324161 328448 322070 305121 270035 315111 395395 373833
18815 373833 366509 341683 327963 293421 275215 307357 349978 266098 162846 118478 127195 158913
18803 158913 194434 192011 198899 231855 157088 66570 149467 221774 233815 181570 128215 172486
18791 172486 153251 109603 42672 103167 247872 297260 293213 259240 190018 228118 197748
18780 197748 127443 136670 174891 218081 250647 286727 262027 288657 315372 351280 315822 309963
18768 309963 371475 310268 310880 326861 336943 409131 539826 504565 492786 476510 474824 467271
18756 467271 350282 297372 364383 353244 345188 326254 311008 332166 279479 208526 221330
18745 221330 238068 116738 4701 70024 196169 243003 243943 228379 215268 314200 308380
18734 308380 268108 241977 192131 194854 206338 183134 164727 203327 154745 186086 226208 301385
18722 301385 298727 310762 336044 293412 259379 245518 237482 144703 108412 182285 255146 285516
18710 285516 349771 482461 504981 457290 425089 417240 390728 364896 334902 200000 -4892
18699 -4892 -270683 -337641 -342102 -359871 -277647 -206927 -144325 -66823 -75230 -36494 -117286 -128575
18687 -128575 -128675 -106477 -138150 -30125 83002 65862 87854 104505 47832 27723 29462 34012
18675 34012 107126 168382 147123 117922 204409 249542 277818 287561 297082 149003 255503 236976
18663 236976 104741 86188 141822 184449 156003 173730 188969 232167 345760 415473 413637
18652 413637 391441 363985 397103 410071 418677 412102 344002 298546 142988 -3402 -98496
18641 -98496 -117813 -131612 -141200 -172557 -191210 -229920 -171120 -126235 -28896 203197 442496
18630 442496 606255 670786 752970 839734 782413 654445 597753 508655 405613 350318 485080
18619 485080 687244 649267 596440 586546 601295 622630 594454 506905 552416 571946 604002
18608 604002 738139 814037 885905 984637 1269120 1708925 2086932 2354887 2340827 2196860
18598 2196860 2002155 1850232 1776601 1669271 1594687 1547404 1428999 1299333 1250206 1312266
18588 1312266 1413447 1574052 1723967 1955347 2224295 2567881 2994397 3793521 4556131
18579 4556131 4942761 4902385 4742164 4486458 4208069 4097460 4153401 4375196 4787137 5502850
18569 5502850 6745580 8933407 12568118 18119709 24721577 29514590 31114485 30530976
18561 30530976 27850815 23200089 18541958 14828200 11956451 10027206 8988278 8643120
18553 8643120 9141375 10039040 10783616 10785496 10010039 8915564 7780859 6674376 5850946
18544 5850946 5433129 5163702 5002570 5004813 5149311 5421093 5811129 6389698 7242012 8321980
18534 8321980 9662933 11100903 12733878 14923352 18122285 23010596 29824677 36819502
18526 36819502 40917124 41255386 40047168 38746505 37483625 36677044 36973638 38626378
18518 38626378 41873142 47425889 56619238 71706318 96489883 137140655 199877544
18511 199877544 277804779 340233319 366413280 362470961 332894155 279042446 220969751
18504 220969751 172198990 133631983 106981447 92075276 86607083 88627014 96092564
18497 96092564 104036484 105529735 98449344 86668373 73377471 59696739 47625866
18490 47625866 38550815 32319619 28094303 25247472 23240524 21673347 20403450 19426715
18482 19426715 18787749 18412896 18371576 18546431 19005062 19592608 20299754 21460028 23380350
18473 23380350 26449645 31331827 38841663 49965895 64906373 80303655 89896781 91291119
18465 91291119 87654867 82515647 77621229 75660743 79510919 91681947 115145061 151991089
18457 151991089 196410881 240008087 280617578 304211703 289484712 245802890 199319341
18450 199319341 154184294 112717687 82540769 63200727 50842679 42872157 37654246
18443 37654246 34257137 32177775 31364654 32117911 34458468 37265880 37976778 35583937
18435 35583937 31626937 27395262 23117375 19338217 16670214 14775844 13253539 11966607
18427 11966607 10865235 9778722 8889463 8229577 7643913 7141487 6687170 6310742 5934072
18418 5934072 5552412 5258044 5009903 4912528 4631192 4381541 4338139 4232020 4062955 3945116
18408 3945116 3814888 3736974 3615792 3418877 3274413 3148866 3077135 2909056 2814581 2800972
18398 2800972 2820781 2885097 2880599 2674926 2466861 2422794 2318473 2197892 2188695 2189048 2133191
18387 2133191 2145229 2140437 2166511 2234513 2332562 2515482 2599994 2570445 2506576 2430432 2340964
18376 2340964 2220525 2055218 1864166 1832332 1868920 1836145 1836851 1836014 1907337 1915495 1840672 1827935
18364 1827935 1831664 1710657 1576898 1511901 1513946 1504683 1448815 1435738 1410195 1341792 1357895
18353 1357895 1411370 1337844 1284836 1229245 1213163 1209751 1174093 1110708 1147846 1140098 1180387 1195238
18341 1195238 1253192 1245250 1306669 1346568 1305085 1222337 1130182 1092412 1174601 1310037 1356202
18330 1356202 1381429 1482810 1603346 1751112 1801065 1845050 1826885 1893459 1937043 1950504 1904470
18319 1904470 1796063 1597422 1487598 1337384 1160052 1015080 960293 988532 1091277 1132458
18309 1132458 1111435 1036959 985687 942607 969325 982216 959078 890887 871557 922246 932783
18298 932783 914959 868815 869648 879503 818686 698424 755166 754834 754454 756806 713190 720207 770350
18285 770350 784832 818999 772049 696926 745106 817300 840422 839273 857739 830184 794284 789980
18273 789980 879543 918542 929879 942835 950933 984468 1032255 1012646 928418 811794 681373
18262 681373 544593 483818 408659 373474 444515 453202 474677 448804 398616 351454 426150
18251 426150 444993 468055 451105 459688 462136 513770 519531 496969 411587 408038 449612 392907
18239 392907 408534 469033 455945 463240 402760 316646 313578 372205 312060 288544 345528 363469
18227 363469 376540 389624 394867 420168 508394 500524 458440 494620 445425 300647 300784 323404
18215 323404 348664 378962 413281 355921 348840 303297 241889 237130 219104 211466 230690 252018
18203 252018 169403 102125 187814 256018 258657 311619 315379 401610 429354 402150 382185 397230
18191 397230 426111 371205 303079 313307 363511 412692 439406 502972 546770 509079 499133 551328
18179 551328 482176 437194 373593 259724 229193 292320 429921 401651 456682 401155 417397
18168 417397 414332 368479 397502 420779 379625 359836 388688 349709 293101 301217 396700 434467
18156 434467 464723 526777 566553 532994 497659 470524 445030 444572 332061 459820 621191
18145 621191 538245 475501 413274 337970 356747 351292 401881 400163 367121 458843 427307 264204
18133 264204 167087 159349 156792 205051 215115 234975 281283 285946 320299 240815 247166 321374
18121 321374 344364 263165 302066 309522 288449 311783 281508 339622 439784 534754 663899
18110 663899 723656 803924 789661 783487 818119 887498 926254 926223 947769 982660 927409 828054
18098 828054 802506 804319 839766 900674 978179 964383 816282 717174 589075 546270 534238
18087 534238 481244 412529 367865 305332 321365 362693 373162 354938 297682 230992 309445
18076 309445 330963 456012 509800 468380 446182 434651 499783 460750 467141 513279 508553 521648
18064 521648 597692 658329 781753 944463 1105687 1256774 1362145 1315491 1245316 1261499
18054 1261499 1345829 1290679 1166026 1041368 882462 826063 725716 642511 658799 628700
18044 628700 542821 586150 573558 374524 308830 280928 329784 297645 274768 299860 328316
18033 328316 358477 388710 416667 378833 344119 300439 266464 268284 310526 348581 370490 394856
18021 394856 318311 261965 184705 265280 349402 370970 385712 461063 475892 367274 438843
18010 438843 565509 703037 763763 833772 850448 854943 866880 966570 1104729 1156511 1190092
17999 1190092 1254523 1365260 1560353 1683823 1677830 1624824 1603228 1639253 1550834 1395966 1337571
17988 1337571 1299079 1213699 1152430 1131282 1154833 1259226 1317118 1288885 1258624 1380014 1470773
17977 1470773 1487275 1544472 1463499 1343775 1348263 1375960 1433690 1463307 1434736 1391352 1255312
17966 1255312 1149420 1049057 1023231 926553 867375 867830 863064 918696 970401 973107 916838 904996
17954 904996 1007855 1031547 969156 983009 962412 912255 942875 888395 831026 817428 914271
17943 914271 902003 792369 751836 809533 753407 728356 754334 810393 897915 951629 1033102
17932 1033102 1162125 1160347 1248700 1397699 1480752 1620765 1589380 1443832 1317007 1200217
17922 1200217 1071207 1068612 973257 824762 645655 614110 671897 838202 949715 965574
17912 965574 1004714 1042472 1057823 1060920 966867 816317 735913 654627 574819 510418 458275
17901 458275 425630 325922 279115 302822 239341 261364 382007 383688 381060 349327 271001 135465
17889 135465 59961 55335 122719 194873 243033 352487 406706 438129 423251 338407 192575
17878 192575 141785 207560 295126 238199 231655 305041 364652 291118 294092 316675 180097 189119
17866 189119 219974 120134 103494 90514 86821 58603 110966 187143 203042 203569 77970 -600
17854 -600 110273 109097 116706 87055 101627 186418 125776 28291 70023 230224 213037 195315
17842 195315 176580 197951 110921 64870 46393 82781 173233 148880 146698 159304 82126 23191
17830 23191 69540 18391 56461 120617 95307 180040 213594 228059 223313 164059 136466 143271
17818 143271 179236 105633 143029 228326 163559 121210 102951 43007 42956 135627 160345 127873
17806 127873 107569 113354 152652 258488 261558 287568 242615 173100 171601 129409 30720 49707
17794 49707 109403 105700 184524 143110 89252 64949 77212 122431 122849 120439 179210 182127 171321
17781 171321 189361 176900 135232 80467 100899 198673 155581 124806 90406 105980 112709 152222
17769 152222 127703 114561 193879 204722 160949 72052 16103 33585 -70982 -122957 -124413
17758 -124413 -68291 -58899 -224 23886 24931 5127 57164 21381 -6502 39940 110785 143468
17746 143468 94484 45058 70388 93475 97868 129591 190989 187062 130902 90770 50217 38580
17734 38580 15546 22873 65262 26382 -491 24572 13695 22534 2698 20914 32223 100371
17722 100371 98535 49814 55975 48308 -19994 49644 169542 227785 189584 157726 167104 164291
17710 164291 154769 93879 89525 164628 225512 276136 234188 175591 91137 38586 108916 162964
17698 162964 210379 134888 85116 37226 35833 69872 57384 54874 92108 153665 171609 125760
17686 125760 32004 24574 -6004 -25083 97147 155868 152528 69062 -11165 29195 36667 37976
17674 37976 95218 124880 121287 109257 128593 160475 141288 123827 82165 67294 56497 1282
17662 1282 12364 76716 76501 87562 135532 154875 160710 157641 124323 43998 12844 32044 115963
17649 115963 115973 64897 53303 81657 127146 99927 120148 137166 138607 63753 30119 112489
17637 112489 96848 116037 197177 109742 60012 40811 40368 33205 43809 80927 62652 57726
17625 57726 -2843 -105982 -133842 -132684 -183133 -200969 -102339 36222 82765 129384 150200
17614 150200 152053 34035 7900 -55525 -70154 -27900 -22347 76859 185495 164307 144852
17603 144852 184170 259371 236667 222686 181926 109932 46463 -24930 -19275 59601 74265 106473
17591 106473 102305 66333 83541 64815 22321 -21377 -55828 46841 88699 89788 90490 141216
17579 141216 147822 91572 -10720 -116212 -82541 16461 -4135 22956 -13172 -95663 -61441
17568 -61441 -44701 9984 48820 104059 134558 45268 9379 19617 1155 98258 84178 13592
17556 13592 -26332 -23603 10190 122040 164901 110659 26661 34312 48578 52627 36078 60245
17544 60245 107596 150644 179293 177100 128361 139976 146682 123786 111460 79198 80011 87394 38813
17531 38813 60542 39777 103139 138967 160883 141883 175986 145549 105144 87640 77254 -2535
17519 -2535 -13279 26772 64391 65115 103898 136869 170595 161088 155269 153695 63409 62543 71499
17506 71499 71184 36466 -4481 12401 15446 50487 7606 33519 44867 42556 63558 49732
17494 49732 53179 63640 111522 64735 86615 138785 150652 94163 46531 48275 91815 92681
17482 92681 126727 213426 175115 143493 42753 38082 78549 165899 205863 111551 71319 61739
17470 61739 18375 17347 1518 25294 85740 121853 116318 111135 79263 119793 55535 33500
17458 33500 20150 19787 58249 14148 -27660 -93071 -165994 -81607 -40730 -3048 -42077 -24403
17446 -24403 27692 38451 80220 167456 140223 50457 8830 -28753 -50926 6142 51918 21110
17434 21110 88306 86436 93108 80434 102345 185274 208389 112024 72418 90006 69236 39046
17422 39046 -21284 -51598 65241 221899 251773 175099 105434 49803 72686 56360 90003
17411 90003 119477 116881 153248 134724 129961 118413 159783 125003 82844 15486 -58171 19707
17399 19707 132787 181252 192090 193355 203163 138948 143250 142977 83591 30795 51572 112882
17387 112882 86986 -30268 -82449 -47846 -6142 4409 6927 -4929 -16931 1166 -30444
17376 -30444 49905 65713 109414 79493 -13337 -2743 1813 -1904 -4919 36679 73035 61389
17364 61389 70914 75653 109047 126015 89873 108781 131103 102162 136850 137002 142231 144943 89589
17351 89589 60338 52657 68075 96012 79089 32603 -29721 10682 9016 9946 -39068 -139469
17339 -139469 -152393 -140128 -162866 -196052 -195095 -200064 -118675 -37099 -98201 -88602 -83603 -79154 -132211
17326 -132211 -132969 -48019 27940 37935 22494 16785 8430 22889 85834 78173 30142 11596 102835
17313 102835 151708 139363 156495 147009 111723 93281 92706 144673 118744 28884 -73961 -32525
17301 -32525 -25154 -27058 -1122 72576 115200 81579 2146 -42935 18488 86676 125490 190416
17289 190416 140525 75762 53143 20792 -33777 34329 57409 52085 23789 22918 69947 49596
17277 49596 6929 26958 38160 6604 -117261 -155769 -137865 -60442 -45316 -98834 -82062
17266 -82062 2392 50285 57939 93339 105086 173059 109875 -14124 -91799 -118870 -131927 -69137
17254 -69137 -68012 -39275 -19571 -65684 -3737 13567 30892 4090 -56266 -72110 -23472 -46690
17242 -46690 -30095 -53508 -63087 -7798 89620 54933 98714 141201 56027 89699 127816 162291
17230 162291 157297 118749 142098 144336 95506 47404 86238 47968 33581 79025 81191 -27485
17218 -27485 -93020 -91417 -38216 27352 -44946 -180281 -178260 -141729 -132076 -39742 52847 158702
17206 158702 153009 97973 91228 135890 -3943 -156901 -145559 -144920 -26496 129557 52567
17195 52567 -48191 -100999 -86493 -44749 6346 -5137 33592 44250 51505 15499 -43218 -49459
17183 -49459 -56260 -44866 -15413 15800 30235 102360 115513 91749 63442 37161 103628 75346
17171 75346 -37981 -65244 -83556 -54173 64457 129927 190124 212858 152009 97193 128915
17160 128915 207910 149494 37871 -8957 -24117 14299 67375 31608 2207 -17083 -31091
17149 -31091 70771 85402 75738 93039 150868 181090 105477 -23462 81410 141248 117904
17138 117904 78331 -22692 -52950 -70400 -52425 13885 115533 128637 128871 89858 677
17127 677 32556 59966 47011 80470 104798 107755 109379 31560 -63576 33938 76881 19249
17115 19249 -46373 13528 38849 -68493 -77329 -65786 -75613 -88343 -61570 -47531 -65090 -29672
17103 -29672 -8568 50388 70026 106407 120095 82454 47608 -5873 3441 402 -35747 5929
17091 5929 17946 -15670 -14485 -24618 -51587 -77299 -105616 6788 110594 168462 136295 26308
17079 26308 21243 80289 115992 104052 127420 100852 84420 26326 -9186 -66774 -4498 43147
17067 43147 88429 79543 -19077 -46754 -84386 -101787 -114194 -118472 -145499 -100059 -42070 61181
17055 61181 39854 63945 103583 117761 87259 90908 44177 56567 3725 -55337 -57049 -49618
17043 -49618 -48144 69225 87941 91685 130804 79149 47749 57745 49196 -1533 -78108 -56673
17031 -56673 48860 109145 122367 114079 29825 32598 102440 112168 61958 50285 137123 161094
17019 161094 91800 123343 116219 99624 112480 99200 43639 -42362 -100167 -173189 -162524 -95873
17007 -95873 -128076 -88044 -52476 -83632 -118786 -129439 -100718 -119195 -85987 20395 -14936
16996 -14936 -17361 -16394 -34739 -65328 -46804 -10473 -10883 -10394 -38041 -55421 -26940 -28869 -32145
16983 -32145 9072 31694 63242 76106 117355 209762 132119 73302 67176 -70163 -182669
16972 -182669 -217371 -129881 -46243 -95377 -128765 -57078 35136 49730 -11233 -58744 -73658
16961 -73658 -22096 -1056 -59850 -134767 -163556 -121449 -53777 -13347 -748 28602 132700
16950 132700 121386 23484 6027 46380 11999 54421 33876 18473 12434 2792 -72491 -112582
16938 -112582 -135143 -147018 -166574 -73621 -32785 -48538 -27358 13621 -29483 -51869 -21875
16927 -21875 -74577 -30224 42136 37870 102620 45191 30761 42139 65414 42626 60089 18772
16915 18772 65000 76290 19136 -24877 38584 -54371 -62400 39587 88969 107699 72293 86842
16903 86842 106488 94112 61149 64248 70294 125141 16260 -19060 562 -24454 5795 13888
16891 13888 52496 49195 70924 85410 113908 88671 74104 67758 41170 30227 30778 47183
16879 47183 79351 27096 -29168 -28290 1466 95957 134144 21972 -37643 -49381 -62996 -88095
16867 -88095 -104765 -25629 29776 139730 166824 98980 26286 8494 -66903 -182536 -139420
16856 -139420 -86185 -92476 -86527 -87247 -91964 -81103 31499 82788 102068 173656 142450 110296
16844 110296 68893 48743 127822 144334 80570 68897 93454 93108 69432 82656 63947 27834
16832 27834 6663 -100886 -149545 -128789 -35384 31927 26884 14285 28209 -72958 -107772
16821 -107772 -64472 -90506 -111060 -123994 -97999 -38780 -52245 -80258 -20459 60482 112439
16810 112439 77080 90910 40012 -13711 8180 11080 -8293 -69082 -74685 -128922 -169966 -130099
16798 -130099 -80063 -31172 73288 77520 54679 35630 82323 89032 47073 -14963 -43176 -110207
16786 -110207 -234808 -146854 26961 57286 17349 13954 -3984 -44565 12957 34503 -870
16775 -870 -47610 6112 122918 104241 123773 65180 46765 71827 103842 75043 67253 6733
16763 6733 -19892 8242 -5118 13048 7008 -54799 -38245 -7456 68217 18204 -9799 1671
16751 1671 -74694 -65103 10013 71651 29600 29297 44621 19813 71635 85201 14166 476
16739 476 8632 6957 94958 76265 63945 135705 114231 72869 44717 81118 33072 -1475
16727 -1475 -22834 -105036 -78838 -85431 -27676 42148 3080 -55200 43461 44048 61272 74572
16715 74572 79546 -28157 -143045 -124816 -82009 -27581 -20217 -11023 -48493 -53636 -53717 -15870 35940
16702 35940 123993 237293 214801 104989 59420 71757 77553 74991 65694 72823 98491 185155
16690 185155 73944 58011 33613 36875 38155 80139 88205 58999 26552 9690 9399 -53735
16678 -53735 -35833 3495 14874 117216 194664 167219 169134 164211 53265 1288 39877 39651
16666 39651 -9788 8017 41642 8011 -6777 -34394 -67493 -62368 -35251 36295 -15467 -63048
16654 -63048 -34487 21219 27079 75353 73736 80835 69551 70830 76694 -38040 -49285 940
16642 940 105364 124595 114123 104404 85550 45645 76953 27185 -45305 -43242 -7581 -27873
16630 -27873 -50437 -23512 -17853 -94095 -55112 21106 15710 -2856 -29313 61713 89680 82257
16618 82257 25031 6453 44514 -14918 -13825 -22818 -31817 -32944 -34368 -52046 -71560 -68524 -60466
16605 -60466 -75835 -2843 57898 101263 107333 -13462 10107 106413 136864 66044 -2437 -1982
16593 -1982 42065 41496 63100 94462 9382 -77409 -105408 -146000 -91837 16341 27439 -1472
16581 -1472 16164 52888 105974 130946 68530 84014 29211 -98628 -81127 -49722 -80973 -66657
16569 -66657 -3676 81724 139066 139905 65913 98318 118076 177333 82184 12004 80932 97957
16557 97957 108910 136802 97379 32307 17522 -21154 -61889 -75760 -6510 33753 16444 68961
16545 68961 45261 37838 28212 -44881 -54100 -33883 11777 78437 107020 57383 77555 97819
16533 97819 111328 -1870 -102296 -103338 3073 72450 -8055 -47592 -6465 38878 39683 39202
16521 39202 65137 84863 70077 2450 -26581 32396 56202 62857 29276 88055 63674 73513
16509 73513 103024 85150 -1691 61127 45169 -13627 30794 95011 77761 -14756 15344 52452
16497 52452 -11283 -94634 -57696 -24365 3437 30255 35439 27035 96 -854 21882 29008 -30428
16484 -30428 -88041 -56958 -29876 -27056 16845 16493 3259 101534 209860 83140 278 94066
16472 94066 138298 123436 108719 80580 35376 21939 19002 58479 67493 61956 71697 40169
16460 40169 70232 25214 18025 50486 121902 172345 146373 82054 1638 20565 18082 -7643
16448 -7643 -47157 -72399 12806 96091 55645 48574 71500 61971 41104 19779 32352 82968
16436 82968 14894 -60676 53100 73468 -25550 -6853 39938 24735 19084 25662 18499 -115644
16424 -115644 -137712 -59475 41548 32283 20154 -7178 -23352 -12259 -14387 26768 -29226 11517
16412 11517 4988 -34445 -66226 -47544 -55375 -45585 -57392 -81817 -90318 -3053 99991 29829
16400 29829 -8654 39374 55477 12285 -7741 -18032 -84567 -42713 -34696 -39909 -83206 -63777
16388 -63777 -100736 -107813 -95552 -34043 -8895 -67067 -40665 -6145 67884 -3813 -49215 -106552
16376 -106552 -79403 -71824 34356 23148 44682 106131 61551 115209 92885 17127 -65277
16365 -65277 -73369 -38678 68707 83926 127942 123499 126175 169837 149623 30663 42274 117828
16353 117828 171114 194946 79137 12243 7591 -18544 713 -12403 -3472 48971 97254 70260
16341 70260 54478 90906 16492 -41832 -14505 77942 130903 109658 115417 68691 54348 -22858
16329 -22858 -75478 -87712 -74769 -94474 16286 33637 -60203 -113266 -105572 -79260 -95636 -47721
16317 -47721 -132882 -142945 -147496 -38927 -40655 -40568 16985 -32619 -36660 10796 19182 21807 87739
16304 87739 128552 134744 223317 164530 87958 -32071 -145992 -128105 -100538 -100175 -107956 -70197
16292 -70197 -49978 -37484 13934 67043 103563 89736 99224 138537 207962 244012 122715 122110
16280 122110 131237 78381 20047 -2658 70211 58349 -24265 -72388 -101101 -102946 -102222 -63419
16268 -63419 -14266 32467 20076 -13953 -278 -8447 -13165 19933 9202 46396 97082 27364
16256 27364 74435 69650 132395 127417 98223 84581 119598 80340 15134 -5955 15268 38141
16244 38141 11361 23663 91928 85139 134358 112788 103503 101311 54485 41529 68834 66834
16232 66834 58976 -491 -34488 3351 46276 93449 109820 68170 88623 39210 -86338 -45571
16220 -45571 -31992 -51006 31674 42574 6976 -7024 -31478 -83749 -111162 -72745 29864
16209 29864 38170 36674 43830 86589 129613 80121 34167 1862 49061 100875 103358 97925 98512
16196 98512 -19844 20520 10608 625 -8785 -72335 -47972 -24409 67986 140115 131797 122090
16184 122090 78057 25760 10465 36874 25496 -27050 30042 58384 46084 62512 79723
16173 79723 33980 6695 -56008 -71794 -649 32840 105009 122580 190649 102532 36518 -3070
16161 -3070 55881 140503 138077 115194 131771 37529 -12451 -22043 -3827 9318 39217 79745
16149 79745 820 -80893 -44023 114905 148878 48623 1511 23598 21016 23091 62087 50045
16137 50045 55302 -4172 76164 51442 -149721 -181639 -168451 -154140 -120868 -24604 -24835 -61353
16125 -61353 -61715 -138743 -120269 -61876 -93523 -142579 -135522 -127954 -131773 -168767 -180346 -177675 -76306
16112 -76306 -4162 30833 109565 85046 79579 58764 -11042 35651 92554 105899 109861 98734
16100 98734 75157 3948 8343 -7285 -27695 -17 25277 86902 47481 66466 32399 -22919
16088 -22919 4217 66378 9046 -62942 -123124 -144308 -184924 -153535 -162993 -87558 14865 -34526
16076 -34526 -123969 -148952 -127641 -58732 -13193 -9638 -22587 -109560 -45539 7172 -3227 -26702
16064 -26702 -19596 12260 28083 72915 44153 4103 -31538 -127192 -151628 -117095 -66601 -52024
16052 -52024 -13657 32121 34765 30246 51180 -7122 -126965 -111193 25420 35373 -14794 -49286
16040 -49286 -124641 -147376 -62931 -53683 -76101 -82046 -43082 -47880 -48524 -78446 -33124 2765 -50419
16027 -50419 -151522 -98818 -52066 -28939 -492 57508 41195 -16796 -14081 -47334 -56084 37390
16015 37390 85526 81263 160300 165981 45319 12425 -5676 -63037 1131 9667 23429 -84270
16003 -84270 -94323 -63064 -1494 22723 82921 72691 46312 30124 48073 45354 -2439 -54606
15991 -54606 -129739 -132360 -64988 18878 112319 144800 6943 -10286 -39590 -25900 55429 65498
15979 65498 45087 35775 31384 28412 37725 38996 72895 120605 101939 41237 -31743 -59234 -57646
15966 -57646 -45632 -67561 -93480 -127476 -131937 -110764 -80298 31909 105744 104651 6867 -55757
15954 -55757 -89964 -24982 -41829 -89283 -38959 -45250 -40860 -61771 63009 96397 112288 52655
15942 52655 -17441 -2819 -92056 -157939 -83115 -10343 85049 117724 131099 125102 139168 35514
15930 35514 -28691 -114276 -170466 -184750 -219936 -111407 -9288 -8500 5768 -13055 42026 57770
15918 57770 51403 45464 -7012 -18267 -1939 20447 45886 27690 -8500 54890 98858 134456
15906 134456 140655 62610 42930 27217 -10702 -23087 -7744 -60899 -56721 -41211 -63451 -137037
15894 -137037 -77290 -21209 20381 -18684 -86024 -44665 18282 21785 42414 21418 -4900 -47040
15882 -47040 46113 56752 51481 -56307 -124347 -143199 -103817 -59875 -104202 -136344 -133675 -67949
15870 -67949 9317 4899 52475 86686 -4403 -31962 -23164 -7607 16235 22771 18360 -37375
15858 -37375 12681 2704 29669 104157 146956 71693 -5741 -10068 9041 56087 82531 80983
15846 80983 165193 119746 93691 40339 -63186 -70794 -46297 7565 -32205 -53546 -31260 -48645
15834 -48645 -17204 -9025 -17687 52991 77333 46404 71806 108248 40178 -44784 -12435 42436
15822 42436 10278 -18635 13594 21956 1923 13829 16722 -55375 -44097 41347 147279 157446
15810 157446 131074 51888 -26161 -38952 -75408 -81230 -23460 -37846 -4050 -10198 27010 88556
15798 88556 62714 21517 -138217 -219680 -149304 -41074 13768 -14574 -9205 -52879 13727
15787 13727 85665 14968 62021 19507 -50040 -56968 6450 -35273 -63342 -98582 -162992 -145731
15775 -145731 -124343 -57869 -60973 -48630 27489 47960 19520 14918 16642 40636 22324 16077
15763 16077 -12182 57156 82484 21361 65688 108218 64308 22449 -20520 -25735 -19304 9035
15751 9035 -5849 -16460 -20753 31750 136120 210384 202939 64953 -13419 -260 81562 9123
15739 9123 -14589 -42480 -44129 -75968 -42031 34737 42126 19552 59999 57680 6686 -102971
15727 -102971 -162362 -152136 -81408 -66893 -51714 -18055 -59639 -87469 -97016 -75878 13646 50433
15715 50433 19093 1585 59227 5567 -15829 -1039 21344 -10833 -43483 -103242 -33750 18548
15703 18548 -38565 -96471 -139891 33901 97210 22407 18413 -23510 -27880 6485 28955 -90047
15691 -90047 -132957 -132364 -115202 5799 80711 34394 -43452 -20355 26444 -33426 -112505 -77315
15679 -77315 -79613 -129930 -75576 -14926 64812 93477 30987 -33553 -17307 -49201 -118013 -115178
15667 -115178 -108747 -93937 -27875 -14115 80009 105837 -13311 -89269 -95462 -120999 -113015 -70669
15655 -70669 -45118 -96075 -60969 -30781 98773 138493 54718 -30059 -199 50847 51349 -58708
15643 -58708 -53406 -34133 3311 41077 61680 51674 15351 -18891 -513 92533 152915 93524
15631 93524 4386 -87358 -106818 -57979 40821 50834 25944 13038 -9538 -36993 -17299 -13043
15619 -13043 11549 -29103 -34677 -14725 -35188 62447 65947 13284 -2957 11428 547 -57369
15607 -57369 -39354 -36250 -149774 -110157 5548 -53776 -19957 -6380 -72309 -76216 -129534 -131147
15595 -131147 -134350 -125069 -88489 -101301 -87278 -74443 1328 1008 3518 73183 134164 69454
15583 69454 25502 18702 -3917 -36828 -93000 -127323 -80335 12613 53777 58144 26445 62865
15571 62865 75390 20197 49128 24573 12883 -7730 -12230 -4804 16733 53733 56853 5222
15559 5222 -94684 -124328 -154871 -92266 -13191 41473 57149 68029 126253 118439 46181 45748
15547 45748 55735 89111 26443 -29200 -121783 -121980 -180635 -170747 -58610 -37810 27683 28834
15535 28834 -38312 -70220 -1187 20164 105282 154452 96608 8825 -61199 17489 -14830 -17089
15523 -17089 23774 99374 75459 44765 54807 -3505 -30379 -21843 -66529 -84077 -32857 -1623
15511 -1623 -17966 -81257 -131869 -97970 -38934 -82092 -117411 -131662 -172366 -138800 -65878 -11694
15499 -11694 -53041 -2531 -33754 -169446 -230695 -174243 -146091 -92639 -34823 -3925 23594
15488 23594 21062 -98045 -131459 -29848 42287 27640 29069 -9031 -83258 -59160 14349 -8407
15476 -8407 -111535 -89323 -889 -12839 -85328 -9844 29174 63552 40110 -3106 -1954 24359
15464 24359 89897 114362 125114 7601 -140871 -150823 -127882 -81965 -132741 -148060 -90952
15453 -90952 -8891 -23021 -57805 -8810 -19379 16778 -63615 -80906 48809 20302 -6911
15442 -6911 -39753 -100520 -88902 -10452 48991 171418 238513 145036 38230 -24337 -58142
15431 -58142 -103532 -72249 -50177 -109312 -100065 -65819 -42392 32294 85812 128180 101572 78125
15419 78125 74676 32014 71614 76359 111251 137063 103321 43756 -25626 -42252 59765 95075
15407 95075 73810 -13008 -48629 -9143 16509 76925 80904 126288 157946 128697 147390 100208
15395 100208 94543 55378 -19869 -84291 -65634 -38779 -33677 96239 149802 88528 149400 153759
15383 153759 90337 40922 60363 75526 70131 77329 89797 7294 -55667 -38775 -47982 -12069
15371 -12069 6390 -42416 -73120 -105462 -188178 -159112 -119360 -139839 -86888 -133642 -163349 -202440
15359 -202440 -195919 -107129 -87843 -36272 52781 -2246 -83040 -98043 13922 53050 -11445
15348 -11445 -51444 -56016 -32603 -35174 -76064 -48085 -30632 -28423 -78390 -91597 -51021 -47495
15336 -47495 -85036 -101353 -94995 -86024 -136187 -177280 -156887 -121574 -24888 19581 -56643 -39181
15324 -39181 -20593 -27176 49013 137853 167811 130923 155478 113591 52862 7326 -33444 -44557
15312 -44557 21302 21265 -37944 -42280 -3461 -63822 -76453 -2803 27202 -13373 -95267 -67457
15300 -67457 -104899 -87157 -50275 -102544 -121778 -120602 11150 17633 -41001 -19410 -18914 -72904
15288 -72904 -123303 -82807 455 54995 94454 -25394 -55117 -62260 6613 53067 -25083 -11075
15276 -11075 76513 187877 173969 122190 65974 50693 35478 70049 121643 77290 43008
15265 43008 107724 68639 36954 121873 93215 8410 -25926 -36485 26367 48574 -3550 -43280
15253 -43280 -19913 36365 50702 -4329 -64498 -100141 -134317 -108632 -752 -9902 -36435 -20017
15241 -20017 22672 36350 9562 1715 26068 46806 20418 -55726 -63606 -31420 -51363 -9713
15229 -9713 14182 -7533 -27993 11284 -39724 -68240 23985 -2019 -88858 -122230 -125146 -48643
15217 -48643 48230 133760 125187 147038 119619 148444 178077 91282 59350 19388 11378 26813
15205 26813 -16894 -10632 -12596 76199 42748 64116 25807 6867 -9309 -85329 -83405 -110443
15193 -110443 -91755 -93930 -87368 -83177 -105310 -94077 -64275 -32268 -66342 -96691 -49911 -87623
15181 -87623 -105896 -18379 28163 -608 18739 -55277 -42145 -34658 -45248 -39286 23268 62774
15169 62774 74752 48600 40753 -11999 -23837 -24559 37737 35601 53954 77415 103174 40409
15157 40409 -54703 -38668 -10774 -20046 28313 43829 57912 59552 56565 67181 31364 -26394
15145 -26394 -24693 31186 42640 98533 139264 172994 159970 19316 -15358 25966 39954 52667
15133 52667 5206 -25370 18473 35960 -12041 -20445 74172 95435 88875 93886 38439 79812
15121 79812 110064 36145 -28078 -74309 -48227 -26751 -56353 -16901 64971 78198 19138 -29405
15109 -29405 9876 34196 -38603 2354 -4870 -50171 -105825 -125353 -81030 -10606 3701 29886
15097 29886 93783 30165 8865 -9265 4327 -23827 -29453 -47352 4324 -64751 -100325 -136058
15085 -136058 -133285 -51225 -40810 -93439 -100453 -112989 -149113 -210895 -220257 -177281 -128931 -112685
15073 -112685 -107358 -60827 -19922 -2683 77667 53462 -20058 -64910 -64979 -55814 -139636 -53903
15061 -53903 36417 56591 8464 5345 43683 94410 73085 4897 25705 63008 84672 55315
15049 55315 -13806 -39855 -66155 -106453 -53275 59654 100666 116721 58914 -25717 -50660
15038 -50660 -91701 -133072 -83156 -44571 -86626 -51901 -40922 -111622 -92008 -33391 -67488 -97221
15026 -97221 -31724 29855 38811 120482 107525 97202 35425 50650 43181 74522 106513 79210
15014 79210 55226 83852 63406 55541 49891 -53042 -15105 -20603 -82918 -76912 49318 100107
15002 100107 122734 123011 34139 -65234 -128789 -85733 -50052 21434 18443 -38703 -53848 -28617
14990 -28617 -17036 212 -34411 -152645 -216872 -189232 -122239 -48313 -33523 33639 99514
14979 99514 41850 -10416 -33567 -9920 18906 11434 -57952 -47889 72931 84083 114112 85770
14967 85770 45356 113708 45993 70874 137628 198926 220349 254475 197865 96862 51383
14956 51383 44285 5019 69132 66608 51477 99723 101095 98899 43040 -48819 -43929 -57871 -95095
14943 -95095 -47509 23701 24901 102971 49548 14940 63721 73746 35805 1152 -81565 -99941
14931 -99941 -45430 16994 41886 61208 47666 -28321 -87620 -25900 -18433 8136 28770 18098
14919 18098 51645 -32853 -11308 -34238 -54983 9970 15717 -3921 -32328 5236 -6120 39319
14907 39319 50409 106829 144475 141026 57149 25954 6722 41780 -47003 -93297 -99575 -55590
14895 -55590 -43383 -75429 -63128 -14312 -40440 -68377 -21358 -812 -59625 -75094 -61660 -200225
14883 -200225 -242164 -149078 -133487 -73175 -41879 -18106 1666 49750 -7571 -39487 -28977
14872 -28977 -24004 -57703 -126747 -71248 -2406 -23108 -11404 19418 10904 -9705 36984 15238
14860 15238 -29165 -35430 -24424 23678 80079 14731 -42257 -96244 -152087 -141265 -90576 -94771
14848 -94771 -94949 -60169 -94802 -146914 -121840 -154386 -155613 -59823 -20918 -69259 -60272 -58471 -92168
14835 -92168 -164524 -139240 -120095 -39579 -11657 1014 13189 -40974 23979 -12761 19343 27319
14823 27319 -1140 -82467 -72948 -12842 2875 -65885 -64286 82591 84659 144734 114209 60535
14811 60535 61049 100246 28673 15669 38922 80953 120483 35737 -2506 20353 61500 -69354
14799 -69354 -117566 -15930 12681 6672 -40579 -61779 -52770 -85794 -61762 14873 132789 55416
14787 55416 -36775 -52671 -118577 -63569 23594 -14177 -65572 -115268 -55532 35749 142576
14776 142576 118621 53887 -36097 34776 41685 14188 -78291 -121286 -79171 -60253 -34443 -84751
14764 -84751 -33963 -10905 -28684 -73193 -76340 -48421 -55915 -21993 3388 -11102 22785 41433
14752 41433 6700 -42916 -70129 -89935 -57415 25 -830 3138 24678 94336 92590 45827
14740 45827 61846 20851 7775 -4561 -64336 -67387 3019 52836 46905 53373 102491 107781
14728 107781 7456 40186 81817 81605 78634 135011 141330 122643 15900 -95301 -44957 -34230
14716 -34230 -29961 43870 102180 11890 -97858 -190291 -138058 -112955 -154142 -125058 -52454 -19971
14704 -19971 1749 17825 5602 47947 -41558 -77188 -95750 -103973 -115163 -96244 -28975 -14609
14692 -14609 -29024 47163 13924 57625 32988 -75394 -76175 -37565 -46194 -73263 -103651 -136573
14680 -136573 -88295 -71831 -110859 -103138 -103472 -67424 -59142 18005 -17866 24982 48676 10224
14668 10224 -35088 -42181 -97534 -21144 53739 65264 38285 -19070 -89641 -99329 -89444 -69376
14656 -69376 -27627 13832 2784 -110874 -138166 -141680 -124138 -107161 -21122 3216 31812 -22011
14644 -22011 -35829 -74790 -100179 -93048 -18607 93627 135281 50035 -19764 -43825 -52698 -68010
14632 -68010 -379 98226 83341 31713 -50247 -140363 -121371 -125151 -105887 -84308 -45949 -31199
14620 -31199 31941 72130 -14329 -38498 12704 -49043 -105301 -105680 -159671 -122064 -130388 -142977
14608 -142977 -123259 -1207 109693 98288 39332 -35620 -61086 18633 56045 123972 74733
14597 74733 -37683 -38335 -27752 85388 95293 55759 20917 -14633 12067 -18283 -68335 -11057
14585 -11057 -38782 -123964 -80653 -66435 31821 100216 62356 13410 -51644 -42706 12188 -50012
14573 -50012 10474 76560 57701 -36119 -5327 -40021 44958 123688 126656 83210 53101 33688
14561 33688 74719 64334 -3651 -22593 27431 28159 26728 59965 -28633 -19486 -18088 -33617 -59322
14548 -59322 -59699 -86730 -23357 52615 55807 430 -49282 -39505 -47158 -47256 -94470 -127241 -97641
14535 -97641 -75731 -2774 82151 125049 48824 -531 47902 64400 -6951 -79901 -111738 -51546
14523 -51546 17496 20174 -93423 -90468 -38214 -16364 121576 119560 24470 -92907 -119715 -150615
14511 -150615 -169212 -79457 -60646 -52890 -64836 -105643 -91812 -14425 -62495 -63740 -61267 24159
14499 24159 72150 108058 97680 30096 -77389 -121625 -171787 -162576 -97270 -55510 -78755 -54791
14487 -54791 -28077 -16314 -7368 -3645 42966 -1367 -59644 38978 47561 11056 -22312 -34604
14475 -34604 -16673 3789 4399 -27906 5111 26887 54616 18660 -50689 -82942 -44079 49706
14463 49706 49034 84457 28318 -5234 19943 11902 46369 42333 25775 50117 35795 58519
14451 58519 26587 -31248 -9037 3414 68706 91782 46183 -1921 -31616 -33241 -114567 -56237
14439 -56237 -45936 -116352 -99467 -33346 36895 106715 70462 35742 1100 -89050 -147091 -201312
14427 -201312 -207940 -132736 5983 73871 42218 68372 52611 4800 -28092 -20148 -42877 -58298
14415 -58298 -29502 14611 -11170 5819 47298 62286 14499 61518 105601 101000 59959 14478
14403 14478 -29265 76480 163824 90678 44110 29055 -23024 -16855 66830 15332 -1731 -85161
14391 -85161 -138503 -87997 -18833 3276 3977 -17681 -24761 50215 111701 100155 13310 -42617
14379 -42617 -25994 -874 13366 -42957 -33289 -46865 -57912 -12571 -36920 -18611 -33032 -22915
14367 -22915 65034 178555 170789 180502 64837 -34893 18991 46985 92029 166096 195878 63680
14355 63680 -35829 46312 -27868 -64373 -82944 -77104 -70754 30727 79807 100220 111424 92069
14343 92069 704 -56337 -133813 -76284 -88923 -165184 -117833 -69963 7334 -3366 -49904 -40714
14331 -40714 -2406 48006 93217 115459 83810 3491 24310 81148 -18218 -59759 -51639 -104549
14319 -104549 -60412 -30493 -53278 -63839 -61376 -68930 -54039 -57796 -25890 -17655 -20959 32473
14307 32473 11917 -17789 -56346 -86680 -100090 -88027 -73593 -48117 -47526 -62467 -26831 12794
14295 12794 63164 23676 17795 22761 16230 79826 16773 -21921 -67482 -44260 24909 67822
14283 67822 79777 44301 19546 26904 -35267 -30993 17623 -25079 -47068 -45304 74548 62260
14271 62260 97 -35229 17900 25486 -68950 -104270 -62103 -2488 27769 -30977 -77524 -59399
14259 -59399 -18530 -64156 -40307 31212 33999 -16375 3708 -22482 -21316 -77709 -95417 -25436
14247 -25436 27875 48797 73996 31654 106812 39416 -2695 -35668 -8046 -18570 -10364 5105
14235 5105 36821 89718 -11250 -61073 -26125 -56127 -70834 -131537 -173063 -145943 -94111 -95836
14223 -95836 -63197 -62651 -52388 -1599 15972 24557 -49000 -70981 -116484 -177387 -157159 -163631
14211 -163631 -243858 -295417 -215882 -133053 -88117 -7567 25512 4398 34391 102933 77234
14200 77234 61650 54122 57581 76071 -13408 -39033 29013 46048 -17806 -20941 -7026 40611
14188 40611 21380 56759 41394 91318 120490 61090 -42757 -9542 7016 -52821 -44772 -56307
14176 -56307 -6536 8439 -21734 -27374 -82773 -95375 -48292 -1990 54104 16754 17337 -29806
14164 -29806 -82318 -81925 -5643 -2202 7852 21977 78568 79591 124045 60695 -84200 -146053
14152 -146053 -72617 27952 52524 5188 58617 65289 87289 12943 -33599 -86104 -60877
14141 -60877 37558 54444 -71404 -157233 -151788 -114076 -122134 -94490 -55014 -70526 -91519 -104984
14129 -104984 -125591 -89145 -13597 21429 -4521 -63217 -3210 25532 15417 -33315 -59111
14118 -59111 -129340 -160115 -153550 -87597 -72289 -48669 -30998 57846 60814 70386 -15977 -40134
14106 -40134 25700 -14561 -14177 -16570 -15286 60829 64949 20215 75074 23487 39245 -10662 -41231
14093 -41231 8106 987 19053 -39403 -106080 -128437 -106762 -2435 -22051 -36035 -18949 14897
14081 14897 44045 26931 -40421 -130189 -164553 -77490 66241 63093 -49058 -15597 61778
14070 61778 75974 42657 54707 28171 -7930 -8458 -11901 35119 120361 117945 20048 -37911
14058 -37911 -39438 25238 31720 85055 90194 59785 76068 54673 50025 41238 -2891 62827 42504
14045 42504 30149 -39082 -37096 -35541 -83345 -64705 -8947 -31860 -90316 -112301 -68066 -50270
14033 -50270 26526 110806 122464 66464 75482 149237 89148 16952 -47278 26575 58754 11276
14021 11276 -20552 4830 36864 70192 44721 -21928 -39612 63854 72437 50603 71567 141099
14009 141099 87506 20124 19774 -7846 -73941 -49740 25627 22619 107190 206632 202730 96997
13997 96997 23406 48012 72942 15153 -27891 -81551 -97106 -55864 -29835 -162442 -103604
13986 -103604 -114154 -141577 -91092 -18113 77742 83464 -6521 -64395 -20750 -38509 -97278 -85008
13974 -85008 -49533 106726 135548 125004 126026 141491 103002 56846 54071 59044 20830 -30829
13962 -30829 -32432 -44130 35054 111726 115385 112105 118503 42516 -86253 -75783 -1479 26576
13950 26576 14918 -4641 -8389 -54940 -75472 -61502 24947 102051 1178 -25902 -20048 -56972
13938 -56972 -24550 -22386 -77504 -60124 -32229 -105731 -18838 27273 -13873 31420 106222 92221
13926 92221 107119 45824 -46361 -25887 27844 66079 50467 -29691 5635 75300 24739 31573
13914 31573 57925 70942 108338 81958 -4604 -59907 -46996 -36030 -53108 -50827 -39973 -49348
13902 -49348 -56015 -36193 11359 -67580 -146240 -154926 -99608 46956 -10229 -29439 -30091 -74626
13890 -74626 -75220 -3803 101402 47688 -11677 -32604 -7674 56607 101804 13931 -127735 -125785
13878 -125785 -54984 -33030 -39540 -42012 -49572 3373 18819 23381 -74024 -77785 -45847 4845
13866 4845 18710 4692 -18065 -10095 -20281 33182 50468 37459 -63163 -82580 -127487 -150088
13854 -150088 -155771 -138466 -87490 -45362 -46071 -34313 -12981 32158 22017 12411 -37036 32244
13842 32244 48128 108465 102202 19094 -35306 -10052 -41046 -82400 -3741 37104 -39058 -93510
13830 -93510 -116857 -72577 -78117 -23794 -24790 -17774 -99675 -120817 -103656 -68717 -8495 70140
13818 70140 145366 160921 101011 83592 61454 -7901 -55289 -21668 9293 7892 26413 -26268
13806 -26268 -9150 30056 34062 -23814 -156224 -140050 -68611 -47003 16678 64890 22333 83395
13794 83395 105825 31938 -578 3309 9261 3968 -24616 -56203 -37314 12638 -17080 -115899
13782 -115899 -172027 -159168 -1367 53482 -32583 -25595 -56188 -8557 -48471 -67573 -79410
13771 -79410 -52081 -14169 39801 47642 14041 42585 110611 62210 103966 163663 139025 80936
13759 80936 34921 -9053 -87586 -63657 -33447 -37031 -11143 24282 5870 7483 -34506 16242
13747 16242 93843 11050 -52926 -43308 -32749 -49916 -57300 -51925 -47431 -821 -52415 -19321
13735 -19321 24788 53531 18491 -58047 -45144 -9683 -41556 -96243 -171025 -107804 -43540 -57673
13723 -57673 -30666 8170 65907 54105 4322 -22616 -37915 -13141 102191 89619 20507
13712 20507 -36815 -50788 -28671 -28881 -40681 -21764 -12827 -87665 -97992 -97782 -22503 -2350 8590
13699 8590 -57674 -67544 -34327 -56991 -82370 -96881 -102646 -66291 -42101 -79608 -133327 -103006
13687 -103006 -114742 -130770 13228 -102 -62712 -125202 -34663 -25159 60085 71897 2224
13676 2224 -13996 -54858 -18532 7009 -11613 -48048 -76722 -73368 8874 33935 -95321 -139976
13664 -139976 -99957 -29054 24305 64095 -16680 -70583 -106329 -113117 -39110 -98042 -83664 -61080
13652 -61080 -44553 32746 -30339 -85078 -83503 -122644 -89711 18893 64939 12401 -17848 -34286
13640 -34286 -18513 -55017 -100384 -25177 38138 2660 -40276 -48684 -5341 28360 126909 158004
13628 158004 122228 35771 5345 -13223 -39375 -75958 -18240 -13559 -26383 -25641 -11221 14680
13616 14680 68855 57048 -32688 -98614 -116222 -105320 -43628 -23889 -8245 -56281 -77259 -26149
13604 -26149 48747 60389 11221 -23580 -79147 -94567 -146466 -97450 -26730 58241 21065 -69404
13592 -69404 -116301 -101906 -112078 -29065 1294 -28145 -25036 -43553 -45475 -8763 50200 29113
13580 29113 -15903 -29995 -34131 -47673 -675 105878 83623 70745 -6319 -84973 -64402 -80838
13568 -80838 -62203 28013 50144 20233 -24423 -39958 -58446 -41688 23636 53107 17757 65425
13556 65425 115718 153631 88096 88040 54694 -19017 -41099 -29168 -19506 -34728 -11769 -54550
13544 -54550 -38068 -25024 51086 -6054 -38771 -28127 -2103 60136 68379 -28538 -13810 -32842
13532 -32842 -12897 4404 -57568 -56165 -65617 -69719 -68080 -34019 9122 22136 117070 89985
13520 89985 116959 79142 -90596 -117242 -68122 -61006 -119982 -102765 -115269 -96247 -121958 -107837
13508 -107837 -49690 -9442 -8145 19689 -36640 -52808 -77528 19044 77156 57133 44854 8359
13496 8359 36628 88252 68804 59196 27399 43204 76019 124588 173710 146963 91523 12043
13484 12043 -86264 -48709 17666 7847 -22120 -37749 -61200 8756 -3421 -53634 -66279 -46439
13472 -46439 -78621 -77039 -38653 -15659 114882 141637 153160 96049 50795 18949 -20859 11215
13460 11215 2902 9428 -42028 42119 -40554 -57120 -64555 4017 46779 -69826 -146587 -264771
13448 -264771 -242732 -213243 -171111 -192872 -140064 -75934 -82595 -92662 -114363 -102144 -106765 -141926
13436 -141926 -84519 6786 -24228 -18890 48566 96772 58111 -1009 -7430 -12972 1423 12914
13424 12914 -24931 -43101 -15572 43733 70948 133562 81479 -14234 -18942 -33177 -89742 -140953
13412 -140953 -76827 -32818 -9522 19266 38861 21114 32617 39881 33959 54606 -1725 -34608
13400 -34608 -56104 -135056 -79304 -108154 -73744 6204 14130 31128 18265 -39697 -55726 -50797
13388 -50797 -53579 -20266 46224 -10932 -100358 -135719 -170842 -179985 -81461 -22448 785 45476
13376 45476 69852 15448 -24090 -39626 -68280 -80500 -153476 -196475 -140442 -18762 24555
13365 24555 99055 136797 116094 59366 6492 -30011 -133235 -130337 -125473 -132769 -130200 -28101
13353 -28101 48866 30933 18472 37992 -26918 -47180 -73067 -70078 -71384 -52878 -18934 -28113
13341 -28113 61329 52872 -88722 -149829 -101069 -51634 6025 -29419 -115535 -87342 -89352 -61978
13329 -61978 -50203 -47315 -30193 -4665 -6632 -17739 -107400 -142415 -104440 -53026 -17852 4045
13317 4045 -44107 -52334 -110488 -32249 -86498 -148880 -66927 -35552 -7718 -273 2281 19545
13305 19545 -59949 -172272 -139865 -147856 -105011 -79390 -65911 49857 14266 25209 20075 -30060
13293 -30060 -27982 -67420 -51233 -17169 -104454 -127287 -88596 -25476 -56071 -55522 7365 35625
13281 35625 52965 43224 -7911 -49372 -38291 -34636 542 21333 -20900 -102070 -87007 -41437
13269 -41437 65276 142875 52321 -20928 -123106 -90442 3820 49425 31597 -17699 -31730
13258 -31730 -21256 -89716 -51609 -33134 -2991 -15456 39187 87264 16663 -31132 -16936 -39382
13246 -39382 4778 29653 59609 -19961 -41562 -50134 -53049 -51911 -178154 -205046 -159377 -94352
13234 -94352 -38322 -29246 -64730 -149211 -48931 50982 122486 108438 68728 56258 89126 117984
13222 117984 157207 113906 122235 21188 -24355 4192 34160 60995 119063 150404 189792
13211 189792 147511 84528 84029 116434 112028 125678 62801 47174 20179 -48610 -73155 -41327
13199 -41327 -77252 -86209 -101566 -71384 25491 51905 23188 -20908 -14486 28795 96612 82815
13187 82815 18806 38922 56467 78522 116550 46119 -77090 -93879 -47416 -82995 -72193
13176 -72193 -56962 -43916 -29013 7457 -9259 59048 61820 -37446 -75874 -87776 -102496 -30187
13164 -30187 48100 65896 -2907 -45534 18284 28629 13010 -6696 45080 57605 73111 67086
13152 67086 -12126 -67793 18351 37386 15768 20032 -43033 -36958 5277 -29977 -87765 -77260
13140 -77260 -145222 -191011 -115794 -57082 -33620 23981 48993 96195 70918 76277 27705 81014
13128 81014 88682 -1172 -93625 -111943 -99581 -98829 -97870 -119776 -68054 -40333 -107279 -149183 -72813
13115 -72813 -44195 -45030 -3089 10754 -52767 -111155 -84295 -84018 -132703 -118022 -50053 60316
13103 60316 88166 -10599 -106993 -72635 -33681 -40301 31089 56287 -36775 -85061 -62435 -65522
13091 -65522 -36031 -7807 11671 -45742 39371 69530 -16962 -20359 32425 68719 88361 -29601
13079 -29601 -104178 -47087 -64449 -53744 -57171 -39267 -41810 -62996 -1579 77394 99683 151545
13067 151545 141652 35201 -20974 -19461 -41350 -38646 72002 67811 30484 -23462 -40407 -76176
13055 -76176 -85732 -141087 -75415 -69973 -84767 -34704 -38649 -91272 -94808 -81199 -32913 -35679 -53715
13042 -53715 -43726 6745 18204 -9372 25243 23823 80593 42738 -108528 -211923 -164419 -655
13030 -655 31974 60524 26758 386 44617 46024 68914 82539 100624 105799 -60351 -144034
13018 -144034 -166133 -192849 -125692 -61544 -30294 -100979 -188001 -155027 -70990 -104689 -158389
13007 -158389 -107219 -95784 -48623 -34027 -4719 -2567 -4421 48535 40015 -12463 -47429 -61507
12995 -61507 -78848 -51183 50388 187851 259258 165914 44159 18633 12736 9446 -48397
12984 -48397 -6988 -40965 13391 37856 5768 40074 -31809 -80646 -58898 -60111 -73351 20293
12972 20293 42105 -28291 -39922 -3156 33684 20860 75717 49905 5670 64259 108550 104875
12960 104875 32629 -86925 -119709 -101571 -18283 17136 -2938 -72770 -153016 -119364 -62163
12949 -62163 -1047 16705 39938 25368 -62621 -41149 -7243 45681 127229 103374 105764 103604
12937 103604 145827 114581 105070 82606 75318 66243 13562 -62923 -41601 -18772 -5903 4050
12925 4050 -3833 -31932 -4777 -8128 1822 14275 46709 65025 40885 35257 20341 26065 -23279
12912 -23279 -30763 -61017 -145458 -152176 -73696 -1513 14794 28266 2210 -7530 -24842 -86918
12900 -86918 -106834 -226475 -241619 -224169 -143756 -164650 -147455 -108677 -32343 110580 94934
12889 94934 34619 3577 -67064 -209416 -171158 -140394 -99417 -6803 -17270 16692 17489 6266
12877 6266 -13889 -26327 -79237 58964 146122 137991 40795 1514 47531 57358 468 -69945
12865 -69945 -111899 -83902 5680 25923 -15187 -29181 53593 22089 -4817 -30012 -33199 1865
12853 1865 67333 69621 54358 -30207 -58495 -10577 -70672 -141678 -74913 -1820 69733 46371
12841 46371 42568 -25249 -8168 -13468 -47554 -24549 -107971 -78612 -102714 -82430 -32117 -27883
12829 -27883 -88073 -132981 -60851 13858 16089 1947 -12449 21603 82293 -28843 -41514 -75022
12817 -75022 -13027 41097 -10248 -19030 -11954 -29775 -40706 -18681 70104 -7078 -60906 -52648
12805 -52648 -46060 -120789 -119645 -49736 -1941 7822 -31420 -10162 -20467 -62348 -51224 -57209
12793 -57209 -44635 -39761 -60177 -60093 -54256 -27350 53387 -4359 6713 78251 149133 173961 67775
12780 67775 30898 -62632 -54345 -24151 23741 36418 30886 5545 34400 29784 18866 -27453
12768 -27453 -51930 -73561 -95878 -107997 -39354 -36116 21377 53080 -21389 -65254 -33399 23220
12756 23220 -4636 -37142 -57148 -71936 9966 12027 12579 23246 -31198 -55177 -95705 -64774
12744 -64774 -15967 58251 92368 51367 3364 -22019 -65713 -9885 43993 41685 99200 98542
12732 98542 37150 -47400 -142481 -163223 -132526 -136113 -166658 -186037 -129393 -141064 -96967 1455
12720 1455 38909 16758 44378 17196 -22345 -34537 -18774 11969 -29898 -13413 39618 -11383
12708 -11383 -64366 -28893 1901 -25680 -4819 34733 6778 -60287 -69493 -43415 -96290 -142050
12696 -142050 -165623 -107901 -34005 -100007 -183011 -147055 -100331 -120587 -123813 -96037 -36331 -57332
12684 -57332 3947 42806 41779 96424 92691 85551 101296 79898 66067 -12897 -77557 -106591
12672 -106591 -98220 -106146 -143499 -120882 -45144 -109594 -113116 -57328 -8220 -41738 -61572 -69248
12660 -69248 21424 -10156 -27160 -25137 401 -22766 -40435 74762 129346 58841 -46720
12649 -46720 -97406 -119172 -152660 -106386 -89001 -71884 -75968 -120634 -73510 -34393 -35570 -24860
12637 -24860 -44474 -23325 -23358 49855 76060 68479 53107 -9890 -67875 -124423 -97881 -81679
12625 -81679 -105979 -96786 -100586 -3449 18431 24491 56756 -13467 -148758 -92346 73723 85806
12613 85806 78020 30114 64704 41189 15115 95727 107460 87096 33350 -22506 -57348 -59376
12601 -59376 -116070 -225738 -203757 -170457 -123459 -78062 -25999 -22445 -21962 25985 104070 7111
12589 7111 -68445 -9519 -23764 -31553 18219 34155 29234 -66627 -162529 -177923 -143139 -30950
12577 -30950 1416 14714 -19185 -89718 -36918 123969 90352 37767 38761 10639 18957 62589
12565 62589 140455 211324 252661 173500 64676 -43607 -62800 -31919 -113819 -85909 -104
12554 -104 38843 12657 -5138 -60142 -17846 -52073 9680 90101 20485 -74105 -27997 16337
12542 16337 16286 -50927 -115663 -110619 -59963 -98239 -165743 -119111 -96270 -68513 -14823 -61137
12530 -61137 -27588 16102 3217 -48694 -38752 43658 32253 84544 101475 76615 59522 -53649
12518 -53649 -83080 -51203 -26719 -1716 -31711 -33158 -18115 -44722 -16203 -46649 -37680 -4374
12506 -4374 -7078 -65165 -75601 -88919 -80220 -69251 -37265 -65404 -57034 -60814 -57049 -1789 -49815
12493 -49815 -98738 -48374 -17306 -54717 -15118 29224 -28725 -12572 -10546 -16190 -103478 -193030
12481 -193030 -73356 -20827 -30365 -10665 32259 -13765 -78001 -7218 59400 41349 12764
12470 12764 -79213 -25122 -9618 6797 14072 49128 100283 135056 149976 174182 45593 -85585
12458 -85585 -96624 -86155 -42446 -77360 -36344 -55133 -150780 -122525 -122577 -56016 -47715 -46751 -37126
12445 -37126 -96667 -75023 57579 133128 37978 -18978 -12736 -28 67829 72352 -15881 -78032
12433 -78032 -76308 -113285 -109767 -7201 21396 -13323 -20850 -10369 -39984 -149950 -112598 -175868
12421 -175868 -223677 -184796 -104481 -72165 -37958 -51441 -39984 -57913 -45949 -20780 -82012
12410 -82012 -87481 -50390 1034 2614 18028 -32436 -9014 4486 -31256 -46974 -41888 12335
12398 12335 -25446 -14116 31923 44299 3607 81827 77173 18318 -29409 64617 125675 173145
12386 173145 244531 240577 135327 118410 10129 14640 43964 -26067 -115345 -77171 -40599
12375 -40599 -67616 -54305 -180166 -217919 -111899 -8226 26464 -45848 -122025 -147805 -124125
12364 -124125 -10285 64817 46887 11388 -42709 -6085 7952 58462 92030 43255 20828
12353 20828 24808 -31653 9466 20511 -69345 -107201 -121981 -174874 -140287 -68359 -25904 -39185
12341 -39185 -76580 -95074 -114185 -97702 -34149 43362 40424 -26972 -42275 -3990 -67186 -31690
12329 -31690 -26251 -123727 -161705 -213597 -244550 -221053 -156555 -29421 -33439 -88177 -78935 -64927
12317 -64927 -127474 -162851 -183705 -217810 -110854 -167 95777 129974 24765 -33360 -55519
12306 -55519 -88928 -52236 -73855 -97646 -140185 -192763 -186974 -151967 -187973 -178135 -160092 -114423
12294 -114423 -52495 -110667 -142005 -106064 -20002 36333 31093 20383 -11229 -18034 56025 70055
12282 70055 27642 -26310 -7177 25636 351 34599 -15663 -128507 -205506 -167163 -191482
12271 -191482 -153833 -77338 -72456 -114222 -151402 -226976 -242933 -132500 -44111 -18099 38437
12260 38437 43125 5211 -120169 -75709 -97079 -127155 -68324 38366 35838 -55 -57307 -87103
12248 -87103 -126747 -146035 -66149 -69097 -140994 -164345 -136462 -59036 41219 100211 122783 167271
12236 167271 223216 112414 82539 95779 174853 140457 -20805 -78334 -48566 -23909 64352
12225 64352 42328 -20709 -81531 -103002 -104403 -113549 -84218 -126664 -146559 -81786 -43696 -33580
12213 -33580 -2267 -62606 -120403 -145603 -136696 -71143 -11718 35931 71420 -578 -43899 13098
12201 13098 -14620 -33586 -52985 -24879 -39086 -92806 -89854 -73521 -113027 -57844 -29160 -136148
12189 -136148 -128179 -1494 30336 10915 -41592 -39604 -29466 -51150 -45126 87031 100306 38428
12177 38428 47435 116597 127910 157699 143174 58285 41164 71617 70381 111340 203614 222788
12165 222788 139641 107121 113046 101706 55332 6573 -10760 -33302 -55430 -85620 -159044 -183091
12153 -183091 -112046 32528 30828 15452 -25913 26004 64972 47486 73619 101523 99503 91065
12141 91065 76344 150789 129662 58263 29003 57729 70631 21554 41304 42240 14480 12880
12129 12880 27613 66759 66341 -14046 -1918 24295 -15618 -8882 52533 13353 -22690 73941
12117 73941 136248 120739 125330 133908 131586 21065 88351 175483 171891 119957 52540 -29450
12105 -29450 -126386 -306729 -465685 -565650 -624955 -637138 -598332 -558132 -435295 -303383 -144124
12094 -144124 -144483 -154510 -130786 -157064 -177983 -145339 -70522 -714 -74624 -33936 -73236 -88801
12082 -88801 -88688 -146565 -195833 -168191 -136202 -117175 -43318 -43823 -50208 -16871 -15142 -84149 -91768
12069 -91768 -90502 -51831 -6873 -12489 -35081 -97171 -131130 -33499 -17947 27221 31271 1931
12057 1931 -3649 30449 -17364 -29491 -62306 -71130 -124185 -119677 -76477 36032 -32332 -83088
12045 -83088 -111621 -212222 -320423 -457779 -541276 -633351 -638743 -418157 -178815 -146768 -57313
12034 -57313 -43092 3738 42091 79456 127894 161918 95020 85817 76198 32024 79929 100998
12022 100998 87760 123271 106309 87114 58411 -39868 -106688 -63064 -25186 -17250 -8055 45005
12010 45005 44694 6211 96996 130044 90722 135499 163264 153087 52095 -24892 -930 9655
11998 9655 47506 10997 -24924 27392 24744 150565 282824 266532 162487 188902 191908 105798
11986 105798 68133 26887 107251 96274 199727 254499 301827 359165 383639 397235 443366
11975 443366 519470 435372 368735 498043 526538 532883 520694 573297 616706 649958 591047
11964 591047 573744 586811 662817 730296 787469 830144 837925 798954 908013 1088881 1294246
11953 1294246 1404657 1497417 1529586 1512181 1572408 1609551 1667043 1772809 1958576 2081940
11943 2081940 2222204 2437966 2609223 2822613 3066589 3386800 3795372 4163974 4558318
11934 4558318 5019498 5555604 6192742 6911533 7799611 8911768 10251032 11817781 13755355
11925 13755355 16196934 19359607 23475278 29091915 36876849 47993836 64049362 87745239
11917 87745239 123415235 175824792 242524576 300299908 319598732 296631960 250376515
11910 250376515 195628510 143792046 104203955 77071520 58598244 45719074 36563554
11903 36563554 29879042 24785014 20866403 17749281 15363035 13423109 11779380 10381287
11895 10381287 9313553 8307803 7525376 6902777 6339505 5776508 5335042 4981927 4732812
11886 4732812 4493836 4282841 4034279 3813914 3689574 3507381 3273488 3128442 3003243
11877 3003243 2913688 2879057 2785180 2589523 2544085 2471754 2281295 2090577 2008612 2004751 1954641
11866 1954641 1856276 1844607 1731691 1580765 1523959 1383021 1239135 1107089 1035364 992843
11856 992843 988603 961926 899221 878636 840925 834495 863977 891656 921502 954013 933476 847436
11844 847436 843683 799713 758985 758911 704624 683069 639738 613638 678452 628511 610984 577413
11832 577413 597909 596701 487490 448565 554614 592016 682006 645446 544517 509369 479242
11821 479242 461152 434384 398737 400157 352930 293047 260584 349184 474141 453469 414867
11810 414867 463058 473187 398769 333831 321761 330621 372803 415933 392215 236939 186089
11799 186089 230412 181183 166937 189614 222268 160507 239072 264710 220194 257536 321191
11788 321191 498404 612260 815408 927197 896104 815067 785324 765236 719741 679731 599153
11777 599153 496411 452444 509248 515870 422219 429629 446498 371817 283958 429077 518257
11766 518257 480306 436363 398788 406315 402061 352033 378558 359666 339076 324786 316676 329197
11754 329197 282650 235716 272657 294593 252896 276199 272067 264645 224104 220780 255255 264302
11742 264302 324309 296577 296889 304621 254992 213630 187494 159914 122688 242003 394122 454935
11730 454935 485341 541470 527796 581444 737031 729168 674956 586820 342776 174399 93002
11719 93002 63040 48235 100614 84601 78953 78396 34962 -17778 -72724 -5392 -28969 -60140
11707 -60140 -32350 62 91868 188194 178163 174160 161918 195401 219343 246742 234842 201879
11695 201879 142919 74924 81982 147857 135696 157358 220264 221975 190784 87710 74888 141337
11683 141337 131442 135511 83955 62724 78604 47911 19836 39591 54120 125312 94159 36121
11671 36121 37225 84542 49579 53935 -7754 -54330 -11386 -22370 -32470 15819 54402 87223
11659 87223 55344 19576 -6836 -17110 97837 203042 232385 242845 218395 203293 87917
11648 87917 92725 129469 149961 128202 94884 55038 53867 86242 171105 180106 105769 136319
11636 136319 127977 99467 97871 85838 91922 95228 105045 110575 113260 170290 82374 26099 -44149
11623 -44149 15103 19157 84228 38932 6363 42966 -1053 -40682 -83931 -7232 49826 46592
11611 46592 56574 19160 43488 13266 9847 -12698 -88223 -90076 -50404 49754 136167 71047
11599 71047 2921 -42448 -17941 32059 25231 9367 16369 -29973 -80416 -93976 -37600 -26238
11587 -26238 -68869 -24402 -59536 -41411 17639 -4211 21748 -34539 -51856 66958 32743
11576 32743 26545 136927 238948 245490 264821 194312 140983 118571 75864 63282 31637 75545
11564 75545 22918 37992 73183 -17801 6856 79678 69362 -27982 -63920 -27168 -27866 37554
11552 37554 100881 100106 135378 183928 122157 79141 47348 20426 -9068 -50952 -13233 57313
11540 57313 27853 -6512 -40105 31570 122806 118444 48301 11703 -18250 -16200 -36350 -20733
11528 -20733 -38662 6437 181748 228293 168086 137160 83040 49034 36773 16685 12806 77091
11516 77091 153425 125265 78585 19017 -730 52197 102731 100981 46189 55418 99032 34920
11504 34920 36673 1294 -45206 -33912 -68845 40813 106642 124460 197129 263057 237114 136576
11492 136576 65951 105064 120728 91148 19793 -27662 -38934 12624 43439 92486 148936
11481 148936 133627 153246 101541 25578 28603 44191 94882 101132 56614 47856 104110 80521
11469 80521 -18035 -30244 48506 67475 125509 186003 188294 92526 53605 108468 148921 72975
11457 72975 10843 87485 154201 145344 117894 139120 140391 186438 214953 292905 183108 220851
11445 220851 291556 236828 161122 143829 49061 41991 6101 84795 132604 150653 131152 65680
11433 65680 124158 214685 254941 228955 129253 112496 85245 89783 76714 103353 189827 254971
11421 254971 150299 143268 197575 183203 227862 311007 324450 263310 138460 113855 131932
11410 131932 88853 26307 -14002 11545 67749 119838 116101 106725 87861 118509 138810 154591
11398 154591 155827 73024 655 -26639 -54111 -12930 -11306 -34859 -40478 16508 47848 34465
11386 34465 -21733 -23336 -32567 -13391 9520 9056 32885 1096 -4204 -10588 -34123 -57893 -101745
11373 -101745 -132056 -124385 -82673 -82272 -76544 -59752 -80507 -147797 -24336 75196 108827 134229
11361 134229 107969 114769 141000 70378 9938 -3064 -19977 22022 106528 81464 -2490 -93404
11349 -93404 -62681 57633 97231 90074 118576 72596 84613 58011 85145 40248 -17111 46961
11337 46961 118213 134890 132060 76889 48346 1836 -33552 -23016 60657 54413 45131 44635 87711
11324 87711 41019 59900 29100 15624 20414 59032 43320 93074 171673 227757 192587 59094
11312 59094 -45285 33030 147806 114198 30779 16588 19041 40116 -20914 -73360 -18162
11301 -18162 63479 18938 -14199 17357 57511 118311 87584 1406 -12229 74400 60451 16729
11289 16729 5497 67268 88292 54730 110594 166242 166432 85121 5792 2306 66411 98404
11277 98404 72404 -21304 15990 97001 2556 -11342 -32419 8006 126033 212418 168237
11266 168237 81407 42533 -19818 -29718 42899 116282 147721 143064 161711 137164 27259 -45779
11254 -45779 -41307 23678 6128 37302 28341 -11894 9920 89 30266 24023 -59315 -53184 -73905
11241 -73905 12700 37295 61581 71266 50609 5479 -66029 -55690 -15297 25884 13974 44298
11229 44298 12516 219 -59317 -7701 62154 91355 59451 185654 234170 199695 149404
11218 149404 184385 208656 114754 68833 107739 124477 79178 84711 51193 55861 82978 -11974
11206 -11974 31318 77210 97677 155923 179250 148319 109279 52572 72669 46107 -62845
11195 -62845 -100585 -67152 8641 60585 30718 67517 106849 89188 74950 58850 54035 1721
11183 1721 -34352 -42020 12819 35043 -4000 -48681 -16436 51385 58578 57319 82032 43895
11171 43895 106309 205992 162484 107551 72504 113278 100150 -24782 -90093 -89709 -9234 315
11159 315 1020 -39545 -86909 -77025 -42874 -128449 -119977 -122756 -138949 -104766 -14570 14353 14468
11146 14468 1873 -7548 4489 52483 73504 -5710 -33322 -36774 5774 -54882 -73915 -62511
11134 -62511 -29431 21924 28355 -56225 -145393 -124008 -108967 -80950 -41936 -39516 -45551 14023
11122 14023 22927 -17759 -14244 -7165 -54825 -10390 25307 47892 2180 31347 63067 45914
11110 45914 71929 -5213 -30803 -72094 -52317 -32076 -122715 -95586 -47179 -51077 -21922 23869
11098 23869 19687 1444 44091 11371 62757 96554 -30803 -44329 -8438 61373 24760 -7029
11086 -7029 25756 6740 -90691 -177660 -126284 -852 42612 43139 72798 118902 31543 -22006
11074 -22006 -94398 -104883 -87527 -37445 37836 23757 60737 44321 -2330 100967 114389
11063 114389 96066 65867 6811 -3977 -53625 -26890 -22540 -67798 -88748 -102752 -113970 -100536
11051 -100536 -25247 15636 6803 -56206 -1565 -1135 -78399 -126268 -93042 -3587 -1593 19037
11039 19037 167995 261682 166372 162626 127169 147700 198348 182909 258889 271943 201534 298314
11027 298314 392865 429089 460117 376601 381928 326157 264208 271094 330784 288477 311879 364889
11015 364889 419729 544135 690710 688018 597743 572319 486443 486366 454798 445827 410539 399563
11003 399563 432400 470770 453895 439518 404948 445414 460118 328262 293571 267924 297960
10992 297960 321439 305851 286628 237461 207460 149868 190377 187493 118982 92413 97312 32443
10980 32443 -23928 -77521 -5630 15557 -84573 -92363 -37315 -28456 -30825 17410 67321 42552
10968 42552 -36031 -34671 7051 6619 22385 -10348 2381 22794 23181 -43943 -12433 42920 42587
10955 42587 35327 76025 9685 30479 71120 83942 35865 48688 58596 63425 91550 36656
10943 36656 88490 107933 18239 -75535 -172092 -88840 -37092 -25688 -94007 -94376 -138156 -123521
10931 -123521 4700 46679 89528 77218 63591 -6062 -5656 39880 94246 70708 34924 32451
10919 32451 -9986 -86156 -120896 -109536 -48752 -35204 -134274 -158043 -135569 -154228 -126731 -88447
10907 -88447 -105323 -39581 81853 120155 41788 -9735 -72290 -84495 -115733 -86214 -74536
10896 -74536 -47575 -14320 -34064 -32459 -7398 -17417 -34319 -21510 -19064 -66321 -71844 -84000
10884 -84000 -44091 42015 89321 -46608 -130209 -144790 -152629 -94892 -51323 -46668 -70180 62227
10872 62227 129500 134397 138526 155842 102724 -42855 -131816 -87606 -71296 4318 16098 -50108
10860 -50108 -99899 -66368 -34805 -40609 -50165 -32018 -43563 -20209 46138 5331 10201 -13445
10848 -13445 4550 20738 28324 -2999 -19978 50638 39842 70408 87813 39548 1493 -20581
10836 -20581 6535 61883 1412 26036 70981 19774 -24023 38288 72521 56188 -9836 -84809
10824 -84809 -55186 -18117 4095 18158 23062 11994 7690 20120 97894 165657 153487 115943
10812 115943 87673 33854 2842 40603 69157 54851 51110 99324 83292 67644 28173 32183
10800 32183 60080 -26097 -97522 -133474 -129817 -139842 -111357 -66406 -26811 -79749 -167113 -150024
10788 -150024 -164316 -119106 -98343 -113047 -201307 -255818 -259652 -218566 -159285 -78946 -30536 -4216
10776 -4216 -50426 -130987 -133081 -132848 -147203 -159397 -211013 -224111 -181880 -173602 -192773 -209309 -221976
10763 -221976 -303965 -358607 -375827 -404275 -398537 -249347 -232710 -335731 -320965 -320375 -270712 -307882
10751 -307882 -278503 -243303 -248505 -247165 -231798 -167797 -164633 -241174 -186018 -112372 -218612 -254720
10739 -254720 -275477 -367454 -296995 -292133 -323373 -331161 -353305 -300727 -230004 -237552 -220467 -205702
10727 -205702 -223892 -278706 -285356 -339901 -270496 -260250 -272074 -306277 -345112 -321539 -241965 -205387
10715 -205387 -236107 -261088 -272541 -199646 -172438 -174207 -199547 -196729 -180739 -136959 -28836 -71380
10703 -71380 -128839 -116944 -104390 -144677 -148109 -135939 -67901 -27802 -21395 -50296 -92596 -46064
10691 -46064 -36422 2492 108120 164567 95530 35617 1058 -17423 6169 95070 42931 793
10679 793 112726 174950 78865 65160 106710 147746 58349 -26728 -3414 31505 -16471 -36858
10667 -36858 60674 81455 91788 117129 75438 79133 169281 216343 194110 179855 228968 178831
10655 178831 96425 23550 77020 187776 121453 121702 156979 168252 253335 373355 385977
10644 385977 381954 392062 454261 490738 497000 520622 496710 545520 631953 659708 618306 695352
10632 695352 782684 826553 959842 1094196 1186539 1348412 1511953 1729900 1990785 2316056
10622 2316056 2541222 2707687 2911211 3280436 3838504 4521477 5356913 6461288 8017952
10613 8017952 10130832 12961181 16799947 21708434 27465218 33200373 37469404 39688950
10605 39688950 40020155 39237968 38199077 37903938 39152719 42538826 48692508 57842198
10597 57842198 69140150 79994883 86868080 88301517 85365904 80124389 74509015 70442629
10589 70442629 69356945 72245635 79488833 90941504 104997388 117510024 123470389 121117370
10581 121117370 112637432 101183323 89236042 79274223 72846080 70571032 72276218 77315895
10573 77315895 84122506 89563198 90371876 85687000 77287423 67351028 57617587 49546928
10565 49546928 43881324 40830779 39955825 40703757 41951949 42482087 41215604 37915277
10557 37915277 33178264 27829387 22624829 18089389 14528603 11726846 9580072 8004602
10549 8004602 6766880 5741586 4999799 4424946 4078714 3718391 3388702 3001736 2647084
10540 2647084 2460758 2246924 2043079 1884922 1806922 1716190 1597283 1516998 1488888 1410508
10530 1410508 1395675 1347391 1308581 1221331 1132128 1086476 1098523 1060931 1094876 1050872 1019114
10519 1019114 989243 931612 870710 863589 887428 918945 863977 766957 719018 690856 690738 676715
10507 676715 707920 689716 709176 614760 578339 701707 702167 682796 646772 550184 528942 527774
10495 527774 494485 459924 475210 506481 550724 541998 472409 400919 409700 406972 338151 376523
10483 376523 344220 298913 307614 322025 312322 368677 416878 394693 402807 350478 235555 147918
10471 147918 163382 277303 344891 302218 342814 324153 286611 290737 357436 322776 334384
10460 334384 394380 452005 499869 501983 527540 575593 508836 495524 460433 433769 429134 471076
10448 471076 532581 589502 624381 633120 617979 564666 571813 531705 512704 489401 493120 475822
10436 475822 486688 500690 499064 473302 415250 489503 507448 485979 547329 533116 508164 417982
10424 417982 303982 304508 285574 347153 351253 362304 367038 376519 334358 316272 465934 549474
10412 549474 492160 469440 452895 440478 451528 506908 431423 395043 369562 370893 333852 285774
10400 285774 320012 449413 507883 524915 613565 579839 518093 545216 462254 372932 222705
10389 222705 89852 68513 129165 143672 239640 206081 171901 147164 171071 243663 226375
10378 226375 173789 133488 117306 160098 208216 218699 218151 134656 109786 183748 209267 188390
10366 188390 177649 197530 161645 251275 312708 235634 174715 166142 114616 132699 239603
10355 239603 234832 154732 85549 3078 22557 19676 39923 14480 88161 182051 156280 120422
10343 120422 79996 113472 149528 205265 167531 104470 136455 107188 116348 208177 252879 230389
10331 230389 224032 222345 135302 68092 31624 -36852 -72665 -2721 81104 160510 201736 128502
10319 128502 114706 104655 138071 219496 193603 206831 213558 256639 214185 245172 194582 190739
10307 190739 219658 190278 214648 213089 151853 87014 136452 98557 116765 215559 183524 161612
10295 161612 101876 37834 104350 184325 188876 199159 217626 200962 249202 186216 154396 194049
10283 194049 182857 128083 170865 153177 150560 259973 303503 230796 179046 191892 200361 254147
10271 254147 339698 434702 569209 590887 708563 1004224 1367128 1741001 2255445 2878429
10261 2878429 3391937 3813102 4088920 4209309 4232253 4043352 3789895 3365279 2856618 2406937
10251 2406937 2008858 1652872 1224139 877273 700036 607508 469858 391653 277072 268338
10241 268338 245200 150041 64729 71261 163645 173593 149839 115993 71144 35362 44180 42250
10229 42250 36284 78245 126112 135865 105592 17664 -30219 29708 71458 70304 84968 61457
10217 61457 81801 87216 70455 69239 64848 11027 -1905 25465 42978 38477 150548 224676
10205 224676 201327 152717 144591 133479 100274 34044 28789 70837 94981 149165 138937 149157
10193 149157 174263 100568 18887 -36745 31342 34811 -425 74456 110403 117642 73286 79737
10181 79737 74715 21436 11234 -62978 17217 143763 255980 171352 226225 321532 243951
10170 243951 255191 251627 308064 295455 240807 229518 198458 262552 297530 336175 468383
10159 468383 560015 565312 539251 476893 419688 365155 420364 468787 486052 500684 574494 614286
10147 614286 645953 648995 676618 683609 642245 601627 552736 572704 675739 665178 590785 558456
10135 558456 577578 527076 510331 411284 386824 370234 375757 376703 397236 421894 413888 431338
10123 431338 461513 536483 509651 426720 261491 168897 180612 176491 202903 167638 119829
10112 119829 9441 -39359 1768 14476 59933 127513 125357 59784 -27454 18964 24693 -93133
10100 -93133 -138666 -111294 -69749 -26305 27642 -16196 36152 83172 45134 85931 115170 77247
10088 77247 32682 83300 64974 -4309 -7613 -10901 -15132 20487 -1772 27994 49880 47449
10076 47449 22942 78974 50924 -3107 21331 50557 72300 46137 -16229 32605 105778 14990
10064 14990 42883 157112 238034 173206 73756 31595 34309 11555 -8059 44817 104496 102880
10052 102880 108195 69897 48989 6219 -45019 -57266 -60858 -67902 -53175 -59538 -55052 -46114 -53982
10039 -53982 -65745 -27458 -29639 -2582 17399 49533 67517 -20418 781 123737 117067 63504
10027 63504 142616 213301 143448 64292 59079 119625 126049 38791 6014 58926 72781 53264
10015 53264 24042 50218 112280 172896 120256 72702 118733 151805 155016 160571 108899 64476
10003 64476 -46625 -99790 -59379 -30971 9807 -28185 -72715 -33644 117919 146090 55545
9992 55545 1083 22858 -30325 -33742 -9195 75453 112584 72678 70174 74282 66433 44520 -27066
9979 -27066 21352 33715 -23448 -32291 -17174 -79800 -17846 27369 148828 131326 30196 21657
9967 21657 2886 -4656 64986 136216 69709 -8293 -38324 -7778 -23464 -5899 37036 19703
9955 19703 10213 48582 60276 -30190 -149526 -125953 -62997 -11422 65990 34126 -3392 34828
9943 34828 -7320 -85471 -104031 -31932 -12304 -22297 -59983 -31063 -578 31943 152409 177330
9931 177330 117931 65754 105851 68368 -23018 -33971 13399 44887 81074 188264 293469
9920 293469 296579 130581 65283 117853 107662 -8366 -77522 -73032 -30539 6067 50426 15270
9908 15270 297 -37473 -72103 -83559 24750 66628 31649 25850 36131 37645 25941 133320
9896 133320 149762 117226 122933 70083 64946 50041 -1407 -34370 -53329 -15316 47531 28446
9884 28446 -8516 -17591 21658 50421 55373 27907 -29745 -35573 39632 127384 81829 34080
9872 34080 20123 40669 -10013 -42736 48514 100260 36620 35986 51108 111669 83349 16904
9860 16904 87513 81065 114439 176417 122817 71121 47119 73976 110164 77851 89308 91503
9848 91503 99794 117815 143518 178777 149182 121072 108776 43938 32496 68 20723 51982
9836 51982 18540 2397 60434 26441 -10460 -24468 -54443 10025 67958 125583 117448 114803
9824 114803 90152 132625 144817 209416 104656 45684 -39882 -44667 38251 136193 145102 102051
9812 102051 48721 81409 131153 144696 138427 117822 122914 121974 93935 29400 -23841 78549
9800 78549 10218 -33758 33449 72592 123859 -18116 -25451 69854 39223 -71793 -48794 -67988
9788 -67988 -177481 -162251 -115286 -33875 3188 -80227 -133458 -74250 -13661 23697 -15606 -131385
9776 -131385 -123504 -18593 21130 -36605 -11808 -44088 2611 6109 66467 142799 77448 70409
9764 70409 41784 -22047 -36035 41466 62323 53892 42498 34069 56389 40493 71441 39033
9752 39033 32490 11977 11884 69646 46606 85973 67274 15234 6546 33652 68183 110110 149941
9739 149941 191656 164713 142693 134924 105102 22270 11191 32784 -56574 -80072 -100258 -87236
9727 -87236 -57243 -2314 100639 188081 135200 -22715 -76472 -154253 -194681 -103625 27050
9716 27050 -10913 -21477 32057 65321 39970 83776 73503 32014 -20645 -68546 -79257 -82439
9704 -82439 -121913 -116696 -131397 -47559 -11727 34750 83466 121585 39556 3706 30204 77685
9692 77685 55860 -18684 -55470 -9336 -52781 -105077 -208210 -143912 -160662 -177505 -181975 -99556
9680 -99556 -24809 8347 40077 155282 166742 70538 -6526 -25882 6409 51148 128015 119652
9668 119652 15437 59432 83014 -11016 -51138 -109877 -104121 -95486 -78543 -42271 51611 56969
9656 56969 43142 42112 26262 38725 28332 -27074 -68090 -54605 68149 220212 376871
9645 376871 472566 382922 280810 268791 269179 295457 268098 175400 146131 116866 123093 132099
9633 132099 197677 224597 213312 108390 2319 9558 5882 -19914 67557 49049 88879 33187
9621 33187 711 -65446 -56854 -45473 9419 45871 62207 88064 104287 76909 -63614 -87383
9609 -87383 -39478 -38017 -62663 23304 120802 66690 -16926 -14371 -35646 -17410 -33486 -14284
9597 -14284 -5175 40987 32957 121842 189343 95013 62676 -4507 -73883 1495 -28126 -42918
9585 -42918 4769 -23420 -21343 17629 11287 18428 40727 87884 83951 50825 38824 42007 -44544
9572 -44544 -34959 -37952 -10870 11866 -4361 -10292 -50070 -103108 -83677 -33053 -49779 12265
9560 12265 28289 -43257 -16846 46359 35987 -66437 -150134 -163288 -117022 -17665 -27667 -51954
9548 -51954 -82993 -73091 -29258 1328 114070 138390 140720 3706 -93882 754 29439 31139
9536 31139 18869 65787 74554 69541 96427 110191 58966 53168 4073 -44635 -7684 20032
9524 20032 -17480 15733 91331 5735 -95345 -105323 -105060 -70312 -41256 -62784 -115758 -116683 -92866
9511 -92866 -51038 -83135 -107468 -107697 -98691 -47746 -42676 -47211 -66018 -73710 -57353 -7060 -59651
9498 -59651 -100856 -110266 -37949 -22732 36355 34558 -28106 -66418 -72699 -3625 31429 11175
9486 11175 -14040 50730 19586 -2468 -2760 11489 38629 -30804 -146786 -138707 -79741 -28496
9474 -28496 -56523 -41022 -41348 -61415 -134194 -112406 20468 75832 77928 77843 58476 105556 130655
9461 130655 118847 70123 136363 88132 -21521 -69290 -45715 -16243 101933 140018 95493
9450 95493 63916 -15490 -53456 6237 17109 -39929 -111881 -31861 70222 102975 19033 -31618
9438 -31618 33747 95434 -8150 -105676 -108488 -59599 -56116 -20592 26214 43856 94287 94155
9426 94155 95648 141674 79983 65927 -8503 58835 76120 66025 54445 15749 -2311 53036
9414 53036 59921 50797 47706 103230 124650 181523 159505 48990 29205 2057 -9072 -17864
9402 -17864 11665 45721 13595 -64042 -34471 15559 7817 23549 -13888 12358 47435 96862
9390 96862 99374 46625 18810 -32177 -75262 -40184 29510 31630 -68738 -58884 56097 71656
9378 71656 24065 24484 62327 46028 105802 170646 157942 95614 62963 99839 166727 246852
9366 246852 177519 107829 126434 154093 135755 128919 139990 128832 100651 51366 53958 -445
9354 -445 -60085 25969 5036 -6876 -7333 69143 7400 -57380 25796 21697 -56853 -74236 -79023
9341 -79023 -121957 -69013 -14603 -18303 -13520 -23795 8634 11793 26682 58811 105516 48716
9329 48716 38590 22635 11130 78397 25068 -24653 -91082 -160690 -106905 -40607 28289 60674
9317 60674 7226 33650 70535 -29061 -100081 -126779 -162241 -113803 -26546 -2953 27390 -14127
9305 -14127 8068 21562 3346 -36860 -62389 -17754 76841 66079 71150 127842 135562 87888
9293 87888 -2836 -42211 -11686 64648 145418 107937 22392 9755 1156 -7905 -29294 -23823
9281 -23823 35209 95222 47502 72073 192902 210327 111997 22654 26440 15480 -5089 24653
9269 24653 26574 42609 -31512 -4538 19364 49713 106859 122381 133865 68485 -22773 2178
9257 2178 15923 38039 98929 65461 73355 23460 -56387 -113805 -67828 43173 69067 108386
9245 108386 140120 132891 90895 -52106 -151604 -194489 -92102 -25801 30829 37455 14710 -61658
9233 -61658 -92994 -71709 10351 70735 40092 -68758 -118965 -64283 -57796 18230 41492 -57815
9221 -57815 -85699 -12593 46418 107273 77460 14061 -63950 9446 146508 115329 8306
9210 8306 -26250 -40060 -61146 -91316 -148344 -108854 -25291 -23368 -92364 -118120 -80387 -101972
9198 -101972 -119731 -46995 39625 44278 58675 51632 81522 31035 44211 38841 23019 4207
9186 4207 63077 80106 55113 98947 28259 -55535 -75938 -22339 -3611 32529 28754 -34002
9174 -34002 -27171 9767 -2226 14176 47981 81651 101117 103091 43023 -63884 -89888 -131001
9162 -131001 -114763 -24136 1620 -18677 -223 -4080 -20927 50801 80112 -9005 -25635 -92521
9150 -92521 -118496 -52487 -55499 -41903 -57891 -29343 -5053 -55289 -15570 -41692 -84134 -40114
9138 -40114 -5653 106641 217425 207982 122155 55838 25493 -22959 22605 64987 45246 38501
9126 38501 -21228 -42816 -10358 -18263 -76124 -16992 -24485 -21503 -69202 -174100 -178198 -137899
9114 -137899 -21643 46383 100045 61833 47454 -1476 47912 177595 149556 37772 -12744
9103 -12744 33140 62073 3034 -67633 -52969 30108 25908 18970 86021 69797 -53153 -55649
9091 -55649 -80047 -114819 7854 27334 -22167 -39743 1574 -51876 -88847 -88661 -155451 -47285
9079 -47285 33176 40013 45689 45032 -27541 -69980 -77632 -77426 -132104 -135401 -91119 -44870 -16793
9066 -16793 62001 98981 92346 81595 26060 -456 27569 29980 106281 121755 115971 60234
9054 60234 48465 92365 139750 101485 75552 105498 122450 38971 -39855 16236 8640 3759
9042 3759 -23390 27886 -1611 -25301 -49889 45969 128542 167275 60968 -31878 -51386 -11835
9030 -11835 -12461 16793 41320 49519 -6715 -85082 -77153 17308 573 -31023 20414 43573 -20449
9017 -20449 15164 -12750 -38038 -85215 -127705 -94447 51450 126368 163857 169404 192508 213627
9005 213627 157646 131163 94026 32880 61840 60688 73577 74745 82212 119866 102204 31210
8993 31210 -20369 2871 -11323 2447 59142 76227 -4993 40569 70407 46720 67420 71964
8981 71964 3141 24330 -15041 18981 28072 -6139 106955 160667 176110 117662 92140 131589
8969 131589 149798 120009 122729 82261 43248 77600 70567 63764 -16461 -45518 -63780 -32208
8957 -32208 7856 -16182 -13638 22997 82259 92363 132289 129932 74184 -9669 12802 82907
8945 82907 77448 72548 124269 200178 153261 76321 -26955 -60146 -49228 -48578 -19768 9164
8933 9164 2067 51552 50092 -85157 -126331 -64594 -71247 -53996 -74762 -122755 -85144 10538
8921 10538 5089 -99306 -88218 -118808 -51081 -83684 -150730 -99015 -140216 -154574 -100578 -112461
8909 -112461 -115018 -100953 3409 -45166 -100120 -68598 -130077 -152127 -122243 -174399 -216775 -230800
8897 -230800 -171457 -95596 -28602 21245 -18015 -29163 -76087 -202231 -192291 -64751 -17074
8886 -17074 6646 -353 -65188 -65203 -38473 -11837 -24254 1100 19579 6449 -39484 -59405 -57982
8873 -57982 -55983 -92611 -57297 20858 70615 77958 17740 -11172 -52099 -120951 -117597 -64506
8861 -64506 -96898 -64446 -22556 -41352 -10363 20661 101603 101458 -9706 -73688 -45595 34707
8849 34707 41284 55583 71090 19135 211 -72780 -129912 -95743 -121532 -50465 -43760 -38031
8837 -38031 12980 35525 66652 95720 94550 -60538 -75677 -9401 60479 161398 183563 166565
8825 166565 155935 170785 273443 337906 309809 146232 74041 44884 -33961 -77648 -77325 -112343
8813 -112343 -141442 -103193 -57531 -43154 -96049 -101382 30068 49508 22105 -782 51998 21435
8801 21435 -31017 56269 99882 21267 -29785 -26766 22420 -9706 -33635 -7076 -36861 -20901
8789 -20901 -69048 -46080 50596 52546 40416 7010 72261 29329 8048 78487 105925 106537
8777 106537 117555 114112 119719 96420 44759 -20418 22362 128340 117450 141652 169111 104478
8765 104478 -4157 -17466 16906 54602 58599 6862 -30643 -92055 -134900 -155842 -148836 -144818
8753 -144818 -71911 -86482 -77225 35958 81183 -55994 -132370 -67172 -5407 -20108 -45868
8742 -45868 -62025 -63506 -58301 -89362 -123182 -132126 -63700 -223 53155 57429 31398 78652 65928
8729 65928 69115 58487 7437 -16189 -4789 65460 45496 -19932 -49616 -77783 -101706 -66915
8717 -66915 -102671 -69849 51000 83141 -11509 15360 143256 146705 66736 44586 59294 138706
8705 138706 191491 162093 193029 217361 126750 57098 93321 130886 109943 49155 97478 95882
8693 95882 36490 47112 74822 77459 85163 8613 -58812 21708 85603 25571 -22937 -29401
8681 -29401 36024 33061 -44009 -85112 -114495 -116842 -133327 -128786 -156259 -65912 8515 22706
8669 22706 -30436 -18615 91457 132992 61190 24449 17433 19937 55867 -18859 -30966 16740
8657 16740 53363 27954 8369 16343 30925 33282 63923 64073 77395 48273 48908 103358 117778
8644 117778 40453 75923 20139 16989 41159 28462 19228 40594 43974 6456 -6048 -24469
8632 -24469 786 28546 88795 67787 34839 4958 22877 50692 153553 172088 150150 142635
8620 142635 6370 -6503 30063 97276 110097 92061 16243 20192 19490 52393 105982 214875
8608 214875 162808 95836 54029 45394 95504 47345 78601 157581 125594 126026 136848 164314
8596 164314 163813 238967 234918 265535 289851 260048 318350 434988 449665 363161 289240 283912
8584 283912 280717 266123 215567 194917 251970 227783 169829 220652 243903 184152 107805 105640
8572 105640 157618 119336 131699 216116 208383 152951 165245 169973 131872 36101 37945 57869
8560 57869 177958 148195 57408 66455 146721 281377 180998 200125 196256 157456 82693 -1589
8548 -1589 -59429 -47745 42550 62647 68196 39938 -26757 13943 111311 66662 116689 90972
8536 90972 70407 110998 95748 102524 128534 103337 108119 153688 185070 99155 94519 107152
8524 107152 109418 105324 36490 37060 75428 81744 62764 67616 123394 160366 104541 49092 82725
8511 82725 83708 87069 28781 -31652 56651 107408 51959 35677 19574 77859 129047 110067
8499 110067 70949 54870 45400 41711 -16373 2926 48502 51641 132100 207911 302185 241812
8487 241812 175858 215054 254880 320427 258376 238293 276375 266943 217204 191731 239950 229098
8475 229098 217766 173653 128678 161043 215555 199672 115989 101871 124174 150280 100933 101177
8463 101177 55349 73831 131668 228659 282313 250973 210893 150282 188618 159299 233836 284038
8451 284038 261681 299102 274112 239026 219559 197681 246316 252134 226187 224412 221352 248898
8439 248898 216866 267174 267243 227529 251020 332343 391780 433235 458683 391367 343308 407460
8427 407460 365414 306871 295547 271246 254867 259564 320815 347353 363266 312109 269900 210561
8415 210561 189821 117839 101877 60450 62990 133214 147468 165420 210073 207436 176925 48360
8403 48360 34252 111051 124782 131646 123898 85357 174923 200442 162774 101947 11529 32794
8391 32794 85232 55796 -15318 27977 74499 46558 74920 85562 76566 -11289 -13019 -8493
8379 -8493 -27775 25070 51228 50001 43963 -3275 -51379 -16670 12465 70467 94825 45131
8367 45131 11819 95522 115517 27755 27539 38111 6500 -40594 -86981 -104084 -10694 29760
8355 29760 -41368 -120119 -102724 -127647 -104329 21723 85709 115414 52624 76413 67602 19639
8343 19639 97389 93401 45871 -5962 -4095 821 -74839 -107600 -106246 -46825 15154 5920 -30475
8330 -30475 -118488 -147462 -168383 -50616 -20076 -38431 -27144 -109054 -113592 -86259 -65902 -82558
8318 -82558 -85166 -19306 -16722 -74244 -90784 -72990 -25535 73538 30104 -5770 16876 54738
8306 54738 62290 66300 34679 79326 106502 93963 20451 43988 16572 -7037 -10587 12523
8294 12523 -73024 -32800 -57356 -79249 -78401 -45670 -17122 -55466 -58858 -50655 -23452 -111447 -170574
8281 -170574 -83161 -11458 40765 -8352 -70949 -83515 -76767 -60182 1878 -45010 -102155 -102585
8269 -102585 -132802 -79301 -14407 -52697 -8439 -3639 8863 17671 -2365 -6896 8386 41436
8257 41436 61960 -17722 -5272 -50728 -78547 -55280 45205 84103 61884 16498 -29236 37263
8245 37263 78286 54341 35062 27720 34555 55561 39944 98445 156069 165125 151780 79596
8233 79596 -5539 9206 -28321 73140 179333 151051 108264 51386 12226 -3744 64161
8222 64161 66005 37525 68085 95103 15596 75830 90479 71475 28143 -45391 -111048 -92195
8210 -92195 -29681 108917 114066 103178 22367 -19996 2207 50529 12247 -36473 61725 104244
8198 104244 -33658 -95574 -54903 -101989 -128164 3556 106890 148494 131220 93315 49890
8187 49890 -50743 -131063 -97161 -65669 -35008 -56879 -101450 -141054 -174877 -151121 -156095 -114873
8175 -114873 25885 86803 -21643 -111128 -216006 -220407 -183654 -145705 -232745 -185198 -84833
8164 -84833 -41389 -119787 -146828 -91633 -14237 -40850 -62339 -74578 -84158 -43741 -22894 -10726
8152 -10726 -57976 -78387 -130985 -22158 40932 50736 32536 -12149 -7674 25943 87683 67328
8140 67328 36834 21463 -8637 -68252 -107859 -9608 132156 161859 190314 57592 -7067
8129 -7067 37912 74761 49380 20689 88869 41994 -54188 -56569 16130 24732 -58290 -65850 47278
8116 47278 144076 138598 113268 74421 99480 155982 173208 95428 -21263 -58179 86248 179670
8104 179670 183102 55968 2124 80031 179248 248478 239105 217495 162442 68572 20263 -71304
8092 -71304 -27611 -36311 -54091 -31917 6198 11926 4587 -23187 -27059 43615 27565 -9162 -19086
8079 -19086 52954 68252 37439 19301 -39419 -35129 -53598 -29997 45739 45432 20289 10792 -3332
8066 -3332 28053 62549 42306 29345 29685 -11701 11707 51452 3672 -16037 -47331 -22612
8054 -22612 -29279 -65910 -86704 -2765 58139 81514 66623 83260 6796 -69166 -47629 19617
8042 19617 27749 10838 6113 35692 39206 53035 135358 152319 111166 113637 113301 77694 32009
8029 32009 -53819 -94368 -69956 -32622 43817 111044 159848 172247 177013 158870 169535 111400
8017 111400 84491 85472 72872 4267 35251 34733 76287 124457 41108 36698 96682 139733 98517
8004 98517 69258 3598 -8967 18817 51057 123162 140642 67384 14142 33721 7770 -77902
7992 -77902 28315 160883 187156 138770 41284 34103 85369 134230 111991 112471 96184 127972
7980 127972 127562 115881 176864 344114 458726 580715 557812 518453 502190 490108 388165
7969 388165 270937 242096 197653 197676 163668 223617 246387 227280 255216 205828 117832 117862 52020
7956 52020 56637 112635 229302 190258 38351 65452 95490 79777 152136 147147 176290 158627
7944 158627 196770 241226 131681 123141 106761 102663 187889 244180 123367 110611 226301
7933 226301 371981 437940 376471 404270 485541 408009 322490 218528 163304 175080 180567
7922 180567 174883 126378 96772 -34865 1614 79785 81191 52774 -23260 -20947 -34873 -25357
7910 -25357 27438 102111 43380 30452 30924 130424 207094 116078 28346 62105 126447 124794
7898 124794 82296 13134 -33650 -24824 48735 -47389 -131651 -30762 55968 54322 -6282 -7455
7886 -7455 18487 30882 68927 74322 4347 -55909 -86850 -195358 -155991 -108519 -76616 -64715
7874 -64715 -53977 34129 66655 69769 25532 212 -78765 -122585 -65251 3649 22041 26899
7862 26899 -6049 -37142 -54225 -51041 -35500 -62874 -68182 -68871 -32239 -62019 -34380 -34072 -73740
7849 -73740 -150119 -140106 -92657 -86575 -107910 -43233 -190 14728 17473 59 -65229 -194206
7837 -194206 -210786 -142877 -35425 75286 61044 -7785 -30687 -505 -26726 -62688 -43784
7826 -43784 -38858 -107547 -121991 -96498 -34501 12073 -45128 -10348 26968 23989 -14308 10641
7814 10641 21476 5513 25560 35185 29487 54959 70785 23466 -48929 -121658 -129131 -131197 -100315
7801 -100315 -412 45458 18913 -51685 -57645 -49710 -32969 -8299 -8780 -55758 -35633 -22436
7789 -22436 -20621 3144 -52516 -56829 -89220 -82610 -92429 -12150 46488 11544 83799 75834 31343
7776 31343 60448 103257 96614 -34681 -75648 -68369 -24857 41777 69309 88877 27148 -71643
7764 -71643 -48360 -5511 22065 -12893 -14977 55449 67995 -14298 -95282 -46761 -41046 -56993
7752 -56993 -58627 -114612 -152587 -187602 -142072 4164 -4776 -58417 -103514 -158480 -42631 -1485
7740 -1485 -23280 10028 84797 101610 53700 -6233 -45930 -54777 -72317 -35308 -18824 40631
7728 40631 35907 59474 42115 46844 14085 -46420 20196 35216 33241 -31326 -45558 -54333 -60360
7715 -60360 -142668 -127101 6407 104768 72754 -25098 17887 48909 16647 -31667 -92436 -107510
7703 -107510 -19775 24850 33104 17196 359 6330 42732 72565 97751 -22772 -98966 -139609
7691 -139609 -78777 -85160 -86167 -147865 -107529 35568 35056 -43450 -97788 -48373 -3069 1884
7679 1884 30687 -36689 -94623 -77831 -115386 -119915 -39248 78510 114064 63063 -2672 -6875
7667 -6875 -24458 -5487 75278 12026 30611 28918 -24364 -108202 -114410 -60390 -83486 -113057
7655 -113057 -44240 -14774 -73386 -141730 -166535 -180978 -178722 -93370 -99018 -50206 -67535 -79219
7643 -79219 -86078 -103566 -14653 45814 50350 35273 72649 76881 7587 -28086 -106272 -110951 -76112
7630 -76112 -26987 6703 16424 -15067 -35570 -54752 7245 15168 -57140 -80229 -122211 -102860
7618 -102860 -96298 -15756 95796 36684 -113164 -133786 -99346 -66627 39135 9137 -35994
7607 -35994 -13625 1283 -6562 -5136 51901 37296 22632 5125 36172 55346 95583 -42135
7595 -42135 -73577 -2218 75089 61247 39886 28475 -62962 -58022 -1450 -235 -79599 -140262
7583 -140262 -106091 -38716 -51459 -71591 -50168 -31212 -85531 -86719 33983 102388 149824 79136
7571 79136 -7582 32807 98520 96001 9738 -50761 -76819 -66607 -96806 -61292 -4120 88671
7559 88671 114880 100441 29114 50962 136366 116505 57668 -3233 -63104 -126358 -43618 17547
7547 17547 -14344 -21284 -19340 -40831 12217 6926 64925 135134 83776 37288 47518 31605
7535 31605 -44376 -117061 -95961 -109387 -58895 -45996 -53473 -53474 -110040 -59745 -37193 -32242 4406
7522 4406 20061 -114511 -131872 -54212 89619 1863 -34539 -10160 87335 103248 78054 66311
7510 66311 4629 -27466 -66069 -119800 -105742 -161208 -93610 518 -15936 -95346 -94091 -45460
7498 -45460 -39854 30214 132112 132121 126754 76262 64155 17390 30130 18988 -40334 -31033 17386
7485 17386 46877 53458 42293 -795 -60870 -73563 44047 74439 -40188 -66500 -43492 -71958
7473 -71958 -40035 -33102 -72184 -93269 -85751 -42100 -74557 -33899 -21304 -18610 -14727 -41681 -60666
7460 -60666 -5120 77751 95803 75575 -12046 -45648 54328 94196 46141 33353 34465 14128
7448 14128 -82323 -76501 -119280 -123457 -25106 -25299 38779 65892 42054 63816 -51381 -107340
7436 -107340 -66575 8956 -36347 -176869 -224862 -233930 -150403 -35112 -45390 -121220 -140306
7425 -140306 -64242 33676 62690 61749 -26955 -98460 -133443 -160982 -42132 15115 -39014 -77662
7413 -77662 -88146 -55793 -99215 -51458 -29054 -84619 -78147 -89239 -113924 -109253 -65175 -23281
7401 -23281 2266 -73046 -58873 26112 29590 82259 131821 84985 26314 -31530 -45984 12485
7389 12485 18474 51862 69022 33815 -64276 -82879 2480 -67448 -112870 -26606 -26736 -269
7377 -269 68351 70077 86536 64973 19624 50359 11981 -69124 -16252 49619 29803 52717
7365 52717 118295 43090 -28991 -64231 -138301 -105479 -72967 17106 -20165 -13213 53524 8395
7353 8395 -49457 -66814 -26063 65041 25805 -27248 -12155 -38477 24 42524 55988 -22536
7341 -22536 -21 12053 18901 66460 -16348 -110840 -97535 -120682 -126932 -66537 20018 119491
7329 119491 128768 90511 81052 86162 55515 14940 -15314 26332 97649 70769 -11620 -74253
7317 -74253 -175441 -74151 -19232 -96253 -154667 -190461 -161757 -142323 -68602 -42193 -56861
7306 -56861 -75212 -147801 -94005 65355 150503 174373 42435 23918 47362 13288 -13893
7295 -13893 17299 115751 191871 83293 49489 89432 169063 122326 12184 11526 -11161 -37428
7283 -37428 -105660 -80541 -140459 -201059 -231878 -117816 -107151 -89712 -106078 -108113 -85946 -86909
7271 -86909 -155950 -126149 -50364 32012 13969 6851 -19506 -43650 -28230 31223 54804 -33121
7259 -33121 -18655 -28371 11699 13865 -26157 -49419 -55418 -68006 3910 15541 12389 -8705 -14557
7246 -14557 18657 -33807 48282 35192 44127 94901 54885 7642 -56472 -125005 -110023 -73953
7234 -73953 -33477 7277 10630 -35428 -33834 24035 53865 32660 36515 77143 90909 75632
7222 75632 -2168 -28551 -40805 -4965 99987 86369 70576 104284 118099 54926 -10408 4120
7210 4120 -1991 -21198 47913 100939 14863 -51681 -119617 -88984 -61650 -73986 -61908 -73327
7198 -73327 -28923 -65652 -64263 -100417 -128129 -91359 -106011 -104479 -11817 1443 -78976 -55629
7186 -55629 -85836 -110287 -80644 2755 61020 35217 19570 20942 29604 43476 32125 27631
7174 27631 57293 101405 96634 18140 -65702 -93564 -99861 -75052 -35730 63344 114431 47445
7162 47445 54407 77564 47959 -28141 -47625 -87704 -91499 -15562 10451 -21438 -5649 -7720
7150 -7720 -136471 -155784 -147700 -126496 -78692 -15013 24823 -18782 -5210 40724 91880 136562
7138 136562 84458 -42776 -65950 23603 63674 35287 26272 44648 115038 94672 -21954
7127 -21954 -89656 -80298 -22362 -50201 -21227 16777 96825 128686 91891 64087 71622 78177
7115 78177 37842 -85665 -152126 -121989 -101978 -108245 -97109 -88314 -69167 -44216 -93220 -61183
7103 -61183 -22741 -68449 -125973 -147515 -107414 -58163 -62537 -42579 -117346 -139088 -118636 -42028
7091 -42028 -8444 68315 -7789 14752 -23484 -135924 -130727 -84300 -139934 -113116 -37473 -13743
7079 -13743 -29288 -66739 -102743 -79179 16238 45424 -12775 -18104 -76633 -129861 -18307 77663
7067 77663 174257 116140 -28741 -11082 73278 65830 63026 -50463 -34735 101191 108353 97818
7055 97818 54700 62367 118586 37736 -36590 -52580 31349 70913 37565 48666 -30754 -48900
7043 -48900 -12920 -80744 -142427 -121446 -67321 -50782 -43931 -16836 -5105 -49317 -73099 -20918
7031 -20918 -27435 20955 31793 102575 137444 123262 134413 111599 99687 -27846 -166448 -172146
7019 -172146 -116923 -130595 -145117 -144790 -116970 -101507 -106554 -37654 -20770 -35603 -39295 -63237
7007 -63237 -37023 -61276 -64506 -25028 -27251 -47880 -32624 -21535 7630 67526 35814 -70485
6995 -70485 -58203 -36755 -21916 -12245 -32621 -108272 -75269 20985 37135 -71353 -88111 -73832
6983 -73832 -63353 -93149 -15005 30964 30078 22367 -26969 -4776 -8499 -18163 -79400 -120439 -123471
6970 -123471 -110099 -126288 -105315 -72915 -101113 -141134 -136458 -8716 44484 -20713 -72071 -21332
6958 -21332 87479 36446 -48743 -65452 -30676 -40973 -66420 -86321 -83278 -125644 -166628 -173102
6946 -173102 -25777 13681 -108439 -145665 -119235 -113450 -53581 -193 -17181 41403 46636 18678
6934 18678 -35582 -48127 -53174 -43985 -2442 -1977 -49862 -95791 -67848 12926 87185 119412 35681
6921 35681 105832 78127 -5345 -28487 -32370 -39442 -95011 -96770 -22718 29780 68718 48226
6909 48226 -30566 -90690 -135351 -178135 -148367 -106110 -47056 39096 2835 -73409 -77643 -16258
6897 -16258 46101 15932 13232 -29488 -75111 -156057 -64964 25052 -13903 -40627 -133573 -152611
6885 -152611 -108935 -60059 -66234 -26447 -47959 14158 -25533 -30682 -46257 -60522 -42997 1716
6873 1716 54698 49425 78691 8352 23009 31871 -15929 -62169 -57407 -82229 -34406 -44823 -61833
6860 -61833 -118248 -96845 -70970 -4479 -39115 -56721 -24392 6404 -33780 -9672 97849 139285
6848 139285 104006 36221 8165 -34118 -33492 4522 51548 26912 -32514 -10290 -69005 -63451
6836 -63451 -93277 -30063 -23661 -11882 29287 28665 -45340 -59876 -1407 31926 -4725 -30982
6824 -30982 -17966 -74562 -76939 -129417 -93500 -78331 -107651 -85510 -90448 -31383 27835 17152
6812 17152 -83496 -196645 -174929 -66922 -78610 -72423 -14695 -19507 -64134 -81624 -135606 -155616
6800 -155616 -131687 -118327 -39748 -30166 -104379 -3816 49284 -33151 -62023 -68870 -65121 -83975
6788 -83975 2359 5649 9050 -63918 -148067 -122857 -63696 -91112 -87673 -73312 -77842 -70151 -33236
6775 -33236 44694 33003 -14689 -18824 -68845 -98570 -59400 -20408 -60537 -28258 -33680 18462
6763 18462 -14405 2529 58566 1563 38781 48076 7666 -62402 -34965 -2593 26759 -2815
6751 -2815 -94884 -155935 -113727 -83312 -117697 -73361 50867 30294 -33408 -126307 -84153 -6966
6739 -6966 61829 129395 110471 61998 109547 31123 -7974 -11670 -74016 -135299 -137637 -60814
6727 -60814 -34965 -77467 -31595 -93652 -93586 -53062 2026 31916 38393 -39010 -45424 60043 59259
6714 59259 64086 31307 6674 75277 170490 130478 118125 15252 -45146 -13014 42227 68196
6702 68196 62473 74827 -33702 -25375 55016 135268 108118 64851 106097 101483 145981 147364
6690 147364 175855 167235 160517 110002 59072 27187 6086 39981 60319 47921 -37660 -40997
6678 -40997 2114 -77893 -82844 -96349 -97737 -138309 -170966 -180735 -151617 -49178 -62888 -71884
6666 -71884 11237 -9115 -16215 -39758 -89350 -101432 -153150 -97400 -47894 -13013 678 46293
6654 46293 78667 35813 -23381 -56139 -107183 -93211 -76551 -111658 -28930 35686 18354 -82459
6642 -82459 -69871 -35495 28799 104581 86246 31802 -25006 -69724 -69173 -51294 -47157 -76861
6630 -76861 -56420 -24889 -19329 30600 41734 47894 44909 622 50386 88190 138622 152575
6618 152575 76141 -4144 -322 -67970 -87285 10931 29423 -22408 -12147 -40931 -42406 -68217
6606 -68217 -109138 -83885 -9263 -11555 -49541 -73927 -157095 -173603 -114638 -25300 -58568 -97816
6594 -97816 -86707 -26004 -9039 30725 50489 98264 60802 -30510 -30826 18050 -43578 -156868
6582 -156868 -250788 -234494 -105125 -101772 -173356 -111357 -102075 -145788 -101583 -81262 -27980 66300
6570 66300 39785 31633 41422 24316 30464 7008 7322 33934 -24094 -32036 4907 17007 63270
6557 63270 53423 -14190 -44782 -43455 -96390 -32501 -16621 27626 61815 63741 64449 -69875 -133340
6544 -133340 -134022 -108912 -59710 -53007 -121326 -136950 -125078 -72070 -11054 -45328 -74037 2253
6532 2253 19040 -88710 -91382 -10151 61529 70893 52314 57080 19165 -46676 -70934 -72069 -141078
6519 -141078 -157850 -94413 -1320 3975 31133 -38623 -109207 -13561 13000 20798 57656 96630
6507 96630 109463 81111 14951 28784 -18198 -44437 -34965 -61457 -6200 -48238 -36643 -58946
6495 -58946 -94029 -66850 -68943 -85807 -191409 -198595 -237817 -265676 -217852 -133045 -40462 -48165
6483 -48165 -110029 -136772 -109958 -36760 24984 9873 54821 1942 -15927 70176 14619 -16962
6471 -16962 -93259 -65280 -73595 -79016 -15756 -66980 -123202 -56609 -105641 -103501 -66091 -39505
6459 -39505 -9469 -54958 -122959 -55914 -13692 -7087 22949 -64836 -60897 22468 138702 152621
6447 152621 161665 99937 -7661 -34472 28387 43969 11365 36735 79945 87444 87736 101489
6435 101489 139480 106341 22203 24752 48221 32297 37240 33880 36195 54675 43402 40438 -13670
6422 -13670 -72824 -6270 76293 -20190 -25363 46112 8952 -22361 -44109 -88849 -43882 -48942
6410 -48942 -8522 -63127 -158214 -59785 -89520 -87415 -33954 -7214 -7991 24650 -14137 -69147
6398 -69147 -24304 12119 367 -27272 12816 -35421 -42925 -11527 27425 19451 64528 -1203
6386 -1203 20574 64739 99982 -913 -38415 -76083 -139895 -233800 -180248 -113256 -122330 -157652
6374 -157652 -97187 45782 179639 33946 -83373 -85291 -103159 -49447 -14442 -51401 -57278
6363 -57278 29333 -72677 -98548 -87507 -36089 19201 58231 80407 41327 -49341 -22211 5919
6351 5919 43194 55607 71876 91266 13608 -127986 -77601 -36143 -35046 -38144 -57979 -82672
6339 -82672 -56483 -67017 -33268 -45318 -77696 -51537 -1958 52043 72759 79058 16394 32390
6327 32390 13521 -62340 -127825 -92792 -69097 -100844 -5533 30776 -36384 -1019 865 2182
6315 2182 4523 -53732 -30792 37212 56638 48811 -34820 -83388 -118045 -77987 -42074 10533
6303 10533 50684 94002 88592 62281 48721 -2222 -50543 -62323 -52959 -15179 23029 37680
6291 37680 49817 46261 -44421 -2568 116253 83651 4370 -45905 -6227 -20895 -41386 19414
6279 19414 59015 55787 16478 -32142 -96006 -44845 25327 23613 9640 -43113 -112555 -172832
6267 -172832 -187468 -118214 5276 62779 89874 119495 72398 -41671 -103961 -79586 -65971
6256 -65971 -59402 -8384 12241 -38068 -53661 -9472 9249 17265 -52357 -167872 -150913 -152342
6244 -152342 -158596 -88053 -56068 -30271 -98815 -147274 -115059 -77916 45558 116686 155985 68566
6232 68566 -29908 -1131 68578 119767 100310 79419 56340 72134 102794 44789 -3256 17221
6220 17221 124047 126262 -9494 -27080 -16872 69568 101378 98907 24620 5222 40752 69253
6208 69253 -29005 -18571 5434 11654 -1611 -102083 -166182 -94645 -20214 25035 34894 74733
6196 74733 58063 -11126 -27686 -11446 20724 18736 -12399 14641 52420 28064 20316 22538
6184 22538 20004 96926 44969 55045 75979 103224 24204 -45787 -68754 -53460 -59554 -15569
6172 -15569 -36676 -23349 76512 97653 100801 42457 29948 -11734 -78883 -189683 -220442 -190997
6160 -190997 -160109 -152725 5976 37386 -37347 26639 36473 100641 130753 13425 -3749 -11890
6148 -11890 2438 122560 156737 83514 95889 38071 -49947 -78153 -38484 -18060 -32326 14034
6136 14034 21682 -18241 -93809 -64855 -112036 -158433 -133397 -143483 -91408 -7223 1946 -25764
6124 -25764 -29370 -95593 -58484 24783 81084 43935 69191 85766 -24446 -100550 -81296 -64598
6112 -64598 -42391 -52798 3437 68924 37153 56760 -8585 -64565 -53595 -6550 36706 15834
6100 15834 -76167 -39415 31507 -11123 -30848 -31820 -45569 440 -29340 15771 -80021 -125363
6088 -125363 -19010 23413 -18067 -41428 -81587 -55639 2995 -36547 -185338 -211570 -116640
6077 -116640 -29008 122945 171229 79300 64638 131601 143903 63339 -14745 27302 64739
6066 64739 88047 161277 200600 158718 76007 -31197 -18104 -19442 32302 79822 110916 162391
6054 162391 113376 2959 -134384 -78686 22281 19869 -27667 -51211 -71203 -5998 88316
6043 88316 36495 52974 118337 128238 163354 128127 80730 34756 52408 22854 -7638 -21173
6031 -21173 -5476 67694 124773 99241 79447 76355 42252 88425 -3917 -48352 -66394 -60992
6019 -60992 -111750 -118316 -122254 -112124 -131535 -139029 -167693 -180961 -126937 -56204 -38868 -84349
6007 -84349 -89094 -102482 -76256 -59973 -35070 -104365 -102831 -21028 6747 -10241 -38405 -16971
5995 -16971 6847 -11280 -57629 -10726 50165 91012 120459 95108 59655 19473 -66012 -21254
5983 -21254 -62494 -118726 -87918 -32149 11081 -34037 -44792 -23264 20738 -6705 -59605 -51588
5971 -51588 43970 57172 -218 31436 83772 95466 117412 59387 62235 26514 13305 15517
5959 15517 -39694 -58195 -97375 -60105 -25412 54407 129431 116823 14741 -4820 -8810 -58352
5947 -58352 -24399 24720 56627 36664 32205 63937 7660 -71120 -33547 -1437 10596 34718
5935 34718 15249 62621 42589 38860 44568 -59450 -53553 9655 65084 9940 60761 45668
5923 45668 65700 29509 -5463 -7279 -18324 -27051 -61932 -86819 -177982 -115566 -18180 -17494 -100553
5910 -100553 -15996 7033 37132 10534 -41394 13012 58565 44545 19210 -11396 16531 103124
5898 103124 86227 17140 -52097 -105736 -198239 -114063 -37622 -32566 -41369 -34 -61218 -43679
5886 -43679 30265 101420 13095 -61729 -110227 -138844 -103438 -54124 -52710 -102674 -142747 -154313
5874 -154313 -155581 -151911 -112430 -69281 -35757 -95447 -112706 -118548 -155761 -149751 -193831 -190748 -120887
5861 -120887 -24403 -44246 34868 75093 102239 89504 30482 14685 -19087 -71583 -70149 -82522
5849 -82522 -47260 71837 67780 -40804 -142633 -179139 -59983 99146 146340 93592 74331
5838 74331 63272 49231 54810 -100429 -152495 -16759 69517 17877 -89257 -130690 -119169
5827 -119169 -143137 -197761 -114553 -55374 -146613 -154941 -104673 -121795 -127160 -35461 -12419 53769
5815 53769 33854 -8115 -37036 -47680 -25218 -62720 -54046 23924 35800 -3178 7014 -52704
5803 -52704 -75861 -16524 -35632 -25771 35893 20551 65073 -1336 -21396 18910 74227 29027
5791 29027 -54631 -92552 -42143 128853 178929 129037 44000 64206 78226 139295 137965 39005
5779 39005 -58986 -63094 -62262 -55571 35848 85891 64561 -57278 -130536 -180608 -142152 -89045
5767 -89045 4547 32327 3879 50770 128950 130202 77501 55261 -103501 -147479 -93796 -136708
5755 -136708 -145246 -110714 -57580 -39058 -41819 -76486 -47029 27370 -17608 -82254 -46690 -27764
5743 -27764 10622 -1033 24295 84154 104410 53798 34272 -812 -70728 -19526 -30888 -58109
5731 -58109 -51836 -57752 -23871 9906 48996 78524 95181 111249 26446 -1537 18284 55884
5719 55884 -12233 -25977 -70092 -82551 -92636 -86702 -106341 -120503 -75781 -36010 -935 15168
5707 15168 -11739 -36676 -17765 -49483 -20123 -26801 -93076 -130215 -158066 -130335 2572 84348
5695 84348 58141 68284 22644 -41774 -50992 -43249 18580 28803 -33852 -58735 -52914 -34085
5683 -34085 -1759 -42333 -50916 -49465 -42713 -87755 -82718 -54910 35225 62549 40106 7159 -68629
5670 -68629 -161207 -40901 -18782 3557 -64 -99729 -153060 -67770 -14158 24862 17884 77594
5658 77594 76431 64797 22841 -60887 -18442 15993 -1576 -49662 -43575 12164 51089 20504
5646 20504 138969 152016 34441 56883 39309 82660 79932 56546 73115 127715 113242 15978
5634 15978 -46212 -41675 29228 78876 64117 14900 -27466 -38412 -168 2396 -32405 -12306
5622 -12306 -85856 -167296 -103701 -6272 -8485 -14310 -15066 10770 -3934 -38813 -18131 -56184 -18342
5609 -18342 10168 -15740 -21376 -51692 -42573 -18090 -37958 -49978 -108998 -119836 -50889 -16089
5597 -16089 7418 -16027 35754 -11250 -6767 31581 45338 95499 123426 18963 -53296 22518
5585 22518 18778 3398 42318 38989 48806 66263 92694 169079 199383 154568 151610 13128
5573 13128 -24667 67198 78154 48421 -45036 -76242 -103662 -83790 -5944 83763 12082 -4775
5561 -4775 23903 13385 -782 -35125 -23992 -3130 32834 -24740 -10384 40938 100550 157452
5549 157452 161052 170165 199666 211067 140176 112268 132095 52306 61465 43055 59962 61052
5537 61052 -12861 -25294 16603 127846 204782 166518 78587 38221 20075 -90825 -148455
5526 -148455 -74029 -48827 -31848 20120 116096 102072 120484 131485 119730 82674 34479 72766
5514 72766 98880 93047 113571 133432 137396 32365 25876 63651 76788 36429 19096 40140
5502 40140 28839 74648 141128 190881 114801 58380 28054 -7265 38751 98761 63047 25456
5490 25456 28069 -49381 -36055 -1848 -39270 -125317 -89447 3093 7381 -82140 -109418 -106587
5478 -106587 -104439 -106364 -96358 -75702 4230 7329 -54232 -59502 27318 120142 63036 -60437
5466 -60437 -57827 -80144 -79558 -29640 46469 78528 87025 50300 93676 -34307 -78274 -103392
5454 -103392 -89465 -17776 40614 6385 -45004 -71485 -53665 8310 21898 32931 28725 12604
5442 12604 -43381 46374 174825 154878 33224 -125546 -168312 -101354 -80341 -74048 -59566
5431 -59566 -110532 -94068 -122810 -158992 -202859 -147198 -176910 -165698 -121063 -74713 20325 30359
5419 30359 -23663 -21234 28920 -16216 -91262 -148869 -127185 -83997 -22402 -32635 -76239 -90075
5407 -90075 -150155 -67849 -14175 12846 31444 68657 83772 63673 33944 34108 19783 19364 11758
5394 11758 85480 129948 76349 -15799 -88063 -108080 -40404 29399 38965 -8201 -10504 27167
5382 27167 -8013 -60235 -21119 26016 89220 61072 34442 66863 47249 67725 38107 539
5370 539 -78945 -133335 -150830 -54352 32674 48434 3300 -533 8095 37445 20771 34833 -8852
5357 -8852 75647 149030 48369 -69367 -20785 39251 76794 171054 141186 101037 100702 46460
5345 46460 12432 11593 27837 72585 45502 33149 10669 -29662 -68434 -18678 19372 -35055
5333 -35055 -89740 -64052 8957 41845 -7764 71580 99207 76357 27274 38282 62921 102015
5321 102015 37131 57411 87581 108935 44531 -5524 20952 -54923 -51023 -82229 -10097 14439
5309 14439 21467 4868 15531 51972 35625 -6473 41183 19612 7783 72805 72649 55270
5297 55270 19768 8575 -21117 -68742 -11825 111723 112096 47317 53757 107988 70936 22415
5285 22415 22344 69306 94163 84124 95546 34121 -27557 34830 56777 54225 96101 75401 11601
5272 11601 -42355 13735 85875 96702 36215 -71967 -79110 -54655 -78625 -58671 -1063 111183
5260 111183 88148 83215 142052 100322 75074 76666 14843 12458 10348 48288 10890 -24900
5248 -24900 -69160 -75563 -64088 -7593 112990 100255 112839 59259 53399 14532 -14000 6327
5236 6327 110081 149050 54060 68165 70237 58136 45724 33609 67046 28216 -42397 -55943
5224 -55943 -83103 -107465 -69474 -36271 -44671 -23478 -26757 -34066 -39798 -33360 2837 -60713 68517
5211 68517 130169 48875 16726 64156 -55376 -84856 -13581 72252 87609 63201 90680 114193
5199 114193 71309 28951 -32688 -11587 -9248 -38781 -83369 -55872 15225 -28349 33104 78270
5187 78270 7561 17040 86832 90962 72005 49451 63481 63112 9787 11140 -54478 -10339 5908
5174 5908 2093 48136 104345 88821 93287 100110 65520 907 -45400 -1747 65360 49905 -14959
5161 -14959 28271 88165 85118 132997 51552 -9567 2429 90213 49015 -1787 -42092 -43985
5149 -43985 -46782 -74794 -99957 -117670 -144689 -45726 39358 81017 28483 21799 -8974 -35935
5137 -35935 -62840 6822 -28969 -106635 -84726 -34492 -29675 -50495 -37883 59294 39611 29838
5125 29838 23557 3090 16284 4083 -50737 -29759 35486 -33139 -28654 61842 68525 68277 108093
5112 108093 96189 20613 -21536 25248 96312 65043 33492 70228 94706 32750 27961 13595
5100 13595 65467 44188 134 80692 55803 67872 130020 126115 89872 93270 54667 25763
5088 25763 14482 -6821 -82489 -53659 -30382 -22533 -34651 -49430 -95323 -37254 -9766 30982
5076 30982 145241 219186 173084 80780 -23313 -50813 -29686 8359 58221 105426 127684
5065 127684 130140 83888 79822 22490 56720 35747 19509 110901 107135 69230 42127 25582
5053 25582 47317 72023 85197 27300 -67746 -102303 -36286 43131 1808 2731 -16015 13424
5041 13424 134046 201994 209377 219578 242579 220634 142847 111613 21921 -77560 -74564 -58514
5029 -58514 -47971 -8417 23652 16867 -30675 -51827 -107570 -149083 -61976 -2322 68269 22506
5017 22506 879 -38654 25018 24481 4483 12834 -96502 -141861 -46892 -82126 -125379 -94366
5005 -94366 -60627 17835 69059 30796 -46831 -62463 -111928 -45844 22160 523 -16878 -17861
4993 -17861 -70203 -42813 -45790 -49724 -18739 -60143 -55414 -28719 -46419 -35155 -57432 -71668
4981 -71668 -28532 -17626 -472 -23821 -108700 -155116 -89140 -1999 -6323 -64247 -81139 -6531
4969 -6531 3055 56779 14313 2458 -7159 28810 46548 78532 148532 139778 155974 151874 145572
4956 145572 72067 16871 -6602 -46962 -48210 44535 70640 55070 20443 33749 56835 48752
4944 48752 -23185 -43548 49806 82883 8810 -46473 -89529 -44302 -80056 -37893 -43502 -45668
4932 -45668 -23125 24824 33001 7437 2435 -74520 -77137 20430 43543 32362 -17964 -24675 -5322
4919 -5322 70015 84598 25072 -54939 -10669 44543 160790 204898 184117 135803 40351 50005
4907 50005 134474 112606 24613 -62622 -96646 -51377 58272 98726 105798 119187 120108 66095
4895 66095 123877 72748 52307 71424 122871 90567 88566 119954 169605 209635 126068 -52633
4883 -52633 -128724 -106107 -90413 -26959 23074 56745 35413 72516 116760 72498 43985 34332
4871 34332 104029 63697 -32924 -46213 -27129 -45361 -24788 -103481 -154510 -230441 -123822 -115193
4859 -115193 -90583 -133229 -34870 18344 20011 52837 -50594 -95132 -84128 -83895 -27754 -23899
4847 -23899 -39634 -45768 -55448 -70840 178 50710 62123 36680 47150 39389 3909 -31287
4835 -31287 -47440 -83830 -103604 -100532 42494 111448 96325 104484 97500 130804 168332 162415
4823 162415 97166 94686 149459 145872 98524 101601 52188 -56256 -52392 -63355 -37867 -24405
4811 -24405 -18963 -23467 -51950 -82128 -81140 -39768 17468 79887 26321 -5760 11291 72688 118051
4798 118051 114176 114868 118507 15853 -4267 19754 34738 46486 51876 28653 59627 107172
4786 107172 122909 74229 -1989 32674 52875 6612 -64974 -97390 -133307 -105693 995
4775 995 4178 -6361 53706 67427 46070 58161 25809 -18367 -33190 3058 19765 -49824
4763 -49824 -34559 26585 26967 8770 -9601 -16798 56557 95161 49294 -16291 -19222 105647
4751 105647 152169 142910 268838 267248 187567 144491 115725 135082 216087 142732 72109 48174
4739 48174 9724 -22895 13887 45576 67216 -69264 -193250 -160494 -90138 -29713 42623
4728 42623 85615 14573 -46256 26332 32512 -42724 -89912 -137635 -84920 -35596 -52750 -50336
4716 -50336 -24374 -35590 -89727 -79073 -111700 -66370 -61416 -110940 -148496 -133755 -149976 -102094
4704 -102094 14694 51614 94128 47421 -81716 -143869 -47209 23315 40260 -48564 -88749
4693 -88749 -52840 -23617 45621 79369 58912 -18537 -33231 -58643 -90339 -42964 -60415 -80373
4681 -80373 -108950 -92196 -98947 -21117 2419 -92654 -107697 -46872 -92694 -146653 -132887 -172966
4669 -172966 -124686 -59637 -12635 33742 30700 14059 69137 52410 -1524 -8433 -17086 -68513
4657 -68513 -69617 -77570 -26689 24104 73197 81124 -17309 -82379 -91942 -80285 -130368 -155705 -123777
4644 -123777 -57228 -41080 25746 7265 59647 78537 44752 -30385 -42605 -17615 -21250 -15272
4632 -15272 39163 92329 135008 98847 24088 12063 98768 120895 68847 48847 52803 6583
4620 6583 -35564 -63918 -53641 -87654 -42060 61422 38287 18074 93378 100868 60026 27308
4608 27308 9135 13993 60188 107727 67301 54914 13302 -27911 6353 -12288 14556 35997
4596 35997 19900 38125 42132 -1420 -65531 -78236 -100980 -86664 -131012 -172207 -166300 -155510
4584 -155510 -125613 -125318 -123449 -126627 -132774 -42366 -82796 -55862 16588 26948 -17895 -69673 11782
4571 11782 93916 60939 64166 60005 65589 41709 67910 90180 18659 39142 -15327 -15980 -2602
4558 -2602 103276 193773 99616 48043 50170 121513 169918 132803 96909 86139 62338 72740
4546 72740 54239 13515 -13639 8028 45614 90086 144242 136120 57097 49726 42677 60445
4534 60445 38399 -51175 27789 32220 8 -60905 -75738 -69748 -28172 -43058 -65947 -30025
4522 -30025 109501 53686 38317 -5753 -41874 -28554 -20258 -20254 -68381 -69022 19539 88406 21532
4509 21532 42767 54151 -21159 -56028 -63246 -38146 -20491 51057 64112 -28445 -109446 -89382
4497 -89382 -90514 -20378 22997 -80559 -99518 35444 -7904 50660 98139 42250 71086 118492
4485 118492 145120 97861 32442 -78273 -99454 -120714 -114479 -89288 -69886 14336 17943 28246
4473 28246 45262 17064 -43829 -45164 -40801 -85046 -77879 -28564 -11808 -88724 -51564 -796
4461 -796 -18858 19660 14821 29413 -60709 -38979 -6020 -59718 -149607 -91046 -86364 -78896 -35047
4448 -35047 35415 15843 -31037 -27764 -31702 -35284 -46231 36323 66368 24069 -44785 -105912
4436 -105912 -175249 -126613 -66947 -14467 -25645 -84656 -48288 -21466 13199 -18489 -80761 -83206
4424 -83206 20298 22403 -70479 -18834 1165 -48204 -87263 -112783 -94474 -123294 -128270 -39185
4412 -39185 -42911 -88409 -39522 23863 982 26922 2351 -53421 -59056 -31826 -69112 -136195
4400 -136195 -200609 -172627 -65976 -30695 -28245 -11127 -112987 -126256 -105160 -116416 -89985
4389 -89985 -44238 2943 -56331 -62875 -116342 -128755 -123174 -154808 -94302 -63620 -88119 -59559
4377 -59559 -20730 -81276 -84039 -22582 -28108 -67491 -19100 30510 6410 48224 69188 162253
4365 162253 167406 92338 59182 -408 -5891 7769 -11478 64763 20218 21305 23647 43592
4353 43592 35707 -53174 -73653 -48320 17032 1547 -33742 -85217 -127340 -106126 -60885 -65496
4341 -65496 -102004 -90170 -167558 -179016 -207243 -178618 -131348 -80344 -117291 -114032 -191591 -180979
4329 -180979 -100537 -79908 -21034 -243 9515 -65556 8430 47361 -4378 -27036 -8156 17788
4317 17788 -6493 43881 81021 91807 95030 55131 39153 -89645 -86973 -103775 -88079 -24833
4305 -24833 40434 13811 -43582 19478 5374 -86774 -72645 49013 118325 174658 208822 197294
4293 197294 172893 102343 27840 -65162 -109426 -34419 10298 30225 -3506 -22769 -74041 -33869
4281 -33869 -28720 -17440 3219 39520 22963 -32901 -75667 2504 39896 22513 -114419 -195647
4269 -195647 -152925 -143990 -67354 119731 190400 148530 91880 36486 -53222 -102458 -120299 -33749
4257 -33749 33012 86784 35532 -51763 28858 30876 13743 51285 77072 94531 88808 64248
4245 64248 89073 109836 1063 -49573 14366 68994 75850 29124 37934 73219 -27459 -22606
4233 -22606 -20787 -52674 -106516 -87409 -46777 -55631 -57098 39003 8202 -35448 -75627 -80602 5095
4220 5095 30980 47302 -4628 -34744 -140281 -62492 -36431 -26088 -31431 -9663 -35932 30862
4208 30862 82251 168158 143386 69961 57305 51435 48338 32144 19944 -40760 -65876 -112418
4196 -112418 -57385 -9654 -34802 -41436 1368 25065 9434 -11852 -52041 -126959 -86705 -112100
4184 -112100 -151457 -136173 -157616 -161331 -126862 -127198 -155181 -184680 -134900 8811 138504 117599
4172 117599 81809 49843 148393 177559 118056 5230 80875 121081 70404 114614 85342
4161 85342 92354 107694 2218 -58198 -61800 -46475 -17169 -9225 42869 6896 35704 56899
4149 56899 -10504 -59452 -76759 -117527 -63863 21357 25089 -19752 -22999 -46961 -35443 -16932
4137 -16932 -1263 -61419 -144258 -137553 -88029 -110481 -190220 -126750 -78367 -20647 14882 -20161
4125 -20161 -19938 -103311 -258963 -233683 -81398 24493 98653 49879 4797 -27087 -88770 -123119
4113 -123119 -75604 -130354 -107578 -70020 -83875 -1669 8790 3350 8431 32471 87028 31488
4101 31488 57717 67986 27121 -34609 -74235 -70058 -44543 -34648 -72238 -75005 -101160 -132446
4089 -132446 -114714 -88883 -57130 -98066 -147645 -222930 -147118 -57392 31196 65750 93122 -6367
4077 -6367 -53365 -78431 -53417 -47912 22728 -14295 -68259 -87714 -43365 -20493 2883 -26251
4065 -26251 -13146 -36261 56257 130431 84277 33312 48344 124965 133163 126962 173003 199276
4053 199276 164460 133293 201529 150747 110609 30399 17095 28161 -8146 -35177 -60265 -44908
4041 -44908 -46535 15021 -34963 -24029 -25919 -21441 6069 53289 55003 -15565 10255 25473 68666
4028 68666 37802 41840 65387 51878 36463 42184 -8531 -40071 -69252 -19994 -5960 -7447
4016 -7447 6888 10649 -6609 -81124 -157564 -187619 -159529 -153799 -53902 -61136 -63471 -70200 -82145
4003 -82145 -125519 -82101 -77349 -97725 -66045 -19580 -13454 -48013 -8697 -18188 -20706 -15870 -13678
3990 -13678 33275 16528 -12760 41277 64773 98632 115920 142792 110823 -603 -35301 -6473
3978 -6473 61330 109535 53527 -3719 -88911 -131257 -97673 2474 43025 77462 60835 16102
3966 16102 -15155 -7125 23153 102012 62275 -7716 -13803 -20007 -40679 -138537 -185649 -146319
3954 -146319 -74804 -81930 2658 127135 35691 -62189 -24385 -2641 -47282 -105379 -112406 -86158
3942 -86158 -44256 47764 147917 132418 16417 -23833 70583 152502 151414 156291 100754 21520
3930 21520 63996 54822 93071 33571 -6166 -43041 -82887 -38408 -1441 377 -21420 -23830
3918 -23830 6622 49145 67094 38205 -59585 -88300 -9852 -17391 6302 -2481 -18572 -74150
3906 -74150 -137792 -128690 -61982 76267 118558 107924 69484 81903 104255 140984 99172 33497
3894 33497 49690 78951 84808 47992 53439 47081 -7571 -129809 -154024 -124584 -118958 -99276
3882 -99276 -81563 -77641 -67666 -21287 5138 20740 52794 28284 -54138 -62144 -9649 24039
3870 24039 22670 -19546 30999 68263 32475 101942 77658 49081 -10991 9825 23599 82580
3858 82580 56332 -15604 -44141 18761 -14634 25589 50282 68296 124319 151365 88465 55448
3846 55448 14981 -6782 3760 12983 29299 -41437 -77147 -16264 72001 61752 34568 816
3834 816 -33156 17797 31299 30103 36880 19094 -34756 -78993 -61423 36015 74736 33042 -10858
3821 -10858 -94883 -66026 -36338 -13656 -23667 9011 -6409 -47220 -95454 -60076 -79300 -113525
3809 -113525 9137 -5162 -77291 -106317 -155274 -193437 -146938 -111137 -76237 -97975 -26866
3798 -26866 10086 60281 24302 13064 12444 -32798 23630 79368 83028 38943 71299 144461
3786 144461 127944 45564 23265 7643 -63003 -52549 -104157 -147692 -98514 35320 5353
3775 5353 26497 51145 81189 78324 16853 -82530 -76727 -31751 63605 112755 149736 54741
3763 54741 66805 187981 233078 174571 100873 139911 85314 45814 80209 48614 72281 51072
3751 51072 50504 -24740 9399 -432 -77256 -94448 -83484 -1563 12624 9022 35967 99426 96844
3738 96844 -17269 69820 142837 78092 -33211 -60975 47046 -7743 -15778 29447 96181
3727 96181 87514 91312 106860 64758 47952 92121 135444 150840 64531 -1614 -245 60100
3715 60100 58169 24886 3066 -5836 -48450 -54433 -83505 -88238 -78822 -36929 -58573 -48806 -60694
3702 -60694 -129977 -142718 -99426 -11957 13062 36685 67487 89446 36372 -2107 -23544 -67132
3690 -67132 -19717 51716 86758 112835 177114 150021 80531 55331 18590 -9285 -43300 -6499
3678 -6499 16600 35085 24442 12722 -24178 -11923 -42882 -80245 -55251 -9057 29075 118274
3666 118274 141646 109069 177647 182280 188048 108708 88535 150049 62432 97953 197379 156751
3654 156751 77780 88705 66111 114757 136256 49971 30614 69800 141323 161720 92266 57710
3642 57710 77055 45288 5074 61793 70089 39245 19322 -55400 -63721 90102 109886 21858
3630 21858 -7797 63322 -49934 -52861 -56921 -79577 -50784 -86969 -177925 -169023 -70905 -56129
3618 -56129 604 58265 81634 55441 93695 102613 58273 49259 142602 210210 221014 196135
3606 196135 110113 79561 9810 -59438 3371 45743 34840 1330 22343 13247 -30720 -6300
3594 -6300 17095 32050 99110 137953 120881 93440 96216 115147 105805 78160 28496 61101
3582 61101 5184 -7251 19736 13798 -8764 -22616 31408 39855 21188 -41558 -13876 22202
3570 22202 81833 94209 36995 -7691 29493 31344 -18097 -46520 12234 -12852 -81553 -64922
3558 -64922 -57807 -45936 -31167 -521 -24041 -52388 -15401 -12489 -27055 23710 58436 90599
3546 90599 81522 -2183 12296 62600 46014 41012 43049 60859 107369 132839 117664 56999
3534 56999 -26405 -70941 -14684 -20685 16802 14911 -789 -19699 45585 57189 -20340 -44699
3522 -44699 -26642 27712 73522 46190 -30016 -90475 47379 203746 247280 234041 165251
3511 165251 98023 37496 47775 -3172 -76371 -76532 -53927 3424 3940 -27608 35212 -18396
3499 -18396 -18866 -39452 -11438 -6543 -71947 -101635 -69839 -44890 -80613 -49765 43435 16213
3487 16213 -3375 84154 121961 80391 -8588 -35315 -74061 -67986 -54173 -72144 -114223 -120851
3475 -120851 -109311 -62730 -99216 -62083 6533 11467 14254 -476 -31535 -70440 -53296 -9331
3463 -9331 49283 72115 12583 -72764 -96748 -109698 37635 13575 -78961 -115365 -42068 -63384
3451 -63384 -14372 120537 115825 74406 28397 -99511 -144532 -161529 -113209 5900 40335
3440 40335 -30901 -8966 39686 -39301 -52178 -62667 -49278 -24295 -8717 27210 61325 67642
3428 67642 -42388 -58414 -48165 -49082 -71504 -92541 -113043 10114 38366 28851 43454 -425
3416 -425 -29466 -72389 -26737 -56529 -50583 55732 89941 1718 -2073 -13023 -40154 -69557
3404 -69557 60283 92102 58475 10627 -43814 -141614 -43827 80516 87738 -30966 -84538
3393 -84538 -45685 -346 -9034 -112925 -155208 -96183 -44431 -78916 -115672 -118281 -9704 48125
3381 48125 13999 -65382 -67199 -49819 -2205 -10403 -52025 -57351 -42424 -19288 42298 158039
3369 158039 186251 177942 125535 15390 -41454 -53868 -7573 -450 -14989 -55072 9876 66112
3357 66112 127489 65576 11940 -56952 -18435 -7277 -53268 -54245 -272 88861 20781 14659
3345 14659 34220 30159 14916 20260 16978 86313 102071 2853 -13558 14918 10359 -3500 10862
3332 10862 39592 27486 -33264 -177995 -183617 -38578 72200 27364 7155 9865 30670 25240
3320 25240 57721 78726 143107 38950 42587 101464 8077 -123683 -97737 -15834 51998 49870
3308 49870 89950 34606 -48180 -11044 35740 87238 102458 30496 -42540 -6292 13174 -59464
3296 -59464 -22006 34192 54508 37823 57542 31420 81402 78963 96334 102956 77349 99367
3284 99367 25899 55855 91780 50394 42358 2707 -12323 -51726 -102647 -178120 -199032 -224298
3272 -224298 -87223 19052 34130 38143 27862 -57359 -76569 -15926 29503 78440 48868
3261 48868 79718 66361 35697 -4272 -38711 -71419 40190 54116 89697 146043 139873 106512
3249 106512 -902 -38155 -107884 -120673 -75489 8335 77894 25506 -7383 -33583 17582
3238 17582 42604 70616 -3742 -67555 14162 40859 -15070 73538 117708 132935 47487 -10857
3226 -10857 -58400 -31093 -12215 16636 -40152 -44714 -51829 -17337 57090 47678 59456 93252
3214 93252 59587 -2904 15056 16264 87538 126723 68979 34253 -30877 -76052 -30219 31592
3202 31592 22743 19626 67253 33302 1462 -3375 16035 16275 -2936 14610 10344 -15019 -57234
3189 -57234 20296 112558 135118 95218 22918 14272 39669 115163 142922 79026 46251 20067
3177 20067 -11474 -37126 -98528 -47340 26337 46816 110898 53189 -10170 45752 94665 120541
3165 120541 103180 106851 60408 5825 -50738 -61399 -24139 -30071 -22742 30000 115931 117459
3153 117459 149936 109746 40625 2742 -36336 -64001 -6939 29668 13751 -26632 -17189 -33911
3141 -33911 -78881 -89943 -14964 112350 151945 88938 60973 -43688 -49936 -19198 -75538 -37170
3129 -37170 -20450 -36138 -56299 -31876 -40896 -42935 -62062 -47449 -58857 18990 50202 111730
3117 111730 138568 12138 -59819 -134695 -136876 -1720 -44583 -20519 43309 75585 188416
3106 188416 176444 107304 57090 93087 92325 67171 38616 10647 70243 19090 36493 38629
3094 38629 -28645 -138168 -103707 -26382 10169 -19342 -27133 -17254 -3947 24880 14661 73469
3082 73469 53911 -28958 -45237 -46033 -39367 -67703 -14028 -52614 -75966 6229 41153 40945 45277
3069 45277 22665 -15489 -93007 -67250 11798 94475 149774 45836 -84301 -53357 109105
3058 109105 118061 40947 37026 42462 83302 135547 136659 148302 169190 138619 87087 8458
3046 8458 -103279 -121972 -40562 44137 25276 22221 48280 13676 -3996 -89514 -162199 -101899
3034 -101899 -62011 -27224 14517 6475 9733 -12168 -22026 -41901 -84028 -122943 -63720 -90013
3022 -90013 -56613 -7967 5849 -4963 -19371 -29298 -20463 -42587 -74048 -219059 -200083 -172274
3010 -172274 -104614 -62959 1107 33626 -8051 -99505 -116245 -108455 -68664 -511 74359 49227
2998 49227 -67571 -94719 -63799 -116300 -185388 -154521 -166809 -153839 -157560 -114421 -31927 -22505
2986 -22505 -121860 -179634 -145177 -124804 -139434 -113071 -99260 -121408 -42807 1440 -70018 -25234
2974 -25234 88171 116550 46922 6524 -72414 -23138 40067 100941 89920 46193 22222 -4216
2962 -4216 30205 41610 -30700 15244 89627 60025 31623 -4960 -58571 -80081 -133580 -122768
2950 -122768 -78365 -26779 24535 -9054 -1781 16233 -21411 -10363 -5832 -63918 -80791 -29309
2938 -29309 -53294 -52898 -70484 -55098 20961 91536 28624 -6240 -61877 -63333 -39560 3788
2926 3788 -18092 -38291 -84615 -61283 -61603 -57796 -130441 -78793 -10161 32839 -10091 -17000 -30250
2913 -30250 -29612 -57146 -90370 -94960 -101526 -60766 -99525 -182304 -123868 -39177 -38947 -30156 -12850
2900 -12850 -9385 -3869 -49725 -130123 -77855 -23085 49567 36799 40835 74238 69336 138604 85240
2887 85240 -2302 -13911 17809 -41207 -61553 -40883 57216 80374 -26725 -131502 -28994
2876 -28994 41299 25490 57462 143119 116381 77321 75494 35991 -19964 -83064 -104901 -123280
2864 -123280 -80952 3401 82120 98808 53102 92064 147328 112192 142901 131445 172626 104275
2852 104275 42923 12753 -53472 -22369 53519 -34511 -18569 -11475 46277 -2043 64708 64116
2840 64116 61325 47402 41248 73656 83436 92991 114777 162452 174899 119050 32934 3085 60499
2827 60499 101744 87400 11445 -20445 -28138 -26929 7475 110635 143618 68259 18996 56612
2815 56612 103978 74988 55910 74577 62349 90734 96362 131222 138010 122342 99272 80603
2803 80603 43579 57064 93943 87184 86597 69188 100199 68558 75125 44397 -7996 -5645 -23145
2790 -23145 -61628 18856 10389 9033 -59891 -113979 -6121 73439 12925 -32048 7092 36955
2778 36955 77775 86681 47373 58509 66821 102459 85571 95940 23180 -12380 -67324 -180646
2766 -180646 -141257 -53446 -64074 -57205 -16508 -60538 -9950 87081 175918 239741 150963 77959
2754 77959 106834 83868 23027 -28175 -82811 -156007 -119458 -109136 -152130 -148525 -191157 -135929
2742 -135929 -84089 -56692 -52704 -74631 -14564 50543 -4366 -57375 -22478 54674 57968 47828
2730 47828 73914 77029 32639 23388 -22898 -58953 -24641 -11205 -13808 52644 103358 63639
2718 63639 -9212 17483 28897 46929 -3081 -82710 -57540 25972 -50737 -105098 -158616 -158410
2706 -158410 -70837 -13553 -43289 -52699 -23707 -54523 -79310 -39284 -23546 -37933 -48582 -36375
2694 -36375 -38870 -137527 -145891 -146115 -201122 -142994 -167111 -166174 -188192 -158607 -109208 -86202 -43108
2681 -43108 40388 80995 111650 89379 62566 51634 86392 115268 76474 118204 111761 79252
2669 79252 87575 95611 94361 137512 110652 87776 83381 29482 -65507 -175882 -171764 -173019 -73472
2656 -73472 -44446 -51834 -17729 12752 117841 61050 42524 84635 100961 56388 13802 -54436
2644 -54436 -23938 16860 -5954 -68425 -148323 -170248 -75178 -59104 -111709 -52091 -26187 -91291
2632 -91291 -106048 50777 46829 54525 66395 -84051 -14156 108617 165075 125683 41189 -58846
2620 -58846 -72807 -26814 -56474 -60443 -95249 -38116 71144 152849 97379 59679 78427 9164
2608 9164 -27129 50434 55949 16322 64901 74248 101242 -41942 -97530 -94758 -111158 -148720
2596 -148720 -168364 -92597 -50875 -127969 -203404 -173268 -68256 16351 -57050 -79754 -37976
2585 -37976 -54641 -94019 -126633 -69210 -41121 -66991 -55114 -37160 -43734 73544 45658 -77362
2573 -77362 -134739 -15058 57911 76538 83440 56081 23458 -60305 -82862 -58854 -60181 -69710
2561 -69710 -20082 7938 67860 41998 -46673 -62998 -82690 -121757 -79862 53099 112617 104621
2549 104621 83059 10773 -26841 -22376 32268 29685 55582 -1814 -51442 25800 64779 143060
2537 143060 155734 107612 52771 -25121 -65767 -34519 -10387 -58705 -131256 -116287 -3305
2526 -3305 31487 20881 -17859 -50202 -141822 -118054 -55197 -8330 -50712 -48358 1838 1698 -38524
2513 -38524 -52195 -750 -47790 -108023 -102539 -89117 -41370 8339 29366 -7785 16574 13589
2501 13589 70158 20309 -37695 12493 32874 72231 22497 -18574 -53924 -33244 13229 8575
2489 8575 10616 27969 15903 39636 97020 85215 156306 150465 147369 73763 70926 29950 -39003
2476 -39003 -50163 -55628 12399 61518 103246 145961 95957 61372 107282 65240 63816 58734
2464 58734 37438 -62898 -139987 -163031 -84657 68688 147650 192364 128346 15492 -40616
2453 -40616 12279 56390 155522 179807 34844 -56777 -51782 25629 69844 38311 5815 -8292
2441 -8292 -32661 -60983 -63262 -84831 -42975 -10500 45846 128915 83695 11913 -27822 -9227
2429 -9227 23465 22720 36644 63352 51123 41961 44831 53586 55681 73372 122374 76920 49312
2416 49312 55490 51687 63237 102650 64009 -53871 -49144 -41283 80005 96463 -38256 -93560
2404 -93560 -65650 -73429 -22583 36330 4502 -17570 29939 78925 121015 93345 81759 69097
2392 69097 -9325 -49993 -111598 -7724 14725 -39153 -61088 -46588 -65637 -36508 23911 12593
2380 12593 -54005 -70245 -29796 -48567 -57771 252 46695 57438 62718 127821 84459 23114
2368 23114 -45550 -91652 -135902 -95555 56302 80008 25508 12258 50137 111851 73542 89675
2356 89675 66516 59617 8452 -42091 -19963 28770 24047 49337 33141 14385 -8419 -19596
2344 -19596 -81910 -97764 -63898 -46430 -53501 -24359 -16178 -25777 -64214 1979 46514 29597
2332 29597 -4331 -23261 -18413 -19725 -9672 -45145 -44471 -34319 -70053 -70761 -54280 -43609 -29578
2319 -29578 -83396 -127409 -100128 -38150 33488 -17782 -41883 -123047 -90614 27175 69328 105912
2307 105912 57549 18043 -4410 19692 46077 8054 75803 116261 154174 184161 148764 133143
2295 133143 127702 51781 18640 66194 -23122 -66240 1445 58085 -25804 -91865 -59697 -3021
2283 -3021 73457 169611 208586 194172 94522 -24714 -38896 14517 -21383 -5307 -79338 12540
2271 12540 87562 108652 39846 1199 -52969 -25974 -26143 16700 5771 44641 131695 48218
2259 48218 69682 187654 170675 82486 -19191 43970 53157 96638 74850 1534 12045 -89039
2247 -89039 -176092 -81580 50681 10831 28031 33280 -25186 -14687 80267 51114 12776 -72317
2235 -72317 -167963 -165409 -103667 -33767 66786 78726 79073 98605 54663 34072 34539 14571 45799
2222 45799 45172 -8321 -42555 24223 50629 29227 -61118 3864 -4855 -48279 -81488 -85309 -41149
2209 -41149 3680 22809 -45993 -54119 -5117 62450 62331 81956 86441 46479 -38826 -103676 -114286
2196 -114286 -91955 -27154 -16907 -12156 74186 4351 -134168 -56551 59185 111160 12534
2185 12534 -37311 35541 45773 41485 74267 85859 70639 -72310 17904 80868 65216 35864
2173 35864 -48311 -87954 -13243 24775 46910 60723 868 -38218 -57555 -5900 22376 24003
2161 24003 69370 65424 -26788 -117632 -163493 -175897 -164177 -104148 -59558 17584 8074 -32712
2149 -32712 -62020 -68880 -97051 -158520 -164865 -158512 -114787 -45756 -125781 -157923 -104266 -63643
2137 -63643 9265 108222 145600 126922 41847 -16741 -77426 -51639 9119 21770 -19370 -15901
2125 -15901 -94677 -110692 -196428 -185356 -59030 -45460 -47469 66270 91304 70564 35486 77327
2113 77327 155029 196686 128696 142284 182252 120924 38770 125095 106511 40244 -23080 -89172
2101 -89172 -71265 -86963 -40457 30734 42448 22984 7417 -14933 9385 9728 -17813 -56443
2089 -56443 -109967 -112487 -79014 -66021 -144418 -138093 -188562 -167175 -154506 -75028 31155 68586
2077 68586 60193 68863 55756 186020 115258 61109 94097 100619 33491 -46970 -79528 -82675
2065 -82675 -134382 -170351 -135188 -139716 -97129 8144 14884 12043 4907 28629 -31888 -49839
2053 -49839 -43529 31054 121314 87844 15775 -32072 -24387 29474 80576 96057 34440 14200
2041 14200 10294 15544 -75078 -35271 -42079 -77546 -64394 -99667 -26525 2623 -55991 -60401 -69155
2028 -69155 -100825 -57267 18160 -3096 -6028 14308 64089 8694 -41274 -46113 -23687 81618
2016 81618 75460 80752 90502 83202 80685 71715 27375 7461 -18763 27923 76396 62176 36044
2003 36044 -34419 -87927 -121821 -83733 -32336 18970 28522 -26832 -52358 18526 92231 91272
1991 91272 17890 20677 -12322 -57043 -51942 6277 33648 59458 86593 -31356 -103917 -68409
1979 -68409 -81014 -108506 -40861 -44651 -61292 -32081 3009 47228 92165 24368 -69449 -52609
1967 -52609 23532 -15579 -62932 -44059 -39001 -72044 -55242 -50630 4594 30200 26613 33961 -82894
1954 -82894 -132799 -56894 -83045 -41353 -36038 5916 -59718 43645 202278 143354 91413 72480
1942 72480 28947 24863 38813 34160 -56881 -83386 -62940 -89769 -37122 -71879 -97307 -48506
1930 -48506 -68986 -102093 -99630 -99118 -60995 -35133 -35494 -83404 -82893 -18005 75147 30507 -43212
1917 -43212 -86918 -12601 -8148 -120003 -89594 -84039 -132233 -133703 -153020 -44761 74033 48268
1905 48268 -6716 -21078 -89464 -86457 -37241 -13350 -52261 -27929 -125488 -62697 22524 36392
$$ [...]
##END NTUPLES=NMR SPECTRUM
##END=
