##TITLE=Analysis number 318348
Compound Code sb 00914
Project Code adrs
Chemist Name molekula
##JCAMPDX= 6.0         $$ Bruker NMR JCAMP-DX V2.0
##DATA TYPE= NMR SPECTRUM
##DATA CLASS= NTUPLES
##ORIGIN= Bruker BioSpin GmbH
##OWNER= nmr
$$ XWIN-NMR		Version 3.5
$$ Fri Mar 24 09:36:53 2006 GMT Standard Time (UT+0h)  MAYBRIDGE\nmr@NMR_250MHZ
##.OBSERVE FREQUENCY= 250.131544655141
##.OBSERVE NUCLEUS= ^1H
##.ACQUISITION MODE= SIMULTANEOUS (DQD)
##.ACQUISITION SCHEME= undefined
##.AVERAGES= 16
##.DIGITISER RES= 18
##SPECTROMETER/DATA SYSTEM= dpx250
##.PULSE SEQUENCE= zg30
##.SOLVENT NAME= DMSO
##.SHIFT REFERENCE= (INTERNAL, DMSO, 0, 16.522)
##AUDIT TRAIL= $$ (NUMBER, WHEN, WHO, WHERE, WHAT)
$$ ##TITLE= Audit trail, XWIN-NMR		Version 3.5
$$ ##JCAMPDX= 5.01
$$ ##ORIGIN= Bruker BioSpin GmbH
$$ ##OWNER= nmr
$$ C:\u/data/dgb/nmr/ADRS/1400/pdata/1/auditp.txt
$$ ##AUDIT TRAIL=  $$ (NUMBER, WHEN, WHO, WHERE, WHAT)
(   1,<2006-03-24 09:36:32.70 +000>,<MAYBRIDGE\nmr>,<NMR_250MHZ>,
      <created by zg, POWCHK disabled, PULCHK disabled
       configuration hash MD5:
       84 BC 41 DB A1 6E 1D 46 DA 25 12 A5 C1 ED C5 3A
       data hash MD5: 64K
       1E D3 3E A6 DD 23 20 3A E9 A6 EB 29 C3 62 E0 F0>)
(   2,<2006-03-24 09:36:44.85 +000>,<MAYBRIDGE\nmr>,<NMR_250MHZ>,
      <Start of raw data processing
       ef LB = 0.3 FT_mod = 6 PKNL = 1 SI = 32K 
       data hash MD5: 32K
       13 23 38 FF C3 C1 6B 7B EA D4 3E 9D 44 10 7D 35>)
(   3,<2006-03-24 09:36:46.38 +000>,<MAYBRIDGE\nmr>,<NMR_250MHZ>,
      <apk 
       data hash MD5: 32K
       D0 8B 4A A2 A3 E7 F4 4B 6E D1 CD 34 BB 1F 20 D0>)
(   4,<2006-03-24 09:36:47.25 +000>,<MAYBRIDGE\nmr>,<NMR_250MHZ>,
      <abs ABSG = 5 
       data hash MD5: 32K
       04 8E F3 AC 16 71 C6 22 5F 8B 9F 38 E6 9C AF 24>)
$$ ##END=
$$ 
$$ hash MD5
$$ C0 4E 72 CB E2 B0 B9 E0 59 19 33 55 75 B6 21 52
##$RELAX= 
##$RELAX= 
##$RELAX= 
##$RELAX= 
##$RELAX= 
##$RELAX= 
##$RELAX= 
$$ Bruker specific parameters
$$ --------------------------
##$DU= <C:\u>
##$EXPNO= 1400
##$NAME= <ADRS>
##$PROCNO= 1
##$TYPE= <nmr>
##$USER= <dgb>
##$AMP= (0..31)
100 100 100 100 100 100 100 100 100 100 100 100 100 100 100 100 100 100 
100 100 100 100 100 100 100 100 100 100 100 100 100 100 
##$AQSEQ= 0
##$AQ_mod= 3
##$AUNM= <au_zg>
##$AUTOPOS= <3 >
##$BF1= 250.13
##$BF2= 250.13
##$BF3= 250.13
##$BF4= 250.13
##$BF5= 500.13
##$BF6= 500.13
##$BF7= 500.13
##$BF8= 500.13
##$BYTORDA= 1
##$CFDGTYP= 0
##$CFRGTYP= 5
##$CHEMSTR= <none>
##$CNST= (0..31)
1 1 145 1 1 1 1 1 1 1 1 1 1 1 1 1 1 1 1 1 1 1 1 1 1 1 1 1 1 1 1 1 
##$CPDPRG= <>
##$CPDPRG1= <>
##$CPDPRG2= <>
##$CPDPRG3= <>
##$CPDPRG4= <mlev>
##$CPDPRG5= <mlev>
##$CPDPRG6= <mlev>
##$CPDPRG7= <mlev>
##$CPDPRG8= <mlev>
##$CPDPRGB= <>
##$CPDPRGT= <>
##$D= (0..31)
0 1 0 0 0 0 0 0 0 0.06 0 0 0 0 0 0 0.0002 0 0 0 0 0 0 0 0 0 0 0 0 0 0 
0 
##$DATE= 1143192991
##$DBL= (0..7)
120 120 120 120 120 120 120 120 
##$DBP= (0..7)
150 150 150 150 150 150 150 150 
##$DBP07= 0
##$DBPNAM0= <>
##$DBPNAM1= <>
##$DBPNAM2= <>
$$ [...]
##$SUBNAM6= <"">
##$SUBNAM7= <"">
##$SUBNAM8= <"">
##$SUBNAM9= <"">
##$SW= 20.6930455092707
##$SWIBOX= (0..15)
0 0 3 0 0 0 0 0 0 0 0 0 0 0 0 0 
##$SW_h= 5175.983436853
##$TD= 65536
##$TD0= 1
##$TE= 294.16
##$TE2= 300
##$TE3= 300
##$TEG= 300
##$TL= (0..7)
0 120 120 120 120 120 120 120 
##$TP= (0..7)
150 150 150 150 150 150 150 150 
##$TP07= 0
##$TPNAME0= <>
##$TPNAME1= <>
##$TPNAME2= <>
##$TPNAME3= <>
##$TPNAME4= <>
##$TPNAME5= <>
##$TPNAME6= <>
##$TPNAME7= <>
##$TPOAL= (0..7)
0.5 0.5 0.5 0.5 0.5 0.5 0.5 0.5 
##$TPOFFS= (0..7)
0 0 0 0 0 0 0 0 
##$TUNHIN= 0
##$TUNHOUT= 0
##$TUNXOUT= 0
##$USERA1= <user>
##$USERA2= <user>
##$USERA3= <user>
##$USERA4= <user>
##$USERA5= <user>
##$V9= 5
##$VALIST= <valist>
##$VCLIST= <CCCCCCCCCCCCCCC>
##$VD= 0
##$VDLIST= <DDDDDDDDDDDDDDD>
##$VPLIST= <PPPPPPPPPPPPPPP>
##$VTLIST= <TTTTTTTTTTTTTTT>
##$WBST= 1024
##$WBSW= 4
##$XGAIN= (0..3)
0 0 0 0 
##$XL= 0
##$YL= 0
##$YMAX_a= 374710
##$YMIN_a= -503773
##$ZGOPTNS= <>
##$ZL1= 120
##$ZL2= 120
##$ZL3= 120
##$ZL4= 120
##$ABSF1= 16.522
##$ABSF2= -4.171173
##$ABSG= 5
##$ABSL= 3
##$ALPHA= 0
##$AQORDER= 0
##$ASSFAC= 0
##$ASSFACI= 0
##$ASSFACX= 0
##$ASSWID= 0
##$AUNMP= <proc_1d>
##$AZFE= 0.1
##$AZFW= 0.1
##$BCFW= 0
##$BC_mod= 0
##$BYTORDP= 0
##$COROFFS= 0
##$CY= 12.5
##$DATMOD= 1
##$DC= 0
##$DFILT= <>
##$DTYPP= 0
##$F1P= 14.0000005364418
##$F2P= -0.99999901652339
##$FCOR= 0.5
##$FTSIZE= 32768
##$FT_mod= 6
##$GAMMA= 0
##$GB= 0
##$INTBC= 1
##$INTSCL= 1
##$ISEN= 128
##$LB= 0.3
##$LEV0= 0
##$LPBIN= 0
##$MAXI= 10000
##$MC2= 0
##$MEAN= 0
##$ME_mod= 0
##$MI= 0
##$NCOEF= 0
##$NC_proc= -3
##$NLEV= 6
##$NOISF1= 0
##$NOISF2= 0
##$NSP= 0
##$NTH_PI= 0
##$NZP= 0
##$OFFSET= 16.522
##$PC= 1
##$PHC0= 159.9353
##$PHC1= 6.206365
##$PH_mod= 1
##$PKNL= yes
##$PPARMOD= 0
##$PSCAL= 4
##$PSIGN= 0
##$REVERSE= no
##$SF= 250.13
##$SI= 32768
##$SIGF1= 0
##$SIGF2= 0
##$SINO= 400
##$SIOLD= 32768
##$SREGLST= <1H.DMSO>
##$SSB= 0
##$STSI= 32768
##$STSR= 0
##$SW_p= 5175.98343685301
##$SYMM= 0
##$S_DEV= 0
##$TDeff= 65536
##$TDoff= 0
##$TI= <Analysis number 999999
Compound Code 99
Book Reference 9
Project Code 9>
##$TILT= no
##$TM1= 0
##$TM2= 0
##$TOPLEV= 0
##$USERP1= <user>
##$USERP2= <user>
##$USERP3= <user>
##$USERP4= <user>
##$USERP5= <user>
##$WDW= 1
##$XDIM= 32768
##$YMAX_p= 488657760
##$YMIN_p= -53592
$$ End of Bruker specific parameters
$$ ---------------------------------
##NTUPLES= NMR SPECTRUM
##VAR_NAME=  FREQUENCY,     SPECTRUM/REAL,   SPECTRUM/IMAG
##SYMBOL=    X,             R,               I
##VAR_TYPE=  INDEPENDENT,   DEPENDENT,       DEPENDENT
##VAR_FORM=  AFFN,          ASDF,            ASDF
##VAR_DIM=   32768,         32768,           32768
##UNITS=     HZ,            ARBITRARY UNITS, ARBITRARY UNITS
##FACTOR=    0.157963299565203, 1,           1
##FIRST=     4132.6476996994, 0,             0
##LAST=      -1043.33573715361, 0,           0
##MIN=       -1043.33573715361, -53592,      0
##MAX=       4132.6476996994, 488657760,     0
$$ Real data points
##PAGE= N=1
##DATA TABLE= (X++(R..R)), XYDATA
$$ [...]
$$ plain form
16053 135897 141095 144732 141851 143875 148134 140745 140126 138365 136262 130141 124445 105445 102551 115414
16039 115414 101735 99770 103790 105921 119241 117433 112150 122652 122893 116586 120980 126987 129216 122908
16025 122908 114408 109924 113610 107032 103837 103201 89347 82236 90410 91247 103402 96343 68181 69282
16011 69282 77438 78685 93921 100385 91905 78303 85903 102640 106829 91649 89352 95245 109645
15998 109645 119915 111030 81921 78075 89404 99941 102194 107488 116140 117968 116750 114231 115596
15985 115596 109230 101145 88396 104215 123928 129494 112928 103261 97492 100130 86381 70775 75322
15972 75322 72424 67606 71436 73087 83182 75209 68886 71112 79044 93672 98685 90499 83903 65321
15958 65321 71483 81386 94338 82411 74186 69928 64872 54920 57814 74499 83688 97769 103688
$$ packed form
16053A35897N198L637k881K024M259p389o19j761k103o121n696j9000k894J2863
16039A15414j3679j965M020K131J3320j808n283J0502K41o307M394O007K229o308
16025A22908q500m484L686o578l195o36j3854p111Q174Q37J2155p059k8162J101
16011F9282Q156J247J5236O464q480j3602P600J6737M189j5180k297N893J4400
15998A09645J0270q885k9109l846J1329J0537K253N294Q652J828j218k519J365
15985A15596o366q085j2749J5819J9713N566j6566r667n769K638j3749j5606M547
15972G5322k898m818L830J651J0095p973o323K226P932J4628N013q186o596j8582
15958F5321O162R903J2952j1927q225m258n056r952K894J6685R189J4081N919
$$ plain form
15945 103688 88646 83798 79192 68278 65230 61180 48442 50015 61365 70263 72927 75478 84211
15932 84211 91745 93602 82433 76092 80705 91385 96902 80447 62716 72887 75542 69504 68546
15919 68546 70992 64428 67121 76151 82704 81828 84740 80466 80978 77355 68192 57019 50177 51023 49326
15904 49326 52344 65361 76125 69308 68161 68932 73518 65208 55654 51356 35831 54357 49697 47117
15890 47117 61098 54195 63414 68404 85745 78023 62191 49979 67960 73399 77821 65430 59326
15877 59326 64644 75794 71015 63411 61938 63141 65125 46054 39321 45752 44532 49732 50403 51669
15863 51669 51690 43631 36878 37648 46184 49954 29161 25113 32378 34509 37203 37348 41862 55228 59587
15848 59587 54324 36514 29592 30540 48349 55836 28985 22797 29503 41008 37734 42788 47586 46794
$$ packed form
15945A03688j5042m848m606j0914l048m050j2738J573J1350Q898K664K551Q733
15932H4211P534J857j1169o341M613J0680N517j6455j7731J0171K655o038r58
15919F8546K446o564K693R030O553q76K912m274N12l623r163j1173o842Q46j697
15904D9326L018J3017J0764o817j147P71M586q310r554m298j5525J8526m660k580
15890D7117J3981o903R219M990J7341p722j5832j2212J7981N439M422j2391o104
15877E9326N318J1150m779p604j473J203J984j9071o733O431j220N200O71J266
15863E1669K1q059o753P70Q536L770k0793m048P265K131K694J45M514J3366M359
15848E9587n263j7810o922R48J7809P487k6851o188O706J1505l274N054M798p92
$$ plain form
15834 46794 38949 36409 29911 34086 25682 7817 17559 26093 28046 23982 37750 37765 32491 38602
15820 38602 15437 7233 10171 25417 33001 39336 44743 34763 29685 22147 27865 28122 24941 37380
15806 37380 50670 41254 33823 43165 33729 28384 31668 40413 44031 24748 25964 31690 20897 32430
15792 32430 48182 38706 38065 43164 44503 42754 41242 50298 53978 45566 47589 60762 54863 45534
15778 45534 40992 43170 42010 37989 45818 43712 41077 27598 32465 24342 19000 24516 26123 43340
15764 43340 41259 36665 38427 32477 26483 35740 29100 34079 44429 50711 46169 38333 29326 24595
15750 24595 31378 32132 15493 -1113 9314 16219 8973 21172 27016 25611 37498 49028 46640
15737 46640 36906 35312 38348 36441 25307 18884 30459 26783 19153 14157 22751 23271 30382 26919
$$ packed form
15834D6794p845k540o498M175q404j7865R742Q534J953m064J3768J5n274O111
15820C8602k3165q204K938J5246P584O335N407r980n078p538N718K57l181J2439
15806C7380J3290r416p431R342r436n345L284Q745L618j9283J216N726j0793J1533
15792C2430J5752r476o41N099J339j749j512R056L680q412K023J3173n899r329
15778D5534m542K178j160m021P829k106k635j3479M867q123n342N516J607J7217
15764D3340k081m594J762n950n994R257o640M979J0350O282m542p836r007m731
15750B4595O783P54j6639j6606J0427O905p246J2199N844j405J1887J1530k388
15737D6640r734j594L036j907j1134o423J1575l676p630m996Q594N20P111l463
$$ plain form
15723 26919 34023 35364 34383 20353 26256 48933 67928 63983 59509 43562 23582 29974 27011
15710 27011 30760 38445 34937 33618 30182 26349 26016 32193 40013 40820 38937 25241 15525 15327 7211
15695 7211 12398 23189 22138 16719 18370 25617 15109 11333 5883 9487 30251 27966 22115 27830
15681 27830 26759 21843 26156 16623 9106 26467 32874 41705 34530 36236 23991 18556 25485 28094
15667 28094 32491 16936 9896 22077 12970 22806 22525 29529 43962 39921 31030 24051 24545 23974
15653 23974 28882 25799 19839 27237 24217 16841 15803 11457 21681 26477 30061 26214 24929 19567
15639 19567 28509 20232 24865 23071 13241 21772 20323 15292 25306 30649 32673 25950 26536 20036
15625 20036 3186 -1498 4948 8540 5242 25463 28528 16701 12582 14049 15922 10708 15081 13520
$$ packed form
15723B6919P104J341r81j4030N903K2677J8995l945m474j5947j9980O392k963
15710B7011L749P685l508j319l436l833l33O177P820Q07j883j3696r716j98q116
15695G211N187J0791j051n419J651P247j0508l776n450L604K0764k285n851N715
15681B7830j071m916M313r533p517J7361O407Q831p175J706j2245n435O929K609
15667B8094M397j5555p040J2181r107R836k81P004J4433m041q891o979M94n71
15653B3974M908l083n960P398l020p376j038m346J0224M796L584l847j285n362
15639A9567Q942q277M633j794r830Q531j449n031J0014N343K024o723N86o500
15625B0036j6850m684O446L592l298K0221L065j1827m119J467J873n214M373j561
$$ plain form
15611 13520 6824 7206 17886 11344 286 -6756 -6299 -16299 1604 1056 7077 12404 7204 -6630
15597 -6630 -5209 -1461 6865 11824 29498 27660 39249 39602 35158 38351 23883 11747 3923 -117
15583 -117 1578 -257 -3450 -3952 5779 5760 -5596 -1463 1749 13121 13632 24947 28577 18724 24810
15568 24810 21394 2373 3001 -1722 -263 -6144 -9952 -18303 -15620 -9482 -1534 -3062 -19772 -15528
15554 -15528 -2550 5134 -2560 -6230 -12411 1304 12886 10205 14268 12758 16086 25661 16136 10582
15540 10582 2711 -3218 -2011 -4988 -8039 3591 15121 12716 8994 7735 17465 11969 17483 16587
15526 16587 14304 16171 18575 19638 19133 10098 -444 777 -5711 1330 12527 21419 26791 28882
15512 28882 22721 5580 10137 4923 7139 10823 15999 11907 20472 24283 33047 28786 27055 31262
$$ packed form
15611A3520o696L82J0680o542j1058p042M57j0000J7903n48O021N327n200j3834
15597f630J421L748Q326M959J7674j838J1589L53m444L193j4468j2136p824m040
15583a17J695j835l193n02R731j9j1356M133L212J1372N11J1315L630r853O086
15568B4810l416j9021O28m723J459n881l808q351K683O138P948j528j6710M244
15554a5528J2978P684p694l670o181J3715J1582k681M063j510L328R575r525n554
15540A0582p871n929J207k977l051J1630J1530k405l722j259R730n496N514q96
15526A6587k283J867K404J063n05r035j0542J221o488P041J1197Q892N372K091
15512B8882o161j7141M557n214K216L684N176m092Q565L811Q764m261j731M207
$$ plain form
15498 31262 28253 39302 32014 21820 19223 15666 24425 19962 13969 4354 -268 -5493 8094 13400
15484 13400 4951 5387 2829 8673 5405 5548 3328 4408 7112 8710 22406 33996 28859 5731
15470 5731 -1367 9917 11918 12017 4937 16472 24351 8496 -10979 -18814 -11844 -18448 -16305 -17359
15456 -17359 4384 14296 29841 26220 12687 20084 18648 13667 10225 9138 15709 25233 20508 3175
15442 3175 2300 11763 25855 25795 8243 5 5646 5946 2483 3654 4422 10813 3429 -7399 -6751
15427 -6751 7192 18627 15451 13680 4770 5588 3646 -98 24797 40411 43309 27505 16556
15414 16556 6330 3908 5289 3758 2619 8601 4042 -14 -6294 -1557 597 4526 8583 17997
15400 17997 9345 3056 13309 11562 6416 5571 10854 13168 13649 8552 7789 13228 17929 14232 10376
$$ packed form
15498C1262l009J1049p288j0194k597l557Q759m463n993r615m622n225J3587N306
15484A3400q449M36k558N844l268J43k220J080K704J598J3696J1590n137k3128
15470E731p098J1284K001R9p080J1535P879j5855j9475p835O970o604K143j054
15456a7359K1743R912J5545l621j3533P397j436m981l442j087O571R524m725j7333
15442C175q75R463J4092o0j7552q238N641L00l463J171P68O391p384j0828O48
15427f751J3943J1435l176j771q910Q18j942l744K4895J5614K898j5804j0949
15414A6556j0226k422J381j531j139N982m559m056o280M737K154L929M057R414
15400A7997q652o289J0253j747n146q45N283K314M81n097p63N439M701l697l856
$$ plain form
15385 10376 5747 7366 26167 34289 33820 26757 27105 17513 15754 11105 -6489 -10995 3047 -3146
15371 -3146 -11252 -12864 -3848 -1215 3156 16 6751 -394 5275 23985 24763 20591 10625 11025 7841
15356 7841 17373 23715 15377 10775 13334 8101 -2127 -15548 -5249 5690 13932 17274 22372 19654
15342 19654 14465 5468 -956 -5454 -1232 -713 -12811 -4879 -437 -7724 -18806 -14232 -15509 4565
15328 4565 22085 19049 -491 -10450 -20049 -27231 -27040 -12715 -5834 2652 8437 -3107 1860 14974
15314 14974 18931 3417 -6552 -12872 -1830 5530 18603 24398 597 -4010 12247 3877 -2638
15301 -2638 -12933 -14893 -20704 -19203 -8240 6240 848 -1096 567 16708 28079 24923 18990
15288 18990 7480 21787 28544 17586 13680 25291 10685 6764 11619 11484 5859 8946 17304
$$ packed form
15385A0376m629J619J8801Q122m69p063L48r592j759m649j7594m506J4042o193
15371c146q106j612R016K633M371l140O735p145N669J8710P78m172r966M00l184
15356G841R532O342q338m602K559n233j0228j3421J0299J0939Q242L342N098k718
15342A9654n189q997o424m498M222N19j2098P932M442p287j1082M574j277K0074
15328D565J7520l036j9540r959r599p182J91J4325O881Q486N785j1544M967J3114
15314A4974L957j5514r969o320J1042P360J3073N795k3801m607J6257q370o515
15301b638j0295j960n811J501J0963J4480n392j944J663J6141J1371l156n933
15288A8990j1510J4307O757j0958l906J1611j4606l921M855j35n625L087Q358
$$ plain form
15275 17304 22467 16205 1002 6403 10791 3803 3640 12776 13879 -961 5458 275 -9916 -4955
15261 -4955 -2269 -8718 -5350 14506 32721 33898 31086 14350 14810 19649 17032 29962 40097 31715
15247 31715 13523 5492 16226 22305 19881 8678 22076 20842 3348 -7167 13639 20791 11014
15234 11014 13906 8822 7454 5571 -559 -19434 -27064 -16320 -4861 8268 11779 20953 4870
15221 4870 -9959 -11033 -6910 -9566 -7204 -7781 2141 7808 14526 32229 35673 11135 2501 -5608
15207 -5608 -14079 -13946 -18062 -10845 -3390 13071 14285 -79 6672 11812 20844 5628 -3590 1750
15193 1750 1681 6830 16073 19639 8896 4730 11345 4654 14472 5123 7323 22232 21262 11868 19109
15178 19109 9934 5467 4917 -1530 2415 3885 -5438 -3337 -7777 -13929 -14460 -9416 -12223 -20088 -23512
$$ packed form
15275A7304N163o262j5203N401M388o988j63R136J103j4840O419n183j0191M961
15261d955K686o449L368J9856J8215J177k812j6736M60M839k617J2930J0135q382
15247C1715j8192q031J0734O079k424j1203J3398j234j7494j0515K0806P152r777
15234A1014K892n084j368j883o130j8875p630J0744J1459J3129L511R174j6083
15221D870j4829j074M123k656K362n77R922N667O718J7703L444k4538q634q109
15207e608q471J33m116P217P455J6461J214j4364O751N140R032j5216r218N340
15193A750o9N149R243L566j0743m166O615o691R818r349K200J4909r70r394P241
15178A9109r175m467n50o447L945J470r323K101m440o152n31N044k807p865l424
$$ plain form
15163 -23512 -16170 -5587 -296 2729 2148 -2091 -13965 -24461 -25757 -21659 -18140 -24728 -18039 -8291
15149 -8291 -7459 -10017 -11458 -12722 -9374 3080 14824 28621 31955 20868 26683 13432 1358
15136 1358 6591 -4305 -2115 -1566 8706 26175 17987 5709 -1747 -12938 -1021 18831 25232
15123 25232 15332 14558 16093 -1962 -4309 -1060 -4471 -4430 -1958 7695 17219 23973 25450 36206 46765
15108 46765 54413 45563 13526 7697 6197 9951 11539 3420 4360 12892 21714 14032 -1112 -1557
15094 -1557 -7584 -2305 3261 1801 11324 11214 4125 702 3329 -1180 -4886 -11206 -12023 -7235 -12368
15079 -12368 -9245 -2486 -8962 -7090 -5971 -9940 -16491 -6779 8904 13203 11777 7762 10060 -3593
15065 -3593 943 -2142 -8924 -12584 -9325 -603 -931 7551 26922 21712 16645 24626 25096 20696 12337
$$ packed form
15163b3512P342J0583N291L025n81m239j1874j0496j296M098L519o588O689R748
15149h291Q32k558j441j264L348J2454J1744J3797L334j1087N815j3251j2074
15136A358N233j0896K190N49J0272J7469q188j2278p456j1191J1917J9852O401
15123B5232r900p74J535j8055k347L249l411M1K472R653R524O754J477J0756J0559
15108D6765P648q850l2037n829j500L754J588q119R40Q532Q822p682j5144m45
15094a557o027N279N566j460R523j10p089l423K627m509l706o320q17M788n133
15079a2368L123O759o476J872J119l969o551R712J5683M299j426m015K298j3653
15065c593M536l085o782l660L259Q722l28Q482J9371n210n067P981M70m400q359
$$ plain form
15050 12337 3364 14933 20388 5256 -4358 -12070 -11184 5838 5172 1921 -2997 7898 8001 3169
15036 3169 -2846 8022 -1333 -4343 2201 6506 8167 5548 6201 1191 10749 4082 4515 5248 17314
15021 17314 32918 11098 -1396 3831 -678 -316 -2846 -7473 -8790 -8090 1650 7274 4394 -7440
15007 -7440 -9631 10580 4044 6395 16137 10888 6712 11234 4771 9902 13664 15056 3647 -4084
14993 -4084 5861 10362 13532 225 -11253 -9965 5439 7368 4253 7157 2024 -6433 -5769 3126
14979 3126 -5419 -16332 -12123 -7583 2684 2602 2111 9904 14200 4624 -6578 -7921 3519 3479 10281
14964 10281 13864 20953 19647 10977 5348 -2016 7251 14626 11478 7759 14347 10930 10179 10785 9816
14949 9816 9846 3353 10455 29033 11399 -2954 -5433 6 -895 -6179 -7923 6914 7490 7078 2019
$$ packed form
15050A2337q973J1569N455j5132r614p712Q86J7022o66l251m918J0895J03m832
15036C169o015J0868r355l010O544M305J661k619O53n010R558o667M33P33J2066
15021A7314J5604k1820j2494N227m509L62k530m627j317P00R740N624k880j1834
15007g440k191K0211o536K351R742n249m176M522o463N131L762J392j1409p731
14993d084R945M501L170j3307j1478J288J5404J929l115K904n133q457O64Q895
14979C126q545j0913M209M540J0267q2m91P793M296r576j1202j343J1440m0O802
14964A0281L583P089j306q670n629p364R267P375l148l719O588l417p51O06r69
14949I816L0o493P102J8578j7634j4353k479N439r01n284j744J4837N76m12n059
$$ plain form
14934 2019 -5724 -6968 -2624 5240 9821 7128 8814 9988 6471 4200 -650 9655 17765 25815
14920 25815 21109 3190 -9172 -12904 -5367 -2030 13615 2646 -252 11348 15018 17575 20061
14907 20061 8466 -6596 -3522 703 -4219 -2121 9226 750 -3820 2404 585 -7322 -22893
14894 -22893 -27202 -25280 -7968 -6419 -10142 -2300 -8392 -8248 -4494 5844 3681 15300 11449 1570
14880 1570 -10128 -28462 -38336 -25283 -149 2560 -3084 -8207 -3565 -2632 -9331 -11324 -9753 -12616
14866 -12616 -5509 -15769 -3570 -8208 -5385 1701 1399 4817 -1679 -10494 -2918 1169 -7056 -19037
14852 -19037 -22391 -9453 -6311 -14711 -9574 -24105 -40370 -28359 -20199 -14631 -10023 -26899 -24506
14839 -24506 -18045 -18435 -16149 -11138 -3278 -2479 2924 -10607 -19019 -32578 -29794 -35121 -30621 -22232
$$ packed form
14934B019p743j244M344P864M581k693J686J174l517k271m850J0305Q110Q050
14920B5815m706j7919j2362l732P537L337J5645j0969k898J1600L670K557K486
14907B0061j1595j5062L074M225m922K098J1347q476m570O224j819p907j5571
14894b2893m309J922J7312J549l723P842o092J44L754J0338k163J1619l851r879
14880A570j1698j8334r874J3053K5134K709n644n123M642R33o699j993J571k863
14866a2616P107j0260J2199m638K823P086l02L418o496q815P576M087q225j1981
14852a9037l354J2938L142q400N137j4531j6265J2011Q160N568M608j6876K393
14839b4506O461l90K286N011P860P99N403j3531q412j3559K784n327M500Q389
$$ plain form
14825 -22232 -27047 -32195 -26376 -20059 -18746 -8596 -7741 -12043 -9435 -17052 -10964 -929 1586 11451
14811 11451 17637 11959 -1233 -10220 -12024 2472 8545 -8029 -27389 -28487 -4403 1775 -893
14798 -893 2686 -10569 -21048 -26274 -20473 -12232 -17337 -28519 -31207 -37296 -32020 -30589 -10812 -6575
14784 -6575 -15278 -18379 -9141 -17386 -9896 7333 8162 3700 -3611 -186 7327 12988 -6800 -8467
14770 -8467 -7695 -902 11680 33744 20120 8547 10091 11836 5641 -2079 -238 -6700 -2742 7514
14756 7514 22499 24699 22324 13269 591 7908 9666 -4988 -3080 3852 5491 3727 -1144 -9726
14742 -9726 -12806 -7780 -9765 -3734 4049 3199 -1215 -5887 -10875 -10936 -2617 14426 11095 6188 3185
14727 3185 -1628 -1549 -4599 -16957 -6846 7896 2893 1498 -9183 -10120 -5837 -15649 -3044 8740
$$ packed form
14825b2232m815n148N819O317J313J0150Q55m302K608p617O088J0035K515R865
14811A1451O186n678j3192q987j804J4496O073j6574j9360j098K4084O178k668
14798h93L579j3255j0479n226N801Q241n105j1182k688o089N276J431J9777M237
14784f575q703l101R238q245P490J7229Q29m462p311L425P513N661j9788j667
14770h467P72O793J2582K2064j3624j1573J544J745o195p720J841o462L958J0256
14756G514J4985K200k375r055j2678P317J758j4654J908O932J639j764m871q582
14742i726l080N026j985O031P783q50m414m672m988o1Q319J7043l331m907l003
14727C185m813P9l050j2358J0111J4742n003j395j0681r37M283r812J2605J1784
$$ plain form
14713 8740 3198 18 -16224 -23543 -7641 -2270 9335 7381 -2672 -3860 -7545 -6240 -12955 -5939
14699 -5939 -1695 1461 19343 7034 -6963 11715 5098 -3530 2610 -1364 -6557 2553 3021 -11884
14685 -11884 -19643 -14704 -9916 -8270 -17718 -16295 -11140 -8108 -11743 -15483 -19838 -26130 -28755 -18654
14671 -18654 -6637 -9661 -19171 -6250 -6961 -20975 -15954 -17853 -4071 -3065 -2968 -3130 873 4842
14657 4842 7931 934 -8913 -11335 -18293 -21118 -18013 2217 6579 1920 3675 5828 -14181 -29783
14643 -29783 -33218 -17082 -8336 -9905 -4987 -3265 -13091 -5656 3917 -4960 4186 16617 15365 5012
14629 5012 -15270 -12741 -5641 -7368 -7054 -2284 11867 23221 14868 12003 3058 3753 -2341 -17821
14615 -17821 -25769 -30827 -25820 -11987 -17172 -14784 -4543 -6058 -29652 -30123 -28142 -22149 -8709 -9171
$$ packed form
14713H740n542l180j6242p319J5902N371J1605j954j0053j188l685J305o715P016
14699e939M244L156J7882j2309j3997J8678o617q628O140l974n193R110M68j4905
14685a1884p759M939M788J646r448J423N155L032l635l740m355o292k625J0101
14671a8654J2017l024r510J2921p11j4014N021j899J3782J006R7j62M003L969
14657D842L089o997r847k422o958k825L105K0230M362m659J755K153k0009j5602
14643b9783l435J6136Q746j569M918J722r826P435R573q877R146J2431j252j0353
14629E012k0282K529P100j727L14M770J4151J1354q353k865q945O95o094j5480
14615a7821p948n058N007J3833n185K388J0241j515k3594m71J981N993J3440m62
$$ plain form
14601 -9171 259 -672 1324 -5773 12399 14139 -9737 -27057 -29518 -24740 -9671 1515 3026 682
14587 682 -7913 3321 -6561 -22480 -19773 -20061 -13538 108 4248 1079 -3338 -5951 229 10955
14573 10955 11528 11206 -3446 -5740 -5357 -5190 -3874 5641 6519 -5756 -7081 -24058 -30763 -15328 -15622
14558 -15622 -8952 -6282 -440 -7640 -5585 -15739 -23579 -22188 -15654 -19585 -16652 -23222 -22328 -14130
14544 -14130 -14637 -29334 -27843 -18350 -6891 2925 17886 16484 12458 15573 9613 -2268 6763 6418
14530 6418 -3443 -1199 7401 2709 -3668 -9482 -9884 -2014 6908 4082 12624 15946 2419 7137 11244
14515 11244 1651 1513 -4939 -13586 -2492 5734 6490 -7977 -11751 -3854 7911 -1249 -8253 -9023
14501 -9023 -11438 -21586 -15741 -16331 -20366 -10346 8407 -10300 -19377 -20704 -29112 -26120 -2394 2261
$$ packed form
14601i171R430r31J996p097J8172J740k3876j7320k461M778J5069J1186J511k344
14587F82q595J1234r882j5919K707k88O523J3646M140l169m417k613O180J0726
14573A0955N73l22j4652k294L83J67J316R515Q78j2275j325j6977o705J5435k94
14558a5622O670K670N842p200K055j0154p840J391O534l931K933o570Q94Q198
14544a4130n07j4697J491R493J1459R816J4961j402m026L115n960j1881R031l45
14530F418r861K244Q600m692o377n814m02P870Q922k826Q542L322j3527M718M107
14515A1244r593j38o452q647J1094Q226P56j4467l774P897J1765r160p004p70
14501i023k415j0148N845n90m035J0020J8753j8707r077j327q408K992K3726M655
$$ plain form
14487 2261 -3683 -7597 -15653 -17187 -13448 -24532 -27757 -22321 -25793 -24256 -14941 -18704 -13526 1079
14473 1079 1761 -10101 -11483 -15379 -6277 -5118 -12114 -17823 -8466 -6226 5336 25576 20219 20785
14459 20785 17839 12452 14425 18579 24954 14823 13975 16100 -1973 -6345 831 -6441 -24757 -15391
14445 -15391 -12012 -1702 4240 13184 21443 24329 21109 21881 14569 8890 3577 5252 13161 7796
14431 7796 6679 -5627 -22996 -18913 -10833 -15307 -4264 5958 4655 6486 6226 -1305 -5281 -4147
14417 -4147 -632 -6473 -13387 -4636 -3600 -7355 -3037 1535 -397 -132 -3442 -5083 -4886 647 7047
14402 7047 16419 13531 5905 -4754 1184 1427 2871 11030 19002 23304 16416 12932 3662 1652 13563
14387 13563 18663 -3155 -9844 -11685 -420 6941 11290 8122 7409 -110 3360 2516 -5395 -9603
$$ packed form
14487B261n944l914q056j534L739j1084l225N436l472J537R315l763N178J4605
14473A079O82j1862j382l896R102J159o996n709R357K240J1562K0240n357N66
14459B0785k946n387J973M154O375j0131q48K125j8073m372P176p272j8316R366
14445a5391L379J0310N942Q944Q259K886l220P72p312n679n313J675P909n365
14431G796j117j2306j7369M083Q080m474J1043J0222j303J831k60p531l976J134
14417d147L515n841o914Q751J036l755M318M572j932K65l310j641J97N533O400
14402G047R372k888p626j0659N938K43J444Q159P972M302o888l484r270k010J1911
14387A3563N100k1818o689j841J1265P361M349l168p13p519L470q44p911m208
$$ plain form
14373 -9603 -3793 3685 -4757 1659 12379 1081 2936 13173 12554 17861 16571 16657 13972 15340 9151
14358 9151 367 -8077 -10509 -8675 -17789 -10622 -1591 -3867 111 1395 -1981 4384 4430 -6198 479
14343 479 6503 1299 -6058 -8290 -163 -7260 -4886 -5338 -12566 -32108 -29966 -12680 -20163 -45151
14329 -45151 -43797 -21184 -20899 -15733 -9837 570 5397 -8342 -14925 -11465 -20468 -12689 464 1970
14315 1970 4385 3775 7088 13185 21956 26211 27376 15750 758 -2970 -6014 2745 6382 7948
14301 7948 15888 21971 4521 -5247 -2286 -5566 -3569 4216 -3808 -5508 -13372 -20671 -12366 -2191
14287 -2191 -10118 -19123 -24121 -32579 -38859 -41553 -36216 -27786 -12223 -2809 -6660 -15203 -11933 -10615
14273 -10615 -4010 1444 -105 -14005 -14818 -15288 -15798 -12553 -3168 -2835 -2542 4089 86 5304 -4734
$$ packed form
14373i603N810P478q442O416J0720j1298J855J0237o19N307j290Q6k685J368o189
14358I151q784q444k432J834r114P167R031k276L978J284l376O365M6j0628O677
14343D79O024n204p357k232Q127p097K374m52p228j9542K142J7286p483k4988
14329d5151J354K2613K85N166N896J0407M827j3739o583L460r003P779J3153J506
14315A970K415o10L313O097Q771M255J165j1626j4992l728l044Q759L637J566
14301G948P940O083j7450r768K961l280J997P785q024j700p864p299Q305J0175
14287b191p927r005m998q458o280k694N337Q430J5563R414l851q543L270J318
14273a0615O605N454j549j3900q13m70n10L245R385L33K93O631m003N218j0038
$$ plain form
14258 -4734 -11369 -15471 -29495 -16594 -15576 -21890 -26517 -10774 10331 19696 16541 13458 22078 28667
14244 28667 35365 30975 26544 20240 7557 11739 10075 11908 11665 9244 15930 14809 19162 15165
14230 15165 7055 -11654 -14730 -21669 -23571 -21847 -21560 -23216 -14713 -4282 -10918 -22995 -20061 -19971
14216 -19971 -9802 -6134 -23528 -20706 -730 15740 23006 15447 8852 4021 211 -12364 -19577
14203 -19577 -14969 -18271 -18498 -25314 -28588 -14002 -9126 -22533 -16810 -11661 -15298 -25893 -26365 -29585
14189 -29585 -19045 -15512 -13228 -13418 -4095 18145 25999 19367 16 -2651 14315 24461 28503
14176 28503 12717 -3001 -13113 -16882 -12777 -5231 -5091 7377 11409 14798 10448 9281 1558 -18873
14162 -18873 -25568 -18088 -11643 -7157 -2294 -11158 -11615 -12102 -16695 -6917 -11758 -19262 -29666 -36229 -25442
$$ packed form
14258d734o635m102j4024J2901J018o314m627J5743K1105R365l155l083Q620O589
14244B8667O698m390m431o304j2683M182j664J833k43k421O686j121M353l997
14230A5165q110j8709l076o939j902J724K87j656Q503J0431o636j2077K934R0
14216a9971J0169L668j7394K822J9976J6470P266p559o595m831l810j2575p213
14203a9577M608l302k27o816l274J4586M876j3407N723N149l637j0595m72l220
14189b9585J0540L533K284j90R323K2240P854o632j9351k667J6966J0146M042
14176B8503j5786j5718j0112l769M105P546J40J2468M032L389m350j167p723k0431
14162a8873o695P480O445M486M863q864m57m87m593R778m841p504j0404o563J0787
$$ plain form
14147 -25442 -13702 -13100 -19456 -15766 -14391 -543 11671 18278 2560 -12872 -111 2608 -4121
14134 -4121 -14077 -14213 -7678 5398 12329 10698 3184 492 10945 -1391 -5826 -7833 -6352 -8525
14120 -8525 -10465 -10117 -14859 -7741 -18336 -15120 -11100 119 7429 624 -4061 -6756 364 -1999
14106 -1999 -8345 6267 7147 -6838 -4305 -2171 -9797 -13793 -3923 5060 -1659 -13961 -21259 -23846
14092 -23846 -31353 -24847 -13337 1258 2231 -4113 631 -8618 -15549 -8909 2833 -5717 -13755 -17259
14078 -17259 -4320 -4852 -12055 -12228 1904 9291 1186 -14229 -8880 -5404 -14493 -25813 -24840 -11804
14064 -11804 6895 8772 -7437 -28554 -21223 -17469 -17975 -14828 -8026 1144 5445 5978 4653 -494
14050 -494 -4471 -4099 538 6480 11572 10823 15634 7391 1558 -3351 -7984 -6298 4744 4034 4535 -12273
$$ packed form
14147b5442J1740O02o356L690J375J3848J2214O607j5718j5432J2761K719o729
14134d121r956j36O535J3076O931j631p514k692J0453j2336m435k007J481k173
14120h525j940L48m742P118j0595L216M020J1219P310o805m685k695P120k363
14106a999o346J4612Q80j3985K533K134p626l996R870Q983o719j2302p298k587
14092b3846p507O506J1510J4595R73o344M744r249o931O640J1742q550q038l504
14078a7259J2939n32p203j73J4132P387q105j5415N349L476r089j1320R73J3036
14064a1804J8699J877j6209k1117P331L754n06L147O802R170M301N33j325n147
14050d94l977L72M637N942N092p49M811q243n833m909m633J686J1042p10N01j6808
$$ plain form
14034 -12273 -12127 648 3229 -121 2324 -8496 -12191 -3709 -3705 -15188 -17702 -19740 -26344 -20979 -7055
14019 -7055 -7896 -10850 -4188 -13886 -3365 8735 2245 -7223 -7814 -10038 -5728 -2291 -815 3063 3988
14004 3988 7271 3072 -3846 -7934 -28643 -28425 -11371 -10397 -18741 -16535 -23207 -24967 -14254 6516
13990 6516 16484 7468 3444 -8582 -19682 -23921 -25762 -33155 -23313 -7939 -5785 -1705 -10673 -24856
13976 -24856 -20686 -21413 -20843 -19905 -18714 -15221 -6855 1689 -2589 -15789 -26280 -16386 -8404 -925 4551
13961 4551 1572 -7014 -7426 -18967 -17513 -3723 4849 1693 -1620 -10365 -15094 -15592 -20317 -15293 -10185
13946 -10185 -7634 -5380 -13048 -19422 -14282 -14961 -1596 -958 -3164 -3187 -14101 -16190 -10402 -9075 -19591
13931 -19591 -13243 -17801 -8658 -2053 -9251 -18542 -28841 -30126 -15163 -1554 3036 -7754 -15571
$$ packed form
14034a2273J46J2775K581l350K445j0820l695Q482Mj1483k514k038o604N365J3924
14019g055q41k954O662r698J0521J2100o490r468n91k224M310L437J476L878R25
14004C988L283m199o918m088k0709K18J7054R74q344K206o672j760J0713K0770
13990F516R968r016m024j2026j1100m239j841p393R842J5374K154M080q968j4183
13976b4856M170p27N70R38J191L493Q366Q544m278j3200j0491R894P982P479N476
13961D551k979q586m12j1541J454J3790Q572l156l313q745m729m98m725N024N108
13946a0185K551K254p668o374N140o79J3365O38k206k3j0914k089N788J327j0516
13931a9591O348m558R143O605p198r291j0299j285J4963J3609M590j0790p817
$$ plain form
13918 -15571 -13035 -22971 -21480 -24487 -17540 -11963 -28685 -35617 -30551 -17891 -7677 -6137 -17 -6895
13904 -6895 -12278 -19086 -5335 17012 23157 17396 12192 -7715 -10093 5854 15790 -69 -11082
13891 -11082 -18910 -15429 -14935 -16685 -16642 -21111 -31578 -26440 -23740 -14966 -4846 -9049 -25823 -19007
13877 -19007 -17836 -20660 -16971 -10836 -2277 4044 13714 13303 2909 -10352 -21490 -17050 -8207 4311
13863 4311 1456 -1796 -8303 319 5059 1666 3323 -2484 -19936 -33259 -33321 -13269 -10985 -26312
13849 -26312 -29434 -15949 -9104 -12003 -17497 -20823 -28406 -24356 -20918 -7570 -12496 -22044 -13765 -4195
13835 -4195 8853 21225 7628 2112 -4435 -5967 -5695 -10305 -8980 -2199 -2097 -17635 -18985 -13891
13821 -13891 -12938 -2051 -10860 -22105 -25814 -25198 -31902 -15272 -8846 -9008 -11470 -9387 -9339 -11397 -145
$$ packed form
13918a5571K536r936J491l007O947N577j6722o932N066J2660J0214J540O120o878
13904f895n383o808J3751K2347O145n761n204j9907k378J5947R936j5859j1013
13891a1082p828L481M94j750M3m469j0467N138K700Q774J0120m203j6774O816
13877a9007J171k824L689O135Q559O321R670m11j0394j3261j1138M440Q843J2518
13863D311k855l252o507Q622M740l393J657n807j7452j3323o2K0052K284j5327
13849b6312l122J3485O845k899n494l326p583M050L438J3348m926r548Q279R570
13835d195J3048J2372j3597n516o547j532K72m610J325O781J02j5538j350N094
13821a3891R53J0887q809j1245l709O16o704J6630O426j62k462K083M8k058J1252
$$ plain form
13806 -145 1688 15075 29565 15141 8246 13019 -3005 6298 3681 6829 25131 23510 -122
13793 -122 -13219 -14602 -15232 -8580 -11034 -13229 -23734 -32250 -11730 -4280 -5480 -17056 -20981 -17175
13779 -17175 -28168 -22470 -18626 -22371 -13823 3591 2048 255 4578 -1880 -1794 -7345 -5711 -1943
13765 -1943 -4577 -3078 -2400 3818 2364 5463 3681 -2570 -1755 9046 31104 20986 14278 9653
13751 9653 -2479 -7131 -11059 -15260 -15759 -8056 -4059 -425 -2018 -5460 5702 9903 7233 5624
13737 5624 -5621 -12365 -6058 -6637 -16509 -8464 -5917 -2024 1592 5832 3838 6690 10122 15606 497
13722 497 3449 2970 1648 11473 -714 -8975 5984 9143 906 5210 1921 2280 5190 6984 14253
13707 14253 12835 22408 7392 45 -4960 -17959 -30553 -19681 -23237 -29109 -21969 -4512 14141
$$ packed form
13806a45J833J3387J4490j4424o895M773j6024R303k617L148J8302j621k3632
13793a22j3097j383o30O652k454k195j0505q516K0520P450j200j1576l925L806
13779a7175j0993N698L844l745Q548J7414j543j793M323o458Q6n551J634L768
13765a943k634J499O78O218j454L099j782o251Q15J0801K2058j0118o708m625
13751I653j2132m652l928m201m99P703L997L634j593l442J1162M201k670j609
13737E624j1245o744O307n79r872Q045K547L893L616M240j994K852L432N484j5109
13722D97K952m79j322R825j2187q261J4959L159q237M304l289L59K910J794P269
13707A4253j418R573j5016p347n005j2999j2594J0872l556n872P140J7457J8653
$$ plain form
13694 14141 14117 5101 -8434 -9936 -3392 3525 14668 10433 10575 -200 -9577 1019 3627 -1022
13680 -1022 -6826 -13482 -9446 -3698 -7898 5323 3784 -854 -12305 -5045 -5380 -11611 -19636 -15127
13666 -15127 -2370 1270 -3335 -237 -4096 8822 7303 -17559 -17539 -26854 -39195 -22184 -47
13653 -47 -10948 -24705 -27178 -30714 -22246 -20275 -21586 -11894 -4953 -2756 -5549 -54 206 5524 3949
13638 3949 2067 -7003 -12291 -3072 -6629 -15261 -13056 -19418 -14810 -16992 -14329 -13918 -35629 -46767
13624 -46767 -43101 -41938 -38712 -26494 -22206 -38714 -41473 -30317 -30390 -28700 243 7247 11218 3046
13610 3046 775 7272 1902 -14251 -26556 -29521 -23039 -16091 -14673 -14324 -13977 -13694 -8098 -13734 -3016
13595 -3016 -6485 -8359 5703 22835 26943 20334 4089 -8131 -4495 -2868 -2675 -7993 -1885 12548
$$ packed form
13694A4141k4r016j3535j502O544O917J1143m235J42j0775r377J0596K608m649
13680a022n804o656M036N748m200J3221j539m638j1451P260l35o231q025M509
13666a5127J2757L640m605L098l859J2918j519k4862K0r315j2341J7011K2137
13653d7j0901j3757k473l536Q468J971j311R692O941K197k793N495K60N318j575
13638C949j882r070n288R219l557q632K205o362M608k182K663M11k1711j1138
13624d6767L666J163L226J2218M288j6508k759J1156p3J690K8943P004L971q172
13610C046k271O497n370j6153j2305k965O482O948J418L49L47K83N596n636J0718
13595c016l469j874J4062J7132M108o609j6245j2220L636J627J93n318O108J4433
$$ plain form
13581 12548 12656 17031 9778 2090 -1913 -5703 16273 20838 4896 -12440 -19608 -16505 -24402 -23736
13567 -23736 -27888 -23043 -17949 -11667 -8419 1354 4044 1993 6074 -6079 -14470 -16513 -346 10058
13553 10058 9793 -6461 -15805 -16408 -13622 -5192 -11481 -15480 -4476 2489 -127 -12044 -12506 -24910
13539 -24910 -38926 -31666 -26149 -27747 -26144 -12801 -8855 -7943 -8024 -16625 -15623 -10696 -7543 75 -8124
13524 -8124 -20658 -28899 -22785 -10431 -12351 -19014 -16850 -11194 3340 5860 3552 3412 -967 -11041
13510 -11041 -8172 -885 -5350 -16254 -21558 -19961 -15296 -17240 -20702 -37317 -29707 -13694 -7064 -9917
13496 -9917 -9702 -12501 -14771 -8099 -3458 594 794 -4876 -547 -11509 -17505 -10786 -12493 -4772 -1121
13481 -1121 -6687 -3613 7135 2953 4607 9373 7846 2790 -949 -9703 -12845 -5301 -12605 -12044 -1639
$$ packed form
13581A2548J08M375p253p688m003l790K1976M565j5942j7336p168L103p897O66
13567b3736m152M845N094O282L248R773K690k051M081j2153q391k043J6167J0404
13553A0058k65j6254r344o03K786Q430o289l999J1004O965k616j1917m62j2404
13539b4910j4016P260N517j598J603J3343L946R12q1q601J002M927L153P618q199
13524h124j2534q241O114J2354j920o663K164N656J4534K520k308j40m379j0074
13510a1041K869P287m465j0904n304J597M665j944l462j6615P610J6013O630k853
13496i917K15k799k270O672M641M052K00n670M329j0962n996O719j707P721L651
13481a121n566L074J0748m182J654M766j527n056l739q754l142P544p304N61J0405
$$ plain form
13466 -1639 3749 3819 -294 11012 5294 -1361 -11168 -15233 -8327 -5416 -20953 -28053 -28063 -18282 -4461
13451 -4461 -2343 -8801 -13991 -7506 -6467 -12696 -18781 -22342 -18521 -18255 -18646 -8641 4681 12523 9829
13436 9829 7017 7600 -15728 -19964 -17246 -13931 -12992 -13184 -19672 -6490 -8700 -10333 -22353 -18204 -3084
13421 -3084 361 -5804 -16026 -5076 -1806 -10670 -1686 -2564 -8454 -1922 7723 9341 9881 2735 -6944
13406 -6944 141 -6015 -15880 -6789 4880 7248 -3339 -12452 -5124 6673 2036 -4388 -29084 -33149
13392 -33149 -35102 -34604 -38148 -35074 -38207 -29032 -4549 8586 9922 16082 11959 -34 9506 4275
13378 4275 -1521 -8530 -1421 -7198 -2242 6414 3295 2532 -1158 1389 -7906 -18112 -27756 -26813 -22789
13363 -22789 -15800 -13036 -3480 2920 9315 15351 15390 24886 20469 10570 3082 -5272 -8131 -9554 4449
$$ packed form
13466a639N388P0m113J1306n718o655r807m065O906K911j5537p100j0R781J3821
13451d461K118o458n190O485J039o229o085l561L821K66l91J0005J3322P842k694
13436I829k812N83k3328m236K718L315R39j92o488J3182k210j633j2020M149J5120
13421c084L445o165j0222J0950L270q864Q984q78n890O532R645J618N40p146r679
13406f944P085o156r865R091J1669K368j0587r113P328J1797m637o424k4696m065
13392c3149j953M98l544L074l133R175K4483J3135J336O160m123j1993R540n231
13378D275n796p009P109n777M956Q656l119p63l690K547r295j0206r644R43M024
13363b2789O989K764R556O400O395O036L9R496m417r899p488q354k859j423J4003
$$ plain form
13348 4449 15478 11863 6276 2640 15183 1892 -18326 -29581 -35009 -34432 -21526 -5469 -15756
13335 -15756 -10641 3825 14175 10651 7732 976 -10311 -5129 2141 5909 -5767 -10062 -3059
13322 -3059 -9650 -23520 -27752 -24818 -28954 -27794 -33807 -25562 -22960 -20838 -18817 -26226 -23815 -29702
13308 -29702 -28313 -18947 -7723 -4675 -11210 -13006 -14278 -13343 -15128 -11301 -4993 12491 3941 -458
13294 -458 11999 6584 -7734 -7165 13111 14479 6905 3588 -8809 -11249 -15998 -25888 -19001 -10472
13280 -10472 5068 18224 8819 8919 12119 1383 6547 11553 -11120 -25283 -17725 -9876 -21316
13267 -21316 -33985 -18527 -9118 -4384 -6687 891 16161 14220 9030 6590 978 -5974 6072
13254 6072 7968 -993 2912 1430 -6138 -19575 -29559 -31679 -34662 -34398 -40534 -32342 -19074 -18565 -10878
$$ packed form
13348D449J1029l615n587l636J2543j3291k0218j1255n428N77J2906J6057j0287
13335a5756N115J4466J0350l524k919o756j1287N182P270L768j1676m295P003
13322c059o591j3870m232K934m136J160o013Q245K602K122K021p409K411n887
13308b9702J389R366J1224L048o535j796j272R35j785L827O308J7484q550m399
13294d58J2457n415j4318N69K0276J368p574l317j2397k440m749r890O887Q529
13280a0472J5540J3156r405J00L200j0736N164N006k2673j4163P558P849j1440
13267b1316j2669J5458R409M734k303P578J5270j941n190k440n612o952J2046
13254F072J896q961L905j482p568j3437r984k120k983K64o136Q192J3268N09P687
$$ plain form
13239 -10878 1261 -11088 -13066 2211 358 4199 15997 8975 -5026 -235 11474 -1946 -14355
13226 -14355 -3721 -4323 -11781 -15468 -20688 -21661 -22854 -20513 -17892 -13864 -14620 -16838 -27018 -23252 -6397
13211 -6397 -8231 -27140 -31917 -25775 -28698 -19165 -6220 -8998 -25737 -22118 -14437 -17527 -21330 -30761
13197 -30761 -20627 -14380 -4015 907 -16482 -33965 -23723 -19809 -21831 -19286 -5749 -1172 -1708
13184 -1708 -5760 -50 7180 12877 8732 -1331 -1900 7010 4610 4690 -6557 -17390 -24782 -17317 -4131
13169 -4131 -1238 1630 4435 18342 22504 4958 -13974 -3037 2056 -3818 -19823 -10211 -3804
13156 -3804 -11251 -8959 -8454 -5103 -8074 -3290 -5004 -1046 -12037 -11325 -6759 -8122 -14146 8501 14940
13141 14940 -3913 -1246 -1062 3901 -11821 -18678 -20147 -25450 -26421 -26922 -21035 -4485 799 607 -9774
$$ packed form
13239a0878J2139j2349j978J5277j853L841J1798p022j4001M791J1709j3420j2409
13226a4355J0634o02p458l687n220r73j193K341K621M028p56k218j0180L766J6855
13211f397j834j8909m777O142k923R533J2945k778j6739L619P681l090l803r431
13197c0761J0134O247J0365M922j7389j7483J0242L914k022K545J3537M577n36
13184a708m052N710P230N697m145j0063n69Q910k400Q0j1247j0833p392P465J3186
13169d131K893K868K805J3907M162j7546j8932J0937N093n874j6005R612O407
13156c804p447K292N05L351k971M784j714L958j0991P12M566j363o024K2647O439
13141A4940j8853K667J84M963j5722o857j469n303r71n01N887J6550N284j92j0381
$$ plain form
13126 -9774 -3116 -4002 -11070 -1887 -5942 -26561 -27670 -23406 -14585 -598 16345 31448 26455 11730
13112 11730 16508 16232 14507 14661 8751 5439 2024 1885 10478 15682 9311 5499 11406 7805 -8073
13097 -8073 -28789 -24391 -12724 -16825 -26138 -7601 5747 4850 9608 9339 961 -2482 -660 -5032
13083 -5032 -19496 -18185 1197 -2303 -3850 7263 9620 -829 -359 -2493 342 958 -7454 -11218
13069 -11218 -16656 -6044 -1749 -6377 -8737 -8971 -20097 -21874 -26415 -28673 -40811 -23909 -8023
13056 -8023 -6888 -10253 -9432 -5374 4941 -10165 -12006 -15313 -13160 -5057 -12370 -12465 -1833 3638 -1501
13041 -1501 3529 3855 -10584 -11033 -10195 -19007 -19619 -20371 -16423 -12102 -9311 2443 5475 860 5864
13026 5864 6143 5982 -3801 -9240 -2255 -8129 -8760 -14478 -17796 -7764 -646 -3789 -10715 -13711 7842
$$ packed form
13126i774O658q86p068R183m055k0619j109M264Q821J3987J6943J5103m993j4725
13112A1730M778k76j725J54n910l312l415j39Q593N204o371l812N907l601j5878
13097h073k0716M398J1667m101r313J8537J3348q97M758k69q378l443J822m372
13083e032j4464J311J9382l500j547J1113K357j0449M70k134K835O16q412l764
13069a1218n438J0612M295m628k360k34j1126j777m541k258j2138J6902J5886
13056h023J135l365Q21M058J0315j5106j841l307K153Q103p313r5J0632N471n139
13041a501N030L26j4439m49Q38q812o12p52L948M321K791J1754L032m615N004
13026E864K79j61r783n439O985n874o31n718l318J0032P118l143o926k996K1553
$$ plain form
13011 7842 21108 20219 2804 -10631 -15079 -10367 -9290 -7025 -7186 -1509 2365 5076 -918 -6100
12997 -6100 -2231 -1914 -4786 -12829 -16725 -14969 -1335 -8075 -5506 -20589 -32157 -14813 -17409 -26117
12983 -26117 -21542 -28802 -18801 -11248 -5172 -3736 34 -3701 1523 4224 7972 4012 -9826 -22457
12969 -22457 -27951 -21735 -20606 -23571 -31052 -29417 -22153 -19625 -11095 5838 8636 6550 -2619 -2263
12955 -2263 4283 -267 1219 3160 442 -13012 -11332 -5805 7318 -7569 -17282 -12482 -19135 -12517
12941 -12517 -10936 -12034 -15194 -29536 -35587 -23166 -5439 -7700 -4699 -6955 -2270 -107 -5917 -3404
12927 -3404 -4010 -12421 -20007 -28131 -26912 -16331 -11815 -12559 -9352 -18316 -35929 -39306 -29724 -12896
12913 -12896 -16098 -28439 -10326 5447 5641 -1442 -2668 602 3662 7178 1579 -10267 -5161 1217
$$ packed form
13011G842J3266q89j7415j3435m448M712J077K265j61N677L874K711n994n182
12997f100L869L17k872q043l896J756J3634o740K569j5083j1568J7344k596q708
12983b6117M575p260J0001P553O076J436L770l735N224K701L748l960j3838j2631
12969b2457n494O216J129k965p481J635P264K528Q530J6933K798k086r169L56
12955b263O546m550J486J941k718j3454J680N527J3123j4887r713M800o653O618
12941a2517J581j098l160j4342o051J2421J7727k261L001k256M685K163n810K513
12927c404o06q411p586q124J219J0581M516p44L207q964j7613l377R582J6828
12913a2896l202j2341J8113J5773J94p083j226L270L060L516n599j1846N106O378
$$ plain form
12899 1217 7966 10330 11564 11179 5480 -129 -9421 3181 16719 18386 8205 -5767 -22514 -19333
12885 -19333 -4136 -5761 -9856 38 -2941 -1024 -15352 -15494 -4439 487 -6514 -2283 8255 404
12871 404 -16718 -12473 -19500 -23754 -13392 -14734 -15213 -11161 6298 6074 -8573 -12748 -15813 -14516
12857 -14516 1373 -2454 -8354 -8605 -10113 -9275 -7864 -1611 1500 -2766 -13635 -7930 -10421 -17388
12843 -17388 -29875 -15005 -5024 2042 4247 -4513 6065 -45 -17574 -33098 -39015 -47131 -30968
12830 -30968 -8918 -1496 3043 6350 -3006 -26879 -43162 -41757 -32198 -33336 -35178 -24572 -13005
12817 -13005 -5000 -7055 -4244 -11948 -14549 -9192 -3352 1121 7556 4463 -3815 -14247 -7316 -4328
12803 -4328 -4024 9687 -2319 -6615 -6598 -14521 -25352 -24242 -17828 -20269 -18812 -14589 -25636 -26646
$$ packed form
12899A217O749K364J234l85n699n609r292J2602J3538J667j0181j3972j6747L181
12885a9333J5197j625m095R894k979J917j4328j42J1055M926p001M231J0538p851
12871D04j7122M245p027m254J0362j342m79M052J7459k24j4647m175l065J297
12857a4516J5889l827n900k51j508Q38J411O253L111m266j0869N705k491o967
12843a7388j2487J4870R981P066K205q760J0578o110j7529j5524n917q116J6163
12830c0968K2050P422M539L307r356k3873j6283J405R559j138j842J0606J1567
12817a3005Q005k055K811p704k601N357N840M473O435l093q278j0432O931K988
12803d328L04J3711j2006m296J7p923j0831J110O414k441J457M223j1047j010
$$ plain form
12789 -26646 -38810 -24982 -14971 -10774 -8688 6280 6017 -4899 -6614 -5875 -7923 -8237 -11149 -8349
12775 -8349 -15834 -23011 -6016 2339 14301 24044 14920 6048 -1359 -7653 -8497 -12447 -12267 139
12761 139 -1209 -16852 -18070 -17780 -6454 5696 6172 5237 12219 18144 18870 8035 -5455 -6874 -10329
12746 -10329 -10256 -26110 -32211 -24479 1490 15493 12997 11006 7850 -9281 -19404 -19120 -17497 1678
12732 1678 8719 -771 -9084 -3814 -3210 -14075 -18118 -16050 -14064 -28820 -29973 -31982 -19897 -14729
12718 -14729 -13034 -8261 -15211 -11017 -12630 -6993 3310 10067 -903 -20136 -12770 -6843 397 8292
12704 8292 3112 5445 7658 1169 -866 -11777 -8780 -11587 4221 22075 3034 -21449 -21234 -14676
12690 -14676 -16442 -13656 -6560 -2251 399 4374 -4222 -6457 -3343 -9590 -9619 461 -2729 -16092
$$ packed form
12789b6646j2164J3828J0011M197K086J4968k63j0916j715P39k048l14k912K800
12775h349p485p177J6995Q355J1962R743r124q872p407o294q44l950J80J2406
12761A39j348j5643j218K90J1326J2150M76r35O982N925P26j0835j3490j419l455
12746a0329P3j5854o101P732K5969J4003k496j991l156j7131j0123K84J623J9175
12732A678P041r490q313N270O04j0865m043K068J986j4756j153k009J2085N168
12718a4729J695M773o950M194j613N637J0303O757j0970j9233P366N927P240P895
12704H292n180K333K213o489k035j0911K997k807J5808J7854j9041k4483K15O558
12690a4676j766K786P096M309K650L975q596k235L114o247k9J0080l190j3363
$$ plain form
12676 -16092 -16435 -20037 -11040 -6996 -5794 2150 -3600 -8120 -14753 -7059 -3182 -3692 -12529 -8518 -3150
12661 -3150 -12283 -15170 -6596 235 2440 12304 3849 -11859 -9863 -3893 -7289 -8067 -13728 -20631 -12499
12646 -12499 -4801 2415 2404 -363 -10832 -10877 -17292 -12878 -11897 -7142 -9519 -7864 -1938 -8812 -1209
12631 -1209 11322 16527 19592 18126 18632 3301 -13224 -9290 9968 25115 20653 3568 -8031
12618 -8031 1925 1714 1102 1202 -1863 -5400 -2884 -2199 -16894 -26222 -19965 -1857 8635 1899 -11725
12603 -11725 -16122 -11827 -13535 -5563 3183 -5978 -9708 -8787 -18351 -8263 -3278 -3718 565 -4265 -11585
12588 -11585 -11645 -7640 -7380 -8213 -8135 -8381 -7212 -1714 7267 14965 2193 -18454 -21533 -8755 -2030
12573 -2030 5512 7468 6525 -5178 -3756 1222 9099 10643 1445 -12627 -12949 8586 15980 4741
$$ packed form
12676a6092l43l602Q997M044J202P944n750m520o633P694L877n10q837M011N368
12661c150r133k887Q574O831K205R864q455j5708J996N970l396p78n661o903Q132
12646a2499P698P216j1k767j0469m5o415M414R81M755k377J655N926o874P603
12631a209J2531N205L065j466N06j5331j6525L934J9258J5147m462j7085j1599
12618h031R956k11o12J00l065l537K516O85j4695r328O257J8108J0492o736j3624
12603a1725m397M295j708P972Q746r161l730R21r564J0088M985m40M283m830p320
12588a1585o0M005K60q33P8k46J169N498Q981P698j2772k0647l079J2778O725
12573b030P542J956r43j1703J422M978P877J544r198j4072l22K1535P394j1239
$$ plain form
12559 4741 -3166 -13072 -26031 -23578 -28989 -38526 -29450 -23327 -23455 -21456 -14389 -16372 -21818 -20239 -3088
12544 -3088 1244 -1639 -4596 -14570 -17391 -6009 10925 6927 -7039 -2485 811 2759 -3655 -82
12530 -82 10371 4102 13707 4661 -93 7443 23903 24367 5857 4988 -10577 -12929 9845 23256
12516 23256 3292 3072 6365 -7798 2330 12112 10663 10444 -2030 4949 -2776 -9613 -6665 9408
12502 9408 18545 23292 19122 2686 -9433 -2991 3257 519 -4741 -2055 2916 7054 12395 9242
12488 9242 -904 -20263 -15068 -7037 -16062 -5561 -9433 -6202 8875 3761 -2610 -8469 -12473 -19158
12474 -19158 -13906 -11868 -14682 -14897 -18553 -19475 137 4851 824 12987 14687 -1449 -12058 -15745
12460 -15745 -27323 -16423 3236 9698 1777 4887 17398 4284 -11286 -7267 -3949 -6591 7898
$$ packed form
12559D741p907r906j2959K453n411r537R076O123j28J999P067j983n446J579J7151
12544c088M332k883k957r974k821J1382J6934l998j3966M554L296J948o414L573
12530h2J0453o269R605r046m754P536J6460M64j8510q69j5565k352K2774J3411
12516B3256j9964k20L293j4163J0128R782j449k19j2474O979p725o837K948J6073
12502I408R137M747m170j6436j2119O442O248k738n260K686M971M138N341l153
12488I242j0146j9359N195Q031r025J0501l872L231J5077n114o371n859m004o685
12474a9158N252K038k814k15l656r22J9612M714m027J2163J700j6136j0609l687
12460a5745j1578J0900J9659O462p921L110J2511j3114j5570M019L318k642J4489
$$ plain form
12447 7898 -3010 -8411 -15534 -15592 -9196 -21773 -30575 -25336 -17525 -1353 371 4360 -6600 -3879
12433 -3879 8705 -7349 -11039 -10431 -30781 -44905 -23461 -13136 -8359 932 8356 1588 1021 -5007
12419 -5007 -13042 -10089 2554 3795 6064 5437 1014 9451 1718 -545 4035 -5728 -5955 2043 -2255
12404 -2255 5418 13861 16311 4753 -18163 -25047 -1663 32170 20865 6315 7578 7696 11774
12391 11774 -281 -7021 -11429 -214 14003 19258 7518 5226 5030 2491 13490 6603 -10540
12378 -10540 -4177 1916 8751 3674 -8314 -13427 -7572 -2866 5253 6294 -2047 -12072 -6774 1657
12364 1657 4384 16285 18860 21733 19269 18272 29422 36699 27084 24223 20662 13148 11782 5692
12350 5692 -4913 -4391 7159 20458 35410 41154 29177 19526 13140 -6927 -4274 9902 12263
$$ packed form
12447G898j0908n401p123n8O396j2577q802N239P811J6172J724L989j0960K721
12433c879J2584j6054l690O08k0350j4124K1444J0325M777R291P424o768n67o028
12419e007q035K953J2643J241K269o27m423Q437p733k263M580r763k27P998m298
12404b255P673Q443K450j1558k2916o884K3384L3833j1305j4550J263J18M078
12391A1774j2055o740m408J1215J4217N255j1740k292j96k539J0999o887j7143
12378a0540O363O093O835n077j1988n113N855M706Q119J041q341j0025N298Q431
12364A657K727J1901K575K873k464r97J1150P277r615k861l561p514j366o090
12350E692j0605N22J1550J3299J4952N744j1977r651o386k0067K653J4176K361
$$ plain form
12337 12263 17353 31701 44931 36053 23178 31424 35983 30437 15895 7995 -109 -1576 -1584 15045
12323 15045 23668 24882 19208 3671 7231 9931 39 1546 8308 9554 120 -5482 -919 151
12309 151 214 -3352 2685 16080 10659 4451 17697 27765 23757 6236 -1119 1118 3661 20324
12295 20324 25072 26258 31277 22125 8909 891 9314 30072 37109 37839 29084 8306 7149 14929
12281 14929 20068 22137 9621 11926 10376 9873 13608 16893 11083 8925 -3456 6207 14209 18228
12267 18228 11279 16164 17859 9072 10000 -254 -4910 1305 9159 7826 -4001 -2467 -14288 -12751
12253 -12751 10323 6168 -2084 -4889 6800 19213 22165 26073 8418 -17465 -16431 -11890 -13538
12240 -13538 -11839 -11670 -13159 -5589 -2773 -4802 -5650 -294 8662 26682 22431 3111 -989 5032
$$ packed form
12337A2263N090J4348J3230q878j2875Q246M559n546j4542p900q104j467qJ6629
12323A5045Q623J214n674j5537L560K700r892J507O762J246r434n602M563J070
12309A51O3l566O037J3395n421o208J3246J0068m008j7521p355K237K543J6663
12295B0324M748J186N019r152j3216q018Q423K0758P037P30q755k0778j157P780
12281A4929N139K069j2516K305j550n03L735L285n810k158j2381R663Q002M019
12267A8228o949M885J695q787R28j0254m656O215P854j333j1827J534j1821J537
12253a2751K3074m155q252k805J1689J2413K952L908j7655k5883J034M541j648
12240a3538J699J69j489P570K816k029q48N356Q956J8020m251j9320m100O021
$$ plain form
12226 5032 4661 8110 -513 -1219 3345 3653 -121 218 3737 16255 5021 6568 14467 3611 4541
12211 4541 14852 16082 7890 5248 8438 24287 39959 29367 14473 16830 21339 27566 40016
12198 40016 39528 29257 37570 32556 28573 23805 20869 10317 14948 14546 -1132 5528 18357 18760
12184 18760 8931 5047 10004 10521 -7812 -6359 8392 712 10829 18484 13515 13273 7196 10957
12170 10957 24225 23654 167 -5196 7262 26762 36061 36319 36600 29598 15516 10240 22112 30243
12156 30243 20817 9479 11164 21643 9440 13191 9030 9864 9790 7634 17788 36953 31227 32160
12142 32160 33557 30763 28694 17643 12903 15917 14980 184 -4201 1109 26548 38044 28163 19576
12128 19576 15911 20440 15705 21508 24041 31966 22700 18835 30697 26709 17458 30050 42759 48834
$$ packed form
12226E032l71L449q623p06M564L08l774L39L519J2518j1234J547P899j0856R30
12211D541J0311J230q192k642L190J5849J5672j0592j4894K357M509O227J2450
12198D0016m88j0271Q313n014l983m768k936j0552M631m02j5678O660J2829M03
12184A8760r829l884M957N17j8333J453J4751p680J0117P655m969k42o077L761
12170A0957J3268n71k3487n363J2458J9500R299K58K81p002j4082n276J1872Q131
12156C0243r426j1338J685J0479j2203L751m161Q34p4k156J0154J9165n726R33
12142C2160J397k794k069j1051m740L014r37j4796m385N310K5439J1496r881q587
12128A9576l665M529m735N803K533P925r266l865J1862l988r251J2592J2709O075
$$ plain form
12114 48834 44781 42109 36699 38053 30047 29462 50219 57388 50007 37272 30642 30958 16636 15070
12100 15070 32203 54743 59669 51070 49483 54022 57198 62572 47793 45587 59580 69536 56674
12087 56674 51313 49948 46298 34455 33151 45195 52838 58267 55838 40655 36634 33756 45272
12074 45272 65005 65416 59719 67277 68204 54130 60868 66362 62442 57863 62374 71216 63145 69339
12060 69339 59044 38064 28258 37967 39731 41733 32143 39542 39976 40948 49297 45904 39339 46306
12046 46306 49129 49313 56042 69170 65703 58827 63360 65408 72364 78791 88831 89352 75346 68585
12032 68585 82371 85645 79306 88046 107096 118175 114806 110984 96066 87390 95887 110826 110900 108567
12018 108567 94176 91226 101642 97401 94355 104298 102556 114850 126857 138795 148225 153078 166918
$$ packed form
12114D8834m053k672n410J354q006n85K0757P169p381j2735o630L16j4322j566
12100A5070J7133K2540M926q599j587M539L176N374j4779k206J3993R956j2862
12087E6674n361j365l650j1843j304J2044P643N429k429j5183m021k878J1516
12074D5272J9733M11n697P558R27j4074O738N494l920m579M511Q842q071O194
12060F9339j0295k0980r806R709J764K002r590P399M34R72Q349l393o565O967
12046D6306K823J84O729J3128l467o876M533K048O956O427J0040N21j4006o761
12032F8585J3786L274o339Q740J9050J1079l369l822j4918q676Q497J4939P4k333
12018A08567j4391k950J0416m241l046R943j742J2294J2007J1938R430M853J3840
$$ plain form
12005 166918 173903 172543 179642 186511 200913 211643 204711 195524 194935 206162 219927 220273 230442
11992 230442 250532 255209 265858 292736 321865 341503 354541 361714 370815 393347 431147 461327
11980 461327 468694 487517 512172 552077 592172 631617 667728 702567 754731 801472 854073 917006
11968 917006 987892 1066789 1159949 1263158 1382202 1533669 1704516 1865295 2054929 2280790
11958 2280790 2565725 2906567 3286473 3751815 4312233 4996583 5846871 6941357 8346760
11949 8346760 10184411 12635652 15971983 20571411 26897708 35167676 44553251 52326931
11941 52326931 54906114 51050286 42880126 33855180 26247213 20560506 16437300 13429521
11933 13429521 11163927 9434836 8107858 7057421 6219654 5497325 4896089 4373178 3923665
$$ packed form
12005A66918O985j360P099O869J4402J0730o932r187n89J1227J3765L46J0169
11992B30442K0090M677J0649K6878K9129J9638J3038P173R101K2532L7800L0180
11980D61327P367J8823K4655L9905M0095L9445L6111L4839N2164M6741N2601O2933
11968I17006P0886P8897R3160J03209J19044J51467J70847J60779J89634K25861
11958B280790K84935L40842L79906M65342N60418O84350Q50288J094486J405403
11949H346760J837651K451241L336331M599428O326297Q269968R385575P773680
11941E2326931K579183l855828q170160r024946p607967n686707m123206l007779
11933A3429521k265594j729091j326978j050437q37767p22329o01236n22911m49513
$$ plain form
11924 3923665 3518248 3173794 2889094 2637853 2404321 2196949 2026221 1871783 1721651
11915 1721651 1611415 1515799 1424092 1344639 1271491 1199290 1114137 1035730 989958 958590 933164
11904 933164 898068 849438 815706 786121 743424 698922 670053 635783 604099 569823 538988
11893 538988 524676 504872 492555 467246 451439 418749 405062 384581 364569 337343 321630
11882 321630 319299 303581 287103 282187 272749 270520 268841 253018 234563 220182 208496 210795 199150
11869 199150 191021 190265 191693 180439 179203 175404 170986 170840 161512 148685 144760 118440 100468 96435
11855 96435 94948 91892 92822 93152 97248 98296 115137 120227 117131 107223 97851 98866 97490 100780 107974
11840 107974 110867 112936 101056 92929 90534 98834 103323 104424 104945 99789 103056 100776 93346 77149
$$ packed form
11924C923665m05417l44454k84700k51241k33532k07372j70728j54438j50132
11915A721651j10236r5616r1707p9453p3148p2201q5153p8407m5772l1368k5426
11904I33164l5096m8630l3732k9585m2697m4502k8869l4270l1684l4276l0835
11893E38988j4312j9804j2317k5309j5807l2690j3687k0481k0012k7226j5713
11882C21630k331j5718j6478m916r438k229j679j5823j8455j4381j1686K299j1645
11869A99150q129p56J428j1254j236l799m418j46r328j2827l925k6320j7972m033
11855I6435j487l056R30L30M096J048J6841N090l096r908r372J015j376L290P194
11840A07974K893K069j1880q127k395Q300M489J101N21n156L267k280p430j6197
$$ plain form
11826 77149 63038 73472 88453 99210 93047 77724 71604 58038 51049 42719 40403 52805 64220
11813 64220 44226 27333 16843 13623 13244 14051 19843 23706 18829 15892 17292 18780 21065 12783
11799 12783 15285 13248 21317 35349 35280 32363 29368 23247 19381 18740 33970 34617 34778 34610 53352
11784 53352 59826 53255 49876 42698 20251 11701 2559 2141 15653 20714 22049 10338 22845 43136
11770 43136 46482 27212 8305 14483 15898 18355 11843 -991 -3007 11280 16042 22911 32141
11757 32141 27596 28322 20462 6320 -5955 626 13971 14740 27234 34795 22930 -7584 -6929 11210
11743 11210 31093 35288 15125 7021 -1608 -6257 10933 18633 21169 35999 33966 27486 12696
11730 12696 9857 9741 6849 -3815 6106 7473 16860 33758 42366 42353 49861 35977 20755 20364
$$ packed form
11826G7149j4111J0434J4981J0757o163j5323o120j3566o989q330k316J2402J1415
11813F4220j9994j6893j0490l220l79Q07N792L863m877k937J400J488K285q282
11799A2783K502k037Q069J4032o9k917k995o121l866o41J5230O47J61j68J8742
11784E3352O474o571l379p178k2447q550r142m18J3512N061J335j1711J2507K0291
11770D3136L346j9270j8907O178J415K457o512j2834k016J4287M762O869R230
11757C2141m545P26p860j4142j2275O581J3345P69J2494P561j1865l0514O55J8139
11743A1210J9883M195k0163q104q629m649J7190P700K536J4830k033o480j4790
11730A2696k839j16k892j0664R921J367R387J6898Q608j3P508j3884j5222l91
$$ plain form
11716 20364 19797 10907 24128 20860 11848 3432 7598 19055 19522 25435 27411 31735 26145 33881
11702 33881 45680 30380 27540 27974 20493 28446 26755 13978 2213 -6726 -6479 -1365 -1399 -4350
11688 -4350 11362 20085 14657 15198 12561 13633 6896 10381 24049 34033 24437 19881 12605 -2269
11674 -2269 -14223 -7915 4044 -1140 -11543 -515 15977 18836 12073 11287 21179 14756 12545 16345
11660 16345 23751 24243 31009 37815 24398 7557 8853 1991 14830 15770 17824 15982 17174 10843
11646 10843 14198 14054 12782 17709 23733 18774 2112 -16173 -12860 615 816 -7077 -5573 1422
11632 1422 6237 7147 9916 6584 -7093 -6539 -12534 -16850 -3799 -844 5590 1571 -1993 -7552 -4293
11617 -4293 -1480 1045 -2061 -3961 3698 2102 3655 12083 12480 -6520 -7387 10417 16522 4189
$$ packed form
11716B0364n67q890J3221l268r012q416M166J1457M67N913J976M324n590P736
11702C3881J1799j5300k840M34p481P953j691j2777j1765q939K47N114l4k951
11688d350J5712Q723n428N41k637J072o737L485J3668R984r596m556p276j4874
11674b269j1954O308J1959n184j0403J1028J6492K859o763p86R892o423k211L800
11660A6345P406M92O766O806j3417j6841J296o862J2839R40K054j842J192o331
11646A0843L355j44j272M927O024m959j6662j8285L313J3475K01p893J504O995
11632A422M815R10K769l332j3677N54n995m316J3051K955O434m019l564n559L259
11617d293K813K525l106j900P659j596J553Q428L97j9000q67J7804O105j2333
$$ plain form
11603 4189 -15698 -19285 -19890 -14087 -13149 -1070 16306 11002 10822 2416 11149 27533 11139 411
11589 411 -5437 6116 -2172 -2273 10115 -957 -12167 -19491 -16069 1442 9028 -4481 -12182 -13574
11575 -13574 -12172 -9355 -1022 2986 4980 2379 -1748 -1429 -1950 -18809 -13359 7213 19421 23259
11561 23259 31834 36600 36587 24285 8583 -1406 -8720 10449 6879 649 8416 12506 8831 4883
11547 4883 3971 1933 -9269 -12028 -24470 -26487 -6166 -3033 -10522 -6989 8356 4855 -49 8306
11533 8306 28651 24859 5458 -15527 -11084 -7903 -4721 -697 -2268 -3108 9363 12682 15230 3979
11519 3979 -1087 -3451 -695 7692 16518 9034 -2452 1824 8199 10388 11321 15368 13496 -732
11505 -732 -4649 5825 23090 38998 46977 38086 30454 22682 9853 13852 18473 12121 4966 7902
$$ packed form
11603D189j9887l587o05N803R38J2079J7376n304j80q406Q733J6384j6394j0728
11589D11n848J1553q288j01J2388j1072j1210p324L422J7511P586j3509p701j392
11575a3574J402K817Q333M008J994k601m127L19n21j6859N450K0572J2208L838
11561B3259Q575M766j3j2302j5702r989p314J9169l570o230P767M090l675l948
11547D883r12k038j1202k759j2442k017K0321L133p489L533J5345l501m904Q355
11533H306K0345l792j9401k0985M443L181L182M024j571q40J2471L319K548j1251
11519C979n066k364K756Q387Q826p484j1486M276O375K189R33M047j872j4228
11505g32l917J0474J7265J5908P979q891p632p772j2829L999M621o352p155K936
$$ plain form
11491 7902 -2271 -14895 -21126 -21761 -20301 -23888 -24378 -22355 -6300 15118 2803 -366 21374 45963
11477 45963 48767 29402 4961 -9121 -15039 4893 14634 5005 -6807 -16153 -9585 -13757 -18809
11464 -18809 -30090 -37627 -46596 -47173 -31414 -21221 -875 19670 27849 27049 18000 8629 7148 5716
11450 5716 4158 4703 12476 12954 -299 -8208 9283 16656 14033 12217 6960 8156 8677 4766 14027
11435 14027 18608 5650 -4780 -4180 2872 7958 12803 6871 1826 13144 6317 -708 -6831 -2071
11421 -2071 9872 7045 10877 17266 18304 29285 33728 31370 15065 7422 4270 2197 10429 -4336
11407 -4336 -15641 -7394 7766 18132 21587 19856 5368 -5014 5685 22027 16270 7168 9071
11394 9071 1952 -7848 -4333 -3198 -7787 2793 -638 -3311 1655 2697 -13627 -16617 -2428 13563
$$ packed form
11491G902j0173j2624o231o35J460l587m90K023J6055K1418j2315l169K1740K4589
11477D5963K804j9365k4441j4082n918J9932R741r629j1812r346O568m172n052
11464a8809j1281p537q969n77J5759J0193K0346K0545Q179q00r049r371j481j432
11450E716j558N45P773M78j3253p909J7491P373k623j816n257J196N21l911R261
11435A4027M581j2958j0430O00P052N086M845n932n045J1318o827p025o123M760
11421b071J1943k827L832O389J038J0981M443k358j6305p643l152k073Q232j4765
11407d336j1305Q247J5160J0366L455j731j4488j0382J0699J6342n757r102J903
11394I071p119r800L515J135m589J0580l431k673M966J042j6324k990J4189J5991
$$ plain form
11380 13563 11990 3488 12908 15208 11302 8311 14113 11382 -3905 -15728 -14019 -2702 -10959 -5935
11366 -5935 -6711 -717 16982 15426 8608 1576 1181 6329 -4150 -4329 2832 5883 -434 16369 18638
11351 18638 5832 20146 27139 14255 8147 16292 9095 8568 13449 11362 10080 14004 13817 23396
11337 23396 17931 21256 14133 14679 23175 17027 12660 10276 5065 10842 22838 27939 13417 6691
11323 6691 5066 85 -1604 2498 10717 25178 25220 32205 28656 23187 23231 19793 7072 -4742 -1593
11308 -1593 1032 -2419 -13996 -20689 -21672 -23310 -18991 -24291 -23681 -15484 1781 6805 -5376 1646
11294 1646 -2221 1418 10295 14196 25573 23507 28830 29983 24793 16850 12741 14511 17487 8422
11280 8422 -2948 3033 5007 1079 -5581 -5623 13825 9427 8885 6589 2655 2514 -1278 -2409 -7597
$$ packed form
11380A3563j573q502R420K300l906k991N802k731j5287j1823J709J1317q257N024
11366e935p76N994J7699j556o818p032l95N148j0479j79P161L051o317J6803K269
11351A8638j2806J4314O993j2884o108Q145p197n27M881k087j282L924j87R579
11337B3396n465L325p123N46Q496o148m367k384n211N777J1996N101j4522o726
11323F691j625m981j689M102Q219J4461M2O985l549n469M4l438j2721j1814L149
11308a593K625l451j1577o693r83j638M319n300O10Q197J7265N024j2181P022
11294A646l867L639Q877L901J1377k066N323J153n190p943m109J770K976r065
11280H422j1370N981J974l928o660m2J9448m398n42k296l934j41l792j131n188
$$ plain form
11265 -7597 708 5258 4923 5386 -6742 -15163 933 2353 3337 4628 -1136 2150 -6262 2706 -1453
11250 -1453 -5805 7828 6050 -7959 -16000 -8107 -4789 -15878 -13621 -10357 -352 3823 5738 2648
11236 2648 2915 2476 5232 3105 -7859 5236 11407 8679 16058 12617 6260 3782 -991 7754 4735
11221 4735 4679 -1927 -11586 2101 13218 18792 1837 -5130 3662 10113 1615 -856 7008 8198
11207 8198 14875 18761 23672 17255 27418 25684 6025 3383 15722 6221 -5969 -6914 -12292 -9901
11193 -9901 5282 16763 24870 16928 10100 5304 7766 -5139 -12665 -8938 1181 11325 -2310
11180 -2310 -28029 -36548 -38994 -29738 -5256 11342 27681 24124 20308 13643 5120 5353 3117 -17015
11166 -17015 -17264 -20843 -21049 -2737 20383 11887 6893 7583 -9362 -14786 8616 21363 21593 16386
$$ packed form
11265g597Q305M550l35M63j2128q421J6096J420R84J291n764L286q412Q968m159
11250a453m352J3633j778j4009q041P893L318j1089K257L264J0005M175J915l090
11236B648K67m39K756k127j0964J3095O171k728P379l441o357k478m773Q745l019
11221D735n6o606r659J3687J1117N574j6955o967Q792O451q498k471P864J190
11207H198O677L886M911o417J0163j734j9659k642J2339r501j2190r45n378K391
11193i901J5183J1481Q107p942o828m796K462j2905p526L727J0119J0144j3635
11180b310k5719q519k446R256K4482J6598J6339l557l816o665q523K33k236k0132
11166a7015k49l579k06J8312K3120q496m994O90j6945n424K3402J2747K30n207
$$ plain form
11152 16386 20169 26256 19806 23414 19808 9812 -4700 2275 417 6728 10179 6207 4203 -9449
11138 -9449 -13711 -4228 -3611 -13654 -7425 6790 7905 22927 29389 35205 41242 34839 22804 9901
11124 9901 7358 -5167 1278 3227 -316 6787 23193 33738 34691 24172 20948 13700 18120 27510
11110 27510 25830 19839 15317 15106 9232 2516 7504 12453 5292 -7078 7625 13960 7025 -2184
11096 -2184 3750 9094 10395 22682 30068 21555 13540 9744 5468 -220 -2997 -9035 -7149 -1433
11082 -1433 5388 22042 24995 15617 23727 8860 -9619 -7023 1488 18737 23066 21119 24860 20749
11068 20749 11503 20958 20800 10077 -3325 -6926 -8723 533 17157 19643 14952 23202 31687 18328
11054 18328 9268 17937 28782 21142 11980 13153 14636 4622 5460 18349 29061 17056 24142
$$ packed form
11152A6386L783O087o450L608l606r996j4512O975j858O311L451l972k004j3652
11138i449m262R483O17j0043O229J4215J115J5022O462N816O037o403j2035j2903
11124I901k543j2525O445J949l543P103J6406J0545R53j0519l224p248M420R390
11110B7510j680n991m522k11n874o716M988M949p161j2370J4703O335o935r209
11096b184N934N344J301J2287P386q513q015l796m276n688k777o038J886N716
11082a433O821J6654K953r378Q110j4867j8479K596Q511J7249M329j947L741m111
11068B0749r246R455j58j0723j3402l601j797R256J6624K486m691Q250Q485j3359
11054A8328r060Q669J0845p640r162J173J483j0014Q38J2889J0712j2005P086
$$ plain form
11041 24142 25109 22864 25691 28904 36761 45403 53162 60898 64515 69004 66695 82015 102328 112041
11027 112041 128935 141130 147859 168575 167646 150739 139169 116691 114990 109458 107518 114589 131207
11014 131207 150195 153261 164152 179276 185453 163948 146526 132348 130062 129477 123524 123283 117457
11001 117457 119344 125149 133309 127662 125035 124077 104472 95749 94429 95684 79275 83652 94828 86006
10987 86006 75848 89445 81744 70876 64715 47845 27472 24813 26138 19750 23759 43752 51149
10974 51149 38333 37520 29698 29185 26519 18773 18705 21814 14842 4174 -300 -4085 11005 5572 -2698
10959 -2698 11763 9788 17643 31589 18065 20205 9705 15133 12585 15640 18521 13104 22422 18892
10945 18892 6528 3374 4481 3918 13184 11965 25709 42346 42411 28576 36243 24011 19937 20197
$$ packed form
11041B4142R67k245K827L213P857Q642P759P736L617M489k309J5320K0313R713
11027A12041J6894J2195O729K0716r29j6907j1570k2478j701n532j940P071J6618
11014A31207J8988L066J0891J5124O177k1505j7422j4178k286n85n953k41n826
11001A17457J887N805Q160n647k627r58j9605q723j320J255j6409M377J1176q822
10987H6006j0158J3597p701j0868o161j6870k0373k659J325o388M009J9993P397
10974E1149j2816q13p822n13k666p746o8L109o972j0668m474l785J5090n433q270
10959b698J4461j975P855J3946j3524K140j0500N428k548L055K881n417R318l530
10945A8892j2364l154J107n63R266j219J3744J6637O5j3835P667j2232m074K60
$$ plain form
10931 20197 11312 7410 2968 3575 13563 -3759 -10024 7895 6964 -2009 7640 28810 29672 27768
10917 27768 46353 47618 28390 14654 18347 30086 10989 3205 12652 -319 9535 30649 35992
10904 35992 39974 42671 41973 40986 40748 28867 24114 29458 29134 24107 23795 41549 47433 43244 34787
10889 34787 23325 22233 18367 14136 7850 1907 10652 19461 16985 24010 28257 13287 8218 12982
10875 12982 21586 26023 24682 21252 16078 20893 27058 25486 34572 35745 36684 34923 24791 21568
10861 21568 46777 48045 51404 44862 42092 50472 51603 44371 38591 29499 29043 36850 43065 53318
10847 53318 39969 33763 37917 39968 48897 58894 46416 41265 38510 37041 24420 9868 16584
10834 16584 24815 27972 36937 40596 51489 49855 40221 37260 41896 55873 54793 57120 64822 66495
$$ packed form
10931B0197q885l902m442O07R988j7322o265J7919r31q973R649K1170Q62j904
10917B7768J8585J265j9228j3736L693J1739j9097p784R447j2971R854K1114N343
10904C5992L982K697o98r87k38j1881m753N344l24n027l12J7754N884m189q457
10889C4787j1462j092l866m231o286n943Q745Q809k476P025M247j4970n069M764
10875A2982Q604M437j341l430n174M815O165j572R086J173R39j761j0132l223
10861B1568K5209J268L359o542k770Q380J131p232n780r092m56P807O215J0253
10847E3318j3349o206M154K051Q929R997j2478n151k755j469j2621j4552O716
10834A6584Q231L157Q965L659J0893j634r634k961M636J3977j080K327P702J673
$$ plain form
10820 66495 58118 47351 39271 32549 45095 46211 43365 48809 32142 32004 41878 41827 49329 56178
10806 56178 46162 29114 12997 21599 17610 13043 -1510 20766 26638 36695 45801 44799 37946
10793 37946 47873 50538 57771 62021 48482 34168 26583 30745 32171 45209 54193 45659 33982
10780 33982 38268 43959 58731 50411 39507 36298 27250 19603 24852 19547 21203 32557 50992
10767 50992 59228 52885 49322 53329 56677 66659 68068 66948 63350 67461 65989 43184 47948 67516
10753 67516 62732 52768 50981 43733 31544 37900 51493 70001 76560 68244 49920 59587 66871
10740 66871 67347 64453 55819 55422 67088 72905 59506 64349 82556 83236 82442 82160 77785 85219 82576
10725 82576 83005 81741 79201 78165 83718 82196 86882 95828 92308 86759 79155 73458 89667 82213
$$ packed form
10820F6495q377j0767q080o722J2546J116k846N444j6667j38R874n1P502O849
10806E6178j0016j7048j6117Q602l989m567j4553K2276N872J0057R106j002o853
10793C7946R927K665P233M250j3539j4314p585M162J426J3038Q984q534j1677
10780C3982M286N691J4772q320j0904l209r048p647N249n305J656J1354J8435
10767E0992Q236o343l563M007L348R982J409j120l598M111j472k2805M764J9568
10753F7516m784r964j787p248j2189O356J3593J8508O559q316j8324R667P284
10740F6871M76k894q634l97J1666N817j3399M843J8207O80p94k82m375P434k643
10725H2576M29j264k540j036N553j522M686Q946l520n549p604n697J6209p454
$$ plain form
10711 82213 78438 80535 70872 60120 53761 56618 72797 69048 82986 92019 83962 77055 87624
10698 87624 97976 92450 80746 65382 73520 72241 73634 71763 78842 95894 112575 106431 94403
10685 94403 81710 81124 90871 95371 102206 91310 73193 74938 87436 93521 90346 107847 114456
10672 114456 123654 130219 132190 152827 154467 146274 152344 147498 154457 157625 154031 156585 148564 152847
10658 152847 157761 162187 176617 189702 191701 193206 202488 210575 224251 243735 246979 264871 294855
10645 294855 317648 344070 361341 383283 407216 435401 455247 479955 472875 471535 476949 485105
10633 485105 507881 525462 544256 578368 623584 691182 778893 859293 966859 1084908 1201592
10622 1201592 1299907 1384677 1468091 1547399 1650264 1801063 1988546 2232486 2544163 2931627
$$ packed form
10711H2213l775K097r663j0752o359K857J6179l749J3938R033q057o907J0569
10698H7624J0352n526j1704j5364Q138j279J393j871P079J7052J6681o144j2028
10685I4403j2693n86R747M500O835j0896j8117J745J2498O085l175J7501O609
10672A14456R198O565J971K0637J640q193O070m846O959L168l594K554q021M283
10658A52847M914M426J4430J3085J999J505R282Q087J3676J9484L244J7892K9984
10645B94855K2793K6422J7271K1942K3933K8185J9846K4708p080j340N414Q156
10633D85105K2776J7581J8794L4112M5216O7598Q7711Q0400J07566J18049J16684
10622A201592R8315Q4770Q3414P9308J02865J50799J87483K43940L11677L87464
$$ plain form
10612 2931627 3435269 4064933 4821156 5719130 6719717 7785268 8799943 9582828 10061695
10603 10061695 10262337 10328881 10453091 10784490 11443321 12483587 13934557 15734884 17693763
10594 17693763 19428559 20508226 20705488 20182689 19349876 18656796 18405457 18739509 19732098
10585 19732098 21369465 23494332 25723163 27461518 28078920 27339024 25566173 23401186
10577 23401186 21413066 19961991 19144918 18968722 19354618 20119843 20952717 21410226 21081844
10568 21081844 19874835 18080047 16105176 14333591 12950695 11988248 11443602 11192479
10560 11192479 11108032 11044474 10796269 10247976 9380933 8299815 7172173 6136037 5245869
10551 5245869 4517989 3924379 3442549 3063335 2752435 2481992 2258032 2055862 1896894
$$ packed form
10612B931627N03642O29664P56223Q97974J000587J065551J014675P82885M78867
10603A0061695K00642O6544J24210L31399O58831J040266J450970J800327J958879
10594A7693763J734796J079667J97262n22799q32813o93080k51339L34052R92589
10585A9732098J637367K124867K228831J738355O17402p39896j772851k164987
10577B3401186j988120j451075q17073j76196L85896P65225Q32874M57509l28382
10568B1081844j207009j794788j974871j771585j382896r62447n44646k51123
10560A1192479q4447o3558k48205n48293q67043j081118j127642j036136q90168
10551E245869p27880n93610m81830l79214l10900k70443k23960k02170j58968
$$ plain form
10542 1896894 1748257 1621929 1507942 1394879 1303125 1216908 1135328 1077663 1016090 956258
10532 956258 897338 854947 824928 796276 746322 694802 662910 658357 641219 623961 583037 547553
10520 547553 518043 495188 483632 472483 470852 438635 406054 403640 389061 372737 346948 332462
10508 332462 326111 324156 306194 298335 282774 291944 304082 308347 296400 272666 241460 220435
10496 220435 204558 192515 191980 189591 185097 173041 168056 161084 166707 158842 157071 152495 152938 151895
10482 151895 162749 160706 159319 154412 142761 142055 137301 130758 137027 151912 151817 137404 129263 116321
10468 116321 122433 130685 132341 123103 103894 95769 95289 95895 96045 97620 116939 113739 90087 81844
10454 81844 83690 75219 75915 76315 66456 58620 61026 66420 74580 76110 77700 68839 67324 65789 58677
$$ packed form
10542A896894j48637j26328j13987j13063r1754q6217q1580n7665o1573n9832
10532I56258n8920m2391l0019k8652m9954n1520l1892m553j7138j7258m0924l5484
10520E47553k9510k2855j1556j1149j631l2217l2581k414j4579j6324k5789j4486
10508C32462o351j955j7962p859j5561R170J2138M265j1947k3734l1206k1025
10496B20435j5877j2043n35k389m494j2056m985o972N623p865j771m576M43j043
10482A51895J0854k043j387m907j1651p06m754o543O269J4885r5j4413q141j2942
10468A16321O112Q252J656r238j9209q125m80O06J50J575J9319l200k3652q243
10454H1844J846q471O96M00r859p836K406N394Q160J530J590q861j515j535p112
$$ plain form
10439 58677 63903 57319 54095 53060 60883 69660 82311 73665 68498 64466 59458 51545 49994 59849
10425 59849 62275 67706 78711 73549 67042 71405 72901 61874 54217 50064 50797 50358 50479 45672 27364
10410 27364 26811 28978 37901 40153 45076 36846 38445 37927 43573 36061 31630 28983 27410 43407 54404
10395 54404 47623 47305 58265 48774 51391 42418 33007 42061 33345 36292 44629 56478 59255 72917
10381 72917 80480 77110 58723 47585 46758 53300 58766 65754 69262 54797 56476 56706 43601 29021
10367 29021 29733 35923 32486 40429 60846 58719 54189 65063 78019 65775 44592 43433 55087
10354 55087 44904 20067 2871 12460 37766 51632 51684 46006 53579 54526 66280 69779 69735 73902
10340 73902 80757 80148 58637 53221 61233 75017 70360 66736 72642 79318 86442 96053 91938 76364
$$ packed form
10439E8677N226o584l224j035P823Q777J2651q646n167m032n008p913j551R855
10425E9849K426N431J1005n162o507M363J496j1027p657m153P33m39J21m807j8308
10410B7364n53K167Q923K252M923q230J599n18N646p512m431k647j573J5997J0997
10395E4404o781l18J0960r491K617q973r411R054q716K947Q337J1849K777J3662
10381G2917P563l370j8387j1138q27O542N466O988L508j4465J679K30j3105j4580
10367B9021P12O190l437P943K0417k127m530J0874J2956j2244k1183j159J1654
10354E5087j0183k4837j7196R589K5306J3866N2n678P573R47J1754L499m4M167
10340G3902O855o09k1511n416Q012J3784m657l624N906O676P124R611m115j5574
$$ plain form
10326 76364 46105 29825 31820 31529 24986 27483 42788 43480 45691 48230 49258 47424 47650 49120
10312 49120 46416 48591 47852 46266 50616 61730 54205 49354 41692 35586 28268 29795 42577 60707
10298 60707 56273 54365 56665 58170 44523 49597 51023 39552 52298 51432 57677 58870 55569 52637
10284 52637 54949 51828 54583 66070 61857 48083 58983 70715 64488 47358 48917 53111 46516
10271 46516 47329 46884 44692 47365 48805 59227 64359 63011 63145 70479 68979 63382 60129 53971 65831
10256 65831 67990 64458 67852 68440 60206 56088 43179 50372 50688 43644 34955 38343 40276 47550 56362
10241 56362 46707 53490 63765 68229 52243 39044 54382 56096 57287 73521 75276 82330 83391
10228 83391 86370 88841 84935 77238 71249 81107 87308 76739 54216 50692 56884 51623 53743 55638
$$ packed form
10326G6364l0259j6280J995k91o543K497J5305O92K211K539J028j834K26J470
10312D9120k704K175p39j586M350J1114p525m851p662o106p318J527J2782J8130
10298F0707m434j908K300J505j3647N074J426j1471J2746q66O245J193l301k932
10284E2637K312l121K755J1487m213j3774J0900J1732o227j7130J559M194o595
10271D6516Q13m45k192K673J440J0422N132j348J34P334j500n597l253o158J1860
10256F5831K159l532L394N88q234m118j2909P193L16p044q689L388J933P274Q812
10241E6362r655O783J0275M464j5986j3199J5338J714J191J6234J755P054J061
10228H3391K979K471l906p697n989R858O201j0569k2523l524O192n261K120J895
$$ plain form
10214 55638 59078 62885 75708 80326 63845 53580 53319 60093 57177 52362 52549 53196 66577 75238
10200 75238 67597 67798 66567 68649 47505 44656 52855 54271 54077 65030 67372 55881 55369 50297
10186 50297 39730 41374 33031 23404 29294 36194 46560 65049 56519 57886 68076 66573 68836
10173 68836 73245 93478 102419 120488 129971 121711 121636 122105 118330 119776 117155 129985 143973 152146
10159 152146 169932 182564 196389 205366 200637 213489 210765 195456 200697 201677 198746 227776 266324
10146 266324 308767 326225 322349 307088 268844 234715 208818 201022 211630 227794 237138 229529
10134 229529 237524 244858 256721 257095 250657 242991 251719 260159 248729 245139 253280 269096 304921
10121 304921 340020 365031 399152 428038 464860 541367 623785 724002 866371 1054886 1306324
$$ packed form
10214E5638L440L807J2823M618j6481j0265k61O774k916m815J87O47J3381Q661
10200G5238p641K01j231K082k1144k849Q199J416j94J0953K342j1491n12n072
10186E0297j0567J644q343r627N890O900J0366J8489q530J367J0190j503K263
10173F8836M409K0233Q941J8069R483q260p5M69l775J446k621J2830J3988Q173
10159A52146J7786J2632J3825Q977m729J2852k724j5309N241R80k931K9030L8548
10146B66324M2443J7458l876j5261l8244l4129k5897p796J0608J6164R344p609
10134B29529P995P334J1863L74o438p666Q728Q440j1430l590Q141J5816L5825
10121C04921L5099K5011L4121K8886L6822P6507Q2418J00217J42369J88515K51438
$$ plain form
10110 1306324 1650047 2057741 2425281 2619624 2548993 2255956 1867587 1500953 1197993 984378
10100 984378 827474 694452 609761 553520 506915 466925 424679 385749 356957 322930 293169
10089 293169 276336 271199 243827 246059 241532 245530 238825 220268 224675 231085 227511 215842 199982
10076 199982 188169 173783 164765 162570 146378 135016 131018 128670 129896 150151 160042 157174 167751
10063 167751 166664 172316 184078 192061 196855 208041 210098 212795 222863 248576 294027 344805 382034
10050 382034 399550 399079 392350 359966 329872 294021 253429 238996 225264 207656 201965 197166
10038 197166 193804 195794 197640 195417 193544 181394 173483 168661 138579 132218 150027 156685 148737
10025 148737 137339 130250 133756 134222 140932 141891 130265 134649 135300 134171 146562 147187 132671 122278
$$ packed form
10110A306324L43723M07694L67540J94343p0631k93037l88369l66634l02960k13615
10100I84378j56904j33022q4691n6241m6605l9990m2246l8930k8792l4027k9761
10089B93169j6833n137k7372K232m527L998o705j8557M407O410l574j1669j5860
10076A99982j1813j4386r018k195j6192j1362l998k348J226K0255R891k868J0577
10063A67751j087N652J1762P983M794J1186K057K697J0068K5713M5451N0778L7229
10050C82034J7516m71o729l2384l0094l5851m0592j4433j3732j7608n691m799
10038A97166l362J990J846k223j873j2150p911m822l0082o361J7809O658p948
10025A48737j1398p089L506M66O710R59j1626M384O51j129J2391O25j4516j0393
$$ plain form
10011 122278 118110 116392 105981 98798 94731 85290 80456 93117 106633 128978 135977 124336 124937
9998 124937 126908 127131 123867 121289 126007 130074 125097 111621 109304 113537 125794 129869 126723 122842
9984 122842 141623 160201 175198 188098 191191 190106 181819 205292 218993 226153 235296 246104 251760
9971 251760 260247 254856 251559 269878 272346 278119 292163 326151 356407 396171 416707 420928 409321
9958 409321 392676 386682 355673 327837 278689 248521 224174 217920 200517 194817 198999 202711 206972
9945 206972 218394 222386 231642 215835 209692 219959 214413 199539 195077 202103 217429 218565 212665
9932 212665 214127 214361 205684 204647 208327 213598 221261 224310 233230 238883 252179 259336 261508 254280
9918 254280 253197 245373 238173 242984 252538 245930 236486 236814 251695 269313 275543 283691 299800 301554
$$ packed form
10011A22278m168j718j0411p183m067r441m834J2661J3516K2345O999j1641O01
9998A24937J971K23l264k578M718M067m977j3476k317M233J2257M075l146l881
9984A22842J8781J8578J4997J2900L093j085q287K3473J3701P160R143J0808N656
9971B51760Q487n391l297J8319K468N773J4044L3988L0256L9764K0536M221j1607
9958D09321j6645n994l1009k7836m9148l0168k4347o254j7403n700M182L712M261
9945B06972J1422L992R256j5807o143J0267n546j4874m462P026J5326J136n900
9932B12665J462K34q677j037L680N271P663L049Q920N653J3296P157K172p228
9918B54280j083p824p200M811R554o608r444L28J4881J7618O230Q148J6109J754
$$ plain form
9904 301554 307395 321216 309780 309823 298447 290995 267780 244694 237559 236318 240717 242505 257514
9891 257514 261531 267907 269787 287381 308090 319026 317695 305693 304257 326479 340571 346022 346501
9878 346501 356328 364587 371586 373361 374133 384297 396897 383724 380064 380145 375718 385907 406846 431046
9864 431046 450084 470639 475552 457741 428296 404629 397266 392598 403268 410059 429302 445027
9852 445027 478494 492772 495851 500054 497344 499978 505438 522883 548753 565219 572164 584912 606850
9839 606850 637062 662327 695294 738826 763739 760536 739107 705643 662113 638277 619635 582361
9827 582361 538981 516137 490779 477495 461259 450521 438729 447890 447992 458831 473761 498284
9815 498284 503780 502327 514259 534073 560664 575758 591766 601402 610988 630271 653704 675002
$$ packed form
9904C01554N841J3821j1436M3j1376p452k3215k3086p135j241M399J788J5009
9891B57514M017O376J880J7594K0709J0936j331j2002j436K2222J4092N451M79
9878C46501R827Q259O999J775P72J0164J2600j3173l660Q1m427J0189K0939K4200
9864D31046J9038K0555M913j7811k9445k3667p363m668J0670O791J9243J5725
9852D45027L3467J4278L079M203k710K634N460J7445K5870J6466O945J2748K1938
9839F06850L0212K5265L2967M3532K4913l203k1429l3464m3530k3836j8642l7274
9827E82361m3380k2844k5358j3284j6236j0738j1792R161J02J0839J4930K4523
9815D98284N496j453J1932J9814K6591J5094J6008R636R586J9283K3433K1298
$$ plain form
9803 675002 692472 698997 696456 709186 728705 744265 764050 793993 827060 851137 871052 909462
9791 909462 935066 944665 959246 985716 1018139 1038456 1045619 1049244 1068028 1090726 1112155 1130575
9779 1130575 1149502 1156635 1170260 1200677 1238569 1273175 1327962 1382730 1430476 1471930 1531820 1600687
9767 1600687 1658403 1717963 1779629 1837089 1899298 1973648 2043121 2096991 2160436 2233226 2315525
9756 2315525 2392496 2476707 2571818 2677089 2798248 2919202 3061660 3224879 3379840 3574505
9746 3574505 3784421 3991506 4206506 4435921 4679560 4944030 5225795 5538615 5885771 6271600
9736 6271600 6710428 7198843 7754424 8397332 9111834 9901198 10810158 11866878 13126917
9727 13126917 14621744 16331555 18167870 20035611 21905929 23863662 26141321 29000435
$$ packed form
9803F75002J7470O525k541J2730J9519J5560J9785K9943L3067K4077J9915L8410
9791I09462K5604R599J4581K6470L2423K0317P163L625J8784K2698K1429J8420
9779A130575J8927P133J3625L0417L7892L4606N4787N4768M7746M1454N9890O8867
9767A600687N7716N9560O1666N7460O2209P4350O9473N3870O3445P2790Q2299
9756B315525P6971Q4211R5111J05271J21159J20954J42458J63219J54961J94665
9746C574505K09916K07085K15000K29415K43639K64470K81765L12820L47156L85829
9736F271600M38828M88415N55581O42908P14502P89364R08960J056720J260039
9727A3126917J494827J709811J836315J867741J870318J957733K277659K859114
$$ plain form
9719 29000435 32610166 37163717 42908078 50073183 58975488 69961808 83715288 101548300
9711 101548300 125558848 158802179 205016094 267324039 344014830 420824758 470614299
9704 470614299 471675543 424610828 350774011 276413680 215976936 171240836 138947574
9697 138947574 115417245 97801451 84116947 73113803 64018827 56379536 49909351
9690 49909351 44425166 39787796 35914131 32731585 30139202 28006243 26132730 24297994
9682 24297994 22390894 20487837 18717681 17200500 15928193 14853393 13915031 13076497
9674 13076497 12302190 11621636 11041828 10536959 10137188 9821585 9621490 9524983 9525709 9554260
9664 9554260 9458387 9126677 8552627 7848436 7175349 6613087 6157861 5771915 5444575 5159747
$$ packed form
9719B9000435L609731M553551N744361P165105Q902305J0986320J3753480J7833012
9711A01548300K4010548L3243331M6213915O2307945P6690791P6809928M9789541
9704D70614299J061244m7064715p3836817p4360331o0436744m4736100l2293262
9697A38947574k3530329j7615794j3684504j1003144r094976p639291o470185
9690D9909351n484185m637370l873665l182546k592383k132959j873513j834736
9682B4297994j907100j903057j770156j517181j272307j074800r38362q38534
9674A3076497p74307o80554n79808n04869l99771l15603k00095r6507P26K8551
9664I554260r5873l31710n74050p04191o73087n62262m55226l85946l27340k84828
$$ plain form
9654 5159747 4899894 4675785 4450795 4228945 4019193 3841055 3684509 3536731 3424911 3302354
9644 3302354 3173970 3065415 2968327 2878727 2782347 2686074 2598439 2529419 2458615 2394246 2327282
9633 2327282 2256650 2181159 2079453 1979497 1912006 1847966 1783979 1717835 1662610 1602039 1535082
9622 1535082 1464725 1418693 1372889 1319563 1279327 1246747 1226027 1209336 1195183 1181711 1164670
9611 1164670 1154292 1133890 1107709 1085388 1061061 1038221 1018305 999642 986475 978250 966286 958630
9599 958630 949157 931545 918149 915576 913761 911862 906513 907077 896775 880036 852590 821844 829350
9586 829350 833657 815649 802262 789649 780679 739601 699962 646426 584613 530183 470861 432326
9574 432326 396075 374088 355262 343623 339211 333724 328560 331901 351411 378186 388518 397333 405634
$$ packed form
9654E159747k59853k24109k24990k21850k09752j78138j56546j47778j11820j22557
9644C302354j28384j08555r7088q9600r6380r6273q7635o9020p0804o4369o6964
9633B327282p0632p5491j01706r9956o7491o4040o3987o6144n5225o0571o6957
9622A535082p0357m6032m5804n3326m0236l2580k0720j6691j4153j3472j7041
9611A164670j0378k0402k6181k2321k4327k2840j9916j8663j3167q225j1964p656
9599I58630r473j7612j3396k573j815j899n349N64j0302j6739k7446l0746P506
9586H29350M307j8008j3387j2613q970m1078l9639n3536o1813n4430n9322l8535
9574D32326l6251k1987j8826j1639m412n487n164L341J9510K6775J0332Q815Q301
$$ plain form
9561 405634 412860 423459 418994 407938 410985 401602 406684 414005 400736 390978 402149 395417 358195
9548 358195 309161 281532 285396 300102 312962 330720 342094 353526 359770 365759 379585 389447
9536 389447 392629 388749 383436 388179 410286 419521 406897 402005 423251 440560 440439 463823 507873
9523 507873 537391 556718 571733 576520 576818 572949 543053 506827 478197 449197 409956 382534
9511 382534 344033 329756 320657 314667 309495 305339 304170 306411 304307 304262 305508 298615 293813 296102
9497 296102 295925 292181 290582 303747 311536 300469 295409 300505 308550 294635 292569 312747 328006
9484 328006 343683 356589 363672 371434 372871 364693 350844 326279 313162 324462 327167 338313 342801
9471 342801 354032 365051 370081 369662 376900 390126 403193 403593 403796 399601 388412 382536 373769 369175
$$ packed form
9561D05634P226J0599m465j1056L047r383N082P321j3269r758J1171o732l7222
9548C58195m9034k7629L864J4706J2860J7758J1374J1432O244N989J3826R862
9536C89447L182l880n313M743K2107R235j2624m892K1246J7309j21K3384M4050
9523E07873K9518J9327J5015M787K98l869k9896l6226k8630k9000l9241k7422
9511C82534l8501j4277r099n990n172m156j169K241k104m5J246o893m802K289
9497B96102j77l744j599J3165P789j1067n060N096Q045j3915k066K0178J5259
9484C28006J5677J2906P083P762J437q178j3849k4565j3117J1300K705J1146M488
9471C42801J1231J1019N030m19P238J3226J3067M00K03m195j1189n876q767m594
$$ plain form
9457 369175 367403 361801 362288 363602 360890 359993 347391 371788 426047 437262 429896 408228 396978
9444 396978 385614 373061 345371 340505 362245 380247 386238 386926 375144 368601 383350 401061 419567
9431 419567 434376 445887 463091 467476 479930 501968 535613 551540 568447 557681 529718 496436
9419 496436 479585 471261 468055 485044 501337 508945 518267 530762 526516 515839 520160 517202 539044
9406 539044 560799 566170 584885 614969 634163 636648 656234 690199 722659 738906 755991 751144
9394 751144 732275 708660 679838 655609 617137 573326 532711 509129 488149 468072 461442 447134
9382 447134 424556 428346 429776 433698 440680 452896 459211 467266 483293 496363 518158 531049 546809
9369 546809 563153 598572 616493 627569 636154 657278 675883 684752 686752 699193 712058 716347
$$ packed form
9457C69175j772n602M87J314k712q97j2602K4397N4259J1215p366k1668j1250
9444C96978j1364j2553k7690m866K1740J8002N991O88j1782o543J4749J7711J8506
9431D19567J4809J1511J7204M385J2454K2038L3645J5927J6907j0766k7963l3282
9419D96436j6851q324l206J6989J6293P608R322J2495m246j0677M321k958K1842
9406E39044K1755N371J8715L0084J9194K485J9586L3965L2460J6247J7085m847
9394G51144j8869k3615k8822k4229l8472m3811m0615k3582k0980k0077o630j4308
9382D47134k2578L790J430L922O982J2216O315Q055J6027J3070K1795J2891J5760
9369E46809J6344L5419J7921J1076Q585K1124J8605Q869K000J2441J2865M289
$$ plain form
9357 716347 732803 747903 781715 796591 816921 842310 877326 890676 906930 923997 931975 950746
9345 950746 967201 984700 1000682 1019617 1037856 1047510 1054883 1069929 1089256 1122693 1159193 1209440
9333 1209440 1260914 1308303 1356447 1418655 1488626 1541730 1573625 1628539 1692249 1755765 1806594
9322 1806594 1896632 1977313 2035212 2101067 2171847 2257818 2348165 2445347 2554643 2679023 2811495
9311 2811495 2947415 3109715 3278560 3491290 3726902 3984144 4269303 4592134 4937372 5349699
9301 5349699 5852373 6463618 7179161 7911051 8528221 8944344 9166217 9323001 9576908 10003893
9291 10003893 10606266 11399104 12390537 13613869 15120390 16897796 18866717 20902971 23004834
9282 23004834 25337368 28114924 31493957 35487752 40117077 45475696 51897826 59904841
$$ packed form
9357G16347J6456J5100L3812J4876K0330K5389L5016J3350J6254J7067P978J8771
9345I50746J6455J7499J5982J8935J8239R654P373J5046J9327L3437L6500N0247
9333A209440N1474M7389M8144O2208O9971N3104L1895N4914O3710O3516N0829
9322A806594R0038Q0681N7899O5855P0780Q5971R0347R7182J09296J24380J32472
9311B811495J35920J62300J68845K12730K35612K57242K85159L22831L45238M12327
9301E349699N02674O11245P15543P31890O17170M16123K21873J56784K53907M26985
9291A0003893O02373P92838R91433J223332J506521J777406J968921K036254K101863
9282B3004834K332534K777556L379033L993795M629325N358619O422130Q007015
$$ plain form
9274 59904841 70275992 84131866 103062370 129352426 166288717 218004841 287587930
9267 287587930 370913763 448131361 488657760 474432359 413340134 332355252 257563051
9260 257563051 199742261 157994426 128125176 106423668 90371441 78355803 69174884
9253 69174884 61828892 55599930 50102658 45126232 40611083 36610867 33194445 30373827
9245 30373827 28020475 25854206 23700720 21566044 19558287 17817117 16333042 15089531
9237 15089531 14013882 13074205 12235307 11466268 10759466 10111755 9536887 9021317 8530781
9228 8530781 8062035 7619708 7239569 6900778 6598728 6326389 6054135 5808971 5557979 5318746
9218 5318746 5092831 4875739 4687018 4487879 4298669 4110849 3937661 3766266 3598125 3444029
$$ packed form
9274E9904841J0371151J3855874J8930504K6290056L6936291N1716124O9583089
9267B87587930Q3325833P7217598M0526399j4225401o1092225q0984882p4792201
9260B57563051n7820790m1747835k9869250k1701508j6052227j2015638r180919
9253F9174884p345992o228962n497272m976426m515149m000216l416422k820618
9245C0373827k353352k166269k153486k134676k007757j741170j484075j243511
9237A5089531j075649r39677q38898p69039p06802o47711n74868n15570m90536
9228H530781m68746m42327l80139l38791l02050k72339k72254k45164k50992k39233
9218E318746k25915k17092j88721j99139j89210j87820j73188j71395j68141j54096
$$ plain form
9208 3444029 3300475 3192370 3091337 2998260 2891446 2797303 2712286 2631432 2561598 2496876 2441766
9197 2441766 2372209 2303747 2230572 2165744 2093183 2027346 1944124 1859691 1776730 1696691 1636551
9186 1636551 1587685 1533815 1471512 1403787 1336625 1290540 1230774 1184478 1163692 1142893 1127498
9175 1127498 1101504 1074544 1048611 1030040 1011865 998923 985612 963299 943357 916521 907142 901690
9163 901690 890170 870808 873249 878925 868180 854971 832386 822269 829802 838179 818181 797712
9151 797712 783561 771181 761663 749559 745288 737796 715656 692731 672411 638362 611955 581914
9139 581914 534434 477734 430205 375359 324870 294477 284798 273274 269990 265226 271289 281841
9127 281841 275188 274761 279175 283869 291280 299730 307864 320464 306476 297894 306138 314010 309905 308312
$$ packed form
9208C444029j43554j08105j01033r3077j06814r4143q5017q0854o9834o4722n5110
9197B441766o9557o8462p3175o4828p2561o5837q3222q4433q2961q0039o0140
9186A636551m8866n3870o2303o7725o7162m6085n9766m6296k0786k0799j5395
9175A127498k5994k6960k5933j8571j8175j2942j3311k2313j9942k6836r379n452
9163I01690j1520j9362K441N676j0745j3209k2585j0117P533Q377j9998k0469
9151G97712j4151j2380r518j2104m271p492k2140k2925k0320l4049k6407l0041
9139E81914m7480n6700m7529n4846n0489l0393r679j1524l284m764O063J0552
9127B81841o653m27M414M694P411Q450Q134J2600j3988q582Q244P872m105j593
$$ plain form
9113 308312 319599 318527 305069 286250 255095 222039 215728 214110 217083 224949 228579 228901 229727 225586
9099 225586 214406 199516 214369 221151 210354 197542 192635 197436 204337 210393 202886 198965 196760
9086 196760 197592 212767 211515 198327 193375 203160 210779 223368 245046 253479 263825 264951 235554
9073 235554 212775 188047 164710 155422 152756 156636 152933 139508 138945 142479 139858 143635 150182 148423
9059 148423 152278 152786 164124 165433 165998 164489 151514 135838 130500 135518 130436 103865 103955 121838
9045 121838 133057 139378 144626 147614 150818 145023 140528 131322 136685 132265 129249 137969 160603 162774
9031 162774 152402 155167 156983 150275 149181 144127 140063 148325 158527 151996 158694 159941 149134 156725
9017 156725 163314 164010 161767 154764 152345 159158 157046 148410 137380 139710 131355 125812 130788 111397
$$ packed form
9113C08312J1287j072j3458j8819l1155l3056o311j618K973P866L630L22Q26m141
9099B25586j1180j4890J4853O782j0797j2812m907M801O901O056p507l921k205
9086A96760Q32J5175j252j3188m952R785P619J2589K1678Q433J0346J126k9397
9073B35554k2779k4728k3337r288k666L880l703j3425n63L534k621L777O547j759
9059A48423L855N08J1338J309N65j509j2975j5676n338N018n082k6571R0J7883
9045A21838J1219O321N248K988L204n795m495r206N363m420l016Q720K2634K171
9031A62774j0372K765J816o708j094n054m064Q262J0202o531O698J247j0807P591
9017A56725O589O96k243p003k419O813k112q636j1030K330q355n543M976j9391
$$ plain form
9003 111397 108143 119583 103570 83171 70114 70660 71931 73357 92551 98491 108626 121705 126858
8990 126858 130799 134947 121135 126762 138804 153048 151799 138122 130616 130295 118796 120445 134701
8977 134701 142446 144114 131832 120675 116988 124734 119556 111587 118911 133243 138788 143010 145539 154887
8963 154887 166758 157991 150087 140018 116443 99495 88465 77264 70968 57294 62438 71662 79312
8950 79312 77777 79235 79337 89892 97811 101149 93228 95456 85965 68860 74687 81571 74433 56969
8936 56969 50103 41995 54927 61974 84602 104969 103679 107799 104190 92690 78577 67284 65504
8923 65504 57791 59465 66412 72942 57029 40145 49030 50978 50081 59141 71403 59673 53625 55980
8909 55980 71251 85452 82148 91102 90076 81503 92103 94375 75536 55236 44336 48937 66934
$$ packed form
9003A11397l254J1440j6013k0399j3057N46J271J426J9194N940J0135J3079N153
8990A26858L941M148j3812N627J2042J4244j249j3677p506l21j1499J649J4256
8977A34701P745J668j2282j1157l687P746n178p969P324J4332N545M222K529R348
8963A54887J1871q767p904j0069k3575j6948j1030j1201o296j3674N144R224P650
8950G9312j535J458J02J0555P919L338p921K228r491j7105N827O884p138j7464
8936E6969o866q108J2932P047K2628K0367j290M120l609j1500j4113j1293j780
8923F5504p713J674O947O530j5913j6884Q885J948q97R060J2262j1730o048K355
8909E5980J5271J4201l304Q954j026q573J0600K272j8839k0300j0900M601J7997
$$ plain form
8896 66934 83241 85355 89514 89300 90834 94271 93027 91485 89559 107659 116185 126319 147640 149168
8882 149168 148887 154564 170307 196852 207812 213957 222002 228440 236230 259756 282477 327068 383254
8869 383254 446559 523492 642619 800052 1010223 1311324 1696663 2144877 2525060 2658016
8859 2658016 2521490 2148500 1705165 1321171 1022376 820697 685233 580998 496973 427663
8849 427663 385446 355627 321957 286842 262024 235778 224482 217794 199535 185752 174476 176302
8837 176302 166736 145910 148210 145509 143635 133564 102909 92289 110032 140440 177147 207514
8825 207514 225304 199349 138130 84098 41532 4105 7981 33253 52662 41326 27109 36075
8813 36075 50131 50596 44595 44698 66003 70344 77441 54862 44945 57931 52931 43295 35306 34115
$$ packed form
8896F6934J6307K114M159k14J534L437j244j542j926J8100Q526J0134K1321J528
8882A49168k81N677J5743K6545J0960O145Q045O438P790K3526K2721M4591N6186
8869C83254O3305P6933J19127J57433K10171L01101L85339M48214L80183J32956
8859B658016j36526l72990m43335l83994k98795k01679j35464j04235q4025o9310
8849D27663m2217k9819l3670l5115k4818k6246j1296o688j8259j3783j1276J826
8837A76302r566k0826K300k701j874j0071l0655j0620J7743L0408L6707L0367
8825B07514J7790k5955o1219n4032m2566l7427L876K5272J9409j1336j4217Q966
8813C6075J4056M65o001J03K1305M341P097k2579r917J2986n000r636p989j191
$$ plain form
8799 34115 23061 11238 13927 31084 26162 24375 12784 12947 34360 51818 50961 53863 50397 43625
8785 43625 48749 53409 65782 49860 24762 23029 31965 45218 44476 50142 54785 46953 49175 44976
8771 44976 43110 53605 51217 42869 40659 35371 40638 36916 50229 56842 50621 31262 17393 29875
8757 29875 38458 34125 29006 28750 15473 14490 13140 14760 18909 30300 29364 21170 19619 17152 23451
8742 23451 27888 23585 16800 3249 982 3199 22462 38850 33415 27213 31380 19740 6591
8729 6591 -3219 -4115 9280 9053 10062 6462 8721 6080 5444 19199 22898 16458 39067 40235 37037
8714 37037 28547 22559 24055 35281 30075 27077 28280 35724 30784 20807 20731 5849 8416 8372 19437
8699 19437 26220 22851 16260 20685 18534 15869 34218 45861 47462 35855 19665 4119 6237
$$ packed form
8799C4115j1054j1823K689J7157m922j787j1591J63K1413J7458q57K902l466o772
8785D3625N124M660J2373j5922k5098j733Q936J3253p42N666M643p832K222m199
8771D4976j866J0495k388q348k210n288N267l722J3313O613o221j9359j3869J2482
8757B9875Q583m333n119k56j3277r83j350J620M149J1391r36q194j551k467O299
8742B3451M437m303o785j3551k267K217J9263J6388n435o202M167j1640j3149
8729F591r810q96J3395k27J009l600K259k641o36J3755L699o440K2609J168l198
8714C7037q490n988J496J1226n206k998J203P444m940r977p6j4882K567m4J1065
8699A9437O783l369o591M425k151k665J8349J1643J601j1607j6190j5546K118
$$ plain form
8686 6237 2229 3435 23334 30077 26906 17939 6448 -5613 -14384 -4829 9330 16008 13295 10450
8672 10450 3267 23029 24044 26425 35889 31206 27487 16006 13891 21767 11758 -11156 -7316 5046
8658 5046 -2887 -11090 -1593 44 5501 19491 27787 17954 6725 4693 10408 16096 19933 30922
8644 30922 23630 27180 36211 39547 30771 5422 -8606 -2110 8051 8483 -2388 -5538 -3488 -2006
8630 -2006 1886 25051 29651 24966 7125 647 110 -9759 1708 18602 26643 29860 21827 15267
8616 15267 8354 3052 4976 4518 9020 12771 10008 -51 -4822 -1661 -6250 6744 20358 19701
8602 19701 6499 -2787 13143 21039 28867 36313 49218 49482 35200 32114 33769 31518 30382 30988
8588 30988 28632 25550 29161 25190 23650 26246 21229 27231 27837 14182 20169 34767 39265 34237
$$ packed form
8686F237m008J206J9899O743l171q967j1491j2061q771R555J4159O678k713k845
8672A0450p183J9762J015K381R464m683l719j1481k115P876j0009k2914L840J2362
8658E046p933q203R497J637N457J3990Q296r833j1229k032N715N688L837J0989
8644C0922p292L550R031L336q776k5349j4028O496J0161M32j0871l150K050J482
8630b006L892K3165M600m685j7841o478n37r869J1467J6894Q041L217q033o560
8616A5267o913n302J924m58M502L751k763j0059m771L161m589J2994J3614o57
8602A9701j3202r286J5930P896P828P446J2905K64j4282l086J655k251j136O06
8588C0988k356l082L611l971j540K596n017O002O06j3655N987J4598M498n028
$$ plain form
8574 34237 27127 26925 37968 50770 48417 40677 35455 32722 25906 40068 31560 27216 33694 41050
8560 41050 41474 48557 42683 24557 22214 17527 20176 21584 23284 23260 38530 47401 45523 32867 36324
8545 36324 38653 40592 21432 -2315 -3068 9715 19955 27950 21329 18495 7659 10522 25694
8532 25694 40431 43582 34493 34370 46962 35171 30365 25607 29098 21440 13337 7998 -1698 332
8518 332 2012 16278 569 -10169 -14452 -10271 9457 15305 19276 17108 23890 32550 41179 44009
8504 44009 32145 36246 40166 33937 10612 11601 19066 24987 36013 25677 -635 -3768 -10992 -14164
8490 -14164 3098 15573 22762 23226 27558 18013 13447 18230 17276 13645 21794 15067 11010 6159 7290
8475 7290 18298 14179 25494 26546 19272 15780 13826 13464 -3649 -12805 -9633 7295 14020 19274
$$ packed form
8574C4237p110k02J1043J2802k353p740n222k733o816J4162q508m344O478P356
8560D1050M24P083n874j8126k343m687K649J408J700k4J5270Q871j878j2656L457
8545C6324K329J939j9160k3747p53J2783J0240P995o621k834j0836K863J5172
8532B5694J4737L151r089j23J2592j1791m806m758L491p658q103n339r696K030
8518C32J680J4266j5709j0738m283M181J9728N848L971k168O782Q660Q629K830
8504D4009j1864M101L920o229k3325R89P465N921J1026j0336k6312l133p224l172
8490a4164J7262J2475P189M64M332r545m566M783r54l631Q149o727m057m851J131
8475G290J1008m119J1315J052p274l492j954l62j7113r156L172J6928O725N254
$$ plain form
8461 19274 28517 28875 29430 26148 18759 11149 7544 -7491 -16900 -11438 5762 -234 -4130 -1677 -7617
8446 -7617 -21036 -22685 -5246 7379 5134 3489 12619 11808 1273 1363 59 5905 15171 13997 7124
8431 7124 6873 18595 25712 24955 22107 13820 2673 8834 5916 -4348 -18569 -9629 -12864 2280
8417 2280 6271 11400 7215 17005 19405 33286 31787 19903 20606 33708 27511 31623 22480 22810 33294
8402 33294 37660 39509 28746 26053 23400 23634 13474 -803 -169 16966 31039 33424 16040 -13598
8388 -13598 -27850 -47097 -50548 -43040 -37516 -32721 -7375 16730 18680 20691 13798 2097 -4805
8375 -4805 -6785 -3423 -8763 -4789 3620 -2798 -6521 -16164 -3307 10092 14644 17505 15878 -1476
8361 -1476 -15948 -15141 -5433 9545 15541 30819 35741 28994 25994 25833 23087 20239 20327 21240 -7908
$$ packed form
8461A9274R243L58N55l282p389p610l605j5035r409N462J7200n996l896K453n940
8446g617j3419j649J7439J2625k245j645R130q11j0535R0j304N846R266j174o873
8431G124k51J1722P117p57k848q287j1147O161k918j0264j4221Q940l235J5144
8417B280L991N129m185R790K400J3881j499j1884P03J3102o197M112r143L30J0484
8402C3294M366J849j0763k693k653K34j0160j4277O34J7135J4073K385j7384k9638
8388a3598j4252j9247l451P508N524M795K5346K4105J950K011o893j1701o902
8375d805j980L362n340L974Q409o418l723r643J2857J3399M552K861j627j7354
8361a476j4472Q07R708J4978N996J5278M922o747l000j61k746k848Q8R13k9148
$$ plain form
8346 -7908 -22032 -13320 13134 17298 -599 8627 17093 24996 16775 14515 12151 13555 16325 13695
8332 13695 260 -6500 -19936 -13750 -8535 -3128 -2995 2661 984 16256 18499 5324 935 9121
8318 9121 9544 2995 6393 19623 14920 2951 1921 -5918 -3588 7820 22917 28956 24263 16099
8304 16099 23419 18870 874 -16431 -8942 7326 -5566 -20103 -6952 4904 10219 13573 22350
8291 22350 10273 -12588 -18492 -12377 -16799 -5912 -934 7247 16606 23013 12362 10152 13010 12573
8277 12573 11784 1103 -11791 -11671 -2490 -11440 -26000 -25216 -12499 6023 14123 27094 29403 35568
8263 35568 40310 22398 8241 11854 6281 -692 -763 3489 5117 -833 2157 7575 12455 12145 13856
8248 13856 7023 7553 10128 15272 12101 11894 11847 15828 16315 13574 9047 3113 6097 15970 8931 12197
$$ packed form
8346g908j4124Q712K6454M164j7897R226Q466P903q221k260k364J404K770k630
8332A3695j3435o760j3436O186N215N407J33N656j677J5272K243j3175m389Q186
8318I121M23o549L398J3230m703j1969j030p839K330J1408J5097O039m693q164
8304A6099P320m549j7996j7305P489J6268j2892j4537J3151J1856N315L354Q777
8291B2350j2077k2861n904O115m422J0887M978Q181R359O407j0651k210K858m37
8277A2573p89j0681j2894J20R181q950j4560P84J2717J8522Q100J2971K309O165
8263C5568M742j7912j4157L613n573o973p1M252J628n950K990N418M880l10J711
8248A3856o833N30K575N144l171k07m7L981M87k741m527n934K984R873p039L266
$$ plain form
8232 12197 17253 28048 40063 33459 19739 16134 20763 16534 14065 14818 7874 738 17530 25988
8218 25988 11135 12090 -3240 1732 10327 6544 -2080 -17317 -27179 -22449 -5725 6077 6893 7968
8204 7968 3237 -5531 -1829 5775 12519 19263 15283 14964 15349 20953 1214 -17428 -27371 -20119 -14994
8189 -14994 -12611 -13172 -4228 1350 -10220 -4109 7838 8153 3182 -4449 4701 4492 -1270 -6317 401
8174 401 -8231 -3347 -6017 564 -5742 -9993 -12256 -7073 -3752 6627 12370 15187 23538 25876 21281
8159 21281 7979 20665 19410 20698 13045 10297 15516 19749 14424 5705 5723 9184 6431 -527 -7229
8144 -7229 -9169 -8907 3978 14486 2143 -15582 -26062 -23819 -18328 -18477 -20743 -30938 -25415 -28075
8130 -28075 -19504 -11626 -8395 -317 95 11571 23623 5703 -24636 -27309 -9921 -18456 -35273
$$ packed form
8232A2197N056J0795J2015o604j3720l605M629m229k469P53o944p136J6792Q458
8218B5988j4853R55j5330M972Q595l783q624j5237r862M730J6724J1802Q16J075
8204G968m731q768L702P604O744O744l980l19L85N604j9739j8642r943P252N125
8189a4994K383n61Q944N578j1570O111J1947L15m971p631R150k09n762n047O718
8174D01q632M884k670O581o306m251k263N183L321J0379N743K817Q351K338m595
8159B1281j3302J2686j255J288p653k748N219M233n325q719J8L461k753o958o702
8144g229j940K62J2885J0508j2343j7725j0480K243N491j49k266j0195N523k660
8130b8075Q571P878L231Q078M12J1476J2052j7920l0339k673J7388q535j6817
$$ plain form
8117 -35273 -32949 -20756 -14856 -2143 -6044 -5414 -14220 2 -1759 -4235 -2507 5360 741 -2993
8103 -2993 -4412 -5543 -18208 -13249 -11853 -13030 -24328 -16876 -7209 -3984 -1805 7442 18998 9406
8089 9406 16346 14386 10941 8820 9790 8783 17481 13973 7961 -4063 -1618 7561 12424 3062 -20741
8074 -20741 -22554 -32692 -48649 -41920 -16060 -3536 -1004 -3460 -11665 -17887 -12067 -2523 6633 -6929
8060 -6929 -9543 -11803 -22118 -17704 -956 2563 -1681 -12687 -8763 1395 -218 -4508 3232 14974
8046 14974 21964 27584 19369 14526 12619 11657 3197 -2558 -6889 -6126 -1111 -563 144 13788 26480
8031 26480 28959 25530 4919 -2183 -3077 -10532 -6103 11826 15161 5794 -12824 -9496 469 5849
8017 5849 7433 2068 -2613 -9471 -2057 4028 11658 20161 12181 -2441 9961 18731 20691 13555
$$ packed form
8117c5273K324J2193N900J2713l901O30q806J4222j761k476J728P867m619l734
8103b993j419j131j2665M959J396j177j1298P452R667L225K179R247J1556r592
8089I406O940j960l445k121R70j007Q698l508o012j2024K445R179M863r362k3803
8074b0741j813j0138j5957O729K5860J2524K532k456q205o222N820R544R156j3562
8060f929k614k260j0315M414J6748L519m244j1006L924J0158j613m290P740J1742
8046A4974O990N620q215m843j907r62q460n755m331P63N015N48P07J3644J2692
8031B6480K479l429k0611p102q94p455M429J7929L335r367j8618L328R965N380
8017E849J584n365m681o858P414O085P630Q503p980j4622J2402Q770J960p136
$$ plain form
8003 13555 -4682 905 3722 -313 -12265 -9897 11742 21645 14361 -4108 -6061 3672 -6100 -8122
7989 -8122 4664 4576 201 -23305 -32794 -28095 -14176 -4486 12414 13427 6067 1889 13026 5857
7975 5857 3442 12041 11289 6312 -4208 -19838 -13935 2448 -2536 -6851 9525 15007 13172 16179
7961 16179 5731 -6942 -6228 -9507 -17579 -19220 -8045 -6102 -14083 5602 17396 22535 18707 30003
7947 30003 41928 33262 19913 20984 19525 -1266 -10440 -21522 -16491 -6801 -2424 3608 632 3759
7933 3759 403 9627 15733 -2001 -22230 -27829 -23562 -10324 -4897 -9953 -20001 -13487 -13373 -19486
7919 -19486 -11517 -8822 2607 7253 -9565 -1351 11483 15235 13886 -831 -8374 -10564 -7591 -22463
7905 -22463 -33645 -23777 -13461 -11643 -9760 -12862 -24122 -18542 -3563 1702 1533 -4222 -10858 -4968
$$ packed form
8003A3555j8237N587K817m035j1952K368K1639R903p284j8469j953R733r772k022
7989h122J2786q8m375k3506r489M699J3919R690J6900J013p360m178J1137p169
7975E857k415Q599p52m977j0520j5630N903J6383m984m315J6376N482j835L007
7961A6179j0448j2673P14l279q072j641J1175J943p981J9685J1794N139l828J1296
7947C0003J1925q666j3349J071j459k0791r174j1082N031R690M377O032k976L127
7933C759l356R224O106j7734k0229n599M267J3238N427n056j0048O514J14o113
7919a9486P969K695J1429M646j6818Q214J2834L752j349j4717p543k190K973j4872
7905b2463j1182R868J0316J818J883l102j1260N580J4979N265j69n755o636N890
$$ plain form
7891 -4968 -14292 -18835 -22635 -23039 -17602 1285 2225 22677 22300 11167 22136 26728 14685 1875
7877 1875 -16247 -14091 3585 1124 -5073 -10021 4767 14286 16072 15238 -1477 -2704 -10536 1870
7863 1870 13785 11598 -652 -6223 1593 9465 6709 -5832 6164 3955 3261 -136 536 14539
7849 14539 16392 2755 1361 103 12543 18537 11240 -2189 -9346 -15308 -15920 -12347 -3966 -4460
7835 -4460 -1893 -5314 -1687 -7297 -7591 -8726 -6467 784 -11271 -22237 -17715 -10925 -12597 -7188 -8503
7820 -8503 -10368 -7165 2473 2836 10165 23927 27198 14485 12451 -229 -3823 7054 8828 9097
7806 9097 15061 1544 -3284 8780 21788 11521 5314 11268 12594 20634 11529 6709 13052 13650
7792 13650 4229 -2423 10325 20753 32946 43871 36033 17660 8752 18287 15272 7275 -12946
$$ packed form
7891d968r324m543l800m04N437J8887R40K0452l77j1133J0969M592j2043j2810
7877A875j8122K156J7676k461o197m948J4788R519J786q34j6715j227p832J2406
7863A870J1915k187j2250n571P816P872k756j2541J1996k209o94l397O72J4003
7849A4539J853j3637j394j258J2440N994p297j3429p157n962o12L573Q381m94
7835d460K567l421L627n610k94j135K259P251j2055j0966M522O790j672N409j315
7820h503j865L203R638L63P329J3762L271j2713k034j2680l594J0877J774K69
7806I097N964j3517m828J2064J3008j0267o207N954J326Q040r105m820O343N98
7792A3650r421o652J2748J0428J2193J0925p838j8373q908R535l015p997k0221
$$ plain form
7779 -12946 -5961 6867 -5921 -20048 -20789 -19110 -18642 -14910 -16853 -17785 -15465 -10802 -21590 -38141
7765 -38141 -39987 -33214 -31927 -21684 -19956 -18867 -20615 -24967 -20962 -5921 6485 6482 154 -3340 -4347
7750 -4347 -3241 -12837 -15933 -26299 -24728 -27804 -24447 -18428 -11897 -12210 -12867 -4197 609 -3409 -9501
7735 -9501 -7174 -1224 8335 7109 6702 -284 -11561 -18341 -5032 20056 10941 -5359 -4904 -3498
7721 -3498 -3109 1046 14674 18536 15646 8525 3557 4406 2203 5376 7403 11333 14544 6045 -1612
7706 -1612 13858 17361 26336 29102 20919 13325 9838 3198 9375 17108 5458 4582 -2975 -179 -19371
7691 -19371 -16794 -897 2108 -1704 -3899 -5205 323 -662 -9476 -7595 -6905 -11763 -5312 1533 2596
7676 2596 -6731 -17327 -10182 8495 26985 27156 25599 31226 15572 258 -7594 -12584 -16620 -15807
$$ packed form
7779a2946O985J2828j2788j4127p41J679M68L732j943r32K320M663j0788j6551
7765c8141j846O773J287J0243J728J089j748m352M005J5041J2406lo328l494j007
7750d347J106r596l096j0366J571l076L357O019O531l13o57Q670M806m018o092
7735i501K327N950R559j226m07o986j1277o780J3309K5088r115j6300M55J406
7721c498L89M155J3628L862k890p121m968Q49k203L173K027L930L211q499p657
7706a612J5470L503Q975K766q183p594l487o640O177P733j1650q76p557K796j9192
7691a9371K577J5897L005l812k195j306N528r85q814J881O90m858O451O845J063
7676B596r327j0596P145J8677J8490J71j557N627j5654j5314p852m990m036Q13
$$ plain form
7662 -15807 -15945 -17109 -12688 8373 19875 9759 -2025 334 -1744 -13238 -18678 -3578 3797
7649 3797 -688 -2849 -5788 -12260 1426 8614 14203 -3673 -5374 -4114 -935 -1831 -5245 825 -1348
7634 -1348 -8967 -11486 -8841 6979 7625 5122 14645 24521 10317 239 -4699 -11589 -2636 -6364
7620 -6364 -7656 -4084 11264 16316 2343 -1289 -10892 -15057 -12611 -3814 -9163 -11206 -3569 -1724
7606 -1724 -1824 -23178 -27201 -21516 -10631 -7699 1442 6599 -4095 -3671 1247 -2679 -134 8861 8455
7591 8455 10363 2520 1368 -3023 -9157 6100 12358 10290 -274 -14768 -24065 -16717 -14148 -16245
7577 -16245 -11612 4265 10255 10515 10917 10489 -116 -12127 -24165 -19602 -25562 -16887 -8658 -10837
7563 -10837 -7280 -271 4411 -5886 -9413 -9399 -1944 -11415 -20763 -19752 -6822 -2478 -2161 -9495 -19948
$$ packed form
7662a5807j38j164M421K1061J1502j0116j1784K359k078j1494n440J5100P375
7649C797m485k161k939o472J3686P188N589j7876j701J260L179q96l414O070k173
7634a348p619k519K645J5820O46k503R523R876j4204j0078m938o890Q953l728
7620f364j292L572J5348N052j3973l632r603m165K446Q797n349k043P637J845
7606a724j00k1354m023N685J0885K932R141N157j0694M24M918l926K545Q995m06
7591H455J908p843j152m391o134J5257O258k068j0564j4494r297P348K569k097
7577a6245M633J5877N990K60M02m28j0605j2011j2038M563n960Q675Q229k179
7563a0837L557P009M682j0297l527J4P455r471r348J011J2930M344L17p334j0453
$$ plain form
7548 -19948 -20504 -15187 -23269 -27909 -20177 -29299 -34691 -25261 -4888 6923 8072 -927 -11506 -11117
7534 -11117 -2643 -1604 2127 13191 12998 1565 -3595 -231 2448 -3853 -11118 -17998 -10196 -9421 -4631
7519 -4631 11601 6962 -12297 -19743 -5653 11770 13812 10907 6380 -4955 -18076 -15927 -17428
7506 -17428 -17287 -18084 -22376 -20883 -12755 -10833 -708 -1786 -4627 -7102 -18569 -9133 8286 5871
7492 5871 16285 14196 4170 1284 -4141 1300 -4781 3890 -187 -15475 -12109 -10325 -9856 -7883
7478 -7883 9226 23144 27819 17615 17738 -2744 -23117 -24536 -11323 -12956 -32151 -31621 -13825
7465 -13825 2610 6715 8481 -1133 -5333 3484 8970 218 4062 158 324 3796 1829 -467 6256
7450 6256 9292 -2875 -4728 -13427 -30424 -27479 -28831 -19202 -336 1819 8372 1494 2775 2493
$$ packed form
7548a9948n56N317q082m640P732r122n392R430K0373J1811J149q999j0579L89
7534a1117Q474J039L731J1064j93j1433n160L364K679o301p265o880P802P75M790
7519d631J6232m639j9259p446J4090J7423K042k905m527j1335j3121K149j501
7506a7428J41p97m292J493Q128J922J0125j078k841k475j1467R436J7419k415
7492E871J0414k089j0026k886n425N441o081Q671m077j5288L366J784M69J973
7478g883J7109J3918M675j0204J23k0482k0373j419J3213j633j9195N30J7796
7465a3825J6435M105J766r614m200Q817N486q752L844l904J66L472j967k296O723
7450F256L036j2167j853q699j6997K945j352R629J8866K155O553o878J281k82
$$ plain form
7436 2493 1402 5331 1104 -5094 -12191 -13393 -11986 -963 5094 10688 29 -1378 -4689 -11589
7422 -11589 -14661 -23672 -19776 -27241 -32116 -28085 -28538 -12875 -15389 -10439 -2422 3529 6684 2356 -2800
7407 -2800 2912 -3348 -5600 -2236 -4678 -17588 -15659 -6917 -6324 -13822 -14087 -12799 -16566 -2259 8761
7392 8761 12328 -15046 -15144 -7001 -3085 -2195 4139 -27 -8434 -9694 -9086 -8567 -5133 4605 9394 9385 4645
7375 4645 3603 1492 -14505 -10132 12856 17080 15533 19142 21755 -50 2845 5861 10599 6914
7361 6914 22966 23597 12548 8189 16007 19426 12551 3253 5514 13318 18714 15212 9915 635 503
7346 503 -2980 -8084 5989 819 -960 -9647 -11562 2000 26644 13170 -14991 -27906 -19759 -967
7332 -967 3355 1401 -3419 -17889 -6653 10236 8501 -9570 -23014 -26509 -14164 -5201 -10903 3752
$$ packed form
7436B493j091L929m227o198p097j202J407J1023O057N594j0659j407l311o900
7422a1589l072r011L896p465m875M031m53J5663k514M950Q017N951L155m328n156
7407b800N712o260k252L364k442j2910J929Q742N93p498k65J288l767J4307J1020
7392H761L567k7374r8Q143L916Q90O334m166q407j260O08N19L434R738M789rm740
7375D645j042k111j5997M373K2988M224j547L609K613k1805K895L016M738l685
7361F914J6052O31j1049m359P818L419o875r298K261P804N396l502n297r280j32
7346E03l483n104J4073n170j779q687j915J3562K4644j3474k8161j2915Q147J8792
7332i67M322j954m820j4470J1236J6889j735j8071j3444l495J2345Q963n702J4655
$$ plain form
7318 3752 14265 3420 8018 6939 9249 7455 3557 -4991 -16190 -11713 -3162 -3208 -10658 -1169 5429
7303 5429 13881 11951 6899 -7101 -5539 -5551 -3674 5963 638 -1284 1942 -5380 -4931 4689 10905
7288 10905 5580 10252 8816 -4358 -19720 -16795 -12778 -17016 -9782 -2386 -6385 -8339 569 -1054
7274 -1054 -16493 -25438 -9057 -9922 -7961 -227 -1649 6831 16406 10793 1142 6603 17656 -5035
7260 -5035 -25541 -32934 -37703 -24069 -10843 -7764 -7284 1564 9052 2865 -19543 -26751 -13699 1103
7246 1103 -4498 -8671 -6748 6625 13442 19233 18139 12892 11145 1184 -8317 -15051 -9675 -6572 -4153
7231 -4153 5146 9199 425 -9842 -24920 -36232 -26983 -8606 -9264 -21493 -3747 1207 9898 373
7217 373 -10793 -14680 -21235 -26449 -13247 -8636 -4238 2678 -7094 -6076 -1925 8947 3108 477
$$ packed form
7318C752J0513j0845M598j079K310j794l898q548j1199M477Q551m6p450R489O598
7303E429Q452j930n052j4000J562j2J877R637n325j922L226p322M49R620O216
7288A0905n325M672j436j3174j5362K925M017m238P234P396l999j954Q908j623
7274a054j5439q945J6381q65J961P734j422Q480R575n613r651N461J1053k2691
7260e035k0506p393m769J3634J3226L079M80Q848P488o187k2408p208J3052J4802
7246A103n601m173J923J3373O817N791j094n247j747r961r501o734N376L103K419
7231d153R299M053q774j0267j5078j1312R249J8377o58j2229J7746M954Q691r525
7217C73j1166l887o555n214J3202M611M398O916r772J018M151J0872n839k631
$$ plain form
7203 477 12563 4550 1192 -431 -8180 -32242 -26138 -21675 -18483 -9164 -12501 -21518 -27270 -29738 -27164
7188 -27164 -16687 -11705 -11426 -13353 -5205 2371 4135 1345 11384 7430 5004 3683 8611 13984
7174 13984 4944 -5006 -19030 -29595 -23661 -8327 6337 12184 3271 1623 5639 2266 -1799 12126
7160 12126 28382 24365 22421 16468 2523 9273 -1408 -81 8841 11398 220 -5256 -22075
7147 -22075 -10526 16772 18696 21510 10101 5738 -4977 -24733 -24386 -19395 -13193 -7103 -7403 -7488
7133 -7488 -4199 -2649 145 3710 -15429 -18660 -12497 -15531 -11966 -18176 -24784 -26202 -6688 -12346
7119 -12346 -19889 -22402 -24177 -18529 -14320 -25944 -17561 -10348 -3646 -1322 -6039 -12618 -17536 -3927
7105 -3927 12921 9500 10212 11190 5843 8146 -1672 -5292 2980 -6306 -20276 -39983 -32565 -18811
$$ packed form
7203D77J2086q013l358j623p749k4062O104M463L192R319l337r017n752k468K574
7188b7164J0477M982K79j927Q148P576J764k790J0039l954k426j321M928N373
7174A3984r040r950j4024j0565N934J5334J4664N847q913j648M016l373m065J3925
7160A2126J6256m017j944n953j3945O750j0681J327Q922K557j1178n476j6819
7147b2075J1549K7298J924K814j1409m363j0715j9756L47M991O202O090l00q5
7133g488L289J550K794L565j9139l231O163l034L565o210o608j418J9514n658
7119a2346p543k513j775N648M209j1624Q383P213O702K324m717o579m918J3609
7105c927J6848l421P12R78n347K303r818l620Q272r286j3970j9707P418J3754
$$ plain form
7091 -18811 -12209 -8769 -16090 -27425 -15817 -2658 4600 1367 -7990 -17846 -19366 -17685 -10833 -15446
7077 -15446 -16208 -17150 -15532 -20174 -20579 -15847 2271 28506 30009 21405 17763 22784 18962 25289 31151
7062 31151 37757 25692 9335 6128 4113 10601 12523 27848 34514 23903 15596 19247 37081
7049 37081 29167 15016 3477 -1250 -4737 -8980 -16559 -8558 -3382 -24151 -32496 -20230 -19124 -20402
7035 -20402 -6647 -5908 -8424 -10464 -1781 21072 19760 15591 19038 3810 -9532 -22300 -20077 -13644
7021 -13644 -20268 -15915 -5112 -1096 -8479 -6324 7217 6863 7310 3471 530 -2106 -13521 -13443 -6198
7006 -6198 6040 4104 -10744 -16867 -13926 2259 5605 -2419 -11717 -17483 -13877 -6157 -10945 -18211
6992 -18211 -14947 -2614 -1963 744 4720 5178 515 -6743 -12433 -12015 -7934 -3238 -2428 -15005 -23493
$$ packed form
7091a8811O602L440p321j1335J1608J3159P258l233r357r856j520J681O852m613
7077a5446p62r42J618m642m05M732J8118K6235J503q604l642N021l822O327N862
7062C1151O606j2065j6357l207k015O488J922J5325O666j0611q307L651J7834
7049C7081p914j4151j1539m727l487m243p579Q001N176k0769q345J2266J106j278
7035b0402J3755P39k516k040Q683K2853j312m169L447j5228j3342j2768K223O433
7021a3644o624M353J0803M016p383K155J3541l54M47l839k941k636j1415P8P245
7006f198J2238j936j4848o123K941J6185L346q024r298n766L606P720m788p266
6992a8211L264J2333O51K707L976M58m663p258n690M18M081M696Q10j2577q488
$$ plain form
6977 -23493 -14166 -25612 -14337 -13959 -20264 -28814 -27877 -37230 -36588 -17799 -21652 -27984 -27748 -26883 -24429
6962 -24429 -18202 -4232 8927 -724 -13057 -16496 -2820 -9258 -15691 -24394 -32016 -35256 -37741 -37157
6948 -37157 -33060 -21240 -26457 -16105 -4823 -10352 -23722 -23893 -22069 -26837 -31141 -27859 -16573 -2221
6934 -2221 2766 253 4226 1723 -18394 -22466 -14460 -13488 -8653 -550 -2889 1060 9555 2535 -6004
6919 -6004 5151 8104 -985 -7289 -6477 5182 14349 13686 -172 2013 2089 1228 577 -331 -4065 3678
6903 3678 4320 -1816 5563 5595 -6963 -18374 -20895 -12751 -8494 -9826 2433 7333 144 4729 -5910
6888 -5910 -14057 -14084 -13925 -23392 -15781 3056 7664 206 -6403 -1287 11729 15046 13307 13562 17352
6873 17352 9955 6269 6083 9156 14067 13972 9328 16664 15257 -3262 -16882 -10035 2515 11391 -13134
$$ packed form
6977b3493R327j1446J1275L78o305q550R37r353O42J8789l853o332K36Q65K454
6962b4429O227J3970J3159r651j2333l439J3676o438o433q703p622l240k485N84
6948c7157M097J1820n217J0352J1282n529j3370j71J824m768m304L282J1286J4352
6934b221M987k513L973k503k0117m072Q006R72M835Q103k339L949Q495p020q539
6919f004J1155K953r089o304Q12J1659R167o63j3858K185P6q61o51r08l734P743
6903C678O42o136P379L2j2558j1411k521Q144M257j332J2259M900p189M585j0639
6888e910q147k7J59r467P611J8837M608p458o609N116J3016L317j739K55L790
6873A7352p397l686j86L073M911r5m644P336j407j8519j3620O847J2550Q876k4525
$$ plain form
6858 -13134 -20616 -17629 -27750 -39161 -40159 -32265 -24744 -17595 -13190 -13305 -12413 2757 12462 6948 -9985
6843 -9985 -13656 7640 -1384 -91 3378 8290 2034 -4163 -5741 569 4860 -3192 -8948 -21358
6829 -21358 -25529 -29021 -21865 -13758 -2707 9226 20795 305 -10564 -5348 3851 -8253 -21473
6816 -21473 -23588 -19596 -19912 -10597 4258 14347 10089 10627 12827 17290 18714 7572 11764 27769
6802 27769 22047 8051 -16633 -28724 -31464 -18943 -4956 6312 5574 11750 2628 -5030 -289
6789 -289 17071 34591 26419 12495 9042 5716 2071 -9228 -11830 -3222 -9404 -12065 -4059 2609
6775 2609 9751 9589 43 -9425 -7684 -16762 -13058 4418 9366 7236 -3467 -904 7847 -6538
6761 -6538 -8325 -8330 -4861 6749 16406 13796 9222 2740 1464 -10215 -18061 -21166 -20582 -11522 -12570
$$ packed form
6858a3134p482K987j0121j1411r98P894P521P149M405j15Q92J5170R705n514j6933
6843i985l671K1296r024J293L469M912o256o197j578O310M291q052n756j2410
6829b1358m171l492P156Q107J1051J1933J1569k0490j0869N216R199j2104j3220
6816b1473k115L992l16R315J4855J0089m258N38K200M463J424j1142M192J6005
6802B7769n722j3996k4684j2091k740J2521J3987J1268p38O176r122p658M741
6789b89J7360J7520q172j3924l453l326l645j1299k602Q608o182k661Q006O668
6775B609P142j62r546r468J741r078L704J7476M948k130j0703K563Q751j4385
6761f538j787nL469J1610R657k610m574o482j276j1679p846l105N84R060j048
$$ plain form
6746 -12570 -10141 5856 24346 30533 23140 16353 20349 24100 25541 24819 21421 19903 24572 17233
6732 17233 4700 7982 6112 11632 11842 13296 11544 -11402 -33457 -23079 -15910 -20955 -18807 -4220
6718 -4220 5442 10280 -2363 3947 5554 -80 2138 6781 -5197 1993 -2717 -6489 6000 23697
6704 23697 15050 1126 -5606 -11588 -12249 -18974 -17939 -3839 -7510 -9965 125 4533 11913 -556
6690 -556 -5893 -7852 -5851 12164 19114 -3694 -25166 -26260 -10031 1909 -1528 -230 2049 -2146
6676 -2146 -9145 -8146 -785 -6848 8114 9536 -2153 -7708 -20696 -16143 6829 9332 6315 13240
6662 13240 7950 -4689 -10797 -1990 -10348 -11087 -9800 -10971 -9232 -17519 -24792 -26857 -25062 -23366 -22510
6647 -22510 -19371 -19576 -28797 -26872 -11576 3818 -1735 -11768 -5354 -7844 -3107 -2200 9319 14545
$$ packed form
6746a2570K429J5997J8490O187p393o787L996L751J441p22l398j518M669p339
6732A7233j2533L282j870N520K10J454j752k2946k2055J0378P169n045K148J4587
6718d220R662M838j2643O310J607n634K218M643j1978P190m710l772J2489J7697
6704B3697q647j3924o732n982o61o725J035J4100l671k455J0090M408P380j2469
6690e56n337j959K001J8015O950k2808k1472j094J6229J1940l437J298K279m195
6676b146o999R99P361o063J4962J422j1689n555j2988M553K2972K503l017O925
6662A3240n290j2639o108Q807q358p39J287j171J739q287p273k065J795J696Q56
6647b2510L139k05r221J925J5296J5394n553j0033O414k490M737R07J1519N226
$$ plain form
6633 14545 2538 -5717 -14619 -20960 -21938 -15088 2028 2154 -666 -11667 -24767 -13360 -2522 -347
6619 -347 1039 19435 23075 32058 17997 19643 19510 20410 25893 14448 15519 11574 7845 13958 18742
6604 18742 26585 10275 6505 14492 16813 8802 -904 -13683 -13782 -7622 -3630 -9621 -12927 -19689 -31257
6589 -31257 -25227 -14410 -10230 -3483 2356 -5305 -8104 -1914 11067 14317 25623 17629 12552 2359
6575 2359 -2302 -963 -1511 -5823 -820 23114 15345 3231 12624 14039 19781 19297 29586 22461 8679
6560 8679 -1141 -1059 4784 22075 22212 13211 7492 1901 -2294 -6189 -10359 -8267 -1006 -1558 1316 5988
6544 5988 9415 17162 23930 20290 16540 11806 -4423 -18011 -32244 -21029 -9078 -2221 5619 9307
6530 9307 4924 -10378 -10001 -14868 -29354 -21445 -14733 -20673 -28444 -26037 -26087 -31673 -38849 -28010 -18466
$$ packed form
6633A4545j2007q255q902o341r78O850J7116J26k820j1001j3100J1407J0838K175
6619c47J386J8396L640Q983j4061J646j33R00N483j1445J071l945l729O113M784
6604A8742P843j6310l770P987K321q011r706j2779r9O160L992n991l306o762j1568
6589c1257O030J0817M180O747N839p661k799O190J2981L250J1306p994n077j0193
6575B359m661J339n48m312N003K3934p769j2114R393J415N742m84J0289p125j3782
6560H679r820Q2N843J7291J37r001n719n591m195l895m170K092P261n52K874M672
6544E988L427P747O768l640l750m734j6229j3588j4233J1215J1951O857P840L688
6530I307m383j5302L77m867j4486P909O712n940p771K407n0n586p176J0839R544
$$ plain form
6515 -18466 -11751 1676 15298 13433 340 -11164 -31201 -25857 -16615 -30747 -33177 -23217 -5347
6502 -5347 -2306 -1983 -4442 -6476 1689 4852 6148 -3782 -8004 -7220 -8599 -7746 1352 12520 17773
6487 17773 6820 5348 1885 9063 -96 -11596 -6505 -4763 -7974 -7221 8115 804 -9554 388
6473 388 1679 -4310 -8174 -12928 2411 9409 7478 13645 2009 335 -2696 -19073 -25528 -12989
6459 -12989 -5120 -5755 -8759 -7083 -1571 -13109 -22319 -22920 -35191 -30824 -15927 4467 10595 8944
6445 8944 15339 17226 24227 9438 -7230 -7840 -6671 -8193 1833 7693 1677 -1335 2763 10893
6431 10893 8329 4356 8153 32205 38174 34894 24875 11795 -2788 -14765 -13055 -7709 -6874 -11175
6417 -11175 -12965 -2734 5990 16499 22496 17307 14535 16984 26955 36362 28691 25897 19429 11698
$$ packed form
6515a8466O715J3427J3622j865j3093j1504k0037N344R242j4132k430R960J7870
6502e347L041L23k459k034Q165L163J296r930m222P84j379Q53R098J1168N253
6487A7773j0953j472l463P178r159j1500N091J742l211P53J5336p311j0358R942
6473C88J291n989l864m754J5339O998j931O167j1636j674l031j6377o455J2539
6459a2989P869o35l004J676N512j1538r210o01j2271M367J4897K0394O128j651
6445H944O395J887P001j4789j6668o10J169j522J0026N860o016l012M098Q130
6431A0893k564l973L797K4052N969l280j0019j3080j4583j1977J710N346Q35m301
6417a1175j790J0231Q724J0509N997n189k772K449R971R407p671k794o468p731
$$ plain form
6403 11698 4482 8548 4313 1811 6063 -2760 -1680 422 13105 -3512 -2878 6378 -4854 -27508
6389 -27508 -26267 -9596 -950 -10485 -19499 -5899 8511 16765 17004 10664 -5248 -3630 7689 6670
6375 6670 11093 15414 13334 11566 6378 11319 22282 13642 11507 12434 13147 13750 7548 3226 11925
6360 11925 29201 46206 34629 40723 51876 37499 23888 16848 10518 7957 -13392 -34015 -37121
6347 -37121 -18388 5271 11165 13407 11966 13563 8527 12973 6904 -10006 -910 912 -19181 -25314
6333 -25314 -18794 -13801 -4284 -3467 -10086 -15804 -11900 -5947 7101 2019 -1094 -11808 -24723 -23165
6319 -23165 -19630 -3770 13301 10114 5061 9614 3499 -133 16797 26148 15285 16190 21764 12368
6305 12368 3981 -8266 -4411 290 6732 3795 2099 1391 -2810 -8806 -3697 -7788 -15647 -1490
$$ packed form
6403A1698p216M066m235k502M252q823J080K102J2683j6617O34R256j1232k2654
6389b7508J241J6671Q646r535r014J3600J4410Q254K39o340j5912J618J1319j019
6375F670M423M321k080j768n188M941J0963q640k135R27P13O03o202m322Q699
6360A1925J7276J7005j1577O094J1153j4377j3611p040o330k561k1349k0623l106
6347c7121J8733K3659N894K242j441J597n036M446o069j6910R096J822k0093o133
6333b5314O520M993R517Q17o619n718L904N953J3048n082l113j0714j2915J558
6319b3165L535J5860J7071l187n053M553o115l632J6930R351j0863R05N574r396
6305A2368q387j2247L855M701O442k937j696p08m201n996N109m091p859J4157
$$ plain form
6291 -1490 12972 -27 -2306 -7938 -10660 -1910 7237 -1979 -4966 -3633 -4073 306 -8314 -16071 -18475
6276 -18475 -5354 -162 -3787 -617 7204 -4243 -9316 -11100 -13188 -4026 189 -5577 -4662 1842
6262 1842 6147 -3545 -12490 -18124 -10475 2087 3934 -1848 4899 2921 -2793 -22577 -24198 -4284
6248 -4284 -585 -7489 -374 2959 10553 15100 8482 4968 15819 12490 3534 -12532 -21791 -13440
6234 -13440 -13946 -16961 1191 7250 5339 -7011 -11246 -14918 -22527 -14089 -25829 -23321 -8848 -1478
6220 -1478 -14928 -11330 -7529 -13177 -14714 -13752 457 -497 -6058 -19825 -21835 -9805 -10958 -9984 4389
6205 4389 15836 22309 19442 4965 3048 -8411 -17714 -9511 -10502 -14338 -4297 9549 21269 12022
6191 12022 11886 4770 72 -1180 -3241 -3257 1432 4787 -3839 -6297 -7189 -17398 -11469 2565 15015
$$ packed form
6291a490J4462j2999k279n632k722Q750R147r216k987J333m40M379q620p757k404
6276a8475J3121N192l625L170P821j1447n073j784k088R162M215n766R15O504
6262A842M305r692q945n634P649J2562J847n782O747j978n714j9784j621J9914
6248d284L699o904P115L333P594M547o618l514J0851l329q956j6066r259Q351
6234a3440n06l015J8152O059j911j2350m235l672p609Q438j1740K508J4473P370
6220a478j3450L598L801n648j537R62J4209r54n561j3767k010J2030j153R74J4373
6205D389J1447O473k867j4477j917j1459r303Q203r91l836J0041J3846J1720r247
6191A2022j36p116m698j252k061j6M689L355q626k458q92j0209N929J4034J2450
$$ plain form
6176 15015 21841 16614 16503 16814 11603 8629 15971 15800 13801 -368 -3437 13010 10862 4236 -4612
6161 -4612 -13839 -14982 -13387 -5035 -5927 -3405 -2372 -3064 17774 25019 18733 14801 17687 4895 -5160
6146 -5160 7347 -148 -11915 -31757 -27395 -19119 -5455 4655 4957 -10710 -10386 -4858 -17794 -18494
6132 -18494 -20556 -20438 -21605 -22880 -21978 -21045 -24292 -5491 8154 1590 -1798 6582 20783 28796 17067
6117 17067 14505 27126 12948 -3604 4815 20273 16929 16177 7932 -9938 -19755 -33776 -29744
6104 -29744 -17662 5330 19684 12734 -7224 -22862 -23555 -22642 -16064 -2237 6090 9097 3049 19931
6090 19931 20336 5911 -6534 -3713 1696 -1614 -3565 -8361 -11883 -12370 -23614 -14735 -13220 -17727
6076 -17727 -14670 -24649 -24721 -12826 4162 1061 9344 10955 3239 -2359 -1103 -10272 -19736 -19548 -6175
$$ packed form
6176A5015O826n227j11L11n211k974P342j71j999j4169l069J6447k148o626q848
6161d612r227j143J595Q352q92K522J033o92K0838P245o286l932K886j2792j0055
6146e160J2507p495j1767j9842M362Q276J3664J0110L02j5667L24N528j2936p00
6132a8494k062J18j167j275R02R33l247J8801J3645o564l388Q380J4201Q013j1729
6117A7067k562J2621j4178j6552Q419J5458l344p52q245j7870r817j4021M032
6104b9744J2082K2992J4354o950j9958j5638o93R13O578J3827Q327L007o048J6882
6090A9931M05j4425j2445K821N409l310j951m796l522m87j1244Q879J515m507
6076a7727L057r979p2J1895J6988l101Q283J611p716n598J256r169r464J88J3373
$$ plain form
6061 -6175 -2813 -7168 -6926 -2435 -8595 -19689 -20156 -14640 -15601 -14142 -8286 -7044 275 -2828 -9073
6046 -9073 -6532 -3905 -16172 -25190 -12201 9549 17768 15864 4203 -16276 -12850 -16562 -15500 -3370
6032 -3370 2885 -1422 -5377 -17521 -30120 -26270 -28432 -25081 -9040 1040 -6954 -8885 -8446 -8270
6018 -8270 -9703 -2461 3408 9800 15035 7515 -9613 -9662 -6017 -14700 -10342 -8745 -28742 -32667 -25078
6003 -25078 -24945 -13890 -3167 3281 451 -6935 -6248 8320 15709 14488 20395 21416 3874 -12313
5989 -12313 -12414 7996 10253 6389 7889 5654 -13731 -26468 -15221 -1893 -6553 1416 3984 -9041
5975 -9041 -23428 -33054 -28104 -24206 -13155 -1668 24322 36336 18064 2734 4537 2038 -1633
5962 -1633 -1243 12550 15155 5342 5347 11305 6922 3086 544 -18108 -25059 -16036 -6441 -8905 -13168
$$ packed form
6061f175L362m355K42M491o160j1094m67N516r61J459N856J242P319l103o245
6046i073K541K627j2267r018J2989K1750Q219j904j1661k0479L426l712J062J2130
6032c370O255m307l955j2144j2599L850k162L351J6041J0080p994j931M39J76
6018h270j433P242N869O392N235p520j7128m9L645q683M358J597j9997l925P589
6003b5078J33J1055J0723O448k830p386O87J4568P389j221N907J021j7542j6187
5989a2313j01K0410K257l864J500k235j9385j2737J1247J3328m660P969K568j3025
5975i041j4387r626M950L898J1051J1487K5990J2014j8272j5330J803k499l671
5962a633L90J3793K605r813NN958m383l836k542j8652o951R023R595k464m263
$$ plain form
5947 -13168 -10978 -11550 1673 3861 2205 14850 15965 9797 3982 1166 -3711 -1566 -3200 1964
5933 1964 16257 24091 20457 15446 12428 5104 5775 18679 7822 -1488 2094 15068 10388 -1910
5919 -1910 -18262 -19128 -17987 -22106 -19475 -17545 -16389 -11720 -14564 -6905 -10016 -12214 -8624 -11835 -9527
5904 -9527 -1901 -9630 -8758 -1890 14148 2511 -16040 -28296 -8859 -4314 2520 -1170 -1393 -11636
5890 -11636 -10343 -23936 -13566 -1977 1199 4587 -10578 -17764 -25648 -10828 -3740 -9961 -10352 -11306
5876 -11306 -3142 -8135 -8276 -13164 -19342 -8228 -3867 -9395 -11232 -5944 -14466 -5199 -12628 -31669
5862 -31669 -21726 -23103 -24002 -28503 -20362 -10869 -6796 7086 13561 16739 13185 1199 -17178 -15167
5848 -15167 1929 6688 -8600 -14804 -22977 -31254 -24396 -27001 -15846 6389 10406 4211 9080 9516
$$ packed form
5947a3168K190n72J3223K188j656J2645J115o168n815k816m877K145j634N164
5933A964J4293P834l634n011l018p324O71J2904j0857r310L582J2974m680j2298
5919a910j6352q66J141m119K631J930J156M669k844P659l111k198L590l211K308
5904i527P626p729Q72O868J6038j1637j8551j2256J9437M545O834l690k23j0243
5890a1636J293j3593J0370J1589L176L388j5165p186p884J4820P088o221l91r54
5876a1306Q164m993j41m888o178J1114M361n528j837N288q522R267p429j9041
5862c1669R943j377q99m501Q141R493M073J3882O475L178l554j1986j8377K011
5848a5167J7096M759j5288o204q173q277O858k605J1155K2235M017o195M869M36
$$ plain form
5834 9516 14197 8352 -2376 -2645 10507 10755 -4384 -10406 -8220 6259 19259 6340 10149 10078
5820 10078 4731 3601 4675 444 -6979 5161 12947 16793 10209 -199 12717 20383 20047 12821
5806 12821 4578 -3528 -12893 -23450 -31901 -29574 -29694 -11285 -5724 -25139 -31316 -15018 -8747 17108
5792 17108 17986 -8905 -9612 -3513 -2687 -7445 -12102 -13352 -5319 -2555 1790 -9988 222 7102 4924
5777 4924 4281 8356 1154 3726 7359 4223 -5492 -3738 -2554 3516 7784 143 2796 6712 -18
5762 -18 -6240 -12755 -20107 -18927 -3310 13352 11657 7453 521 -13535 -10144 -2365 -295 -12599
5748 -12599 -8997 -18841 -24309 -17302 -8997 8210 13883 9801 362 5626 -9532 -10099 -10001 -11997 -6593
5733 -6593 -11045 -15346 -1132 5555 2294 -10121 -12311 -13750 -20537 -10499 7399 3475 -2815 -10573
$$ packed form
5834I516M681n845j0728k69J3152K48j5139o022K186J4479J3000j2919L809p1
5820A0078n347j130J074m231p423J2140P786L846o584j0408J2916P666l36p226
5806A2821q243q106r365j0557q451K327j20J8409N561j9415o177J6298O271K5855
5792A7108Q78k6891p07O099Q26m758m657j250Q033K764M345j1778J0210O880k178
5777D924o43M075p202K572L633l136r715J754J184O070M268p641K653L916o730
5762a8o222o515p352J180J5617J6662j695m204o932j4056L391P779K070j2304
5748a2599L602r844n468P007Q305J7207N673m082r439N264j5158n67R8j996N404
5733f593m452m301J4214O687l261j2415k190j439o787J0038J7898l924o290p758
$$ plain form
5719 -10573 -21637 -19845 -11486 -13024 -14313 -8935 -1179 -17674 -12752 -4868 -12219 -20247 -19113 -21858
5705 -21858 -29846 -25542 -6245 9526 10003 6068 -7680 6237 19286 19649 17171 11276 4602 11837
5691 11837 20498 19498 14120 15561 24594 32896 26010 9890 7992 -3163 -13375 -6872 -17616 -20522
5677 -20522 -12046 -8125 -3707 -2747 -16186 -12355 -16825 -12403 -5046 888 -1215 -4359 99 5478 8079
5662 8079 5360 -1728 -17532 -14141 -5870 -1272 -2749 810 3372 -8560 -9553 -2918 -8215 -3380 3911
5647 3911 -12017 -15006 -15528 -13747 7397 13811 14955 22589 7064 -3305 4913 -5648 -17846 -13766
5633 -13766 -7079 -6787 -8949 -12057 -13541 -11159 -7329 14832 6710 -6125 -6378 -1696 12862 13193 13560
5618 13560 14247 9004 702 -3177 2164 3678 3178 499 -8858 -11228 -5254 -10929 -10498 -3523 15951
$$ packed form
5719a0573j1064J792Q359j538j289N378P756j6495M922P884p351q028J134k745
5705b1858p988M304J9297J5771M77l935j3748J3917J3049L63k478n895o674P235
5691A1837Q661j000n378J441R033Q302o886j6120j898j1155j0212O503j0744k906
5677b0522Q476L921M418R60j3439L831m470M422P357N934k103l144M458N379K601
5662H079k719p088j5804L391Q271M598j477L559K562j1932r93O635n297M835P291
5647C911j5928k989n22J781K1144O414J144P634j5525j0369Q218j0561j2198M080
5633a3766O687K92k162l108j484K382L830K2161q122j2835k53M682J4558L31L67
5618A3560O87n243q302l879N341J514n00k679r357k370N974n675M31O975J9474
$$ plain form
5603 15951 24857 20490 9273 -9565 -9820 1413 8725 3628 -11706 -31174 -36002 -22267 -7043
5590 -7043 2617 -437 66 6923 -9084 -9184 -5459 -7218 -11862 -13192 -17733 -22951 -30903 -13646 -18274
5575 -18274 -14671 4906 9493 1945 -8818 -16245 -15344 4466 12199 2213 59 8382 9220 17851
5561 17851 11905 11493 18298 2819 -6124 -3568 1977 -9329 -22162 -30760 -22377 -9360 -18209 -20663
5547 -20663 -1601 -2638 -1815 -6214 -10366 -13756 -1238 10763 15221 -378 -1870 4706 -2236 16682
5533 16682 15458 22745 18945 9779 15839 17547 6118 193 -10117 -14308 -8956 -7326 2627 11515
5519 11515 17797 11463 4378 1805 -3809 -2891 -15653 -3937 854 -16757 -9261 1967 8106 -2936
5505 -2936 -20520 -2052 15404 17772 22694 22931 23556 5387 5565 16253 11625 272 -14249 -19128
$$ packed form
5603A5951Q906m367j1217j8838k55J1233P312n097j5334j9468m828J3735J5224
5590g043R660l054N03O857j6007j00L725j759m644j330m541n218p952J7257m628
5575a8274L603J9577M587p548j0763p427R01J9810P733r986k154Q323Q38Q631
5561A7851n946m12O805j5479q943K556N545j1306j2833q598Q383J3017q849k454
5547b0663J9062j037Q23m399m152l390J2518J2001M458j5599j492O576o942J8918
5533A6682j224P287l800r166O060J708j1429n925j0310m191N352J630R953Q888
5519A1515O282o334p085k573n614R18j2762J1716M791j7611P496J1228O139j1042
5505b936j7584J8468J7456K368M922K37O25j8169J78J0688m628j1353j4521m879
$$ plain form
5491 -19128 -20478 -12495 -5880 2642 -1786 -3456 947 12224 -927 -1049 -13429 -26189 -29613 -22113
5477 -22113 -12599 -22147 -29091 -23331 -15024 -9883 150 3284 -2573 7724 9172 -1076 -12813 -18159
5463 -18159 -5999 3135 -1540 -8335 -8714 5101 652 -3478 -3399 -2361 11015 26279 31816 13077
5449 13077 -11728 -27177 -45192 -52253 -31539 -6622 -8688 -8635 243 14716 25759 26326 16005
5436 16005 7660 9632 20595 18830 13646 1798 -4952 -363 771 -10999 -22973 -9486 4102
5423 4102 11493 16725 8532 -4492 -11162 -3251 4131 4072 583 -6490 -6397 -8602 -25890 -25443 -11471
5408 -11471 -19365 -28850 -22709 -12579 -7649 -751 5789 1387 -10973 -25998 -17988 -8924 5416 6220
5394 6220 -6590 -4440 -256 -11680 -17671 -22449 -18369 -12429 -12226 -3361 -6859 -55 -400 4577 7982
$$ packed form
5491a9128j350P983O615Q522m428j670M403J1277j3151j22j2380j2760l424P500
5477b2113R514r548o944N760Q307N141J0033L134n857J0297J448j0248j1737n346
5463a8159J2160R134m675o795l79J3815m449m130P9J038J3376J5264N537j8739
5449A3077k4805j5449j8015p061K0714K4917k066N3Q878J4473J1043N67j0321
5436A6005q345J972J0963j765n184j1848o750M589J134j1770j1974J3487J3588
5423D102P391N232q193j3024o670P911P382n9l489p073R3k205j7288M47J3972
5408a1471p894r485O141J0130M930O898O540m402j2360j5025Q010R064J4340Q04
5394F220j2810K150M184j1424n991m778M080N940K03Q865l498O804l45M977L405
$$ plain form
5379 7982 8994 -4348 -6798 -5531 1588 -10505 -3735 15085 14236 5517 2301 -8893 -28949 -16480
5365 -16480 3964 11203 7949 -11546 -13865 -2564 5343 8951 6140 2316 11882 17492 18873 17830
5351 17830 12519 475 -5645 -2789 -3226 -10406 -18880 -11758 -15976 -26665 -16183 -2833 -14215 -6737
5337 -6737 -4343 3930 3287 1726 11981 6168 -5711 -2161 -4600 -4295 -5347 -7073 -9525 1825 8760
5322 8760 3900 12828 17205 9598 5369 12496 2739 -2303 -3667 4229 -9206 -14895 -19999 -21359 -17003
5307 -17003 -19096 -12357 415 -7812 -10569 4622 8932 2155 4370 1354 -7644 -1464 -3095 -11210
5293 -11210 -8059 -22206 -31650 -7270 8858 10289 5758 -4477 616 8930 -5416 -13719 -19819
5280 -19819 -23418 -24258 -13780 -5966 -9393 -25750 -23949 -10778 -2083 5343 11636 1572 2377 3163
$$ packed form
5379G982J012j3342k450J267P119j2093O770J8820q49q719l216j1194k0056J2469
5365a6480K0444P239l254j9495k319J1301P907L608k811l824R566N610J381j043
5351A7830n311j2044o120K856m37p180q474P122m218j0689J0482J3350j1382P478
5337f737K394Q273o43j561J0255n813j1879L550k439L05j052j726k452J1350O935
5322H760m860Q928M377p607m229P127r757n042j364P896j3435n689n104j360M356
5307a7003k093O739J2772q227k757J5191M310o777K215l016q998O180j631q115
5293a1210L151j4147r444K4380J6128J431m531j0235N093Q314j4346q303o100
5280a9819l599q40J0478P814l427j6357J801J3171Q695P426O293j0064Q05P86
$$ plain form
5266 3163 -18333 -10974 -690 -2890 -2295 7598 10045 5726 -4376 1029 357 -4047 -11857 -8817 4541
5251 4541 3722 -9281 -19136 -13697 -13563 -4390 -3524 -10185 -710 -2692 -12411 -24376 -23857 4247 11068
5236 11068 -325 -1219 -608 6110 3145 9419 10197 -5106 -3520 3765 8798 21152 20209 18211 24488
5221 24488 32638 19539 4967 1580 3883 10693 5179 -14968 -18869 -14539 -18422 -18784 -28022 -19359
5207 -19359 -13599 -17506 -18853 -12980 -3355 -8183 -27200 -17934 -15477 -11851 -8960 -14405 -3692 -1387
5193 -1387 -3048 1160 -1619 9705 12634 -6669 -10487 -13658 -8440 -513 2434 2194 -5665 -13233 -10156
5178 -10156 -12304 -15949 -9261 7818 3129 -3707 -4495 -11925 -20446 -29383 -26376 -14329 -16978 -28870
5164 -28870 -26615 -18300 -21921 -20784 -6832 -17556 -14932 4935 3307 -8288 -12484 -12372 -8395 -1689
$$ packed form
5266C163k1496P359J0284k200N95R893K447m319j0102N405o72m404p810L040J3358
5251D541q19j3003r855N439J34R173Q66o661R475j982r719j1965N19K8104O821
5236A1068j1393q94O11O718k965O274P78j5303J586P285N033J2354r43j998O277
5221B4488Q150j3099j4572l387K303O810n514k0147l901M330l883l62r238Q663
5207a9359N760l907j347N873R625m828j9017R266K457L626K891n445J0713K305
5193a387j661M208k779J1324K929j9303l818l171N218P927K947k40p859p568L077
5178a0156k148l645O688J7079m689o836p88p430q521q937L007J2047k649j1892
5164b8870K255Q315l621J137J3952j0724K624J9867j628j1595m196J12L977O706
$$ plain form
5150 -1689 -6544 -13493 -23339 -15911 -9916 -12557 -11994 -10927 -31 1866 12193 9096 1565 -2654 3115
5135 3115 14198 -4341 -20132 -18574 -18888 -7738 5569 4907 -4849 -16502 -17155 -20688 -18113 -20247
5121 -20247 -18217 -5568 4131 28680 31711 20951 10457 15565 27295 16404 12164 8609 9284
5108 9284 13367 24167 18943 9254 4738 -8991 -21931 -16447 5511 14120 13881 9728 1575 12340
5094 12340 8395 -2986 -7939 -481 11122 16716 9843 5165 3691 5940 -14636 -15408 -19479 -13615
5080 -13615 -12748 -604 -2806 2046 11555 11852 10061 11646 5943 3350 1015 -11667 -13763 -5330 -6712
5065 -6712 -2289 1411 -8969 -12342 -8415 -8331 -13071 -16598 -27081 -37116 -37978 -37872 -27195 -27036 -18953
5050 -18953 -16637 -9615 -4333 -11535 -5208 6125 -9390 -22788 -20679 -21812 -9544 1666 6681
$$ packed form
5150a689m855o949r846P428N995k641N63J067J0896J897J0327l097p531m219N769
5135C115J1083j8539j5791J558l14J1150J3307o62r756j1653o53l533K575k134
5121b0247K030J2649R699K4549L031j0760j0494N108J1730j0891m240l555O75
5108I284M083J0800n224r689m516j3729j2940N484K1958Q609k39m153q153J0765
5094A2340l945j1381m953P458J1603N594o873m678j474K249k0576p72m071N864
5080a3615Q67J2144k202M852R509K97j791J585n703k593k335j2682k096Q433j382
5065f712M423L700j0380l373L927Q4m740l527j0483j0035q62J06J0677J59Q083
5050a8953K316P022N282p202O327J1333j5515j3398K109j133J2268J1210N015
$$ plain form
5037 6681 -696 1359 14241 18741 17261 9303 3604 -55 -8941 -7014 -3224 -14008 2026 13618
5023 13618 4893 -15787 -15749 -15324 -9496 -2860 4160 6713 5863 4524 9579 3047 -5248 -16770 -6517
5008 -6517 14475 7373 2514 -3580 -6395 -8300 -4013 7647 -1702 -20808 -26664 -25502 -24488 -13718
4994 -13718 -13640 -8855 10573 22630 20038 5294 9670 2023 -23982 -22440 -14042 -18759 -33512 -39171
4980 -39171 -24252 -12381 -20518 -7357 -4344 -18086 -11885 -5110 -3556 1154 8292 -1480 -10459 -10981
4966 -10981 267 -3814 -12857 -10876 -1577 -15902 -28469 -16338 -8889 -537 -2801 5358 -5782
4953 -5782 -677 186 -289 7471 978 -7247 -8070 -37 10885 11884 2399 -4335 7480 17799 11452
4938 11452 7597 8656 1864 2995 -7277 -15645 -5362 8576 13928 -6979 -28036 -23902 -8060
$$ packed form
5037F681p377K055J2882M500j480p958n699l659q886J927L790j0784J6034J1592
5023A3618q725k0680L8M25N828O636P020K553q50j339N055o532q295j1522J0253
5008f517K0992p102m859o094k815j905M287J1660r349j9106n856J162J014J0770
4994a3718P8M785J9428J2057k592j4744M376p647k6005J542Q398m717j4753n659
4980c9171J4919J1871q137J3161L013j3742O201O775J554M710P138r772q979n22
4966a0981J1248m081r043J981R299j4325j2567J2131P449Q352k264Q159j1140
4953e782N105Q63m75P760o493q225q23Q033J0922R99r485o734J1815J0319o347
4938A1452l855J059o792J131j0272q368J0283J3938N352k0907k1057M134J5842
$$ plain form
4925 -8060 -2932 -934 4378 8197 13754 19676 20705 18810 19306 17003 6960 -6676 -17374 -17041 -7737
4910 -7737 -12268 -16477 -9911 -4525 10741 -1512 -24363 -17611 -3892 3453 8136 9431 10215 11998
4896 11998 -2703 335 10770 14346 14924 5960 -5315 3869 8951 16747 218 -8491 -21599 -39320
4882 -39320 -36009 -19261 -10267 -9366 1974 8462 4398 -2448 -6964 6266 1203 67 12243 12574
4868 12574 -912 4566 15550 9597 13603 -1992 -9968 -9081 -17108 -16475 -4597 10763 12719 4561
4854 4561 2920 1734 -7098 -5123 7379 -2323 -8938 -5904 -8526 -174 -5379 -19833 -17114 -12063
4840 -12063 854 2619 -6581 -15794 -2592 -9148 -13935 2942 7380 -1688 -5916 9828 10705 9625
4826 9625 -5898 -15569 -23959 -24466 -32669 -32224 -23566 -9566 -1971 11193 6468 -7930 -12348 -9008
$$ packed form
4925h060N128J998N312L819N557N922J029j895M96k303j0043j3636j0698L33R304
4910g737m531m209O566N386J5266j2253k2851O752J3719P345M683J295P84J783
4896A1998j4701L038J0435L576N78q964j1275R184N082P796j6529q709j3108j7721
4882c9320L311J6748Q994R01J1340O488m064o846m516J3230n063j136J2176L31
4868A2574j3486N478J0984n953M006j5595p976Q87q027O33J1878J5360J956q158
4854D561j641j186q832J975J2502r702o615L034k622Q352n205j4454K719N051
4840a2063J2917J765r200r213J3202o556m787J6877M438r068m228J5744Q77j080
4826I625j5523r671q390n07q203M45Q658J4000P595J3164m725j4398m418L340
$$ plain form
4812 -9008 -9476 2011 3291 1168 2673 7372 2603 -649 9828 8668 4593 -4566 14289 25332
4798 25332 21973 9883 13560 18192 18604 20567 20634 3345 -4003 -10548 -17201 -17571 -213 4140 -12081
4783 -12081 -8021 2927 8057 10953 7119 -2951 1740 -7173 -17040 -5574 -8536 -4154 8211 7225
4769 7225 10347 5539 -9738 -12252 -8645 -11446 -6678 3972 11767 15081 9857 2649 -7140 -11968
4755 -11968 -3006 800 -11068 3210 -1014 3686 8520 11550 2867 4094 15632 21758 26363 29027
4741 29027 31640 39507 46261 38116 30644 33959 11256 -6378 -15842 -19781 -17931 -10294 -3639 -6786
4727 -6786 -14467 -1406 -6035 -12142 2658 10171 9244 7243 19429 17912 30272 22364 7230 6187
4713 6187 7648 -7767 -8665 -17420 -24670 -16116 -2212 193 -1742 -10148 -12730 -11199 -13694 -16809 -22706
$$ packed form
4812i008m68J1487J280k123J505M699m769l252J0477j160m075r159J8855J1043
4798B5332l359j2090L677M632M12J963O7j7289p348o545o653l70J7358M353j6221
4783a2081M060J0948N130K896l834j0070M691q913r867J1466k962M382J2365r86
4769G225L122m808j5277k514L607k801M768J0650P795L314n224p208r789m828
4755a1968Q962L806j1868J4278m224M700M834L030q683J227J1538O126M605K664
4741B9027K613P867O754q145p472L315k2703j7634r464l939J850P637O655l147
4727f786p681J3061m629o107J4800P513r27k001J2186j517J2360p908j5134j043
4713F187J461j5415q98q755p250Q554J3904K405j935q406k582J531k495l115n897
$$ plain form
4698 -22706 -30029 -21553 -14751 -5404 -2659 -11589 -15962 -18205 -28691 -27414 -17191 -6902 -6791 -2159
4684 -2159 5936 -9205 -9494 1246 2395 5208 6632 380 -15524 -7078 3084 -5013 -14303 -6259
4670 -6259 9439 8800 12020 10269 3090 -16047 -34132 -31472 -22641 -13529 -7343 -17945 -17528 -7530
4656 -7530 -1835 -9305 -18757 -20251 -31480 -26745 -11506 -9737 -6524 978 5996 -3791 1532 2398 5570
4641 5570 4904 -15516 -19605 -20213 -10637 6480 24032 20113 773 -9756 8010 19045 7122
4628 7122 -16469 -18877 -13427 -15045 -12866 -5502 -12559 -10441 -12108 -22978 -27492 -15393 -17255 -13340
4614 -13340 2064 117 -4881 -6210 -2168 4411 7754 7608 11956 1845 7408 16304 10025 4456
4600 4456 12146 17833 11435 4130 11497 7318 -11370 -28039 -32021 -28786 -24837 -16505 -8753 -1393
$$ packed form
4698b2706p323Q476O802R347K745q930m373k243j0486J277J0223J0289J11M632
4684b159Q095j5141k89J0740J149K813J424o252j5904Q446J0162q097r290Q044
4670f259J5698o39L220j751p179j9137j8085K660Q831R112O186j0602M17R998
4656g530N695p470r452j494j1229M735J5239J769L213P502N018r787N323Q66L172
4641E570o66k0420m089o08R576J7117J7552l919j9340j0529J7766J1035j1923
4628G122k3591k408N450j618K179P364p057K118j667j0870m514J2099j862L915
4614a3340J5404j947m998j329M042O579L343j46M348j0111N563Q896o279n569
4600D456P690N687o398p305P367m179j8688j6669l982L235L949Q332P752P360
$$ plain form
4586 -1393 15823 16760 4878 14962 25542 12726 -4770 -5961 13405 24142 18879 14529 25689
4573 25689 24789 15875 14841 22501 24969 23839 29571 19337 7023 3402 -2816 2496 16999 17035 25034
4558 25034 18120 8970 10096 7892 10288 9745 5605 -14052 -19784 -20640 -10433 2466 355 132 3541
4543 3541 2968 -3994 -12387 -11381 -21425 -9859 -6661 4275 11994 3874 -1395 8686 3772 -4991
4529 -4991 -18601 -31054 -21944 -5159 -10051 -14914 -22570 -26276 -12313 2483 11107 16868 18376 8930
4515 8930 -1941 -15840 -13255 -137 11602 10883 4714 15274 16092 9306 4546 5701 13814 15763
4501 15763 5371 5967 3558 6198 7810 4858 14398 2162 -2142 9300 8379 -994 572 10334
4487 10334 25218 18926 1974 -6845 -9939 -23971 -36969 -32026 -21604 -23379 -9630 -4469 -7748
$$ packed form
4586a393J7216R37j1882J0084J0580j2816j7496j191J9366J0737n263m350J1160
4573B5689r00q914j034P660K468j130N732j0234j2314l621o218N312J4503L6P999
4558B5034o914r150J126k204K396n43m140j9657n732q56J0207J2899k111k23L409
4543C541n73o962q393J006j0044J1566L198J0936P719q120n269J0081m914q763
4529d991j3610j2453R110J6785m892m863p656l706J3963J4796Q624N761J508r446
4515H930j0871j3899K585J3118J1739p19o169J0560Q18o786m760J155Q113J949
4501A5763j0392N96k409K640J612k952R540j2236m304J1442r21r373J566R762
4487A0334J4884o292j6952q819l094j4032j2998M943J0422j775J3749N161l279
$$ plain form
4474 -7748 200 2347 2073 -4768 -12391 -12710 -19857 -22257 -4971 8550 -1329 -2164 -1587 -3495 -6973
4459 -6973 -15025 -20206 -23348 -23597 -13480 -12372 -13461 -9113 1725 7463 1597 -5031 -15203 -3870
4445 -3870 4459 -1211 -2794 -5123 -5542 -11010 -15881 -9374 -1961 4329 14382 4654 4697 -9558 -1662
4430 -1662 12329 15092 9839 15988 7349 1306 3279 5542 -1049 -6407 -18207 -13852 -10650 -12491
4416 -12491 -8498 -16876 -18128 -21448 -13306 -19802 -11668 -23897 -34692 -35924 -35006 -22180 636 12546
4402 12546 1993 -7845 -367 19427 14764 5378 16474 15101 13192 11719 14399 17785 11058 7845
4388 7845 6875 3743 -3766 599 6571 15504 14577 -8236 -23640 -14435 -9195 -14117 -12037 -3311 -3325
4373 -3325 -10315 -465 -1591 -7097 -3451 4632 4119 14779 19166 15868 2131 605 -3343 -8708 -473
$$ packed form
4474g748P948K147k74o841p623l19p147k400J7286J3521r879q35N77j908l478
4459f973q052n181l142k49J0117J108j089M348J0838N738n866o628j0172J1333
4445c870Q329n670j583k329m19n468m871O507P413O290J0053r728M3j4255P896
4430a662J3991K763n253O149q639o043J973K263o591n358j1800M355L202j841
4416a2491L993q378j252l320Q142o496Q134j2229j0795j232R18J2826K2816J1910
4402A2546j0553r838P478J9794m663r386J1096j373j909j473K680L386o727l213
4388G845r70l132p509M365N972Q933r27k2813j5404R205N240m922K080Q726j4
4373c325o990R850j126n506L646Q083n13J0660M387l298j3737j526l948n365Q235
$$ plain form
4358 -473 4038 7447 16074 11655 17577 10354 -2428 -8617 -22532 -34625 -30414 -22870 -10218 -12112
4344 -12112 -15337 -15469 -19763 -23673 -12801 -18743 -16622 -3116 7839 15131 17062 19294 15224 19244
4330 19244 26480 18393 3452 -2952 1316 -6756 -20988 -25403 -21244 -10728 -9857 -12033 -7903 -9496
4316 -9496 -12627 -16390 -14005 -10689 -827 -1958 -2758 2727 21627 17047 -752 74 337 -3881 -10809
4301 -10809 -12044 -12631 -13657 -9789 -3498 6676 11845 12111 16851 4736 3517 7674 8977 10434 4921
4286 4921 3443 -184 14738 26607 16023 5931 1768 -5589 -12224 -22089 -24278 -8879 -9444 -6727
4272 -6727 -10232 863 -3318 -7076 -9885 -5632 -863 -3630 -19250 -17545 -17755 -8375 -15538 -5856 13481
4257 13481 25829 12803 11305 5699 -11793 -16605 -3720 -474 908 6078 7549 3353 -4247 -3209
$$ packed form
4358d73M511L409Q627m419N922p223j2782o189j3915j2093M211P544J2652j894
4344a2112l225j32m294l910J0872n942K121J3506J0955P292J931K232m070M020
4330A9244P236q087j4941o404M268q072j4232m415M159J0516Q71k176M130j593
4316i496l131l763K385L316R862j131q00N485J8900m580j7799Q26K63m218o928
4301a0809j235n87j026L868O291J0174N169K66M740j2115j219M157J303J457n513
4286D921j478l627J4922J1869j0584j0092m163p357o635r865k189J5399n65K717
4272f727l505J1095m181l758k809M253M769k767j5620J705k10R380p163R682J9337
4257A3481J2348j3026j498n606j7492m812J2885L246J382N170J471m196p600J038
$$ plain form
4243 -3209 651 5709 7448 18658 13560 5352 -222 1699 -4188 -3619 6735 13116 6816 9046 16241
4228 16241 4243 12243 13673 15065 15324 3043 -12480 -15449 -7691 -6965 -3596 -5625 5585 18248
4214 18248 15417 4331 -4233 -3107 2750 -5419 -11934 -9406 1041 8534 21646 16512 14005 15028
4200 15028 6689 11559 2828 -7101 -5345 13654 17221 216 -6939 3121 17133 9479 5781 -1733
4186 -1733 -9375 -15705 -3938 -356 -7607 -2088 503 -1221 -9981 -16949 -9188 -12081 -6822 2030 -6878
4171 -6878 -11892 -8345 -12229 -16956 -13872 -4459 -8892 -1345 14226 3228 1373 2623 -3819 -14746
4157 -14746 -1774 9509 20550 19991 14046 17675 19941 16122 18000 9667 19052 13037 7388 6882
4143 6882 2211 -2109 1463 -4048 2956 11191 12816 -11797 -22425 -15860 -8486 601 5865 3842
$$ packed form
4243c209L860N058J739J1210n098q208n574J921n887N69J0354O381o300K230P195
4228A6241j1998Q000J430J392K59j2281j5523k969P758P26L369k029J1210J2663
4214A8248k831j1086q564J126N857q169o515K528J0447P493J3112n134k507J023
4200A5028q339M870q731r929J756J8999L567j7005p155J0060J4012p654l698p514
4186a733p642o330J1767L582p251N519K591j724q760o968P761k893N259Q852q908
4171f878n014L547l884m727L084R413m433P547J5571j0998j855J250o442j0927
4157a4746J2972J1283J1041n59n945L629K266l819J878q333R385o015n649n06
4143F882m671m320L572n511P004Q235J625k4613j0628O565P374R087N264k023
$$ plain form
4129 3842 -581 -293 604 7020 3951 4169 5834 9586 13798 23911 12826 4876 -19 -75 -4857 -11754
4113 -11754 -3001 1966 -2967 -13791 -22469 -25685 -11028 17491 27156 22734 20976 930 -7738 -10113
4099 -10113 -18429 -10061 -773 6310 11443 935 -2719 -1591 -2440 6582 -551 -1800 -12164 -16983
4085 -16983 -15595 -7045 -8058 -8725 7949 13426 11319 1295 -9051 -205 20651 26732 9285 -845
4071 -845 -4415 687 -3101 -4208 -3640 -9303 -8043 -1096 -7782 -145 -2526 271 -3961 -4455 -10206 -9664
4055 -9664 -6863 5972 5249 -12654 -20331 -3604 9781 2479 10740 14182 989 -12515 -10339 -4810
4041 -4810 -15111 -11893 -8009 -5686 -8648 2676 -4818 -15252 -13988 5190 12998 2854 412 -5163
4027 -5163 -5786 -436 8375 3293 -14250 -16660 -4339 1734 9272 21455 18929 4224 11926 34684
$$ packed form
4129C842m423K88Q97O416l069K18J665L752M212J0113j1085p950m895n6m782o897
4113a1754Q753M967m933j0824q678l216J4657K8519R665m422j758k0046q668k375
4099a0113q316Q368R288P083N133j0508l654J128q49R022p133j249j0364m819
4085a6983J388Q550j013o67J6674N477k107j0024j0346Q846K0856O081j7447j0130
4071h45l570N102l788j107N68n663J260O947o686P637k381K797m232m94n751N42
4055i664K801J2835p23j7903p677J6727J3385p302Q261L442j3193j3504K176N529
4041d810j0301L218L884K323k962J1324p494j0434J264J9178P808j0144k442n575
4027e163o23N350Q811n082j7543k410J2321O073P538J2183k526j4705P702K2758
$$ plain form
4013 34684 36242 25611 19676 7915 104 1839 11502 23962 29001 15441 6651 21770 25634
4000 25634 13648 -7839 -6498 -10518 -8851 -1168 3137 6066 -12055 -20236 -8598 6567 13381
3987 13381 11189 15528 13744 7712 14725 19571 21564 11804 24662 25821 7675 -5066 12390 18148
3973 18148 15987 4385 2241 3491 -1087 -8156 -10043 -12588 -9118 -9451 2178 -3066 -2455 7633
3959 7633 4836 -279 -13824 -19394 -861 11706 14903 15487 22687 18431 6099 1296 -12922 -17523
3945 -17523 -15139 -11539 -17270 -17873 -15543 -15508 -15516 -14105 -16821 -36019 -38338 -20001 -1081 1265 -1232
3930 -1232 8071 11692 3892 -4496 -5343 -4718 6559 3437 9695 3825 -11705 -35226 -30765 -30768 -31635 -10048
3914 -10048 -7665 -6462 -1979 4736 7784 10329 21932 14025 24968 14352 819 333 1337 -6260
$$ packed form
4013C4684J558j0631n935j1761p811J735R663J2460N039j3560q790J5119L864
4000B5634j1986k1487J341m020J667P683M305K929j8121q181J1638J5165O814
3987A3381k192M339j784o032P013M846J993r760J2858J159j8146j2741J7456N758
3973A8148k161j1602k144J250m578p069j887k545L470l33J1629n244O11J0088
3959G633k797n115j3545n570J8533J2567L197N84P200m256j2332m803j4218m601
3945a7523K384L600n731o03K330L5qJ411k716j9198k319J8337J8920K346k497
3930a232R303L621p800q388q47O25J1277l122O258n870j5530k3521M461lq67K1587
3914a0048K383J203M483O715L048K545J1603p907J0943j0616j3533m86J004p597
$$ plain form
3900 -6260 -1396 3464 3987 6871 6585 9719 1425 -8503 -5095 2794 11978 3824 -18231 -22320 -14958
3885 -14958 -156 -5833 -5589 5393 7172 1075 10981 17246 23982 19100 13007 4326 12155 13387
3871 13387 7207 16185 30480 21611 12878 30939 31115 21124 6582 -11099 -26208 -14250 -11396
3858 -11396 -7853 -14228 -22581 -17436 -12550 -3648 4937 8375 6175 15922 8362 6953 -7299 -9367
3844 -9367 -12192 -17307 -21771 -7071 11661 3218 3693 9042 13130 11240 10837 8922 9463 2913 -3598
3829 -3598 -14806 -14519 -13162 -8938 -17228 -19087 -7736 -1434 -7897 -14028 -15501 -12627 -13755 259
3815 259 19501 20894 11604 11878 658 -12230 -6374 1526 2873 -5558 -9293 -3307 -3680 -250 -15619
3800 -15619 -11065 3947 15738 4384 -5900 -12588 -201 2535 -12743 -13067 -5433 4229 -2022
$$ packed form
3900f260M864M860N23K884k86L134q294r928L408P889R184q154k2055m089P362
3885a4958J4802n677K44J0982J779o097R906O265O736m882o093q681P829J232
3871A3387o180Q978J4295q869q733J8061J76r991j4542j7681j5109J1958K854
3858a1396L543o375q353N145M886Q902Q585L438k200R747p560j409j4252k068
3844i367k825n115m464J4700J8732q443M75N349M088j890m03j915N41o550o511
3829c598j1208K87J357M224q290j859J1351O302o463o131j473K874j128J4014
3815B59J9242J393r290K74j1220j2888N856P900J347q431l735N986l73L430j5369
3800a5619M554J5012J1791j1354j0284o688J2387K736j5278l24P634R662o251
$$ plain form
3787 -2022 -13766 -13367 3582 10760 8711 -4609 -11243 -5451 -11237 -10281 10225 21627 22306 17909
3773 17909 1228 -15823 -9004 -811 10778 14140 7571 -1073 11295 12261 2063 2917 5014 7612
3759 7612 -4404 -5034 5196 -7886 -13081 -20243 -25905 -27789 -17341 -12273 -5724 2600 -3473 -4014
3745 -4014 -4788 -4655 -14316 -20291 -9978 -5788 -11874 -5117 3066 1343 -1649 15113 14516 -6623 -10883
3730 -10883 -19243 -21749 -19930 -26251 -18678 -5262 1406 1858 -6661 -1155 -8552 -6896 870 4955 2991
3715 2991 -257 -515 6567 2692 -8763 -13152 -4 1319 -6020 -6005 -2604 -9599 -11006 2272 9962
3700 9962 10978 6491 8885 7097 2418 -7315 -4351 5912 14873 13359 16383 8626 6558 -3024 -7845
3685 -7845 -10232 -10582 -23827 -30336 -24374 -24570 -23555 -30924 -39278 -30281 -24586 -31591 -16540 -5908 -2096
$$ packed form
3787b022j1744L99J6949P178k049j3320o634N792n786R56K0506J1402O79m397
3773A7909j6681j7051O819Q193J1589L362o569q644J2368R66j0198Q54K097K598
3759G612j2016o30J0230j3082n195p162n662j884J0448N068O549Q324o073n41
3745d014p74J33r661n975J0313M190o086O757Q183j723k992J6762n97k1139m260
3730a0883q360k506J819o321P573J3416O668M52q519N506p397J656P766M085j964
3715B991l248k58P082l875j1455m389J3148J323p339J5L401o995j407J3278P690
3700I962J016m487K394j788m679r733K964J0263Q961j514L024p757k068r582m821
3685g845k387l50j3245o509N962j96J015p369q354Q997N695p005J5051J0632L812
$$ plain form
3670 -2096 -9032 -13324 -5122 -802 -6055 3237 8425 2851 3722 -5768 -9599 -8785 -2127 -9385 -17630
3655 -17630 -21468 -17539 -6322 -6763 -15906 -4052 2521 -1455 -11653 -19325 -14233 -4050 -6351 -12717
3641 -12717 -12684 -3483 1110 12737 14242 13083 13245 29936 32249 2147 -13237 -6464 -25098 -21787
3627 -21787 -7488 -7335 -4031 1101 4584 -4236 -19826 -13407 4160 4999 2221 -2996 -10158 -12824
3613 -12824 -1323 7361 31288 40693 34370 10086 -2381 4947 10007 666 5776 16958 14614
3600 14614 7560 11246 25094 24788 14102 12453 19517 12410 5518 -5097 -12951 -7757 -7834 -440 4044
3585 4044 3574 -2367 -2463 -2272 -3005 4980 2426 -2843 -6249 -19189 -19230 7910 19071 17931 16095 -2597
3569 -2597 -6034 7674 -3856 -22222 -22306 -18987 -26535 -20005 -14097 -19863 -19217 -8996 -214 -10059 -18361
$$ packed form
3670b096o936m292Q202M320n253R292N188n574Q71r490l831Q14O658p258q245
3655a7630l838L929J1217m41r143J1854O573l976j0198p672N092J0183k301o366
3641a2717L3R201M593J1627J505j159J62J6691K313l0102j5384O773j8634L311
3627b1787J4299J53L304N132L483q820j5590O419J7567Q39k778n217p162k666
3613a2824J1501Q684K3927R405o323k4284j2467P328N060r341N110J1182k344
3600A4614p054L686J3848l06j0686j649P064p107o892j0615p854N194p7P394M484
3585D044m70n941r6J91p33P985k554n269l406j2940m1K7140J1161j140j836j8692
3569b597l437J3708j1530j8366q4L319p548O530N908n766O46J0221Q782r845q302
$$ plain form
3554 -18361 -11661 -2058 2774 6627 13667 10377 -3853 -4751 9085 22441 22227 12014 10312 12443
3540 12443 3374 -5722 -13393 -13637 -9895 -3577 9962 14135 -3532 1964 10835 5772 -4815 -15360
3526 -15360 -28719 -18253 5568 11930 12808 4621 183 -14374 -12551 -15617 -17508 -18817 -14711 -11383
3512 -11383 -13312 -8575 -367 -16738 -15978 -6277 -3299 -7642 -6610 -3917 4915 486 -3427 -984 -8176
3497 -8176 -10790 -8670 -8712 -6632 -3993 -6073 -8385 -15059 -17207 -13413 -9213 10277 7101 -3196 5789
3482 5789 17543 22511 20207 10121 -5567 -23091 -27569 -21931 -9605 -6800 -15890 -17606 -15165 -10544
3468 -10544 -29171 -42819 -27660 -7800 -6672 -6484 -6096 5687 12033 9346 8521 844 -7484 -11521
3454 -11521 -6015 406 6719 -1520 10448 23819 14990 8789 -2959 -16236 -19673 -9569 -7048
$$ packed form
3554a8361O700R603M832L853P040l290j4230q98J3836J3356k14j0213j702K131
3540A2443r069r096p671k44L742O318J3539M173j7667N496Q871n063j0587j0545
3526a5360j3359J0466K3821O362Q78q187m438j4557J823l066j891j309M106L328
3512a1383j929M737Q208j6371P60R701K978m343J032K693Q832m429l913K443p192
3497h176k614K120m2K080K639k080k312o674k148L794M200J9490l176j0297Q985
3482E789J1754M968k304j0086j5688j7524m478N638J2326K805r090j716K441M621
3468a0544j8627j3648J5159J9860J128J88L88J1783O346k687q25p677q328m037
3454a1521N506O421O313q239J1968J3371q829o201j1748j3277l437J0104K521
$$ plain form
3441 -7048 -2832 8957 20270 11208 13944 3735 -5891 387 1139 12995 19350 23977 23448 16434
3427 16434 7780 -153 -11288 -10570 -9322 -8940 -1231 5322 3098 11144 8104 9332 14578 22777 25255
3412 25255 21016 19171 15461 12742 11353 9861 6947 19809 13053 3477 13408 11428 18038 24294
3398 24294 28853 17744 21353 23837 7826 8468 17092 18973 15788 6517 10431 18895 5361 -1882
3384 -1882 3957 1654 -5294 -10342 482 9608 5988 -4476 -11392 4752 20288 26999 30252 19353
3370 19353 2468 2622 3542 -15435 -18231 -25183 -29400 -21806 -5900 3590 -1174 -4920 -5242 5696
3356 5696 2594 -9906 11613 21599 13812 -4033 -2880 7511 3793 16467 12628 3741 2173 19931
3342 19931 15342 3493 -1190 1272 2050 -8092 -5344 -7270 -11611 1978 8986 4998 -9319 -15895
$$ packed form
3441g048M216J1789J1313r062K736j0209r626O278P52J1856O355M627n29p014
3427A6434q654p933j1135P18J248L82P709O553k224Q046l040J228N246Q199K478
3412B5255m239j845l710k719j389j492k914J2862o756r576R931j980O610O256
3398B4294M559j1109L609K484j6011O42Q624J881l185r271L914Q464j3534p243
3384a882N839k303o948n048J0824R126l620j0464o916J6144J5536O711L253j0899
3370A9353j6885J54R20j8977k796o952m217P594J5906R490m764l746l22J0938
3356E696l102j2500K1519R986p787j7845J153J0391l718J2674l839q887j568J7758
3342A9931m589j1849m683K462P78j0142K748j926m341J3589P008l988j4317o576
$$ plain form
3328 -15895 -18097 -5598 2835 3286 9369 17949 18985 17351 10554 -2420 -2375 -7480 -7002 -11721 -2723
3313 -2723 9112 12177 9595 13002 17287 17751 7076 8214 12798 4408 1931 -8754 -10255 -16465
3299 -16465 -17026 -16912 -2177 -140 -1150 -385 6355 -11850 -22406 -24443 -37969 -35114 -26980 -15708
3285 -15708 -1398 9754 15763 5449 -9580 -17978 -5195 1712 4853 13410 20308 15111 6568
3272 6568 12844 10210 6375 580 5203 8904 -974 -11369 -22655 -17502 -817 2177 -6223 2772
3258 2772 10962 4090 -1352 1803 5741 3981 -8901 -16327 -3730 9127 19826 21802 19104 5506
$$ packed form
3328a5895k202J2499Q433M51O083Q580J036j634o797j2974M5n105M78m719Q998
3313b723J1835L065k582L407M285M64j0675J138M584q390k477j0685j501o210
3299a6465n61J14J4735K037j010P65O740j8205j0556k037j3526K855Q134J1272
3285a5708J4310J1152O009j0314j5029q398J2783O907L141Q557O898n197q543
3272F568O276k634l835n795M623L701r878j0395j1286N153J6685K994q400Q995
3258B772Q190o872n442L155L938j760j2882p426J2597J2857J0699J976k698j3598
$$ [...]
##END NTUPLES=NMR SPECTRUM
##END=
