##TITLE=Analysis number 317398
Compound Code sb 00940
Book Reference 1
Project Code qc-cat
Chemist Name glenb
##JCAMPDX= 6.0         $$ Bruker NMR JCAMP-DX V2.0
##DATA TYPE= NMR SPECTRUM
##DATA CLASS= NTUPLES
##ORIGIN= Bruker BioSpin GmbH
##OWNER= nmr
$$ XWIN-NMR		Version 3.5
$$ Tue Feb 21 11:03:18 2006 GMT Standard Time (UT+0h)  MAYBRIDGE\nmr@NMR_250MHZ
##.OBSERVE FREQUENCY= 250.131544655141
##.OBSERVE NUCLEUS= ^1H
##.ACQUISITION MODE= SIMULTANEOUS (DQD)
##.ACQUISITION SCHEME= undefined
##.AVERAGES= 16
##.DIGITISER RES= 18
##SPECTROMETER/DATA SYSTEM= dpx250
##.PULSE SEQUENCE= zg30
##.SOLVENT NAME= DMSO
##.SHIFT REFERENCE= (INTERNAL, DMSO, 0, 16.522)
##AUDIT TRAIL= $$ (NUMBER, WHEN, WHO, WHERE, WHAT)
$$ ##TITLE= Audit trail, XWIN-NMR		Version 3.5
$$ ##JCAMPDX= 5.01
$$ ##ORIGIN= Bruker BioSpin GmbH
$$ ##OWNER= nmr
$$ C:\u/data/dgb/nmr/ADRS/16480/pdata/1/auditp.txt
$$ ##AUDIT TRAIL=  $$ (NUMBER, WHEN, WHO, WHERE, WHAT)
(   1,<2006-02-21 11:02:44.55 +000>,<MAYBRIDGE\nmr>,<NMR_250MHZ>,
      <created by zg, POWCHK disabled, PULCHK disabled
       configuration hash MD5:
       84 BC 41 DB A1 6E 1D 46 DA 25 12 A5 C1 ED C5 3A
       data hash MD5: 64K
       F4 A8 24 8F 1E 22 4B DB 6F 09 08 59 8B CC C8 C8>)
(   2,<2006-02-21 11:03:05.08 +000>,<MAYBRIDGE\nmr>,<NMR_250MHZ>,
      <Start of raw data processing
       ef LB = 0.3 FT_mod = 6 PKNL = 1 SI = 32K 
       data hash MD5: 32K
       D1 49 5F 7D 8A 78 47 6A A4 BF 5B 15 99 5F 61 C3>)
(   3,<2006-02-21 11:03:07.77 +000>,<MAYBRIDGE\nmr>,<NMR_250MHZ>,
      <apk 
       data hash MD5: 32K
       57 08 EB D7 86 C9 49 A7 ED A1 70 0D CE 7A 17 2F>)
(   4,<2006-02-21 11:03:09.13 +000>,<MAYBRIDGE\nmr>,<NMR_250MHZ>,
      <abs ABSG = 5 
       data hash MD5: 32K
       34 F8 B4 2B 6C C1 DF 6B 51 D6 E1 EC EC 6C D3 CA>)
$$ ##END=
$$ 
$$ hash MD5
$$ 2C 39 05 8C 9E 20 66 80 3D DE DC 10 BB 81 A8 F3
##$RELAX= 
##$RELAX= 
##$RELAX= 
##$RELAX= 
##$RELAX= 
##$RELAX= 
##$RELAX= 
$$ Bruker specific parameters
$$ --------------------------
##$DU= <C:\u>
##$EXPNO= 16480
##$NAME= <ADRS>
##$PROCNO= 1
##$TYPE= <nmr>
##$USER= <dgb>
##$AMP= (0..31)
100 100 100 100 100 100 100 100 100 100 100 100 100 100 100 100 100 100 
100 100 100 100 100 100 100 100 100 100 100 100 100 100 
##$AQSEQ= 0
##$AQ_mod= 3
##$AUNM= <au_zg>
##$AUTOPOS= <18 >
##$BF1= 250.13
##$BF2= 250.13
##$BF3= 250.13
##$BF4= 250.13
##$BF5= 500.13
##$BF6= 500.13
##$BF7= 500.13
##$BF8= 500.13
##$BYTORDA= 1
##$CFDGTYP= 0
##$CFRGTYP= 5
##$CHEMSTR= <none>
##$CNST= (0..31)
1 1 145 1 1 1 1 1 1 1 1 1 1 1 1 1 1 1 1 1 1 1 1 1 1 1 1 1 1 1 1 1 
##$CPDPRG= <>
##$CPDPRG1= <>
##$CPDPRG2= <>
##$CPDPRG3= <>
##$CPDPRG4= <mlev>
##$CPDPRG5= <mlev>
##$CPDPRG6= <mlev>
##$CPDPRG7= <mlev>
##$CPDPRG8= <mlev>
##$CPDPRGB= <>
##$CPDPRGT= <>
##$D= (0..31)
0 1 0 0 0 0 0 0 0 0.06 0 0 0 0 0 0 0.0002 0 0 0 0 0 0 0 0 0 0 0 0 0 0 
0 
##$DATE= 1140519763
##$DBL= (0..7)
120 120 120 120 120 120 120 120 
##$DBP= (0..7)
150 150 150 150 150 150 150 150 
##$DBP07= 0
##$DBPNAM0= <>
##$DBPNAM1= <>
$$ [...]
##$SUBNAM6= <"">
##$SUBNAM7= <"">
##$SUBNAM8= <"">
##$SUBNAM9= <"">
##$SW= 20.6930455092707
##$SWIBOX= (0..15)
0 0 3 0 0 0 0 0 0 0 0 0 0 0 0 0 
##$SW_h= 5175.983436853
##$TD= 65536
##$TD0= 1
##$TE= 293.16
##$TE2= 300
##$TE3= 300
##$TEG= 300
##$TL= (0..7)
0 120 120 120 120 120 120 120 
##$TP= (0..7)
150 150 150 150 150 150 150 150 
##$TP07= 0
##$TPNAME0= <>
##$TPNAME1= <>
##$TPNAME2= <>
##$TPNAME3= <>
##$TPNAME4= <>
##$TPNAME5= <>
##$TPNAME6= <>
##$TPNAME7= <>
##$TPOAL= (0..7)
0.5 0.5 0.5 0.5 0.5 0.5 0.5 0.5 
##$TPOFFS= (0..7)
0 0 0 0 0 0 0 0 
##$TUNHIN= 0
##$TUNHOUT= 0
##$TUNXOUT= 0
##$USERA1= <user>
##$USERA2= <user>
##$USERA3= <user>
##$USERA4= <user>
##$USERA5= <user>
##$V9= 5
##$VALIST= <valist>
##$VCLIST= <CCCCCCCCCCCCCCC>
##$VD= 0
##$VDLIST= <DDDDDDDDDDDDDDD>
##$VPLIST= <PPPPPPPPPPPPPPP>
##$VTLIST= <TTTTTTTTTTTTTTT>
##$WBST= 1024
##$WBSW= 4
##$XGAIN= (0..3)
0 0 0 0 
##$XL= 0
##$YL= 0
##$YMAX_a= 565305
##$YMIN_a= -548365
##$ZGOPTNS= <>
##$ZL1= 120
##$ZL2= 120
##$ZL3= 120
##$ZL4= 120
##$ABSF1= 16.522
##$ABSF2= -4.171173
##$ABSG= 5
##$ABSL= 3
##$ALPHA= 0
##$AQORDER= 0
##$ASSFAC= 0
##$ASSFACI= 0
##$ASSFACX= 0
##$ASSWID= 0
##$AUNMP= <proc_1d>
##$AZFE= 0.1
##$AZFW= 0.1
##$BCFW= 0
##$BC_mod= 0
##$BYTORDP= 0
##$COROFFS= 0
##$CY= 12.5
##$DATMOD= 1
##$DC= 0
##$DFILT= <>
##$DTYPP= 0
##$F1P= 14.0000005364418
##$F2P= -0.99999901652339
##$FCOR= 0.5
##$FTSIZE= 32768
##$FT_mod= 6
##$GAMMA= 0
##$GB= 0
##$INTBC= 1
##$INTSCL= 1
##$ISEN= 128
##$LB= 0.3
##$LEV0= 0
##$LPBIN= 0
##$MAXI= 10000
##$MC2= 0
##$MEAN= 0
##$ME_mod= 0
##$MI= 0
##$NCOEF= 0
##$NC_proc= -3
##$NLEV= 6
##$NOISF1= 0
##$NOISF2= 0
##$NSP= 0
##$NTH_PI= 0
##$NZP= 0
##$OFFSET= 16.522
##$PC= 1
##$PHC0= 232.438
##$PHC1= 7.551543
##$PH_mod= 1
##$PKNL= yes
##$PPARMOD= 0
##$PSCAL= 4
##$PSIGN= 0
##$REVERSE= no
##$SF= 250.13
##$SI= 32768
##$SIGF1= 0
##$SIGF2= 0
##$SINO= 400
##$SIOLD= 32768
##$SREGLST= <1H.DMSO>
##$SSB= 0
##$STSI= 32768
##$STSR= 0
##$SW_p= 5175.98343685301
##$SYMM= 0
##$S_DEV= 0
##$TDeff= 65536
##$TDoff= 0
##$TI= <Analysis number 999999
Compound Code 99
Book Reference 9
Project Code 9>
##$TILT= no
##$TM1= 0
##$TM2= 0
##$TOPLEV= 0
##$USERP1= <user>
##$USERP2= <user>
##$USERP3= <user>
##$USERP4= <user>
##$USERP5= <user>
##$WDW= 1
##$XDIM= 32768
##$YMAX_p= 347112223
##$YMIN_p= -104952
$$ End of Bruker specific parameters
$$ ---------------------------------
##NTUPLES= NMR SPECTRUM
##VAR_NAME=  FREQUENCY,     SPECTRUM/REAL,   SPECTRUM/IMAG
##SYMBOL=    X,             R,               I
##VAR_TYPE=  INDEPENDENT,   DEPENDENT,       DEPENDENT
##VAR_FORM=  AFFN,          ASDF,            ASDF
##VAR_DIM=   32768,         32768,           32768
##UNITS=     HZ,            ARBITRARY UNITS, ARBITRARY UNITS
##FACTOR=    0.157963299565203, 1,           1
##FIRST=     4132.6476996994, 0,             0
##LAST=      -1043.33573715361, 0,           0
##MIN=       -1043.33573715361, -104952,     0
##MAX=       4132.6476996994, 347112223,     0
$$ Real data points
##PAGE= N=1
##DATA TABLE= (X++(R..R)), XYDATA
$$ [...]
23012 3924 10035 15309 4880 -16499 -16449 -6946 -6956 -6945 -33060 -56595 -49504 -45730 -41662 -44458 -42558
22997 -42558 -5116 22194 17192 17959 25669 5604 17312 47862 50222 35571 33509 16743 5040
22984 5040 15985 1260 17075 25547 2088 -39630 -40633 -15336 38706 64220 54522 46273 35371
22971 35371 10105 6402 -4448 -4852 17955 2385 -16120 -15669 -1508 25575 8644 -26684 -33915
22958 -33915 -28310 11761 30634 24853 -5117 -17016 -36397 -28413 -13191 -8487 -15375 -15011 3014
22945 3014 11961 13925 18756 1135 -24959 -45396 -31451 -34236 -33520 -18449 2607 -21797 -44810
22932 -44810 -38508 -44490 -35553 -28819 -34133 -25149 -8224 -2005 3242 -8853 -22076 -14708 -11869 -20692
22918 -20692 -16343 -1637 15299 17409 4244 7872 17292 10652 -6053 -4394 9451 -16828 -7953
22905 -7953 16503 1031 -17027 -12193 -161 -25078 -37814 -37367 -53588 -62346 -28445 -41292 -59239
22892 -59239 -40992 -66807 -66732 -41221 -17414 -21892 -7969 -41562 -59542 -37676 9491 34345
22880 34345 31915 9533 77 -3028 14104 6709 7712 -2410 -31974 -27985 7660 18115 668
22867 668 -2684 -15305 -18305 -26496 -26220 -31464 -28843 -11233 -19030 -15766 -12712 -19035 3642 15340
22853 15340 2906 14839 26515 35630 20405 27549 22961 -19192 -28999 -23733 -17058 -24705 -29914
22840 -29914 -267 14398 11414 -9946 -16133 -12675 -6814 -11246 -19722 5332 -3080 -26903 -19730
22827 -19730 -25334 -29404 -20078 -33008 -14694 -10559 -8042 -12985 -12069 -24691 -20708 -24482 -26750 -19475
22813 -19475 -36656 -47465 -44765 -16176 3624 10950 4413 27317 36096 -7814 -12632 -18021 -20066
22800 -20066 -4648 7264 29570 17409 -12394 -18953 -2401 -6389 13160 18710 -12296 -5221
22788 -5221 18667 44708 22700 15542 -4517 -25695 -14929 15656 -1129 3442 15407 -1658
22776 -1658 4707 -4696 505 833 -13720 1081 15860 3390 8505 7967 2223 -10318 -10566 552
22762 552 6958 -2185 -4852 4682 17238 22719 15289 19940 9409 -2220 -3350 -21245 -18116 12506
22748 12506 -15259 -8250 -11609 -17889 -21033 -13293 -584 12049 -18858 -41345 -38923 4823 5985
22735 5985 11821 26937 29444 13157 12053 16306 16415 -22709 -65551 -70761 -43471 -37628 -11786
22722 -11786 11195 12940 -19335 -35199 -31307 -29446 -18100 8950 16075 29996 36842 41395 53732
22709 53732 12740 -20754 -36577 -30214 -48194 -39776 -5071 -15779 -17497 10846 53975 62014
22697 62014 41002 32876 26790 25256 -2541 -23901 -40606 -4603 34207 40352 32286 38314 12853
22684 12853 -20247 -42014 -17079 8495 2106 -6129 -20766 -16360 -24691 -34968 -24619 -25239 -32752
22671 -32752 -28752 -30638 -38536 -47973 -41290 -46449 -36238 -21488 -33445 -28546 -26325 -33256 -26122 -17551
22657 -17551 -23233 -33350 -60062 -57882 -57198 -49806 -19745 -10363 -3313 39224 36755 22785 33455
22644 33455 21963 38039 44118 37645 32828 26513 9105 -7235 -29010 -43465 -20078 14708
22632 14708 14680 -1534 7335 6685 1522 -17714 -43185 -35638 -31683 2009 6349 -2564 8777 11428
22618 11428 4061 -2499 1926 -13439 -36210 -26079 -10866 -24270 -52438 -48394 -32808 -15460
22606 -15460 -34090 -59580 -50801 -53959 -49462 -29407 -36963 5622 16207 -17094 -6554 12874
22594 12874 -4629 -5078 4708 2203 -17537 -12033 -15214 -47273 -32573 -25113 -37522 -61368 -38194
22581 -38194 -22084 -30121 -2068 2518 -26157 -22138 556 -23606 -58937 -70359 -44917 -20178
22569 -20178 -43588 -36085 -11532 -15724 -4162 14171 36114 18973 -4019 14983 23358 2015
22557 2015 -14050 -24767 -20882 -34933 -62323 -52171 -14814 -43598 -64855 -60961 -56191 -74233
22545 -74233 -73382 -47011 -22873 -31506 -32038 -9373 -10709 -29450 -41282 5246 37368 33067 12476
22532 12476 -20822 -36605 -29957 -6103 6332 16820 12246 7727 1852 -7458 -18817 -43602 -34187
22519 -34187 -2346 -28026 -8169 -13237 -14695 -22896 -18692 19109 41763 15073 -9808 -44397
22507 -44397 -60123 -65691 -65932 -39019 -20907 -4964 -6910 -17310 19133 48705 34558 22086
22495 22086 21586 11152 -4357 -3679 3665 -25740 -41531 -42721 -22029 -56106 -54509 -34218 3021
22482 3021 9603 23533 14018 16821 5301 -9203 -16641 -23962 -38720 -39447 -45978 -31328 -13816
22469 -13816 1718 15381 -4474 -29733 -12217 18609 17733 14464 6875 10574 11140 15220 5245
22456 5245 -5660 2202 -1582 -2069 27202 -222 -35120 -44217 -37836 -30321 1660 25051 20648
22443 20648 -32142 -26270 -14393 1153 26313 33261 15917 3650 -14870 -7660 8104 16398
22431 16398 909 -31300 -30361 -77 9659 -2384 -2502 2044 -9374 28105 39614 22877 493
22418 493 6419 678 -13821 -12379 -917 1149 -17898 -26998 -15244 -10715 -23267 -29109 -21244 -11502
22404 -11502 5772 11423 -12051 -40008 -27954 -3553 2799 6083 -12309 -24583 -20216 -13152 525
22391 525 5888 18028 29821 20841 -3872 -2792 1467 15771 5292 -15592 -8704 -23078 -42611
22378 -42611 -35075 -42268 -46681 -59205 -73715 -50659 -13439 1375 8002 13755 -16422 -49190 -48224
22365 -48224 -28702 -4693 -4832 8241 49623 37190 29551 55868 28149 28431 31632 19730 15741
22352 15741 3579 23992 31773 -1549 2274 1968 -8136 -21127 -25748 -35657 -48866 -45323 -25225
22339 -25225 4222 15802 14685 17515 1843 -3939 7288 1320 -10512 -28765 -56250 -49496 -25783
22326 -25783 5419 35745 35338 8430 -13457 -7097 -3458 -3724 -22755 -12882 -1467 -8640 -15684
22313 -15684 -10025 4553 11011 -276 -33902 -30961 -24100 -37436 -27335 -17926 -40909 -45887 -23657
22300 -23657 -6688 5139 12213 29329 4398 -11384 -4031 -9049 -1604 -26731 -28597 -28187 -25612
22287 -25612 -11136 2922 -2072 -19699 522 3950 4444 6719 22754 62759 53820 14971 -2297
22274 -2297 15946 31494 42348 35289 -10503 -46683 -49307 -24449 -12052 711 -4330 -25690
22262 -25690 -23568 -4700 -1280 -18390 -25871 -47002 -70222 -53623 -25359 4124 13918 993
22250 993 -5843 -14147 -32928 -10023 -11911 -23212 -8531 6580 41746 7755 -9686 -23924 -38505
22237 -38505 -23732 -30416 12646 48767 54969 21830 8445 21467 26713 18841 20357 16842 4497
22224 4497 7240 -1221 12831 6653 21441 28249 -3362 -39660 -36013 -18180 -10596 -20728 -26290
22211 -26290 -22262 -14560 -19285 -33527 -3860 10456 1570 4492 19354 25699 35053 40912 46671
22198 46671 4514 -8900 -14659 2080 779 8270 23125 39684 25069 28574 27394 10117 -14673
22185 -14673 -14554 -5817 4753 -12812 3641 -3421 -17469 -12046 -11157 413 13342 -12466 -21903
22172 -21903 -13590 -7147 15825 37983 25168 23174 31422 29452 24603 15122 44715 61806 16391
22159 16391 -50415 -69077 -69403 -38159 -10010 21482 11520 -10045 -18594 -22036 3273 5231 -4890
22146 -4890 4994 1373 5291 25961 1997 11373 31814 41257 38727 27551 14624 12792 11247
22133 11247 12089 5031 16983 20447 7442 1686 686 16645 777 -28602 -24816 -20670 -30927
22120 -30927 -53281 -47730 -32139 -36367 -36629 -31485 -12043 6325 30749 39993 25772 34388 31465
22107 31465 6376 -12693 -19397 -41230 -23651 -15335 9531 5363 10932 35268 43725 51300 26174
22094 26174 -1216 -8390 -15189 -7293 27178 19279 16636 -1163 -12500 -24672 -2284 -2818 8763
22081 8763 23376 21957 17085 1435 -16153 -33257 -989 20817 16411 17177 19598 25596 17795
22068 17795 -12142 -30474 -25090 -13145 -21377 -9776 20121 37762 24175 36524 39623 13499
22056 13499 -3044 -7565 -30470 -20503 -12113 6678 5879 -18625 3711 1585 -14811 -40174 -25160
22043 -25160 -17788 -10378 10998 3110 2583 -12635 -19812 4465 17958 2182 11543 15798 17711
22030 17711 -7811 -45923 -40209 -48214 -59701 -45338 -31399 -40834 -30710 -12138 2660 27823
22018 27823 12550 -8922 -1953 -7875 -12854 -12907 -11543 -31148 -34479 -25631 -29423 -20453 -14435 785
22004 785 34768 37030 47936 57102 41971 25639 13537 4213 -8038 -15101 -13062 -27346 -31810
21991 -31810 -27200 -34062 -39928 -33642 -34292 -35085 -18740 -5980 25853 13288 -7324 -7301 -22200 -36654
21977 -36654 -38411 -34388 -3427 -8355 -401 -38085 -67688 -44943 -15231 -20241 3220 23472 -5804
21964 -5804 -15983 -20989 -3364 -10503 -17668 -23604 -5445 6439 348 -17281 -30316 -20947 -40340
21951 -40340 -8940 24278 18831 -3750 -740 2761 -4615 -18145 -6058 6475 -3444 -36391 -52909
21938 -52909 -49937 -53857 -40169 -31701 -19597 -7747 -11551 -6713 19346 26423 30669 1124 -10820
21925 -10820 9774 10055 -13277 3581 11083 21452 25878 23090 21185 33360 4563 -1295 5296
21912 5296 12167 33177 37502 -12505 -9044 2822 25004 27738 16440 -2972 -24713 -44131 -46564
21899 -46564 -30240 2074 234 3803 6360 10317 -1434 -16048 -7079 -20305 -36959 -29540 -46754
21886 -46754 -30214 -11062 -5019 1629 24047 32007 34060 52131 53172 45585 10640 -2992 -16427
21873 -16427 -7368 -775 -1930 527 22753 18501 1031 -603 -7826 -20654 -48245 -66859 -63495
21860 -63495 -65791 -47835 -31277 -42181 -20768 -10468 -20261 -70223 -89553 -71967 -52400 -41873
21848 -41873 -38335 -16242 9289 -2956 -32022 -22882 5308 15050 23477 6125 -12079 -30955
21836 -30955 -28379 5541 1235 5682 -7613 -22469 -39136 -36560 -37451 -50726 -40651 -45276 -51318
21823 -51318 -55202 -19456 -3453 -29442 -30719 -33364 -26106 -39184 -48541 -12279 17725 10669 29088
21810 29088 57813 80601 57131 10680 1201 -9185 -44880 -59505 -59865 -49204 -32249 -38698
21798 -38698 -44915 -36511 9728 30175 -12223 -22674 -7944 2590 -6640 18336 39234 33050
21786 33050 20004 17037 14595 3433 -1128 -5794 13477 4574 6990 -7683 -29705 -22215 -13171
21773 -13171 -18364 -45688 -38462 -10277 -7015 -1435 -6529 -10467 -11157 -9975 -31504 5546 33367
21760 33367 44118 40602 51349 37507 14797 6115 -2788 -15304 -40686 -59895 -30627 -13156
21748 -13156 -11771 -7235 -4463 -21938 -6410 10304 9320 -4537 -11481 -21825 -38430 -22924 12340
21735 12340 29522 24362 32392 -2419 -21042 -16176 -4435 -258 -5978 -12918 -9805 -5957 -9564
21722 -9564 -8982 5047 -9350 -21519 -49639 -45920 -23382 -23645 -4725 9803 -33321 -24963 -22961
21709 -22961 -3618 -10473 -2639 -25447 -25043 20852 47602 55667 53194 65151 17466 1861 -4632
21696 -4632 -18244 -5351 24195 -1372 -19617 -35944 -32064 -51684 -43334 -10190 -12835 -24198
21684 -24198 -28531 -34305 -24423 -6569 -1753 14533 18921 20866 40656 32236 19061 7134 9221
21671 9221 4424 -23480 -17967 -10850 -18685 -19025 -676 -5210 -1380 -11643 29438 52201 40045
21658 40045 31671 30153 -4848 -13765 -15080 -16428 -1564 3627 5742 18823 28142 19698 19269 52415
21644 52415 52622 29075 12520 841 7114 23929 38120 17426 20137 1170 -14238 5890
21632 5890 -1917 -47527 -44129 -55467 -49566 -14654 5209 -19683 -20948 6601 44722 52118 18873
21619 18873 15413 18703 -997 -16836 468 621 -33549 -22919 15673 -6408 -22031 5110
21607 5110 10560 2902 -25094 -29468 -24306 -3584 129 -22949 -7638 17442 50338 19985 9748
21594 9748 21086 -5857 -24353 -29823 -32049 -17828 18049 16117 -5031 -10919 -3786 2618 12516
21581 12516 30349 43353 33424 -1947 -5721 21330 16759 -8186 282 13185 901 21187
21569 21187 8990 -8725 1303 16194 12723 -13196 -24153 -29417 -11453 11891 40337 24260
21557 24260 3788 13901 -10982 -29620 -20706 -2264 -4099 25761 22889 3021 -11301 -9883
21545 -9883 2638 29972 17255 19341 496 -9745 8620 20929 8969 -18570 -7572 21247
21533 21247 10670 20246 34236 50111 24685 -727 35642 36649 26933 -1223 -12193 -30731
21521 -30731 -47820 -29472 13845 13326 28387 22901 12697 -25651 -37494 -25199 -24300 -10917 -4079
21508 -4079 8629 8817 -1080 -4433 -4249 11105 -655 -4438 2361 -56926 -80351 -76030 -46515 -33040
21494 -33040 -41289 -51992 -15997 -26086 -25351 -18473 -39927 -40657 -22426 -6720 -5454 -26006 -20030
21481 -20030 10054 1577 -29841 -39292 -34263 -36410 -26849 -33086 -27610 -44627 -17366 -3309 -14753
21468 -14753 -16432 25888 30528 19776 15293 -12205 -16570 -12086 2964 8396 24287 7867 -17552
21455 -17552 -4401 -41405 -51619 -21992 -5260 5789 11047 14686 18956 32213 16018 -3972
21443 -3972 -7218 -580 -3136 -29226 -35837 -50501 -37653 -17344 1913 -13113 -16201 4979 23027
21430 23027 14719 27884 40288 46954 31787 14530 35762 48338 60756 61581 34777 33819 10176
21417 10176 -14295 -34421 -10356 -2146 18397 23152 10153 -5388 -13800 1400 27290 37294
21405 37294 49528 25273 2330 11794 26915 36892 45381 48034 60009 48430 27962 4037
21393 4037 -3980 20705 48453 38796 19784 24023 20320 -9485 3466 -2398 -13867 -3733 -10626
21380 -10626 -13319 -14449 -20101 -48047 -48326 -184 49530 68031 39155 31447 16706 28178 2906
21367 2906 -11168 -1117 5956 -6702 -6604 10441 9509 2058 3548 23031 21131 -2651 14434 3228
21353 3228 -14256 7892 -5049 -5113 15081 28740 21614 16426 -5675 -6992 -1513 -14313 -5150
21340 -5150 1983 -2309 2964 4121 13036 17858 -11388 -4621 11383 32786 25887 4091 -5469 19546
21326 19546 27748 34369 23560 3171 -27773 -38191 -32162 -53656 -31295 -24821 6691 20100
21314 20100 13412 13793 18147 22925 25131 30584 19901 -5806 -16105 2786 24467 27767 24565
21301 24565 20835 -2661 -24846 -43251 -37600 -38324 -30241 -19566 -29203 -26252 -20973 1224 7478
21288 7478 537 19494 12068 12741 45378 47263 54043 48556 24257 9414 1833 -5641 9696 33959
21274 33959 18721 18143 28080 17368 -3708 4858 18085 4525 -2060 17317 -2846 -41538 -40547
21261 -40547 -35494 -24466 -27941 -10051 -9359 -1889 -6973 -3774 -21617 -10794 -3717 5357 15891
21248 15891 297 -10375 10609 5232 -3118 -25850 -22025 -656 -928 -18478 -31765 -19832 -17581
21235 -17581 4619 42885 26083 -2451 -1602 2683 2111 23055 44449 50903 48837 45108 39080
21222 39080 29693 16057 12401 3004 4047 7276 20073 36791 5553 -32950 -9416 14503 -5380
21209 -5380 -27087 -19340 77 22095 15618 16613 6779 14676 20775 10684 -32333 -53257 -18766
21196 -18766 -3140 -13367 70 -4262 -35322 -32688 -35771 -27109 -8678 -10893 -20682 -44041 -48345
21183 -48345 -51820 -49448 -25105 -8911 -12306 -28409 -17587 16111 17863 -11043 16789 31236
21171 31236 -7484 -12078 -18873 6370 24212 -13876 -20682 -13237 -14636 -52180 -77823 -76543 -65852
21158 -65852 -48135 2093 32742 42584 -2120 8760 18430 35577 64993 45584 31527 49672
21146 49672 56383 66530 53315 42398 36754 42985 29720 12194 3772 7095 -6001 -25436 -33488
21133 -33488 -42158 -35628 -27781 -13623 -9089 2754 -17957 -23408 -10451 1411 -6054 -9825 -12289
21120 -12289 10376 17807 32322 38510 44405 23753 27229 12815 -30223 -31949 -27394 -33140 -47463
21107 -47463 -50127 -40323 -5165 -5838 -2276 15702 12515 3862 -9960 -15525 -14647 -10107 556 15542
21093 15542 19871 26210 42929 37282 17823 2680 4656 31575 40789 40336 47824 33986 2872
21080 2872 11166 4769 -2277 25020 30348 25338 30609 16163 5177 -10980 -40734 -28975 -1996
21067 -1996 -20971 -8154 21962 18431 -5232 -23768 -41251 -53854 -57869 -43166 -11124 1596
21055 1596 16856 21549 17620 50524 69318 73583 48292 9659 16768 21520 23918 33199 39546
21042 39546 15198 21736 48278 46707 27719 -10823 -20892 -5476 20220 11594 20005 36760
21030 36760 17414 -34840 -49118 -31633 -27871 -37161 -38073 -37510 -39820 6209 21325 -5046 -11107
21017 -11107 6023 4432 15636 45521 35079 8096 -1862 12296 -10732 -3719 7123 16784
21005 16784 763 5750 -7932 -13123 -10377 -7746 -9223 15737 27210 17835 13813 2399 6406
20992 6406 8058 20231 1068 -10599 22042 44340 24329 10019 7200 24604 51387 42343
20980 42343 21402 -7546 -6450 25519 52877 36583 22611 26229 28886 31303 31125 26942 42992
20967 42992 45515 30918 2212 -11940 -5751 1148 22486 53475 49451 43104 39608 29747 43570
20954 43570 47914 38015 19761 39255 53117 62500 71207 54252 37592 51907 49420 50991 40877
20941 40877 46336 34379 11901 18667 40037 25533 17636 36514 30761 35670 34333 27774 5155
20928 5155 -18522 -46091 -34556 6575 22999 26521 16186 -27240 -28005 18128 48748 19238
20916 19238 21927 3110 -8932 -11233 12064 30641 30080 8352 14064 27925 16125 22333 32233
20903 32233 52567 68907 79991 83344 57032 20277 31363 15816 5492 943 14457 19171
20891 19171 20774 -3249 -5244 5959 9815 -687 27562 43140 28505 20817 32880 63822
20879 63822 43003 -7936 -8532 15213 50269 56696 31240 33084 51827 36252 2494 -11055
20867 -11055 -34321 -16451 22667 43056 49060 38858 12024 -1207 2518 2881 4230 11240 42314
20854 42314 27305 15499 -12212 -29770 -43121 -59225 -30642 19664 23911 9360 15674 22064
20842 22064 9727 -14444 -20437 19164 58534 29043 -2365 -8776 -26573 -5258 9610 10265
20830 10265 -9704 7929 21594 5814 -15098 -1988 23986 23577 36398 8964 -27850 -26839
20818 -26839 -69874 -43922 -22840 -12112 -4880 -2794 -3198 -8383 5830 5399 -19476 -51456 -57228
20805 -57228 -33998 -2532 -19719 -32457 -31801 -26825 -3156 -595 -202 15238 5704 -14521 12858
20792 12858 34014 14958 9533 19522 33326 28039 20650 47626 27389 14422 12845 19168 8060
20779 8060 26244 20898 34810 42207 39491 62173 58717 56790 83779 90756 71008 49984 8625
20766 8625 9067 37403 24684 -1940 19408 39889 30824 3716 -26015 -31925 -19038 9962 1599
20753 1599 21366 10688 7889 -3450 -30006 -21627 6634 50827 53522 13967 3785 28037
20741 28037 64737 64829 51022 59516 66367 70808 76248 56167 44187 25919 38881 72908 83460
20728 83460 95391 73076 44099 23943 23466 6924 26705 23240 15041 18694 52045 54307 42795
20715 42795 20528 17360 14521 -4360 29891 38959 23943 25985 14288 11466 31470 37899 35244
20702 35244 19847 18534 31356 56901 54090 46057 15643 16836 20120 5520 10102 23114 34513
20689 34513 31122 30010 31227 33335 32672 9312 -6045 -24304 -10333 -1394 4595 20970 11973
20676 11973 18336 25165 24510 22400 30038 15196 22745 38928 4516 -20567 966 24279 37754
20663 37754 28455 6958 -3374 -3102 -3267 -13506 516 21774 22175 32927 22873 31410 48996
20650 48996 22374 23022 44355 29186 51918 71859 46719 26728 36564 38559 23766 13463
20638 13463 14265 31121 21106 9014 9824 5619 -16564 -2307 16984 1396 7293 31439 26890
20625 26890 16591 39312 44776 33553 11280 -16043 -47003 -16667 17501 9719 4992 3341
20613 3341 3487 6009 13773 615 11776 2901 -30798 -35074 -25905 -23863 -6473 8785 22189
20600 22189 14562 28996 14510 -5514 -10737 -23902 3883 32785 24725 6422 19416 37689
20588 37689 49682 21326 16102 25129 34827 30403 36195 37579 24686 1397 -24084 -33701 -4914
20575 -4914 15778 20261 23537 26539 54154 57060 41701 51945 62901 45051 19018 -24582 -64875
20562 -64875 -66840 -23540 14658 36070 66142 93027 90201 85882 71892 60586 24429 -9255
20550 -9255 -20511 -27692 -4254 16975 19261 24646 30457 40045 49484 52981 17589 3490 17174
20537 17174 29828 26938 21687 35326 45013 48098 55817 45021 40897 46178 34817 28348 23463
20524 23463 6908 2601 18387 17012 6054 -667 -9748 17801 35200 19582 -19552 -18291 -389
20511 -389 14759 37340 54856 36336 10845 21437 14528 7622 29893 37100 57758 41286 24169
20498 24169 19192 20911 28102 -6621 -17410 -8924 18568 41596 78469 98018 72933 62084
20486 62084 43261 38800 33427 13200 7593 4611 16837 30586 -3487 -16606 -12653 -30755 -9064
20473 -9064 -10146 36624 55557 25852 12315 26549 44596 59275 51057 21291 -867 7369
20461 7369 49354 25728 301 -9220 7796 24195 31404 37374 46501 52909 50995 5850 8494
20448 8494 40958 34030 18667 30591 57104 79632 87671 77052 68212 83249 54276 20841
20436 20841 27212 27503 6004 15952 45468 60932 66349 91494 99598 87941 68940 52248 34282
20423 34282 48476 32741 28420 38888 37435 31878 12825 578 15637 10243 -13235 -7886 -19783
20410 -19783 14687 66371 50083 33932 53037 61548 50449 44394 63763 76941 77155 96395
20398 96395 98007 69144 39965 22666 27569 47940 30965 27814 19087 24016 32616 50422 74872
20385 74872 67152 34991 13415 24189 -5668 -18064 -6273 10128 34211 52190 29505 3765
20373 3765 2260 -13558 39155 69912 68726 52145 32146 21680 -1327 -6420 -19815 6968
20361 6968 16879 17887 11136 39998 34644 10623 -26232 -36794 -8630 19915 10057 -14585 334
20348 334 17851 -7163 -11144 -10420 13218 11697 28542 63398 42258 -13002 -10701 15893 30296
20335 30296 25684 38360 34644 43483 49211 34228 26735 24003 27557 27452 20773 6664 17261 19906
20321 19906 12227 18150 9565 8269 4419 7876 29859 32468 24231 33792 56009 40899 29849
20308 29849 9237 5822 19834 30069 25418 6800 -19763 -28023 -51454 -36924 -8593 15842
20296 15842 26983 43542 50349 31912 1939 108 1368 -8024 -25563 4891 40822 40392 30030
20283 30030 32903 21688 38249 47241 44401 17716 6653 24117 33140 29329 42737 62527 71862
20270 71862 77331 71886 62990 48155 49647 50196 57620 80114 68765 51034 76179 92841 77430
20257 77430 60356 57041 64011 41773 9315 24145 50398 62639 64652 84804 74649 51464
20245 51464 32391 22833 41811 64563 59792 41336 41955 70856 66858 35423 11713 15294 36112
20232 36112 35807 28387 27722 21551 17983 9445 -4454 6406 30458 33430 19619 15261 24234 31360
20218 31360 58014 69869 57187 53869 71663 62148 33914 38625 39051 31231 -3938 -33472 -13225
20205 -13225 27779 50461 59178 46205 29965 26426 14198 22306 24508 54682 60369 46267 43838
20192 43838 54445 64553 40856 38959 65393 68883 56984 42455 29263 27081 55089 54380 45312
20179 45312 46100 31344 23462 29470 34782 48408 40930 47178 45998 63298 73734 74300 87556 108453
20165 108453 121103 123043 95891 93955 87653 88711 94117 90765 108381 90942 96723 99434 105289
20152 105289 131342 154827 182198 232254 267860 361697 487945 553012 562673 558650 527965 452057
20140 452057 365521 316063 290886 298307 302311 301656 297743 317482 352579 382671 424789 492410
20128 492410 535190 549646 543592 536618 551023 514101 489894 450957 378482 290472 216554 180413
20116 180413 168084 177840 184571 173477 177461 184536 155176 133738 123812 118319 141211 157274 167190
20103 167190 198474 216632 213926 206582 219805 241800 240139 214857 204683 199848 201825 236709
20091 236709 313631 386863 436927 525747 609063 596698 556088 519614 438201 375425 363352
20080 363352 389579 433558 470174 499313 503163 501245 497464 508346 514227 487408 435427 397136
20068 397136 350491 292244 257407 220471 211431 237582 208887 161866 134786 119597 128317 113788
20056 113788 104559 83108 90091 96026 88194 95267 124379 138407 113214 100158 90695 106365 125060
20043 125060 95622 56795 37967 46974 69274 64917 50564 41811 40982 44161 40851 80232 91513
20030 91513 53022 28383 59960 55690 47107 46780 26919 4109 -7978 5412 16020 35441
20018 35441 66270 96790 118703 119668 72857 42889 60762 62278 57496 52673 46875 45230 72827
20005 72827 101591 87269 75829 67034 62202 61160 77282 81911 69534 69429 61063 45718 75454
19992 75454 82625 84471 73843 45236 43269 58014 55416 70821 74162 90455 92589 123699 139155
19979 139155 125018 123739 122157 106553 102857 121225 130237 116078 88281 65407 52514 50194
19967 50194 69646 78353 62801 43617 38601 61763 101214 108212 89700 77938 96794 101105
19955 101105 100745 110209 112997 106653 129329 170969 147017 116708 115201 123561 133668 123726 116022
19942 116022 90176 91737 76917 86916 111850 112194 118275 148885 164797 169864 172796 151894 119416
19929 119416 115031 103385 108324 108597 104958 111330 134351 133676 132201 104599 81770 100594 152978
19916 152978 145837 157281 141751 137829 161511 141187 98416 85825 93667 69951 89110 113495
19904 113495 125181 131996 140687 127148 112938 125019 144739 158395 160101 148145 142310 139419
19892 139419 105873 95486 120108 120302 120861 121781 118760 114563 133697 133396 152580 137855 131320 148052
19878 148052 157513 153721 145418 163365 153168 126642 124690 128225 126612 146785 154360 153288 182508
19865 182508 197463 198718 209738 184771 185358 189111 181277 187916 202718 225908 230468 196532 172891
19852 172891 154911 158594 164643 181467 181741 191169 168338 183896 185847 201795 211614 194740 164236
19839 164236 174770 202324 194958 200396 215791 204511 174162 149049 155408 171283 183323 193721
19827 193721 203518 179492 159570 151203 173534 211870 218110 229462 237420 239031 231824 200803 176729
19814 176729 188525 182687 203460 234852 244045 241429 245955 243725 278138 273781 291544 321471 337250
19801 337250 369973 371223 370294 370808 370315 362278 341808 316034 286209 260674 242629 219293 187844
19788 187844 183692 193251 191876 195514 209446 219022 194306 189420 201642 191126 150688 153215 159164
19775 159164 149142 162840 176781 216732 247280 265618 233423 225911 217524 218402 217708 210562 204316
19762 204316 203403 201300 217064 239924 242695 236923 213623 224948 212990 219589 224752 258488 273838
19749 273838 276198 285337 330630 332289 315676 278225 272531 300488 308599 317622 328476 355221 356400
19736 356400 343844 354980 331039 320588 348974 362387 366479 324790 280349 224479 178833 188011
19724 188011 180304 224421 257917 270242 282128 266282 265205 267344 266978 251678 239776 244260 256815
19711 256815 291968 300661 291455 311855 298002 284894 288145 314634 347895 354944 373931 377173
19699 377173 371652 387145 370824 366071 358518 383785 424283 441822 461661 470554 471266 480784 487042
19686 487042 476029 498345 505324 490503 524106 576596 612850 635672 676520 693266 684225 686573
19674 686573 659411 650453 645234 651716 670314 668045 662330 665826 669550 682178 696821 713153 760429
19661 760429 805979 824025 844499 841163 864931 898518 924113 938977 941000 972454 1003181 1074081
19649 1074081 1119934 1179511 1247667 1309601 1376603 1435207 1495869 1550834 1649308 1748235 1847789
19638 1847789 1961077 2091529 2278909 2482435 2714621 3036669 3462377 3927203 4438902
19629 4438902 4953894 5463497 6095336 7043747 8438914 10573459 13569782 17043324 19811117
19620 19811117 20769490 20333152 19136977 17886612 17179002 17298966 18318908 20374133 23767819
19611 23767819 29118437 37607305 51378488 73065739 103785877 139388475 165653200
19604 165653200 172073203 163263639 146227377 125934651 105467224 87120191 72273263
19597 72273263 61049549 53902421 51410350 53238559 57766867 61347997 60369492 55001182
19589 55001182 47094522 38329495 30396163 24187688 19741630 16749574 14818438 13557438
19581 13557438 12724833 12126001 11651649 11246203 10952272 10810123 10782583 10936881 11193863
19572 11193863 11524367 12016987 12861245 14173795 16245612 19471657 24478392 31885166
19564 31885166 41635361 51949759 58958925 60751283 58776630 55036995 51795008 51402449
19556 51402449 55419664 64522436 78224284 94786326 115037466 141974978 173074089
19549 173074089 195565653 195283696 175943757 146347722 113284066 83915111 61957461
19542 61957461 47015376 37250872 30865657 26729266 24255975 23074089 23229495 24674106
19534 24674106 26753404 27846410 26768910 24091107 20595395 16973610 13863793 11552911
19526 11552911 9950929 8816294 7893120 7049466 6285446 5611878 4999792 4459097 4021181
19517 4021181 3670784 3388930 3156101 2963881 2795825 2669088 2544899 2390160 2259177
19508 2259177 2130780 1994658 1902978 1820533 1732873 1649307 1585018 1494554 1379246 1297582 1220988
19497 1220988 1152096 1115255 1068541 1047056 1034273 974754 957394 927617 875118 845484 813721
19486 813721 784062 748273 720094 676623 652767 619828 588394 527133 457243 414273 386194
19475 386194 387396 401126 407746 398531 362417 342445 338872 346443 353307 322695 291215 290469 275776
19462 275776 257044 238999 239273 280481 306858 301201 282014 287916 266748 265936 244271 256620 259811
19449 259811 240827 255552 291036 292043 288932 297730 296243 258412 242630 247789 245780 212973 228311
19436 228311 255615 254833 234226 215478 212646 212406 234975 239539 284589 260181 227033 212135 187557
19423 187557 178364 131564 107295 96651 73823 67727 72062 58430 11774 -13245 -7477 9542
19411 9542 27026 32986 6750 4843 24754 43917 72051 70462 41281 26853 35488 54335 62937
19398 62937 40679 48561 63868 56753 38567 41151 67035 72594 77299 97095 146393 143669 113836
19385 113836 100012 90544 104916 143134 149688 125283 131529 125203 76064 84046 73500 71637 64167
19372 64167 69047 97664 100858 107956 101570 96796 98399 63815 43764 70319 36637 -5753 -17139
19359 -17139 -21795 -65794 -101300 -90779 -80531 -84451 -79499 -69074 -26898 -44064 -67765 -79880
19347 -79880 -63076 -9717 356 7522 28384 39519 56174 61050 51372 27042 -3534 3417
19335 3417 7071 -35317 -20755 6902 8543 8198 24838 15218 2295 7146 18702 -13210 -38935
19322 -38935 -32313 -28169 -22703 4373 20579 38254 42556 33335 -1394 -31616 -47172 -23757 -6547
19309 -6547 -2331 10288 7219 1289 11150 21084 30560 10301 31365 39349 20457 13376 6756 27932
19295 27932 31812 33544 18514 6408 23691 38324 45410 53465 59665 49426 15493 -1488 -13052
19282 -13052 -24008 -4844 14684 -10704 -48714 -26293 10013 27523 17716 -20996 -21366 36041
19270 36041 66728 53831 50827 40158 32384 19247 549 -10430 16634 33020 -2274 -10311
19258 -10311 -13325 -3414 -21203 -36131 -19873 6743 20437 16036 14242 23420 7835 -19337 -13676
19245 -13676 -4808 8480 10863 4880 -9826 6275 -6773 -3006 5624 45911 59698 65885 32104
19232 32104 19042 27766 35104 25649 13315 23234 27255 9239 29205 37128 59707 86408 74370
19219 74370 45913 16471 48551 67162 54603 64125 57924 37478 30053 6851 22334 27736
19207 27736 -14207 -20496 11756 4097 7875 21482 41636 40762 27623 9438 17829 27801 1861
19194 1861 -17548 12087 25902 21690 15950 12673 4583 1128 1122 19926 24374 -12331 -14845 -11639
19180 -11639 12478 20819 4040 8489 7118 42852 46632 27498 -4008 -1022 38130 63258 24597
19167 24597 1677 12273 39040 47629 53621 30956 21512 13950 38792 49815 43786 45142 33260
19154 33260 27624 19108 -1066 -9380 81 34763 53021 60817 58985 67727 76671 110452 154638
19141 154638 187608 223009 267016 276941 297049 352063 396045 428775 462583 492542 495647 477633
19129 477633 471256 490351 480970 472463 493529 525469 556928 615145 647691 630187 592047 547625
19117 547625 501709 454285 430280 407177 383618 353110 339613 327982 334861 344417 289759 257915
19105 257915 247208 241416 219191 195623 173450 147712 111453 94722 107670 123299 133205 145727
19093 145727 155348 186192 192935 212955 232688 266613 283360 306983 326582 320932 333962 369186
19081 369186 417191 485765 584517 701894 816883 923463 947650 964508 980286 953066 908515
19070 908515 861449 806220 724923 673213 661940 699831 776027 838463 896840 899189 848849 752590
19058 752590 665439 577382 503015 402935 313232 268177 259385 252486 245318 228879 204314 192070
19046 192070 204560 212477 196909 162554 139802 112596 120436 136357 121950 122855 123230 144423 185361
19033 185361 184569 204003 236634 269337 328987 377909 433957 505609 571989 592142 619559 659622
19021 659622 672556 642523 604653 555605 491393 402167 334212 282915 275901 287948 315676 367053
19009 367053 401530 429322 464614 521420 586504 657366 652175 593982 502273 416700 321146 260100
18997 260100 197293 172931 174115 160107 150414 149550 158527 123670 86868 96162 109751 107875 90571
18984 90571 68049 81314 71043 84102 70008 77460 92278 103714 105310 97883 99138 82532
18972 82532 88150 88289 94128 97472 81628 84657 74449 74520 83836 88744 75402 78634 56231 57565
18958 57565 76727 112594 127004 121534 84184 56280 90255 80172 72579 83393 80963 108370
18946 108370 95154 62279 54324 62352 62416 58217 72298 101182 99571 101892 113771 113208 94462
18933 94462 84551 92727 83506 96521 102230 95339 79004 105030 79376 64320 93838 108701 110213
18920 110213 120410 140139 145790 144066 155981 136718 136383 124380 131073 129208 119198 136678 123544
18907 123544 93445 118692 141535 128384 136946 142149 114982 124768 129446 98419 102110 111791 92325
18894 92325 98230 111233 147673 161769 148461 119160 115808 115177 101601 100702 127970 148988 171817
18881 171817 163527 164520 142830 156495 169362 151335 136803 136788 136136 134348 133623 114350 97527 101879
18867 101879 132982 174387 190429 222871 259372 265478 256742 257730 259933 246166 227550 219025 237767
18854 237767 231411 199883 187217 188365 184158 209870 217564 214656 199667 200321 198153 176589 177947
18841 177947 186012 183904 179545 185018 197152 194365 178671 186031 210440 233866 232945 217442 185425
18828 185425 180893 146846 131257 142042 163017 169080 187483 223822 240235 238967 242190 244461
18816 244461 233486 203464 171547 170412 193418 211750 236432 261030 286802 288289 315362 328252
18804 328252 353279 346057 340122 359147 364460 343211 329221 290044 276379 250621 225556 191991
18792 191991 192723 207249 193384 201066 215860 238014 218773 208330 184211 179456 168250 165641
18780 165641 173914 207126 226976 226674 234422 219638 177637 173318 189833 196645 195496 212566 215277
18767 215277 224294 214958 199687 187792 193925 170970 172567 185746 206415 239279 218626 222578
18755 222578 232972 229915 200922 204908 232235 270958 303373 307369 327625 328233 314669 326619
18743 326619 346918 345824 306207 301272 332764 369343 376808 328413 293365 274989 258232 287072
18731 287072 292476 301884 289092 257785 253612 254437 269516 273905 272784 275357 251173 260788 271158
18718 271158 265344 286094 281543 274349 286821 275540 271157 268119 291746 302699 304399 307227 324783
18705 324783 341575 364637 371074 346921 361330 380567 391682 396830 402800 448069 469937 462811
18693 462811 474209 473121 479643 487602 500640 532949 554651 596082 612030 629745 651777 677049
18681 677049 708192 728770 733924 721929 728028 712566 680821 663135 686155 718325 710735 726163
18669 726163 755168 766107 764470 801939 820964 843918 876661 870428 902144 956478 1036501 1057726
18657 1057726 1082643 1160606 1254935 1321677 1344308 1369683 1405745 1460051 1557704 1667272 1779732
18646 1779732 1911019 2055892 2226348 2458834 2726412 3017088 3329354 3651855 3911616
18637 3911616 4148186 4363016 4596764 4905373 5352806 6000678 6944590 8347247 10323195
18628 10323195 12636997 15123011 18020112 20836877 22272549 22559510 22433833 21931915
18620 21931915 21403709 21486525 22606212 25184438 29927359 38005035 50810341 68378389
18612 68378389 88366199 110679541 137312260 159801992 166674831 163563992 155927621
18605 155927621 142602057 124362886 105678803 89781946 76896207 67404711 61711304
18598 61711304 59089856 58983671 60229051 59562185 56099131 51269927 45287124 38451930
18590 38451930 31959094 26459929 22034948 18666541 16220000 14549460 13467883 12756859
18582 12756859 12270052 11968430 11738436 11596094 11530503 11569627 11796307 12274366 13151117 14646813
18572 14646813 17035987 20599571 25338230 30784585 36893218 43784290 49602946 52171166
18564 52171166 52793671 52921582 52967189 54062815 57317621 64181577 76146213 90988105
18556 90988105 105377969 120069179 136826123 151336946 152923404 143220131 129371645
18549 129371645 110845210 89446850 70176873 54541069 42289347 33475875 27728506
18542 27728506 24292947 22475381 21656459 21515032 21999140 22551214 21969613 20486771 18682879
18533 18682879 16444585 14042402 11874941 10019296 8516648 7396272 6593291 6009184
18525 6009184 5551367 5211888 4935922 4622591 4287482 3986198 3669998 3306956 3011804
18516 3011804 2774135 2570262 2366481 2204947 2042163 1920440 1811745 1715072 1624587 1585474
18506 1585474 1505153 1412151 1325665 1265373 1212502 1145434 1095476 1059833 1039786 1002015 981796
18495 981796 924620 852916 844055 836344 800524 777405 758063 737660 717919 686426 631377 555230
18483 555230 495589 447412 410157 361821 337436 344168 324558 328195 347540 340119 326909 309254
18471 309254 301079 288033 293308 303966 296888 262746 245366 240382 235647 220148 220546 231300 230212
18458 230212 250824 229657 205129 204999 183951 188361 217365 233072 241740 233938 227202 215095 191238
18445 191238 192820 190394 207121 213449 222023 201903 206365 199732 198046 192886 190317 194683 169555
18432 169555 155807 180946 173957 130054 132410 133571 123122 137087 135695 117040 104801 79775
18420 79775 53541 30977 -525 -5800 14746 -3498 -15162 -24752 7304 17349 -2473 -12489
18408 -12489 19172 32242 26121 22475 -4405 -6664 11216 33908 39062 24112 22701 45908 63301
18395 63301 52271 43251 51610 65472 59023 72908 96067 75005 49284 44440 25940 15254
18383 15254 16035 54666 85746 110710 102880 88069 57388 42863 57863 66254 72254 43062 11517
18370 11517 20401 33623 22942 -2617 -23663 -34517 -28793 -81744 -104952 -86439 -60415 -56865
18358 -56865 -75270 -66235 -66561 -55897 -34435 -29019 -60612 -73022 -26711 -4377 4812 5580 15755
18345 15755 -17589 -9115 14826 -23609 -44954 -10056 15363 3087 -33645 -6987 15434 9642
18333 9642 14318 3656 6054 2038 -13588 -15467 -18658 -6419 -2096 -25851 -31472 -10200 -33628
18320 -33628 -49197 -50857 -62876 -65382 -55777 -43376 -54737 -63613 -35049 -188 3213 -10729 -8065
18307 -8065 -14008 -17411 8077 15151 -2784 -32443 -47491 -22558 -20960 -12427 -2158 6920 11393
18294 11393 5023 -24686 -27187 -15890 3008 8917 228 -3544 -34385 -54627 -33469 -12734 1800
18281 1800 9559 17385 26326 9998 -9009 -10850 -23450 -27770 -29011 -27519 -11320 -18947 -57956
18268 -57956 -55808 -26306 -30048 -28751 -25262 -35789 -10478 -18798 -44310 -38934 -23546 -27376 -35550
18255 -35550 -19752 -22136 -2383 52008 26489 -16084 -20473 -3147 7738 3687 12433 -7087
18243 -7087 -29445 -62086 -79885 -82879 -73830 -64321 -66380 -59554 -57679 -45668 -9431 6384 10142
18230 10142 -6474 -34794 -35543 -35047 -18998 -31415 -40600 -70627 -54433 -42600 -49058 -23930 -11722
18217 -11722 -25037 -10963 -14451 -22851 -13311 -7224 -25411 -65129 -75433 -44226 -22616 -8495
18205 -8495 182 -12500 -7496 4146 -10936 -15931 3799 4326 -11160 -34871 -45635 -22680 1170
18192 1170 18296 12154 8519 -11241 1198 5351 12576 26250 19340 8942 -1223 -31699 -35159
18179 -35159 -8776 -10443 -26364 -12170 -19523 -26065 -2698 7173 2503 -3747 1142 26789 33855
18166 33855 11171 -6273 -15829 -20152 -29942 -9802 -10882 -20524 -1187 -21847 -55567 -52420 -18611
18153 -18611 -8540 -2559 12466 2375 17835 18309 10387 29112 10755 1140 5386 -14325 -7267
18140 -7267 -23206 -23260 5718 31940 13315 -4678 -27846 -17414 -23172 -21174 -23655 -59 11688
18127 11688 -15279 -30305 -24082 -10271 -10891 -19472 -16583 -3651 9132 42211 51594 24528 17918
18114 17918 26741 25114 29474 29729 76794 96459 72579 47462 20970 19979 54344 75648 100562
18101 100562 128964 130351 114726 107698 108900 121672 186800 229859 247469 260835 270815 310520
18089 310520 314651 349665 390506 423934 482572 507179 549953 574065 575830 557389 538249 498885
18077 498885 470623 440666 364806 328794 313457 282216 249840 235633 223533 219847 228322 205863
18065 205863 188187 154844 144104 141734 120636 115987 115130 114440 134670 97898 88565 103425 80165
18052 80165 83880 119227 101304 82010 105794 160664 172529 203464 255594 301721 320622 320922
18040 320922 337106 347433 340093 347079 400254 472899 490996 481715 476773 437906 382792 329691
18028 329691 278981 288676 325903 339861 346173 334649 353828 364246 373330 349970 318198 282465
18016 282465 258697 222064 187548 169655 170477 137137 110742 74256 57979 59181 68136 63433
18004 63433 30991 13378 -1393 8239 20055 -108 -23156 -19826 -10791 -23015 -18175 5225
17992 5225 10806 -14566 -4300 3987 -23120 -43793 -52641 -30055 -37135 -31747 -5770 5422 -7324
17979 -7324 -32281 -28638 -36549 -31995 -18977 -14159 -19115 -15420 -11988 -20965 -27853 -14471 5001 1745
17965 1745 3423 1066 -2091 2910 19770 7078 -19082 -12214 1841 10174 -12463 -13831 -10637
17952 -10637 -9219 -15508 -35156 -16878 -20700 -33690 -45579 -61366 -55696 -32589 -1180 12984
17940 12984 14300 -5441 -20939 -5224 12889 42564 32013 9442 2936 -11597 -24492 -13346
17928 -13346 4306 2019 -7868 -10086 -17670 -25961 -63284 -82087 -63321 -28620 -19892 -6967 -11605
17915 -11605 -36519 -40329 -23655 -24765 -6158 -4625 -20070 -29924 -19404 -2069 1265 -4798 19628
17902 19628 -6503 -34322 -27347 18985 17113 -24805 -38185 -74881 -86488 -51946 -26495 -7223
17890 -7223 -18835 -35287 -32417 -23726 -39754 -35257 -18104 12008 9769 13069 378 5440 6097
17877 6097 8759 18651 12495 4300 -17093 -5848 -11755 -41471 -44873 -25908 -32513 -20336 -9967
17864 -9967 -3299 -1107 -2228 -55489 -66770 -39621 -42492 -9384 -17688 -41696 -58246 -29596 -21571
17851 -21571 -15638 -18759 -17759 -5407 -3925 -4647 -11941 -26196 -18554 -14770 -583 14537 -3252
17838 -3252 -5128 -1602 10470 15690 -18815 -30260 -14926 -30578 -39837 -23071 -4772 1474 21950
17825 21950 69020 29324 -28243 -58600 -36244 3612 36434 46975 12978 22767 8185 -29759
17813 -29759 -34447 -33086 -44828 -58325 -62663 -28120 -5028 6848 14112 -14670 -31047 -25906 -32080
17800 -32080 -28068 -25383 -17106 -377 10259 764 7968 9804 -12187 -32796 -21636 -36638 -40844
17787 -40844 4728 16010 22710 22548 8435 1575 13140 -72 -43917 -28523 -240 32425
17775 32425 55787 49225 38773 16944 -10709 -19810 -16434 -21785 -18060 3457 3455 -14419 -38264
17762 -38264 -44237 -24318 -15795 -34522 -41956 -27563 16248 16360 -8003 -21764 -804 -9136 -482
17749 -482 -5795 5090 -6652 -46984 -8686 6428 -20207 -32597 -18459 -10904 -8041 8004 -22370
17736 -22370 -30208 30 -8078 -18228 -2952 -15100 -52013 -67423 -47682 -28093 -17652 -32168
17724 -32168 -28491 18562 29865 25022 4119 -11231 -14199 9924 12426 10681 -15710 -21914 1400
17711 1400 -9205 -14686 -65764 -85759 -63718 -44805 -49133 -34043 -30981 -51867 -8643 3949
17699 3949 406 -4141 1054 -29143 -43513 -31190 -30283 -24911 -13542 13117 9358 9756 -6632 -9111
17685 -9111 -23142 -42273 -51987 -54175 -60336 -61170 -35013 -27079 2812 18947 -10781 -31193 7862
17672 7862 -15862 -55493 -55410 -39245 -33766 -16504 -22328 -31600 -19022 -3585 32243 60885 44517
17659 44517 30108 13875 -405 -19285 -26948 -20952 -26504 -47688 -36997 -32800 -25005 -14496 -3007
17646 -3007 -3140 -7769 -24065 -531 -12934 -50995 -19756 10351 6793 -14720 -15018 -16139 -24543
17633 -24543 -28184 -30296 -48215 -70537 -44956 -21248 -37849 -36077 3679 8625 15951 6774 -9764
17620 -9764 -13575 -10714 4668 -35750 -40046 -12282 935 5825 1048 -4003 -16468 -30858 -29226
17607 -29226 -9902 3944 15810 10241 -2552 -5918 -12263 19297 38947 45461 49037 19260 4910
17594 4910 -27330 -41148 -22310 -6180 -5880 -17172 -40532 -44341 -18655 -29400 -45929 -29029
17582 -29029 -37902 -31412 -29219 -32068 -48295 -41322 -37666 -54028 -37490 -36940 -23311 -26567 -28035 -26554
17568 -26554 -13838 -1429 12269 6221 -16471 -32077 -45968 -46069 -44651 -31841 -23730 -11874 -21098
17555 -21098 -13350 -28837 -34957 -20921 301 -5138 -19647 -32326 -60192 -44853 -30444 -37810
17543 -37810 -13365 -4796 1404 -2610 -12678 -18593 -14708 -37258 -34843 -6344 3778 -1983 -21789
17530 -21789 -40814 -25975 -22921 -23894 -4043 -4718 -8811 19327 29714 1299 -13704 -16916 -1216
17517 -1216 -2957 -2866 -5927 -16149 -31400 -37113 -13315 7798 25608 20628 9230 20087 11252
17504 11252 -8732 -13021 10959 8039 3050 -4034 -16082 4857 17179 32583 14781 20273 26521
17491 26521 9566 14424 17169 16243 6617 27763 70993 77967 47207 28497 32529 11176 3955
17478 3955 -26040 -22057 -1945 6469 -7586 -25134 -38380 -35095 -17511 -10323 -3338 2055 -23666
17465 -23666 -49059 -64036 -70833 -60711 -33415 -30887 -25514 -11242 -5124 2563 -142 -10083 6243
17452 6243 -22261 -63506 -67768 -35910 4928 14727 8166 6704 19451 13571 -9451 -4800 -7429
17439 -7429 -14429 2791 -9071 -5675 6730 12956 14898 10373 -2163 7598 8080 9023 3942 32729
17425 32729 42820 43371 45129 32455 -4379 -14918 -23973 -13474 -39083 -44130 -29882 -40773 -20205
17412 -20205 -23730 -24237 -33379 -37903 -36465 -55406 -61835 -47706 -21278 -9073 -11057 -17928 -50930
17399 -50930 -54820 -29750 -25779 -26528 -21886 -16217 -7545 5881 32906 50776 -6285 -40218 -41365
17386 -41365 -62679 -47215 -41751 -38063 -38665 -25254 -11779 -17578 -13932 -6258 -2855 -4116 -2132 2088
17372 2088 10230 1020 -13290 -9754 6368 -16020 1443 36751 49462 21519 9362 32695
17360 32695 22917 -3918 -8257 -1175 -17080 -24205 5930 13329 2231 -6840 3369 -7329 -15130
17347 -15130 2198 41636 42612 30006 -2346 -29968 -49184 -52526 -43547 -30868 -29950 -24757 -13235
17334 -13235 -19608 -4749 14422 13427 27672 34571 47509 32700 23028 15754 25206 -628 -14620
17321 -14620 13159 16240 -156 -20718 -30464 -24921 -30643 -44555 -58277 -57377 -49549 -48264 -41349
17308 -41349 -24533 -35990 -45668 -23302 -23140 4066 114 -29660 -33304 -45331 -71596 -72168 -73131
17295 -73131 -59536 -40564 -14471 -13512 -33173 -44078 -13081 15293 21309 44063 41868 49553 50220
17282 50220 55454 52279 40763 30457 11809 -3220 -1060 9127 21573 26374 3412 -23252
17270 -23252 -26030 -21797 -15385 3627 -20233 -12788 -10732 -4624 -4651 -5169 -5902 2709 -14154 -15094 -6725
17255 -6725 -12387 2054 9695 13944 33931 27986 22680 23903 62223 51877 7593 26777 25413
17242 25413 -12437 -24355 2132 13188 20701 24222 2639 -14190 -46406 -63714 -61156 -44794
17230 -44794 -13623 12134 2078 -25124 -12267 -38273 -37478 -17253 -3579 -2049 -8515 -10377 -6596
17217 -6596 -7025 -20433 -10009 4147 7114 -8515 -38675 -48241 -53388 -60519 -61520 -47325 -38780
17204 -38780 -6887 1134 -22002 -19334 13384 14387 9998 3006 2098 -13895 -13249 -2587 -10727 -7867
17190 -7867 -19096 -14620 -36386 -46454 -45766 -13954 -13049 -581 -5579 7108 25855 18321 -3609
17177 -3609 10963 8640 16898 28934 32407 -10355 -22362 -14543 -14553 -13651 -12021 -2934 -19886 -33620
17163 -33620 -31175 -34064 -14136 -19658 -9078 -13414 -12478 -12324 -28288 -36458 -43841 -24499 1148 -18037
17149 -18037 -12802 -1186 17203 7706 -12576 -35792 -43044 -25299 -6552 10375 -1185 -14626
17137 -14626 -2004 -10888 -43353 -49048 -34811 -36678 -29440 -27851 -17344 -4057 23076 37125 25204
17124 25204 4702 -21346 7728 10377 1821 -22791 -54553 -51697 -43359 -19297 -9542 -727 -11661
17111 -11661 -11195 -3972 26201 6676 -11372 -21855 -17297 -11912 -357 20069 37900 27828 8329
17098 8329 -10354 -27957 -53251 -17775 -6796 -3469 1521 -32358 -56409 -36872 -14464 -4067
17086 -4067 3663 19950 6075 -6579 -2843 -14050 -23481 -12498 -18875 -46371 -43442 -33538 -14478
17073 -14478 -343 4403 -12832 -3705 1966 9134 11014 17919 26056 -4200 -3017 -8169 -19788
17060 -19788 -23288 -196 4617 -17507 -74 13834 -26979 -35717 -17150 -9747 -19403 -21568 -24413
17047 -24413 -25980 -4757 19201 4606 11514 17591 10242 15956 25366 15758 15589 24576 8074 -1393
17033 -1393 4312 6507 -924 -8271 -5903 -9799 -24626 -10223 7859 19239 8744 -13758 -6022
17020 -6022 17969 4756 -29634 -55527 -35566 3063 25965 20396 -2946 -9684 -14088 -25015
17008 -25015 -7555 4241 -5197 -35276 -44031 -24646 -23590 -23494 -5969 -6087 -6519 -23728 -27359 2341
16994 2341 24633 20515 24985 34260 39312 -14295 -34457 -16085 -13184 -16060 -10749 -2098 21343
16981 21343 31423 21575 6165 2894 -27257 -57463 -58477 -51311 -50397 -48307 -54505 -27120 -1797
16968 -1797 855 4207 -17273 -15253 -5520 11036 30740 5631 -23829 -10161 15714 15253 -13848
16955 -13848 3921 25086 21908 1038 -27648 -22977 -40699 -32542 -2919 2602 567 -26402 -28958
16942 -28958 -27106 -19859 -1757 -3774 -12722 15303 50840 61251 32534 19297 -2595 2417 17142
16929 17142 27661 32104 32697 35511 28238 36078 40045 13576 11300 4557 -12207 -776 4116 -7004
16915 -7004 -12344 1895 1414 7013 -12890 -40018 -43085 -23447 1851 -14630 -37044 -24446 97
16902 97 13703 16511 17353 32124 14859 12872 26239 19875 27088 17804 -6557 -32054 -39781 -32456
16888 -32456 -7133 7334 -6180 -14751 4615 8155 -13207 -14764 -30634 -23043 7745 16262 9255
16875 9255 23834 -5784 -13960 -22943 -6383 7649 14677 15210 -12505 -25012 -12002 -343 18559
16862 18559 42186 22344 10088 -3063 -33158 -30406 -10627 -11755 -4301 -18532 -31677 -19168
16850 -19168 -16617 -27399 -29109 -38653 -29868 -26041 -18483 -19990 -37561 -50934 -59461 -16274 -11709
16837 -11709 -7996 18937 31329 48689 29779 31042 23084 -6079 -23536 -35900 -19054 -7422
16825 -7422 10607 19862 1508 -10241 -19408 -19207 -17442 -19443 2568 -4183 -33891 -49827 -77087
16812 -77087 -51257 -32754 -1204 23229 4764 -8497 -8517 -8256 -13576 -18493 -16068 -28056 -26639
16799 -26639 -6100 -1261 -188 6642 -5265 -17711 -25451 424 6427 -3519 -3397 -6256 -10565 -17270
16785 -17270 -18421 -58807 -73267 -52358 -26285 7580 18325 13792 18099 8363 -29542 -53303
16773 -53303 -61850 -46404 -40298 -32952 -34517 -36243 -38329 -18896 -16501 -28211 -46979 2195 22567
16760 22567 9252 6582 14618 16780 12797 4826 415 -9311 -8095 24040 18835 10135 23775 6921
16746 6921 -23879 -25131 2472 4587 -13702 -12143 1663 -18483 -14757 -16893 2435 30749 -4582
16733 -4582 -22935 -16384 4215 7556 15824 5816 -33034 -66691 -47794 -42734 -30447 -7264 5390
16720 5390 -20966 -31615 -11384 -32482 -55559 -48889 -38981 -24577 -27226 -24877 -29356 -11687 -2732
16707 -2732 -39898 -39112 -26353 -21977 -9261 19962 25627 14240 21 7008 19075 11799 8852
16694 8852 10579 18454 901 -4646 2206 10734 22995 21116 9114 -3420 -10312 1339 -19432
16681 -19432 -5773 -423 -15741 -44700 -43910 -38954 -56534 -46470 -22420 -8746 -30678 -47696
16669 -47696 -74883 -67788 -32650 -14719 -12525 -9832 -19006 -45007 -35643 -26331 -19127 -25902 6245
16656 6245 13699 4210 906 2829 -22319 -44554 -51736 -34936 -15375 -4138 3683 -34631 -9625
16643 -9625 -3877 -4834 -12480 -20228 -27581 -35164 -46098 -41330 -54329 -58725 -41329 -24338 -24618 -32794
16629 -32794 -52449 -46164 -28838 -16490 541 12642 3580 -16644 -32893 -35826 -20775 5587
16617 5587 14100 -4079 -30102 -30212 -49496 -57545 -48027 -32839 -26780 -40210 -35505 -40732 -43583 -38361
16603 -38361 -26955 -13425 8743 -6731 -14655 -1007 17829 22704 10477 1582 9409 3541 -17029
16590 -17029 -33270 -69661 -86848 -69715 -52700 -40345 -61375 -65610 -79497 -75334 -89521 -81255
16578 -81255 -83295 -48094 -28316 -28349 -31874 -33994 -12361 -2390 5823 -2759 9520 -13747 -20875 -17803
16564 -17803 -20660 -23749 -8122 -8360 8928 -5732 -10007 1149 12845 14777 -18583 -31973 -37262
16551 -37262 -56622 -59152 -27951 -3114 754 -15669 -12996 -8518 622 900 -6985 -30353 -27213
16538 -27213 -7390 -26108 -46784 -10024 3098 6989 -7114 2065 12264 -6914 -38931 -5932
16526 -5932 -3170 -28246 -18243 -21796 -9704 -25742 -26785 -42505 -59521 -64296 -51285 -33652 -26701
16513 -26701 -22011 -33535 -26130 -6125 -5600 -40307 -34673 -25260 -40527 -49591 -54199 -35701 -11547
16500 -11547 22906 26625 32742 25372 19474 -9498 -27728 -37095 -29379 -42756 -52483 -30281 -19219
16487 -19219 -29822 -37749 -30997 -5112 -12467 -29912 -57552 -60058 -70448 -71377 -58237 -58807 -48846
16474 -48846 -41658 -53723 -75004 -36628 -6249 -34128 -66727 -63894 -45849 -33149 -115 6036
16462 6036 1860 -4571 -24612 -11749 -8234 5257 -3370 -26220 -30074 -28776 -21979 -13805 -24278
16449 -24278 -18311 7237 18652 -9620 -15508 -2847 905 2668 24125 6499 12359 16042 31718
16436 31718 35498 9133 -33225 -42842 -38094 -16851 10659 21173 -11484 -22876 8270 18498
16424 18498 8911 -317 12683 3232 -1645 -13564 -14008 -15911 15631 22718 1887 -22860 -53679
16411 -53679 -72725 -46040 -21383 -8571 -16411 9936 -5535 -3289 17154 4227 -56360 -57828
16399 -57828 -47407 -62570 -55558 -13081 -16586 -15967 -9537 -763 19530 3363 -8144 6937 2916
16386 2916 1288 27013 30189 29710 27486 35715 29303 18578 42346 56135 30369 562 -15427
16373 -15427 -20397 -37780 -33709 -39241 -42824 -44205 -55600 -41491 -31616 -15521 -2206 5720 -963
16360 -963 -24504 -40960 -27647 -8437 -10477 -5741 -97 681 13788 21305 16511 -13162 -21788 11741
16346 11741 12639 -74 -27204 -28798 -21829 -20662 -29268 -46775 -53559 -57290 -19918 -9015 -13303
16333 -13303 1354 20042 -2756 -17494 -13576 -12938 2966 6635 -5335 -6955 3324 12483 3387
16320 3387 437 -8925 3299 -21837 -48212 -34013 -3855 290 -6082 -3015 22491 33510 32842
16307 32842 -3879 -8546 -21254 -50470 -49740 -33212 -27419 -10536 -19405 -10470 -16603 -31207 -19021
16294 -19021 -4733 21531 44572 29315 16693 -11413 -17465 -38757 -18186 -21173 -8327 6429
16282 6429 7380 11873 22634 10619 -16418 -18379 -16431 -17054 -19256 -2448 30847 11542 17343 11402
16268 11402 11393 6264 -2105 2831 -22532 -56785 -77339 -71078 -58370 -70411 -79035 -59398 -51351 -5751
16254 -5751 23354 15948 13539 29446 8376 -8678 -1719 -12875 -31657 -8669 -11675 -17740 -23377
16241 -23377 22331 43720 75568 65335 39100 39825 53573 28686 -9 -11340 -115 -8802
16229 -8802 3863 5221 -2626 -26932 -53091 -83523 -82215 -64019 -16513 -2570 -12589 -5599 -2409
16216 -2409 -45751 -55736 -50936 -36093 9451 1479 6843 288 29560 40117 47704 39241 21184
16203 21184 -23707 -24880 -4701 4308 -3101 -28199 -17909 -13605 4852 10575 -867 -33542 -48710
16190 -48710 -53243 -57701 -54341 -37604 -19346 -17439 -28526 -7211 -18641 -14141 -14368 -15105 -28587
16177 -28587 -35392 -43203 -29579 -5466 -3957 20162 -436 -30006 -49852 -49202 -27784 -8355 5256
16164 5256 11611 9056 1208 13668 -4062 -23137 -9008 2538 6953 -1467 9787 -14191 -28650
16151 -28650 -44954 -55066 -34320 -39091 -47428 -29038 -23180 -22575 -24926 -23377 -34600 -36787 -45950
16138 -45950 -57212 -50395 -40536 -42437 -37473 -59795 -28795 8901 -23846 -38004 -48718 -44410 -25105
16125 -25105 -16443 -11930 -11435 -41401 -11908 -15043 -29011 -19332 -10453 -5298 -9508 -19628 -33187
16112 -33187 -52174 -31576 -3736 11505 18319 22719 53937 36638 32820 36789 20783 10559
16100 10559 -32986 -77485 -80178 -45578 -18691 -7009 9357 23886 37446 28340 11293 17564
16088 17564 35566 19072 7833 -6797 -19914 -14923 -1005 25131 8355 5620 -6665 -19577
16076 -19577 -14966 -7948 -18966 -24081 -10800 11781 5438 -8063 18773 -1894 -10708 -4790 19374
16063 19374 37778 47296 46010 22738 16599 29238 26880 21970 21453 32925 16400 -15946 -29023
16050 -29023 -15039 -22441 -26322 -31616 -20954 -3249 8742 912 -3560 732 -13151 -22551 -75743
16037 -75743 -77972 -37258 -48925 -40572 -40492 -45295 -54574 -55993 -56198 -42987 -45619 -31367 -23289 -18744
16023 -18744 -28614 -17108 -2119 -7956 -9170 18223 19982 -58 -10277 15657 13855 5113 7804
16010 7804 5171 -38 -23023 -10887 -23487 -29647 5416 9781 360 13642 28240 7251 5599
15997 5599 10302 12514 12529 -17716 -44678 -37208 -16045 10074 1587 -23600 -26984 -13931 -22444 -15934
15983 -15934 -5507 12831 20151 26771 33412 21725 18743 5819 3972 1340 -1541 -7992 -18897
15970 -18897 -51629 -64459 -71704 -39570 -7602 5029 -15652 -40142 -43966 -39141 -57827 -60982
15958 -60982 -67620 -36804 -34540 -52377 -33679 -35449 -46064 -58973 -48574 -62735 -56243 -30304
15946 -30304 -12920 -8489 -11027 -13455 4253 6778 -37054 -56489 -34034 -21224 8059 15712 30211
15933 30211 18422 -4008 12596 10568 -16278 -36737 -31474 -1914 24054 34450 14530 -4871
15921 -4871 -7039 -20737 -33991 -21937 -21400 -33276 -4039 52675 54669 48153 45787 33604 9636
15908 9636 16127 20069 24668 40739 30163 24634 16088 19447 11320 -6357 -6542 4525 20238 22029
15894 22029 12912 28809 49451 10568 -10823 1000 3912 -5802 17493 50864 60437 52494 34180
15881 34180 18359 18816 16787 -6307 -48671 -47517 -26593 149 -22449 -37013 -25154 9106
15869 9106 56390 50179 9434 -5402 -12888 9459 2944 4429 23454 16454 23315 28391 36304
15856 36304 35923 11200 -16152 -14106 3839 6407 10153 10617 13467 4031 -17807 -28575 -28933 -36694
15842 -36694 -51602 -38490 -32317 -37209 -50214 -31464 -26517 -14954 -4872 20765 19647 27700 31803
15829 31803 9554 1165 6063 -9306 -7536 27965 40590 33696 12351 -12642 -7541 -17265 3867
15816 3867 3356 -18342 -4720 15781 -101 -18010 -4451 -16839 -21490 -1807 4821 26644 15642
15803 15642 -452 -36386 -41075 -25611 13940 17899 18612 12869 -87 1763 143 2153 28399
15790 28399 -3717 -19769 -4442 9661 -2089 1073 4098 -5485 23932 19228 12246 -5657 -23514
15777 -23514 -15883 -9165 4116 22884 30829 28252 19586 22194 29231 32223 32287 36830 25576 4728
15763 4728 -5640 -9216 4679 4493 27384 16716 8599 -28950 -42937 -28151 -9187 4867 -1450
15750 -1450 20194 26106 -36622 -58258 -34271 -55155 -36305 -20773 -37409 -41607 -27596 -10270
15738 -10270 -3312 -17321 -9529 -8341 -19839 -36038 -50179 -47061 -28253 -18301 -559 11341 -4700
15725 -4700 -19913 -32042 -48631 -26803 5984 9844 7875 4114 -5436 -16598 398 4712 7520
15712 7520 17476 39996 46214 29510 4677 -12783 -7158 3401 11200 -4975 -34137 -47003 -46083
15699 -46083 -31339 -16033 -9942 -7529 -14141 -3221 -914 9680 2394 -36038 -59659 -70670 -50676
15686 -50676 -24188 -18171 -12764 10361 1094 -17937 -40795 -51868 -42919 -15816 -5309 -7637 16313
15673 16313 -5302 -7703 -19625 -62283 -68191 -49074 -23817 -126 10037 -13608 -42280 -40468
15661 -40468 -28104 7128 16110 8122 -14621 -22007 -8538 4728 10204 11236 8564 12469 -5263
15648 -5263 -8591 -21564 -32048 -44902 -47576 -23064 -19592 -16675 -39965 -37711 -31629 -37354 -25988
15635 -25988 -2534 -20899 -28043 -6326 1451 8625 5058 -82 -6540 -3216 3126 -3273 15852
15622 15852 28397 20132 27442 23464 7688 2678 36042 62714 53087 71429 73731 43392 44427
15609 44427 61338 48015 20819 16601 20602 11196 18224 24703 31917 23539 22076 11084 24172
15596 24172 8781 12053 31296 34280 13371 833 -20319 -25895 -24926 -28116 -18021 -9292 -3949
15583 -3949 -13781 -9739 8058 18504 35457 35085 32823 7923 -502 -15754 -25885 -28076 -17277
15570 -17277 -25483 -16021 -15504 -16146 -18154 -21443 -38970 -38548 -18277 -20772 18457 18582 -6564 -42068
15556 -42068 -30861 9336 18534 24872 12034 -12786 -21666 -4343 -8153 -39924 -58329 -37040
15544 -37040 -20748 -2568 -17417 -41626 -46003 -15615 -19375 -2394 28430 36244 20012 5093
15532 5093 -11963 -37845 -28856 -22021 -7368 3277 16132 1970 -6294 -18901 -14367 -17179 -27607
15519 -27607 -34124 -34528 -39367 -6534 14839 17708 25760 13053 8195 -1978 -5542 -24004 -24013 -23386
15505 -23386 -553 4865 -2867 -40525 -42054 -32010 -31890 -34786 -18033 8322 7367 1670 9544 17899
15491 17899 15596 -2474 -22729 -34333 -1474 5670 37758 50267 14761 -14816 -31813 -22253
15479 -22253 -11767 -2107 -10173 -6933 11952 36679 43085 27768 23403 19301 -13361 -13534 -5260
15466 -5260 988 -1986 6700 -7626 -22313 -12357 -7587 -14011 -14423 -10847 -31256 -10418 23182 -1434
15452 -1434 -29899 -38543 -39259 -21570 -7450 -2283 -13282 4812 -1878 26778 38960 19262 -13647
15439 -13647 9185 9549 -37670 -56339 -57026 -72089 -63632 -37328 -15256 -8098 -18500 -31956 -22113
15426 -22113 -7496 -20887 10223 51845 45190 38845 38922 8304 -13277 -4149 2041 1675 -11276
15413 -11276 -23585 -16798 -35270 -60471 -71181 -28066 1775 7771 1535 255 12795 -5755
15401 -5755 -3456 22816 -12136 -44115 -37540 -46258 -59403 -39237 -47683 -36484 -44657 -53787 -52296
15388 -52296 -55094 -32294 -17961 6722 -3414 -16122 -10703 -10781 -7778 -22027 -33163 778 3262
15375 3262 -20751 -11100 3846 13200 16929 14679 33916 37306 25289 22106 -1543 -16237 -1188
15362 -1188 29476 35034 34426 35079 34342 29708 8246 -7339 -19396 -50821 -52778 -35980 -26514 -11356
15348 -11356 -13030 -20638 -8930 -13654 10305 -10578 -25640 -29246 -10712 27950 16296 9496 32397
15335 32397 35560 28853 20678 -437 -441 21265 37523 32736 5624 -18472 -3033 3277 4571 10447
15321 10447 -32515 -39490 -23884 -10275 14072 11129 -22856 -20202 26974 15097 6337 -5121
15309 -5121 725 26475 2289 -10317 -18341 -25559 -20552 -6279 -8660 -454 -34275 -38350 -34613
15296 -34613 -22078 -11082 -20325 -6988 21867 34344 42987 51347 37776 15620 -17553 -18723
15284 -18723 -24941 -26058 -11261 19307 14253 22074 37788 42307 36536 27051 33569 24866 -999
15271 -999 -5133 -12526 -24590 -24246 2065 4656 -15743 -20339 -26299 -15702 -19817 -12718 -2329 -26450
15257 -26450 -34866 -30390 -5459 -20142 -14561 9065 13274 10381 11362 3354 3131 14720 43767 38855
15243 38855 52999 72984 63577 36224 26259 24882 21837 42796 19388 -13131 -9749 24810 36705
15230 36705 35850 9935 -19089 -27508 -7748 -21602 -17156 3150 881 -19241 -55 4610 20268
15217 20268 37912 49235 40495 13033 -2350 12275 -1253 -22560 -15915 -27382 -27973 -3660
15205 -3660 -17203 -46898 -51897 -35433 -10245 20997 13786 13237 35724 42538 43414 26236 21852
15192 21852 40130 35494 34822 24823 22569 29492 26311 20064 10278 26868 33258 23417 17637 5391
15178 5391 1921 -2485 -11578 -28324 -28265 -2242 532 4549 49644 71803 54672 7998 -11512
15165 -11512 -34227 -30306 -17642 10117 28268 34767 14069 27627 47660 38428 42084 26666
15153 26666 16734 17669 8354 28324 24704 -17863 -20056 -21918 -21600 -5611 8639 -8941 -8408 4375
15139 4375 -3536 -25221 -11497 20284 23553 37233 19286 3276 15834 18327 5113 14306 30088
15126 30088 33778 18071 7722 13434 23656 21919 20623 22087 23546 23386 17104 4698 6720 -9311
15112 -9311 -6569 -5507 22478 -14270 -23796 -10902 -390 1922 -19562 -39659 -39408 -21780 -18095
15099 -18095 10951 41268 31885 2770 9030 18459 -13956 -7171 -19097 -35906 -20945 1511
15087 1511 11722 11919 9931 -3073 6246 19420 11185 -10816 -37778 -50072 -31664 -904 18474
15074 18474 6578 -3579 -25247 -44168 -28972 -3130 23422 16057 -14859 -14325 -5994 -25271
15062 -25271 -23485 -11493 -44520 -81091 -52007 -21894 19400 -8395 -36223 -41807 -13254 -6240
15050 -6240 -11704 -26823 -25871 -11053 -10504 -17417 -4280 3707 -5378 -3223 -5491 -3393 11074 -5255
15036 -5255 -11875 -6314 15992 13393 10180 2874 9940 3780 -8455 13111 20661 13669 20125 20584
15022 20584 15439 3814 6134 6323 -2732 2123 13165 21752 11374 1033 29206 25713 13706
15009 13706 9266 4945 13341 -23310 -37654 -5943 18459 36132 41391 22602 18067 27408 17535
14996 17535 3778 -30656 -38960 -28937 -9536 -16475 -25675 -13350 -28452 -38084 -44665 -38665 -12946
14983 -12946 12899 41499 3932 -10723 -10164 -32642 -31386 -9462 -10410 5557 -20663 -27427 -4322
14970 -4322 658 -83 9762 25759 29102 1683 -18477 -27670 -35607 -49568 -41281 -14881 4858
14957 4858 10389 35573 7988 -1095 -9476 21092 19715 -2901 -29185 -41471 -23838 -1166 -4066
14944 -4066 -2734 -862 7202 32409 31502 11458 -20315 -13255 6340 5842 383 -4703 4827 -18114
14930 -18114 -35610 -18119 -8615 -4926 4797 4646 510 4889 18664 14018 2626 -23896 -52778
14917 -52778 -33217 -1679 859 -6563 -29990 -38191 -6034 31854 21853 12899 7891 -3249 -17663
14904 -17663 -16622 -21285 -43476 -40735 -27608 -30733 -31660 -33968 -40339 -47410 -46239 -27007 -26391 -14248
14890 -14248 -15835 -8258 -17150 -53132 -47418 -38469 -39346 -39885 -3113 26639 13718 25772 10497
14877 10497 -12235 988 19861 22012 4437 -6609 14780 29063 21490 5060 -18784 3096
14865 3096 19250 4557 13764 24470 3624 -20151 -17830 -16255 -18968 1469 36530 10910 12389
14852 12389 -7819 -26374 -20995 -9397 -19863 -27289 -20701 -25622 -24455 -4041 22766 29244 14826
14839 14826 22301 15803 2163 -19592 -42845 -37875 -40000 -52758 -32944 -19751 -26038 -29392 -29162
14826 -29162 -26412 -156 13886 23695 50083 32343 -5409 -9751 7412 13051 27945 18765 9212
14813 9212 7956 13682 -13952 -18093 -15607 -14015 -15886 -45341 -77166 -31491 -11238 -34177 -39440
14800 -39440 -28779 -515 26770 13484 -5350 -24186 -28289 2845 3104 12000 19099 2529 -8652
14787 -8652 8891 3074 -24353 -22353 10361 16790 -9842 -31716 -6486 11161 -17571 -25171 -27456
14774 -27456 -22993 -11973 -34239 -42936 -20537 5996 -1118 8241 19190 10617 5961 17290 14354
14761 14354 29347 33852 26664 38086 51324 53245 16703 1565 -12099 -30341 -42418 -24381
14749 -24381 -2075 12432 46137 52484 30881 32743 33969 -6204 -13396 -15462 -18265 -8306 625
14736 625 5666 33972 52653 30265 9314 -23630 -41035 -57014 -56166 -23302 -24292 -30159 -33162
14723 -33162 248 21941 20207 -12488 -8043 28805 47128 13917 -5126 12255 4205 1371
14711 1371 -15192 -9848 13274 30394 39994 25016 49695 59804 70578 48717 21502 12325
14699 12325 -15000 -56526 -60924 -31053 -21666 -25003 6341 41594 34501 38389 46033 52252 33390
14686 33390 32762 39161 19560 -7091 1008 29643 13522 -7238 -3772 11933 27148 47257 7829
14673 7829 -35344 -57047 -42909 -48970 -46800 -18258 -9570 -34485 -14544 9585 10812 22045 19992
14660 19992 2010 -11582 -13331 -21019 -15698 -21306 -31642 -24057 14247 6780 -10286 -5549 -8057
14647 -8057 -12115 -23112 -8845 12622 17271 12243 5355 3040 -3653 -3408 -1829 25437 46262 24425
14633 24425 21189 -2401 -18593 -13049 -11742 -8757 -27336 -8885 10403 8980 -6301 -3295 4477
14620 4477 6521 22531 34933 4561 -15966 198 17547 11381 32194 33363 32728 49569 26666
14607 26666 29017 41822 25922 -817 -1156 -19573 -19188 -6783 -7536 3334 4516 16004 2348
14594 2348 -22396 -31007 -28190 -21897 4061 10244 -16115 -32788 -22095 -20498 -29413 -24939 -12751
14581 -12751 5353 11470 15356 11802 -44293 -49815 -14643 -12387 -28842 -7399 -2838 -4912 3301
14568 3301 -12536 -26358 1790 29582 44927 29615 -6219 -9246 1743 -3677 12454 17357
14556 17357 14792 14356 9532 -13000 -5386 4770 14948 9936 -11666 19384 50582 19771 -4098
14543 -4098 -1772 10709 4195 5091 -5172 -26057 -32899 -35007 -32790 -21789 -14596 -2327 13642
14530 13642 16767 8309 3850 -10843 -27834 -20236 5668 29332 42400 41437 18615 20491 -1677
14517 -1677 -11206 -8200 10563 3701 -11711 -25855 -11846 -7517 3867 6130 12967 13994 15279
14504 15279 22119 34804 11844 -15227 27772 30684 6225 8199 1662 -1161 6060 -8177 -3544
14491 -3544 -597 -25093 -37514 -57973 -49823 -31160 -12038 16850 30722 12152 -8024 -12850
14479 -12850 -2681 -2758 -9179 -5882 -14666 -23332 -11340 -15963 -22631 -24020 -15849 -1827 -453 -27238
14465 -27238 -7827 -434 -36414 -35163 -13924 1170 6863 17812 13723 14820 30588 16575 12200
14452 12200 43382 63609 47071 23336 -21412 -17411 370 5226 5619 14613 -5867 -31990 -42852
14439 -42852 -38044 -70723 -43938 -12601 -3289 27761 36752 35863 36179 28501 9558 5928 9555 13280
14425 13280 29229 46593 37743 11515 18890 -9170 4254 49038 28163 26157 -9857 -38519
14413 -38519 -50995 -39694 -21815 -47458 -45081 -43285 -22744 6755 -1606 3249 -13098 -15829 -25835
14400 -25835 -11803 -17587 -18547 5189 8509 32717 47078 31040 30170 42845 16450 -6896 -16400
14387 -16400 -28603 -11003 -9803 -8303 -21208 -25810 -27303 -22079 -25274 -29728 -17232 -16762 -19455 8503
14373 8503 13720 -22295 -59467 -38947 -28185 -30552 -19747 -34077 -30413 -16186 -16444 7928 27024
14360 27024 15900 -8647 -14021 12693 16169 38632 50163 61807 30651 18418 2639 -7746
14348 -7746 -11333 -819 14675 -5342 -18106 -9428 -4309 -4795 -7994 13618 -1511 -10788 -5817
14335 -5817 -20630 -22386 -30855 -30459 -36397 -12823 -952 -28639 -43149 -52339 -44941 -12122 12514
14322 12514 566 -18775 23789 76463 75188 57835 30234 5759 11958 16553 38654 40870
14310 40870 38525 50303 63915 56371 41137 15030 -9058 -17614 -39159 -40296 -63601 -51178
14298 -51178 -38194 -12793 -2759 -11714 -3221 7296 26347 49743 39837 20695 20709 21989 9593
14285 9593 -6641 10044 5151 3692 -9951 -10709 -3127 -15956 -4795 12239 11306 22888 36923
14272 36923 59203 45837 21295 -4346 -21132 -11317 -19680 -7647 -29946 -40582 -27427 18558
14260 18558 19443 30506 30317 40801 54409 39966 23957 38872 16044 8617 25637 28282 29852
14247 29852 18566 7293 39011 30924 23536 21872 35618 20024 6199 12039 15026 40197 62794
14234 62794 31471 13096 12732 7488 1093 7467 8717 10316 17560 21033 19656 25876 21627 7229
14220 7229 21026 38496 13525 20005 42009 7822 -1675 10659 -5415 -19271 -6572 16302
14208 16302 39062 33760 2426 2616 -2352 -996 15828 21689 22898 25638 -4827 -18341 -18783 -12500
14194 -12500 -14721 -13167 -7311 8919 7558 22483 28250 404 -15097 -12323 -18036 -28366 -13389
14181 -13389 19669 2337 -13940 -8317 3652 -5511 844 -12949 -5945 -5286 -13394 5872 13751
14168 13751 21327 6374 -3462 498 -1395 4128 -3047 -7367 -11769 -4321 -379 14940 23296 23104
14154 23104 4273 -4986 -2708 -10392 -12663 -27809 -40339 -22587 -3753 -1118 -2675 6838 11777
14141 11777 23435 9329 7791 22295 18513 18910 37516 40506 22679 -62 -31893 -35647 -22213
14128 -22213 3907 23326 -416 -4057 -7701 7749 14481 -9573 -31993 -35037 -43277 -40834 -50602
14115 -50602 -53980 -21376 -8442 21443 25668 22349 25673 -2622 2314 9591 -7365 -1379 -2062
14102 -2062 13692 18917 17038 13378 8610 8302 8713 40241 52818 43200 19849 -114 22243 30153
14088 30153 14067 23952 29787 24673 31886 16405 39479 16266 15070 38621 48095 46628 2834
14075 2834 -17538 -5335 6410 5450 26717 42888 37800 22147 23201 -8862 -25612 -45550 -13623
14062 -13623 -9399 -20996 -49305 -41204 -26125 -26698 -1888 15350 12696 8382 -4640 23570 39441
14049 39441 30131 16215 17239 -3212 -577 9771 8208 4830 28065 42722 24883 20965 21611
14036 21611 5988 7019 19076 22428 -4318 -3281 45980 54232 23199 255 -9339 -25562 -34404
14023 -34404 -18182 -20533 -14150 -21099 -31265 -31029 15137 43131 40281 33373 33237 46233 42695 23576
14009 23576 44562 47126 31634 32997 37218 27141 -3666 -27962 -9235 183 17528 52330
13997 52330 41483 36340 2802 -291 15711 1532 5514 -595 -48942 -51867 -28346 628 19231
13984 19231 4645 -27393 -17439 10414 23453 10249 -13882 -26442 -23587 -28481 -22164 -32196
13972 -32196 -21442 -11267 -2555 -7262 -16612 -13391 -4739 -4836 -21269 -13619 -13206 575 21579 34813
13958 34813 11153 151 9892 3135 16280 23410 27977 44247 45552 42763 10059 -11692 -19439
13945 -19439 -28815 6704 30075 20375 39078 77265 66986 54621 60353 78583 52553 105
13933 105 2732 32264 33123 23771 42757 49950 54567 40370 46808 27140 16786 17694 -10266 2995
13919 2995 24815 36189 21915 -12038 -12442 -14026 -5896 15468 28276 26829 15817 11465 4802
13906 4802 -39761 -33805 -14411 1674 -20268 -25842 -21063 -7086 1776 16202 -15655 -6669 4311
13893 4311 1609 13030 1312 6842 38844 25320 15756 7268 12167 17538 12645 -11323 -22440
13880 -22440 -35025 -12881 33133 63557 59600 39137 12492 -3689 -388 1423 -10401 24557
13868 24557 23397 -11544 -18820 -23919 -36604 -24503 -19909 -16056 -32872 -17557 -14854 -7407 -29607
13855 -29607 -18079 792 9833 -2749 -7368 10356 11031 -1114 -7395 -22834 -21045 -17981 -14838
13842 -14838 22169 49321 45372 26031 -10215 -7543 12061 -76 -9048 -598 23965 61875
13830 61875 47860 41595 27174 30933 10975 9291 3274 19873 53221 42369 17437 10169 5109
13817 5109 -11449 -21336 -16206 22425 8507 -10826 -1712 -13036 -32723 -30064 -29407 -40606 -22771
13804 -22771 881 6969 -10486 -20297 -18540 -279 26698 19548 13482 25007 33527 17932 4507
13791 4507 -2957 -29998 -36672 -19435 -6138 -8914 5098 15652 41458 52264 66223 40192
13779 40192 15223 4712 3557 -35451 -24986 -1740 103 8015 18297 30296 15753 32022
13767 32022 1470 11946 12164 813 -19693 -4311 20350 28296 25669 2959 6912 25179 41629
13754 41629 20583 8845 -19673 -40119 -11771 21553 18486 1510 -2669 5021 9849 -2992
13742 -2992 -17934 -7001 13529 -4113 -19786 -25726 -12639 -14312 -27329 -24782 -331 17450
13730 17450 15208 15979 -21639 -28970 -801 24884 49449 35340 33581 35939 30762 3166 9085
13717 9085 35061 31421 14241 37589 55696 60894 45906 21700 20447 16976 425 -32815 -36105
13704 -36105 -18900 -370 -10562 -34035 -25861 -36620 -31820 -4839 9697 -5631 11712 5291
13692 5291 -1999 3490 28048 25000 18132 34491 45896 59376 49642 18418 -2788 -10509 -10658
13679 -10658 -13484 -28224 -28183 -13006 15073 -4875 -35239 -47841 -32413 -28005 -3958 7494 2882
13666 2882 5285 1767 -19676 19762 42827 34252 16691 24735 33621 32397 26984 31923 25128 18376
13652 18376 20409 15133 7135 2674 1568 -464 -5237 -7176 15187 49083 47441 22718 -6441
13639 -6441 -17177 -874 17485 683 4629 21207 22109 34420 20916 18627 21920 21544 4553
13626 4553 -14559 -7399 24193 47487 50582 939 -32414 -52336 -61254 -61733 -35715 -33410 -28891
13613 -28891 -5442 39698 38624 48767 50677 44038 25357 936 -8472 4409 20362 26307 21305
13600 21305 35071 42162 54121 53427 31192 47055 38050 7705 -5013 14406 6756 -1709 15791
13587 15791 39065 39109 36530 27580 5787 2189 32364 37501 43064 55615 60728 54453 59955 49716
13573 49716 48063 20881 -11288 -3366 27516 40492 61738 69274 52563 27823 -10988 -463
13561 -463 7634 4003 16074 30307 38129 27396 -14585 -7253 23548 29670 19087 1784 -148
13548 -148 -1099 38893 70444 44626 29088 34143 38177 29922 51627 52049 32018 33812 42181 54981
13534 54981 59858 46265 28156 49545 72573 51446 38669 36322 31351 13698 1059 -3567
13522 -3567 -3105 20015 30885 11327 -1981 508 20106 13987 -19585 -15216 13913 6488 12774
13509 12774 -5 1545 -15752 -43210 -60538 -28068 -9892 -9262 -9272 -4775 24066 38272 22045
13496 22045 27240 27928 10550 -11560 -20205 -33878 -40464 -15086 3253 -13282 -28401 -10692 -13736
13483 -13736 -32923 -11797 -2591 175 2317 6884 18245 28577 36825 25949 3764 -1582 1897
13470 1897 -5125 -11329 5899 -8882 -21201 13901 -4873 -6342 -19664 -43040 -47411 -44807 -36588
13457 -36588 -22962 407 1666 5958 18153 6687 6071 45812 57721 57340 54944 37243 43156
13444 43156 44238 30586 9916 2575 7052 26181 11077 18579 37191 57127 52988 28771 9727
13431 9727 21935 25366 26581 31389 39488 66472 55731 53639 65403 54041 12285 -2644 -16359
13418 -16359 -27317 5521 8299 31624 51851 58713 39613 21369 14931 9835 -1843 -13232
13406 -13232 -15467 9321 974 2381 7081 12358 25476 17201 11088 -20554 -4553 21887 28894
13393 28894 -2287 -23473 5270 25161 38845 25300 -7383 -13124 7568 15658 36752 46792
13381 46792 34076 40699 43252 28183 25985 20055 6094 14893 27122 52149 81863 78530 42763
13368 42763 20272 8368 21673 41051 39313 29389 29985 32697 22832 8113 7099 32671 57191
13355 57191 59242 37889 50400 31082 24860 9368 4547 15769 20541 43988 20311 20591 13609
13342 13609 17036 -12743 -21536 -828 32346 36260 24858 21359 24244 20979 32400 45086 30122
13329 30122 21668 -1390 2530 -1715 3787 -5567 19335 33587 34034 25579 -4155 -8491 5068
13316 5068 25290 17490 15493 149 -28268 -25396 -5033 15548 30111 18905 12041 30862 7650
13303 7650 4377 -5827 -237 896 18558 7564 21066 43023 36774 27589 36132 40041 13872
13290 13872 -116 382 1208 28446 44326 59098 41402 23674 23045 10835 16910 69301 78024
13277 78024 67478 78132 54976 20513 13537 17350 15512 30202 43643 38594 49522 29291
13265 29291 1720 8602 4637 -6032 29774 27881 14071 21830 38348 31086 7598 9306 16834
13252 16834 14579 26803 44091 44085 64896 60114 59294 72464 48625 24552 7178 -2336 -900 8540
13238 8540 28019 40446 56604 49301 47130 42102 44948 61688 69997 59191 61765 63079 57842
13225 57842 63704 58662 60236 60974 51982 9340 16014 31828 41402 45772 47670 63419 42815 31420
13211 31420 12365 9428 3764 17981 38759 48287 41113 33798 12793 8558 14910 21207 -2673
13198 -2673 -15759 3699 16248 27078 34967 55419 51706 67657 93063 83996 53905 28951
13186 28951 41983 30924 47337 58454 83660 57830 38796 40566 62036 36593 27706 31817
13174 31817 29681 36555 26148 6394 1225 2739 -4335 20 14169 26098 30674 19285 -4156
13161 -4156 2082 22735 40444 27833 28865 40745 46224 49010 29344 28664 38496 33930 15747
13148 15747 29813 40021 31912 38920 24428 15990 22724 33699 74442 112849 71537 48458
13136 48458 54391 33636 23403 10400 14555 -6363 1096 8096 4134 19343 41383 60604 67566
13123 67566 49847 47730 22093 -6540 -11257 20618 66385 69632 71368 71893 53749 49933 36421
13110 36421 41999 19148 10752 -1117 5649 23063 45308 61679 47425 53839 47023 47524 59626
13097 59626 48685 45999 9284 -11433 -2822 -10869 1266 -21724 -21162 5068 28515 24719 34792
13084 34792 51666 52818 51211 58405 53712 38913 53649 71527 105056 123934 141179 134915 65302
13071 65302 56252 55451 54685 50041 59939 59114 54086 56529 53758 31416 26074 50724 82062 83852
13057 83852 104150 121329 124151 116874 119188 110753 99756 111599 126658 135895 124141 120032 103577
13044 103577 121707 140217 133073 148615 142479 153249 156050 160545 189282 207905 205143 233057
13032 233057 272180 329825 367698 414271 510435 626097 735759 875308 1015779 1206153
13022 1206153 1353028 1497810 1566147 1618801 1600801 1535429 1445772 1304722 1151423 981045
13012 981045 834696 678880 573087 515582 464406 433123 391707 362809 344317 289128 248854
13001 248854 262727 262405 238886 211836 192598 192134 214582 241704 209462 188902 192007 174003
12989 174003 163272 154117 132863 124429 115987 119978 116750 133890 139788 139454 174856 199959 192368
12976 192368 191391 154442 145272 133324 107405 105198 109691 120297 144051 132220 125639 134766 123397
12963 123397 145214 182025 194135 207946 232515 265644 321575 341192 377828 413436 429307
12952 429307 452358 428462 377025 318201 252240 229967 225659 212003 204220 214247 182719 148071
12940 148071 161302 176446 174342 172066 172607 157041 135384 128610 136784 150375 161808 179901 184445
12927 184445 184515 187713 201237 205547 201600 186189 158042 141765 148378 152664 156925 170132 150271
12914 150271 141680 156641 157245 136868 119123 91454 100495 96148 90978 122614 154310 143584 139458
12901 139458 152856 133941 141272 125622 136141 133738 129715 153750 177046 172834 144832 147496
12889 147496 141984 159218 175938 145428 117031 110498 149182 173749 183253 155953 135915 161226
12877 161226 141499 135790 134458 147542 165848 185930 202945 219981 253511 301832 332614 351512
12865 351512 364337 365995 366852 373525 391238 384362 357893 334372 300495 280466 262885 261684 262881
12852 262881 238647 234967 246712 235345 233554 232343 221748 235940 242631 217348 201426 194408
12840 194408 192389 197203 193988 211074 197572 175275 205548 231876 239800 243545 255554 246310 232099
12827 232099 217002 195342 179212 169926 192797 212581 194171 173581 179618 176053 167817 192988
12815 192988 225408 241859 264425 278080 305563 337207 341048 374077 398209 415868 423352 423822
12803 423822 402009 368782 342757 271139 222082 193211 150868 129268 111800 100925 105309 115711
12791 115711 107436 130966 111922 119828 114920 98628 94423 123957 143117 170287 177920 174422 178974
12778 178974 196608 208258 228036 216357 200758 175506 171109 175464 173715 183900 220041 226546
12766 226546 223367 235315 245490 234867 223697 235854 224629 206855 219650 238406 259785 282184
12754 282184 283755 289690 288507 278511 290208 300067 338001 400155 431158 482606 501057 524560
12742 524560 562343 611140 628662 608574 606880 580947 533318 469688 453133 428106 411949 373602
12730 373602 364490 374280 381019 401130 416390 436065 434278 438881 444164 436745 405172 429827 470329
12717 470329 483406 497680 527727 524121 544220 592092 621446 608718 600694 590048 589421 617460
12705 617460 641173 641520 618667 624655 627266 627369 658319 683281 710497 722013 740024 745057 751553
12692 751553 777181 779055 817622 841428 888846 928884 948157 981068 1017051 1019823 1038176 1077664
12680 1077664 1121921 1132578 1140637 1169495 1199717 1225833 1255749 1288473 1328753 1397590 1457980
12669 1457980 1533330 1605669 1663012 1730316 1786661 1836752 1925168 2003982 2076028 2148958 2217432
12658 2217432 2308588 2419490 2526599 2631460 2774290 2932255 3084985 3266181 3442415 3633222
12648 3633222 3888429 4175358 4497726 4865729 5282372 5779434 6334530 6974778 7676223
12639 7676223 8464428 9335846 10235386 11220329 12321340 13557340 14922242 16375530 17955661
12630 17955661 19630557 21406606 23376404 25597214 28212145 31436344 35610870 41221785
12622 41221785 48926479 59742846 75126719 96770875 125734794 161576728 202603348
12615 202603348 245541958 286007703 319306731 340771184 347112223 338033566 315116120
12608 315116120 281699750 242323750 201444650 163009809 129976418 103418908 83072771
12601 83072771 68013261 57047255 49039170 43055751 38453077 34802007 31794969 29245012
12593 29245012 26995832 24904976 22964659 21153543 19470464 17944535 16611821 15392473
12585 15392473 14249085 13227506 12226500 11278437 10393475 9551716 8775262 8079080 7502574
12576 7502574 7024644 6558649 6152557 5803088 5482002 5204950 4967593 4707527 4442441
12567 4442441 4227541 4028563 3807419 3611679 3454893 3287843 3122875 3003908 2891685
12558 2891685 2803820 2703281 2593359 2504830 2410185 2324284 2236262 2149791 2045178 1933561
12548 1933561 1871878 1786436 1669453 1607390 1541164 1491718 1445431 1372543 1312981 1281116 1250883
12537 1250883 1203953 1170197 1145683 1117482 1084637 1039884 1031462 987516 943680 917173 933602
12526 933602 911119 854360 818390 793612 780662 724758 694011 690990 677669 663287 655860 634696
12514 634696 610728 629971 627061 596706 573922 595304 590182 580850 566451 578463 562928 571622
12502 571622 576019 586247 594329 600179 596059 584497 555236 551270 600563 620858 580387 573917 571896
12489 571896 544169 516976 442595 390870 348794 285145 227711 179436 183359 218835 222719 224381
12477 224381 213391 213163 244505 293227 321767 299448 304550 345397 361473 367079 356987 350365
12465 350365 351996 348986 318298 281008 299898 325364 330228 303651 289791 325021 329925 289585
12453 289585 283698 299160 291125 286407 290700 297874 300254 295710 290724 278234 272104 280441 289003 263006
12439 263006 262272 267106 266430 314269 334396 324158 331194 317110 323699 339294 343030 351699 343935
12426 343935 291854 238378 187044 122390 86221 53789 -5964 -24953 -24883 7994 -12229 -45022
12414 -45022 -29643 6285 33299 24972 24651 43472 70385 102107 108107 114886 98542 102319 103632
12401 103632 116609 125643 110970 108474 124688 145258 133690 104576 103889 111982 103425 118395 126506
12388 126506 150620 177286 158596 150047 160031 136111 150455 170516 161465 144989 158944 138806
12376 138806 116922 114701 110955 103957 124922 123160 119565 138713 137863 126555 125072 125820 129067 128071
12362 128071 129091 125983 95405 105538 118456 113404 80533 85747 102823 113535 133979 141952
12350 141952 150479 149662 163611 175781 167923 161558 140053 135669 181391 193283 180102 137941 113588
12337 113588 114406 104463 124300 122757 125771 131101 129341 124449 121841 100413 94211 100816 93461 88096
12323 88096 102517 158478 164591 157069 159523 170510 133161 93574 111770 124450 119721 128516 136269
12310 136269 124905 123012 126779 148043 145897 115861 103605 90418 73544 84775 118914 148989
12298 148989 151049 144017 127229 105992 114093 157795 155016 170946 168090 152549 162240 173437 160558
12285 160558 151810 130241 132583 141963 162176 151971 123327 115948 125861 134653 139640 149838 150102
12272 150102 136506 171875 194751 188515 158528 142844 146533 180602 181483 176267 207337 197285
12260 197285 170591 144625 130933 135110 130441 152400 164961 175815 179231 183047 148685 159739
12248 159739 179643 169997 166676 163427 159292 179977 165424 176037 180792 170772 166022 180496 198263
12235 198263 190606 171873 174130 179705 211948 247858 239800 239349 225416 237597 242091 266496 263268
12222 263268 243259 241357 311882 345221 324107 317925 334188 346736 357967 382054 432425 456969
12210 456969 509209 588422 643374 732984 811354 930812 1098393 1299742 1463760 1617550
12200 1617550 1748589 1829190 1842643 1793201 1675512 1511814 1321539 1159411 1040677 902930
12190 902930 769669 680470 590151 524043 484529 449289 423704 396059 358918 354618 365432
12179 365432 344487 343527 322253 301674 289727 270177 253047 268178 325245 315234 303978 324103
12167 324103 357343 349868 316158 298873 294419 285052 270959 263182 260451 278064 279268 294918 307062
12154 307062 323954 324216 343644 324972 287256 253750 253773 254581 249977 246631 260853 279704 285574
12141 285574 295337 289467 272862 299115 353529 355111 344455 315464 306812 316730 352458 364906
12129 364906 356389 351865 329206 312410 319082 329666 371077 374417 363718 335827 318697 314743
12117 314743 316540 315975 321176 312177 330267 366998 376585 379526 393275 428475 443612 445799 434944
12104 434944 421219 416642 416496 415623 395965 397965 418640 442595 441297 423486 446303 441163 436208
12091 436208 466053 496910 495420 466731 470492 457388 474490 516900 586373 586857 578376 560658
12079 560658 539360 539136 554783 587381 574774 574966 573098 573420 584357 584643 617632 656595 652790
12066 652790 644206 667311 691271 681234 680586 666105 670608 686467 688217 664314 690756 711795
12054 711795 692512 706066 722438 712312 715097 738345 771646 765079 756115 778232 820765 839412
12042 839412 854814 893649 858618 861988 890359 928145 951790 975095 996250 1002835 1007812 1039892
12030 1039892 1060837 1066086 1069521 1084052 1109085 1139435 1166426 1200156 1190082 1186079 1199643 1225878
12018 1225878 1265882 1314732 1335407 1335154 1371701 1407737 1392386 1409633 1458357 1503013 1544436 1549065
12006 1549065 1556849 1538412 1539438 1578231 1656744 1711566 1712551 1733377 1786273 1825410 1860410 1892758
11994 1892758 1907608 1900205 1905636 1942304 1955232 1978231 2000324 2043472 2064182 2094406 2149862 2195424
11982 2195424 2223883 2270781 2290108 2277448 2307865 2338958 2359263 2378717 2406314 2435096 2424552
11971 2424552 2421640 2463296 2504766 2543364 2546741 2549909 2589172 2618485 2641393 2639523 2669554 2669871
11959 2669871 2689724 2695024 2694643 2710591 2722898 2725386 2738442 2744678 2720486 2715388 2699144 2714059
11947 2714059 2719078 2687444 2657581 2656523 2648233 2641809 2628753 2609924 2606149 2578015 2546909 2553809
11935 2553809 2526228 2487962 2487356 2450210 2408823 2368198 2345490 2330441 2321755 2308846 2286701 2244396
11923 2244396 2233504 2201507 2152710 2144695 2116617 2089646 2076308 2050151 1997848 1959861 1916066
11912 1916066 1867558 1858522 1838867 1828353 1799744 1751946 1739424 1720614 1710749 1696592 1666664 1609460
11900 1609460 1588567 1586141 1562527 1539804 1518912 1475413 1421853 1391935 1366801 1353448 1314363
11889 1314363 1287182 1289581 1286909 1246442 1210537 1208871 1220935 1162696 1098908 1095681 1105749 1098916
11877 1098916 1102984 1110456 1104753 1083707 1076640 1018121 1007187 1007434 998909 982398 966271 937348 924010
11864 924010 911977 932345 918720 881550 849514 824130 823097 810545 792315 755231 740266 761547
11852 761547 760812 741488 728807 689556 657990 649220 638660 642160 636191 628940 636162 623952 592085
11839 592085 573183 571265 583827 594018 581382 584524 584189 587693 600755 559448 510808 491686
11827 491686 503476 504137 507642 498412 496954 517583 479294 475613 492871 500846 476831 466369 462381
11814 462381 446820 442701 425788 439230 425782 413378 414391 414487 407519 406760 409186 391666 365743
11801 365743 354110 346180 345008 383921 437076 425832 370476 349411 346332 346388 323817 303710 286437
11788 286437 285326 286477 311372 334908 308775 285678 291005 314083 341108 315359 298911 277789
11776 277789 268060 243037 245631 271735 292024 293971 276425 278078 266593 247781 246555 255085 278934
11763 278934 290483 271500 263803 257327 255066 224060 202222 191840 201766 200231 192314 203161 202180
11750 202180 213227 210036 191311 192825 200301 206698 249918 263452 248914 254971 242615 220271
11738 220271 207301 190980 172627 176474 171842 158817 174700 192245 212614 222707 235851 230076
11726 230076 206638 188770 173943 180082 190592 196125 197200 189304 202767 224297 216956 188088
11714 188088 209335 223799 215529 193636 171225 161295 159201 152952 146321 142438 137314 143642 144243
11701 144243 110173 124192 155741 173781 152928 147288 160665 189399 174136 150945 157254 161519
11689 161519 163071 173685 188574 178911 165945 160671 155764 157191 166738 156972 149241 152895 120641
11676 120641 100808 81024 117470 137545 127950 130697 139685 154131 123286 128513 148655 130084
11664 130084 127214 117329 94795 91055 87770 80177 96937 112702 102167 73577 90387 117207
11652 117207 117847 116344 155151 147745 144159 156689 134089 104400 77310 101226 120791 91223
11640 91223 67985 81247 80444 76833 91991 76499 71203 93761 74775 65742 93266 95207 103519
11627 103519 64338 54313 73392 83591 62251 56590 89230 84511 80416 119697 135641 123728
11615 123728 120064 139279 144181 131206 102207 87476 78861 83220 68027 83147 102223 90517
11603 90517 62534 32737 32776 87977 113349 82297 59308 51739 21310 29237 35523 39851 52197
11590 52197 64965 74267 85940 61242 44637 39994 47752 60669 31983 26081 22659 19923 6716
11577 6716 -3117 23288 31264 19641 27835 53426 63030 87463 79270 44544 37772 28676 42498
11564 42498 34179 45587 51281 46349 70893 94740 76801 75929 77347 53184 52003 53514 61704
11551 61704 72437 37916 25291 32435 49619 53508 45173 28997 27859 28952 50237 52370 41932
11538 41932 34695 52854 88136 111819 102175 80183 55060 34752 57474 78505 85960 84723
11526 84723 83458 71260 63298 44569 39791 30743 7800 -22391 6245 43558 60241 71385
11514 71385 71769 43944 40235 37979 70935 79057 57125 44056 24598 12275 14008 35062 21835
11501 21835 32657 39787 63307 56507 39602 39617 43465 42104 46379 43400 47061 64286 24383 2279
11487 2279 -7539 32323 53224 46136 52513 41440 35435 49132 63461 39602 -4212 871 16231
11474 16231 28492 38955 37371 42762 42783 27527 701 -16297 11369 18021 12703 28316 54923
11461 54923 43919 19531 23090 5312 24173 25884 17201 39379 68036 76504 60069 57527 38029
11448 38029 26182 45647 39083 33680 38046 65297 52701 53641 51425 18209 19110 29055 43101
11435 43101 67400 42634 15519 48697 64352 62517 74057 73399 67180 34155 -7066 -16164 -2934
11422 -2934 17843 23074 34513 52323 90322 79325 61641 86502 89141 52978 44416 43575 39388
11409 39388 41153 44638 62720 71970 72977 73878 40453 27891 35366 31484 51964 47135 37410 44767
11395 44767 29357 7463 9570 -7496 6332 26243 24927 32243 31515 21871 15504 37574 52520
11382 52520 50531 73627 86258 68513 64378 44211 48768 45891 44513 50076 42658 30730 15019
11369 15019 14156 40123 33716 16907 6172 14003 23441 43010 24881 2628 -1988 25209 30340
11356 30340 15066 -3004 34218 46056 44395 41343 37044 31028 30509 36147 19140 23540 40231
11343 40231 57043 32397 32180 47278 47872 49035 37239 40229 16943 8338 24479 46119 24937
11330 24937 -2490 1704 1514 1375 -12074 -11543 13317 -8401 5744 26457 32864 13923 35899
11317 35899 34909 2176 -5157 -13317 974 13958 18245 3293 -1251 2818 3966 -880 9336
11304 9336 12541 18867 25480 11332 -10196 -20076 -10079 8717 14665 13969 31223 31799 25391 45253
11290 45253 21797 12824 30998 4584 -39028 -36082 -7994 24931 24061 22910 21810 6229 10955
11277 10955 5971 2678 9369 7282 24331 81 10248 17539 2198 11995 23297 24813 26959
11264 26959 50444 64090 40089 36899 23662 38826 10343 14493 9005 10142 25723 17498 -1246
11251 -1246 19583 32551 14161 12901 10213 873 27570 42241 29561 21284 6266 -23758 2902
11238 2902 1977 8338 25136 49069 20931 12956 12116 25231 6380 4372 13979 34871 27413 32498
11224 32498 41044 31367 36261 40029 17225 -13918 -12552 7619 25591 53359 48950 5689 -22619
11211 -22619 -28524 -22011 -36200 -47544 -57336 -48088 -8071 32594 25263 29226 47501 29796 7859
11198 7859 -6741 11527 29836 -3550 -9224 8452 9278 2520 13155 18340 21994 5029 2718
11185 2718 11973 37752 29845 26476 46169 16433 23753 45498 34713 8390 12833 12692 31586
11172 31586 47636 33542 17361 18413 58166 56456 21787 12961 32847 32210 10978 -4864 -12431
11159 -12431 -20654 -39749 -48550 -27466 -7079 13091 7410 8029 3822 3082 13673 8295 26548
11146 26548 12368 -2934 -10210 -13318 -35137 -39645 -38470 -4239 15895 28288 27149 10706 13733
11133 13733 40882 37758 49874 48157 46889 59716 76560 64236 63194 49498 41657 37559 14891
11120 14891 58 8232 27196 9522 -11004 -19298 -33400 -10636 27133 18273 9560 5675 17608
11107 17608 31349 41658 37755 27523 29244 21952 9331 4048 6569 21896 10185 9921 21636
11094 21636 19523 21615 18945 7983 10224 -10664 -13751 4377 10994 30806 26828 6097 -19000
11081 -19000 -30081 -40229 -21237 -6737 -983 -1471 21309 39102 39123 29355 14503 11979 -4733
11068 -4733 -33669 -22277 -7851 16098 44704 22564 21419 42064 30877 -6985 13178 46147
11056 46147 48094 2816 -16830 4876 10612 20711 17766 7807 21551 28641 22489 16510 16472 18080
11042 18080 2684 8269 26821 52877 81432 99619 111676 82458 62093 68395 65422 62308
11030 62308 81924 90935 107661 166122 199465 195446 181138 190241 183945 161549 167398 188086 175254
11017 175254 175887 203482 209013 239475 253964 275488 282996 281639 269659 252755 223809 213901 209152
11004 209152 184125 180891 188535 190061 180096 195467 198128 163001 120516 110704 128956 141038 161535
10991 161535 164611 162947 145876 124706 128829 114677 88075 89541 66612 50959 31091 3808
10979 3808 26757 52254 39579 48140 32568 21252 -839 -23572 -27713 -18052 -3410 -1212 2982
10966 2982 -19943 -28220 9450 24845 21407 7111 3648 -2273 39807 49901 29222 44237 56683
10953 56683 38535 27 11194 22353 -5308 -25546 -26504 -24277 -2627 6184 21067 26851 34236
10940 34236 33900 34129 11064 13683 33600 47699 43555 19964 25391 48864 71069 22318 6823
10927 6823 16517 42066 48585 43902 45817 26715 31434 54311 76599 56307 31038 17403 25679
10914 25679 43059 20358 20217 17533 39269 74505 58369 28861 6535 24891 45304 65110
10902 65110 68412 37194 38852 32930 31303 41703 40993 51251 33607 34669 35619 48663 17292
10889 17292 9268 7344 -2811 15603 38838 50874 56409 37727 20925 49449 71944 71003 44756
10876 44756 5765 4192 22947 27379 9749 19222 25274 16899 38698 73333 61947 21199 -16866
10863 -16866 -60135 -50745 -6312 18287 59674 57956 39077 41797 34751 22909 20152 10018 27622
10850 27622 55885 71336 101710 52290 51624 72628 63361 56352 55392 25444 641 4384 19737
10837 19737 21470 28169 -330 15219 47313 69715 84923 98952 124280 81172 65732 73677
10825 73677 87935 55563 44250 51548 67178 66445 67643 111717 110677 60887 41646 33284 22328
10812 22328 13462 2111 21247 28771 24061 24956 70575 65613 65344 87170 92006 74913 51601
10799 51601 39467 52359 58158 64587 76603 72993 76368 88720 95527 94873 85462 60822 45014
10786 45014 27053 49586 70427 71586 69226 62636 50346 58745 58520 41498 12670 19551 53856
10773 53856 79323 75763 55186 56851 36511 37760 35036 45079 37299 7003 23663 48185 60773
10760 60773 57224 48272 33970 26257 30296 14183 26271 15808 -8359 -2981 10797 43799 55025
10747 55025 33140 5679 4543 18820 11360 -4071 14349 47170 35667 32468 15765 29565
10735 29565 24362 21616 18978 40301 44547 21731 27685 37673 17419 -16281 -9465 21589 35456
10722 35456 62687 95194 91024 84248 83213 90233 86459 71234 55517 72168 85056 84922 70220
10709 70220 89787 113365 88094 78226 66098 86193 113780 112825 103381 80487 85311 78637 62798
10696 62798 36140 28664 22743 23732 18943 16848 25333 43418 53938 70738 113758 115886 86093
10683 86093 65198 50683 30416 59165 75484 59671 68214 93144 94892 101052 116660 137973
10671 137973 133220 99664 107123 111609 101946 96284 117612 111969 97345 105040 107282 98897 82117
10658 82117 105668 123605 123678 131639 130399 118100 134818 144609 177140 195220 216222 213359 224945
10645 224945 271080 309254 321449 351926 395825 437272 422865 417904 412936 426946 400021 377972
10633 377972 379928 417077 452455 488258 526607 582809 629808 706611 807465 914968 1053036
10622 1053036 1127286 1194259 1276606 1372357 1499715 1658739 1895647 2186319 2559095 3055062
10612 3055062 3762643 4742139 6022352 7699632 9665343 11696810 13339361 14232147 14393213
10603 14393213 14111375 13749439 13596040 13915947 14989416 16983155 20014194 23982127 28016282
10594 28016282 30770547 31539655 30586202 28673823 26580990 25024733 24546208 25411122 27768007
10585 27768007 31638893 36659877 41437673 43986120 43441203 40522529 36329604 31991933
10577 31991933 28431788 26138463 25267821 25762964 27506777 30041317 32223905 32764063
10569 32764063 31252857 28265545 24651165 21125582 18257999 16268841 15130173 14778075
10561 14778075 15014979 15493537 15759584 15379138 14218759 12552257 10641681 8755210 7126088
10552 7126088 5814589 4815669 4081756 3484904 3008479 2663979 2423182 2235736 2049706
10543 2049706 1852903 1681674 1555517 1437054 1337659 1227668 1147270 1063801 980289 921067
10533 921067 851555 802129 788033 743874 684632 658955 645309 601588 586251 597891 559495
10522 559495 520289 495775 449550 403537 373161 350387 335888 326686 314711 301931 298031 283181
10510 283181 274524 264530 264073 238463 213158 183711 174590 181452 189631 167243 154950 155461 164058
10497 164058 185790 200905 187385 193890 220969 186156 167972 143885 138433 135220 104305 78757
10485 78757 109499 147363 155939 138561 131784 135701 146751 153964 153882 156832 164288 165229 154329 147470
10471 147470 116057 87885 82463 107693 102883 101375 109611 100825 101864 94186 88452 81807 89592
10458 89592 76053 72328 78941 100829 90972 101557 96486 68537 91590 102755 106901 86509 64838
10445 64838 65997 40538 41510 60452 60740 64495 39357 19669 39132 47041 34674 39577 66334
10432 66334 78512 61182 45927 34650 32881 37148 45172 25797 28247 24047 30437 49060 45834
10419 45834 40690 57041 67395 44506 41324 19953 29868 51216 63080 57994 57488 63010 66613
10406 66613 78061 60080 53378 32875 5581 -6328 6235 26781 46081 59177 55504 9827
10394 9827 -7631 -6603 -19215 -29614 -22627 -8207 -8910 -14074 6427 24570 21322 -4540 -17562
10381 -17562 -8487 -28965 -42283 -32263 -34220 -7206 28500 32778 14757 -24303 -28330 5407
10369 5407 30642 12821 3520 13860 19465 5925 6318 19721 25130 16686 10321 -6364 -1156
10356 -1156 -1740 450 -3487 -5098 2084 -23281 -39989 -6883 19556 -9457 -5835 -17233 -11698
10343 -11698 -12385 -25502 -19691 -15827 -7319 -10349 -290 19682 27724 6276 -2172 7034 -7671
10330 -7671 -35096 -45537 -32312 -32989 -35167 -50456 -66280 -64076 -47910 -25899 -7318 -8770 5823
10317 5823 54741 23662 2949 35733 36079 23030 18845 44015 28561 8549 2735 18587 -12674
10304 -12674 -24080 -34413 -33714 -15576 -19926 -28074 -31269 -29735 -21208 -24269 -2741 11829 37685
10291 37685 48846 27400 156 -11291 -10695 5908 12272 33746 20220 -6088 -17454 -1311
10279 -1311 16852 25940 12534 -12851 -6869 1177 -14031 -32164 -41746 -23306 -624 41434 49615
10266 49615 21228 18609 13074 4811 -8042 -17408 2486 41897 69828 59601 37501 52534
10254 52534 68372 42990 32730 31969 22097 12943 -768 25358 23205 16194 15898 21512 60512
10241 60512 56225 48123 40989 50167 33622 14690 11171 17545 22301 14008 21938 14682 -10341 23138
10227 23138 15054 -6539 -14473 -20635 -13745 -9746 -14386 -375 -24291 -20631 -377 -11152 -4607
10214 -4607 -19057 -41615 -10714 2188 -7972 1177 5663 24605 53907 54026 10615 3817 7084
10201 7084 4824 -562 -690 4103 -671 -11709 -20427 -8777 -10606 -12962 7061 36599 60497 58004
10187 58004 60946 60367 52230 19619 21427 11074 10744 27257 45750 62910 30950 462 -9131
10174 -9131 21762 51441 54448 86215 123337 142309 140645 142226 94752 85136 105723 98111 89683
10161 89683 72496 97880 145840 165426 172757 168252 171494 189102 216195 209819 214297 214674 209407
10148 209407 205495 210295 220915 243474 230664 229763 245816 228839 172736 134559 143464 166970
10136 166970 185902 202349 203555 190036 188439 159353 123375 98515 87116 99230 70201 49220
10124 49220 65511 52290 47852 58172 67652 64610 48574 24855 23466 8822 -15512 -13892 2953
10111 2953 19557 9816 1352 13395 27925 25735 39332 52151 48746 70240 81840 63006 47886
10098 47886 23808 15590 16118 14838 13583 -5356 130 -10490 -17807 -16020 -16858 14718 30914 57118
10084 57118 66037 64814 47743 38494 33933 20620 12812 3561 -29498 -40980 -2558 29570 21609
10071 21609 -5797 -23882 -5438 -20396 -26336 -26534 -2511 28987 35104 12073 -17637 -42187
10059 -42187 -28272 -20549 -779 33745 33653 26900 12777 12200 14633 19081 18963 13822 -5126 19120
10045 19120 -5003 -35955 -39765 -27249 4595 16229 9326 -14776 -8374 -13146 -29574 -4078
10033 -4078 -3887 -24436 -23062 -23555 -52404 -66566 -33203 8577 12861 -21099 -45023 2571 20539
10020 20539 14338 27858 35569 15791 -6781 -2704 14465 20358 12580 27097 19924 28771 39650
10007 39650 28455 14066 23791 28802 20032 8695 15354 5806 -218 -3209 -8561 -6066 -17927
9994 -17927 -25145 -34694 -22871 -122 19491 5444 5198 30374 43442 33982 15087 -2267 3962
9981 3962 -8060 -31204 -43351 -36846 -22703 -15592 5829 1887 -23415 -8787 1224 9112 4250
9968 4250 6408 14574 13789 7934 36936 61002 33498 -202 -16385 -23751 22571 32357 21582
9955 21582 -9700 -2404 30872 31378 16925 14425 29133 35778 49559 56689 20540 -11616 -2194
9942 -2194 -13524 -30970 -45339 -35960 -26789 -12835 -23275 3754 -15647 -29168 -31664 -23542 -36388
9929 -36388 -22798 -5812 8118 10055 12361 -5715 -1668 24216 33748 32257 26229 32207 41329
9916 41329 44157 58627 47876 71796 57642 38855 48356 26034 2999 -23914 -21214 -2143
9904 -2143 -1236 -24087 -47837 -39433 -35773 -30781 -33432 -38376 -18498 -3805 5594 10521 -10116 -23789
9890 -23789 -26673 -25201 -16815 -17011 -24552 -16112 -3686 30161 18994 -9846 -4258 -2025 33641 5870
9876 5870 -34651 -25905 -32838 -26079 -16145 -2541 -5447 -20091 777 8586 11734 -589 24111
9863 24111 61724 62888 53492 50752 64358 47813 8871 -13353 -8268 -21655 -22327 -26040 -27376
9850 -27376 -18434 -6902 8010 1014 -13959 -2058 -16246 -36102 -16957 3342 -8437 -4609
9838 -4609 3956 15342 -2476 440 38410 45838 31723 4586 24416 18676 14072 25121 39619
9825 39619 17702 -1995 17059 11039 -6780 -3923 9397 28108 39020 36247 20026 22617 4715
9812 4715 -24157 -28162 2326 21009 43877 59311 46744 53102 37809 27652 -11418 -33145
9800 -33145 -19935 -7908 1431 -5765 -5508 20495 31743 51595 33260 12429 -21019 -25270 -24893
9787 -24893 -10557 4899 22561 34955 35322 12122 -6108 -30062 -19650 -19581 -12248 -18291 -32299
9774 -32299 -8318 -8886 -33227 -22663 -17744 3481 34991 17743 7256 19388 25305 23923 -15680
9761 -15680 -30903 -58288 -37832 -40503 -29615 -9535 -29649 -23566 -6016 243 -26942 -45232
9749 -45232 -2167 -12682 -4910 6784 -16617 -33606 -20782 -397 -7296 -20009 -2576 18031
9737 18031 25211 52961 44234 13608 8786 46806 53094 31540 40327 18130 -259 3280 -25073
9724 -25073 -44359 -61702 -54170 -69696 -52567 -9968 13640 10790 -10328 -16670 -24488 -16618 -1747
9711 -1747 4490 24265 38514 35181 30066 31247 33519 32727 -1199 -34385 -11837 24928 22518 13045
9697 13045 15561 287 3512 10231 16359 -7963 -29928 -28870 -33950 -30443 -44011 -51327 -42905 -16285
9683 -16285 620 -8931 3940 8398 14022 41747 59786 48888 30070 28673 24496 27393 21375
9670 21375 19013 43266 50363 46349 13229 -5598 14860 26464 35957 5080 -10401 -31107 -37606
9657 -37606 -26472 -23707 -23537 -21402 -9001 -31922 -48689 -54353 -40157 -16197 6752 10227 12327
9644 12327 2140 20992 34869 25961 -4944 -13321 9806 35009 28169 32137 40362 31582 11928
9631 11928 19921 18861 4415 -774 -20302 -15816 15566 -5304 -24608 -25025 -7815 2972 8639
9618 8639 -39237 -19474 -25884 -28698 -22374 -10917 1267 -17139 1764 16245 43558 31587 28147
9605 28147 16405 19536 50116 52166 38263 13062 23577 21090 14949 15955 18922 13540 37357
9592 37357 43644 26576 16072 14696 34107 32510 36635 -16765 -21026 -307 8230 9330 -3279
9579 -3279 -13095 -21530 -15763 12758 30980 42927 44718 39171 969 -24414 -22200 -16429 3030
9566 3030 27213 30197 -24898 -46339 -44468 -34601 -49155 -61176 -50277 -12847 -9313 -12309 -9863
9553 -9863 -4398 8736 10587 17668 27077 24816 17733 14578 -16156 -14777 12514 28917 19402 19035
9539 19035 30475 21938 37407 40880 25252 8589 202 7716 -4822 26556 43073 66106 31264
9526 31264 5475 15626 4039 -8434 -18591 -28393 -32556 -40272 -19492 -23834 -74886 -63054 -37234
9513 -37234 -15653 -22349 -595 1559 -33437 -39269 -25272 7760 44395 27233 -7820 -32068
9501 -32068 -27853 -8837 -33376 -33378 -7774 9072 5432 580 -10876 -6621 -16772 1177 -3514 -34471
9487 -34471 -31299 -27979 -27430 -3460 28629 44802 72157 72504 64559 33745 27400 33521 -6148 -36444
9473 -36444 -44594 -28997 -9179 -11526 -19761 -11057 -19978 -25182 -10142 -3063 5261 -13985 -40740
9460 -40740 -52103 -53279 -70930 -52076 -25923 -37365 -55954 -40914 591 -4177 -11246 -18650 19686
9447 19686 26576 23712 18970 18066 9441 8041 -307 1395 17546 28356 10364 -18398 -15193 -15409
9433 -15409 -18053 -8957 26327 30633 11345 4206 -8756 1083 18175 10336 -11169 4545 -115
9420 -115 3 -9340 -23121 -20582 -34125 -17658 -4647 -17614 -39101 -48385 -32192 12361 21097
9407 21097 9212 661 -13803 11096 20177 -4514 -2224 10848 30870 37170 43970 15997 -28184
9394 -28184 -41372 -50413 -52427 -32622 -29219 -27545 -6863 25370 11070 -4542 -36664 -52341 -52383
9381 -52383 -59264 -69788 -76964 -74339 -49550 -53174 -52011 -32954 -24728 -25838 -31392 -26671 -15112 -14408
9367 -14408 -10169 17497 25203 618 5880 38401 69678 62461 44649 32705 43944 48508 25158
9354 25158 8601 17529 25610 3905 -25739 -33660 -33874 -33726 -23473 -12785 -9290 6384 27458
9341 27458 28714 43342 50005 28786 1852 -23444 -14784 -12139 -13377 -20004 -41772 -76593 -77651
9328 -77651 -70004 -72430 -70154 -37303 -23647 -15376 -33208 -28221 3888 36979 52646 39399 5207
9315 5207 -34387 -23245 -9417 -6995 -20138 -6251 -10716 -16669 -23066 -190 2642 8341 25287
9302 25287 30874 26631 40355 51233 33427 21003 19908 760 -22375 -23727 -31803 -39579 -68489
9289 -68489 -53127 -10267 -13933 -20878 -6006 -1010 13112 35608 24746 14086 23933 40606 22486
9276 22486 -2036 -19024 -31107 -13086 -906 -3805 26690 9126 -25398 -19852 -17392 -6394
9264 -6394 -13917 -7337 -44326 -44614 -40927 170 -9209 -15666 -7149 30898 44148 38282 6841 -5307
9250 -5307 -10505 -26581 -32994 -23896 -7967 9066 4259 16379 17387 -1232 -33599 -18905 15940
9237 15940 17764 -6070 -21989 -37108 -18893 885 -1546 2846 27081 27087 22344 1345 -19578
9224 -19578 -37068 -37056 -2783 12909 16773 15504 30467 46329 22112 18457 25990 32689 19928
9211 19928 36827 56365 36184 11398 8995 15588 9725 -2629 13518 -8667 -28977 2512
9199 2512 -4181 -6690 4940 20280 14808 -13451 -33027 -26919 -35203 -33196 -37257 -32541 627 6069
9185 6069 8544 -1893 -15181 -3541 11357 12191 -27928 -46840 -34424 -16001 -26298 -29797 -36207
9172 -36207 -43952 -33382 -31006 -26408 -35599 -47897 -42037 -3145 6909 -31578 -22630 -22010 -21291 -9385
9158 -9385 -6934 21439 42606 19775 -6033 -2925 -11829 -24888 -23408 -16789 -21848 -29366 -38526 -50016
9144 -50016 -21246 -21489 -13244 -5972 3975 -16010 4243 6336 -1657 -4488 -2071 2597 -26847 -37669
9130 -37669 -34037 -17462 -19339 -7834 -24315 -27597 -38822 -40619 -30926 -20192 -36630 -8794 11098
9117 11098 23608 39142 16504 21183 43552 44959 39125 12808 4367 2041 -2853 5461 16552
9104 16552 40701 18026 3354 22388 11198 -20077 -8448 27349 56057 61324 34104 -4240
9092 -4240 -1626 7061 -2501 -20165 -44715 -30243 1638 24723 17832 -1606 10731 19438 24088
9079 24088 4785 -6656 11860 -957 -28968 -23872 7225 4494 4983 283 -6158 4460 1856
9066 1856 -12890 -7649 -21975 -22024 -6809 -23759 -28287 -24429 -16742 -5633 -12141 -33879 -28208 8345
9052 8345 41398 20768 -12811 -36346 -48611 -40125 -9403 -17931 -4167 15270 31207 31401 38158
9039 38158 38873 13590 -4871 5621 16189 4648 984 5418 -8684 -21741 9097 5171 -15580
9026 -15580 731 4195 18367 46826 43329 36908 21441 -16131 -4430 36269 50727 30957
9014 30957 11732 4407 11017 3856 11757 40589 35502 31690 34202 26949 -16418 -38697 -16285
9001 -16285 -42758 -13676 11589 35454 43767 23039 21728 26499 23390 14873 28309 16586 10229
8988 10229 16812 38417 30874 47726 58876 49390 29856 24887 55234 42487 4672 -7565 21659
8975 21659 45768 58153 52102 32462 19996 56110 32174 14314 18055 23320 -10446 -32351
8963 -32351 -47235 -15822 5012 13408 -1263 15424 48255 32712 7953 875 -10222 -12212
8951 -12212 -18244 -22481 -24820 -34361 -8226 20831 25395 10585 -446 -10772 1105 21231 15978
8938 15978 -3612 -20280 -28138 -8257 10362 -4345 -10380 -5357 -32436 -37515 -34184 -6246 10155
8925 10155 -698 -15675 -5255 -4252 -13258 -4456 11099 13529 13253 -15734 -32808 -26168 -21807
8912 -21807 -28917 -16454 -32744 -60181 -62161 -51051 -48820 -22313 -48211 -34943 -27990 -49543 -54223
8899 -54223 -51223 -61274 -61179 -47230 -12465 -26058 -13931 -15135 2996 1987 -19311 -24922 -31844
8886 -31844 -41049 -72263 -72258 -57921 -42295 -37097 -34798 -34619 -17778 6741 15032 -6753 -1692 -10051
8872 -10051 -42192 -26398 -18738 -30451 -20683 -1740 26947 39374 31447 8038 -8324 -94 -24348
8859 -24348 -50755 -45559 -31570 -34907 -6336 -6346 -32384 -46255 -26050 2704 -5512 -7860 -11901
8846 -11901 -14850 5931 -15422 -20010 -7245 -11334 -26253 -44101 -29033 3548 9416 -12649 -2928
8833 -2928 -8509 -13304 -16127 16288 54563 44484 35489 39911 54639 50315 33510 29319 15124
8820 15124 20043 14682 20122 20597 7518 7201 3785 4756 3235 -18225 -38007 -53333 -56286 -45065
8806 -45065 -32435 -16206 -19799 -7408 -10161 -31804 -23749 -8786 -4313 17271 -5041 -22704 -43199
8793 -43199 -37473 -13280 -24613 -35824 -44899 -49556 -16124 -6093 -19113 -18687 -11347 -10994 -16517 -31208
8779 -31208 -7580 30501 48052 36615 -7355 -28233 -26067 -42421 -38699 -28588 13539 12752 -6118
8766 -6118 9884 16964 15337 13575 21870 28066 29736 24095 13063 845 3541 3957 -5346 -3627
8752 -3627 7861 -6779 -5268 17620 30920 12130 -6644 -20958 -51587 -60212 -36194 -34883 -25766
8739 -25766 -23491 -26865 6785 13023 -17718 -20905 -17147 -17886 -3067 -18196 -9049 -1702 -1288 -1210 3265
8724 3265 -29465 -34250 -19698 -20335 2957 -8219 -42029 -1941 6078 16356 -6006 -33741 -16905
8711 -16905 -746 -31573 -8112 20709 23122 47305 21953 -14399 -16311 -15583 -37005 -30802 -16184
8698 -16184 -8402 22151 48976 55933 69068 41915 23377 34967 16602 24321 22152 5133 -13326
8685 -13326 -18823 -22345 -14959 -5028 -31 15592 19801 6265 -14561 -12337 2500 -20110 -14648
8672 -14648 -10312 -21511 -39012 -53933 -52954 -40009 -28163 -31721 -17476 -10915 -13119 -25502 -37979
8659 -37979 -36800 -25782 -7600 43215 42275 6803 25479 33894 3420 4575 16223 21665 -10591
8646 -10591 -43215 -16293 -4046 -29746 -31784 -10092 -393 29657 6940 16949 15501 -4956
8634 -4956 -11729 -31070 -43733 -42531 -36018 -41706 -45831 -36996 -30281 -17557 8647 27044 20236 7781
8620 7781 28719 25933 2579 15753 43395 33022 36494 13088 14621 15949 -14077 -25671 -31533
8607 -31533 -15449 4842 27901 45729 12366 -5991 -28529 -45062 -25076 -7131 -1513 -4885
8595 -4885 -16491 -20583 -9570 34013 46569 30914 -3747 -22316 3987 26874 25590 8348
8583 8348 47 9260 9640 -5975 -48615 -35647 -16037 27940 30051 11098 -8622 -7515 10112
8570 10112 31712 27689 2106 27026 57001 47463 44839 45501 37634 34771 55535 67095 58345
8557 58345 50223 26855 -10763 -13997 -448 14271 19010 16532 15463 10922 4639 29456 52548
8544 52548 51573 57267 41958 49943 42754 42926 52195 40795 33001 11914 26477 27429 1155 -2654
8530 -2654 -9620 -18116 -9638 13194 26899 14679 -9432 -10245 -11724 -19169 -8489 -9353 -26553 -19481
8516 -19481 -4545 -5681 -14008 -27756 -7607 15261 -17419 -38754 -27849 -19158 -12181 -13821 -15813
8503 -15813 -29332 -14444 22960 42971 55643 23551 46553 23776 15053 24373 27028 32298 26571
8490 26571 29473 43996 44071 7959 -10820 2189 10661 -355 -8114 586 -6532 5182 -1902 25
8476 25 588 7954 25034 17347 -25220 -25352 11145 37859 31208 42419 61931 19775 18186 -11047
8462 -11047 -14065 -5785 18558 6686 -5133 -5020 -4209 -11622 19020 42926 40157 49089 51393 34307
8448 34307 30118 41063 28754 6540 -18510 -30506 -7701 -7350 -11728 -18829 -16151 24725 38670
8435 38670 18010 7145 622 1539 -847 8486 11572 4065 5517 10517 14992 30539 31999 15693
8421 15693 -2992 -4831 3241 2059 -1515 12208 8698 -4651 -13484 -17981 -34743 -11654 -16299
8408 -16299 -28285 -12368 1782 607 7860 14084 -1606 -17400 -21970 16266 26514 2750 19395
8395 19395 27883 11496 -2672 24176 18315 27534 34545 33904 39785 29285 30357 15750 -10603
8382 -10603 -34786 -17229 276 18962 49620 39556 3554 -13106 -449 21527 14747 240
8370 240 12670 -4622 -22989 -14220 -21025 -12730 -26014 -30881 -33545 -35785 -26674 -4752 2425 -18987
8356 -18987 -26342 -18330 12665 26256 23150 8852 8047 -22458 -45221 -41696 -36815 -41256 -30862
8343 -30862 -54907 -53778 -66140 -84074 -55053 -15466 3186 4184 -3636 47405 75677 60295 41019
8330 41019 30180 -19797 -73314 -49110 -465 18565 9749 8281 -9129 -9300 -15749 -26256 -35468
8317 -35468 -11222 893 1954 -14671 -27683 -42147 -25651 -19027 -41672 -32395 10089 40402
8305 40402 19471 18553 -13564 -31619 -44451 -54477 -51479 -41241 -37208 -35403 -5685 13300 92
8292 92 -14687 -280 -12492 -24474 -35561 -36911 -45761 -49369 -30593 -42834 -31642 -17743 -20666
8279 -20666 -32878 -32141 -32245 -48402 -25735 -11385 -2747 4818 15577 26446 17366 2970 10729
8266 10729 24650 26749 9996 7659 -7131 -9321 5781 25854 14997 -1257 -4679 -6013 15715
8253 15715 21221 -15257 -30816 -29741 -31116 -21559 -27020 -14410 21016 19026 9343 5114 1221 -10449
8239 -10449 -32064 -48642 -29433 -24423 -39500 -27252 -10333 -16904 -38890 -1244 69267 90682
8227 90682 66834 45008 48158 43574 23602 9661 -7126 5233 32816 32962 18854 19171 -176
8214 -176 -168 22047 18989 16978 13537 40924 49270 55672 15437 1825 -4077 -26000 -56782 -63581
8200 -63581 -56020 -33630 -28133 -3900 6159 34162 49977 39536 42443 39055 29336 27027 13412
8187 13412 1903 -13873 12972 24258 14182 -16486 -34357 -38697 -31872 -47155 -76193 -98132
8175 -98132 -65553 -67787 -45381 -21636 16393 11427 12308 15669 9838 22786 13716 2638 21999
8162 21999 23721 23751 -2626 -18968 -18955 -7757 -3512 -13886 -27091 -15063 -15107 -8924 -9049 -4518 6903
8147 6903 -1149 -12769 -10208 -2957 -38336 -57780 -61820 -75066 -69204 -46645 -8134 -20649 -2899
8134 -2899 22039 9002 71 -5753 -22483 -45104 -31806 -14181 -16049 -19858 -11034 -1626 4646
8121 4646 -4807 8516 8985 -4763 -26234 -26734 -22979 -26455 -32372 -10866 8758 24896 51187 51309
8107 51309 26160 11389 3489 11082 15611 14566 30854 31842 5523 -8637 -13009 -39761 -42044
8094 -42044 -11755 -10200 -5480 15370 -5015 -24590 -14084 5672 -3267 3495 8594 21228 25777
8081 25777 26502 18520 28036 40691 39757 13951 17297 17971 29885 48314 33071 28829 35837 37791
8067 37791 42320 71151 86205 67058 32885 19189 6023 -14878 3351 19664 15606 9492
8055 9492 11249 17673 -17668 -18241 13579 40286 41815 31639 43001 50959 64824 67344 63932 50805
8041 50805 22855 3335 -15980 -20459 -11493 -4324 -19060 -14982 8293 11671 -9634 -52727 -62379
8028 -62379 -86165 -56464 -62360 -94529 -67632 -34437 -8636 -15132 -1610 -13930 -3404 14414
8016 14414 11101 10522 6269 16882 -179 1276 -2566 -7958 2390 16789 42734 46859 37100 -3318
8002 -3318 -30044 -18368 3699 21177 13236 15558 29019 37576 45523 31013 43653 47942 34479
7989 34479 33704 38413 9075 -2400 -12059 -4612 31015 73502 33986 13062 30070 37447 25512
7976 25512 4950 -21420 -27411 -33907 -27669 -24278 -19583 -15528 -23088 -15778 23395 -2218 -14831
7963 -14831 196 -4706 -36774 -27588 -13204 -30009 -23503 -254 1542 -17056 -15837 3992 -16662
7950 -16662 -39487 -46593 -24070 -21670 -13666 -4667 13768 35882 39164 35305 13802 -9465 -23090
7937 -23090 -40345 -37492 -4438 15268 33713 32287 32966 16822 -6933 -8598 7791 15005 14924 14772
7923 14772 33596 46116 37482 36481 52203 42745 8768 3374 16547 19431 4180 -22846 -31002
7910 -31002 19903 18722 2956 -21870 -21578 -34044 -21145 -12141 -5576 3914 -9853 5746 27666
7897 27666 25303 -10616 -2052 19877 -2698 -19886 3835 20681 -8038 -23792 3569 18386
7885 18386 26427 1588 -1866 2963 6183 32147 32422 45337 50200 23118 24790 1953 -10531
7872 -10531 2767 4703 -7338 -17374 -17632 -11411 -10222 6494 -8037 1957 39395 29792 15098
7859 15098 380 -21003 -39344 -33726 -18797 -16981 -8389 -36489 -23337 -6348 3023 8042 9571
7846 9571 7999 14292 7485 -1146 1156 -7747 -320 -24520 -38401 -49833 -24847 -8433 -19400
7833 -19400 -15711 -24842 -30612 -5060 11756 6056 -1994 -4497 -34089 -32365 -8783 -1479 9951
7820 9951 25874 20717 14064 -18684 -39772 -16465 14640 15034 28101 36634 34190 2151 3391
7807 3391 -13455 -15553 4519 -12624 -3941 9988 12457 18994 40227 36162 28478 -2366 -46582
7794 -46582 -64527 -54026 -14822 31657 48413 45236 22288 2721 -23977 -51603 -62758 -66332
7782 -66332 -67861 -62550 -78062 -63386 -48195 -52102 -69463 -53041 -28131 -20290 -39625 -54430 -40802
7769 -40802 -21956 -48711 -39803 -6174 12950 29333 30827 6835 -15927 -4493 10148 11639
7757 11639 22969 12291 -16007 -43814 -43183 -31735 -22469 -9918 13762 10226 -18765 -45218 -27470
7744 -27470 -35814 -30634 -22336 -48655 -40556 -25738 -17996 -8336 7094 22960 7273 -18815 -37384
7731 -37384 -29785 -13041 -14442 -15006 -10475 -10583 -20547 -11951 -31151 -7426 9909 1769 -36049 -49152
7717 -49152 -51127 -78458 -65892 -47635 -34706 -21792 -5612 2952 6846 -6246 -22484 -23730 -26813
7704 -26813 -18693 4459 34960 13634 -1496 -16864 -14819 21851 33005 22663 -1172 -1096 -27693
7691 -27693 -39634 -2907 1840 -30730 -55113 -47165 -45465 -30909 -40484 -5509 8467 -6428 15456
7678 15456 -16227 -35904 -25178 -11244 -4603 -33469 -23360 -31851 -34422 -11913 -12964 -10542 -12988
7665 -12988 -13531 -9346 1765 24743 50571 52001 49305 32868 3352 -26993 -21419 -5515 25871
7652 25871 30369 1290 -20683 -13909 214 1488 -18204 -29339 -16698 4499 5625 -14576 -38738
7639 -38738 -32252 -10929 -2858 -1015 393 15578 10983 -4954 -28830 -13898 -9791 14118 40991
7626 40991 58174 65830 68553 56977 43036 15679 2582 18726 68 -36333 -33828 -35090 -52068
7613 -52068 -28624 -2620 7654 -17370 -26460 -15880 -7632 -14098 11536 45257 55919 56708 59617
7600 59617 37711 44077 16196 1212 422 36488 47536 24155 -5143 -7907 1508 -8358 -20017
7587 -20017 -13479 -25545 -24721 -20049 -15186 -5919 -13529 -31392 -14495 -7186 -11455 1618 -7739 -14541
7573 -14541 -12134 -288 21323 -3875 -23640 -1836 2659 -2383 -14587 -3131 -9093 -9533 179
7560 179 1024 18110 20187 8669 -10532 -1390 -8654 -30738 -28672 -17622 -26989 -15998 10483 8000
7546 8000 -14158 -1938 -13968 -5219 -10118 -10838 -33509 -14542 499 5561 18530 10410 -11208
7533 -11208 -11267 -21736 -41794 -56351 -42894 -21368 -9408 -16736 -17013 1886 -15732 -8215 -10682
7520 -10682 -31864 -42821 -71641 -79703 -55358 -12841 14468 32182 17120 17966 5923 -12584
7508 -12584 -8154 -13056 -950 -3512 1350 14115 6183 -9151 -5824 25912 48265 47441 11497
7495 11497 10108 11483 23065 11275 2514 963 -6687 24269 53345 38282 19766 -5340 -6565
7482 -6565 14969 22463 5425 -7200 -17188 -12712 -34720 -59623 -53524 -37508 -21129 -24106 -32786
7469 -32786 -33675 -8453 3492 -26108 -56460 -49118 -47865 -68526 -85699 -45192 -41914 -27398 1491
7456 1491 -23508 -35925 -45630 -9449 6337 8206 11120 -27226 -37871 -11158 3489 -10394 -20480
7443 -20480 -26082 -11213 -32676 -58000 -44580 -37466 -61146 -50237 -47226 -21582 25182 24028 27036
7430 27036 7154 24241 45739 65539 69554 67694 45375 40855 15514 -4029 26400 31377 13225
7417 13225 -15470 -25356 -22450 10969 39190 32603 18772 5466 -13786 -18430 -31954 -21889 -27723
7404 -27723 -9958 -4650 -40798 -72153 -71200 -49964 -38540 -20317 8227 30543 13326 -5621
7392 -5621 -12752 12841 46374 28380 11240 -11028 2945 -10697 -23612 -22577 -9254 10878
7380 10878 9586 -14610 -1549 16697 18182 1610 -34306 -35924 -25993 -21722 -34526 -22632 -24807
7367 -24807 -19945 1627 -31686 -57658 -31442 -30227 -32361 -11030 -25712 -15657 -42602 -28339
7355 -28339 -5434 -5074 18662 29313 18981 5182 10384 9949 -19799 -21695 -34647 -22626 -26031
7342 -26031 -29901 -9528 -4416 -19758 -12609 -6095 16771 37215 28924 15205 2989 4936 -5213
7329 -5213 -31063 -30367 -9109 11747 16150 28692 14086 852 -2453 4975 2277 4151 5170 19818
7315 19818 20138 30134 23124 14773 23100 8560 -3114 -11351 -18806 -11543 34339 57859 19769 14606
7301 14606 4536 -1396 -2929 -3579 3 1944 -8167 7808 19360 23232 7542 -28172 -49786
7288 -49786 -44472 -50039 -18119 1375 6713 8762 7184 5512 -10677 -1321 38424 34498 12709
7275 12709 14285 14282 -4814 -124 -8921 -31379 -44850 -42479 -30356 -18765 -23937 -26749 -20626 16953
7261 16953 37851 35326 33020 38461 24192 13465 -4834 12134 26455 37547 7236 -1383 13732
7248 13732 19103 2203 -31452 -40866 -23829 -20561 -21632 9358 29500 27912 35628 18165 8818
7235 8818 2458 -1071 5269 5653 18876 18145 28777 33115 16592 -10518 -20286 6194 25746 43505
7221 43505 47519 -2635 -8143 3035 -965 20198 23048 30850 55440 52056 23533 28487 24066
7208 24066 10045 2518 6792 -10002 202 -1395 -41422 -62359 -69801 -60086 -33187 -8778 -3734
7195 -3734 5863 21407 8297 -7452 -21194 -16727 25061 29768 -4652 -21563 -24012 -10755 -10480
7182 -10480 -37280 -18390 -20200 -28425 -1476 40028 37078 26815 15721 17489 2622 105 -8165
7169 -8165 -33883 -20523 -14099 -31799 -37073 -54934 -26288 4728 -15327 -43260 -31134 -27120 -21032
7156 -21032 -20955 -25032 -17512 -28479 -36837 -42458 -34128 -10263 -3454 -10238 -361 16762 16319 -15473
7142 -15473 -32560 -13093 -12853 -26326 -34263 -42070 -14410 -23298 -9344 9281 24332 15029 18700
7129 18700 37434 37320 33220 25975 17160 7832 -10085 -18768 2583 19510 -4978 -15462 -1381
7116 -1381 18268 40935 29989 6721 12738 1034 -18763 -21515 -44094 -18463 -21931 -27166 -32633
7103 -32633 -45992 -60481 -54039 -50086 -43381 -39156 -29200 -35272 -30355 -21688 -13661 -1671 18783 13503
7089 13503 13094 12694 9174 -1406 -18415 7117 39075 68883 72782 52569 28404 28427 18328 6874
7075 6874 -29735 -18539 -25713 -16958 -10883 1509 -547 -10941 -20839 -4458 7332 -2708 -2611 -3769
7061 -3769 14572 14610 -6775 -25581 -58267 -61543 -59547 -54396 -62549 -67564 -78718 -74188 -79241 -70543
7047 -70543 -57375 -33208 -20798 -40272 -47444 -34802 -35341 -3792 17679 -3565 -52199 -67648
7035 -67648 -58786 -29391 -12654 3963 -106 -18994 -13535 -8305 176 14201 27371 10971 -22112
7022 -22112 -21751 9226 29787 18934 8417 39822 38334 10588 9468 5673 -25966 -11540 13172
7009 13172 4229 2757 -11872 -3522 -11270 -26351 -34244 -4198 8950 12095 14124 10067 16742 11834
6995 11834 10603 28107 18520 8613 -10932 -21348 -11763 17669 23210 14116 -5854 -29061 -19477
6982 -19477 -5276 7139 -7714 -2441 6345 18022 22535 -11466 3046 24304 29885 3301 15384
6969 15384 24456 12406 12960 11391 9527 931 2744 -13596 6374 8319 3068 3147 1632 -6140 -14386
6954 -14386 -27941 -51510 -21779 13093 22839 -5618 -10078 -3151 29724 22317 12109 -16023 -35738
6941 -35738 -17197 -33058 -16943 -1376 4793 -11948 -20756 -23582 -13762 4067 6613 13435 6236
6928 6236 -949 8059 13486 11818 8312 -690 -6695 -31839 -32780 -17200 -16576 -13586 -23170 -41239 -43763
6913 -43763 -40073 -15140 9872 42991 55282 54274 17875 -6919 16222 54996 64712 41086
6901 41086 10828 13575 26569 4089 27359 34275 41675 29543 7748 3496 -1203 -10237 -31564
6888 -31564 -24771 4807 15817 12489 18971 8581 -21177 10901 3278 -43543 -48997 -25456 -7102
6875 -7102 -16166 13794 20730 8088 -2395 -4769 1338 -4165 -15782 -36179 -7238 31650 29497
6862 29497 3454 -5553 -20359 -29933 -26569 -32310 -32756 -42774 -43627 -23148 2835 23942 27464 -5061
6848 -5061 1286 -10034 -23647 -33048 -18659 -11136 -24751 -32883 -43439 -41583 -50233 -50467 -37118 -23950
6834 -23950 -10847 -6664 -5804 -27342 -11557 13438 11996 -3523 -20162 -58899 -43792 -1448 2130
6821 2130 -7708 4016 -12820 -29650 -58774 -49418 -40578 -35755 -17995 -13298 -26717 -23550 -24511 -20390
6807 -20390 -16575 -40040 -52256 -39557 387 19909 -7674 -8387 -14760 -36813 -32451 -11476 -10922
6794 -10922 -24418 -39898 -50142 -44139 -36555 -28936 -19028 -15435 1042 31148 18983 40317 55240
6781 55240 59553 49609 47269 30931 16836 -19207 -31648 -25333 -16185 -18668 -16420 -9709 -3377 1608
6767 1608 -19141 -5965 7151 29710 33301 15227 21432 32272 32063 20454 -1880 -6431 18463
6754 18463 8431 -12664 -31355 -4830 2293 -12663 -7328 3810 -15271 -18628 -30616 -15364
6742 -15364 4308 2587 5100 7405 30422 46346 47625 35388 7421 -17872 -10811 -5533 7845
6729 7845 1909 -7121 -13553 -32039 -24853 -18831 3496 42349 37189 -5281 -27681 7610 25132
6716 25132 34909 23638 1844 -35035 -25076 4167 7007 10866 127 -30073 -45419 -31648 -44334
6703 -44334 -47908 -23716 -36597 -38863 -33946 -36768 -54080 -13637 15669 6305 -5420 10455 41821
6690 41821 36125 1167 -27868 -33105 -15921 -8082 -47902 -61265 -30642 -17009 -30896 -12884
6678 -12884 12290 16866 8641 -169 18267 1351 -25677 -14063 -4128 8186 28275 16288 1943
6665 1943 -18035 -29842 -35442 -36694 -37000 -56595 -53706 -44931 -54593 -45518 -36418 -41058 -39469 -33083
6651 -33083 -44736 -27078 -17702 -23890 -25314 -46741 -45631 -52097 -59300 -58835 -35649 -42806 -32383 -32266
6637 -32266 -36148 -35030 -15280 -19181 -40732 -44571 -19644 -14100 -10091 -15599 -23355 -23188 -26344 -41419
6623 -41419 -48897 -32128 -37229 -39866 -33632 -29018 -9471 -9487 -38361 -38178 -25497 -24826 -4292 7385
6609 7385 14807 7864 16731 30672 42683 21500 -5452 -26923 -15046 6019 4166 -8709 -16953
6596 -16953 -2750 -7583 -3264 -22800 -6605 -20451 -29903 -20828 -15324 -33545 4571 35259 34615
6583 34615 5168 -15296 -370 -15424 -15477 -6503 -13383 -18154 -22425 -1378 11442 8412 -36886
6570 -36886 -47514 -46307 -34039 -13039 -29030 -39073 -33820 -37319 -33776 -17211 -455 -21907 -37701
6557 -37701 -45728 -45144 -51446 -72691 -56297 -9008 -2452 13079 1073 18461 39203 40969 32975
6544 32975 1785 -819 8179 8502 -10484 -36774 -5686 1526 12112 422 5709 12372 6476
6531 6476 3304 26978 43719 39108 13032 -14080 -26806 -13540 19846 20043 23794 16785 12466
6518 12466 -19637 -24857 8327 17365 23692 11392 -11162 -42889 -59383 -50718 -41415 -25732 -30529
6505 -30529 -17481 -16079 -669 20378 24623 33200 29494 19534 9684 -6196 -6110 2175 2833 2438 8076
6490 8076 5935 12059 17047 -6997 5720 27700 50732 49604 31921 -3051 -50898 -33964 -39105
6477 -39105 -34059 4610 -1707 -24480 -46101 -37661 -22340 -20959 -16156 -44995 -68069 -83241 -51299
6464 -51299 -31066 -44439 -8293 18400 23845 34036 22588 20153 8721 -948 -30971 -45654
6452 -45654 -54162 -30974 -27856 -25038 -13162 4565 32683 31414 33192 16185 15784 1256 26301
6439 26301 27840 -8002 16135 42920 42948 50011 38185 45023 37163 19055 -27091 -33661 -28258 -21328
6425 -21328 -2444 -15661 -7842 3790 22798 21235 11007 -24458 -27277 -3613 -1044 -16254 -18451
6412 -18451 -10357 -8622 -8803 6241 10836 -4970 7143 -17629 -16326 4627 -2992 -3877 5673 -6217
6398 -6217 -14270 -26138 -26474 -13719 15673 10133 8152 9005 13349 3713 1445 12741 -428 -7954
6384 -7954 -519 -4395 893 2880 -12423 -21935 -25138 -39849 -48610 -39658 -31127 -14618 -3773 -277
6370 -277 15124 23902 10888 -18238 -31565 -20526 -875 2177 -14803 -5069 16595 -2444 -17454
6357 -17454 -8982 -13016 -7763 37988 50097 15980 -28468 -4155 7916 2129 -22167 -30828 -21975
6344 -21975 -11094 -17542 -14876 -6092 -25906 -49550 -53490 -19617 6761 -3592 -23584 -15403 -25973
6331 -25973 -19374 -3435 -20936 -37775 -30445 -9169 -12834 -15102 -32499 -56532 -58092 -7998 18268
6318 18268 15124 -4918 -11456 -23835 -16551 15791 -5115 -28555 -23339 -35655 -37213 -36083 -17594
6305 -17594 -15257 -20073 -15658 -29505 -40594 -42488 -26837 -11571 11370 21650 36468 25417 22033
6292 22033 834 -1778 -16277 -35887 -46894 -51626 -25034 -20095 -12237 -27970 -35702 -48967 -40111
6279 -40111 3392 24559 30456 14768 1872 18984 26730 12103 -5336 -7008 -9754 -15768 -18143
6266 -18143 2485 11755 32345 36728 8852 -4675 9552 18994 24934 -3303 1192 -7864 381
6253 381 30377 32305 26128 2057 761 -19452 -25740 -24438 -25299 -31651 -23907 -40782 -77104 -82190
6239 -82190 -67220 -17281 14237 34987 35662 13402 27389 26193 765 -5245 13453 8246 2261
6226 2261 -2902 14610 11691 -20316 -21128 -5304 -18975 -52823 -59405 -31309 11983 40232 28211
6213 28211 17207 -9408 -17179 7935 13047 279 11418 22175 35331 15215 -20218 -39929
6201 -39929 -45526 -14171 15249 18014 17349 25119 32385 29225 44873 16591 -10334 -7740 -5757 -809
6187 -809 -2785 4148 12155 16487 -1041 -45975 -54128 -34690 -25100 -37059 -17321 15346 3436
6174 3436 2466 14839 26525 -8517 -39129 -45349 -65662 -69171 -49235 -27029 -9162 -3388 -12398
6161 -12398 -17525 -7611 -7334 -22518 -62915 -49090 -12388 -975 -29189 -15443 -7261 5753 -1253
6148 -1253 -10402 7021 13624 4336 3427 -6435 -18749 -35041 -30396 -5972 10093 18116 9940 13827
6134 13827 -1862 18331 13549 -9105 10212 13760 8401 21497 44812 28049 -22977 -15922 7717
6121 7717 8665 3603 -5615 2740 14204 -4166 -18149 -8995 7370 13797 -1005 12336 16839 18392
6107 18392 12217 -18288 -58823 -49675 -45115 -30464 -8663 18346 20414 5727 -24688 -25379 -28797
6094 -28797 -21082 -17498 5802 11440 23354 31347 58166 40407 10950 13188 -1366 -3028 833
6081 833 -16853 -33816 -36073 -37331 -36936 -20352 -19953 -57398 -43034 -16963 -5610 -17643 -16812 1047
6067 1047 23418 28378 23915 1651 11356 10678 7556 8899 -6164 -33841 -32729 -27649 -25988 -22187
6053 -22187 -28541 8042 45375 49883 35268 10519 6428 15482 -16819 -41921 -18712 -11661 -5400
6040 -5400 808 2578 13189 3767 -660 -10612 -17669 -39800 -38905 -23085 -24709 -4648 -9603 -22449
6026 -22449 -2797 -786 9425 13203 20078 18338 40310 53488 44281 8334 -16831 -937 4474
6013 4474 -2335 8671 25571 16644 10815 25795 33203 4980 -18354 -17733 -3324 7517 14199
6000 14199 6211 31543 59436 53093 5990 -14651 -50340 -43739 -28679 -45795 -47997 -39425 -1666
5987 -1666 184 3425 24752 50610 26349 6433 4761 18017 23612 16085 8572 -29705 -45283
5974 -45283 -40487 -52999 -30678 9875 5512 -4652 -13511 -4286 -7576 -2050 18028 22328 8173
5961 8173 11593 22625 39066 42435 44723 25966 8192 14240 15786 -10915 -20170 -32524 -15344
5948 -15344 1688 -5888 7419 16609 4393 -9383 7139 7446 13221 24274 5055 -12683 -12010
5935 -12010 6047 19262 53118 90550 58897 31683 16282 3048 12688 4462 26719 29102
5923 29102 2705 19957 11752 -289 -11386 -6868 -4852 -11211 -26817 -36908 -37068 -40529 -48848
5910 -48848 -52959 -43808 -23428 1900 34518 30234 27288 31058 31498 20268 -9201 -11102 -13829 -1543
5896 -1543 513 177 -1845 -7411 10557 44982 10504 -14318 -10675 3326 3141 -6701 5466 808
5882 808 -4926 9287 8922 9378 2064 4122 29599 22150 4963 6586 41756 58385 35768 7997
5868 7997 20047 30571 23491 -2465 -3772 830 -4531 4109 19658 17481 6006 876 -5891 4931
5854 4931 -5575 -20890 12818 15782 11755 31944 3818 -4005 10133 11972 -6752 2292 2810
5841 2810 12999 8031 3607 721 -253 -7503 12228 22288 28266 7873 -32900 -28506 -6468 19659
5827 19659 18175 -6703 -7485 -456 13757 19452 6093 -24542 -36637 -34562 -42288 -51602 -43922 -21092
5813 -21092 -153 -17442 -15662 -5449 -16254 -1100 5071 1894 -16892 -10272 10315 18686 15366
5800 15366 19546 20224 33950 51712 30258 20792 14131 -7411 -26685 -22695 -16415 -4713 7235
5787 7235 -3872 1527 14776 26322 14561 23566 34230 19265 12982 38293 28406 -3519 -29249
5774 -29249 -21192 -29935 -22533 4453 3473 -7468 -20886 -6247 410 -18183 14729 20908 35784
5761 35784 42488 12471 5512 -4455 -12962 -3671 -7689 20782 42630 42851 27248 984 -33258
5748 -33258 -37974 -34374 -20867 -3592 8594 -4770 -17941 -12047 -21237 6012 44586 25437 28427
5735 28427 -6404 -40615 -53063 -22661 -7409 -14644 3894 22579 4495 -21473 -29966 -30743 -51271
5722 -51271 -61396 -44461 -31436 -7890 -10342 -17627 -12026 -19501 -42619 -43388 -24573 -7675 17534
5709 17534 20511 37885 29934 32409 30333 26766 16482 -78 -13982 752 5195 6696 13640
5696 13640 2167 -17998 -12550 -6064 -7689 -15223 1217 -14597 -10590 6383 -18600 -21954 -2097
5683 -2097 26302 2588 -43064 -53762 -34502 -19625 -12181 -5172 3982 35680 38634 37333 27953
5670 27953 -827 -16168 9768 3568 -11292 -1029 -1721 18146 -6702 7774 24112 15497 37620
5657 37620 19504 -9330 -8367 -4798 481 10886 10784 -12529 -27174 -27816 -29260 -10696 2634 -41238
5643 -41238 -55601 -45928 -29061 -24861 -32335 -11586 4848 -25044 -39243 -21459 -29445 -34840 -44014
5630 -44014 -31786 -28534 -17620 -10872 3701 -11224 1023 33555 21158 19776 27481 33059 34344
5617 34344 39768 35879 38071 22288 20262 -4013 -41499 -61277 -53513 -61031 -40332 3522 -4746
5604 -4746 -27114 -15132 -1430 -5740 -14479 -2508 3207 -16486 -44983 -51521 -34251 -15575 -10629
5591 -10629 -6966 3530 -15596 -44643 -45556 -49014 -57842 -59384 -47645 -14595 -3632 -7611 -19515
5578 -19515 6721 -2647 -32239 -20696 12221 11456 6430 -7105 -8548 -12920 9871 32130 25687
5565 25687 20503 21655 18359 -2894 -19469 8695 1359 -26753 -25026 -32533 -28316 16549 24933
5552 24933 21132 -996 -4592 7316 20285 41558 10733 -3546 17453 3119 -10162 8125
5540 8125 23291 46737 58603 44659 24394 33632 33208 31564 35212 40689 37888 33180 17882 24534
5526 24534 2124 -1425 13396 32222 21684 8460 -11654 -39209 -33898 -5905 -11262 -16175 41388
5513 41388 28634 7973 10453 -12714 -16003 7248 15786 -11005 -32065 -48017 -58423 -23722
5501 -23722 -15405 -23074 21242 33925 31238 21834 11305 39538 58302 65819 53666 35218 28914
5488 28914 13087 19432 7848 28444 45936 42151 12822 9603 27704 14143 17758 19951 -10191
5475 -10191 -32473 -25571 -41989 -52342 -59338 -63381 -27834 -2156 27955 49845 34377 33382 23922
5462 23922 12228 -7993 -10507 6194 6076 -2624 2929 1854 10376 -8825 -4520 12848 14838 -9536
5448 -9536 -22864 -5889 8367 23717 8932 -12979 -26722 -40991 -21017 -9150 -47332 -57812
5436 -57812 -45746 -40773 -49409 -53752 -37081 -28678 -19569 -11354 -22693 -48145 -37236 -13842 -12262
5423 -12262 -12845 -19670 -495 39025 22890 -3802 -13854 -17225 19032 25071 10515 -22389 -38465
5410 -38465 -25650 -3925 -438 -14693 12762 18015 -6476 -17299 -27608 -45525 -14407 -30665
5398 -30665 -31357 -14279 -20982 -18772 14456 6619 3666 -20627 -17259 -27928 -50706 -31124 -16775
5385 -16775 -12842 16844 20387 -4100 -17424 -13957 6982 -8390 -9830 3449 20285 -6094 -7402
5372 -7402 5643 -2619 -1917 16639 41298 22535 3580 -34841 -21144 -14893 -37489 -48825 -30817
5359 -30817 -61235 -72912 -64660 -64243 -37494 -26996 -33819 -53087 -50171 -17288 9510 32658 60715
5346 60715 80610 64776 55752 41060 27793 4793 7355 33462 18500 -3657 -5854 -14903 -7123
5333 -7123 5857 20353 17395 3125 -2323 -463 8150 2224 10042 10988 15878 43220 33543 20325
5319 20325 12888 -4939 4738 1519 -5147 702 -13084 -13021 8478 32761 20585 7785 15683 1045
5305 1045 -12982 800 18879 33465 1479 11961 24073 62232 59847 34648 24624 44611
5293 44611 41236 33130 23238 11366 15720 -29597 -49943 -46961 -31629 -28381 -42333 -51776 -33876
5280 -33876 -8897 -8067 8239 16304 6691 -5293 11839 11733 23938 10732 -5822 17103 34362
5267 34362 29241 25146 26294 10658 -6436 -1134 14130 33683 15860 -3759 6492 6307 -8609
5254 -8609 -11167 -13522 -12490 -11177 -16519 -26055 -7603 -2006 7454 -30878 -37063 -12679 -17780 -12766
5240 -12766 -13643 -18449 -30106 -9859 -233 9660 33589 19019 30488 51093 57967 57778 40431
5227 40431 18744 12789 394 -10387 -24062 -6725 15415 24730 13748 15782 4286 -40929
5215 -40929 -43234 -31953 -27320 8860 14684 -12140 -19750 -22517 -40056 -34103 -32664 -23643 -7246
5202 -7246 -10626 -5007 -2659 -2097 -8180 -32990 -21608 -9606 3550 14514 7348 -4308 -15029
5189 -15029 -34269 -34916 -31832 -36328 -45534 -25449 -31616 -21998 -1995 -20361 -6186 -14368 -24550
5176 -24550 -40780 -36282 -36512 -43561 -46855 -57720 -25845 1567 14916 5926 -21028 -9292 35220
5163 35220 54206 19800 -12722 -58554 -60215 -11826 -26867 -47295 -37034 9776 -7030 -55162
5151 -55162 -57414 -56140 -31607 -26841 -15929 16670 15620 13927 19169 16049 -4433 -40 -4682 -152
5137 -152 416 9861 17958 14131 -9540 -34468 -35007 -51583 -34772 12395 3597 15942 13226 14358
5123 14358 3197 -32033 -9752 9045 16313 20149 9510 227 -15237 -23111 -22342 -23848 -3410
5110 -3410 5835 -5677 16562 1384 -31964 -21499 -11465 10489 11645 3124 23376 64190 77440
5097 77440 49088 38304 39580 26926 33782 38564 26600 -4742 -17101 -35428 -34376 -14809 2907
5084 2907 -23086 -46049 -32406 -16183 -23682 -15339 -6462 -41855 -63078 -48280 -51888 -49246 -49135
5071 -49135 -40430 -50580 -46988 -48554 -57495 -81462 -60333 -27060 -13105 -23514 -13187 9541 35526
5058 35526 39459 34259 24580 18835 19012 11312 -16187 -28807 -26705 -8991 -1382 19826 14327 14466
5044 14466 -17525 -28729 -7434 14591 17764 -8342 -12779 -3111 16995 19514 17383 1014 15561
5031 15561 5969 -87 -5956 -2899 -14126 -8943 7430 15225 7236 -39197 -60265 -39111 -32057
5018 -32057 -7390 -2621 -14757 -14388 17701 17540 25819 29608 19870 22804 34493 23277 11556 23214
5004 23214 26737 -3847 -19615 -19863 3394 11200 21304 26902 34408 28652 30867 22923 516 -854
4990 -854 4734 3988 14727 -11285 -39451 -57660 -70086 -39529 -17283 -12176 6207 10713 -4883
4977 -4883 -6192 -13794 -8895 -16697 -29359 1426 11678 20103 6875 2047 12067 2232 -32101
4964 -32101 -41415 -50663 -59037 -72071 -64078 -39058 -4995 2855 1716 -8970 -23427 -30487 -12792
4951 -12792 7232 33432 54904 31920 4628 -8263 -12990 -6907 -3480 7927 7246 1172 -24010
4938 -24010 -13921 5617 -14651 -16763 -8517 14773 8581 7348 -18633 -13713 -7287 -10314 -16349
4925 -16349 -12214 -5811 7099 1188 -5039 22104 38963 47548 45807 34633 11584 1584 26890
4912 26890 51664 29601 19111 17581 10977 -22524 -628 -7200 -11541 -2437 29029 38964 51161
4899 51161 34685 34349 1420 -4920 -12867 -8773 450 10018 21779 14510 -10806 -14036 -3475 -4971
4885 -4971 19740 29360 37205 -10811 -16020 -26372 -52962 -49695 -6824 7951 9381 -7380 -14132
4872 -14132 22241 18321 9238 16314 28274 15803 -17940 -7030 5168 19934 30305 13845
4860 13845 6158 -20327 -35918 -33241 -44073 -40772 -32944 -15833 -20236 -29107 -13646 4180 9690
4847 9690 34628 23873 36308 23148 8173 -14182 -1105 -12060 -23577 -2073 24530 14575
4835 14575 -25322 843 14954 -11725 -10929 -17347 -27555 -21367 -23967 -26420 -35367 -12023 -2424
4822 -2424 1322 2706 6032 -8162 14405 45048 43302 50254 29398 4504 4686 19370 -2115
4809 -2115 -27428 3236 8893 12925 -223 -9281 -19152 -26228 -8742 -9503 -18386 -17950 664 -1710
4795 -1710 15967 -1891 -14560 18567 11728 -7984 907 6540 -8258 -22545 -24209 -4657 676
4782 676 -11085 -14885 -41737 -13954 -8842 -2268 -17084 -42181 -32813 -22795 -21248 -10693 25972
4769 25972 23949 27801 22468 20265 17971 -7766 -31955 -30044 -5337 -15572 -9127 16543 6678
4756 6678 -25989 -35565 -28836 -7693 6067 21892 46241 28680 28492 57431 25529 -239 18628
4743 18628 25095 7191 -317 -15589 -51868 -59136 -54179 -48653 -29813 -17377 -13032 -19017 11119
4730 11119 13320 7463 -20356 -42252 -13484 -6980 31148 67135 65924 31411 36034 35455 18512
4717 18512 11516 -3398 -12279 -4458 -1238 -1881 7799 -4416 -30494 284 28729 19096 27550 3875
4703 3875 3473 -7964 -7352 -10894 -713 33343 25034 -10780 -9923 10140 26609 5513 -2159 4906
4689 4906 -19051 -30736 -14179 -4001 3849 -5708 -8596 -11888 -19149 -35008 -15363 13754 19930
4676 19930 24548 36062 12877 9483 11364 21335 16498 4823 2621 -6196 -868 -27277 -30241 -13032
4662 -13032 -18837 -8925 -1646 -29819 -51743 -52853 -50727 -27773 -25569 1102 27531 6834 -14293
4649 -14293 -4276 -25719 -52706 -30083 -36546 -18150 2876 -6114 -18325 -28174 -46396 -67933
4637 -67933 -66347 -32266 10113 34347 448 -28198 -29543 2230 25501 51026 48675 36569
4625 36569 -6108 -28651 -35236 -45334 -30226 -26721 -32816 -47017 -20945 -3722 -8171 -18017 -45306
4612 -45306 -19578 -6616 2124 -604 -11071 -9360 -6738 17056 14103 13090 4638 -19602 18614
4599 18614 50396 35394 -5391 -465 682 -29451 -32159 -30907 -47483 -36600 -19295 -24178 -42039
4586 -42039 -16804 18717 12865 -4708 -9552 -3102 5222 -5060 15945 22369 13491 11974 -9865
4573 -9865 -16715 -10446 27821 39314 25001 5599 11388 10874 -22616 -42867 -39024 -39215 -47672 -38756
4559 -38756 -1901 9410 189 -9689 -11082 -155 7554 -13167 -37284 -40636 -42392 -38233 -31338
4546 -31338 -39465 -74506 -70439 -46268 -12903 2300 -2811 7845 8204 -34977 -32672 -18601 3311
4533 3311 21699 28070 1042 -33748 -42513 -50907 -35018 -41188 -41296 -43053 -25329 -9662 -33109
4520 -33109 -44166 -3327 9433 -9123 -31222 -6159 16105 6839 31404 35095 16644 21684
4508 21684 4397 -1148 5531 805 -8099 -720 13231 36149 7748 -13437 6824 12227 -708
4495 -708 26997 36723 22212 8462 -12463 -18329 -9097 29545 64462 46661 37431 29365 -7255
4482 -7255 -38277 -10229 -9596 -20997 -56535 -28444 10510 6698 -16869 -23117 -13086 26008 40377
4469 40377 9796 -28262 -11218 -6822 -714 21838 28436 22568 -14731 -17367 5349 -14991 -34881
4456 -34881 -23695 -14712 -6514 9212 13192 17055 27824 20475 22178 8725 4655 18690 38442
4443 38442 42041 21259 6245 5795 -3500 -25361 -30857 -37486 -60607 -55575 -28242 -33572 -47537
4430 -47537 -22542 3545 -2823 22084 50092 33100 -20750 -40718 -7315 28803 37177 34270
4418 34270 23731 7387 -26403 -49507 -47102 -23401 -8344 4068 -11488 -25073 -23257 -20466
4406 -20466 -15336 -40129 -48116 -13950 9711 27178 8370 -1181 5516 -13972 -49254 -22624 7661
4393 7661 -3490 -22207 2660 36888 38181 15674 -18305 -11493 -11836 -28609 6610 1111 -44454
4380 -44454 -70166 -65622 -56465 -37562 -22186 -19052 -16896 -34534 -31904 8852 16032 -12865 -20246
4367 -20246 -34996 -25006 -15372 -19411 -42652 -41280 -24986 -22088 -31591 -32672 1162 4376 21631
4354 21631 52893 52585 31452 1018 -6905 10113 43719 59471 44847 38556 36226 35775 25576
4341 25576 8672 3404 -6234 -8104 -12571 3229 -5611 -12508 -20488 -25394 221 9487 16226 10130
4327 10130 6029 7429 35886 41850 46360 30707 23333 3829 14242 18958 8313 8232 9610 -17513
4313 -17513 -4732 25297 14270 3187 34459 42867 133 -48142 -52191 -45933 -33414 -17751
4301 -17751 -17825 -13049 -4955 11006 11379 -1583 -3899 -26689 -25664 -28529 -36564 -28380 -28477 -11152 4252
4286 4252 15422 1713 -14995 -47451 -59902 -5959 38124 26551 39982 36174 5268 399
4274 399 20506 15143 19598 17553 -6996 -36006 -57008 -61859 -25469 -22109 -34148 -41332 -7809
4261 -7809 -9585 -20642 -20636 834 19598 6552 16362 43417 16664 984 8287 13991 40596 24147
4247 24147 28552 38901 39070 23132 4920 13650 15602 38244 21049 2180 3073 15837 16584 -2258
4233 -2258 779 19481 38660 38072 33611 -1452 330 12859 7203 17321 -19719 -28999 -22610 6505
4219 6505 6055 1920 -10313 -5970 -7515 -21532 -30857 -25568 -2228 -1734 -25971 -46275 -26048 -26701
4205 -26701 -31775 2865 -4099 -12766 826 6153 -17700 -20146 -14169 -16524 -19553 -6913 3749
4192 3749 -5935 -22531 -28350 -32672 -27741 -25799 -38088 -16437 -23383 -41166 -52071 -22629 -14622
4179 -14622 -20499 -16848 -33866 -27639 -36765 -31722 -5782 15049 33207 46688 50795 46731 40449
4166 40449 36955 24593 9712 -5733 -11439 773 -930 -17452 -9720 941 11663 25178 26163
4153 26163 6629 -9999 18088 57733 48069 13157 -4217 8723 20480 32411 19327 19618
4141 19618 33419 37836 38902 52457 57924 34159 7477 -3661 4691 -6897 -25291 -40679 -34324
4128 -34324 -11456 2691 22541 22533 46479 16748 19728 14031 12199 6318 -15350 -35575 -25525
4115 -25525 -3954 21036 27797 30230 16048 3386 23297 37078 -1859 4188 9410 12465 2851
4102 2851 -6816 1440 -14116 -12588 -21368 -21308 -482 9373 15418 1910 8129 -817 -21961 -14851
4088 -14851 -23675 -22208 -19259 -14144 -8776 9747 11561 14293 14204 4432 6378 27907 41809 36430
4074 36430 37840 55254 46864 60541 37462 25985 46372 13312 -2330 -11635 -29205 -23144 2819
4061 2819 -6377 23208 36320 6523 -6766 19109 17780 -17958 -32989 -20367 7226 -5189
4049 -5189 -3057 5306 9284 21981 12959 2894 -9674 -24297 -26993 -24677 -11790 13716 8063
4036 8063 -3522 -14318 -34023 -17441 -28787 -41091 -39894 -23962 -9362 -10060 -24587 1295 162
4023 162 -3370 -8573 -12402 -12748 -26173 -16734 -2541 21594 -7755 -45812 -47023 -21796 3368 4527
4009 4527 -5461 1801 2604 197 -5696 -18651 -22103 1253 50187 62324 53417 38545 29121 4532
3995 4532 -206 451 -22565 -11757 -27513 -10549 20362 30121 37223 40747 47476 18079 24425 28337
3981 28337 25836 29630 36912 46472 41416 22188 35321 37905 28189 7681 21429 9657 -23252
3968 -23252 -51397 -28867 -12915 -9134 -24667 -2477 3395 -487 -19512 -25360 -13397 7259 -2767
3955 -2767 -20430 4726 -19450 -26648 -2150 20551 -3069 -41987 -47056 -26858 -8628 -7484 -27927
3942 -27927 -60689 -59297 -31923 -23292 -30794 -34945 -27244 -58075 -39827 -38936 -43701 -34989 -45499 -40601
3928 -40601 -28237 -20323 -20279 16862 25633 12873 -10802 -24355 -18065 -6819 -1921 1408 -128 22521
3914 22521 25005 10370 30026 27844 20018 -17495 -20590 661 21451 5862 -9991 -27208 -43637
3901 -43637 -36375 -12086 -3451 -25566 -19219 -39050 -34516 -40339 -39879 -30915 -15669 12248 12574 -9308
3887 -9308 -10594 -11009 -11232 -36182 -51922 -25441 -8604 1045 -3065 -19400 -34149 -52641 -53351 -19479
3873 -19479 19755 28817 32505 11761 6127 14924 40873 16582 -14127 13799 17346 -945 -13916
3860 -13916 -15536 -8647 6158 26584 32734 32030 43161 50047 59943 71901 84966 71701 74826
3847 74826 71714 35011 5873 20383 6160 12814 23030 10043 2278 2749 -4562 20496 29768
3834 29768 32541 49911 41103 42320 31540 41441 38163 8872 7846 32872 43805 54455 44553
3821 44553 12748 15965 11802 20955 44557 42180 52398 50331 34491 5171 -14997 -24132 -20274
3808 -20274 3601 -8205 -6924 -8382 -12136 23564 24395 23448 -3171 -426 -264 -10208 -19312 -14841
3794 -14841 -9103 -11682 9583 14670 13151 47934 62228 33832 17925 2925 6826 18172 10326
3781 10326 20862 42255 40156 -6442 -34430 -43993 -43507 -52436 -41157 -24536 -20475 -18417 -6751
3768 -6751 5018 15056 -1540 -23369 -45460 -42716 -23207 -5979 -7646 10363 23392 -10650
3756 -10650 -29650 -25759 -35997 -47026 -20879 11509 27908 39970 46641 26129 11298 19604
3744 19604 14894 31192 28971 3799 -2786 3727 35786 59153 45360 25733 25804 17323 24214 7868
3730 7868 501 5418 -738 4109 8943 -665 7661 4864 3167 19249 40855 21323 4567 -22922
3716 -22922 -11196 11506 18989 5513 10212 27128 41380 34817 27058 11573 -3264 -2806 8720
3703 8720 6234 9688 8916 -2488 -13594 -4966 -5572 -8742 5857 13279 8097 -17967 -115 5621
3689 5621 -20687 -14782 -8722 -22318 -12992 -2180 38687 36128 20565 12577 564 -17739 -26814
3676 -26814 -24821 -23463 -11371 -20992 -32356 -17771 -3738 5569 -2578 -17812 -16064 -15963 2464
3663 2464 37662 46353 49987 29880 27783 17509 -12711 -9841 45085 80502 77915 66122 20906
3650 20906 8746 13792 -11812 -15603 888 -9591 -10738 -1275 1228 14137 24023 14529 6978
3637 6978 8203 -11992 -3431 1557 -14427 -17458 -9592 13730 36014 31944 30390 30914 12469 13258
3623 13258 31616 35047 12837 14271 1305 23436 19830 6770 10977 -8316 -18725 -7900 1314
3610 1314 -33444 -43969 -17790 18716 38625 41054 30974 24702 8969 5302 -41505 -61728 -33648
3597 -33648 -32110 -18944 -12178 -25028 -21654 5194 5853 -27017 -10852 -1794 5670 -27365 -2153
3584 -2153 37933 39692 28059 22477 -2008 -25898 -24617 -15246 -10339 -27191 -37323 -10357 -168
3571 -168 14432 22962 32788 11870 15925 -6352 -32938 -26592 -6999 -18496 -15253 6322 27236
3558 27236 45227 55607 72404 32578 -10495 -43811 -29963 -14184 11396 32084 18576 13166
3546 13166 3162 -15573 -16562 -17080 -13815 -3084 -799 -28527 -32718 -22165 -37601 -31784 -15785
3533 -15785 4640 -18827 -9221 -10320 1127 12305 16309 -5081 5187 7785 -4772 -26334 -14239
3520 -14239 -7554 16465 29063 24635 6607 -5095 5532 28917 24339 14292 5254 -22639 -8914
3507 -8914 -1001 23209 52414 26550 -2092 -20099 -30677 -28821 -17277 -27721 -15295 -10746 -4155
3494 -4155 13304 14121 23999 30577 24568 -20515 -45123 -19763 -7435 -9383 -19843 -8032 11489
3481 11489 7176 11087 19440 -637 5835 -2464 -2507 -14818 -40382 7644 27204 16367 16184 17316
3467 17316 9952 19655 47124 60345 29955 -17206 -17494 -8222 -11043 -16791 -25206 -13263 -2500
3454 -2500 23250 25498 31054 40821 13229 -10231 -35591 -50583 -27860 -30511 -49266 -40891 -27602
3441 -27602 -8152 5986 -3525 -27740 -37646 -24981 -20661 -21864 6619 31396 6549 -3737 13854
3428 13854 7406 5569 40714 38465 20859 -4496 -25578 -5972 8218 -1083 -10545 -27715 -45286
3415 -45286 -40985 -31925 -26599 -5730 6235 22795 10967 -34005 -46718 -34264 -22030 -12170 -11313
3402 -11313 -47229 -57442 -62954 -67817 -28633 -5336 -1692 -15923 1481 17486 9000 -13809 -20805
3389 -20805 -17426 9947 6415 4296 -15820 5819 33935 43476 49778 51541 40915 17625 -3624
3376 -3624 -14778 -2317 451 31446 47535 50557 39835 1908 -33775 -40345 -5320 9442 962
3363 962 -27100 -22392 7847 -8091 -22843 -25144 -16513 -32648 -18392 -4532 -12471 -2228 -18556
3350 -18556 -16565 368 -4048 -9557 3194 23435 17159 20285 14849 2528 -13229 -27886 -17960
3337 -17960 -518 6682 2434 16474 -5137 -25806 -15124 18559 -368 -24825 -28534 -33564 -30641
3324 -30641 -39726 -18185 -16937 -40781 -57938 -30979 -5423 -2256 10264 1491 4925 38788 30264
3311 30264 13467 5231 -11872 -21129 -23540 -15936 -23875 -27305 159 -12038 -519 11267 12256
3298 12256 15705 21805 867 9008 31428 3148 -23094 -8148 9558 18650 15184 3634 -8886
3285 -8886 444 3854 24071 25196 33361 37128 24978 43661 21726 -5326 -7995 -9702 -10376 -5255
3271 -5255 12406 55258 75873 34275 30755 7115 -12369 -17935 -36506 -37675 -16985 -10266 -27225
3258 -27225 -26337 -18059 -1517 12318 -10401 2127 14158 6481 6364 6571 -3338 -7097 -11598 -17340
3244 -17340 -23821 -22208 -10521 -5371 4667 25974 -9788 -23607 -10916 -11141 -10345 -6350 -25026
3231 -25026 -21858 2359 43199 46796 18908 387 -23770 -43471 -32751 -41515 -30833 -12818
3219 -12818 -9358 -22426 -9552 -8659 -24995 -25660 5190 -13292 -7467 -2715 5787 14112 24263 -7370
3205 -7370 -14404 3407 -8239 -23011 -10279 6323 -2101 6633 5433 2422 14245 -9502 -42744
3192 -42744 -33925 -7894 -36997 -37694 -13216 -12157 -21609 -40396 -40833 -36169 -40906 -27910 -11133 9207
3178 9207 17149 20542 11229 20436 11968 -2956 -7226 15308 17021 26737 554 -30047 -42777 -16552
3164 -16552 21829 48497 43827 35807 1188 -24194 -27533 -16093 -6323 -18859 -19760 -18852 -27023 -26434
3150 -26434 877 11676 3734 15744 12790 -6125 -23372 18794 18265 9764 5931 -11130 -12896
3137 -12896 3040 8011 -27415 -44254 -15408 -10429 14793 10707 7105 44925 42218 41855 28006
3124 28006 34824 52603 44345 49954 37698 24904 30039 -3506 -8888 5644 9713 20238 10283
3111 10283 1024 16065 26785 23798 8094 -6966 -26227 -12755 4170 28673 35203 25575 26096
3098 26096 22755 1506 -32449 -76120 -67513 -40904 -8554 2279 9591 15710 6181 -18778 -11845
3085 -11845 13828 -3617 -18781 -17589 -18336 -33374 -12461 7062 -10791 -22283 -10382 425
3073 425 -8038 -10816 -21826 -4642 -13517 -20307 -22240 -16525 2695 -793 -3869 -5239 3914 -9424
3059 -9424 -44572 -20732 -27904 -27912 -22113 -44400 -41828 -51515 -44264 -23495 -24548 -40441 -38154 -1755
3045 -1755 -5844 4533 9454 -31725 -30041 -32954 -49925 -21311 -6040 -11341 -9100 7444 -407
3032 -407 -6983 7448 18501 24510 24399 36390 3132 5570 -12818 -28412 -47686 -52875 -43672 -49018
3018 -49018 -48608 -97 21386 -1200 -20178 -12255 -23918 -5224 115 -4938 -21500 -39187 -27933
3005 -27933 7809 22062 45754 46956 32257 15943 12617 14585 7331 -6643 1267 7459 25518
2992 25518 27286 37743 33287 29264 3183 -12944 -14894 -8616 5583 11296 10489 3820 22038 20519
2978 20519 3671 -7130 662 -2376 -3289 -14594 -6599 963 13411 5633 898 6367 37038 25993
2964 25993 26583 14330 27259 38987 30446 -1929 -27587 -31421 -31281 4873 27473 20242 14153
2951 14153 2336 -3285 -13287 -2436 7084 -819 -4201 -17757 -23343 -6911 -18053 -10509 -17149
2938 -17149 -11606 -26180 -34499 -46420 -46703 -57315 -50984 -51413 -24119 -16186 -9835 13277 5868 -36174
2924 -36174 -49988 -38404 -24305 -38650 -38260 -30689 -648 4262 -3554 4930 -12869 -27412 -20510
2911 -20510 148 -1347 4593 6404 16160 3105 32829 22689 -4979 -26271 -14543 -18136 -20199
2898 -20199 -20713 -21377 -26818 -20619 2586 -13936 -26542 -41756 -47540 -21063 -10693 -37829 -48501
2885 -48501 -27698 -15852 -12444 -45455 -34882 -38743 -31961 -29544 -26292 -7538 5643 5098 20156
2872 20156 33660 26518 29478 24132 22145 24454 18357 -9729 -24765 -25502 -17330 -27937 -14305 13391
2858 13391 12152 9569 -16459 -23932 -26409 -15774 10026 39783 23312 20192 38847 46592 55332
2845 55332 45293 3691 -635 -447 -4688 -6591 -9728 -17663 -13260 -2880 6890 28829 40276 48141
2831 48141 26345 38529 75799 77654 40216 29096 23380 -12497 -22471 -4942 1069 -28091 -13360
2818 -13360 10262 7213 -18258 14113 22119 24748 20415 27893 38310 18312 23090 43874 32498
2805 32498 51350 75410 81210 71863 55449 41202 5671 -9126 19476 21832 -5157 -43243
2793 -43243 -63882 -49266 -30746 111 6866 -9713 -9508 4678 13798 -2260 -30831 -25421 -37008
2780 -37008 -27619 -30184 -38941 -33811 -19810 8828 15961 38879 47367 42997 31054 2617 13734
2767 13734 46987 48869 44184 19912 42159 33817 15109 46348 33734 28388 14527 7222 4989
2754 4989 -7555 -36849 -40567 -38722 -33872 -13585 15746 41409 40875 43741 22110 2128 -14728
2741 -14728 -8551 -33506 -48926 -25996 7956 33467 56905 73638 77196 76413 47893 21909 25056
2728 25056 37819 -1355 -9593 -14413 -17124 -26249 -10834 -40226 -58390 -37274 -13458 -13440 6216
2715 6216 -9316 1336 -14297 -36409 -42577 2114 25361 37575 14655 8534 -4997 -17231
2703 -17231 4692 -10884 -22888 -23770 -32719 -13714 -10351 -4523 4765 5287 -10217 -16703 -26745 -36056
2689 -36056 -8669 17070 42410 72349 71632 44309 8246 -8508 -15536 -25260 -18266 -1220 13890
2676 13890 34730 21512 -4618 -8674 -25375 -17448 -10355 -24912 -20627 -18965 -37489 -30642 -22207
2663 -22207 4148 -9475 -20166 -23731 -16969 -20448 -22723 -9438 -7221 4766 9123 36032 24344
2650 24344 14424 31445 36272 13369 -12004 -26227 -41911 -36537 -42002 -41718 -39137 -13978 -14737 -1194
2636 -1194 -19048 -32200 -50557 -52439 -35109 -30926 -22547 3328 -4181 21598 9230 -29103 -19471
2623 -19471 -21110 -31812 -12803 -6813 -2992 6025 18786 24266 -7316 -16649 -18279 -8324 -6138 2218
2609 2218 8302 35660 26605 8464 -5693 -15134 346 -1295 8344 1897 -4711 -15479 -28983
2596 -28983 -16817 -9205 -15333 -14797 10867 20492 39031 55381 34428 11791 7156 20563 13290
2583 13290 -42343 -94053 -63067 -35334 -37727 -14549 -24144 -14286 6831 -145 -10987 -12043 -8505
2570 -8505 -21681 -8935 27432 28669 11791 7310 11955 -230 -32906 -26807 7301 -2458 -35510
2557 -35510 -32942 -31072 -20818 -24341 -26202 -19280 -1150 -6113 -12294 10899 17108 -22977 -39128
2544 -39128 -32049 -1433 13501 11751 -19466 -33096 -37904 -55163 -52016 -42472 -44256 -26828 -25175
2531 -25175 -5223 26480 39295 30746 11877 8133 13770 11121 19808 30124 38296 37174 27413
2518 27413 17394 20901 27291 16637 25036 14078 234 8499 22711 41824 12647 -24149 -55780
2505 -55780 -30627 -16031 -24170 -2183 3186 -23379 -8632 3429 35184 54898 34710 36748
2493 36748 41435 5334 4471 23646 40893 44532 35880 -886 3454 -7888 -15590 -31677 -53398
2480 -53398 -50977 -26362 5935 7682 8053 20986 20690 19746 -6262 -25209 -41529 -42845 -20197 -10364
2466 -10364 -6475 3037 7126 11769 20211 29891 27575 36106 45681 43813 19631 9360 3935 1615
2452 1615 12386 12714 15319 19727 29279 15878 8229 9448 24367 16262 20577 8269 -3425 2101
2438 2101 43144 74564 86237 46724 23053 -12827 -54037 -65397 -64128 -65523 -61384 -66600 -73259
2425 -73259 -57844 -40465 -13485 -12969 12178 10176 7155 26332 14682 -6386 -6241 4232 30707
2412 30707 61023 48885 45166 21048 11634 42671 53735 40674 25847 -1305 -7405 7697
2400 7697 4532 -13866 14824 28127 27714 31922 19635 -8527 18070 29668 28547 28464 19228 15806
2386 15806 5345 26031 22130 12697 16553 2896 -25463 -164 9078 -5204 6664 23177 2046
2373 2046 -10651 14257 7922 -464 12617 33406 15070 11067 14419 -10141 -7222 -19679 -35039
2360 -35039 -17961 -33770 -41935 -9293 -3324 -11881 16878 23031 17518 4342 18098 -13121 -23473
2347 -23473 14242 18573 22481 -1580 18077 14575 15720 28874 13823 -269 -13954 -15327 18909
2334 18909 19021 19376 56634 52497 41736 23573 285 -2796 -10676 -3021 11057 1912 4217 16560
2320 16560 4142 -29073 -27191 -42011 -56472 -87626 -86534 -28603 -4243 10039 1379 -26471
2308 -26471 -37985 -16954 -5133 -5826 -2346 -19532 -8319 -1917 -14692 -26114 -26475 -9942 -36454
2295 -36454 -55414 -62159 -38730 3971 -2758 6757 15512 26798 -802 -23975 19855 28656 7009
2282 7009 -7098 -26381 -23562 -4651 18928 57030 40530 11503 29251 14662 3980 10523
2270 10523 17037 25688 11543 16040 34405 26931 -31911 -34750 -1651 23779 18273 7977 15868
2257 15868 21572 19929 -18577 -30518 -26430 -6400 13265 10301 7097 21689 23511 20539 13646
2244 13646 65 9225 20254 25720 48100 47097 26950 7700 -1594 16691 24271 32416 51321
2231 51321 44785 58566 82849 68612 55272 25407 10286 5858 -2946 28117 38616 21588
2219 21588 29990 28590 21832 13923 11980 15217 31153 23878 10453 15894 24118 -1566 -3165 -16663
2205 -16663 -19724 -20045 -17190 -3640 -19607 -33064 16964 37868 6536 -14986 18204 35586 48837
2192 48837 43421 36367 34872 13174 11945 1548 -2411 -17794 -17864 -14339 133 5798 25799 43169
2178 43169 48933 28347 21676 15746 12500 13841 20812 41609 36323 19531 -657 -5517 -7411 6908
2164 6908 -6125 -23528 -1710 38283 29029 15476 16865 8356 18679 -3096 -6488 11917 19855
2151 19855 12637 10663 18771 45498 45497 25354 12808 15765 22214 9623 -1860 7939 21388 -1471
2137 -1471 -7641 4546 27615 19812 5940 1529 -3548 4395 -22356 -4540 -11871 -2458 24667
2124 24667 30181 9769 -28936 -46251 -38284 -2193 25892 34528 34769 18567 18994 13443 9263 -4456
2110 -4456 -11453 12909 33570 29117 -13835 -76468 -51851 -28181 878 408 -7643 13921 15870
2097 15870 -32167 -15921 -1430 -2372 26197 26303 45460 39218 22581 5686 8067 -4971 -10734
2084 -10734 15123 25524 35684 28068 8846 19681 23862 43379 73203 61368 35339 30992
2072 30992 26105 46447 50007 49955 54635 57935 31273 15003 -3900 -2114 9170 11115 17976 -1824
2058 -1824 -12695 -34666 -19411 7194 -26838 -50005 -45402 -44672 -35304 -437 4271 -896 8617
2045 8617 6857 -14096 -13966 -13434 -17831 857 14746 24641 42937 43842 38385 39480 56295 68849
2031 68849 64340 47534 30214 35252 25271 37185 48260 30282 29617 12918 -13549 -29330 -12283
2018 -12283 5916 18988 18307 40859 29395 -7160 -8834 21136 23758 6983 2684 -24511 -39051
2005 -39051 -21902 -8146 -10739 -8344 -7535 -29635 -15159 13091 10940 4487 7166 -2498 -25623
1992 -25623 -14956 -13550 9788 27339 12787 3545 -21218 -10123 -803 17467 32521 3043
1980 3043 16461 14036 -8359 -20318 2123 1838 -14802 -3962 -9032 -28708 -26139 -17476 -20953
1967 -20953 3651 25461 12854 13669 -515 -21471 -21835 -5086 3253 9442 -11305 -7140 -7660 6250
1953 6250 17570 6826 -27546 -18130 4379 3247 14469 4123 -199 8490 -10702 -9718 -692
1940 -692 -3561 -34560 -33911 -11204 -9051 9152 23593 -20008 -18936 3544 3944 5325 25679 7969
1926 7969 -8865 9250 21318 26605 27411 29528 6721 -525 8644 25945 62293 64536 62135 45971
1912 45971 45620 8137 1901 480 16249 39733 55797 47144 11312 -1632 -16561 -6215 7217
$$ [...]
##END NTUPLES=NMR SPECTRUM
##END=
