##TITLE=Analysis number 318832
Compound Code sb 01001
Project Code adrs
Chemist Name stores
##JCAMPDX= 6.0         $$ Bruker NMR JCAMP-DX V2.0
##DATA TYPE= NMR SPECTRUM
##DATA CLASS= NTUPLES
##ORIGIN= Bruker BioSpin GmbH
##OWNER= nmr
$$ XWIN-NMR		Version 3.5
$$ Wed Apr 19 13:49:25 2006 GMT Daylight Time (UT+1h)  MAYBRIDGE\nmr@NMR_250MHZ
##.OBSERVE FREQUENCY= 250.131544655141
##.OBSERVE NUCLEUS= ^1H
##.ACQUISITION MODE= SIMULTANEOUS (DQD)
##.ACQUISITION SCHEME= undefined
##.AVERAGES= 16
##.DIGITISER RES= 18
##SPECTROMETER/DATA SYSTEM= dpx250
##.PULSE SEQUENCE= zg30
##.SOLVENT NAME= DMSO
##.SHIFT REFERENCE= (INTERNAL, DMSO, 0, 16.522)
##AUDIT TRAIL= $$ (NUMBER, WHEN, WHO, WHERE, WHAT)
$$ ##TITLE= Audit trail, XWIN-NMR		Version 3.5
$$ ##JCAMPDX= 5.01
$$ ##ORIGIN= Bruker BioSpin GmbH
$$ ##OWNER= nmr
$$ C:\u/data/dgb/nmr/ADRS/2780/pdata/1/auditp.txt
$$ ##AUDIT TRAIL=  $$ (NUMBER, WHEN, WHO, WHERE, WHAT)
(   1,<2006-04-19 13:48:55.92 +100>,<MAYBRIDGE\nmr>,<NMR_250MHZ>,
      <created by zg, POWCHK disabled, PULCHK disabled
       configuration hash MD5:
       84 BC 41 DB A1 6E 1D 46 DA 25 12 A5 C1 ED C5 3A
       data hash MD5: 64K
       86 4C AC C2 DC 70 67 95 93 05 BD F6 58 A4 76 A9>)
(   2,<2006-04-19 13:49:07.76 +100>,<MAYBRIDGE\nmr>,<NMR_250MHZ>,
      <Start of raw data processing
       ef LB = 0.3 FT_mod = 6 PKNL = 1 SI = 32K 
       data hash MD5: 32K
       0E 18 E1 F5 6F 2F E7 A1 28 D2 57 75 A0 5D E8 6E>)
(   3,<2006-04-19 13:49:09.42 +100>,<MAYBRIDGE\nmr>,<NMR_250MHZ>,
      <apk 
       data hash MD5: 32K
       33 8B 7E 0D CB 65 7A 4D 26 DA 85 F2 A6 98 DD 99>)
(   4,<2006-04-19 13:49:10.30 +100>,<MAYBRIDGE\nmr>,<NMR_250MHZ>,
      <abs ABSG = 5 
       data hash MD5: 32K
       2D A8 F0 78 00 B4 D1 FF D7 B2 FD B8 38 E8 3E 31>)
$$ ##END=
$$ 
$$ hash MD5
$$ DC 34 5E 19 15 65 2E 94 80 27 51 2F 55 8E 9D 15
##$RELAX= 
##$RELAX= 
##$RELAX= 
##$RELAX= 
##$RELAX= 
##$RELAX= 
##$RELAX= 
$$ Bruker specific parameters
$$ --------------------------
##$DU= <C:\u>
##$EXPNO= 2780
##$NAME= <ADRS>
##$PROCNO= 1
##$TYPE= <nmr>
##$USER= <dgb>
##$AMP= (0..31)
100 100 100 100 100 100 100 100 100 100 100 100 100 100 100 100 100 100 
100 100 100 100 100 100 100 100 100 100 100 100 100 100 
##$AQSEQ= 0
##$AQ_mod= 3
##$AUNM= <au_zg>
##$AUTOPOS= <33 >
##$BF1= 250.13
##$BF2= 250.13
##$BF3= 250.13
##$BF4= 250.13
##$BF5= 500.13
##$BF6= 500.13
##$BF7= 500.13
##$BF8= 500.13
##$BYTORDA= 1
##$CFDGTYP= 0
##$CFRGTYP= 5
##$CHEMSTR= <none>
##$CNST= (0..31)
1 1 145 1 1 1 1 1 1 1 1 1 1 1 1 1 1 1 1 1 1 1 1 1 1 1 1 1 1 1 1 1 
##$CPDPRG= <>
##$CPDPRG1= <>
##$CPDPRG2= <>
##$CPDPRG3= <>
##$CPDPRG4= <mlev>
##$CPDPRG5= <mlev>
##$CPDPRG6= <mlev>
##$CPDPRG7= <mlev>
##$CPDPRG8= <mlev>
##$CPDPRGB= <>
##$CPDPRGT= <>
##$D= (0..31)
0 1 0 0 0 0 0 0 0 0.06 0 0 0 0 0 0 0.0002 0 0 0 0 0 0 0 0 0 0 0 0 0 0 
0 
##$DATE= 1145450934
##$DBL= (0..7)
120 120 120 120 120 120 120 120 
##$DBP= (0..7)
150 150 150 150 150 150 150 150 
##$DBP07= 0
##$DBPNAM0= <>
##$DBPNAM1= <>
##$DBPNAM2= <>
##$DBPNAM3= <>
$$ [...]
##$SUBNAM7= <"">
##$SUBNAM8= <"">
##$SUBNAM9= <"">
##$SW= 20.6930455092707
##$SWIBOX= (0..15)
0 0 3 0 0 0 0 0 0 0 0 0 0 0 0 0 
##$SW_h= 5175.983436853
##$TD= 65536
##$TD0= 1
##$TE= 295.16
##$TE2= 300
##$TE3= 300
##$TEG= 300
##$TL= (0..7)
0 120 120 120 120 120 120 120 
##$TP= (0..7)
150 150 150 150 150 150 150 150 
##$TP07= 0
##$TPNAME0= <>
##$TPNAME1= <>
##$TPNAME2= <>
##$TPNAME3= <>
##$TPNAME4= <>
##$TPNAME5= <>
##$TPNAME6= <>
##$TPNAME7= <>
##$TPOAL= (0..7)
0.5 0.5 0.5 0.5 0.5 0.5 0.5 0.5 
##$TPOFFS= (0..7)
0 0 0 0 0 0 0 0 
##$TUNHIN= 0
##$TUNHOUT= 0
##$TUNXOUT= 0
##$USERA1= <user>
##$USERA2= <user>
##$USERA3= <user>
##$USERA4= <user>
##$USERA5= <user>
##$V9= 5
##$VALIST= <valist>
##$VCLIST= <CCCCCCCCCCCCCCC>
##$VD= 0
##$VDLIST= <DDDDDDDDDDDDDDD>
##$VPLIST= <PPPPPPPPPPPPPPP>
##$VTLIST= <TTTTTTTTTTTTTTT>
##$WBST= 1024
##$WBSW= 4
##$XGAIN= (0..3)
0 0 0 0 
##$XL= 0
##$YL= 0
##$YMAX_a= 406368
##$YMIN_a= -549311
##$ZGOPTNS= <>
##$ZL1= 120
##$ZL2= 120
##$ZL3= 120
##$ZL4= 120
##$ABSF1= 16.522
##$ABSF2= -4.171173
##$ABSG= 5
##$ABSL= 3
##$ALPHA= 0
##$AQORDER= 0
##$ASSFAC= 0
##$ASSFACI= 0
##$ASSFACX= 0
##$ASSWID= 0
##$AUNMP= <proc_1d>
##$AZFE= 0.1
##$AZFW= 0.1
##$BCFW= 0
##$BC_mod= 0
##$BYTORDP= 0
##$COROFFS= 0
##$CY= 12.5
##$DATMOD= 1
##$DC= 0
##$DFILT= <>
##$DTYPP= 0
##$F1P= 14.0000005364418
##$F2P= -0.99999901652339
##$FCOR= 0.5
##$FTSIZE= 32768
##$FT_mod= 6
##$GAMMA= 0
##$GB= 0
##$INTBC= 1
##$INTSCL= 1
##$ISEN= 128
##$LB= 0.3
##$LEV0= 0
##$LPBIN= 0
##$MAXI= 10000
##$MC2= 0
##$MEAN= 0
##$ME_mod= 0
##$MI= 0
##$NCOEF= 0
##$NC_proc= -5
##$NLEV= 6
##$NOISF1= 0
##$NOISF2= 0
##$NSP= 0
##$NTH_PI= 0
##$NZP= 0
##$OFFSET= 16.522
##$PC= 1
##$PHC0= 158.1346
##$PHC1= 6.246996
##$PH_mod= 1
##$PKNL= yes
##$PPARMOD= 0
##$PSCAL= 4
##$PSIGN= 0
##$REVERSE= no
##$SF= 250.13
##$SI= 32768
##$SIGF1= 0
##$SIGF2= 0
##$SINO= 400
##$SIOLD= 32768
##$SREGLST= <1H.DMSO>
##$SSB= 0
##$STSI= 32768
##$STSR= 0
##$SW_p= 5175.98343685301
##$SYMM= 0
##$S_DEV= 0
##$TDeff= 65536
##$TDoff= 0
##$TI= <Analysis number 999999
Compound Code 99
Book Reference 9
Project Code 9>
##$TILT= no
##$TM1= 0
##$TM2= 0
##$TOPLEV= 0
##$USERP1= <user>
##$USERP2= <user>
##$USERP3= <user>
##$USERP4= <user>
##$USERP5= <user>
##$WDW= 1
##$XDIM= 32768
##$YMAX_p= 372409811
##$YMIN_p= -382000
$$ End of Bruker specific parameters
$$ ---------------------------------
##NTUPLES= NMR SPECTRUM
##VAR_NAME=  FREQUENCY,     SPECTRUM/REAL,   SPECTRUM/IMAG
##SYMBOL=    X,             R,               I
##VAR_TYPE=  INDEPENDENT,   DEPENDENT,       DEPENDENT
##VAR_FORM=  AFFN,          ASDF,            ASDF
##VAR_DIM=   32768,         32768,           32768
##UNITS=     HZ,            ARBITRARY UNITS, ARBITRARY UNITS
##FACTOR=    0.157963299565203, 1,           1
##FIRST=     4132.6476996994, 0,             0
##LAST=      -1043.33573715361, 0,           0
##MIN=       -1043.33573715361, -382000,     0
##MAX=       4132.6476996994, 372409811,     0
$$ Real data points
##PAGE= N=1
##DATA TABLE= (X++(R..R)), XYDATA
$$ [...]
13228G656897q8806j84971j39777j16902q3777j67500j96545p6928j50748k23772
$$ 7656897 7568091 7383120 7243343 7126441 7042664 6875164 6678619 6601691 6450943 6227171
13218F227171j73324j03617l0202j54141j35044r8662k03005k53611j74133l0799
$$ 6227171 6053847 5950230 5920028 5765887 5630843 5532181 5329176 5075565 4901432 4870633
13208D870633Q0870Q50j29798j18631j42585K6906K6863K413j78164j19334l9442
$$ 4870633 4951503 4952353 4822555 4703924 4561339 4588245 4615108 4617521 4439357 4320023 4280581
13197D280581l7444j10095j66023p5835q6684m7919k8804j02231j96378r8420
$$ 4280581 4243137 4133042 3967019 3891184 3804500 3756581 3727777 3625546 3429168 3330748
13187C330748N1635R1922m5377m9857o943j62148j35763m4700k5951n3817l6852
$$ 3330748 3382383 3474305 3428928 3379071 3372128 3209980 3074217 3029517 3003566 2949749 2912897
13176B912897j1106q7671j01630o6782O6920Q313l9151n9504j5195p7642Q568
$$ 2912897 2901791 2814120 2712490 2645708 2712628 2720941 2681790 2622286 2607091 2529449 2538017
13165B538017j5408j06831j21397L2135P0893p4000j01574L1388j01379L9747
$$ 2538017 2522609 2415778 2294381 2326516 2397409 2323409 2221835 2253223 2151844 2191591
13155B191591O5604j52219j71596p2089n3799J04899M5443r9244j16802j58087
$$ 2191591 2257195 2104976 1933380 1861291 1807492 1912391 1957834 1858590 1741788 1583701
13145A583701k122J51426L5121L368j92844p7567j2177Q3135P0498m9317j07532
$$ 1583701 1581579 1733005 1768126 1771494 1578650 1501083 1488906 1572041 1642539 1593222 1485690
13134A485690l6901P2490k672m5921k3631k2046j03508n384M7692l377m0076K2717
$$ 1485690 1448789 1521279 1518607 1472686 1449055 1427009 1323501 1318117 1365809 1362432 1322356 1345073
13122A345073l6042k5303J1471p4770j9910j7498J9149K4008q6244q6907q8114
$$ 1345073 1309031 1283728 1295199 1220429 1200519 1183021 1202170 1226178 1139934 1053027 964913
13111I64913J9236R7871m9786M7644j3382k2541O5077R7653r1725j38842p1258
$$ 964913 984149 1082020 1032234 1079878 1066496 1043955 1109032 1206685 1114960 976118 904860
13100I04860j9653J8173O7304J07983L3730j9065q8577r4613m2610M4830J04443
$$ 904860 885207 903380 970684 1078667 1112397 1093332 1004755 910142 867532 912362 1016805
13089A016805k650j08285j13459R7703N9779Q3491m7110j50741n0754j08298r5166
$$ 1016805 1014155 905870 792411 890114 949893 1033384 986274 835533 784779 676481 581315
13078E81315P8224R7511L1999J7432k4812p246M0097K4377p4295j39522q3643
$$ 581315 659539 757050 789049 806481 781669 774423 814520 838897 764602 625080 541437
13067E41437N7522l1622L594M8416l5692J3859J2321k4148L5977l3986o2534n8454
$$ 541437 598959 567337 570931 619347 583655 597514 609835 585687 621664 587678 525144 466690
13055D66690Q8080R3490P137r7107m6820N1909m3675j81648K0067J29407K0105
$$ 466690 554770 648260 655397 558290 511470 563379 519704 338056 358123 487530 507635
13044E07635O368l828k0882o3985K9304K0919p4579q8813L2365Q7141L0636J4960
$$ 507635 514003 510175 489293 425308 454612 475531 400952 312139 344504 431645 462281 477241
13032D77241p5831K727R9354J26002k4961l974n5863m1197M289j27946j36464
$$ 477241 401410 404137 503491 629493 604532 600558 544695 503498 507787 379841 243377
13021B43377k5563o761m4768Q0322J79662K3180p2128r6211m7467K5127J24975
$$ 243377 217814 211053 166285 246607 426269 449449 377321 281110 233643 258770 383745
13010C83745J49764K7973j03090J5608L276P1775k0226n6398m4181N8709m152
$$ 383745 533509 561482 458392 474000 477276 549051 528825 472427 428246 486955 482803
12999D82803o3765L1697J08934j04988l2596k9321M181M1895K1660m0720k2757
$$ 482803 419038 450735 559669 454681 422085 392764 396945 438840 460500 419780 397023
12988C97023q4779j01956M3780k3681k737L9294o7510N9286J13801J21227O5074
$$ 397023 312244 210288 254068 230387 227650 266944 199434 258720 372521 493748 558822
12977E58822l0877r1865K710j1715N5614M4097R9637J7567r4712k0618m879K1578
$$ 558822 527945 436080 438790 427075 482689 526786 626423 643990 549278 528660 523781 545359
12965E45359J5061j10679J941O1707M1843j02464n7125R5740J31436Q3204P425
$$ 545359 560420 449741 451682 513389 555232 452768 395643 491383 622819 706023 713448
12954G13448r8394l3053L3314K0372J28425J30939J864l2463j00303j1929L1921
$$ 713448 615054 582001 615315 635687 764112 895051 896915 864452 764149 752220 784141
12943G84141k30M4609q4860M6717Q1180k2405n451j4299l4297J3737q6200l8520
$$ 784141 783911 828520 743660 790377 871557 849152 843701 829402 795105 808842 722642 684122
12931F84122J31446j3862N3963R4597Q0484M6707m5379J7496k6193L2001K1015
$$ 684122 815568 801706 855669 950266 1030750 1077457 1032078 1049574 1023381 1055382 1076397
12920A076397N3150j7248L3748N3950k7016l539J7365N6666O908q6436O836N6180
$$ 1076397 1129547 1112299 1146047 1199997 1172981 1169442 1186807 1243473 1250381 1163945 1170781 1226961
12908A226961N9347j06960k0555Q8220Q5328R7749n0642j09839m3821R2694J58117
$$ 1226961 1286308 1179348 1158793 1247013 1332341 1430090 1379448 1269609 1225788 1318482 1476599
12897A476599L5925l3388P481o3108p2475O4736r7560l5262J1980L600M05M9698
$$ 1476599 1512524 1479136 1486617 1423509 1351034 1415770 1318210 1282948 1294928 1298528 1298933 1348631
12885A348631k7748m3945j3188O625M0844k3597L1054Q843o9975m5204J0597L0653
$$ 1348631 1320883 1276938 1263750 1270375 1311219 1287622 1318676 1327519 1257544 1212340 1222937 1253590
12873A253590j585l5981O2309j1747j7482o8480L7382M9051J11155N4153P626
$$ 1253590 1252005 1216024 1278333 1266586 1249104 1180624 1218006 1267057 1378212 1432365 1439991
12862A439991K221q4544R2750M6319N6805J07294N8667N6799l8654J7336N9905
$$ 1439991 1442212 1357668 1450418 1496737 1553542 1660836 1719503 1776302 1737648 1754984 1814889
12851A814889m7258P0525J12990R5158L4157J41928P1799P8409J28975J01993
$$ 1814889 1767631 1838156 1951146 2046304 2080461 2222389 2294188 2372597 2501572 2603565
12841B603565K08120K23892K88039L22554L22684M24577L77751M44842N56660
$$ 2603565 2811685 3035577 3323616 3646170 3968854 4393431 4771182 5216024 5772684
12832E772684P23066Q52603J124029J327949J542710K086050K532574K971364
$$ 5772684 6495750 7348353 8472382 9800331 11343041 13429091 15961665 18933029
12824A8933029L249888L295656K934228K504476J825789J256849L64403n53925
$$ 18933029 22182917 25478573 28412801 30917277 32743066 33999915 34364318 33810393
12816C3810393j622077k482668k935359k910548k645969k168342j834016j387267
$$ 33810393 32188316 29705648 26770289 23859741 21213772 19045430 17211414 15824147
12808A5824147j202555r20100p26176o20311l72894k90025l25026j75987m3796
$$ 15824147 14621592 13701492 12975316 12355005 11982111 11692086 11367060 11191073 11147277
12799A1147277q877J55464K49610K39178L26208M41822O85069Q17827J128159
$$ 11147277 11138400 11293864 11543474 11782652 12108860 12550682 13235751 14053578 15181737
12790A5181737J488587J887894K287837K662140L083172L384757L278837K868142
$$ 15181737 16670324 18558218 20846055 23508195 26591367 29976124 33254961 36123103
12782C6123103K465146J790812J081937K79973o71045j584093k095922k097308
$$ 36123103 38588249 40379061 41460998 41740971 41069926 39485833 37389911 35292603
12774C5292603j700048j076838k08728O34367J365941J853153K025929J842909
$$ 35292603 33592555 32515717 32306989 32941356 34307297 36160450 38186379 40029288
12766D0029288J453375R43761L19326m15433j318790k292743l142570l467532
$$ 40029288 41482663 42426424 42745750 42330317 41011527 38718784 35576214 32108682
12758C2108682l226256k827793k315271j947505j690145j371369r40877q52151
$$ 32108682 28882426 26054633 23739362 21791857 20101712 18730343 17789466 16937315
12750A6937315q86905o52808m30822k72652k49700j44832j50306r7652P247M6825
$$ 16937315 16050410 15397602 14966780 14694128 14444428 14299596 14149290 14051638 14058885 14105710
12740A4105710K44753L97247N21131O30307R27607J347501J602909K167725K524363
$$ 14105710 14350463 14747710 15268841 15899148 16826755 18174256 19777165 21944890 24469253
12731B4469253K818613K969531K773522K339305J759549J118308L74514m68732
$$ 24469253 27287866 30257397 33030919 35370224 37129773 38248081 38622595 38153863
12723C8153863j573036k654290l215816l414556l141272k724064k318537j881702
$$ 38153863 36580827 33926537 30710721 27296165 24154893 21430829 19112292 17230590
12715A7230590j459804j146309j038669r11994p26038o47983n96390m98967m40452
$$ 17230590 15770786 14624477 13585808 12673814 11947776 11299793 10703403 10204436 9763984
12706I763984l71813m08478l56883k65718k90375j97912j85331j85142k04161
$$ 9763984 9392171 8983693 8626810 8361092 8070717 7872805 7687474 7502332 7298171
12697G298171k62687j63950j64063k23734j37516j60822j3394l9109o8399j21060
$$ 7298171 7035484 6871534 6707471 6483737 6346221 6185399 6172005 6132896 6064497 5943437
12687E943437j35817n5715j17760q9015J7056l2433o4963q2118R4478j7823q2330
$$ 5943437 5807620 5751905 5634145 5545130 5562186 5529753 5464790 5382672 5477150 5459327 5376997
12676E376997k5731P6191Q2571L7636j09481j29661o5683q8918j238j4913l2691
$$ 5376997 5351266 5427457 5510028 5547664 5438183 5308522 5242839 5153921 5152683 5137770 5105079
12665E105079J5223p0120j59373o4615j05145N7237O776n9740l8539N8966p3321
$$ 5105079 5120302 5050182 4890809 4826194 4721049 4778286 4785062 4725322 4686783 4745749 4672428
12654D672428j86124j47279m3990J0892n2669p175P7720Q56R0959l7944q4840
$$ 4672428 4486304 4339025 4295035 4305927 4253258 4246083 4323803 4324659 4415618 4377674 4292834
12643D292834N405P6718J2537k8543o2576k644J93495P8491l9259J1655m9993
$$ 4292834 4298239 4374957 4387494 4358951 4296375 4293731 4487226 4565717 4526458 4538113 4488120
12632D488120j0105J889M9232J09371N8976o2466n8193n1627j8645N8815K0032
$$ 4488120 4478015 4479904 4529136 4638507 4697483 4635017 4576824 4525197 4506552 4565367 4585399
12621D585399M6460K4138j29218j56620m5358p1013q6533p7589m0801P8825j22031
$$ 4585399 4631859 4655997 4526779 4370159 4324801 4253788 4167255 4089666 4048865 4127690 4005659
12610D005659r6170n8054k1570n1557j259n2538j54466N263k2491j11219o1878
$$ 4005659 3909489 3851435 3829865 3778308 3777049 3724511 3570045 3575308 3552817 3441598 3379720
12599C379720m9358M8009l5072j19322p9887q2088J6379K2527l5915L8173k2226
$$ 3379720 3330362 3378371 3343299 3223977 3144090 3062002 3078381 3100908 3064993 3103166 3080940
12588C080940m3095q5809Q447L4845j7702r641J6612Q85J4640L3775n9108j16641
$$ 3080940 3037845 2952036 2960483 2995328 2977626 2967985 2984597 2985482 3000122 3033897 2974789 2858148
12576B858148m1505M1508n0011n0185j12736j09367k9537K0643K1525l6345q1162
$$ 2858148 2816643 2858151 2808140 2757955 2645219 2535852 2506315 2526958 2548483 2512138 2430976
12565B430976j09260r4698r9020k25582l2772q4571q867k3636o8264k6982K0587
$$ 2430976 2321716 2227018 2127998 1902416 1869644 1785073 1776206 1752570 1684306 1657324 1677911
12554A677911j3070j2531o6372r2695j09834m7841M3784Q230j00706q1086k1920
$$ 1677911 1664841 1652310 1585938 1493243 1383409 1335568 1379352 1387582 1286876 1205790 1183870
12543A183870l0883n7647q1493n6551p0001k3131N6381Q1218O7123m0827j06776
$$ 1183870 1152987 1095340 1013847 957296 887295 864164 920545 1001763 1068886 1028059 921283
12532I21283J6705R0610q3333L0100q8448j66081Q0838J574m5701Q781L324j237
$$ 921283 937988 1028598 945265 975365 886917 720836 801674 803248 757547 766328 769652 768415
12520G68415K5583K1636N5730n1158p1259M2915m3306Q2664K684j64533k7651
$$ 768415 793998 815634 871364 820206 748947 791862 748556 831220 833904 669371 641720
12509F41720N685m7455n6880m471L7117P5854J01L8576j0724o4541r9134l8575
$$ 641720 647405 599950 543070 538599 575716 651570 651671 690247 679523 614982 515848 477273
12497D77273J8050L6316L6036l8725n6142k3169j4920O9140J3569J19269J7723
$$ 477273 495323 531639 567675 528950 472808 449639 434719 503859 517428 636697 654420
12486F54420L550l898m705m819q1110n7000n9671M050K5139J05022P9769j09831
$$ 654420 657970 654072 649367 644548 563438 506438 446767 450817 475956 580978 660747 550916
12474E50916m2298k1818j04437m3705L8811P9708R3901J08328m2850n5442l7316
$$ 550916 508618 486800 382363 338658 377469 457177 551078 659406 616556 561114 523798
12463E23798j59m8270k3668O719L5534J4513J0583o1328P5416n8677n8773o6131
$$ 523798 523639 475369 451701 458420 493954 508467 519050 457722 533138 474461 415688 349557
12451C49557k4380P2313O9888j40720k221Q7726O2948j07328K7421l6895J0678
$$ 349557 325177 397490 467378 326658 324437 412163 475111 367783 395204 358309 368987
12440C68987l1981L901M6425M3639J9838l0320k133l5804j5329O8232k2973o788
$$ 368987 337006 340907 387332 430971 450809 420489 418356 382552 367223 435455 412482 405694
12428D05694R428k1544n1413M3696J5072j0719n821O7355Q0789j8726p0117j07957
$$ 405694 415122 393578 342165 385861 400933 390214 384393 451748 532537 513811 443694 335737
12416C35737L0217K8213J5818m7531j83157j3966P7739J41384R0894l929R600
$$ 335737 365954 394167 409985 362454 179297 165331 243070 384454 475348 471419 481019
12405D81019j06811P3113K37l6380m6568K8251J62639o2261j42055j00661K2885
$$ 481019 374208 447321 447558 411178 364610 392861 555500 493239 351184 250523 273408
12394B73408R3937n234M4204K4079k9820k9635j6792l161j10473n5325J60151
$$ 273408 367345 362111 406315 430394 400574 370939 354147 350986 240513 185188 345339
12383C45339O9046m0845m3627R1449O9607L7843k7923M6251L3038l1110j3032
$$ 345339 414385 373540 329913 421362 490969 528812 500889 547140 580178 549068 536036
12372E36036M6419K3201L3495n7936o7703k4906o7538L3718J28322j8603p4402
$$ 536036 582455 605656 639151 581215 513512 488606 421068 454786 583108 564505 490103
12361D90103j07600M2952R963K418l5190j9114K6740j836M5424k3397m6823q5570
$$ 490103 382503 425455 435418 437836 402646 383532 410272 408436 453860 430463 383640 298070
12349B98070J753q72R4816N1656L7612O3032k2492L5599O5342j261J1023j9151
$$ 298070 299823 298951 393767 445423 483035 546067 523575 559174 624516 623255 634278 615127
12337F15127L137J8106J6519L2272N3232j1255n6267k9027r143Q4644Q4335n5792
$$ 615127 618264 636370 652889 685161 738393 727138 670871 641844 632701 717345 801680 745888
12325G45888o4872o8568L184r364q0733j4192J0161n2574J3326N8988j7441r935
$$ 745888 681016 612448 615632 606268 525535 511343 521504 468930 482256 541244 523803 513868
12313E13868j5337q961p027o4322m9902N6170K5608k215m7100p8396m6849P422
$$ 513868 498531 489570 482543 418221 368319 424489 450097 447882 400782 322386 275537 282959
12301B82959J7262Q3297J72728N4501q8481J5266L836M7651N3635O4736j9369
$$ 282959 300221 383518 556246 610747 522266 537532 541368 589019 642654 707390 688021
12290F88021q9819m6818P0352J5333q4244l0077N5041j9359J03103J34176P2306
$$ 688021 598202 551384 621736 637069 552825 522748 577789 558430 661533 795709 868015
12279H68015k1602j10813m2044l4986l4685m5144j6764q159n7M9996Q6592J24498
$$ 868015 846413 735600 693556 658570 623885 578741 561977 553818 553761 603757 690349 814847
12267H14847o9854j29472o6223K943l112l9652K0793P0722J01208n9756J1943
$$ 814847 744993 615521 549298 552241 549129 509477 530270 600992 702200 642444 654387
12256F54387Q1815q43q4712l1789k048l9607Q4757l4515n4915o7370r034M9467
$$ 654387 736202 735359 650647 618858 616810 577203 661960 627445 572530 505160 496126 545593
12244E45593R3442L1969k1900n7737J903j4918O2866o9019m7223J00265O9128
$$ 545593 639035 671004 649104 591367 593270 578352 641218 572199 524976 625241 694369
12233F94369J25230n448p8373r1308o6852n7492L7118J34561o4753o5102q363
$$ 694369 819599 814151 735778 644470 577618 520126 557244 691805 627052 561950 553587
12222E53587M4322J05619L0346n1872j199P7727M0427J0064k0997R6373J24596
$$ 553587 597909 703528 733874 682002 680803 758530 798957 809021 788024 884397 1008993
12211A008993L1173j24457j05769l7784M0046N6677j4119p4243m4062k9021Q125
$$ 1008993 1040166 915709 809940 772156 812202 868879 854760 780517 736455 707434 715559
12200G15559N1015Q7354n2320j16029j11275Q0682J9185J4046Q1146k2086j3876
$$ 715559 766574 853928 801608 685579 574304 654986 674171 688217 769363 747277 733401
12189G33401N5440O9777k3368m1239p6465J309r903Q9706o420O1224K1744k4639
$$ 733401 788841 858618 835250 794011 717546 718855 708952 798658 792238 853462 875206 850567
12177H50567p824J1954Q1097l3528P330J25367k5761l3719n3379P3704j1888n4661
$$ 850567 842743 854697 935794 902266 909596 1034963 1009202 975483 922104 995808 983920 929259
12165I29259K5940m9120q6886o907Q5195N3516O2648J05558N014n2500k3632K8467
$$ 929259 955199 906079 819193 812286 897481 950997 1013645 1119203 1124217 1071717 1048085 1076552
12153A076552R116j9490P22o2148n1785M0126P3476K3206K5126n7202q2118N9588
$$ 1076552 1085668 1066178 1066900 1004752 952967 993093 1066569 1089775 1114901 1057699 975581 1035169
12141A035169N7523L0476o3713O4648Q1862l19P0040J12561j0228j28574k4252
$$ 1035169 1092692 1123168 1059455 1124103 1205965 1205646 1275686 1388247 1378019 1249445 1225193
12130A225193R5972R6918O4480n8151L389j6730L039K1039O9774k6217M3151K6591
$$ 1225193 1321165 1418083 1482563 1424412 1427801 1411071 1414110 1435149 1504923 1478706 1521857 1548448
12118A548448O189O2885J6936m3803L0338M9804O194k0591L5841p3634j28228
$$ 1548448 1554637 1617522 1634458 1590655 1620993 1670797 1676991 1656400 1692241 1618607 1490379
12107A490379J6251J07908J31188K7522j9713r4518k0324j6607P1360Q6631J14249
$$ 1490379 1506630 1614538 1745726 1773248 1753535 1659017 1638693 1622086 1693446 1780077 1894326
12096A894326k6141Q002L5687k398N6929k0597m2599n7724J03841P8012Q1326
$$ 1894326 1868185 1876187 1911874 1909476 1966405 1945808 1903209 1845485 1949326 2027338 2108664
12085B108664l0155K388J9844O5490k4947q4712m3562R8559Q1866N271o0784J7764
$$ 2108664 2078509 2080897 2100741 2166231 2141284 2056572 2013010 2111569 2193435 2198706 2137922 2155686
12073B155686P4488J47546O0557m5641K330J44908N3498q575O9484R0125Q2438
$$ 2155686 2230174 2377720 2438277 2392636 2394966 2539874 2593372 2584797 2654281 2744406 2826844
12062B826844r3258k7280J5588L7256J61719J08530M2604k9868p4509K6595K5304
$$ 2826844 2733586 2706306 2721894 2759150 2920869 3029399 3072003 3042135 2967626 2994221 3019525
12051C019525N0926K00058P0070q4614q0615j8727L3868J1181M9104J9535J05067
$$ 3019525 3070451 3270509 3340579 3255965 3175350 3156623 3190491 3201672 3250776 3270311 3375378
12040C375378J01304N9891K4150J05502K3599O0173R9340K6580J22650J26043
$$ 3375378 3476682 3536573 3560723 3666225 3689824 3749997 3849337 3875917 3998567 4124610
12030D124610L0141J9635J24586L8084K3050L9159Q1092J03604K5982J07240K4341
$$ 4124610 4154751 4174386 4298972 4337056 4360106 4399265 4480357 4583961 4609943 4717183 4741524
12019D741524m0557R4705K8716O2355J65238R0974R4225J14152O6735K5612N0962
$$ 4741524 4700967 4795672 4824388 4886743 5051981 5142955 5237180 5351332 5418067 5443679 5494641
12008E494641Q5082J39114J68591J54634O5448N1846N4809J37638J28351R9021
$$ 5494641 5579723 5718837 5887428 6042062 6107510 6159356 6214165 6351803 6480154 6579175
11998F579175J20818J53338K5770J02239O9631J78402J57020K17668J90604J12126
$$ 6579175 6699993 6853331 6879101 6981340 7050971 7229373 7386393 7604061 7794665 7906791
11988G906791Q4438N8846Q5817R4197J80634J69626J92618K10973J33329J50204
$$ 7906791 7991229 8050075 8135892 8230089 8410723 8580349 8772967 8983940 9117269 9267473
11978I267473K49699J80508J73726J27661R6388K39371K14503J42181K52378K49461
$$ 9267473 9517172 9697680 9871406 9999067 10095455 10334826 10549329 10691510 10943888 11193349
11968A1193349J75295Q6422J45260K02625J96180K01416L08530K04217P2655J98777
$$ 11193349 11368644 11455066 11600326 11802951 11999131 12200547 12509077 12713294 12785949 12984726
11958A2984726K66335K32323J27932J79027L38747L82593K22046J96848J62071
$$ 12984726 13251061 13483384 13611316 13790343 14129090 14511683 14733729 14930577 15092648
11949A5092648J60390J72704J15344Q6631J50290L07969K82899K28765J50956
$$ 15092648 15253038 15425742 15541086 15627717 15778007 16085976 16368875 16597640 16748596
11940A6748596J34328J20222K33034J34775k863J19580J04317J20077n0458R255
$$ 16748596 16882924 17003146 17236180 17370955 17368092 17487672 17591989 17712066 17661608 17670863
11930A7670863O1822M0728M7569Q4884P2792J21917Q545j15453m5319q4325n6136
$$ 17670863 17732685 17773413 17820982 17905866 17978658 18100575 18109120 17993667 17948348 17864023 17807887
11919A7807887j6878l8480j15568j59829j15088j21913l0265q2861j42761k39277
$$ 17807887 17791009 17752529 17636961 17477132 17362044 17240131 17209866 17127005 16984244 16744967
11909A6744967j65372o4674q9486j20049j28101j88750j80651j84986j78763k91026
$$ 16744967 16579595 16514921 16425435 16305386 16177285 15988535 15807884 15622898 15444135 15153109
11899A5153109j49030j49183p5502k40582k60395k04332j88702k40236k07731
$$ 15153109 15004079 14854896 14779394 14538812 14278417 14074085 13885383 13645147 13437416
11890A3437416k20124k15583k64911j03578j17458q7650k18219r9317j96010j98318
$$ 13437416 13217292 13001709 12736798 12633220 12515762 12428112 12209893 12110576 11914566 11716248
11880A1716248k61623k30984k05179k51514j25817j18845k2733j68945k03459
$$ 11716248 11454625 11223641 11018462 10766948 10641131 10522286 10499553 10330608 10127149
11871A0127149j29318j46371r0343j11042k11465k39745o9653o8689k43253j61821
$$ 10127149 9997831 9851460 9761117 9650075 9438610 9198865 9129212 9060523 8817270 8655449
11861H655449j17485l9349m0053j38263j87738j78232j20829o5050n6055j69232
$$ 8655449 8537964 8498615 8458562 8320299 8132561 7954329 7833500 7768450 7712395 7543163
11851G543163j26003j83601j51404q9299j26384l815m5801j07747k19289j26890
$$ 7543163 7417160 7233559 7082155 6992856 6866472 6862657 6816856 6709109 6489820 6362930
11841F362930m7759l287q4139j93204j64401n1224m9218k0109m8347m0862n7082
$$ 6362930 6315171 6311884 6227745 6034541 5870140 5818916 5769698 5749589 5701242 5660380 5603298
11830E603298j92973j9683j05428o5309o4562j20424k3735o3843q7208n5847j22937
$$ 5603298 5410325 5390642 5285214 5219905 5155343 5034919 5011184 4947341 4860133 4804286 4681349
11819D681349p1862m536m1179j24852j2198L8422K856L0186j40461k24862j06601
$$ 4681349 4609487 4604951 4563772 4438920 4426722 4465144 4468000 4498186 4357725 4132863 4026262
11808D026262M253k4573L7328j986p5761j9365k9625q4j10925j11498m454l7124
$$ 4026262 4030515 4005942 4043270 4041284 3965523 3946158 3916533 3916449 3805524 3694026 3689572 3652448
11796C652448n2754J3403l3621l2670n0357j56974r4426l6660q2012O133P6194
$$ 3652448 3599694 3613097 3579476 3546806 3496449 3339475 3245049 3208389 3126377 3132510 3208704
11785C208704J8815j14242p2751M1560o140K5092p5126j08560j24392o3550l5241
$$ 3208704 3227519 3113277 3040526 3082086 3075946 3101038 3025912 2917352 2792960 2729410 2694169
11774B694169j714M4057J05765M0957r7087j18908p1933l8822m8528j10641k8599
$$ 2694169 2692455 2736512 2842277 2883234 2786147 2667239 2595306 2556484 2507956 2397315 2368716
11763B368716P8709k11n0438O3587p512j02608j7539o1631k2608j2526L0433l7590
$$ 2368716 2447425 2447214 2396776 2460363 2452851 2350243 2332704 2271073 2248465 2235939 2266372 2228782
11751B228782j15150j1236J1323q5233r6491n6374n2795M4196o4790K1276N7001
$$ 2228782 2113632 2102396 2113719 2028486 1931995 1875621 1822826 1867022 1802232 1823508 1880509
11740A880509N434k1595k630K8839j30692o2160J39328K8316j48385j28735m2924
$$ 1880509 1885943 1864348 1861718 1890557 1759865 1697705 1837033 1865349 1716964 1588229 1545305
11729A545305R2062L5537j0615P519J6667m0593l0998m7463l3467J3554J9267
$$ 1545305 1637367 1672904 1662289 1669808 1686475 1645882 1614884 1567421 1533954 1547508 1566775
11718A566775R7790j1297J697K6396q8120n8983p598J0238k3933K7410o634q2664
$$ 1566775 1664565 1653268 1654965 1681361 1593241 1534258 1526660 1536898 1512965 1540375 1533741 1451077
11706A451077m7113J7516M0892n163j1512o643r871m7061n306m8268m8104m4711
$$ 1451077 1403964 1421480 1462372 1457209 1445697 1439054 1429183 1382122 1376816 1328548 1280444 1235733
11694A235733j5245j7024M4022J11490p3130p4202p5759k0246p0098K7614m9380
$$ 1235733 1220488 1203464 1247486 1358976 1285846 1211644 1135885 1115639 1045541 1073155 1023775
11683A023775k4528M3837j0884M6682J6565r7231j03778j5736M6926R5807P1108
$$ 1023775 999247 1043084 1032200 1078882 1095447 998216 894438 878702 925628 1021435 1092543
11672A092543Q4415Q605m5107j20777j22282q8744m1875J03033R5705N4694N20
$$ 1092543 1176958 1185563 1140456 1019679 897397 808653 766778 869811 965516 1020210 1020730
11661A020730Q1577j464p7641l1987P2930j7359q6391l6110P1220O6451o8149
$$ 1020730 1102307 1100843 1023202 991215 1064145 1046786 960395 924285 995505 1061956 993807
11650I93807r7158k3865K8378m3795L1031j4000n0405o9858j3795p570K0664M9991
$$ 993807 896649 872784 901162 857367 888398 874398 823993 754135 740340 732770 753434 803425
11638H03425K5106O555o441q4826o5650O0091q8181J8436K1878j2333N7690j9884
$$ 803425 828531 835086 828645 743819 678169 738260 650079 668515 690393 678060 735750 715866
11626G15866q3453O6099K4168P736k1652J9250J4471l3858j30110o1390L1322
$$ 715866 632413 698512 722680 730416 708764 728014 742485 708627 578517 517127 548449
11615E48449L0895L4100q169L5756J2506j69536n084L2721O1427k5176J59906
$$ 548449 579344 613444 605275 641031 653537 484001 478917 511638 573065 547889 707795
11604G07795O8254q4019j80800l9678N0327p478L4048k2103o5926M203M0288J8187
$$ 707795 776049 692030 511230 471552 521879 514401 548449 526346 460420 464623 504911 523098
11592E23098O3796Q97q0864M319j5694O9908m2168q6499R3283J0022N8420j3616
$$ 523098 586894 587791 506927 511246 495552 565460 523292 436793 530076 540098 598518 584902
11580E84902J6942j298K70n8864n2331M060N1272M2711j69677m413J04168j3175
$$ 584902 601844 600546 600816 541952 489621 493681 544953 587664 417987 413574 517742 504567
11568E04567j2806k0008j7042N4206M0763L9342r8018k9602N3985n532L4301j3652
$$ 504567 491761 471753 454711 508917 549680 589022 491004 461402 515387 509855 544156 530504
11556E30504N04J5926o1602m8025O080L224L0088J431n5323j8988p1402l4114
$$ 530504 531008 546934 485332 437307 443387 446611 476699 478130 422807 403819 332417 298303
11544B98303R9214N1251K99J226k9834k2190j63420l0981L8907M6435n1905J9853
$$ 298303 397517 448768 449067 450293 420459 398269 234849 203868 242775 289210 237305 257158
11532B57158l7373j3827P1882l9905q524J04808N9649p9661o4755K4471j4182
$$ 257158 219785 205958 277840 237935 229411 334219 393868 314207 249452 273923 259741
11521B59741J32738j7093o2160J6413k0784o7991J7709P7970J0250n5732o5752
$$ 259741 392479 375386 313226 329639 308855 240864 258573 336543 346793 291061 225309
11510B25309J09624Q6408k2186j8211O0190o0416k1495j369L0781k1217l0878
$$ 225309 334933 421341 399155 380944 441134 380718 359223 357854 388635 367418 336540
11499C36540n963j9477J9101N4826J1240q1544j8761m065J9813l4826j6872l1684
$$ 336540 330577 311100 330201 385027 396267 314723 295962 291897 311710 276884 260012 228328
11487B28328L710O7966L1571N4143m0457j42689o6314J7192L4359J3832o314j522
$$ 228328 232038 300004 331575 385718 345261 202572 136258 153450 187809 201641 195327 193805
11475A93805L7414P2248P5534M8974r1250j07376r453L2853M5782m6839L9197
$$ 193805 231219 303467 379001 427975 336725 229349 219896 252749 298531 251692 290889
11464B90889K2004J4489N1531j5178j44887r2159l3184j1189m4096K8323O1111
$$ 290889 312893 327382 378913 363735 218848 126689 93505 82316 38220 66543 127654
11453A27654Q0502r168R11K8287m7522L8081M3092L6976l7406k6712K3865q1335
$$ 127654 208156 198988 199899 228186 180664 218745 261837 298813 261407 234695 258560 177225
11441A77225j1392k9135n3019J02782P8900M6545M633l8835L5998k8568k811j686
$$ 177225 165833 136698 83679 186461 265361 311906 316539 277704 313702 285134 282323 280637
11429B80637J3501k1264j13160n3241j9797Q1569Q7812M7118j02989n4296J2195
$$ 280637 294138 272874 159714 106473 86676 168245 256057 303175 200186 145890 158085
11418A58085J6456J3391K2287R27J1173r1750J2041n9290j02708O3892P921J5092
$$ 158085 174541 187932 210219 211146 222319 130569 142610 83320 -19388 44504 52425 67517
11406F7517P3453j5794l6685q092J9585M9034Q4728K2753n6999n533m8373n7622
$$ 67517 140970 125176 88491 80399 99984 149018 233746 256499 199500 193967 145594 87972
11394H7972j1664L0541L2759k97j0103m306m8099o8457M894n0165P852M4939M8390
$$ 87972 76308 106849 139608 139311 129208 124902 76803 8346 13240 -36925 -29073 15866 64256
11381F4256M9964m1066L3517K4130K1927o786L7827K418K4887O2638m8433k2937
$$ 64256 114220 73154 106671 130801 152728 145942 183769 186187 211074 273712 225279 202342
11369B02342l728J08126l6988K2552L8486R0226o9438o7290q5325o3155K9871
$$ 202342 198614 306740 269752 292304 330790 421016 351578 284288 198963 135808 165679
11358A65679j8679L4532Q0640l9692K4267K9664k3706r360k1601q0756m9078Q387
$$ 165679 147000 181532 262172 222480 246747 276411 252705 243345 221744 140988 91910 100297
11346A00297J05224P2373j9699m217k9326j02270m732L4628K0380P5525r3004
$$ 100297 205521 277894 258195 253978 224652 122382 117650 152278 172658 248183 155179
11335A55179q8654j6944N261N5685n4942l1057K2051J06244r9049j4024M7180
$$ 155179 66525 49581 54842 110527 55585 24528 46579 152823 53774 39750 86930
11324H6930J9145O3036m1612k8133K4299O8078R6266m6761l6187l791p9838N8592
$$ 86930 106075 169111 127499 99366 123665 191743 288009 241248 205061 201270 121432 180024
11312A80024k1362K748n7802q1356j3474Q1325R6552J7725l1710j11613N6985
$$ 180024 158662 161410 103608 22252 8778 90103 186655 204380 172670 61057 118042
11301A18042J4546p6952j1688J18257q7726q4627N8694J30546L5899n2757L087
$$ 118042 132588 55636 43948 162205 74479 -10148 48546 179092 214991 162234 165321
11290A65321J2609k9001K9833k5722r9695K3055k1436p8848Q2579J36105M6711
$$ 165321 177930 148929 178762 153040 53345 76400 54964 -23884 58695 194800 241511
11279B41511l1177l7105l7867k2715N10m649o867O354k6425L5128m7077p0887
$$ 241511 210334 173229 135362 112647 113157 108508 101641 107995 81570 116698 69621 -1266
11267a266O4328L7285n8722K7652N9085j0298P2130L4579l9358q0207K7061p0894
$$ -1266 63062 100347 41625 69277 128362 118064 190194 224773 185415 105208 132269 61375
11255F1375j54214j624J48212R0209J0445R232M5334M3591L2963m2046j5920n3681
$$ 61375 -92839 -94463 53749 143958 154403 163635 208969 252560 285523 243477 227557 173876
11243A73876o5452O6632o4766j28289R039O3685J10201j2299o3206l6525p6304
$$ 173876 108424 175056 110290 -17999 -8960 54725 164926 152627 89421 52896 -23408
11232b3408L0232L5940m5365k6312M2592N0822l4776j2023k7163n6050K4942J50626
$$ -23408 6824 42764 -2601 -28913 13679 64501 29725 17702 -9461 -65511 -40569 110057
11220A10057J8980m7681n4232l5148j1454N5035L267m6807j346n9404j5248m9077
$$ 110057 129037 81356 27124 -8024 -19478 35557 38824 -7983 -9329 -68733 -83981 -133058
11208a33058L8318J22261Q7152J1641M083J02066k4131p8847j00332j1144R4908
$$ -133058 -94740 27521 114673 126314 130397 232463 208332 129485 29153 18009 112917
11197A12917P4301O9910O5139P9078j77845j03557O7654L4922l9467J4620l390
$$ 112917 187218 257128 322267 401345 223500 119943 187597 222519 183052 197672 194282
11186A94282p951l4997r931j0053M4072m7845j8685j4200L7510J13989j39964
$$ 194282 186331 151334 141403 131350 175422 127577 108892 94692 132202 246191 106227
11175A06227r3408q8765K1608J3179J91259P6411o5041j66200m5570N3221J6287
$$ 106227 12819 -75946 -54338 -41159 150100 226511 161470 -4730 -50300 2921 19208
11164A9208N6331l2226k9325k0362P353J11271k4037j08133N859P2730L6683p1802
$$ 19208 75539 43313 13988 -6374 979 112250 88213 -19920 -14061 58669 95352 23550
11152B3550k3184L0911Q9828N1253p8488j4140N8608R0246O8095k0527j25273
$$ 23550 366 31277 121105 172358 93870 79730 138338 228584 296679 276152 150879
11141A50879q9887m6569j1377M950J7888L5121R0587j2369l5895L0778L6218L0142
$$ 150879 60992 14423 3046 7996 25884 61005 151592 139223 103328 134106 170324 200466
11129B00466k6249n4951q3762p979l422m3955o0411M0348O8266J14243K9559L5639
$$ 200466 174217 119266 35504 27525 24103 -19852 -80263 -39915 28351 142594 172153 207792
11117B07792j5437l6440j5761J5145p4154p7555m7398K843O2864M8715J6992Q5384
$$ 207792 192355 155915 140154 155299 81145 3590 -43808 -40965 21899 70614 87606 172990
11105A72990m16n1462k3018j01618k6497K5031R0289k219P1488N2994k7534K0062
$$ 172990 172574 121112 98094 -3524 -30021 -4990 85299 83080 154568 207562 180028 200090
11093B00090J5880j38096n8349M9884J535o7946l7286j2377L4832J07706L6442
$$ 200090 215970 77874 19525 69409 70944 2998 -34288 -46665 -11833 95873 132315
11082A32315l6071r381j1424M695o2742q3461r84P4124J7837K2738j4521k0401
$$ 132315 96244 86863 75439 80134 17392 -66069 -67053 7071 24908 47646 33125 12724
11070A2724m512N9831L4251K5567K8676k297j23862o9917N2308O1098J18562M246
$$ 12724 8212 68043 102294 127861 156537 154240 30378 -39539 12769 73867 192429 196675
11058A96675L2182j07411o2316L3019J1696r2503K6543O5559N6088K7443j29694
$$ 196675 228857 121446 59130 92149 103845 11342 37885 103444 159532 186975 57281
11047E7281o9750l613M9212O7186Q150N4658J2454M9707Q0740K8794K7657J3001
$$ 57281 -12469 -16082 33130 100316 108466 163124 175578 225285 306025 334819 362476 375477
11035C75477l7500l1575m8809L7113J30437R9704j5578m1718N589J11786J61232
$$ 375477 337977 306402 257593 294706 425143 524847 509269 467551 473140 584926 746158
11024G46158J4187O2924M6817l4008q1690r0164L2754R4187Q6211M9323J06627
$$ 746158 760345 823269 870086 836078 754388 664224 696978 791165 877376 926699 1033326
11013A033326j0110j0812k5416l4123r5335q9573j49645q4668P2664J11265J15631
$$ 1033326 1023216 1012404 986988 952865 857530 767957 618312 533644 606308 717573 833204
11002H33204N3771o7110n2248n8918q6900l7917o5236p5919k435L4113K9014K8591
$$ 833204 886975 819865 767617 708699 621799 583882 518646 442727 440292 474405 503419 532010
10990E32010l5252n6374q5809l8298K4404l4718k9703k8327j07161l3169J34860
$$ 532010 496758 440384 354575 316277 340681 305963 276260 247933 140772 107603 242463
10979B42463k0301p498o6317m0807j3088L090q1637l3711J22165P3494m822J575
$$ 242463 222162 214664 148347 107540 94452 97542 15905 -17806 104359 177853 173031 174606
10967A74606J4313L8470l7240j40774j1997J35718N7694k4974L3490j32195l9754
$$ 174606 188919 227389 190149 49375 37378 173096 230790 205816 239306 107111 67357
10956F7357P3787j5926n5526p092J6927L2701M3858J2057K36k4621q6851R382
$$ 67357 141144 125218 69692 62600 79527 112228 156086 168143 168379 143758 56907 66289
10944F6289M8264J7957L4150M005j29279l3155P1296k229k9773J09218j6087m1548
$$ 66289 114553 132510 166660 170665 41386 8231 79527 77298 47525 156743 140656 99108
10932I9108K5367o6390M955l240K7472M7465k7604k8051j9156l3200o0310j5551
$$ 99108 124475 58085 63040 59800 87272 134737 107133 79082 59926 26726 -33584 -49135
10920d9135L138J33658Q0283K9531k7297r2597l9988P1650J0917L7842k117J10728
$$ -49135 -45997 87661 167944 197475 170178 77581 37593 109243 120160 158002 155885 266613
10908B66613J2857r8615j59030K9497J5586r8174J00098M8575m7700N1472r331
$$ 266613 279470 180855 21825 51322 66908 -31266 68832 117407 69707 121179 111848
10897A11848o7909Q7573J3681k6146q566j3551N2128O4409M7052l7902j03752
$$ 111848 43939 131512 145193 119047 110481 96930 149058 213467 260519 222617 118865
10886A18865n5265N6631P3564N59r5306Q6890O3175n3183n2990n9337j09954r907
$$ 118865 63600 120231 193795 194354 99048 185938 249113 195930 142940 83603 -26351 -36258
10874c6258J10126k4148O15n8402J6778L9881r0875k1800R1152J74302Q0265Q9173
$$ -36258 73868 49720 50335 -8067 8711 48592 -42283 -64083 27069 201371 281636 370809
10862C70809r2871o4725R1920n5875l3350j20357l4155J02680L8470N4187J41404
$$ 370809 277938 213213 305133 249258 215908 95551 61396 164076 202546 256733 398137
10851C98137K0200n1496l9526P6506q198L0525K0404j09460o535m0601o9831O815
$$ 398137 418337 366841 327315 403821 395623 426148 446552 337092 330557 289956 220125 226940
10839B26940R3492M7855q8004n2539l1860R1905K9658j4804N7394k3607n0397
$$ 226940 320432 368287 280283 227744 195884 287789 317447 302643 360037 336430 286033
10828B86033n8674n8208o752j2884K9515K2434o5249m071L2760K6737m2511o5049
$$ 286033 227359 169151 162399 149515 179030 201464 136215 132144 164904 191641 149130 84081
10816H4081J1849J1311L3224m2714r1942M1436N6067o913O3414k0220p1253L3430
$$ 84081 95930 107241 140465 97751 5809 47245 103312 96399 159813 139593 68340 101770
10804A01770P6353L896j19152k7834m1070o4978o022n3840M4970O6239Q8096M6278
$$ 101770 178123 182019 62867 35033 -6037 -71015 -77037 -130877 -85907 -19668 68428 114706
10792A14706P7611P3852k4878J456n9267l7716l3651l4368j6513L2456P3254j6323
$$ 114706 192317 266169 241291 242747 183480 145764 112113 77745 61232 93688 166942 150619
10780A50619R618O9041K1154j32094j02293K6563J19266j1557l0992N8544o0982
$$ 150619 160237 229278 250432 118338 16045 42608 161874 150317 119325 177869 116887
10769A16887O1246J14333k361q4557p0969L0770n7997k6207K2685M625k5394N6657
$$ 116887 178133 292466 290105 205548 134579 165349 107352 81145 103830 108455 83061 139718
10757A39718O7021K8686K4090M8265J0800k2380L4777J22319Q3405M4012Q813
$$ 139718 206739 235425 259515 307780 318580 296200 330977 453296 536701 580713 589526
10746E89526P7276K8613M3059J23477J15885J79738K01347J98946K04063K36835
$$ 589526 666802 695415 738474 861951 977836 1157574 1358921 1557867 1761930 1998765
10736A998765L91269P59340R48539J505536K330268L084453K691131J060407N75926
$$ 1998765 2390034 3149374 4097913 5603449 7933717 11018170 13709301 14769708 15345634
10727A5345634J050410J157755O95622j013182l231803l683984k443969j468850
$$ 15345634 16396044 17553799 18249421 17236239 14004436 10320452 7876483 6407633
10719F407633r23917n90504m09658l59629k03246j65838r9070k5239j00657m6183
$$ 6407633 5483716 4893212 4483554 4123925 3920679 3754841 3655771 3630532 3529875 3483692
10709C483692m3393r7746j27193j21896l9530m6885m5287m6593j17315p5636M640
$$ 3483692 3440299 3342553 3215360 3093464 3053934 3007049 2961762 2915169 2797854 2722218 2726858
10698B726858K8217r1363k6778j26775j32079k9735p4999j05499K8381q8344l7687
$$ 2726858 2755075 2663712 2636934 2510159 2378080 2348345 2273346 2167847 2196228 2107884 2070197
10687B070197n783m4464p2582p102j1056p5458q4679j22750n8561m008m0240M0075
$$ 2070197 2064414 2019950 1947368 1940266 1929210 1853752 1769073 1646323 1587762 1583754 1543514 1583589
10675A583589l2922j29948N77j13201r596m5185R296K2296N1471j8715n2723K0517
$$ 1583589 1550667 1420719 1421296 1308095 1298499 1253314 1262610 1284906 1336377 1317662 1264939 1285456
10663A285456Q2076M924j76694j00870q946J38500J34461J4695l7720j1451J28040
$$ 1285456 1367532 1372456 1195762 1094892 1085946 1224446 1358907 1373602 1335882 1324431 1452471
10652A452471J17723q323o4737R530J02599J25707R8083J99812J55762j5205l5665
$$ 1452471 1570194 1561871 1497134 1506664 1609263 1734970 1833053 2032865 2188627 2173422 2137757
10641B137757k9534P3934P1201N6744J24624r0362j14997K1138M0799J17577K31949
$$ 2137757 2108223 2182157 2253358 2310102 2434726 2344364 2229367 2250505 2291304 2408881 2640830
10630B640830L31719L30023L19029N34398M72088M16425L46273K99680M38494
$$ 2640830 2972549 3302572 3621601 4155999 4628087 5044512 5390785 5690465 6128959
10621F128959N71090N25618M87919N51116J056999J383510J959458K576822L332612
$$ 6128959 6700049 7225667 7713586 8264702 9321701 10705211 12664669 15241491 18574103
10612A8574103M268494N334833N820298N416645M818657M323523M162912L931117
$$ 18574103 22842597 28177430 33997728 39414373 44233030 48556553 52719465 56650582
10604E6650582L095851J980835J508429K530102N099113Q013617R408276Q620612
$$ 56650582 59746433 61727268 63235697 65765799 70864912 78878529 88286805 96907417
10596I6907417P027232O233243O057056N059445K378042j253590l247524j364157
$$ 96907417 103934649 110167892 116224948 121284393 123662435 122408845 119161321 117797164
10588A17797164L374608Q111579J0104858Q793005O592359N429923M560833K178141
$$ 117797164 121171772 129283351 139388209 148181214 154773573 160203496 164764329 166942470
10580A66942470k846463q970538j2354526j0509154n486281q12148J604966J589749
$$ 166942470 164096007 155125469 142770943 132261789 126775508 125963360 127568326 129158075
10572A29158075O13443J10989l75784k101491n606779r650769j1434664r968281
$$ 129158075 129771518 129882507 129506723 127405232 121798453 112147684 100713020 90744739
10564I0744739o780528l792085k086365j726494j806733k015127k302133l275745
$$ 90744739 83964211 80172126 78085761 76359267 74552534 72537407 70235274 66959529
10556F6959529m840287o385051o828534o254889n174730l996014l106733k380388
$$ 66959529 62119242 55734191 48905657 42650768 37476038 33480024 30373291 27992903
10548B7992903j820920j571601j286165j057729j058600r60814p58620o94415
$$ 27992903 26171983 24600382 23314217 22256488 21197888 20237074 19478454 18784039
10540A8784039o62215o69490o70056n80488n58319n48566l80305m33123m41438
$$ 18784039 18121824 17452334 16782278 16201790 15643471 15094905 14714600 14281477 13840039
10531A3840039l42455l48268l68530k60655l31830k71172k45743k63561k80948
$$ 13840039 13497584 13149316 12780786 12520131 12188301 11917129 11671386 11407825 11126877
10522A1126877j81073l18676k99456k69397j43285l38701k11930j98588k50706
$$ 11126877 10945804 10627128 10327672 10058275 9914990 9576289 9364359 9165771 8915065
10513H915065k32887k75317k40703k41024j33017r0478j19647k17816j58504j48653
$$ 8915065 8682178 8406861 8166158 7925134 7792117 7701639 7581992 7364176 7205672 7057019
10503G057019r5580n4110j15868j10811j68932j37486o6111r5641j86721j12634
$$ 7057019 6961439 6907329 6791461 6680650 6511718 6374232 6308121 6212480 6025759 5913125
10493E913125k9155j30237j09176q7532j57304p4131j99900q6710l0749p7327
$$ 5913125 5883970 5753733 5644557 5557025 5399721 5325590 5125690 5038980 5008231 4930904
10483D930904P260N6397Q385n6803r4841j08294p8684q3695p226o506l8726l8178
$$ 4930904 4938164 4994561 5002946 4946143 4851302 4743008 4664324 4580629 4573403 4566897 4528171 4489993
10471D489993J0119R516q2832k2600K6360m8064o2272K2208J4095Q7805J40041
$$ 4489993 4500112 4509628 4426796 4404196 4430556 4382492 4320220 4342428 4356523 4444328 4584369
10460D584369K75468N00191M54957L84112K81995J89123J76125J34997N6391j46164
$$ 4584369 4859837 5360028 5814985 6199097 6481092 6670215 6846340 6981337 7037728 6891564
10450F891564m23177n53131n19744n01325m02351k73471j55994j81083j57376
$$ 6891564 6468387 5915256 5395512 4894187 4491836 4218365 4062371 3881288 3723912
10441C723912j36267j33460q7790j01379j47658n4384l4479N117O2004q968q4991
$$ 3723912 3587645 3454185 3366395 3265016 3117358 3062974 3028495 3033612 3095616 3086648 3001657
10430C001657j79219j61591q4577j12316k4234J0230l1821j25451j45115r2183
$$ 3001657 2822438 2660847 2576270 2463954 2439720 2449950 2418129 2292678 2147563 2055380
10420B055380q2287p0189m915M2269J7371r906k069o1893p7284q418M1317j9218
$$ 2055380 1973093 1902904 1897989 1940258 1957629 1947723 1945654 1883761 1806477 1798059 1839376 1820158
10408A820158j15175r9426j2742n393J0432j67949j03914m9375M8656O2548O4336
$$ 1820158 1704983 1605557 1592815 1587422 1597854 1429905 1325991 1276616 1325272 1387820 1452156
10397A452156R9812m9666q9933K462n9488r058l5059m3542J23231p2818r4930
$$ 1452156 1551968 1502302 1412369 1414831 1355343 1346285 1311226 1267684 1390915 1318097 1223167
10386A223167L6449N635n0767n5154o0785k737Q5677O9740m0049n1474J2452k7725
$$ 1223167 1259616 1265251 1214484 1159330 1098545 1095808 1181485 1251225 1211176 1159702 1172154 1144429
10374A144429K9632L3064k4709j00967j00841o1845L5178O6157j04058p4664L7824
$$ 1144429 1174061 1207125 1182416 1081449 980608 918763 953941 1020098 916040 841376 879200
10363H79200m5786p959N7551m4258j7189J22444O8437O2879o5759j07109j12429
$$ 879200 833414 825455 883006 838748 821559 944003 1012440 1075319 1009560 902451 790022
10352G90022o2749N7397L5847r0634m006M4708M910L4806k3292m891n6511k3438
$$ 790022 727273 784670 820517 729883 725877 770585 775495 810301 787009 782118 725607 702169
10340G02169j4914K9141J6541p2192k3047m1119O5007M7529n0232o4599n9182
$$ 702169 687255 716396 732937 660745 637698 596579 661586 709115 658883 594284 535102
10329E35102m9073k4929K0018Q0538j1571j00867n7696L7148K2215N0864M5039
$$ 535102 486029 461100 481118 561656 550085 449218 391522 428670 450885 501749 546788
10318E46788m7359j28638M1819J03519O975m330L4744P2425Q3241o7979r1445
$$ 546788 499429 370791 412610 516129 523104 518774 553518 625943 709184 641205 549760
10307E49760p1726j4899O691l8840r7272l9622l466J588K2824K9183O0401n8142
$$ 549760 478034 463135 469826 430986 333714 294092 290626 292214 315038 344221 404622 346480
10295C46480O6470j7139J9242J08483l0572j36243j2207M7149j990l4571K6833
$$ 346480 412950 395811 415053 523536 492964 356721 344514 391663 389673 355102 381935
10284C81935m2006m8999k6910r9693m3715P37N8791N5680M1113J6962N428j00968
$$ 381935 339929 290930 264020 164327 120612 121349 180140 235820 276933 293895 299323 198355
10272A98355j41081O559J73976Q1411M5706N2519N5989k7485l2122j05238k7893
$$ 198355 57274 63833 237809 319220 364926 417445 473434 445949 413827 308589 280696
10261B80696m0327J868K7356M0240J4489m3375N5222M8248l3543O837l2690P0659
$$ 280696 240369 242237 269593 309833 324322 280947 336169 384417 350874 357711 325021 395680
10249C95680J2845k5826l6444p9478M1782K9847n896l0745n0863p9549M1010M5700
$$ 395680 408525 382699 346255 266777 308559 338406 332510 301765 250902 171353 212363 258063
10237B58063m4959Q4716O0496n1080k9700m2108n4119K6220M7651o955q1818N7347
$$ 258063 213104 297820 358316 307236 277536 235428 181309 207529 255180 248225 166407 223754
10225B23754R5951n715o8686j85964p0690R3337j2071l3049N0087J38488J23454
$$ 223754 319705 313990 245304 59340 -11350 81987 69916 36867 86954 225442 348896
10214C48896p1089j57802K0801J07994l4527l7943O5860P4068q6947p6198Q397
$$ 348896 277807 120005 140806 248800 214273 176330 242190 316258 229311 153113 161510
10203A61510q232N4272k2498j0915n2910K79L858M238k7340P2332O0079N7113
$$ 161510 153278 207550 185052 174137 121227 121506 125364 129602 102262 174594 234673 291786
10191B91786l8274m758K2774j8423N7161n2208q4187R76K5641R1615m014l0784
$$ 291786 253512 248754 271528 253105 310266 258058 173871 174847 200488 292103 288089 257305
10179B57305M2307k8550m9720j1174K3127M0983K7430J7606O488L6464j2100O5117
$$ 257305 299612 271062 221342 210168 233295 274278 301708 319314 325802 362266 350166 415283
10167D15283Q1011l1071P4502P2412k3214R0460Q6648P3515J3862O6969l9876
$$ 415283 496294 465223 539725 612137 588923 679383 766031 839546 853408 920377 880501
10156H80501n5733Q1721m818r544J11105J01467o3776L4391Q8597L9437p3536
$$ 880501 824768 906489 901671 892127 1003232 1104699 1040923 1075314 1163911 1203348 1129812
10145A129812k2076P7117N7946r2678j45119m2133L1049j5000p661j879n3605
$$ 1129812 1107736 1184853 1242799 1150121 1005002 962869 993918 978918 971257 969378 915773
10134I15773p1165p700R8101L9104m4302j26852k7429l6627M8633J1211O9268
$$ 915773 844608 836908 935009 974113 929811 802959 775530 738903 787536 798747 868015
10123H68015K5778m3183r5550n8517q5116o8167n6777l1141L6947J354k6487K7904
$$ 868015 893793 850610 755060 696543 611427 543260 486483 455342 492289 493643 467156 495060
10111D95060O301o2678K1995l242J7687j32638j3299O9439K6524M7251p900j2232
$$ 495060 501361 438683 460678 457436 475123 342485 329186 398625 425149 472400 464500 452268
10099D52268j05032m4457n2303j7799M8593J06843P8997J04873l265M6113J21769
$$ 452268 347236 302779 250476 232677 281270 388113 467110 571983 568718 614831 736600
10088G36600l4390K0471l0616l5326r7760p3243k9190M2122P0722Q8150J2785
$$ 736600 702210 722681 692065 656739 558979 485736 456546 498668 569390 657540 670325
10077F70325l8717o4029q073o0375J10k5705K928M8409Q8361Q1449J2430N6287
$$ 670325 631608 567579 559506 499131 499241 473536 476464 524873 613234 694683 707113 763400
10065G63400J59542J25279o7928k3445J94898P5438Q0883Q402J4131O389M6697
$$ 763400 922942 1048221 980293 956848 1151746 1227184 1308067 1316469 1330600 1336989 1383686
10054A383686O9847K8616l5522j27950O6145P1850q4894m7903k5141n4838O3264
$$ 1383686 1453533 1482149 1446627 1318677 1384822 1456672 1371778 1323875 1298734 1243896 1307160
10043A307160m0737j7061N6225M0337j0957j3981l2511P2071R6456P4026j0671
$$ 1307160 1266423 1249362 1305587 1345924 1334967 1320986 1288475 1360546 1457002 1531028 1520357
10032A520357N9469M5106J25291J22821K01977K67402J52323K02636J59932K59483
$$ 1520357 1579826 1624932 1750223 1873044 2075021 2342423 2494746 2697382 2857314 3116797
10022C116797K39224K94133L49151L53157L29918L10105L74941J52285P3053J23214
$$ 3116797 3356021 3650154 3999305 4352462 4682380 4992485 5367426 5519711 5592764 5715978
10012E715978M9445j267j00984r1668j71300k65548m12541j99169n2376j75705
$$ 5715978 5765423 5764156 5663172 5571504 5400204 5134656 4722115 4522946 4470570 4294865
10002D294865j28121q4151p5003n7530N818k0565r6712J2991J05977K05970J44718
$$ 4294865 4166744 4082593 4007590 3950060 3955878 3935313 3838601 3851592 3957569 4163539 4308257
9991D308257K25749K29311J38125K58672K41451L37305M77443N82914N49684O09072
$$ 4308257 4534006 4763317 4901442 5160114 5401565 5738870 6216313 6799227 7348911 7957983
9981G957983P04998P50363Q63287R92808J044978R66267R39759Q58225P33268
$$ 7957983 8662981 9413344 10276631 11269439 12314417 13280684 14220443 15078668 15811936
9972A5811936O74407L32097J74599p0315k08861m59992p43594r20696r13753q87854
$$ 15811936 16486343 16818440 16993039 16922724 16713863 16253871 15510277 14589581 13675828 12787974
9962A2787974q26757p64691o03930l54421k51058k90880k92849k69431j63322
$$ 12787974 11961217 11196526 10592596 10238175 9987117 9696237 9403388 9133957 8970635
9953H970635o7481p1072n3255J46891K02334K78181K15477L35705M17754N26952
$$ 8970635 8903154 8832082 8778827 8925718 9128052 9406233 9621710 9957415 10375169 10902121
9943A0902121O52571O58922P76569J039039J268226J372814J425208J469786J559546
$$ 10902121 11554692 12213614 12990183 14029222 15297448 16670262 18095470 19565256 21124802
9934B1124802J604296J610938J518008J349043J035576O81038M07916j78807n77187
$$ 21124802 22729098 24340036 25858044 27207087 28242663 28923701 29331617 29152810 28575623
9925B8575623q28496j109036j444211j512723j548509j563174j491754j309837
$$ 28575623 27747127 26638091 25193880 23681157 22132648 20569474 19077720 17767883
9917A7767883j045269q50752p71017n94638m88200m49359l95177k34270r9111
$$ 17767883 16722614 15871862 15100845 14506207 14018007 13568648 13173471 12939201 12840090
9908A2840090m2495K8282Q0866j8964J79245K94320M07530O06201O81786P71504
$$ 12840090 12797595 12825877 12906743 12887779 13067024 13361344 13768874 14375075 15056861 15828365
9898A5828365R75223J021629J116937J307855J520773J581900J690799J644682
$$ 15828365 16803588 17825217 18942154 20250009 21770782 23352682 25043481 26688163
9890B6688163J533321J324308J094123P57801L04560k19794p13614j064998j278531
$$ 26688163 28221484 29545792 30639915 31397716 31702276 31482482 30768868 29703870 28425339
9881B8425339j501819j525171j666920j588568j492149j419820j309300j058313
$$ 28425339 26923520 25398349 23731429 22142861 20650712 19230892 17921592 16863279
9873A6863279r61959p31477n95865n81875m95413l82684l37608l57629k52590
$$ 16863279 15901320 15169843 14573978 13992103 13496690 13114006 12776398 12418769 12166179
9864A2166179j42176r6002j040O7891M0436J57840K99544L71936M27042M78314
$$ 12166179 12024003 11928001 11926961 11994852 12035288 12193128 12492672 12864608 13291650 13769964
9854A3769964O18266P23832Q41053R99703J042346R72203Q59588P75594N43548
$$ 13769964 14388230 15112062 15953115 16952818 17995164 18967367 19826955 20602549 21146097
9845B1146097M05297L06327o3138m22922o81081r62530j090359j064564j037804
$$ 21146097 21551394 21857721 21794583 21371661 20690580 19728050 18637691 17573127 16535323
9836A6535323j076345q86710p86762p36415o15357o19522o47523n49467n61851
$$ 16535323 15458978 14572268 13785506 13049091 12433734 11814212 11166689 10617222 10055371
9827A0055371m00566l67607l17294k15175j47968j41827k19589j68414n9586r1518
$$ 10055371 9654805 9287198 8969904 8754729 8606761 8464934 8245345 8076931 8017345 7925827
9817G925827k5445J1158J68193J30512O1486R8234K11407K31340K27231K85412
$$ 7925827 7900382 7911540 8079733 8210245 8271731 8369965 8581372 8812712 9039943 9325355
9807I325355K84398J99236J75263J99589J63623j5080m5707j24408j51767k93649
$$ 9325355 9609753 9808989 9984252 10183841 10347464 10332384 10286677 10162269 10010502 9716853
9797I716853l68077m29921l65034m60662l28943k79360k99082k48306k31053k56353
$$ 9716853 9348776 8918855 8553821 8093159 7764216 7484856 7185774 6937468 6706415 6450062
9787F450062k57445k67468k94243k14670p5418m0276r9882q8469j34203j60871
$$ 6450062 6192617 5925149 5630906 5416236 5340818 5300542 5200660 5112191 4977988 4817117
9777D817117j04734j6996O3485m2379k6263J02813R9928P6758j1410m5971l4933
$$ 4817117 4712383 4695387 4758872 4716493 4690230 4793043 4892971 4969729 4958319 4912348 4877415
9766D877415q268J4709L2912J2967J3031k7100j22157P7265L6835r9131l6300
$$ 4877415 4869147 4883856 4916768 4929735 4942766 4915666 4793509 4870774 4907609 4808478 4772178
9755D772178M4781j20699j58919l2804k21539j76544j30124o3377j2971r6710
$$ 4772178 4816959 4696260 4537341 4504537 4282998 4106454 3976330 3912953 3899982 3803272
9745C803272p5595j07266o0370l0180q033r4460j25827l4665K3168q8864n4802
$$ 3803272 3727677 3620411 3560041 3529861 3521828 3427368 3301541 3266876 3290044 3201180 3146378
9734C146378R0429K8174k2498K6861o8649n8394n690P1831J8756j7652o3124m0840
$$ 3146378 3236807 3264981 3242483 3269344 3200695 3142301 3136611 3208442 3227198 3209546 3146422 3105582
9722C105582M7635J00670O6798K8678j2478n4903j10407p1885n163p2642o6276
$$ 3105582 3153217 3253887 3320685 3349363 3336885 3281982 3171575 3099690 3094527 3021885 2955609
9711B955609j93650k1837n9896n4384K5994M3611j6119q7037o6749m662n639j73589
$$ 2955609 2761959 2740122 2680226 2625842 2651836 2695447 2679328 2592291 2525542 2520880 2515241 2341652
9699B341652q6038o1290K9081l7657r6695j7295O4669N22p5439P1223n4922r2612
$$ 2341652 2255614 2194324 2223405 2185748 2089053 2071758 2136427 2136949 2061510 2132733 2077811 1985199
9687A985199L6976N6675R25o1101m5294j36p404o8293n4738J4270j6281L4678
$$ 1985199 2022175 2078850 2079775 2018674 1973380 1973244 1965840 1897547 1842809 1857079 1840798 1875476
9675A875476N857J0196k2934q1380n7669l9370P8999L4583j5796j35063k7530
$$ 1875476 1881333 1891529 1868595 1787215 1729546 1690176 1769175 1803758 1787962 1652899 1625369
9664A625369p2210p3032m5018j1233k5482K3166P5190j03216n4051J7066l2079
$$ 1625369 1553159 1480127 1435109 1423876 1398394 1421560 1496750 1393534 1339483 1356549 1324470
9653A324470M2301J31097J36676P7530J452l9160Q6118J31015p3854j09839k16174
$$ 1324470 1366771 1497868 1634544 1712074 1713526 1674366 1760484 1891499 1817645 1707806 1491632
9642A491632k64995n7295l6162o601o2393k7403k1322k6177o8275k5574l1637
$$ 1491632 1226637 1169342 1133180 1126579 1064186 1036783 1015461 989284 921009 895435 863798
9631H63798l0228k6925J6114N169m1328p790j483l8552K020M4669K2272l5253
$$ 863798 833570 806645 822759 827928 786600 778810 777327 738775 740795 785464 807736 772483
9619G72483R2476N6615m1150j30983j9695P163j4985l7750j5489r6199M2282j903
$$ 772483 864959 921574 880424 749441 729746 736909 721924 684174 668685 572486 614768 612865
9607F12865j26422l1418Q2569M662J10867l1082k4925n7391j46534M2044N3826
$$ 612865 486443 455025 537594 542256 653123 622041 597116 539725 393191 435235 489061
9596D89061j8235R441m4389N752j5446P4369M9220m4810n7091j19704n0734n5050
$$ 489061 470826 480267 435878 441630 426184 500553 549773 504963 447872 328168 277434 222384
9584B22384M5549P3121O6937L9706k0035Q572L9769j00361j46744l1091R641M6682
$$ 222384 267933 341054 407991 447697 427662 436234 476003 375642 228898 197807 207448 254130
9572B54130P5834N7159r3203p59R484j03551m8305R0961N3444q44N2028M4372
$$ 254130 329964 387123 293920 293161 302645 199094 150789 241750 295194 294350 346378 390750
9560C90750j3926P091k5420n0910j3312q8228q9190J9474J20896R6790M1621n3795
$$ 390750 376824 383915 358495 307585 294273 206045 116855 136329 257225 354015 395636 341841
9548C41841r5177p2264O727K187r8278J04751l4482M00k5462q8173k1538J0175
$$ 341841 246664 174400 181127 183314 85036 189787 155305 155705 130243 42070 20532 30707
9536C0707M6915L6042L349N3079J00053q12k6533o01j8036L9177l0239o9748n822
$$ 30707 77622 113664 117013 170092 270145 269333 242800 242199 224163 263340 233101 163353 157531
9523A57531J721N6232N1210m704k852j2339j43103j4937O07j939M2991j6475j03022
$$ 157531 159252 215484 266694 261990 259138 246799 103696 88759 89366 87427 130418 113943 10921
9510A0921l3710Q9267m4263j7926P4946L3697O8321p1282N471N5708r881k3394
$$ 10921 -22789 66478 22215 4289 79235 112932 181253 109971 115442 171150 161269 137875
9498A37875r9382M3535j0409j07939M7282m1078k4458R1914N6102j04876N6240
$$ 137875 38493 82028 71619 -36320 10962 -30116 -54574 37340 93442 -11434 44806
9487D4806J23675k2743j1179M825j09378q8407L1921J33177Q4281O0522K8876
$$ 44806 168481 145738 134559 139384 30006 -58401 -26480 106697 190978 251500 280376
9476B80376j01728n0146o229J11895l0800n973k9404L1033J2067O635J9862K895
$$ 280376 178648 128502 122273 234168 203368 197395 167991 199024 211091 217726 237588 240483
9464B40483p0385K9338k8981p0467r0323K9439q299J24031O8314m8880n8917J7535
$$ 240483 170098 199436 170455 99988 9665 39104 30805 154836 223150 174270 115353 132888
9452A32888k6424J6161k6006k1107J9069o6428o1182J3697L2558M7644k1416o455
$$ 132888 106464 122625 96619 75512 94581 28153 -33029 -19332 13226 60870 39454 32999
9440C2999R2758q9002n2037k2062m2503M7599P2124P965l6989o1727R5508R7835
$$ 32999 125757 36755 -15282 -37344 -79847 -32248 39876 47841 10852 -50875 44633 142468
9428A42468K6079l8969m1585J7581K2177K7115L4277N3670L7397l5642K6790O2416
$$ 142468 168547 129578 87993 105574 127751 154866 189143 242813 280210 244568 271358 333774
9416C33774j8918r6448k1549q632r8009j1735N1975O1172J04691j17003r5950
$$ 333774 314856 218408 196859 188227 90218 78483 130458 191630 296321 179318 83368
9405H3368K1299M5998O4986J8762J45303l942m1520l9171m70q0734r892K397j62499
$$ 83368 104667 150665 215651 234413 379716 375774 334254 295083 294613 213879 203987 206384 43885
9392D3885l6103P9897N9929R188J2808j30228p7671j1803J6371p379j1029P7454
$$ 43885 7782 87679 147608 156796 169604 39376 -38295 -50098 -33727 -41106 -52135 25319
9380B5319M6209m2758O1396K8204J4991N693J04443n3257o0705o9627J6275p1154
$$ 25319 71528 28770 90166 118370 133361 139054 243497 190240 129535 59908 76183 5029
9368E029j06013J16236J71978j26907k7784M9481M4578O4396r218r2491k3697
$$ 5029 -100984 15252 187230 60323 32539 82020 126598 190994 181776 89285 65588
9357F5588N3169M5930P1510J9305j10539O811q4357k0549M065r071N0808K2081
$$ 65588 118757 164687 236197 255502 144963 151774 67417 46868 50933 41862 92670 114751
9345A14751K3825k9259r3871j00222p4398L1504N729R6259J6318q7132o3620K7927
$$ 114751 138576 109317 15446 -84776 -159174 -127670 -121941 -25682 -9364 -96496 -160116 -132189
9333a32189P3784O9352K6675l8694P060n2649k9135k9432M2883J9705J6715P2394
$$ -132189 -58405 10947 37622 -1072 5988 -46661 -75796 -105228 -62345 -42640 -25925 46469
9321D6469l7334l99L3845P035j7912j782L7694K7301j2682J08524L7517r8299
$$ 46469 9135 8736 42581 49616 31704 29922 67616 94917 82235 190759 228276 129977
9309A29977n0764k0118j10955L2556k757k4540m9560N0845o3222j6481O0811L3784
$$ 129977 79213 59095 -51860 -19304 -22061 -46601 -96161 -45316 -108538 -125019 -64208 -30424
9297c0424k1899j9974M0381R9091n8849K0003m1788N457p5673j3987M4051M1135
$$ -30424 -52323 -72297 -31916 67175 8326 28329 -13459 -8002 -83675 -97662 -53611 -12476
9285a2476O7119K6940n5224p9531o0754N1403j9772m4231j8196K1301J24552L3173
$$ -12476 54643 81583 26359 -53172 -113926 -62523 -82295 -126526 -144722 -123421 1131 34304
9273C4304q6695m582J4930j2794L7839j7692J3493M6387M5579j5743j5374n2596
$$ 34304 -52391 -56973 -42043 -54837 -16998 -34690 -21197 25190 70769 55026 39652 -12944
9261a2944J8051J7183L1405j0394N1710K820p9298M4788J7759j2582q8457R1214
$$ -12944 5107 22290 53695 43301 95011 97831 18533 63321 81080 68498 -19959 71255
9249G1255J33956r8650n8582J4031n2807J819p298L6717o3410N3584O9395L9543
$$ 71255 205211 106561 47979 62010 9203 11022 3724 40441 -22969 30615 100010 139553
9237A39553n8874q6442p2753k2607N2010L5667P4196N3430J23071L509k6778j9473
$$ 139553 80679 -5763 -78516 -101123 -49113 -13446 60750 114180 237251 240760 213982 194509
9225A94509k3528j18761j06010m5299k8236j0447N9583L2508L047p1808O1553
$$ 194509 170981 52220 -53790 -99089 -127325 -137772 -78189 -45681 -42634 -114442 -52889
9214e2889R0035j1798l3125K4562P4139L855l7984j4752K8462l6675o6209n8686
$$ -52889 37146 25348 -7777 16785 90924 94779 56795 42043 70505 33830 -32379 -91065
9202i1065M6934J25869M2408N0528J0572j46169j04837R0543Q315o5023j6342
$$ -91065 -44131 81738 124146 174674 185246 39077 -65760 24783 33098 -31925 -48267
9191d8267k6347j286P933L1255N5167N5882J0058l1238r0879L6861m679o272l1941
$$ -48267 -74614 -75900 -67967 -36712 18455 74337 84395 53157 -37722 -861 -5540 -11812 -43753
9178d3753L3521P4001N7255j21890m6619j3613Q7970P3868q2749o6780n0899J10027
$$ -43753 -10232 63769 121024 -866 -47485 -61098 26872 100740 17991 -48789 -99688 10339
9166A0339J41759r9892j8340j30949q3357J54202o224q634l4609P022J07354K7923
$$ 10339 152098 52206 33866 -97083 -180440 -26238 -32462 -41096 -75705 -68683 38671 66594
9154F6594j30474j14476o1046Q1680M4053N0952j21007l1028J04941P9790l3857
$$ 66594 -63880 -178356 -239402 -157722 -113669 -62717 -183724 -214752 -109811 -30021 -63878
9143f3878q281N1566L3330R488L0446m6769p2791P8672n4709q6350J4659J8722
$$ -63878 -72159 -20593 12737 22225 52671 5902 -66889 11783 -42926 -129276 -114617 -95895
9131i5895K7382K0582K3579j2296M7724P5998K4725N337J0301r9240k7803k2877
$$ -95895 -68513 -47931 -24352 -36648 11076 87074 111799 117136 127437 28197 394 -22483
9119b2483k0098j1915r110J06385K7425l8510l6489k1242m046P6990j3110m1396
$$ -22483 -42581 -54496 -63606 42779 70204 31694 -4795 -26037 -30083 46907 33797 -7599
9107g599P930R1248j0356q692p4420n9918N4954L201O3002K7715j8936K1961o7557
$$ -7599 331 91579 81223 72531 -1889 -61807 -6853 -3652 59350 87065 68129 90090 22533
9094B2533k6364o2483n3748Q8080Q0475J12136P9773p1123r6177L9608k1323p0520
$$ 22533 -3831 -66314 -120062 -31982 48493 160629 240402 169279 73102 112710 91387 20867
9082B0867o5006M7667o2086m9211N4809N4103K9259n9533o366J3295l1345J6874
$$ 20867 -44139 3528 -58558 -107769 -52960 1143 30402 -29131 -35497 -22202 -53547 -36673
9070c6673J1232N2570J8145K0459l0779m5248k6569M1322l6085n6254o0643O412
$$ -36673 -25441 27129 45274 65733 34954 -10294 -36863 4459 -31626 -87880 -148523 -142111
9058a42111m7644P4048k3922j8609O2825M2083J7721P26N8213R6189K407j30976
$$ -142111 -189755 -115707 -139629 -158238 -95413 -53330 -35609 -34883 23330 119519 121926 -9050
9046i050q4161k4755Q2667l9301o349k1119m9023P2044J35263N1080l6350N4750
$$ -9050 -93211 -117966 -35299 -74600 -80949 -102068 -151091 -79047 56216 107296 70946 125696
9034A25696N3375K0605l0732m3791q8863l3439j5650o0998L8346P7115O7673L5198
$$ 125696 179071 199676 168944 125153 36290 2851 -12799 -73797 -35451 41664 109337 144535
9022A44535k0606k8175r9176m2589J6958N8145J21563P8611j17803j02350j6419
$$ 144535 123929 95754 -3422 -46011 -29053 29092 150655 229266 111463 9113 -7306
9011g306l377L7833J3051k3979j1222j2662m8867M9511M1649j4223Q908K3428
$$ -7306 -10683 27150 40201 16222 5000 -7662 -56529 -7018 34631 20408 29316 52744
8999E2744k3233m0304j8307k4453N0923Q6774J2438j13756q1501k7007J72456
$$ 52744 29511 -10793 -29100 -53553 -2630 84144 96582 -17174 -98675 -125682 46774
8988D6774J3446m0271n9872M577j6877O5063L5818k5812p2433j24841J3597J68941
$$ 46774 60220 19949 -39923 -35346 -52223 12840 48658 22846 -49587 -174428 -160831 8110
8976H110m595j07712M1366J25482J00571m4405l647l3711l342l0259N1686Q8248
$$ 8110 3515 -104197 -62831 62651 163222 118817 115170 81459 78117 47858 99544 187792
8964A87792p2578p9833K856k9706J5044J20527P9969m7355k3473J7204k1191K5975
$$ 187792 115214 35381 38237 8531 23575 144102 224071 176716 153243 170447 149256 175231
8952A75231P116j04013n5916J4086M7446q1418j7685J0600p035l2699o0748j8132
$$ 175231 182347 78334 22418 36504 83950 2532 -15153 -4553 -11588 -44287 -105035 -123167
8940a23167J02164M2996p7416n2340N406K2080L8091r987K4863R833R1914k4393
$$ -123167 -21003 21993 -55423 -107763 -102357 -80277 -42186 -52173 -27310 -17477 74437 50044
8928E0044L131r38l6423J1570M5880O9367L5468J7490p7616j2516L6458J8540
$$ 50044 53175 52237 15814 27384 73264 142631 178099 195589 117973 105457 141915 160455
8916A60455l9998o5248l6730J3878K7088o1343K6982J4008J5492n8331r7722K4680
$$ 160455 120457 55209 18479 32357 59445 -1898 25084 39092 54584 -3747 -101469 -76789
8904g6789N3947K7008K50N7197k3747k1299m5300M6971L0399K4564o7407m9116
$$ -76789 -22842 4166 4416 61613 37866 16567 -28733 18238 48637 73201 5794 -43322
8892d3322Q7301P822q5221j0265J3426L192l0138N9773P3800J767k4975j03965
$$ -43322 43979 51801 -33420 -43685 -30259 -27067 -57205 2568 76368 78135 53160 -50805
8880e0805q6452K7276P4290M4808J04184J08376n0229j35037k7079J38018K2746
$$ -50805 -137257 -109981 -35691 9117 113301 221677 171448 36411 9332 147350 170096
8869A70096p0098K4769k2825n2724k0584m2424R407P575r461l2120R8103O1220
$$ 170096 99998 124767 101942 49218 28634 -13790 -4383 3192 -6269 -38389 59714 120934
8857A20934o9487n3454M6892J8302K6408J571O0686l771M7108m9683m4679o3647
$$ 120934 51447 -2007 44885 63187 89595 91166 151852 148081 195189 145506 100827 37180
8845C7180J8189L2454R9278K2411J1376J3908m1191o9139l14o34j8110l5059j47009
$$ 37180 55369 87823 187101 209512 220888 234796 193605 124466 124152 123518 105408 70349 -76660
8832g6660m8360L3936Q7925N7082l1431j589J06647J13369J06168M573o4109l3843
$$ -76660 -125020 -91084 -3159 53923 22492 20903 127550 240919 347087 351660 287551 253708
8820B53708m2070q5356p2701J13071m8063m3162R5660J382r3017K1488r1967L1184
$$ 253708 211638 126282 53581 166652 118589 75427 171087 172469 79452 100940 8973 40157
8808D0157q6182j62P6374O2760j0399Q2715J18384J2108p0926n0000p024m5506
$$ 40157 -46025 -46187 30187 92947 82548 165263 283647 295755 224829 174829 167805 122299
8796A22299r3030j7028R8622o2408j5385P2161j9985o694p1067l7278O6078M8966
$$ 122299 29269 12241 110863 48455 33070 105231 85246 78552 7485 -29793 36285 85251
8784H5251M5084k8717j397k1718j6783Q6099N3550l4191k237J5658o6963j8444
$$ 85251 130335 101618 100221 78503 61720 147819 201369 167178 164941 180599 113636 95192
8772I5192N7190k2635j24539m7758R3089N6570l4517j21022k2830P4121J48591
$$ 95192 152382 129747 5208 -42550 50539 107109 72592 -48430 -71260 2861 151452
8761A51452L9895j8091j8836j37653r036M4395J19995k1967p1386O312l7985l5977
$$ 151452 191347 173256 154420 16767 7731 52126 172121 150154 78768 85080 47095 11118
8749A1118k417J9958p9494J6142J02755J5078j045j68676n6756M4317R9149p1223
$$ 11118 8701 28659 -50835 -34693 68062 83140 82095 -86581 -143337 -99020 129 -71094
8737g1094m5925M3984P1239O1446L1333n4642j1761l5458m4377J26826P9297o7732
$$ -71094 -117019 -73035 -1796 59650 90983 36341 24580 -10878 -55255 71571 150868 83136
8725H3136j52103l376O99M8663N7089O0156j515J2320j7082O4055K0106p9006
$$ 83136 -68967 -72343 -71644 -22981 34108 94264 92749 105069 87987 152042 172148 93142
8713I3142Q882J7284k5422k9323o5721K2151o2510K2626j4056L3856M4587L8819
$$ 93142 102024 119308 93886 64563 -1158 20993 -41517 -18891 -32947 909 45496 84315
8701H4315j1035N6591k8241J9183Q9978K1762k341q9804L985k6937n0261l3992
$$ 84315 73280 129871 101630 120813 210791 232553 230212 140408 144393 117456 67195 33203
8689C3203p8901j6004P0527K1426j04K2443n1070N175M6875N5364J8058p4087
$$ 33203 -45698 -61702 8825 30251 30147 52590 1520 6695 53570 108934 126992 52905
8677E2905M4708J0533l9476L7685p9324n6458K0955l0348o8329m1135Q3675J45955
$$ 52905 97613 108146 68670 106355 27031 -29427 -8472 -38820 -107149 -148284 -64609 81346
8665H1346Q9722l7509n2005R196o3426J3602O1392O7020M78n8876p6785l1388
$$ 81346 171068 133559 81554 90750 27324 40926 102318 169338 169816 110940 34155 2767
8653B767L0532J2874J30567o1236P472J52j6094M9883L4699j4850m411j08861
$$ 2767 33299 46173 176740 115504 122976 123128 107034 156917 191616 176766 172355 63494
8641F3494q2478k368N2723N6345K5086O3665p809l2938l4275K5257K7797n4739
$$ 63494 -18984 -21352 31371 87716 112802 176467 168658 135720 101445 126702 154499 99760
8629I9760r1201j5198J6684J09825O0767k9868M6230n8033K7284K9440j099J453
$$ 99760 8559 -6639 10045 119870 180637 150769 196999 138966 166250 195690 194591 196044
8617A96044q5542j9170j7728n244L5382k5556j1210k5166O2513M3335n1213O0932
$$ 196044 110502 91332 73604 68360 103742 78186 66976 41810 104323 147658 96445 157377
8605A57377O8481K944J5563n7936n7867L5677Q8425K1502Q309P3034k5654j3078
$$ 157377 225858 228802 244365 186429 128562 164239 252664 274166 282475 355509 329855 316777
8593C16777M1836n5016p2817m1363k5771j039r4958P908K0650L9851Q6886L822
$$ 316777 358613 303597 230780 189417 163646 162607 67649 75557 96207 136058 222944 226766
8581B26766n8887n7375L9818k7976J03406J13674K3297k8870j4456j9669m5841
$$ 226766 167879 110504 150322 122346 225752 339426 362723 333853 319397 299728 253887
8570B53887j5729L6320J7069K1468n992l0919l3537N6402M8951j6236q9065m7775
$$ 253887 238158 274478 291547 313015 307023 276104 242567 298969 347920 331684 242619 194844
8558A94844M61N6547j05201l7597N6542K0329j1769j6133Q8117Q0071n5288l2869
$$ 194844 195305 251852 146651 109054 165596 185925 174156 158023 246140 326211 270923 238054
8546B38054j3585j83244P764N297j0369L9296O8404J47682J58984N462j29517
$$ 238054 224469 41225 48989 54286 43917 83213 151617 299299 458283 463745 334228
8535C34228n4054N599J9385l371o214K5928o794J9503o1393k982K4669K169n4642
$$ 334228 280174 285773 305158 301787 295573 321501 314707 334210 272817 269835 294504 296673 242031
8522B42031O49l3064n9995M7379K3921j0996L006M4648R454L7735l6813k6704
$$ 242031 242680 209616 149621 197000 220921 209925 212931 257579 267033 304768 267955 241251
8510B41251L2421O6547P3023P2115k594q6592L4191j0876p6598N8765R4210R1753
$$ 241251 273672 340219 413242 485357 482763 396171 430362 419486 342888 401653 495863 587616
8498E87616j0143J0604L3105k2857J5418J58937k009j1135M3488J35364J35689
$$ 587616 577473 588077 621182 598325 613743 772680 770671 759536 803024 938388 1074077
8487A074077J55388J80283Q1899P0254J57078J55075J54504O3760n8893j67244
$$ 1074077 1229465 1409748 1491647 1561901 1718979 1874054 2028558 2092318 2033425 1866181
8477A866181J3589O0139j22957j41629j66506j80266j00539l802p0849j11202
$$ 1866181 1879770 1939909 1816952 1675323 1508817 1328551 1228012 1224210 1153361 1042159
8467A042159k1380l7503Q68j34421k1237P3730p914r7624j02885k7825Q3264L3111
$$ 1042159 1020779 983276 984144 849723 828486 902216 894302 796678 693793 665968 749232 782343
8455G82343O0701Q3037P7431k5715n8586j7280J09075Q5594N793Q052J79773L02916
$$ 782343 843044 926081 1003512 977797 919211 901931 1011006 1096600 1102393 1110445 1290218 1593134
8443A593134J66100p5764k8209k1137Q6348L8163P5058K9716n4158P9129j21350
$$ 1593134 1759234 1683470 1655261 1634124 1720472 1758635 1833693 1863409 1809251 1888380 1767030
8432A767030j09922M3845j54546k38159m6919l8309q2342j65197k04808j42105
$$ 1767030 1657108 1700953 1546407 1308248 1261329 1223020 1140678 975481 770673 628568
8422F28568k4584L9604K0068J6129k8098K2117r1176j32382o5068O5663K6613
$$ 628568 603984 643588 663656 679785 651687 673804 582628 450246 385178 450841 477454
8411D77454Q5127P5357j333P024m1759l7945n5029n2374j18700N8315J01970O7506
$$ 477454 562581 637938 636605 643629 601870 563925 508896 456522 337822 396137 498107 565613
8399E65613M5543J20372r3955j46147M2852J3144k5238l493J28354j6219p0273
$$ 565613 611156 731528 637573 491426 534278 547422 522184 518691 647045 630826 560553
8388E60553M2972o2500J2174k8068K0696j07576j31237J08837N0614J5255P4577
$$ 560553 603525 541025 553199 525131 545827 438251 307014 415851 466465 481720 556297
8377E56297O806r4569J4511J04118J6728o981k7505J9762K5884Q7571q3141m516
$$ 556297 563103 468534 483045 587163 603891 596910 569405 589167 615051 702622 619481 614965
8365F14965O987n50q1339q094j32915p9549Q3687J11639Q2782L636J54757J10000
$$ 614965 621952 621402 540063 531969 399054 319505 403192 514831 597613 601249 756006 866006
8353H66006l5874o6093o6055M3726k7060k6792n3598o780K9550J13182K1521J3038
$$ 866006 830132 764039 697984 741710 714650 687858 634260 627480 657030 770212 791733 804771
8341H04771N2241M1695j1585j36219J9794L0003J3479k115o1346k4654n714q5459
$$ 804771 857012 898707 887122 750903 770697 800700 814179 812064 750718 726064 720350 634891
8329F34891o6891k7322k2770m9932k0037L8447P5635O8270j0692o560k1122j1367
$$ 634891 568000 540678 517908 467976 447939 486386 562021 630291 619599 613039 591917 580550
8317E80550M2668M8630k5959p6569l3532K9989R0149r8276m9152R2822Q1761k7385
$$ 580550 623218 671848 645889 569320 535788 565777 655926 557650 508498 601320 683081 655696
8305F55696j16189M4482L9380M0603Q932L2807P9070l4161r6858O2876J28068
$$ 655696 539507 583989 623369 663972 672904 705711 784781 750620 653762 716638 844706
8294H44706k3692n6913l3912K725N9839J8475M4306o2084r6449n5803j2411N938
$$ 844706 821014 764101 730189 732914 792753 811228 855534 793450 697001 641198 628787 634725
8282F34725p6029m8014l3199Q0164P831j1954j623M7739N4425K1660K2045O5141
$$ 634725 558696 510682 477483 557647 565478 553524 551901 599640 654065 675725 697770 762911
8270G62911L2528j4962Q404M8142q2311P203k9289K7285Q0954n0418M8108N1016
$$ 762911 795439 780477 788881 837023 754712 761915 732626 759911 840865 790447 838555 889571
8258H89571j20967o2453q8357L6263J86246P7101L9378K0718j36160r7257M2200
$$ 889571 768604 706151 617794 654057 840303 917404 956782 977500 841340 744083 786283
8247G86283N384R6110k8305l340n802Q4171Q5385K6427o519L2038J8185N6740
$$ 786283 791667 887777 859472 856132 850330 934501 1019886 1046313 1039794 1071832 1090017 1146757
8235A146757J5167K2884J14079K02289R2085J1619o6859J24130J09725N7248J11397
$$ 1146757 1161924 1184808 1298887 1501176 1593261 1604880 1538021 1662151 1771876 1829124 1940521
8224A940521J22946J86135K32705J65470K16684J98420J07868K50387L04673K71738
$$ 1940521 2063467 2249602 2482307 2647777 2864461 3062881 3170749 3421136 3725809 3997547
8214C997547K81027J50267M8122r0806M616n0242l8035K61j10680n3193j95387
$$ 3997547 4278574 4428841 4476963 4386157 4390773 4340531 4302496 4302757 4192077 4138884 3943497
8203C943497o8385n1947j59930j59942q837o8500n7835j8050o8272N4118J01401
$$ 3943497 3875112 3823165 3663235 3503293 3494456 3425956 3368121 3350071 3281799 3335917 3437318
8192C437318M31q8060O1353Q2621P2297M2252L6498q074M6959J72791R8834Q936
$$ 3437318 3437749 3349689 3411042 3493663 3565960 3608212 3644710 3636636 3683595 3856386 3955220 3964156
8180C964156K06645J70300J30479K39539K30857K81772L87204K56843J07856M4798
$$ 3964156 4170801 4341101 4471580 4711119 4941976 5223748 5610952 5867795 5975651 6020449
8170F020449J14262J07268J54492J08319o0047p5213j3228j6953r1197j42600
$$ 6020449 6134711 6241979 6396471 6504790 6444743 6369530 6356302 6339349 6248152 6105552
8160F105552n4150k2671o150l7969r9572j0737L1013J43717J75882K7360k0817
$$ 6105552 6051402 6028731 6022581 5984612 5885040 5874303 5905316 6049033 6224915 6252275 6231458
8149F231458o863J63560J12276K3397l2941J69416J69604K76131K02895K22068
$$ 6231458 6224595 6388155 6500431 6523828 6490887 6660303 6829907 7106038 7308933 7531001
8139G531001J56219K42147K22033L11681L35344J77696J97715K38753K64087L53769
$$ 7531001 7687220 7929367 8151400 8463081 8798425 8976121 9173836 9412589 9676676 10030445
8129A0030445L44248L49251L90204M27241M39161N83259O90646O59504O75425
$$ 10030445 10374693 10723944 11114148 11541389 11980550 12563809 13254455 13913959 14589384
8120A4589384Q03590P31004Q32920R85692J035772J159732J339270J501779J672391
$$ 14589384 15392974 16123978 16956898 17942590 18978362 20138094 21477364 22979143 24651534
8111B4651534J789797K084654K454312K782335L044303L508708L996918M492517
$$ 24651534 26441331 28525985 30980297 33762632 36806935 40315643 44312561 48805078
8103D8805078N090717N909496O814411P907259R198590J0965967J2928164J5469633
$$ 48805078 53895795 59805291 66619702 74526961 83725551 94691518 107619682 123089315
8095A23089315J8444520K1736315K5172214K8259828L0215556L0516893K8353527
$$ 123089315 141533835 163270150 188442364 216702192 246917748 277434641 305788168
8088C05788168K4056060J8428954J1929196M351141m216316j3123000k0710217
$$ 305788168 329844228 348273182 360202378 364553519 360337203 347214203 326503986
8081C26503986k5334965k7074425k6122828k3672723k0582646j7465886j4631892
$$ 326503986 301169021 274094596 247971768 224299045 203716399 186250513 171618621
8074A71618621j2249131j0250899q567364p046446n986972n107779m265274l269374
$$ 171618621 159369490 149118591 140551227 133504781 127517809 122410030 118144756 114875382
8066A14875382k426041j719209j072054k94453M28000J135519J973031K843046
$$ 114875382 112449341 110730132 109658078 109363625 109791625 110927144 112900175 115743221
8058A15743221L851337N113738O480580P960044R993785J2376894J4955517J8009173
$$ 115743221 119594558 124708296 131188876 139148920 149142705 161519599 176475116 194484289
8050A94484289K1275764K4307824K6485985K7124878K5604565K2007755J6815935
$$ 194484289 215760053 240067877 266553862 293678740 319283305 341291060 358106995
8043C58106995J0613950L688866m007373j2418163j9992567k5370666k7765219
$$ 358106995 368720945 372409811 368402438 355984275 335991708 310621042 282855823
8036B82855823k7332501k5159510k2004375j8894459j6070807j3599222j1645691
$$ 282855823 255523322 230363812 208359437 189464978 173394171 159794949 148149258
8029A48149258r980640q579645p565743o659704n822843n303724m793553m401687
$$ 148149258 138168618 129588973 122023230 115363526 109540683 104236959 99443406 95041719
8021I5041719l927103l586752l381336k972575k591786k253234k079445j935038
$$ 95041719 91114616 87527864 84146528 81173953 78582167 76328933 74249488 72314450
8013G2314450j810123j592571j524567j306673j284487j073279j001006j019850
$$ 72314450 70504327 68911756 67387189 66080516 64796029 63722750 62721744 61701894
8005F1701894r04156q82381r12833r39990q40330q23699q52833q15209p31232
$$ 61701894 60797738 59915357 59002524 58062534 57222204 56398505 55545672 54730463 53999231
7996E3999231p64023q47521p55828p41816q05136o99559p17134n33430o76012
$$ 53999231 53235208 52387687 51631859 50890043 50084907 49385348 48668214 48134784 47458772
7987D7458772o35103o75687o96656o46678p27831o77525o49150o59687o11737
$$ 47458772 46823669 46147982 45451326 44804648 44076817 43399292 42750142 42090455 41478718
7978D1478718n51566n85324n43801m81334n35412n15099l02908k64053l54590
$$ 41478718 40927152 40341828 39798027 39316693 38781281 38266182 37963274 37699221 37344631
7969C7344631k75095j00009j39523j30033j31092p9760j92193j28320j43899k69865
$$ 37344631 37069536 36969527 36830004 36699971 36568879 36489119 36296926 36168606 36024707 35754842
7959C5754842k35757l39254n09361n03760m70954l72658m41739n40351m88090
$$ 35754842 35519085 35179831 34670470 34166710 33695756 33323098 32881359 32341008 31852918
7950C1852918n22203m73064m36179l79657l70187o32712n02750m58703n82231
$$ 31852918 31330715 30857651 30421472 30041815 29671628 29038916 28536166 28077463 27495232
7941B7495232o26139n82528n36746o68790n73961o39063o67374n67148o09361
$$ 27495232 26869093 26286565 25749819 25081029 24507068 23868005 23200631 22633483 22024122
7932B2024122o25067o09161o51993n44598m05265m92875m91868m89927l35168
$$ 22024122 21399055 20789894 20137901 19593303 19188038 18695163 18203295 17713368 17378200
7923A7378200l90115k84989k13697k03276l53836l43123l28355m69196l26191
$$ 17378200 16988085 16703096 16489399 16286123 15932287 15589164 15260809 14791613 14465422
7914A4465422l42447n04329l78553l88810m38702l38933l04979k67609l51664
$$ 14465422 14122975 13618646 13240093 12851283 12412581 12073648 11768669 11501060 11149396
7905A1149396l04534j73327j77198j65667k23299k65506j73092k47857k42915
$$ 11149396 10844862 10671535 10494337 10328670 10105371 9839865 9666773 9418916 9176001
7896I176001k33950j72611j72996q1182k38772k56850q4385j00710p9900q2423
$$ 9176001 8942051 8769440 8596444 8515262 8276490 8019640 7935255 7834545 7754645 7672222
7886G672222k32693j34166o4356j77036j36495j44188j65086j21439k45869k4537
$$ 7672222 7439529 7305363 7241007 7063971 6927476 6783288 6618202 6496763 6250894 6226357
7876F226357N6933j00683k55966k33720p8864n0034o7060p1118j27468j51019
$$ 6226357 6283290 6182607 5926641 5692921 5614057 5564023 5496963 5425845 5298377 5147358
7866E147358k8841o8606r1763r8016j10753N349n9199j20951m9720p7046k0993
$$ 5147358 5118517 5049911 4958148 4860132 4749379 4754728 4695529 4574578 4524858 4447812 4426819
7855D426819m0317r4378j40074q9101o6945l3267j4465j1707j01696r0588l2994
$$ 4426819 4386502 4292124 4152050 4062949 3996004 3962737 3948272 3936565 3834869 3744281 3711287
7844C711287q075p8722m5631q8046k6261J6748l6507r5862p4593k6340l7929m744
$$ 3711287 3703212 3624490 3578859 3490813 3464552 3481300 3444793 3348931 3274338 3247998 3210069 3205325
7832C205325o3101J9631m2520n7498q9461o7139K004k0030q1583q2396L329M2533
$$ 3205325 3142224 3161855 3119335 3061837 2972376 2905237 2907241 2887211 2805628 2723232 2726561 2769094
7820B769094p502l4072n0774q8826q0383m0151o1595j3906N8818p98n3008l0608
$$ 2769094 2761592 2727520 2676746 2587920 2507537 2467386 2405791 2391885 2450703 2449905 2396897 2366289
7808B366289j65320j04865M8661j69159m6291O5745o7778K2150k3527l8603k8994
$$ 2366289 2200969 2096104 2144765 1975606 1929315 1995060 1927282 1949432 1925905 1887302 1858308
7797A858308N3922m3851M811r155k5529p4931n9981r3707L0157q498j6207M5390
$$ 1858308 1912230 1868379 1873190 1864035 1838506 1763575 1703594 1609887 1640044 1631546 1615339 1660729
7785A660729q573l1302L3063o4031M2908m743K0949j14302j6971k635M3631K8624
$$ 1660729 1652156 1620854 1653917 1589886 1632794 1628051 1649000 1534698 1517727 1515092 1558723 1587347
7773A587347j99289j6881o6040Q235m6213j35330k4232K6787r7705Q5436J22218
$$ 1587347 1388058 1371177 1305137 1313372 1267159 1131829 1107597 1134384 1036679 1122115 1244333
7762A244333k5043j09397j5481J1173M8125j5711R654J4771l218o6573K095K9135
$$ 1244333 1219290 1109893 1094412 1105585 1153710 1137999 1147653 1162424 1159206 1092633 1094728 1123863
7750A123863j5147l5250j40945k706O8650O2815l0578p4191r9029K5454K1469
$$ 1123863 1108716 1073466 932521 929815 998465 1061280 1030702 956511 857482 882936 904405
7739I04405j460k5869M556n763l910L7259N5614o7548o9915k2859K1741M8942
$$ 904405 902945 877076 881632 875869 871959 909218 964832 897284 827369 804510 826251 875193
7727H75193n0968p9404J9733j3509M3375P3558m263J6802j0951n6162K6046j1607
$$ 875193 824225 744821 764554 751045 794420 867978 863715 880517 869566 813404 839450 827843
7715H27843P3893R7214n5075j71279j24186O2380J2510N1047O8315l8844N6249
$$ 827843 901736 998950 943875 772596 648410 710790 723300 774347 842662 803818 860067
7704H60067J13971m591m495M1270Q346j05700N4586Q5943J90214N5487K4839N7124
$$ 860067 974038 969447 964952 1006222 1014568 908868 963454 1049397 1239611 1295098 1319937 1377061
7692A377061J63404K22278J41645J80551J18405K5823J6274J3539N2720n30j10391
$$ 1377061 1540465 1762743 1904388 2084939 2203344 2229167 2245441 2258980 2311700 2311170 2200779
7681B200779j78751o6718P8147j47510j45338o5882j18628j49352m9202r755o932
$$ 2200779 2022028 1955310 2033457 1885947 1740609 1674727 1556099 1406747 1357545 1347790 1340858
7670A340858l3503j12048l3831J6690j0160k2517j6660l0678j17380k5638K5767
$$ 1340858 1307355 1195307 1161476 1178166 1168006 1145489 1128829 1098151 980771 955133 980900
7659I80900N4349j5997K8477M2882j9173J17022J39349P2004n2749O5297Q2448
$$ 980900 1035249 1019252 1047729 1090611 1071438 1188460 1327809 1399813 1347064 1412361 1494809
7648A494809M0625J12561K09493J37762J05786M3387j6732p3290J1503j32753
$$ 1494809 1535434 1647995 1857488 1995250 2101036 2144423 2127691 2054401 2065904 1933151
7638A933151n6280o6340k81968j46081n2803j1522k2817o1415j04872m9652j13449
$$ 1933151 1876871 1810531 1528563 1382482 1329679 1318157 1295340 1233925 1129053 1079401 965952
7627I65952m7043l4672K2448J5374n1359J3053r6094q0723m8613l729J9780M7972
$$ 965952 918909 884237 906685 922059 870700 883753 787659 706936 658323 654594 674374 722346
7615G22346L9616o9853l1103k34n5319K2439K8845M4636l5620k7953j8795j3651
$$ 722346 761962 692109 661006 660772 605453 627892 656737 701373 665753 637800 619005 605354
7603F05354Q6606j8583k6505q7513K0132K7916o1943m1277J13094L630l8203j1605
$$ 605354 691960 673377 646872 559359 579491 607407 545464 504187 617281 620911 582708 571103
7591E71103J4083j01017o4718j3856j1013k4117P8694L3871l7520j5529J0024
$$ 571103 585186 484169 419451 405595 394582 370465 449159 483030 445510 429981 440005
7580D40005M2627m6845q0931K263N3207J7080n529j4753q4616j17825q6653L1629
$$ 440005 482632 435787 354856 357119 410326 427406 421877 407124 322508 204683 118030 149659
7568A49659q150K37619O8635K7956K8260k3854K96j25934j26306l09J47946N4476
$$ 149659 141509 379128 447763 475719 503979 480125 480421 354487 228181 227872 375818 430294
7556D30294r191m6241m106m5709P7127K2756J2498M8108k0458j02060o0555l4886
$$ 430294 421103 374862 370756 325047 402174 424930 437428 485536 465078 363018 302463 267577
7544B67577P5185O9010j41j8048q3440k7243l6913k173k7908M2845J23771n6408
$$ 267577 342762 411772 411631 393583 310143 282900 245987 243814 215906 258751 382522 326114
7532C26114J4808P0121K0485o7842m3660m8355j09244P8764R1313p8661n3949
$$ 326114 340922 411043 431528 363686 320026 271671 162427 241191 332504 253843 199894
7521A99894j2539o257J8758n7740J01193J22764M3564p4613J5605o3629M6470
$$ 199894 187355 181098 199856 142116 243309 366073 409637 335024 350629 287000 333470
7510C33470L0145q5437o1682O1540n6197p4461L6094O0404q5022q095k3726O6338
$$ 333470 363615 278178 216496 278036 221839 147378 183472 243876 158854 150759 127033 193371
7498A93371M5584p9816r2069o2403J4767l7496P4628Q6512M5377J0866l6733M8569
$$ 193371 238955 159139 67070 4667 19434 -18062 56566 143078 188455 199321 162588 211157
7486B11157N9259k2270j5332Q793p83p23l6422j8208J529l6020m3355J1946M198
$$ 211157 270416 248146 232814 241607 240824 240101 203679 185471 187000 150980 107625 119571 123769
7473A23769K5934k8426M9752l8657j8134m1084J08373L5291r7616l7986R5201
$$ 123769 149703 121277 171029 132372 114238 73154 181527 216818 119202 81216 176417
7462A76417J03112k0726J8293L8628o6158r9266q522m8514J04601P7930O4465
$$ 176417 279529 258803 277096 315724 249566 150300 141778 93264 197865 275795 340260
7451C40260M9166M364j28000j12540j07304L1040K9079j318P528M9332l7Q0184
$$ 340260 389426 393790 265790 153250 45946 76986 106065 104747 112275 161607 161570 241754
7439B41754K0557n7407o5133j03811l0321m7501L5772M3836j2366l4571M3109
$$ 241754 262311 204904 139771 35960 5639 -41862 -6090 37746 25380 -9191 33918
7428C3918M3001R3443R7046j997k1067n1179K900o081o2143J2209K1426O6314
$$ 33918 76919 170362 267408 265411 244344 193165 196065 189984 127841 140050 161476 227790
7416B27790j0285o7867O8582j2838o7055O459O5092N5466p1361o1607l652o3741
$$ 227790 217505 149638 218220 205382 138327 144786 209878 265344 193983 132376 128724 64983
7404F4983r2931k9055L74K4425m2148k3615K0686L9851J3709M8107N8126P3506
$$ 64983 -27948 -57003 -56629 -32204 -74352 -97967 -77281 -37430 -23721 24386 82512 156018
7392A56018P0220L9478p1844j09015o8571O5000N8280k1805Q4756o8150n7718
$$ 156018 226238 265716 193872 84857 16286 81286 139566 117761 202517 134367 76649
7381G6649K2416j6740n0402j8647J55553J12701k1314m2081j3706P2021N3680
$$ 76649 99065 82325 31923 13276 168829 281530 260216 218135 204429 276450 330130
7370C30130K8556k4370J7570k6304l5174r9363j12248J1088L105M502R0747J3744
$$ 330130 358686 334316 351886 325582 290408 191045 78797 89885 92990 97492 188239 201983
7358B01983n3921n6404M7281R260n854j04710r2796o611O7463J182o0440J0333
$$ 201983 148062 91658 138939 148199 142345 37635 -55161 -61772 5691 6873 -53567 -43234
7346d3234L428n68n5343J44476Q3559n226n0426L721N3714p6272j07045n191P968
$$ -43234 -39806 -40374 -95717 48759 132318 127092 76666 80387 134101 57829 -49216 -54407 -46439
7333d6439J26002j5917m7865Q8986l71k2112j04029p9326M5541P1178k275m8028
$$ -46439 79563 63646 15781 104767 104396 82284 -21745 -101071 -55530 15648 13373 -34655
7321c4655k091M751Q4595j6702n8110J211R148Q1958o9695j273J12149L4874j5403
$$ -34655 -36746 -31995 52600 35898 -22212 -21001 -11853 70105 410 -863 111286 146160 130757
7308A30757m0419N1749L4490j48916p5533Q2858L1218n6057m9319O9836L4852
$$ 130757 90338 142087 176577 27661 -47872 34986 66204 10147 -39172 30664 65516
7297F5516j2349r4364n2075k7682J6772P949O7132O0170M9047J20193R5994P8515
$$ 65516 53167 -41197 -93272 -120954 -104182 -96233 -29101 31069 80116 200309 296303 374818
7285C74818j24108j98345l5843R0117m3356Q2209K2706n6767n3126R7643k8866
$$ 374818 250710 52365 16522 106639 63283 145492 168198 111431 58305 155948 127082
7274A27082n3244L3930p621L4237j5525q9878p823M4538l7068n3399Q2994R9557
$$ 127082 73838 107768 100147 134384 118859 28981 21158 65696 28628 -24771 58223 157780
7262A57780q8084q4995M7744O655p5595q9807M2491J2939q782k2156k1683L5J08235
$$ 157780 69696 -15299 32445 39100 -36495 -126302 -83811 -70872 -79654 -101810 -123493 -123458 -15223
7249a5223P6838L3430n4265j21294K5517N2873o9174R5413R2544N6167j1980p5018
$$ -15223 61615 95045 40780 -80514 -54997 -2124 -71298 24115 116659 172826 160846 85828
7237H5828n3398N3444N039J701k4663P9065n4481o0988o5588L8914J07985M283
$$ 85828 32430 85874 90913 92614 67951 147016 92535 31547 -34041 4873 112858 117141
7225A17141K2091k3681q188j53052m4448N7925J03121J11480J3097K0289Q2108
$$ 117141 139232 115551 107363 -45689 -90137 -32212 70909 182389 195486 215775 297883
7214B97883K1126r7613k5327o368m902K1422M4447M2320q589j23223m6004J3205
$$ 297883 319009 221396 196069 189701 184799 206221 250668 292988 284399 161176 115172 128377
7202A28377J5802J9118q1055p7004o4490j1607j0913R2437M382L5215O6639J2530
$$ 128377 144179 163297 82242 5238 -59252 -70859 -81772 10665 15047 50262 116901 129431
7190A29431O0652K014j50931l3695J09170N8317r6375K1397P6083N2989m2019
$$ 129431 190083 192097 41166 7471 116641 174958 78583 99980 176063 229052 187033
7179A87033r1859k3738k2408m9558m5698N9326O6155m7532M759R1587L4092k9072
$$ 187033 95174 71436 49028 -530 -46228 13098 79253 31721 36480 128067 162159 133087
7167A33087k1722J0487L3054o5676R045k789o089m6247P0476m8366N1540K2407
$$ 133087 111365 121852 154906 89230 98275 95486 89397 43150 113626 65260 116800 139207
7155A39207j1713n0781j07L9224O4256k7768q7402l428q3736l5307R5302M0130
$$ 139207 127494 76713 76606 115830 180086 152318 64916 61488 -22248 -57555 37747 77877
7143G7877J5968r996q818l9533l1072o1272j2482M7330Q6442J0874p3340n9312
$$ 77877 93845 83849 75031 35498 4426 -56846 -69328 -21998 64444 75318 1978 -57334
7131e7334K8827O1850J5389K0959K6386l4267Q695R6440m4128o1369q9128L5739
$$ -57334 -28507 33343 48732 69691 96077 61810 70505 166945 122817 61448 -27680 8059
7119H059P7802j4444k2138O0448o7368l1933K3652L9771j01252p2748j005O0470
$$ 8059 85861 71417 49279 109727 42359 10426 34078 73849 -27403 -100151 -101156 -40686
7107d0686O5113N8133m5250j22863J2721n6880Q7504O7096R4863Q3547J3889j10227
$$ -40686 24427 82560 37310 -85553 -72832 -129712 -42208 24888 119751 203298 217187 106960
7095A06960j09971p5841j3621Q843Q0246L0663n7550P3776j673p307k1455K8031
$$ 106960 -3011 -78852 -92473 -83630 -3384 27279 -30271 43505 41832 34525 13070 41101
7083D1101J1235K7485j7610K9865L1192m5603p0807j27976P2140J70563n7876
$$ 41101 52336 79821 62211 92076 123268 77665 6858 -121118 -48978 121585 63709
7072F3709j04129p4117J0831O3672M0438K9940m3044j9707j5650N9048K4878M5682
$$ 63709 -40420 -114537 -103706 -40034 404 30344 -12700 -32407 -48057 10991 35869 81551
7060H1551L7557p3228p4308K9775j9063j04931l0976Q8707o825k6107M4621k0482
$$ 81551 119108 45880 -28428 1347 -17716 -122647 -153623 -64916 -71741 -97848 -53227 -73709
7048g3709k9799K0035K9492l7051K486k2496l3004P3614J5822Q7697p7932K3927
$$ -73709 -103508 -83473 -53981 -91032 -88546 -111042 -144046 -70432 -54610 33087 -44845 -20918
7036b0918k6703l1462N9079j8757j9622J01282J06142q960J5270J9502o8167r8833
$$ -20918 -47621 -79083 -20004 -38761 -58383 42899 149041 140081 155351 174853 106686 7853
7024G853j5302J0977m3006p3826M4812R065l2286J8369N9573o332m5386L8730
$$ 7853 -7449 3528 -39478 -113304 -68492 -59427 -91713 -73344 -13771 -20103 -65489 -26759
7012b6759j04937r5664N8999N2556O0908q0875j555J35730M260K7119J4129J7058
$$ -26759 -131696 -227360 -168361 -115805 -54897 -135772 -137327 -1597 2663 29782 43911 60969
7000F0969n8730N0489o25p4370K8436k5712n777Q4193J9937j3171m5881J4711
$$ 60969 2239 52728 52103 -22267 6169 -19543 -25320 58873 78810 65639 19758 34469
6988C4469J14059L7397j05160q4873O167M8251o6158m3844J425n1745P243Q2521
$$ 34469 148528 185925 80765 -4108 2059 50310 -15848 -59692 -58267 -110012 -102769 -20248
6976b0248J17461r00j11873J7994O6033L7158k7348l8502K0997q0820p1107J0988
$$ -20248 97213 96313 -15560 2434 68467 105625 78277 39775 60772 -20048 -91155 -80167
6964h0167N50j9045K5120n162K1568J28066Q2794q1826n4839r9671K932K9252
$$ -80167 -79617 -98662 -73542 -78704 -57136 70930 153724 71898 17059 -82612 -79680 -50428
6952e0428K9537J086Q2781L9490l3914j453P3712j9310J2898j6594n7539k718
$$ -50428 -20891 -19805 62976 102466 68552 67099 140811 121501 134399 117805 60266 57548
6940E7548O3971p2973J8273K1000j0078M0985N7541o2618p6867o4870j5352j2594
$$ 57548 121519 48546 66819 87819 77741 118726 176267 113649 36782 -28088 -43440 -56034
6928e6034K4255O3766l9834o6798m4110m3695j4517J5509k4735m3290J49180J02630
$$ -56034 -31779 31987 -7847 -74645 -118755 -162450 -176967 -161458 -186193 -229483 -80303 22327
6916B2327k6980L7187n1437o2296M8725O1218J4037L2611m3719q4274N0177R657
$$ 22327 -4653 32534 -18903 -81199 -32474 28744 42781 75392 31673 -52601 -2424 7233
6904G233o5053P0906J9348J0313n0241j2406n1322M3341m8497N9424J5947o6139
$$ 7233 -57820 13086 32434 42747 -7494 -19900 -71222 -27881 -76378 -16954 -1007 -67146
6892f7146J2206O4814o4843n9525j2901M3243Q372m1151l3359M4724j38993o3709
$$ -67146 -54940 9874 -54969 -114494 -127395 -84152 -75780 -116931 -150290 -105566 -244559 -308268
6880c08268L5574J36556J34641L1703j10501K7354N1375K0299m5949j18652O5222
$$ -308268 -272694 -136138 -1497 30206 -80295 -52941 -1566 18733 -27216 -145868 -80646
6869h0646M4479N5906m2880p2563n590L7556m2387P8314J08275J9570J107O219
$$ -80646 -36167 19739 -23141 -95704 -101294 -63738 -106125 -27811 80464 100034 101141 107360
6857A07360l1929K1703M8583k0536l9894j5781q6218m1592j7393P2241J0857M2353
$$ 107360 75431 97134 145717 125181 85287 69506 -16712 -58304 -75697 -3456 7401 49754
6845D9754P0440r9773o4400m3087J9286O6603j491l1705o5296m1314m1629J30756
$$ 49754 120194 20421 -43979 -87066 -67780 -1177 -2668 -34373 -99669 -140983 -182612 -51856
6833e1856J04985P0015P0751K455K641K4121k1701j04330m7907k4662J5454J0253
$$ -51856 53129 123144 193895 196350 198991 223112 201411 97081 49174 24512 39966 50219
6821E0219M2369M1635M1285n3828l437n9851j40420q064O7367J10772o3395j02338
$$ 50219 92588 134223 175508 121680 118243 58392 -82028 -90092 -22725 88047 24652 -77686
6809g7686j5821Q4229k0501M2685O547J0354j157L706o3742O5936Q9012l3904
$$ -77686 -93507 -9278 -29779 12906 19453 29807 28650 32356 -31386 34550 123562 89658
6797H9658l6702N8794m9075j23255j01871o8441O5398J18342M1594N6883P1394
$$ 89658 52956 111750 62675 -60580 -162451 -230892 -165494 -47152 -5558 51325 122719
6786A22719j05663m9864N4398l8956J8119J8898j45351J2866L1015P960N4453
$$ 122719 17056 -32808 21590 -17366 753 19651 -125700 -112834 -81819 -73859 -19406
6775a9406L6853p105q9250q7537n5049n747J43391L6745L2295M3799J2085J20759
$$ -19406 17447 10342 -78908 -166445 -221494 -227241 -83850 -47105 -14810 28989 41074 161833
6763A61833l6523j06107q1647m4826Q0118P343j3788n3159r151N8060j6642l1355
$$ 161833 125310 19203 -62444 -107270 -27152 -19809 -33597 -86756 -95907 -37847 -54489 -85844
6751h5844k4349k7907P1324M1351K6296j45504n2188O2374J05557k5790j8161
$$ -85844 -110193 -138100 -66776 -25425 871 -144633 -196821 -134447 -28890 -54680 -72841
6740g2841o2260p4523J07586Q4973K1270p7951l8937L0383M6218P2671R9820n0023
$$ -72841 -135101 -209624 -102038 -17065 4205 -73746 -112683 -82300 -36082 36589 136409 86386
6728H6386p6778j49170P7756J20722J434Q849o9968j68243p3876K2267L7585o714
$$ 86386 9608 -139562 -61806 58916 60350 69199 -769 -169012 -242888 -220621 -183036 -189750
6716a89750M1938M9140m2589j0941N5937K1189K7615P72q7863j6262M5263l9895
$$ -189750 -147812 -98672 -141261 -152202 -96265 -75076 -47461 -46689 -134552 -150814 -105551 -145446
6704a45446j10403R1701J55532j5455k9749M6082K7930p5828N7214K4454n1555
$$ -145446 -255849 -164148 -8616 -24071 -53820 -7738 20192 -55636 1578 26032 -25523
6693b5523Q9342M4779J1592j5721j0398q58n254n7571p1035l674k8772L0966K5258
$$ -25523 63819 108598 120190 104469 94071 93213 87959 30388 -40647 -44321 -73093 -42127 -16869
6680a6869m7863q4258N253J08451J15538L0031k345L2925L4611l3885j9265q3757
$$ -16869 -64732 -148990 -143737 -35286 80252 110283 107938 140863 175474 141589 122324 38567
6668C8567r6800k9843L6115r86l3720M1110l7686Q1344K6760j1803P0466j3484
$$ 38567 -58233 -88076 -51961 -52947 -86667 -45557 -83243 -1899 24861 13058 83524 70040
6656G0040L5505n3729l2500n5681L9261k631p9568L5584l231k0867J0491N3614
$$ 70040 105545 51816 19316 -36365 2896 265 -79303 -43719 -46950 -67817 -57326 -3712
6644c712q828l0892j28922l3410K06225N7065J8481n9227p4326o2515Q3336J9980
$$ -3712 -12540 -43432 -172354 -205764 461 57526 76007 16780 -57546 -120061 -36725 -16745
6632a6745J5117L5866Q955l5542l2650k8746j1221K6522L7368O8667l1685J3708
$$ -16745 -1628 34238 43193 7651 -24999 -53745 -64966 -38444 -1076 67591 35906 49614
6620D9614P0800P5691q6267q3418n2332J2722O2061Q073L3452q123j1262j0497
$$ 49614 120414 196105 109838 26420 -25912 -13190 48871 56944 90396 82273 71011 60514
6608F0514j8574o2384L0419L2518j5441P8706R3389p4247j33799m8330L4696n6672
$$ 60514 41940 -20444 9975 42493 27052 105758 199147 124900 -8899 -57229 -22533 -79205
6596g9205m9438Q3542J3971l7069R9199P569L7943K2270N350l869n7522k8791
$$ -79205 -128643 -45101 -31130 -68199 31000 38569 76512 98782 104132 100263 42741 13950
6584A3950O1342l5266j8732R5803K5043p9450M7836J1561l1005L5522l5275K2429
$$ 13950 75292 40026 21294 117097 142140 62690 110526 122087 91082 126604 91329 113758
6572A13758j0867M7743l3424j53662n2979R4565l5355O8692J7122j0870O0972
$$ 113758 102891 150634 117210 -36452 -89431 5134 -30221 38471 55593 44723 105695
6561A05695P0329J6417K7753k1074O512j08978n2274j1978j0599M1851j7856l821
$$ 105695 176024 192441 220194 199120 205632 96654 44380 32402 21803 63654 45798 41977
6549D1977j14045k7674O5457P78M4313k1114j72554j0689l7213P546J9139L7315
$$ 41977 -72068 -99742 -34285 -33507 10806 -10308 -182862 -193551 -230764 -223218 -204079 -166764
6537a66764K063R807P8091N9904L5495L1618n605j16309o3767J3222q590r88l849
$$ -166764 -164701 -154894 -76803 -16899 18596 50214 44609 -71700 -135467 -122245 -130835 -131823 -135672
6524a35672m3599P4251J55068J19663n9613L1552q7814o6099j31800q791N3493
$$ -135672 -179271 -105020 50048 169711 110098 141650 53836 -12263 -144063 -152854 -99361
6513i9361o872P587J649K7379Q9615J5042q7778j06636k3016J00730J66946l6082
$$ -99361 -106233 -98646 -96997 -69618 19997 35039 -52739 -159375 -182391 -81661 85285 49203
6501D9203o7717m449j8772L2864J1203L7648q278m0205o8391L2803O6911N8555
$$ 49203 -18514 -22963 -41735 -8871 2332 39980 31702 -8503 -76894 -44091 22820 81375
6489H1375N0940k0361q5037M7792M4292R895l2243q0861K9214J8192L270m2974
$$ 81375 132315 111954 26917 74709 119001 128896 96653 15792 45006 63198 66468 23494
6477B3494n6599k1367j7436m6200L2049Q5230l5889r6110L073K2962k1243n2616
$$ 23494 -33105 -54472 -71908 -118108 -86059 -829 -36718 -132828 -129755 -106793 -128036 -180652
6465a80652M7200M6581o4994o8457L189K6217K821N0980J10335p886N5539P929
$$ -180652 -133452 -86871 -151865 -220322 -217133 -190916 -188095 -137115 -26780 -34666 20873 28802
6453B8802k6732m9687n9551L3626J17215L455j12303L0308M822j01290p8467R2794
$$ 28802 2070 -47617 -107168 -73542 43673 47128 -65175 -34867 -30045 -131335 -209802 -117008
6441a17008N4772p132J5958k340J06841O3792n0533n6409j7790J5343Q9289J5666
$$ -117008 -62236 -69368 -53410 -55750 51091 114883 64350 7941 -9849 5494 94783 110449
6429A10449p3067j9767Q3023l9772p9634j36070n4961J6476P0544J09236J17237
$$ 110449 37382 17615 100638 60866 -18768 -154838 -209799 -193323 -122779 -13543 103694
6418A03694J2235k762m2840p4081j7528P3274k2980K686l1111r8656P0933K09998
$$ 103694 115929 113167 70327 -3754 -21282 51992 29012 31698 587 -98069 -27136 182862
6406A82862M3473j6075j65698j35492J6068P1890M1211m7634n0055J6129o9057
$$ 182862 226335 210260 44562 -90930 -74862 -2972 38239 -9395 -59450 -43321 -112378
6395a12378p8146r1168k451J53583J33039O3233j26012K538K564L6777L0922J966
$$ -112378 -190524 -281692 -284143 -130560 2479 65712 -60300 -57762 -55198 -18421 12501 14467
6383A4467Q321n9130j02397P201L1369R6892L7661k0382q540p259k6975l8396
$$ 14467 22788 -36342 -138739 -131538 -100169 -3277 34384 14002 5462 -1797 -28772 -67168
6371f7168N9580K5206q786m8417N4639O3972j23747n5604R2479n8060o3762Q4321
$$ -67168 -7588 17618 8832 -39585 15054 79026 -44721 -100325 -7846 -65906 -129668 -45347
6359d5347L6090q5807r8955l7657O257R6439O0907J29808Q9660m4378j46651K3831
$$ -45347 -9257 -95064 -194019 -231676 -225419 -128980 -68073 61735 151395 107017 -39634 -15803
6347a5803J13116j7910k304P856M9290J3558q4994j05037Q0192M9425N979P016
$$ -15803 97313 79403 77099 84955 134245 147803 62809 -42228 37964 87389 93368 100384
6335A00384K1449P0521k6787o6209j16805K5161J12325j063m3970m8351j02858
$$ 100384 121833 192354 165567 99358 -17447 7714 120039 118976 75006 26655 -76203
6324g6203l7465K9046j7372K0560K7158M6860m6834l0063o5095m8100N618J19809
$$ -76203 -113668 -84622 -101994 -81434 -54276 -7416 -54250 -84313 -149408 -197508 -191890 -72081
6312g2081R0983k2004N8944O47l8379J7032m0027N3559m5523j20157l246K0899
$$ -72081 18902 -3102 55842 56489 18110 35142 -4885 48674 3151 -117006 -120252 -99353
6300i9353L8214n3745N2002J77054M2752o8402q6080n915Q852j6616r697O3484
$$ -99353 -61139 -114884 -62882 114172 156924 88522 2442 -3473 5379 -11237 -20934 42550
6288D2550L8817n198m0148J1235K3437o9585j506k4296K1759m2722O6704K5232
$$ 42550 81367 76169 36021 47256 70693 1108 -398 -24694 -2935 -45657 21047 46279
6276D6279K7n5571k5364Q7661j02229p5410L8788M7980J28759J2967j1474k4618
$$ 46279 46306 -9265 -34629 53032 -49197 -124607 -85819 -37839 90920 103887 92413 67795
6264F7795o0849N7692r0078o2149k8262R05P0880O3979N0897K2431r4000p5577
$$ 67795 6946 64638 -25440 -87589 -115851 -114946 -44066 19913 70810 93241 -759 -76336
6252g6336O3122L2061N1773L1399k2279k7994M6191M9949l3700q2425p578j9964
$$ -76336 -13214 18847 70620 102019 79740 51746 97937 147886 114186 31761 24183 4219
6240D219J6971n3390n3957j0971M1162K1393P4394J6396n6481j19120J4689N4216
$$ 4219 21190 -32200 -86157 -97128 -55966 -34573 39821 56217 -264 -119384 -104695 -50479
6228e0479K2648J5033n0207o4225o0604J81730J04964n7499n9144M9308l7750
$$ -50479 -27831 -12798 -63005 -127230 -187834 -6104 98860 41361 -17783 31525 -6225
6217f225p7051k4100j8239m8504l2016P4738J11789J3787L8939M0612j15549l3165
$$ -6225 -83276 -107376 -125615 -174119 -206135 -131397 -19608 -5821 33118 73730 -41819 -74984
6205g4984K2839l1907L5322N6216l4876l8843K2927M2603J2742p8153n8246O6002
$$ -74984 -52145 -84052 -48730 7486 -27390 -66233 -43306 -703 12039 -66114 -124360 -58358
6193e8358J16663P7774M2814j31651j32683M2251J5246q9666P169K2377k4284
$$ -58358 58305 136079 178893 47242 -85441 -43190 -27944 -117610 -110441 -88064 -112348
6182a12348J4143j25043k045L742M825R6631P7267R3319r4957r6622J12773O0784
$$ -112348 -98205 -223248 -225293 -221551 -216726 -120095 -42828 50491 -44466 -141088 -28315 32469
6170C2469N7321j7331o6077m7585m867o1841j9226R3672J13866n1923k5974j8165
$$ 32469 89790 72459 6382 -41203 -46070 -107911 -127137 -33465 80401 28478 2504 -15661
6158a5661M3014L4353N7086O854m6441l2128n0499J3996N8047R7006l6768O6468
$$ -15661 27353 61706 118792 125646 79205 47077 -3422 10574 68621 165627 128859 195327
6146A95327q1531o9493j00709l7884j381j4875R919L3351P0307K5009j6224N1440
$$ 195327 113796 44303 -56406 -94290 -95671 -110546 -100627 -67276 3031 28040 11816 63256
6134F3256j0052j45867p5063N6142M1155j8032N3581K6845p6439L0474j718n0856
$$ 63256 53204 -92663 -167726 -111584 -70429 -88461 -34880 -8035 -84474 -54000 -55718 -106574
6122a06574O2890q1993M8759Q4176J24369k0560J5716J368k0111k319r1189m3110
$$ -106574 -43684 -125677 -76918 7258 131627 111067 126783 128151 108040 105721 14532 -28578
6110b8578J7356M3982l0361K8618k6709n5979j3114m982l4670K6123L0581k3803
$$ -28578 -11222 32760 2399 31017 4308 -51671 -64785 -69767 -104437 -78314 -47733 -71536
6098g1536L0551R4473J4331p4753L8956k2230n3709j54O8675J00466j48158k7786
$$ -71536 -40985 53488 67819 -6934 32022 9792 -43917 -44071 24604 125070 -23088 -50874
6086e0874m9222K780J2326M1371n8622m0954P9370O112L4387P8434O6624K7338
$$ -50874 -100096 -97316 -84990 -43619 -102241 -143195 -63825 -57713 -23326 55108 121732 149070
6074A49070p783j5230n6859m2969J2304J5044j5163j5530Q880L6514j4943m3407
$$ 149070 141287 126057 69198 26229 38533 53577 38414 22884 31764 68278 53335 9928
6062I928j7282L0752M0300o2370k3639o2084J0226j4906p4900J98837J10844r2416
$$ 9928 -7354 23398 63698 1328 -22311 -84395 -74169 -89075 -163975 34862 145706 53290
6050E3290p6840P487Q2532N2670n6049J5403j7905p5793p8927o2477N4286P1550
$$ 53290 -23550 -16063 66469 119139 63090 78493 60588 -15205 -94132 -156609 -102323 -30773
6038c0773j1888N015O3780M0832O6629O1816R282j06693j13123j1573m6206r801
$$ -30773 -42661 -37646 26134 66966 133595 195411 204693 98000 -15123 -26696 -72902 -82703
6026h2703N5456O1702k037k8119q8616L6012J2214O9275J1427m5468l8129k545
$$ -82703 -27247 34455 32418 4299 -84317 -48305 -36091 33184 44611 -857 -38986 -41531
6014d1531M7589l9590m6338J6865k4679m2917k1669N5667M9450P901l8333o5646
$$ -41531 6058 -33532 -79870 -63005 -87684 -130601 -152270 -96603 -47153 -39252 -77585 -143231
6002a43231j3072l068o7832M7557M1038l715Q2395J22673l5227p2309O3004r0684
$$ -143231 -156303 -159371 -227203 -179646 -138608 -142323 -59928 62745 27518 -44791 18213 -72471
5990g2471P2582O8812l2410k0854Q7475n7590j29430r0160o2826Q0835j8178k3120
$$ -72471 111 68923 36513 15659 103134 45544 -83886 -174046 -236872 -156037 -174215 -197335
5978a97335l0779Q395L2675k182P6150j7115j57698r335J14057J20905M1187k7761
$$ -197335 -228114 -219719 -187044 -189226 -113076 -130191 -287889 -297224 -183167 -62262 -21075 -48836
5966d8836j1834O2046L1751O7151m6331k6843J5024o0049L6481R747m7549l1184
$$ -48836 -60670 1376 33127 100278 53947 27104 42128 -17921 18560 28307 -19242 -50426
5954e0426j2702l8302q4004R1263Q2359r4319j19402L6536O1469M2817O1589O0932
$$ -50426 -63128 -101430 -185434 -94171 -11812 -106131 -225533 -188997 -127528 -84711 -23122 37810
5942C7810J4140m714j04011p9353P6310J4946O755J06428N4455k7155n8958k9193
$$ 37810 51950 47236 -56775 -136128 -59818 -44872 -38117 68311 122766 95611 36653 7460
5930G460k8595N207M1137L6311j19715r6448K674O3169k163n0919q0813L9728
$$ 7460 -21135 -15928 25209 61520 -58195 -154643 -151969 -88800 -90963 -141882 -222695 -182967
5918a82967J53334j4510m4686l7962K8207k1852N1509K6229k2179O9666Q9705
$$ -182967 -29633 -44143 -88829 -126791 -98584 -120436 -68927 -42698 -64877 4789 94494
5907I4494K9806r398N4879K3033l0378m0142k6718L9475M3751L3801l4462j24284
$$ 94494 124300 114902 169781 192814 162436 122294 95576 135051 178802 212603 178141 53857
5895E3857n7006K3442q3611M6978l853l7114K5756M7877J1396l4994L3786p803
$$ 53857 -3149 20293 -63318 -16340 -20193 -57307 -31551 16326 27722 -7272 26514 18711
5883A8711j2971O9143Q2013l7606o4740P429n4191l8019J8574M5617j3396j14975
$$ 18711 5740 74883 156896 119290 54550 61979 7788 -30231 -11657 33960 20564 -94411
5871i4411K8870N9032k1735k8146Q8388p6875l1210K2398J3201k1198M4490m2930
$$ -94411 -65541 -6509 -28244 -56390 31998 -44877 -76087 -53689 -40488 -61686 -17196 -60126
5859f0126K5350J04584L4047l3976q6247K3629k2300o4406n3566J6802J5943p3797
$$ -60126 -34776 69808 103855 69879 -16368 7261 -15039 -79445 -133011 -116209 -100266 -174063
5847a74063o8134N5111J44050J133q747k5914j3345l2651N6479L9193k1716j37296
$$ -174063 -242197 -187086 -43036 -41903 -50650 -76564 -89909 -122560 -66081 -26888 -48604 -185900
5835a85900l4226N4839Q9424J6066O2714m892j1914m0903K6489n0318n6958n2042
$$ -185900 -220126 -165287 -75863 -59797 2917 -1975 -13889 -54792 -28303 -78621 -135579 -187621
5823a87621J54124J50597J1399m4429p4712p0372j5456q8645M7373J00427M614
$$ -187621 -33497 117100 128499 84070 9358 -61014 -76470 -165115 -117742 -17315 -12701
5812a2701L5830k3718l449m6017l544l0269O2766J0771j32422j6109K7404J1420
$$ -12701 23129 -589 -4038 -50055 -53599 -83868 -21102 -10331 -142753 -158862 -131458 -120038
5800a20038j738k2340M6952Q6869O5057L8720p5454n7096l351M5955K3586M3923
$$ -120038 -121776 -144116 -97164 -10295 54762 93482 18028 -39068 -42419 3536 27122 71045
5788G1045J7991n4028o6659q3536q0858l2671K3129k601k0056J34654M3728k6700
$$ 71045 89036 35008 -31651 -115187 -196045 -228716 -205587 -208188 -228244 -93590 -49862 -76562
5776g6562Q119O31n9945O592n1620j700R11p6242N9371R1827O8948Q981Q271P903
$$ -76562 -68443 -67812 -127757 -121165 -172785 -174485 -173574 -249816 -190445 -98618 -29670 -20689 -12418 -4515
5762d515m3011q9707q9103k7395J26425P6839M0283p5701m5304O8278N1747P6760
$$ -4515 -47526 -137233 -226336 -253731 -127306 -50467 -10184 -85885 -131189 -62911 -11164 65596
5750F5596J6575J4915l8426n4036j3077K7351l8865K9507L6586m577M1599p8851
$$ 65596 82171 97086 58660 4624 -8453 18898 -19967 9540 46126 41549 83148 4297
5738D297J8013l8006j3652m5512o1716j9277l2982j0777M2400L0792K4288k2212
$$ 4297 22310 -15696 -29348 -74860 -136576 -155853 -188835 -199612 -157212 -126420 -102132 -124344
5726a24344Q646l4811l7620N1982J4496q3965N5365O355q8137J857o81j9961j6972
$$ -124344 -115698 -150509 -188129 -136147 -121651 -205616 -150251 -143896 -232033 -230176 -230857 -250818 -267790
5713b67790M9416L3403J8440k146L8539P1174Q3958m5217l0391k2623K031o9433
$$ -267790 -218374 -184971 -166531 -168677 -130138 -58964 24994 -20223 -50614 -73237 -71206 -140639
5701a40639J4074O0888J7179O539r806J955Q48O0684K6536o6568q0922J9398K4432
$$ -140639 -126565 -65677 -48498 -41959 -51765 -49810 -48962 11722 38258 -28310 -109232 -89834 -65402
5688f5402M1923j6700l9787o2616P5284Q0826k0009m0169L0308L7873L4473k7880
$$ -65402 -23479 -40179 -79966 -142582 -67298 13528 -6481 -46650 -16342 21531 56004 28124
5676B8124m3719k0328J03467p3640l6339M5863p8203J5256Q1503J1688k8853n428
$$ 28124 -15595 -35923 67544 -6096 -42435 3428 -74775 -59519 21984 33672 4819 -609
5664f09L4162J0481l8746j08741j18395j0162Q1098O9389P2532R9399l4696j00203
$$ -609 33553 44034 5288 -103453 -221848 -232010 -150912 -81523 -8991 90408 55712 -44491
5652d4491j9041o5918R0612J19192P891l7148p0566r4691J10651N9064n7698l6555
$$ -44491 -63532 -129450 -38838 80354 88245 51097 -19469 -114160 -3509 55555 -2143 -38698
5640c8698J279o435J0033J30954M8540r014M5554j3421L2102N9822j26768j02048
$$ -38698 -37419 -43854 -33821 97133 145673 136659 182213 168792 200894 260716 133948 31900
5628C1900k0466J0422K5428m4292K4337o3127l5118J5264J8374R7505Q4360q6235
$$ 31900 11434 21856 47284 2992 27329 -35798 -70916 -55652 -37278 60227 144587 58352
5616E8352j0410j4228l655M4163M9968q8151p4944o0559N260J919K718K1145j4308
$$ 58352 47942 33714 30059 74222 124190 36039 -38905 -99464 -94204 -92285 -89567 -68422 -82730
5603h2730O7806Q5649m0946K8733J5312j5361j7293k6601m0714M8358L908q5230
$$ -82730 -14924 70725 29779 58512 73824 58463 41170 14569 -26145 22213 26121 -59109
5591e9109j20908o0807M4588O4482K0641J9778m7046m7237R7383O9024K2863r62
$$ -59109 -180017 -240824 -196236 -131754 -111113 -91335 -138381 -185618 -88235 -19211 3652 2690
5579B690K5146o1538l8910J470P9490j3069K5473m267J4754L4450j6009p3984
$$ 2690 27836 -33702 -72612 -71142 8348 -4721 20752 16485 31239 65689 49680 -24304
5567b4304j06944q436P9179l112l5698O0187m8517J3268j5813l277N3158o809
$$ -24304 -131248 -139684 -60505 -63617 -99315 -39128 -87645 -74377 -90190 -93467 -40309 -47118
5555d7118L6621J6147M2251Q5890R7786p7367j41110q3511K519N8660J5783M9532
$$ -47118 -10497 5650 47901 133791 231577 154210 13100 -70411 -67892 -9232 6551 56083
5543E6083N4023K0464l9829j6751n7435q5247R0225R9249K2657p4926j74277r0544
$$ 56083 110106 130570 90741 73990 16555 -68692 21533 120782 143439 68513 -105764 -196308
5531a96308J07648K30460N9981p9454p9146M8506l0045r4193k5479J25214M9400
$$ -196308 -88660 141800 201781 122327 43181 91687 61642 -32551 -58030 67184 116584
5520A16584j02819l7699k2084J08252O3803n0652j31751j0011J9953l0081m7255
$$ 116584 13765 -23934 -46018 62234 126037 75385 -56366 -66377 -46424 -76505 -123760
5509a23760n2611l0140j3078K7122L0905o3178N7171J30789N1720k0048k6046
$$ -123760 -176371 -206511 -219589 -192467 -161562 -224740 -167569 -36780 14940 -5108 -31154
5498c1154j3694Q1363P194n3283P510N2943l7330n9679m0276P0773l8717P8941
$$ -31154 -44848 36515 43709 -9574 -2064 50879 13549 -46130 -86406 -15633 -54350 24591
5486B4591N5120O6991j7240p9439O452O8160J34924M9379q6118p3910m5820O333
$$ 24591 79711 146702 129462 50023 56475 124635 259559 308938 222820 148910 103090 109423
5474A09423k3198n7858M3110R7133M0711j19514j12271r2788N3500Q0502L5990
$$ 109423 86225 28367 71477 168610 209321 89807 -22464 -115252 -61752 18750 54740
5463E4740o9046o0486L3320R9542k4561m8495K7883P6078r163n3596R7727K0276
$$ 54740 -14306 -74792 -41472 58070 33509 -14986 12897 88975 79812 26216 123943 144219
5451A44219l4454j65271j14559Q0003O5680q832q488K5367o652r4936K5664L2644
$$ 144219 109765 -55506 -170065 -90062 -24382 -33214 -41702 -16335 -22987 -117923 -92259 -59615
5439e9615J4682O7413j0921j6482l8589n5238J91184J5695p0998r9784l6653J330
$$ -59615 -44933 22480 11559 -4923 -43512 -98750 92434 108129 37131 -62653 -99306 -97976
5427i7976K2379J31662j4765p0167K0275L9299M5544q8809l4122J9861K7100R0096
$$ -97976 -75597 56065 41300 -28867 -8592 30707 76251 -12558 -46680 -26819 281 90377
5415I0377o1668j63064l0744k4385J439N2164J3073K3806M436L3435M1004M62
$$ 90377 28709 -134355 -165099 -189484 -188045 -135881 -122808 -99002 -94566 -61131 -20127 -19665
5403a9665o3797J04388R9550j03930j56694N2450P9599n4074j3980k6781q36k1609
$$ -19665 -83462 20926 120476 16546 -140148 -87698 -8099 -62173 -76153 -102934 -103770 -125379
5391a25379k4833q500K6185O9893m6096K5889P0437L2759m4966M0966p4612J1169
$$ -125379 -150212 -158712 -132527 -62634 -108730 -82841 -12404 20355 -24611 16355 -58257 -47088
5379d7088M7751l6492M7963r0436j9125R1939K890n4455j25755m5963K9772O8240
$$ -47088 663 -35829 12134 -78302 -97427 -5488 -2598 -57053 -182808 -228771 -198999 -130759
5367a30759O708l0427J5900r088J18773N5459q8470R7915P3458n1943L955N0635
$$ -130759 -124051 -154478 -138578 -147666 -28893 26566 -61904 36011 109469 57526 61481 112116
5355A12116q5964q7551m5739R7803O596p1369K0439J3452l7323N8942j8980k5060
$$ 112116 26152 -61399 -107138 -9335 -2739 -74108 -53669 -40217 -77540 -18598 -37578 -62638
5343f2638m0056J8495L3001j3681m6813n1060J51641P9457k0902p3925M147O376
$$ -62638 -102694 -84199 -51198 -64879 -111692 -162752 -11111 68346 47444 -26481 -22334 -15958
5331a5958l6425N5837L7154k094m7782q1176J0723j6166j01776K8248J06895K4859
$$ -15958 -52383 3454 40608 38514 -9268 -90444 -79721 -95887 -197663 -169415 -62520 -37661
5319c7661m681j03411k0256O8618K8499Q379L9730o1092l4590n070R5768L8014
$$ -37661 -42342 -145753 -166009 -97391 -68892 -60513 -20783 -81875 -116465 -121535 -25767 12247
5307A2247N2173Q810J5560m9355q6158j7811P3587N7586J3089J1305k6812l3601
$$ 12247 64420 73230 88790 39435 -46723 -64534 9053 66639 79728 91033 64221 30620
5295C0620j57856J0573P0648q6131o7499L7264L0866L9112O5157P4634O3976j18452
$$ 30620 -127236 -116663 -46015 -132146 -199645 -162381 -131515 -92403 -27246 47388 111364 -7088
5283g088j5943o9403l2783R4636J00477R9648k9528j00580j6489O7699m8040j49610
$$ -7088 -23031 -92434 -125217 -30581 69896 169544 140016 39436 22947 90646 42606 -107004
5271a07004J4165k2104l679P6756k2683J8564P848k3772O4800L1722j3445k503
$$ -107004 -92839 -114943 -118622 -41866 -64549 -45985 -38137 -61909 2891 34613 21168 18665
5259A8665O875m0003j069O0937P0778o4598l6197M765J04901M6152p838P6642
$$ 18665 25540 -14463 -15532 45405 116183 51585 15388 20153 125054 171206 163368 240010
5247B40010L2576j7087l4861r8497q4167n1362m2270J9334J01011J4317l9127
$$ 240010 272586 255499 220638 122141 37974 -13388 -55658 -36324 64687 79004 39877
5236C9877L1640o0263j30105N9796J6145k2754J0569j2651l6171l6300M0384L4391
$$ 39877 71517 11254 -118851 -59055 -42910 -65664 -55095 -67746 -103917 -140217 -99833 -65442
5224f5442L5592P8240o1231l5499K960p2627K3099O1232M538R903N1593J4217
$$ -65442 -29850 48390 -12841 -48340 -45380 -118007 -94908 -33676 -29138 -19235 32358 46575
5212D6575j2432p3708r2805j7563M1887j912Q9573j9630o7808K3222j7180M955
$$ 46575 34143 -39565 -132370 -149933 -108046 -109958 -20385 -40015 -107823 -84601 -101781 -96826
5200i6826K3199p014l6042P9624M0180k4007l0454M1566K5534j17080j5172L0028
$$ -96826 -73627 -80641 -116683 -37059 3121 -20886 -51340 -9774 15760 -101320 -116492 -86464
5188h6464q7718j7312N2250q4556k7309l8566k0051P6228R0838O9543P0229L5786
$$ -86464 -174182 -191494 -139244 -223800 -251109 -289675 -309726 -233498 -142660 -73117 -2888 32898
5176C2898r8077p952J34038m0727j37320k4535L7603Q8519m3289j12340q0596
$$ 32898 -65179 -73131 60907 20180 -117140 -141675 -104072 -15553 -58842 -171182 -251778
5165b51778O9916R980J427K4274L205N6555L9260j5663l6123K7774K7655K3442
$$ -251778 -181862 -171882 -170455 -146181 -142976 -86421 -47161 -62824 -98947 -71173 -43518 -20076
5153b0076P8604k8213p9648l383j0314l2192k0654k6001o7184m0845J10326J18967
$$ -20076 58528 30315 -49333 -52716 -63030 -95222 -115876 -141877 -209061 -249906 -139580 -20613
5141b0613m3958j09414j1921J471M3553R7227J4156K2321N0932L1980j8286n6606
$$ -20613 -64571 -173985 -185906 -184435 -140882 -43655 -29499 -7178 43754 75734 57448 842
5129H42k1287j4738Q6826L9407q8178k0142j21089l2525Q9276O2090k8730k9089
$$ 842 -20445 -35183 51643 91050 2872 -17270 -138359 -170884 -81608 -19518 -48248 -77337
5117g7337K8198J3171k5264k6389n7241Q6648O766Q7101K6767P59J5802j2089
$$ -77337 -49139 -35968 -61232 -87621 -144862 -58214 -51448 35653 62420 63179 78981 66892
5105F6892o8728n8569P6813P4224m8968m5227L9395k6303j23628m2665P1740R5711
$$ 66892 -1836 -60405 16408 90632 41664 -3563 35832 9529 -114099 -156764 -85024 10687
5093A0687O69M5787q8168J2907N3477q0327J2557m4673j7528J8939R3577K7694
$$ 10687 11356 57143 -31025 -18118 35359 -44968 -32411 -77084 -94612 -75673 17904 45598
5081D5598O3560J2863o2202m1449r5778K1210N5221k3814q7724J1574M0902O8289
$$ 45598 109158 122021 59819 18370 -77408 -56198 -977 -24791 -112515 -100941 -60039 8250
5069H250K9682p8316j2039l0202K5701M2285K5751m1165P5938L8203O2896K2050
$$ 8250 37932 -40384 -52423 -82625 -56924 -14639 11112 -30053 45885 84088 146984 169034
5057A69034m2705j14348j87l329J185r018j7615m1896R671J18333n2904k065l245
$$ 169034 126329 11981 11794 8465 9650 632 -16983 -58879 -49208 69125 16221 14156 10911
5044A0911n3223K8061O4214k6705p449O9859O8505N3097o8517j24405o8665Q194
$$ 10911 -42312 -14251 49963 23258 15809 85668 154173 207270 138753 14348 -54317 -46123
5032d6123J0565p4616m9282L9085J15308L9285P0104k8990o6949k3456L9978K911
$$ -46123 -35558 -110174 -159456 -120371 -5063 34222 104326 75336 8387 -15069 24909 27820
5020B7820O0773k3168J3872L0317j11832n1041q1034k9389l3635M6112M8149l405
$$ 27820 88593 65425 79297 109614 -2218 -53259 -134293 -163682 -197317 -151205 -103056 -106461
5008a06461M0629K4838O6588k8966j6998l18o9667k2376P3470R189Q3213N0439
$$ -106461 -65832 -40994 25594 -3372 -20370 -20688 -90355 -112731 -39261 -30072 53141 103580
4996A03580J4433n5433m1763o2334l4233K3474K2495Q3266j9064p9648k6831n506
$$ 103580 118013 62580 20817 -41517 -75750 -52276 -29781 53485 34421 -45227 -72058 -77564
4984g7564m2637n280N2740L7555n9459k2461Q3934k9627j5493j6402p2840k4938
$$ -77564 -120201 -125481 -72741 -35186 -94645 -117106 -33172 -62799 -78292 -94694 -167534 -192472
4972a92472K3756O1530J31714k8193n4878M4363J0044n1459j17742l1079N3645
$$ -192472 -168716 -107186 24528 -3665 -58543 -14180 -4136 -55595 -173337 -204416 -150771
4961a50771m0356Q6563O3681o3971J5402Q1619q613J01885J8518j52259j3721
$$ -150771 -191127 -104564 -40883 -104854 -89452 -7833 -16446 85439 103957 -48302 -62023
4950f2023N1536n9639j13393P793J6241m6384J0756J0428M6635K9078K3964o859
$$ -62023 -10487 -70126 -183519 -175726 -159485 -205869 -195113 -184685 -138050 -108972 -85008 -91867
4938i1867L1967j460L2395R412J1920n2578J1025M8918J06945l1890j4319k6917
$$ -91867 -59900 -61360 -28965 -19553 -7633 -60211 -49186 -268 106677 74787 60468 33551
4926C3551p6499j6135k4299j0280N500J0259M8663k3706L8039O2376j1111n8198
$$ 33551 -42948 -59083 -83382 -93662 -88162 -77903 -29240 -52946 -14907 47469 36358 -21840
4914b1840o8026J55175k3890n3473q698l0234k571R6332J7568m1066N7440J15546
$$ -21840 -89866 65309 41419 -12054 -20752 -50986 -53557 42775 60343 19277 76717 192263
4902A92263l5018p9055r7732n2452j6413l627q824L2014j1281O5180O6827n1604
$$ 192263 157245 78190 -19542 -71994 -88407 -92034 -100858 -68844 -80125 -14945 51882 278
4890B78J19477L2852j65006p8421R1241j0839p555l1964J4806L9490r5905p1479
$$ 278 119755 152607 -12399 -90820 421 -10418 -17973 -49937 -35131 4359 -91546 -163025
4878a63025m0622J5934P6164K10586J10632j8994m2496K6759r226p241r2537j00371
$$ -163025 -203647 -187713 -111549 99037 209669 190675 148179 174938 165712 158471 65934 -34437
4866c4437K8952j6077P58J8741n3642n9068l7011j59664q252O8889K03361J41215
$$ -34437 -5485 -21562 -20804 -2063 -55705 -114773 -151784 -311448 -319700 -250811 -47450 93765
4854I3765o4155m163O9833k6390p1840J8858M2760N0007N7702M4471q2526k8003
$$ 93765 29610 25447 95280 68890 -2950 15908 58668 108675 166377 210848 128322 100319
4842A00319K1850j12865j24670L2348J7239L1630o8295o0032Q1980N5112l8330
$$ 100319 122169 9304 -115366 -83018 -65779 -34149 -102444 -162476 -80496 -25384 -63714
4831f3714j12759n0497M1208M4974K5628O088K3041L0576k8862K4297m8266K4437
$$ -63714 -176473 -226970 -185762 -140788 -115160 -109072 -86031 -55455 -84317 -60020 -108286 -83849
4819h3849l0084N8120K2929m1113K1611N6981j1136k6452n4637J8944j2637l7964
$$ -83849 -113933 -55813 -32884 -73997 -52386 4595 -6541 -32993 -87630 -68686 -81323 -119287
4807a19287P0855N8603N368M2907O4894j10719l3334N0256O7606j5336o0533r5579
$$ -119287 -48432 10171 15539 58446 123340 12621 -20713 29543 97149 81813 21280 -74299
4795g4299j23357p0244R314J17759O6749j5816K5296J6850M6323m5004Q275M7826
$$ -74299 -197656 -267900 -258586 -140827 -74078 -89894 -64598 -47748 -1425 -46429 -38154 9672
4783I672k3886o6916r1957K6668Q2856r1967q4436M3712J07774L6609n2181P316
$$ 9672 -14214 -81130 -173087 -146419 -63563 -155530 -239966 -196254 -88480 -51871 -104052 -96736
4771i6736P3551O7443j0369j838o1435l4412J1950M9650n3748O0289m9697n9138
$$ -96736 -23185 44258 33889 32051 -29384 -63796 -51846 -2196 -55944 4345 -45352 -104490
4759a04490K6728J36588J6180r1081k6596p0950R5737L7362l7749r9826o9627
$$ -104490 -77762 58826 75006 -16075 -42671 -113621 -17884 19478 -18271 -118097 -187724
4748a87724N6821O5641L5713Q4382j5735J8933R8062m2547L0515r7713j10833
$$ -187724 -130903 -65262 -29549 54833 39098 58031 156093 113546 144061 46348 -64485
4737f4485k0408m5178j5872O3426P8228m6482j26816l5146j23178m1742J40696
$$ -64485 -84893 -130071 -145943 -82517 -4289 -50771 -177587 -212733 -335911 -377653 -236957
4726b36957J30114P5423J01749m7901k1905l3222Q395J1276K3241N9499p0157
$$ -236957 -106843 -31420 70329 22428 523 -32699 -24304 -13028 10213 69712 -445
4715d45o0178n6112m13M1028m8079j05195L0314J38793J5840K0136K8613n9753
$$ -445 -60623 -116735 -117148 -76120 -124199 -229394 -199080 -60287 -44447 -24311 4302 -55451
4703e5451m5360m6505J3745J46317N5864j4447o1727k6289P4543J135j5709J2771
$$ -55451 -100811 -147316 -133571 12746 68610 54163 -7564 -33853 40690 41825 26116 38887
4691C8887J2117p9860k7479k1907r8031m544J19266N6821k0658q836p829R1384
$$ 38887 51004 -28856 -56335 -78242 -176273 -180817 -61551 -4730 -25388 -34224 -42053 49331
4679D9331M1680k5431n9638l3391N8828n1098o1875k2020O835M447m0320M7512
$$ 49331 91011 65580 5942 -27449 31379 -19719 -81594 -103614 -96779 -92332 -132652 -85140
4667h5140J10317o9809j46992k2601K5716O236k9729m2017J06243L5966J00412
$$ -85140 25177 -44632 -191624 -214225 -188509 -182273 -212002 -254019 -147776 -111810 -11398
4656a1398R4489k8962l2093r455J2944L3940p6460n6321O3871J3239m6757n0285
$$ -11398 83091 54129 22036 12581 25525 59465 -16995 -73316 -9445 3794 -42963 -93248
4644i3248K009M8090m8932m7566l762L8460l2429M4966J4079j37332k5468J9686
$$ -93248 -91239 -43149 -92081 -139647 -143409 -104949 -137378 -92412 -78333 -215665 -241133 -221447
4632b21447O9860k0173J26898J36529l6147l7158J368n6112k1346j4727J0807
$$ -221447 -151587 -171760 -44862 91667 55520 18362 19730 -36382 -57728 -72455 -61648
4621f1648J430J7935K6425n2888k8588j4111N1086n5867k5392K1021Q8648k9199
$$ -61648 -60218 -42283 -15858 -68746 -97334 -111445 -60359 -116226 -141618 -120597 -31949 -61148
4609f1148P2812J50580j7117j30385p4572L305L4131L350m2368M697p3936R9210
$$ -61148 11664 162244 145127 14742 -59830 -56525 -22394 -19044 -61412 -56715 -130651 -31441
4597c1441J11490k5270k223K8010K3760j7724o9925r5871P3095J07542J5585m4641
$$ -31441 80049 54779 52556 80566 104326 86602 16677 -79194 -6099 101443 117028 72387
4585G2387N4671J9712p9179o3395k4430k0533K3727O944J6575l1311k9257m2609
$$ 72387 127058 146770 67591 4196 -20234 -40767 -17040 -10096 6479 -24832 -54089 -96698
4573i6698J2482L0629p0457M1861r912o8846r1336M3225J01222J0851K9996J02242
$$ -96698 -84216 -53587 -124044 -82183 -92095 -160941 -252277 -209052 -107830 -96979 -66983 35259
4561C5259J4097l2690k8080L1507n7271r1166o6813P9627R9450N2040K8141p9706
$$ 35259 49356 16666 -11414 20093 -37178 -128344 -195157 -115530 -16080 35960 64101 -15605
4549a5605j8914O9912m5895j06967J7827J07728M2463k2149m7371K2679K3987
$$ -15605 -34519 35393 -10502 -117469 -99642 8086 50549 28400 -18971 3708 27695
4538B7695L7958Q95p2282K4981k6665J0065N4071K1622J1708m5785l9091N7350
$$ 27695 65653 66548 -5734 19247 -7418 2647 56718 78340 90048 44263 5172 62522
4526F2522j2880q5369q8475O1549K6470M0757J8031r6262l5731Q3445j4113n3275
$$ 62522 49642 -35727 -124202 -62653 -36183 4574 22605 -73657 -109388 -25943 -40056 -93331
4514i3331m9645J22346N4978k7227L383K0988l6304o1037L9822Q5879N4933o61
$$ -93331 -142976 -20630 34348 7121 10504 31492 -4812 -65849 -26027 59852 114785 114124
4502A14124k9452j21583p242K4272J2117m7771K378O0772R6400m9188l5953j0512
$$ 114124 84672 -36911 -44153 -19881 -7764 -55535 -53157 7615 104015 54827 18874 8362
4490H362j8342J6725m847j15016o4908J19194Q9895J301n7767l7019J2535J05708
$$ 8362 -9980 6745 1898 -113118 -178026 -58832 31063 32364 -25403 -62422 -49887 55821
4478E5821k5132l1751n8486M3923l421P259N5691J8778p601o5476m626q7540O4044
$$ 55821 30689 -1062 -59548 -15625 -19046 -11787 43904 62682 55081 -10395 -15021 -102561 -38517
4465c8517q056M5141P5838p7870j18266K779Q8873L7163l3796l6925r516K2019
$$ -38517 -46573 -1432 74406 -3464 -121730 -118951 -30078 7085 -26711 -63636 -73152 -51133
4453e1133J0083o7802K1758j930m8022J4746O1617N6240o2851R578P5672l358
$$ -51133 -41050 -108852 -87094 -89024 -137046 -122300 -60683 -4443 -67294 -57716 17956 14598
4441A4598n2207m1722m4030K5522N4603k624J01991m3143J0565O4382K9067P1537
$$ 14598 -37609 -79331 -123361 -97839 -43236 -45860 56131 12988 23553 87935 117002 188539
4429A88539n767n3149p9386J1529L5484j4935j00968p302p8903o2622k7080m9192
$$ 188539 182772 129623 50237 61766 97250 82315 -18653 -25955 -104858 -167480 -194560 -243752
4417b43752J3766j3421P8216R348J423j2630M5037P3219P572j5120K0675o858
$$ -243752 -229986 -243407 -165191 -155843 -154420 -167050 -122013 -48794 -41222 -56342 -35667 -42525
4405d2525m0823O975O2438N7176l090J4372n1266k406P8571Q2418l0944l5093
$$ -42525 -83348 -76373 -13935 43241 40151 54523 3257 851 79422 161840 130896 95803
4393I5803l7356n5891M6114K4649J938k015n3273m4201j9260P2869M6149p3882
$$ 95803 58447 2556 48670 73319 75257 73242 19969 -24232 -43492 29377 75526 1644
4381A644l5319J2467P705l743R518P1759k1037n0150R001j0566m4991n9164L640
$$ 1644 -33675 -21208 -13503 -17246 -7728 64031 42994 -7156 1845 -8721 -53712 -112876 -109236
4368a09236m2636K7901P2136m0547M7837L1525n10J14790J8971j58640k4862P9238
$$ -109236 -151872 -123971 -51835 -92382 -44545 -13020 -13530 101260 120231 -38409 -63271 15967
4356A5967K7035O041m375o5849J51l9533O7613j3733M4238K5197m0025M3338j2419
$$ 15967 43002 49043 44668 -21181 -21030 -60563 7050 -6683 37555 62752 22727 66065 53646
4343E3646j57413k0668N9408q8181o180Q4145k3233O3000O1868M0343p5865o2347
$$ 53646 -103767 -124435 -65027 -153208 -159388 -75243 -98476 -35476 26392 66735 -9130 -71477
4331g1477j3781q7687m1737J49629J8844k1042L9264j8614k5729j8974M2879K7477
$$ -71477 -85258 -172945 -214682 -65053 -46209 -67251 -27987 -46601 -72330 -91304 -48425 -20948
4319b0948P1604R8246o5206r4206j1147k9231o1554q2295n272Q4988P5857K0326
$$ -20948 50656 148902 83696 -10510 -21657 -50888 -112442 -194737 -200009 -115021 -39164 -18838
4307a8838J0037J3604j1614j348m4031j22490J9221J30349Q3382k3622N8478J6922
$$ -18838 -8801 4803 -6811 -8159 -52190 -174680 -155459 -25110 58272 34650 93128 110050
4295A10050j6565j23406l906P2422Q5493N946o7810k6613n4173L4648n947n423
$$ 110050 93485 -29921 -33827 38595 124088 130034 62224 35611 -18562 16086 10139 4716
4283D716k4594k9466j5544o798Q3193K5043L1033p1390q5285q591L362J48155
$$ 4716 -19878 -49344 -64888 -71686 11507 36550 67583 -3807 -89092 -97683 -94321 53834
4271E3834Q5352l3753j14270o5021l3673l8670q567J5505P6663P7571J729j3557
$$ 53834 139186 105433 -8837 -73858 -107531 -146201 -154768 -139263 -62600 14971 16700 3143
4259C143k4464n640Q6814L2811n8708K8559l4333j6755l3105o9255n5488P2717
$$ 3143 -21321 -26961 59853 92664 33956 62515 28182 11427 -21678 -90933 -146421 -73704
4247g3704O1624l1052K079l650J6570m6282k4587j2993R10P531k7632N6369l4046
$$ -73704 -12080 -43132 -41053 -44703 -28133 -74415 -99002 -111995 -111085 -103554 -131186 -74817 -108863
4234a08863P0495K2143k4843m3975O1339o270q058N8118J2526J0409l627k3509
$$ -108863 -38368 -16225 -41068 -85043 -23704 -29974 -38032 20086 32612 43021 39394 15885
4222A5885k2849l2226o4787R0943m6731K602M2477M8579k9516r6855k952L7707
$$ 15885 -6964 -39190 -103977 -13034 -59765 -57163 -14686 33893 4377 -92478 -95430 -57723
4210e7723j7455K0690n299r8456M6520J33395k6849j3239j8084K4950j8676K3535
$$ -57723 -75178 -54488 -59787 -158243 -111723 21672 -5177 -18416 -36500 -11550 -30226 -6691
4198f691j5876j2161J7905J3957p2062p7774M9659O9611K8061J9390n9052q6289
$$ -6691 -22567 -34728 -16823 -2866 -74928 -152702 -103043 -33432 -5371 14019 -45033 -131322
4186a31322o7931l7477Q5976J03760J6823P7716J8181j09989j4121M519k9051
$$ -131322 -199253 -236730 -150754 -46994 -30171 47545 65726 -44263 -58384 -53865 -82916
4175h2916o9809J9872R7414P7580m4722K4550l0887n1611m7804j1772L6552j6483
$$ -82916 -152725 -132853 -35439 42141 -2581 21969 -8918 -60529 -108333 -120105 -83553 -100036
4163a00036K9796k0322j8167R6812N7896j06302k4677M2423j35453l3306J53806
$$ -100036 -70240 -90562 -108729 -11917 45979 -60323 -85000 -42577 -178030 -211336 -57530
4152e7530J19527k0365p181j9428p6414m1842k2724N6341M0793O891o9916p1805
$$ -57530 61997 41632 34451 15023 -61391 -103233 -125957 -69616 -28823 -21932 -91848 -163653
4140a63653J669l6017N5747m517K5960N5144m8534L2698j5524K2216J5420J7049
$$ -163653 -161984 -198001 -142254 -146771 -120811 -65667 -114201 -81503 -97027 -74811 -59391 -42342
4128d2342j4383n8220n8799R6772K0213q8010j3787j4723m538l8067k7983J05657
$$ -42342 -56725 -114945 -173744 -76972 -56759 -144769 -158556 -173279 -177817 -215884 -243867 -138210
4116a38210J49980K51n409k6249M5047J8441j5545Q5821r541r7678m6036J2626
$$ -138210 11770 12021 6612 -19637 25410 43851 28306 114127 104586 6908 -39128 -26502
4104b6502k9365L5296R4869k2846o8967j8027L1019J3721o5721j18151j1966K4531
$$ -26502 -55867 -20571 74298 51452 -17515 -35542 -4523 9198 -56523 -174674 -186640 -162109
4092a62109m0961N4565J33763Q3723j14500K8128N8849n8533j34792L819N5976
$$ -162109 -203070 -148505 -14742 68981 -45519 -17391 41458 -17075 -151867 -148048 -92072
4081i2072Q0453l641N1274M8036l052k9503m9611k7600M8771L1987k2061n6788
$$ -92072 -11619 -15260 36014 84050 80998 51495 1884 -25716 23055 55042 32981 -23807
4069b3807q9456J5889K1786K5109j6275n223o165Q0965N2257M5705o0848q2902
$$ -23807 -113263 -97374 -75588 -50479 -66754 -71977 -78142 2823 55080 100785 39937 -42965
4057d2965L8248P1150M9933n8222j3043K7340q9506k105r083L7122K6048J36892
$$ -42965 -4717 66433 116366 58144 45101 72441 -17065 -19170 -28253 8869 34917 171809
4045A71809J3733j20611p173p5316k4402O3374J7717p0099l0668Q5159J05171
$$ 171809 185542 64931 57758 -17558 -41960 21414 39131 -30968 -61636 23523 128694
4034A28694j05101j22020n4354J6915J3655N8034k0199J538m9896k264J14476
$$ 128694 23593 -98427 -152781 -135866 -122211 -64177 -84376 -82838 -132734 -134998 -20522
4023b0522O6261j8370p0010n3697j1128j3229P6080J0200n0411L4354k9487p5463
$$ -20522 45739 27369 -42641 -96338 -107466 -120695 -44615 -34415 -84826 -50472 -79959 -155422
4011a55422m2670m2500L5638P0369Q0058J17129Q1153n7031m2471K3942p3313
$$ -155422 -198092 -240592 -204954 -134585 -54527 62602 143755 86724 44253 68195 -5118
4000e118K5149m8127o412m9226q4501l5470K5888J3087K8608J6960n835P461N5782
$$ -5118 20031 -28096 -34508 -83734 -168235 -203705 -177817 -164730 -136122 -119162 -124997 -117536 -61754
3987f1754Q7920O9565l4037n5027j08223J0708K1060L8577m6278M734l5102M0738
$$ -61754 26166 95731 61694 6667 -101556 -90848 -69788 -31211 -77489 -72755 -107857 -67119
3975f7119J64853J4927m0059k0393j6412O3934j37308o7707N1794n7967o4659
$$ -67119 97734 112661 72602 52209 35797 99731 -37577 -105284 -53490 -111457 -176116
3964a76116M4786N5583N3721Q1685n91m7665r3682p17k8259J23214N2459K7347
$$ -176116 -131330 -75747 -22026 59659 59068 11403 -82279 -82996 -111255 11959 64418 91765
3952I1765K2192M9374J914j17681p8436o0632j4421J380P0578m9829q4371L076
$$ 91765 113957 163331 165245 47564 -30872 -91504 -105925 -104545 -33967 -83796 -168167 -165091
3940a65091P4139J3741M7441L5523N667O7714K7406n7126k2836L3919k5884O5586
$$ -165091 -90952 -77211 -29770 5753 11420 79134 106540 49414 26578 60497 34613 100199
3928A00199k2366j22840q7902N0155J28169N9002J7558n8238j9010m2294L3504
$$ 100199 77833 -45007 -132909 -82754 45415 104417 121975 63737 44727 2433 35937
3917C5937p635m4040P4479J2070j561p6547N219L7299L8734J6570o7539j01736
$$ 35937 28302 -15738 58741 70811 69250 -7297 -2078 35221 73955 90525 22986 -78750
3905g8750k3910L3188K9538n422J7898K3735J7427k5750j10467L71Q8464J8730
$$ -78750 -102660 -69472 -39934 -45356 -27458 -3723 13704 -12046 -122513 -122142 -33678 -14948
3893a4948o4309n5635J05893L0341k5562q55N6463K4663L6581O4148j4377l0554
$$ -14948 -79257 -134892 -28999 1342 -24220 -25075 31388 56051 92632 156780 142403 111849
3881A11849p1387J8594O66j35833p0293Q3954J27025N5865l8354j08732J7187
$$ 111849 40462 59056 59722 -76111 -146404 -62450 64575 120440 82086 -26646 -9459
3870i459n247j0552m0381m301J5925j5697K5353J00196n6271m2650J2414L0627
$$ -9459 -14706 -25258 -65639 -69940 -54015 -69712 -44359 55837 -434 -43084 -30670 -43
3858d3J16999j1178o032p5335j3453q9630k7006J00021J2613K5057J92439m132
$$ -43 116956 105778 99746 24411 10958 -78672 -105678 -5657 6956 32013 224452 220320
3846B20320j6165J9799j22898r6801o467l094J4350k2767l5543n8025k1949l3562
$$ 220320 204155 223954 101056 4255 -2212 -5306 9044 -13723 -49266 -107291 -129240 -162802
3834a62802p8783m9426O3467J36759L4239m2282o0412J10419K166m6828n8700
$$ -162802 -241585 -291011 -227544 -90785 -56546 -98828 -159240 -48821 -46655 -93483 -152183
3823a52183N874R1490k8920m8342l351m8306l4500N2354J00249R8670N7279l555
$$ -152183 -146309 -54819 -83739 -132081 -135432 -183738 -218238 -165884 -65635 33035 90314 86759
3811H6759J8579M4925O4842o1160n2808O825n7135r381J633O0338l2385o1740
$$ 86759 105338 150263 215105 153945 101137 107962 50827 41446 43079 103417 71032 9292
3799I292o506l1876n6717n2510P4720J1591k1860l0694K8404J22871J3908j6102
$$ 9292 2786 -29090 -85807 -138317 -63597 -52006 -73866 -104560 -76156 46715 60623 44521
3787D4521l4652m3755K2195q720K9271J38789K7860p304n2205p2641j39205M8593
$$ 44521 9869 -33886 -11691 -20411 8860 147649 175509 168205 116000 43359 -95846 -47253
3775d7253J28141P8308J5806N7817p7971j19161O9658n8895p3677J9454J4841
$$ -47253 80888 159196 175002 232819 154848 35687 105345 46450 -27227 -7773 7068
3764G068j11137R879l748M9441n2328l5762O6705l9738L2939O6977L7009L668
$$ 7068 -104069 -94190 -97938 -48497 -100825 -136587 -69882 -109620 -76681 -9704 27305 30973
3752C0973j6592M0424j4052o8069l9522O2713M2348n9520r5112n911K1098K8930
$$ 30973 14381 54805 40753 -27316 -66838 -4125 38223 -21297 -116409 -122320 -101222 -72292
3740g2292l6934L1173J3244R7804L2790m9677j9182L0612q3446j8195q2582M8485
$$ -72292 -109226 -78053 -64809 32995 65785 16108 -3074 27538 -55908 -74103 -156685 -108200
3728a08200J0024J3710M7489N2663n7728j9075P1873m5541l6467P8280J5022p0459
$$ -108200 -98176 -84466 -36977 15686 -42042 -61117 10756 -34785 -71252 7028 22050 -48409
3716d8409P617J3607J8213n233k1600p7144K7893Q9656N7597l1220o4360l4724
$$ -48409 -40792 -27185 -8972 -14205 -35805 -112949 -85056 4600 62197 30977 -33383 -68107
3704f8107Q8732L8783M5851k5559p8009l519M0423l3256q1952N0873j3500l8553
$$ -68107 20625 59408 105259 79700 1691 -1828 38595 5339 -76613 -25740 -39240 -77793
3692g7793N8483O2714q383j67943L392k4774O8007J15179K2977J326n6480J4715
$$ -77793 -19310 43404 35021 -132922 -129530 -154304 -86297 28882 51859 53185 -3295 11420
3680A1420O5496J19143n891n9299q5284J10227L0532M5651m3994j72466j2907
$$ 11420 76916 196059 190168 130869 45585 155812 186344 231995 188001 15535 2628
3669B628O9052p2052r4133Q6612K2094l3738l1637L3063J1140J9723M0994m3926
$$ 2628 71680 -372 -94505 -7893 14201 -19537 -51174 -18111 -6971 12752 53746 9820
3657I820m2168J24970L1290j4492L9511k631k1374o0623p8522j0010P7047J3935
$$ 9820 -32348 92622 123912 109420 148931 146300 124926 64303 -14219 -24229 52818 66753
3645F6753q3705N8286k8852L8779J5099j5323p3103j024P1211K9270M6748J553
$$ 66753 -16952 41334 12482 51261 66360 51037 -22066 -23090 48121 77391 124139 125692
3633A25692L6173K0975o183j2377p8532o5445m1178m6737N4343J65877Q935j54830
$$ 125692 161865 182840 176657 164280 85748 20303 -20875 -67612 -13269 152608 161543 6713
3621F713q8284P8066k0732l2954M3840k1303r5332r6468K4680Q8844J50393K5929
$$ 6713 -81571 -3505 -24237 -57191 -13351 -34654 -129986 -226454 -201774 -112930 37463 63392
3609F3392r3448p8387j1251K4786R9170J32968m5538q2246o2951n6757l8141K8651
$$ 63392 -30056 -108443 -119694 -94908 4262 137230 91692 9446 -53505 -110262 -148403 -119752
3597a19752K4058M261n0548j10410K0878J5918m3264J06573k5245J629Q4876J04882
$$ -119752 -95694 -91433 -141981 -252391 -231513 -215595 -258859 -152286 -177531 -175902 -91026 13856
3585A3856k6776p3570p760N3792J4223O2636K7637j06280O9118m3989p3968M3394
$$ 13856 -12920 -86490 -94250 -40458 -26235 36401 64038 -42242 26876 -17113 -91081 -47687
3573d7687l0790K9723M8457n659J9490N1423J06927o8269L8620L2226j17147l8787
$$ -47687 -78477 -48754 -297 -5956 13534 64957 171884 103615 142235 174461 57314 18527
3561A8527N378j0081N217K8681n4541N4636N0453o0771m3429N7686O036L7028
$$ 18527 23905 13824 19041 47722 -6819 47817 98270 37499 -5930 51756 57792 94820
3549I4820m2058j0388p901M5481j9180r556l0171m415Q3740p4832p084J5041p7427
$$ 94820 52762 42374 34473 79954 60774 51218 21047 16632 100372 25540 18456 33497 -43930
3536d3930l9899L3302M7966O071n8897l3233L4795J8874p78M8226j4349K5859
$$ -43930 -83829 -50527 -2561 3510 -55387 -88620 -53825 -34951 -35729 12497 -1852 24007
3524B4007J4287r149R8268Q375o7669r3159k3402p7409Q061P4346L9636J1647
$$ 24007 38294 29145 127413 135788 68119 -25040 -48442 -125851 -117790 -43444 -3808 7839
3512G839L8225j25168o29N9259l893n0945K0448j1634o0941P1039J2386l8615
$$ 7839 46064 -79104 -79733 -20474 -24367 -75312 -54864 -66498 -127439 -56400 -44014 -82629
3500h2629l5514J9600l3366o67O8892O2654O189n2305n4770J186P4474P742Q912
$$ -82629 -118143 -98543 -131909 -132576 -63684 -1030 5159 -47146 -101916 -100730 -26256 -18514 -9602
3487i602l7014l8944l241L3748J7475J3148j0310r648J7299m5137O6589Q4565
$$ -9602 -46616 -85560 -88801 -55053 -37578 -24430 -34740 -44388 -27089 -72226 -5637 78928
3475G8928N9270k5207n1282o4262l3583M3142J4426q3731k2117m5964o9705l2646
$$ 78928 138198 112991 61709 -2553 -36136 7006 21432 -62299 -84416 -130380 -200085 -232731
3463b32731j9931O7920L2962P9592N1499Q056M4710J2240m0203Q1294r233k0570
$$ -232731 -252662 -184742 -151780 -72188 -20689 -12633 32077 44317 4114 85408 76175 55605
3451E5605k5505r7046p606N6912j0809J2674K3667L1901M2705j421o7224q1576
$$ 55605 30100 -66946 -74552 -17640 -28449 -15775 7892 39793 82498 81077 13853 -67723
3439f7723l9885J13417Q0136O933m8058k3548n4475J03845J8015k0422j7784K4083
$$ -67723 -107608 5809 85945 92878 44820 21272 -33203 70642 88657 68235 50451 74534
3427G4534K7011J4143k9487k2456p4130j1433R7848P6931j0980M396n1556n0824
$$ 74534 101545 115688 86201 63745 -10385 -21818 76030 152961 141981 146377 94821 43997
3415D3997r816j8627j08613o7560N634Q9750P1390q4964j580N6591O1683N0320
$$ 43997 34181 15554 -93059 -160619 -154985 -65235 6155 -78809 -80389 -23798 37885 88205
3403H8205k2941l8425N8434R2924k7031m588j2535M8400k1124j11728P7208L4730
$$ 88205 65264 26839 85273 178197 151166 146578 134043 182443 161319 49591 126799 161529
3391A61529m847K3634p2989j4130k2676K8798l1267o4001q1715M1730j9345N2873
$$ 161529 156682 180316 107327 93197 70521 99319 68052 4051 -77664 -35934 -55279 -2406
3379b406J41180N4080m7424q6690J0019M5777j438o9485o9961N4162q6745n3525
$$ -2406 138774 192854 145430 58740 68759 114536 113098 43613 -26348 27814 -58931 -112456
3367a12456N1499J2789o5489L7887J1848P0679O0308K9417l9007n392p293n8386
$$ -112456 -60957 -48168 -113657 -75770 -63922 6757 67065 96482 57475 52083 44790 -13596
3355a3596R1158J04264M5817j18323q7177j37513l7691N2147M9785n5389L4334
$$ -13596 77562 181826 227643 109320 22143 -115370 -153061 -100914 -51129 -106518 -72184
3344g2184O3077q5622j6256R8926N9568K1766k540k7047J382R8998M6617o1106
$$ -72184 -9107 -94729 -110985 -12059 47509 69275 66735 39688 41070 140068 186685 125579
3332A25579n2012k2723K4310j2445q3909R754p3760l6365m826R3520K1766L4914
$$ 125579 73567 50844 75154 62709 -21200 -11446 -85206 -121571 -126397 -32877 -11111 23803
3320B3803n9950K3761Q9963K0782n4646M421m6251l3922n7720j1751L8231M2560
$$ 23803 -36147 -12386 77577 98359 43713 48134 1883 -32039 -89759 -101510 -63279 -20719
3308b0719q9472J3627J22903P3916r9903n288J00590l5735n0287n5505j5049j051
$$ -20719 -110191 -96564 26339 100255 352 -4936 95654 59919 9632 -45873 -60922 -61973
3296f1973J6640j152J6819O2072K0732k1840n4084k3486j388l0050Q175P9314
$$ -61973 -45333 -46485 -29666 32406 53138 31298 -22786 -46272 -47660 -77710 -69535 9779
3284I779l1547K6812K792O3338O9819k0776r6325l8764J5995n7978M7813O5525
$$ 9779 -21768 5044 7836 71174 140993 120217 23892 -14872 1123 -56855 -9042 56483
3272E6483k0979L1232N0039J7226p724N2488l5718o775l0762j7856j6674l0439
$$ 56483 35504 66736 116775 134001 126277 178765 143047 136272 105510 87654 70980 40541
3260D0541J1044m5046p2259R257N8921J30196n0736p9542n6256R8968J19505P9705
$$ 40541 51585 6539 -65720 -56463 2458 132654 81918 2376 -53880 45088 164593 244298
3248B44298r5818k7671k2963j00749k8647Q3847l2647m4650P582J0942N0656N0897
$$ 244298 148480 120809 97846 -2903 -31550 52297 19650 -25000 -17418 -6476 44180 95077
3236I5077Q0393J0295o1027j18300j2952L7822K9912K7353r5368k7907R2802N3743
$$ 95077 175470 185765 124738 6438 -6514 31308 61220 88573 -6795 -34702 58100 111843
3224A11843J1851j32979o8177L6147N9832j13044m1896p62R3599J26772m2970
$$ 111843 123694 -9285 -77462 -41315 18517 -94527 -136423 -137185 -43586 83186 40216
3213D0216K4840n6534p0277J12720o13j07488m0019m5594m5976N3882R9357M481
$$ 40216 65056 8522 -61755 50965 50352 -57136 -97155 -142749 -188725 -134843 -35486 -31005
3201c1005n2920O1883R4618m5844n3006r938M955O200l5560K5157p600l4181J08709
$$ -31005 -83925 -22042 72576 26732 -26274 -36212 -31257 -25057 -60617 -35460 -43060 -77241 31468
3188C1468O4785J07490j16065k373K3530j4993l4030n1375N204q9846j02700O5764
$$ 31468 96253 203743 87678 85305 108835 93842 59812 8437 13641 -76205 -178905 -113141
3176a13141P8151J254K7145J04987J15894J1737l4549j09740p8220j0418j2751
$$ -113141 -34990 -33736 -6591 98396 214290 226027 191478 81738 3518 -6900 -19651
3165a9651j09163k9692J3384o6734n286Q8797K298L1049p0703M1398L1707j8026
$$ -19651 -128814 -158506 -145122 -211856 -217142 -128345 -126047 -94998 -165701 -124303 -92596 -110622
3153a10622J4030M7658K240Q1938L1657J7549p2525p4718M3379Q6331K0004J5837
$$ -110622 -96592 -48934 -46694 35244 66901 84450 11925 -62793 -19414 66917 86921 102758
3141A02758j48666k5344j1557J7762k274l40J7423J8905j5078q9547n5757L0399
$$ 102758 -45908 -71252 -82809 -65047 -67321 -67661 -50238 -31333 -46411 -135958 -191715 -161316
3129a61316k676O1740J0495J4691M0850P2545p7246M1035o416n7621l7562M2734
$$ -161316 -163992 -102252 -91757 -77066 -36216 36329 -40917 118 -6298 -63919 -101481 -58747
3117e8747l4569J8597M7828n703n5752k8405j6990J12507J10607l2788k3248K9016
$$ -58747 -93316 -74719 -26891 -32594 -88346 -116751 -133741 -21234 89373 56585 33337 62353
3105F2353p0243p166M3567k6029J0959n6229K9117m474Q5164J05357l8360m892
$$ 62353 -7890 -15056 28511 2482 13441 -42788 -13671 -18145 67019 172376 134016 129124
3093A29124O4906K9304M2469n8510m0047r6210j0007j1279j0189j38771r3972
$$ 129124 194030 223334 265803 207293 167246 71036 61029 49750 39561 -99210 -193182
3082a93182O3788K2751L3241j0134P8282J10355j6055J1125k7569p2112m305Q663
$$ -193182 -129394 -106643 -73402 -83536 -5254 105101 89046 100171 72602 490 -3815 4848
3070D848N172q0705j2360j966p3607Q3999M4240J0765J6656L7201K4170M2498
$$ 4848 10020 -70685 -83045 -85011 -158618 -74619 -30379 -19614 -2958 34243 58413 100911
3058A00911O081n1770L8664J1949j393M6597l2893l9980j13789k134l7560o5489
$$ 100911 106992 55222 93886 105835 104442 151039 118146 78166 -35623 -37757 -75317 -140806
3046a40806j4557K3354j9964r9226O0277R4808J02555M5068p0797j8740m2762
$$ -140806 -155363 -132009 -151973 -251199 -190922 -96114 6441 51509 -19288 -38028 -80790
3035h0790l508O9580L6381J4865k0791p2680L3199K8889n5647j10712P0360J53352
$$ -80790 -84298 -14718 21663 36528 15737 -56943 -23744 5145 -50502 -161214 -90854 62498
3023F2498l0095N5262P3229k09827j02363J11419J6048J6269Q530n055R5129j0456
$$ 62498 32403 87665 160894 -48933 -151296 -39877 -23829 -7560 970 -4085 91044 80588
3011H0588o3827R6365J8487q6589n8394l5715O118M2944Q8314l4618k7369O3381
$$ 80588 16761 113126 131613 45024 -13370 -49085 -42967 -23 88291 53673 26304 89685
2999H9685j0315n2793k8876l7037N9113M9798j6042K2393N8817m4810n1234j25866
$$ 89685 79370 26577 -2299 -39336 19777 69575 53533 75926 134743 89933 38699 -87167
2987h7167M8584l100L5764r6257k5679O5107N0848k601J0990j20405j2125K628
$$ -87167 -38583 -41683 -5919 -102176 -127855 -62748 -11900 -14501 -3511 -123916 -136041 -133413
2975a33413j9591J30716O6063p4511l8438J4007M8411l4851O9977p9737n424j3075
$$ -133413 -153004 -22288 43775 -30736 -69174 -55167 -6756 -41607 28370 -51367 -56791 -69866
2963f9866n0599J0994L3320L1682p243p93K0918l2004j2325L9621O8603l022q6814
$$ -69866 -120465 -109471 -76151 -44469 -51712 -52505 -31587 -63591 -75916 -36295 32308 29286 -57528
2950e7528j2044J45723l6546m1829r502P155j19017j8164J2354M0454R2118J0593
$$ -57528 -69572 76151 39605 -2224 -11726 -4571 -123588 -141752 -129398 -88944 3174 13767
2938A3767m8317k470p5953N7542J24979J639n0531q8675n9224J0249P860M5429
$$ 13767 -34550 -37020 -112973 -55431 69548 71187 20656 -68019 -127243 -116994 -109134 -63705
2926f3705J35624M3036j33907L9579o31n015k1849K8014j5077p9827l2228m219
$$ -63705 71919 114955 -18952 20627 19996 14981 -6868 21146 6069 -73758 -105986 -110205
2914a10205P674O7295J1161r529n0315o9851J18799O2760m0741j4371l36j3826
$$ -110205 -102531 -35236 -24075 -33604 -83919 -153770 -34971 27789 -12952 -27323 -27659 -41485
2902d1485l8314K9321J6636o991o8226L3639j7650l5292N5377J07482r2742r7859
$$ -41485 -79799 -50478 -33842 -40833 -109059 -75420 -93070 -128362 -72985 34497 -58245 -156104
2890a56104P6034J68420n3616p1453Q3935J4671k2699q9815M5993K5980O3974
$$ -156104 -80070 88350 34734 -36719 47216 61887 39188 -50627 -4634 21346 85320
2879H5320P0243l1455j7476n0217l3055o4543P1789N6204n1466n2053J0175N516
$$ 85320 155563 124108 106632 56415 23360 -41183 30606 86810 35344 -16709 -6534 -1018
2867a018n1397O4584J4920K4992n7900j44537J181R0179M3690n6195o6328j2808
$$ -1018 -52415 12169 27089 52081 -5819 -150356 -149175 -58996 -15306 -71501 -137829 -150637
2855a50637N4275J67376n0333k5521K1192J0980N9875P6929n494q8674j29728
$$ -150637 -96362 71014 20681 -4840 16352 27332 87207 164136 158642 69968 -59760
2844e9760m6060N0428J08703Q0277K6002m54J4648j53011j19596K2713l4951Q5693
$$ -59760 -105820 -55392 53311 133588 159590 159136 173784 20773 -98823 -76110 -111061 -25368
2832b5368q134m2514K4172j7503L420J6115O0730l7941o6991n243n2197L4474
$$ -25368 -33502 -76016 -51844 -69347 -65927 -49812 10918 -27023 -94014 -99257 -151454 -116980
2820a16980Q7036J11895O5261N2964J8437n901p9833m083R1540L228N8q1890j08028
$$ -116980 -29944 81951 147212 200176 218613 212712 132879 128796 220336 223564 223622 141732 33704
2807C3704q3952j3885J1690N471M8144j83882q5627Q4353P0843J11224J4666m1499
$$ 33704 -50248 -64133 -52443 -46972 1172 -182710 -268337 -183984 -113141 -1917 12749 -28750
2795b8750j67563M123J8170m4265r740K1462L1620R370Q9721p574R105l081k3562
$$ -28750 -196313 -192190 -174020 -218285 -228025 -206563 -174943 -165573 -75852 -83426 -74321 -77402 -100964
2782a00964R8100K7048M4736P71j43992j42582R7287J00417J2312P6105O5708
$$ -100964 -2864 24184 68920 69691 -74301 -216883 -119596 -19179 -6867 69238 134946
2771A34946p408O798r1783m0433J9813l43m7077K3799K8232l1820m008p4204j16593
$$ 134946 127538 134336 42553 2120 21933 21590 -25487 -1688 26544 -5276 -9284 -83488 -200081
2758b00081n3890K0635L5965Q5908P2042J01963P4033o4750J5861M7891l3582
$$ -200081 -253971 -233336 -197371 -111463 -39421 62542 136575 71825 87686 135577 101995
2747A01995p2723q1623m9312P4161K3716K0807R7553k1971p8100n8240J4198K0114
$$ 101995 29272 -52351 -101663 -27502 -3786 17021 114574 92603 14503 -43737 -29539 -9425
2735i425j6676N1120j2924q8126n9409J386M0082r152Q0210R724k0368p2356m5205
$$ -9425 -26101 25019 12095 -76031 -135440 -134054 -93972 -103124 -22914 -13190 -33558 -105914 -151119
2722a51119j0640k4791r267J12726L3134j1564L2580O5299k5212m9115j9528N5456
$$ -151119 -161759 -186550 -195817 -83091 -49957 -61521 -28941 36358 11146 -37969 -57497 -2041
2710b041N6134J001K8281n2346j00819L1719O2740L4596l5345k5408J5325j16715
$$ -2041 54093 55094 83375 31029 -69790 -38071 24669 59265 23920 -1488 13837 -102878
2698a02878Q1528P3977L2382J7972l7512k7135j56812q2793K4948O8957J01667
$$ -102878 -21350 52627 85009 102981 65469 38334 -118478 -201271 -176323 -107366 -5699
2687e699M1389O5005j3445j01727k2651O2617J1850m5876J8934l5931j7839J691
$$ -5699 35690 100695 87250 -14477 -37128 25489 37339 -8537 10397 -25534 -43373 -41682
2675d1682K4833N4375L7388o0919J1001L8690p550r9002m2315J42723O7168q8478
$$ -41682 -16849 37526 74914 13995 24996 63686 56136 -42866 -85181 57542 124710 36232
2663C6232k3090O7029k8241L9096O951j25792q7709L1645r621n886O2711M7681
$$ 36232 13142 80171 51930 91026 97977 -27815 -115524 -83879 -93500 -99386 -36675 11006
2651A1006J10786R979m4115l9999m4766M9203q743m9709L2463q2289k6873M2792
$$ 11006 121792 131771 87656 47657 2891 52094 43351 -6358 26105 -56184 -83057 -40265
2639d0265K0830k640M7802K7831P941q9591j6008m1926o1086q1436N7053J04244
$$ -40265 -19435 -22075 25727 53558 61499 -28092 -44100 -86026 -147112 -228548 -171495 -67251
2627f7251Q0112N3523l075j07330R454J61431O3207r0660p5028K7733l0055j5633
$$ -67251 12861 66384 63309 -44021 -34567 126864 190071 99411 24383 52116 22061 6428
2615F428J46286m1993j00290k8269o7947k3361K0461K0299Q2611K1677m0267p0483
$$ 6428 152714 110721 10431 -17838 -85785 -109146 -88685 -68386 14225 35902 -4365 -74848
2603g4848l0773P4456j58239k9705O5316k9524M4735O0763o3144J494L7226l9484
$$ -74848 -105621 -31165 -189404 -219109 -153793 -183317 -138582 -77819 -140963 -139469 -102243 -141727
2591a41727p4534J41508L0636q517O2859o0719l2652k6345P306J7223K4964M1142
$$ -141727 -216261 -74753 -44117 -52634 10225 -50494 -83146 -109491 -102185 -84962 -59998 -18856
2579a8856j2020r51J06776Q108J814j5793k6002M8963n3831n497l883p6028L8269
$$ -18856 -30876 -31827 74949 83057 84871 69078 43076 92039 38208 32711 28828 -47200 -8931
2566h931Q0477J2605r6783r4074o1126L7277O5783n0925J6580N6442J14282q202
$$ -8931 71546 84151 -12632 -106706 -167832 -130555 -64772 -115697 -99117 -42675 71607 63405
2554F3405m936M3467L698j6224k1341q6272K0j8431l3768J02084M2773L8717K6228
$$ 63405 58469 101936 105634 89410 68069 -18203 -18183 -36614 -70382 31702 74475 113192 139420
2541A39420r5111k465j9301k3389l3951p5421l6446l6790k4977j5397L7802J02012
$$ 139420 44309 41844 22543 -846 -34797 -110218 -146664 -183454 -208431 -223828 -186026 -84014
2529h4014j4216l4808L8087M507j7888J00644R6554O9599k2978L1047r5679r7618
$$ -84014 -98230 -133038 -94951 -90444 -108332 -7688 88866 158465 135487 166534 70855 -26763
2517b6763q8350Q230Q1771m3442M87j6752r0513N4708J20987M04r9457j1751Q1099
$$ -26763 -115113 -106883 -25112 -68554 -68067 -84819 -175332 -120624 363 767 -98690 -110441 -29342
2504b9342J52749n2537j42616k5166K3468N8109R2892k6115o8764q1760K2354
$$ -29342 123407 70870 -71746 -96912 -73444 -15335 77557 51442 -17322 -99082 -76728
2493g6728M7107l8513k9696j7926N0939l6170n055P2257N589m3298n1420J06398
$$ -76728 -29621 -68134 -97830 -115756 -64817 -100987 -106042 -33785 -28196 -71494 -122914 -16516
2481a6516L4735j3531J621k0602M6510Q3994r2231j15893q1621P3076L7753j5733
$$ -16516 18219 4688 6309 -14293 32217 116211 23980 -91913 -173534 -100458 -62705 -78438
$$ [...]
##END NTUPLES=NMR SPECTRUM
##END=
