##TITLE=Analysis number 313648
Compound Code sb 01062
Project Code adrs
Chemist Name stores
##JCAMPDX= 6.0         $$ Bruker NMR JCAMP-DX V2.0
##DATA TYPE= NMR SPECTRUM
##DATA CLASS= NTUPLES
##ORIGIN= Bruker BioSpin GmbH
##OWNER= NMR
$$ XWIN-NMR		Version 3.5
$$ Thu Sep 15 15:21:45 2005 GMT Daylight Time (UT+1h)  MAYBRIDGE\NMR@NMR_250MHZ
##.OBSERVE FREQUENCY= 250.131544655141
##.OBSERVE NUCLEUS= ^1H
##.ACQUISITION MODE= SIMULTANEOUS (DQD)
##.ACQUISITION SCHEME= undefined
##.AVERAGES= 16
##.DIGITISER RES= 18
##SPECTROMETER/DATA SYSTEM= dpx250
##.PULSE SEQUENCE= zg30
##.SOLVENT NAME= DMSO
##.SHIFT REFERENCE= (INTERNAL, DMSO, 0, 16.5096)
##AUDIT TRAIL= $$ (NUMBER, WHEN, WHO, WHERE, WHAT)
$$ ##TITLE= Audit trail, XWIN-NMR		Version 3.5
$$ ##JCAMPDX= 5.01
$$ ##ORIGIN= Bruker BioSpin GmbH
$$ ##OWNER= NMR
$$ C:\u/data/dgb/nmr/ADRS/9540/pdata/1/auditp.txt
$$ ##AUDIT TRAIL=  $$ (NUMBER, WHEN, WHO, WHERE, WHAT)
(   1,<2005-09-15 15:21:26.16 +100>,<MAYBRIDGE\NMR>,<NMR_250MHZ>,
      <created by zg, POWCHK disabled, PULCHK disabled
       configuration hash MD5:
       62 19 C7 07 E1 42 D1 B7 37 6C 3D D0 77 39 F9 E6
       data hash MD5: 64K
       74 07 A2 F2 66 68 4C B3 34 F8 E4 C5 B2 E0 5B 47>)
(   2,<2005-09-15 15:21:37.77 +100>,<MAYBRIDGE\NMR>,<NMR_250MHZ>,
      <Start of raw data processing
       ef LB = 0.3 FT_mod = 6 PKNL = 1 SI = 32K 
       data hash MD5: 32K
       8B AE 7E D8 29 59 02 33 84 D9 4D 6C 6A 13 6C CD>)
(   3,<2005-09-15 15:21:39.53 +100>,<MAYBRIDGE\NMR>,<NMR_250MHZ>,
      <apk 
       data hash MD5: 32K
       57 DB D2 76 AE BB F4 6D 91 71 6D D7 C8 1A 97 58>)
(   4,<2005-09-15 15:21:40.19 +100>,<MAYBRIDGE\NMR>,<NMR_250MHZ>,
      <abs ABSG = 5 
       data hash MD5: 32K
       8F CB 6A 8B 2D 22 C2 5C A2 06 BE 16 FB 45 02 F6>)
$$ ##END=
$$ 
$$ hash MD5
$$ 4C 1F 42 3A 47 39 2F CF 77 80 C4 68 49 5A 0D 85
##$RELAX= 
##$RELAX= 
##$RELAX= 
##$RELAX= 
##$RELAX= 
##$RELAX= 
##$RELAX= 
$$ Bruker specific parameters
$$ --------------------------
##$DU= <C:\u>
##$EXPNO= 9540
##$NAME= <ADRS>
##$PROCNO= 1
##$TYPE= <nmr>
##$USER= <dgb>
##$AMP= (0..31)
100 100 100 100 100 100 100 100 100 100 100 100 100 100 100 100 100 100 
100 100 100 100 100 100 100 100 100 100 100 100 100 100 
##$AQSEQ= 0
##$AQ_mod= 3
##$AUNM= <au_zg>
##$AUTOPOS= <31 >
##$BF1= 250.13
##$BF2= 250.13
##$BF3= 250.13
##$BF4= 250.13
##$BF5= 500.13
##$BF6= 500.13
##$BF7= 500.13
##$BF8= 500.13
##$BYTORDA= 1
##$CFDGTYP= 0
##$CFRGTYP= 5
##$CHEMSTR= <none>
##$CNST= (0..31)
1 1 145 1 1 1 1 1 1 1 1 1 1 1 1 1 1 1 1 1 1 1 1 1 1 1 1 1 1 1 1 1 
##$CPDPRG= <>
##$CPDPRG1= <>
##$CPDPRG2= <>
##$CPDPRG3= <>
##$CPDPRG4= <mlev>
##$CPDPRG5= <mlev>
##$CPDPRG6= <mlev>
##$CPDPRG7= <mlev>
##$CPDPRG8= <mlev>
##$CPDPRGB= <>
##$CPDPRGT= <>
##$D= (0..31)
0 1 0 0 0 0 0 0 0 0.06 0 0 0 0 0 0 0.0002 0 0 0 0 0 0 0 0 0 0 0 0 0 0 
0 
##$DATE= 1126794085
##$DBL= (0..7)
120 120 120 120 120 120 120 120 
##$DBP= (0..7)
150 150 150 150 150 150 150 150 
##$DBP07= 0
##$DBPNAM0= <>
##$DBPNAM1= <>
##$DBPNAM2= <>
$$ [...]
##$SUBNAM7= <"">
##$SUBNAM8= <"">
##$SUBNAM9= <"">
##$SW= 20.6930455092707
##$SWIBOX= (0..15)
0 0 3 0 0 0 0 0 0 0 0 0 0 0 0 0 
##$SW_h= 5175.983436853
##$TD= 65536
##$TD0= 1
##$TE= 295.16
##$TE2= 300
##$TE3= 300
##$TEG= 300
##$TL= (0..7)
0 120 120 120 120 120 120 120 
##$TP= (0..7)
150 150 150 150 150 150 150 150 
##$TP07= 0
##$TPNAME0= <>
##$TPNAME1= <>
##$TPNAME2= <>
##$TPNAME3= <>
##$TPNAME4= <>
##$TPNAME5= <>
##$TPNAME6= <>
##$TPNAME7= <>
##$TPOAL= (0..7)
0.5 0.5 0.5 0.5 0.5 0.5 0.5 0.5 
##$TPOFFS= (0..7)
0 0 0 0 0 0 0 0 
##$TUNHIN= 0
##$TUNHOUT= 0
##$TUNXOUT= 0
##$USERA1= <user>
##$USERA2= <user>
##$USERA3= <user>
##$USERA4= <user>
##$USERA5= <user>
##$V9= 5
##$VALIST= <valist>
##$VCLIST= <CCCCCCCCCCCCCCC>
##$VD= 0
##$VDLIST= <DDDDDDDDDDDDDDD>
##$VPLIST= <PPPPPPPPPPPPPPP>
##$VTLIST= <TTTTTTTTTTTTTTT>
##$WBST= 1024
##$WBSW= 4
##$XGAIN= (0..3)
0 0 0 0 
##$XL= 0
##$YL= 0
##$YMAX_a= 305120
##$YMIN_a= -494489
##$ZGOPTNS= <>
##$ZL1= 120
##$ZL2= 120
##$ZL3= 120
##$ZL4= 120
##$ABSF1= 16.50956
##$ABSF2= -4.183613
##$ABSG= 5
##$ABSL= 3
##$ALPHA= 0
##$AQORDER= 0
##$ASSFAC= 0
##$ASSFACI= 0
##$ASSFACX= 0
##$ASSWID= 0
##$AUNMP= <proc_1d>
##$AZFE= 0.1
##$AZFW= 0.1
##$BCFW= 0
##$BC_mod= 0
##$BYTORDP= 0
##$COROFFS= 0
##$CY= 12.5
##$DATMOD= 1
##$DC= 0
##$DFILT= <>
##$DTYPP= 0
##$F1P= 14.0000005364418
##$F2P= -0.99999901652339
##$FCOR= 0.5
##$FTSIZE= 32768
##$FT_mod= 6
##$GAMMA= 0
##$GB= 0
##$INTBC= 1
##$INTSCL= 1
##$ISEN= 128
##$LB= 0.3
##$LEV0= 0
##$LPBIN= 0
##$MAXI= 10000
##$MC2= 0
##$MEAN= 0
##$ME_mod= 0
##$MI= 0
##$NCOEF= 0
##$NC_proc= -4
##$NLEV= 6
##$NOISF1= 0
##$NOISF2= 0
##$NSP= 0
##$NTH_PI= 0
##$NZP= 0
##$OFFSET= 16.50956
##$PC= 1
##$PHC0= -89.73634
##$PHC1= 9.51505
##$PH_mod= 1
##$PKNL= yes
##$PPARMOD= 0
##$PSCAL= 4
##$PSIGN= 0
##$REVERSE= no
##$SF= 250.130003111699
##$SI= 32768
##$SIGF1= 0
##$SIGF2= 0
##$SINO= 400
##$SIOLD= 32768
##$SREGLST= <1H.DMSO>
##$SSB= 0
##$STSI= 32768
##$STSR= 0
##$SW_p= 5175.98343685301
##$SYMM= 0
##$S_DEV= 0
##$TDeff= 65536
##$TDoff= 0
##$TI= <Analysis number 999999
Compound Code 99
Book Reference 9
Project Code 9>
##$TILT= no
##$TM1= 0
##$TM2= 0
##$TOPLEV= 0
##$USERP1= <user>
##$USERP2= <user>
##$USERP3= <user>
##$USERP4= <user>
##$USERP5= <user>
##$WDW= 1
##$XDIM= 32768
##$YMAX_p= 289858017
##$YMIN_p= -329625
$$ End of Bruker specific parameters
$$ ---------------------------------
##NTUPLES= NMR SPECTRUM
##VAR_NAME=  FREQUENCY,     SPECTRUM/REAL,   SPECTRUM/IMAG
##SYMBOL=    X,             R,               I
##VAR_TYPE=  INDEPENDENT,   DEPENDENT,       DEPENDENT
##VAR_FORM=  AFFN,          ASDF,            ASDF
##VAR_DIM=   32768,         32768,           32768
##UNITS=     HZ,            ARBITRARY UNITS, ARBITRARY UNITS
##FACTOR=    0.157963299565203, 1,           1
##FIRST=     4129.53620196177, 0,            0
##LAST=      -1046.44723489124, 0,           0
##MIN=       -1046.44723489124, -329625,     0
##MAX=       4129.53620196177, 289858017,    0
$$ Real data points
##PAGE= N=1
##DATA TABLE= (X++(R..R)), XYDATA
$$ [...]
17409D2974L2401J7682p1145l5840M8810l4579J3423N8365M6167j5984n7129l4158
$$ 42974 75375 93057 21912 -13928 34882 303 13726 72091 118258 102274 45145 10987
17397A0987L4905k4688n3837K7438n6539n0034N6263L5195l2221r467M6256n621
$$ 10987 45892 21204 -32633 -5195 -61734 -111768 -55505 -20310 -52531 -61998 -15742 -21363
17385b1363n3232Q433J34982R7258P017K4317m1330l8948o9936n62K3399K6270
$$ -21363 -74595 -66162 68820 166078 173095 197412 156082 117134 47198 46636 70035 96305
17373I6305L211n3284K2950l4739M3501m1013l0153M0325N6678J3428n238j526
$$ 96305 99516 46232 69182 34443 77944 36931 6778 47103 103781 117209 111971 110445
17361A10445o455N5180N4106M7585o1366j6965M0497j8619r7870k7509k6716L5989
$$ 110445 103990 159170 213276 260861 199495 182530 223027 204408 106538 79029 52313 88302
17349H8302J06756r938n4973l1814K6807M3601N3753N0473l9482L8330L3236j3432
$$ 88302 195058 185120 130147 98333 125140 168741 222494 272967 233485 271815 305051 291619
17337B91619p0489m9684k2869R7748L0234n675m0714j09873j03770l867L8306
$$ 291619 221130 171446 148577 246325 276559 270884 230170 120297 16527 12660 50966
17326E0966K7003J4702R8729J6484n1199o747j4678k8371m6640M8598O3688m9307
$$ 50966 77969 92671 191400 207884 156685 149938 135260 106889 60249 108847 172535 123228
17314A23228j580K4896j1766m1784P6183Q8661J1265m3328M2729j02735o0735
$$ 123228 121648 146544 134778 92994 169177 257838 269103 225775 268504 165769 105034
17303A05034O1076N2240K3628K8829K4794l3169n827K3304R8256O1104L813K574
$$ 105034 166110 218350 241978 270807 295601 262432 256605 279909 378165 439269 443082 445656
17291D45656M683m7476k1995J7497O082L324r7448o4682L4757R158j7496p0729
$$ 445656 450339 402863 380868 398365 404447 407771 310323 245641 280398 289556 272060 201331
17279B01331m6113N7611L4508j3679o3866K8047p1817j0785J3429p801l3979n64
$$ 201331 155218 212829 247337 233658 169792 197839 126022 115237 128666 120865 86886 86322
17267H6322N9352k4004p0483L3889J7416L9664R8k9918L6065m0961k7174K1403
$$ 86322 145674 121670 51187 85076 102492 142156 142254 112336 148401 107440 80266 101669
17255A01669J2707M8419M7188J2719o5722k9859P5751K662k2096J8119r5970K0629
$$ 101669 114376 162795 209983 222702 156980 127121 202872 205534 183438 201557 105587 126216
17243A26216M3976k2877n8523J8496M9976j6698p2183m6106P4176Q458k3657N5886
$$ 126216 170192 147315 88792 107288 157264 140566 68383 22277 96453 104911 81254 137140
17231A37140Q7892k3880q8254j04258N445L2970K3203N3299k8288l124L1700k1925
$$ 137140 225032 201152 112898 8640 14085 47055 70258 123557 95269 92145 123845 101920
17219A01920J1435j3917o9885P797L6801J3993L54J07243K500K7998k7313o3501
$$ 101920 113355 99438 29553 37350 74151 88144 88498 195741 198241 226239 198926 135425
17207A35425L7711j3743j754k7480J1049j0300m1446j3695J6221R397k0154l512
$$ 135425 173136 159393 157639 130159 141208 130908 89462 75767 91988 101385 81231 77719
17195G7719J9874q2183l5265J22427P6193k6146m7699m1983M0177M4091j3667
$$ 77719 97593 15410 -19855 102572 178765 152619 104920 62937 103114 147205 133538
17184A33538p9510n5827O5493K8459j1165L7219L3852N2255n0149o6785k629J4926
$$ 133538 54028 -1799 63694 92153 80988 118207 152059 204314 154165 87380 84751 99677
17172I9677l28J08067k0802k5988K9390m060n8432O2748M5230J514p9430r5175
$$ 99677 99349 207416 186614 160626 190016 185956 127524 190272 235502 237016 157586 62411
17160F2411q6549R296Q2007j7838o4395O1308K6764M434L0843P6654M9212J812
$$ 62411 -24138 -14842 67165 49327 -15068 46240 73004 77438 108281 184935 234147 235959
17148B35959J2756j1235j07701j2304M3451L8745Q6053P285l0817j7299N2232
$$ 235959 248715 237480 129779 117475 160926 199671 285724 293009 262192 244893 297125
17137B97125K876p0207k6894L8214n2601M903O3959N2103K9710L4024K12k9039
$$ 297125 300001 229794 202900 241114 188513 193416 257375 309478 339188 373212 373424 344385
17125C44385o7541m8983j2945k2753Q9007M94m1071J1674L0791K94o6473M0842
$$ 344385 276844 227861 214916 192163 281170 281664 240593 252267 283058 283352 216879 257721
17113B57721L9039K6162k6092m9457j1956M6958Q6080N5566K6408L7008m0830
$$ 257721 296760 322922 296830 247373 235417 282375 368455 424021 450429 487437 446607
17102D46607q3961L9175J04153O985j2582l3311l3725Q708j222m3731K6341J2595
$$ 446607 362646 401821 505974 512959 500377 467066 433341 442049 440827 397096 423437 436032
17090D36032L1958j11939m0261N3114m5062L6350L1264r9214K1143n459n7323
$$ 436032 467990 356051 315790 368904 323842 360192 391456 292242 313385 307926 250603
17079B50603k3258R5749J08312K3072j61700n7318K9053O5333L8182K2829j262
$$ 250603 227345 323094 431406 454478 292778 235460 264513 329846 368028 390857 389595
17068C89595m4990j139l0512J19803Q336n1162q0136j4726N1511k1285O8158P2444
$$ 389595 344605 343466 312954 432757 441093 389931 309795 295069 346580 325295 393453 465897
17056D65897n3594n7715j18833n6206P7329J34352N3400L154O656k4864j4440
$$ 465897 412303 354588 235755 179549 256878 391230 444630 447784 454440 429576 415136
17045D15136j35532n1229m0656N9979L7548P0049L1311N2369L3508M5917m4049
$$ 415136 279604 228375 187719 247698 285246 355295 386606 438975 472483 518400 474351
17034D74351m4568J7095K7910r5086o9184M8205l1211q0771j7541P811p360J8149
$$ 474351 429783 446878 474788 379702 310518 358723 327512 246741 229200 237011 229651 247800
17022B47800Q1849M6508N8499N7362Q9609J7707j06636r4161J04341L9436n3981
$$ 247800 329649 376157 434656 492018 581627 599334 492698 398537 502878 542314 488333
17011D88333M461k188l0255k0492l664L5676L9419N7047J1608o2390j9147n367
$$ 488333 492794 490606 460351 439859 436195 471871 511290 568337 579945 517555 498408 493041
16999D93041k9659O0133m022k6238J43518L1737J0096N4922J7923M3383N1228
$$ 493041 463382 523515 519493 493255 636773 668510 678606 733528 751451 794834 846062
16988H46062o637q3317n7642o602L7340P613k0802J3633J1105J1078O5005J13120
$$ 846062 839425 756108 698466 691864 729204 736817 716015 729648 740753 751831 816836 929956
16976I29956R2229N1295m4466L521m6333n5055K7438Q447P3332K1113r431M6091
$$ 929956 1022185 1073480 1029014 1032535 986202 931147 958585 967032 1040364 1061477 1052046 1098137
16964A098137j4298j1393o2825l8249L2117N4617J39552O7788J7286o3125j03437
$$ 1098137 1083839 1072446 1009621 971372 1003489 1058106 1197658 1265446 1282732 1219607 1116170
16953A116170K3090M7974O3207M9631J22257O4644m2551l9906m8731M5634P52
$$ 1116170 1139260 1187234 1250441 1300072 1422329 1486973 1444422 1404516 1355785 1401419 1402171
16942A402171J14161r984p290M4566M7686N0299L6943j0686M193O9776k067M1340
$$ 1402171 1516332 1506348 1499058 1543624 1591310 1641609 1678552 1667866 1672059 1741835 1739768 1781108
16930A781108j4177j0073L5650O1588k0510M9976L1432N4668K0175M2571Q7473
$$ 1781108 1766931 1756858 1792508 1854096 1833586 1883562 1914994 1969662 1989837 2032408 2119881
16919B119881O0794R8421O4423R5440J7080M5230J7226J0668O7178R5984R6299
$$ 2119881 2180675 2279096 2343519 2438959 2456039 2501269 2518495 2529163 2596341 2692325 2788624
16908B788624J16266R2936K5132m2111j0273J70689J63971R7837q140O6965J00182
$$ 2788624 2904890 2997826 3022958 2980847 2970574 3141263 3305234 3403071 3394931 3461896 3562078
16897C562078M6284Q6425J94683J03702J28511J73001J19494J08996L8049N2093
$$ 3562078 3608362 3694787 3889470 3993172 4121683 4294684 4414178 4523174 4561223 4613316
16887D613316J53236J39630J00251K55676J83685J22076K59769J46523J63596
$$ 4613316 4766552 4906182 5006433 5262109 5445794 5567870 5827639 5974162 6137758
16878F137758K62787K11053J61944K23625L20901K93457K67096K84930L36395
$$ 6137758 6400545 6611598 6773542 6997167 7318068 7611525 7878621 8163551 8499946
16869H499946K85802K56596L25671M21778M12077L68588M39764N02403N28440
$$ 8499946 8785748 9042344 9368015 9789793 10201870 10570458 11010222 11512625 12041065
16860A2041065N42734N01214O20718P02684P06841P31607P47071Q63429R07682
$$ 12041065 12583799 13085013 13705731 14408415 15115256 15846863 16593934 17457363 18365045
16851A8365045R68782J028185J139954J225023J245829J344735J428166J578207
$$ 18365045 19333827 20362012 21501966 22726989 23972818 25317553 26745719 28323926
16843B8323926J696824J884919J972655K143792K342703K546909K666543K831497
$$ 28323926 30020750 31905669 33878324 36022116 38364819 40911728 43578271 46409768
16835D6409768L075694L210557L364122L586461L784970L825754L962783M072459
$$ 46409768 49485462 52696019 56060141 59646602 63431572 67257326 71220109 75292568
16827G5292568M043641L991214L914917L649031L358107K953091K506956J906074
$$ 75292568 79336209 83327423 87242340 90891371 94249478 97202569 99709525 101615599
16819A01615599J284757N70156q4154q11650j462842k001006k475884k932406
$$ 101615599 102900356 103470512 103386358 102574708 101111866 99110860 96634976 93702570
16811I3702570l247592l533080l714143l808398l785365l762572l736719l642489
$$ 93702570 90454978 86921898 83207755 79399357 75613992 71851420 68114701 64472212
16803F4472212l603673l407190l173603l033501k870676k679659k530533k406987
$$ 64472212 60868539 57461349 54287746 51254245 48383569 45703910 43173377 40766390
16795D0766390k241767k082459j899946j884269j761937j463441j449826j453702
$$ 40766390 38524623 36442164 34542218 32657949 30896012 29432571 27982745 26529043
16787B6529043j313649j262487j179043j045997r20030q88232q61473p85038p77859
$$ 26529043 25215394 23952907 22773864 21727867 20807837 19919605 19058132 18273094 17495235
16778A7495235p70252o36220n68608n91074n55409n60114n63997m31728m21821
$$ 17495235 16724983 16088763 15520155 14929081 14373672 13813558 13249561 12817833 12396012
16769A2396012m90691l62495l37973m02907l54574l12420l17101k24793k25749
$$ 12396012 11905321 11542826 11204853 10801946 10447372 10134952 9817851 9593058 9367309
16760I367309k85345l25476l26040k05285k49745k24848k57166j38286j51471
$$ 9367309 9081964 8756488 8430448 8225163 7975418 7750570 7493404 7355118 7203647
16751G203647j95812j76536j96758k29670j57619j50241r7928j21761j34116o8112
$$ 7203647 7007835 6831299 6634541 6404871 6247252 6097011 5999083 5877322 5743206 5675094
16741E675094j33756j04977j63587j1797o0975j65035j16774j30419p8541r0647
$$ 5675094 5541338 5436361 5272774 5260977 5200002 5034967 4918193 4787774 4709233 4618586
16731D618586o6207o7178j02396p5122j22074j10851r8292n3159j03024l4191
$$ 4618586 4552379 4485201 4382805 4307683 4185609 4074758 3976466 3923307 3820283 3786092
16721C786092j07560j4461l5992l5460n1559m9323l9356m8561n774p9509j03729
$$ 3786092 3678532 3664071 3628079 3592619 3541060 3491737 3452381 3403820 3398046 3318537 3214808
16710C214808l0954k3484j1253o0485p7837r2061k4163q477N3664K5399j13387
$$ 3214808 3183854 3160370 3149117 3088632 3010795 2918734 2894571 2886094 2939758 2965157 2851770
16699B851770j19274p4461j119M9009o8035q9813j6530j8803M4074m2007r4707
$$ 2851770 2732496 2658035 2656916 2705925 2637890 2548077 2531547 2512744 2556818 2514811 2420104
16688B420104K0705J9244k3992m7003o8500M969k3715k2346p0536n5666j24003
$$ 2420104 2440809 2460053 2436061 2389058 2320558 2325527 2301812 2279466 2208930 2153264 2029261
16677B029261N0725L848m3103n607j15773j7342k761J20356M9233l0881p6224
$$ 2029261 2079986 2083834 2040731 2035124 1919351 1902009 1899248 2019604 2068837 2037956 1961732
16666A961732l4626l8861j59742K4269O8887J1604O2530k2938O053N9927j2988
$$ 1961732 1927106 1888245 1728503 1752772 1821659 1833263 1895793 1872855 1878908 1938835 1925847
16655A925847j2795n9469q1043j12817k5840j2321O9484M199q6971o9910K8772
$$ 1925847 1913052 1853583 1772540 1659723 1633883 1621562 1691046 1695245 1608274 1538364 1567136
16644A567136N1489o560j6038J0013l4275m6062L0112L6727P620M7062n0038j10794
$$ 1567136 1618625 1612065 1596027 1606040 1571765 1525703 1555815 1592542 1600162 1647224 1597186 1486392
16632A486392j3255N8049J8902M5761K8866p7169o0926P6699O0259O718k1073
$$ 1486392 1473137 1531186 1550088 1595849 1624715 1547546 1486620 1563319 1623578 1630296 1609223
16621A609223L7712k5892o5391q6541J2903J1918j8870n5784L592k0902L6698
$$ 1609223 1646935 1621043 1555652 1469111 1482014 1493932 1475062 1419278 1422870 1401968 1438666
16610A438666l1328l131k7995n820P383o3245l8698k5031N6556J4971p6200q778
$$ 1438666 1407338 1404207 1376212 1370392 1377775 1314530 1275832 1250801 1307357 1322328 1246128 1237350
16598A237350N6902Q8353K3244j0983k5441q3122n2791L7183m7947n8185L7237
$$ 1237350 1294252 1382605 1405849 1394866 1369425 1286303 1233512 1270695 1222748 1164563 1201800
16587A201800l0808M0582Q8405q3136j21765j3956J7942L8814m473K5568j00710
$$ 1201800 1170992 1211574 1299979 1216843 1095078 1081122 1099064 1137878 1133405 1158973 1058263
16576A058263l6569P4813N2198L1587K3348k7146r6685p8218m1122N0200J0576
$$ 1058263 1021694 1096507 1148705 1180292 1203640 1176494 1079809 1001591 960469 1010669 1021245
16565A021245j6547J61239Q013q3568O091J07790O0345q6281M8576K6148k9596
$$ 1021245 1004698 1165937 1173950 1090382 1096473 1204263 1264608 1178327 1226903 1253051 1223455
16554A223455k8007K1145k7363l9021L0587k6377n8448j1238P037L801J22237
$$ 1223455 1195448 1216593 1189230 1150209 1180796 1154419 1095971 1084733 1091770 1095571 1217808
16543A217808J07622p107O956L0946p2665j42148r125R8392k1519m9251k3191
$$ 1217808 1325430 1318323 1325279 1356225 1283560 1141412 1132287 1230679 1209160 1159909 1136718
16532A136718o978m4297p5642m6581R918l5372K2175M136j6900M045P546j16674
$$ 1136718 1129740 1085443 1009801 963220 973138 937766 959941 964077 947177 951222 958768 842094
16520H42094m5652j9781o0317p7633k5167L8510K5927Q9595J524k7084o4429l0826
$$ 842094 796442 776661 716344 638711 613544 652054 677981 767576 769100 742016 677587 646761
16508F46761o0619r7991N9264Q1075n3975K2451k6933n2209M8256J1152r652K4943
$$ 646761 586142 488151 547415 628490 574515 596966 570033 517824 566080 577232 567580 592523
16496E92523O0700k0690j5302j01973q7890K4687N2676J9859k9421L1231M1839
$$ 592523 653223 632533 617231 515258 427368 452055 504731 524590 495169 526400 568239
16485E68239M4832l9239j6706J6258N3531k5859K3145k0287l8270K8203l9237
$$ 568239 613071 573832 557126 573384 626915 601056 624201 603914 565644 593847 554610
16474E54610o4551K3133l1963R964K6488j10495J8091O3036O8373n44j01684m0520
$$ 554610 490059 513192 481229 491193 517681 407186 425277 488313 556686 556142 454458 413938
16462D13938P0567k2409J2428k5178P146l6558p841J1595L5194j9985m8495m5457
$$ 413938 484505 462096 474524 449346 456492 419934 412093 423688 458882 438897 390402 344945
16450C44945M3705K2245K6080K3940M2362J4226K9607M127k7111j7648q3869j3078
$$ 344945 388650 410895 436975 460915 503277 517503 547110 551237 524126 506478 422609 409531
16438D09531K8378l9468j4255j5128j326L1214J3285q5968M222j8051o306M6234
$$ 409531 437909 398441 384186 369058 367732 398946 412231 326263 330485 312434 306128 352362
16426C52362j4673P8821J5708P3294m9526p2855j8976n7031l2698O8664K4578
$$ 352362 337689 416510 432218 505512 455986 383131 364155 307124 274426 343090 367668
16415C67668N1312n0032k6484j8776Q915J7130o0997j02403o4734N1551J7674
$$ 367668 418980 368948 342464 323688 332603 349733 288736 186333 121599 173150 190824
16404A90824M6202Q2817J2225j3942J7970K8274k4605k2805Q655p2778n2591N3604
$$ 190824 237026 319843 332068 318126 336096 364370 339765 316960 325615 252837 200246 253850
16392B53850Q4P2437p2594l2598m0518M9819O8693p988k230J5229n6867n0366
$$ 253850 253934 326371 253777 221179 180661 230480 299173 291185 288955 304184 247317 196951
16380A96951O432J0482N6745P8656j4033r4229o2783O5707r526K1953o3372l3089
$$ 196951 203383 213865 270610 349266 335233 241004 178221 243928 234402 256355 192983 159894
16368A59894m4390J495R701J8371k686M5182O2842j2335K0206o0297L3145N6113
$$ 159894 115504 116999 126700 145071 142385 187567 250409 238074 258280 197983 231128 287241
16356B87241j3038r2569J3201M7528j2846k8880k5617l3155R832l4068m9643M6016
$$ 287241 274203 181634 194835 242363 229517 200637 175020 141865 151697 117629 67986 114002
16344A14002L757O8789K0432n5345K4275m4848j13155j11844j2017K8816J22996
$$ 114002 117759 186548 206980 151635 175910 131062 17907 -93937 -105954 -77138 45858
16333D5858J4956q561l0625L9502L5123M6185r5581l7887R1023q081P5749K9779
$$ 45858 60814 52253 21628 61130 96253 142438 46857 8970 99993 91912 167661 197440
16321A97440j1240o5038o0216r6257O466Q9249J01889K4175k3344k4336j7550
$$ 197440 186200 121162 60946 -35311 -28845 60404 162293 186468 163124 138788 121238
16310A21238M2712j913k4628P7372m6076m3247j2966M0943l4309n0758M4012P5490
$$ 121238 163950 162037 137409 214781 168705 125458 112492 153435 119126 68368 112380 187870
16298A87870K7199m1974j21664J8636Q3690n646o6400m6775L3512K9786l8297
$$ 187870 215069 173095 51431 70067 153757 148111 81711 34936 68448 98234 59937
16287E9937K022P3729J8551K5915P250q7635j5821O1202N70o9508p57J8898Q828
$$ 59937 61959 135688 154239 180154 187404 99769 83948 145150 145720 76212 75455 94353 103181
16274A03181M8478k1060L5225j8685j0562J9871r5813m1190N9370L263N1520J04600
$$ 103181 151659 130599 165824 147139 136577 156448 60635 19445 78815 82078 133598 238198
16262B38198j5363j6103O6558k0607m2623M1442j00564n5362k9565L8065L0221
$$ 238198 222835 206732 273290 252683 210060 251502 150938 95576 66011 104076 134297
16251A34297p995O0416L2801l851k8992n5134J5152L1256k7745o8335m1902j2566
$$ 134297 126302 186718 219519 215668 186676 131542 146694 177950 150205 81870 39968 27402
16239B7402o1163q7146J4098J9085O503N1054N6805k6583M2319N352m0776O182
$$ 27402 -33761 -120907 -106809 -87724 -81221 -30167 26638 55 42374 47726 6950 13132
16227A3132m4595P1814J03942M9105N1124J7575L4957r259j54738n4278R3859
$$ 13132 -31463 40351 144293 193398 244522 262097 297054 287795 133057 78779 172638
16216A72638K2597k6594r8127q5456J9304K9601J3795n8382q702R5202M7695j7091
$$ 172638 195235 168641 70514 -14942 4362 33963 47758 -10624 -19326 75876 123571 106480
16204A06480j0832O5362M7092j8395n8720j01389l6140J4993N7495M032m6q9902
$$ 106480 95648 161010 208102 189707 130987 29598 -6542 8451 65946 69978 69932 -19970
16192a9970M7936L2407o4021N0417J205n1267Q9621n998J0002k919n1896j2355
$$ -19970 27966 60373 -3648 46769 47974 -3293 86328 80330 90332 87413 35517 23162
16180B3162j0095p481O4534n826o6231p0489q71K9090l5184k8880k2789k2606
$$ 23162 13067 5586 70120 64294 -1937 -72426 -73297 -44207 -79391 -108271 -131060 -153666
16168a53666K9195N2886K8207J08936L1511m5329n2007m9559M179M771O6551P7980
$$ -153666 -124471 -71585 -43378 65558 97069 51740 -267 -49826 -45647 -40876 25675 103655
16156A03655k423k6745k5128M2109K5880O6819p145j16553j751J3165j8959j5444
$$ 103655 101232 74487 49359 91468 117348 184167 177022 60469 58718 71883 52924 37480
16144C7480o9244j0225J6497N2248L4710j8185j8964M3264p211n648l2977l5967
$$ 37480 -31764 -41989 -25492 26756 61466 43281 24317 67581 60370 54722 21745 -14222
16132a4222q504n0238m3825l3716Q0060J20233K3071p9073J9613P2462P7601k5377
$$ -14222 -22726 -72964 -116789 -150505 -70445 49788 72859 -6214 13399 85861 163462 138085
16120A38085o1330n4003q2509Q1782N3797L3308m7937O067m5715M9562K1828p1163
$$ 138085 76755 22752 -59757 22025 75822 109130 61193 67260 21545 71107 92935 21772
16108B1772n6407M458R030k3823n3694q142M1397R1533q13o3356L048p7958l8286
$$ 21772 -34635 -30177 -21147 -44970 -98664 -106806 -65409 26124 25311 -38045 -34997 -112955 -151241
16095a51241J1471M2434N0753Q4222J3975j24227k0976O5031n918m576l8502Q470
$$ -151241 -139770 -97336 -46583 37639 51614 -72613 -93589 -28558 -34476 -39052 -77554 -69084
16083f9084k2206K1132L5711K6851k8927M4759k053M1137k4857n7085r1678k5761
$$ -69084 -91290 -70158 -34447 -7596 -36523 8236 6183 47320 22463 -34622 -126300 -152061
16071a52061o843L9350O8922N2337p565k7354L2425L9732m1584L5126L6076p8212
$$ -152061 -158904 -119554 -50632 1705 -5860 -33214 -789 38943 -2641 32485 68561 -9651
16059i651l9928O1042j7233n7253M28J4888N1754M0181m3273m971j2031O385m4844
$$ -9651 -49579 11463 -5770 -63023 -62595 -47707 4047 44228 955 -4016 -16047 -9662 -54506
16046e4506J3332N9898n2441o3480P9533K0846L3026J8850l1542r838n5757Q1879
$$ -54506 -41174 18724 -33717 -97197 -17664 3182 36208 55058 23516 13678 -42079 39800
16034C9800N0117L2092l1755o4431m9154Q122p8750n2167J7640J9193O4445l8529
$$ 39800 89917 122009 90254 25823 -23331 -15209 -93959 -146126 -128486 -109293 -44848 -83377
16022h3377R0329N7325M097k3351L6021m3262j3787l3238m9798k6503P6038R3357
$$ -83377 6952 64277 68374 45023 81044 37782 23995 -9243 -59041 -85544 -9506 83851
16010H3851l7813k5271J8047j06916n8196P3256R2130M4308M7953j8520q7876
$$ 83851 46038 20767 38814 -68102 -126298 -53042 39088 83396 131349 112829 24953
15999B4953L9659K6585m8022p1701q8500J1520L6121m7832m2844J08035Q0112
$$ 24953 64612 91197 43175 -28526 -117026 -105506 -69385 -117217 -160061 -52026 28086
15988B8086j5912p2767L621l9832K5606m3963j1419Q5168N9355j0457n1801k4978
$$ 28086 12174 -60593 -56972 -96804 -71198 -115161 -126580 -41412 17943 7486 -44315 -69293
15976f9293J6418K6595m4063K9230N1253P9551k4838r3701j6977N2107j9564j7896
$$ -69293 -52875 -26280 -70343 -41113 10140 89691 64853 -28848 -45825 6282 -13282 -31178
15964c1178o7124P8063J6647m5843j9835M9521r822k7645K4797O7918n7746m6219
$$ -31178 -98302 -20239 -3592 -49435 -69270 -19749 -29571 -57216 -32419 35499 -22247 -68466
15952f8466M4380Q8940k2635n4799k6341N289L3849l4597p8194k5389Q3564Q3876
$$ -68466 -24086 64854 42219 -12580 -38921 -33632 217 -34380 -112574 -137963 -54399 29477
15940B9477j03394p1398N6011J34484L1750j8102m9981l4079J9581N7395j24765
$$ 29477 -73917 -145315 -89304 45180 76930 58828 8847 -25232 -5651 51744 -73021
15929g3021n8232k3705O3570R0039M6000k6998j6197k5957K3896L3673j9760M0907
$$ -73021 -131253 -154958 -91388 -1349 44651 17653 1456 -24501 -605 33068 13308 54215
15917E4215L8687l4185q6911n6815q200p306Q2762K0148n9572K9153O3567m050
$$ 54215 92902 58717 -28194 -85009 -93209 -100515 -17753 2395 -57177 -28024 35543 31493
15905C1493l2018p2270j7593K0101L2470j358j27114k5385R9751N4272P0865l9013
$$ 31493 -525 -72795 -90388 -70287 -37817 -39175 -166289 -191674 -91923 -37651 33214 -5799
15893e799l9467O5617M0017M7533k5196q3973P8858Q2259l4210n3380m7151k751
$$ -5799 -45266 20351 60368 107901 82705 -1268 77590 159849 125639 72259 25108 22357
15881B2357J4532q7912l866J23693L1128n3066o879K5604k4199K473K2170o865
$$ 22357 36889 -51023 -54889 68804 99932 46866 39987 65591 41392 43865 66035 59170
15869E9170k9957q0847P469M8028O9224M35o6230j06919n7542k5168o908P5095
$$ 59170 29213 -51634 -44165 3863 73087 73522 7292 -99627 -157169 -182337 -189245 -114150
15857a14150M9504l3608N3996M4309k5001m1384p2160m9222o035Q649l6343o3242
$$ -114150 -64646 -98254 -44258 51 -24950 -66334 -138494 -187716 -193751 -185102 -221445 -284687
15845b84687N719R8879J0376P256O4637N1481j2748p960O4002m1310n2817L8925
$$ -284687 -278968 -180089 -169713 -162457 -97820 -46339 -59087 -67047 -3045 -44355 -97172 -58247
15833e8247P224l1514J2425K0999l1463N1760N3257m759q9957k9592J5978K6452
$$ -58247 -51023 -82537 -70112 -49113 -80576 -28816 24441 19682 -70275 -99867 -83889 -57437
15821e7437P842j399o7381K3430L5959m774k8183L0719M9878l0024O8506k439
$$ -57437 -49595 -50994 -118375 -94945 -58986 -63760 -91943 -61224 -11346 -41370 27136 24697
15809B4697M8587K9795m1655j19286L4827O7413j1847n8197m9590k8280K3817
$$ 24697 73284 103079 61424 -57862 -23035 44378 32531 -25666 -75256 -103536 -79719
15798g9719K9180k100J4670K7915K771Q225N3338P1556k3035j25352k7471O2181
$$ -79719 -50539 -52639 -37969 -10054 -7283 942 54280 125836 102801 -22551 -50022 12159
15786A2159j6420n5998N3123R833j69928J3425O8284M2014N9387M6688r938n9942
$$ 12159 -4261 -60259 -7136 2697 -167231 -153806 -85522 -43508 15879 62567 52629 -7313
15774g313o700O6345N428K5761N933k3307o1655n3963p3233l8128R5543M4672
$$ -7313 -14013 52332 57760 83521 89454 66147 4492 -49471 -122704 -160832 -65289 -20617
15762b0617j2776J9183N618R7307L0946q7483o6982K081N1572j3611k6007j5672
$$ -20617 -33393 -14210 -8592 88715 119661 32178 -34804 -32723 18849 5238 -20769 -36441
15750c6441L6317l095l0547n7924k0759J00094O2232q4346N894k8987L8719N0464
$$ -36441 -124 -3219 -33766 -91690 -112449 -12355 49877 -34469 -28575 -57562 -18843 31621
15738C1621k6272n5982k5128M7356n7789L3681J5008L0357l9567l1470l7518j23694
$$ 31621 5349 -50633 -75761 -28405 -86194 -52513 -37505 -7148 -46715 -78185 -115703 -239397
15726b39397K0186J71405K5947l8788k9353N6712N7179K2900l6363P9107N0528
$$ -239397 -219211 -47806 -21859 -60647 -90000 -33288 23891 46791 10428 89535 140063
15715A40063k6285n4216j0781p1291k2448Q187J03128r31r8075J9379L0283q0622
$$ 140063 113778 59562 48781 -22510 -44958 -36771 66357 65426 -32649 -13270 17013 -63609
15703f3609m5253L4571k7584K3737M8874L9362J9062o8743m1714Q548Q1280K1310
$$ -63609 -108862 -74291 -101875 -78138 -29264 10098 29160 -39583 -81297 -72749 8531 29841
15691B9841L9448j983o8231n3932M6401K387j3139k5123n7460J1233M1117j8621
$$ 29841 69289 67306 -925 -54857 -8456 -6069 -19208 -44331 -101791 -90558 -49441 -68062
15679f8062n7398K0186l5074l8112Q9465M9167j23040k3082J35010O0926j2766
$$ -68062 -125460 -105274 -140348 -178460 -88995 -39828 -162868 -185950 -50940 9986 -2780
15668b780k1034K6037P922o4970L7041L2832o0997l8175l7995Q0834P2454K7427
$$ -2780 -23814 2223 10145 -54825 -17784 15048 -45949 -84124 -122119 -41285 31169 58596
15656E8596l915k2063o648p7322J3943L1717o0230n1872N86K5163l7016O5903
$$ 58596 54681 32618 25970 -51352 -37409 -5692 -65922 -117794 -117208 -92045 -129061 -63158
15644f3158L3914k7283m2159Q8368m5189K0339L1801n0516k0922L699J0074l7368
$$ -63158 -29244 -56527 -98686 -10318 -55507 -35168 -3367 -53883 -74805 -71106 -61032 -98400
15632i8400j5039q3995n831M9967J3273J4606N4912J23567L278k0065p8536k0114
$$ -98400 -113439 -197434 -203265 -153298 -140025 -125419 -70507 53060 56338 36273 -42263 -62377
15620f2377n2572M9667j9041j3037m0841l3082j2550N1734k1277O442J05157P6557
$$ -62377 -114949 -65282 -84323 -97360 -138201 -171283 -183833 -132099 -153376 -146934 -41777 34780
15608C4780J2315r415p8558n1050J5479Q4735K0877n3155l2572K8586j29223n7049
$$ 34780 47095 37680 -40878 -91928 -76449 8286 29163 -23992 -56564 -27978 -157201 -214250
15596b14250J7148L7834Q6307l2073j2776J6075O516j241m0045Q528P233P224
$$ -214250 -197102 -159268 -72961 -105034 -117810 -101735 -95219 -96460 -136505 -127977 -120744 -113520
15584a13520j0947O673n7145Q472O1515P7017l8615k9900L5990J7262r416k5170
$$ -113520 -124467 -117794 -174939 -166467 -104952 -27935 -66550 -96450 -60460 -43198 -52614 -77784
15572g7784L171l6287n5796l206q970K7271l3721L0260L8361K6741P36k1932R3054
$$ -77784 -74613 -110900 -166696 -169902 -178872 -151601 -185322 -155062 -116701 -89960 -89224 -111156 -18102
15559a8102P9678l5432J3744l8259n3564m1035N1300J5424J3919n5560Q9320L6986
$$ -18102 61576 26144 39888 1629 -51935 -92970 -41670 -26246 -12327 -67887 21433 58419
15547E8419O9098n7954j09712m6475r642K3451j9587q7594O928M8981K4556o9763
$$ 58419 127517 69563 -40149 -86624 -96266 -72815 -92402 -179996 -173068 -124087 -99531 -169294
15535a69294J0596L9298L5021J8626p6782Q8848J7824k3270Q9303N2888L6140
$$ -169294 -158698 -119400 -84379 -65753 -142535 -53687 -35863 -59133 30170 83058 119198
15524A19198n5542k6130m6455m5215k093P5100q0884p3375R9254K0050P60M8385
$$ 119198 63656 37526 -8929 -54144 -56237 18863 -62021 -135396 -36142 -16092 -15332 33053
15512C3053M1909k9473m896R643O5288k4825p7462m0950n68J3332M6081q7847
$$ 33053 74962 45489 40593 50236 115524 90699 13237 -27713 -28281 -14949 31132 -56715
15500e6715K0907K2142P178N6801L5701r9102m495m9198M660q238k0410M3825
$$ -56715 -35808 -13666 -6488 50313 86014 -13088 -17583 -66781 -62121 -70359 -90769 -46944
15488d6944J2693Q32J7672m1672J3618O1222K5717J7076j2303K9514k7842M0238
$$ -46944 -34251 -33419 -15747 -57419 -43801 17421 43138 60214 47911 77425 49583 89821
15476H9821M3587j2838m9572N670m085j36023n9320R5813k068k0891L062N3493
$$ 89821 133408 120570 70998 76668 72583 -63440 -122760 -26947 -29015 -49906 -46844 6649
15464F649N9564o2124r2293K2789L6277j0169j27144o0332P8962N8549l138K05
$$ 6649 66213 4089 -88204 -65415 -29138 -39307 -166451 -226783 -147821 -89272 -92410 -92205
15452i2205l7679q53j386N460L6264K5165k1567m2387L321p759J2495L8484M6054
$$ -92205 -129884 -130737 -132123 -126663 -90399 -65234 -86801 -129188 -125867 -133626 -121131 -82647 -36593
15439c6593J402L2624O0266J1224q1922N3825K521n4005J3846m6293M6082J1872
$$ -36593 -35191 -2567 57699 68923 -12999 40826 43347 -10658 3188 -43105 2977 14849
15427A4849N550L3395j7982k2160j785J4598Q4910k0613o3449j27058R477r7R43
$$ 14849 20399 53794 35812 13652 11867 26465 111375 90762 27313 -99745 -90268 -90365 -89422
15414h9422K1907l7189m6697k5663j1430L3125J6520Q4552L8670j362j2513L1598
$$ -89422 -67515 -104704 -151401 -177064 -188494 -155369 -138849 -54297 -15627 -16989 -29502 2096
15402B096K8197k825m3420M5418l7053L5295m7260p1718j2855q149Q6212Q6740
$$ 2096 30293 27468 -15952 29466 -7587 27708 -19552 -91270 -104125 -112274 -26062 60678
15390F0678l1142m9394N3165o3347M1977l0261n6814j5297J9930M7958k5932j13160
$$ 60678 29536 -19858 33307 -30040 11937 -18324 -75138 -90435 -70505 -22547 -48479 -161639
15378a61639o6232L0268O1734N8499N5708j7764N9573M7780M834l2935L5852o4271
$$ -161639 -227871 -197603 -135869 -77370 -21662 -39426 20147 67927 72761 39826 75678 11407
15366A1407l1193Q479n0634L745K1915M3914Q2183j4779q2178M657K5047J421
$$ 11407 -19786 -11307 -61941 -58196 -36281 7633 89816 75037 -7141 -2484 22563 23984
15354B3984j6810m2094L4880O2481k2007o4236O5176m008p3310M5736M8459Q615
$$ 23984 7174 -34920 -40 62441 40434 -23802 41374 37366 -35944 9792 58251 66866
15342F6866m7252j2422q6927K6921K236l172k5499m651M3133L0368J07692k2133
$$ 66866 19614 7192 -79735 -52814 -50578 -53750 -79249 -83900 -40767 -10399 97293 75160
15330G5160m8372m056q6114n5869l9276M1313l010j4880L3024N275O7138k2667
$$ 75160 26788 22732 -63382 -119251 -158527 -117214 -120224 -135104 -102080 -96805 -29667 -52334
15318e2334K466m273m4565k2760P6525L1121L4102k0972q3995n5103l0305l112
$$ -52334 -49868 -54141 -98706 -121466 -44941 -13820 20282 -690 -84685 -139788 -170093 -173205
15306a73205N8724k0634l8497M3867J22929o4652p8753J14510K3712K6667k45
$$ -173205 -114481 -135115 -173612 -129745 -6816 -71468 -150221 -35711 -11999 14668 14423
15295A4423j1298o2034k9133N8442k3170m4533Q249m3014N0468L7926L3933M8816
$$ 14423 3125 -58909 -88042 -29600 -52770 -97303 -89054 -132068 -81600 -43674 -9741 39075
15283C9075J2446Q908K1669M1090n0536q3074L305K7607p3478p9162N598M4266
$$ 39075 51521 60429 82098 123188 72652 -10422 -7117 20490 -52988 -132150 -126552 -82286
15271h2286M6024j5133o163o6457k4440J6088M5310N9324n488M6745j9577p9988
$$ -82286 -36262 -51395 -57558 -124015 -148455 -132367 -87057 -27733 -33221 13524 -6053 -86041
15259h6041k5526j9204J04763O2365p4672n5529k1201j5090O5520N8459K1660
$$ -86041 -111567 -130771 -26008 36357 -38315 -93844 -115045 -130135 -64615 -6156 15504
15248A5504P3125l9292m2164p059m9874m1256O333L4396N5439J1569m5309r632
$$ 15504 88629 49337 7173 114 -49760 -91016 -84683 -50287 5152 16721 -28588 -38220
15236c8220L6739K8955O406n8205L9526M7367J4600r4009m1643m2165j9393P8392
$$ -38220 -1481 27474 33880 -24325 15201 62568 77168 -16841 -58484 -100649 -120042 -41650
15224d1650k456m2200k6579K2748J4653j08753n2286Q1127J6965j0030K3154O6513
$$ -41650 -44106 -86306 -112885 -90137 -75484 -184237 -236523 -155396 -138431 -148461 -125307 -58794
15212e8794L3082n3499p956J9666m4309J3264O6611k9570p5768N41P895m4070
$$ -58794 -25712 -79211 -87167 -67501 -111810 -98546 -31935 -61505 -137273 -136732 -128837 -172907
15200a72907n3944l039J1153j1923Q8759M4105R8828P7637l6523k9504n4791j2272
$$ -172907 -226851 -229890 -218737 -230660 -141901 -97796 1032 78669 42146 12642 -42149 -54421
15188e4421Q9102l6882l0293l0081k3641J46501J4363l8927m1777n2085n7962
$$ -54421 34681 -2201 -32494 -62575 -86216 60285 74648 35721 -6056 -58141 -116103
15177a16103k1617O1324K3899L87m1987M5487j0369M2508j3488l9739o2072q0212
$$ -116103 -137720 -76396 -52497 -52110 -94097 -48610 -58979 -16471 -29959 -69698 -131770 -211982
15165b11982N1373P6254N4035J6199p3866m5239N1454N751m4204l1871L0838P7208
$$ -211982 -160609 -84355 -30320 -14121 -87987 -133226 -81772 -76021 -120225 -152096 -121258 -44050
15153d4050L3141J2947M7211k1887j4486j8245n7437l0430K5015M6500l5081K2187
$$ -44050 -10909 2038 49249 27362 12876 -5369 -62806 -93236 -68221 -21721 -56802 -34615
15141c4615K0566M3924l2351n7094j3090O6801R648n3833n1992q57M7725m4631
$$ -34615 -14049 29875 -2476 -59570 -72660 -5859 3789 -50044 -102036 -102893 -55168 -99799
15129i9799j8536k5146J2107P3294p378o7230L4627R9120K1574q2834J2461j2459
$$ -99799 -118335 -143481 -131374 -58080 -65458 -132688 -98061 1059 22633 -60201 -47740 -60199
15117f0199N3956K4003L4172m3754q1132J2798k7187J8463j5114m0977k2387N076
$$ -60199 -6243 17760 51932 8178 -72954 -60156 -87343 -68880 -83994 -124971 -147358 -142282
15105a42282J17241j4396L0925M2488j00032M008J8258p0599n0093K7787L5806
$$ -142282 -25041 -39437 -8512 33976 -66056 -62048 -43790 -114389 -164482 -136695 -100889
15094a00889m9136L6010L5964O0958L326l5130n74m6859J9748J8542n1390l7416
$$ -100889 -150025 -114015 -78051 -17093 -13767 -48897 -49471 -96330 -76582 -58040 -109430 -146846
15082a46846M9724R1192j4616n1089l1252l8186k3821J3286Q616M9688R4587J1638
$$ -146846 -97122 -5930 -20546 -71635 -102887 -141073 -164894 -151608 -142992 -93304 1283 12921
15070A2921q8923Q962O3751L1354m8238R580k7642k8020J6932K1654p848n8674
$$ 12921 -76002 -67040 -3289 28065 -20173 -10593 -38235 -66255 -49323 -27669 -35517 -94191
15058i4191M0680N9017o046r1845k4195J9797m4115k1367N6909L3045J5680M8344
$$ -94191 -53511 5506 -540 -92385 -116580 -96783 -140898 -162265 -105356 -72311 -56631 -8287
15046h287Q752L090K4015K1094J665J662O1043m2747m214q3258J3232K028n6140
$$ -8287 465 3555 27570 48664 50329 51991 113034 70287 66073 -17185 -3953 -1925 -58065
15033e8065N3743Q2404l7994K8202n4082P1696K5833l3405n3440l5129M790m0375
$$ -58065 -4322 78082 40088 68290 14208 85904 111737 78332 24892 -10237 -5447 -45822
15021d5822p6732o4803O962n1678J03114P9347l6167K4977N7142M1510n2789K2027
$$ -45822 -122554 -187357 -180395 -232073 -128959 -49612 -85779 -60802 -3660 37850 -14939 7088
15009G088J3728O279R4446p2702q5036l0685J25001l1863N0981R0248J7338L5891
$$ 7088 20816 27095 121541 48839 -36197 -66882 58119 26256 77237 167485 184823 220714
14997B20714m2931j04711j94698n3965P2744J47953J4381l4912k4697l7035j8352
$$ 220714 177783 73072 -121626 -175591 -102847 45106 59487 24575 -122 -37157 -55509
14986e5509L895P8973K9320m2714m4167q222n0773o9530K7014M6145O6686j5605
$$ -55509 -51614 27359 56679 13965 -30202 -38424 -89197 -158727 -131713 -85568 -18882 -34487
14974c4487J599M738o5701K6152P642M3061K0395p6047l6010k8217M0088L7565
$$ -34487 -32888 -28150 -93851 -67699 -60057 -16996 3399 -72648 -108658 -136875 -96787 -59222
14962e9222J5969K8566k8738p7369L0453J4071k4404r279j9268K8712m5448j2500
$$ -59222 -43253 -14687 -43425 -120794 -90341 -76270 -100674 -109953 -129221 -100509 -145957 -158457
14950a58457n2613R347J409J5314L7180Q2448n0034j5354P811K2348j3429P9330
$$ -158457 -211070 -201723 -200314 -185000 -147820 -65372 -115406 -130760 -122949 -100601 -114030 -34700
14938c4700L0084l7920L2483J4387k1991l8379p9100l0385K4566Q8903K6272n4680
$$ -34700 -4616 -42536 -10053 4334 -17657 -56036 -135136 -165521 -140955 -52052 -25780 -80460
14926h0460L2658Q2667r098n3115p2387J7651J05195N0019m1537p8414r7939R059
$$ -80460 -47802 34865 25767 -27348 -99735 -82084 23111 73130 31593 -46821 -144760 -135701
14914a35701J0280P4090R5006L6937O2956J2274q7153o6891j4759n7393n0000
$$ -135701 -125421 -51331 43675 80612 143568 155842 68689 1798 -12961 -70354 -120354
14903a20354J5222L2296k0827J1607k8606k3720K9190J8426J8749N4372P1675
$$ -120354 -105132 -72836 -93663 -82056 -110662 -134382 -105192 -86766 -68017 -13645 58030
14892E8030N5775j8700p9369l9288r2655l6878P3364Q7403m6713K6154K8247J0997
$$ 58030 113805 95105 15736 -23552 -116207 -153085 -79721 7682 -39031 -12877 15370 26367
14880B6367N629m8097j8698N948k7427M7798P5776J2249m3512j6429k9685j4064
$$ 26367 31996 -16101 -34799 -28851 -56278 -8480 67296 79545 36033 19604 -10081 -24145
14868b4145l3216p2540K4974J8762K8709l705N3410k0537J8673j9536k1161K3237
$$ -24145 -57361 -129901 -104927 -86165 -57456 -61161 -7751 -28288 -9615 -29151 -50312 -27075
14856b7075Q425J6560L9224l0001J4316l4066n8515Q7799M5981l4656l3567k6715
$$ -27075 -18650 -2090 37134 7133 21449 -12617 -71132 16667 62648 27992 -5575 -32290
14844c2290k2626Q1395J8310L108k1217q0760K8263J1281o3601n5N0195o6053
$$ -32290 -54916 26479 44789 47897 26680 -54080 -25817 -14536 -78137 -78192 -27997 -94050
14832i4050n0193j7042l5230K5053M1044n2755K916K0524l5221P923K6404k7442
$$ -94050 -144243 -161285 -196515 -171462 -130418 -183173 -180257 -159733 -194954 -187031 -160627 -188069
14820a88069K6352M9090M8130K6294L431K900n6381L5375J11474m2196o5641k4445
$$ -188069 -161717 -112627 -64497 -38203 -34772 -31872 -88253 -52878 58596 16400 -49241 -73686
14808g3686N4705Q0030r171j5246l3219m5814p3601L9290k031l3321P4174K8397
$$ -73686 -18981 61049 51878 36632 3413 -42401 -116002 -76712 -78743 -112064 -37890 -9493
14796i493k6965j4688P514m047k3396M0654J5236n3529J5648k6395n7628L5574
$$ -9493 -36458 -51146 -43632 -47679 -71075 -30421 -15185 -68714 -53066 -79461 -137089 -101515
14784a01515M1397k8265m7816Q816P6327j9421m0989J9964n9732l0755J90K2912
$$ -101515 -60118 -88383 -136199 -127383 -51056 -70477 -111466 -91502 -151234 -181989 -181799 -158887
14772a58887M7710P6840M9579q996j03602o8778J34227J4513n7570L8970R225
$$ -158887 -111177 -34337 15242 6246 -97356 -166134 -31907 -17394 -74964 -35994 -26769
14761b6769p6313n3466O672J3971q7223K3386J16030O1747R982n2734k5542m673
$$ -26769 -103082 -156548 -149876 -135905 -223128 -199742 -83712 -21965 -11983 -64717 -90259 -94932
14749i4932p469K925l9107R8221M9698m4351M6054q0005j2258N6198O07K49O9919
$$ -94932 -102401 -99476 -138583 -40362 9336 -35015 11039 -68966 -81224 -25026 -24419 -24170 45749
14736D5749J3553k7668p9908q7791P5800O3595L2225k9165l5649K1060m8928K9955
$$ 45749 59302 31634 -48274 -136065 -60265 3330 35555 6390 -29259 -8199 -57127 -27172
14724b7172M2801q1652j04843j0676P2675K0926K8077M7485j0884L9298K2342
$$ -27172 15629 -66023 -170866 -181542 -108867 -87941 -59864 -12379 -23263 16035 38377
14713C8377l7072m0179n0537m267J05678k0597n019k0067j1039o3517m9967O2682
$$ 38377 1305 -38874 -89411 -93678 12000 -8597 -13616 -33683 -44722 -108239 -158206 -95524
14701i5524p4797n9547L4448L0604k3400k493j0939J8392N5241O8017p473J3762
$$ -95524 -170321 -229868 -195420 -164816 -188216 -190709 -201648 -183256 -128015 -59998 -67471 -53709
14689e3709k0088q8666k413J1658j3427M8400O7063K3394o110j5727o6389J1368
$$ -53709 -73797 -162463 -164876 -153218 -166645 -118245 -51182 -27788 -33898 -49625 -116014 -104646
14677a04646N8473J0281l4338J4619M2081O4714P9282M0212o0697n5895k0589
$$ -104646 -46173 -35892 -70230 -55611 -13530 51184 130466 170678 109981 54086 33497
14666C3497m0961J385p9805r4872J00943M8170o1103k7713J4307l1557k2539N6130
$$ 33497 -7464 -6079 -85884 -180756 -79813 -31643 -92746 -120459 -106152 -137709 -160248 -104118
14654a04118O4828K3739k7600P2234K3258O1642j4225L9247n0512m9751j9306
$$ -104118 -39290 -15551 -43151 29083 52341 113983 99758 139005 88493 38742 19436
14643A9436j0693J4179n219Q292l3749l4818j2268m7113j9967O1193l6399O1238
$$ 19436 8743 22922 17703 25995 -7754 -42572 -54840 -101953 -121920 -60727 -97126 -35888
14631c5888O8436r3759r1461k8834J2081J10787j7661m602L734K1986M8230l377
$$ -35888 32548 -61211 -152672 -181506 -169425 -58638 -76299 -80901 -77167 -55181 -6951 -10328
14619a0328m2996j5387l5479K3443J9145q593m4510r468M8501L3379L4118j4781
$$ -10328 -53324 -68711 -104190 -80747 -61602 -70195 -114705 -124173 -75672 -42293 -8175 -22956
14607b2956P2389J073r8879j3625k7176k7026j4272J00583O7865q533J6595N601
$$ -22956 49433 50506 -48373 -61998 -89174 -116200 -130472 -29889 37976 29443 46038 51639
14595E1639o8614p8606j3458M3390L3798K5300M5157k8140m5640R273M9154j3009
$$ 51639 -16975 -95581 -109039 -65649 -31851 -6551 38606 10466 -35174 -25901 23253 10244
14583A0244o2584j1382L7663J8067M0398P8603n7543l552o2014O096Q1950n6473
$$ 10244 -52340 -63722 -26059 -7992 32406 111009 53466 49914 -12100 -6004 75946 19473
14571A9473K9571j5720k4304l952M7407K0533N600K4757k7525K3559j7136k2599
$$ 19473 49044 33324 9020 5068 52475 73008 78608 103365 75840 99399 82263 59664
14559E9664o1392j24961q5918M3903j6234O5097N7028m0053M036J03137J397N3210
$$ 59664 -1728 -126689 -212607 -168704 -184938 -119841 -62813 -102866 -98830 4307 5704 58914
14547E8914l9959j09253j01549j8494K2667P8554L3185K186P7553O1951m1904
$$ 58914 18955 -90298 -191847 -210341 -187674 -109120 -75935 -73749 3804 65755 23851
14536B3851m5265M1113J12149K9047p7019m3952k5433K9814J0540q019P0259j6822
$$ 23851 -21414 19699 131848 160895 83876 39924 14491 44305 54845 46826 117085 100263
14524A00263o5668n7259q900O2632K5928L53K405K9485n5385j09363r239K615
$$ 100263 34595 -22664 -31564 31068 56996 57349 59754 89239 33854 -75509 -84748 -82133
14512h2133K4677j0280j3205N4043K687J2838l3317m1192J4721L1713Q6051p906
$$ -82133 -57456 -67736 -80941 -26898 -24211 -11373 -44690 -85882 -71161 -39448 46603 38697
14500C8697r3695q5902k5635N5565M2769M865m2804j6717Q4646Q9678R117j6435
$$ 38697 -54998 -140900 -166535 -110970 -68201 -63336 -106140 -122857 -38211 51467 60584 44149
14488D4149M2784J9444o0194q3015Q231m804N0199O2765O125m854m966J0949K62
$$ 44149 86933 106377 46183 -36832 -28601 -33405 16794 79559 85684 80830 75864 86813 87075
14475H7075l710m777l2887r522j7574r0191k5144R2700K7260l4321J171O7066
$$ 87075 83365 78588 45701 36179 18605 -71586 -96730 -4030 23230 -11091 -9920 57146
14463E7146n688n9429o5077m1878l022J07814M8084k6707l3887q0435J9358O5008
$$ 57146 51458 -7971 -73048 -114926 -117948 -10134 37950 11243 -22644 -103079 -83721 -18713
14451a8713l5819n4477q612K9798k1941R3408N7716P77N939m0250N1855o00k5823
$$ -18713 -54532 -109009 -117621 -87823 -109764 -16356 41360 42137 48076 7826 59681 59081 33258
14438C3258j711n582m0302n579M5723j8596k2179m1516J4399K1752L8943l9423
$$ 33258 31547 25965 -14337 -19916 25807 7211 -14968 -56484 -42085 -20333 18610 -20813
14426b0813m1189J783J10270M9699n1543j29386k1813p2129L776L1366K8434p236
$$ -20813 -62002 -60219 50051 99750 48207 -81179 -102992 -175121 -171345 -139979 -111545 -118781
14414a18781K0307J1966L7515N5713l8987k3993P571L47l0135q4903P1087K8823
$$ -118781 -98474 -86508 -48993 6720 -32267 -56260 -48689 -48342 -78477 -163380 -92293 -63470
14402f3470j2833J3797R2941L8508K2564q219n6920r603j403j6130K3278M3584
$$ -63470 -76303 -62506 30435 68943 91507 83288 26368 16765 15362 -768 22510 66094
14390F6094n7920m2662m3538K6599N4631j9407L2740K3964o8837m3761j8376L9057
$$ 66094 8174 -34488 -78026 -51427 3204 -16203 16537 40501 -28336 -72097 -90473 -51416
14378e1416P5208m1868n5049P7415j4663J634L5527J3628J6819r5111p995K1287
$$ -51416 23792 -18076 -73125 4290 -10373 -8739 26788 40416 57235 -37876 -45871 -24584
14366b4584J5631O8948k0412l8423M1782k075j46107J847k4687K3097N984o7918
$$ -24584 -8953 59995 39583 1160 42942 40867 -105240 -103393 -128080 -104983 -98999 -166917
14354a66917k9489L8494J9216N6981R3479L7974k8476q9442L2648O1317K6131
$$ -166917 -196406 -157912 -138696 -81715 11764 49738 21262 -68180 -35532 25785 51916
14343E1916m2550L6125N5081J9454n5201m1207K0615l1101r532J1037k5679n1573
$$ 51916 9366 45491 100572 120026 64825 23618 44233 13132 3600 14637 -11042 -62615
14331f2615M7794J1431P881m4082j3162L9762M8199j923j7384r170j7782l1076
$$ -62615 -14821 -3390 4491 -39591 -52753 -12991 35208 33285 15901 6731 -11051 -42127
14319d2127L3049M1585l9354m5942l6385N04N980M3403m3531P1891k2086n437
$$ -42127 -9078 32507 -6847 -52789 -89174 -88670 -82690 -39287 -82818 -10927 -33013 -38450
14307c8450o111J5889P5767k8081n9612m6256l0596K309m9275Q036L8779K7646
$$ -38450 -44561 -28672 47095 19014 -40598 -86854 -117450 -115141 -164416 -156380 -117601 -89955
14295h9955L1054l7195m4199K9171J21253N6648o0039r2909L5324P0526K2832
$$ -89955 -58901 -96096 -140295 -111124 10129 66777 6738 -86171 -50847 19679 42511
14284D2511k1838n4187k8990J9666P2415m4580j55546j7269O5420N6148L0314
$$ 42511 20673 -33514 -62504 -42838 29577 -15003 -170549 -187818 -122398 -66250 -35936
14273c5936l7373p0395L0014R8758J2942o4682m1584K7883k011j7597l7501L4730
$$ -35936 -73309 -143704 -113690 -14932 -1990 -66672 -108256 -80373 -82384 -99981 -137482 -102752
14261a02752L7838o4468J015N5097J2534o313l7037j7583J8728M0551J3087J9396
$$ -102752 -64914 -129382 -128367 -73270 -60736 -67049 -104086 -121669 -102941 -62390 -49303 -29907
14249b9907J0776N831p7281l209p5838M6887J12062K9316M5448L0786o5203K1591
$$ -29907 -19131 -13300 -90581 -93790 -169628 -122741 -10679 18637 64085 94871 29668 51259
14237E1259K0174k7157m4785j846K2625O29k3128L5424m9001j00178l5315R0839
$$ 51259 71433 44276 -509 -2355 20270 20899 -2229 33195 -15806 -115984 -151299 -60460
14225f0460L5162j8102J5115O114P7739l2481k7050J9993L5518j04071o1015l6459
$$ -60460 -25298 -43400 -28285 -22171 55568 23087 -3963 16030 51548 -52523 -113538 -149997
14213a49997M8710J4136m8978M4869P9658M4885j566k0707n8481k6010M2067J0210
$$ -149997 -101287 -87151 -136129 -91260 -11602 33283 31717 11010 -47471 -73481 -31414 -21204
14201b1204M78l968k0661j06273K5252M5069o9701L3926Q1174M528L8154K3289
$$ -21204 -20726 -24694 -45355 -151628 -126376 -81307 -151008 -117082 -35908 -31380 6774 30063
14189C0063j8348K5578j9202j2370O3709q25m176n0675L8798k2331p6169R1168
$$ 30063 11715 37293 18091 5721 69430 68605 64429 13754 52552 30221 -45948 45220
14177D5220N5733m1210n4868j1523l8351k0786L6931K2530k2657k5786n0218l9242
$$ 45220 100953 59743 4875 -6648 -44999 -65785 -28854 -6324 -28981 -54767 -104985 -144227
14165a44227m4418P0270Q2599l238p864l6258L4708l0397m681L1390p9365n1131
$$ -144227 -188645 -118375 -35776 -39014 -46878 -83136 -48428 -78825 -83506 -52116 -131481 -182612
14153a82612O1274J36977N0746q790m5215k942O546N6214k3140L349P5100n5686
$$ -182612 -121338 15639 66385 57595 12380 9438 15984 72198 49058 52407 127507 71821
14141G1821j27406j7345N7921k8229l3536n2369k690Q9528M8338k1925J4778L2798
$$ 71821 -55585 -72930 -15009 -43238 -76774 -129143 -131833 -42305 6033 -15892 -1114 31684
14129C1684m8067j3478L3252M1081q282q489k0818j38768l0763O7827J4471m0183
$$ 31684 -16383 -29861 3391 44472 36190 27701 6883 -131885 -162648 -94821 -80350 -120533
14117a20533Q4450j8386j8828l3541k3069Q1605P813m6718m3982Q9736N1481m3419
$$ -120533 -36083 -54469 -73297 -106838 -129907 -48302 -40489 -87207 -131189 -41453 10028 -33391
14105c3391p3383J11497O1688n3856n1513j959N1291l141r0637n8688l421R8231
$$ -33391 -106774 4723 66411 12555 -38958 -40917 10374 7233 -83404 -142092 -145513 -47282
14093d7282j1838j06153m2936K4991J3661N4832K4083L2637J00422J2004L4838
$$ -47282 -59120 -165273 -208209 -183218 -169557 -114725 -90642 -58005 42417 54421 89259
14082H9259j0284j03743p4371j22007k5495R5014O1243L0307J5847M9160Q0521
$$ 89259 78975 -24768 -99139 -221146 -246641 -151627 -90384 -60077 -44230 4930 85451
14071H5451j5361J7439N0305k9877p806j09008m5463m4209m7119j0793L4970O5301
$$ 85451 70090 87529 137834 107957 100151 -8857 -54320 -98529 -145648 -156441 -121471 -56170
14059e6170l2374m1041K9270K6446m6251k8290L4533M4776M3121N0629l3007l9012
$$ -56170 -88544 -129585 -100315 -73869 -120120 -148410 -113877 -69101 -25980 24649 -8358 -47370
14047d7370l7697o412L93L1977M2065j3856N110l4716r8885k6723J8747O5328
$$ -47370 -85067 -91479 -91086 -59109 -17044 -30900 -25790 -60506 -159391 -186114 -167367 -102039
14035a02039L3391l078K6068l2123k521O2777N35k5993J4067l6288n1506K2633
$$ -102039 -68648 -71726 -45658 -77781 -80302 -17525 -16990 -42983 -28916 -65204 -116710 -94077
14023i4077K7574J3712L6080n7944k51K4452l0696l4079M0693J10500J902K120
$$ -94077 -66503 -52791 -16711 -74655 -74906 -50454 -81150 -115229 -74536 35964 37866 39986
14011C9986K1901j51237M9325O4084r0232J7768L1078m2333l9999j1518j9804
$$ 39986 61887 -89350 -40025 24059 -66173 -48405 -17327 -59660 -99659 -111177 -130981
14000a30981N6221R8311J0260m5875j9355q0974p5902P6595P1449M3826j9689
$$ -130981 -74760 23551 33811 -12064 -31419 -112393 -188295 -111700 -40251 3575 -16114
13989a6114l8114K2447L4278j9177p834N390j8529m4741j7444k5985P9120N482
$$ -16114 -54228 -31781 2497 -16680 -24514 -19124 -37653 -82394 -99838 -125823 -46703 -41221
13977d1221m9675j6745M643J5832l1262o531M3957k766K6854l3283m4654N1700
$$ -41221 -90896 -107641 -102998 -87166 -118428 -124959 -81002 -83768 -56914 -90197 -134851 -83151
13965h3151K2811l6548K4113l0458n013l9602k9478k2603Q8774M1635k4534J7455
$$ -83151 -60340 -96888 -72775 -103233 -108246 -147848 -177326 -199929 -111155 -69520 -94054 -76599
13953g6599M75p812Q8611K6950j06742r7407J434M1793L2172N5917J1638q5615
$$ -76599 -76124 -83936 4675 31625 -75117 -172524 -171090 -129297 -97125 -41208 -29570 -115185
13941a15185L77N6354L156K1387k5779j26938k7871J08560J02445r039k9943K2802
$$ -115185 -114808 -58454 -55298 -33911 -59690 -186628 -214499 -105939 -3494 -12533 -42476 -19674
13929a9674L6730J426L8205N9652L0619l1650l4496j0402N4388p5487n5400k803
$$ -19674 17056 18482 56687 116339 146958 115308 80812 70410 124798 49311 -6089 -8892
13917h892k596L2126o0980n9774R226m5326o7662J8447N1605l9013l1305m0754
$$ -8892 -11488 20638 -40342 -100116 -90890 -136216 -203878 -185431 -133826 -172839 -204144 -244898
13905b44898R9970O3382Q359O9186J9644k8659o8972Q4172j8521O5634O1128j5477
$$ -244898 -144928 -81546 -73187 -4001 15643 -13016 -81988 2184 -16337 49297 110425 94948
13893I4948m8891m4303j6797q4340m2297O4650P1862m012k7853K4045l2110j4699
$$ 94948 46057 1754 -15043 -99383 -141680 -77030 -5168 -9180 -37033 -12988 -45098 -59797
13881e9797L6522N7734j1743m5213j8437j4641N5970l137J1695N8672r6968r5887
$$ -59797 -23275 34459 22716 -22497 -40934 -55575 395 -2742 8953 67625 -29343 -125230
13869a25230Q41O3632L7173o6306j36000M1869J85423Q6431o3156j14958o4982
$$ -125230 -124389 -60757 -23584 -89890 -225890 -184021 1402 87833 24677 -90281 -155263
13858a55263J1491N4503M1134k5284J5819M6799l4099r0357m1822L2833N4285
$$ -155263 -143772 -89269 -48135 -73419 -57600 -10801 -44900 -135257 -177079 -144246 -89961
13847h9961O937m7146j16105k3363L9140L6435K6446L4243N1111k0415J8443O6214
$$ -89961 -83024 -130170 -246275 -269638 -230498 -194063 -167617 -133374 -82263 -102678 -84235 -18021
13835a8021o3708r5550m140M876P5864m694Q229k4089J6729Q8940j9513m4692
$$ -18021 -81729 -177279 -181419 -176543 -100679 -105373 -97144 -121233 -104504 -15564 -35077 -79769
13823g9769M3538j8208L5711r983o4561k4098J27721j7501J9480K6502k031M8802
$$ -79769 -36231 -54439 -18728 -28711 -93272 -117370 10351 -7150 12330 38832 36801 85603
13811H5603k1247n6037k289J6405m4503l6931m8812K6089N1371r411n764J7007
$$ 85603 64356 8319 6030 22435 -22068 -58999 -107811 -81722 -30351 -39762 -45526 -28519
13799b8519N5396m2030K2532L3414L8267j3338J3710l9381j8305k2972l0635K320
$$ -28519 26877 -15153 7379 40793 79060 65722 79432 40051 21746 -1226 -31861 -29541
13787b9541m8625M266J8258j2261r775k5387o3150Q559M3193P091L0738J4010
$$ -29541 -78166 -73900 -55642 -67903 -77678 -103065 -166215 -157656 -114463 -107372 -76634 -62624
13775f2624k5103j1511K45K6052k5556R0573M0785q3090L9034J31375j36672q5879
$$ -62624 -87727 -99238 -98993 -72941 -98497 -7924 32861 -50229 -11195 120180 -16492 -102371
13763a02371J5546l2567Q910N4843L4676K8790l8302m2076k8144p369Q0206J6257
$$ -102371 -86825 -119392 -110482 -55639 -20963 7827 -30475 -72551 -100695 -108064 -27858 -11601
13751a1601p7232j1010O3412K8950M071k9307L7099N8947n3378p1063L8721r840
$$ -11601 -88833 -99843 -36431 -7481 -3410 -32717 4382 63329 9951 -61112 -22391 -32231
13739c2231P9566l8913n4650j8679o056k701K8355P814j0142l8997k7413K7182
$$ -32231 47335 8422 -46228 -64907 -70963 -73664 -45309 -37495 -47637 -86634 -114047 -86865
13727h6865L1298L2668L2413K7539K3963J8613l9021K1383K0526L6360M9793l5325
$$ -86865 -55567 -22899 9514 37053 61016 79629 40608 61991 82517 118877 168670 133345
13715A33345n4054j9990m5291k8863M5469L2887l962m6799j04515K8782P60q9448
$$ 133345 79291 59301 14010 -14853 30616 63503 59541 12742 -91773 -62991 -62231 -151679
13703a51679l4453L4052J5053J7714l6528J2482N9827j2842M635K4427K7431J5542
$$ -151679 -186132 -152080 -137027 -119313 -155841 -143359 -83532 -96374 -91739 -67312 -39881 -24339
13691b4339J6514M6545n6733q7651K7665M0141q920k5921q9568J9969N9964Q994
$$ -24339 -7825 38720 -18013 -105664 -77999 -37858 -46778 -72699 -162267 -142298 -82334 -73340
13679g3340L2041O501j1329P9759R3443k1775n7278O43L7028p8432o7148R1381
$$ -73340 -41299 -34798 -46127 33632 127075 105300 48022 48665 85693 7261 -59887 31494
13667C1494N1282j0724k1432P5437n539j00920o37M1595k857m4194k3333M1571
$$ 31494 82776 72052 50620 126057 120518 19598 18961 60556 57699 13505 -9828 31743
13655C1743j4379M4446M649L9870q2489j02734L695L1975M8037N394r410P968
$$ 31743 17364 61810 66459 106329 23840 -78894 -75199 -43224 4813 10207 797 8765
13643H765k652O8574Q3562R84j12910q6973K3661N4234j5705J1058j27m4890N9405
$$ 8765 6113 74687 158249 159233 46323 -40650 -16989 37245 21540 32598 32471 -12419 46986
13630D6986K2759N9488q521l6962K4235R867k7970j9063L229j9107k2799J05468
$$ 46986 69745 129233 120712 83750 107985 117852 89882 70819 74048 54941 32142 137610
13618A37610n1812q6806J0641J1150M5625J2057J652J6038L6261k1774l9907m8221
$$ 137610 85798 -1008 9633 20783 66408 78465 80117 96155 132416 110642 70735 22514
13606B2514R461l2393M1511j883n1776j12169q5973J02550J32107R3497l8419
$$ 22514 31975 -418 41093 39210 -12566 -124735 -210708 -108158 23949 117446 79027
13595G9027p9948l2086j0055K4030j6388L5892K6784O1775N9427m008k8352k0086
$$ 79027 -921 -33007 -43062 -19032 -35420 472 27256 89031 148458 144450 116098 96012
13583I6012n8080k4011l154n039P206L8698M5367j0284m5096L4304J1911n6108
$$ 96012 37932 13921 10767 5728 12934 51632 96999 86715 41619 75923 87834 31726
13571C1726k0968O3709j3450J4728L7562m1188k4038n6593M659P9218P3510n1252
$$ 31726 10758 74467 61017 75745 113307 72119 48081 -8512 -3853 75365 148875 97623
13559I7623l9768J0665o907L538m685J6062P0545J5286o3158p961j2568p779J1198
$$ 97623 57855 68520 61613 65151 60466 76528 147073 162359 99201 91240 78672 70893 82091
13546H2091J05758l349m4744L9309L7262k977J6016m4660j56411j01633O0757
$$ 82091 187849 184500 139756 179065 216327 213350 229366 184706 28295 -73338 -12581
13535a2581P5891P4728k836J9454k7470l3334J1428p430l5062k7877M2547Q2222
$$ -12581 63310 138038 135202 154656 127186 93852 105280 97850 62788 34911 77458 159680
13523A59680O022J2182P0676O0166j3796n3659K2692J897K1074P3692o8313j19062
$$ 159680 165702 177884 248560 308726 294930 241271 263963 265860 286934 360626 292313 173251
13511A73251k7657l1070P995J04926m109j1291M8763o0307k244P788j8488m390
$$ 173251 145594 114524 122519 227445 223336 212045 260808 200501 198257 206045 187557 183167
13499A83167J1900N164K067J7722L9965R5606J8219j0162p7277q8523l3524K3981
$$ 183167 195067 200231 202298 220020 259985 355591 373810 363648 286371 197848 164324 188305
13487A88305m3496L1199J06124j1260p6502J1265M0272K9198N278n7744j6478
$$ 188305 144809 176008 282132 270872 194370 205635 245907 275105 280383 222639 206161
13476B06161j96J6871K7145l5894m0277K8783N1662O127M3522Q8816n0143m1297
$$ 206161 205965 222836 249981 214087 173810 202593 254255 260382 303904 392720 342577 301280
13464C01280m0604j5011L456J9436j1978J8145L4542L0550j3012K9044m0427o3943
$$ 301280 260676 245665 249121 268557 256579 274724 309266 339816 326804 355848 315421 251478
13452B51478K001K6337Q1365J00745o5691l0082L4719j9964p3847l7107O9251
$$ 251478 253479 279816 361181 461926 396235 366153 400872 380908 307061 269954 339205
13441C39205M495O8968L7667l5815K5959k0846l8950l4074j5775j9856l4296J04178
$$ 339205 343700 412668 450335 414520 440479 419633 380683 346609 330834 310978 276682 380860
13429C80860O7059n8165n0965k2757k2044n3651M3591j1098m1213o1651L4501
$$ 380860 447919 389754 338789 316032 293988 240337 283928 272830 231617 169966 204467
13418B04467O9220N6714N9300m356O7980o3964r2319o212j2851O9044O9836R184
$$ 204467 273687 330401 389701 385345 453325 389361 297042 290830 277979 347023 416859 426043
13406D26043j2998o1881j3611m2356n1377J3748l7089M9508Q5311L3570n4081
$$ 426043 413045 351164 337553 295197 243820 257568 220479 269987 355298 388868 334787
13395C34787j8364J7700L3610O45p964O26l6790M5312L3655k106p9941J2226P9782
$$ 334787 316423 334123 367733 368378 360414 361040 324250 369562 403217 401111 321170 333396 413178
13382D13178k220m4139k726l5683l5385j5763Q1610Q0462p5681l7265O1957l316
$$ 413178 410958 366819 364093 328410 293025 277262 358872 439334 363653 326388 388345 385029
13370C85029n4350L7901J5403R65M3349r9600q0261o8761k2756M8686P8526N7424
$$ 385029 330679 368580 383983 384948 428297 328697 248436 179675 156919 205605 284131 341555
13358C41555N6676j7079n6139J6091K1929k1994J12297O3826K366r9267j11357
$$ 341555 398231 381152 325013 341104 363033 341039 453336 517162 519528 420261 308904
13347C08904K8887L8735N5698m0294r4671p782k1391n7019P251L7752k2630M4027
$$ 308904 337791 376526 432224 391930 297259 289477 268086 211067 218318 256070 233440 277467
13335B77467o2256j29433O442M3968J5059K7349k6571p6009P8430K4878n6955
$$ 277467 215211 85778 92220 136188 151247 178596 152025 76016 154446 179324 122369
13324A22369k9414L1710N0848N0565M5368J8819K2039l6433o6143L6131M5193
$$ 122369 92955 124665 175513 226078 271446 290265 312304 275871 209728 245859 291052
13313B91052p9652r1223l6567L4942P0698P8360q71j02446k4538Q5189J5156m2661
$$ 291052 211400 120177 83610 118552 189250 267610 266739 164293 139755 224944 240100 197439
13301A97439K2784l7700k9290J6262K5799r793N6616o1018n0007j2504o740k5829
$$ 197439 220223 182523 153233 169495 195294 185501 242117 181099 131092 118588 111848 86019
13289H6019o829L309M2658L4763Q2654j9821q4070L1348L3913J5256J6398J3670
$$ 86019 79190 82499 125157 159920 242574 222753 138683 170031 203944 219200 235598 249268
13277B49268k6624J586L976k237j9922l5853k3432l0576P9428N4721m8065k8312
$$ 249268 222644 224230 228206 225969 206047 170194 146762 116186 195614 250335 202270 173958
13265A73958M5280P9341K90j7728r2058j515L2740K1975R581j3820q3531m8621
$$ 173958 219238 298579 298869 281141 189083 187568 220308 242283 251864 238044 154513 105892
13253A05892q428k2851m7129K4662R1488k461Q320J0708K278j9491o6491l8787
$$ 105892 97464 74613 27484 52146 143634 141173 149493 160201 162479 142988 76497 37710
13241C7710l4815N7189R5766k1590k2039M7697k4165p1453p0131r5247O0218O4843
$$ 37710 2895 60084 155850 134260 112221 159918 135753 64300 -5831 -101078 -40860 23983
13229B3983P4113p6847M1261N0536Q5545N708q2501r2995j9235P3701k3428j5078
$$ 23983 98096 21249 62510 113046 198591 204299 121798 28803 9568 83269 59841 44763
13217D4763L9832M5946o4247o556r864P1443O790q1816K451O4227O041K0500J2955
$$ 44763 84595 130541 66294 59738 49874 121317 128107 46291 48742 112969 119010 139510 152465
13204A52465L3671l7907l1695M4170o8616J9902p9230K6446N7822M4915M9507
$$ 152465 186136 148229 116534 160704 92088 111990 32760 59206 117028 161943 211450
13193B11450j0311m743n9962n3875J383J1673j14552k4347J6361o849p155l694
$$ 211450 201139 196396 136434 82559 83942 95615 -18937 -43284 -26923 -33772 -40927 -44621
13181d4621k8332L6991Q5042M5843l8204J0306q65o7658L9092P7657r735j0098
$$ -44621 -72953 -35962 49080 94923 56719 67025 66160 -1498 37594 115251 105516 95418
13169I5418r397m488N084n6296n5271L5503j0667m7371L6218N8141P1916J7813
$$ 95418 86021 81533 86617 30321 -24950 10553 -114 -47485 -11267 46874 118790 136603
13157A36603r4798n5001j5670n1917J5268J1714q454O5255J00393k7488j37620
$$ 136603 41805 -13196 -28866 -80783 -65515 -53801 -62255 3000 103393 75905 -61715
13146f1715n8421J12189M3491k2356M2419n1q645J9607J953j3056l8375M366J707
$$ -61715 -120136 -7947 35544 13188 55607 55556 46911 66518 68471 55415 17040 21406 23113
13133B3113m1396l3365q36N8026K297N9702l2886m0563O4343P4255m9298o1363
$$ 23113 -18283 -51648 -52484 5542 7839 67541 34655 -5908 58435 132690 83392 22029
13121B2029N2971O7366K0760n618k1968j40136j6348Q9884K6314j2945o9484n8724
$$ 22029 75000 142366 163126 157508 135540 -4596 -20944 68940 95254 82309 12825 -45899
13109d5899O9940J31311N1794j14594M6838K9069m0090K2621J194j501K528m1255
$$ -45899 24041 155352 207146 92552 139390 168459 128369 150990 152184 150683 153211 111956
13097A11956j13184q225K8677N8680n5831j09164m0810P5216L773N7934L696L0347
$$ 111956 -1228 -9453 19224 77904 22073 -87091 -127901 -52685 -48912 9022 12718 43065
13085D3065P2120k976n234J2710m9789k6063J009J1668K023n1267l4368n7528
$$ 43065 115185 112209 106975 119685 69896 43833 44842 56510 58533 7266 -27102 -84630
13073h4630M2142M8655m7334n3416J03265J9249P131p8606J4622P7574M5302k748
$$ -84630 -42488 6167 -41167 -94583 8682 27931 35062 -43544 -28922 48652 93954 91206
13061I1206o5849J4250Q940k1006l5351k15N8169L7341j7955n6746o2495n9680
$$ 91206 25357 39607 48547 27541 -7810 -8025 50144 87485 69530 12784 -49711 -109391
13049a09391N2066K5386j4257J1454J7887L1057K0145L5896M7923N315K4247l2673
$$ -109391 -57325 -31939 -46196 -34742 -16855 14202 34347 70243 118166 123481 147728 115055
13037A15055n9239n1006J9382L2345k0728k6905M965J1214j9874N1969N4340o4618
$$ 115055 55816 4810 24192 56537 35809 8904 13869 25083 5209 57178 111518 46900
13025D6900m5660j3635J8540L021o9740j8496K3762k6006K2838j3332M2377L4485
$$ 46900 1240 -12395 6145 9166 -60574 -79070 -55308 -81314 -58476 -71808 -29431 5054
13013E054L4064k6339l3896m6222L187N7226k7139k0544j5851K0079l2243L2649
$$ 5054 39118 12779 -21117 -67339 -64152 -6926 -34065 -54609 -70460 -50381 -82624 -49975
13001d9975Q460j892M6563K8468L4166Q277r1518l7953O4407M754P852j567J4245
$$ -49975 -41515 -43407 3156 31624 65790 74067 -17451 -55404 9003 13757 21609 20042 34287
12988C4287p3265j08382K2554M0855M2044p76M0685O2071j2701k2061j0984L4772
$$ 34287 -38978 -147360 -124806 -83951 -41907 -42683 -1998 60073 47372 25311 14327 49099
12976D9099N4350J2446o2950o7610l7967q061J7948j9159j10473N9433P6226L2836
$$ 49099 103449 115895 52945 -14665 -52632 -60693 -42745 -61904 -172377 -112944 -36718 -3882
12964c882L8579j9075N242K8167O611n5498o4402j7901Q2388O086p4188l214R6794
$$ -3882 34697 15622 20864 49031 55642 144 -64258 -82159 229 6315 -67873 -71087 25707
12951B5707J38272m92L1948m6855j2080o1909p0952l2L6526l9224k1847P4544
$$ 25707 163979 163487 195435 148580 136500 74591 3639 3607 40133 909 -20938 53606
12939E3606O264n1437n3492o8302K1276P1801q448k5868j4038k675Q2686K1100
$$ 53606 59870 8433 -45059 -113361 -92085 -20284 -28732 -54600 -68638 -71313 11373 32473
12927C2473K8586m5592l5890n4620O1870N279K8607J8666R1712j5739r135j6729
$$ 32473 61059 15467 -20423 -75043 -13173 -7894 20713 39379 131091 115352 106217 89488
12915H9488r5308j4639L9166L1424o752K0198o5404l4112j318l5293Q916K9201
$$ 89488 -5820 -20459 18707 50131 43379 63577 -1827 -35939 -37257 -72550 -63634 -34433
12903c4433J6130Q8573J3227q3113r4145O520m3711M0638O9313Q8428J30378K9407
$$ -34433 -18303 70270 83497 384 -93761 -87241 -130952 -90314 -21001 67427 197805 227212
12891B27212j37002j41993M8439R8263o086m4034n3909M9994k3162J1368K8023
$$ 227212 90210 -51783 -3344 94919 88833 44799 -9110 40884 17722 29090 57113
12880E7113n323p8137K6928R4714L7896m955k5543J5260n1634m407j7965r454
$$ 57113 51790 -26347 581 95295 133191 128236 102693 117953 66319 61912 43947 34493
12868C4493o2920P7178K5376J6269n2625o02J8593J475r616n3043n2921p1822
$$ 34493 -28427 48751 74127 90396 37771 37169 55762 57237 47621 -5422 -58343 -130165
12856a30165k7432P3971P6688N1536K4976o9072L409L1691M2707O6540m7210j8238
$$ -130165 -157597 -83626 -6938 44598 69574 502 3911 35602 78309 144849 97639 79401
12844G9401j6586j4220j3616K5206k6639k4671m1710L3049Q8163l9435N306r7094
$$ 79401 62815 48595 34979 60185 33546 8875 -32835 214 88377 48942 54248 -42846
12832d2846r3853J12155O9855o61j066k1222M0793o295L8810M0701l3081l4152
$$ -42846 -136699 -24544 45311 44650 43584 22362 63155 56860 95670 136371 103290 69138
12820F9138Q539J83m623l5075n7498m0868M2447K1447R714n7834q0889J8692O6566
$$ 69138 77677 77860 73237 38162 -19336 -60204 -17757 3690 13404 -44430 -125319 -106627 -40061
12807d0061K328m960Q469N5926O9160M8437P370j01189j10030K8662O6393j2662
$$ -40061 -37733 -42693 -34224 21702 90862 139299 146669 45480 -64550 -35888 30505 17843
12795A7843n0107j0032M2161k5877M2676N1109m2111P310O7846M3464L938j02277
$$ 17843 -32264 -42296 -135 -26012 16664 67773 25662 32972 100818 144282 148220 45943
12783D5943n6150n0427K5589N626n8475J6153N6430k0591O4295J07505r3662J9333
$$ 45943 -10207 -60634 -35045 -29419 -87894 -71741 -15311 -35902 28393 135898 42236 61569
12771F1569K6291K1478k9268J5460n3216K8046L4853Q8163Q304j7018l0846n0575
$$ 61569 87860 109338 80070 95530 42314 70360 105213 193376 201680 184662 153816 103241
12759A03241O2415K288L7770M8212k0342o934r3240m9901j3282k4984M4297l2479
$$ 103241 165656 167944 205714 253926 233584 226650 133410 83509 70227 45243 89540 57061
12747E7061l3959J4179K7997M6112K3036K1648J48999P1847r9003j80875K8033
$$ 57061 23102 37281 65278 111390 134426 156074 305073 376920 277917 97042 125075
12736A25075R2608J4560K2945p334N75p482m7071N9656M9941L3666J3910j2907
$$ 125075 217683 232243 255188 247854 248429 240947 193876 253532 303473 337139 351049 338142
12724C38142O1249K3407m7831K3146J61678Q1726J87M5532O589R6673N216N6903
$$ 338142 399391 422798 374967 398113 559791 641517 641704 687236 693825 790498 795714 852617
12712H52617k8878j3492l8354j6874n4381q6901K5294K9062q7085k1591m5455
$$ 852617 823739 810247 771893 755019 700638 613737 639031 668093 581008 559417 513962
12701E13962m689n6569l4726m741K2042n4122n1121r594k5244q5692N579N5396
$$ 513962 509273 452704 417978 413237 435279 381157 330036 320442 295198 209506 215085 270481
12689B70481L9162K4048j16440j55767N5235N1745l8578l8257m3186O265Q2906
$$ 270481 309643 333691 217251 61484 116719 168464 129886 91629 48443 54708 137614
12678A37614m0767r1321q184L0011n564J04860J5653n2205n4389N4711m7106j7792
$$ 137614 96847 5526 -2658 27353 21789 126649 142302 90097 35708 90419 43313 25521
12666B5521J7314P327J4773P81J1710K1714k068k6182j9991m363M5815M9237J4110
$$ 25521 42835 50162 64935 65716 77426 99140 97072 70890 50899 46536 92351 141588 155698
12653A55698l6752p2863M2051P4240K8136k0051L1372l2516m1346J0598k1935
$$ 155698 118946 46083 88134 162374 190510 170459 201831 169315 127969 138567 116632
12642A16632o5380j6774o291K8299n656j8601q0605M4487N0829K7910P2703j5003
$$ 116632 51252 34478 28187 56486 50830 32229 -48376 -3889 46940 74850 147553 132550
12630A32550l7774L1369N5432J2517J8928P6859j5507n8833n3864L6580k1409
$$ 132550 94776 126145 181577 194094 213022 289881 274374 215541 161677 198257 176848
12619A76848o0191M0725R583n8569o169m1316o0850L3264J0753L3942O6383n9295
$$ 176848 116657 157382 166965 108396 102227 60911 61 33325 44078 78020 144403 85108
12607H5108N3893Q3837M0497q7687j1372L0389o1577o4722L1020M5346J2086J0978
$$ 85108 139001 222838 263335 175648 164276 194665 133088 68366 99386 144732 156818 167796
12595A67796K3617l8847o031k0548m2575k4748O656R0338q884k5339p3964j9268
$$ 167796 191413 152566 146535 125987 83412 58664 65320 155658 146774 121435 47471 28203
12583B8203L5310k4797N5437J5890j9752J0446p6454m0319O0253P8131M810q6067
$$ 28203 63513 38716 94153 110043 90291 100737 24283 -16036 44217 122348 127158 41091
12571D1091N3261k4404n8057o0534r815P7311N5792l9682R577R4452o383J0900
$$ 41091 94352 69948 11891 -48643 -58458 18853 74645 34963 44540 138992 132609 143509
12559A43509m4310p536n2151n6746j1206l0380l1290n58N5783l2612J1958N0710
$$ 143509 99199 91663 39512 -17234 -28440 -58820 -90110 -90668 -34885 -67497 -55539 -4829
12547d829K486n6280K0591J41849N3146M112K1190J9514J4760p4260L93R856K8612
$$ -4829 -2343 -58623 -38032 103817 156963 161075 182265 201779 216539 142279 142672 152528 181140
12534A81140J07184Q3419l3625n7458j47486o9322L2387N4824J3417K5700r980
$$ 181140 288324 371743 338118 280660 133174 63852 96239 151063 164480 190180 180200
12523A80200L5019L9136n7445q6428J1765K8245J27888O879r1546q7392l7734
$$ 180200 215219 254355 196910 110482 122247 150492 278380 285259 193713 106321 68587
12512F8587L1900o1521k584L3157K4336r435L7125O9750k5866j18763n4986r650
$$ 68587 100487 38966 36382 69539 93875 84440 121565 191315 165449 46686 -8300 -17950
12500a7950Q43L1729M7345K4975J8807l5438j4914L1878k0341p8841j4283o5493
$$ -17950 -17107 14622 61967 86942 105749 70311 55397 87275 66934 -11907 -26190 -91683
12488i1683K2426K9812L7223P5324N8382j5263j07581l8657M7256M836L1165j992
$$ -91683 -69257 -39445 -2222 73102 131484 116221 8640 -30017 17239 22075 53240 51248
12476E1248M0653M4711Q3876Q7094R6601j52133j11480l63R3045J8036J7043P0949
$$ 51248 91901 136612 220488 307582 404183 252050 140570 140207 233252 251288 268331 339280
12464C39280M4130N1556J0553m4009m602q919l9840N4273R0102K8482m1829N5507
$$ 339280 383410 434966 445519 401510 396908 387989 348149 402422 492524 521006 479177 534684
12452E34684O5580n1796l8806m820m7434N5570j2938n9669O199P5970k7758l4853
$$ 534684 600264 548468 509662 504842 457408 512978 500040 440371 446570 522540 494782 459929
12440D59929m2318M9724P3939O0914p1416n5025K7933j116l9380J25058K0084
$$ 459929 417611 467335 541274 602188 530772 475747 503680 502564 463184 588242 608326
12429F08326l3492J0196N0559k6124M5102N8881J0942O5750K798o2993Q750P8665
$$ 608326 574834 585030 635589 609465 654567 713448 724390 790140 792938 729945 738695 817360
12417H17360N2548J7137k8449L2378o9861n0256J8937L7468k332m0407J6691N8131
$$ 817360 869908 887045 858596 890974 821113 770857 789794 827262 824930 784523 801214 859345
12405H59345K0803O8240J80269M7309m5980j04497n7723n23N4616N4150M9004
$$ 859345 880148 948388 1128657 1175966 1129986 1025489 967766 967243 1021859 1076009 1125013
12394A125013Q2620j0280k4251N3885J0206K2967J0115n6183O0964J30509J5892
$$ 1125013 1207633 1197353 1173102 1226987 1237193 1260160 1270275 1214092 1275056 1405565 1421457
12383A421457m9427m6139Q6917Q2442L2846Q9872K6182K7862L6679J3576J3578
$$ 1421457 1372030 1325891 1412808 1495250 1528096 1617968 1644150 1672012 1708691 1722267 1735845
12372A735845K4014N8101Q2155Q4053M5074K8330K0994J14938Q3915K0330Q3432
$$ 1735845 1759859 1817960 1900115 1984168 2029242 2057572 2078566 2193504 2277419 2297749 2381181
12361B381181R2313J00247Q5246L4442K0868P6590J10550J80275N9378Q9196R9920
$$ 2381181 2473494 2573741 2658987 2693429 2714297 2790887 2901437 3081712 3141090 3230286 3330206
12350C330206R0857J11342J42288J50426J45832J86905J23791L4957J85862K25285
$$ 3330206 3421063 3532405 3674693 3825119 3970951 4157856 4281647 4316604 4502466 4727751
12340D727751K26953K16923K69823K80313L23789K19319K11917K66720L19872
$$ 4727751 4954704 5171627 5441450 5721763 6045552 6264871 6476788 6743508 7063380
12331G063380L41218L62639L90470M57834M33908N39084O22450O21434P29460
$$ 7063380 7404598 7767237 8157707 8615541 9049449 9588533 10210983 10832417 11561877
12322A1561877P44667Q04890P77240Q98970J083568J198754J325226J393412J553771
$$ 11561877 12306544 13111434 13888674 14787644 15871212 17069966 18395192 19788604 21342375
12313B1342375J755358K030243K276290K477887K737495L135839L559223L923110
$$ 21342375 23097733 25127976 27404266 29882153 32619648 35755487 39314710 43237820
12305D3237820M417958N069249N764609O691466P505253Q503007R664883J0704721
$$ 43237820 47655778 52725027 58489636 65181102 72686355 81189362 90854245 101558966
12297A01558966J1686799J2416251J2836818J2496645J1339622R434321O700146
$$ 101558966 113245765 125662016 138498834 150995479 162335101 171769422 178469568
12290A78469568L361465k85307m030975p167293r558599j1145375j1988113j2049735
$$ 178469568 181831033 181545726 177514751 170347458 160788859 149643484 137655371 125605636
12282A25605636j1764938j1196044j0254663r187301q263385p267507o405590
$$ 125605636 113840698 102644654 92389991 83202690 74939305 67671798 61266208
12275F1266208n775006n154608m543625l973382l481771l100670k831724k572185
$$ 61266208 55491202 50336594 45792969 41819587 38337816 35237146 32405422 29833237
12267B9833237k210581k007667j848601j633916j481796j375546j226624j198798
$$ 29833237 27622656 25614989 23766388 22132472 20650676 19275130 18048506 16849708
12259A6849708j126931r69098q46925p41062n77561o13284o04563o56360n67818
$$ 16849708 15722777 14753679 13906754 13165692 12588131 11974847 11370284 10713924 10146106
12250A0146106n16701m23118m28578l99786l90360l52312k93884l25791k24670
$$ 10146106 9629405 9206287 8777709 8377923 7987563 7635251 7341367 7015576 6790906
12241F790906j49847l04770l08493k53912k56402j08311j62093j92595j20259
$$ 6790906 6641059 6336289 6027796 5773884 5517482 5409171 5247078 5054483 4934224
12232D934224j42590j64624j17955j00148j52039j41695j44203j76157k9827m9915
$$ 4934224 4791634 4627010 4509055 4408907 4256868 4115173 3970970 3794813 3764986 3715071
12222C715071j75772j23630q1522j11219j13362p8738o7367j77078j08004l7230
$$ 3715071 3539299 3415669 3334147 3222928 3109566 3030828 2963461 2786383 2678379 2641149
12212B641149L0609j6644q5658j06576j27384n9080J073j7220j5413j39486j04213
$$ 2641149 2671758 2655114 2569456 2462880 2335496 2276416 2277489 2260269 2244856 2105370 2001157
12201B001157q7248k0620O657o8416p6407o8202q1126P6395l5559q8814K3713
$$ 2001157 1913909 1893289 1899946 1831530 1755123 1686921 1605795 1682190 1646631 1557817 1581530
12190A581530j1253O3721J7087k1914r071k7736n4053m0514L03M6237J4690J8335
$$ 1581530 1570277 1633998 1651085 1629171 1620100 1592364 1538311 1497797 1498100 1544337 1559027 1577362
12178A577362l6571l349K6377j8009p3547m782m5530m6693K7158J2068r1227j7964
$$ 1577362 1540791 1537442 1563819 1545810 1472263 1467481 1421951 1375258 1402416 1414484 1323257 1305293
12166A305293N5218P4848j1521p8314l1847k2735m8006n7014l7337L2332k7838
$$ 1305293 1360511 1435359 1423838 1345524 1313677 1290942 1242936 1185922 1148585 1180917 1153079
12155A153079p8563p6561p2644o0509m9961N4229J50354Q429r5850k6827j106
$$ 1153079 1074516 997955 925311 864802 814841 869070 1019424 1027853 932003 905176 904070
12144I04070J10831k946n0096M7703L30n9935j34060K4935L5036j0130K2126l4060
$$ 904070 1014901 1011955 961859 1009562 1009892 949957 815897 840832 875868 865738 887864 853804
12132H53804j59139j7067O9962k629o8298m0545j23093o7315j5182L1436K3345
$$ 853804 694665 677598 747560 744931 676633 636088 512995 445680 430498 461934 485279
12121D85279r0952K5151m3185m5402j8823k2333K4284J09792K6067M5696R5899
$$ 485279 394327 419478 376293 330891 312068 289735 314019 423811 449878 495574 591473
12110E91473R1424O7067P5016J29211Q2613P1963K6259J288N608k3164R520R7688
$$ 591473 682897 749964 824980 954191 1036804 1108767 1135026 1136314 1141922 1118758 1128278 1225966
12098A225966L9466L96L4307M7264O1246J1620P895k1362p5595p4802o661k3988
$$ 1225966 1265432 1265828 1300135 1347399 1408645 1420265 1428160 1406798 1331203 1256401 1249740 1225752
12086A225752N693L8834M228j4628p300m441l0259q3130m3966J5046L3650K6945
$$ 1225752 1231445 1270279 1274507 1259879 1252579 1248138 1217879 1134749 1090783 1105829 1139479 1166424
12074A166424q8574p6894K7046O1470l9867L6162P476l0533m2628N6581O390J9615
$$ 1166424 1077850 1000956 1028002 1089472 1049605 1085767 1093243 1062710 1020082 1076663 1083053 1102668
12062A102668Q8785J4361j9973M2180L6179J9344L5072R2960m5807n206K3946
$$ 1102668 1191453 1205814 1185841 1228021 1264200 1283544 1318616 1411576 1365769 1360563 1384509
12051A384509N642P516O9608n1847k5618M3242r91L2424O3870L6105M7082J21883
$$ 1384509 1390151 1397667 1467275 1415428 1389810 1433052 1432061 1464485 1528355 1564460 1611542 1733425
12039A733425K6022j7214k5188O4989m421J4984l3502k8613L1552m546j9695K7820
$$ 1733425 1759447 1742233 1717045 1782034 1777613 1792597 1759095 1730482 1762034 1757488 1737793 1765613
12027A765613N5031L5720J7360P1185q2220o097Q1283Q1800N7605O2391J19349
$$ 1765613 1820644 1856364 1873724 1944909 1862689 1856592 1937875 2019675 2077280 2139671 2259020
12016B259020M2638k6301J2323j3057j1143K3186O1253N8187J0520N1378O3673
$$ 2259020 2301658 2275357 2287680 2274623 2263480 2286666 2347919 2406106 2416626 2468004 2531677
12005B531677J02601N0841J9597N9029J85361J14299J02612N2377K709N3863L2191
$$ 2531677 2634278 2685119 2704716 2763745 2949106 3063405 3166017 3218394 3221103 3274966 3307157
11994C307157R2104J43911N2451J06527P6408J74379K34474J67950J78094J09983
$$ 3307157 3399261 3543172 3595623 3702150 3778558 3952937 4187411 4355361 4533455 4643438
11984D643438J10207Q0683J06283J69667J27573K23522K79085K79563K94379K12479
$$ 4643438 4753645 4834328 4940611 5110278 5237851 5461373 5740458 6020021 6314400 6526879
11974F526879K17888K47040L05934L20152L41643L61490L38979L44770L86383
$$ 6526879 6744767 6991807 7297741 7617893 7959536 8321026 8660005 9004775 9391158
11965I391158N00730N60774O21179O32992P11779O51536P22000Q50286Q60280
$$ 9391158 9891888 10452662 11073841 11706833 12418612 13070148 13792148 14642434 15502714
11956A5502714J017982J127498J182330J278203J404103J521819J749324J940985
$$ 15502714 16520696 17648194 18830524 20108727 21512830 23034649 24783973 26724958
11948B6724958K099632K400200K754792L061773L410605L822464M370482N092280
$$ 26724958 28824590 31224790 33979582 37041355 40451960 44274424 48644906 53737186
11940E3737186N861381O689825P654566Q955292J0477268J2061239J3978006J6126017
$$ 53737186 59598567 66288392 73942958 82898250 93375518 105436757 119414763 135540780
11932A35540780J8267526K0468526K2230544K3302522K2871923K0451147J5844970
$$ 135540780 153808306 174276832 196507376 219809898 242681821 263132968 278977938
11925B78977938R311080J568999o130482j2668470j7438272k0180222k1201924
$$ 278977938 288289018 289858017 283727535 271059065 253620793 233440571 212238647
11918B12238647k0945113k0055921j8396561j6632545j4912267j3092920j1421736
$$ 212238647 191293534 171237613 152841052 136208507 121296240 108203320 96781584
11911I6781584j0006524q776991p693667o664047n855396n133837m470681l932029
$$ 96781584 86775060 77998069 70304402 63640355 57784959 52651122 48180441 44248412
11903D4248412l535734l150214k757419k568423k188536j951188j778148j609460
$$ 44248412 40712678 37562464 34805045 32236622 30048086 28096898 26318750 24709290
11895B4709290j553935j409055j183148j142337j028899j032195q51657p40335
$$ 24709290 23155355 21746300 20563152 19420815 18391916 17359721 16508064 15767729
11887A5767729p31994p61054o65549o03633n68072m73509n29461m75370m64204
$$ 15767729 15035735 14274681 13609132 13005499 12437427 11963918 11434457 10959087 10494883
11878A0494883l27408k66644l63238l52371k78588k68261k54578k46172k86638
$$ 10494883 10167475 9900831 9537593 9185222 8906634 8638373 8383795 8137623 7850985
11869G850985j94830j56567j50860j80982j61882j09919j74402j20592k05508
$$ 7850985 7656155 7499588 7348728 7167746 7005864 6895945 6721543 6600951 6395443
11860F395443l04976j36688k56462k25807k70576p8346p2167j74558q6612j50375
$$ 6395443 6090467 5953779 5697317 5471510 5200934 5122588 5050421 4875863 4789251 4638876
11850D638876j97185j94065j26020n9862p1249j76154j30666r4665r9886n8689
$$ 4638876 4441691 4247626 4121606 4061744 3990495 3814341 3683675 3589010 3489124 3430435
11840C430435q8466p4940j69325m3825L9523p5884j27990m1423q3955n0751J6426
$$ 3430435 3341969 3267029 3097704 3053879 3093402 3017518 2889528 2848105 2764150 2713399 2729825
11829B729825l2082r3134m2369n4619j8938n6423n475j50566j15104K3578m4956
$$ 2729825 2697743 2604609 2562240 2507621 2488683 2432260 2426785 2276219 2161115 2184693 2139737
11818B139737j1034m7319o2912r0210q001N4794k7671m9935k769q122K001K7o1770
$$ 2139737 2128703 2081384 2018472 1928262 1920261 1975055 1947384 1897449 1894680 1886558 1888559 1888586 1826816
11805A826816q1792n8021Q4359O054m1652l6980J1788K778m9291j13613o7947
$$ 1826816 1745024 1687003 1771362 1777416 1735764 1698784 1710572 1713350 1664059 1550446 1482499
11794A482499n1171k2724N285J2693P287R576o925k6746M1591n0862l3523p0618
$$ 1482499 1431328 1408604 1413889 1426582 1433869 1443445 1436520 1409774 1451365 1400503 1366980 1296362
11782A296362r2583M1951j6843J7969n2677K8883P7374q3140o3697p6937o0403
$$ 1296362 1203779 1245730 1228887 1246856 1194179 1223062 1300436 1217296 1153599 1076662 1016259
11771A016259M895o2131m725L0786l4813l9663k7403o7557J6091J09l1928m0109
$$ 1016259 1021154 959023 954298 985084 950271 910608 883205 815648 831739 831848 799920 759811
11759G59811L1430l0367m3505K897R9393K0599N838k2369L3466j3164n7417j5712
$$ 759811 791241 760874 717369 720266 819659 840258 846096 823727 857193 844029 786612 770900
11747G70900M6190l4506j4528O2898L6005M7150Q4580J22993L6005K9962l7368
$$ 770900 817090 782584 768056 830954 866959 914109 998689 1121682 1157687 1187649 1150281
11736A150281N570L8507O8118M997n3774l5209J3029o5327m695o8345L186K8299
$$ 1150281 1155851 1194358 1262476 1267473 1213699 1178490 1191519 1126192 1121497 1053152 1056338 1084637
11724A084637p1731l0352p7507j6949K4396K9722j4635j12089j13983m7828j1775
$$ 1084637 1012906 982554 905047 888098 912494 942216 927581 815492 701509 653681 641906
11713F41906k6912m121J0031L6041P4474p812k0219j9412O966J7347m3041q0263
$$ 641906 614994 610873 620904 656945 731419 723607 703388 683976 690942 708289 665248 584985
11701E84985M3712M457o5668o0064K2554n043K1340k0903k1904M7713M8203N4123
$$ 584985 628697 633154 567486 507422 529976 524933 546273 525370 503466 551179 599382 653505
11689F53505J1627o3472j1148P4837J8845k120J8727l1326o8099m8309p3948m0612
$$ 653505 665132 601660 590512 665349 684194 682074 700801 669475 601376 553067 479119 438507
11677D38507N2926J35408R4833k3515m3444J9264j0417j715K1464K4207N7511
$$ 438507 491433 626841 721674 698159 654715 673979 663562 661847 683311 707518 765029
11666G65029k2432n2747M4418L5184M3043r5422l2849L9249Q8452m1320k3960
$$ 765029 742597 689850 734268 769452 812495 717073 684224 723473 811925 770605 746645
11655G46645j7406o7919R038k0645K3705l2675j4109n2291j9044J2225M952J606
$$ 746645 729239 661320 670358 649713 673418 640743 626634 574343 555299 567524 572476 574082
11643E74082O6981m7283p1128K5386k2830J1431n664l4367k6955j8411o4871J9478
$$ 574082 641063 593780 522652 548038 525208 536639 530975 496608 469653 451242 386371 405849
11631D05849R476M7554j0455m8271N205M4958M2423L493k2916p1846q2669j0544
$$ 405849 415325 462879 452424 404153 409358 454316 496739 500232 477316 405470 322801 312257
11619C12257O5324k3851M069j6696k7999n3744m4251k2880R32J40533p659n3503
$$ 312257 377581 353730 357799 341103 313104 259360 215109 192229 193161 333694 326035 272532
11607B72532K1921K2576Q6243n0891l9997N4080j7219K28k2980J0569L7604l4147
$$ 272532 294453 317029 403272 352381 312384 366464 349245 349473 326493 337062 374666 340519
11595C40519m2015j1413j731q6841M6024J7369J6368j54K2856J3950j282r0433
$$ 340519 298504 287091 285360 198519 244543 261912 278280 278126 300982 314932 313650 223217
11583B23217j9023j977O3219j983o4505m5868K4710P6409M0059k358k6289m8981
$$ 223217 204194 202217 265436 263453 198948 153080 177790 254199 294258 291900 265611 216630
11571B16630j0234J6848l5649O0709J3875l4882j9153o682Q954O2541M3273m9469
$$ 216630 206396 223244 187595 248304 262179 227297 208144 201462 210416 272957 316230 266761
11559B66761j5472L4600j9893q1982l5245k599O0845K6463l8449L9165p5330k7949
$$ 266761 251289 285889 265996 184014 148769 146170 207015 233478 195029 234194 158864 130915
11547A30915P7223R5698j1204n4322M7799R726p7851Q330P2176m163l6501J2967
$$ 130915 208138 303836 292632 238310 286109 295835 217984 226314 298490 294327 257826 270793
11535B70793o2221p7710j0978P4937L6012p2506J5014Q9154k6039j8577J0524
$$ 270793 208572 130862 119884 194821 230833 158327 173341 262495 236456 217879 228403
11524B28403J4722R3280k5359j01452q0246K9691J9333j7342K7500J4076l7312
$$ 228403 243125 336405 311046 209594 129348 159039 178372 161030 188530 202606 165294
11513A65294j15189N0034P6771j604p2545o416J16693k5398j2977K5343L9889
$$ 165294 50105 100139 176910 175306 102761 96345 213038 187640 174663 200006 239895
11502B39895n547J9206K6959k5028j4994l3331r6580p556K1982r344l730k0508
$$ 239895 234348 253554 280513 255485 240491 207160 110580 103024 125006 115662 111932 91424
11490I1424M9316P3515j9409J2308L3640j1251L1021l7525o7461m5946k3183m580
$$ 91424 140740 214255 194846 207154 240794 229543 260564 223039 155578 109632 86449 81869
11478H1869n2313Q0367L1663p6395q494J7202L3579j0119j0638J3816L5371m7332
$$ 81869 29556 109923 141586 65191 56697 73899 107478 97359 86721 100537 135908 88576
11466H8576k113J4301k765K1166j676l8369j6990k6291N9080N5911L7166p1300
$$ 88576 86463 100764 97999 119165 117489 79120 62130 35839 94919 150830 187996 116696
11454A16696l9455M2985K3721o7889o3115k314M7699O3907J6978k0294k4693P205
$$ 116696 77241 120226 143947 76058 12943 10629 58328 122235 139213 118919 94226 101431
11442A01431N5410q300r7732l8950k6004p038L545K4824P8951R6401P447n4370
$$ 101431 156841 148541 50809 11859 -14145 -21183 -17638 7186 86137 182538 189985 135615
11430A35615p875O9826K9566L8663O3629q8176n6037Q88L5249k0603n5454m0986
$$ 135615 127740 197566 227132 265795 329424 241248 185211 186099 221348 200745 145291 104305
11418A04305r97l2815J8507o342P7241M6531M6807n5882o7124N0726k0839p9590
$$ 104305 103308 70493 89000 82658 159899 206430 253237 197355 130231 180957 160118 80528
11406H0528o5596O504N950L0214j3542j3188j609J5553p559m9790k264j3530K9361
$$ 80528 14932 21436 27386 57600 44058 30870 29261 44814 37255 -12535 -14799 -28329 1032
11393A032P1797R4132R7501k7277p6832j1405r8765P034L9877p0903j8418R5025
$$ 1032 72829 166961 264462 237185 160353 148948 50183 57217 97094 26191 7773 102798
11381A02798l5822n9925J6248n408Q6836O2499m8447r3693p8385j7192K5273O4407
$$ 102798 66976 7051 23299 17891 104727 167226 118779 25086 -53299 -70491 -45218 19189
11369A9189L8352j710M087O7393M0645j7571J8278q9102k4603J27339J06389l6236
$$ 19189 57541 55831 59918 127311 167956 150385 168663 79561 54958 182297 288686 252450
11357B52450l7480p5272p7890j2730l3405P3908P3049m2548m1241k0924K5462
$$ 252450 214970 139698 61808 49078 15673 89581 162630 120082 78841 57917 83379
11346H3379k0264M5575J9667M1201l5707j2043n7350K9552m6312k7785n910K5625
$$ 83379 63115 108690 128357 169558 133851 121808 64458 94010 47698 19913 14003 39628
11334C9628j647k2572M6787k9758J0201j4596M693Q9505K2420l9787l7420m3318
$$ 39628 37981 15409 62196 32438 42639 28043 32736 122241 144661 104874 67454 24136
11322B4136k2366M9245M3237J7039l2673K8156n41l4797o6551o3566Q0730Q9466
$$ 24136 1770 51015 94252 111291 78618 106774 106233 71436 4885 -58681 22049 111515
11310A11515l0328r5982k074Q2428O4542N5830N6341m2992k5251J1491j7996j8828
$$ 111515 81187 -14795 -16869 65559 130101 185931 242272 199280 174029 185520 167524 148696
11298A48696j00674q8987j278O6186O5441J0523j8154k2162j3436M8475Q2316
$$ 148696 48022 -40965 -42243 23943 89384 99907 81753 59591 46155 94630 176946
11287A76946O7964j25566n8501L8333K6971J5118J38977j6927j54947o4786O5191
$$ 176946 244910 119344 60843 99176 126147 141265 280242 263315 108368 43582 108773
11276A08773O2852k5932j7716O206q7180l3617n0614m5000M7001K7663J9318j9716
$$ 108773 171625 145693 127977 134183 47003 13386 -37228 -82228 -35227 -7564 11754 -7962
11264g962K8471Q0928K81l8098J5308M5210n0805o9122j9977O7035J27258r783
$$ -7962 20509 101437 101718 63620 78928 124138 73333 4211 -15766 51269 178527 168744
11252A68744K0202J6124o0556k0202k4903m5459j02198l0603O971O2347K3807
$$ 168744 188946 205070 144514 124312 99409 53950 -48248 -78851 -71880 -9533 14274
11241A4274j7338P814P4553J4127K5606P8270j4626j21295r4408l4952P2742J03040
$$ 14274 -3064 4750 79303 93430 119036 197306 182680 61385 -33023 -67975 4767 107807
11229A07807K2696r6398p2013l087M5317m1724l0802k2435P8030K2703l4722J6717
$$ 107807 130503 34105 -37908 -40995 4322 -37402 -68204 -90639 -12609 10094 -24628 -7911
11217g911n78P8097J1166q3708r9768O012O1671J1483n8229r0828K4639J43637
$$ -7911 -8489 69608 80774 -2934 -102702 -96690 -35019 -23536 -81765 -172593 -147954 -4317
11205d317O2458m8779o4988J27076L9788l1034o8482l2296m8731P3028J7331k5099
$$ -4317 58141 9362 -55626 71450 111238 80204 11722 -20574 -69305 3723 21054 -4045
11193d045m701l1231j4728m3175P023Q8255j1722K8038l3693P528J33754m2734
$$ -4045 -8746 -39977 -54705 -97880 -90857 -2602 -14324 13714 -19979 -12451 121303 78569
11181G8569l900P714o497n162L6811k5812m3353L6399l8626m0217J3766L5381
$$ 78569 74669 82383 75886 70724 107535 81723 38370 74769 36143 -4074 9692 45073
11169D5073o1490n8279j7045P169M9230P6785L3512k8668j0364L2111k645j2974
$$ 45073 -16417 -74696 -91741 -84572 -35342 41443 74955 46287 35923 68034 65389 52415
11157E2415l3066m671k0784Q452O2684m081m6295L0613J09055r3669r8000q863
$$ 52415 19349 14678 -6106 2346 65030 60949 14654 45267 154322 60653 -37347 -46210
11145d6210l281N4956J5217J1216O0798k1683l4333J6640j0675o0669J0214L0918
$$ -46210 -49491 5465 20682 31898 92696 71013 36680 53320 42645 -18024 -7810 23108
11133B3108o057O3711p4268l2217R4145k5414l0592l0823J3676Q110k0468n416
$$ 23108 17051 80762 6494 -25723 68422 43008 12416 -18407 -4731 3379 -17089 -22505
11121b2505n7731Q1361L0342l9104j04336l1837R161K5177M5127Q4201K0575J3073
$$ -22505 -80236 1125 31467 -7637 -111973 -143810 -134649 -109472 -64345 19856 40431 53504
11109E3504n2912Q028J3498L2201M7249J2856r2119l9677m789J03110N7959R079
$$ 53504 592 8620 22118 54319 101568 114424 22305 -17372 -22161 80949 138908 147987
11097A47987J5679j5450j22445P804J6807k0423L7724O5776K0743L1596k5545
$$ 147987 163666 148216 25771 33575 50382 29959 67683 133459 154202 185798 160253
11086A60253o1856k1346m2280j1932O7948K1861k2632n8854L5040k3108r4546
$$ 160253 98397 77051 34771 22839 90787 112648 90016 31162 66202 43094 -51452
11075e1452N8078j3017l2058J172K3148N0945K8704l4128n1111o7373O196K2052
$$ -51452 6626 -6391 -38449 -37277 -14129 36816 65520 31392 -19719 -87092 -80896 -58844
11063e8844P2517j3276J4943M0404K5773N1080r0356p8879K0381R762j8608P0751
$$ -58844 13673 397 15340 55744 81517 132597 42241 -36638 -16257 -6495 -25103 45648
11051D5648N2537K2069k0592K8852J5548O8048m6743o3506J7832N1402J988N770
$$ 45648 98185 120254 99662 128514 144062 212110 165367 101861 119693 171095 173083 178853
11039A78853p3193N2455J36405J15954j5946K719k8029k6739k634J4866m5002
$$ 178853 105660 158115 294520 410474 394528 397247 369218 342479 339845 354711 309709
11028C09709M8712J3346o2545p3684k621Q1629J41311R6486K8702L5800k975p8824
$$ 309709 358421 371767 309222 235538 232917 314546 455857 552343 581045 616845 613870 535046
11016E35046p5806Q92j07996r3644n7044o386O1765J0205L6304Q1182j0375r744
$$ 535046 459240 460132 352136 258492 201448 195062 256827 267032 303336 384518 374143 364399
11004C64399k0888j25403p7838l4082l9270m1595L7400K4875j1440m0501Q4904
$$ 364399 343511 218108 140270 106188 66918 25323 62723 87598 76158 35657 120561
10993A20561O3159m715l2999p1629J7703M3207l1504r1392J1918K363j7860J9754
$$ 120561 183720 179005 146006 74377 92080 135287 103783 12391 24309 26672 8812 28566
10981B8566K4112Q541n9814q549j3073R959r528l0151n4447l3026K774r5303N1771
$$ 28566 52678 61219 1405 -7144 -20217 -10258 -19786 -49937 -104384 -137410 -134636 -229939 -178168
10968a78168O4358R0095R9201L6109O1232o2517j21203m8904L3365M2246J2383
$$ -178168 -113810 -23715 75486 111595 172827 110310 -10893 -59797 -26432 15814 28197
10957B8197l7704k5819N1710l3515k5229N6405J922q3452J3072n3709j2689J3785
$$ 28197 -9507 -35326 16384 -17131 -42360 14045 15967 -67485 -54413 -108122 -120811 -107026
10945a07026L0202o547P8246J29182L1202K8116q2281j8643J1623J1709k0715
$$ -107026 -76824 -83371 -5125 124057 155259 183375 101094 82451 94074 105783 85068
10934H5068K4729n2378o8587j3243j7065K1166N5974K7450m8208p9157l3391n49
$$ 85068 109797 57419 -11168 -24411 -41476 -20310 35664 63114 14906 -64251 -97642 -98191
10922i8191o098L3495L6732L7494J30165N3348m8104p2244N9289K9776j01681
$$ -98191 -104289 -70794 -34062 3432 133597 186945 138841 66597 125886 155662 53981
10911E3981q3820m5655j8553M1645M6767J5152l6149n5064J0161L2475J5452k5545
$$ 53981 -29839 -75494 -94047 -52402 -5635 9517 -26632 -81696 -71535 -39060 -23608 -49153
10899d9153M3985J7965P8880L8127q495q7613o833O9406l5660N5269K6841j3056
$$ -49153 -5168 12797 91677 129804 121309 33696 26863 96269 60609 115878 142719 129663
10887A29663q6943l4855k8723M4149Q5879K9518q0167l6106q2515p4176r198M9674
$$ 129663 42720 7865 -20858 23291 109170 138688 58521 22415 -60100 -134276 -143474 -93800
10875i3800L0187k489L1668R6363o7081j65244K6330L9836o9143M2354P7488P883
$$ -93800 -63613 -66102 -34434 61929 -5152 -170396 -144066 -104230 -173373 -131019 -53531 -45648
10863d5648o8433j8023M8659K4885n1627n3394L4018M5556P6331m0828J5l1949
$$ -45648 -114081 -132104 -83445 -58560 -110187 -163581 -129563 -84007 -7676 -48504 -48489 -80438
10851h0438k0874r518M7186P4989M593K9342r8666r8491o602J2642Q5418M4992
$$ -80438 -101312 -110830 -63644 11345 15938 45280 -53386 -151877 -158479 -145837 -60419 -15427
10839a5427K8008L5473j3438l071K570l6557o2234r2389L9766P4809j0139m4436
$$ -15427 12581 48054 34616 31545 34115 -2442 -64676 -157065 -117299 -42490 -52629 -97065
10827i7065p4980P5252R821K5239K4788J9376O494m4494L6012K2790p8995l7034
$$ -97065 -172045 -96793 -86972 -61733 -36945 -17569 -11075 -55569 -19557 3233 -75762 -112796
10815a12796O4745P7718k8344l7985o2289L0664Q3190L0399L0686l5940m3481
$$ -112796 -48051 29667 1323 -36662 -98951 -68287 14903 45302 75988 40048 -3433
10804c433k3187o0157O361J4550j4089m1384n5354N0131p940J6775j4587L1247
$$ -3433 -26620 -86777 -80416 -65866 -79955 -121339 -176693 -126562 -134502 -117727 -132314 -101067
10792a01067j554n0445o5747J0108N373L202K1122N8798J4801M9428j3211j0582
$$ -101067 -102621 -153066 -218813 -208705 -203332 -200130 -179008 -120210 -105409 -55981 -69192 -79774
10780g9774m9009n7808L4357M576J14518J04474N8482p5405q8838K3181R9476
$$ -79774 -128783 -186591 -152234 -147658 -33140 71334 129816 54411 -34427 -11246 88230
10769H8230j0649o3322l3956p0150p876P8750k7170o9176L7083J4636m8849j8478
$$ 88230 77581 14259 -19697 -89847 -97723 -18973 -46143 -115319 -78236 -63600 -112449 -130927
10757a30927p041J25742j3813k988P5540q675j03652p066M1340P7975j841k578
$$ -130927 -137968 -12226 -26039 -29027 46513 37838 -65814 -72880 -31540 46435 44594 42016
10745D2016J5486l7609K2009J4575N8956o8980m6412n8224K9974N51j9096J9861
$$ 42016 57502 19893 41902 56477 115433 46453 41 -58183 -28209 -27658 -46754 -26893
10733b6893R5566K7526k1097p809k2118m6514J0660m284m6012K2243j7552p6892
$$ -26893 68673 96199 75102 67293 45175 -1339 9321 5037 -40975 -18732 -36284 -113176
10721a13176n0376N9395J24716N7344k1187j2605L8805j791k8752O0355K1969
$$ -113176 -163552 -104157 20559 77903 56716 44111 82916 81125 52373 112728 134697
10710A34697p0022p4511M8155O1878O5647N790j8908k9241m6505k0576k121K2015
$$ 134697 64675 -9836 38319 100197 165844 171634 152726 123485 76980 56404 54283 76298
10698G6298j744M3533P928M8398k7683m8686l0433r806q530j00113M3369L3745
$$ 76298 74554 118087 126015 174413 146730 98044 67611 57805 49275 -50838 -7469 26276
10686B6276j6249L052m2881J4398j8326j8035M2508K2919O2124l1344o489M6993
$$ 26276 10027 13079 -29802 -15404 -33730 -51765 -9257 13662 75786 44442 37953 84946
10674H4946n8275k6117N2217l3693M2821Q8111k2152q5840p8063K6225O7476K904
$$ 84946 26671 554 52771 19078 61899 150010 127858 42018 -36045 -9820 57656 60560
10662F0560m9481J9652N6550L2197P698K1169P100K2854o188K5590N335N3459
$$ 60560 11079 30731 87281 119478 127176 148345 155445 178299 172111 197701 203036 256495
10650B56495M1820M4787k3373k6748o0720j8653N9572M4497l936M7125J3159K4793
$$ 256495 298315 343102 319729 292981 232261 213608 273180 317677 313741 360866 374025 398818
10638C98818J0944K3323J21470R6279J19188J11096J70833J71531J46335J64562
$$ 398818 409762 433085 554555 650834 770022 881118 1051951 1223482 1369817 1534379
10628A534379J59209J99942K17927K43573L20420M61418O48993R39141J211014
$$ 1534379 1693588 1893530 2111457 2355030 2675450 3136868 3785861 4725002 5936016
10619E936016J641138K211199K908643L815029M494311M302635K917278J199711
$$ 5936016 7577154 9788353 12696996 16512025 21006336 25308971 28226249 29425960
10611B9425960k02995q84260o94615N1164J281734K915581N014229P313600Q913085
$$ 29425960 29222965 28338705 27644090 27695254 28976988 31892569 36906798 44220398 53133483
10602E3133483Q107300M345900l89031l415923m309904l695710k089494J6383
$$ 53133483 61240783 65586683 65197652 61781729 57471825 53776115 51686621 51703004
10594E1703004K788430N978219R393033J1200404R128709K929631l945503q077782
$$ 51703004 54491434 60469653 69862686 81063090 90191799 93121430 89175927 81098145
10586H1098145r059364q058334o133037l658930r80231J851995M401712N487553
$$ 81098145 72038781 63980447 57847410 54188480 53208249 55060244 59461956 64949509
10578F4949509L805943o81907n114298p468194p522550o529454n153899l533405
$$ 64949509 68755452 68073545 62959247 55491053 47968503 41439049 36285150 32751745
10570C2751745j834368l23685P23532J007602K81224j465233l150446m004661
$$ 32751745 30917377 30593692 31317224 32324826 32606050 31140817 27990371 23985710
10562B3985710m051232l656663l086339k512001j874117j412223j191508r60380
$$ 23985710 19934478 16277815 13191476 10679475 8805358 7393135 6201627 5241247
10554E241247p74148n41909m09261l24911k52793k91766k37577j96998k34530
$$ 5241247 4467099 3925190 3515929 3191018 2938225 2646459 2408882 2211884 1977354
10545A977354k03226j54759k24856q0753k7423n7386Q1712p7255l6392p6071p5822
$$ 1977354 1774128 1619369 1394513 1313760 1286337 1228951 1310663 1233408 1197016 1120945 1045123
10534A045123j37766n6308K059j8077O5260l2119l705k2960j18942m1486L0466
$$ 1045123 907357 851049 853108 835031 900291 868172 864467 841507 722565 681079 711545
10523G11545P3431K3829r4119p2394L1063O6427K9383n2957k9718o325l47j1199
$$ 711545 784976 808805 714686 642292 673355 739782 769165 716208 686490 680165 679818 668619
10511F68619j5761n1498q4145L6707o9331J5438J5344L4321k5659r2705r1755
$$ 668619 652858 601360 517215 553922 484591 500029 515373 549694 524035 431330 339575
10500C39575N0693l1233l4819l4188P4488M321m4227k1551k474r813N2343O5139
$$ 339575 390268 359035 324216 290028 364516 368837 324610 303059 300585 290772 343115 408254
10488D08254n555j20409l5907N66O0700J8468m4078m5331O098N0786j8623j7339
$$ 408254 402699 282290 246383 246949 307649 326117 282039 236708 242806 293592 274969 257630
10476B57630J9930L7926K2652J1334J9345k7055R24K6613n122o8138k9813k6589
$$ 257630 277560 315486 338138 349472 368817 341762 342686 369299 364177 296039 266226 239637
10464B39637n5429M055k7780L8187M8931j588R864p2941q7469l6005K2276Q4667
$$ 239637 184208 188263 160483 198670 247601 246013 255877 182936 95467 59462 81738 166405
10452A66405N8899R80l0125r1511L2746J38064M5338L0063l6730n2344J4823o1083
$$ 166405 225304 226284 196159 104648 137394 275458 320796 350859 314129 261785 276608 215525
10440B15525q4507p1963m5689M418L7443l8818M0657Q5941L5328n0070n5959m7336
$$ 215525 131018 59055 13366 17784 55227 16409 57066 143007 178335 128265 72306 24970
10428B4970J8332J1184J9511l6359j1741o338J4983n7081R207Q0456N5429k017
$$ 24970 43302 54486 73997 37638 25897 19559 34542 -22539 -13332 67124 122553 120536
10416A20536O3934J1935p9046n7327L9654P5195L5267q5215j1021K9995J17804
$$ 120536 184470 196405 117359 60032 99686 174881 210148 124933 113912 143907 261711
10405B61711K6268j02043J7151J8119K2078j5837Q598K5112j4291l9407k3420
$$ 261711 287979 185936 203087 221206 243284 227447 236045 261157 246866 207459 184039
10394A84039n0068K6101K9917k2210J05932Q6793M5643j25512l3531o7859l7312
$$ 184039 133971 160072 189989 167779 273711 360504 406147 280635 247104 179245 141933
10383A41933p234m1283N8261M0389m8753K2338O6334n1812m4961l0721P8996N2496
$$ 141933 134699 93416 151677 192066 143313 165651 231985 180173 135212 104491 183487 235983
10371B35983m3628l3768O3269m8532l1296j3451m4801R1924K8062m8505k8845
$$ 235983 192355 158587 221856 173324 142028 128577 83776 175700 203762 155257 126412
10360A26412j4398j25237j6051J00480k0404J6360O5579M6385J734j5050O7723
$$ 126412 112014 -13223 -29274 71206 50802 67162 132741 179126 180860 165810 233533
10349B33533k9249l5534L2315K4551o5613o8083M437J280L4506K1090p2221J4562
$$ 233533 204284 168750 201065 225616 160003 91920 96357 97637 132143 153233 81012 95574
10337I5574P398m8760J823J115P5018k1151l7132N8044K0947J6364M0480N0031
$$ 95574 102972 54212 56035 57150 132168 111017 73885 131929 152876 169240 209720 259751
10325B59751j5691j1669m8568q9264j2063k5013N8873M1280R7421j9111r7289
$$ 259751 244060 232391 183823 94559 82496 57483 116356 157636 255057 235946 138657
10314A38657m4484r642j4696L1402K6863R735l7597K442n611j69R2960M3913o6379
$$ 138657 94173 84531 69835 101237 128100 137835 100238 102680 97069 96900 189860 233773 167394
10301A67394q6874m0741L3685J4032M6523M3236K0589k7997l1545k4641p1248
$$ 167394 80520 39779 73464 87496 134019 177255 197844 169847 138302 113661 42413
10290D2413n0015j8330M282K3135R0167O1284m5875j2692R402k3472K504o3404
$$ 42413 -7602 -25932 -21650 1485 91652 152936 107061 94369 103771 80299 82803 19399
10278A9399j4261J519O9823J6089p2188l6707M4001j0322k645L9407Q0055m1979
$$ 19399 5138 6657 76480 92569 20381 -16326 27675 17353 14708 54115 134170 92191
10266I2191r4715k059M7265J7039j1564n6599p1093j239j0447Q4773K4523j8869
$$ 92191 -2524 -4583 42682 59721 48157 -8442 -79535 -80774 -91221 -6448 18075 -794
10254g94k2252K3386K9551O2172L4151o022q2489n7871j9651J8034M9811J21961
$$ -794 -23046 340 29891 92063 126214 120192 37703 -20168 -39819 -21785 28026 149987
10242A49987j9912o2315L6852L8446L5960n5153n8116M2414m2141J1166R1670
$$ 149987 130075 67760 104612 143058 179018 123865 65749 108163 66022 77188 168858
10231A68858j094k7823q3375J5138O3567k6168k2006N1352m1379m2527J9552L476
$$ 168858 167764 139941 56566 71704 135271 109103 87097 138449 97070 54543 74095 77571
10219G7571P0090Q0765q1659r4921m7043Q8848K494j19117J6652R4775J1654o4294
$$ 77571 147661 228426 146767 51846 4803 93651 96145 -22972 -6320 88455 100109 35815
10207C5815n9054M3258L3464L2492m4303K2422o1447l4488N2972R0283l7214j45771
$$ 35815 -23239 20019 53483 85975 41672 64094 2647 -31841 21131 111414 74200 -71571
10195g1571m8756K2573M2613P6757R525L343k485P6939j0314j11117l9244q3212
$$ -71571 -120327 -97754 -55141 21616 31141 34484 31999 108938 98624 -12493 -51737 -134949
10183a34949p723q019Q1904Q0056R5721R722L7743o334N0737m5483P021L2922
$$ -134949 -142672 -150691 -68787 11269 106990 116712 154455 148121 198858 153375 160396 193318
10171A93318K4462p6040P070p464L1004J67640O6208K5099r7756l4564O0561l8335
$$ 193318 217780 141740 148810 141346 172350 339990 406198 431297 333541 298977 359538 321203
10159C21203j0693P267J9532k0991O3009J10204M6021J1032J0423o1760N5379
$$ 321203 310510 317777 337309 316318 379327 489531 535552 546584 557007 495247 550626
10148E50626r2976j22598l5635k9572l5248J15318J5889L1296k2982k6794K5771
$$ 550626 457650 335052 299417 269845 234597 349915 365804 397100 374118 347324 373095
10137C73095r0182n3475N6365k7238l6621K4925p0238m510o246p5371n8944M0807
$$ 373095 282913 229438 285803 258565 221944 246869 176631 172121 165875 90504 31560 72367
10125G2367R3545L5723k2366l0849k3293J1244L5603K581n3227p2602l7039K2435
$$ 72367 165912 201635 179269 148420 125127 136371 171974 174555 121328 48726 11687 34122
10113C4122J0340N7940O9423p8576l8431m1078M2133J00796Q2300K8317j13111
$$ 34122 44462 102402 171825 93249 54818 13740 55873 156669 238969 267286 154175
10102A54175j01621l8964K8500N159q6269J7112N2633K5643J4538r6757K5803
$$ 154175 52554 13590 42090 47249 -39020 -21908 30725 56368 70906 -25851 -48
10091d8M6497J13578J9346r3955j02492q967O7591M3606R575r7614n7983M3246
$$ -48 46449 160027 179373 85418 -17074 -26041 41550 85156 94731 -2883 -60866 -17620
10079a7620J0269M551Q865k0496o5695n045O2817N0641j8061N5488R4368L3421
$$ -17620 -7351 -2800 6065 -14431 -80126 -85171 -22354 28287 10226 65714 160082 193503
10067A93503k3402j8326l6995m1439k6919l6382r8306j6233Q0042L3175J6673
$$ 193503 170101 151775 114780 73341 46422 10040 -88266 -104499 -24457 8718 25391
10056B5391N7268J8805q6955J1633Q0109j943m7057j9065K9326k2580l9092J7240
$$ 25391 82659 101464 14509 26142 106251 104308 57251 38186 67512 44932 5840 23080
10044B3080l9562R414N5428k6023r7455J7304M0626K3535n541M8794k9862O1779
$$ 23080 -16482 -7068 48360 22337 -75118 -57814 -17188 6347 806 49600 19738 81517
10032H1517k6441p959N5099j0458o0581n6534L653k1532k3486M620k8975Q733
$$ 81517 55076 47117 102216 91758 31177 -25357 -21704 -43236 -66722 -62102 -91077 -82344
10020h2344K485J9462l4451J8768K519J7443Q7460j6615m0233K5024M0837m9825
$$ -82344 -79859 -60397 -94848 -76080 -73561 -56118 31342 14727 -25506 -482 40355 -9470
10008i470l7546R7705P958n4270M5733k3106L2244K0789J6281N9117M0098O782
$$ -9470 -47016 50689 58647 4377 50110 27004 59248 80037 96318 155435 195533 202315
9996B02315k159L0318J0081r7785q3633o5347j3560M8133P5783m3444o034L7604
$$ 202315 200156 230474 240555 142770 59137 -6210 -19770 28363 104146 60702 54668 92272
9984I2272l469m3819j889l9104m2125r655p2658k4746O7263M5251P2413K9463
$$ 92272 88803 44984 43095 3991 -38134 -47789 -120447 -145193 -77930 -32679 39734 69197
9972F9197n0164p007K6379k6004l0051O423P800M943m5469m8689N9404j7508q3610
$$ 69197 19033 12026 38405 12401 -17650 -11227 -3427 1516 -43953 -92642 -33238 -50746 -134356
9959a34356L0120M0351K4836k4595L9401P772k6536P3990J5092J406j2090j6971
$$ -134356 -104236 -63885 -39049 -63644 -24243 -16471 -43007 30983 46075 47481 35391 18420
9947A8420l2039K9707m683K8832N7617M193n8630j5770M034L7724J1478l4687
$$ 18420 -13619 16088 11405 40237 97854 102047 43417 27647 31681 69405 80883 46196
9935D6196k9817j387L4838N8008M9536l5593m0686L2340k1547K2864k6588K3990
$$ 46196 16379 14992 49830 107838 157374 121781 81095 113435 91888 114752 88164 112154
9923A12154J8086j431n6361j5769K7261k8941r721j557l2599J5380J1388O0356
$$ 112154 130240 128809 72448 56679 83940 54999 45278 43721 11122 26502 37890 98246
9911I8246l6511l7119k3462n8395k5366L9793M8972O2250q4747q115p682N1643
$$ 98246 61735 24616 1154 -57241 -82607 -42814 6158 68408 -16339 -24454 -32136 19507
9899A9507K9195m7400L7141N4781R2644q7643m8962j5801q0477j05747M4830k01
$$ 19507 48702 1302 38443 93224 185868 98225 49263 33462 -47015 -152762 -107932 -108133
9887a08133k7139P7274P8091K3657p55K119O8730m0351m2909M9904j05484K1257
$$ -108133 -135272 -57998 20093 43750 42995 45114 113844 73493 30584 80488 -24996 -3739
9875c739K5805K255L1123m038l3461l8613n4212L8828J18037N5480P6336Q0463
$$ -3739 22066 24321 55444 51406 17945 -20668 -74880 -36052 81985 137465 213801 294264
9863B94264m2140j14990j40086j2282K9450l1230L7902J6021o9906p7689N3365
$$ 294264 252124 137134 -2952 -15234 14216 -17014 20888 36909 -32997 -110686 -57321
9852e7321J14971p0504l4472P9105P8655k2148j2108n8307l7700L7117p344o1943
$$ -57321 57650 -12854 -47326 31779 110434 88286 76178 17871 -19829 17288 9944 -51999
9840e1999m1171K2325P3969n3882m256J6716L7218L7826n513J7846J013j3038
$$ -51999 -93170 -70845 3124 -50758 -55014 -38298 -1080 36746 31233 49079 50092 37054
9828C7054J0780J578l6829J7840l3123l7209M249M4591L6639M844j842k2943J8158
$$ 37054 47834 49412 12583 30423 -2700 -39909 -35660 8931 45570 50414 48572 25629 43787
9815D3787O3281o1205Q813K3844m7179n0257J2090J4357p3538k7890k6941J2147
$$ 43787 107068 45863 54676 78520 31341 -18916 -6826 7531 -66007 -93897 -120838 -108691
9803a08691j9928M0777j2217P9731R7040o2219o4348K2337N1625M5578j603J6632
$$ -108691 -128619 -87842 -100059 -20328 76712 14493 -49855 -27518 24107 69685 68082 84714
9791H4714p1875m8841J2153j8866N5592N3247K2038j1708k9260j6522J5258J5265
$$ 84714 12839 -36002 -23849 -42715 12877 66124 88162 76454 47194 30672 45930 61195
9779F1195J1539R0616N017n0775l8273p454J9475M7349l0402n5659p4329q8112
$$ 61195 72734 163350 168367 117592 79319 71865 91340 138689 108287 52628 -21701 -109813
9767a09813R075N7691O1463j8573L1979J7925K0082M5182q307M8178m3807j25106
$$ -109813 -100738 -43047 18416 -157 31822 49747 69829 115011 106704 154882 111075 -14031
9755a4031q1206P8397J19852l2653m1262o186N2830K7809Q860j4552L2759k3167
$$ -14031 -95237 -16840 103012 70359 29097 22911 75741 103550 112410 97858 130617 107450
9743A07450r081m7737j08616n7627j820J0671P431M3013P5048J6287o3229j315
$$ 107450 98369 50632 -57984 -115611 -117431 -106760 -99329 -56316 18732 35019 -28210 -29525
9731b9525O5332K6989j18932o490J938k9224J5553J1683M324P0784R9806K9252
$$ -29525 35807 62796 -56136 -62626 -60688 -89912 -74359 -62676 -58352 12432 112238 141490
9719A41490j0329m7997m9443n3156n7836K7287N8058P558J1475q923p3580J9175
$$ 141490 131161 83164 33721 -19435 -77271 -49984 8074 15632 27107 18184 -55396 -36221
9707c6221N4527P7843o6574N4537o9265o2228N6853L0064J917l5040J786M3959
$$ -36221 18306 96149 29575 84112 14847 -47381 9472 39536 41453 6413 8199 52158
9695E2158l9709p4018L3923P0379l4814O5734k0021j1826n1345j8206o3572n4010
$$ 52158 12449 -61569 -27646 42733 7919 73653 53632 41806 -9539 -27745 -91317 -145327
9683a45327J3169J1104j4144J05254J02626M1270J549l7566p2248p0128r20L2603
$$ -145327 -132158 -121054 -135198 -29944 72682 113952 115501 77935 5687 -64441 -65361 -32758
9671c2758L6081L9701m4458K5447O2674J9067k4392J396K1154k764n3572k8041
$$ -32758 3323 43024 -1434 24013 86687 105754 81362 82758 103912 101148 47576 19535
9659A9535l7568L6816L2136l4311k2759o7320m2740j113K8884J13020q338j8005
$$ 19535 -18033 18783 50919 16608 -6151 -73471 -116211 -117324 -88440 24580 16242 -1763
9647a763k8862p6147Q7995L0039N5408O8403Q8383j15013j08885K8047K2463r716
$$ -1763 -30625 -106772 -18777 11262 66670 135073 223456 108443 -442 27605 50068 40352
9635D0352k2082n730k8059J4463J47583L4475M4852j5293q3738J7208M4097N0378
$$ 40352 18270 12540 -15519 -1056 146527 181002 225854 210561 126823 144031 188128 238506
9623B38506J6098R5514j3132L7557P3481J86436J93149K90882N73141Q76736J410299
$$ 238506 254604 350118 336986 374543 448024 634460 827609 1118491 1691632 2568368 3978667
9612C978667J805566J231964k45223j164644j281338r16816p76962p23895m80061
$$ 3978667 5784233 7016197 6770974 5606330 4324992 3408176 2631214 1907319 1427258
9603A427258l06395k47497k07287j27308o4879j06462n2588m1958q1487r3661
$$ 1427258 1120863 873366 666079 538771 473892 367430 314842 272884 191397 97736
9593I7736k9397M6641K8243Q0174j6105m5512p1378J2877n115k861l783N260K5900
$$ 97736 68339 114980 143223 223397 207292 161780 90402 103279 98164 95303 91520 96780 122680
9580A22680l4133M5872P4488M1889L4334J2372j0927m0577m8493K152J5896j21272
$$ 122680 88547 134419 208907 250796 285130 297502 286575 245998 197505 199657 215553 94281
9568I4281j04566r773M7352k0297l3448n923Q611q7482K3031M2002N6086J6032
$$ 94281 -10285 -20058 27294 6997 -26451 -32374 -23763 -111245 -88214 -46212 9874 25906
9556B5906J1620j6981K5881J348P6054l4354o5739J4540L2001o7150n1420k1315
$$ 25906 37526 20545 46426 47774 123828 89474 23735 38275 70276 3126 -48294 -69609
9544f9609P069p755j9274N2341Q7335o394n0465Q227P3295P863J3147L3824l6497
$$ -69609 -62540 -70295 -89569 -37228 50107 43713 -6752 1475 74770 82633 95780 129604 93107
9531I3107N949J3821q3109j7270J2590j79151l7728J30859J04348m412r9938J6176
$$ 93107 99056 112877 29768 12498 25088 -154063 -191791 -60932 43416 39004 -60934 -44758
9519d4758P4160K2747k7645k2504J2459L6387k0778q6534j6384P0383O4762r0352
$$ -44758 29402 52149 24504 2000 14459 50846 30068 -56466 -72850 -2467 62295 -28057
9507b8057p7636O86O2330N8398O9948n1787q0263j56509o068P8967R5748K6924
$$ -28057 -105693 -105007 -42677 15721 85669 33882 -46381 -202890 -208958 -129991 -34243 -7319
9495g319k1070p8965j2379K5625n0556l0454Q5155J08008M3593j6312j8780m4618
$$ -7319 -28389 -107354 -119733 -94108 -144664 -175118 -89963 18045 61638 45326 26546 -18072
9483a8072n4791J6368k4864Q59Q4996K8554n4619n0476Q6727O832j0842O7594
$$ -18072 -72863 -56495 -81359 -80500 4496 33050 -21569 -72045 14682 21514 10672 78266
9471G8266K4474m9711K7285j3504J0431k2988j13582J9482J696R7113N2648n6778
$$ 78266 102740 53029 80314 66810 77241 54253 -59329 -39847 -38151 58962 111610 54832
9459E4832m8578o8632k4856J6548m5532M5355P23N3052J23075J3569J1976p2519
$$ 54832 6254 -62378 -87234 -70686 -116218 -70863 -70140 -17088 105987 119556 131532 59013
9447E9013L9430O074L3333o1004j6834k9444J4311l1167j6499J4053N2465J6224
$$ 59013 98443 104517 137850 76846 60012 30568 44879 13712 -2787 11266 63731 79955
9435G9955M2164m0372l9026Q172k9976L0142L6307P0253m8462m4783L4796M3812
$$ 79955 122119 81747 42721 50893 20917 51059 87366 157619 109157 64374 99170 142982
9423A42982k2221p7533m4586l20M1350n626m9880j9277M668k5731L4847P8135
$$ 142982 120761 43228 -1358 -1678 39672 34046 -15834 -35111 -30443 -56174 -21327 56808
9411E6808q790j05291k7259N0169J6909P513k5745o7148j0703j01296J4798R5516
$$ 56808 48018 -57273 -84532 -34363 -17454 -9941 -35686 -102834 -113537 -214833 -200035 -104519
9399a04519P5020N6214J7677J0485j0140j0074O733J17119p6982p5318L9398M1819
$$ -104519 -29499 26715 44392 54877 44737 34663 41396 158515 81533 6215 45613 87432
9387H7432o09m0047k9957k9133k0123l0029O309L0360k2729O8681M6079J8495
$$ 87432 86823 46776 16819 -12314 -32437 -62466 -56157 -25797 -48526 20155 66234 84729
9375H4729m3111j8324J7642K3192k5541p4917q3563N1625R1566j9465j3692j0706
$$ 84729 41618 23294 40936 64128 38587 -36330 -119893 -68268 23298 3833 -9859 -20565
9363b0565o4005R6620N2518L1597q5645k679P6415O0374L2921j24622n2438j8135
$$ -20565 -84570 12050 64568 96165 10520 7841 84256 144630 177551 52929 491 -17644
9351a7644R6899k2817K0758l4121K2090P7270k9394j4712K6071K1915M4135m9060
$$ -17644 79255 56438 77196 43075 65165 142435 113041 98329 124400 146315 190450 141390
9339A41390Q376j1213l5870n5346l7893N6984p593j0459n4067K8544o947N7070
$$ 141390 149766 138553 102683 47337 9444 66428 58835 48376 -5691 22853 15906 72976
9327G2976m162j06918P105o0961m1742L3301N5778P2536L3364q6109n7233o030
$$ 72976 68814 -38104 -30999 -91960 -133702 -100401 -44623 27913 61277 -24832 -82065 -88095
9315h8095L3978M5610m1912n2859N0033j0874L4256O7338l295L6661j0667p736
$$ -88095 -54117 -8507 -50419 -103278 -53245 -64119 -29863 37475 34180 70841 60174 52438
9303E2438J9279m2522j2735l4841J5547R346k3309L9188J4522L8062K0106p4117
$$ 52438 71717 29195 16460 -18381 -2834 6512 -16797 22391 36913 74975 95081 20964
9291B0964m059m0645j6782J4885Q7757J0609l3813M3269k6532n1920l6997K422
$$ 20964 16905 -23740 -40522 -25637 62120 72729 38916 82185 55653 3733 -33264 -30842
9279c0842n1793l9966K7811M9730L4507L8229k8364j2178L749J0942R2023R350
$$ -30842 -82635 -122601 -94790 -45060 -10553 27676 -688 -12866 -9117 1825 93848 103198
9267A03198o6207n4623j8226k8461M611k1177K9414M3755P5868j8110p2499o4799
$$ 103198 36991 -17632 -35858 -64319 -59708 -80885 -51471 -7716 68152 50042 -22457 -87256
9255h7256Q986R9697q793m0339l843k9635P5093Q6132m3406l6222J6162j9520
$$ -87256 -78270 21427 12634 -27705 -31548 -61183 13910 100042 56636 20414 36576 17056
9243A7056l2151K2934Q3781p1128m8445L8956N3489j31220q9121J2200J3428O0979
$$ 17056 -15095 7839 91620 20492 -27953 11003 64492 -66728 -155849 -143649 -130221 -69242
9231f9242K7275N0485M0458L0467o913J3391o2321l3053N4847P156k6904l7447
$$ -69242 -41967 8518 48976 79443 72530 85921 23600 -9453 45394 52550 25646 -11801
9219a1801L6908M898j8691m9153k4240R8276L73J099l4508p9273J8735P9739n2215
$$ -11801 25107 30005 11314 -37839 -62079 36197 36570 37669 3161 -76112 -57377 22362 -29853
9206b9853r619Q629J4197M9770M4032l7033J8615J9419Q384k5707j00954n5040
$$ -29853 -39472 -30843 -16646 33124 77156 40123 58738 78157 86541 60834 -40120 -95160
9194i5160J8869L4076J8450m401K2338k1332p79O2490l4482m420N7060K3879J5997
$$ -95160 -76291 -42215 -23765 -28166 -5828 -27160 -27939 34551 69 -4351 52709 76588 92585
9181I2585J1522m7094n1263j6120J7034K0399L1195o3155p7640l3390N4399P0482
$$ 92585 104107 57013 5750 -10370 6664 27063 58258 -4897 -82537 -115927 -61528 8954
9169H954n0656p4162k5782Q6154R7239j1686n2537j211n9396L7958M7884K0109
$$ 8954 -41702 -115864 -141646 -55492 41747 30061 -22476 -23687 -83083 -45125 2759 22868
9157B2868J06004J2754j50232K9330p062m4324l8371J10181N5233M7376r547n7611
$$ 22868 128872 141626 -8606 20724 13662 -30662 -69033 41148 96381 143757 134210 76599
9145G6599n2664l9521j3668N457k3507J3945K4173L7869K8355j476J798n8938
$$ 76599 23935 -15586 -29254 -23797 -47304 -33359 -9186 28683 57038 55562 57360 -1578
9133a578q0341L6401M2255P2942J4700N1267m400j3517L6957Q470q6555l7324
$$ -1578 -81919 -45518 -3263 69679 84379 135646 131246 117729 154686 163156 76601 39277
9121C9277J0630K9757M4107O941k3396n3044l6738L624m790O8067K8269k7844
$$ 39277 49907 79664 123771 130712 107316 54272 17534 21158 16368 84435 112704 84860
9109H4860n4607j7671N1223m5593j27370m3999L267M6352m0014P0449L7075o1402
$$ 84860 30253 12582 63805 18212 -109158 -153157 -149890 -103538 -143552 -73103 -36028 -97430
9097i7430K3232R2571N196o0847l9724J7421L4762l5910J24743M7405n5364J8569
$$ -97430 -74198 18373 23569 -37278 -77002 -59581 -24819 -60729 64014 111419 56055 74624
9085G4624m1442o9011j857N0308Q5289o5451n4440k216N276N3307M0617j09688
$$ 74624 33182 -35829 -37686 12622 97911 32460 -21980 -24196 -18920 34387 75004 -34684
9073c4684j45248n8784r008J17056P5031L6630m0597K3146L332K6155n833q4904
$$ -34684 -179932 -238716 -247724 -130668 -55637 -19007 -59604 -36458 -33126 -6971 -12804 -97708
9061i7708K4044k665m9335r1557L5867J06660k0503l1845O7325Q2134O4978l3438
$$ -97708 -73664 -76329 -125664 -217221 -181354 -74694 -95197 -127042 -59717 22417 87395 53957
9049E3957o8372L6984M9247l5865l9733O077J0191k1482r8239r936J43349O9558
$$ 53957 -14415 22569 71816 35951 -3782 2295 12486 -8996 -107235 -117171 26178 95736
9037I5736j238L0334J1229K0203J8819n4521o9486j7866o8339q6875l447J07503
$$ 95736 94498 124832 136061 156264 175083 120562 51076 33210 -35129 -122004 -125451 -17948
9025a7948l39p3605n9480M9085O3498K9238P259p7872P568q077J8967N2497l6999
$$ -17948 -18287 -91892 -151372 -102287 -38789 -9551 -2292 -80164 -72596 -80673 -61706 -9209 -46208
9012d6208n9930N2126L21j4022L4496O4791j06982N4381R5369k9850n3989k7025
$$ -46208 -106138 -54012 -53691 -67713 -33217 31574 -75408 -21027 74342 44492 -9497 -36522
9000c6522J328J6500L3671j801K6142J03603Q545j09834j69171r9692K4039O9208
$$ -36522 -35194 -18694 14977 13176 39318 142921 151466 41632 -127539 -227231 -203192 -133984
8988a33984J21254K8877k4878M2524K2100m9388l0609m8579r8635M730L3120J78
$$ -133984 -12730 16147 -8731 33793 55893 6505 -24104 -72683 -171318 -166588 -133468 -133290
8976a33290O7085K8879P532M9434N1071p7025r7480p6285M3767o499k2905J4927
$$ -133290 -66205 -37326 -29794 19640 70711 -6314 -103794 -180079 -136312 -142811 -165716 -150789
8964a50789J11563Q0078L4064K3976q8962J5027P8276P417j09205p861J0759n9650
$$ -150789 -39226 40852 74916 98892 9930 24957 103233 110650 1445 -6416 4343 -55307
8952e5307o1155l0982R5333J8659K3256J0099m980j9732l7017L3700j1973m877
$$ -55307 -116462 -147444 -52111 -33452 -10196 -97 -5077 -24809 -61826 -28126 -40099 -44976
8940d4976k8659k6175K5476L9203J04332O0853k5622o1434o6446k0149p4978j3940
$$ -44976 -73635 -99810 -74334 -35131 69201 130054 104432 42998 -23448 -43597 -118575 -132515
8928a32515J1259K0938k178K6991L9771m6652l7916j4697J5929J01761q030Q3188
$$ -132515 -121256 -100318 -102496 -75505 -35734 -82386 -120302 -134999 -119070 -17309 -25339 57849
8916E7849M1953m7101o9312l7840P4707N7751N0535M026j7237q8668j47070j8879
$$ 57849 99802 52701 -16611 -54451 20256 78007 128542 132568 115331 26663 -120407 -139286
8904a39286J03847M382k651J4820R2523J6004K1374n0036j6300k1715k0052j3905
$$ -139286 -35439 -31057 -33708 -18888 73635 89639 111013 60977 44677 22962 2910 -10995
8892a0995J1211N7499K1809k584l5470p6335J5825J07191m2977p2945j2773J1092
$$ -10995 216 57715 79524 76940 41470 -34865 -19040 88151 45174 -27771 -40544 -29452
8880b9452N8744J4365p6748j7084L9904M5118j2562N055L4021j3717L341k4684
$$ -29452 29292 43657 -33091 -50175 -10271 34847 22285 27340 61361 47644 50985 26301
8868B6301m1630N2710k2841l6983l332L2609O532R24l4746r253K7127N6665P3292
$$ 26301 -15329 37381 14540 -22443 -25775 6834 13366 14290 -20456 -29709 -2582 54083 127375
8855A27375p7106p4554n2686k5064J9388N3019J5884m5290k9813j8521m4379N561
$$ 127375 50269 -24285 -76971 -102035 -82647 -29628 -13744 -59034 -88847 -107368 -151747 -146186
8843a46186P4867N4592P0441J7753m7696p371N2286K0680n2102k2110L1259j8364
$$ -146186 -71319 -16727 53714 71467 23771 16400 68686 89366 37264 15154 46413 28049
8831B8049J822o5198k2861M4801Q0150L1749q6546n9694r5987l1354N8060J0287
$$ 28049 29871 -35327 -58188 -13387 66763 98512 11966 -47728 -143715 -175069 -117009 -106722
8819a06722K3602P2595P7441N2738k0883o9335Q786l208K297l2410o6315j6867
$$ -106722 -83120 -10525 66916 119654 98771 29436 38222 35014 37311 4901 -61414 -78281
8807g8281J35532L0191l5633K9558P261J0975j25054k9266K4651Q1178K8095k8407
$$ -78281 57251 87442 51809 81367 88628 99603 -25451 -54717 -30066 51112 79207 50800
8795E0800p84k9898l202K1160l025J7675k5189p8307K5002L3614L7404j0174j1843
$$ 50800 50016 20118 16916 38076 35051 52726 27537 -50770 -25768 7846 45250 35076 23233
8782B3233o9752L2083K5737l5615p1143k81O1295m9553K3539N5023K6506k0354
$$ 23233 -46519 -14436 11301 -24314 -95457 -95738 -34443 -83996 -60457 -5434 21072 718
8770G18M4876l4576j9644K7380O3145j8900k1056p0450l2204n2437J8776N3764
$$ 718 45594 11018 -8626 18754 81899 62999 41943 -28507 -60711 -113148 -94372 -40608
8758d0608Q5848R243n5301o167O7039l2097k3568j3670m482j7906P299O772K884
$$ -40608 45240 54483 -818 -6985 60054 27957 4389 -9281 -13763 -31669 -24370 -17598 -14714
8745a4714R0587J4475o4921l3575k7434R018K1668p5047m016J08536k3581j5303
$$ -14714 75873 90348 25427 -8148 -35582 -26564 -4896 -79943 -83959 24577 996 -14307
8733a4307M3800N324K2057j02873J4408M0130n164p9600L3363M9193N9515o0597
$$ -14307 29493 34817 56874 -45999 -31591 8539 3375 -76225 -42862 6331 65846 5249
8721E249k7508N8367L102J1034k1712k6072m9558n9112M996J4696J3672L8550
$$ 5249 -22259 36108 39210 50244 28532 2460 -47098 -106210 -101214 -86518 -72846 -34296
8709c4296M8197L8822l3092N7440K385l8485p0685j0605J9498K5250m5002J7757
$$ -34296 13901 52723 19631 77071 79456 40971 -29714 -40319 -20821 4429 -40573 -22816
8697b2816J08568p35J2365q1935l3448L5227N7146j2008o9409J6014J7515l8153
$$ -22816 85752 85017 97382 15447 -18001 17226 74372 62364 -7045 8969 26484 -11669
8685a1669n4444N792L1518k0654K3376J4483K2299L2050P1169l5511j25785p7872
$$ -11669 -66113 -60321 -28803 -49457 -26081 -11598 10701 42751 113920 78409 -47376 -125248
8673a25248o7807N3016J00380o9697j8006r947N4719O3365M3319K2441N6462l6313
$$ -125248 -193055 -140039 -39659 -109356 -127362 -137309 -82590 -19225 24094 46535 102997 66684
8661F6684L8826N8743J2238N758m2284r1899p6979J1011k5032k8523N92R603J3197
$$ 66684 105510 164253 176491 182249 139965 48066 -28913 -17902 -42934 -71457 -70865 -61262 -48065
8648d8065J7047O1623N451j6868q642L2059P859J4460l2603j8209l0435L462L154
$$ -48065 -31018 30605 36056 19188 10546 42605 50464 64924 32321 14112 -16323 -12861 -9707
8635i707l9517n5116K8568K6390L4826m2960M9397M3476r508j1754k4766Q1689
$$ -9707 -49224 -104340 -75772 -49382 -14556 -57516 -8119 35357 25849 14095 -10671 71018
8623G1018n5378m189R5001o490P377J7493n8111j9661J0672j00316q228N4548
$$ 71018 15640 11451 106452 99962 107339 124832 66721 47060 57732 -42584 -50812 3736
8611C736j6977q4879P3J47294k3426l6249j6357m509p051J3814J6632j7625M3038
$$ 3736 -13241 -98120 -98047 49247 25821 -10428 -26785 -31294 -38345 -24531 -7899 -25524 17514
8598A7514l7182l6250P4728K0108R89M6018j6183n9883k0490p9J6645P5624M4724
$$ 17514 -19668 -55918 18810 38918 39907 85925 69742 9859 -10631 -10710 5935 81559 126283
8585A26283l189N7250l9294m3666j026M2324N021J0821N8111N4818m3296p0419
$$ 126283 123094 180344 141050 97384 96358 138682 143703 154524 212635 267453 224157 153738
8573A53738p8022J7152J6707j2866o2398o0749K9381P0915M5648R718p3626j37158
$$ 153738 75716 92868 109575 96709 34311 -26438 2943 73858 119506 129224 55598 -81560
8561h1560K4732O9702Q1761j8032m8636K8027O555K15q6552O094M7437J8927p735
$$ -81560 -56828 12874 94635 76603 27967 55994 62549 62764 -23788 -17694 29743 48670 40935
8548D0935j5591L7971m388k6292j6504m6500K1696P4721m9997r68k2683m5753
$$ 40935 25344 63315 58927 32635 16131 -30369 -8673 66048 16051 15083 -7600 -53353
8536e3353j8331O6301K2909j13040r741P296K6178J2162k9717K5431J4229l3943
$$ -53353 -71684 -5383 17526 -95514 -105255 -97959 -71781 -59619 -89336 -63905 -49676 -83619
8524h3619l8259P549Q3159q610j08472Q7786J93003L3149p5722k4684M2636j7934
$$ -83619 -121878 -114329 -31170 -39780 -148252 -60466 132537 165686 89964 65280 107916 89982
8512H9982j6997J5073j6184j3921J614L7187n2522n4371J2328Q396N0417O8324
$$ 89982 72985 88058 71874 57953 59567 96754 44232 -10139 2189 10585 61002 129326
8500A29326p1773K900O8578n5905q0746o7804k4293R033O5577P0354K7832n58
$$ 129326 57553 60453 129031 73126 -7620 -75424 -99717 -90684 -25107 45247 73079 72521
8488G2521p4839O083L7810o7781k444L4825J2248K3015N4784j0211k2429M828
$$ 72521 -2318 3765 41575 -26206 -28650 6175 18423 41438 96222 86011 63582 68410
8476F8410k3575P121L3391J1336J7648k2153o2596j4419k6777Q995Q9341N6301
$$ 68410 44835 51956 85347 96683 114331 92178 29582 15163 -11614 -2619 86722 143023
8464A43023r477l6095J0203L0176p0n8179l0612m4606L2674O3850P1748o213n4453
$$ 143023 133546 97451 107654 137830 137760 79581 48969 4363 37037 100887 172635 166422 111969
8451A11969J7610n2921p5699Q153L2655P1586k458l6542m7577O8018K7283P1485
$$ 111969 129579 76658 959 9112 41767 113353 110895 74353 26776 94794 122077 193562
8439A93562P7690M5342k0765o4544j19284n496K5377l9935L2714L2325j2419j25727
$$ 193562 271252 316594 295829 231285 112001 106505 131882 91947 124661 156986 144567 18840
8427A8840p4740o1718K0820K0620J6652j8990k3258q091N3398M0186L4120r7005
$$ 18840 -55900 -117618 -96798 -76178 -59526 -78516 -101774 -109865 -56467 -16281 17839 -79166
8415g9166p0992P788K4802Q2904j2076J4461J4876n7936M123j69j5675J0217n4065
$$ -79166 -150158 -142370 -117568 -34664 -46740 -32279 -17403 -75339 -71216 -71385 -87060 -76843 -130908
8402a30908n1424K8293L2645N9868K5242M4421L4758l1940r3919q965J5856R783
$$ -130908 -182332 -154039 -121394 -61526 -36284 8137 42895 10955 -82964 -91929 -76073 -66290
8390f6290L1554O9843n140l7752M5781M3752L690p3852q4824L5041L0212m2821
$$ -66290 -34736 35107 29967 -7785 37996 81748 85438 11586 -73238 -38197 -7985 -50806
8378e0806q595M1443k0078k7807k7404p5442M7666J41134R0161O2155m3964o7404
$$ -50806 -59401 -17958 -38036 -65843 -93247 -168689 -121023 20111 110272 172427 128463 61059
8366F1059M887M4248m617j6523r901m9383n3961j4268L9420Q4249Q0451q7475
$$ 61059 65946 110194 105577 89054 79153 29770 -24191 -38459 961 85210 165661 78186
8354G8186q2522n8377J6183J2608l2890M8687m1391l3435M1292j4670l3529O5312
$$ 78186 -4336 -62713 -46530 -33922 -66812 -18125 -59516 -92951 -51659 -66329 -99858 -34546
8342c4546L4142j9933m19M1812j3413K2901o3634M5533N6390r06N7358n0199n4585
$$ -34546 -404 -20337 -20756 21056 7643 30544 -33090 12443 68833 67927 125285 75086 20501
8329B0501m5406J136J2228L7896l7553N545Q2724J00366j6755o2763r1834J736
$$ 20501 -24905 -23769 -11541 26355 -11198 -5653 77071 177437 160682 97919 6085 7821
8317G821J9397N8129j8291p5513k2212M5541j7723k2656Q4457K2734j21672o0773
$$ 7821 27218 85347 67056 -8457 -30669 14872 -2851 -25507 58950 81684 -39988 -100761
8305a00761Q6724J0419r177N5990N0482P8955R3470L0213k4798m2402l5530l01
$$ -100761 -14037 -3618 -12795 43195 93677 172632 266102 296315 271517 229115 193585 193284
8293A93284p878J40599J73136L21951K74471j5197k32778j78277q5771j17245
$$ 193284 185406 326005 499141 821092 1095563 1080366 847588 669311 583540 466295
8283D66295n9053Q033j00087j71912l6517j5275l3253L4815M0630q7929j8165
$$ 466295 407242 415275 315188 143276 106759 91484 58231 93046 133676 45747 27582
8272B7582J17495P6949o9653L5488n056o7909O933l5570l4039m9115k8135l3637
$$ 27582 145077 222026 152373 187861 182805 114896 121829 86259 52220 3105 -25030 -58667
8260e8667O6170J21350p9652j4127J37223J31083J15806Q5831K03866K80149J27925
$$ -58667 7503 128853 49201 35074 172297 303380 419186 505017 708883 989032 1116957
8249A116957j41712l23340k82056p5808m4725j12854r1400M3081O171l1612l9575
$$ 1116957 975245 651905 369849 294041 249316 136462 45062 88143 94314 62702 23127
8238B3127M8452j2212N9313L6816m3131j2476J01152m0929l9937j9979k3465J7527
$$ 23127 71579 59367 118680 155496 112365 99889 201041 160112 120175 100196 76731 94258
8226I4258k023r0602j4706N643k0499n971o0013J7236J3673J8557K0856M900L0149
$$ 94258 92235 1633 -13073 -7430 -27929 -33900 -93913 -76677 -63004 -44447 -23591 -18691 11458
8213A1458P6125K6785p5682n5016J8866J2103j9813j4852O065j8567j0929J1447
$$ 11458 87583 114368 38686 -16330 2536 14639 -5174 -20026 -13961 -32528 -43457 -32010
8201c2010M0036n8504p1495L6485l8771M4901R9964K8548o4675l6562O4513o8925
$$ -32010 8026 -50478 -121973 -85488 -124259 -79358 20606 49154 -15521 -52083 12430 -56495
8189e6495k0125J29511j685n8539J3279J0701p2656o5763R4495R7517P96k7987
$$ -56495 -76620 52891 51206 -7333 5946 16647 -56009 -121772 -27277 70240 71036 43049
8177D3049j4427j8563K5360O7133M5074j44747q7118n3592N5176O3117L9913m2116
$$ 43049 28622 10059 35419 102552 147626 2879 -84239 -137831 -82655 -19538 20375 -21741
8165b1741l3028Q333K2839j1127L0813J3591r9027j4478O9940P3973K2882O050
$$ -21741 -54769 -46436 -23597 -34724 -3911 9680 -89347 -103825 -33885 40088 62970 69020
8153F9020q9404L8961K9309p2913j7843n6355l7365N2681l3342J4050L1556P499
$$ 69020 -20384 18577 47886 -25027 -42870 -99225 -136590 -83909 -117251 -103201 -71645 -64146
8141f4146K236L4863J7832r707j9006k2854N8076P8721k4178r895K1011n7409
$$ -64146 -61910 -27047 -9215 -18922 -37928 -60782 -2706 76015 51837 41942 62953 5544
8129E544M5124P2689l0001q740J7359O6315m6684j31607J8136J5334l877J8931
$$ 5544 50668 123357 93356 84616 101975 168290 121606 -10001 8135 23469 19592 38523
8117C8523j7820q3245L6658n0952o7956k4067J8990J09371m5799j9849P9576K8972
$$ 38523 20703 -62542 -25884 -76836 -144792 -168859 -149869 -40498 -86297 -106146 -26570 2402
8105B402k8163j8849J879K0480j5828q3602n1461L4424j8278L0857N3740N306
$$ 2402 -25761 -44610 -42731 -22251 -38079 -121681 -173142 -138718 -156996 -126139 -72399 -67093
8093f7093q8969M1664J140k0803O1775K2634j8015J7798k5249m803Q5136L9048
$$ -67093 -156062 -114398 -113258 -134061 -72286 -49652 -67667 -49869 -75118 -79921 5215 44263
8081D4263n271q265k4780m3484l4279o82o0858l7315P6558N7653N3413o0346n3593
$$ 44263 38992 30727 5947 -37537 -71816 -72498 -133356 -170671 -94113 -36460 16953 -43393 -96986
8068i6986O1053n913L8090Q5735l2610r6164j3243O3701J1900m7135n6698J0788
$$ -96986 -35933 -41846 -3756 81979 49369 -46795 -60038 3663 15563 -31572 -88270 -77482
8056g7482R6660R1509J9830K6345K8996P7992k6472j53821p9092k6374n5993k236
$$ -77482 19178 110687 130517 156862 185858 263850 237378 83557 4465 -21909 -77902 -80138
8044h0138O768j5470R219j6358J2000J6651M7183N066k2089N6652P7202K5837
$$ -80138 -73370 -88840 -79621 -95979 -83979 -67328 -20145 -15079 -37168 19484 96686 122523
8032A22523m0699j42600q0479K29M9364P7593J9195j7068o0969O7554L4638j1457
$$ 122523 81824 -60776 -141255 -141026 -91662 -14069 5126 -11942 -72911 -5357 29281 17824
8020A7824j6340o7637O4985j1202M4127n306p2471o9551k6894J08101J826j9686
$$ 17824 1484 -66153 -1168 -12370 31757 26451 -46020 -115571 -142465 -34364 -32538 -52224
8008e2224o3448L6990J02759J7317K1482m9262J06135L7946n8485j07838m8083
$$ -52224 -115672 -78682 24077 41394 62876 13614 119749 157695 99210 -8628 -56711
7997e6711j9104J5554J7304J04276r055O0831J5969q8220N7393J0996J2586M2857
$$ -56711 -75815 -60261 -42957 61319 52264 113095 129064 40844 98237 109233 121819 164676
7985A64676j3744n896m1168l5628q1221o8691J9217J08728P269J3724J0150M8148
$$ 164676 150932 145036 103868 68240 -12981 -81672 -62455 46273 53542 67266 77416 125564
7973A25564n9868l1436l3609l9352n1077o4776m0179R1985J15778M6209j8031
$$ 125564 65696 34260 651 -38701 -89778 -154554 -194733 -102748 13030 59239 41208
7962D1208m1863m4192J3983J2521O3885j179O5340M6091n7312j02818k0870M667
$$ 41208 -655 -44847 -30864 -18343 45542 44363 109703 155794 98482 -4336 -25206 -20539
7950b0539R2809K7199p46m1382m605O4824K8923O7393K3727p6454k0733j14325
$$ -20539 72270 99469 98723 57341 52736 117560 146483 213876 237603 161149 140416 26091
7938B6091k9589M6680j2211m7793K9199m9102k4078L7673K3619N0o3068m1333
$$ 26091 -3498 43182 30971 -16822 12377 -36725 -60803 -23130 489 539 -62529 -103862
7926a03862l2570j5731J8694O2484R5434J1678J760k3179j8166l5155N9461J8230
$$ -103862 -136432 -152163 -133469 -70985 24449 36127 37887 14708 -3458 -38613 20848 39078
7914C9078N7728J3862j03493o3930L9497K9896p0841m108l249N857K4595M9784
$$ 39078 96806 110668 7175 -56755 -17258 12638 -58203 -62311 -65560 -59703 -35108 14676
7902A4676J0335O0327K7233q1704m4460p5273M5740N8651Q093l2470l3600p7723
$$ 14676 25011 85338 112571 30867 -13593 -88866 -43126 15525 23618 -8852 -42452 -120175
7890a20175L6451j7092k4505N5811j712P7835J9250o4158J6319M0766q7631o7911
$$ -120175 -83724 -100816 -125321 -69510 -71222 6613 25863 -38295 -21976 18790 -68841 -136752
7878a36752J7245L2301P1020J05398N9828N5772n9699k3332L8806l6526q7003
$$ -136752 -119507 -87206 -16186 89212 149040 204812 145113 121781 160587 124061 37058
7867C7058l8877n4497k3392j5404R4017P6826k9360p415J5309o7624n9731m0086
$$ 37058 -1819 -56316 -79708 -95112 -1095 75731 46371 38956 54265 -13359 -73090 -113176
7855a13176P9902J16663N4491k5559k1764j7363j6164m90q376K1674K895k3406
$$ -113176 -33274 83389 137880 112321 90557 73194 57030 56540 48164 69838 72733 49327
7843D9327k4776J3007P143O6168L1115n5375o8023n4372j0257L3094J7317O7278
$$ 49327 24551 37558 44701 110869 141984 86609 18586 -35786 -46043 -12949 4368 71646
7831G1646n9999m9498J06852K3860j1453k7179r876k3295k2934k1301p7371j01495
$$ 71646 11647 -37851 69001 92861 81408 54229 44353 21058 -1876 -23177 -100548 -202043
7819b02043Q4819P7262L958o744L8763r28J0233L3476r32j11760o7233Q2789J05348
$$ -202043 -117224 -39962 -36004 -42748 -3985 -4913 5320 38796 37864 -73896 -141129 -58340 47008
7806D7008o6676k9916O7980L6940L3499j23102j7992K3470m7643r7704j1482J22917
$$ 47008 -19668 -49584 18396 55336 88835 -34267 -52259 -28789 -76432 -174136 -185618 -62701
7794f2701K6242O732n2158J3023P8531R45j500M4798n656J2344l0680J452K1852
$$ -62701 -36459 -29727 -81885 -68862 9669 10614 9114 53912 48256 60600 29920 31372 53224
7781E3224N84K7913o0870j02459O3233q833p0739m4177J8308j4016L124J11711
$$ 53224 53808 81721 20851 -81608 -18375 -27208 -97947 -142124 -123816 -137832 -134708 -22997
7769b2997P787k4431j1296n1283L3880Q9462k6486r44K2278J322m7382l4543l8739
$$ -22997 -15210 -39641 -50937 -102220 -68340 21122 -5364 -6308 15970 17292 -30090 -64633 -103372
7756a03372Q9031O4337k4202j18451R788O2687m2522J629J2914j4890q616o0291
$$ -103372 -14341 49996 25794 -92657 -82869 -20182 -62704 -61075 -48161 -63051 -71667 -131958
7744a31958P6323J2046K9249J2566n1572n6830M0993R385o4943k927L1304L6295
$$ -131958 -55635 -43589 -14340 -1774 -53346 -110176 -69183 -59798 -124741 -127668 -96364 -60069
7732f0069j7695l9341k271l1921o868P1059j8866m9515q5009j46J08931P676j9008
$$ -60069 -77764 -117105 -119376 -151297 -158165 -87106 -105972 -155487 -240496 -240642 -131711 -124035 -143043
7719a43043L4654P8339J21170M1488o9666l3986k7715R020N209k2501M9197J3512
$$ -143043 -108389 -30050 91120 132608 62942 28956 1241 10261 15470 -7031 42166 55678
7707E5678p680n3106K5695J03778j05637j24399P2570M2804N030L4580N7731p256
$$ 55678 47998 -5108 20587 124365 18728 -105671 -33101 9703 14733 49313 107044 99788
7695I9788n0214n1452K1528k3310J5474l9930k3962N8592K741p8559M866k6874
$$ 99788 49574 -1878 19650 -3660 11814 -28116 -52078 6514 9255 -69304 -64438 -91312
7683i1312J3049m5805K4884R8513r852m4612M8577K161j0214n9355L1036M7891
$$ -91312 -78263 -124068 -99184 -671 -10523 -55135 -6558 -4397 -14611 -73966 -42930 4961
7671D961L6512m163M0027o3008J3093R6537M195p1784p0297j3045l8685k8853
$$ 4961 41473 37310 77337 14329 27422 123959 128154 56370 -13927 -26972 -65657 -94510
7659i4510j5261m2475k4846P286L4631Q7057M7331K9971o7120N0194j0707M4832
$$ -94510 -109771 -152246 -177092 -169806 -135175 -48118 -787 29184 -37936 12258 1551 46383
7647D6383K6877L0082l6461j6610J6602p402Q26M0925K4746p497j19132Q187l397
$$ 46383 73260 103342 66881 50271 66873 59471 60297 101222 125968 118471 -661 7526 4129
7634D129j4696O3594m6100o8316j9376L2505M8433O9212N2169j0329k738j2508
$$ 4129 -10567 53027 6927 -61389 -80765 -48260 173 69385 121554 111225 108487 95979
7622I5979k5930m1989k7426n3691m777j3511N1067N892j6231j315J4360M4233
$$ 95979 70049 28060 634 -53057 -57834 -71345 -20278 -14386 -30617 -31932 -17572 26661
7610B6661n100m0116R1304K4094j9446m5888k5195J01546O979k7469j10321R315
$$ 26661 21561 -18555 72749 96843 77397 31509 6314 107860 114839 87370 -22951 -13636
7598a3636o0058J859k0849J721J21349j3927l2884k355j683M9879Q8924j3708
$$ -13636 -73694 -71835 -92684 -90963 30386 16459 -16425 -18780 -20463 29416 118340 104632
7586A04632j15810L8729k4055j8093N628q709M4469j7933Q2844M035m3225N4411
$$ 104632 -11178 27551 3496 -14597 -8969 -17678 26791 8858 91702 95737 52512 106923
7574A06923j4208j36094j19875N4258Q2025P6975n7474m3613J5320N7964O4255
$$ 106923 92715 -43379 -163254 -108996 -26971 50004 -7470 -51083 -35763 22201 86456
7563H6456p1087o0136o985r5910k4766L8502k282N5728J23001O3161l3981k6906
$$ 86456 15369 -44767 -51752 -147662 -172428 -133926 -136208 -80480 42521 105682 71701 44795
7551D4795P9808J8905j7225l6895n3864o3140p338j5000R6300j1892r0386n5248
$$ 44795 124603 143508 126283 89388 35524 -27616 -34954 -49954 46346 34454 -55932 -111180
7539a11180p088M2468P3740L981j7067R1192l3281l7945Q1389m5597p3128N8215
$$ -111180 -118268 -75800 -2060 1921 -15146 76046 42765 4820 86209 40612 -32516 25699
7527B5699l6292J512N2337L9895K7909q376m1244o103j33192n1588R9086J11204
$$ 25699 -10593 -9081 43256 83151 111060 102684 61440 55337 -77855 -129443 -30357 80847
7515H0847j1360q1554M3731R7943j10081o2978K5112j055M8970J09145j7366l3023
$$ 80847 69487 -12067 31664 129607 19526 -43452 -18340 -19395 29575 138720 121354 88331
7503H8331o0314l2093O7324j0323J4549j8981n8240L7368O6717n9777o4390j1624
$$ 88331 28017 -4076 63248 52925 67474 48493 -9747 27621 94338 34561 -29829 -41453
7491d1453k6601j0457p7074M0007M8084M8108L0452m3279r0065Q8898Q0908p6192
$$ -41453 -68054 -78511 -155585 -115578 -67494 -19386 11066 -32213 -122278 -33380 47528 -28664
7479b8664m6543m105K4521R917K6396n4277k2854N4274R3374q21j0313k0578J0173
$$ -28664 -75207 -79312 -54791 -44874 -18478 -72755 -95609 -41335 52039 51218 40905 20327 30500
7466C0500L8780m366l9112m6337l7564L0553m6500K1280m667M5878J01557j8839
$$ 30500 69280 64914 25802 -20535 -58099 -27546 -74046 -52766 -57433 -11555 90002 71163
7454G1163o9896m3186L49J608N1388J4740p5966j06140N5252N935M2438n0415
$$ 71163 1267 -41919 -41570 -39962 11426 26166 -49800 -155940 -100688 -94753 -52315 -102730
7442a02730p141l1495j11032P7459P6314R0876K5982m7116j1390L8726L4387O370
$$ -102730 -109871 -141366 -252398 -174939 -98625 -7749 18233 -28883 -40273 -1547 32840 39210
7430C9210j5861k7973N3405P9130N7222M1786l1596m4699j33575l6819J04742
$$ 39210 23349 -4624 48781 127911 185133 226919 195323 150624 17049 -19770 84972
7419H4972n224m6461m2822q75J6502q361l3827k1406l7891L9204m554p0361r3401
$$ 84972 79748 33287 -9535 -10410 6092 -2269 -36096 -57502 -95393 -56189 -60743 -131104 -224505
7406b24505M5306J02731k6746L7482J4242j2740p441k1498O6275J05364M7051
$$ -224505 -179199 -76468 -103214 -65732 -51490 -64230 -71671 -93169 -26894 78470 125521
7395A25521J4234m4177k9847l7856m3083N396Q9666j6901o294j15215r4228R7532
$$ 125521 139755 95578 65731 27875 -15208 -9812 79854 62953 56659 -58556 -152784 -55252
7383e5252J41959q9361q0951Q5441K9651j2807k142N7154L3166r356L3331r3211
$$ -55252 86707 -2654 -83605 1836 31487 18680 16538 73692 106858 97502 130833 37622
7371C7622k2132J1990k4997p7725l5753k92P5676N0690L8832J02699j4811P124
$$ 37622 15490 27480 2483 -75242 -110995 -111287 -35611 15079 53911 156610 141799 148923
7359A48923p7003r7142J237M692j427O3915P001l2441q836j0617k886Q9553l3472
$$ 148923 71920 -25222 -23985 -19293 -20720 43195 50196 17755 8919 -1698 -4584 84969 51497
7346E1497n1180n3681m9709l780Q2623J4531N421j6939O2637M1324J9252k6334
$$ 51497 317 -53364 -103073 -106853 -24230 -9699 -4278 -21217 41420 82744 101996 75662
7334G5662O0499J2621o9608p146m1337j26260K2127P9483N5190l311L3387L0325
$$ 75662 136161 148782 79174 72028 30691 -95569 -73442 6041 61231 57920 91307 121632
7322A21632J9539K9274o0875o5937j20439n7200J2616m2954O3813L5778n5482
$$ 121632 141171 170445 109570 43633 -76806 -134006 -121390 -164344 -100531 -64753 -120235
7311a20235J184P0522L8427k2211j5951j3886N5508k7833K0795j2198M746n6641
$$ -120235 -119051 -48529 -10102 -32313 -48264 -62150 -6642 -34475 -13680 -25878 -21132 -77773
7299g7773l8544R341Q608N8375K9044p624L0806L0438o557k5232r560P378l8632
$$ -77773 -116317 -106976 -98368 -39993 -10949 -18573 12233 42671 36114 10882 1322 8700 -29932
7286b9932N2128m0303p7021l6989o3217k3411O4706o0571L261O3200Q8706P036
$$ -29932 22196 -18107 -95128 -132117 -195334 -218745 -154039 -214610 -211349 -148149 -59443 -52407
7274e2407K5835P4017p8267p6991l9856k484P880q097r41L9444O038K8453N354
$$ -52407 -26572 47445 -30822 -107813 -147669 -150153 -142273 -150370 -151311 -111867 -105829 -77376 -72022
7261g2022o754p4261m5140n0444R0113P9152L9270j8233k9841j3265q249K2852
$$ -72022 -78776 -153037 -198177 -248621 -158508 -79356 -40086 -58319 -88160 -101425 -109674 -86822
7249h6822L8964j629L0778R594j9086k8056J5689p0350J4515K6507j3845j02331
$$ -86822 -47858 -49487 -18709 -9115 -28201 -56257 -40568 -110918 -96403 -69896 -83741 -186072
7237a86072J2134J4131L9897P2391P5852N3238K1997N2747O210m7307n3584L4460
$$ -186072 -173938 -159807 -119910 -47519 28333 81571 103568 156315 162525 115218 61634 96094
7225I6094q752P0523N8320n9551r3736n5659n556J6679L2191m4487K4331Q779
$$ 96094 87342 157865 216185 156634 62898 7239 1683 18362 50553 6066 30397 39176
7213C9176K0678M473j6934P5014j0624q6207M0830K1383o9961l3273M166M3247
$$ 39176 59854 64327 47393 122407 111783 25576 66406 87789 17828 -15445 -11279 31968
7201C1968P6707k8789l9186J5095L814m9050m5162p8255K3921J19900K9972k8114
$$ 31968 108675 79886 40700 55795 59609 10559 -34603 -112858 -88937 30963 60935 32821
7189C2821j8232j02974L2267J7480L2243l9922j7294n4791J8768M5990l4615N7961
$$ 32821 14589 -88385 -56118 -38638 -6395 -46317 -63611 -118402 -99634 -53644 -88259 -30298
7177c0298O4774L4297k6696p5159j9581M8799R6944q6144p4618k8089O464M8329
$$ -30298 34476 68773 42077 -33082 -52663 -3864 93080 6936 -67682 -95771 -89307 -40978
7165d0978q185P992L8491J9750N544k8928M2928J8092q7919n281q189P5981J12017
$$ -40978 -49163 -41171 -2680 17070 22614 -6314 36614 54706 -33213 -38494 -46683 29298 141315
7152A41315J9931j36378q9321N648P3834m4718o005j4670K8182j1686O941k3955
$$ 141315 161246 24868 -64453 -58805 15029 -29689 -35694 -50364 -22182 -33868 -26927 -50882
7140e0882L717o2830l060O8270L5241O2885p988m862j09941r8265M0010K3778
$$ -50882 -47165 -109995 -113055 -44785 -9544 53341 45353 40491 -69450 -167715 -127705 -103927
7128a03927k6251N0811l3011k190R6851N7190K1904k0432j1808O3598j5914k1604
$$ -103927 -130178 -79367 -112378 -114568 -17717 39473 61377 40945 29137 92735 76821 55217
7116E5217k7357r0126k2666P2M1898J3288K0407o5546L8187M9098M3398L4554
$$ 55217 27860 -62266 -84932 -84860 -42962 -29674 -9267 -74813 -36626 12472 55870 90424
7104I0424m0594J9736k2769k8869j4062m1833j6496m0851l948p006n4007L8310
$$ 90424 49830 69566 46797 17928 3866 -37967 -54463 -95314 -99262 -106268 -160275 -121965
7092a21965L2357N1891j5635m3526J4189M8334M448n7748l6093l6234J3887K7208
$$ -121965 -89608 -37717 -53352 -96878 -82689 -34355 -29907 -87655 -123748 -159982 -146095 -118887
7080a18887n1477o468K8315P2714M4630k4074j2159m3923J5690P4627K3008P8969
$$ -118887 -170364 -176832 -148517 -75803 -31173 -55247 -67406 -111329 -95639 -21012 1996 80965
7068H0965l8324n9594o5443j184J24874L7010j05883o3161L5186J8151n938k9843
$$ 80965 42641 -16953 -82396 -83580 41294 78304 -27579 -90740 -55554 -37403 -43341 -73184
7056g3184Q874K5118P4187R872j34923P8289L1693n2411k3583l6992j7442Q1948
$$ -73184 -64310 -39192 34995 44867 -90056 -11767 19926 -32485 -56068 -93060 -110502 -28554
7044b8554o884N282L9513n3898L0286j3297K6918l5450J7653J3870k8580n1647
$$ -28554 -35438 -30156 9357 -44541 -14255 -27552 -634 -36084 -18431 -4561 -33141 -84788
7032h4788J5925M9932Q1513M133m5143J5266J13641M8996p0710P374k3733j3720
$$ -84788 -68863 -18931 62582 66715 21572 36838 150479 199475 128765 136139 112406 98686
7020I8686J9597o2917o5089k6488L9703R3851o8314p9656J4893o18p0912l9745
$$ 98686 118283 55366 -9723 -36211 3492 97343 29029 -50627 -35734 -36352 -107264 -147009
7008a47009j7067J7381M4816k1248N6921P837l3847j6505O6988L4933L7821K5022
$$ -147009 -164076 -146695 -101879 -123127 -66206 -58369 -92216 -108721 -41733 -6800 31021 56043
6996E6043N423q3889j3935N6892j1209n5394n1586J326N2344Q3800l2708O8690
$$ 56043 61466 -22423 -36358 20534 9325 -46069 -97655 -96329 -43985 39815 7107 75797
6984G5797k2122j2804k1209N883j0103q3946p206M852N944n786k5145K646P1762
$$ 75797 53675 40871 19662 25545 15442 -68504 -75710 -70858 -64914 -70700 -95845 -93199 -21437
6971b1437J16696M624q4931k4778K0185l1002r9014R2340k9085l0084m1778P8907
$$ -21437 95259 99883 14952 -9826 10359 -20643 -119657 -27317 -56402 -86486 -128264 -49357
6959d9357L8629M8863O276l54n2961k6128O9779K7282n4008n4101N497K6839j3984
$$ -49357 -10728 38135 44411 44057 -8904 -35032 34747 62029 8021 -46080 -40583 -13744 -27728
6946b7728N6938o2483l6873K841Q9165Q6266o5083p0402J9544P6592P034p4269
$$ -27728 29210 -33273 -70146 -67305 21860 108126 43043 -27359 -7815 68777 75811 1542
6934A542j4514n647k9586l2531K3502j3902l0730l8055N5565O5620j0152J5984
$$ 1542 -12972 -18619 -48205 -80736 -57234 -71136 -101866 -139921 -84356 -18736 -28888 -12904
6922a2904O3041m5685l3239M0405j9337l0504M0215K0185n9870M624O4484j3631
$$ -12904 50137 4452 -28787 11618 -7719 -38223 1992 22177 -37693 -33069 31415 17784
6910A7784n7523o4740p1406M8358O0786P26N6494L5030o1646O5741O5182j12710
$$ 17784 -39739 -104479 -175885 -127527 -66741 -66015 -9521 25509 -36137 29604 94786 -17924
6898a7924j19476j4431J02563j5142o9569m7150J7066Q5229Q398j1255P9257k6649
$$ -17924 -137400 -151831 -49268 -64410 -133979 -181129 -164063 -78834 -70436 -81691 -2434 -29083
6886b9083M3294J8986l1033p2029j1885K355k4938O2510Q0193J6130k8362p1476
$$ -29083 14211 33197 2164 -69865 -81750 -79395 -104333 -41823 38370 54500 26138 -45338
6874d5338o9853l1700K4663J20252K4835l5603k2071K4744k9675O6219l3865K9236
$$ -45338 -115191 -146891 -122228 -1976 22859 -12744 -34815 -10071 -39746 26473 -7392 21844
6862B1844n0924l4544k3645m9954L0198P7931R5291M3331J1403n0529j9073l0411
$$ 21844 -29080 -63624 -87269 -137223 -107025 -29094 66197 109528 120931 70402 51329 20918
6850B0918k5295M1275j305L2987L0619p5237n8327j8259N8457M8060l4241o7242
$$ 20918 -4377 36898 35593 68580 99199 23962 -34365 -52624 5833 53893 19652 -47590
6838d7590M0214Q9762P435m9799J4888R036O2939l7623l4868N0154K7818Q970
$$ -47590 -7376 82386 89821 40022 54910 63946 126885 89262 54394 104548 132366 141336
6826A41336n1793n0071n6541r811k8791m3657j4036K2669N0933j0596l9085P5677
$$ 141336 89543 39472 -17069 -26880 -55671 -99328 -113364 -90695 -39762 -50358 -89443 -13766
6814a3766J1663l7922K7686J27542N1190K8490r3390l7821n8676q9233Q031J9073
$$ -13766 -2103 -40025 -12339 115203 166393 194883 101493 63672 4996 -84237 -76206 -57133
6802e7133J9689k4738r7648J08954M6522j7352J11070M6002j1731l0549l5316
$$ -57133 -37444 -62182 -159830 -50876 -4354 -21706 89364 135366 123635 93086 57770
6791E7770l5599j1351N4125l0838n5426n400J4116K8536K2916k8137Q081M4848
$$ 57770 22171 10820 64945 34107 -21319 -26719 -12603 15933 38849 10712 18793 63641
6779F3641k4951l4011K5585J44357N0541r9868p7795K2752j6526l6834o2518m8108
$$ 63641 38690 4679 30264 174621 225162 125294 47499 70251 53725 16891 -45627 -93735
6767i3735J0617l1305Q16J03327M8269k8054k8825M8847Q0664j4107q3381m306
$$ -93735 -83118 -114423 -113607 -10280 37989 9935 -18890 29957 110621 96514 13133 8827
6755H827m35J513k4101J1396J3161p5882J4625J9009J4003L1215p16M6398n2660
$$ 8827 8392 9905 -14196 -2800 10361 -65521 -50896 -31887 -17884 13331 12615 59013 6353
6742F353m3458k5130P122J3577j968r3016L1795M2357K7407k6369N0326j7501
$$ 6353 -37105 -62235 -55113 -41536 -43504 -136520 -104725 -62368 -34961 -61330 -11004 -28505
6730b8505q6527K344P1888P3439M5163n8640m4890j2806m774N1079q287n0478
$$ -28505 -115032 -112688 -40800 32639 77802 19162 -25728 -38534 -43308 7771 -516 -50994
6718e0994l7170k4552L0555Q775K2595p5892n939M2158K2855P560L3956l1247
$$ -50994 -88164 -112716 -82161 -73386 -50791 -126683 -132622 -90464 -67609 -60049 -26093 -57340
6706e7340m8526m224J1228J8788R619Q8537M8005n5552l3787l4283k0795j5504
$$ -57340 -105866 -110090 -98862 -80074 -70455 18082 66087 10535 -23252 -57535 -78330 -93834
6694i3834K6114J9000j5380J26563L9066r1511j04834k1443L3588K0947j131O9554
$$ -93834 -67720 -48720 -64100 62463 101529 10018 -94816 -116259 -82671 -61724 -62855 6699
6682F699J6104l9079m2444k3640J29042J10389k3317o7632J1104n234l2686o2706
$$ 6699 22803 -16276 -58720 -82360 46682 157071 133754 66122 77226 71992 39306 -23400
6670b3400l5051n5421K9178L6683N0520l5256o6186j0653O5177R1702K9962N8171
$$ -23400 -58451 -113872 -84694 -48011 2509 -32747 -98933 -109586 -44409 47293 77255 135426
6658A35426J4538m7123j12361l1850J04136P6882j1035J6833K1386R6904J98536
$$ 135426 149964 102841 -9520 -41370 62766 139648 128613 145446 166832 263736 462272
6647D62272K15129J42234r9415j74150j15149j06182K6103O655M8889j9581Q4775
$$ 462272 677401 819635 720220 546070 430921 324739 350842 357497 406386 386805 471580
6636D71580J18846J41706K96687L38648M09430N41503P46617J174497K146953
$$ 471580 590426 732132 1028819 1367467 1776897 2318400 3065017 4239514 6386467
6627F386467M734107Q054864N318127k637154n039841m303402l322138k412635
$$ 6386467 11120574 19175438 24493565 21856411 16816570 12513168 9191030 6778395
6619F778395j770915j202537q40200o02583n19407m24719k95668k34248j67167
$$ 6778395 5007480 3804943 2964743 2362160 1842753 1418034 1122366 888118 720951
6610G20951j22431n3308o6747N7295K1687R6280L3554m4560q4034r5809m3363
$$ 720951 598520 545212 478465 535760 557447 653727 687281 642721 558687 462878 419515
6599D19515l0104n3311R61n3980j33073l0718k4867j5808j0226j0308k627k7429
$$ 419515 389411 336100 337061 283081 150008 119290 94423 78615 68389 58081 55454 28025
6587B8025o243L0365O6791L8706J912N4718j14464o6555O9578L0820L3191n7478
$$ 28025 21782 52147 118938 157644 159556 214274 99810 33255 102833 133653 166844 109366
6575A09366k0674j5247l7885o8646N5684K3791q237M0736P131k5460n2762R2138
$$ 109366 88692 73445 35560 -33086 22598 46389 38152 78888 86019 60559 7797 99935
6563I9935N7429J3999k5117n5732m9336j4873k9666j630q099n7757o9430K3388
$$ 99935 157364 171363 146246 90514 41178 26305 -3361 -4991 -13090 -70847 -140277 -116889
6551a16889O2323R1538J03227k2182p8267L2836k5638j580O1413M5976J061J4115
$$ -116889 -54566 36972 140199 118017 39750 72586 46948 45368 106781 152757 153818 167933
6539A67933n2219q0257k5587l8673k3021k35j5118K1645k0295j24699P7193J21069
$$ 167933 115714 35457 9870 -28803 -51824 -52059 -67177 -45532 -65827 -190526 -113333 7736
6527G736k3305n6033k6859P2184O0075j6553n4483l3794J4596N2722k7616p91
$$ 7736 -15569 -71602 -98461 -26277 33798 17245 -37238 -71032 -56436 -3714 -31330 -32121
6515c2121l6573m7749K737O7433Q4652p0877j8450J7521J5708M3l5192N2347L828
$$ -32121 -68694 -116443 -113706 -46273 38379 -32498 -50948 -33427 -17719 -17676 -52868 -521 3307
6502C307Q152p324K2033j0723n3825k684J6101p1315Q941R1457J6593l2039l4072
$$ 3307 11459 4135 26168 15445 -38380 -41064 -24963 -96278 -87337 4120 20713 -11326 -45398
6489d5398N8453M1835l4667l1127m4530K8847J79913Q4305j11779m6651n3725
$$ -45398 13055 54890 20223 -10904 -55434 -26587 153326 237631 125852 79201 25476
6478B5476p3530J0782J4842L6355K7042M0235l3168N7536N459l5686l8011j1664
$$ 25476 -48054 -37272 -22430 13925 40967 81202 48034 105570 111029 75343 37332 25668
6466B5668L2112K1735L248p0865n5359j9830L4665P579Q9936N8090p7390J3640
$$ 25668 57780 79515 82763 11898 -43461 -63291 -28626 -21047 68889 126979 49589 63229
6454F3229q8832P590l9755l0237N0617P2432R0233j0659q0509k4621m532j6143
$$ 63229 -25603 -18013 -57768 -88005 -37388 35044 125277 114618 34109 9488 4956 -11187
6442a1187J7273L8938M3296l1982j09106P4620L6968J1965o704n6121J5157O1245
$$ -11187 6086 45024 88320 56338 -52768 21852 58820 70785 64081 7960 23117 84362
6430H4362l6421r366m3575N999N3968K3531l5695n6490q2820J13572O4269q3835
$$ 84362 47941 38575 -5000 999 54967 78498 42803 -13687 -96507 17065 81334 -2501
6418b501j8145j863l1741j0699Q6256k8051r199p555j7592M282j2927j9284o7633
$$ -2501 -20646 -22509 -54250 -64949 21307 -6744 -15943 -23498 -41090 -36808 -49735 -69019 -136652
6405a36652K7264R1818k7140Q1830p3357p72N3412o7079J1635l8165j497J8517
$$ -136652 -109388 -17570 -44710 37120 -36237 -37009 16403 -50676 -39041 -77206 -78703 -60186
6393f0186k6627J9409J2774L0861n306k2617K1595j2250l3610J9571M8638L0935
$$ -60186 -86813 -67404 -54630 -23769 -29075 -51692 -30097 -42347 -75957 -56386 -7748 23187
6381B3187j0815N3254k0606n4174M5783L6731m7002p8045O1257J12108k6625l4452
$$ 23187 12372 65626 45020 -9154 36629 73360 26358 -51687 9570 121678 95053 60601
6369F0601J7411m1440N81M9229k0587n0464n1274J8323N9044k4375r0626L1091
$$ 60601 78012 36572 37153 86382 65795 15331 -35943 -17620 41424 17049 -73577 -42486
6357d2486L1795m4946J5567m430n9859J7179J6944q223O8896M2300K313J0414
$$ -42486 -10691 -55637 -40070 -44500 -104359 -87180 -70236 -78459 -9563 32737 35050 45464
6345D5464J2541r6893k6788l8499j09925Q447P5858J33838J4784r0553N912L9675
$$ 45464 58005 -38888 -65676 -104175 -214100 -205653 -129795 4043 18827 -71726 -65814 -26139
6333b6139o6407n4943N7842N0756J38518N7331p8703l8071n8210j51290r1956
$$ -26139 -92546 -147489 -89647 -38891 99627 156958 78255 40184 -18026 -169316 -261272
6322b61272N4850O4500J10041R2315m1386K4395k3787j6024N0583r417n3727p8724
$$ -261272 -206422 -141922 -31881 60434 19048 43443 19656 3632 54215 44798 -8929 -87653
$$ [...]
##END NTUPLES=NMR SPECTRUM
##END=
