##TITLE=Analysis number 307093
Compound Code ac 11676
Project Code adrs
Chemist Name komarov
##JCAMPDX= 6.0         $$ Bruker NMR JCAMP-DX V2.0
##DATA TYPE= NMR SPECTRUM
##DATA CLASS= NTUPLES
##ORIGIN= Bruker BioSpin GmbH
##OWNER= NMR
$$ XWIN-NMR		Version 3.5
$$ Wed Apr 20 14:41:01 2005 GMT Daylight Time (UT+1h)  MAYBRIDGE\NMR@NMR_250MHZ
##.OBSERVE FREQUENCY= 250.131544655141
##.OBSERVE NUCLEUS= ^1H
##.ACQUISITION MODE= SIMULTANEOUS (DQD)
##.ACQUISITION SCHEME= undefined
##.AVERAGES= 16
##.DIGITISER RES= 18
##SPECTROMETER/DATA SYSTEM= dpx250
##.PULSE SEQUENCE= zg30
##.SOLVENT NAME= CDCl3
##.SHIFT REFERENCE= (INTERNAL, CDCl3, 0, 16.522)
##AUDIT TRAIL= $$ (NUMBER, WHEN, WHO, WHERE, WHAT)
$$ ##TITLE= Audit trail, XWIN-NMR		Version 3.5
$$ ##JCAMPDX= 5.01
$$ ##ORIGIN= Bruker BioSpin GmbH
$$ ##OWNER= NMR
$$ C:\u/data/dgb/nmr/ADRS/1850/pdata/1/auditp.txt
$$ ##AUDIT TRAIL=  $$ (NUMBER, WHEN, WHO, WHERE, WHAT)
(   1,<2005-04-20 14:40:26.54 +100>,<MAYBRIDGE\NMR>,<NMR_250MHZ>,
      <created by zg, POWCHK disabled, PULCHK disabled
       configuration hash MD5:
       62 19 C7 07 E1 42 D1 B7 37 6C 3D D0 77 39 F9 E6
       data hash MD5: 64K
       D3 C8 E9 CF C4 36 B6 23 75 1D 5E 0E DF 50 13 02>)
(   2,<2005-04-20 14:40:43.54 +100>,<MAYBRIDGE\NMR>,<NMR_250MHZ>,
      <Start of raw data processing
       ef LB = 0.3 FT_mod = 6 PKNL = 1 SI = 32K 
       data hash MD5: 32K
       2D 5E 0C 1A 55 7D F4 83 B9 96 3C 1D A6 3F 4A E9>)
(   3,<2005-04-20 14:40:46.58 +100>,<MAYBRIDGE\NMR>,<NMR_250MHZ>,
      <apk 
       data hash MD5: 32K
       C7 E5 0E 1E 41 60 E5 53 BC CA 71 BD 91 05 48 A6>)
(   4,<2005-04-20 14:40:48.15 +100>,<MAYBRIDGE\NMR>,<NMR_250MHZ>,
      <abs ABSG = 5 
       data hash MD5: 32K
       84 08 6F 70 6C 3C F9 26 56 8E E9 28 95 1F F0 2C>)
$$ ##END=
$$ 
$$ hash MD5
$$ 2C 1E 69 B5 73 04 35 52 14 FF 79 CE C3 0A 85 CC
##$RELAX= 
##$RELAX= 
##$RELAX= 
##$RELAX= 
##$RELAX= 
##$RELAX= 
##$RELAX= 
$$ Bruker specific parameters
$$ --------------------------
##$DU= <C:\u>
##$EXPNO= 1850
##$NAME= <ADRS>
##$PROCNO= 1
##$TYPE= <nmr>
##$USER= <dgb>
##$AMP= (0..31)
100 100 100 100 100 100 100 100 100 100 100 100 100 100 100 100 100 100 
100 100 100 100 100 100 100 100 100 100 100 100 100 100 
##$AQSEQ= 0
##$AQ_mod= 3
##$AUNM= <au_zg>
##$AUTOPOS= <26 >
##$BF1= 250.13
##$BF2= 250.13
##$BF3= 250.13
##$BF4= 250.13
##$BF5= 500.13
##$BF6= 500.13
##$BF7= 500.13
##$BF8= 500.13
##$BYTORDA= 1
##$CFDGTYP= 0
##$CFRGTYP= 5
##$CHEMSTR= <none>
##$CNST= (0..31)
1 1 145 1 1 1 1 1 1 1 1 1 1 1 1 1 1 1 1 1 1 1 1 1 1 1 1 1 1 1 1 1 
##$CPDPRG= <>
##$CPDPRG1= <>
##$CPDPRG2= <>
##$CPDPRG3= <>
##$CPDPRG4= <mlev>
##$CPDPRG5= <mlev>
##$CPDPRG6= <mlev>
##$CPDPRG7= <mlev>
##$CPDPRG8= <mlev>
##$CPDPRGB= <>
##$CPDPRGT= <>
##$D= (0..31)
0 1 0 0 0 0 0 0 0 0.06 0 0 0 0 0 0 0.0002 0 0 0 0 0 0 0 0 0 0 0 0 0 0 
0 
##$DATE= 1114004425
##$DBL= (0..7)
120 120 120 120 120 120 120 120 
##$DBP= (0..7)
150 150 150 150 150 150 150 150 
##$DBP07= 0
##$DBPNAM0= <>
##$DBPNAM1= <>
##$DBPNAM2= <>
$$ [...]
##$SUBNAM7= <"">
##$SUBNAM8= <"">
##$SUBNAM9= <"">
##$SW= 20.6930455092707
##$SWIBOX= (0..15)
0 0 3 0 0 0 0 0 0 0 0 0 0 0 0 0 
##$SW_h= 5175.983436853
##$TD= 65536
##$TD0= 1
##$TE= 295.16
##$TE2= 300
##$TE3= 300
##$TEG= 300
##$TL= (0..7)
0 120 120 120 120 120 120 120 
##$TP= (0..7)
150 150 150 150 150 150 150 150 
##$TP07= 0
##$TPNAME0= <>
##$TPNAME1= <>
##$TPNAME2= <>
##$TPNAME3= <>
##$TPNAME4= <>
##$TPNAME5= <>
##$TPNAME6= <>
##$TPNAME7= <>
##$TPOAL= (0..7)
0.5 0.5 0.5 0.5 0.5 0.5 0.5 0.5 
##$TPOFFS= (0..7)
0 0 0 0 0 0 0 0 
##$TUNHIN= 0
##$TUNHOUT= 0
##$TUNXOUT= 0
##$USERA1= <user>
##$USERA2= <user>
##$USERA3= <user>
##$USERA4= <user>
##$USERA5= <user>
##$V9= 5
##$VALIST= <valist>
##$VCLIST= <CCCCCCCCCCCCCCC>
##$VD= 0
##$VDLIST= <DDDDDDDDDDDDDDD>
##$VPLIST= <PPPPPPPPPPPPPPP>
##$VTLIST= <TTTTTTTTTTTTTTT>
##$WBST= 1024
##$WBSW= 4
##$XGAIN= (0..3)
0 0 0 0 
##$XL= 0
##$YL= 0
##$YMAX_a= 511044
##$YMIN_a= -404524
##$ZGOPTNS= <>
##$ZL1= 120
##$ZL2= 120
##$ZL3= 120
##$ZL4= 120
##$ABSF1= 16.522
##$ABSF2= -4.171173
##$ABSG= 5
##$ABSL= 3
##$ALPHA= 0
##$AQORDER= 0
##$ASSFAC= 0
##$ASSFACI= 0
##$ASSFACX= 0
##$ASSWID= 0
##$AUNMP= <proc_1d>
##$AZFE= 0.1
##$AZFW= 0.1
##$BCFW= 0
##$BC_mod= 0
##$BYTORDP= 0
##$COROFFS= 0
##$CY= 12.5
##$DATMOD= 1
##$DC= 0
##$DFILT= <>
##$DTYPP= 0
##$F1P= 14.0000005364418
##$F2P= -0.99999901652339
##$FCOR= 0.5
##$FTSIZE= 32768
##$FT_mod= 6
##$GAMMA= 0
##$GB= 0
##$INTBC= 1
##$INTSCL= 1
##$ISEN= 128
##$LB= 0.3
##$LEV0= 0
##$LPBIN= 0
##$MAXI= 10000
##$MC2= 0
##$MEAN= 0
##$ME_mod= 0
##$MI= 0
##$NCOEF= 0
##$NC_proc= -3
##$NLEV= 6
##$NOISF1= 0
##$NOISF2= 0
##$NSP= 0
##$NTH_PI= 0
##$NZP= 0
##$OFFSET= 16.522
##$PC= 1
##$PHC0= 137.7395
##$PHC1= 2.29802
##$PH_mod= 1
##$PKNL= yes
##$PPARMOD= 0
##$PSCAL= 4
##$PSIGN= 0
##$REVERSE= no
##$SF= 250.13
##$SI= 32768
##$SIGF1= 0
##$SIGF2= 0
##$SINO= 400
##$SIOLD= 32768
##$SREGLST= <1H.CDCl3>
##$SSB= 0
##$STSI= 32768
##$STSR= 0
##$SW_p= 5175.98343685301
##$SYMM= 0
##$S_DEV= 0
##$TDeff= 65536
##$TDoff= 0
##$TI= <Analysis number 999999
Compound Code 99
Book Reference 9
Project Code 9>
##$TILT= no
##$TM1= 0
##$TM2= 0
##$TOPLEV= 0
##$USERP1= <user>
##$USERP2= <user>
##$USERP3= <user>
##$USERP4= <user>
##$USERP5= <user>
##$WDW= 1
##$XDIM= 32768
##$YMAX_p= 290428906
##$YMIN_p= -262084
$$ End of Bruker specific parameters
$$ ---------------------------------
##NTUPLES= NMR SPECTRUM
##VAR_NAME=  FREQUENCY,     SPECTRUM/REAL,   SPECTRUM/IMAG
##SYMBOL=    X,             R,               I
##VAR_TYPE=  INDEPENDENT,   DEPENDENT,       DEPENDENT
##VAR_FORM=  AFFN,          ASDF,            ASDF
##VAR_DIM=   32768,         32768,           32768
##UNITS=     HZ,            ARBITRARY UNITS, ARBITRARY UNITS
##FACTOR=    0.157963299565203, 1,           1
##FIRST=     4132.6476996994, 0,             0
##LAST=      -1043.33573715361, 0,           0
##MIN=       -1043.33573715361, -262084,     0
##MAX=       4132.6476996994, 290428906,     0
$$ Real data points
##PAGE= N=1
##DATA TABLE= (X++(R..R)), XYDATA
$$ [...]
$$ plain form
14474 -4751 481 1759 -3229 -7461 -10266 -12722 -13709 -11577 -10627 -7969 -9629 -1157 -361 -6051 -7503
14459 -7503 -3870 -4233 -3752 -5837 -8268 -241 1486 1180 7086 4456 7163 5705 6262 953 524 2140
14443 2140 3125 1645 650 -1319 -4744 -2271 -901 3233 5860 1257 -5885 -4611 -825 4850 3662
14428 3662 680 5497 7262 1291 1891 3758 4269 -737 -2960 1833 -5859 -13186 -8617 -10812 -15448
14413 -15448 -12395 -8160 -4578 4049 8680 8176 3277 -2201 -8182 -5440 -4550 -7573 -10323 -12261 -12535
14398 -12535 -8421 -249 7686 3795 -4530 -7869 -2789 3245 2271 3066 -3270 -6660 -8616 -12603 -12982
14383 -12982 -6311 -4725 -6791 -6689 211 -7235 -20060 -19490 -16327 -19419 -13905 -8869 -8190 -4762 -1895
14368 -1895 -5747 -8543 -10625 -8810 -7365 -1844 2708 -731 460 1645 3032 833 -1558 -1803 61
$$ packed form
14474d751N232J278m988m232k805k456r87K132R50K658j660Q472P96n690j452
14459g503L633l63M81k085k431Q027J727l06N906k630K707j458N57n309m29J616
14443B140R85j480r95j969l425K473J370M134K627m603p142J274L786N675j188
14428C662k982M817J765n971O00J867N11n006k223M793p692p327M569k195m636
14413a5448L053M235L582Q627M631n04m899n478n981K742Q90l023k750j938k74
14398a2535M114Q172P935l891q325l339N080O034r74P95o336l390j956l987l79
14383a2982O671J586k066J02O900p446j2825N70L163l092N514N036O79L428K867
14368a895l852k796k082J815J445N521M552l439J191J185J387k199k391k45J864
$$ plain form
14353 61 1220 676 1239 5777 769 -3330 -6628 -8722 -4339 -475 3083 4017 -134 -4736 -275 1831
14337 1831 1102 1252 -3530 -1490 620 1733 2173 1869 7025 8616 5382 10573 8091 -2330 -6520
14322 -6520 -2529 1952 3285 1133 -4108 -2512 2013 -5068 -4989 -5043 -10126 -14436 -6760 -1063 -774 -1024
14306 -1024 -4505 -4363 -4990 -1019 5281 7536 5408 2382 134 3325 -966 -7359 -7585 -9018 -5044
14291 -5044 3803 6490 10837 5740 -1339 -364 1134 1264 7451 13171 9358 10018 10574 8457 1884 -9757
14275 -9757 -11087 -2048 1644 -367 -5166 -6849 -8281 -2246 607 -4577 -485 3201 4691 -1909 -857
14260 -857 -158 -6751 -6288 -5630 -6626 -4132 -7220 -5452 -2784 4769 -2134 -2032 -5007 -9196 -2674 -3416
14244 -3416 2206 5147 140 2496 8434 7862 5102 3431 -5845 -11515 -7783 -5925 -2768 -1136 -2908
$$ packed form
14353F1J159n44N63M538n008m099l298k094M383L864L558R34m151m602M461K106
14337A831p29J50m782K040K110J113M40l04N156J591l234N191k482j0421m190
14322f520L991M481J333k152n241J596M525p081P9n4n083m310P676N697K89k50
14306a024l481J42o27L971O300K255k128l026k248L191m291o393k26j433L974
14291e044Q847K687M347n097p079R75J498J30O187N720l813O60N56k117o573j1641
14275i757j330R039L692k011m799j683j432O035K853n184M092L686J490o600J052
14260h57O99o593M63O58r96K494l088J768K668P553o903J02k975m189O522p42
14244c416N622K941n007K356N938n72k760j671r276n670L732J858L157J632j772
$$ plain form
14229 -2908 3065 5695 -1655 -8673 -5462 -5833 -4114 -6507 -6486 -3698 -6298 -3005 -2140 -950 1906 -3931
14213 -3931 -5323 -2199 -5445 -11176 -11527 -7764 -8008 -3543 -1313 62 -3540 -9907 -6585 -3443 -3377 3791
14197 3791 -322 -6859 -5741 -1037 643 -3045 -4609 -5292 -10753 -8448 -7476 -5289 -4623 -269 -390 -1388
14181 -1388 -1985 2449 -3831 -8167 -8429 -9315 -7372 -9452 -5592 -5952 -6876 -6642 -4224 -2086 -1623 -3961
14165 -3961 -1873 3619 8784 9461 5073 5890 5606 6398 8445 8934 3771 -32 2373 -6613 -16522 -13892
14149 -13892 -9915 -5018 -2073 -6114 -7103 -7200 -11527 -9022 -6259 -3499 1520 5491 5495 9759 4755 -115
14133 -115 -1299 3593 7326 4251 3584 426 -1066 -5021 -3725 -4501 -6222 -5869 -3082 -2792 -2044 5385
14117 5385 15732 13264 5880 -409 -2325 -2259 -4631 -826 79 -106 915 5261 3030 -4690 -9664
$$ packed form
14229b908N973K630p350p018L211l71J719k393K1K788k600L293Q65J190K856n837
14213c931j392L124l246n731l51L763k44M465K230J375l602o367L322L142O6P168
14197C791m113o537J118M704J680l688j564o83n461K305R72K187O66M354j21r98
14181a388n97M434o280m336k62q86J943k080L860l60r24K34K418K138M63k338
14165c961K088N492N165O77m388Q17k84P92K047M89n163l803K405q986r909K630
14149a3892L977M897K945m041r89r7m327K505K763K760N019L971MM264n004m870
14133a15j184M892L733l075o67l158j492l955J296p76j721L53K787K90P48P429
14117E385J0347k468p384o289j916O6k372L805R05j85J021M346k231p720m974
$$ plain form
14102 -9664 -4740 -721 -5192 -4660 -7617 -13106 -12215 -12832 -10668 -126 -2072 -559 4060 3551 1670
14087 1670 -6178 -4457 -1047 -1743 -1453 -10687 -13337 -16475 -17244 -18221 -14558 -8077 -9884 -8821 -2884 -2503
14071 -2503 -3881 -4398 -3820 -4434 -7233 -9083 -8918 -10136 -6807 -8139 -10329 -7148 -3267 -5345 -10585 -6972
14055 -6972 -6190 -2879 2701 1072 3393 1122 -1850 -3842 -127 2750 6225 4877 -2233 -9538 -12649
14040 -12649 -6270 -1757 -7023 -7348 -1479 -585 -3869 -8721 -7084 -1321 -2630 -3116 -4342 -7746 -4177
14025 -4177 -2315 -222 -2108 193 4292 761 -946 2852 4542 2747 377 -6456 -13311 -16431 -13083
14010 -13083 -6166 -7705 -5173 -5655 -7395 -6998 -6219 -2303 -1465 -1791 166 913 542 681 2786 2147 -4848
13993 -4848 -7168 -1325 1199 -6981 -9321 -7151 -4604 -3802 -1684 3396 5261 6013 3372 -2460 -3369
$$ packed form
14102i664M924M019m471N32k957n489Q91o17K164J0542j946J513M619n09j881
14087A670p848J721L410o96K90r234k650l138p69r77L663O481j807J063N937L81
14071b503j378n17N78o14k799j850J65j218L329j332k190L181L881k078n240L613
14055f972P82L311N580j629K321k271k972j992L715K877L475j348p110p305l111
14040a2649O379M513n266l25N869Q94l284m852J637N763j309m86j226l404L569
14025d177J862K093j886K301M099l531j707L798J690j795k370o833o855l120L348
14010a3083O917j539K532m82j740L97P79L916Q38l26J957P47l71J39K105o39o995
13993d848k320N843K524q180k340K170K547Q02K118N080J865P52k641n832r09
$$ plain form
13978 -3369 -7579 -7243 -2517 -2835 -4585 -2142 -6703 -9696 -12183 -13194 -5865 781 4441 5084 935
13963 935 -4379 -7429 -5758 -3005 -9503 -10409 -7170 -1529 2208 801 -4876 -9423 -5006 -3727 -919
13948 -919 802 372 -2335 -5932 -10620 -6657 -8060 -10847 -5331 -3009 -8395 -14982 -13219 -7993 -3987
13933 -3987 -2339 -2578 -6216 -9241 -7384 -2121 -2749 -5851 -3069 288 528 145 3435 5916 6379 5969
13917 5969 3752 -86 -3491 -1601 6319 4925 889 -5010 -7344 -3056 -1693 -3417 -3057 -5797 -11391
13902 -11391 -13972 -12240 -7480 -8268 -9891 -7684 -3216 -5585 -1529 1908 -5521 -6127 -120 -2964 -848
13887 -848 4862 10039 6657 3610 3452 6171 292 1490 4785 3122 3932 2907 -4297 -8262 -5553
13872 -5553 -2637 -5347 -2703 3451 7526 11788 4794 2437 3417 1783 -1494 -4859 -6574 3833 9022
$$ packed form
13978c369m210L36M726l18j750K443m561k993k487j011P329O646L660O43m149
13963I35n314l050J671K753o498r06L239N641L737j407n677m547M417J279K808
13948i19J721m30k707l597m688L963j403k787N516K322n386o587J763N226M006
13933c987J648k39l638l025J857N263o28l102K782L357K40l83L290K481M63m10
13917E969k217l838l405J890P920j394m036n899k334M288J363j724L60k740n594
13902a1391k581J732M760p88j623K207M468k369M056L437p429o06O007k844K116
13887h48N710N177l382l047j58K719n879J198L295j663Q10j025p204l965K709
13872e553K916k710K644O154M075M262o994k357R80j634l277l365j715J0407N189
$$ plain form
13857 9022 8088 6225 6772 6517 6906 7900 3150 1752 3367 1332 1345 2362 4718 6053 3425 -2900
13841 -2900 -3374 -3372 521 360 1302 4878 6909 2862 74 -9001 -11010 -13567 -10766 -6855 -4252 -5839
13825 -5839 -9745 -2751 1805 -1727 -1785 -1512 1074 1659 2046 -1251 -4069 -5649 -3554 418 1742 -2917
13809 -2917 -9395 -7812 -5403 -1225 -2514 2125 499 -3043 -5997 -8715 -2158 -1069 -3355 -11066 -13799
13794 -13799 -6262 -6772 -9713 -6330 -4089 -1025 -6822 -9213 -2251 -4666 -8521 -8818 -6676 -4685 -8005
13779 -8005 -8584 -3334 -2326 -3500 -9030 -13883 -16313 -5405 1593 8473 3966 1389 3394 3143 -4563
13764 -4563 -9828 -6989 -4358 -4539 952 4072 1995 -2516 -7097 -7092 -2867 -3256 -2619 -1830 -2593 -2110 -1304
13747 -1304 786 4646 3974 -1000 -2451 1763 7524 9143 7366 3954 4932 -1397 -3073 -2175 -1907 -3777
$$ packed form
13857I022r34j863N47k55L89R94m750j398J615k035J3J017K356J335k628o325
13841b900m74KL893j61R42L576K031m047k788r075k009k557K801L911K603j587
13825e839l906O994M556l532n8K73K586N85L87l297k818j580K095L972J324m659
13809b917o478J583K409M178j289M639j626l542k954k718O557J089k286p711k733
13794a3799P537n10k941L383K241L064n797k391O962k415l855k97K142J991l320
13779h005n79N250J008j174n530m853k430J0908O998O880m507k577K005k51p706
13764d563n265K839K631j81N491L120k077m511m581NM225l89O37P89p63M83Q06
13747a304K090L860o72m974j451M214N761J619j777l412R78o329j676Q98K68j870
$$ plain form
13731 -3777 -3912 -5136 -4919 -3260 -262 4816 6480 7512 4506 5365 198 -106 -2553 -5522 -758 2065
13715 2065 1157 -134 -573 -1804 -325 1081 380 5938 4670 329 -1775 -3188 -5909 -4335 2062
13700 2062 3215 2091 -620 493 -118 -554 -2710 -2940 2526 -908 -1703 -5344 -4321 -3142 -482 -1654
13684 -1654 357 -2393 -8842 -9003 -1666 -2087 -4492 -287 -362 5111 11724 11704 5626 1443 -619 -5226
13668 -5226 -2813 740 2232 4769 2196 3640 2095 -1549 -2272 -1502 -2158 -166 1870 -7 994
13653 994 5220 -757 -3828 -680 -982 2661 -374 -1336 -2013 2479 -648 -2824 -1924 3157 13118 13996
13637 13996 7326 1756 172 -76 3510 2616 -6865 -4366 2037 7812 7689 4946 2310 -4546 -9896
13622 -9896 -2238 292 3783 3086 3039 -3777 -3796 -5152 -2439 -1377 -4782 -6000 -8219 -11299 -6850 -3797
$$ packed form
13731c777j35j224K17J659K998N078J664J032l006Q59n167l04k447k969M764K823
13715B065r08j291m39j231J479J406p01N558j268m341k104j413k721J574O397
13700B062J153j124k711J113o11m36k156k30N466l434p95l641J023J179K660j172
13684a654K011k750o449j61P337m21k405M205p5N473O613k0o078m183k062m607
13668e226K413L553J492K537k573J444j545l644p23P70o56J992K036j877J001
13653I94M226n977l071L148l02L643l035r62o77M492l127k176R00N081R961Q78
13637A3996o670n570j584k48L586q94r481K499O403N775j23k743k636o856n350
13622i896P658K530L491o97m7o816j9j356K713J062l405j218k219l080M449L053
$$ plain form
13606 -3797 -1064 5445 8969 3098 2841 -1671 2085 1301 -5500 -8633 -7066 -4933 -4682 -7026 -7644 -3859
13590 -3859 -176 -2749 3935 -541 -10365 -9174 -12029 -13931 -12012 -9028 -9576 -7673 -11297 -13414 -6981
13575 -6981 -1442 -7090 -6890 1 -2510 -1027 -1265 4566 6151 6746 5572 1949 -33 -3812 -6607
13560 -6607 -8185 -5492 -4205 -3226 -4322 -2458 -5343 -5984 -1769 -1438 -2372 -647 -107 3368 -487 -1509
13544 -1509 -2646 -2860 -7456 -9525 -11254 -8788 -6347 -3329 -1715 -1959 -2808 -3453 -9281 -6595 -6311 -3383
13528 -3383 -2827 -9053 -10049 -8484 -9918 -12793 -11161 -5847 -946 531 -8 -4 -1966 -1766 -6206 -3342
13512 -3342 295 1118 2172 928 -2875 -5423 -3032 2402 334 -3240 858 3494 -502 6619 5893
13497 5893 3208 6916 8225 3030 -408 -4425 -6869 -5064 -2113 -260 7679 5905 2828 5761 6770
$$ packed form
13606c797K733O509L524n871k57m512L756p84o801l133J567K133K51k344o18L785
13590c859L683k573O684m476r824J191k855j902J919K984n48J903l624k117O433
13575f981N539n648K00O891k511J483k38N831J585N95j174l623j982l779k795
13560f607j578K693J287R79j096J864k885o41M215L31r34J725N40L475l855j022
13544a509j137k14m596k069j729K466K441L018J614k44q49o45n828K686K84K928
13528c383N56o226r96J565j434k875J632N314M901J477n39Mj962K00m440K864
13512c342L637Q23J054j244l803k548K391N434k068l574M098K636l996P121p26
13497E893k685L708J309n195l438m017k444J805K951J853P939j774l077K933J009
$$ plain form
13482 6770 5532 5482 93 -1439 -1499 -2617 -3849 -3302 -5638 -4614 -6464 -2372 3695 3090 4292 2909
13466 2909 809 5631 7673 3105 -736 1307 4534 11 -6694 -3676 121 4078 2597 -3299 -8087
13451 -8087 -1321 1019 4149 15001 13136 258 -5403 -7247 -5310 -2971 2339 3147 341 -2217
13437 -2217 -4372 -8337 -8737 -10871 -10833 -11716 -11686 -8413 -12668 -14530 -6046 -230 2748 800 -6276 -9511
13421 -9511 -10037 -8293 -6860 -2297 5799 5187 6194 13848 9333 5562 6192 6296 3411 2660 2568 1577 -1892
13404 -1892 -4440 -5826 -5505 -6077 -2360 1998 944 4544 7519 7116 401 -981 1788 748 -3611
13389 -3611 -8599 -8745 -7517 -4349 -126 1642 4270 5673 9108 6905 688 -157 -1286 -7434 -3271
13374 -3271 5199 8795 6707 2504 6408 11070 5192 -917 -422 -2323 783 6587 4360 1551 343
$$ packed form
13482F770j238n0n389j532o0j118j232N47k336J024j850M092O067o05J202j383
13466B909k100M822K042m568l841K043L227m523o705L018L797L957j481n896m788
13451h087O766K340L130J0852j865j2878n661j844J937K339N310Q08k806k558
13437b217k155l965m00k134L8q83L0L273m255j862Q484N816K978j948p076l235
13421i511n26J744J433M563Q096o12J007P654m515l771O30J04k885p51r2r91l469
13404a892k548j386L21n72L717M358j054L600K975m03o715j382K769j040m359
13389c611m988j46J228L168M223J768K628J403L435k203o217q45j129o148M163
13374c271Q470L596k088m203L904M662n878o109M95j901L106N804k227k809j208
$$ plain form
13359 343 1741 21 -5551 -8279 -15433 -10319 -1535 4455 4591 691 -3224 -2009 1892 2671 -2547
13344 -2547 -2196 -5516 -301 6008 4566 -4432 -8469 -7696 -6726 -5121 -9116 -6871 379 2560 1997 4863
13328 4863 3044 -5633 -12178 -16266 -9633 -8208 -10138 -12114 -10478 1952 9420 6463 -866 -6136
13314 -6136 -8494 -8506 -5429 1551 -3782 -2883 -475 1091 4655 572 -793 -4777 -11321 -11933 -9034 -8626
13298 -8626 -5878 -5170 -5369 -4336 -699 -416 2038 5811 6007 1627 -738 -3461 -1490 -490 -786 -1581
13282 -1581 -3593 -3502 -9283 -11565 -7375 -5441 -5689 -4415 -1531 672 616 2465 -940 -9235 -11274 -9768
13266 -9768 -4133 -5566 -5497 -4134 -1160 1902 3267 6122 4537 1055 410 694 -411 -1926 -1831 -244
13250 -244 -3936 -577 -2022 -9871 -17055 -17064 -12406 -4798 -6106 -1847 3591 8179 6222 578 -4753 -506
$$ packed form
13359C43J398j720n572k728p154N114Q784N990J36l900l915J215L901P79n218
13344b547L51l320N215O309j442q998m037P73R70J605l995K245P250K181n63K866
13328D863j819q677o545m088O633J425j930j976J636J2430P468k957p329n270
13314f136k358j2L077O980n333Q99K408J566L564m083j365l984o544o12K899M08
13298h626K748P08j99J033L637K83K454L773J96m380k365k723J971J000k96p95
13282a581k012R1n781k282M190J934k48J274K884K203n6J849l405q295k039J506
13266i768N635j433O9J363K974L062J365K855j585l482o45K84j105j515R5J587
13250b44l692L359j445p849p184rM658P608j308M259N438M588j957n644n331M247
$$ plain form
13234 -506 1657 6256 12271 10809 7572 2501 -2961 -2563 -729 -1028 -5344 -6002 -3180 3906 2310 1942
13218 1942 -2211 4518 8606 10150 8218 8724 10130 8693 3419 6177 42 1170 8272 9619 3004
13203 3004 -1754 187 770 -5271 -11000 -8192 1972 5029 -712 -2935 -4837 -10203 -8682 -1995 3604
13188 3604 1390 -1689 -849 -2305 4526 7231 3827 1669 -4969 -6539 -4551 -5326 -8070 -7169 -8250
13173 -8250 -6384 -7812 -9271 -8175 -9961 -12430 -11541 -5598 -1320 1353 5576 8839 5799 1310 193
13158 193 7282 15524 14677 5288 -224 -4693 -4595 -3358 334 -2511 -5701 -1413 -1658 -2671 1998 -1015
13142 -1015 -5745 -7731 -2108 -6403 -9944 -795 6664 1310 -6340 -9833 -5778 -945 1426 3360 -559
13127 -559 -7284 -8902 -9191 -3566 4375 7420 8043 6539 9880 6376 7625 8693 8636 8799 2630 2824
$$ packed form
13234e06K163M599O015j462l237n071n462L98J834k99m316o58K822P086j596l68
13218A942m153O729M088J544j932N06J406j437n274K758o135J128P102J347o615
13203C004m758J941N83o041n729K808J0164L057n741k223j902n366J521O687N599
13188C604k214l079Q40j456O831K705l404k158o638j570J988p75k744R01j081
13173h250J866j428j459J096j786k469Q89N943M278K673M223L263l040m489j117
13158A93P089Q242q47r389n512m469R8J237L692k845l190M288k45j013M669l013
13142a015m730j986N623m295l541R149P459n354p650l493M055M833K371J934l919
13127e59o725j618k89N625P941L045O23j504L341l504J249J068n7J63o169J94
$$ plain form
13111 2824 2233 5074 5131 6687 3140 -2608 -11749 -13037 -11194 -16838 -18930 -12940 -8390 -6793 -2727
13096 -2727 -5974 -8932 -6778 -9840 -6085 586 5120 7851 9705 7284 2778 1471 1623 -1217 -7387
13081 -7387 -6802 -4119 -7490 -8428 -7611 -5809 -4126 -11580 -13738 -11179 -3987 177 1015 2210 238 2854
13065 2854 682 -2193 2794 -2128 -3944 -6392 -9139 -7633 -6611 -3260 -2921 564 6338 6316 2149
13050 2149 -1030 -6574 -8867 -9286 -4192 -626 -21 187 4204 7487 7601 9342 5434 702 3239 12095
13034 12095 4566 944 2094 8316 8347 4626 665 1316 3519 8639 10699 14414 12203 11592 10280
13019 10280 10553 6294 1895 9496 8239 9467 4626 2102 2637 271 1006 3555 2896 3591 11620 5479
13003 5479 3047 10638 15261 9388 5968 3685 8859 15906 13754 15148 8632 6476 16064 17358 13293
$$ packed form
13111B824n91K841N7J556l547n748r141j288J843n644k092N990M550J597M066
13096b727l247k958K154l062L755O671M534K731J854k421m506j307J52k840o170
13081g387N85K683l371r38Q17J802J683p454k158K559P192M164Q38J195j972K616
13065B854k172k875M987m922j816k448k747J506J022L351L39L485N774k2m167
13050B149l179n544k293m19N094L566O05K08M017L283J14J741l908m732K537Q856
13034A2095p529l622J150O222L1l721l961O51K203N120K060L715k211o11j312
13019A0280K73m259m399P601j257J228m841k524N35k366P35K549o59O95Q029o141
13003E479k432P591M623n873l420k283N174P047k152J394o516k156R588J294m065
$$ plain form
12988 13293 20272 27449 29792 31545 33217 27749 21454 21798 27411 34451 29658 27281 34389 43103 41876
12973 41876 38343 32471 30139 31266 33055 33987 35914 38280 39532 41050 42004 45646 43024 40958 40477
12958 40477 40860 36330 33464 33669 37522 39466 44246 46834 48715 52281 56152 56199 56516 56563 55841 61175
12942 61175 63559 59339 55409 56310 59560 57525 54878 57089 60070 64713 68371 72451 81125 86481 82380
12927 82380 78347 83461 86618 77457 70349 69488 81630 97716 108574 106838 96763 91041 87843 91498
12913 91498 83565 75349 77829 76339 74136 73770 71670 68771 68998 65286 66830 70463 65202 49287 43044
12898 43044 56315 63411 67208 68297 64046 60128 59221 63893 72088 78230 80020 82951 84936 82213
12884 82213 86585 85599 83620 79481 77665 81713 85907 79884 80059 84391 87009 95014 103065 100988 90091
$$ packed form
12988A3293O979P177K343J753J672n468o295L44N613P040m793k377P108Q714j227
12973D1876l533n872k332J127J789R32J927K366J252J518R54L642k622k066m81
12958D0477L83m530k866K05L853J944M780K588J881L566L871M7L17M7p22N334
12942F1175K384m220l930R01L250k035k647K211K981M643L658M080Q674N356m101
12927H2380m033N114L157r161p108q61J2142J6086J0858j736j0075n722l198L655
12913I1498p933q216K480j490k203l66k100k899K27l712J544L633n261j5915o243
12898D3044J3271P096L797J089m251l918r07M672Q195O142J790K931J985k723
12884H2213M372r86j979m139j816M048M194o023J75M332K618Q005Q051k077j0897
$$ plain form
12869 90091 80890 78371 71756 68755 58940 59400 59993 63066 68776 68074 63952 58945 57507 55853 52689
12854 52689 49301 47295 41345 41871 42364 43241 46913 49278 53714 55775 59041 59139 58687 62046 57903 52913
12838 52913 50447 46539 42542 43127 42339 45325 47254 55828 63925 54374 51102 50020 52184 54417 45644
12823 45644 37912 39461 35020 28344 34642 40841 39051 35707 29105 24743 19625 21987 25259 25216 19874
12808 19874 13171 15219 12082 12929 17113 19371 19780 15249 16290 17300 12554 13173 16710 14263 8572
12793 8572 2281 6257 13455 20502 24268 30854 33564 27123 22562 25601 23349 19081 14312 17315 19997
12778 19997 23467 22212 17443 17797 19208 10137 10113 6291 7257 10265 15880 16231 11280 8957 7439 5895
12762 5895 2332 4764 5008 6435 10349 15257 9939 3001 188 4269 5159 5024 1390 2221 6666 6168
$$ packed form
12869I0091r201k519o615l001r815M60N93L073N710p02m122n007j438j654l164
12854E2689l388k006n950N26M93Q77L672K365M436K061L266R8m52L359m143m990
12838E2913k466l908l997N85p88K986J929Q574Q097r551l272j082K164K233q773
12823D5644p732J549m441o676O298O199j790l344o602m362n118K362L272m3n342
12808A9874o703K048l137Q47M184K258M09m531J041J010m746O19L537k447n691
12793H572o291L976P198P047L766O586K710o441m561L039k252m268m769L003K682
12778A9997L470j255m769L54J411r071k4l822R66L008N615L51m951k323j518j544
12762E895l563K432K44J427L914M908n318o938k813M081Q90j35l634Q31M445m98
$$ plain form
12746 6168 7337 7305 6881 3147 2356 7844 8142 -385 4617 9722 7483 5137 7267 6725 -1986 -1962 330
12729 330 -541 105 8901 10774 8863 5689 4522 772 1617 3261 2507 1 9035 15566 10513 3630
12713 3630 -1726 759 -549 -992 -27 646 5192 5249 9255 8969 7723 9395 6896 3389 10831 11346
12697 11346 7378 2260 -219 619 2069 4245 7666 10340 16162 12042 6328 3536 12817 20038 17010
12682 17010 12955 20094 17265 12834 7390 6638 2213 3168 3798 8738 15262 20555 17274 19109 17450
12667 17450 10200 9227 10512 13807 14395 10536 6546 5447 5227 7690 2167 854 -1592 -3109 -4344
12652 -4344 -3152 222 2304 2265 2539 -867 -10 1724 2772 -3303 -790 2661 286 2264 7881 14166
12636 14166 12304 11142 10324 16229 14500 7894 2146 245 328 2536 3509 3939 9021 12789 15650 17794
$$ packed form
12746F168J169l2m24l734p91N488K98q527N002N105k239k346K130n42q711K4K292
12729C30q71O46Q796J873j911l174j167l750Q45J644p54k506R034O531n053o883
12713C630n356K485j308m43R65O73M546N7M006k86j246J672k499l507P442N15
12697A1346l968n118k479Q38J450K176L421K674N822m120n714k792R281P221l028
12682A7010m055P139k829m431n444p52m425R55O30M940O524N293l281J835j659
12667A7450p250r73J285L295N88l859l990j099k20K463n523j313k446j517j235
12652d344J192L374K082l9K74l406Q57J734J048o075K513L451k375J978N617O285
12636A4166j862j162q18N905j729o606n748j901Q3K208R73M30N082L768K861K144
$$ plain form
12620 17794 17809 17063 16126 9622 6039 9462 13884 9838 9229 4174 1807 7346 12251 11440 7129 3446
12604 3446 2508 2212 2275 7301 9907 1853 -1854 -1541 -608 6109 9604 6404 9662 11702 10211 13901
12588 13901 9700 13368 12386 7694 6001 6692 4479 4660 4908 8495 4837 1326 456 -3022 -3549 5529
12572 5529 11916 12082 3614 6042 14981 15691 15899 8584 7703 8796 7162 7052 8339 13394 11510 9115
12556 9115 9472 11431 9660 6888 4444 6765 10590 16774 16588 7521 7700 7259 4277 7775 10977 12175
12540 12175 9647 2234 -465 726 8302 7507 2685 -4718 -4766 -5643 -4487 -4521 -375 -2071 4421 9329
12524 9329 7370 9712 10191 7495 3334 -4263 -4603 -920 363 4939 13925 18409 20466 19833 14094
12509 14094 12051 12990 14435 11273 10042 6418 4577 4308 1861 -614 1833 610 1440 3830 6632
$$ packed form
12620A7794J5p46r37o504l583L423M422m046o09n055k367N539M905q11m311l683
12604C446r38k96O3N026K606q054l707L13R33O717L495l200L258K040j491L690
12588A3901m201L668r82m692j693O91k213J81K48L587l658l511q70l478n27R078
12572E529O387J66q468K428Q939P10K08p315q81J093j634j10J287N055j884k395
12556I115L57J959j771k772k444K321L825O184j86r067J79m41k982L498L202J198
12540A2175k528p413k699J191P576p95m822p403m8q77J156l4M146j696O492M908
12524I329j959K342M79k696m161p597l40L683J283M576Q986M484K057o33n739
12509A4094k043R39J445l162j231l624j841k69k447k475K447j223Q30K390K802
$$ plain form
12494 6632 9324 7320 7374 10038 8780 9728 6704 3196 451 4684 -2123 1054 10298 11997 8141
12479 8141 6642 8610 11144 6056 325 2872 10717 12488 6320 4965 5735 7942 13172 13113 10920
12464 10920 10069 15497 12630 6291 594 4172 7656 9531 6302 89 1963 6591 709 1541 5467
12449 5467 12162 10550 9495 5305 5997 11605 17940 20634 21608 27244 29449 29034 36448 50414 68862
12434 68862 96129 129893 188800 278794 389836 472316 492305 438224 347669 259932 188477
12423 188477 141665 107931 87740 84353 86065 79996 72474 63162 57935 52127 49285 49215 53951 48685
12409 48685 46336 44396 35664 31303 29748 34131 40700 36677 37741 35872 40196 39943 44748 55681
12395 55681 69970 81393 100597 131771 174427 241545 337653 482551 712348 1036273 1369303
$$ packed form
12494F632K692k004N4K664j258R48l024l508k745M233o807L177R244J699l856
12479H141j499J968K534n088n731K547P845J771o168j355P70K207N230n9k193
12464A0920q51N428k867o339n697L578L484J875l229o213J874M628n882Q32L926
12449E467O695j612j055m190O92N608O335K694R74N636K205m15P414J3966J8448
12434F8862K7267L3764N8907Q9994J11042Q2480J9989n4081r0555q7737p1455
12423A88477m6812l3734k0191l387J712o069p522r312n227n808k842p0M736n266
12409D8685k349j940q732m361j555M383O569m023J064j869M324k53M805J0933
12395E5681J4289J1423J9204L1174M2656O7118R6108J44898K29797L23925L33030
$$ plain form
12384 1369303 1539987 1477911 1228790 926037 665567 482507 375236 312810 271951 245561
12374 245561 230007 199363 170980 147644 133985 119998 113279 102696 92763 84302 77950 72534
12362 72534 63631 55595 56627 58283 54395 51578 56477 59929 61091 67460 73737 77174 91565 109197
12348 109197 142341 178467 225105 301708 423973 615234 907158 1256366 1516518 1559284
12338 1559284 1382891 1081056 783494 563074 425814 334694 285733 258486 234830 211007
12328 211007 182026 157779 142965 127106 112249 100957 90716 80509 73234 70035 60036 55430
12316 55430 54943 52538 53605 51670 45105 45210 46436 46464 46680 54069 63803 66614 64790 73661 86883
12301 86883 110775 148300 201519 284407 398435 499598 547025 516354 430614 328942 238520
$$ packed form
12384A369303J70684o2076k49121l02753k60470j83060j07271o2426m0859k6390
12374B45561j5554l0644k8383k3336j3659j3987o719j0583r933q461o352n416
12362G2534q903q036J032J656l888k817M899L452J162O369O277L437J4391J7632
12348A09197L3144L6126M6638P6603J22265J91261K91924L49208K60152M2766
12338A559284j76393l01835k97562k20420j37260r1120m8961k7247k3656k3823
12328B11007k8981k4247j4814j5859j4857j1292j0241j0207p275l199r999m606
12316E5430m87k405J067j935o565J05J226K8K16P389R734K811j824Q871J3222
12301H6883K3892L7525N3219Q2888J14028J01163M7427l0671q5740j01672r0422
$$ plain form
12290 238520 179578 141985 117332 103294 92412 88299 83367 76731 69012 62562 67248 70517 67344
12277 67344 61267 55623 50818 55726 57598 55098 49146 48831 42680 32206 31543 38286 34147 22770
12263 22770 17073 17175 21374 24897 30933 31090 24043 18010 17476 20006 23295 28540 31673 24082 22264
12248 22264 20190 22209 29338 25808 28511 29726 36291 37756 34908 42086 49133 55833 54165 56493
12234 56493 55062 49307 44365 45807 46152 44470 40437 36577 37530 32851 31674 31062 31985 32734 26460 25515
12218 25515 29715 24345 24336 24434 29911 41287 43604 39437 32881 27854 26111 23345 17336 11419 14379
12203 14379 24351 30555 35570 37178 39498 44811 51625 48548 49747 50277 50208 51797 53177 54632 51717
12188 51717 48352 45750 40296 31558 27485 24610 17526 20153 23846 27100 28088 25156 25744 31309 31581
$$ packed form
12290B38520n8942l7593k4653j4038j0882m113m932o636p719o450M686L269l173
12277F7344o077n644m805M908J872k500n952l15o151j0474o63O743m139j1377
12263B2770n697J02M199L523O036J57p047o033n34K530L289N245L133p591j818
12248B2264k074K019P129l530K703J215O565J465k848P178P047O700j668K328
12234E6493j431n755m942J442L45j682m033l860R53m679j177o12R23P49o274r45
12218B5515M200n370rR8N477J1376K317m167o556n027j743k766o009n917K960
12203A4379R972O204N015J608K320N313O814l077J199N30o9J589J380J455k915
12188E1717l365k602n454q738m073k875p084K627L693L254R88k932N88N565K72
$$ plain form
12173 31581 23560 20309 19051 19737 21694 15304 9347 16949 19075 19723 18091 21498 18917 21242 24729
12158 24729 29089 35365 33963 38262 38251 38492 40789 42402 40897 46885 47266 40833 38098 34065 35624
12143 35624 31012 27787 26511 27838 23837 25508 27279 28761 23429 22924 20261 20029 21193 27506 30342
12128 30342 34497 40423 45857 51297 64605 78519 115699 167907 211007 233806 229695 197838 156291
12115 156291 115968 89250 76830 74402 62767 49580 39874 37933 34139 35119 36407 33526 31560
12102 31560 31253 29764 26537 26760 21274 17805 23398 22790 24031 24723 24464 26034 30677 30571 24329 27786
12086 27786 39772 44201 54887 71382 84132 102095 140740 193418 270114 389695 541138
12075 541138 672359 719079 665113 546455 414566 304185 229852 178419 150564 136192 123815
$$ packed form
12173C1581q021l251j258O86J957o390n957P602K126O48j632L407k581K325L487
12158B4729M360O276j402M299j1K41K297J613j505N988L81o433k735m033J559
12143C5624m612l225j276J327m001J671J771J482n332n05k663k32J164O313K836
12128C0342M155N926N434N440J3308J3914L7180N2208M3100K2799m111l1857m1547
12115A56291m0323k6718j2420k428j1635j3187r706j941l794R80J288k881j966
12102C1560l07j489l227K23n486l469N593o08J241O92k59J570M643j06o242L457
12086B7786J1986M429J0686J6495J2750J7963L8645N2678P6696J19581J51443
12075E41138J31221M6720n3966j18658j31889j10381p4333n1433k7855j4372j2377
$$ plain form
12064 123815 115670 101247 92635 87788 79357 70459 69180 66168 57624 51818 47680 47758 48255 43525 40467
12049 40467 40893 40251 39593 44866 51226 51701 52113 51184 54329 59266 66127 87657 109374 135053 169747
12034 169747 239595 348886 493317 642501 725617 716757 627000 494065 368112 276098 214620
12023 214620 173664 155265 144211 135701 124260 115069 103700 88245 76606 70568 64396 60429
12011 60429 53550 48412 48669 47494 46369 42371 40122 39958 37670 33820 39125 37424 33776 43066 49236
11996 49236 55305 60909 68356 75504 76945 89616 108865 137532 184739 234354 274448 286354 263891
11983 263891 219925 175099 141794 119255 107176 94537 84793 78065 74563 79192 71795 64121 62332
11970 62332 63664 66923 62672 57994 54719 54217 54953 58664 60128 59007 58629 65963 87669 103232 111895
$$ packed form
12064A23815q145j4423q612m847q431q898j279l012q544n806m138P8M97m730l058
12049D0467M26o42o58N273O360M75M12r29L145M937O861K1530K1717K5679L4694
12034A69747O9848J09291J44431J49184Q3116q860q9757j32935j25953r2014o1478
12023B14620m0956j8399j1054q510j1441r191j1369j5455j1639o038o172l967
12011F0429o879n138K57j175j125l998k249j64k288l850N305j701l648R290O170
11996D9236O069N604P447P148J441J2671J9249K8667M7207M9615M0094J1906k2463
11983B63891m3966m4826l3305k2539j2079j2639r744o728l502M629p397p674j789
11970F2332J332L259m251m678l275n02P36L711J464j121l78P334K1706J5563Q663
$$ plain form
11955 111895 107430 100037 88178 79407 82814 92287 90345 93588 94149 101329 103924 105960 98909 101455
11941 101455 103530 108836 110714 111318 117110 125341 124470 124863 131094 132110 127990 113440 108689 102917 101134
11926 101134 104258 105874 105759 102117 102970 109304 109147 103478 103928 110861 123076 129487 133964 146351 163350
11911 163350 186770 217211 243917 262847 277818 288167 289375 294717 311425 331216 352483 378488
11899 378488 412714 451187 498120 562461 640151 729935 816657 889907 939338 961342 967081 942901
11887 942901 905723 862917 824105 791052 739055 680112 638528 612142 604661 619557 644270 665631
11875 665631 677182 673583 658713 637705 637915 665403 701333 733316 759190 785304 813736 854432
11863 854432 914843 1003696 1128071 1285870 1465701 1662695 1870981 2090612 2312031 2531668
$$ packed form
11955A11895m465p393j1859q771L407R473j942L243N61P180K595K036p051K546
11941A01455K075N306J878O04N792Q231q71L93O231J016m120j4550m751n772j783
11926A01134L124J616j15l642Q53O334j57n669M50O933J2215O411M477J2387J6999
11911A63350K3420L0441K6706J8930J4971J0349J208N342J6708J9791K1267K6005
11899C78488L4226L8473M6933O4341P7690Q9784Q6722P3250M9431K2004N739k4180
11887I42901l7178m2806l8812l3053n1997n8943m1584k6386p481J4896K4713K1361
11875F65631J1551l599j4870k1008K10K7488L5930L1983K5874K6114K8432M0696
11863H54432O0411Q8853J24375J57799J79831J96994K08286K19631K21419K19637
$$ plain form
11853 2531668 2768482 3019373 3274770 3492837 3616999 3633329 3579322 3493121 3388935 3266697
11843 3266697 3109747 2922480 2746249 2607576 2529465 2513035 2531634 2535990 2472735 2327057
11833 2327057 2131776 1927700 1753709 1627837 1550611 1512598 1516439 1548691 1601958 1697569 1849552
11822 1849552 2068831 2369802 2747666 3163008 3578083 3952558 4266406 4534453 4796738
11813 4796738 5088668 5435857 5821655 6195058 6494533 6689707 6779196 6772076 6701249 6557354
11803 6557354 6338564 6055266 5731782 5442732 5217214 5058539 4932169 4766501 4521112
11794 4521112 4174734 3763022 3337034 2945714 2621604 2373542 2202631 2095032 2054768 2074317
11784 2074317 2153872 2312139 2566352 2905010 3300921 3713745 4080185 4350890 4505563 4591239
$$ packed form
11853B531668K36814K50891K55397K18067J24162J6330n4007q6201j04186j22238
11843C266697j56950j87267j76231j38673p8111j6430J8599M356o3255j45678
11833B327057j95281k04076j73991j25872p7226l8013L841L2252N3267R5611J51983
11822A849552K19279L00971L77864M15342M15075L74475L13848K68047K62285
11813D796738K91930L47189L85798L73403K99475J95174Q9489p120p0827j43895
11803F557354k18790k83298l23484k89050k25518j58675j26370j65668k45389
11794D521112l46378m11712m25988l91320l24110k48062j70911j07599m0264J9549
11784B074317P9555J58267K54213L38658L95911M12824L66440K70705J54673Q5676
$$ plain form
11774 4591239 4692806 4875641 5154705 5517529 5920702 6315105 6669772 6959931 7161247
11765 7161247 7241434 7172568 6949303 6618634 6235118 5860206 5525503 5243008 4985737 4723987
11755 4723987 4421988 4070271 3688551 3290472 2906301 2562571 2270278 2044878 1870183
11746 1870183 1745729 1680130 1676647 1736217 1857358 2027532 2211550 2363583 2445086 2449233 2397874
11735 2397874 2325253 2283102 2306853 2421199 2618245 2883652 3194551 3514294 3802968 4031301
11725 4031301 4161081 4149253 4007588 3775304 3499323 3244242 3020345 2817460 2634379 2455588
11715 2455588 2279874 2114814 1961875 1798887 1630752 1455215 1278078 1121545 991605
11706 991605 885173 808508 766817 748642 751392 765703 779462 775430 744130 695253 639669 593938
$$ packed form
11774D591239J01567J82835K79064L62824M03173L94403L54667K90159K01316
11765G161247Q0187o8866k23265l30669l83516l74912l34703k82495k57271k61750
11755D723987l01999l51717l81720l98079l84171l43730k92293k25400j74695
11746A870183j24454o5599l483N9570J21141J70174J84018J52033Q1503M147n1359
11735B397874p2621m2151K3751J14346J97046K65407L10899L19743K88674K28333
11725D031301J29780j1828j41665k32284k75981k55081k23897k02885j83081j78791
11715B455588j75714j65060j52939j62988j68135j75537j77137j56533j29940
11706I91605j06432p6665m1691j8175K750J4311J3759m032l1300m8877n5584m5731
$$ plain form
11694 593938 567291 553778 562572 604409 675654 765814 861301 949382 1030654 1073876 1073457 1039859
11682 1039859 974726 903226 843246 792351 745549 706039 663978 623895 582579 552855 522078
11671 522078 490419 453291 415034 370659 324044 291470 264830 245989 231768 217242 206234
11660 206234 193116 178983 164612 158947 156607 153527 151025 148075 142155 134653 126594 124368 121488
11647 121488 122399 120627 121473 123236 120725 124526 130327 133462 141966 152305 151303 154783 151929 142299
11633 142299 144547 148864 145883 142121 143715 151638 160781 166404 174024 178448 181015 178602 166722 162530
11619 162530 164733 171604 185785 203227 224845 255471 288649 321959 343323 354188 353496 331910
11607 331910 304432 278974 247959 225826 215352 211592 212126 205365 196571 194225 191752 193428 192565
$$ packed form
11694E93938k6647j3513Q794M1837P1245R0160R5487Q8081Q1272M3222m19l3598
11682A039859o5133p1500n9980n0895m6802l9510m2061m0083m1316k9724l0777
11671E22078l1659l7128l8257m4375m6615l2574k6640j8841j4221j4526j1008
11660B06234j3118j4133j4371n665k340l080k502k950n920p502q059k226k880
11647A21488R11j772Q46J763k511L801N801L135Q504J0339j002L480k854r630
11633A42299K248M317k981l762J594P923R143N623P620M424K567k413j1880m192
11619A62530K203O871J4181J7442K1618L0626L3178L3310K1364J0865o92k1586
11607C31910k7478k5458l1015k2133j0474l760N34o761q794k346k473J676q63
$$ plain form
11594 192565 197272 196995 200918 207701 221829 241432 264779 291625 324432 356108 390230 423018
11582 423018 462730 519252 577466 635466 707887 793840 899448 1016059 1132925 1246339 1333123
11571 1333123 1387856 1414744 1417472 1410929 1425837 1480501 1576933 1708409 1822038 1867789 1838090
11560 1838090 1748489 1659358 1601239 1592913 1657234 1769898 1921528 2110206 2329924 2580429
11550 2580429 2840289 3036587 3118224 3046031 2856752 2629001 2424689 2290348 2257600 2332216
11540 2332216 2502432 2741394 3019302 3312461 3598322 3847366 4034939 4172856 4283473
11531 4283473 4394426 4516853 4668219 4876483 5160237 5557774 6081626 6668421 7191359
11522 7191359 7541719 7699754 7716103 7703057 7760935 7939627 8263364 8749814 9342761 9956493
$$ packed form
11594A92565M707k77L923O783J4128J9603K3347K6846L2807L1676L4122L2788
11582D23018L9712N6522N8214N8000P2421Q5953J05608J16611J16866J13414Q6784
11571A333123N4733K6888K728o543J4908N4664R6432J31476J13629M5751k9699
11560A838090q9601q9131n8119q326O4321J12664J51630J88678K19718K50505
11550B580429K59860J96298Q1637p2193j89279k27751k04312j34341l2748P4616
11540B332216J70216K38962K77908K93159K85861K49044J87573J37917J10617
11531D283473J10953J22427J51366K08264K83754L97537N23852N86795N22938
11522G191359L50360J58035J6349j3046N7878J78692L23737M86450N92947O13732
$$ plain form
11512 9956493 10539689 11050498 11419873 11519671 11231990 10576579 9724957 8868932 8165356 7659931
11502 7659931 7345629 7197436 7179290 7288239 7491267 7781700 8115604 8446388 8715475 8912568
11492 8912568 9088804 9326180 9687770 10176713 10761147 11425684 12182468 13028780 13927242
11483 13927242 14811832 15624416 16342568 16924285 17356582 17694149 18017494 18393561 18835109
11474 18835109 19276356 19591404 19679141 19515689 19084548 18400599 17495636 16475492 15483469
11465 15483469 14628555 13925558 13346307 12842100 12369248 11895394 11425894 11015082 10746289
11456 10746289 10662978 10734408 10850673 10952128 11076935 11329643 11796733 12497005 13385996 14403189
11446 14403189 15469899 16515851 17470979 18287196 18930947 19377634 19579927 19560953 19423975
$$ packed form
11512I956493N83196N10809L69375R9798k87681o55411q51622q56025p03576n05425
11502G659931l14302j48193j8146J08949K03028K90433L33904L30784K69087J97093
11492H912568J76236K37376L61590M88943N84434O64537P56784Q46312Q98462
11483A3927242Q84590Q12584P18152N81717M32297L37567L23345L76067M41548
11474A8835109M41247L15048Q7737j63452m31141o83949r04963j020144r92023
11465A5483469q54914p02997n79251n04207m72852m73854m69500m10812k68793
11456A0746289q3311P1430J16265J01455J24807K52708M67090P00272Q88991J017193
11446A4403189J066710J045952R55128Q16217O43751M46687K02293j8974j36978
$$ plain form
11437 19423975 19275413 19183916 19155629 19106118 18938773 18599782 18039834 17267860 16345255 15398317
11427 15398317 14546999 13859496 13314791 12810594 12288767 11734388 11170508 10605938 10053530
11418 10053530 9528724 9058425 8658452 8308089 8006795 7762394 7637581 7695103 7985348
11409 7985348 8514370 9251739 10114683 10965630 11660975 12090877 12212045 12051486 11674542
11400 11674542 11166045 10613573 10114216 9748339 9547892 9512439 9598367 9741976 9846901 9777219
11390 9777219 9450767 8895249 8225196 7575523 7028526 6587201 6206529 5855532 5534586
11381 5534586 5253212 5028343 4847661 4684238 4504483 4301172 4066314 3793936 3516126
11372 3516126 3281020 3134389 3104394 3187550 3356824 3549882 3703770 3762827 3701146 3520058
$$ packed form
11437A9423975j48562r1497k8287m9511j67345l38991n59948p71974r22605r46938
11427A5398317q51318o87503n44705n04197n21827n54379n63880n64570n52408
11418A0053530n24806m70299l99973l50363l01294k44401j24813N7522K90245
11409G985348N29022P37369Q62944Q50947O95345M29902J21168j60559l76944
11400A1674542n08497n52472m99357l65877k00447l5453Q5928J43609J04925o9682
11390I777219l26452n55518o70053o49673n46997m41325l80672l50997l20946
11381E534586k81374k24869j80682j63423j79755k03311k34858k72378k77810
11372C516126k35106j46631k9995Q3156J69274J93058J53888N9057o1681j81088
$$ plain form
11362 3520058 3271309 3004311 2755802 2548863 2390241 2295499 2281514 2339311 2476356 2644455
11352 2644455 2792401 2856924 2794752 2615042 2359269 2104355 1883346 1700251 1562267 1469215
11342 1469215 1408155 1372166 1351859 1341969 1352713 1353347 1331146 1290964 1224042 1125155 1015596 903258
11330 903258 814863 740653 677454 621305 567077 521650 477624 445230 412722 389836 369663
11319 369663 355790 348623 349424 349744 354108 358411 368400 382669 395498 393972 381185 364208 338047
11306 338047 309419 290697 277007 270136 263617 264095 276711 293200 311526 327807 329549 321273 307282
11293 307282 291787 278103 266172 261701 258234 250158 231833 212002 192051 179897 174717 164774
11281 164774 159434 154913 148854 148783 150016 142259 139534 138746 131254 121655 117970 119669 116814 109390 104785
$$ packed form
11362C520058k48749k66998k48509k06939j58622r4742j3985N7797J37045J68099
11352B644455J47946O4523o2172j79710k55773k54914k21009j83095j37984r3052
11342A469215o1060l5989k0307r890J0744O34k2201m0182o6922r8887j09559j12338
11330I03258q8395p4210o3199n6149n4228m5427m4026l2394l2508k2886k0173
11319C69663j3873p167Q01L20M364M303R989J4269J2829j526j2787j6977k6161
11306C38047k8628j8722j3690o871o519M78J2616J6489J8326J6281J742q276j3991
11293C07282j5495j3684j1931m471l467q076j8325j9831j9951j2154n180r943
11281A64774n340m521o059p1J233p757k725p88p492r599l685J699k855p424m605
$$ plain form
11266 104785 101357 98139 96378 91945 90157 94291 94616 88551 88945 96804 94459 89117 89510 88983 88688
11251 88688 93554 94720 98298 104200 104047 101503 97708 90117 79386 71927 72964 68091 68744 69886 73790
11236 73790 76573 76499 73169 71506 66664 70388 73080 73088 75903 76557 69096 65759 65253 64073 63252 58271
11220 58271 50188 50819 51721 52560 59887 61202 52405 50454 50666 54829 61052 59438 54234 58530 56253
11205 56253 53369 54062 54682 52260 48976 48566 46767 44873 46044 48600 50615 53323 50256 51026 42279
11190 42279 41822 42222 49493 58830 61849 55557 54630 57359 56460 50656 53291 57390 56505 49378 49801 47340
11174 47340 46557 43671 47089 56005 57613 50858 43040 39238 43640 49247 46134 45640 53720 51010 49188
11159 49188 45384 44033 47783 45658 42312 42259 41038 39470 40548 36702 35018 29402 30329 36466 43295
$$ packed form
11266A04785l428l218j761m433j788M134L25o065L94P859k345n342L93n27k95
11251H8688M866J166L578N902j53k544l795p591j0731p459J037m873O53J142L904
11236G3790K783p4l330j663m842L724K692QK815O54p461l337n06j180q21m981
11220E8271q083O31R02Q39P327J315q797j951K12M163O223j614n204M296k277
11205E6253k884O93O20k422l284m10j799j894J171K556K015K708l067P70q747
11190D2279m57M00P271R337L019o292r27K729q99n804K635M099q85p127M23k461
11174D7340p83k886L418Q916J608o755p818l802M402N607l113m94Q080k710j822
11159D9188l804j351L750k125l346n3j221j568J078l846j684n616R27O137O829
$$ plain form
11144 43295 37776 37259 39933 41969 45071 49477 45324 40810 39472 36466 39302 41291 46569 51110 49799
11129 49799 47210 44738 39035 36721 42952 45888 47465 42933 34532 30238 34220 32173 29775 29635 31915
11114 31915 39937 40167 45525 47259 43759 41863 43345 47046 50798 52028 48465 46848 41310 40565 44646
11099 44646 51899 59478 65569 59457 55448 62400 67907 69643 70102 67302 65400 67281 69391 68306 72204
11084 72204 75112 77638 75641 68885 62720 65796 66773 66651 67913 66024 61624 57413 56578 51533 52342
11069 52342 59264 61144 53092 56253 61079 60863 65090 65909 67600 68594 64314 70198 76552 84007 85634
11054 85634 89620 91722 98303 104639 109662 119909 125965 120396 119243 127364 137550 134578 132371 127646
11040 127646 112359 99929 96017 86911 74402 71592 71232 67584 71550 69444 65772 66751 76201 80245
$$ packed form
11144D3295n519n17K674K036L102M406m153m514j338l006K836J989N278M541j311
11129D9799k589k472n703k314O231K936J577m532q401m294L982k047k398j40K280
11114C1915Q022K30N358J734l500j896J482L701L752J230l563j617n538p45M081
11099D4646P253P579O091o112m009O952N507J736M59k800j902J881K110j085L898
11084G2204K908K526j997o756o165L076R77j22J262j889m400m211q35n045Q09
11069E2342O922J880q052L161M826k16M227Q19J691R94m280N884O354P455J627
11054H5634L986K102O581O336N023J0247O056n569j153Q121J0186k972k207m725
11040A27646j5287j2430l912r106j2509k810l60l648L966k106l672R79R450M044
$$ plain form
11026 80245 76864 82152 85996 86510 89803 88362 87962 90422 86631 86805 81239 78634 80801 83057 94899
11011 94899 104377 114917 122792 122470 118349 124149 128971 129224 127285 125551 126655 124296 120038 115100 115481
10996 115481 109426 98024 80621 72254 76654 79792 82713 78547 74627 72760 71944 76333 67928 68202
10982 68202 69628 74670 71254 67510 63572 61418 57169 48970 51580 51233 52596 54980 60961 67597 73904
10967 73904 79056 80896 78520 78660 75281 79148 86612 88555 83604 77191 71289 65725 66988 61372 52666
10952 52666 45906 41121 42106 41068 44074 44739 46177 44750 43948 35558 32432 31096 29313 30384 28057
10937 28057 27018 30708 36555 35763 31825 31488 30878 34733 37784 38755 36524 38072 42262 39402 33149
10922 33149 35530 41582 44118 39138 30948 27912 31477 31607 32267 33949 31517 30661 23002 23893 24608 23317
$$ packed form
11026H0245l381N288L844N14L293j441m00K460l791J74n566k605K167K256J1842
11011I4899R478J0540P875l22m121N800M822K53j939j734J104k359m258m938L81
10996A15481o055j1402j7403q367M400L138K921m166l920j867q16M389q405K74
10982F8202J426N042l416l744l938k154m249q199K610l47J363K384N981O636O307
10967G3904N152J840k376J40l379L867P464J943m951o413n902n564J263n616q706
10952E2666o760m785R85j038L006O65J438j427q02q390l126j336j783J071k327
10937B8057j039L690N847p92l938l37o10L855L051R71k231J548M190k860o253
10922C3149K381O052K536m980q190l036L565J30O60J682k432q56p659Q91P15j291
$$ plain form
10906 23317 22826 24104 22188 22380 22003 21684 18252 18080 25640 28415 20308 14306 15295 17543 18074 15182
10890 15182 11060 12075 18631 22461 22865 21412 21238 19577 22753 22965 19134 10732 2934 6389 10664
10875 10664 13982 20397 23006 24580 27970 26834 31263 26803 27825 27336 26132 26755 26182 23877 17286
10860 17286 19289 21836 18836 26699 27488 24154 24003 23494 19452 16879 14906 17711 22681 25070 26325
10845 26325 25758 23498 25968 25670 26585 23885 20946 19019 18665 16571 13023 14717 22009 25060 20035
10830 20035 18249 14504 19867 26038 20270 19880 24339 27505 24198 16202 18519 11713 13144 14868 10858
10815 10858 9067 12966 22071 24740 20657 23507 17092 13745 15740 19188 19665 16521 13853 16896 21774
10800 21774 23549 26380 26198 24825 23044 20688 12304 10748 13506 10561 10759 10087 13705 18689 23245
$$ packed form
10906B3317m91J278j916J92l77l19l432j72P560K775q107o002R89K248N31k892
10890A5182m122J015O556L830M04j453j74j661L176K12l831q402p798L455M275
10875A0664L318O415K609J574L390j136M429m460J022m89j204O23n73k305o591
10860A7286K003K547l000P863P89l334j51n09m042k573j973K805M970K389J255
10845B6325n67k260K470k98R15k700k939j927l54k094l548J694P292L051n025
10830B0035j786l745N363O171n768l90M459L166l307p996K317o806J431J724m010
10815A0858j791L899R105K669m083K850o415l347J995L448M77l144k668L043M878
10800B1774J775K831j82j373j781k356q384j556K758k945J98o72L618M984M556
$$ plain form
10785 23245 23188 22251 12302 12611 21717 29170 29851 25334 18302 20285 17977 23188 24068 27199 25531 25277
10769 25277 28685 28856 27005 29389 21882 17666 20910 20742 22482 21219 19961 22551 24256 20308 18048
10754 18048 20445 21393 19694 15511 20536 20767 20985 17940 18073 16144 22665 24582 26461 27056 22715 22605
10738 22605 19919 17333 25270 26066 18941 16803 14972 11330 11172 13710 17271 18865 22458 20885 24995
10723 24995 27790 20940 15262 15762 13862 13741 13577 10134 9662 15753 20071 23931 23051 21097 14999 19201
10707 19201 25391 26499 25359 24885 27137 25037 13338 9160 14024 21343 24368 31207 41590 38802
10693 38802 36216 38718 37029 38204 35061 32468 34824 34985 36369 34270 33987 37779 36257 36156 37024
10678 37024 35733 31954 33774 35268 35973 28756 25126 25295 25754 24219 23927 31322 37429 37190 44335 47158
$$ packed form
10785B3245n7r37r949L09R106P453O81m517p032J983k308N211Q80L131j668k54
10769B5277L408J71j851K384p507m216L244j68J740j263j258K590J705l948k260
10754A8048K397R48j699m183N025K31K18l045J33j929O521J917J879N95m341j10
10738B2605k686k586P937P96p125k138j831l642j58K538L561J594L593j573M110
10723B4995K795o850n678N00j900j21j64l443m72O091M318L860q80j954o098M202
10707A9201O190J108j140m74K252k100j1699m178M864P319L025O839J0383k788
10693C8802k586K502j689J175l143k593K356J61J384k099k83L792j522j01Q68
10678C7024j291l779J820J494P05p217l630J69M59j535k92P395O107k39P145K823
$$ plain form
10662 47158 51474 51835 47206 45275 43987 38509 34551 40641 36958 38640 44283 46393 48581 46325 43142
10647 43142 31595 30992 36520 34139 28002 24386 25208 35113 37065 32245 33442 37361 41456 45840 36526
10632 36526 33279 31786 35400 35041 36772 40749 45410 46057 39929 42581 51387 47033 43442 42407 42287
10617 42287 41345 38955 37152 35953 40684 35743 33714 37890 34120 29893 24609 30067 36057 39732 36147
10602 36147 41939 44088 52625 54069 46340 41352 46021 46704 48667 54214 57608 64186 77898 93394
10588 93394 101035 101437 99379 103049 106448 105689 103705 101557 97187 89806 83825 81588 86881 85911 87588
10573 87588 94835 103028 103760 102799 100819 93816 86563 82158 72908 62934 57947 56965 61606 68209 74656
10558 74656 73290 71192 78417 83228 93250 101771 103994 97867 94146 89111 84968 86165 89250 89132
$$ packed form
10662D7158M316L61m629j931j288n478l958O090l683J682N643K110K188k256l183
10647D3142j1547o03N528k381o137l616Q22R905J952m820J197L919M095M384r314
10632C6526l247j493L614l59J731L977M661O47o128K652Q806m354l591j035j20
10617D2287r42k390j803j199M731m941k029M176l770m227n284N458N990L675l585
10602C6147N792K149Q537J444p729m988M669O83J963N547L394O578J3712J5496
10588I3394P641M02k058L670L399p59j984k148m370p381n981k237N293r70J677
10573H7588P247Q193P32r61j980p003p253m405r250r974m987r82M641O603O447
10558G4656j366k098P225M811J0022Q521K223o127l721n035m143J197L085j18
$$ plain form
10544 89132 92463 93431 101793 107793 103714 102818 99699 95978 85830 81428 79567 75939 66205 58250 57954
10529 57954 68538 77655 82936 91205 100093 108334 118359 125246 125957 132241 137019 141532 150081 150887
10515 150887 154984 161941 163224 167049 177199 189642 196140 190706 181036 168140 153042 145001 140447
10502 140447 134166 128795 119940 117713 115990 113142 106716 115936 124492 129039 134377 131637 126350 123970
10488 123970 125588 122212 121410 120074 121252 120800 117699 112059 112907 114139 113881 108481 107748 108659 104393 97887
10472 97887 92362 89941 90921 91431 90103 89695 98591 113974 120728 125613 128241 131192 138308 154583 163070
10457 163070 171789 181299 183140 179609 187331 193831 192230 185781 184047 182362 179239 176031 169352 161347
10443 161347 149949 141494 142209 142736 130613 125076 112656 96809 84146 75085 68521 57426 59092
$$ packed form
10544H9132L331R68Q362O000m079q96l119l721j0148m402j861l628r734p955k96
10529E7954J0584R117N281Q269Q888Q241J0025O887P11O284M778M513Q549Q06
10515A50887M097O957J283L825J0150J2443O498n434r670j2896j5098q041m554
10502A40447o281n371q855k227j723k848o426R220Q556M547N338k740n287k380
10488A23970J618l376q02j336J178m52l101n640Q48J232k58n400p33R11m266o506
10472I7887n525k421R80N10j328m08Q896J5383O754M885K628K951P116J6275Q487
10457A63070Q719R510J841l531P722O500j601o449j734j685l123l208o679q005
10443A61347j1398q455P15N27j2123n537j2420j5847j2663r061o564j1095J666
$$ plain form
10430 59092 60265 57709 51360 45940 43161 43482 46965 36806 27201 28306 30919 32193 34717 38729
10416 38729 34521 38335 46823 43777 44167 59545 70943 77962 91676 104084 112235 110243 117760 121387
10402 121387 120621 125568 134576 140387 137750 135677 137096 130609 126970 122301 124216 130129 128930 124755
10388 124755 114932 106698 94822 83237 73451 65399 62539 61032 52833 44325 41235 41071 39843 35618
10374 35618 36008 39223 33901 33216 33488 34342 28455 24612 25819 32673 37210 35262 31806 24268 27329
10359 27329 25740 30377 37982 42532 44177 47109 47040 51508 58613 56677 59839 65581 66270 66226 68734 77283
10343 77283 78599 72699 72552 74299 78843 81448 78955 67986 61088 63895 66796 61562 56723 55969 45679
10328 45679 41373 46770 48131 47634 49735 51918 44752 42270 39474 38212 36391 40070 43736 36378 28636
$$ packed form
10430E9092J173k556o349n420k779L21L483j0159r605J105K613J274K524M012
10416C8729m208L814Q488l046L90J5378J1398P019J3714J2408Q151j992P517L627
10402A21387p66M947R008N811k637k073J419o487l639m669J915N913j199m175
10388A24755r823q234j1876j1585r786q052k860j507q199q508l090j64j228m225
10374C5618L90L215n322o85K72Q54n887l843J207O854M537j948l456p538L061
10359B7329j589M637P605M550J645K932o9M468P105j936L162N742O89m4K508Q549
10343G7283J316n900j47J747M544K605k493j0969o898K807K901n234m839p54j0290
10328D5679m306N397J361m97K101K183p166k482k796j262j821L679L666p358p742
$$ plain form
10313 28636 34580 37217 33833 34644 33927 32524 36152 38597 41626 39361 35506 37124 36803 32418 39956
10298 39956 47285 55318 59181 52341 53709 59445 65004 64523 68302 63751 62908 65284 69398 70260 64770
10283 64770 68981 73998 75083 70669 59042 58559 55867 64101 71492 68910 70489 65910 58519 58448 56763
10268 56763 55854 58236 60661 58291 56637 56686 56786 45981 41324 44652 44255 43577 39667 32497 31098 33835
10252 33835 30934 34231 36273 37860 41028 38933 35267 29947 27473 27051 28202 29589 26502 24408 28418
10237 28418 27330 29592 35672 31899 31680 33136 30483 31491 37745 37801 36877 35065 35978 33386 32130 33974
10221 33974 35081 29729 30002 29568 30858 37793 38415 31830 28258 32833 39113 36479 30698 26888 29245
10206 29245 29660 32185 26873 26834 32929 38837 37666 35740 36937 38794 36077 37528 37565 34697 33447 39050
$$ packed form
10313B8636N944K637l384Q11p17j403L628K445L029k265l855J618l21m385P538
10298C9956P329Q033L863o840J368N736N559m81L779m551q43K376M114Q62n490
10283F4770M211N017J085m414j1627m83k692Q234P391k582J579m579p391p1j685
10268E6763r09K382K425k370j654M9J00j0805m657L328l97o78l910p170j399K737
10252C3835k901L297K042J587L168k095l666n320k474m22J151J387l087k094M010
10237B8418j088K262O080l773k19J456k653J008O254N6r24j812R13k592j256J844
10221C3974J107n352K73m34J290O935O22o585l572M575O280k634n781l810K357
10206B9245M15K525n312l9O095N908j171j926J197J857k717J451L7k868j250N603
$$ plain form
10190 39050 38011 35887 32895 25055 27074 30574 31400 31394 27981 25953 32978 33708 33663 31457 33098 36287
10174 36287 37071 36964 39283 41037 45500 47188 43223 46030 49218 51430 51249 52925 59932 56582 46390
10159 46390 43450 46380 46339 44750 42549 39607 33433 34858 35895 33575 35656 37384 46426 47539 47768
10144 47768 57589 58779 54009 50789 49902 45660 40379 44859 48839 51516 54387 48596 45869 43684 41092
10129 41092 49909 57464 57355 55506 56005 53604 59065 65187 62218 61334 67106 68132 63139 66497 66194
10114 66194 66196 69653 71990 68704 66283 68180 65040 66861 64407 65359 67462 64158 60523 56858 55593
10099 55593 58446 62790 62447 61216 60914 64033 66107 60905 59272 62525 63584 69050 76899 76513 72227
10084 72227 66664 62981 61397 63009 59034 54072 47955 52564 55294 52606 60726 69179 72200 78395
$$ packed form
10190C9050j039k124k992p840K019L500Q26ol413k028P025P30m5k206J641L189
10174C6287P84j07K319J754M463J688l965K807L188K212j81J676P007l350j0192
10159D6390k940K930m1j589k201k942o174J425J037k320K081J728R042J113K29
10144D7768R821J190m770l220q87m242n281M480L980K677K871n791k727k185k592
10129D1092Q817P555j09j849M99k401N461O122k969q84N772J026m993L358l03
10114F6194KL457K337l286k421J897l140J821k454R52K103l304l635l665j265
10099E5593K853M344l43j231l02L119K074n202j633L253J059N466P849l86m286
10084G2227n563l683j584J612l975m962o117M609K730k688Q120Q453L021O195
$$ plain form
10070 78395 78998 77404 74047 80101 79368 78586 74313 71762 70193 64871 62172 61167 53546 52377 51661
10055 51661 57496 61772 60355 61621 66091 72198 71299 72287 72039 75225 78746 69559 64802 67990 66319
10040 66319 66636 62160 58847 59944 61355 55674 56321 62832 67098 72145 77016 72408 67700 74413 79356
10025 79356 84291 83812 78604 77656 73479 66294 67022 71492 78812 82168 82889 84334 88204 101187 107949
10010 107949 111616 107171 96129 89925 85990 85099 82431 75772 66618 59305 59508 64174 61784 58145
9996 58145 57889 65162 71305 71089 74390 77544 80471 79750 74653 73951 78922 81019 80340 80284 85389 86419
9980 86419 84575 80557 89415 98128 109942 118832 126264 137623 147389 149329 155650 165786 172147 177183
9966 177183 181401 174965 166291 150971 130864 119894 116548 107375 108263 109618 118608 126261 125534 129480
$$ packed form
10070G8395O03j594l357O054p33p82m273k551j569n322k699j005p621j169p16
10055E1661N835M276j417J266M470O107q99R88k48L186L521r187m757L188j671
10040F6319L17m476l313J097J411n681O47O511M266N047M871m608m708O713M943
10025G9356M935m79n208r48m177p185P28M470P320L356P21J445L870J2983O762
10010A07949L667m445j1042o204l935q91k668o659r154p313K03M666k390l639
9996E8145k56P273O143k16L301L154K927p21n097p02M971K097o79n6N105J030
9980H6419j844m018Q858Q713J1814Q890P432J1359R766J940O321J0136O361N036
9966A77183M218o436q674j5320k0107j0970l346r173Q88J355Q990P653p27L946
$$ plain form
9952 129480 126347 124022 120784 105029 91945 88893 89116 85720 91731 97204 93744 93362 102368 111384
9938 111384 128101 148608 160347 174303 188928 195902 192886 181821 177118 174434 168222 163678 164517
9925 164517 157128 156246 154278 160190 176361 193174 209844 214810 209493 204168 197143 186791 179427 184290
9911 184290 195724 206187 212032 206313 197705 188711 171071 150746 137748 129542 130200 131134 134597 140339
9897 140339 148569 156617 166424 175307 181938 190428 199468 220967 246690 270385 285463 290010 279520
9884 279520 253776 226578 204125 199421 200698 209165 232553 253699 264941 266700 259351 245465 230236
9871 230236 217110 204803 193137 176702 160617 153369 152365 160150 165406 175127 182152 185057 189678
9858 189678 197046 201789 207465 210149 211964 209275 205782 206997 203738 197715 193319 187195 181828 181844 190084
$$ packed form
9952A29480l133k325l238j5755j3084l052K23l396O011N473l460l82R006R016
9938A11384J6717K0507J1739J3956J4625O974l016j1065m703k684o212m544Q39
9925A64517p389q82j968N912J6171J6813J6670M966n317n325p025j0352p364M863
9911A84290J1434J0463N845n719q608q994j7640k0325j2998q206O58R34L463N742
9897A40339Q230Q048R807Q883O631Q490R040K1499K5723K3695J5078M547j0490
9884B79520k5744k7198k2453m704J277Q467K3388K1146J1242J759p349j3886j5229
9871B30236j3126j2307j1666j6435j6085p248j004P785N256R721P025K905M621
9858A89678P368M743N676K684J815k689l493J215l259o023m396o124n367J6Q240
$$ plain form
9843 190084 202867 213383 232908 251636 267970 268830 255832 246491 245465 240679 245021 251792 269313
9830 269313 288936 305475 317794 313781 295545 276892 256840 235597 223149 212479 196916 181703
9818 181703 175315 165292 158337 157820 159969 157111 158338 151287 159350 181032 188929 192548 196103 194186
9804 194186 192747 194513 196378 202530 224581 255188 293760 335796 393543 457528 514116 544593
9792 544593 530321 475717 410925 352269 309937 279663 262272 253132 254203 258700 270967 282928
9780 282928 286967 281682 269133 269010 278989 293243 328170 377320 453062 566495 703804 826459
9768 826459 898842 899909 845486 781265 753362 768436 834670 954786 1141870 1334585 1460166
9757 1460166 1502757 1467777 1403593 1353910 1351246 1411003 1524655 1661273 1769662 1789266 1709482
$$ packed form
9843A90084J2783J0516J9525J8728J6334Q60j2998r341j026m786M342O771J7521
9830B69313J9623J6539J2319m013j8236j8653k0052k1243j2448j0670j5563j5213
9818A81703o388j0023o955n17K149k858J227p051Q063K1682P897L619L555j917
9804A94186j439J766J865O152K2051L0607L8572M2036N7747O3985N6588L0477
9792E44593j4272n4604o4792n8656m2332l0274j7391r140J071M497J2267J1961
9780B82928M039n285j2549j23R979J4254L4927M9150P5742J13433J37309J22655
9768H26459P2383J067n4423o4221k7903J5074O6234J20116J87084J92715J25581
9757A460166M2591l4980o4184m9683k664N9757J13652J36618J08389J9604p9784
$$ plain form
9746 1709482 1573291 1446414 1377403 1376219 1443811 1554526 1691041 1865402 2056419 2219412
9736 2219412 2315387 2353668 2364424 2383505 2460463 2598457 2752610 2894363 2975677 2961307 2834755
9725 2834755 2615965 2355687 2111252 1902592 1724923 1569767 1438410 1343548 1308776 1349398
9715 1349398 1473985 1671208 1874557 1983353 1974912 1893591 1816142 1806294 1855162 1920220 1937971
9704 1937971 1884785 1781636 1659815 1553878 1485622 1483354 1559561 1725014 2004406 2440177
9694 2440177 3034002 3722783 4428212 5144007 5854441 6509990 7086946 7490733 7572127 7258337
9684 7258337 6627594 5852086 5108019 4506524 4041604 3681857 3424212 3288603 3265965 3300380
9674 3300380 3305640 3239076 3131592 3074928 3179636 3496318 4005333 4600623 5211803 5858783
$$ packed form
9746A709482j36191j26877o9011j184O7592J10715J36515J74361J91017J62993
9736B219412R5975L8281J0756J9081P6958J37994J54153J41753Q1314j4370j26552
9725B834755k18790k60278k44435k08660j77669j55156j31357r4862l4772M0622
9715A349398J24587J97223K03349J08796q441q1321p7449r848M8868O5058J7751
9704A937971n3186j03149j21821j05937o8256k268P6207J65453K79392M35771
9694B440177N93825O88781P05429P15795P10434O55549N76956M03787Q1394l13790
9684G258337o30743p75508p44067o01495m64920l59747k57645j35609k2638L4415
9674C300380N260o6564j07484n6664J04708L16682N09015N95290O11180O46980
$$ plain form
9664 5858783 6575531 7295924 7906611 8297531 8427991 8313098 8013517 7596486 7153242 6731442
9654 6731442 6328640 5946748 5572546 5157157 4663481 4118483 3593128 3158022 2866204 2706745
9644 2706745 2683213 2791333 3052110 3426401 3821406 4104198 4214390 4196682 4163590 4272548
9634 4272548 4653371 5367547 6353489 7436753 8388993 8922212 8850927 8263706 7411386 6494787
9624 6494787 5606024 4778398 4050698 3464212 3038632 2756113 2607272 2544920 2515019 2491312
9614 2491312 2464064 2442980 2433845 2431359 2405861 2338482 2273899 2253261 2321007 2531304 2916200
9603 2916200 3473587 4101178 4620733 4899858 4907663 4701337 4398697 4126067 3956723 3887305
9593 3887305 3862571 3829908 3736956 3580404 3373470 3145187 2948227 2817837 2800401 2937966
$$ packed form
9664E858783P16748P20393O10687L90920J30460j14893k99581m17031m43244m21800
9654F731442m02802l81892l74202m15389m93676n44998n25355m35106k91818j59459
9644B706745k3532J08120K60777L74291L95005K82792J10192j7708l3092J08958
9634D272548L80823P14176R85942J083264R52240N33219p1285n87221q52320r16599
9624F494787q88763q27626p27700n86486m25580k82519j48841o2352k9901k3707
9614B491312k7248k1084r135k486k5498o7379o4583k0638O7746K10297L84896
9603B916200N57387O27591N19555K79125P805k06326l02640k72630j69344o9418
9593C887305k4734l2663r2952j56552k06934k28283j96960j30390j7436J37565
$$ plain form
9583 2937966 3267289 3822419 4558871 5269447 5737245 5874703 5745553 5514116 5360178 5409878
9573 5409878 5744226 6384842 7274145 8208693 8914148 9113113 8704847 7840629 6821882
9564 6821882 5942278 5322307 4899956 4558952 4235505 3909563 3584788 3303038 3093793 2988072
9554 2988072 2971577 2974617 2918061 2785589 2625524 2484837 2413306 2432879 2551824 2793465 3186051
9543 3186051 3767727 4622198 5876349 7685396 10161776 13232698 16306867 18494050 19254490
9534 19254490 18501477 16630881 14305400 12137303 10501577 9573423 9325333 9525960 9893741
9525 9893741 10321750 10903715 11753651 12752638 13506961 13588248 12882162 11650577 10326303
9516 10326303 9283041 8712625 8683747 9237441 10461355 12442808 15149992 18154177 20708244
$$ packed form
9583B937966L29323N55130P36452P10576M67798J37458j29150k31437j53938M9700
9573E409878L34348O40616Q89303R34548P05455J98965m08266q64218j018747
9564F821882q79604o19971m22351l41004l23447l25942l24775k81750k09245j05721
9554B988072j6495L040n6556j32472j60065j40687p1531J9573J18945K41641L92586
9543C186051N81676Q54471J254151J809047K476380L070922L074169K187183P60440
9534A9254490p53013j870596k325481k168097j635726r28154k48090K00627L67781
9525I893741M28009N81965Q49936R98987P54323Q1287p06086j231585j324274
9516A0326303j043262n70416k8878N53694J223914J981453K707184L004185K554067
$$ plain form
9507 20708244 22153213 22166675 20906382 18872928 16686343 14824001 13595169 13168111 13657260
9498 13657260 15115479 17472428 20479935 23897309 27399980 30325611 31979521 31963760
9490 31963760 30266759 27417282 24272216 21677336 20145144 19785389 20283986 20977632 21151076
9481 21151076 20463846 19123620 17700580 16793462 16691204 17121082 17335478 16757161 15332323
9472 15332323 13476667 11723995 10443293 9754687 9659567 10181519 11375509 13197942 15307590
9463 15307590 16969831 17475485 16664202 14965111 13078320 11631838 10963647 11179621 12289973
9454 12289973 14080697 15973056 17379752 18121903 18323837 18100396 17462909 16306364 14591781
9445 14591781 12508533 10384608 8502400 7000511 5876637 5055063 4455612 3990372 3609454
$$ packed form
9507B0708244J444969J3462j260293k033454k186585j862342j228832m27058M89149
9498A3657260J458219K356949L007507L417374L502671K925631J653910j5761
9490C1963760j697001k849477l145066k594880j532192l59755M98597O93646J73444
9481B1151076o87230j340226j423040r07118j02258M29878K14396n78317j424838
9472A5332323j855656j752672j280702o88606r5120N21952J193990J822433K109648
9463A5307590J662241N05654q11283j699091j886791j446482o68191K15974J110352
9454A2289973J790724J892359J406696P42151K01934k23441o37487j156545j714583
9445A4591781k083248k123925j882208j501889j123874q21574n99451m65240l80918
$$ plain form
9436 3609454 3290100 3024268 2806532 2634785 2509232 2433045 2410018 2444758 2543653 2727124
9426 2727124 3039386 3567590 4419490 5660229 7203376 8668292 9499540 9376686 8433855
9417 8433855 7105581 5849041 4927897 4405112 4248679 4414843 4828379 5296235 5553378
9408 5553378 5457971 5041393 4457360 3846174 3301949 2854056 2521711 2307930 2203882 2209841
9398 2209841 2305863 2476455 2698092 2952047 3210765 3479510 3771271 4074964 4345812 4485668
9388 4485668 4426160 4143328 3681414 3143537 2618390 2172538 1836864 1594210 1418467 1290715
9378 1290715 1195620 1112799 1045334 996311 961885 940766 946303 993579 1090458 1239759 1410366
9367 1410366 1516457 1510703 1391469 1199890 1004116 845511 731396 650570 592105 551897
$$ packed form
9436C609454l19354k65832k17736j71747j25553p6187k3027L4740R8895J83471
9426B727124L12262N28204Q51900J240739J543147J464916Q31248j22854r42831
9417H433855j328274j256540r21144n22785j56433J66164M13536M67856K57143
9408E553378r5407m16578n84033o11186n44225m47893l32345k13781j04048N959
9398B209841R6022J70592K21637K53955K58718K68745K91761L03693K70848J39856
9388D485668n9508k82832m61914n37877n25147m45852l35674k42654j75743j27752
9378A290715r5095q2821o7465m9023l4426k1119N537M7276R6879J49301J70607
9367A410366J06091n754j19234j91579j95774j58605j14115q0826n8465m0208
$$ plain form
9357 551897 521958 499544 475107 442695 410010 383673 367500 351505 336033 326061 311777 297861
9345 297861 286723 279470 274461 273975 275572 270129 273603 276628 280313 288197 300328 301064 302764 319571
9331 319571 345757 382977 436058 518461 642776 815147 1020154 1196934 1276107 1226341 1082390
9320 1082390 908801 756336 639666 559595 506690 472956 439048 411337 390893 377211 362671
9309 362671 348990 346311 353626 368624 394956 429334 479097 537083 593195 631616 647755 635262
9297 635262 597077 541432 482342 422446 365557 325849 304030 286802 273900 266203 259007 246897
9285 246897 235567 220585 209895 202650 196150 188710 184470 184233 184361 185320 181491 183086 184333 186134
9271 186134 188698 191576 184127 176655 174621 178983 182739 179758 175021 169131 164555 159260 155824 158729
$$ packed form
9357E51897k9939k2414k4437l2412l2685k6337j6173j5995j5472r972j4284j3916
9345B97861j1138p253n009m86J597n443L474L025L685P884J2131P36J700J6807
9331C19571K6186L7220N3081Q2403J24315J72371K05007J76780P9173m9766j43951
9320A082390j73589j52465j16670q0071n2905l3734l3908k7711k0444j3682j4540
9309C62671j3681k679P315J4998K6332L4378M9763N7986N6112L8421J6139j2493
9297F35262l8185n5645n9090n9896n6889l9708k1819j7228j2902p697p196j2110
9285B46897j1330j4982j0690p245o500p440m240k37J28R59l829J595J247J801
9271A86134K564K878p449p472k034M362L756k981m737n890m576n295l436K905
$$ plain form
9257 158729 158785 159226 154137 150777 152460 143711 136038 133433 133083 141412 147068 149879 150441 148225 144036 144692
9241 144692 145281 144857 142735 138898 142904 146010 143134 141772 144406 146425 148650 155248 161713 162861 165101
9226 165101 165395 166823 163617 159244 159508 166919 167698 163401 163518 168370 172666 166250 159493 161038 160837 163855
9210 163855 162248 163351 168876 166798 159509 155849 153422 152627 149738 150307 152739 156030 152412 153442 156486
9195 156486 163331 163172 158414 160570 163496 166011 180241 189044 195947 199884 202946 206850 212106 209331
9181 209331 199751 192758 182540 176176 174968 167161 159967 154768 152573 154459 155998 156225 151386 156112
9167 156112 163207 162021 159434 159714 160174 161770 161083 163607 163487 161735 161691 161842 166202 171074 178413 189606
9151 189606 207202 220138 236953 237832 239446 242449 238932 226188 224842 221969 219497 216165 220641 215767
$$ packed form
9257A58729N6M41n089l360J683q749p673k605l50Q329N656K811N62k216m189O56
9241A44692N89m24k122l837M006L106k876j362K634K019K225O598O465J148K240
9226A65101K94J428l206m373K64P411P79m297J17M852M296o416o757J545k01L018
9210A63855j607J103N525k078p289l660k427p95k889N69K432L291l618J030L044
9195A56486O845j59m758K156K926K515J4230Q803O903L937L062L904N256k775
9181B09331r580o993j0218o364j208p807p194n199k195J886J539K27m839M726
9167A56112P095j186k587K80M60J596o87K524j20j752m4J51M360M872P339J1193
9151A89606J7596J2936J6815Q79J614L003l517j2744j346k873k472l332M476m874
$$ plain form
9137 215767 204150 202681 196704 188451 187676 190699 193902 196566 200139 202884 200796 198863 195355 190543
9123 190543 179067 173636 173633 175236 175925 178374 176469 174393 174132 181567 187691 189772 198083 219626 236861
9108 236861 248257 264891 275892 275121 276800 274786 265218 253984 246083 238325 236669 240820 246279 255090
9094 255090 269886 287724 300117 302805 295968 280774 268279 263929 258346 254538 256348 252175 247284
9081 247284 241415 244170 252167 256370 262537 260360 252464 259351 268476 275109 277797 277903 278016 271119 267099
9066 267099 269146 276310 280185 284807 290505 293975 285302 276347 278019 283082 296172 306208 320343 323776
9052 323776 323641 327730 331365 333919 326113 315823 308525 298219 292524 294719 298913 296527 300608 304500
9038 304500 301441 294423 287171 279869 277912 279429 286479 298930 315184 337458 364472 387308 395513
$$ packed form
9137B15767j1617j469n977q253p75L023L203K664L573K745k088j933l508m812
9123A90543j1476n431lJ603O89K449j905k076k61P435O124K081Q311K1543J7235
9108B36861J1396J6634J1001p71J679k014r568j1234p901p758j656M151N459Q811
9094B55090J4796J7838J2393K688o837j5194j2495m350n583l808J810m173m891
9081B47284n869K755P997M203O167k177p896O887R125O633K688J06J13o897m020
9066B67099K047P164L875M622N698L470q673q955J672N063J3090J0036J4135L433
9052C23776j35M089L635K554p806j0290p298j0306n695K195M194k386M081L892
9038C04500l059p018p252p302j957J517P050J2451J6254K2274K7014K2836Q205
$$ plain form
9025 395513 389726 374310 362845 352759 341581 337106 339088 345505 364857 382467 386428 391007 387241
9012 387241 369758 357895 353432 346996 342961 350107 356082 360587 358762 355359 348447 341805 332480 324192
8998 324192 314146 307339 304688 305895 302342 308138 312064 316040 327368 334451 337441 335980 333275 323368
8984 323368 317856 322561 321277 329434 341243 353635 363294 375526 380276 387824 400268 420220 437948
8971 437948 440685 433214 426813 417749 410737 402486 391887 382604 380284 379566 374966 372064 366593 359947
8957 359947 353533 349344 349810 350972 358018 371646 381866 385313 393820 399084 398793 399382 397577 393694 386953
8942 386953 388687 392011 395104 405205 414286 417149 416815 411315 403126 394596 389324 388452 389349 382645 384198
8927 384198 387563 390090 392157 391575 389072 395446 405793 416891 421059 416668 414855 416190 420135 426623
$$ packed form
9025C95513n787j5416j1465j0086j1178m475J982O417J9352J7610L961M579l766
9012C87241j7483j1863m463o436m035P146N975M505j825l403o912o642r325q288
8998C24192j0046o807k651J207l553N796L926L976J1328P083K990j461k705r907
8984C23368n512M705j284Q157J1809J2392R659J2232M750P548J2444J9952J7728
8971D37948K737p471o401r064p012q251j0599r283k320p18m600k902n471o646
8957C59947o414m189M66J162P046J3628J0220L447Q507N264k91N89j805l883o741
8942C86953J734L324L093J0101R081K863l34n500q189q530n272q72Q97o704J553
8927C84198L365K527K067n82k503O374J0347J1098M168m391j813J335L945O488
$$ plain form
8913 426623 431009 435503 442454 440440 432180 419539 413669 408719 405001 404251 414222 418252 418799 426059 435001
8898 435001 451566 461810 470338 483164 482106 477010 479647 480224 469769 461401 457091 448583 436082
8885 436082 432936 436593 435302 432746 435565 435030 431456 430318 426123 432346 434224 439713 449280 459227 469446
8870 469446 474401 477383 479143 476979 479711 482775 493551 503472 521349 545035 553269 553665 555297 558229
8856 558229 560262 575818 584519 586534 583074 572426 562470 552892 543726 547729 548338 543406 546629 548209
8842 548209 558067 561873 568983 578680 581152 574455 568801 568176 572166 580142 594687 606919 616293 621654
8828 621654 618886 622452 636100 642426 643688 651683 650748 647730 656986 665426 674153 681200 693825 707777
8814 707777 724596 745930 771005 800373 830636 857296 880201 911286 956204 1035275 1159689
$$ packed form
8913D26623M386M494O951k014q260j2641n870m950l718p50R971M030N47P260Q942
8898D35001J6565J0244Q528J2826j058n096K637N77j0455q368m310q508j2501
8885D36082l146L657j291k556K819n35l574j138m195O223J878N489R567R947J0219
8870D69446M955K982J760k164K732L064J0776R921J7877K3686Q234L96J632K932
8856E58229K033J5556Q701K015l460j0648r956r578r166M003O09m932L223J580
8842E48209R858L806P110R697K472o697n654o25L990P976J4545J2232R374N361
8828F21654k768L566J3648O326J262P995r35l018R256Q440Q727P047J2625J3952
8814G07777J6819K1334K5075K9368L0263K6660K2905L1085M4918P9071J24414
$$ plain form
8803 1159689 1342075 1598939 1909398 2198997 2356296 2317701 2122401 1857250 1614091 1436271
8793 1436271 1318788 1253213 1211414 1172201 1133713 1100756 1067448 1044250 1034796 1031363 1026417 1017873
8781 1017873 1007638 1005017 1004811 1011753 1024511 1043350 1069375 1097577 1128232 1149407 1161168 1176886
8769 1176886 1209770 1265738 1345641 1448869 1586704 1785118 2059278 2405100 2788463 3100423
8759 3100423 3222318 3104460 2804735 2447892 2147251 1934771 1791318 1712242 1671249 1654959
8749 1654959 1657204 1661870 1675491 1703369 1764627 1878775 2054865 2266941 2448965 2522837 2460534
8738 2460534 2303386 2118343 1951880 1841966 1782315 1754380 1761131 1781697 1813830 1847904 1892209
8727 1892209 1963036 2056589 2140258 2178489 2171704 2120122 2045781 1986835 1939795 1885378 1825730 1790527
$$ packed form
8803A159689J82386K56864L10459K89599J57299l8595j95300k65151k43159j77820
8793A436271j17483o5575m1799l9213l8488l2957l3308k3198r454l433m946q544
8781A017873j0235k621k06O942J2758J8839K6025K8202L0655K1175J1761J5718
8769A176886L2884N5968P9903J03228J37835J98414K74160L45822L83363L11960
8759C100423J21895j17858k99725l56843l00641k12480j43453p9076m0993j6290
8749A654959K245M666J3621K7878O1258J14148J76090K12076J82024P3872o2303
8738B460534j57148j85043j66463j09914n9651k7935O751K0566L2133L4074M4305
8727A892209P0827R3553Q3669L8231o785n1582p4341n8946m7040n4417n9648l5203
$$ plain form
8715 1790527 1786119 1797336 1819396 1846378 1875613 1896196 1912147 1934768 1966279 1997964 2045317 2116060
8703 2116060 2211688 2342695 2501521 2672769 2828461 2936609 3002631 3056483 3143914 3299964
8693 3299964 3549435 3842545 4109508 4330378 4557947 4878806 5377435 6044394 6710731 7154339
8683 7154339 7240912 7027477 6676595 6315282 5975062 5626233 5270838 4951885 4713362 4572360
8673 4572360 4531714 4586463 4744284 5038065 5480800 6021577 6535375 6879267 6964372 6833566
8663 6833566 6634640 6500538 6493363 6622842 6885289 7270771 7740478 8228411 8566088 8624073
8653 8624073 8409505 8026191 7635394 7382377 7366280 7630711 8190490 8930141 9565431 9834500
8643 9834500 9697546 9320460 8884065 8504435 8206934 8002933 7925363 7991457 8218362 8626509
$$ packed form
8715A790527m408J1217K2060K6982K9235K0583J5951K2621L1511L1685M7353P0743
8703B116060R5628J31007J58826J71248J55692J08148O6022N3852Q7431J56050
8693C299964K49471K93110K66963K20870K27569L20859M98629O66959O66337M43608
8683G154339Q6573k13435l50882l61313l40220l48829l55395l18953k38523j41002
8673D572360m0646N4749J57821K93781M42735N40777N13798L43892Q5105j30806
8663F833566j98926j34102p175J29479K62447L85482M69707M87933L37677N7985
8653H624073k14568l83314l90797k53017j6097K64431N59779P39651O35290K69069
8643I834500j36954l77086m36395l79630k97501k04001p7570O6094K26905M08147
$$ plain form
8633 8626509 9270103 10195355 11402287 12739346 13934027 14737174 15044576 14934342 14644456
8624 14644456 14442049 14542714 15075622 16138655 17755216 19752111 21705242 23207859 24040045
8615 24040045 24185710 23877936 23386778 22734245 21802201 20635712 19457993 18581544 18203717
8606 18203717 18277223 18606722 19140406 20011406 21348852 22917470 24075312 24413017 24071826
8597 24071826 23541632 23154942 22866058 22573965 22343152 22414295 22897575 23736835 24669301 25312924
8587 25312924 25358798 24776311 23888089 23191823 23158709 24048499 25802425 28070373 30351885
8578 30351885 32124856 33037554 33291404 33462646 34052747 35182750 36544432 37529249 37805909
8569 37805909 37386580 36501382 35425644 34240673 32946228 31680956 30575172 29653239 29011156
$$ packed form
8633H626509O43594R25252J206932J337059J194681Q03147L07402j10234k89886
8624A4644456k02407J00665N32908J063033J616561J996895J953131J502617Q32186
8615B4040045J45665l07774m91158o52533r32044j166489j177719q76449l77827
8606A8203717P3506L29499N33684Q71000J337446J568618J157842L37705l41191
8597B4071826n30194l86690k88884k92093k30813P1143M83280Q39260R32466O43623
8587B5312924M5874n82487q88222o96266l3114Q89790J753926K267948K281512
8578C0351885J772971R12698K53850J71242N90101J130003J361682R84817K76660
8569C7805909m19329q85198j075738j184971j294445j265272j105784r21933o42083
$$ plain form
8560 29011156 28799362 29073889 29696994 30213237 30123080 29411262 28531996 28000485 27895653 27734954
8550 27734954 27068293 25887852 24505150 23270095 22389046 21888424 21712785 21867311 22505434
8541 22505434 23765059 25443706 26883609 27386151 26701298 25066291 22957963 20810505
8533 20810505 18940695 17568075 16777702 16549710 16769384 17296420 18160660 19527387 21422799
8524 21422799 23513082 25177115 25681003 24646017 22401350 19623952 16943759 14701001
8516 14701001 12969485 11713532 10857066 10314816 9990101 9768114 9619958 9591311 9757342
8507 9757342 10128931 10587698 10919322 10946640 10634433 10112949 9602944 9307958 9278478 9390238
8497 9390238 9418198 9228317 8867408 8482401 8243993 8232372 8395137 8661555 8876485 8857578
$$ packed form
8560B9011156k11794K74527O23105N16243r0157p11818q79266n31511j04832j60699
8550B7734954o66661j180441j382702j235055q81049n00622j75639J54526O38123
8541B2505434J259625J678647J439903N02542o84853j635007k108328k147458
8533B0810505j869810j372620p90373k27992K19674N27036Q64240J366727J895412
8524B1422799K090283J664033N03888j034986k244667k777398k680193k242758
8516A4701001j731516j255953q56466n42250l24715k21987j48156k8647J66031
8507I757342L71589M58767L31624K7318l12207n21484n10005k94986k9480J11760
8497I390238K7960j89881l60909l85007k38408j1621J62765K66418K14930j8907
$$ plain form
8487 8857578 8580374 8165006 7828877 7742462 7938681 8378867 9096949 10040786 10796919 11019698
8477 11019698 10656244 9955316 9244852 8681900 8198193 7657831 7039114 6401525 5832356
8468 5832356 5377500 5052324 4829755 4695554 4611623 4566115 4578482 4680175 4885305 5115204
8458 5115204 5240790 5192404 5002538 4802265 4729826 4869686 5224535 5708518 6155056 6380130
8448 6380130 6285395 5938956 5503972 5130763 4892382 4772743 4711540 4691446 4708101 4770765
8438 4770765 4921592 5211295 5677879 6223061 6667265 6911181 6944367 6835975 6695963 6639103
8428 6639103 6725095 6996062 7503577 8251428 9248094 10472453 11857844 13325858 14796703
8419 14796703 16311394 18062108 20343935 23529381 28088926 34649377 44239237 58674589
$$ packed form
8487H857578k77204m15368l36129q6415J96219M40186P18082R43837P56133K22779
8477A1019698l63454p00928p10464n62952m83707n40362o18717o37589n69169
8468E832356m54856l25176k22569j34201q3931m5508J2367J01693K05130K29899
8458E115204J25586m8386j89866k00273p2439J39860L54849M83983M46538K25074
8448F380130r4735l46439m34984l73209k38381j19639o1203k0094J6655O2664
8438D770765J50827K89703M66584N45182M44204K43916L3186j08392j40012n6860
8428F639103Q5992K70967N07515P47851R96666J224359J385391J468014J470845
8419A4796703J514691J750714K281827L185446M559545O560451R589860J4435352
$$ plain form
8411 58674589 80983400 115238302 164124673 222436510 271030069 290428906 275380152
8404 275380152 234773736 184804698 139749266 106184652 83572205 69020485 59763256
8397 59763256 53456549 48198283 43219799 38708619 34920963 31834468 29208200 26808586
8389 26808586 24556329 22550673 20946745 19843170 19251127 19108281 19328122 19820723 20449296
8380 20449296 21158101 22051141 23383206 25463302 28666823 33513731 40778396 51751395
8372 51751395 68568617 94415708 132688998 183583144 238096812 276084664 281795989
8365 281795989 255455568 209379603 160141046 119589729 91247567 72781231 61016784
8358 61016784 53423288 47924692 42977831 38198121 33961102 30477400 27627396 25161683
$$ packed form
8411E8674589K2308811L4254902M8886371N8311837M8593559J9398837j5048754
8404B75380152m0606416m9969038m5055432l3564614k2612447j4551720r257229
8397E9763256o306707n258266m978484m511180l787656l086495k626268k399614
8389B6808586k252257k005656j603928j103575n92043j42846K19841M92601O28573
8380B0449296P08805Q93040J332065K080096L203521M846908P264665J0972999
8372E1751395J6817222K5847091L8273290N0894146N4513668L7987852N711325
8365B81795989k6340421m6075965m9238557m0551317k8342162j8466336j1764447
8358F1016784p593496n498596m946861m779710m237019l483702k850004k465713
$$ plain form
8350 25161683 22875331 20742537 18856489 17288333 16052870 15090409 14361586 13885407 13744928
8341 13744928 14043421 14927438 16635382 19585629 24519830 32638661 45312852 62592169
8333 62592169 80399063 90978883 90141193 79071371 63140315 47832247 36197608
8326 36197608 28391010 23368090 20165547 18050984 16399166 14827860 13347499 12067103
8318 12067103 10996782 10073899 9220880 8410665 7667778 7046122 6581090 6273288 6109531
8309 6109531 6061675 6117584 6250002 6415452 6600221 6834097 7179719 7720467 8569347 9884014
8299 9884014 11881661 14941936 19733576 27333516 39041533 55308262 73214688 85385792
8291 85385792 86610718 77158995 61885099 46449577 34407421 26305656 21135764 17904316
$$ packed form
8350B5161683k286352k132794j886048j568156j235463r62461p28823m76179j40479
8341A3744928K98493Q84017J707944K950247M934201Q118831J2674191J7279317
8333F2592169J7806894J0579820q37690j1069822j5931056j5308068j1634639
8326C6197608p806598n022920l202543k114563j651818j571306j480361j280396
8318A2067103j070321r22883q53019q10215p42887o21656m65032l07802j63757
8309F109531m7856N5909J32418J65450J84769K33876L45622N40748Q48880J314667
8299I884014J997647L060275M791640P599940J1708017J6266729J7906426J2171104
8291H5385792J224926r451723j5273896j5435522j2042156q101765n169892l231448
$$ plain form
8283 17904316 15852929 14351776 12956333 11616275 10436499 9439169 8552936 7699419 6854568
8274 6854568 6051906 5342552 4756665 4292246 3918929 3602048 3335665 3089981 2859534 2661429
8264 2661429 2488810 2332480 2191745 2051359 1912630 1794360 1688130 1607076 1548061 1508418
8254 1508418 1495052 1501317 1496162 1465294 1408375 1338068 1274740 1220889 1183167 1136753 1091798 1065048
8242 1065048 1070767 1100682 1141180 1170259 1157156 1100676 1018579 945228 892434 854370 829315 807662
8230 807662 778880 746269 717685 700746 681815 662032 644988 627253 613758 609461 609320 613423
8218 613423 627624 655922 695447 743770 782103 805875 796886 763892 719028 681176 670271 681776
8206 681776 699330 719330 728238 734300 733639 725460 705797 673988 639559 609114 585208 563079 547880
$$ packed form
8283A7904316k051387j501153j395443j340058j179776r97330q86233q53517q44851
8274F854568q02662p09354n85887m64419l73317l16881k66383k45684k30447j98105
8264B661429j72619j56330j40735j40386j38729j18270j06230q1054n9015l9643
8254A508418j3366O265n155l0868n6919p0307o3328n3851l7722m6414m4955k6750
8242A065048N719K9915M0498K9079j3103n6480q2097p3351n2794l8064k5055k1653
8230H07662k8782l2611k8584j6939j8931j9783j7044j7735j3495m297j41M103
8218F13423J4201K8298L9525M8323L8333K3772q989l2994m4864l7852j0905J1505
8206F81776J7554K0000Q908O062o61q179j9663l1809l4429l0445k3906k2129j5199
$$ plain form
8193 547880 544729 541811 533115 514787 484056 452634 434828 414071 403215 405060 400203 386683 377935
8180 377935 368903 351187 346356 359929 383457 409886 430273 446390 451178 451148 451954 449428 459978
8167 459978 479925 504911 520686 522482 507544 495419 483006 482558 500011 527249 541003 537236
8155 537236 509593 466524 426384 394386 371137 353843 332882 319463 305730 297527 293107 301451
8143 301451 326201 350883 374549 387737 389997 383664 372696 355832 332519 313438 306602 303684
8131 303684 305989 297603 294418 297987 295490 282039 266659 262818 259618 256726 248012 246383 247881 257777
8117 257777 269173 275876 274875 275072 265579 250933 240539 242730 256336 266057 267788 274207 289058
8104 289058 296222 288599 287455 288540 283181 277052 281923 279923 271620 267112 258451 253749 251105 246532
$$ packed form
8193E47880l151k918q696j8328l0731l1422j7806k0757j0856J845m857j3520q748
8180C77935r032j7716m831J3573K3528K6429K0387J6117M788l0Q06k526J0550
8167D59978J9947K4986J5775J796j4938j2125j2413m48J7453K7238J3754l767
8155E37236k7643m3069m0140l1998k3249j7294k0961j3419j3733q203m420Q344
8143C01451K4750K4682K3666J3188K260o333j0968j6864k3313j9081o836k918
8131C03684K305q386l185L569k497j3451j5380l841l200k892q714j629J498R896
8117B57777J1396O703j001J97r493j4646j0394K191J3606R721J731O419J4851
8104B89058P164p623j144J085n359o129M871k000q303m508q661m702k644m573
$$ plain form
8090 246532 246714 246045 239272 231238 222536 222266 220385 218147 214945 215880 220876 227228 233704 232746 236591 236000
8074 236000 226746 225246 225767 212964 201049 196964 200670 208692 205502 200802 204155 207219 210408 207258
8060 207258 206306 208740 211956 192172 158259 111580 75139 55879 55636 57326 58990 58845 57264 44887
8046 44887 50836 64613 77579 95149 115000 135069 151260 165864 172819 180760 180683 167198 157706
8033 157706 153115 146654 147985 161522 175333 185149 189497 190892 196005 199998 204949 217693 234437
8020 234437 256714 282756 318918 360225 413441 480634 554785 635340 756162 941853 1199652
8009 1199652 1472620 1660898 1669318 1502238 1232038 958708 742372 595191 495276 431092
7999 431092 395879 365140 340068 314372 289363 265749 247035 236902 216708 202744 192830 191703
$$ packed form
8090B46532J82o69o773q034q702k70j881k238l202R35M996O352O476r58L845n91
8074B36000r254j500N21j2803j1915m085L706Q022l190m700L353L064L189l150
8060B07258r52K434L216j9784l3913m6679l6441j9260k43J690J664j45j581j2377
8046D4887N949J3777J2966J7570J9851K0069J6191J4604O955P941p7j3485r492
8033A57706m591o461J331J3537J3811R816M348J395N113L993M951J2744J6744
8020B34437K2277K6042L6162M1307N3216O7193P4151Q0555J20822J85691K57799
8009A199652K72968J88278Q420j67080k70200k73330k16336j47181r9915o4184
7999D31092l5213l0739k5072k5696k5009k3614j8714j0133k0194j3964r914j127
$$ plain form
7987 191703 191338 187328 185387 190101 190296 185714 176730 174459 189031 219810 254646 301289 384452 508333
7973 508333 679779 897511 1157997 1437969 1664721 1740525 1632344 1388552 1104105 854182
7963 854182 664857 533011 455401 402713 364776 338335 307765 280769 252262 225534 211176
7952 211176 194201 177418 159497 152115 149541 145715 140080 134093 129413 140866 152801 164325 175329
7939 175329 194946 237295 298072 381483 476807 539081 538032 487169 409686 328426 256639 207526
7927 207526 181901 167408 158339 149172 140405 131191 124678 115337 105695 100769 96579 91551 84232 81581
7913 81581 71267 66420 68506 66016 63038 71709 78811 77483 77045 90452 104009 109233 122255 144227
7899 144227 167531 207870 264263 342115 434858 494163 510718 477217 399638 313456 245946 195797
$$ packed form
7987A91703l65m010j941M714J95m582q984k271J4572L0779L4836M6643Q3163J23881
7973E08333J71446K17732K60486K79972K26752P5804j08181k43792k84447k49923
7963H54182j89325j31846p7610n2688l7937k6441l0570k6996k8507k6728j4358
7952B11176j6975j6783j7921p382k574l826n635n987m680J1453J1935J1524J1004
7939A75329J9617M2349O0777Q3411R5324O2274j049n0863p7483q1260p1787m9113
7927B07526k5625j4493r069r167q767r214o513r341r642m926m190n028p319k651
7913H1581j0314m847K086k490k978Q671P102j328m38J3407J3557N224J3022K1972
7899A44227K3304M0339N6393P7852R2743N9305J6555l3501p7579q6182o7510n0149
$$ plain form
7887 195797 163712 138148 131169 127942 110911 102381 103759 100256 97322 94028 86833 80081 65665
7874 65665 59082 52058 49286 49930 52360 50689 55447 58353 59697 52908 57663 63197 58375 57484 58253
7859 58253 58538 63516 66050 62515 54484 44434 41285 43992 37680 34367 38909 40423 47267 49991 47875
7844 47875 50114 55390 58880 50176 45286 47996 53865 53280 47969 49263 47111 44378 40670 39765 40734
7829 40734 48757 44492 40878 44700 52162 53906 52414 49707 45843 44558 33878 27826 33744 40385
7815 40385 36978 35268 35430 39710 34321 35665 33710 34361 38037 37288 34139 28430 36544 40993 34308
7800 34308 33184 36755 35901 35334 35313 34221 31626 31985 29941 36161 31233 28601 29685 33230 34905 36708
7784 36708 45128 43089 38527 30121 25459 25996 25972 24944 25750 24716 25425 26911 28483 24515 23108 24733
$$ packed form
7887A95797l2085k5564o979l227j7031q530J378l503k934l294p195o752j4416
7874F5665o583p024k772O44K430j671M758K906J344o789M755N534m822q91P69
7859E8253K85M978K534l535q031j0050l149K707o312l313M542J514O844K724k116
7844D7875K239N276L490q704m890K710N869n85n311J294k152k733l708r05R69
7829D0734Q023m265l614L822P462J744j492k707l864j285j0680o052N918O641
7815D0385l407j710J62M280n389J344j955O51L676p49l149n709Q114M449o685
7800C4308j124L571q54n67k1j092k595L59k044O220m928k632J084L545J675J803
7784C6708Q420k039m562q406m662N37k4j028Q06j034P09J486J572l968j407J625
$$ plain form
7768 24733 22942 28616 26355 32967 36208 36529 32408 29771 28740 32218 37917 34123 31222 34328 31604
7753 31604 25027 22974 23569 22441 21700 22606 23908 22223 25424 28040 26288 18224 23461 21736 18901
7738 18901 26083 27901 25898 24154 22131 21822 28343 31621 27929 25160 22834 19218 20671 25770 27380
7723 27380 25513 21256 18086 17328 20236 19745 19990 20714 18935 18326 20665 17866 16846 21614 19782 23073
7707 23073 33054 37859 31821 24395 26092 28850 25068 20333 20453 17970 17741 19495 23987 26352 23651
7692 23651 19158 15331 16822 12715 6760 10390 15222 16019 14892 11016 14966 20099 16050 12051 17005
7677 17005 15774 15670 14246 9380 6259 11050 12383 9994 1573 -2715 1593 9212 17588 23420 23074
7662 23074 25962 23567 22716 17568 17304 14636 10830 10801 13568 18725 16065 14273 14904 12912 13517 16989
$$ packed form
7768B4733j791N674k261O612L241L21m121k637j031L478N699l794k901L106k724
7753C1604o577k053N95j128p41R06J302j685L201K616j752q064N237j725k835
7738A8901P182J818k003j744k023l09O521L278l692k769k326l616J453N099J610
7723B7380j867m257l170p58K908m91K45P24j779o09K339k799j020M768j832L291
7707B3073R981M805o038p426J697K758l782m735J20k483k29J754M492K365k701
7692B3651m493l827J491m107n955L630M832P97j127l876L950N133m049l999M954
7677A7005j231j04j424m866l121M791J333k389q421m288M308P619Q376N832l46
7662B3074K888k395q51n148k64k668l806k9K767N157k660j792O31j992O05L472
$$ plain form
7646 16989 19192 22739 17947 15074 9712 9348 12376 17693 21070 22055 24730 21877 16857 10119 11142
7631 11142 8690 6829 9940 14603 12006 9123 5311 5877 9121 14512 17023 15375 11041 6942 7043
7616 7043 10016 13864 17162 15651 15824 18016 17858 15742 12579 11156 6494 8463 9583 11938 14523
7601 14523 14625 10568 8432 12020 9398 7464 10721 12843 10833 7857 10168 12498 11024 4686 -1421
7586 -1421 1264 1651 4294 6133 7759 9975 9223 11276 16709 12830 12743 12598 10356 7681 8965 12434
7570 12434 14301 18003 12247 6816 8015 11864 6429 6792 5283 3889 4812 6182 10867 13819 6372
7555 6372 -1672 -1461 4724 14045 17328 14952 13646 12612 17340 16450 12004 10256 8679 5532 6215 4955
7539 4955 3187 353 1305 4896 -2750 -2319 1592 2833 2258 6423 1506 1864 2671 1615 3312 3526
$$ packed form
7646A6989K203L547m792k873n362l64L028N317L377R85K675k853n020o738J023
7631A1142k452j861L111M663k597k883l812N66L244N391K511j648m334m099J01
7616G043K973L848L298j511J73K192j58k116l163j423m662J969J120K355K585
7601A4523J02m057k136L588k622j934L257K122k010k976K311K330j474o338o107
7586a421K685L87K643J839J626K216p52K053N433l879q7j45k242k675J284L469
7570A2434J867L702n756n431J199L849n435L63j509j394R23J370M685K952p447
7555F372q044K11O185R321L283k376j306j034M728q90m446j748j577l147O83j260
7539D955j768k834R52L591p646M31L911J241n75M165m917L58Q07j056J697K14
$$ plain form
7523 3526 5545 8377 10724 8652 5864 10279 14105 8284 6085 6612 4722 1679 1632 1985 -361 -4146
7507 -4146 -5890 -7197 -1398 1118 35 3213 4211 5399 14032 24410 21773 20857 18954 12714 12205
7492 12205 17887 16966 13733 9933 12494 12522 3015 -914 4965 8198 12266 11002 8100 9855 11355
7477 11355 14386 20561 24225 16011 6141 10955 17097 14937 11873 9267 5022 4883 6820 3318 -773
7462 -773 -5933 -1416 6563 6980 4846 1319 -422 -3515 -9300 -7122 486 5277 5445 7970 14597 21062
7446 21062 17922 12648 6614 4273 13025 14734 10992 10430 9932 7826 6278 7582 7139 5268 5086 4944
7430 4944 7163 7848 579 -1783 4945 8548 6114 7816 8075 3488 -1350 -5527 -3581 4316 9130
7415 9130 11106 10857 11928 8924 5811 247 -2198 2917 6528 8846 9559 15112 14182 11931 11790 12035
$$ packed form
7523C526K019K832K347k072k788M415L826n821k199N27j890l043m7L53k346l785
7507d146j744j307N799K516j083L178R98J188Q633J0378k637r16j903o240n09
7492A2205N682r21l233l800K561K8r507l929N879L233M068j264k902J755J500
7477A1355L031O175L664q214r870M814O142k160l064k606m245j39J937l502m091
7462g73n160M517P979M17k134l527j741l093n785K178P608M791J68K525O627O465
7446B1062l140n274o034k341Q752J709l742n62m98k106j548J304m43j871j82j42
7430D944K219O85p269k362O728L603k434J702K59m587m838m177J946P897M814
7415I130J976k49J071l004l113n564k445N115L611K318P13N553r30k251j41K45
$$ plain form
7399 12035 6979 -6793 -1497 5962 7829 7429 11282 11462 6934 6372 9571 1929 3770 5770 6377
7384 6377 9354 13061 13798 11912 14106 7134 -2157 -24 6297 8288 5437 3335 2136 3112 1543
7369 1543 -2233 -6194 -4901 -92 2689 5720 5839 2973 2943 2760 2530 -1284 -5738 -9148 -10459 -10852
7353 -10852 -10639 -2502 5387 4004 543 -6558 -8437 -6117 -3279 -4220 -3531 -11033 -11809 -13393 -15447 -11429
7337 -11429 -3227 4239 4120 5599 4252 -569 -1072 -949 -3674 -6881 -9506 -7512 -8110 -3778 -971 6537
7321 6537 7613 4792 5021 7838 6287 7608 9031 11967 5722 196 1058 -3693 -1710 3030 1928
7306 1928 1926 -2670 -1128 5148 3277 5026 8759 691 -8052 -4214 -2926 -4093 1770 8558 9102 9565
7290 9565 6944 6038 2584 1122 475 1283 6888 9444 13658 10449 8531 15036 13916 7995 7727 -4111
$$ packed form
7399A2035n056j3772N296P459J867m00L853J80m528n62L199p642J841K000O07
7384F377K977L707P37j886K194o972r291K133O321J991k851k102j199R76j569
7369A543l776l961J293M809K781L031J19k866l0j83k30l814m454l410j311l93
7353a0852K13Q137P889j383l461p101j879K320K838r41O89p502p76j584k054M018
7337a1429Q202P466j19J479j347m821n03J23k725l207k625J994n98M332K807P508
7321F537J076k821K29K817j551J321J423K936o245n526Q62m751J983M740j102
7306A928km596J542O276j871J749L733q068q743L838J288j167N863O788N44M63
7290I565k621r06l454j462o47Q08N605K556M214l209j918O505j120n921k68j1838
$$ plain form
7274 -4111 -10471 -6502 -4624 847 6827 8119 8438 9038 13270 12069 9386 10491 5011 -3865 -3997 -1114
7258 -1114 1456 1611 2850 9269 10517 8155 6618 11476 2302 -11392 -14596 -16829 -12611 -6079 -5979
7243 -5979 -6484 -6163 -3470 117 653 5056 8119 9183 3971 1017 -802 -2658 -4970 -7148 -5612 -476
7227 -476 -4625 -7144 -4132 -3592 -6344 -5568 210 2561 -375 -4154 -2798 470 4487 2774 4086 7816
7211 7816 6929 -229 4698 6520 8015 9018 12207 13556 10391 8178 7866 385 -1319 1456 -4199
7196 -4199 -5301 -3317 -109 -1150 -2600 157 -1337 -4995 -10915 -13172 -19167 -13113 -8179 -3121 -956
7181 -956 -710 -4540 -1119 -5265 -9185 -4722 -986 2138 1342 -2128 -2676 -9106 -10606 -15682 -13327 -11233
7165 -11233 -15040 -11101 616 10530 12567 8835 5135 166 -2827 -1165 2394 2832 3140 3801 5440
$$ packed form
7274d111o360L969J878N471N980J292L19O00M232j201k683J105n480q876j32K883
7258a114K570J55J239O419J248k362j537M858r174j3694l204k233M218O532J00
7243e979n05L21K693L587N36M403L063J064n212k954j819j856k312k178J536N136
7227d76m149k519L012N40k752P76N778K351k936l779J356L268M017j713J312L730
7211G816q87p158M927J822J495J003L189J349l165k213l12p481j704K775n655
7196d199j102J984L208j041j450K757j494l658n920k257n995O054M934N058K165
7181i56K46l830L421m146l920M463L736L124p96l470n48o430j500n076K355K094
7165a1233l807L939J1717R914K037l732l700m969k993J662L559M38L08O61J639
$$ plain form
7150 5440 9625 13440 11192 4785 -433 -3488 -2110 -695 880 -912 690 4609 5572 2002 -6104
7135 -6104 -7120 3438 8754 6075 2329 -4453 -2511 -5204 -8209 -11460 -12772 -7923 -7728 -2746 -1315
7120 -1315 -5689 -6067 -5286 -5050 4761 9054 760 -139 -213 -1840 -6940 -6831 -8266 -13632 -15604 -14707 -11769
7103 -11769 -1808 3542 -2743 -324 -3570 -5212 -4043 -869 2281 3885 2050 -2429 -5153 1223 10124
7088 10124 2551 825 3996 7998 9882 4532 685 1586 2184 -139 -3567 -4704 -5271 -6810 -10075
7073 -10075 -8967 -6903 93 3051 3701 -2122 -3582 -6227 -6974 -6075 -884 -5228 -6759 2785 5594
7058 5594 4101 -1599 1105 7456 5050 4241 -1490 -6845 -5386 -5473 -369 8373 5060 6758 6979 7597
7042 7597 6124 893 2951 3885 2449 554 -1504 -10591 -12381 -2220 450 4711 -5713 -8376 -5530
$$ packed form
7150E440M185L815k248o407n218l055J378J415J575j792J602L919R63l570q106
7135f104j016J0558N316k679l746o782J942k693l005l251j312M849J95M982J431
7120a315m374l78P81K36R811M293q294q99p4j627n100J09j435n366j972Q97K938
7103a1769R961N350o285K419l246j642J169L174L150J604j835m479k724O376Q901
7088A0124p573j726L171M002J884n350l847R01N98k323l428j137n67j539l265
7073a0075J108K064O996K958O50n823j460k645p47Q99N191m344j531R544K809
7058E594j493n700K704O351k406q09n731n355J459q7N104Q742l313J698K21O18
7042G597j473n231K058R34j436j895k058r087j790J0161K670M261j0424k663K846
$$ plain form
7027 -5530 -4491 -6629 3271 10426 8977 5247 -669 -2912 334 -396 -3902 -7371 -11120 -7631 -716
7012 -716 -4921 -4321 -3506 2852 7310 4456 34 -574 506 -2172 -5069 -3647 -6422 -7605 -7542 -6136
6996 -6136 -4166 -2055 2334 -1566 -6766 -1378 -1762 602 -1269 -1444 -7303 -5202 -1984 -4615 -6372
6981 -6372 -7583 -8343 -4034 -256 -1439 -378 -4745 -2631 -1711 3880 3115 -768 -1493 -3131 -595 -4115
6965 -4115 -1431 -1178 -4921 -6077 -7471 -11106 -11963 -12894 -6571 -3101 -4209 -11039 -7715 -8334 -6817 -3544
6949 -3544 1582 3693 -8197 -8815 -37 2346 2675 408 2104 -239 -5060 -7783 -11349 -9644 -8447
6934 -8447 -4506 -1458 -738 -10583 -11352 -1078 2425 -156 2345 35 118 8470 11255 8667 4213 -184
6918 -184 -1739 329 2505 5808 1635 -117 1554 1310 220 1279 548 3085 -282 -2364 1129 5867
$$ packed form
7027e530J039k138R900P155j449l730n916k243L246p30l506l469l749L489O915
7012g16m205O00Q15O358M458k854m422o08J080k678k897J422k775j183O3J406
6996f136J970K111M389l900n200N388l84K364j871j75n859K101L218k631j757
6981f372j211p60M309L778j183J061m367K114R20N591p65l883p25j638K536l520
6965d115K684K53l743j156j394l635q57r31O323L470j108o830L324o19J517L273
6949c544N126K111j1890o18Q778K383L29k267J696k343m821k723l566J705J197
6934h447L941L048P20r845p69J0274L503k581K501k310Q3Q352K785k588m454m397
6918a84j555K068K176L303m173j752J671k44j090J059p31K537l367k082L493M738
$$ plain form
6902 5867 8215 8096 3998 2939 3988 -820 8202 14127 6027 -2267 -6654 -595 662 -523 1980
6887 1980 4243 3301 -5679 -6275 -2691 -6521 -7676 -5909 -2746 2132 4538 2877 -1037 -300 -496 -3984
6871 -3984 -8339 -11059 -10927 -12103 -15312 -17448 -16862 -12690 -5216 927 2057 -4742 -8646 -6525 -3378
6856 -3378 -1930 -2628 -4652 -4500 -2709 -2504 -6843 -4772 -2382 223 7233 8763 4917 3178 -1532 -4954
6840 -4954 -5158 -1063 -1880 -942 -3870 89 4841 3986 4103 7195 7628 1568 -1284 3232 2827 1076 -5555
6823 -5555 -5580 -4900 -7251 -10556 -11846 -7414 -705 3471 3841 6955 8231 2562 -219 -7432 -7105 -3412
6807 -3412 618 -1382 -2755 -1729 -3069 -1736 -1728 -655 338 2581 979 -2585 -3007 -2575 -4615 -8844
6791 -8844 -11845 -7319 -5112 -9206 -5962 -2565 -2038 96 1212 -1912 92 -451 -3835 -6000 -5283 -7321
$$ packed form
6902E867K348j19m098j059J049m808R022N925q100q294m387O059J257j185K503
6887A980K263r42q980n96L584l830j155J767L163M878K406j661l914P37j96l488
6871c984m355k720J32j176l209k136N86M172P474O143J130o799l904K121L147
6856c378J448o98k024J52J791K05m339K071K390K605P010J530l846j739m710l422
6840d954k04M095q17R38k928L959M752q55J17L092M33o060k852M516m05j751o631
6823e555k5O80k351l305j290M432O709M176L70L114J276n669k781p213L27L693
6807c412M030k000j373J026j340J333QJ073R93K243j602l564m22M32k040m229
6791h844l001M526K207m094L244L397N27K134J116l124K004n43l384k165P17k038
$$ plain form
6775 -7321 -7708 -10539 -4126 2107 7310 11015 10941 7459 10398 6426 156 -1114 1486 3268 4384 -1721
6759 -1721 2621 1267 -1536 3530 2433 -2920 -5259 -2716 -1464 -2775 -7698 -4420 -3874 -11574 -8871
6744 -8871 -4477 -2373 2562 4541 -285 -7261 400 6150 9914 2084 1428 -3549 -4910 -8028 -10387
6729 -10387 -10165 -6950 -2878 -5274 -9996 -8721 -14589 -14660 -11020 -6011 -10356 -15095 -14844 -15489 -11912 -6579
6713 -6579 -6250 -964 5 -2950 -2859 -4891 -3986 -1636 -2344 -2185 -2855 -785 6322 7525 -2463 -5052 -3691
6696 -3691 -4122 -1367 -2634 -3004 -4532 -5531 -3828 -270 7966 9702 6793 4690 4967 4292 3446 465
6680 465 -4784 -2938 278 4159 5033 6292 5068 8196 2826 -1931 60 405 169 1524 -1133 -2983
6664 -2983 -3657 838 -652 1316 -2436 -6162 663 16230 27030 25032 19587 18208 18768 17363 16694
$$ packed form
6775g321l87k831O413O233N203L705p4l482K939l972o270j270K600J782J116o105
6759a721M342j354k803N066j097n353k339K543J252j311m923L278N46p700K703
6744h871M394K104M935J979m826o976P661N750L764p830o56m977j361l118k359
6729a0387K22L215M072k396m722J275n868p1L640N009m345m739K51o45L577N333
6713f579L29N286R69k955R1k032R05K350p08J59o70K070P107J203r988k589J361
6696c691m31K755j267l70j528r99J703L558Q236J736k909k103K77o75q46k981
6680D65n249J846L216L881Q74J259j224L128n370m757J991L45k36J355k657j850
6664b983o74M495j490J968l752l726O825J5567J0800j998n445j379N60j405o69
$$ plain form
6649 16694 16733 16193 11352 8729 3854 -2146 2372 5069 5474 10622 12532 5585 2644 -259 -1128 -1824
6633 -1824 -2681 -94 7007 9430 1746 -2348 1605 7920 10008 8785 2875 -3256 -9563 -12226 -9726
6618 -9726 -7518 -4612 -3570 639 3524 1164 -1204 -4 1263 3870 7789 4884 -1965 -3069 -3243
6603 -3243 642 -9269 -11532 -5428 -5348 -7315 -8228 -4988 -3035 -1359 1454 399 -404 2363 425 -730
6587 -730 -8598 -7532 -7168 -6655 -1258 -2396 -4491 -3465 4098 403 -6275 -1712 -1177 453 3528 2100
6571 2100 2936 -1103 5284 5434 7511 -2203 -7935 -6773 -3317 -2869 -1597 -2799 -3456 -4281 -7384 -6644
6555 -6644 -9556 -5252 -9539 -10931 -11209 -7289 -3979 495 2487 1440 116 122 1488 -412 517 2102
6539 2102 -4133 -2347 -4178 -9266 -9822 -8846 -8650 -9175 -4021 700 2744 9981 10461 1469 -6445 -7358
$$ packed form
6649A6694L9n40m841k623m875o000M518K697M05N148J910o947k941k903q69o96
6633a824q57K587P101K423p684m094L953O315K088j223n910o131o307k663K500
6618i726K208K906J042M209K885k360k368J200J267K607L919k905o849j104j74
6603c243L885r911k263O104Q0j967r13L240J953J676K813j055q03K767j938j155
6587g30p868J066L64N13N397j138k095J026P563l695o678M563N35J630L075j428
6571B100Q36m039O387J50K077r714n732J162L456M48J272j202o57q25l103P40
6555f644k912M304m287j392k78L920L310M474J992j047j324OJ366j900R29J585
6539B102o235J786j831n088n56R76J96n25N154M721K044P237M80q992p914r13
$$ plain form
6523 -7358 -2342 -3286 -1425 -2346 -3748 -5724 -6706 -5849 -5271 746 1568 -4879 -2472 3271 3801 -2023 -5619
6506 -5619 -3636 -3869 -7579 -10474 -12658 -10785 -11051 -11265 -11005 -7143 -1377 294 2487 -1491 -1697 -3557
6490 -3557 -2292 -1335 -2222 -3848 -2906 4842 7117 7543 10467 7066 3225 3175 -29 2166 6488 7566
6474 7566 4164 -880 -2088 1182 173 -1417 -2541 -7596 -8448 -1381 2069 1173 -1624 -7153 -2885
6459 -2885 -2609 -5695 -5994 -4259 -2992 -8535 -6929 -2688 -9186 -10204 -9545 -10700 -3984 -2694 -3462 218
6443 218 -8590 -13435 -13258 -8117 -5193 -2675 -3821 -1556 -5959 -3415 2152 4049 65 -1886 -395
6428 -395 1597 -5308 -6281 -10118 -2630 6697 1988 276 439 887 2179 -479 -4332 -7360 -6914 -7508
6412 -7508 -8993 -5073 2118 1333 -2590 -5749 -6514 -4955 -7032 -1450 3817 4129 -462 -5151 -11462 -7558
$$ packed form
6523g358N016r44J861r21j402j976r82Q57N78O017Q22o447K407N743N30n824l596
6506e619J983k33l710k895k184J873k66k14K60L862N766J671K193l978k06j860
6490c557J265R57q87j626R42P748K275M26K924l401l841n0l204K195M322J078
6474G566l402n044j208L270j009j590j124n055q52P067L450q96k797n529M268
6459b885K76l086k99J735J267n543J606M241o498j018O59j155O716J290p68L680
6443B18q808m845J77N141K924K518j146K265m403K544N567J897l984j951J491
6428c95J992o905r73l837P488R327m709j712J63M48J292k658l853l028M46n94
6412g508j485L920P191p85l923l159p65J559k077N582N267L12m591m689o311L904
$$ plain form
6396 -7558 1426 6913 -238 -5645 -7508 -1452 -758 3483 1787 -1442 -3738 -5109 -4405 242 -229 -3088
6380 -3088 -5027 625 3509 2869 -5626 -8195 -7496 -6480 -5750 -6378 -5889 -2300 -1209 -2440 -3818 -5441
6364 -5441 -3588 -4206 -10643 -14137 -16721 -19647 -11825 -12298 -15193 -5235 -1815 -4754 -6021 -1810 2417
6349 2417 6802 8018 7360 6858 3848 3950 1789 -1033 30 -4615 -3500 -4555 -2888 -3481 -2839 -5063
6333 -5063 -736 -3487 -9362 -11897 -4150 -3683 -7714 -5024 3029 872 -2856 -8008 -6923 3929 5212
6318 5212 1785 -1071 -6090 -10301 -13195 -13551 -13049 -8757 -10505 -9040 -6495 395 2539 -9361 -11069
6303 -11069 -5753 -5825 -7239 589 8599 6452 1931 6784 11237 3060 -3667 -375 160 -2482 3202
6288 3202 7329 5809 5134 -4436 -5719 -222 1678 735 -1003 -438 2683 10922 9221 7506 7367 10450
$$ packed form
6396g558Q984N487p151n407j863O056O94M241j696l229k296j371P04M647m71k859
6380c088j939N652K884o40q495k569O99J016P30o28M89L589J091j231j378j623
6364e441J853o18o437l494k584k926P822m73k895R958L420k939j267M211M227
6349B417M385J216o58n02l010J02k161k822J063m645J115j055J667n93O42k224
6333e063M327k751n875k535P747M67m031K690Q053k157l728n152J085J0852J283
6318E212l427k856n019m211k894l56N02M292j748J465K545O890K144j1900j708
6303a1069N316p2j414P828Q010k147m521M853M453q177o727L292N35k642N684
6288C202M127j520o75r570j283N497J900r43j738N65L121Q239j701j715j39L083
$$ plain form
6272 10450 4625 7207 11701 8053 6227 5158 3883 3786 -740 -1358 -2462 -2479 -993 3568 1406 -1606
6256 -1606 -5513 -5163 -4214 -10958 -11565 -12420 -13368 -12295 -7337 -6674 -6560 -9464 -8184 -4393 -7184 -8608 -11304
6239 -11304 -15112 -17919 -17498 -12032 -7339 -7331 -7565 -9837 -9800 -14616 -9459 -589 1127 457 2262 4140 5204
6222 5204 4592 7307 4895 4843 9509 8935 8879 6292 665 -2540 -298 4252 2413 1249 1825 1702 6130
6205 6130 10339 6965 2859 5917 7481 10253 10845 8882 5890 2377 2540 -3541 -11274 -17490 -14156
6190 -14156 -10865 -7707 -4510 -4410 -5167 -871 -1533 -4099 -3799 -6811 -10157 -13457 -12909 -4702 -4283 -7800
6174 -7800 -10162 -18430 -17376 -12743 -11163 -1484 -561 -7141 -8232 -1746 7541 9573 9281 9400 13100 11681
6158 11681 5545 2243 3 -3481 -278 746 225 2066 2457 -350 -5971 -5891 -3952 -7461 -5679 -3950
$$ packed form
6272A0450n825K582M494l648j826j069j275r7m526o18j104j7J486M561k162l012
6256a606l907L50R49o744o07q55r48J073M958O63J14k904J280L791k791j424k696
6239a1304l808k807M21N466M693Qk34k272L7m816N157Q870J716o70J805J878J064
6222E204o12K715k412n2M666n74n6k587n627l205K242M550j839j164N76j23M428
6205F130M209l374m106L058J564K772N92j963k992l513J63o081p733o216L334
6190a4156L291L158L197J00p57M296o62k566L00l012l346l300N48Q207M19l517
6174g800k362q268J054M633J580R679R23o580j091O486R287K032k92J19L700j419
6158A1681o136l302k240l484L203J024n21J841L91k807n621Q0J939l509J782J729
$$ plain form
6142 -3950 -478 -643 -2621 -5363 -8878 -1633 3182 1249 3207 5626 10736 12684 11333 4054 1398
6127 1398 5240 6705 -2247 920 1234 721 -3191 -3456 -1805 -2395 800 -1328 2840 -2559 -6418 -5088
6111 -5088 -6658 -11161 -12129 -7410 -3946 -1063 -1523 635 2561 2183 2800 -3549 -5743 -7337 -5809 -4307
6095 -4307 -3060 2133 1881 -2554 -6127 -5018 -11648 -13708 -6048 -3898 -8729 -8149 1130 5989 1464
6080 1464 -468 1060 -722 -10472 -5578 512 608 -1373 -985 -1336 -456 3807 8081 5614 923 -502
6064 -502 1458 2333 -1439 -1876 -842 1199 2835 3318 1303 1748 502 -1899 -4192 -687 2416 6138
6048 6138 3910 400 -3873 -2309 -1313 1165 3955 6935 4454 1794 5512 5731 4148 2094 -460
6033 -460 424 454 5447 3305 2732 2850 701 -1430 5144 8407 3616 -7499 -9101 -7636 3627 5128
$$ packed form
6142c950L472j65j978k742l515P245M815j933J958K419N110J948j351p279k656
6127A398L842J465q952L167L14n13l912k65J651n90L195k128M168n399l859J330
6111e088j570m503r68M719L464K883m60K158J926l78O17o349k194j594J528J502
6095d307J247N193k52m435l573J109o630k060P660K150m831N80R279M859m525
6080A464j932J528j782r750M894O090R6j981L88l51Q80M263M274k467m691j425
6064e02J960Q75l772m37J034K041J636M83k015M45j246k401k293L505L103L722
6048F138k228l510m273J564R96K478K790K980k481k660L718K19j583k054k554
6033d60Q84L0M993k142n73J18k149k131O574L263m791j1115j602J465J1263J501
$$ plain form
6017 5128 2530 3071 -597 -9123 -9849 -8332 -5808 -3445 -4018 -4854 -9225 -4583 -5721 -7223 -6965 -6507
6001 -6507 -4774 233 102 -7335 -11223 -7690 -6070 78 -350 -4126 172 8947 4898 -54 2489
5986 2489 -2956 -7992 -6717 -2164 1681 705 1995 351 -1841 -2557 -3181 -4993 -2582 -330 8130 14005
5970 14005 8864 2070 -2144 -2203 -4862 -6317 -875 9000 6842 -1631 -337 2612 4175 7040 5477
5955 5477 568 4106 4517 3681 4392 5667 -795 -6807 -3359 -3480 -3061 5144 8119 7120 5253 774
5939 774 -5075 -12301 -13864 -5242 -4206 -5538 -2816 -3245 265 -2272 -1812 -1772 -7178 -8075 -6110 -6770 -2832
5922 -2832 1766 2928 8844 9995 7366 3728 555 -2155 -1437 -5267 -5996 -5313 -258 461 1700 -1619
5906 -1619 -7132 -3982 1000 10513 7988 329 -1903 4328 3044 -236 778 35 5501 10528 3295
$$ packed form
6017E128k598N41l668q526p26J517K524K363n73q36m371M642j138j502K58M58
6001f507J733N007j31p437l888L533J620O148m28l776M298Q775m049m952K543
5986B489n445n036J275M553L845r76J290j644k192p16o24j812K411K252Q460N875
5970A4005n141o794m214n9k659j455N442R875k158q473J294K949J563K865j563
5955E477m909L538M11q36P11J275o462o012L448j21M19Q205K975r99j867m479
5939G74n849p226j563Q622J036j332K722m29L510k537M60M0n406q97J965o60L938
5922b832M598J162N916J151k629l638l173k710P18l830p29O83N055P19J239l319
5906a619n513L150M982R513k525p659k232O231j284l280J014p43N466N027p233
$$ plain form
5891 3295 -9411 -10461 -4603 209 3502 3199 -2043 -7252 -8500 -10899 -3075 -1220 -3275 -2693 -2234
5876 -2234 -2241 -2717 -3419 3361 7468 3954 -3279 -5040 -5030 -12324 -15697 -7406 -6056 -5098 -6232 -8069 -7987
5859 -7987 617 5878 3524 2567 1793 3510 -1740 -5119 -6168 -2160 4773 3245 2419 4165 3219 197
5843 197 -336 -730 -7519 -5206 -1832 -3190 -7025 -9585 -6203 -5220 -8848 -8052 -10798 -16042 -11464 -6613
5827 -6613 -5668 -2960 -2757 -997 -3424 -6260 274 2759 -1911 -5095 -2708 -5783 253 2634 -655
5812 -655 -3125 -2495 -1742 1200 3210 1480 3974 421 -4233 -13678 -16716 -9470 -4788 -6479 -5536 -2637
5796 -2637 956 3888 3284 1911 -7243 -13870 -16688 -11187 -8164 -4640 1089 -1461 -903 2745 -1234
5781 -1234 -3288 -2110 -6526 -11362 -10602 -12775 -9992 -5149 -5657 -9540 -10564 -10331 -5837 2694 4282 3268
$$ packed form
5891C295j2706j050N858M812L293l03n242n209j248k399P824J855k055N82M59
5876b234pm76p02O780M107l514p233j761J0p294l373Q291J350R58j134j837Q2
5859g987Q604N261k354r57p74J717n250l379j049M008O933j528q26J746r46l022
5843A97n33l94o789K313L374j358l835k560L382R83l628P96k746n244M578M851
5827f613R45K708K03J760k427k836O534K485m670l184K387l075O036K381l289
5812f55k470O30P53K942K010j730K494l553m654r445l038P246M682j691R43K899
5796b637L593K932o04j373r154o627k818N501L023L524N729k550N58L648l979
5781a234k054J178m416m836P60k173K783M843n08l883j024K33M494Q531J588j014
$$ plain form
5765 3268 4712 1643 1886 -2937 -6064 -5327 -8967 -11248 -2812 -467 -1191 1294 -6894 -13190 -11253 -4396
5749 -4396 -1283 1814 5405 -609 -5591 -4173 737 3798 2021 2679 341 935 6673 7109 5570 -1986
5733 -1986 -4165 2198 190 -1240 -832 -5795 -6382 -6782 -6064 -1037 -1357 -6851 -6741 -1793 -2029 6178 4288
5716 4288 6895 8972 8985 4467 548 -1068 442 -46 527 3023 1234 2877 2374 3368 1680 -1262
5700 -1262 -2081 1644 936 -1744 -2793 -1598 -148 2078 -1749 -10732 -15045 -8896 -971 5826 557
5685 557 -546 2302 1817 -279 -2011 551 -2975 -9138 -17788 -17732 -7289 -11 -1097 -1812 -9364 -12829
5669 -12829 -11917 -3586 1968 481 -1935 2148 -2664 -3914 -1992 3275 6741 6976 3781 1192 -5464
5654 -5464 -7759 -7971 -7468 -5876 -1821 -1943 -1162 -5441 -14513 -10328 -6655 -6448 -10624 -13158 -11140 -3881
$$ packed form
5765C268J444l069K43m823l127P37l640k281Q436K345p24K485q188o296J937O857
5749d396L113L097L591o014m982J418M910L061j777O58k338N94N738M36j539p556
5733a986k179O363k008j430M08m963n87m00P18N027l20n494J10M948k36Q207j890
5716D288K607K077J3m518l919j616J510m88N73K496j789J643n03R94j688k942
5700a262q19L725p08k680j049J195J450K226l827q983m313O149P925O797n269
5685E57j103K848m85k096j732K562l526o163q650N6J0443P278j086p15p552l465
5669a2829R12Q331N554j487k416M083m812j250J922N267L466K35l195k589o656
5654e464k295k12N03J592M055j22P81m279r072M185L673K07m176k534K018P259
$$ plain form
5638 -3881 -1025 -3005 -8113 -7537 -7630 -8820 -8812 -3099 -179 3470 3004 763 4412 5320 -1406 -2322 -5676
5621 -5676 -8481 -7843 -7965 -6035 -4313 -2482 5661 3902 2693 2604 1124 -1767 -4250 -1487 3829 3511
5605 3511 1898 2723 944 1059 4266 5300 6416 16701 16754 10469 7587 900 4726 9466 6284 2919
5589 2919 -4945 -10611 -9978 -10036 -7837 -4937 1305 -289 -1818 -4295 -4082 -2661 837 5745 5611 4101
5573 4101 3660 397 -447 3900 6967 2657 954 3386 -438 -2049 -3240 2244 4973 -575 -7833
5558 -7833 -7524 -4653 -6988 -4854 1496 -380 -3095 -1301 -3645 -3475 320 3067 -1318 -2745 4799
5543 4799 -373 -7542 -10383 -10930 -5064 -6049 -3479 -4411 -6264 -3943 -2128 -5676 -9294 -10912 -7189 -4647
5527 -4647 40 1240 -2438 -7187 -4992 -4271 -3237 -7843 -10061 -5902 -5528 -6903 -2379 2700 1065
$$ packed form
5638c881K856j980n108N76r3j190QN713K920L649m66k241L649R08o726r16l354
5621e676k805O38j22J930J722J831Q143j759j209q9j480k891k483K763N316l18
5605C511j613Q25j779J15L207J034J116J0285N3o285k882o687L826M740l182l365
5589B919p864n666O33n8K199K900O242j594j529k477K13J421L498M908j34j510
5573D101m41l263q44M347L067m310j703K432l824j611j191N484K729n548p258
5558g833L09K871k335K134O350j876k715J794k344J70L795K747m385j427P544
5543D799n172p169k841n47N866r85K570r32j853K321J815l548l618j618L723K542
5527d647M687J200l678m749K195P21J034m606k218M159L74j375M524N079j635
$$ plain form
5512 1065 -1337 6117 7298 2322 -865 983 7808 6393 3274 1299 3335 4238 1748 -1861 -773
5497 -773 -349 272 7912 11686 3292 -2114 -3050 1596 6389 3149 3503 5677 6491 7218 5494 6188 434
5480 434 -963 1172 1585 218 -1552 1542 786 2369 -2014 874 4385 3349 6458 7828 4116 3596
5464 3596 4953 5162 1809 -2696 -5443 -11390 -10467 -6309 -1897 2503 -1231 -3575 2882 8654 1700
5449 1700 -3470 889 2952 1981 -3168 -6802 -5709 -4298 -1571 4339 6585 9580 6354 3442 6329
5434 6329 3717 534 -3278 736 1228 2577 -3622 -3474 -669 -5904 -8956 -6908 -3159 -8615 -9619
5419 -9619 -4833 4552 3901 321 -704 914 3047 -367 -369 5453 10204 10402 7038 2378 -1531 336
5403 336 -1757 -4913 325 2959 3863 6412 11512 10206 4388 250 -1079 -1783 1699 5822 3361 2581
$$ packed form
5512A065k402P454J181m976l187J848O825j415l119j975K036R03k490l609J088
5497g73M24O21P640L774q394n406r36M646M793l240L54K174Q14P27j724O94n754
5480D34j397K135M13j367j770L094p56J583m383K888L511j036L109J370l712n20
5464C596J357K09l353m505k747n947R23M158M412M400l734k344O457N772o954
5449A700n170M359K063r71n149l634J093J411K727N910K246K995l226k912K887
5434F329k612l183l812M014M92J349o199J48K805n235l052K048L749n456j004
5419i619M786R385o51l580j025J618K133l414kN822M751J98l364m660l909J867
5403C36k093l156N238K634R04K549N100j306n818m138j329p04L482M123k461p80
$$ plain form
5387 2581 -681 -1514 -4175 -4264 -5529 -4085 -2070 -6661 -8221 -13334 -13086 -4522 -3166 -3558 -8011 -3931
5371 -3931 3856 8717 -52 -2742 -1214 2126 1295 139 892 2382 -2858 -4554 3495 10619 14765
5356 14765 16734 10382 10934 13003 6822 7457 5542 1287 -569 -3894 -1238 -1978 2359 5191 8626
5341 8626 8294 6271 6895 3307 -587 350 -982 -4986 -9906 -1600 -3033 14 -260 -3334 -9210 -9341
5325 -9341 -8080 -9388 -6867 -9308 -9385 -4463 -2032 -978 -193 -2309 -3010 -2356 -1684 -6294 -3147 -3351 3363
5308 3363 6446 1349 3216 1801 5893 -2840 -2915 -3305 -4051 -13835 -15168 -7940 -1611 4273 3175 58
5292 58 1029 2665 1634 216 -4247 -4541 -5834 -14396 -6807 -5640 -7348 -9041 -7779 -8770 -12565 -12385
5276 -12385 -13405 -9539 -4792 -4206 -3240 -7173 -10990 -9045 -944 4636 3500 -1514 -7121 -7068 -5883 -7615
$$ packed form
5387B581l262q33k661q9j265J444K015m591j560n113K48Q564J356l92m453M080
5371c931P787M861q769k690J528L340q31j156P53J490n240j696Q049P124M146
5356A4765J969o352N52K069o181O35j915m255j856l325K656p40M337K832L435
5341H626l32k023O24l588l894R37j332m004m920Q306j433L047k74l074n876j31
5325i341J261j308K521k441p7M922K431J054P85k116p01O54O72m610L147k04O714
5308C363L083n097J867j415M092q733p5l90p46r784j333P228O329N884j098l117
5292E8R71J636j031j418m463k94j293q562P589J167j708j693J262r91l795J80
5276a2385j020L866M747N86R66l933l817J945Q101N580j136n014n607N3J185j732
$$ plain form
5260 -7615 -5124 -1628 474 -1268 -4329 -5543 -11570 -14261 -12531 -9371 -4863 -602 1510 2268 133
5245 133 2034 1123 5249 4423 3642 513 5135 4427 5807 3687 -455 -5829 -4403 -3002 -5458 -1480
5229 -1480 -3991 -876 1745 3588 -1325 -3868 -4540 -6288 -5751 -7019 -8524 -4842 -3708 3112 4673
5214 4673 3928 -2378 -8418 -5027 -4022 -3337 -2464 -905 -1281 -3344 -2827 -1958 -1310 1563 8327 7751 542
5197 542 -2211 -2971 -6352 -7745 -8346 -2265 -2429 -5746 -6177 -2682 -1043 -2716 832 763 3012 -4906 -3968
5180 -3968 -5242 -9230 -2177 738 2363 -561 -1512 1668 6341 2053 -9114 -7957 -3141 -1423 -5190
5165 -5190 -6638 -3907 -164 -521 -4018 -8940 -978 4601 7267 4074 -576 -3466 -5230 -7729 -2479
5150 -2479 1444 -1019 -672 -396 -2969 -6435 -3096 3464 11381 6352 -4284 -13040 -14688 -10248 -4564
$$ packed form
5260g615K491L496K102j742l061j214o027k691J730L160M508M261K112P58k135
5245A33J901r11M126q26p81l129M622p08J380k120m142n374J426J401k456L978
5229a480k511L115K621J843m913k543o72j748N37j268j505L682J134O820J561
5214D673p45o306o040L391J005O85Q73J559l76k063N17Q69O48K873O764n76p209
5197E42k753p60l381j393o01O081j64l317m31L495J639j673L548o9K249p918R38
5180c968j274l988P053K915J625k924r51L180M673m288j1167J157M816J718l767
5165e190j448K731L743l57l497m922P962N579K666l193m650k890j764k499N250
5150b479L923k463L47K76k573l466L339O560P917n029j0636q756j648M440N684
$$ plain form
5135 -4564 -1877 3731 9936 5107 2725 10886 8848 4871 519 2539 -2407 -3525 -6843 -5655 -1661
5120 -1661 -2729 -5974 -3514 -5901 -4346 -3964 -2587 -6949 -7451 2997 831 612 9504 4787 1863
5105 1863 7917 8853 4334 4425 2802 -2237 -3152 -2604 -6179 -7174 -924 3965 587 -6368 -10786 -10937 -4663
5088 -4663 541 1282 706 592 -1181 -1656 -5188 -10164 -12902 -13252 -14022 -6898 -2897 621 1272 -1833 -6305
5071 -6305 -14573 -13577 -8427 -6013 -3312 -231 3931 8124 9507 8746 9858 13935 9794 -344 -3883
5056 -3883 -1364 -264 -154 -2209 -436 -1189 1827 7483 11713 11677 10195 -1217 -5947 -2872 -705 -6111
5040 -6111 -9243 -4251 -2263 -4435 -6910 -13317 -8465 -3241 -2081 -1566 -6284 -12622 -6581 -4206 3280
5025 3280 9692 10650 7711 6116 9322 8974 5683 2387 -1086 -1268 119 -2242 -5938 1580 -1447 -3215
$$ packed form
5135d564K687N608O205m829k382Q161k038l977m352K020m946j118l318J188L994
5120a661j068l245K460k387J555L82J377m362n02J0448k166k19Q892m717k924
5105A863O054R36m519R1j623n039r15N48l575r95O250M889l378o955m418j51O274
5088d663N204P41n76j14j773m75l532m976k738l50p70P124M001L518O51l105m472
5071f305q268R96N150K414K701L081M162M193J383p61J112M077m141j0138l539
5056c883K519J100J10k055J773p53L016N656M230l6j482j1412m730L075K167n406
5040f111l132M992J988k172k475o407M852N224J160N15m718o338O041K375P486
5025C280O412R58k939j595L206l48l291l296l473j82J387k361l696P518l027j768
$$ plain form
5009 -3215 1900 3905 3776 -2320 -2611 -613 2717 2553 3997 4321 9786 6102 -2058 -6500 -3784 5808
4993 5808 9790 6100 766 -708 76 2658 2494 -3434 -7014 -5727 -3137 333 3839 3258 1341 483
4977 483 -4765 -8640 -12024 -13368 -9703 -3753 -5183 -3777 -1565 -837 -1251 -520 2627 -2200 33 5411
4961 5411 1472 3024 3726 6372 5317 -1142 -2303 -2987 -5150 -2710 -1972 -862 -4532 -4662 -4234 -2593
4945 -2593 -913 -1116 -2144 2110 4847 6701 5936 4554 -3224 -7374 -7881 -6341 -3782 192 -32 534
4929 534 -1748 -6720 -7703 -6153 1166 1616 529 -5726 -4097 -2223 -1424 -6593 -2888 -1253 -930 4525
4913 4525 4108 -7528 -14644 -7146 -5795 -3193 -4512 -3401 -7312 -4137 -2241 -1723 4203 3636 5390
4898 5390 8110 6408 8637 7977 8722 9612 6695 7232 7912 2504 -1797 -5607 -6939 -7671 -5102 -1144
$$ packed form
5009c215N115K005j29o096k91J998L330j64J444L24N465l684q160m442K716R592
4993E808L982l690n334j474P84K582j64n928l580J287K590L470L506n81j917q58
4977D83n248l875l384j344L665N950j430J406K212P28m14P31L147m827K233N378
4961E411l939J552P02K646j055o459j161o84k163K440P38J110l670j30M28J641
4945b593J680k03j028M254K737J854p65j382p778m150n07J540K559L974k24N66
4929E34k282m972r83J550P319M50j087o255J629J874P99n169L705J635L23N455
4913D525m17j1636p116P498J351K602j319J111l911L175J896N18N926n67J754
4898E390K720j702K229o60P45Q90k917N37O80n408m301l810j332p32K569L958
$$ plain form
4882 -1144 -2962 -9909 -8924 -3024 313 -2250 -8909 -3704 1114 -2948 -6986 -5798 -1710 -6014 -3939
4867 -3939 -1710 2317 4341 1165 3070 2225 7825 9614 14661 12541 13233 11961 5667 1050 3846
4852 3846 10631 12150 8933 9510 7801 1490 304 1268 3154 2508 1234 -4163 -9521 -14732 -14129 -9943
4836 -9943 -4645 -3157 -1307 986 1688 -5500 -12780 -15904 -15407 -14985 -17668 -12798 -7125 32 1764 2393
4820 2393 143 -7661 -7985 -4785 -3306 -1926 342 -5020 -10430 -3887 1350 -287 -5340 -4943 -10471
4805 -10471 -10451 -4605 2757 1120 7334 11925 8776 4486 2922 6675 6377 3490 3848 3882 6287 7953
4789 7953 5595 3554 4766 2239 -4206 -4308 -744 -3098 -3622 -6815 -3051 -4238 -5635 -6980 -6664 -8516
4773 -8516 -4356 -781 2145 -146 -484 -3457 -5398 -1359 6644 2022 -444 -3161 -8261 -5560 -7016
$$ packed form
4882a144j818o947R85N900L337k563o659N205M818m062m038J188M088m304K075
4867c939K229M027K024l176J905q45N600J789N047k120O92j272o294m617K796
4852C846O785J519l217N77j709o311j186R64J886o46j274n397n358n211O03M186
4836i943N298J488J850K293P02p188p280l124M97M22k683M870N673P157J732O29
4820B393k250p804l24L200J479J380K268n362n410O543N237j637n053L97n528
4805a0471K0N846P362j637O214M591l149m290j564L753k98k887L58L4K405J666
4789G953k358k041J212k527o445j02L564k354n24l193L764j187j397j345L16j852
4773h516M160L575K926k291l38k973j941M039Q003m622k466k717n100K701j456
$$ plain form
4758 -7016 -4879 -736 451 -1633 -4399 -7844 -7783 -4090 7215 6368 1708 2575 3289 81 1360 3681
4742 3681 6890 7661 10930 7070 4881 4940 5965 1449 -6182 -6647 -4749 -2147 -3007 -6281 -5429 -3506
4726 -3506 -1711 6495 8830 -54 240 1264 1478 -2836 -10112 -11820 -10456 -12035 -8682 -7380 -2436
4711 -2436 438 -3158 1160 6861 8088 4657 274 -4484 -2904 -847 401 -2708 -1360 3768 7848
4696 7848 11309 8027 7273 12054 13058 9439 299 -436 6260 3282 -446 12150 21495 14400 7492
4681 7492 7376 2402 -3137 530 3099 1287 -1439 -2919 -2317 1013 8633 8638 4467 89 359 -1284
4665 -1284 -8034 -13463 -12285 -6194 -3858 -617 2289 5951 8557 11849 9299 8918 5816 3706 8098
4650 8098 4290 -7592 -6197 3166 3631 -1349 -1957 -5460 -6389 -4728 1286 -1773 -7345 -14466 -11284
$$ packed form
4758g016K137M143J187k084k766l445O1L693J1305q47m660Q67P14l208J279K321
4742C681L209P71L269l860k189N9J025m516p631m65J898K602q60l274Q52J923
4726c506J795Q206K335q884K94J024K14m314p276j708J364j579L353J302M944
4711b436K874l596M318N701J227l431m383m758J580K057J248l109J348N128M080
4696G848L461l282p54M781J004l619r140p35O696k978l728J2596R345p095o908
4681G492j16m974n539L667K569j812k726j480O02L330P620Nm171m378K70j643
4665a284o750n429J178O091K336L241K906L662K606L292k550l81l102k110M392
4650H098l808j1882J395R363M65m980o08l503r29J661O014l059n572p121L182
$$ plain form
4635 -11284 -8493 -10477 -10676 -5433 -2488 3156 1442 -897 1790 5273 280 72 4743 9490 10866
4620 10866 2100 -108 -2926 -8771 -11346 -8636 -4201 -6305 -5728 -9662 -3890 1823 -9183 -13202 -4862
4605 -4862 -10317 -16476 -11577 -4764 -2565 -1850 -2867 -4760 -7862 -5704 -3260 -8347 -15453 -13408 -4132
4590 -4132 -2448 -1655 -2353 -2626 -7030 -7001 -13001 -13656 -7770 -11941 -2789 5926 9106 4976 -1572 -3356
4574 -3356 -746 -1268 1976 -780 -3458 75 -5041 -1896 5353 3356 -4103 2681 966 -2258 -4150
4559 -4150 -2341 -3513 -465 -569 1923 901 -3763 -6955 2115 779 -5277 -8350 -7972 296 1511
4544 1511 1747 3771 2294 2669 453 1820 207 434 3011 1779 394 -109 -653 -2126 -3453 -2681
4528 -2681 -2345 -3579 -969 -3976 -3546 -2298 -5393 -3349 -968 553 6991 9456 2320 -879 -1384 -4422
$$ packed form
4635a1284K791j984j99N243K945N644j714k339K687L483m993k08M671M747J376
4620A0866q766k208k818n845k575K710M435k104N77l934N772N713j1006m019Q340
4605d862n455o159M899O813K199P15j017j893l102K158K444n087p106K045R276
4590d132J684P93o98k73m404K9o000o55N886m171R152Q715L180m130o548j784
4574c356K610n22L244k756k678L533n116L145P249j997p459O784j715l224j892
4559d150J809j172L048j04K492j022m664l192R070j336o056l073L78Q268J215
4544A511K36K024j477L75k216J367j613K27K577j232j385n03n44j473j327P72
4528b681L36j234K610l007M30J248l095K044K381J521O438K465p136l199n05l038
$$ plain form
4512 -4422 -8951 -16510 -12208 -3897 -3397 2809 12167 11793 7701 2961 4909 768 4672 1573 -6625
4497 -6625 -6862 -1048 3541 7452 2534 -5217 -6537 -7763 -9155 -5766 -3381 1945 3369 1694 1826
4482 1826 1695 5845 4277 2143 -1156 -3923 -2151 -1555 -2862 -5310 -1657 -3653 -9398 -10603 -7756
4467 -7756 -7531 -8923 -7813 -3216 -3597 -3736 -1736 -1580 1141 -5789 -12807 -6396 -1074 -4596 -7305 -5298
4451 -5298 -5033 -5302 -5228 -10390 -9672 -4119 -3979 -4981 -6130 4216 6131 -336 -3759 -3786 -2088 1586 2949
4434 2949 558 -427 4832 3231 6192 5077 -348 -818 995 4212 -3643 -7387 -1936 2149 -2829
4419 -2829 -13093 -11255 -3921 2418 2280 2594 1484 -3140 -5444 -5701 -1594 4158 2052 -3561 -5469
4404 -5469 -5226 -7691 -8324 -5749 -5197 -4823 -1313 -4591 -2039 -206 -1251 -4737 -4840 -1277 -6317 -5785
$$ packed form
4512d422m529p559M302Q311N00O206R358l74m092m740J948m141L904l099q198
4497f625k37N814M589L911m918p751j320j226j392L389K385N326J424j675J32
4482A826j31M150j568k134l299k767J772N96j307k448L653j996n745j205K847
4467g756K25j392J110M597l81j39K000J56K721o930p018O411N322l522k709K007
4451e298K65k69P4n162P18N553J40j002j149J0346J915o467l423k7J698L674J363
4434B949k391r85N259j601K961j115n425m70J813L217p855l744N451M085m978
4419b829j0264J838P334O339j38L14j110m624k304k57M107N752k106n613j908
4404e469K43k465o33K575N52L74L510l278K552J833j045l486j03L563n040N32
$$ plain form
4388 -5785 1461 1324 3881 6733 5456 3261 -1720 116 3376 -1381 -2186 -1971 -7863 -7309 -3560 -8623
4372 -8623 -10736 -8803 -932 5837 5011 5533 1638 -3708 -5971 -6429 -4085 -68 -3071 -3613 -2207 -6617
4356 -6617 -11276 -7753 -3940 884 -2513 1115 2314 59 -2515 -1482 -6448 -6539 -7225 -6878 -9489 -9436
4340 -9436 -7703 -2674 1359 1016 -1431 3032 4815 2310 -973 -4047 -2080 -1360 4153 5276 2838
4325 2838 2572 7098 7334 2532 300 -4224 -3937 3406 7459 10104 15043 14452 6500 2742 2332 5853
4309 5853 -167 231 432 -2677 -1824 -1070 -714 590 375 2315 6777 5628 6045 6770 2908 -1443 -6806
4292 -6806 -10509 -10748 -6467 -5233 -7638 -8054 -1476 4250 5000 5963 5414 7605 3565 -1565 -7515 -12668
4276 -12668 -9171 -8539 -6853 -4555 -3922 -3764 7561 14752 9336 7508 10666 5383 4243 10500 14272
$$ packed form
4388e785P246j37K557K852j277k195m981J836L260m757q05K15n892N54L749n063
4372h623k113J933P871O769q26N22l895n346k263m58K344M017l003n42J406m410
4356f617m659L523L813M824l397L628J199k255k574J033m966r1o86L47k611N3
4340i436J733N029M033l43k447M463J783k505l283l074J967P20N513J123k438
4325B838k66M526K36m802k232m524K87P343M053K645M939n91p952l758m10L521
4309E853o020L98K01l109Q53P54L56J304k15J940M462j149M17P25l862m351n363
4292f806l703k39M281J234k405m16O578N726P50R63n49K191m040n130n950n153
4276a2668L497O32J686K298O33J58J1325P191n416j828L158n283j140O257L772
$$ plain form
4261 14272 5929 1082 3563 606 -1719 -1966 -2583 -2107 -4067 -4760 -5066 -3447 2133 4886 1498 1511
4245 1511 47 2475 369 -4933 -9218 -7795 -2623 2728 4867 6471 -89 -6676 -5515 -6441 -8173
4230 -8173 -11612 -9826 -4468 -2773 -8139 -8736 -7502 -4197 347 -1949 3443 10479 9369 2090 -811
4215 -811 2818 324 -2278 -4334 -6941 -10284 -15369 -13673 -8945 2087 4679 9574 10846 8449 8863
4200 8863 5897 5932 3163 -1389 -6246 -3084 741 665 -6430 -6320 -5700 -8495 -3607 3400 7258 3169
4184 3169 1996 3003 5960 9116 7710 4548 3192 1284 -438 -4938 -1010 6089 15000 13313 5050
4169 5050 1152 3585 2467 3063 3146 1799 2337 94 -228 -2403 -2918 995 -255 -90 -7723 -12935 -17065
4152 -17065 -13251 -6092 -2068 -94 -856 -6070 -6791 -6604 -8786 -6457 -2839 -1247 -422 -653 6456 2754
$$ packed form
4261A4272q343m847K481k957k325k47o17M76j960o93l06J619N580K753l388J3
4245A511j464K428k106n302m285J423N172N351K139J604o560o587J161r26j732
4230h173l439J786N358J695n366n97J234L305M544k296N392P036j110p279k901
4215h11L629k494k602k056k607l343n085J696M728J1032K592M895J272k397M14
4200H863k966L5k769m552m857L162L825p6p095J10O20k795M888P007L858m089
4184C169j173J007K957L156j406l162j356j908j722m500L928P099Q911j687q263
4169E050l898K433j118N96Q3j347N38k243l22k175n15L913j250J65p633n212m130
4152a7065L814P159M024J974p62n214p21J87k182K329L618J592Q25k31P109l702
$$ plain form
4136 2754 1595 4005 -1456 -2947 -4516 -4567 -7382 -6360 -6517 -2491 -7294 -10499 -9252 -8383 -3863 -4191
4120 -4191 -7178 -3469 -1359 6863 10729 5957 1334 -2031 -1163 703 -873 404 -3041 -6634 -5536
4105 -5536 -10390 -11098 -5121 -569 4317 4156 1134 969 4504 1338 6222 11791 11574 4215 1851 3237
4089 3237 -1259 -2485 -3826 -4761 -1069 -1858 1253 -4582 -3190 3008 -512 -748 -1665 -5374 -5677 -7297
4073 -7297 -6995 -259 5887 3530 1563 -7591 -6620 -6499 -14340 -12017 -4559 -2450 -7892 -6019 -542 934
4057 934 2513 5124 7261 6279 6061 -2173 -7835 -4992 -1747 -3889 -2804 -4696 -3335 -620 -6548 -4880
4041 -4880 -5287 -10781 -16558 -14741 -8768 -7558 -2789 2077 3266 -737 4632 6238 8620 766 -8021
4026 -8021 -1689 -239 -3726 2881 4590 3412 2591 -903 -5662 -6820 -3166 -2378 -2595 -6550 -5415 -1850
$$ packed form
4136B754j159K410n461j491j569n1k815J022j57M026m803l205J247Q69M520l28
4120d191k987L709K110Q222L866m772m623l365Q68J866j576J277l445l593J098
4105e536m854p08N977M552M886j61l022j65L535l166M884N569k17p359k364J386
4089C237m496j226j341r35L692p89L111n835J392O198l520k36r17l709l03j620
4073g297L02O736O146k357j967r154R71J21p841K323P458K109n442J873N477J476
4057I34J579K611K137r82k18q234n662K843L245k142J085j892J361K715n928J668
4041d880m07n494n777J817N973J210M769M866J189m003N369J606K382p854q787
4026h021O332J450l487O607J709j178q21l494m759j158L654P88k17l955J135L565
$$ plain form
4010 -1850 353 1091 9779 10594 5405 858 -4333 -1091 -4679 -3938 5330 5291 1729 7858 18093 16715
3994 16715 11833 6203 1533 -4431 -7089 -5446 -2763 -2740 5270 7448 677 -6361 -7687 -1203 -3561
3979 -3561 -3369 -141 2632 1378 1845 2675 4967 3358 -3786 -311 2379 6171 6539 7592 4234 -2555
3963 -2555 -6722 -9436 -6578 1194 300 2843 8372 8419 6418 3819 3234 4929 2397 -3962 -1062 330
3947 330 -5443 -8546 -5324 -4653 -7301 -2893 8332 12524 5218 -525 652 2310 -1722 -6051 -6559
3932 -6559 -8905 -7395 -674 2546 3179 3575 6239 8383 5929 3480 861 -2353 -1203 -1444 600 5395
3916 5395 4082 -4562 -3371 -2350 -2881 -482 -298 -6072 -10352 -6720 -4109 -7036 -7848 -852 -436 2500
3900 2500 1861 -5634 -10739 -11676 -14868 -12279 -10195 -5324 875 4146 2979 1570 -3845 -661 5600
$$ packed form
4010a850K203P38Q688Q15n189m547n191L242l588P41R268l9l562O129J0235j378
3994A6715m882n630m670n964k658J643K683K3Q010K178o771p038j326O484k358
3979c561J92L228K773j254M67Q30K292j609p144L475K690L792L68J053l358o789
3963b555m167k714K858P772q94K543N529M7k001k599n85J695k532o359K900J392
3947C30n773l103L222O71k648M408J1225M192p306n743J177J658m032m329n08
3932f559k346J510O721L220O33L96K664K144k454k449k619l214J150k41K044M795
3916E395j313q644J191J021n31K399J84n774m280L632K611k927q12O996M16K936
3900B500o39p495n105r37l192K589K084M871O199L271j167j409n415L184O261
$$ plain form
3885 5600 6631 2553 4203 9204 14139 9409 7656 4608 5900 2510 996 3670 2643 4216 7456
3870 7456 10190 13719 10850 11605 10870 6597 5387 2831 -1140 -7395 -7350 -6506 -8715 -13567 -14069 -17976
3854 -17976 -18778 -14873 -6720 -1245 6518 9547 9707 7617 2116 -246 589 4160 4269 -6233 -6119 1485
3838 1485 553 -2626 -6683 -4378 4798 2710 -6791 -11678 -12091 -11373 -11997 -4908 1663 3312 -1938 -140
3822 -140 -797 21 -1504 -6213 -6771 -8551 -4890 -4910 -3077 -1861 -7810 -4496 -1565 -8203 -11620 -10756 -4282
3805 -4282 1296 754 1254 2347 -357 3571 5246 5188 7744 7765 8217 4459 -101 4026 3778 -1172 -7480
3788 -7480 -3861 -5811 -6602 -7157 -2910 -2006 809 -2088 -762 2050 2028 3662 646 -3093 -2092 299
3772 299 4833 4154 4985 6343 8814 5709 7441 4643 6929 9760 4403 -4915 2520 10844 14186 11317
$$ packed form
3885E600J031m078J650N001M935m730j753l048J292l390j514K674j027J573L240
3870G456K734L529k869P55p35m273j210k556l971o255M5Q44k209m852n02l907
3854a7976q02L905Q153N475P763L029J60k090n501k362Q35L571J09j0502J14P604
3838A485r32l179m057K305R176k088r501m887m13P18o24P089O571J649n250J798
3822a40o57Q18j525m709n58j780L661k0J833J216n949L314K931o638l417Q64O474
3805d282N578n42N00J093k704L928J675n8K556K1M52l758m560M127k48m950o308
3788g480L619j950p91n55M247R04K815k897J326K812k2J634l016l739J001K391
3772B99M534o79Q31J358K471l105J732k798K286K831n357r318P435Q324L342k869
$$ plain form
3756 11317 6634 1384 -1176 1577 3687 7254 3943 19 -12123 -10710 -6944 -11604 -12753 -3323
3742 -3323 4307 5262 9545 4979 -1735 -5297 -4229 -966 -2245 -3314 -8077 -10309 -3381 1568 3488
3727 3488 3492 3566 1968 671 2259 4388 4495 1678 749 -915 -3784 -4045 -3163 630 3593 125 -208
3710 -208 3270 -1721 -5414 354 479 308 3676 6140 5541 7421 13653 14824 13444 14905 8811 3957
3694 3957 1404 3611 1330 4575 6934 4104 3040 5956 11227 8212 3099 463 2264 8794 9902
3679 9902 2128 1401 709 3669 5896 -19 -2696 -4131 -5428 -4383 -4123 -5751 -3827 912 9561 1542
3663 1542 -3201 -1273 -5417 -6250 -2719 1040 4072 -633 3410 9518 6955 4491 6068 11595 3972
3648 3972 -4163 -5413 -2413 4755 5836 2148 -1118 -5302 -9429 -9722 -7558 -1726 848 -125 4813
$$ packed form
3756A1317m683n250k560K753K110L567l311l924j2142J413L766m660j149R430
3742c323P630R55M283m566o714l562J068L263j279j069m763k232O928M949J920
3727C488MP4j598j297J588K129J07k817r29j664k869k61Q82L793K963l468l33
3710b08L478m991l693N768J25j71L368K464n99J880O232J171j380J461o094m854
3694C957k553K207k281L245K359k830j064K916N271l015n113k636J801O530J108
3679I902p774p27o92K960K227n915k677j435j297J045K60j628J924M739Q649q019
3663A542m743J928m144q33L531L759L032m705M043O108k563k464J577N527p623
3648C972q135j250L000P168J081l688l266m184m127k93K164N832K574r73M938
$$ plain form
3633 4813 10649 6814 6158 2074 -368 -3344 -2729 -4549 -1076 4079 2125 3091 2326 1462 2701 -5341
3617 -5341 -11978 -9093 -9889 -5757 2019 5122 1401 1265 3877 10409 11276 8230 5513 4952 1952 583
3601 583 -2544 -1824 405 5515 9149 773 -1131 2529 6485 2618 -4864 -2781 2734 6094 8104
3586 8104 3152 2369 3905 1734 3056 8791 13355 7892 -102 1202 10660 6410 5487 7758 5435
3571 5435 7001 6395 5333 -3851 -6545 -2412 -3247 -676 4126 -1676 -5521 -6693 -4288 -3291 -3015 -5951
3555 -5951 -4818 -6069 4596 13703 12662 7381 1594 -3393 -677 5992 3221 -1343 -1791 -2010 -8969
3540 -8969 -14823 -16928 -13034 -5477 -7734 -4583 -936 -5052 -8781 -6775 -2465 -468 -2925 -10383 -8982
3525 -8982 -366 2742 309 -1359 994 3822 -5274 -8466 -4208 1614 5848 4319 270 -1397 -2233
$$ packed form
3633D813N836l835o56m084k442k976O15j820L473N155j954R66p65q64J239q042
3617e341o637K885p96M132P776L103l721j36K612O532Q67l046k717n61l000j369
3601E83l127P20K229N110L634q376j904L660L956l867p482K083N515L360K010
3586H104m952p83J536k171J322N735M564n463p994J304R458m250r23K271k323
3571E435J566o06j062r184k694M133q35K571M802n802l845j172K405R97K76k936
3555e951J133j251J0665R107j041n281n787m987K716O669k771m564m48k19o959
3540h969n854k105L894P557k257L151L647m116l729K006M310J997k457p458J401
3525h982Q616L108k433j668K353K828r096l192M258N822M234j529m049j667q36
$$ plain form
3510 -2233 5917 4432 1140 -1319 -610 792 629 -1051 1845 -3669 -6884 -1406 1576 1316 7345 2161
3494 2161 -2023 -8277 -6372 -1931 -5697 -9346 -8379 -6589 -2722 29 4836 5806 7617 5490 1201
3479 1201 -1827 1246 5473 11272 11385 11721 14071 14168 14078 3953 -6652 -6989 -738 -3660 -7464 -7712
3463 -7712 -6574 -6700 -7084 -13709 -11212 -11464 -12931 -16092 -9795 -1043 2645 4340 1472 -2083 1306 63
3447 63 3377 7236 3551 281 -3485 -1826 -2690 -2875 -1048 4853 4791 5720 3546 2607 2686 6144 5587 9799
3429 9799 6466 -2281 1007 7464 11687 10975 2194 -1532 881 156 -8565 -10419 -9251 -3993 -3406 3268
3413 3268 3889 4562 5399 8888 10444 7137 6973 4246 3153 490 -3880 -1509 1470 4829 10679 13960
3397 13960 8864 2027 1860 1739 2607 3011 4274 3279 3441 1984 4726 3124 -4401 -2288 -3252 -5309
$$ packed form
3510b233Q150j485l292k459P09J402j63j680K896n514l215N478K982k60O029n184
3494B161m184o254J905M441l766l649R67J790L867K751M807R70J811k127m289
3479A201l028L073M227N799J13L36K350R7r0j0125j0605l37O251k922l804k48
3463g712J138j26l84o625K497k52j467l161O297Q752L688J695k868l555L389j243
3447F3L314L859l685l270l766J659q64j85J827N901o2R29k174r39P9L458n57M212
3429I799l333q747L288O457M223p12q781l726K413p25q721j854J168N258N87O674
3413C268O21O73Q37L489J556l307j64k727j093k663m370K371K979L359N850L281
3397A3960n096o837j67j21Q68M04J263r95J62j457K742j602p525K113r64k057
$$ plain form
3381 -5309 -3376 -3077 2148 2269 2903 -5607 -8568 -8532 -9945 -9728 -7823 -4420 -5627 -3386 -9568 -10578
3365 -10578 -4240 1175 1774 -220 -2957 3750 6928 597 -3013 -2267 -2336 -5088 -1183 -2817 -4302 -4722
3349 -4722 -7287 -12151 -11199 -8747 -11482 -8350 -3518 500 3167 9819 6810 5000 5294 3279 6718
3334 6718 1862 3898 544 5418 8930 9373 7129 4925 3170 6157 5207 2077 4969 9366 5151
3319 5151 -3892 -5517 -5568 -5429 -492 1756 -2262 -1839 -1227 -1530 -126 399 -207 869 -5514 -8931 -6974
3302 -6974 -4191 -7154 -7970 -7509 -8592 -8383 -4613 -484 7349 8679 6895 6308 1619 -2694 -3536 -3050
3286 -3050 -2382 -6347 -3120 -633 1062 2839 443 -2547 326 -537 -2691 752 -1919 -1284 3738 9119
3270 9119 3387 4966 5652 3242 -4436 -7253 -7663 -5290 -2413 -3611 -5131 -5644 -3661 -4792 -5660 -1361
$$ packed form
3381e309J933K99N225J21O34q510k961L6j413K17J905L403j207K241o182j010
3365a0578O338N415N99j994k737O707L178o331l610P46o9k752L905j634j485m20
3349d722k565m864R52K452k735L132M832M018K667O652l009j810K94k015L439
3334F718m856K036l354M874L512M43k244k204j755K987r50l130K892M397m215
3319E151r043j625n1J39M937K248m018M23O12l03J404N25o06J076o383l417J957
3302f974K783k963q16M61j083K09L770M129P833J330j784n87m689m313q42M86
3286c050O68l965L227K487J695J777k396k990K873q63k154L443k671O35N022N381
3270I119n732J579O86k410p678k817m10K373K877j198j520n13J983j131q68M299
$$ plain form
3254 -1361 1599 -3884 -3940 3574 1791 -3683 -5541 1494 3932 3487 -681 -4237 -6909 -7984 -9384 -5700
3238 -5700 -275 2893 2257 -1397 1904 1421 -3183 -7489 -10199 -3512 502 1371 1846 474 2281 -5183
3222 -5183 -1716 7124 2731 -4197 -6270 -6883 81 5761 1489 -599 -2265 -3800 -3931 -4124 -2487 3212
3206 3212 506 -4794 -2555 -1994 -3930 -5860 -9831 -5363 177 738 -2642 -5689 -6359 -9050 -5587 -1706
3190 -1706 106 -3229 -1093 -81 651 5968 1006 -1340 -5777 -7719 -11563 -11662 -10624 -10469 -7360 -7439
3174 -7439 -4441 -6863 -11782 -15115 -13238 -5479 -6943 -2634 5429 5767 4873 3411 1551 -1364 -288
3159 -288 5753 7191 7162 5057 850 -3400 -7844 -3187 -171 742 463 4104 12828 11645 7259 -862
3143 -862 -3140 -4607 235 1468 -1793 -4050 695 8955 7919 7305 4471 3011 3021 245 -4344 -6237
$$ packed form
3254a361K960n483n6P514j783n474j858P035K438m45m168l556k672j075j400L684
3238e700N425L168o36l654L301m83m604m306k710O687M014Q69M75j372J807p464
3222e183L467Q840m393o928k073o13O964N680m272k088j666j535j31j93J637N699
3206C212k706n300K239N61j936j930l971M468N540N61l380l047o70k691L463L881
3190a706J812l335K136J012P32N317m962k346m437j942l844r9J038J55L109p9
3174g439K998k422m919l333J877P759j464M309Q063L38q94j462j860k915J076
3159b88O041J438k9k105m207m250m444M657L016R13k79L641Q724j183m386q121
3143h62k278j467M842J233l261k257M745Q260j036o14k834j460J0k776m589j893
$$ plain form
3127 -6237 -7739 -2399 -3953 -5930 -793 3623 5549 5120 6962 7925 2586 3545 256 -9606 -11809 -8895
3111 -8895 -5071 4273 6348 4870 6683 3516 -4326 -2553 -282 -870 -4869 -6745 -7175 -4879 535
3096 535 2263 2949 2488 2280 1079 1209 6328 4495 1558 1503 198 -5716 -10475 -9136 -5941 -1069 433
3079 433 -43 -32 -4987 -8870 -3717 2683 -102 3905 4703 3360 2708 3720 -3589 -5251 -5851 -968 4678
3062 4678 2166 -4469 -8642 -1020 3551 1382 -5174 -5779 -840 54 -893 2709 2253 794 -839 -6405
3046 -6405 -13671 -13981 -11464 -5666 5600 10377 7618 -2307 -4719 -4280 -4216 -5514 -183 1741 80 -247
3030 -247 -7771 -7237 2175 4019 -126 -6028 -1395 -1065 4092 4808 -39 -4489 -6021 329 1789 2256
3014 2256 -1298 -626 -2166 736 1771 4175 5496 -3635 -5199 -4161 -3995 -2934 3202 3837 302 1665
$$ packed form
3127f237j502N340j554j977N137M416J926m29J842R63n339R59l289r862k203K914
3111h895L824R344K075j478J813l167p842J773K271n88l999j876m30K296N414
3096E35J728O86m61k08j201J30N119j833k937n5j305n914m759J339L195M872J502
3079D33m76J1m955l883N153O400k785M007P98j343o52J012p309j662o00M883N646
3062D678k512o635m173P622M571k169o556o05M939Q94r47L602m56j459j633n566
3046f405p266l10K517N798J1266M777k759r925k412M39O4j298N331J924j661l27
3030b47p524N34R412J844m145n902M633L30N157P16m847m450j532O350J460M67
3014B256l554O72j540K902J035K404J321r131j564J038J66J061O136O35l535J363
$$ plain form
2998 1665 539 -5724 -5833 -5041 -4119 3103 -1005 -1035 -1452 -11322 -15755 -12072 -7008 -6631 -4880 -4599 -5391
2981 -5391 -5733 -5781 -822 4913 18343 15660 6139 187 1918 -3214 -2634 2663 2083 -1505 -3752 -1491
2965 -1491 -3127 -7162 2439 2352 1363 -689 -2255 -6423 -5311 -7660 -16801 -15279 -9062 -8891 -11637 -9480
2949 -9480 -4726 304 7567 10975 7830 830 1951 8806 12559 13958 12283 6865 966 -6138 -4919
2934 -4919 1005 3544 7676 5639 2933 -1539 -5226 -3396 1032 1464 3369 8055 6367 1390 572
2919 572 6282 8708 740 -1962 1020 -1773 -1204 3433 324 -371 927 5401 2903 2749 2366 -57
2903 -57 -3138 1899 1538 -2560 3376 -1939 -4616 -4297 -2613 4383 12873 16614 1154 -5490 -6577 -3306
2887 -3306 3050 4684 8035 4818 7025 8554 4732 2137 5046 864 111 -20 -2649 80 -2300
$$ packed form
2998A665j126o263j09P92R22P222m108l0m17r870m433L683N064L77J751K81p92
2981e391l42m8M959N735J3430k683r521n952J731n132N80N297n80l588k247K261
2965a491j636m035R601q7r89k052j566m168J112k349r141J522O217J71k746K157
2949i480M754N030P263L408l145p000J121O855L753J399j675n418n899p104J219
2934d919N924K539M132k037k706m472l687J830M428M32J905M686j688m977q18
2919E72N710K426p968k702K982k793N69M637l109o95J298M474k498j54l83k423
2903e7l081N037l61m098N936n315k677L19J684O996Q490L741j5460o644j087L271
2887c306O356J634L351l217K207J529l822k595K909m182p53j31k629K729k380
$$ plain form
2872 -2300 5975 4960 -5562 -7101 -5054 -4984 -6901 1677 -231 -2049 -1761 -357 -2022 2563 6559
2857 6559 2685 1301 4844 673 2017 4436 3766 2908 4881 330 -1097 1433 4352 4836 4503 2275
2841 2275 -720 -1196 -2504 -1240 767 -1489 -1725 -4576 -6395 -3466 -5519 -5821 -3270 -1225 56 865
2825 865 -597 -2669 42 -98 3472 7519 10506 5449 -829 -6589 -11297 -13368 -11799 -10830 -12609 -13444
2809 -13444 -7268 -7363 -7515 -5763 -6564 -6368 -805 362 -1041 -3043 2551 9442 7286 5277 9363 10570
2793 10570 8462 734 -2551 1564 4400 2986 -585 1063 -1358 -3656 -3490 -894 -1457 529 -892
2778 -892 -6458 -6529 -208 -342 -2108 -3197 -4843 -5912 -6029 -10487 -10307 -1894 7349 6036 -39 -4536
2762 -4536 259 1704 -746 -2002 -1244 -968 -5936 -7200 -4644 3465 3057 -2487 -1131 -3761 -6459 -4238
$$ packed form
2872b300Q275j015j0522j539K047P0j917Q578j908j818K88J404j665M585L996
2857F559l874j384L543m171J344K419o70q58J973m551j427K530K919M84l33k228
2841B275k995m76j308J264K007k256k36k851j819K929k053l02K551K045J281Q09
2825H65j462k072K711j40L570M047K987n057o278n760m708k071J569R69j779q35
2809a3444O176r5j52J752q01J96N563J167j403k002N594O891k156k009M086J207
2793A0570k108p728l285M115K836j414l571J648k421k298J66K596n63J986j421
2778h92n566p1O321j34j766j089j646j069j17m458J80Q413R243j313o075m497
2762d536M795J445k450j256P58K76m968j264K556Q109m08n544J356k630k698K221
$$ plain form
2746 -4238 -4345 -1779 -2477 -6430 4547 9517 16724 15887 13485 3792 -1881 -4617 -8392 -7388 -7729 -4702
2730 -4702 -5431 -3785 186 3512 3084 2057 -3175 -8465 -9026 -5172 -5783 -2024 4483 6954 5852 1446
2714 1446 -2493 -2545 -6322 -5600 -2077 2135 5317 2471 -3072 -3451 -5273 -8745 -7134 -83 3679 3755
2698 3755 -2487 -4031 1387 5364 6580 8029 12565 9180 3475 3712 6337 3794 4596 5224 3776 3050
2682 3050 -2216 -2351 -3751 -8964 -8283 -3887 1743 3514 -619 -1234 -4979 -4471 -7621 -12699 -2842 -255
2666 -255 -5909 -2367 -4732 -6105 -1563 3859 5410 3174 3605 7603 4714 -1381 -6069 -1020 1976
2651 1976 1311 -521 -9581 -8375 -3458 2845 8552 5929 719 -6867 -11476 -9654 -4571 -3215 -422
2636 -422 4779 4428 -4015 -6303 598 -309 -3839 808 4171 4270 1388 -698 6158 7058 3340 2807 3068
$$ packed form
2746d238j07K566o98l953J0977M970P207q37k402r693n673k736l775J004l41L027
2730d702p29J646L971L326m28j027n232n290n61L854o11L759O507K471j102m406
2714A446l939n2l777P22L523M212L182k846n543l79j822l472J611P051L762P6
2698C755o242j544N418L977J216J449M536l385n705K37K625k543Q02O28j448p26
2682C050n266j35j400n213O81M396N630J771m133o15l745N08l150n078R857K587
2666b55n654L542k365j373M542N422J551k236M31L998k889o095m688N049K996
2651A976o65j832r060J206M917O303N707k623n210p586m609J822N083J356K793
2636d22N201l51q443k288O901r07l530M647L363R9k882k086O856R00l718n33K61
$$ plain form
2619 3068 5547 7645 5548 4550 -304 1038 2461 4388 7758 13703 8331 3664 7274 6188 3674
2604 3674 4442 3161 3693 8701 3256 2805 5224 1231 -2422 374 -4018 -3599 -1118 -3773 -1596 2633
2588 2633 4916 1636 -7 1136 2793 868 -2691 -7908 -7492 -5065 291 3308 -712 -1119 -4328
2573 -4328 -1062 3175 5570 9360 13816 4919 1841 5132 5082 3907 1958 2792 4163 4599 1702 6866
2557 6866 617 -4633 -11760 -11069 -7620 -9927 -13698 -7661 -1824 -3910 -7031 -7382 -10833 -8922 -8302 -2774
2541 -2774 5742 4205 -6033 -3951 -859 2052 5078 -85 -6599 -5109 -5690 -3404 114 -3307 1094
2526 1094 3358 7120 9049 8680 -1219 -4059 -1608 -2837 -3915 -63 -2852 -10682 -12986 -12917 -7676 -3362
2510 -3362 -3253 -4204 -3753 -7901 -4796 957 6151 6839 7005 5547 1879 -4849 -2368 -2332 -670 6832 3949
$$ packed form
2619C068K479K098k097r98m854J342J423J927L370N945n372m667L610j086k514
2604C674P68j281N32N008n445m51K419l993l653K796m392M19K481k655K177M229
2588B633K283l280j643J143J657j925l559n217M16K427N356L017m020m07l209
2573d328L266M237K395L790M456q897l078L291n0j175j949Q34J371M36k897N164
2557F866o249n250p127O91L449k307l771O037N837k086l121l51l451J911O20N528
2541b774Q516j537j0238K082L092K911L026n163o514J490n81K286L518l421M401
2526A094K264L762J929l69r899k840K451j229j078L852k789p830k304O9N241M314
2510c362J09r51M51m148L105N753N194O88J66j458l668o728K481L6J662P502k883
$$ plain form
2493 3949 5091 5476 9426 10310 6195 2683 1935 8519 5681 1874 6822 11856 7490 6902 6258 6091
2477 6091 4958 3725 5765 9261 5954 6215 6532 5383 11765 11341 14367 16083 12433 11275 9804 14688
2461 14688 11287 5690 5465 3216 1796 5957 5429 2383 4680 9930 16305 12143 11778 7866 10864
2446 10864 5879 -6631 -15602 -10142 -3530 6481 9005 2830 835 3389 3475 -224 574 1856 2392
2431 2392 5189 3860 2471 8685 4828 6937 5358 1856 3339 3838 4546 1748 2064 528 2417 6431
2415 6431 6388 2567 2641 5234 3498 -1885 -618 -1662 -2188 2425 2515 1853 2804 4810 4669 2526 -2009
2398 -2009 -1164 -2773 -5576 -4560 -4209 -619 1234 5739 630 -3041 -5739 2794 2679 2025 5917 3817
2382 3817 3961 5498 2189 609 227 -1014 -6706 -3784 -2212 -157 594 -1591 3206 7347 5663 -5320
$$ packed form
2493C949J142L85L950Q84m115l512p48O584k838l807M948N034m366n88o44j67
2477F091j133j233K040L496l307K61L17j149O382m24L026J716l650j158j471M884
2461A4688l401n597k25k249j420M161n28l046K297N250O375m162l65l912K998
2446A0864m985j2510q971N460O612J0011K524o175j995K554Q6l699P98J282N36
2431B392K797j329j389O214l857K109j579l502J483M99P08k798L16j536J889M014
2415F431m3l821P4K593j736n383J267j044n26M613R0o62R51K006j41k143m535
2398b009Q45j609k803J016L51L590J853M505n109l671k698Q533j15o54L892k100
2382C817J44J537l309j580l82j241n692K922J572K055P51k185M797M141j684j0983
$$ plain form
2366 -5320 -2328 -860 -24 2442 8825 10290 10319 8136 8020 2912 -1202 -2737 -3429 1714 2359 -2405
2350 -2405 -4486 -2688 -2383 -2895 1890 4354 3637 9822 11265 9475 3382 762 -1153 -525 1030 1702
2334 1702 7021 8879 2916 -124 4383 334 -5894 -786 2837 2386 8602 11161 6865 3962 -342
2319 -342 -6778 -3444 -797 6153 11379 5826 4901 -621 -1824 -1657 2185 7763 7309 -330 -4684 -4498
2303 -4498 -1774 1265 339 3393 -1437 -2546 -153 -1464 1358 -79 2859 3463 1927 5989 6579 83
2287 83 -2704 -1503 -2742 -4954 -4305 -939 -1686 -2291 -1480 -803 904 3708 303 -2993 -4208 -2673 -4321
2270 -4321 -9572 -12079 -13746 -10095 -3256 -4587 -2903 4014 6195 10171 10807 7506 9072 9811 6812
2255 6812 -1745 -4452 -3961 -2149 308 -5146 312 4222 6922 2129 -1164 -3395 -6947 -10762 -11109
$$ packed form
2366e320K992J468Q36K466O383J465K9k183j16n108m114j535o92N143O45m764
2350b405k081J798L05n12M785K464p17O185J443j790o093k620j915O28J555O72
2334A702N319J858n963l040M507m049o228N108L623m51O216K559m296k903m304
2319c42o436L334K647O950N226n553r25n522j203J67L842N578m54p639m354J86
2303d498K724L039r26L054m830j109K393j311K822j437K938O04j536M062N90o496
2287H3k787J201j239k212O49L366p47o05Q11O77J707K804l405l296j215J535j648
2270d321n251k507j667L651O839j331J684O917K181L976O36l301J566P39k999
2255F812q557k707M91J812K457n454N458L910K700m793l293k231l552l815l47
$$ plain form
2240 -11109 -9796 -3043 -769 -1667 311 5775 5151 1140 -951 -5357 -2989 2564 2114 3578 1343
2225 1343 -1895 3326 141 -102 -4521 -8398 -11551 -8792 -2530 530 4952 4537 4833 -1468 -5328 -9021
2209 -9021 -9724 -4566 -2936 -2110 -6227 -3441 5705 10676 5621 1615 9672 19009 16867 11912 10332
2194 10332 15443 13304 7951 5242 2640 3237 4241 -848 -1849 8784 7631 2512 -4580 -7038 -1728
2179 -1728 -2749 -8308 -2397 847 -341 -5912 -8035 -5491 5116 6815 6229 -506 -10327 -3936 -163
2164 -163 -3959 -5772 -8293 -3632 -1283 7115 9846 5629 1597 1102 6918 6398 2910 1302 -831 -1778
2148 -1778 -8564 -9787 -6739 1026 -1284 -4257 -2488 607 7971 3448 -230 2766 9422 6395 4559
2133 4559 10946 10814 6746 3234 5801 5635 4715 7562 4175 4522 5389 1394 757 3031 94 -6832
$$ packed form
2240a1109J313O753K274q98J978N464o24m011k091m406K368N553m50J464k235
2225A343l238N221l185k43m419l877l153K759O262L060M422m15K96o301l860l693
2209i021p03N158J630Q26m117K786R146M971n055m006Q057R337k142m955j580
2194A0332N111k139n353k709k602N97J004n089j001J0633j153n119p092k458N310
2179a728j021n559N911L244j188n571k123K544J0607J699n86o735r821O391L773
2164a63l796j813k521M661K349Q398K731m217m032m95N816n20l488j608k133r47
2148a778o786j223L048P765k310k973J769L095P364m523l678K996O656l027j836
2133D559O387j32m068l512K567j66r20K847l387L47Q67l995o37K274k937o926
$$ plain form
2117 -6832 -3981 3207 9351 14001 5302 6189 5841 4541 9129 2496 -1539 -2522 2522 3332 2668 2422
2101 2422 -3276 -2011 -1418 3144 777 -2096 1175 1345 -3285 3235 6149 8331 8857 8351 3583 1347
2085 1347 3948 -5189 -7312 701 6134 4284 5946 4021 -4314 -7610 -3936 818 -3184 -7201 -11923
2070 -11923 -7489 -2251 -1771 -2363 4300 -215 2062 4749 7834 8444 4543 -3956 -195 -2168 -9670
2055 -9670 -11723 -5440 -3875 630 4690 3787 1044 4480 7294 10153 9555 3155 3694 6076 3357 5625
2039 5625 4506 2788 -845 -5754 -10168 -13174 -9880 -535 -2323 -2293 2372 5483 6772 11676 4629
2024 4629 3882 2782 2340 -2927 -2087 -1157 -124 2103 -5968 -5967 -3414 545 2299 2205 -3186 -6794 -2469
2007 -2469 9 -2372 -5603 -10761 -6682 -2373 -2037 199 1951 2809 -863 -1589 -5654 -10832 -13654 -11118
$$ packed form
2117f832K851P188O144M650q699Q87l48j300M588o633m035r83N044Q10o64k46
2101B422n698J265N93M562k367k873L271J70m630O520K914K182N26n06m768k236
2085A347K601r137k123Q013N433j850J662j925q335l296L674M754m002m017m722
2070a1923M434N238M80n92O663m515K277K687L085O10l901q499L761j973p502
2055i670k053O283J565M505M060r03k743L436K814K859n98o400N39K382k719K268
2039E625j119j718l633m909m414l006L294R345j788L0M665L111J289M904p047
2024D629p47j100m42n267Q40R30J033K227q071JK553L959J754r4n391l608M325
2007b469K478k381l231n158M079M309L36K236J752Q58l672p26m065n178k822K536
$$ plain form
1991 -11118 -1895 -1481 -3980 2284 9467 2525 -2222 3571 3758 -1924 -2053 767 -464 -246 -6333 -7882
1975 -7882 -9664 -3846 600 4571 4414 3483 4492 4013 -2901 1741 454 -377 -3157 -7626 -7586 -10447
1959 -10447 -6662 2921 3737 4200 7002 9997 9618 5969 9964 7823 5920 1665 -2546 -6594 -5321
1944 -5321 1233 3919 4424 6992 3496 -480 -2763 -2963 -1826 -1919 -5764 -10079 -9796 -9077 -7060 -5450
1928 -5450 112 3059 4493 5799 4716 -1440 -3104 288 412 -3472 -6541 484 4459 -2739 -841
1913 -841 -363 -3139 -3285 -4116 -2663 -1436 1140 1588 -3370 -3577 4124 177 1495 463 -6000 -10224
1897 -10224 -15215 -17213 -17263 -10938 -1515 6673 6774 5968 7243 5184 5321 7514 6851 8447 11040 9498
1881 9498 6302 -3617 -304 -911 -1886 -2403 -8695 -8321 -3963 -3757 -11253 -10468 -8845 -4748 -380 1221
$$ packed form
1991a1118R223M14k499O264P183o942m747N793J87n682j29K820j231K18o087j549
1975g882j782N818M446L971j57r31J009m79o914M642j287q31k780m469M0k861
1959a0447L785R583Q16M63K802K995l79l649L995k141j903m255m211m048J273
1944e321O554K686N05K568l496l976k283k00J137r3l845m315K83P19K017J610
1928e450N562K947J434J306j083o156j664L392J24l884l069P025L975p198J898
1913h41M78k776j46q31J453J227K576M48m958k07P701l947J318j032o463m224
1897a0224m991j998n0O325R423Q188J01q06J275k059J37K193o63J596K593j542
1881I498l196r919L313o07r75n17o292L74M358K06p496P85J623M097M368J601
$$ plain form
1865 1221 2814 3264 -2390 -6470 -6424 -9807 -6530 1742 2814 4225 910 -1057 -1823 -3819 -1819 3817
1849 3817 5630 11368 14572 14979 13047 13221 9912 7254 5848 8649 10402 2950 3030 -319 -3236 -5144
1833 -5144 -1885 9165 10522 8589 10121 14057 11588 6063 4530 5612 7490 9468 5158 -1991 -3492
1818 -3492 2805 2391 -4256 -4371 1630 1918 1808 6099 91 -579 -3465 -7843 -3518 -5969 -6978 -4321
1802 -4321 -5298 -8600 -6145 -765 3033 6583 11200 10016 2276 -3254 -1792 1841 2899 112 -3085
1787 -3085 -9598 -7525 1374 8329 4832 2624 -1452 -190 -710 -1745 -4370 -4526 -3959 -2351 -5813 -11557
1771 -11557 -12507 -9461 -7601 -4852 -4266 -8499 -6735 172 -2353 -5311 -3909 -5062 -3370 -2331 -5003
1756 -5003 -5434 157 4397 1331 -6590 -10677 -12224 -4995 4454 7482 2881 -7523 -5317 2577 4023
$$ packed form
1865A221J593M50n654m080M6l383L277Q272J072J411l315j967p66j996K000N636
1849C817J813N738L204M07j932J74l309k658j406K801J753p452Q0l349k917j908
1833e144L259J1050J357j933J532L936k469n525j533J082J878J978m310p149j501
1818c492O297m14o647j15O001K88j10M291o008o70k886m378M325k451j009K657
1802d321r77l302K455N380L798L550M617j184p740n530J462L633J058k787l197
1787c085o513K073Q899O955l497k208m076J262n20j035k625j56N67J608l462n744
1771a1557r50L046J860K749N86m233J764O907k525k958J402j153J692J039k672
1756e003m31N591M240l066p921m087j547P229R449L028m601j0404K206P894J446
$$ plain form
1741 4023 1960 1356 2601 -4374 -6207 -4990 -5601 -2392 -9802 -8359 989 5235 4414 6011 2048 485
1725 485 -685 1761 2231 -1131 422 5686 4001 2108 3525 10610 5968 126 -4929 -5223 -6698 -7345
1709 -7345 -4500 1534 10826 7503 5181 3451 1183 -1617 1494 -453 -5149 -4848 -1542 -1108 1775
1694 1775 4346 -499 415 3077 9033 9678 9769 5616 7553 8391 2012 -1275 -2587 -5949 -6580 -8021
1678 -8021 -10078 -4564 1389 3106 2202 -586 -4474 -2375 -2397 553 -737 -314 -1206 -1531 3069 6280
1662 6280 14832 17661 11154 6621 -1525 -4644 -6978 -6015 -644 -2712 -7304 -7772 -2785 2795 432
1647 432 1679 3047 1289 8451 10002 5324 5539 6352 4279 3815 3833 8024 11757 9876 7569 3278
1631 3278 -645 1627 95 3543 9715 9790 9130 6954 2092 -2300 -7278 -8152 -5124 -6483 -11266 -7319
$$ packed form
1741D023k063o04J245o975j833J217o11L209p410J443R348M246q21J597l963j563
1725D85j170K446M70l362J553N264j685j893J417P085m642n842n055k94j475o47
1709g345K845O034R292l323k322j730k268k800L111j947m696L01L306M34K883
1694A775K571m845R14K662N956O45R1m153J937Q38o379l287j312l362o31j441
1678h021k057N514N953J717r04k788l888K099k2K950j290M23q92l25M600L211
1662F280Q552K829o507m533q146l119k334R63N371k068m592m68M987N580k363
1647D32J247J368j758P162J551m678K15Q13k073m64J8M191L733j881k307m291
1631C278l923K272j532L448O172P5o60k176m862m392m978q74L028j359m783L947
$$ plain form
1615 -7319 -2299 -3610 -5464 -5520 -1997 -5184 -7219 -2691 92 3567 5820 3024 -2892 -6436 -4930
1600 -4930 -5119 -2145 -2220 1008 2161 6530 8444 7861 3829 1315 2559 3278 5520 6663 -2739 -1595
1584 -1595 -3938 -531 602 -6475 -2855 4844 4498 2547 -1028 -48 -3461 -6891 -10325 -6433 -4528
1569 -4528 117 4012 4047 7292 8601 8776 3936 2526 6865 12172 11107 8298 9541 11544 11493 1419
1553 1419 -1927 -3285 -1769 4136 9229 10189 5295 1313 952 5857 8853 2186 -7947 -10024 -5491
1538 -5491 -3608 1343 1632 1533 -4216 -2285 -1342 1175 -18 4967 13043 10428 5051 1082 -1431 4400
1522 4400 9295 8035 9461 5230 2283 -167 798 5591 6616 3208 -5374 -4803 -3416 -389 7604
1507 7604 3949 -857 1932 1059 2594 902 -2567 -5011 -4893 -7049 -5698 1380 2144 6652 6426 5861
$$ packed form
1615g319N020j311j854n6L523l187k035M528K783L475K253k796n916l544J506
1600d930j89K974p5L228J153M369J914n83m032k514J244P19K242J143r402J144
1584a595k343L407J133p077L620P699l46j951l575R80l413l430l434L892J905
1569d528M645L895L5L245J309J75m840j410M339N307j065k809J243K003n1j0074
1553A419l346j358J516N905N093R60m894l982l61M905K996o667j0133k077M533
1538e491J883M951K89r9n749J931R43K517j193M985Q076k615n377l969k513N831
1522D400M895j260J426m231k947k450R65M793J025l408q582N71J387L027P993
1507G604l655m806K789q73J535j692l469k444J18k156J351P078P64M508k26n65
$$ plain form
1491 5861 5896 1124 -1644 -5185 -12295 -12974 -7841 -8984 -7336 -2890 1225 783 1683 -669 -654 -3397 -5377
1474 -5377 -1545 -3110 -3542 -1694 -908 449 -2627 33 -1521 -6528 -37 -1071 -947 -6457 -8137 -10174
1458 -10174 -13014 -10145 -7525 -5895 -944 8991 6420 8747 9507 6828 3708 -261 -4783 -8361 -558
1443 -558 -985 808 -2037 382 691 1415 2708 7070 2227 551 1206 904 3808 4565 8477 5190 3694
1426 3694 6312 6237 1667 736 1588 -1009 -4356 -5428 -547 -2740 -9458 -3808 165 -1863 -10124 -12165
1410 -12165 -8775 -1599 7022 11502 12021 12382 5309 5159 784 -114 3257 438 1521 4624 4506 5200
1394 5200 -1033 723 1183 3620 5757 5362 2175 1616 -1285 -1056 3717 5533 285 961 1345 3740
1378 3740 2030 3345 1096 -2754 -5452 -4786 -3153 4112 8881 5500 3677 8852 3794 -4431 -2080
$$ packed form
1491E861L5m772k768l541p110o79N133j143J648M446M115m42R00k352J5k743j980
1474e377L832j565m32J848P86J357l076K660j554n007O491j034J24n510j680k037
1458a0174k840K869K620J630M951R935k571K327P60k679l120l969m522l578P803
1443e58m27J793k845K419L09P24J293M362m843j676O55l02K904P57L912l287j496
1426C694K618p5m570r31Q52k597l347j072M881k193o718N650L973k028q261k041
1410a2165L390P176Q621M480N19L61p073j50m375q98L371k819J083L103j18O94
1394E200o233J756M60K437K137l95l187n59k901K29M773J816n248O76L84K395
1378C740j710J315k249l850k698O66J633P265M769l381j823N175n058q225K351
$$ plain form
1363 -2080 -731 -1960 -2685 -6064 -5664 -4194 -2210 -910 3754 6988 6705 422 -4624 -2052 3125 -3508
1347 -3508 -10706 -10051 -310 1792 -5428 -8516 -4899 -1946 826 -714 -2590 -1962 47 -3096 -3673 -6537
1331 -6537 -7574 -3525 -2698 -1923 4005 9878 5803 3741 7829 3073 1692 -170 222 5109 2393 206
1315 206 -1975 -4708 -1641 -3718 -4992 -115 8201 8184 4387 391 -1917 299 -916 -3083 -6362 -6849
1299 -6849 839 -548 -719 838 -3875 -3157 -1440 5066 2940 -3732 -6374 -7889 -5384 -358 1227
$$ packed form
1363b080J349j229p25l379M00J470J984J300M664L234k83o283n046K572N177o633
1347c508p198O55R741K102p220l088L617K953K772j540j876O28K009l143n77k864
1331f537j037M049Q27P75N928N873m075k062M088m756j381j862L92M887k716k187
1315B06k181k733L067k077j274M877Q316j7l797l996k308K216j215k167l279m87
1299f849P688j387j71J557m713P18J717O506k126o672k642j515K505N026J585
$$ [...]
##END NTUPLES=NMR SPECTRUM
##END=
