##TITLE=Analysis number 312534
Compound Code ac 12787
Project Code adrs
Chemist Name avocado
##JCAMPDX= 6.0         $$ Bruker NMR JCAMP-DX V2.0
##DATA TYPE= NMR SPECTRUM
##DATA CLASS= NTUPLES
##ORIGIN= Bruker BioSpin GmbH
##OWNER= NMR
$$ XWIN-NMR		Version 3.5
$$ Mon Aug  8 10:33:02 2005 GMT Daylight Time (UT+1h)  MAYBRIDGE\NMR@NMR_250MHZ
##.OBSERVE FREQUENCY= 250.131544655141
##.OBSERVE NUCLEUS= ^1H
##.ACQUISITION MODE= SIMULTANEOUS (DQD)
##.ACQUISITION SCHEME= undefined
##.AVERAGES= 16
##.DIGITISER RES= 18
##SPECTROMETER/DATA SYSTEM= dpx250
##.PULSE SEQUENCE= zg30
##.SOLVENT NAME= CDCl3
##.SHIFT REFERENCE= (INTERNAL, CDCl3, 0, 16.522)
##AUDIT TRAIL= $$ (NUMBER, WHEN, WHO, WHERE, WHAT)
$$ ##TITLE= Audit trail, XWIN-NMR		Version 3.5
$$ ##JCAMPDX= 5.01
$$ ##ORIGIN= Bruker BioSpin GmbH
$$ ##OWNER= NMR
$$ C:\u/data/dgb/nmr/ADRS/7260/pdata/1/auditp.txt
$$ ##AUDIT TRAIL=  $$ (NUMBER, WHEN, WHO, WHERE, WHAT)
(   1,<2005-08-08 10:32:43.26 +100>,<MAYBRIDGE\NMR>,<NMR_250MHZ>,
      <created by zg, POWCHK disabled, PULCHK disabled
       configuration hash MD5:
       62 19 C7 07 E1 42 D1 B7 37 6C 3D D0 77 39 F9 E6
       data hash MD5: 64K
       2E 47 28 5B 33 DD D6 4F 8C 7F F9 8C 18 B7 7D 28>)
(   2,<2005-08-08 10:32:54.50 +100>,<MAYBRIDGE\NMR>,<NMR_250MHZ>,
      <Start of raw data processing
       ef LB = 0.3 FT_mod = 6 PKNL = 1 SI = 32K 
       data hash MD5: 32K
       1D 4C 72 A3 E3 A7 CA 18 97 5A DD E1 73 46 EB 0C>)
(   3,<2005-08-08 10:32:56.10 +100>,<MAYBRIDGE\NMR>,<NMR_250MHZ>,
      <apk 
       data hash MD5: 32K
       B8 F1 CE FF 2B 68 03 EF 22 78 CF BC BD 6C 23 2F>)
(   4,<2005-08-08 10:32:56.81 +100>,<MAYBRIDGE\NMR>,<NMR_250MHZ>,
      <abs ABSG = 5 
       data hash MD5: 32K
       AA CF 72 75 D1 E8 CC 9E 45 9F FA 8D C8 D3 D0 60>)
$$ ##END=
$$ 
$$ hash MD5
$$ 07 A6 11 84 FC 27 38 E5 36 AD BC 16 8B EE 18 53
##$RELAX= 
##$RELAX= 
##$RELAX= 
##$RELAX= 
##$RELAX= 
##$RELAX= 
##$RELAX= 
$$ Bruker specific parameters
$$ --------------------------
##$DU= <C:\u>
##$EXPNO= 7260
##$NAME= <ADRS>
##$PROCNO= 1
##$TYPE= <nmr>
##$USER= <dgb>
##$AMP= (0..31)
100 100 100 100 100 100 100 100 100 100 100 100 100 100 100 100 100 100 
100 100 100 100 100 100 100 100 100 100 100 100 100 100 
##$AQSEQ= 0
##$AQ_mod= 3
##$AUNM= <au_zg>
##$AUTOPOS= <16 >
##$BF1= 250.13
##$BF2= 250.13
##$BF3= 250.13
##$BF4= 250.13
##$BF5= 500.13
##$BF6= 500.13
##$BF7= 500.13
##$BF8= 500.13
##$BYTORDA= 1
##$CFDGTYP= 0
##$CFRGTYP= 5
##$CHEMSTR= <none>
##$CNST= (0..31)
1 1 145 1 1 1 1 1 1 1 1 1 1 1 1 1 1 1 1 1 1 1 1 1 1 1 1 1 1 1 1 1 
##$CPDPRG= <>
##$CPDPRG1= <>
##$CPDPRG2= <>
##$CPDPRG3= <>
##$CPDPRG4= <mlev>
##$CPDPRG5= <mlev>
##$CPDPRG6= <mlev>
##$CPDPRG7= <mlev>
##$CPDPRG8= <mlev>
##$CPDPRGB= <>
##$CPDPRGT= <>
##$D= (0..31)
0 1 0 0 0 0 0 0 0 0.06 0 0 0 0 0 0 0.0002 0 0 0 0 0 0 0 0 0 0 0 0 0 0 
0 
##$DATE= 1123493562
##$DBL= (0..7)
120 120 120 120 120 120 120 120 
##$DBP= (0..7)
150 150 150 150 150 150 150 150 
##$DBP07= 0
##$DBPNAM0= <>
##$DBPNAM1= <>
##$DBPNAM2= <>
$$ [...]
##$SUBNAM7= <"">
##$SUBNAM8= <"">
##$SUBNAM9= <"">
##$SW= 20.6930455092707
##$SWIBOX= (0..15)
0 0 3 0 0 0 0 0 0 0 0 0 0 0 0 0 
##$SW_h= 5175.983436853
##$TD= 65536
##$TD0= 1
##$TE= 295.16
##$TE2= 300
##$TE3= 300
##$TEG= 300
##$TL= (0..7)
0 120 120 120 120 120 120 120 
##$TP= (0..7)
150 150 150 150 150 150 150 150 
##$TP07= 0
##$TPNAME0= <>
##$TPNAME1= <>
##$TPNAME2= <>
##$TPNAME3= <>
##$TPNAME4= <>
##$TPNAME5= <>
##$TPNAME6= <>
##$TPNAME7= <>
##$TPOAL= (0..7)
0.5 0.5 0.5 0.5 0.5 0.5 0.5 0.5 
##$TPOFFS= (0..7)
0 0 0 0 0 0 0 0 
##$TUNHIN= 0
##$TUNHOUT= 0
##$TUNXOUT= 0
##$USERA1= <user>
##$USERA2= <user>
##$USERA3= <user>
##$USERA4= <user>
##$USERA5= <user>
##$V9= 5
##$VALIST= <valist>
##$VCLIST= <CCCCCCCCCCCCCCC>
##$VD= 0
##$VDLIST= <DDDDDDDDDDDDDDD>
##$VPLIST= <PPPPPPPPPPPPPPP>
##$VTLIST= <TTTTTTTTTTTTTTT>
##$WBST= 1024
##$WBSW= 4
##$XGAIN= (0..3)
0 0 0 0 
##$XL= 0
##$YL= 0
##$YMAX_a= 479702
##$YMIN_a= -431606
##$ZGOPTNS= <>
##$ZL1= 120
##$ZL2= 120
##$ZL3= 120
##$ZL4= 120
##$ABSF1= 16.522
##$ABSF2= -4.171173
##$ABSG= 5
##$ABSL= 3
##$ALPHA= 0
##$AQORDER= 0
##$ASSFAC= 0
##$ASSFACI= 0
##$ASSFACX= 0
##$ASSWID= 0
##$AUNMP= <proc_1d>
##$AZFE= 0.1
##$AZFW= 0.1
##$BCFW= 0
##$BC_mod= 0
##$BYTORDP= 0
##$COROFFS= 0
##$CY= 12.5
##$DATMOD= 1
##$DC= 0
##$DFILT= <>
##$DTYPP= 0
##$F1P= 14.0000005364418
##$F2P= -0.99999901652339
##$FCOR= 0.5
##$FTSIZE= 32768
##$FT_mod= 6
##$GAMMA= 0
##$GB= 0
##$INTBC= 1
##$INTSCL= 1
##$ISEN= 128
##$LB= 0.3
##$LEV0= 0
##$LPBIN= 0
##$MAXI= 10000
##$MC2= 0
##$MEAN= 0
##$ME_mod= 0
##$MI= 0
##$NCOEF= 0
##$NC_proc= -2
##$NLEV= 6
##$NOISF1= 0
##$NOISF2= 0
##$NSP= 0
##$NTH_PI= 0
##$NZP= 0
##$OFFSET= 16.522
##$PC= 1
##$PHC0= 129.9982
##$PHC1= 6.07199
##$PH_mod= 1
##$PKNL= yes
##$PPARMOD= 0
##$PSCAL= 4
##$PSIGN= 0
##$REVERSE= no
##$SF= 250.13
##$SI= 32768
##$SIGF1= 0
##$SIGF2= 0
##$SINO= 400
##$SIOLD= 32768
##$SREGLST= <1H.CDCl3>
##$SSB= 0
##$STSI= 32768
##$STSR= 0
##$SW_p= 5175.98343685301
##$SYMM= 0
##$S_DEV= 0
##$TDeff= 65536
##$TDoff= 0
##$TI= <Analysis number 999999
Compound Code 99
Book Reference 9
Project Code 9>
##$TILT= no
##$TM1= 0
##$TM2= 0
##$TOPLEV= 0
##$USERP1= <user>
##$USERP2= <user>
##$USERP3= <user>
##$USERP4= <user>
##$USERP5= <user>
##$WDW= 1
##$XDIM= 32768
##$YMAX_p= 261014442
##$YMIN_p= -107111
$$ End of Bruker specific parameters
$$ ---------------------------------
##NTUPLES= NMR SPECTRUM
##VAR_NAME=  FREQUENCY,     SPECTRUM/REAL,   SPECTRUM/IMAG
##SYMBOL=    X,             R,               I
##VAR_TYPE=  INDEPENDENT,   DEPENDENT,       DEPENDENT
##VAR_FORM=  AFFN,          ASDF,            ASDF
##VAR_DIM=   32768,         32768,           32768
##UNITS=     HZ,            ARBITRARY UNITS, ARBITRARY UNITS
##FACTOR=    0.157963299565203, 1,           1
##FIRST=     4132.6476996994, 0,             0
##LAST=      -1043.33573715361, 0,           0
##MIN=       -1043.33573715361, -107111,     0
##MAX=       4132.6476996994, 261014442,     0
$$ Real data points
##PAGE= N=1
##DATA TABLE= (X++(R..R)), XYDATA
$$ [...]
22231 13316 16272 20502 24689 35332 43266 52004 55055 50083 39827 31476 25042 20567 18901 18231
22217 18231 14109 7744 2341 1696 2907 6450 7464 3960 5891 8632 20475 33514 40028 46215
22203 46215 56181 66944 75793 88486 112714 152521 210931 261416 269369 264900 266119 224505 173888
22190 173888 131857 91214 63149 51549 51281 50677 47486 42717 40157 43246 53790 70425 90119
22177 90119 116588 152348 215144 324711 505292 774007 1047222 1133180 984450 733789
22167 733789 516502 390821 319998 259803 199030 145522 103816 77288 62738 52684 45796
22156 45796 46498 48297 44103 37607 32848 33411 39812 52195 67275 82258 93385 98254 95564 89099
22142 89099 81979 74035 64159 59320 59444 60301 62927 65185 69627 81989 95948 106021 113136 116918
22128 116918 118210 117758 117612 115935 112044 104020 98609 102693 114855 128466 133133 137363 139660 149262
22114 149262 177049 210816 242289 267762 275337 276105 294119 328471 367656 406527 446811 473098
22102 473098 489313 504409 517991 542117 575060 599721 614048 628778 659114 713425 796590
22091 796590 897023 992380 1065277 1148126 1288419 1522178 1823827 2152318 2507232 2949581
22081 2949581 3516746 4212983 5091960 6257837 7829915 9954579 12899022 17243739 24130330
22072 24130330 35622544 55369775 89037831 137527135 178840376 184074778 154383291
22065 154383291 111566793 75612282 52704825 38658375 29015292 21660879 16079061
22058 16079061 12142006 9484711 7664906 6376585 5440067 4726466 4155191 3698535 3346348
22049 3346348 3079191 2846146 2603757 2352456 2127720 1957046 1830329 1713254 1583639
22040 1583639 1448239 1328975 1224964 1130421 1043612 965310 895384 828705 775289 733682 697026
22029 697026 673042 664803 656255 637421 605976 573307 555155 552487 551878 547123 534288 515336 491784
22016 491784 472237 461852 457421 450769 433593 408005 386285 367375 349977 333625 319707 304607
22004 304607 292427 286554 286135 292218 294620 291504 287571 280809 272556 263730 249596 235857 221199
21991 221199 203497 189458 182218 182859 192866 204504 214272 220585 221433 218527 215002 211352 210498 213851
21977 213851 214657 213281 214861 215600 213770 215729 218258 227195 252958 293498 368439 508615 746327
21964 746327 1044334 1211931 1129112 885607 638587 467332 364027 302783 263129 232179
21954 232179 208988 192637 175727 163479 155343 157513 163739 175349 195683 210377 219073 251173
21942 251173 305311 312760 262207 223240 196069 158971 129329 111435 96832 84920 75855 74416
21930 74416 74894 76239 80515 82682 84036 88667 88714 88565 89441 90949 86537 80731 76540 72639 68830 67540
21914 67540 65053 58149 49234 40644 29231 24376 28719 36759 45205 52062 53849 57982 59149 60102
21900 60102 59555 55996 51145 47117 46239 47181 49518 47201 44609 40056 39352 41123 47635 52850 48609
21885 48609 37630 33844 39623 54578 72847 85714 88931 88184 93816 105736 104887 80957 63594
21872 63594 63403 67477 64642 58150 56521 55579 55389 52996 49800 45627 39077 36723 33636 28902 22916
21857 22916 19497 19573 22927 28981 30552 30216 34492 38245 34798 29203 27994 25627 21078 18036 16121
21842 16121 18085 23688 24613 23661 27061 29108 29780 32451 28415 25985 21393 19683 24602 28018 29219
21827 29219 30599 32440 35106 37779 34749 30346 29858 30397 35947 42394 49142 51009 51353 44909 38872
21812 38872 35118 31437 25186 27725 31476 33769 34832 34211 33670 33309 35305 34650 34510 38453 39032 36189
21796 36189 36320 34581 33599 29436 24975 25146 25348 29131 27050 23756 17955 14561 17055 15880 14684
21781 14684 17879 23501 25873 27695 28065 26548 28377 29988 31868 33998 32037 30416 28606 25331 25536
21766 25536 25955 23722 22613 21954 19689 15458 13297 13919 18220 22677 26380 35843 41646 43173 42126
21751 42126 40660 42486 47449 51956 58727 66920 73365 81587 76182 56304 29740 6518 -9717
21738 -9717 -13690 -14934 -11178 -11502 -7994 -5070 -1696 4673 10263 15022 15475 16709 16373 11752 9633
21723 9633 8205 7718 7141 8491 8185 10264 12747 13105 11687 14415 18598 16609 12850 9988 12751 16816
21707 16816 14872 17363 19439 18441 18779 19687 20565 19730 20735 20781 16975 13817 11390 12437 15454 18114
21691 18114 18606 19466 17384 13666 13903 13572 13385 14465 17877 20489 20375 19752 19498 14329 12476 13588
21675 13588 12622 12927 9829 7127 5987 7598 5306 7075 7064 3974 3303 4203 7352 9273 9275 6917 7786
21658 7786 7145 6302 9032 10883 11047 11197 13857 13519 12421 9722 6878 4658 4745 4903 4762 9193 11924
21641 11924 8523 8144 11258 12977 12132 14448 16286 16423 18567 18747 15217 14992 14684 11765 9656 8501
21625 8501 10180 10286 11509 11683 13659 13866 17260 18631 15134 12081 10541 9946 10673 10322 6087 1966
21609 1966 2727 3459 3508 5707 7440 5897 8108 10967 12865 11391 9955 7710 6545 5631 2739 908
21593 908 1951 2421 6642 8079 7011 4811 5462 5866 6946 10934 16722 15031 12798 9427 5659 6381
21577 6381 6590 7170 8269 11144 11789 10653 12690 13141 13990 18054 16703 16220 14983 10567 11642 13339
21561 13339 13168 13448 11550 10652 11331 9042 7092 10105 10954 10171 13676 16067 14737 13078 11512 11967
21545 11967 13354 14341 12806 13852 13149 10973 12703 12438 9024 8423 10013 11433 13326 14375 16058
21530 16058 16858 17448 16821 16602 17260 17256 18672 23525 26681 25863 24396 24273 24335 30396 33536 38385 44781
21513 44781 54641 65552 82062 103510 138554 198884 307058 492825 759502 981635 996944
21502 996944 819557 587380 400103 278437 204061 155499 119026 88208 66491 55167 49764
21491 49764 44141 38623 37957 35681 29534 24449 22232 20853 20694 20859 21321 20722 21824 22159 21012 21200
21475 21200 19728 15958 16725 19940 19615 19828 19467 16381 17213 16141 12348 9792 8877 10529 14211 15865
21459 15865 14810 11286 10521 9726 10960 11072 12901 13856 13453 9979 6758 9506 10648 7431 8004 10244
21443 10244 8517 12615 13014 10670 8299 8901 12742 13787 13095 9582 7682 8670 8794 11801 10124 6799
21427 6799 4619 2103 753 3214 93 4015 10495 11559 9612 8361 5353 5154 9557 9379 9254
21412 9254 10871 12221 9147 8562 10910 11852 10961 11068 10990 12101 14770 16324 19453 18387 17723 16403
21396 16403 11033 10190 10436 11205 10263 9906 9800 10326 8007 6685 5206 2860 5003 5146 2290 1103
21380 1103 7977 12613 13329 14967 12395 12578 10139 7040 6764 7463 6305 5836 7234 4221 2470 1094
21364 1094 2809 6156 8461 7198 7369 6315 3615 5778 5267 3209 4370 5517 4605 4185 7842 8577
21348 8577 8282 8750 7907 5227 6363 10518 11448 7809 5675 6746 6207 4608 6302 7298 8112 9074 8547
21331 8547 7089 7806 7779 4023 70 3092 3390 3408 2835 5554 9227 7058 6138 7113 8952 11348 10069
21314 10069 4528 2226 7768 11206 5672 3693 2418 2688 5277 4176 -443 543 4697 6430 6054
21299 6054 5071 7192 11090 8836 9313 7678 3635 4727 7589 7359 6952 4273 5933 8752 11278 10833
21283 10833 10818 9242 5333 1497 440 1522 3431 6493 6156 3510 1810 534 -2574 -1027 2232
21268 2232 1354 2046 4210 6510 4480 2867 4479 2048 2567 2478 3519 2210 4383 5154 3685 1284
21252 1284 2678 5575 7981 6573 7160 5922 5544 5092 5607 4921 1704 -960 562 -1714 -173 304
21236 304 819 1417 1692 3620 3217 2374 4771 6092 5916 4509 3636 2142 1014 1219 4376 9032 8426
21219 8426 8453 6622 3822 2234 3531 3044 495 -942 -832 -2749 -1239 728 1626 -825 -1220 1019
21203 1019 871 1921 2744 -815 -1087 716 1676 1183 836 4357 6074 9232 9075 2975 -121 -1108 -771
21186 -771 -558 1640 1790 -145 3255 5492 798 -1838 -1017 2389 1581 298 -1365 -2655 -676 3240
21170 3240 3363 4090 5460 4105 6363 4769 2218 4063 5640 5920 3991 2361 2471 2596 2284 4936
21154 4936 9680 12413 12105 12064 11854 8162 4803 3507 2249 204 -458 1825 1528 1353 614 -452 -1151
21137 -1151 212 4160 4844 1730 -734 -1453 931 -287 1569 3293 3282 2753 5650 6550 7762 9355
21121 9355 6963 6893 6817 5748 1791 -744 -3091 -4735 -3573 221 -652 -4466 -5810 -5742 -1113 5385
21105 5385 6819 8286 7892 7090 2071 1372 2355 762 320 2324 2423 1571 994 1494 1821 4313 3200
21088 3200 -682 -4047 -2263 -1177 -27 -234 3648 3836 659 2013 2119 536 1567 1302 1816 2958
21072 2958 2181 1932 2396 3524 1833 504 2841 1205 -430 1188 670 2210 3439 4043 569 -3054
21056 -3054 -4172 -4447 -2422 -3076 -3814 -924 -1281 -571 881 435 -1202 -1220 -1143 -2790 -2202 -2122 -3837 -420
21038 -420 1507 390 646 5037 5158 2369 1809 1973 6095 6419 6132 7223 3871 3332 3472 2492 919
21021 919 966 3799 3252 2668 2515 2447 4583 5494 2326 111 1517 2748 3716 2873 703 550 -1646 -2261
21003 -2261 -1394 -683 3829 7618 3848 3183 7935 9113 6733 4645 -132 -2605 -2698 -161 -1287 -341
20987 -341 458 690 2382 3847 2718 5106 2904 1549 1848 2983 795 -2690 -4422 -2842 -2324 -3942
20971 -3942 -2202 -1691 -3322 -3525 -2833 -250 2969 4506 1918 737 904 3254 6702 7656 5455 3808
20955 3808 4653 2948 -220 -1291 3238 6034 3759 1135 -45 347 -163 512 -203 1897 2399 5642
20939 5642 7881 3886 448 -853 -2548 -1479 1945 3245 2015 -2057 -3783 -2266 -696 325 -1273
20924 -1273 496 -351 874 937 -1795 -2673 -329 1000 -1408 -525 3924 4636 2007 4511 7008 4758
20908 4758 2552 290 -1036 2926 2297 -1225 409 567 1238 -510 907 4924 5657 3031 -474 -489
20892 -489 -757 585 2254 4014 4930 4330 3879 1044 1497 1674 6662 8237 7178 3757 2530 3993
20876 3993 4163 1948 -784 -1744 -1299 -134 488 -237 -1643 -3487 -2253 -2719 -2638 321 1129 1675 1568
20859 1568 1293 1854 5728 5268 3823 1853 -722 654 -465 -747 -1450 -379 547 -1303 -2991 -139
20843 -139 3580 4092 4168 6864 3914 -1035 930 3540 2455 4101 6706 6767 5819 -913 -5430 -4352
20827 -4352 124 1225 671 -1090 621 5593 3657 -2177 -3467 -3164 1109 5319 3078 2010 2175
20812 2175 711 4209 3050 401 -925 -344 1418 -708 -2535 -1630 -1002 -3072 -3220 -1640 249 2397
20796 2397 3233 4809 5140 5124 4601 1189 -1465 -3865 -1177 493 -1270 -3262 -1783 896 349 1297
20780 1297 3381 4416 710 -3028 -1811 -1779 -3155 -3752 -4475 -2923 -2838 -1182 -2322 -484 -424 1275 765
20763 765 -1042 -18 2526 3955 1379 -1762 -1594 -1645 -1462 1003 3621 2427 3655 1327 -1787 -3711
20747 -3711 -2092 -1885 -1422 -2659 -16 1327 -766 -851 -1954 -6022 -4148 -3583 -3355 180 244 -2636 -5764
20730 -5764 -4955 -2114 140 2247 2191 2185 -898 1576 8345 9905 9716 5915 2826 -433 -1788 -1623 -1284
20713 -1284 2139 1592 -1946 -445 2645 -324 -70 909 -446 -693 635 320 1287 -422 -564 -4410
20697 -4410 -4547 -2475 -225 257 855 675 1399 131 1894 1914 5520 6774 5488 810 -2377 -2907 -1366
20680 -1366 -683 -1878 -1319 -1367 -1063 -578 -3552 -1834 -331 -432 -496 -1079 2359 957 3629 3446 2176
20663 2176 3269 859 -2073 -1387 211 -1353 -2024 1612 4305 3337 284 -1968 -2078 -917 -205 -1458
20647 -1458 -2782 -3164 -2336 -326 -1246 355 -1930 -6187 -4271 -2546 -2732 -1462 -1286 205 -2432 -3542
20631 -3542 -2607 -2841 -2973 2191 4421 3284 -365 -48 -859 189 1545 652 1163 674 -508 1279 1714
20614 1714 1084 2288 3576 -2065 -4796 -862 -2508 -4366 -5977 -4882 -4673 -6818 -6769 -2050 -146 2686
20598 2686 3587 2609 1890 -737 -2236 -1595 -2882 -3168 -3480 -1669 -2907 -5732 -2780 -4321 -5178 -3964
20582 -3964 -713 1067 386 3679 2945 3041 2596 270 287 1933 273 -4057 -5895 -3755 -2956 -3950 -1702
20565 -1702 -1197 -1342 -4109 -2065 1045 473 -1776 -3952 -6919 -4239 -2566 -1582 -678 1132 4138 2175
20549 2175 -261 -1196 -1126 -2342 -2312 -2751 1483 1485 -498 1065 3143 2232 5148 5371 2186 789 -1056
20532 -1056 -1954 -1971 -1176 451 1980 1412 -1021 -418 2276 774 470 2072 2243 1119 1498 108 -332
20515 -332 2203 -371 418 1257 2131 1920 -1811 -2177 -823 2178 3458 3982 2295 1458 2296 187 916
20498 916 1981 -1299 -1976 347 -1937 -1354 -937 -336 674 1567 -40 -639 -306 -751 -2653 -4645 -5997
20481 -5997 -2805 -2575 -2104 -4265 -3522 -28 -979 -1247 -676 -2982 -5917 -5377 -2985 -3932 -8597 -8117 -3541
20464 -3541 -312 2533 1652 -979 -1354 -2958 -2431 395 -1051 -4678 -4697 -1156 -4813 -5834 -4017 -4751
20448 -4751 -6369 -7644 -5697 -275 -1350 -3998 -4677 -2334 -4364 -5520 -5961 -2471 -690 -3887 -3551
20433 -3551 -2424 753 -271 -359 -1077 -6382 -7816 -6626 -5049 -6663 -7274 -3275 -141 2715 4282 3168
20417 3168 1484 2992 2640 1888 1659 -864 -2358 -428 73 -2866 -5760 -667 1058 680 -2093 -4245
20401 -4245 -7090 -7860 -4508 -5885 -7020 -3417 -5486 -6463 -8544 -7574 -5269 -4294 -4946 -2910 -583 -742
20385 -742 995 759 -1390 -1537 -2245 -3412 -2009 -1348 -1445 -1939 -867 -1761 -2724 -2125 -2027 -3907 -3266 -1585
20367 -1585 -3345 -5173 -3305 -4484 -6228 -6004 -5211 -3873 -3081 -2403 -3543 -5362 -2594 -4022 -4330 -2559
20351 -2559 -1196 -1150 -2294 -722 -978 -3279 -6508 -7101 -4012 -2909 -1784 -935 -2153 -1008 -215 -2646
20335 -2646 -4696 -4304 -4034 -2895 -1299 -2168 -1997 467 430 -79 -1110 -2041 -1311 -248 -1150 -2912 -5395
20318 -5395 -6817 -5127 -5623 -5047 -1283 -1035 -1319 -2280 -3024 -1614 -2490 -3469 -4272 -3595 -1122 89 -87
20301 -87 1208 2478 3161 2614 1510 504 -379 -7979 -9794 -6060 -3875 -4563 -5723 -4146 -131 -2013
20285 -2013 -4843 -4750 -962 -1149 -112 198 -2956 -485 2427 2815 1098 -3252 -2584 397 2362 2128
20269 2128 2275 934 -2072 -4208 -3998 -4276 -4434 -2115 -1598 -3102 -2213 1862 2088 170 65 -818 -2735
20252 -2735 -3566 -4135 -3078 -3022 -3976 -4022 -6964 -5999 -4434 -5111 -4653 -3120 -3385 -7203 -7387 -5505 -2192 -653
20234 -653 -2763 -3692 686 857 1855 2963 1022 291 -1355 -2047 -1236 -124 978 -693 -3165 -4804
20218 -4804 -4188 -5782 -5819 -7370 -4405 -2164 -3049 -1788 -917 -5456 -5351 -4270 -1683 -64 -706 -3057
20202 -3057 -3977 -1647 -337 1500 -1139 -3258 -2837 -4313 -3765 -3668 -4595 -5809 -7419 -3775 -1724 -2642
20186 -2642 -1708 -4091 -7327 -6221 -3316 -1183 -1697 -2397 -3475 -3990 -2991 -3454 -5618 -6006 -6586 -7075 -5215
20169 -5215 -2339 835 1614 1177 70 213 -520 240 -1559 -1290 175 -688 1151 587 540 -2604 -2060
20152 -2060 -4169 -4544 -5746 -4124 -1951 -5324 -5206 -4624 -3601 -2598 -1840 -4683 -2027 -1036 -1016 -2180
20136 -2180 -1267 761 1125 307 691 -708 -2114 -3699 -5968 -6359 -3492 -1262 542 595 -1237 1914
20120 1914 2138 3255 3010 2809 1402 -2761 -2749 157 -270 -2631 -2434 -3701 -1113 -530 -1158 -3446 -2226
20103 -2226 -19 -534 -89 -1854 -6780 -3718 -1466 1409 802 -1471 -3931 -3334 -3175 -2234 -4840 -3161
20087 -3161 -2228 -4163 -4501 -5081 -4894 -5446 -5419 -6176 -4880 -932 -363 -1175 273 582 4 -4875 -3900 1604
20069 1604 -173 -1155 -3152 -5282 -6035 -4031 91 3279 3589 3472 1444 2665 1926 -2556 -4586 -5279
20053 -5279 -6675 -4643 -2400 -1628 -1223 -364 -3357 -5718 -4842 -3330 -4553 -8398 -5879 -1900 -935 -1854
20037 -1854 -2234 -5528 -6098 -4837 -3744 -1840 -2752 -4284 -316 4028 3271 153 -3237 -3299 -3445 -1448
20021 -1448 -35 916 2526 1556 -891 -489 -112 -1016 -1246 -714 -68 871 -854 -3829 -5457 -1883 -673
20004 -673 -1085 -3481 -1252 754 -728 -1174 2012 1234 4047 3698 29 -4680 -2244 1697 -373 -2751
19988 -2751 -2685 -2931 -2583 -4906 -3935 -6622 -8022 -5002 -3047 -3518 -2362 -3753 -5874 -4982 -5397 -4470 -3693
19971 -3693 -3415 -37 2304 2863 1001 -2392 -1648 -3041 -1614 1575 184 -2785 -4749 -5571 -5000 -5057
19955 -5057 -2309 238 -2139 -6160 -6022 -5262 -6763 -5234 -3224 -3832 -3486 -1686 -233 2858 3926 4601
19939 4601 5177 2569 2512 246 -2393 -2774 -2970 -1614 -5805 -3257 -1714 -2543 -5810 -8445 -5074 -897
19923 -897 -4040 -7432 -6386 -5042 -4899 -1561 -1725 -1787 243 4424 3812 -340 -1730 -2110 -3668 -4639 -3571
19906 -3571 -5150 -3373 -4476 -6532 -9064 -6061 -3256 -4893 -4189 -1673 1720 1969 2260 -2552 -2579 -3494
19890 -3494 -3493 -5235 -4259 -4239 -7582 -9020 -7714 -5657 -6082 -7517 -6629 -4245 -4842 -5751 -6035 -6273 -3318 -3575
19872 -3575 -1905 725 639 -59 -2252 -2267 -2462 -2989 -2098 -70 152 1673 -974 -6171 -7087 -5842 -5025
19855 -5025 -4957 -6505 -8318 -9742 -7948 -4152 -3175 -3182 -1840 -3893 -5563 -2900 -5141 -5213 -5555 -7263 -7304
19838 -7304 -5538 -6511 -7044 -8176 -3290 -215 -313 -1687 -3674 -3312 -2364 1583 4495 4252 3917 3864 3392
19821 3392 3789 3462 -2000 -4730 -4650 -4262 -5711 -6148 -4244 -3717 -3468 -6093 -7465 -6857 -9279 -9797 -8138
19804 -8138 -5386 -2387 -3870 -4712 -2936 -2144 -2512 -3341 -3076 -4929 -5847 -5250 -4515 -3001 -2960 -2532 -1707 -1816
19786 -1816 -761 151 1586 -1549 -5942 -5713 -3591 -1459 -3594 -6080 -5916 -7324 -4762 -7059 -10180
19771 -10180 -10938 -10270 -9720 -9034 -6623 -7109 -3909 -2829 -4273 -3850 -7513 -9543 -10933 -7106 -6531 -7282
19755 -7282 -5688 -5365 -5566 -4294 -1628 -3902 -5483 -1102 -1468 -1507 1675 -1140 -4295 -1863 -1433 224
19739 224 758 45 -5614 -7657 -6798 -8015 -5996 -5271 -4166 -4267 -3303 -2637 -3620 -4174 -4200 -6394 -4410 -2190
19721 -2190 -2793 -1377 -782 -3176 -5070 -4836 -293 1864 3047 2587 -1226 -419 -2504 -5086 -2821 -73
19705 -73 1026 1344 -3646 -3724 -1337 -4410 -7730 -7195 -4343 -2922 -3671 -2597 -2122 -1399 -620 -123 -818 -2689
19687 -2689 -3474 -3214 -3887 -2641 -2841 -2204 -419 -1056 -3566 -6045 -7532 -9958 -10143 -6496 -6870 -8316 -8418
19670 -8418 -2056 778 188 1423 1277 -2802 -3754 -6740 -7602 -4629 -3900 -6832 -8672 -8230 -8767 -5963
19654 -5963 -2720 -2081 -5313 -5603 -3907 -5752 -6300 -6289 -5279 -6758 -6049 -7323 -10086 -10985 -8462 -4791
19638 -4791 -1990 -5289 -7111 -3238 -1758 -3395 -5146 -5566 -3451 -4811 -4018 -4533 -5382 -4689 -4320 -2426
19622 -2426 -3637 -6000 -2278 569 -1900 -4565 -5723 -9616 -7139 -4638 -5074 -5640 -6444 -8630 -6759
19607 -6759 -6302 -8403 -9290 -4811 -3332 -3505 92 1722 -2280 -5304 -7026 -4320 -5269 -5449 -3825 -5851
19591 -5851 -9138 -5529 -3946 -6882 -6157 -40 176 -2038 -1585 -2912 -2020 -3064 -3763 -1778 -879 -5778
19575 -5778 -8182 -6429 -4413 -2048 -140 -771 -1319 -2610 -3093 -6951 -8284 -5029 -3933 -2378 -3202 -5231
19559 -5231 -4356 -2717 -908 247 -391 -3701 -4745 -7676 -11075 -6754 -1570 -3203 -5013 -7404 -6578
19544 -6578 -8365 -8564 -7710 -5939 -3587 -6717 -4772 -2731 -4272 343 4621 2601 1779 3974 3131 3221
19528 3221 738 -620 -3066 -2590 -3145 -6951 -5720 -7105 -2856 703 1019 -496 426 578 -3014 -5507
19512 -5507 -8379 -9352 -9946 -7356 -4330 -3307 -2378 -3666 -3644 -598 -1151 152 -1587 -2555 -1629 -1968 -4320
19495 -4320 -5920 -5867 -1335 -296 -4670 -9177 -8435 -6235 -4719 -2344 -1456 -2693 -951 -23 816 -991
19479 -991 -2862 -6001 -3589 -1198 -4402 -7631 -5008 -5062 -6685 -7507 -7817 -7673 -5733 -5994 -9832 -11523
19463 -11523 -9082 -6767 -4929 -5190 -5194 -5991 -5709 -2140 -1023 -2592 -6004 -4935 -3021 -2911 -3361 -4329 -6061
19446 -6061 -7450 -7445 -6308 -7445 -10344 -7925 -7192 -5201 -3891 -3921 -4567 -6898 -5865 -6858 -9240 -4376 -1430
19429 -1430 -2293 -1988 -3727 -4625 -4363 -6408 -7288 -4578 -4318 -5126 -6851 -3303 1219 1039 2586 1214 -2133
19412 -2133 -4890 -6613 -6834 -8665 -6957 -3947 -3474 -4720 -5350 -7583 -8527 -6493 -5512 -4265 -1072 2280
19396 2280 1866 682 -2553 -2478 1771 2731 276 4190 8541 12964 17221 18300 24219 33888 49479
19381 49479 76201 114628 187932 321345 503564 583053 507190 357477 228622 152528 107839
19370 107839 76820 55685 41969 30422 24584 18978 14507 13299 10235 5122 1781 1345 2822
19357 2822 7065 5695 4459 5841 2523 3155 7240 4381 -174 -1873 105 2060 3158 3780 4285
19342 4285 4662 2604 -148 -1031 -321 -1091 -1415 -957 -4366 -4503 -1808 -1280 623 -1836 -714 -509 -1014
19325 -1014 226 1123 -1362 -108 1288 612 -380 1907 1795 -725 194 3196 3970 6206 8236 4933
19309 4933 2909 4798 4826 3324 1497 645 4251 6477 5813 2292 1672 -647 335 3291 2578 4264
19293 4264 4824 2380 3138 5427 7469 6248 6809 7357 11535 14147 14631 15021 16992 20489 28226 29700
19277 29700 30705 39303 43115 49047 60929 73914 85060 95401 112970 128358 142789 159981
19265 159981 178136 194626 210366 219757 226992 229881 228473 227665 220628 212419 205257 191634 175845
19252 175845 161343 143111 122448 104244 94393 84870 74098 62503 52296 44609 42589 39503
19240 39503 32919 29119 25108 21646 19615 20742 19681 13691 7718 7705 5701 4998 3671 3632 7860 10154
19224 10154 8907 7084 4536 4670 7397 8760 7164 5409 2248 3386 6204 7920 4936 4220 4873
19209 4873 6950 4656 2314 2811 2253 -28 61 2932 3699 1905 1620 3084 752 -2500 -5874 -3175
19193 -3175 160 -72 -5053 -4772 585 4721 4201 929 -2640 -5935 -9610 -8337 -4184 -3678 -2415 -2530
19177 -2530 -3809 -2879 -3618 -6349 -7589 -6204 -5680 -2086 1875 1016 196 -174 -2309 -1224 -829 -3278
19161 -3278 -1276 -2602 -2257 -433 -4067 -1766 -98 -2324 -905 -1669 -1172 -1796 -2859 -6175 -7550 -10746
19145 -10746 -10790 -9659 -5538 -2734 435 1592 2686 5231 6758 11078 13263 18298 21666 27924 38878
19130 38878 58035 82136 119633 163184 211334 264240 304956 327859 332752 310918 273481 226995
19118 226995 179251 139144 104305 77606 63417 55887 51703 47031 45141 45904 49458 58996 79019
19105 79019 106209 146331 193354 244366 296073 329633 341904 336685 311164 267118 213527 164423
19093 164423 123564 88416 63847 51331 41435 34788 28918 25222 21018 16152 16493 15835 13543 10595
19079 10595 6604 4657 1647 363 -99 1039 475 2336 2591 5139 6260 6599 8825 6213 6774 4160
19063 4160 3291 3877 3037 2164 2264 2368 6622 7623 7574 7760 8424 11008 8612 4671 1947 2328 2904 2325
19045 2325 2939 3187 3829 3759 2094 -1093 -891 -912 -1755 -506 -2265 -4938 -1235 -447 -2338 62 -561
19028 -561 -1187 -4757 -8931 -8440 -7746 -6131 -2916 -2557 1214 144 1085 627 1037 2090 3207 5698 7349
19011 7349 8959 16710 29127 47871 66890 60925 39813 25018 18255 12424 13364 10473 9173 9318
18997 9318 5589 4542 6224 3768 2000 2414 -2163 -4252 398 -627 -6408 -8450 -6282 -4057 -1920
18982 -1920 1491 1161 -1664 -511 -868 -557 -777 -762 -819 -322 1342 2082 231 -4503 -7077 -3832 -1285
18965 -1285 428 1829 -2524 -4762 -2033 500 -406 -573 531 -625 -2480 -1341 -2447 -2576 76
18950 76 -167 -630 -680 -1808 -2840 -4952 -387 587 412 2042 4271 4438 1462 -273 508 2205 8401
18933 8401 10732 7492 7405 9245 12082 14655 10705 8928 7302 1561 -4024 -11205 -17613 -19715 -15933
18918 -15933 -14563 -14389 -7806 -2706 1537 628 -2305 -584 4099 8464 12348 19830 25023 26965 24710
18903 24710 19649 12010 8637 1690 -7854 -15324 -18515 -21664 -24715 -21392 -14062 -8917 -8099 -6545 -3380
18888 -3380 -221 1857 5654 12593 17080 21315 26350 30410 23043 14699 12571 9088 7778 5748 5887
18873 5887 8391 10311 10574 14189 19321 21599 21554 20803 20420 17914 15976 10824 10568 12920 15366 18864
18857 18864 18669 20124 23394 24253 26901 29835 34473 41125 41740 36460 31411 28864 25635 23510 20902
18842 20902 18062 12662 9735 7466 4730 2196 3027 8014 10565 14811 22629 27360 29655 32497 36800
18827 36800 36806 38773 37363 34550 30540 26884 25039 25067 22295 19652 16178 10411 5408 3526 3068 2681
18811 2681 4095 3479 4321 5995 8194 9528 8090 6125 4117 7361 11010 8466 6241 8490 7075
18796 7075 4734 3157 3059 2973 -591 -2378 -1821 -102 -1915 -2634 1698 7293 11942 15622 19375 19268
18780 19268 18514 19612 16822 15025 18945 23357 25860 33040 40017 44486 43890 43633 47233 52375 59570
18765 59570 53353 42108 32831 25078 21662 23560 24239 23473 27104 28140 27992 27805 27449 27718 28617 26634
18749 26634 25490 24712 22387 22161 20207 13923 11500 10942 10734 11869 15655 20117 22926 28628 35233
18734 35233 45326 54099 60770 66904 73522 84814 96837 107306 112918 122058 125676 112673 101683
18721 101683 90988 74649 64041 57949 49079 42334 40866 38257 36285 38925 39410 41469 48034 57961
18707 57961 73585 89107 106440 125951 144630 151189 162745 172370 177942 185029 194471 207089 239032
18694 239032 287529 346838 410436 447149 462625 455732 415534 354617 287078 228572 182975 151687
18682 151687 129743 119557 114963 115465 124299 138574 154345 179863 219935 274944 346237 434614
18670 434614 528467 621991 686555 716733 729395 711283 666149 597061 527767 459654 392086
18659 392086 328933 275023 230448 199889 178998 165813 159751 156106 153948 157444 161005 162373 166620
18646 166620 175848 190043 216739 251571 298346 353991 411620 466149 524440 581458 642044 704284
18634 704284 773067 842796 884849 906706 897962 852414 786316 717920 661776 625905 610738 622739
18622 622739 662196 721541 806818 919413 1065352 1247968 1458087 1698532 1975980 2296547
18612 2296547 2652731 3042934 3488464 4010365 4652101 5526407 6816722 8845326 12160778
18603 12160778 17374164 24447982 32830223 42542661 51810418 57636760 60344891 59935145
18595 59935145 55266964 47629464 38942011 30580672 23394021 17821071 13956653 11444512
18587 11444512 9841046 8881445 8433726 8437069 8929995 10079737 12248853 16009153 21862757
18578 21862757 29497240 38452054 48561614 57132981 61820643 63543290 61588162 55349785
18570 55349785 46678930 37399466 28775928 21507713 15962796 12095195 9450762 7603331
18562 7603331 6285933 5324337 4608099 4054524 3621527 3277706 2997214 2756391 2531934
18553 2531934 2326444 2129691 1936960 1753099 1583512 1433407 1312235 1218264 1154307 1110841
18543 1110841 1082594 1073551 1069437 1048117 1019709 977364 911024 831993 752327 684250 629987 583930
18531 583930 547847 519536 497589 476417 459328 444265 432690 417153 400441 387828 374585
18520 374585 360271 346284 334405 323105 313425 303005 295447 287647 279422 276188 274376 269690 264356
18507 264356 259714 256174 251741 246226 239562 232698 226337 219122 210465 203534 194025 186939 185535 183220
18493 183220 180795 182867 182062 180903 180337 184254 185195 184033 182650 182888 178974 175684 174350 175177 175142 175513
18477 175513 173706 176470 179534 181211 188452 193046 193730 195673 192511 178430 169514 158575 142403 131955
18463 131955 124389 118719 115724 114064 112948 113857 116607 116775 120602 128127 133332 138640 144611 152167 162421
18448 162421 163242 158310 156435 144075 128069 112711 98595 84179 73667 67649 65380 63757 63187
18435 63187 62983 62454 62407 64254 68420 69119 68171 67498 65319 62408 57913 57954 58025 56939 53708 51408 47583
18418 47583 45348 44970 43133 43728 45863 48867 59055 73087 86056 96668 105430 109062 108320 102480
18404 102480 100059 90246 77970 69988 63344 57824 52871 51549 47458 44973 46565 46671 45335 42566
18390 42566 43787 48982 54155 60067 68159 79638 92485 103512 103050 94876 92679 84175 71364 61527
18376 61527 53402 47350 45091 42401 40986 40429 38045 33308 34369 35922 35652 33374 29644 28805 29239
18361 29239 27699 32020 34249 33125 34250 31503 27358 27603 26327 27239 30678 27739 25887 29039 29500
18346 29500 31182 34397 35320 37186 38288 35536 37387 38769 37939 35612 36745 37077 34460 33159 31484
18331 31484 34664 37260 35997 34801 37992 39075 42325 43909 45704 44341 41037 41629 41353 39616 34242
18316 34242 31590 33441 32185 30131 30978 34044 35781 32365 30126 30668 32678 33952 38509 38451 33332
18301 33332 31423 37315 40492 33697 26416 24234 25065 24696 23206 22822 21631 23196 22231 21472 26599 31773
18285 31773 34893 34279 36427 39260 43581 45809 49220 50111 52026 53090 52120 50535 48671 47343 41276
18270 41276 33007 24671 19700 14602 16324 21295 24853 27417 30272 28502 30351 30932 30902 31917 33687
18255 33687 35136 37361 39580 40198 40218 36352 32760 32347 30431 25932 21525 18817 18893 20024 25790 33557
18239 33557 39485 46262 53762 59375 66741 73961 73997 76608 77711 70994 65368 64670 66831 67240 63612
18224 63612 58526 55866 57076 57807 61145 61671 59149 58770 58015 58419 57716 57278 61473 63111 65639 64525
18208 64525 58806 57054 54717 57858 62841 71124 77136 82342 82559 78943 73703 71835 69418 61550 54414
18193 54414 50588 49749 49417 50162 50468 51669 53354 53745 54696 56969 56097 52050 47954 43245 39529 37528
18177 37528 38416 33948 29676 24939 23782 22431 19853 16304 17465 19703 20847 19507 19278 18266 19009
18162 19009 18542 20743 20799 19135 16585 16840 17994 18321 17458 15369 14948 15560 15986 19337 23913 25563 23727
18145 23727 21121 24129 28108 28921 29605 29939 29505 28913 25486 23472 25360 25584 28501 29884 32889 33550
18129 33550 37383 42260 44699 47604 56858 61098 68550 78035 87272 98850 120003 144684 171867
18116 171867 207347 258399 332391 433719 581245 823392 1235135 1960308 3266999 5254027
18106 5254027 6596380 6102207 4562763 2984708 1988166 1428424 1073086 802886 588946
18097 588946 437611 340064 278283 231018 195054 170947 151062 137260 127019 121054 114093 103163
18085 103163 95919 88776 83985 77412 72575 70854 69244 69545 68668 69017 71814 78950 85883 91801 112733
18070 112733 143384 180994 224462 276194 322663 348008 357478 348927 319171 276584 230004 185017
18058 185017 146201 119057 99050 87916 83027 79462 77036 76796 80081 88434 102925 122396 153545
18045 153545 195841 250452 308767 351838 374487 378606 360179 321311 269791 216696 171447 133032
18033 133032 102984 84267 72843 65424 57980 52471 46690 45872 41786 44293 46135 50350 53980 59921
18019 59921 67010 72803 76038 86868 102667 117197 121098 121213 130568 157065 201635 244096 252005
18006 252005 233865 209454 206835 231909 269329 280562 255361 219351 187778 172372 169051 167747
17994 167747 161500 149954 142988 141619 140723 140011 142876 156359 181698 219375 245878 237814 211932
17981 211932 198637 204028 227826 253422 253253 226183 190323 164685 149710 144196 133667 114614
17969 114614 93054 74318 65357 59414 57039 52090 45340 40591 36441 29649 27122 26023 24856 26775
17955 26775 28019 26989 25266 22188 21762 20571 19637 20158 20574 16648 15950 17555 17698 14586 14386 14568
17939 14568 14606 14335 16149 21393 21588 17522 14614 15615 12485 11482 13419 13341 11976 13559 17040 17401
17923 17401 18208 17150 16888 18277 20346 20172 17937 19584 22555 23074 23139 21570 18935 16430 16340 15565 11771
17906 11771 8378 9138 10821 11687 10441 9957 9345 8084 10216 14012 16279 16801 16336 15591 18410 17667
17890 17667 13340 8508 9576 8802 7729 13922 15904 15750 18056 17545 14598 15160 19381 23703 25533
17875 25533 27130 29116 30315 35371 38139 38252 39383 40367 46413 58321 67605 68419 63662 58686 58868
17860 58868 65140 79423 81458 74731 66406 58168 56103 61696 64102 64010 57778 50111 46047 47117 44474
17845 44474 38834 33922 27743 23283 20922 19459 22535 25543 24935 23536 25507 26944 25674 29607 35104
17830 35104 38554 40847 43570 45203 45188 41087 40226 37779 33075 27076 23008 20987 19609 16877 17709
17815 17709 17018 15758 17237 18085 18098 17752 15686 13536 12833 14076 13345 7684 6862 5688 7948 8050 7274
17798 7274 2422 -1869 -3880 -4498 -2143 -3105 -5510 -4866 948 8575 11709 10121 5777 6450 9159 12769
17782 12769 11795 6283 1238 -875 -1927 -1882 -2578 -6907 -12270 -14069 -12290 -10474 -5615 -2627 -2081 -1542
17766 -1542 -2873 193 3269 3594 6014 8392 10302 11919 14672 17595 23248 29638 38948 44811 44425
17751 44425 39452 39124 37413 26092 19350 16152 12560 12632 9031 7630 8232 11633 13155 15537 14707
17736 14707 16310 21841 24636 26828 32960 30930 30168 29675 28931 32737 33665 30568 28613 30734 37927
17721 37927 47697 56701 59032 56527 57497 58051 56147 52597 47520 43329 39575 40711 44857 45049 42293
17706 42293 41025 40204 42128 44957 44174 37609 37233 35327 32945 33146 28848 23471 23210 24530 24891 24469
17690 24469 21994 25543 29338 29149 30368 29643 29174 28972 26622 28567 29292 27130 21809 17980 16504 15318
17674 15318 15234 16205 12795 9385 8261 11907 16758 18119 14665 11119 9700 13605 15231 15142 13737 13767
17658 13767 15618 17461 17467 16035 8253 2126 3751 7444 15209 16954 11894 6063 7112 11666 14842
17643 14842 16921 19647 21183 23423 27838 29589 30647 29454 26610 26592 28288 32341 33837 35166 35536
17628 35536 36214 41304 47842 50972 57791 63918 78093 104875 143193 191659 246402 310414 374635
17615 374635 413336 434409 436650 406435 359272 306935 264159 231621 200653 170155 154569 141203
17603 141203 126471 121403 120403 112374 106580 107010 98255 92868 90291 88065 91597 102398 116953 139168
17589 139168 170149 211353 261371 318853 381270 424090 439496 440713 423201 377466 324150 275827
17577 275827 229512 185568 151249 132840 112890 99554 88661 75314 65057 59864 54158 49276
17565 49276 44657 42944 40512 42398 41523 41973 45403 47635 50302 53265 54238 50947 48969 47668 49678
17550 49678 54151 52379 48725 48006 46916 49840 56919 60373 63071 65284 64839 67379 72535 77501 79929
17535 79929 81749 82715 87455 90118 97548 105282 108796 110795 112361 119326 131235 143951 152110 160947
17521 160947 168954 185617 207076 226919 252363 283433 312702 341227 363758 383187 413507 466844
17509 466844 543727 614950 657117 676128 699243 747288 836227 953046 1057092 1141015 1214938
17498 1214938 1296070 1427525 1623128 1856167 2114324 2424208 2828919 3417962 4330113 5745143
17488 5745143 7920675 11069332 14536169 16734593 17464310 18187936 20825282 26770781
17480 26770781 35244695 40810233 39746454 34956988 31207198 31834852 36984515 42421238
17472 42421238 41981753 36033859 28779674 23923125 22291296 22538597 22412269 21136448
17464 21136448 19926102 20064719 21004143 21153648 20626797 20903625 23699273 29958194 37627027
17455 37627027 40797661 37984707 32955197 30195172 32049918 37561217 41285989 38673490
17447 38673490 31836831 24982834 20933793 19622564 19216847 17580446 14489069 11092245
17439 11092245 8397403 6586260 5350962 4437927 3746341 3244552 2899119 2642030 2419714
17430 2419714 2208935 2027250 1901230 1827142 1754657 1638057 1498679 1368805 1276009 1223691
17420 1223691 1170167 1084605 979626 884728 817412 769880 734470 693715 646960 606399 579479
17409 579479 559350 540650 519955 496091 475532 460532 453256 443045 427458 410871 393527 379141
17397 379141 370134 360716 349189 336367 327269 321441 314516 310083 305786 297409 286271 277181 272838
17384 272838 271478 268593 262454 255958 248574 237654 230266 223842 222603 222839 219702 214961 209530 207921
17370 207921 205864 204245 202292 199673 199624 197587 196457 196937 196184 198065 200731 202735 199102 195802 192113
17355 192113 189395 196934 203081 198249 192186 185217 176404 174042 176250 173294 168009 165839 166227 160211
17341 160211 157245 156254 152668 153774 157506 160746 161817 162636 165275 163459 160360 165094 171586 171043 171642
17326 171642 173525 166230 164758 167080 158312 152686 157963 163233 171229 189298 209980 217607 216601 223728
17312 223728 244965 286672 344539 378361 366285 330790 305808 310883 347521 386595 380447 340574
17300 340574 288455 250425 234331 229312 225851 218732 213817 215924 217632 212707 210140 217756 243923
17287 243923 291737 340902 352500 326689 294968 284072 300667 334865 350029 324798 277076
17276 277076 236030 211859 198901 188423 171325 151758 132960 119330 109043 98263 89651 82417
17264 82417 82329 84544 81255 75543 72642 69661 72624 76133 73268 64919 61871 63800 65065 63168 56692
17249 56692 52767 55649 61823 61307 57230 55109 57348 56870 57384 60891 62011 63499 65546 68145 67302
17234 67302 65415 66444 66880 68317 69723 69961 66879 61599 58885 60229 62745 65525 61340 59915 58566
17219 58566 57727 60192 66934 69903 74124 74674 73174 71588 70066 66541 66180 69588 73769 71124 67068
17204 67068 65305 59986 58745 61219 61709 58488 53995 49089 46558 47378 46045 46454 46053 44611 43114
17189 43114 45039 47640 48191 49281 49682 51576 50320 48177 46901 48986 49320 49568 53078 52141 48724 48093
17173 48093 49647 53717 55072 54652 60292 67127 69536 71614 74427 82607 90345 96887 104239 108628 110737
17158 110737 109078 102927 97724 92538 87759 83651 79359 76856 70994 68573 64376 57709 49437 42858
17144 42858 41893 44564 43560 41549 39500 37676 36885 40048 42324 41742 41237 40040 41362 44435 42316
17129 42316 35799 31603 30053 32524 32432 30733 26827 24023 27324 26968 25258 22733 21402 21624 22056 23863
17113 23863 21117 19245 19414 19854 22377 26836 31838 29824 30251 34556 31784 31807 35997 34044 30242 29211
17097 29211 29433 31446 31915 29028 28832 32544 34169 33538 31290 31138 32552 32620 31999 30141 29284 29175 30171
17080 30171 30456 32586 37588 40040 39238 37092 32540 31091 31962 32077 27789 29135 34376 38289 42951
17065 42951 48651 51500 50988 50910 53839 50894 42951 39448 41730 34149 27612 28667 26477 25284 26530
17050 26530 22956 23192 24947 26219 26436 24046 19871 17519 17373 17698 18777 18557 19240 19339 18832 21041 24433
17033 24433 21974 21687 23285 24058 24140 22876 21910 22100 21315 19085 19283 17995 17816 20025 21402 19905 20001
17016 20001 19579 21369 22678 22615 21300 20861 17360 15120 17107 20586 22964 20729 20308 20570 20103 19572
17000 19572 19123 18701 19309 21347 23829 25674 26584 22687 16823 15022 16242 13469 16208 17521 19322
16985 19322 20070 19989 20978 22660 20376 19039 19728 18869 20855 19807 22211 21689 20575 22485 24628 22892
16969 22892 17926 19864 22851 24306 24467 23643 22200 23460 24701 26082 30068 32577 34813 38453 43357
16954 43357 50908 60305 74447 89236 106740 116750 121934 129988 151205 190741 230638 236639 215114
16941 215114 195505 188900 205561 233982 249310 231417 190168 155366 139615 132807 135187 134921
16929 134921 129288 131273 136704 137910 137104 139204 148285 173407 211223 239126 236076 212082 192909
16916 192909 194847 219120 241646 237117 208844 170255 138820 124569 121607 111952 95391 77914
16904 77914 66583 55868 47420 39877 34902 32656 34920 39026 33848 33317 31168 29488 30328 30342 27443
16889 27443 25656 23445 22821 21662 18927 20180 17589 16511 19008 18790 18673 19117 20161 19943 16188 15498
16873 15498 18432 18372 16375 17859 14823 13354 15548 21108 21659 19916 18429 13301 15865 18581 18601 18265
16857 18265 15027 13230 15284 15421 15921 15908 16177 15922 15576 14009 11290 13046 15018 14104 14385 14897 11379
16840 11379 13737 16409 13234 13871 16856 16526 13930 13380 11748 11195 13102 16013 17777 15211 13593
16825 13593 13930 14411 11493 11297 12003 11589 9210 11811 18426 18420 18465 17330 18717 18384 14900 12367 11726
16808 11726 13593 11834 10792 11127 13016 13091 13279 14596 16309 11953 12224 11952 13483 14355 15620 16922
16792 16922 15296 15994 16304 13906 13588 14822 17988 18957 16017 12702 11953 10523 13482 16092 17025 18736
16776 18736 18648 17985 18690 14571 9132 11347 13951 13548 11191 10656 9466 8361 8260 9960 13287 12495
16760 12495 11527 9603 6378 7551 7026 5886 6767 7323 7324 6657 7419 7119 6755 8706 11258 12750 11642
16743 11642 9092 10765 7887 4476 6204 9094 6606 8124 9686 8754 7453 8751 9368 9524 11291
16728 11291 11547 9775 6491 6105 5137 2344 3890 5745 6412 10462 12481 9853 9559 11521 13258 14236
16712 14236 15296 14854 12789 10978 8030 6433 8557 9467 5718 5621 7353 9214 12111 15156 15300 12072
16696 12072 7345 5895 7198 8112 7232 6057 8585 12699 9475 7610 10532 12426 14998 14616 12577
16681 12577 8491 6176 8824 11002 9437 9685 11698 11170 10240 9499 10534 12573 10898 11037 9639 8665
16665 8665 9422 5266 3868 7304 8259 9455 10814 10516 6287 1278 -1744 1782 5809 7226 6674 5808
16649 5808 5946 8581 8714 8367 7384 7395 7943 9582 10470 9497 7222 7203 7450 3827 3980 5814 6871 6380
16631 6380 4257 2962 3511 6084 6172 3761 4566 7929 9342 6229 1664 292 97 1386 4510 5861
16615 5861 4267 5031 4563 5954 7046 3958 4617 7221 7976 9371 6128 5742 7643 5721 4298 7744
16599 7744 11655 12559 9720 4949 6336 8288 5747 2338 1825 1696 6907 8641 9306 9670 4068 1508
16583 1508 3782 8047 8578 8359 5208 2250 4892 5584 8290 9789 6850 9611 7574 4453 7543
16568 7543 9597 5045 1974 2667 977 1361 3891 5146 2958 1786 576 -233 1063 780 1497 1718
16552 1718 3224 4728 4362 3695 3439 4069 6040 4825 1804 -526 834 -339 -376 474 2957 5863
16536 5863 7550 6979 7559 6530 7046 7929 8264 8553 7114 6647 5530 3792 3068 2760 4754 9346 6217
16519 6217 6608 6714 4828 4841 6125 3727 8137 8185 9679 7647 7302 6908 6280 6646 5281 4411 4203 6541
16501 6541 6037 4712 3057 677 402 4542 3895 3241 5343 5782 7449 4627 6699 9259 10970 7812
16485 7812 6937 7731 12158 12759 11709 12526 15420 17199 21781 25505 27359 30236 28901 28899 27921 23372 20560
16468 20560 18980 14871 10014 8652 9556 8608 5593 5326 6085 6964 7992 7121 4569 6853 6583 4346
16452 4346 3556 4362 6658 6255 7096 8394 4196 4139 1731 2993 5634 7869 5757 2823 2857 3675 5125
16435 5125 591 876 4679 4961 3550 429 -733 2856 4606 7426 8416 5510 5438 3843 3606 1509
16419 1509 -1726 1341 2116 4934 4286 5355 7481 4221 1759 3737 5400 4348 6461 5005 1766
16404 1766 1286 4558 2377 1500 2845 7651 8243 5657 6280 9340 7864 7024 10673 10917 9846 8438
16388 8438 9729 7681 9365 11792 9838 7093 6247 7092 10727 8485 6467 5245 5487 4940 2891 1982
16372 1982 4380 6194 5981 7485 4794 4086 4615 4898 3984 1285 3977 5713 2654 3026 4886 5223
16356 5223 4014 792 -1366 -3669 -3337 -1765 -377 3435 5331 4662 3439 2203 1534 1753 1899 1159
16340 1159 2430 3162 4118 6915 5325 3378 4771 2597 170 -147 -812 -436 -1415 610 1386 -316
16324 -316 -1259 -867 2019 7761 8947 8203 6807 5386 5839 8443 8720 5062 3860 2400 -2982 -5779
16308 -5779 -2542 -407 3659 6247 5118 4179 1682 1071 1643 2067 2475 1059 -185 -1997 -3320 -1554
16292 -1554 1862 1670 -1476 -1330 1258 3214 1751 -1266 2639 4056 9145 8199 4067 4860 7728 3204
16276 3204 3054 4830 3430 956 -1364 -2027 970 1790 -1121 -755 902 2949 3061 847 1024 2597
16260 2597 2625 3911 5229 5331 2061 2371 2287 2357 5242 7373 10138 11681 11691 10787 12142 12890 10221 6512
16242 6512 5170 6348 5037 5730 5983 6466 8134 8160 5079 1073 -2806 488 2417 3123 2052 782
16226 782 2387 1422 3838 5618 2925 4222 4459 -477 -1638 -239 -2485 -2344 -537 1442 2098 4016
16210 4016 4662 5188 5276 4006 1377 -176 -19 2160 1655 -73 1074 1245 317 1448 2297 3625 2806
16193 2806 1950 1248 -1197 -2808 1446 4243 3479 2856 1197 -231 2815 767 166 2173 1658 -2767
16177 -2767 -1844 -811 -1405 2644 8442 6893 4752 5148 5905 3261 2422 1178 -1454 -460 986 -242
16161 -242 -165 965 1074 -660 1211 2225 2459 1895 -862 -2387 -1058 -941 -1597 -973 1740 2685 3820
16144 3820 5294 2250 5 1612 3133 148 -1100 -102 4550 4935 4360 941 122 1960 2961 -553
16128 -553 -2459 1327 2615 4557 6797 4823 2995 -580 -407 627 2259 5968 5357 3534 1857
16113 1857 -368 660 1643 -1512 -1179 -1681 -877 -280 1003 1989 511 -831 -7015 -8602 -5991 -2624
16097 -2624 1167 2768 1488 770 1338 2356 4316 5617 4628 1423 -915 -2006 -1020 477 3235 4295
16081 4295 1892 1899 527 -166 -33 1559 3681 2954 3728 4044 1867 553 3714 6739 4600 -1700 -3879
16064 -3879 -3835 -1376 -375 1696 1652 1541 -1515 -141 2351 492 3422 4100 1945 1501 846 1598 -234
16047 -234 1454 1558 -783 -473 805 2078 491 -2080 -2694 -2378 -3679 -3661 -3149 -587 -1079 -4124 -1053
16030 -1053 1002 92 -1152 -1476 -3607 -2772 -3497 -4103 -7752 -6791 -4023 -3789 -392 3255 3086 3419 4625
16013 4625 3833 -452 -5768 -6127 -4266 -5143 -3623 -1450 -432 -1712 -1129 516 717 216 -226 1089
15997 1089 4038 3626 1918 469 -147 3449 5868 5720 2895 3270 5198 6408 5272 5302 5561 7744
15981 7744 4423 1721 1315 4232 10013 9342 5624 4148 1801 1461 91 -128 1289 5257 3144 3000
15965 3000 3247 2300 2775 1190 -41 2356 1042 743 -2643 -1031 -942 -3626 -6843 -6091 -7806 -9598
15949 -9598 -8827 -6946 -3768 -729 1148 2552 1358 2288 901 -1383 -3743 -4692 -3622 643 3228
15934 3228 1866 -1327 -668 192 263 -710 -1537 -3250 -5809 -1561 -955 -2089 -1871 -61 3749 3835 1099
15917 1099 400 1699 3455 1047 43 -2460 -7111 -3763 -2913 -3744 -2726 -375 -6139 -4997 -723
15902 -723 -2299 -3244 -1732 194 958 102 394 1011 581 1249 669 -296 -234 -917 828 2297 3600 2477
15884 2477 1801 987 -524 -1697 -323 1864 -793 1136 1092 1548 -984 -3572 -6668 -5600 -279 2500
15868 2500 1891 3821 543 -1335 -2827 -1077 2425 1857 -897 -4913 -3967 478 3776 5253 4454 2182
15852 2182 -1077 253 1650 3389 1175 -449 -4177 -4769 -1053 170 1213 2550 1173 -1739 2710
15837 2710 2264 2193 2927 5218 5172 2342 678 2528 2841 1252 1021 2247 1119 90 -348 4403 4759
15820 4759 2605 4104 5834 6674 5517 5012 4606 1716 1605 2355 1312 -518 -1910 -2753 -1949 -3155
15804 -3155 -305 377 659 258 79 2821 5798 4827 2474 134 -1262 -2728 -1899 -2201 -1665 -2246 -1944
15787 -1944 -3056 -4761 -2592 1038 1681 61 -3471 -3732 -1185 -1545 -3766 -4989 -3359 -850 -574 -818
15771 -818 -788 -2534 -4124 -1783 -2115 -1611 604 3494 4612 7054 7781 7470 3794 1756 3100 4443
15755 4443 3601 2789 81 -1205 -962 -318 -3 3457 6724 6605 1453 -1299 -3182 -4038 -2735 215
15739 215 4867 3631 1813 -500 -213 -1941 -305 2101 2237 2614 1735 1582 2399 2113 -498 558 -701
15722 -701 -1721 425 87 931 2263 2805 1035 1083 -1232 -3561 -1530 993 -20 464 2877 4434
15706 4434 4266 6624 8593 5960 3054 -2561 -6509 -4179 -3177 -3043 -3608 -3333 -3087 -30 879 420
15690 420 1827 3596 2252 2099 576 -827 -297 781 2054 2639 2162 1848 353 -1498 -5538 -7148
15674 -7148 -3762 -2203 -335 -824 -3143 -5295 -3622 -1824 -2467 -1221 1502 3763 5012 37 -3997
15659 -3997 -5839 -5516 -4883 -5445 -4021 -4774 -2851 -3153 -3776 -3039 -1052 -201 -288 -2831 -2886 -2369 -3139 -5104
15641 -5104 -5479 -4234 -3621 -4795 -3835 -4760 -4802 -3875 -954 2503 -1272 -877 1062 1509 234 -682 746
15624 746 1113 2239 1285 -30 -189 127 -167 -142 488 744 -574 -1141 -651 973 3297 961 -991 -2702
15606 -2702 -3984 -1038 11 -1040 -1830 -705 3596 5792 3352 173 887 1722 2514 1895 3928 3932 6564
15589 6564 5718 3561 3300 3109 2664 1495 -438 -2399 -992 2635 2431 -555 -335 -758 2502 4871
15573 4871 3553 1771 1756 652 986 -1032 -1763 521 5047 3576 -562 708 1431 2599 1665 -2837
15557 -2837 -9317 -10481 -9291 -8764 -6791 -2670 1525 1891 -4334 -2592 -2740 -5812 -5056 -1292 61 -2607
15541 -2607 -4548 -6696 -6972 -4427 -4271 -1608 -1712 -1916 -2678 -2094 -855 -3616 -6023 -3732 -1845 -3453
15525 -3453 -1107 817 -676 -272 -2168 -3617 -3702 -2924 -4683 -3900 -2249 -496 -1463 -3591 -4450 -2815
15509 -2815 -3145 -4378 -5600 -3783 528 1771 2499 -69 -3092 -2565 -1569 -3525 -3411 -4750 -8831 -9266
15493 -9266 -5614 -2236 -2432 -1362 -1719 -5085 -8586 -8811 -6336 -2318 -2298 -1768 -1655 -2612 -3431 -3841 -3705
15476 -3705 -1350 1099 7204 3694 -3608 -3749 -5885 -9904 -8028 -2751 -497 -787 -4302 -2628 -3205
15461 -3205 -4211 -1722 -2425 71 4118 3085 657 -1186 -3523 -4625 -5579 -3695 -2060 -1333 -2166 -4298
15445 -4298 -2805 -899 -599 -1416 -115 1604 2620 3049 2555 1559 1498 1590 708 3094 4246 4975 6490
15428 6490 6615 5722 2419 -534 -3873 -2176 289 1255 3965 7862 6499 2139 -1311 -2647 1142
15413 1142 2052 1478 -2830 -5739 -4888 -918 3581 3236 5027 3067 -976 -1081 330 279 -1375 -1869 -579
15396 -579 -2454 -4270 -3426 -5048 -5690 -4528 -2687 355 499 -3841 -5231 -3079 -3929 -1797 -696 -1660
15380 -1660 -2950 -2296 -1560 -2431 -2350 -1186 -2464 -3373 -4311 -693 1696 -668 -1855 -1732 -3756 -5808 -4728
15363 -4728 -5164 -1041 1974 -1965 -2155 -2477 -330 1271 -3718 -5948 -5266 -7695 -5549 -6269 -6987 -8152
15347 -8152 -4484 -3341 -4000 -3737 -1415 -576 -257 606 4116 4679 1935 -70 -1069 -1920 -2094 806 2778
15330 2778 4128 3845 1367 1817 2916 3810 4224 1413 782 -575 -3710 -6306 -2752 394 416 -1870
15314 -1870 -2129 -3361 -2488 -1694 -1009 912 -1718 -100 -628 -5831 -7422 -4651 -8218 -9381 -8003 -6503
15298 -6503 -4852 -5740 -7867 -5564 -1953 -2172 -5060 -6051 -2785 -147 600 -552 -1051 -1463 -2091 -7130
15282 -7130 -8724 -6941 -6760 -4896 -4097 -7077 -6702 -4199 -3685 -2300 -1478 -499 536 1838 2340 2635 115
15265 115 -3690 -5706 -6643 -5203 -1713 -3055 -5687 -5874 -6397 -2859 1303 1773 4016 1741 1908 3360
15249 3360 5780 1612 -5280 -8938 -10779 -5464 -809 3659 5112 -664 -4016 -5123 -5163 -701 3441
15234 3441 3141 2348 -1583 -4965 -9306 -12554 -8970 -7491 -4667 -2488 -3820 -4159 -2918 -2228 -3426 -805
15218 -805 4193 2378 -2422 -4769 -6495 -7600 -3842 2274 4403 3315 409 -3979 -5832 -3926 -574
15203 -574 -247 -97 2458 -580 -594 -717 -1751 -666 -3710 -5967 -3064 -1042 1156 988 1523 1104 -991
15186 -991 -1509 570 3200 254 -1091 -1148 -3194 -5712 -4299 -3054 -2813 -3259 -4458 -6591 -3325 -1997
15170 -1997 -3628 -3995 -5439 -5917 -3776 -5981 -9171 -7027 -4741 -4173 -4063 -3540 -5835 -5943 -6083 -3074
15154 -3074 884 2824 4252 2538 490 1744 -1080 -4646 -3988 -2759 -2218 -5053 -3767 -1956 -7843
15139 -7843 -7309 -6166 -6955 -6150 -2767 -757 -2060 -1245 -990 -96 -1934 -4509 -4497 -2593 -2337 -3281 -5571
15122 -5571 -2325 2195 1740 371 -317 2148 4588 4776 3561 -757 -1009 589 -4154 -3530 635 3413
15106 3413 2706 1501 -1165 -2980 -3996 -6802 -10541 -8979 -8738 -8446 -10204 -8164 -8207 -6069 -1858 1033
15090 1033 2019 2089 4034 3465 -430 -2979 -4611 -7254 -7490 -4860 -6285 -10289 -9724 -6424 -6056 -5049
15074 -5049 611 2342 -1605 -4188 -9493 -10855 -10156 -9123 -7157 -3340 593 -2342 -3785 -3188 -1853
15059 -1853 140 -1323 -1482 -1817 -2783 619 882 -1277 -3631 -4947 -3229 -852 -3545 -5306 -4494 -3600
15043 -3600 -5858 -6589 -3349 -4212 -6789 -4730 -2670 -4328 -5416 -5769 -2750 -883 -890 -2139 -2968 -3842 -6945
15026 -6945 -7643 -7631 -9385 -8005 -4968 -2275 -2746 -6888 -6692 -7233 -9789 -10159 -9662 -6519 -5146 -6491 -6502
15009 -6502 -8750 -7384 -404 -397 -2274 -2452 -1722 -3140 -1954 -1630 -1302 -2880 -2855 -7527 -8987 -5879 -5795
14992 -5795 -3577 -2673 -1959 903 3440 2235 1338 -54 -858 -2225 -2383 4 1229 -1145 -1333 -378
14976 -378 1474 394 -892 732 6404 5072 3650 8486 8160 9656 13096 13764 9118 7385 11189
14961 11189 13296 15192 15437 14787 11145 6349 6420 5852 3213 5167 6922 5062 3459 1907 1775 2324
14945 2324 3019 2778 741 -2591 -6256 -5745 -7036 -5569 -1350 -4757 -5856 -5101 -1653 1295 -2343 -3458
14929 -3458 -1392 -1756 -3809 -4395 -4719 -6172 -6711 -5978 -5360 -5580 -3024 -2608 -4041 -5142 -8710 -7680 -5625
14912 -5625 -3418 -2265 -3962 -3151 -5021 -7524 -4740 -1109 -1205 -2316 -2262 -525 -2114 -5306 -6221 -3997
14896 -3997 -1713 -176 -1369 -3740 -3809 -3182 -3532 -2239 -3842 -8207 -9956 -10517 -9824 -6539 -3833 -3934
14880 -3934 -2936 -2557 379 -1121 -114 2621 -1458 -2931 -1926 -1468 -2914 -3725 -3356 -3672 -6445 -7878
14864 -7878 -7823 -8952 -9658 -12406 -6239 -1737 549 1516 -2501 -9208 -9552 -6685 -4362 -2201 -1817 -2487
14848 -2487 -3725 -3575 -3308 -2614 -2155 134 2251 2159 1142 -1545 -4561 -4905 -5191 -4173 -500 -3962 -5151
14831 -5151 -2788 -3440 -6439 -6522 -8442 -9492 -10322 -8661 -7458 -6489 -3726 -3922 -5838 -5203 -8095 -8549 -6206
14814 -6206 -8767 -9567 -9968 -10007 -6397 -4459 -3506 -1178 -4196 -4285 -2685 -5351 -5544 -6165 -5770 -6733 -7754
14797 -7754 -4362 -1248 -1345 -2078 -2905 -5502 -5936 -5394 -2350 -2191 -5024 -6376 -4552 -3772 -3898 -2908 -3154
14780 -3154 -3988 -2689 -1812 -4148 -5824 -5841 -6668 -7308 -7010 -6809 -5476 -1280 -677 -1213 -545 386 -1036 644
14762 644 894 -2397 -1063 1167 27 -472 -1985 -2630 -2710 -6106 -6765 -2865 -1876 1095 1655 718 -412
14745 -412 489 1218 480 482 2182 875 -1129 -2581 -5493 -5674 -5443 -2569 1812 4559 1102 501 -400
14728 -400 -4213 -2813 -2168 -5816 -7419 -6659 -6402 -7801 -9096 -9687 -6292 -4351 -5950 -9123 -10980 -7695
14712 -7695 -3889 -4202 -7431 -4462 -3878 -5256 -2053 -1143 -2054 -3985 -2543 -642 1060 963 -916 -4461
14696 -4461 -8094 -8660 -6888 -3017 -2590 337 2049 2602 -1804 -6919 -7339 -6848 -6632 -4263 -2070 -3169
14680 -3169 1796 3107 2260 5128 3314 1652 598 -838 -1807 -6775 -10684 -9764 -7184 -4706 -5422 -5818
14664 -5818 -6529 -4737 -3153 -1477 -2904 -3079 3022 1335 -1332 -1936 -5270 -6167 -4243 -4041 -3486 -932
14648 -932 -2778 -4689 -5556 -5338 -5723 -4569 -3093 -1900 -3524 -7490 -8395 -5288 -2712 -3165 -3339 -1332
14632 -1332 -5373 -9230 -9161 -8258 -9500 -9782 -4842 -3103 -3284 -3881 -1444 -3109 -5169 -6982 -4597 -2634
14616 -2634 -1575 -3051 -3783 -4989 -4578 -5246 -8670 -9428 -9061 -9576 -7887 -4972 -7933 -7100 -5595 -6972
14600 -6972 -6019 -4001 -3100 -3871 -5510 -4423 -5650 -8184 -8979 -7657 -8899 -6473 -6480 -5311 -2713 -2405 -3858
14583 -3858 -7571 -6481 -4220 -3047 -3252 -3163 -2058 -4532 -5228 -6067 -9213 -9355 -6724 -4065 327 1269
14567 1269 -1738 -6117 -4885 -4586 -2525 -2277 -3363 -3854 -4740 -5029 -6839 -8458 -11550 -9839 -6119 -5374
14551 -5374 -4176 -4597 -2756 -2134 -2094 -2106 -4168 -4250 -3292 -439 672 3486 762 -5116 -5361 -5399 -2138 -3952
14533 -3952 -6160 -5262 -3389 -1273 -1076 -4590 -5139 -6251 -5555 -830 -1706 -2854 -4419 -1393 988 1397
14517 1397 326 -3302 -1835 -474 -1517 -1702 -180 -62 -2605 -2529 -1780 -2265 -3021 -3694 -2946 -543 -3754
14500 -3754 -9530 -8105 -1867 -1001 -1957 -1638 -2270 -4854 -7233 -8185 -8233 -6971 -5445 -4343 -2530 -2382 -4236
14483 -4236 -6093 -6233 -2312 -2731 -2649 -252 -116 -5462 -8369 -6032 -4282 -4061 -2655 -5081 -7536 -6816
14467 -6816 -3080 -3484 -2625 261 1808 142 -4386 -5960 -6204 -2128 2221 4385 1244 171 -58 203
14451 203 389 1021 -417 -2150 -1929 -1506 -2521 -152 -157 -1456 -4686 -3956 -3030 -3456 -987 -1148 -2745 241
14433 241 -857 -302 -2394 -4759 -9109 -9632 -5515 -5037 -6290 -4615 -1179 -665 203 -2411 -4742 -5654
14417 -5654 -3306 -3170 -3369 -2747 -4715 -8757 -9442 -5478 -3334 -2967 -3751 -1876 -4249 -7932 -6104 -5649
14401 -5649 -2740 3100 2535 896 -432 -603 -3840 -6122 -6793 -1717 59 -3443 -3983 -597 -998 -1434
14385 -1434 -1547 -1276 -151 -1465 -2259 -80 -608 -2367 -4321 -6607 -8286 -5381 -2434 -2773 -3665 -400
14369 -400 -324 -1949 -1526 -2637 -2242 -426 -258 1099 1959 2508 469 162 -3834 -4933 -30 2508 493
14352 493 -3215 -3751 -2445 -1598 -338 -3400 -1362 3438 5874 8970 10413 5345 1053 910 4992 5031
14336 5031 1632 -2924 -1225 2219 1597 1111 1547 -570 -1199 -1301 -2528 -907 -40 979 2315 1798
14320 1798 -591 -5258 -9485 -9883 -12981 -10570 -9181 -8615 -6644 -4166 -3443 -2838 -4690 -3771 -3151 -6734
14304 -6734 -6525 -4143 -3171 -204 724 600 -135 -4894 -8681 -10137 -9066 -9421 -8103 -7484 -9100 -6757
14288 -6757 -5160 -4236 -5575 -3289 -1634 -680 -2932 -2025 1978 2594 1995 459 -165 -1759 -4107 -3433
14272 -3433 -2225 67 2613 4410 2207 694 -1425 -1056 -1711 -3249 -4040 -4166 -3243 -2918 -941 -1855
14256 -1855 -1088 -2122 -864 -1077 -3910 -6880 -6710 -2167 -1207 -1605 -1432 -447 -1508 -727 426 1801 -3
14239 -3 -1487 -170 -1509 -2945 -2354 -550 -3906 -5528 -3594 -3573 -4756 -3700 -2812 -1881 -2105 -7350 -8835
14222 -8835 -4664 -3177 -2545 -2575 -2615 -2775 -2992 -2343 -5082 -9565 -11986 -8080 -10300 -11580 -7975 -6815 -6841
14205 -6841 -3797 -4718 -10314 -8645 -4100 -3111 -4333 -6664 -6411 -5438 -2051 -619 -1080 -2897 -7226 -11121
14189 -11121 -10179 -7077 -4564 -1862 -4312 -3771 -3686 -5500 -4490 -4141 -3693 -1878 -542 -5 -3290 -5167
14173 -5167 -5777 -7581 -9308 -7581 -4437 -4419 -3461 -68 -293 -3517 -5683 -5516 -3824 -3636 -4160 -6228 -7864
14156 -7864 -9899 -10102 -7679 -3344 -1462 752 2416 1399 156 -4545 -3248 -291 -2746 -5050 -4308
14141 -4308 -2044 -255 1405 3716 2155 -299 -2474 -1045 -3630 -1713 -2211 1383 3254 1203 2083
14126 2083 1597 504 -2804 -5425 -8307 -9595 -5887 -5944 -6445 -5753 -6108 -110 -519 -1750 -983 -545 2666
14109 2666 1666 -265 -98 -2859 -3942 -6339 -7334 -6846 -9867 -13232 -11895 -9206 -6961 -3285 1193
14094 1193 2738 2131 1200 1609 3546 -904 -5238 -3304 -2267 -3644 -5710 -12281 -11506 -11274 -14462 -13967
14078 -13967 -6999 -208 -1644 -5134 -3382 -2763 -2734 -5645 -8287 -8286 -5367 -2518 -1396 690 -3251 -6112
14062 -6112 -5385 -5534 -4179 -4010 -3947 -3887 -4500 -4442 -1554 -1029 -2248 -4817 -7113 -10332 -11953 -9786 -7792
14045 -7792 -4707 -689 626 -1310 -2650 -1357 -1531 -5142 -4892 -688 -791 -2277 -2564 -2465 -3088 -2144 -1199
14028 -1199 -1769 -1715 -1522 -363 3175 2878 3411 684 -3140 -3539 -5285 -4271 926 1859 -798 -3546 -6507
14011 -6507 -9035 -7656 -6507 -3577 -2087 -3522 -2684 -911 -1146 -4025 -5700 -4775 -3154 -1479 -2002 -2398
13995 -2398 -3997 -4154 -5824 -5166 -3459 -1782 -902 -2903 -4340 -3794 -4266 -3248 -885 -3243 -6087 -5504
13979 -5504 -3767 -3418 -6998 -5913 -1340 4100 4978 4318 3860 6704 4158 -2865 -3049 -3483 -4304 -2762
13963 -2762 -2889 -4267 -6140 -3887 -1089 -1013 -1402 -2328 -4779 -3960 -2753 1343 1318 -1997 1622 4355 3486
13946 3486 4193 2489 -1332 -4909 -4138 -588 -2013 -4415 -7147 -5369 -4495 -5463 -7117 -6774 -5039 -4098
13930 -4098 -3775 -3018 -3652 -5926 -4719 -1797 -289 -2353 -1429 -1146 -4225 -4936 -4998 -6633 -5187 -2041 -1082
13913 -1082 167 -937 -1699 -1854 -1762 -2084 -1494 -2482 -4580 -5657 -5192 -5837 -8093 -5194 -4503 -3671 -5781
13896 -5781 -3697 -1071 2366 4766 3957 5859 5656 4160 5128 4262 2959 3273 -99 -2696 -4319 -4108
13880 -4108 -3576 1128 4013 4940 982 -2608 -5340 -7040 -4771 -436 -2574 -7756 -6370 21 2721
13865 2721 1017 -1846 -3962 -6929 -6277 -8112 -7046 -4612 -4677 -4049 -8722 -9019 -6539 -2233 -2955 -4486
13849 -4486 -1910 -2777 -2844 -6256 -6816 -5461 -3863 -711 161 -160 -145 -845 2288 1952 736 -2135 -4519
13832 -4519 -4089 -1169 -1228 -698 -1060 -1262 409 2843 2604 2430 389 -4275 -6116 -6222 -8027 -8086 -7082
13815 -7082 -4898 -5367 -3191 -3753 -3673 280 1396 174 -4173 -3176 -1697 -1222 -263 -777 -1707 -2046 -1598
13798 -1598 -945 -1980 -1924 1846 -637 -3741 1097 2137 -1515 -1544 -3340 -2494 -721 671 1569 -1173
13782 -1173 -949 219 3304 426 -1578 -972 -863 -2433 -2691 284 3500 4789 3977 3315 -1552 -7482
13766 -7482 -7731 -9125 -8045 -6401 -4505 3797 5803 3123 5146 6626 5390 1358 -3547 -3759 -1154
13751 -1154 782 63 391 265 1354 -1650 -3901 -4366 -4046 -3621 -1857 -2863 -5406 -5715 -3604 -2999 -1674
13734 -1674 123 -668 -3269 -3336 -1403 1496 1569 -1469 -1232 -2997 -3561 -6528 -6755 -4818 -271 1515 -1025
13717 -1025 251 2311 2011 -1651 -2564 -2338 -1164 -1023 55 -21 -4232 -5703 -2639 -1635 -2295 -1199
13701 -1199 -192 1281 -340 -962 800 -1097 -3202 -1520 1156 -724 769 714 -3467 -3592 -6718 -6389
13685 -6389 -2084 -3247 -5301 -5310 -4888 -3537 -1716 1403 -1102 290 1949 1616 -127 1480 5638 4469
13669 4469 -819 -2427 -6007 -4034 -1047 -904 41 1146 3073 4802 7392 4641 2215 -2578 -2241
13654 -2241 -1044 -1585 562 4109 6546 1852 -563 -322 498 4123 6997 7803 4424 397 2808 8501
13638 8501 8432 5966 3640 2754 2000 1679 2668 1863 -1644 -2696 1044 1624 1975 -826 -3407 -3582 -1035
13621 -1035 -149 1532 2626 2809 3323 1939 3082 168 -1693 -1177 -3701 -3493 -1419 -665 1405 2272
13605 2272 1836 2436 3243 32 -3099 -3959 -4899 -3280 -745 3679 6240 3035 -2230 -1696 -2814 -2040
13589 -2040 -3820 -1548 128 -1501 -5112 -2782 1221 3269 4114 4858 3588 4602 2930 2489 5700
13574 5700 8241 9816 8803 3192 -386 305 1038 1243 -196 -1054 352 1314 4182 5023 2866 3254
13558 3254 2816 957 704 2732 2673 4026 5652 6264 3631 5185 721 -691 -18 134 1547 -210
13542 -210 -1276 260 1581 2971 3209 476 3004 4781 6670 6494 6998 4746 2511 763 325 -163
13526 -163 -313 -289 -1087 2366 3942 2800 2746 1981 714 2696 520 2018 2423 -1015 -2989 -3496 -889
13509 -889 3019 1149 736 789 2838 1023 -1232 -358 2769 4200 4877 4150 3486 1055 -1470 -3830 -1461
13492 -1461 -1271 -2480 -52 -300 -2449 -2254 -1502 404 218 -737 -841 3142 3700 154 -40 348 2338
13475 2338 1091 -2481 -1102 1009 3334 3452 1309 279 75 1082 2712 5389 6518 5659 5138 4597
13459 4597 5412 7277 7330 5118 3820 5383 6882 9635 7300 8326 5884 4113 4182 5392 6298 4493
13443 4493 4178 5452 3876 3103 2431 2336 1918 4189 6809 8614 6852 5505 2623 4020 6036 7074
13427 7074 8444 8630 9227 8426 6842 8507 8131 4549 1874 2555 5061 8533 6408 5925 4823 3445
13411 3445 1711 3478 3842 4847 4978 7400 3385 3059 8175 7064 5267 7036 10423 6271 672
13396 672 948 3592 6449 6586 3726 3180 4124 7015 7805 7683 7301 5718 1977 3224 6478 10406 10050
13379 10050 8868 6650 5459 6336 7468 7457 3776 3625 5324 6763 7634 5377 1004 746 3914 5779
13363 5779 6442 6134 5725 2697 -565 763 2814 2414 3459 6999 7254 7704 7358 8677 8491 7498 4841
13346 4841 3259 3087 2643 319 2335 6131 6424 5798 5934 6715 5024 1114 -354 3442 2388 3460
13330 3460 7896 10784 7709 7420 10955 10862 8175 4566 5053 6594 5678 5812 4162 5533 8995 7952
13314 7952 6476 4088 4816 5147 5900 6787 4290 4041 8861 12049 11155 10042 11640 10781 9629 8334
13298 8334 5809 5250 7304 11817 14195 14653 15256 12540 9955 6530 3306 5032 6728 9882 8427
13283 8427 3739 3012 6464 8464 10243 10315 8021 7757 5096 4978 5602 9985 10039 11072 11686 10939 8583
13266 8583 7351 9332 11958 11102 9711 8580 5167 3974 7461 12857 10373 10747 12416 12580 10075
13251 10075 10792 13576 15140 13749 11698 11115 9746 9559 8578 12481 15146 13043 9340 9766 11678 12969
13235 12969 14709 15625 13503 11155 9478 7978 9285 10963 12388 13596 13152 9932 8369 9998 10015
13220 10015 10136 10793 10406 9728 7457 6799 8874 12145 14369 14478 11413 13870 12042 7037 7352 6612
13204 6612 9401 12921 15307 13903 12626 9714 10849 13088 14846 18818 17487 13908 15233 15646 12734
13189 12734 11084 9712 9192 11081 12914 13291 13858 11663 11044 12499 12809 15306 14081 13457 15099 16148
13173 16148 18651 20119 18428 19408 18181 16853 15622 14313 11597 12411 15115 16641 15720 16125 17552
13158 17552 17732 20430 21255 20926 19745 17506 13943 15508 15375 15394 18476 19366 17873 17044 15379 17613
13142 17613 18661 17102 18790 18633 19717 19920 20556 20416 19123 16916 14181 14908 15126 14547 14219 13840 12651
13125 12651 14338 14951 16402 16200 16654 19597 25008 25023 23661 21011 20360 17692 19746 19883 20953 19050
13109 19050 17100 18861 16963 18174 19263 18288 20409 21185 19352 18245 19796 21189 23058 22171 18727
13094 18727 15731 16538 19456 20832 18494 16812 19020 17721 16119 15797 15447 16687 17441 19031 18558 17390
13078 17390 18094 15561 12457 13133 16443 15508 17630 17379 18757 20466 17675 18880 21848 20809 20287 23007
13062 23007 22023 22933 22666 22762 26390 25667 24247 24989 24716 21488 19909 19567 20655 19596 20897 20311 19632
13045 19632 21499 21875 22125 25718 25941 26327 25213 26837 26158 20431 20851 23060 21247 19462 18869 19370
13029 19370 21297 23088 25196 26488 25916 22653 23135 22438 24297 28489 29695 28608 26991 24980 24860
13014 24860 24852 24718 23211 23994 23714 22818 24555 22162 23618 24543 24124 24201 25371 27419 25311 24082 24146 23764
12996 23764 23219 24924 26916 27472 26156 26702 24629 20121 16058 14986 18885 23633 25895 21661 20746
12981 20746 22307 23188 23279 23650 23006 23605 23837 26145 28624 27740 25249 27264 26640 26019 24496 29230 33400
12964 33400 30103 27131 25601 24962 26471 28606 29427 30049 28869 28904 27843 24411 23170 23820 26164 26399
12948 26399 26014 26460 31061 34454 30956 31835 32187 29350 30048 26520 23393 26110 25439 27094 28373 29350
12932 29350 28988 29836 30990 31608 29250 26512 27040 25154 24941 28130 28641 32722 31891 29070 31119 34699
12916 34699 33285 33067 32265 31464 32972 33973 34579 34890 35774 34192 34229 32574 31616 33958 33117 29137 28163
12899 28163 29983 31957 36796 39322 39674 36536 36357 37572 36235 33607 32113 31466 28281 25669 27169
12884 27169 30106 31299 32010 28703 32776 39720 39740 37404 34248 38231 40547 38213 37539 33590 33006 35377
12868 35377 37103 40357 41660 42071 39195 35529 36479 38210 37219 32069 27357 23733 30169 37568 39859
12853 39859 40600 38698 38988 39746 40807 39578 37618 36325 31171 31983 34720 34821 33626 30952 33412 38024
12837 38024 39912 37592 37060 37581 35290 32754 33359 35478 34414 34734 37590 37240 33088 31752 32216 35027
12821 35027 35276 34383 35159 39206 38761 38000 41649 43219 43829 45303 46406 43591 42834 42686 41315 39676
12805 39676 38474 37770 36508 36460 38784 39119 39487 38747 41699 43572 43147 43248 41395 38323 38821 42121 42204
12788 42204 40048 37249 37356 39893 43500 43436 45033 47598 44553 43928 46944 47095 42944 41034 45145 47277
12772 47277 46493 45365 44964 45864 51884 55037 54726 56770 55967 55264 54846 51451 52769 55438 59032 58965 51998
12755 51998 47333 45407 46933 46419 44271 42349 44216 43304 43100 43534 42766 43076 43192 42331 44675 46036
12739 46036 46988 49329 51427 49279 45120 44630 45005 47714 48830 50883 49539 43943 42750 42264 41732 41031
12723 41031 41919 44403 48433 49893 47862 46403 43824 44105 42343 42619 44098 43082 43493 42830 44622 45857
12707 45857 46145 46099 45480 46344 49434 45522 47378 45182 42945 45335 43763 40926 44610 46132 46404 45112
12691 45112 44363 43275 44395 44375 43731 44255 40490 39032 39716 38545 38738 42022 44150 45370 50137 50357
12675 50357 45446 43768 45534 44363 43527 42599 43072 42791 42979 45284 48034 43691 38358 37945 40289 41732
12659 41732 41950 41900 38789 38187 36851 35653 37255 39298 40340 39272 39179 36400 34333 35742 40907 43879
12643 43879 43049 42718 44192 42013 38494 36897 41709 43474 42372 43987 42672 43597 42697 38033 36640
12628 36640 32272 32095 36885 37782 37159 39754 39876 39177 40754 43154 44054 44428 43415 46654 47256 42514
12612 42514 42068 42473 43302 41425 42922 40533 39055 39792 38321 35400 35956 35692 41419 44018 42769 41840
12596 41840 40137 42766 45049 46188 45544 42983 43003 43731 43557 42004 40790 40128 38259 39286 37635 35920
12580 35920 35102 36924 36589 37402 36808 39284 40889 42276 43824 40630 35646 36032 37747 40323 44846 46163
12564 46163 43846 39935 38121 35566 34275 34073 36792 39379 40737 41150 37545 36510 37095 37267 36993 36212
12548 36212 36276 37042 35756 33395 36000 35924 37975 35874 34018 32570 30592 32977 29757 29895 34555 38130
12532 38130 39646 35330 32007 33165 35020 33582 32911 30824 34823 35826 36195 37972 39806 40269 39056
12517 39056 35493 33008 35185 38948 40875 37629 35531 35834 38703 37308 36224 39022 44376 41414 37185
12502 37185 34384 32868 32331 33800 34924 31933 30531 30607 29088 29173 31383 32521 27475 26829 26968 27822
12486 27822 30190 31727 28831 25838 29071 33380 35873 35906 33633 32002 30418 30752 31829 33280 31056
12471 31056 31567 32819 34487 32346 32064 29428 26404 25673 24721 26193 29052 29768 30048 29180 29431 27679
12455 27679 29609 30915 30643 29441 29284 30785 30772 29157 28142 25508 26007 28607 29495 26976 27993 28559
12439 28559 26440 26663 30179 32150 30784 26807 29724 36605 37598 33321 29774 28384 26089 27895 28255
12424 28255 26534 25849 26879 27338 30695 36747 35965 34981 33873 31323 27291 29254 31805 33945 34844 37210
12408 37210 36952 36988 37817 39892 39721 41992 44701 40488 35729 34545 35492 37073 37484 36877 35383 37082
12392 37082 35180 32876 34017 32452 28631 23628 21680 24642 28004 26033 28339 29908 27534 23887
12378 23887 23500 25999 26519 23428 24347 26140 23831 21253 19991 19599 21532 25926 26231 24616 25690 23754
12362 23754 21939 23115 22719 19613 19315 19294 21338 23845 27429 24970 20415 19103 19992 21689 21682 21760 24397
12345 24397 28524 29591 25982 22293 18759 19923 20604 21057 19246 19592 21141 18338 16493 18858 24479
12330 24479 25584 23161 18805 18258 21102 21854 20336 19917 19021 20168 19285 22562 21746 18367 17353 17523
12314 17523 17874 17938 15558 15952 15731 15651 16427 17200 20423 23307 22559 23785 20345 17054 16324 19442 20107
12297 20107 18124 18384 17875 19725 19125 17236 16350 15344 12962 11657 14109 13549 11828 14038 16950 18454
12281 18454 16897 16604 15427 14070 11039 10289 13042 13797 14409 16981 17121 14739 13490 13832 13628 14465
12265 14465 14781 13153 10005 11369 13316 13349 13687 14851 14578 12441 13334 13619 15453 15968 12390 8028
12249 8028 8979 10010 10779 11433 12508 13535 15966 15091 13338 15992 16732 17784 17032 16415 18728 14295
12233 14295 12603 13196 14891 14049 13252 16011 18706 22660 20641 15490 11602 10014 9337 9935 9622 13171
12217 13171 13594 9903 7559 9724 11072 15653 17961 16990 13645 13489 12838 11170 12505 9843 8662
12202 8662 12333 12920 11308 8650 7304 9887 12992 13094 9222 6827 6404 7589 7558 8973 10603 9937
12186 9937 7355 5676 8763 9961 7980 5949 4431 3904 6137 5496 6274 6363 4707 3069 3954 4578
12170 4578 4657 3965 4152 2800 1378 3555 6001 8703 10224 10072 10598 11752 13365 10420 6844 7025
12154 7025 8641 9524 12783 13259 12367 7255 5673 5652 7789 6938 4826 2351 4845 10765 9576 9869
12138 9869 11796 8935 8457 9804 9261 11460 11114 14031 17105 15981 14950 14341 13014 8960 7163 7088
12122 7088 5540 9659 11402 9461 7921 11113 13543 11277 6390 2016 5530 8140 3949 3644 3369
12107 3369 3679 3423 4779 8299 6262 5212 6593 7013 8175 11601 10380 9600 9925 4958 3886 3321
12091 3321 1322 6316 7193 6459 5422 3065 731 2702 4992 8972 9604 10373 11839 11987 11242 10516
12075 10516 9147 7374 4770 2837 2610 3752 3100 644 -929 -1548 -1880 -334 5713 7084 6113 6135
12059 6135 7418 6547 3773 81 -538 1979 2692 2440 3174 4463 4180 2923 3157 4729 6935 7936
12043 7936 8204 8846 6037 4542 5371 5984 6405 7419 7273 5049 4555 4769 2843 1857 1370 -363 1584
12026 1584 2483 3108 5302 4871 653 -1879 -2193 3299 4897 4962 3796 4392 6155 6531 3603 -403 -299
12009 -299 -189 1296 3253 -837 695 2779 2624 1541 5706 3719 2044 2955 6032 6064 3945 3682
11993 3682 2356 2313 3637 1159 -810 1594 573 603 2045 -678 513 1235 554 -1525 -4091 -1077
11977 -1077 844 1013 -432 -1236 -1994 -1458 968 -653 -1499 734 1391 -1905 -4221 -6624 -4977 -2782
11961 -2782 -1640 931 391 -365 3077 4652 3282 303 221 542 1615 695 2034 4078 8 -3673
11945 -3673 -6230 -1310 3086 1752 -1641 -4364 -4992 -5052 -5050 -2136 -3237 -999 1379 2044 558 918 -2203
11928 -2203 -1738 554 73 -2549 -1195 2226 1677 2358 2818 1111 -2427 -1888 -3235 -3355 3331 5235
11912 5235 5312 1236 -1695 -4640 -495 539 -2424 -7990 -8702 -7082 -5766 -2441 -2485 -5106 -6282 -5818
11896 -5818 -7419 -7164 -7947 -8925 -8163 -6151 -3102 -2300 -5871 -4732 -3432 -6329 -8714 -10599 -6261 -2064
11880 -2064 -710 372 4968 4129 2126 -1333 -7012 -7234 -7118 -9688 -5965 -6165 -6636 -4830 -4746 -1642
11864 -1642 3966 4474 1261 2893 5603 6042 4796 485 -540 -2465 -2637 -5634 -3438 -2591 -3100 -2816
11848 -2816 -2702 -42 1750 657 -2683 -2683 -5213 -8212 -8492 -7779 -8629 -8499 -4200 -2415 -4042 -6121 -4684
11831 -4684 -3705 -4332 -7240 -5851 -3610 -2347 -1410 -3851 -1622 -784 -2615 -3666 -4210 -8443 -9784 -6943
11815 -6943 -4597 -2438 -3206 -4323 -5379 -4270 -6213 -8099 -6002 -1599 -3542 -7872 -9195 -7969 -6837
11800 -6837 -4631 -2742 -1863 1095 85 -3815 -4012 74 -1984 -5393 -7336 -6191 -2293 -1044 -4066
11785 -4066 -5526 -5370 -5231 -4522 -7557 -9181 -9632 -6613 -3476 -2894 -4557 -3405 -4752 -5482 -6556 -6331
11769 -6331 -5606 -5835 -9822 -8900 -10313 -9721 -6200 -5112 -4366 -4935 -5981 -4742 -6003 -6239 -2532 -3362 -4174
11752 -4174 -8875 -9134 -11792 -11103 -10658 -12024 -13431 -12688 -9837 -5978 -3061 -4368 -4752 -3980 -4284 -4451 -2541
11735 -2541 -2749 -6034 -9748 -9427 -5087 -4180 -6706 -7815 -8577 -6635 -5224 -6357 -6994 -11716 -14388 -14269
11719 -14269 -11929 -7972 -6285 -6217 -9651 -10993 -10737 -10624 -10237 -9788 -9290 -9422 -10372 -11057 -8280 -10352 -10411
11702 -10411 -11043 -12421 -9142 -5341 -5195 -7212 -6795 -7336 -7069 -6523 -8425 -6525 -7880 -9804 -6638 -7257
11686 -7257 -4614 -1447 -2750 -2263 -1151 -936 3701 4433 4127 3628 -919 -5800 -6880 -6260 -5742 -4912 -7656
11669 -7656 -7263 -7951 -8165 -7759 -6725 -5903 -5246 -5072 -6899 -8579 -8172 -9195 -8356 -7153 -9712 -11922 -11711
11652 -11711 -10863 -11082 -8614 -8187 -10126 -10147 -8714 -9800 -13186 -10997 -8299 -11005 -16497 -17925 -16432 -14540
11636 -14540 -14988 -13953 -10672 -8612 -11320 -10169 -8839 -7136 -6232 -7039 -8065 -10846 -12161 -11857 -11079 -10160
11620 -10160 -8723 -10160 -7543 -7758 -8788 -10627 -13857 -14709 -14179 -16012 -14492 -12968 -12024 -14308 -12398
11605 -12398 -13163 -14461 -15230 -15408 -15636 -13502 -12584 -11495 -8411 -11058 -10156 -8914 -6140 -6513 -6856 -4381
11589 -4381 -7552 -11236 -10120 -9536 -12415 -12798 -15416 -15523 -13016 -14018 -14666 -12518 -10654 -10306 -12327 -14622
11573 -14622 -18644 -18269 -15492 -13488 -12499 -10391 -11653 -13017 -16878 -13811 -9635 -6514 -4548 -5296 -4389
11558 -4389 -2051 -3205 -1400 -1090 1326 800 -1658 -3812 -7720 -10204 -12152 -10224 -11027 -12932 -11815
11543 -11815 -11134 -11652 -10577 -10347 -7477 -3953 -7497 -10355 -9202 -13295 -15100 -14032 -13407 -11786 -8870
11528 -8870 -7880 -6912 -7764 -10890 -10113 -8356 -9348 -12954 -15024 -14248 -17444 -18394 -17581 -17634 -14278 -13400 -16472
11511 -16472 -14619 -14814 -12984 -11892 -10549 -12921 -11131 -10867 -8268 -5665 -6153 -7265 -9120 -8161 -11614
11496 -11614 -15441 -16609 -14868 -12546 -13663 -14358 -13569 -13640 -11935 -10558 -12290 -13163 -11075 -13318 -13218 -8056
11480 -8056 -5029 -5254 -5535 -8682 -5923 -4184 -2897 -2898 -4485 -7381 -8217 -10160 -11866 -10592 -9005 -9620
11464 -9620 -11855 -11782 -11468 -13758 -13416 -8886 -10384 -10296 -10018 -9707 -9233 -11851 -13957 -15394 -13890 -9987 -9577
11447 -9577 -11874 -13275 -13129 -14653 -15564 -15769 -13336 -13179 -14740 -15559 -17462 -15359 -12543 -12354 -12651 -13984
11431 -13984 -13452 -12542 -13153 -12801 -11734 -11115 -11090 -10647 -7437 -7123 -9528 -9995 -8789 -8001 -9082 -9241 -8388 -7935
11413 -7935 -8649 -9455 -9525 -10567 -11666 -14694 -11271 -11972 -14286 -14166 -10687 -10254 -9579 -6743 -8341 -11670 -13252
11396 -13252 -14268 -12418 -8563 -5515 -5450 -5090 -7398 -10842 -13304 -10555 -9425 -8615 -7685 -8054 -6704 -9383
11380 -9383 -13133 -14023 -12990 -9764 -8489 -10555 -7357 -10332 -13171 -12605 -10467 -11914 -12097 -8189 -9254
11365 -9254 -10562 -11518 -9338 -9853 -8910 -7503 -6492 -8991 -14622 -13431 -13244 -14113 -14876 -14956 -18479 -18591 -19774
11348 -19774 -22057 -20286 -19318 -20305 -21080 -19503 -18630 -22115 -20729 -19066 -19640 -17696 -13956 -13965 -14169 -17081 -17641
11331 -17641 -18420 -19792 -17202 -15473 -15823 -16018 -15471 -16557 -14888 -14243 -12784 -10280 -11224 -14115 -13917 -14915
11315 -14915 -17482 -17254 -16184 -16312 -16537 -17777 -18735 -15214 -14712 -16775 -15478 -12690 -12980 -14195 -16170 -15084
11299 -15084 -13285 -10553 -11490 -14290 -13330 -14267 -16720 -17129 -13589 -11933 -11404 -8794 -5051 -8046 -10566 -12790
11283 -12790 -9767 -3726 -3724 -7878 -9581 -12342 -12244 -8867 -4311 -2721 -856 279 636 -4 1214 2813
11267 2813 5452 8124 9148 14237 22152 29490 39218 52348 70881 90831 109813 137783 181541
11254 181541 249293 364838 558311 862375 1261721 1613318 1811797 1886904 1829352 1588876
11244 1588876 1227842 879213 619723 445616 329610 250579 191294 145975 116314 97617
11234 97617 79561 66966 59974 51388 42762 37302 33432 29683 27876 28236 23584 19461 14219 5714
11220 5714 1910 2889 3123 314 2051 4387 3373 1960 -2976 -637 -167 -892 -2387 -4443 -4549 -4309
11204 -4309 -6324 -9837 -10372 -8840 -9449 -7012 -7321 -10767 -9983 -8812 -6767 -7893 -12433 -13836 -9475 -7589
11188 -7589 -8425 -7677 -7072 -7388 -11023 -13366 -11187 -9059 -11617 -13645 -11928 -11957 -12218 -15340 -17213 -16876 -17164
11171 -17164 -20061 -21543 -23391 -25196 -25302 -24871 -25460 -23965 -23206 -19650 -17183 -15134 -11938 -10253 -12203
11156 -12203 -9304 -4696 -2676 -3611 -4873 -2733 -116 1076 1154 3796 3462 778 1320 1748 2080 4853
11140 4853 2776 3150 6439 9299 17997 29795 41715 57715 75721 99018 124638 165001 225647
11127 225647 318260 470144 723787 1084652 1410099 1549736 1560367 1592522 1640265 1537699
11117 1537699 1252552 913515 638712 455957 339004 260034 202715 158544 126277 101055
11107 101055 80266 63815 52912 46790 45437 41744 38208 33690 32072 28653 25050 24172 22453 21004
11093 21004 22056 19610 14260 13339 13409 15477 17841 19646 18568 13950 13050 16400 18830 23531 22804 23114
11077 23114 23981 23677 17112 11925 13377 14605 10041 4239 1356 625 1260 -2669 -4266 -5858 -3540
11062 -3540 1848 2771 1376 72 302 -1248 -3715 -3692 -1668 4529 7807 10046 13620 14479 20119 26245
11046 26245 33485 45910 56730 69292 78663 82606 87382 96449 113151 140938 179712 241945 335974
11033 335974 490872 739936 1036265 1253287 1390890 1472526 1464228 1433990 1467674 1514441 1506712
11022 1506712 1462696 1321944 1074437 797997 572649 421062 321436 246526 190116 149092
11012 149092 119616 98096 84738 73622 63357 58202 56676 52278 48923 44947 39047 35371 34364
10999 34364 31272 27926 28269 27142 21764 16562 11593 6752 4486 5671 7426 4188 2028 3175 4637
10984 4637 4461 3533 2288 3266 2786 2094 1243 3313 6996 9499 13902 10379 10783 10136 10578 12227 20710
10967 20710 26468 26473 27591 32586 34932 41243 49989 61443 77659 111273 162600 231267 298248 340116
10953 340116 340227 297386 238270 180029 125540 81924 48388 19493 -5229 -21056 -33203 -46240
10941 -46240 -59841 -76614 -92393 -101384 -107111 -106382 -98471 -82806 -65381 -50697 -40352 -32190 -24232
10928 -24232 -18617 -13195 -8356 -1112 5081 6814 996 -4669 -11215 -20472 -24529 -30283 -36720 -39622
10914 -39622 -39992 -37909 -34962 -36295 -34794 -28929 -25158 -22347 -16571 -10988 -6458 -5011 -5014 -331 2386
10899 2386 1342 -1585 -2997 -6625 -9387 -8572 -9569 -13518 -18578 -20224 -17142 -14750 -13206 -12500 -8349
10884 -8349 -3072 -379 7302 25314 49591 67987 84077 113383 128630 124804 145252 166244 159382
10871 159382 164601 182363 164888 149474 141218 113737 92787 81448 70929 58796 48054 36625
10859 36625 27516 21487 19558 20020 18439 20282 22136 23923 27299 26020 26957 31700 38880 44283 47322
10844 47322 48593 46559 43074 38158 34330 34738 35836 37391 39856 41993 44377 46046 43647 43728 47924
10829 47924 52419 51851 53486 55071 54950 54795 51671 39702 25119 9750 -548 -3479 -8427 -12663
10815 -12663 -25166 -32402 -29765 -35772 -33623 -18689 -13331 -11906 4023 8532 2600 12160 23259
10802 23259 26083 31853 41445 42417 39468 42636 43628 41500 43806 48963 48980 45640 41783 35273 37277
10787 37277 43135 46722 50650 58318 65432 73717 83426 90691 91725 92898 99957 101691 102923 101977 97944
10772 97944 92594 86933 80307 63503 48965 43575 43407 41877 40630 44891 51426 59332 68805 76342
10758 76342 86868 103440 125215 154040 189912 238892 309307 376774 419548 479485 542503 525407
10746 525407 542873 572804 541448 518535 532774 479248 403127 374274 296583 230404 183630
10735 183630 145027 120204 108724 103603 93719 82526 75284 68774 66904 71602 78689 83179 84065
10722 84065 83912 84454 84131 87094 91381 97176 97708 94669 94946 89976 84927 82776 84148 83833 83945 90751
10706 90751 97861 105822 119664 139160 161902 186744 205789 220768 233736 243717 250309 257941 268215
10693 268215 276288 284235 287752 289119 288282 296354 309104 324776 343759 361491 381860 402675 420669
10680 420669 437964 456428 473121 489163 502414 517484 530762 545803 562019 581522 605675
10669 605675 646145 706788 775019 846789 928893 1024371 1141962 1259239 1353810 1441610 1534039
10658 1534039 1642494 1773114 1908274 2016606 2111658 2216216 2348982 2506744 2684743 2887444
10648 2887444 3140252 3482579 3952615 4589137 5350464 6177951 7111528 8097559 9133790
10639 9133790 10252086 11343129 12255546 13097168 13956077 14931983 16347177 18521830 21691681
10630 21691681 26136288 32444628 41744029 55997360 78370558 113832529 164100254
10623 164100254 211269551 237817717 254244101 259723236 252694489 249056838 256830854
10616 256830854 261014442 257916934 248923044 222029748 180204154 135125651 99032677
10609 99032677 74450947 57668883 45574667 36485941 29685468 24729862 21187571 18707314
10601 18707314 16955657 15557782 14351288 13252775 12130446 11028382 10098446 9360366
10593 9360366 8676076 8036153 7409827 6726017 6032889 5394553 4861896 4430063 4074356
10584 4074356 3786474 3552874 3351668 3169143 3005082 2859714 2737227 2645257 2572797 2508323
10574 2508323 2439165 2363734 2283632 2206811 2144527 2097913 2064715 2045424 2033140 2036611 2082692
10563 2082692 2195320 2407234 2690829 2925194 3064437 3121817 3075483 2997350 2985844 3022427
10553 3022427 3014525 2949223 2778607 2488001 2151456 1846655 1616993 1453806 1327189 1226755
10543 1226755 1151134 1094828 1051165 1023799 1004100 994686 988190 988436 990493 992048 993291 995108 989346
10530 989346 978758 965146 944992 917878 886808 857889 823304 782216 745563 718716 700747
10519 700747 687051 674403 669272 664716 659637 656228 655474 650434 644349 647378 650590 645687 632165 615940
10505 615940 600089 588134 587831 599508 616628 624770 630856 666404 723825 730943 737515 775310 752212
10492 752212 712959 730453 718210 659562 645306 628420 547652 491584 457138 417788 389404
10481 389404 370958 359046 353142 350223 344552 344021 343261 341787 338856 333136 329033 321525 312348 305379
10467 305379 291083 273932 254435 241953 233657 229556 225329 220982 215271 212200 215921 211925 208058
10454 208058 211517 219464 222230 224425 227384 226567 226599 223955 217183 209387 200825 197516 200519 199548 192066
10439 192066 187695 183048 183714 189392 195697 204814 212234 221474 235101 238048 233547 248076 256101 256098 264375
10424 264375 271083 260926 256014 255683 239017 221479 216349 216829 209904 198984 189914 181487 178612 172141
10410 172141 167927 164203 158614 151952 149317 145024 139932 139536 135338 131409 131219 128679 121601 124460 127835
10395 127835 131130 131242 133620 131146 127359 127146 128231 129465 131342 133141 138265 142534 146053 145653 147682
10380 147682 152569 155104 152379 152388 151530 151219 154626 160936 168729 172141 174204 177815 180268 179750 176034 176981
10364 176981 180917 180922 179750 178864 170642 163474 159722 157411 156241 155828 156549 161038 168186 176392 186540
10349 186540 201818 211105 214554 209141 194789 180991 167493 155874 143528 133140 126963 125293
10337 125293 121448 123982 124950 120981 117684 118227 121071 124873 127064 127432 131429 141880 143633 143107 143489
10322 143489 142958 139937 134429 129770 128058 124457 118913 112044 109095 106773 105862 104335 103946 109519 113534
10307 113534 117253 125651 133642 142404 153916 164589 180704 194513 202961 204825 199002 187828 168847
10294 168847 148127 136609 127709 119949 103495 87959 69037 50116 37915 33709 37167 39645
10282 39645 45297 49080 49420 52774 56828 59875 63535 69499 72121 74220 71552 66982 62823 63145 61313
10267 61313 64001 68772 72697 73951 74453 76079 75585 73145 71109 70493 70238 72192 76674 77968 74844
10252 74844 74870 79447 84417 87920 88629 90580 93996 93066 92035 88304 89610 95937 100636 104850 104674 106143
10236 106143 112323 127395 146358 184026 235274 286939 324019 354822 374924 387153 399626 417896
10224 417896 423472 422204 416952 393487 363825 334149 316490 313504 324255 349344 400310 486167
10212 486167 632078 867724 1154562 1365441 1492809 1568761 1555004 1517760 1542830 1589266
10202 1589266 1580470 1535669 1396473 1152147 874561 643624 485839 382756 310813 259748
10192 259748 222406 198144 180183 163686 153768 147941 142277 137026 126652 118555 114522 110864 104254
10179 104254 100455 101654 99838 94628 91267 88071 86582 80563 77968 77086 78855 77389 75444 71116
10165 71116 66410 63524 59353 53468 50956 46226 43802 41399 40250 42448 41857 40216 42095 40629 43637
10150 43637 49643 50770 52527 53803 52827 52249 51202 48843 49630 50032 50367 49565 47776 48682 49605 46668
10134 46668 44526 42758 45595 51067 52411 54372 49324 44094 41456 42429 47134 50278 55438 56262 54554
10119 54554 52562 54064 53615 56436 57807 55800 51938 51092 48140 46017 47789 49721 52424 51933 51732
10104 51732 51713 54421 57544 58355 54772 54815 57154 58704 58730 54206 50492 52961 52789 54057 53979 51901 53898
10087 53898 59346 61601 58782 55434 57321 55302 54311 54407 54490 54325 55306 55041 57010 54981 52488 52792 53120
10070 53120 52819 54434 53894 50817 51505 54307 56042 54464 54311 52340 50809 49492 52285 51578 49896 47206
10054 47206 44481 43022 43857 43716 42405 38830 37940 40019 38974 39624 41611 44132 47502 49302 44159
10039 44159 42364 41314 42638 46874 46836 44796 46675 46624 45163 42132 39229 41328 44118 42714 37443
10024 37443 34854 37435 37886 35185 35724 34667 35705 35248 35578 37851 38390 40195 40256 39014 39371 40593
10008 40593 41519 42172 43446 45505 48568 49533 50680 53752 56551 61492 64167 71267 84038 97408 118333
9993 118333 158604 228492 360144 562511 700831 646748 490202 330333 230244 176316
9983 176316 140626 117178 97042 79947 68700 60406 55724 56802 54403 49586 47652 44890 45980
9970 45980 45125 45284 46330 45600 42473 39398 39625 40989 44339 44537 41491 36885 39361 38358 38334 39857
9954 39857 41495 40534 36496 33953 35635 34817 35945 35114 33904 35312 33447 31905 31448 35260 36560 34400
9938 34400 32056 29572 30495 30215 29118 29565 30610 30313 25897 27802 29233 32505 33504 33508 29895 29676 33482
9921 33482 34959 33089 31563 29149 29963 31840 31401 30867 31597 31778 29985 29978 28872 28347 27726 23675 21507
9904 21507 23117 28693 32092 29087 26013 24400 22649 25485 31911 32752 33529 33793 32713 32135 30026 27443
9888 27443 30155 30912 30258 29878 29535 30788 31358 33194 34557 33643 33811 37328 37745 40515 52151 72111
9872 72111 98396 115037 110405 88773 68720 56559 45700 39996 38083 34549 33397 33213 33457 31848
9858 31848 28473 28551 28952 26826 27810 27281 23890 22763 22471 22513 23615 24862 26419 26845 23184 26152 26346
9841 26346 25131 25930 27251 24891 22222 19471 22106 23194 25910 27007 24419 25548 27359 26459 26059
9826 26059 24251 25466 26780 26040 25234 24904 26283 29184 31569 31802 29988 32540 34780 36045 38757 38254
9810 38254 42368 47951 55441 66848 82634 92225 94019 89020 82110 70851 57834 50901 45556 39461
9796 39461 38541 39803 38534 33610 30792 31120 30794 29583 30013 27773 29112 29516 29475 30185 27034 22536 22440
9779 22440 23453 21074 20927 20772 19852 19718 20579 19357 18401 17946 22493 26395 26924 24558 21568 22050 26796
9762 26796 25235 21509 18805 16879 17896 18142 20527 23786 23300 26597 27303 24359 19320 18900 21958 22781
9746 22781 21531 18965 19267 19955 19902 18252 20402 22971 19092 17327 20850 22254 23730 24042 20972 21630
9730 21630 19935 21197 22247 24373 21768 21597 22157 23162 24634 23786 21449 21189 22001 21509 20599 20142 20054
9713 20054 21840 24305 24719 21636 22054 22186 22791 21646 23239 23183 22991 21714 23728 21940 25093 22524
9697 22524 19639 17683 14333 15967 16474 13600 12869 13819 14297 14327 13617 15536 18300 21096 21477 17607 19709
9680 19709 24092 20012 18251 16351 14762 16804 21388 23617 23612 24564 27220 28572 23164 22082 25472 28592
9664 28592 30139 25721 22580 22852 27023 25050 23428 26590 34485 36492 34225 32710 31478 31121 31493
9649 31493 28324 25957 25872 24866 27206 29143 26583 30245 31668 31402 35305 40476 42777 38987 37175
9634 37175 35112 30082 28507 27567 27272 25241 22317 22815 26814 28269 25556 24833 23008 17800 16107 17872
9618 17872 15892 16163 15779 16326 19232 20874 19874 21592 20663 23069 21648 21367 25159 25077 23072 20960
9602 20960 16465 18418 22389 22163 17122 18125 22054 25762 26226 25149 19086 17715 19152 21622 17854
9587 17854 13996 18706 23786 21964 20815 21463 20412 18202 20373 22770 22119 23740 24270 21393 20846 23944
9571 23944 25855 27170 27810 24175 20196 18086 20054 21557 19264 17377 17275 16514 17644 19877 20469 19586
9555 19586 19155 20965 24087 28337 23068 20592 19297 21211 22648 21096 20459 19961 17736 15592 15147 17838
9539 17838 18914 19623 20600 18040 15382 15327 15692 15729 12942 14181 16772 18298 17880 18032 19101 22000 23621
9522 23621 23019 20886 18735 22398 25323 23452 18541 16062 16073 15694 18283 19475 16954 16677 14854 13849
9506 13849 17252 16986 15865 15038 12782 12625 15771 19395 19753 22001 22298 20419 17750 16882 17315 18276 18758
9489 18758 18576 16348 16294 14834 15734 15430 14016 15943 18097 18474 17468 17756 18523 19874 21030 21507 20899
9472 20899 17879 15873 16998 16959 14131 11900 16454 16897 19001 20658 20718 18537 16079 17831 17236 17785
9456 17785 18781 18907 16818 15913 14407 14715 17557 15614 16223 17404 13129 14660 15082 15489 13705 16621
9440 16621 16970 16825 17244 16455 18936 21462 18505 17167 16235 18208 17540 14008 14495 17177 17778 19729 18781
9423 18781 19554 16358 14414 17016 17689 18258 16559 14570 12867 16502 18294 17328 14287 11642 13603 11229
9407 11229 13157 17521 18619 16805 18631 21734 20566 18571 18660 23009 24214 25353 25160 22354 17573
9392 17573 15841 16658 15591 15522 16230 15327 16768 21427 22824 21778 23082 25406 23106 20521 15409 14329
9376 14329 13596 12587 15766 16995 14807 14787 14404 13943 16951 21432 23753 20394 16905 15817 15493 19672
9360 19672 21599 21575 19886 19094 17359 15909 16253 15923 16177 17194 14653 16000 16799 16963 16606 16285 16231 16181
9342 16181 17700 17078 14871 16418 17744 16597 15860 14986 18124 16936 16097 12325 15310 16398 16736 18811
9326 18811 19556 19242 19697 17706 18166 17756 16338 14773 13758 13907 13733 14380 16885 19298 20028 21014 20776
9309 20776 17695 15193 12309 14358 17485 18391 14714 10898 10811 13392 14996 12894 12728 16694 19159 18316
9293 18316 13948 12056 10793 12404 14868 13885 13190 17452 18955 17155 14377 13016 13891 18057 24466
9278 24466 23380 18895 14471 10703 11036 12014 14284 13237 11620 10933 9430 11529 9554 8674 11203 13165
9262 13165 13008 10783 9999 12707 12035 14278 17708 20102 16471 13862 10116 14165 16263 14311 13011
9247 13011 14076 14545 11155 10590 9802 10640 9348 8417 8361 6190 6115 10221 14127 16882 20007 17795 15712
9230 15712 17202 19268 20388 16976 16729 14970 14804 16594 16531 14601 13297 14497 17669 16705 15847 18086
9214 18086 18589 20091 17198 11094 11357 9947 10497 10069 11322 12598 15197 14584 12999 13499 13093 11007
9198 11007 12154 10721 8821 6104 6264 7972 9936 8686 12112 14972 14143 13434 10286 11054 14968 17492
9182 17492 13936 11406 12623 11750 10418 11756 13787 15066 14128 12697 10713 11251 10319 12584 12181 9303
9166 9303 7474 7867 9046 8139 9697 12059 11631 8721 8141 10715 10605 8442 8102 9594 11397 11705 7966
9149 7966 9928 10278 9433 8116 9875 12490 14074 10373 7523 8511 10550 8726 9515 7322 6711 8013
9133 8013 8138 9600 10594 8560 8902 8148 7216 7079 6616 4257 7137 13948 11468 12338 13005 10472 7461
9116 7461 9035 12074 12251 12318 9900 7207 8760 7961 6684 6850 3229 4430 7891 11931 12370 13363 13935
9099 13935 14266 12674 9620 9914 12399 11744 12395 10573 5876 6715 11650 12593 13930 11246 6998 8255
9083 8255 8243 5901 7559 8046 9359 10013 8727 9150 8665 8135 6740 4393 9304 11993 8854 7398 7277
9066 7277 3841 3133 8043 9501 9896 10712 10563 8335 9411 9513 11022 10769 6352 3350 4866 4647 6166
9049 6166 10273 7939 7068 8194 4794 5700 7313 7569 6931 6126 5378 3991 4824 4557 6434 6054 4874
9032 4874 2545 3799 5829 6113 7375 8963 7658 6240 6308 5789 4820 3674 4117 7032 8048 5650
9016 5650 5115 6753 5810 7232 6598 7873 11462 10645 6817 4619 3577 7758 10493 8844 7510 5127
9000 5127 3363 5874 8082 6547 2446 1330 814 2653 2782 2281 2435 6963 7994 7876 4936 3253
8984 3253 1879 3457 5532 8104 11041 11486 10919 13401 11046 10786 9547 5240 4133 8118 10842 9432
8968 9432 6363 4326 5722 4421 1101 4417 5591 2098 3038 4967 7072 8269 4911 3559 5541
8953 5541 6275 5687 4178 3612 4737 6471 8285 9417 9453 9579 9772 10079 7760 4202 3583 2970 252
8936 252 697 1009 4574 4737 3574 2946 1789 -202 -3091 -3359 -1320 2069 3957 3877 7182 8706 8888
8919 8888 9176 9949 10978 11612 10455 8857 8770 7803 4717 7466 7694 6548 6730 5770 5393 3211 216
8902 216 -1667 -1978 2524 6774 5804 5398 4533 5282 7104 6800 5774 1603 3764 7127 7195 6518 7051 4671
8884 4671 1417 3465 4228 7140 5144 -200 964 3714 5482 7152 8164 5356 6143 6670 7467 6849
8868 6849 5274 4417 5237 7174 6211 8215 10011 11022 7098 3033 3078 5203 6094 7102 6602 6781 8469
8851 8469 7023 5036 2824 1366 152 3128 6111 7962 6452 7489 6368 4733 4787 6138 5282 6323
8835 6323 5950 6954 3817 1485 3035 7685 5927 1492 -149 8 1343 3337 5639 7107 8454
8820 8454 7354 6390 2436 1738 3345 307 1799 4156 5059 2974 2314 5221 4164 2119 3191 3793
8804 3793 3773 -63 1546 5994 4677 4808 7510 7718 4096 79 3081 5487 7595 8037 6194 6007
8788 6007 6102 6008 6306 5030 3818 1784 3739 3251 5205 5594 5453 2734 -88 2095 2484 2242 6821
8771 6821 5152 5318 5374 3522 5815 6092 4367 3085 3605 4780 7303 3772 3036 5042 4890 6064 5872
8754 5872 4055 4634 6103 7014 7998 3404 451 -224 4144 3838 4599 3795 4581 4965 4660 4819 3417 8162
8736 8162 8417 4779 4747 3066 1088 3715 4943 5418 3454 1041 3214 396 -3571 1580 2924 1556
8720 1556 3588 5490 5277 7377 5570 8552 14549 11298 7893 10058 8640 6677 3370 2604 4191
8705 4191 5598 4270 10376 11664 6350 4298 3316 3325 513 -1366 743 4648 6526 4832 3784 2978
8689 2978 2302 4378 4713 3080 4078 2695 1348 3048 3356 4764 5335 7754 7138 4937 2939 5043
8673 5043 5503 6439 9322 7812 5038 1606 2905 3221 6677 4474 1407 -1781 505 7055 2147 -486
8657 -486 4494 7309 6545 5983 4962 5813 3680 2115 6940 10044 9942 9896 9789 8889 6780 4423 4180
8640 4180 5143 6826 5255 4858 5812 5096 6237 7473 7178 8852 7983 7636 7537 6830 6999 6177 4136 653
8622 653 -95 203 1138 5005 7515 5131 4950 7012 8630 6639 7231 6340 6058 8388 7497 6871 5627
8605 5627 8125 11208 9752 7365 6555 5562 5529 7635 6376 9346 7277 7413 5331 5573 8707 8637 10156
8588 10156 13733 16152 15663 11574 7495 5321 4659 5152 6511 6416 4635 5032 6607 7192 4125 7199
8572 7199 4105 3752 4403 3460 5235 2141 40 905 3607 3837 4080 3237 2096 3866 5254 6990 7502
8555 7502 8957 10995 13596 15424 13160 7930 4828 5575 7336 8214 10353 10733 9918 11296 14189 13357
8539 13357 8440 4800 5951 5690 5613 7332 9701 12269 14576 14826 14161 13664 14052 14031 12626 11490 6378
8522 6378 3343 4399 4701 3841 4324 87 -2761 -933 1845 6067 6713 4705 4593 2970 1308 2537
8506 2537 403 -2196 188 1203 1718 2591 5651 6599 5212 5079 5244 5748 6587 6670 7068 5085 4905 4361
8488 4361 3322 3600 1925 2369 1237 1708 508 1278 4428 6036 7394 3102 1309 4074 3729 1140
8472 1140 226 62 1055 2459 2536 1934 3262 2243 1734 1606 2066 4308 6940 7710 5478 6252 3868 1428
8454 1428 856 -467 3665 8887 8067 7446 10078 12709 13480 15490 11429 9664 10462 9999 8150 6921
8438 6921 4185 2107 236 2900 7366 6658 3458 4429 6245 8346 8561 8580 7009 7176 7411 6740 3868
8421 3868 3309 4737 8169 6360 5830 6998 8887 7196 5498 3352 3515 3880 2642 3389 4979 6297
8405 6297 4301 1061 -553 1621 3897 6611 4223 3338 3190 2702 3957 663 851 5961 3434 984
8389 984 1202 3528 7737 8359 4377 2529 1874 1138 4559 5558 4154 4517 2849 2449 5273 3810 732
8372 732 2262 3016 974 899 4020 6347 6798 7161 8546 5650 2199 1445 1549 2888 5559 5930 4101
8355 4101 7001 6879 6684 6257 5622 2752 1378 3098 3551 1579 468 1739 1046 -717 -1403 -921 560
8338 560 640 2690 4980 5030 1425 3125 6457 3621 2940 4190 3830 6802 8317 7178 4840 4079 4207
8321 4207 4554 2531 1528 586 -1141 1533 -2156 -4036 -135 713 1389 4304 6555 7183 4794 2023
8305 2023 -9 2032 2393 3684 2185 1828 5213 5244 4493 2001 -129 -808 2604 6037 6102 5098 4855
8288 4855 2503 2601 4994 3127 -1684 -2230 -452 2793 4335 361 1162 2474 2966 4874 7104 4337
8272 4337 2936 3626 967 -1409 -366 1486 860 -836 255 4248 3899 2170 -449 521 2344 1307
8256 1307 2017 4808 5886 5271 6410 4942 4373 2410 -51 695 4878 8932 8508 3138 1410 68
8240 68 348 638 2308 1768 3924 2593 2171 3542 1278 -1492 770 793 1885 1123 1830 4340 3119
8223 3119 3862 3106 680 -1613 1665 3047 1991 -121 1795 2213 -2747 -2806 2349 4747 -404 -3714
8207 -3714 -2653 -337 871 2452 3202 6417 7151 8383 6378 3358 2623 1506 -2085 -782 4981 7497
8191 7497 8548 6688 5023 1079 -81 -1062 -21 5098 6540 4896 2614 4467 5470 5927 3506
8176 3506 2868 -662 -1787 2410 5803 5118 2609 3404 7692 6530 6553 7585 5826 3627 4597 4079 1570
8159 1570 -613 -1804 -76 -1922 -5159 -6230 -4496 -2537 -1538 332 1564 3649 2448 2005 1161 2150
8143 2150 527 196 4615 6300 4459 3491 3540 3677 2542 -805 1363 2395 1599 4721 7036 3915
8127 3915 2366 3076 6674 7173 4382 4132 6153 6456 5235 3397 5541 7225 4033 361 -1256 3
8111 3 -780 -1263 1832 3130 3150 4731 4555 2641 1767 2984 1381 2533 3946 7440 7244 4125 2828
8094 2828 5796 5886 4512 2460 1870 -4739 -4473 -3450 -1466 1362 2004 2301 3210 2483 -196 -368 -426 1388
8076 1388 -1470 -2541 -3084 -2408 863 2408 -1153 -2931 -2803 -953 1804 1197 1737 2585 1128 -244
8060 -244 -2164 -3910 -1121 676 -235 3073 4350 3256 4466 3155 1873 -1159 30 3782 4139 1070
8044 1070 -397 -3786 -1853 -355 -4148 -2438 -41 1416 -324 -5200 -5745 -4155 -3476 -4650 101
8029 101 1492 820 3104 5760 1835 -562 -4479 -8452 -4675 -2159 -1960 -2844 -595 1777 -79 577
8013 577 989 4186 7525 6528 4996 4855 1726 1229 -82 1889 3886 832 1465 2621 901 -901
7997 -901 -894 -3339 -2951 1783 3186 1048 -1744 804 2712 2477 5491 7157 5537 1668 -381 2599
7981 2599 2134 -1087 -2135 527 449 -521 600 3100 4430 6014 8196 7885 8683 3719 364 167 1975
7964 1975 3526 5171 3610 4117 2747 3397 6934 6950 3904 3658 929 625 2067 1475 2846 4246 4756
7947 4756 3272 1508 2087 2252 8555 8343 5680 6189 6778 8105 5505 3450 3457 1989 3468 5078 2813
7930 2813 3041 1356 -1650 -1797 5848 9848 7279 -922 -2771 -2914 423 641 -2606 -2965 635 2199
7914 2199 3442 2670 757 -975 -1928 -3028 -1855 1078 2652 537 773 3873 3327 -1047 -1680 1630
7898 1630 4416 4128 -215 -3403 -1789 -1972 238 -101 540 2027 2048 3014 2796 1334 691 -1196 -2013
7881 -2013 -192 1892 4483 8457 9783 7418 5784 4748 5106 4005 4670 4213 3713 3197 1165 5872
7865 5872 8511 5186 2616 2366 5708 9404 7874 6979 6672 8229 7757 10827 11253 8092 7390 6866 6008
7848 6008 4668 2886 3287 2591 3079 1826 -424 1719 3081 87 -618 -968 936 2108 3230 4697
7832 4697 5875 4524 3138 4750 2850 -800 717 3731 1226 -813 2920 4219 2568 1969 847
7817 847 -1958 -1513 -1194 -884 -1292 -2533 -2179 2317 6059 1007 -3983 -4129 -5244 783 2898 1546 409
7800 409 -1149 -2104 -1757 -1335 -4784 -7345 -5229 -4534 -2139 -1894 -1842 -134 1473 2062 3020 1903 295
7783 295 67 -1482 -2964 -2065 -182 -886 -1433 -1264 -2366 -2979 -5752 -7145 -6772 -8689 -9097 -6073 -4469
7766 -4469 -2016 -1105 -2693 -2203 64 739 -454 551 -1564 187 313 -3148 -4081 -5749 -4286 -4446
7750 -4446 -6648 -6816 -4865 -5608 -5611 -2546 1320 4415 4063 4051 4091 2099 1506 -2645 -2738 864 627 2914
7732 2914 2591 -1251 -1558 760 989 -1860 -2488 -4647 -2066 -74 982 -949 -597 1119 1025 3317 3540
7715 3540 8404 7000 5995 4007 2041 -694 -976 665 2618 2134 -105 -675 784 -96 401 738
7699 738 -621 2509 1291 107 -2962 -2342 2141 4588 2506 -1555 -5150 -6168 -4001 -4159 -4492 -3449
7683 -3449 -4856 -1805 -437 -976 -425 2743 3645 1691 2144 1566 -2300 -3419 -4240 -2212 -1440 -23 1106
7666 1106 -2865 -3868 -4485 -2603 1497 2677 336 2197 2985 1331 -2981 -3530 -965 -20 -927 190
7650 190 -1450 -770 -243 757 1997 -389 -107 874 1737 856 -2498 -3107 -4612 -4463 -4826 -1961 -75
7633 -75 500 1438 854 -1126 1345 387 244 2776 907 -2742 -4626 -1556 -281 2383 3240 3810 2605
7616 2605 1089 864 -1355 -2573 -72 -700 -2292 -3201 -4919 -5503 -781 1861 -1187 -6217 -5382 -3049
7600 -3049 -417 -1137 -2436 -1904 14 -1317 -1948 -4653 -3831 -952 -1018 -1660 -2076 -2548 -507 -1655 45
7583 45 1399 1201 310 -1138 -1759 -2486 -1857 -2070 -2874 -3945 -1339 -1581 -953 624 -1272 -3001 -1201 -1339
7565 -1339 -686 -1812 -3447 -1182 2793 3289 1939 1307 2305 2123 2184 2164 3328 3475 2376 1282 -904
7548 -904 612 -728 -302 1912 -615 -3276 -2012 486 -98 -1695 -122 1951 2736 4114 3596 1059
7532 1059 -391 -5047 -8338 -2951 2852 4712 6895 5076 2062 -1044 -2672 -2356 -2024 -4816 -6738
7517 -6738 -5981 -566 -942 -3482 36 3057 2601 1110 -2180 -3252 -471 54 -127 -1398 606 837
7501 837 -2003 -4466 -5081 488 6024 5021 1204 -300 -2263 -4636 -7087 -8623 -5069 961 4498
7486 4498 5282 5316 5221 2083 -1477 -488 140 1389 -246 -72 -536 -847 937 -1241 972 878 -84 -2563
7468 -2563 -1412 -2994 -1934 -2053 -4334 -3933 -3222 -1076 -538 -2761 -6078 -3382 1900 4271 2139 -44
7452 -44 -663 -655 -1867 -1718 231 2847 810 -3047 -5503 -3810 -2175 -67 -1403 -3565 -3497 -4751 -1338
7435 -1338 1615 1467 2587 120 -475 -1482 -2952 35 979 485 781 -680 -1744 -728 -4158 -6236
7419 -6236 -843 657 -2068 -1743 -1029 -558 1812 3133 1349 -1076 -1689 -1854 -1693 -4281 -2192 -1533 -2594
7402 -2594 -2317 -155 -1753 -1656 210 1549 3646 2108 1650 4342 4410 1299 -315 1291 3632 5056
7386 5056 4173 2736 803 -2600 -3276 -2570 -2706 -1293 -1760 -2589 -4419 -3241 -3079 -2780 -4544 -4292 -2411
7369 -2411 -1338 150 3409 3069 -177 -2499 -3101 735 2796 2506 3081 2366 1025 4 -4593 -380
7353 -380 1970 883 3788 5206 959 -2243 -2022 -1740 -1383 -1072 -863 734 2361 -1464 -4187 -4386 -1625
7336 -1625 613 731 686 -2403 -3671 -2931 -1530 -2208 -5419 -5876 2522 1236 -3112 -2964 2357 6013 2649
7319 2649 819 -312 3162 7585 4466 -459 -870 -1475 653 430 512 4399 -577 -3150 -2255 698
7303 698 4975 8182 4937 619 -2885 -4724 -3063 -1070 -2030 -3203 -2529 -2330 -6042 -4204 -1440 -1628
7287 -1628 967 798 1004 1901 41 788 -1125 -1832 -2206 -3365 -5210 -2564 -1604 -2499 -663 -102 -58 -613
7269 -613 -1780 -1390 -2585 -3729 25 3380 2231 2294 1215 -1323 118 923 2162 3240 2451 -779
7253 -779 -4374 -3603 -1671 -1970 -426 180 2045 -1382 -5678 -4323 -265 -2170 -4155 -681 232 -2971
7237 -2971 -3551 159 4165 4725 6662 5961 4429 7788 7549 2550 1951 1212 3488 4026 4636 4999 1781
7220 1781 -1189 -1903 2707 1561 522 2170 -463 -4019 -3647 86 1059 -1346 -1220 -137 -1404 -799
7204 -799 4101 4608 3670 1845 -3965 -6257 -8218 -6718 -2789 -2331 -6404 -8054 -6752 -7177 -4521 -2457
7188 -2457 -5524 -7071 -3922 -3150 -2189 -3234 -3729 -5318 -4672 -3107 -3989 -5070 -3974 1698 1060 -3278
7172 -3278 -6032 -3454 -3345 -4668 -3489 -636 910 213 -149 192 -46 -4932 -8205 -8099 -4358 -4308 -5292
7155 -5292 -4021 -1693 -276 1810 2765 5306 6701 2478 1223 2642 1964 5636 3913 2010 780
7140 780 -1647 -3866 -7666 -8072 -8250 -8272 -9495 -12397 -11360 -6451 -280 4070 249 -789 1010 -510
7124 -510 -3646 -3948 -2381 2118 3573 308 690 -1011 -3931 -1788 4055 5685 6868 3897 -1054 -4022
7108 -4022 -1400 -235 1818 2054 1554 2352 1464 752 1035 -1225 -2408 -12 1139 -848 -2957 -972
7092 -972 3135 1419 -813 -860 1267 -2840 -4811 -2705 1288 2830 -956 -1296 -2826 -3324 -1137 476
7076 476 5173 5173 1926 733 -2348 -6469 -5238 -3933 -2904 -1752 -650 -265 4743 4951 5738 4570 131
7059 131 -2553 1445 4683 1906 1794 2713 3820 -1412 -3174 -3306 -2847 -4018 -2951 142 -1427 -2225
7043 -2225 -56 -1177 -1687 -909 -1453 -3180 -6748 -8390 -7909 -5597 -4314 -1412 -381 -2536 -9866 -8551
7027 -8551 -4926 -5339 -6666 -7925 -6366 -3388 -1252 -1695 1477 818 503 2300 -1527 -579 -712 253 -73
7010 -73 202 1448 -1537 -398 1787 343 1894 3425 1992 1762 274 -2820 -3462 -3179 -2992 -2439 -571
6993 -571 3649 5266 1372 -1513 -430 202 -776 867 2021 754 2759 939 -2086 -1908 -1712 -676
6977 -676 2195 -1046 -3777 -4920 -4348 -2479 -6869 -7664 -7070 -4962 -3319 318 2585 2284 324 1008
6961 1008 776 -980 121 95 -4963 -7035 -8353 -3658 3738 3273 634 -2140 272 544 900 3533
6945 3533 2714 667 -802 -651 624 1730 2094 2850 3020 5666 3353 2587 2649 -1271 -2519 -3897 -3855
6928 -3855 -5838 -5484 -6734 -4913 -4459 -2489 -3115 -2428 -336 778 -227 -1330 -5494 -5931 -3187 -2487
6912 -2487 -1985 263 -2946 -4626 -3997 -3103 -1152 1736 2934 4173 1945 3953 5365 2643 1830 2246
6896 2246 2394 2418 -1353 -3943 848 2916 1413 1619 -482 1237 3382 178 -2423 -6498 -5001 -4043
6880 -4043 -2264 2278 1192 2112 2115 165 2271 1534 -228 -2542 -4606 -4223 -6141 -4410 -1136 726
6864 726 -903 1513 3224 2907 1718 1578 1042 2093 -460 540 1804 -75 -1356 -1098 928 1998
6848 1998 3664 4811 4548 6546 3784 4734 2562 -3626 -3439 -1721 -484 -198 1354 -957 -4541 -2542
6832 -2542 499 70 -3321 -2167 -128 617 463 1277 3825 2925 902 -12 -299 -816 -1150 316 33
6815 33 -674 840 -908 -2378 -1859 26 -1793 -3335 -3560 -649 2296 1219 2818 4526 1000 -1106
6799 -1106 -2638 -3027 -2756 -824 379 -682 -545 2767 602 -3780 -4246 -4054 210 1798 -723 -2615
6783 -2615 -4183 -3426 -1905 -837 978 347 -507 -1086 783 -182 -3333 -4872 -1003 4189 6383 4756
6767 4756 1996 865 580 1895 -312 -1433 -2237 -1066 -649 122 162 -169 2174 4214 -501 -1128 -484
6750 -484 -1309 -996 -514 1016 -521 -3005 224 1726 1519 -316 -153 780 1452 1004 91 1631 1830 2514
6732 2514 976 -1343 -3286 -2961 -2113 -1927 2344 3023 1381 -4819 -6646 -5550 -2853 -1363 -922 -527
6716 -527 373 -1154 215 226 -68 -393 -1584 -2541 1132 1293 3863 2915 2844 1793 -330 -792 -1201 -3403
6698 -3403 734 3372 2129 4014 1182 -560 1846 4578 5447 1611 -316 -583 -2640 -5477 -6011 -5238
6682 -5238 -3493 -2119 -1241 -3190 -1519 -2882 -4934 -5496 -4642 -3595 -519 2123 -5 -486 1575 2684
6666 2684 361 -1428 -4051 -2617 -664 -1633 -1532 572 -2792 -2343 -2107 -867 843 -181 2242 2819
6650 2819 2004 32 2223 2409 -281 -2861 -5729 -1902 2946 -642 -4622 -5357 -5500 -6420 -3556 1714
6634 1714 1564 613 -1587 -2825 -1654 -1733 101 1204 -3010 -4347 -4569 -3423 243 1693 1011 2272
6618 2272 2230 3274 2616 3037 4496 3215 4195 3692 2333 -579 -3606 -2774 -3314 -4119 -2236 -899 -1615
6601 -1615 -1185 2122 2622 -1112 -4064 -2857 -1838 -4563 -6160 -3341 2052 1375 -2801 -2927 -1898 1844
6585 1844 -1276 214 -1240 -707 -945 -1087 749 -477 -1378 -320 479 -1484 -4375 -4846 -2926 -4027
6569 -4027 -4523 -6417 -6656 -5966 -6216 -8122 -6261 -6981 -4120 -3876 -4264 -2107 -2668 -2421 -3014 -2408 -3246 1030
6551 1030 2426 1985 1058 -508 -420 2213 1135 783 -337 -2364 -2351 -3074 -4857 -6502 -2782 177 -3117
6534 -3117 -4102 -3734 -2183 -459 105 -1385 -5844 -6508 -4985 -4886 -2208 -3781 -4674 -1401 -272 1323 -344
6517 -344 1230 5232 5282 1393 -1348 -3339 -4177 -835 1182 -688 -3335 -3633 -3676 -2487 -3133 -6819 -9497
6500 -9497 -8350 -6211 -3989 -3353 1353 3481 2379 -684 -1116 -729 681 1780 2747 1964 1309 3664
6484 3664 3390 1423 -733 -1931 808 -606 -2644 -4639 -3014 -564 1430 2262 3385 2763 550 -3059
6468 -3059 -4170 -5355 -4534 -3549 -3367 -4806 -5399 -2009 207 -397 118 -123 -1674 2573 4447 4332 1742
6451 1742 -2134 -1664 -179 -2252 -1424 209 -966 -2814 -3000 -3531 -5788 -6343 -9286 -6761 -5818 -7063
6435 -7063 -8090 -5490 -4994 -6117 -4145 -2610 398 2326 -1057 -1715 1559 2663 -43 784 -126 1009
6419 1009 1802 1320 -1282 -2278 -3556 -4624 -3919 368 5087 4822 1036 -2737 -5779 -6634 -2474 -870
6403 -870 -4068 -5155 -2746 1932 2887 2826 2098 2318 786 -2692 -1429 -1167 -2718 -2876 -4145 -1643 -2049
6386 -2049 -592 2417 -1004 -4940 -4047 -2201 -1924 -376 -1805 -1147 187 3040 -1313 -3357 -3338 -3363 -3882
6369 -3882 -3014 -2037 -5116 -4902 -2227 -1951 -251 -703 -2642 -3496 -1731 555 549 1607 -488 -520 -846 -2235
6351 -2235 -1178 -2798 -1946 859 1677 -1324 -4651 -2087 -181 -45 -850 -2309 -6204 -7760 -3050 1553
6335 1553 475 -499 481 -1589 2323 2906 2298 1871 971 2277 2158 1531 1962 -123 -2273 -646 -38
6318 -38 382 1649 -378 -1370 -2236 -316 2189 3601 3253 3437 3015 2373 535 1267 2528 1662 324 -733
6300 -733 -1250 -435 -760 3452 3857 2118 -2553 -4408 -4449 -1004 1326 1014 -1173 -3010 -6437 -6157 -5046
6283 -5046 -2720 -1282 1900 1103 459 183 1486 40 -1878 -551 -3831 -5238 -3974 -6266 -7570 -9526
6267 -9526 -8806 -8424 -5989 -3929 -5592 -6909 -6469 -2788 -1793 -3706 -4978 -4231 -3270 -1864 -1583 -4578 -6558
6250 -6558 -6342 -1745 -1773 -4640 -5495 -2445 -3701 -3650 -3975 -941 262 -1222 -2827 -2975 -1519 -328 2638
6233 2638 90 -573 244 -1456 1411 3325 3324 1914 -959 -5150 -5339 -425 835 3626 3490 143 1437
6216 1437 67 -3624 -4999 -7108 -4572 -996 -903 -2137 -1753 -1298 -2849 -3856 -2818 -1839 -3083 -5710
6200 -5710 -4731 -7097 -5046 -4477 -3790 -5659 -5415 -2981 -3831 -6106 -5592 -8714 -4679 2744 3966 4683 5153
6183 5153 2955 83 -5273 -4438 -2640 -3951 -6540 -5313 -3399 -2792 -770 1488 -1201 -4373 -3250
6168 -3250 -3723 -2123 -2584 -1937 -1801 -3351 -2257 -5304 -4279 -2503 -3113 -5233 -6909 -7886 -7550 -8004 -5326
6151 -5326 -7006 -6506 -4528 -1480 2871 2351 1619 1651 4483 5968 4946 3735 1771 2475 112 -3780
6135 -3780 -4955 -4933 -7569 -3895 -2105 -2449 -1588 -2528 -3943 -1155 2060 779 751 1434 -238 -1395 -810
6118 -810 1119 2137 560 -2673 -1050 1171 1905 -1415 -3355 -298 2789 994 781 4259 5202 3025
6102 3025 721 -142 -518 -1884 -3958 -7382 -7070 -4516 -21 1597 2032 1157 -1158 -3332 -729 -95
6086 -95 -799 91 -420 -822 -1992 -448 -1629 -3941 -1652 1830 -513 -3941 -4780 -3403 -2323 686 -517
6069 -517 -184 273 -3141 -4250 -4864 -3206 -839 -3093 -4242 -6471 -7025 -6197 -6449 -7105 -5166 -5083 -4787 -4006
6051 -4006 -1643 494 1431 2129 -379 -2488 -4084 -4390 -3011 -1655 1762 3254 1553 -1960 -5871 -1682
6035 -1682 3682 3551 -1268 -6202 -7039 -5118 -3809 -761 3795 4781 424 -3806 -7026 -9294 -9922 -6487
6019 -6487 -2397 -514 -1474 -6251 -12783 -15003 -15195 -13892 -6776 -1677 -2202 -4496 -6356 -5340 30 6188
6003 6188 6302 2858 2378 2691 2321 3712 2965 1369 -993 -1566 -5775 -8390 -3876 -617 1079 -963
5987 -963 -2903 -3826 -6286 -2564 -1804 -5669 -5606 -4648 -4318 -1876 -1062 1206 -267 -2568 -3816 -4332 -525
5970 -525 2184 1134 1319 -452 690 -1180 -5523 -6680 -4405 -2593 -2541 -2769 -3002 -6653 -6268 -4132 -4422
5953 -4422 -4567 -2332 405 -779 -3172 -4048 -6089 -6460 -5344 -2872 -1034 1247 -2308 -1705 1865 2269
5937 2269 120 -1570 -3658 -1008 1345 -865 -2572 -2552 -2182 -1501 -1347 -1730 -1271 -349 770 1968 -334
5920 -334 -3014 -3699 -3252 -1564 42 -3126 -4575 -4863 -4593 -5597 -5822 -609 614 -1830 -2822 -4741 -2176
5903 -2176 3027 4423 655 -1016 -1348 3131 3594 670 -5047 -3957 -1570 -2093 -907 -992 -560 1428
5887 1428 3604 4207 2549 -1931 -5706 -3249 -1996 -773 -3487 -6593 -3952 -1872 -1525 -2500 -2284 -2009
5871 -2009 -3269 -1963 -740 -1838 -1716 -2673 -4495 -2792 -1510 -934 -1483 -3754 -1707 -95 -239 413
5855 413 -167 -4271 -7373 -8497 -6045 -3581 -2113 -3186 -5221 -7100 -8779 -7868 -6529 -3896 -4136 -4419
5839 -4419 -1263 2290 1830 2145 -435 -2723 -3739 -3097 -2587 -2518 213 1510 306 393 758 83 -440 385
5821 385 -1180 -3489 -3837 -3101 -2949 -2910 -3618 -1375 -2917 -3865 -2861 -1101 -872 -3727 -5253 -4400 -1631
5804 -1631 -984 -3293 -2113 -362 -45 -2186 -1879 -4374 -7912 -6790 -3589 -1863 -2519 -4351 -1961 2028
5788 2028 1672 2828 1362 2122 5326 4006 2648 2732 2774 1435 2510 3652 4843 3723 4041 3332 874
5771 874 -712 -1129 -969 487 -166 -2389 -2997 -4138 -6432 -4061 -3073 -5268 -8709 -8277 -5471 -4193 -1812
5754 -1812 2918 4627 4539 536 -713 2750 4231 4321 1322 -541 3141 4988 3133 340 1246 2496
5738 2496 1845 1863 -2075 -4487 -1159 258 1 -1695 -3802 -2265 -968 1098 -199 794 -1416 -1096
5722 -1096 1379 1948 -1264 -6935 -7386 -7768 -5704 -5040 -3715 -2882 -3626 -2081 2467 5278 2317 -2142
5706 -2142 -852 1316 -511 -3754 -1900 121 -1457 258 148 -3851 -4483 -479 1663 -529 -496 2286
5690 2286 1451 -121 -1424 1535 896 -1499 -1036 -864 -1344 -1788 -1936 -1600 1782 3542 3605 1015 -4143
5673 -4143 -7145 -4467 -4355 -6846 -5450 -5902 -4747 -3172 -2943 -2313 -846 -135 -2096 -1957 897 -884
5657 -884 -1934 -3607 -3728 -677 -1767 -1855 -1156 -445 -1597 -1119 -5501 -7890 -5826 -6127 -5983 -2042 -833
5640 -833 -3245 -2870 -2344 -3979 -4279 -924 1395 32 -81 930 1163 1349 671 -1763 -2195 2002 5556
5623 5556 2409 -1245 -4036 -4989 -2447 1794 2973 2484 435 64 518 212 647 -1716 -3104 -1493
5607 -1493 -61 -3965 -270 3499 1777 -1474 -1067 -1307 -587 679 81 179 -715 -2337 -4457 -3811 -1710
5590 -1710 -826 -398 -1554 -2784 -1466 1366 2143 4725 5048 1191 -418 364 -286 -1747 20 2444
5574 2444 1524 896 469 640 1396 480 -1940 -2814 -3124 1735 5636 2382 726 2112 2696 3270 3327 5038
5556 5038 4366 1115 -1946 -1912 -1176 -1375 -1977 -965 -706 -885 -1769 -2334 1005 158 -321 707 -3430 -5030
5538 -5030 -4389 -275 -2089 -4573 -5718 -6588 -5573 -4068 -4500 -3060 -3740 -2596 736 2901 43 -2534
5522 -2534 -3810 -4153 -5966 -5230 -1751 35 2400 908 -899 -2958 -3093 -3646 -4029 -3359 -2541 -4857 -3463
5505 -3463 -3519 -3871 -2491 -2436 -4656 -4798 -5272 -7555 -5502 -3962 782 5302 6123 5260 2112 62 7 -2962
5487 -2962 -4769 -6222 -4914 -3432 272 -1040 -3088 -2554 -1161 -2807 -531 451 -2621 -2768 318 2106
5471 2106 2307 893 4027 3502 854 -2783 -3594 -839 -52 -3 373 104 -1309 -3360 -942 1142 1576
5454 1576 1308 1054 -1135 -1726 -929 245 5098 6813 2233 -1593 -1849 -3189 -1960 -2164 1472 441
5438 441 1612 1318 476 1480 4310 4473 979 -3769 -2652 12 -773 1818 2397 2568 34 939 -2188
5421 -2188 -1863 3410 2268 -875 -3004 -4272 -1232 754 1403 1703 1921 502 -2162 -2400 -1974 85
5405 85 2366 3488 3823 3926 1819 -360 -3184 -6567 -2884 176 -1357 -1412 -1203 -1821 1123 5303 5000
5388 5000 3034 1873 509 -4434 -9538 -11016 -9313 -3271 1400 3352 1826 373 714 2588 3403
5373 3403 942 -162 1174 481 -127 1624 -1049 -4267 -3855 -2160 -4056 -2108 -1741 -708 3184 5816
5357 5816 4468 3605 775 1029 6941 6784 4383 3918 3666 3180 -2169 -3942 -4447 -2683 -710 2670 1919
5340 1919 -2196 -3457 -4955 -7978 -8593 -5115 -1231 -2905 -2718 -1664 -832 1033 1591 -622 -1062 -3940
5324 -3940 -6993 -5178 309 -248 -3435 -3934 -56 646 -1805 -1972 -1302 1343 1269 732 -42 1618 -153
5307 -153 -2382 -2391 -440 -1029 111 -1268 -4960 -5199 -2301 2107 278 -1136 -1283 264 1427 -991 101
5290 101 1051 2060 -58 -863 -1070 -3306 -3923 -4005 -4724 -3835 -2697 -1147 -1476 -3801 -5609 -3627 -1223
5273 -1223 1263 443 -3781 -4058 -1469 -1591 -2926 -5588 -4667 -4467 -5458 -5271 -5544 -5282 -3475 -853 -570
5256 -570 248 3343 3505 1122 -656 -655 -2045 -1216 -1948 -1291 242 -1224 -3972 -4820 -5373 -2215 172 5584
5238 5584 5351 2231 -782 -2134 -1247 845 3330 1653 -625 1586 2179 2196 -90 -1853 -1698 876
5222 876 3225 2010 196 -1480 -2534 -4158 -6293 -7416 -5222 -4162 -3806 -4063 -4652 -2803 -4938 -5970
5206 -5970 -4014 -96 2465 2649 84 131 -212 1007 1316 -356 -951 -386 -93 -1327 304 1176 1164 3116
5188 3116 4117 2765 2606 1226 -320 -1306 -1370 -1264 1605 1570 -2161 -400 2442 -1506 -3853 -1691 -1936
5171 -1936 -997 -96 -3778 -3500 -3516 -3890 -2050 -928 -2869 -4042 -4432 -2355 -1359 -3551 -4765 -802 -1371
5154 -1371 -6778 -7488 -7368 -4495 -2553 -2083 -1306 1816 1398 -825 -1374 -6373 -7230 -4369 -3843 -2280 -2078
5137 -2078 -2481 -239 1157 963 -384 -2241 -3776 -186 4321 1364 -1280 -3014 -5635 -7222 -7248 -7531
5121 -7531 -5342 -178 -661 -1464 1428 1801 -1654 -2308 -1467 -1602 1148 -907 -3455 -5961 -8653 -7976 -4476
5104 -4476 -581 833 -1165 1113 -385 -5190 -6284 -6296 -7310 -4529 -3050 -3587 -3113 -2192 -3551 -594
5088 -594 -459 -2788 -3797 -4931 -5274 -5058 -2693 -931 1258 629 -3031 -5717 -4268 -7068 -7234 -3277
5072 -3277 -2432 -4145 -4067 -2464 769 -229 -165 5870 5336 1891 -2714 319 2187 1495 -863 -2223 -1427
5055 -1427 -1385 -2335 -3310 -3888 -285 3900 3705 4095 4159 512 -2138 -2137 -2966 -3546 -4445 -4386 -1762 1385 2633
5036 2633 -6 -363 2098 2598 -307 -2652 -4432 -4912 -6807 -8912 -9565 -5596 -2599 -2606 -128 1240 -158
5019 -158 -1780 -2071 -2787 -1205 -5203 -3773 -3222 -2233 -889 -699 -1471 -5220 -7192 -2561 -705 -2207 2037
5002 2037 2027 -739 -621 -1607 357 -2557 -6788 -5996 -4330 -5044 -4376 -4555 -6176 -6257 -4722 -3965 -174 90
4984 90 -2818 -3284 -1812 -2754 -3429 -5541 -6642 -5972 -4155 -3497 -392 -643 -3280 -5727 -5089 -3661 -5965
4967 -5965 -4228 -1804 -1914 -3212 -298 -1840 -3627 -4203 -2526 -409 -137 -789 274 -1051 -354 1249
4951 1249 -850 -2147 -2597 -2052 2595 3398 902 -824 -1600 -3956 -3892 -3811 -3610 -3878 -6541 -5910 -5369 -3324
4933 -3324 -39 -2969 -4007 -4913 -5991 -2400 633 76 -1762 -2020 -2249 -4500 -4790 -349 1319 -1058
4917 -1058 -5054 -1955 3275 523 -2907 -2176 -3036 -2537 -1512 -4676 -2465 -3125 -6728 -4822 1250 2566
4901 2566 131 -3020 -5426 -2472 -541 645 86 -248 562 -438 -3467 -4368 -1609 -2177 -2941 -3694 -2125
4884 -2125 2174 4084 2483 2531 3074 1007 -399 -4706 -5353 -2723 -1037 -1882 -2404 698 3583 3317 1607
4867 1607 586 -2517 -5347 -6811 -6566 -3731 -69 327 -427 -3854 -7430 -7877 -2108 -53 -1936 -3680
4851 -3680 -5453 -5962 -3048 -4426 -4694 -5385 -5966 -6373 -4677 -645 2486 2324 -1668 200 2869 2264 734
4834 734 -2189 -977 -1200 -983 3888 4581 1496 2431 1744 2722 1039 -2067 -81 -2786 -3889 -717 -3020
4817 -3020 -2029 360 1080 389 504 -1256 -1318 311 2115 3439 3878 1919 2985 -170 -4274 -2997 -2634
4800 -2634 336 2618 -980 -720 -2336 -3354 -122 2669 1518 1672 337 -503 -767 -45 -111 -1205 -3012
4783 -3012 -3314 -2431 -1861 1704 -17 -636 4 -1722 -3997 -1736 917 1650 917 -762 -2620 -918 -1169
4766 -1169 -2721 -2891 -3993 -4185 -2599 -2798 -4217 -4296 -2536 -5352 -3423 33 1760 1895 -924 -2215
4750 -2215 -510 -283 2444 431 115 -1206 -3899 -4514 -5615 -8016 -7451 -5976 -3107 -1672 -1258 -4171
4734 -4171 -6273 -3348 -742 -576 -2385 -1621 -2989 -1750 250 -689 -3886 -2285 -1194 -1168 -2230 -1308
4718 -1308 -711 -378 -867 -602 2993 1383 -3501 -1092 -1900 -4370 -2157 -813 2161 2490 1881 246 1309
4701 1309 1796 839 -1906 -4448 -3119 -3544 -3756 -2696 -1390 482 -1165 -3983 -2357 -2984 -3501 -3553 -1250
4684 -1250 2348 -1919 -2908 422 842 318 415 952 -2096 38 782 21 -856 -1252 -141 -3759 -7118
4667 -7118 -5368 -1398 788 1202 -1127 -834 -1835 -264 -1558 -905 3399 6069 5540 5364 3311 2425
4651 2425 -41 1009 2100 1204 1493 2548 3310 2454 2499 2178 -168 471 2815 1647 1278 1703 1307 4101
4633 4101 4038 1 -2174 -1666 -1130 -378 -894 -724 -1988 -3050 -4467 -3749 -2811 -2504 -1032 -204 459 -844
4615 -844 -2229 -2601 -1346 2407 3759 -2333 -6150 -3236 249 -1703 -161 1085 -1427 -3136 -316
4600 -316 2815 1910 1650 3174 3406 2213 -242 -1127 -1787 -2196 627 2814 3579 1510 -2535 -1389 -185
4583 -185 -1165 -3568 -3235 1140 2554 1322 -1200 -3866 -7413 -6928 -5479 -4144 -1531 1077 1861 2588
4567 2588 1689 -35 -1223 1944 953 1209 1441 1756 2054 -40 -666 -335 -1120 -2297 -2019 -3754 -4307 -3072
4549 -3072 -2794 -607 3532 3346 1158 -778 -816 2024 2752 1356 2622 7 -2909 -4611 -1938 195
4533 195 665 2275 3519 2435 401 -884 -1489 -827 -2140 -2571 -2038 683 2053 1832 -462 -339 1915
4516 1915 1199 -472 -1032 -383 -2953 -1102 540 2019 3776 2156 334 -725 1227 1748 2571 2157
4500 2157 1425 -352 -1032 -1252 822 1051 128 1361 76 -1308 -1538 -1310 -834 1126 1842 471 1804
4483 1804 1447 -427 -1475 1207 853 -2076 -5224 -2859 -1776 -2823 1438 5954 6788 5786 1908 -1905
4467 -1905 -2892 -2003 -5216 -6773 -8066 -5144 -2952 -5821 -8315 -8513 -5916 -6028 -4312 -2037 329 1604
4451 1604 3646 3865 4623 732 -2728 -3228 -79 19 -3841 -2452 1304 665 863 -2540 -3580 218 1716
4434 1716 -805 1848 1595 1512 1068 2659 1288 -437 579 -847 -3120 -5633 -4000 1665 101 -2757
4418 -2757 -768 1655 891 1235 504 -4368 -4928 -3571 -1560 -1027 -3030 -3961 -1495 1321 2057 -594 -2432
4401 -2432 -5944 -8286 -9530 -4975 -4435 -5076 -2911 -2946 -990 -2264 -2253 -3233 -5134 -4537 -2814 -2833 -1802
4384 -1802 -3211 -4668 -1909 -1198 -3400 -3735 -1310 -2109 -3040 -1908 -1438 -3270 -3181 -2694 -2104 -1266 -1414 836
4366 836 1577 -2378 -6073 -6555 -4735 -4612 -3079 -1706 -3298 -3534 -1513 -1238 388 -431 1100 -1141 -1625
4349 -1625 720 1562 3265 2451 -1124 -2663 -1049 -1851 -3114 -3671 -3287 -406 -1920 -4241 -1729 -1248
4333 -1248 -2345 -1189 -1032 -3122 -2396 937 620 3847 5098 1350 -649 -1550 -3213 -2995 -2907 -3373 -2792
4316 -2792 -2125 -5570 -6251 -991 1646 1250 2323 2015 2003 -2063 -4170 -187 1846 -359 -763 -1866 592
4299 592 608 365 686 954 1538 126 2137 1032 -910 557 -3917 -4337 -4465 -4394 -1605 -1510 -845 -1140 -28
4280 -28 1203 517 1757 461 1197 1911 107 -585 -1393 -2004 -4216 -503 376 -392 391 3140 506 -2129
4262 -2129 -3125 -3386 -5086 -3549 -341 682 3087 6653 6726 4179 -411 -3926 -2099 -3694 -5529 -4233
4246 -4233 -5914 -5215 -2934 1511 -274 -3864 -3366 -4954 -6135 -5897 -6333 -6326 -2145 2563 3187 4869 5328
4229 5328 5833 4831 3078 755 -332 -568 270 104 -2001 -4297 -3319 -737 699 1592 536 -841
4213 -841 -3778 -5788 -4610 -2933 -457 2895 3754 521 -596 -3994 -5157 -4306 -2309 -438 1231 1274
4197 1274 -2324 -3927 -3141 -1962 -890 434 -1127 -4572 -5984 -4665 132 39 -1649 -2483 -3193 -1679
4181 -1679 688 -2938 -4594 -430 142 -2144 -5556 -5650 -4447 -1966 -2579 -344 1277 -828 -4251 -3460
4165 -3460 -2960 -3467 -2453 -2132 -897 -2958 -1882 1580 -125 -1366 -2257 -3015 -5758 -3929 -2726 -2421
4149 -2421 -1806 -2052 -620 115 873 612 2306 2310 1151 530 1067 1587 -342 -2378 -4965 -2452 1804 -3024
4131 -3024 -7250 -4005 129 1001 3043 2841 3533 2398 -224 3348 4154 1491 1956 1483 2187 -1102 -5246
4114 -5246 -6281 -4860 -5138 -2826 -3029 -4238 -5141 -5207 -4381 -3649 -8360 -8510 -6289 -7097 -6610 -4809 -1942
4097 -1942 -1730 -1723 -1118 -2028 -1694 903 863 -1984 -1857 -579 611 3650 1919 -969 -578 1097 -81 -2026
4079 -2026 -214 439 -865 -261 -1129 -407 1099 -3004 -4552 -4185 -3159 939 4529 3136 -1352 -3485
4063 -3485 -3284 -3397 -4280 -3809 -1749 -717 -2987 -1211 1902 950 988 -827 -1858 -3061 -250 988 -1146
4046 -1146 -601 -2695 -2122 -5473 -5703 -1924 3278 1599 256 -2179 1082 3065 -104 -838 -2310 -2240
4030 -2240 -1234 -1107 -319 2844 5527 4932 827 1191 -1027 -3633 -1303 -498 -4206 -5565 -6651 -4270
4014 -4270 -962 -71 -2401 -5380 -5950 -3989 -2960 -718 1503 960 6 474 3136 -217 -5878 -5007
3998 -5007 1291 494 -1019 -2009 -4795 -7406 -4963 -2938 -2669 -1996 -1252 -1075 -1852 -1456 -1213 -672 -422 -980
3980 -980 -2219 -3515 -4039 -2016 -163 974 417 1508 635 -1595 628 2838 1378 -834 -1515 -3
3964 -3 -88 -3098 -2313 -5658 -8748 -5291 -1282 -429 18 -1736 -3489 -4148 -2858 -4869 -7583 -7798 -4718
3947 -4718 -4030 -2133 -4198 -8178 -7664 -2362 289 2695 3578 3101 1584 1622 -2272 -2900 -1677 -3051 -1425
3930 -1425 -235 680 2036 4100 2575 -367 -662 -696 -1112 472 577 209 2162 2540 2748 1006 1881
3913 1881 2168 3995 5297 3513 1871 -1867 -1400 2464 2916 1502 25 206 778 -878 -2122 -1260
3897 -1260 1653 2602 3139 4113 3301 4142 4656 1882 563 -1153 -3552 -2663 -1932 338 707 -2167 -1931
3880 -1931 -2268 -36 824 -463 -3635 -6678 -5586 -2968 -2761 -2328 -445 -656 224 1749 4896 4989 2759
3863 2759 1786 2221 1435 599 2271 3421 3923 1890 719 194 1242 -627 -3747 -1510 1159 -392
3847 -392 -1552 162 -1274 -3138 -2743 312 3049 -4215 -6848 -6467 -5712 -4868 -5960 -5327 -3303 2541
3831 2541 3377 -2392 -6418 -5155 -3842 -1238 -2112 -3061 -3264 -1300 839 4137 5175 2423 568 3107
3815 3107 3634 2515 -811 -1229 -1472 -2193 -2416 104 187 -997 -3741 -4838 -3148 -4 -138 2394 3679
3798 3679 2769 -1423 -3112 -2535 345 -324 -3125 -1426 5081 5915 4633 6799 6134 4106 3185 5745
3782 5745 -433 -225 1514 1066 2012 398 817 3186 4866 5182 6223 3370 3339 2977 1551 2731 3765
3765 3765 1300 -1558 -623 377 -1027 -338 3304 2709 -478 -2350 233 546 36 77 143 -2830 -4768
3748 -4768 -2005 -2937 -4088 -6114 -5777 -3590 -1782 -162 3125 5558 3318 225 896 2365 1367 1543
3732 1543 -672 -3274 -3588 -4353 -354 -13 465 -2130 -4462 -4354 650 250 -1500 1345 -152 -4649
3716 -4649 -4686 156 1729 -511 -4030 -3315 -3104 -4721 -4996 -3061 -2373 -466 3263 5886 6806 4023 -97
3699 -97 -4140 -4429 -3458 -3421 -2611 -2012 121 -616 423 -630 -4014 -4507 -2008 -3246 -2122 -675 596
3682 596 3923 2351 2028 3517 4128 911 -1437 521 372 -2873 -3026 -1072 -2096 -4718 -6071 -6759
3666 -6759 -3929 -3418 -4198 -2092 -1872 -1211 624 1689 2090 -41 -215 2150 4493 5106 4494 951 -37
3649 -37 -2727 -1593 -3861 -3176 -3534 -1853 -1376 663 2817 2562 4464 2998 3818 2119 1023 1306 -60
3632 -60 -162 -2476 -1179 1679 3281 3005 -743 -936 -1012 2066 465 -1580 850 -693 -4078 -5212 -6407
3615 -6407 -2126 3029 2360 2216 2251 2187 -1043 -5307 -5005 -5361 -3254 -742 -1400 -3278 -5499 -3250 -691
3598 -691 -1959 -2140 -2778 -1103 -1576 -2434 -1993 -2774 -3143 -1115 -457 -2222 -3053 -359 1504 0 -817 -959
3580 -959 -2960 -3911 -2089 -3305 -731 1096 1335 797 3945 4498 2031 -12 -1020 -890 -1486 -76 -139
3563 -139 -509 1394 3097 1513 1782 940 2066 85 -1396 254 3659 3770 1981 950 -2332 -4402
3547 -4402 -2851 -1189 151 3758 6921 7776 5933 1108 -1100 -772 -2678 -2544 3478 2919 2849 2141 -1653
3530 -1653 -5461 -5694 -4027 1351 2013 -169 2223 4525 3201 1726 2290 -1261 -2500 -2227 -1378 -2744
3514 -2744 -2139 4231 5325 2748 464 -638 -2306 -3019 -2167 -765 2186 6351 3392 684 -1416 -59
3498 -59 736 843 -3617 -4468 -4260 -4803 -5111 -3319 -349 1305 1989 253 -4610 -4266 -570 538 -45 1034
3480 1034 -120 1352 -555 -190 -1705 2367 5571 2744 311 -2873 -2089 -1104 161 1392 1586 384
3464 384 -2322 -769 2994 789 1061 2542 4423 919 -1861 111 1618 3012 3032 -2401 -5708 -5065
3448 -5065 -1306 -773 122 -2059 -5270 -3180 -1198 176 2598 3015 1992 1952 501 138 986 -938 -2348
3431 -2348 1544 2218 1654 1066 441 1714 3904 6601 7315 4910 3065 2078 2131 1207 625 -2837 -2612 -722
3413 -722 2279 2540 -1899 -2402 -914 -2709 214 2616 2956 1238 -1000 -2105 -929 389 -638 -3591
3397 -3591 -5113 -2785 68 1453 -725 -1914 -397 -1465 -4268 -3065 -2283 -865 -675 -942 -1422 -3032
3381 -3032 -4868 -3758 -1554 -550 -2193 -1268 -1341 -627 -121 -1998 -2925 -4357 -6407 -4009 -839 -92 1508
3364 1508 -200 -926 797 2015 84 -4950 -4029 -1198 923 1997 3624 2318 1942 3847 3504 -2277
3348 -2277 -2300 -1287 -4002 -1909 373 -881 -662 1035 2788 3380 3459 2537 1276 284 -212 -86 776 681
3330 681 2010 765 -2536 -2173 1675 1622 -3086 -3950 -1205 -2703 -4248 -2555 -1366 -3042 -1553 -2627
3314 -2627 -3406 -1966 522 3637 1359 -1826 -3931 187 1859 419 -1650 -637 -848 -1282 -1870 -726
3298 -726 -896 -1741 -2764 -3531 -5270 -3206 -459 1094 -574 -1263 331 -2161 -3292 -3494 -2206 3
3282 3 2668 4286 2220 -12 -454 264 -1732 -3932 -3775 -1899 -723 -249 2873 4764 5749 1612 1768
3265 1768 2220 2871 659 -1813 1500 939 -83 -1573 -1838 -1663 -3477 -3083 -5051 -5290 -1762 -1467 -2519
3248 -2519 -3502 -4295 -1759 -453 510 1689 2541 2129 -578 1567 -1290 -2700 -714 -396 -2459 -5024
3232 -5024 -4169 -3388 62 187 -619 1127 -744 -2847 -2018 -3756 -2529 -3398 -5297 -3770 -2179 -548
3216 -548 3673 5960 8409 7891 3574 1210 223 -2250 -4225 -6930 -8025 -8936 -10343 -7445 -3451 -1036
3200 -1036 617 2106 2862 947 -121 -666 167 -956 -779 -454 -4314 -4475 -1484 -691 520 558 642 555
3182 555 1248 -2433 -2567 -2248 -2899 -6578 -7132 -3751 -983 719 1325 2254 1726 592 -2939 -4944 -3662
3165 -3662 -4471 -3289 -5154 -9146 -8454 -6129 -4458 -7216 -6711 -4193 -4275 -4728 -845 2756 1017 429 370
3148 370 -176 -994 3023 2585 2548 -361 188 4345 2020 167 -1166 1752 2397 1327 -874 -1245 -3413
3131 -3413 -2466 396 804 825 -1584 -2011 531 803 -488 -705 -100 2432 -1934 -4423 -4470 -3947 -3706 -4198
3113 -4198 -5608 -4131 -2559 -561 -644 -1246 -592 2605 2112 1178 -213 -2966 -334 559 1435 2769 2130
3096 2130 -1550 -4716 -2828 -3562 -3197 -1656 -3265 -1206 1079 1907 528 247 3204 3455 401 -652
3080 -652 -2933 -2647 -4485 -2880 -4818 -8425 -10275 -13282 -10972 -7036 -3128 -1907 -1160 2640 2290 2575
3064 2575 3181 3240 1604 1993 1730 -1736 -1586 -1539 -3436 -2552 -887 127 -1280 -2531 -2236 -2124 -5138 -6920
3046 -6920 -5195 -5572 -2623 -1441 -3374 -267 891 -947 -596 415 2182 4438 4407 2047 2337 1590
3030 1590 3440 2907 2356 395 -5397 -9104 -7539 -4057 -4890 -4563 -4130 -6279 -4758 -5446 -6778 -5997 -3625
3013 -3625 -493 -21 -860 -1418 -569 -906 1658 1319 1447 -702 -2078 -162 329 1562 1429 1146 -222
2996 -222 -856 -1780 -2210 -3584 -1527 515 3600 3730 410 -3038 -6157 -3349 -511 2298 1203 1982
2980 1982 1512 1017 -970 -1825 -1590 1592 1353 76 93 1643 3460 7343 6237 5154 6115 5318 -1265
2963 -1265 -5010 -2031 1484 4998 6755 4202 4242 3332 1312 -806 -41 -886 -2646 -3125 -936 -219 -3523
2946 -3523 -2816 1815 2894 -2272 -3552 -328 38 -2196 803 5612 4735 1318 -1698 -2478 -1701 -1401
2930 -1401 2469 2208 1320 2906 1674 406 -612 -3133 -3827 -5132 -4860 -2674 -3488 -4352 -5360 -2232
2914 -2232 3525 3962 3739 3106 1231 -1289 -820 -47 1200 -629 -2699 -4356 -6990 -622 3841 624
2898 624 -3904 -1493 -952 -342 2372 648 -2499 -3344 -3658 -3976 -2449 -3475 -1682 -625 1936 1798 1660
2881 1660 116 -2944 -3622 -263 2081 1180 4357 3152 2138 2194 1089 -2375 -3659 -4633 -3611 -4113
2865 -4113 -5591 -5922 -2484 -647 533 1191 4063 1445 -2335 -1424 -130 322 92 -219 -2154 -1856 -1971
2848 -1971 -4805 -5806 -3824 -4349 -4501 -5773 -1359 1025 -224 -147 -502 9 4197 3963 4268 2679 -494
2831 -494 -681 1215 -988 -5205 -5978 -4549 531 4222 1620 1567 2541 868 2235 3998 3962 1171 83
2814 83 1357 113 -1318 -1462 1319 2680 1538 983 119 511 -1549 -4208 -4445 -2631 -969 2539 431
2797 431 -3359 -4718 -4269 -3307 -163 3577 4710 2728 980 -1327 -3130 -1735 -361 878 1503 1634
2781 1634 2841 2544 -258 413 1316 1926 5341 5000 2006 3530 3448 2862 2490 2531 6029 5934 3775 2248
2763 2248 1395 -1550 -1752 -4234 -3615 -564 540 987 3482 4495 5780 3331 674 -3866 -6129 -1863
2747 -1863 -1829 -4351 -762 1690 897 1112 -1981 1698 1842 1816 2242 2553 866 1029 963 598 -2133 -3957
2729 -3957 -2825 -1326 -1800 -2926 -1542 -359 -83 -553 685 -402 -2041 -1486 -990 -577 -2814 -4037
2713 -4037 -6711 -7419 -6019 -1667 -1912 -1564 -1282 2009 1273 757 -68 2221 -2018 -2917 -2950 10 2164
2696 2164 4625 5376 3097 1023 3769 4220 4760 6406 3349 3126 3065 1418 -3140 -2656 -858 -1133 -498
2679 -498 -2101 -6402 -4875 -4451 -2051 -4187 -4870 -8349 -12000 -10236 -4773 -1524 2632 3298 5135 8814
2663 8814 7742 5191 4229 3283 2727 2881 3607 1542 -1827 -3906 -3743 -4267 -3984 -4948 -3918 -1796 -2625
2646 -2625 -2207 205 -1283 -783 2499 2884 2484 1294 934 2253 3081 2234 1960 1991 3266 2226 -1408
2629 -1408 -5746 -5010 -5737 -7272 -10328 -10444 -7687 -4904 -5498 -4954 -2099 3337 5798 3882 3644 6203
2613 6203 4026 3892 3278 3362 7195 6947 4954 6163 6386 6713 8134 3535 3488 2161 -2922 -2503 -2671 -3399
2595 -3399 534 521 -2281 -2492 -998 440 -661 -3552 -4413 -3626 -1421 -752 944 2644 -129 -1122 -1101
2578 -1101 75 28 546 3830 5208 4238 4567 -1716 -4930 -5620 -1648 -1922 -1522 325 3388 4037 5116
2561 5116 6314 6578 5964 6038 6774 5291 5173 3384 453 -3054 -3295 -1531 -2150 -1397 -1109 1114 2070 1101
2543 1101 -4045 -6273 -5974 -1845 803 1260 358 -451 -447 -180 -790 -4208 -2969 -1778 -3581 -2562 -454
2526 -454 515 3725 3000 870 -384 -5550 -4660 -4015 -4778 -4212 -510 2452 1476 -516 -1397 -1826 643
2509 643 819 2477 4022 4290 3174 1813 -304 -2257 -1114 1089 1627 2577 -637 -3020 -1936 -1238
2493 -1238 -1603 -1566 965 2888 2269 2672 3984 5646 6820 809 -3112 -1282 -2027 -423 2291 100
2477 100 -1036 164 -618 107 -469 -1011 -1412 -1367 -1380 -1297 -1625 798 116 -494 1301 -1455 -2718 -260 10
2458 10 -2249 -3863 -2398 -4260 -3439 -962 -2512 -1298 -2508 -1496 -2898 -3165 2935 5980 4277 2758
2442 2758 5054 8158 5890 2140 2162 1700 1782 147 -766 -2009 1527 2719 3769 -1216 -3063 -1908
2426 -1908 933 2758 2814 2748 1680 1414 2342 5064 4470 7450 8322 6511 7105 6062 883 -625 -2922
2409 -2922 -1704 3418 6407 4262 1346 1209 4011 1954 334 525 975 -671 -269 -711 -790 1654 743
2392 743 -1164 316 412 2405 1893 623 2008 1017 2648 4182 5599 2643 787 -1739 -2880 -1818
2376 -1818 -376 -909 1146 5792 4968 1165 -3832 -3348 593 3529 3454 -305 -1763 -1851 -2960 -1564 -1204
2359 -1204 -2676 -3239 -1324 287 1231 1247 1978 2562 3612 3983 4193 279 -743 651 1374 956 3142
2342 3142 3612 4877 7070 6903 5192 2062 794 3401 484 -2182 1719 2018 2485 5738 6735 4494
2326 4494 4586 5077 4677 198 1500 -460 -1143 905 1808 1790 -1534 -3339 -1043 1470 2172 1497 1479 2995
2308 2995 3465 4996 6022 3803 4876 4721 5664 5052 4724 3124 39 -566 2275 5725 2228 -2241
2292 -2241 -855 1791 2724 271 469 3900 4332 4716 6359 1920 -389 2335 497 1475 3243 3361
2276 3361 4137 4158 3216 3633 458 238 1961 3756 4205 1911 697 148 3738 6687 6092 2095 -1589
2259 -1589 -3510 -3780 -4254 -7951 -6708 -2409 -1559 1767 2686 6143 8435 6904 4183 1063 58 -1608
2243 -1608 551 -2285 -4709 -2492 -255 -294 -1964 -2849 -2160 -898 311 1573 3846 5462 4369 5108
2227 5108 2722 327 -4144 -6105 -4409 -1731 881 -634 -927 3778 5457 6080 3549 6143 5606 1854
2211 1854 -1471 -1403 -147 480 391 -386 -3088 -3799 -2637 -2468 2106 3161 3899 2557 499 -1106 -3330
2194 -3330 -1758 -3453 -5393 -1870 7 5648 5864 2546 781 2303 4315 878 -1202 -144 1733
2179 1733 -1012 -2574 -2876 -1136 -209 -1704 -1081 -4370 -3456 -3522 -4401 -1627 -1002 -3531 -4410 -4210 40
2162 40 4042 5547 5426 2404 -8 -2654 -3068 1856 2898 -576 -1846 -1823 -804 -3325 -5191 -2511
2146 -2511 -657 1633 2752 1212 2836 1498 417 2325 1140 3307 2750 -1078 -4658 -5366 -1744
2131 -1744 -32 -2037 -4500 -6378 -6799 -3941 2819 3245 826 -2124 -4028 -2554 -1132 1822 3915
2116 3915 3540 -499 -4 1776 2842 -14 -305 1523 1719 2828 2826 3779 3678 5153 8618 5662 659
2099 659 636 994 -67 1293 4591 4399 3772 1667 -2038 -3096 -1689 -2719 298 1606 2702 2370 1347
2082 1347 656 1245 -1266 -1492 99 -219 1362 3185 1541 2558 2601 1191 3418 4625 4144 4508 4367
2065 4367 3056 -21 -1018 3496 4721 4852 3586 2168 1543 1356 281 4239 6901 6024 5343 3420
2049 3420 679 2010 4274 1746 698 -1157 -2646 -2041 -2396 -5278 -4569 -5181 -6783 -7622 -4882 -2874
2033 -2874 -2519 -1668 1353 5821 6621 6319 3746 3550 1428 2138 4593 3561 2265 497 -1017 299
2017 299 242 -553 -2725 -4407 -2374 -3197 -5345 -5231 -1785 920 1071 3466 1110 -910 2120 2474 -1014
2000 -1014 -2920 -4567 -4933 -4904 -4834 -4573 -1038 56 568 362 -889 -3031 -2521 1171 989 -2602 -5704
1983 -5704 -5338 -3972 -1479 1992 918 938 908 -200 -1468 -3162 -4532 -4290 -2401 -3070 -2580 -1128 2344
1966 2344 3477 1393 2592 2930 480 1825 4147 3604 6144 5938 6108 3856 4437 4349 1735 -1225 -969
1949 -969 1406 -253 -2160 -3317 -2199 -1781 -1413 2289 3192 4910 2452 3056 2768 3192 771 -871 -1526
1932 -1526 -872 -2350 -952 1347 -60 -852 675 554 -1873 -3584 -2716 6 34 1313 3948 1657
1916 1657 4942 2783 -965 -1506 -2463 424 3370 5706 5244 3051 59 -2340 -2840 -4531 -5720 -3778
1900 -3778 136 -39 -2460 -3294 -4107 -3657 -6601 -5015 -7623 -6370 -1878 -569 -1592 2041 5188 4755
1884 4755 2850 1381 3067 2247 2685 1262 2694 3932 4744 4565 1744 -1279 -3604 -4297 -4778 -3703
1868 -3703 -2279 -4903 -2645 -2084 -919 330 31 -470 1565 116 -677 -1033 591 1470 3742 4734 5687
1851 5687 4100 2250 1761 -464 1978 2011 -1137 -2961 -1724 2334 3388 1669 -1289 -1342 -28 -475
1835 -475 -35 2152 2059 276 2841 224 934 3384 5414 6940 3330 790 -2361 -6309 -5145 -2848
1819 -2848 -3760 -2270 -1373 946 1092 -1972 -2133 1571 7053 5349 10 2247 1795 1214 1871 617 1020
1802 1020 -653 -2710 -1964 -1196 -932 2884 4360 3418 1213 149 -2470 -1356 391 5534 3881 1449
1786 1449 3561 460 598 190 -1437 1978 3980 568 -1476 -960 -447 -1337 -3507 -9236 -9335 -5707 -1611
1769 -1611 339 2995 4813 4841 7565 7453 7080 6030 2203 1651 3884 3892 1948 1969 1964 6305 7379 8475
1751 8475 5980 1637 181 -2706 -1628 2277 2232 2185 1197 -2592 -3074 -1336 1217 2522 5595 5084 7579
1734 7579 7723 7624 5079 509 171 1515 1186 1831 -1159 -7553 -7345 -6086 -5518 -4506 -278 -2583 -1996
1717 -1996 2167 -260 1486 1505 -1021 -2358 -2749 -564 1509 3391 3637 4086 -52 -3105 -4597 -602
1701 -602 662 -136 -3408 -3926 -2254 -220 586 2547 4049 4673 3551 1372 817 435 709 2238 1726
1684 1726 1193 1435 2740 1542 1556 5087 5241 4415 5413 4883 975 -1695 801 2150 2016 -525 -1357
1667 -1357 297 1264 -40 -168 1013 2766 3150 4776 4267 3515 3884 2403 1852 3078 89 -1373 -424
1650 -424 52 1795 3394 3571 1718 3677 4961 3942 2307 -1047 -2665 -834 1035 1817 1924 6278
1634 6278 3414 1461 1299 594 2524 1490 3685 5661 4865 2006 101 -1428 -674 622 -1439 -3675
1618 -3675 -5627 -7271 -3117 -2065 -2805 -1788 2066 2469 1232 -317 3381 5944 7261 9155 5890
1603 5890 1461 -2986 -4113 -4897 -4052 135 3925 7689 4391 4995 4152 2317 3194 3938 4439 4961 3674
1586 3674 980 1592 2951 3662 4172 1338 -952 -1658 -1991 890 3287 -523 -297 3534 1563 -1082
1570 -1082 2683 5458 7569 5404 1969 464 635 1681 3702 3153 867 -18 -1012 -709 1887 281
1554 281 -1186 -3603 -6127 -7696 -6302 -4466 -732 292 -2713 -2639 -640 211 -1076 -1435 -2889 1152
1538 1152 6038 7519 5195 3279 2495 -1433 -698 2160 4629 6573 3400 -166 1536 3673 4340 2753
1522 2753 2622 2656 -215 -1763 -2391 -929 -4347 -6713 -4627 -2283 -175 -199 -1351 356 6371 7995
1506 7995 6287 4282 2927 3865 1962 406 209 2200 189 -927 2459 972 686 556 -391 -1479
1490 -1479 87 1833 -229 -1104 115 2347 646 -2641 -3285 103 1979 -420 -986 -1745 -1109 -3928
1474 -3928 -5700 -2378 1228 1533 605 -809 -3490 -5292 -5154 -1213 -1558 -3769 -4727 -4969 -4824 -3203 -3694
1457 -3694 -5021 -3655 -631 -44 1937 2225 1938 -736 582 1398 1567 1811 1317 794 1930 -249 2382
1440 2382 1843 4010 4761 1411 367 -4591 -8997 -5648 -2515 -2629 -174 1190 -120 -1338 2378 2612
1424 2612 -901 -2932 -3312 729 1887 409 -508 -2370 -3021 -1324 -1207 -1419 2286 2876 206 -1132
1408 -1132 -964 -1368 -2735 -672 3653 3674 1716 4399 3022 637 209 2862 3601 270 -1047 -270 -1372
1391 -1372 -3870 -4482 -3039 -717 -2055 -399 1186 -2661 -4217 -4510 -5616 -1599 2238 2080 2864 3409
1375 3409 1852 4482 5883 5941 2915 829 -1252 -556 -144 -1752 -1732 294 732 165 2456 4629 5260
1358 5260 2899 -328 813 3651 6928 6208 4981 1950 242 375 -597 -1468 -895 298 2329 4910
1342 4910 6327 2392 397 1764 4529 3808 1907 952 1426 3832 6114 3348 1162 -2431 -2629 -2924
1326 -2924 -2631 -732 371 593 -511 -93 1543 1027 1139 191 -1240 -1106 -559 -870 -2599 -3223 -2495 1949
1308 1949 3830 3873 1477 607 1527 2021 4680 5717 4998 4353 2163 1437 868 91 3210 2643 2457 4305
1290 4305 2605 2085 -219 -333 420 189 1711 3536 1913 1282 1984 2686 5241 3397 527 -2049 -1562
1273 -1562 1105 -2599 -1892 726 788 2713 2996 -57 35 -1545 -680 2152 5499 3879 -581 -443 692
1256 692 1786 -295 -1799 468 4528 2163 -1210 -1642 -701 -3220 -2689 2002 1917 -2264 -4625 -582
1240 -582 5492 5742 4807 4905 4569 1657 1280 1372 997 2105 3933 3362 -1185 -3720 -4034 -1278 -854 2826
1222 2826 2872 935 -985 -3783 -6398 -2759 2848 4507 7538 7011 4674 1853 532 686 1845 2552
1206 2552 3332 6054 6444 2739 -739 -2832 -4151 -5656 -6204 -4365 -3296 1178 2356 5855 3568 542
1190 542 1648 2598 1467 -632 925 2744 3032 5921 8461 7417 3593 723 195 2691 2100 4468
1174 4468 7348 4628 1 -2732 -762 161 746 3254 847 -1901 -5591 -6086 -4196 250 2712 3025
1158 3025 2763 949 2528 4177 3985 1833 1057 -515 2306 1503 -1974 -1761 -4116 -2097 -61 -536
1142 -536 903 2260 2835 4674 6389 5666 5335 4188 3986 3784 -280 -1833 -153 2715 2432 -2951 -3789
1125 -3789 -1163 1793 175 -1632 -674 -1276 -2355 -1689 -286 2733 3695 5785 8145 9410 8158 4759
1109 4759 2729 1730 3756 4076 3785 4307 5093 2457 1647 2117 -451 -972 981 3125 3979 3068 2436 2637
1091 2637 67 -1560 -659 390 -38 -1336 1995 4812 4652 1596 2871 5541 7710 6842 3697 4111
1075 4111 1098 -2429 -4567 -3070 -443 -567 -2116 -1623 -1861 -2405 -3348 -3664 1703 3355 2097 -1780
1059 -1780 -1234 -2458 -2056 -98 3962 5677 1924 -3173 -6661 -4093 -2735 -3340 -2544 -123 -773 2195
1043 2195 -1257 -1975 986 21 -1428 -1364 -3237 -1836 -93 36 -505 -11 3493 1420 2055 2989 1432
1026 1432 -103 -1237 -3176 -3887 -1489 -1615 -2732 -2344 -2027 -1795 -3244 -4032 -3046 -1751 -1012 -1733 -577
1009 -577 -2711 -5722 -8868 -9604 -7023 -3792 -1966 -1333 -1527 193 2737 4314 4179 3533 538 -1878
993 -1878 -1625 1729 1715 767 3889 6524 4134 2730 3429 2001 1561 695 -138 193 -657 1484 5746 7117
975 7117 6044 2891 367 -2382 -963 327 -536 -2607 -3091 -4403 -3269 -55 1128 -2456 43 1409
959 1409 1973 -852 -2260 261 -3136 -6472 -4334 -1037 -1701 -2732 292 3375 1119 1763 2368 3247
943 3247 3740 1981 457 1399 2623 2894 -222 494 1107 773 4632 3823 581 925 4645 3237 1811
926 1811 -1029 -573 726 2291 1358 2134 1133 -2972 -3452 -1116 2070 448 -1785 -3366 -2640 166
910 166 1430 -1396 2759 2665 1719 3755 4046 1188 4035 6684 6839 9583 11807 10671 10399 7597 3394
893 3394 4040 3701 1428 -308 2062 2428 3763 3014 1454 1937 2305 4327 6034 5356 4044 2779 6422
876 6422 9276 7695 2807 1152 -878 140 745 477 -1533 -714 1334 -6 -1596 585 1566 1162
860 1162 1138 -141 2101 4598 5927 3336 1253 -811 -325 2114 2578 2683 1680 272 -310 2451 260
843 260 1868 3562 1085 1612 1277 2400 760 1248 2055 3308 -480 -197 45 125 331 115 2105 837
825 837 -1070 71 443 1594 3868 3528 850 -337 -3244 -2925 -1516 -2006 -1702 1485 2200 -41 2697
808 2697 3162 5532 6005 5560 4410 1011 966 -760 -3119 -1112 3415 4187 3349 1281 761 1131 3224
791 3224 3248 2208 2987 4824 5899 3959 3516 5640 7039 6742 5429 5626 7206 5831 4683 3098 4726
774 4726 3966 2157 2150 5821 7503 8099 6451 1931 213 73 1030 773 -1881 -2996 -3400 -3480 -1077 194
756 194 637 2105 1518 1199 -116 -3989 -5404 -604 3820 3000 3173 3677 5566 3196 -125 -4118 -3853
739 -3853 -1754 1728 30 -316 -2142 -1752 -2568 -2859 -2850 291 37 -2332 -333 1300 2551 5958 4315
722 4315 4434 4341 3571 927 2732 5254 6516 3030 -2568 -548 2092 3525 4089 3673 2543 432 -3319
705 -3319 -2842 -539 3166 7456 2304 -3492 -4510 -4948 -1600 -481 -1230 908 3019 5249 4379 2093
689 2093 3679 3494 4005 5372 5806 3478 1209 -2453 -1545 -802 -1594 -3615 -7807 -2584 4098 3915 6411
672 6411 6744 2046 814 4024 5337 5007 3555 1759 3770 6495 6303 6336 2887 3987 7473 8596
656 8596 8529 3496 -473 2428 2307 1738 3927 3237 3247 1455 -535 -1028 569 -479 -376 1564 -1402
639 -1402 -2043 -4019 -5681 -6265 -2268 3740 6043 3310 1668 4841 5176 5850 4308 -184 -2077 383
623 383 4829 6866 7125 4633 3210 3135 2223 3351 3360 2635 -1851 -3681 -1298 5026 5375 2294 2329 4731
605 4731 1962 -898 -2063 81 3748 4063 3120 2789 2623 3526 2994 3075 2110 521 -358 2547 4028 3322
587 3322 3937 6559 5616 4252 2645 -260 -4152 -4680 -2475 -787 1075 2369 1926 1832 2222 2846 2416
570 2416 3915 4000 3152 4461 4914 2873 434 -1174 467 3983 4282 3515 2640 2007 3145 2432 772
553 772 1731 2853 2242 2781 4753 6129 4252 2196 135 -1772 -3412 593 1295 1572 2047 2609 1871
536 1871 3213 3211 6148 8513 8055 4887 481 -4881 -5547 -3165 -3038 -3051 -1819 712 3920 4918 6391
519 6391 4474 4253 3238 4768 2664 -376 -747 -947 -3601 -3943 231 1039 2615 4437 3931 3707 -395
502 -395 -1529 -285 1413 3180 6500 5389 6608 5844 6088 3916 4066 4319 5674 4706 5107 3381 1909
485 1909 1298 838 5096 4657 1605 -1143 -3397 -1523 -1561 -1526 -642 678 -127 475 1110 -81 94 -790
467 -790 -727 336 3171 2997 4537 4695 525 -306 -1492 -1054 2256 4982 5601 4621 3111 -1156 -943 2130
449 2130 3827 2814 4053 3700 2238 748 -1935 404 5400 4938 2539 1284 4443 7198 5664 3710
433 3710 4917 4089 4643 2593 1478 2111 2838 -458 -639 628 475 -935 27 36 -2609 -2323 -2256 330
415 330 -30 -969 -1593 461 1550 -160 816 5626 3071 1729 -257 -1064 -468 1320 3329 4534 3314
398 3314 -956 -1051 2752 2363 -355 595 901 143 96 2676 3311 1103 1992 -1571 -4500 -4902 -2339 1243
380 1243 1524 1239 -1332 -1372 -2062 -710 101 -730 -275 2765 4206 3458 2256 3697 3845 2604 3003 2676
362 2676 4985 4912 466 -68 1517 2690 1752 1412 2903 1305 2421 1654 1521 1202 1448 2561 3526 3807
344 3807 3415 4121 4623 5459 2590 4510 7727 3738 2325 2854 1796 895 -1212 -4788 -2399 -117 1448
327 1448 4146 4891 3513 5031 7527 5847 3179 4051 5637 6699 5898 6841 5002 2026 5563 4855
311 4855 1891 -1311 -1058 3032 4723 2604 3999 6872 6268 1934 -1033 -4862 -3264 789 3829 2861
295 2861 1289 -232 753 1303 1761 1261 3037 4709 1223 2041 3199 1689 1210 1994 1741 -669 -2201
278 -2201 -1866 2600 2011 279 2695 4940 6240 5700 4756 897 563 3617 6242 3808 3137 2240 2395
261 2395 3520 5093 2621 3241 5259 5034 6256 7307 3913 -251 877 1191 1852 1715 466 126 2249
244 2249 4457 2267 3616 5373 3763 78 -1972 -2177 68 2512 2748 4035 4616 262 -1114 105
228 105 82 1099 2459 1823 -34 123 -343 -1128 -1617 1099 2892 960 -1076 -1221 -1258 -1515 -114 -643
210 -643 -778 1203 3009 1544 1407 1486 4959 6210 2067 1670 2135 1954 4372 6669 3711 1865 3859
193 3859 5383 5723 5927 4705 6784 7390 3828 664 4244 7449 6508 5503 5851 6038 5401 6617 3998
176 3998 167 -1878 -3425 -3186 -743 1534 1898 1065 2098 882 758 -160 775 -1160 1124 2120 5937
159 5937 6125 2250 2557 2758 3504 1875 334 774 2112 1865 2111 4037 4794 4880 5066 4184 3343 3709 52
140 52 749 2834 4725 3195 2520 3402 4702 4867 3019 4 -1081 1011 1424 2692 2428 2534 795
123 795 2421 4674 3347 1077 1221 3236 2983 2340 1345 456 -470 141 1021 2887 3387 2429 1106 1462
105 1462 -2001 -1847 -1881 843 3037 3974 6403 5422 1349 327 624 -740 1396 2257 1910 1889 2392 2025
87 2025 3262 -61 -1135 -1307 -530 -667 -1795 -36 -1247 -929 -1132 -53 2161 1524 -1481 -1872 36
70 36 -847 -315 2999 3543 653 960 1391 173 1708 3381 4157 4279 4085 3601 -377 -2160 -1401 717
52 717 818 1685 1694 1459 906 1632 36 849 3292 5290 6510 5311 5457 5230 4043 3095 3031 3921 5824
33 5824 5357 5604 5866 2359 -1632 -1466 2676 3918 2715 1587 3282 2839 3308 4681 5094 6155 3322
16 3322 2046 5345 4953 2882 2056 1792 3451 2219 -1360 -861 896 2575 4059 3356 541 416
0D16
$$ Imaginary data points
##PAGE= N=2
##DATA TABLE= (X++(I..I)), XYDATA
32767 55511 54693 53039 54275 55114 54641 55255 57527 58317 60853 58145 57194 58803 56479 57751 61859 59342
32751 59342 57625 57839 60803 63453 63162 61017 60064 61901 61563 62178 60663 61632 63142 63505 66064 66416
32735 66416 64696 65117 67487 67009 66527 67585 68866 67594 66729 68011 71651 72898 72172 72700 73522 72437
32719 72437 71965 73033 73077 74398 73915 73842 75144 75821 76321 79355 82311 79890 79062 77573 76328 77084 78781
32702 78781 80426 80902 79214 80736 81343 82233 84683 84566 84350 80850 78076 77567 78293 80003 83169 83839
32686 83839 85369 87526 90823 91583 92803 93091 93209 93962 92411 93150 91142 88110 89095 90999 91831 92429
32670 92429 93086 92831 94048 94677 95686 93355 91262 90806 90587 92181 96330 98775 97179 96345 96483 97977
32654 97977 99109 100073 103218 102333 99167 99676 100025 100541 100088 99935 99624 101465 101653 99632 97470 101090 103750
32637 103750 106036 108511 109411 107686 106570 106256 106373 107997 108999 111050 111871 109279 106663 108004 110551
32622 110551 110113 108731 110649 113876 114568 112437 112353 112540 113415 113083 114852 113422 111809 114068 115991 115312
32606 115312 113556 115541 119156 120414 118881 118238 118777 120620 122133 123488 120900 121407 121247 122355 123656
32591 123656 125596 125135 126383 126960 126054 126295 127031 126267 127919 130066 128013 127210 127366 126702 126559 123803 124135
32574 124135 126100 127510 129566 127953 128239 128109 129742 132446 133234 135525 136846 136239 135907 136549 135470 131645
32558 131645 133237 133606 131410 129278 131743 133060 135269 135394 137152 138777 139425 139295 139605 139398 136876 137026
32542 137026 136638 137001 138685 138683 135334 135436 136950 137226 139076 140276 139272 138483 137278 134727 135550 136162 139434
32525 139434 139911 139439 141616 143974 144072 146505 145937 144544 143700 145429 146305 143090 141050 140405 145502 149403
32509 149403 150049 149153 149832 147515 145313 148102 151247 152107 152414 152769 152448 149513 150679 151475 150572 149439
32493 149439 151207 150224 151061 150808 152617 153253 150762 150160 151932 153412 157774 156529 157210 159091 158709 157840
32477 157840 156189 154820 153761 155389 156192 158396 157035 158378 158733 162073 164759 164071 161562 160900 161246
32462 161246 156397 155319 153935 155464 155800 156690 159952 161180 160911 160111 162169 164049 162768 160190 160214 164743
32446 164743 166410 164359 165286 162520 157705 159262 161943 161067 160956 160174 160405 161877 161525 164447 168264 170440
32430 170440 170495 169435 167663 167072 167959 170594 169098 168224 164813 160391 160582 161870 162986 161924 162567 168244
32414 168244 169504 170034 169106 169629 172138 174758 177306 180204 180634 179711 177337 176605 175167 175115 173596 171875
32398 171875 174433 176050 175012 174381 176022 177847 176798 174311 175785 178332 176230 174818 176486 177985
32384 177985 177525 175069 173811 176053 172950 171082 170066 172090 172365 174074 179265 179267 175274 172931 170047
32369 170047 170565 174981 176049 175520 176009 176656 178768 179433 178677 177621 177581 178295 177442 175432 175116 174556 175836
32352 175836 177837 178083 177857 178930 179615 178846 176869 177529 177580 176712 178526 178727 178100 177961 177472 176823 177287 176324
32334 176324 175351 174213 176320 176995 176664 175601 179098 182851 183969 181829 179731 180742 180332 180837 180285 177907
32318 177907 173776 174866 178041 178118 180182 181823 182325 179618 177201 176495 175946 177957 183082 183908 180818 181979
32302 181979 183976 181839 180997 179369 179345 180958 181178 182173 183479 183756 180990 179494 181305 183830 185912 188339
32286 188339 186456 184361 185624 185431 184762 184633 182771 182205 182271 180413 179463 178849 179947 183858 187967 192354
32270 192354 192182 195686 193405 190563 187957 188467 188756 188078 190105 189842 186235 185313 185103 183951 182656 181846
32254 181846 185158 187786 187836 186808 189151 188368 189980 190282 189403 191159 185904 184319 182889 182994 186921 186452
32238 186452 186801 182554 181180 184390 188258 188375 187003 187597 191410 193138 193644 192006 192495 191909 191246 191734
32222 191734 192901 190805 189940 191424 190329 193156 193974 192908 191098 191428 189144 187270 187677 188677 185735
32207 185735 184985 186582 190057 190563 189818 188174 186968 186187 186121 189093 191658 190691 187947 188164 188558 185786
32191 185786 186799 190137 192139 189066 186735 188824 189947 186568 187819 188301 189560 189305 190159 189794 189864 190494
32175 190494 191852 190866 191417 189506 189962 192707 191653 190788 192230 192841 190449 187097 188815 191550 192220 189430
32159 189430 187676 187657 191056 190925 191550 194095 192138 190498 188766 186627 187035 189212 190540 192633 193044 193368
32143 193368 190772 190416 190589 194003 198440 200324 196533 195081 195208 194115 192991 191074 190161 192993 195369
32128 195369 192191 188737 186651 185703 189472 190484 193061 190227 188943 191637 191428 191654 193551 196854 198194
32113 198194 196883 194743 192824 194444 196640 196437 193332 193319 192637 191238 188657 188153 191120 192601 192351 193851
32097 193851 194109 195986 196667 198232 201765 201468 200237 200872 200949 197667 191982 190470 189895 192688 191178 189537
32081 189537 190025 189765 193907 194405 195036 192108 190918 192372 194032 197498 195527 190872 186627 186135 185642 189413
32065 189413 193161 195989 194753 194821 193346 196154 195151 191555 193176 193807 192308 191491 193632 194985 197588
32050 197588 198173 197066 196511 191752 188845 190288 189752 189986 192831 193287 196569 198311 194468 195098 196110 195676
32034 195676 198177 202415 203640 200139 198855 194970 193375 194500 195159 192520 191200 191209 188184 190596 195078
32019 195078 195802 195754 195689 193756 192686 194516 195077 193418 195453 197166 197545 197363 195936 195843 193627 192895 192767
32002 192767 195607 196467 195997 194504 194808 193016 194223 196703 201051 199188 194437 191527 192140 194112 195818
31987 195818 196958 196459 195308 192708 192513 193603 194580 195349 197383 195362 190954 192903 191624 192661 193072
31972 193072 192494 191947 190083 190963 192986 196935 198859 199452 198522 199017 197872 198425 194296 192412 196907 198624
31956 198624 196095 194076 196605 195948 192242 191703 190699 194636 199711 197872 194736 198279 198921 197786 198466
31941 198466 196278 194697 193542 196896 195744 193115 194466 193084 191211 191088 193459 194806 196020 195856 196972
31926 196972 197613 199794 199063 197925 197966 196544 194004 192811 196471 198182 195685 194524 193274 193363 195351 196621
31910 196621 196951 196480 196386 196007 195618 196124 193872 190802 192744 194757 194010 192220 192779 195399 195787 194065 194877
31893 194877 194247 196904 194597 191828 193576 194134 192706 193378 195052 195859 197277 199963 199417 199849 200774 200889
31877 200889 203221 204229 202567 200969 199303 199337 200494 201104 199359 197649 195134 193706 194901 197618 197635
31862 197635 199302 200142 199838 198762 197341 196016 197595 198455 197265 195463 196321 195724 192639 194020 194781 196015
31846 196015 199239 201440 201307 199317 200342 199619 199740 198221 196773 194936 195613 197632 195600 193094 195414
31831 195414 197924 199340 198141 194409 194682 195822 198030 197874 197139 197227 200435 199876 197224 198019 199570 202202
31815 202202 200861 198473 198854 202729 203191 199245 198111 197977 198799 199079 199411 198793 195189 196859 199090 198420
31799 198420 197708 199245 199184 200973 198241 198944 199510 201936 200851 198389 199029 200582 201858 201127 200255 198355
31783 198355 200157 197980 196562 196734 197812 200467 199351 200422 200478 197649 197621 200302 199540 198669 200567 204931
31767 204931 204244 200125 195311 194808 198371 199471 199094 198205 194815 195531 195963 193380 191608 190898 195468 201644
31751 201644 203800 201281 201023 198404 199813 201546 204715 205318 201043 198908 199837 198848 196992 194246 195491
31736 195491 198732 199100 198422 200497 202216 200345 198273 195452 194050 196208 198339 201795 201724 202603 203829
31721 203829 204184 200467 196842 197658 195751 196153 192931 193493 200644 204226 202889 199655 194715 191016 193662
31706 193662 196685 197686 196111 200057 202381 200075 197526 197820 197148 197480 198899 198350 198563 201981 202562 201440
31690 201440 199478 198045 199235 199335 197141 196916 198903 202585 203439 206008 202788 198876 196943 196409 202894
31675 202894 203691 201383 200043 200270 201888 203139 205618 205276 204178 203953 204928 205321 202341 200812 199949 198186
31659 198186 198062 200067 201238 200936 199945 199986 201424 203020 202210 200182 202624 204668 203050 199739 198457 197495
31643 197495 197113 197966 200926 202445 201971 201743 199861 198257 200221 199172 196232 197638 200549 197261 194470
31628 194470 198431 202151 201043 200587 204136 205215 206010 205720 203299 200927 200475 203349 207115 206223 200542
31613 200542 196874 196602 194443 195527 198087 195920 198013 203061 203842 199798 198683 198152 197585 199497 203879
31598 203879 205975 206168 203009 197692 195514 198049 201453 202579 200740 197263 199390 199068 196229 196181 197072
31583 197072 195587 193755 199355 203046 200945 203251 210159 210325 206942 203691 201385 202313 203466 203401 203833
31568 203833 205828 205390 206180 206070 204401 203451 203653 203045 200621 201048 200527 202275 202955 201582 199664 198727 202843
31551 202843 202664 199853 198221 198954 199326 196674 196604 198247 196383 194898 196604 198495 201958 203116 205715
31536 205715 203661 202133 203988 206783 205321 204650 203955 200427 198247 200456 201331 200981 199731 199527 199859 200565
31520 200565 203629 203756 203532 203857 204068 203682 205490 204536 200143 199624 200062 201235 201301 199902 197665 194941 193361
31503 193361 197192 199703 199978 198246 199651 198719 198606 197550 195431 197635 199420 195667 193769 194459 197634
31488 197634 198284 199822 205990 207840 205186 200701 199837 198172 196826 200362 204775 204634 201088 203981 206146
31473 206146 205709 206816 207581 205915 203951 204577 203350 199950 197847 200823 204220 204793 202487 200564 199378
31458 199378 199878 202296 203409 205196 206402 204951 203231 203649 204954 205781 206512 205907 206537 204757 204144 205073
31442 205073 205654 203990 199142 199474 201222 202759 201275 200846 203180 202498 205044 206237 208220 206706 202401
31427 202401 201364 203031 204058 202460 200408 200895 203924 206251 207752 206174 205564 205064 208855 210714 210816
31412 210816 207866 204992 205066 205160 203917 201337 198216 201637 200494 201955 199846 199690 201308 200234 199261 200766
31396 200766 206011 207882 203608 202020 206071 207978 205224 203474 205781 205449 205346 203765 199400 198003 199248
31381 199248 200919 201803 202496 201315 202655 204029 202106 199457 202825 206142 207152 206397 204504 201762 200456
31366 200456 199568 201979 206147 207530 204769 203958 205308 205966 204705 202764 204012 204611 202927 201852 204463
31351 204463 206701 208838 206305 203660 203585 204626 208474 207428 203742 200726 202682 203864 205561 206665 207619
31336 207619 203692 202931 204503 207144 208590 206374 203088 203471 205379 204387 205347 205671 207390 208210 209526 209285
31320 209285 210093 207426 204398 203348 203506 202276 201941 200513 200859 202712 202513 201408 204280 205435 206527
31305 206527 206566 204447 202457 204614 203776 203453 201941 201804 203357 205441 203811 204542 208081 204715 200571 200380
31289 200380 203761 207195 205523 202555 203571 205752 203451 203561 205148 206462 205371 202843 201092 201063 202897
31274 202897 202826 203390 205123 208625 212863 212915 208613 205655 204251 206510 207932 204197 203444 208204 212209 209803
31258 209803 207536 206698 204901 205474 209722 212134 207112 202133 203494 205911 206312 204186 202301 202195 201108
31243 201108 201317 196854 197662 201390 203143 200612 201361 200777 200379 203199 204933 203386 204402 207438 208814
31228 208814 208234 204472 203474 205450 204249 204175 204841 208207 211312 205887 205563 206844 204955 202785 201337 203652
31212 203652 204136 203587 203337 205699 206088 204699 207501 209136 208949 210527 211529 208594 206911 205289 205728 203430
31196 203430 202959 205552 206060 202859 202535 204392 203422 205551 208870 207933 208571 209674 209249 206812 206399 207913
31180 207913 206395 204762 205034 205825 205729 203676 201178 200773 203683 206829 205677 205447 204171 202579 204677 205440
31164 205440 203896 205056 204997 204886 210189 211817 206523 205433 209917 210793 212115 209522 206479 205777 204993 206632
31148 206632 208626 209668 210532 207461 208484 208854 207009 208812 208940 206567 205898 206578 208360 207053 204486
31133 204486 200704 201540 205403 206408 208211 209682 210761 209949 209004 209783 207187 206506 208483 209222 209030 210803
31117 210803 209986 207251 207434 208688 208216 206039 204514 205588 210310 211425 209008 208083 207289 205839 207165
31102 207165 208852 208752 205230 205035 204542 204153 201932 202284 205531 204581 202962 203045 204183 208093 209531 208474
31086 208474 208681 206540 205386 206529 205234 205649 205511 205761 203720 203883 206612 208945 211742 209127 207892
31071 207892 204484 204753 206660 205006 205855 203462 203637 201206 201882 202177 201917 204339 207494 205586 203433 201932
$$ [...]
##END NTUPLES=NMR SPECTRUM
##END=
