##TITLE=Analysis number 310508
Compound Code ac 29286
Project Code adrs
Chemist Name st petersburg
##JCAMPDX= 6.0         $$ Bruker NMR JCAMP-DX V2.0
##DATA TYPE= NMR SPECTRUM
##DATA CLASS= NTUPLES
##ORIGIN= Bruker BioSpin GmbH
##OWNER= NMR
$$ XWIN-NMR		Version 3.5
$$ Thu Jun 23 09:12:42 2005 GMT Daylight Time (UT+1h)  MAYBRIDGE\NMR@NMR_250MHZ
##.OBSERVE FREQUENCY= 250.131544655141
##.OBSERVE NUCLEUS= ^1H
##.ACQUISITION MODE= SIMULTANEOUS (DQD)
##.ACQUISITION SCHEME= undefined
##.AVERAGES= 16
##.DIGITISER RES= 18
##SPECTROMETER/DATA SYSTEM= dpx250
##.PULSE SEQUENCE= zg30
##.SOLVENT NAME= CDCl3
##.SHIFT REFERENCE= (INTERNAL, CDCl3, 0, 16.522)
##AUDIT TRAIL= $$ (NUMBER, WHEN, WHO, WHERE, WHAT)
$$ ##TITLE= Audit trail, XWIN-NMR		Version 3.5
$$ ##JCAMPDX= 5.01
$$ ##ORIGIN= Bruker BioSpin GmbH
$$ ##OWNER= NMR
$$ C:\u/data/dgb/nmr/ADRS/4550/pdata/1/auditp.txt
$$ ##AUDIT TRAIL=  $$ (NUMBER, WHEN, WHO, WHERE, WHAT)
(   1,<2005-06-23 09:12:21.69 +100>,<MAYBRIDGE\NMR>,<NMR_250MHZ>,
      <created by zg, POWCHK disabled, PULCHK disabled
       configuration hash MD5:
       62 19 C7 07 E1 42 D1 B7 37 6C 3D D0 77 39 F9 E6
       data hash MD5: 64K
       10 C4 15 63 0F 58 83 6A 49 77 C0 EA 89 12 AC 23>)
(   2,<2005-06-23 09:12:34.02 +100>,<MAYBRIDGE\NMR>,<NMR_250MHZ>,
      <Start of raw data processing
       ef LB = 0.3 FT_mod = 6 PKNL = 1 SI = 32K 
       data hash MD5: 32K
       69 EF 32 8A 80 3A 21 C6 9D C3 8A C8 D7 40 3A 29>)
(   3,<2005-06-23 09:12:35.83 +100>,<MAYBRIDGE\NMR>,<NMR_250MHZ>,
      <apk 
       data hash MD5: 32K
       32 01 72 EA AA DF 46 B0 75 28 45 49 3B 69 12 3C>)
(   4,<2005-06-23 09:12:36.54 +100>,<MAYBRIDGE\NMR>,<NMR_250MHZ>,
      <abs ABSG = 5 
       data hash MD5: 32K
       03 5B 48 0A 70 A1 45 9C EA 1F 60 57 57 50 86 EF>)
$$ ##END=
$$ 
$$ hash MD5
$$ E4 66 97 43 34 63 BF 72 31 33 02 F6 A9 84 08 8C
##$RELAX= 
##$RELAX= 
##$RELAX= 
##$RELAX= 
##$RELAX= 
##$RELAX= 
##$RELAX= 
$$ Bruker specific parameters
$$ --------------------------
##$DU= <C:\u>
##$EXPNO= 4550
##$NAME= <ADRS>
##$PROCNO= 1
##$TYPE= <nmr>
##$USER= <dgb>
##$AMP= (0..31)
100 100 100 100 100 100 100 100 100 100 100 100 100 100 100 100 100 100 
100 100 100 100 100 100 100 100 100 100 100 100 100 100 
##$AQSEQ= 0
##$AQ_mod= 3
##$AUNM= <au_zg>
##$AUTOPOS= <54 >
##$BF1= 250.13
##$BF2= 250.13
##$BF3= 250.13
##$BF4= 250.13
##$BF5= 500.13
##$BF6= 500.13
##$BF7= 500.13
##$BF8= 500.13
##$BYTORDA= 1
##$CFDGTYP= 0
##$CFRGTYP= 5
##$CHEMSTR= <none>
##$CNST= (0..31)
1 1 145 1 1 1 1 1 1 1 1 1 1 1 1 1 1 1 1 1 1 1 1 1 1 1 1 1 1 1 1 1 
##$CPDPRG= <>
##$CPDPRG1= <>
##$CPDPRG2= <>
##$CPDPRG3= <>
##$CPDPRG4= <mlev>
##$CPDPRG5= <mlev>
##$CPDPRG6= <mlev>
##$CPDPRG7= <mlev>
##$CPDPRG8= <mlev>
##$CPDPRGB= <>
##$CPDPRGT= <>
##$D= (0..31)
0 1 0 0 0 0 0 0 0 0.06 0 0 0 0 0 0 0.0002 0 0 0 0 0 0 0 0 0 0 0 0 0 0 
0 
##$DATE= 1119514340
##$DBL= (0..7)
120 120 120 120 120 120 120 120 
##$DBP= (0..7)
150 150 150 150 150 150 150 150 
##$DBP07= 0
##$DBPNAM0= <>
##$DBPNAM1= <>
##$DBPNAM2= <>
$$ [...]
##$SUBNAM7= <"">
##$SUBNAM8= <"">
##$SUBNAM9= <"">
##$SW= 20.6930455092707
##$SWIBOX= (0..15)
0 0 3 0 0 0 0 0 0 0 0 0 0 0 0 0 
##$SW_h= 5175.983436853
##$TD= 65536
##$TD0= 1
##$TE= 295.16
##$TE2= 300
##$TE3= 300
##$TEG= 300
##$TL= (0..7)
0 120 120 120 120 120 120 120 
##$TP= (0..7)
150 150 150 150 150 150 150 150 
##$TP07= 0
##$TPNAME0= <>
##$TPNAME1= <>
##$TPNAME2= <>
##$TPNAME3= <>
##$TPNAME4= <>
##$TPNAME5= <>
##$TPNAME6= <>
##$TPNAME7= <>
##$TPOAL= (0..7)
0.5 0.5 0.5 0.5 0.5 0.5 0.5 0.5 
##$TPOFFS= (0..7)
0 0 0 0 0 0 0 0 
##$TUNHIN= 0
##$TUNHOUT= 0
##$TUNXOUT= 0
##$USERA1= <user>
##$USERA2= <user>
##$USERA3= <user>
##$USERA4= <user>
##$USERA5= <user>
##$V9= 5
##$VALIST= <valist>
##$VCLIST= <CCCCCCCCCCCCCCC>
##$VD= 0
##$VDLIST= <DDDDDDDDDDDDDDD>
##$VPLIST= <PPPPPPPPPPPPPPP>
##$VTLIST= <TTTTTTTTTTTTTTT>
##$WBST= 1024
##$WBSW= 4
##$XGAIN= (0..3)
0 0 0 0 
##$XL= 0
##$YL= 0
##$YMAX_a= 271722
##$YMIN_a= -580573
##$ZGOPTNS= <>
##$ZL1= 120
##$ZL2= 120
##$ZL3= 120
##$ZL4= 120
##$ABSF1= 16.522
##$ABSF2= -4.171173
##$ABSG= 5
##$ABSL= 3
##$ALPHA= 0
##$AQORDER= 0
##$ASSFAC= 0
##$ASSFACI= 0
##$ASSFACX= 0
##$ASSWID= 0
##$AUNMP= <proc_1d>
##$AZFE= 0.1
##$AZFW= 0.1
##$BCFW= 0
##$BC_mod= 0
##$BYTORDP= 0
##$COROFFS= 0
##$CY= 12.5
##$DATMOD= 1
##$DC= 0
##$DFILT= <>
##$DTYPP= 0
##$F1P= 14.0000005364418
##$F2P= -0.99999901652339
##$FCOR= 0.5
##$FTSIZE= 32768
##$FT_mod= 6
##$GAMMA= 0
##$GB= 0
##$INTBC= 1
##$INTSCL= 1
##$ISEN= 128
##$LB= 0.3
##$LEV0= 0
##$LPBIN= 0
##$MAXI= 10000
##$MC2= 0
##$MEAN= 0
##$ME_mod= 0
##$MI= 0
##$NCOEF= 0
##$NC_proc= -5
##$NLEV= 6
##$NOISF1= 0
##$NOISF2= 0
##$NSP= 0
##$NTH_PI= 0
##$NZP= 0
##$OFFSET= 16.522
##$PC= 1
##$PHC0= -82.71072
##$PHC1= 14.48698
##$PH_mod= 1
##$PKNL= yes
##$PPARMOD= 0
##$PSCAL= 4
##$PSIGN= 0
##$REVERSE= no
##$SF= 250.13
##$SI= 32768
##$SIGF1= 0
##$SIGF2= 0
##$SINO= 400
##$SIOLD= 32768
##$SREGLST= <1H.CDCl3>
##$SSB= 0
##$STSI= 32768
##$STSR= 0
##$SW_p= 5175.98343685301
##$SYMM= 0
##$S_DEV= 0
##$TDeff= 65536
##$TDoff= 0
##$TI= <Analysis number 999999
Compound Code 99
Book Reference 9
Project Code 9>
##$TILT= no
##$TM1= 0
##$TM2= 0
##$TOPLEV= 0
##$USERP1= <user>
##$USERP2= <user>
##$USERP3= <user>
##$USERP4= <user>
##$USERP5= <user>
##$WDW= 1
##$XDIM= 32768
##$YMAX_p= 366865523
##$YMIN_p= -421789
$$ End of Bruker specific parameters
$$ ---------------------------------
##NTUPLES= NMR SPECTRUM
##VAR_NAME=  FREQUENCY,     SPECTRUM/REAL,   SPECTRUM/IMAG
##SYMBOL=    X,             R,               I
##VAR_TYPE=  INDEPENDENT,   DEPENDENT,       DEPENDENT
##VAR_FORM=  AFFN,          ASDF,            ASDF
##VAR_DIM=   32768,         32768,           32768
##UNITS=     HZ,            ARBITRARY UNITS, ARBITRARY UNITS
##FACTOR=    0.157963299565203, 1,           1
##FIRST=     4132.6476996994, 0,             0
##LAST=      -1043.33573715361, 0,           0
##MIN=       -1043.33573715361, -421789,     0
##MAX=       4132.6476996994, 366865523,     0
$$ Real data points
##PAGE= N=1
##DATA TABLE= (X++(R..R)), XYDATA
$$ [...]
17787 -53091 -17729 20272 63036 48927 27593 -35221 -106270 -162934 -106954 -71059 -81967 -77552
17775 -77552 -88033 -121552 -105853 -145798 -168079 -151536 -165488 -118416 43972 105498 127254
17764 127254 102949 25199 -24608 21218 90121 145991 136822 14609 -1615 51217 51152 12212
17752 12212 27263 171637 281382 174866 -47345 -145397 -128474 27575 122217 100913 -28601
17741 -28601 -14771 36781 -56849 -113481 -10580 107077 113379 185251 134553 3906 -35479
17730 -35479 -72733 -65057 -70405 -45321 -24660 60582 133201 250969 295491 125467 31413 -44447
17718 -44447 9087 18919 35583 12663 -27291 -58133 -108255 -68679 -3304 72104 -39802 -77356
17706 -77356 32461 28029 -117570 -49454 -33590 -91498 -128102 -128914 -128632 -88657 -67391 -26347
17694 -26347 59986 140019 50646 -22288 -104776 -99171 -16917 -43466 -56832 -87914 -143319 -101655
17682 -101655 -124480 -62822 -85353 -274485 -335514 -275198 -208864 -101938 -30665 -6138 -12904
17671 -12904 28978 42855 18227 59125 94074 30155 -3744 9193 72186 80661 -6750 -60911
17659 -60911 -129630 -98744 -133118 -148595 -67910 17446 82688 2583 -77548 -77434 -25262 -58246
17647 -58246 -158294 -218940 -207541 -103270 48447 33007 69981 138053 97100 -31886 -66619
17636 -66619 -24207 55792 122478 118556 16550 45009 119367 162557 186102 161429 56459
17625 56459 -67054 -68223 -29180 -140069 -125473 -120349 -183009 -159621 -132743 -142448 -228918 -226518
17613 -226518 -141132 -138081 -255597 -218530 -128853 -123045 -18235 67239 -4221 -131574 -250397
17602 -250397 -197420 -157412 -139911 -135337 -145527 -29417 -37851 -38144 -93839 -81443 -75224 -1076
17590 -1076 26448 -25887 65992 29009 25806 33111 68045 132250 159695 200999 145680 41960
17578 41960 -16053 -93211 -142050 -70038 -25216 -2777 -1279 -7198 80147 89410 103053 160743
17566 160743 148109 140187 111610 -44013 -49920 30400 168987 213956 184032 9905 -60987
17555 -60987 23042 17993 -44298 -75438 -74222 -88583 -122691 -129777 37650 103747 6830 -123434
17543 -123434 39975 117151 66472 14164 -21779 -126948 -52049 -1532 -7113 -27639 -101107
17532 -101107 -132705 -79619 -52198 -28450 -82387 -81902 8738 103072 220142 153547 98057 49235
17520 49235 -6432 -17314 15116 37283 95681 40897 34436 128496 4646 -103515 23792
17509 23792 116679 170303 130221 67548 -126933 -208567 -119467 72781 152404 78601 7893
17498 7893 -46310 -7363 34954 111244 44148 119926 138082 39794 84898 98135 -9337 -97121
17486 -97121 -100274 -96861 -169625 -50499 73570 76242 40160 -54893 -42919 -91004 -52126 -9324
17474 -9324 12393 15654 -2721 -47374 -159360 -46318 133963 126743 167132 194189 221434 207967
17462 207967 124306 123314 125535 133080 138758 212521 205805 92910 71806 109034 179314 140672
17450 140672 197487 229688 249013 317973 371317 341972 366145 493875 553702 643212 664087
17439 664087 557422 461651 281339 46455 9535 2748 96508 -16306 9295 -12834 -74279
17428 -74279 -138602 -162388 -194745 -158469 -156244 -104150 95122 246666 324201 166823 81017
17417 81017 97339 61985 25199 -34643 74961 171898 192519 175516 215849 171142 19151
17406 19151 31353 -45775 7130 56082 84992 42493 64370 48202 191801 217257 136044
17395 136044 10735 -46237 -17596 -56262 -152115 -81814 10123 -92966 -147402 -91086 7909
17384 7909 26942 22861 -66627 -24822 104597 151815 157966 115202 39536 56666 43475 -43216
17372 -43216 -103983 -41878 51902 21482 -65196 -118947 -74856 -41309 -14836 -4378 -13386 -159966
17360 -159966 -137177 -64042 24581 -17017 -182700 -328768 -247041 -71956 -20733 -48985 -98685
17349 -98685 -153122 -148698 -64516 -59879 -93805 -18034 -15372 -129610 -64675 25382 101823 53595
17337 53595 -52888 32177 66860 56079 17607 -43388 -64017 -82669 -46128 4565 -21855
17326 -21855 -46183 71649 138643 86532 239926 312560 193426 28426 -86473 -87220 -73107
17315 -73107 -69632 28615 28771 -141150 -197984 -181825 -156004 -130787 -41323 -71279 -131453 -89834
17303 -89834 -16957 22005 -17913 -52755 -74512 -68734 -95790 -77851 -20910 -25460 -18405 -13646
17291 -13646 65851 -20672 -51441 -38131 -27316 19084 130166 153653 90228 -17296 -79059
17280 -79059 -136189 -126649 -129007 -159306 -214152 -165604 -64725 -112334 -25480 -16583 13389 -16835
17268 -16835 -204 -45473 -91769 -62055 28790 107558 141063 166298 157918 13559 37623 151049
17256 151049 42398 26584 -12644 -92269 10379 37050 59695 90169 65221 -11347 -102283
17245 -102283 -137228 -111207 -45374 -28645 -6602 -28184 -124174 -97423 -26536 18257 45864
17234 45864 -17335 -5506 -45832 -60570 -84778 -76804 -69532 -82251 -15189 9031 34832 4686
17222 4686 61192 119914 143722 99156 28159 -124358 -63279 85575 6120 -147223 -83775
17211 -83775 51137 6510 -58687 67983 162879 132626 45968 -47824 -3661 -4054 -73270 4302
17199 4302 28886 33089 -74182 -185706 -195759 -146039 -186741 -177531 34201 115551 21377 13654
17187 13654 102046 98701 297 62550 116394 112434 8188 -24694 3625 -6871 -9601 -39032
17175 -39032 -44946 -99235 -52218 -27871 -86860 -117178 -35555 -51029 -88474 -148707 -264966 -219141
17163 -219141 -214182 -207334 -129803 -84255 -138961 -70210 -47290 -122815 -193825 -255413 -274691 -130574
17151 -130574 -96251 45274 79255 -15600 -64872 -8503 -21223 11438 49324 -5961 -17707
17140 -17707 8084 70672 1505 2392 109965 191448 303229 212872 162405 77063 103164 156789
17128 156789 172970 123362 26446 -8919 -140651 -91951 -53757 -113988 -87098 -201181 -243345
17117 -243345 -223019 -147161 -44881 62481 9470 -39916 -44077 -85063 55682 15863 2149
17106 2149 74309 98793 121604 108365 73565 44507 -8510 24649 -27203 -121162 -81752 -55260
17094 -55260 -124427 -56508 -118600 -19202 88491 -10997 -30357 -108618 -135208 -38251 60361
17083 60361 98930 60991 17081 23364 10993 22958 68374 102879 91897 165054 189307 206302
17071 206302 185035 119384 72747 129075 123391 111677 131233 -66401 -147609 -20451 -55400
17060 -55400 -90512 -143617 -153817 -176952 -112716 -116978 -108295 -105488 4942 56901 9008 9620
17048 9620 39008 -5484 -73645 -41713 -11521 13220 -46003 -18565 15770 95246 127487 132074
17036 132074 14033 13425 -72912 -69976 -109938 -117140 -50142 29885 86182 141817 27708 -6890
17024 -6890 44974 30243 77333 45832 140906 99533 49734 33195 20327 52583 59806 -2730
17012 -2730 -81040 -59958 -70525 -71543 -14425 607 -15187 -73658 -89717 -23538 57786 34102
17000 34102 -96163 -163010 -87109 -19187 -86530 -185637 -220897 -143032 -60977 32644 133966
16989 133966 -9640 -140343 -85897 40508 78150 42326 18071 32147 -51907 -62604 -38011
16978 -38011 44502 -43111 -164904 -105755 -158143 -162735 -52556 57305 58322 -40390 -52809
16967 -52809 -19968 -27337 -41274 -52966 -67338 163 41415 -13085 72537 38241 34406 111361
16955 111361 82681 111623 117446 32772 46239 86914 134205 68299 82366 55506 38116 134142
16943 134142 139992 158715 253859 214873 244032 252017 177297 95423 12865 -9861 2281 -30277
16931 -30277 -104117 -24106 51661 14446 -64569 -48824 -11702 -20224 43518 192112 194359 125557
16919 125557 89432 36128 -1125 -4753 82179 118515 139058 138346 147726 126015 93020 103191
16907 103191 110701 67782 -149475 -218222 -88009 69555 139042 125495 57156 15671 85079
16896 85079 86552 161303 76037 -10436 -10635 -44152 31194 37402 142923 189435 202288 153574
16884 153574 136986 166283 63492 1652 74421 93104 103921 231313 282589 264119 165713
16873 165713 29696 -3288 68665 31128 43396 98507 97768 90729 56161 4206 34504 93085
16861 93085 106248 116021 221088 231607 162387 183840 216280 94442 9438 5214 6713 -29610
16849 -29610 -111267 -116295 -51016 -17533 61726 59261 -14613 -1490 38579 60778 23881 29077
16837 29077 67446 98743 71194 65359 -1390 -35980 -57539 -42439 -77863 -70639 -62116 -28490
16825 -28490 69238 123729 138345 139364 70502 -12548 -23549 -41425 -23447 -84770 8878 129847
16813 129847 100194 23265 68361 92058 23308 -30156 35192 58371 78652 98754 112128
16802 112128 75340 83838 -3731 -32032 70953 86002 38779 46916 103832 93521 134499 145442
16790 145442 108503 -10697 -163461 -133682 32036 28777 -51288 -57788 -144313 -41779 56208
16779 56208 -55328 -58788 50046 49979 53065 109521 113475 103867 78523 61080 59775 78551 38445
16766 38445 59190 35672 3158 -37574 -25483 103373 109486 58993 152071 110049 59297 89103
16754 89103 107496 71278 23776 97422 29797 -16259 -102098 -126905 -54098 111074 246489
16743 246489 224951 92496 -46481 -51241 -55176 49320 130317 154980 125575 228782 191208
16732 191208 121812 60472 61044 70344 113634 56248 84614 80401 53956 2044 3354 -34879
16720 -34879 -131577 -73033 132480 251848 188193 170477 177615 140533 151965 145484 48248 68337
16708 68337 134455 84393 27600 9213 20990 52070 64811 28986 25257 81951 175593 226665
16696 226665 213969 204933 159708 144947 117614 85548 350 -54425 -38414 48939 40106 -13783
16684 -13783 45525 15452 63040 103173 1036 -62274 -60020 -108662 -24960 89311 107249
16673 107249 72018 94312 46851 63164 96689 168326 164209 86707 -61464 -121433 -105629
16662 -105629 -22594 112762 33788 143782 157020 35397 -5217 41153 4113 -77615 -120065
16651 -120065 -108352 -65945 46641 104149 55959 125565 63785 -28878 -4758 48463 96203
16640 96203 56726 78843 99113 126918 34102 24834 -17849 13061 72718 -77673 15161 5570
16628 5570 -15495 14615 22446 68471 97386 133211 112502 103818 175136 300263 327762 258182
16616 258182 159555 31659 -27295 -94325 -65526 -37767 38124 217727 173276 103511 131195
16605 131195 193072 100684 8635 -4224 -3173 -12216 1708 9542 31433 9001 96478 124291
16593 124291 143876 42372 67510 144819 203513 234336 232154 154441 140891 191169 167558
16582 167558 139514 142352 217777 181339 131185 115992 178235 203996 142397 26952 21080 64699
16570 64699 159230 171713 236857 259291 263334 328989 245886 102903 56770 113972 126757 120476
16558 120476 39459 86720 89447 27628 47317 95207 -29751 -69051 -44902 -3571 -91938
16547 -91938 -74235 2899 -54745 -53869 49875 62260 111585 180964 205533 256698 270541 195712
16535 195712 85220 21627 96631 139414 168409 149054 78906 19510 -139989 -120504 -13095
16524 -13095 35653 -82513 -69601 -73756 -20586 95235 154577 90179 41492 67253 173932
16513 173932 207343 164631 101252 115571 105233 61789 -22593 -75780 -139668 -164828 -58239
16502 -58239 -27487 94817 249525 273806 253775 179713 83602 6181 8017 47258 125189
16491 125189 94440 56817 131187 255847 307244 294123 144798 78892 98627 48372 17439
16480 17439 -35274 -97969 -100061 -77041 -3306 -30247 -40193 147900 138335 2107 61239 18993
16468 18993 -57015 102550 116390 156262 236213 169124 -31984 -140412 -141647 -47897 62647
16457 62647 141679 78485 86913 30319 38968 168573 213992 134002 235528 246792 231373 299020
16445 299020 255980 178869 288366 334170 211192 163536 142026 156038 213051 215551 228020
16434 228020 173610 85074 234768 342447 259121 282572 225020 179355 202117 183750 200240
16423 200240 242176 204585 77382 63765 84812 204247 319481 281788 321997 303096 176504
16412 176504 75990 135164 298349 370015 301659 209723 164338 196470 254396 235574 282113
16401 282113 265734 228031 60846 14719 83921 109071 163120 174866 228842 246596 301913
16390 301913 284124 234111 105941 56457 110124 157322 157310 213569 152386 163937 123217 84109
16378 84109 95080 89393 203867 223034 183933 241382 253264 154531 111900 127874 147574 20845
16366 20845 39717 60297 97892 180227 320349 358558 339900 248125 226545 194215 191718 176309
16354 176309 198941 262240 134027 138755 152537 179251 184961 166022 134179 153339 232160 233670
16342 233670 197264 75014 28514 -905 9267 65241 130247 252753 295850 294799 263188
16331 263188 260762 326011 365822 308069 252067 175672 184438 177502 221859 316488 342447 334962
16319 334962 308274 226502 171285 386802 511661 341810 263622 370048 329600 292372 341488
16308 341488 350044 190433 118898 133322 95604 215174 307317 370408 372947 336043 340806 336216
16296 336216 314482 329567 329245 308803 331813 261213 194094 132102 172325 227653 264683 298004
16284 298004 339477 319219 377546 332289 332471 271497 148568 142505 141117 115144 190856 126613
16272 126613 170498 286247 355104 396906 384328 307904 212263 119293 171958 312017 415641
16261 415641 447256 467451 421698 333358 319526 370703 321068 213753 262546 238875 202178
16250 202178 156566 199905 212178 253009 358783 356169 385786 378830 313690 350666 473189
16239 473189 476459 411960 314177 256200 265670 204874 209573 237392 277714 424397 365670 329922
16227 329922 300807 305488 354995 426834 438810 437807 357528 366119 429156 465711 490142 436073
16215 436073 412172 454135 501418 402491 306270 347450 328056 329121 334051 359066 324952 163072
16203 163072 103209 38626 -35436 151101 213480 218898 263235 220401 325861 383312 361273
16192 361273 343946 375116 462335 557430 595227 614201 567164 585332 503310 437341 501602
16181 501602 504310 499596 498689 548419 495235 448544 476204 442845 363926 443896 451351 415568
16169 415568 426002 475796 472066 459534 412373 425831 442459 372816 337947 322622 393853 400539
16157 400539 458692 437224 274846 227846 318810 488344 513554 492791 514562 481113 501836
16146 501836 454827 459735 380049 397584 560217 602956 570645 575783 523256 491791 478015 452074
16134 452074 439069 379712 447311 521490 558954 498797 469949 516893 480475 448188 443476 525634
16122 525634 520058 535907 668792 602353 507871 564488 536324 458302 436414 339145 393571
16111 393571 481764 493485 540117 613585 580118 550905 577690 562531 585202 489622 487783 538968
16099 538968 498138 526785 461155 434220 510280 582797 564999 583118 674120 590883 775319
16088 775319 828156 730061 669930 627236 604629 585088 602264 713887 733629 713501 712863 701898
16076 701898 763557 782534 703133 700094 601057 598691 616881 648274 640172 691567 675355 636089
16064 636089 615897 539507 548116 750611 749932 671212 778720 709924 696719 842907 897118
16053 897118 790900 756771 769184 812022 783822 784827 858260 862724 826594 777553 821693 901833
16041 901833 859013 874149 936316 945807 1004009 971335 858413 871123 905207 931899 827091
16030 827091 963908 1057191 979385 1036607 1107411 1073012 996400 979154 953881 972457 1111517
16019 1111517 1058424 1034341 1091403 1194659 1273102 1268578 1313072 1378297 1360323 1312235 1334112
16008 1334112 1311519 1337708 1388589 1543619 1617827 1611788 1593293 1750342 1822846 1837418 1900862
15997 1900862 1863983 1803140 1663360 1585896 1465681 1476709 1572247 1637101 1691680 1719344 1729094
15986 1729094 1659583 1637806 1768973 1765054 1788451 1801658 1730657 1569338 1472455 1535702 1613172
15975 1613172 1574414 1527060 1589775 1631625 1682895 1695698 1532730 1466883 1452051 1507742 1603658
15964 1603658 1752795 1853168 1825602 1655782 1638402 1623789 1524514 1603599 1681953 1728268 1675005
15953 1675005 1538772 1559731 1607884 1620857 1638475 1592505 1610925 1694439 1736332 1784861 1785402
15942 1785402 1831099 1789557 1883256 1860678 1855741 1900927 1932134 1947586 1958804 1868929 1855928
15931 1855928 1856947 1902740 1887350 1905422 1873349 1842631 1878843 1956297 1832688 1730435 1825142
15920 1825142 1829496 1971052 2129916 2188333 2106585 2064161 2077332 2111581 2131749 2062591 2124433
15909 2124433 2150066 2127013 2131935 2219934 2340300 2419749 2418736 2490710 2471628 2497407 2550094
15898 2550094 2496213 2480072 2508517 2451840 2549351 2607916 2707890 2711166 2711996 2762584 2698240 2736966
15886 2736966 2874407 3012598 3033117 3034028 3063362 3107895 3102182 3104054 3211291 3235413 3283664
15875 3283664 3351605 3430890 3471423 3557133 3573745 3509970 3482719 3566597 3597606 3593075 3690605
15864 3690605 3742050 3768060 3825629 3931136 3944383 4037499 4161052 4369050 4412317 4308064
15854 4308064 4342674 4425937 4488326 4553985 4463116 4557054 4644672 4747696 4844919 5012674 5028515
15843 5028515 5071878 5265306 5425584 5460931 5455516 5429947 5524811 5552709 5637998 5888196 6027886
15832 6027886 6145612 6216827 6416733 6597380 6650629 6696759 6751635 6858271 6937673 7120067
15822 7120067 7294820 7452634 7698269 7817435 7887185 8125122 8353881 8543385 8617900 8699326
15812 8699326 8867376 9044312 9225982 9369651 9622132 9866333 10092240 10308972 10479217
15803 10479217 10713692 10996172 11251699 11496723 11760914 12066705 12379133 12624235 13002036
15794 13002036 13293602 13603510 13878840 14112450 14385628 14819769 15310092 15802504 16204870
15785 16204870 16569838 16976682 17478195 17829332 18250788 18749643 19201821 19744628 20259499
15776 20259499 20825967 21430266 21987154 22631999 23434748 24284390 25016261 25821149 26595816
15767 26595816 27259343 28234663 29255738 30178101 31095226 32119799 33284272 34430000 35742099
15758 35742099 37066162 38357289 39757951 41184951 42632962 44156457 45733302 47288639
15750 47288639 49046460 50881019 52671968 54545576 56532309 58564106 60607870 62724877
15742 62724877 64739105 66606034 68582100 70625721 72643208 74552124 76400673 78048733
15734 78048733 79629775 81182941 82614881 83953746 85042910 85987660 86760686 87217997
15726 87217997 87695145 87964242 87900463 87708858 87359377 86812074 86230448 85603943 84727238
15717 84727238 83786077 82788964 81578256 80275133 79061249 77839544 76414964 75026562
15709 75026562 73581635 72100020 70582430 69126424 67824101 66523590 65107964 63648138
15701 63648138 62363540 61096201 59784393 58454065 57064783 55785038 54516923 53286683
15693 53286683 52192406 51100851 50033747 48851238 47643866 46486564 45347926 44247298
15685 44247298 43281610 42307077 41199751 40158733 39183489 38129696 37205764 36426414 35494428
15676 35494428 34508886 33496542 32529147 31723759 30905591 30056340 29300237 28560165 27741806
15667 27741806 26931330 26187174 25596328 24939781 24258825 23633686 22937180 22304116 21696050
15658 21696050 21048057 20570290 20046753 19493724 18912229 18431677 18056567 17626267 17149748
15649 17149748 16734497 16256250 15766005 15395594 14998864 14505136 14121906 13710545 13394485
15640 13394485 13102009 12736986 12424724 12107320 11686527 11435876 11366993 11236990 10975674
15631 10975674 10691104 10431577 10202702 9971618 9693059 9494899 9387795 9180826 8899957
15622 8899957 8701934 8462981 8184410 8033726 7799197 7584873 7543288 7535950 7451437 7307714
15612 7307714 7093659 6811548 6700844 6527459 6444143 6348765 6193582 5987329 5836596 5827243
15602 5827243 5812712 5672700 5521260 5412533 5388959 5326681 5248952 5254500 5191157 5065943 4883943
15591 4883943 4788247 4701348 4624665 4525255 4441880 4347128 4293385 4185178 4083450 4031104 4136693
15580 4136693 4210915 4116254 4043400 4068193 3857834 3767256 3763243 3714056 3720466 3697739 3676350
15569 3676350 3663103 3524357 3451447 3491471 3421694 3397288 3526910 3528303 3393112 3466708 3515038
15558 3515038 3474373 3414880 3298871 3244758 3141556 3108425 2991776 2874473 2823596 2865340
15548 2865340 2863266 2916798 2920939 2923139 2898055 2862895 2927098 2917673 2788338 2751225 2821837 2786428
15536 2786428 2772247 2750445 2639366 2595509 2754834 2784219 2706248 2742111 2782063 2686578 2644247
15525 2644247 2624406 2544393 2390071 2305076 2265041 2293289 2269609 2235109 2174949 2186853 2102557
15514 2102557 2118151 2018863 1996180 1959225 1935362 1946156 1937998 1861463 1917697 1985285 2021019
15503 2021019 1999362 1975503 1869000 1785070 1661553 1684352 1764022 1673215 1621032 1598760 1569549
15492 1569549 1549689 1569726 1548964 1575458 1542384 1534678 1500160 1477135 1473746 1468912 1534464 1524325
15480 1524325 1424315 1402084 1488380 1491279 1438130 1363364 1334177 1249541 1184476 1128588 1240303
15469 1240303 1346793 1384046 1377042 1326439 1264051 1258305 1281251 1308757 1319466 1325869 1289389 1340118
15457 1340118 1502002 1687259 1893591 1977736 1899028 1788143 1682286 1572889 1513752 1456591
15447 1456591 1377599 1326074 1291462 1241801 1257388 1157983 1115350 1144505 1047128 1079312 1124145
15436 1124145 1233565 1241371 1188640 1175164 1165068 1099725 1013077 971947 1032651 1063701 1052336
15425 1052336 1040567 974649 888450 924892 950079 905351 943805 925848 861936 767235 744520
15414 744520 779811 847175 801652 811690 898592 961395 972612 840497 764187 864968 1043877
15403 1043877 1122925 1042848 909457 853611 785858 805896 854902 730582 603704 592958 635178
15392 635178 731231 824820 864239 770595 678257 644889 722156 792784 763407 729770 672666
15381 672666 625282 611213 674103 678008 658366 661137 645770 703642 696230 685365 692184 644411
15369 644411 672415 671305 626095 543361 439919 364320 406026 413875 409450 438026 528770 500699
15357 500699 474412 486719 454219 414973 324794 393828 541443 590873 513653 550665 547508
15346 547508 523663 583585 635198 633199 589149 436433 415467 494636 479519 406832 470906
15335 470906 500350 549963 465601 461341 519373 479007 426384 498179 537728 569827 517968 513260
15323 513260 526002 504746 403253 395079 518498 578137 585619 537894 492099 357937 262052
15312 262052 311769 254313 243889 343420 332843 288546 289545 291764 381231 466645 393641 278594
15300 278594 289326 281447 239298 207352 261641 284568 274041 405505 567480 497126 427310
15289 427310 426837 373135 391701 406442 414314 431121 472634 469431 336593 497623 558448 413538
15277 413538 264526 186213 224676 360639 381446 354470 352552 308072 287124 265629 340539
15266 340539 365093 273446 182742 178903 263530 441755 467500 376626 216524 199121 215762
15255 215762 239837 223363 215572 309116 352677 245077 182143 335904 400300 268593 84681
15244 84681 210124 297755 295348 221358 15194 -64714 93179 302024 341403 302246 196917
15233 196917 136505 108106 81510 138846 222664 180820 164144 159773 147536 98433 -7484
15222 -7484 -6010 -26847 81799 250347 336079 322379 271894 187782 149955 157319 193836 171832
15210 171832 123562 94118 155821 212081 221665 157355 114196 113896 182755 146237 136239 266059
15198 266059 409783 357911 338472 274258 273154 259621 283687 166357 133052 216374 262071
15187 262071 262477 169519 144729 193451 264516 201248 184699 200726 144142 117417 90808 71690
15175 71690 5414 33117 108905 131178 59356 64457 134123 195999 223215 206020 224970 113387
15163 113387 105533 155354 152762 214446 130137 103883 216538 245073 209947 153566 74299 90024
15151 90024 157948 203870 242909 265103 254775 226867 227235 245091 105668 47728 58180 95096
15139 95096 62340 123670 103969 182577 217836 72560 -49902 9840 9215 -21494 76095 70762
15127 70762 136931 152164 163080 194477 169161 96585 115492 119036 179108 162618 245589 295122
15115 295122 191141 142474 115690 56593 -21945 -37044 48687 33914 -41932 -59233 101700
15104 101700 168099 153234 107286 122376 197135 239843 58183 71176 14843 -34040 71361
15093 71361 84432 65876 -12092 -54014 -32265 24263 85577 105483 168551 225706 155431 112062
15081 112062 150531 95037 118871 229626 290955 172092 79554 53587 58996 -103716 -193169
15070 -193169 -184956 -232305 -323440 -247111 -163533 -52796 21757 9882 -29124 34169 61105
15059 61105 59096 76890 -26627 -105049 -49135 -2091 27125 94581 79359 53907 64060 81383
15047 81383 25943 100380 99156 67932 156596 228116 202253 100101 150359 81321 97210 152195
15035 152195 85528 25971 -46817 -64437 17758 22173 58006 117952 115126 46723 59698 107130
15023 107130 142636 130664 66582 77322 36923 57869 138913 86800 35659 23292 5820
15012 5820 -32686 27990 85411 76516 76609 38294 26496 36315 14515 40262 122722 129797 85762
14999 85762 103688 105594 113364 131083 132872 118287 62114 52019 53971 52151 -54227 -24031
14987 -24031 -68563 -135405 -89169 -31079 80602 241488 150649 68453 34472 19680 -28229
14976 -28229 -73918 -143571 -187680 -51702 163300 147678 140023 145746 119197 24682 10695 74153
14964 74153 143405 126054 -35293 -100547 -52429 34688 98203 74807 106572 60396 -26716
14953 -26716 -24279 -20216 -9819 61409 107473 63984 24333 45312 124689 246339 191943 82634
14941 82634 157665 84281 42793 -17027 -102860 -77466 -15395 8731 43915 125661 72783 10418
14929 10418 -8743 -6265 -16313 70949 112755 20160 45721 -30879 -3855 71807 6906 -37871
14917 -37871 -40943 -9088 23573 46391 -17299 -97604 -70354 -61876 -31691 -17953 -34642 -81520
14905 -81520 -73513 -67671 -47234 -16865 -70354 -45102 -86664 -107953 -47207 -21406 1365 -28567
14893 -28567 -166954 -144999 -124718 -106560 -86343 -54104 14998 207 -24626 -145818 -62741
14882 -62741 108830 102157 27570 -43550 -72157 50993 28073 -95264 -174377 -220515 -198794
14871 -198794 -227303 -138644 -30198 22077 28573 53425 172764 110217 132400 185047 128820
14860 128820 22960 92517 100017 -77801 -185361 -124488 7445 116780 -30786 -103041
14850 -103041 -38323 89288 63520 35667 63225 54574 175187 206160 189931 148589 37052
14839 37052 28472 13699 58665 80575 27564 16831 -78235 -66750 28458 28648 65375 32530
14827 32530 62881 27318 44352 -48785 -63055 -75601 -32381 14033 35248 90338 5743 -29969
14815 -29969 -47761 -24702 63054 112735 135360 171130 116364 114417 65455 -16839 -14893 -17320
14803 -17320 -69412 -46668 -8263 11250 35648 53903 43319 145297 147860 124652 128478 100895
14791 100895 46618 20556 -57962 -99923 -20550 -48819 -103287 -156728 -143001 -25821 7566
14780 7566 -45002 -118157 -124301 -50554 66506 82462 1329 -55297 65636 102570 51879 62804
14768 62804 -2718 -695 15568 -60616 29717 66637 25189 52032 -39516 -75554 -107088 -114542
14756 -114542 -62438 -62094 -77469 -29216 -14099 850 23612 84408 81609 93286 80252 -4309
14744 -4309 -46541 -105194 -152139 -57664 66162 112444 117795 89799 78203 24229 64021 79771
14732 79771 74879 10388 1548 8189 -145945 -113933 21839 52925 -5296 33977 5337 -57096
14720 -57096 -59664 -166839 -197926 -134482 -93296 -71725 -173014 -241510 -141099 -53711 -18135
14709 -18135 -68101 -133579 -88485 -158238 -119968 -133205 -23917 15940 93364 107862 63972
14698 63972 47158 124760 75789 -60128 -99120 -33414 95911 134097 -762 -47550 -45641
14687 -45641 -77241 -70570 -46018 53332 92421 79863 108279 46586 -100762 -58574 9812 -3859
14675 -3859 -62587 7679 24638 93943 99509 122506 81340 -14213 395 59849 96604 27087
14663 27087 51569 -18153 -10712 -43516 -84800 -116228 -151338 -162596 -77421 16008 8835 -31676
14651 -31676 54751 76684 -89317 -137435 -59604 34494 31059 16348 36583 40529 40552 36032 -36561
14638 -36561 -48534 -57715 -72621 -46576 -92413 -79773 -119086 -247994 -354774 -321747 -312041 -252296
14626 -252296 -185839 -206014 -130640 -103929 -60924 -21989 35811 36097 110900 166105 9520 -105983
14614 -105983 -74682 -120359 -178242 -91482 2448 -10679 19546 144972 72962 -65891 -18735
14603 -18735 12475 -88378 -158899 -113087 -22689 143560 248004 283566 298411 227914 102795
14592 102795 10751 -78402 -98289 24193 33136 -14493 -31309 -17239 15120 19907 -7556 40910
14580 40910 24345 -41016 -133631 -55037 82674 63287 34926 75622 52473 -86992 -58988
14569 -58988 -6717 -39226 -37954 -35692 -7603 -7451 -34619 -67655 -123311 -23707 1387 -84944
14557 -84944 -79816 -48201 75913 115848 80635 49821 461 16401 -14962 19029 -2610 -27201
14545 -27201 6378 83948 12237 -130139 -159468 -119859 -77534 -106583 -140221 -80619 20397
14534 20397 114022 46553 44980 20918 7705 11706 -12261 -190300 -254634 -221634 -269137 -279474
14522 -279474 -162641 -123466 -69134 -68862 -64296 -235380 -306467 -190842 -64452 71311 85829
14511 85829 -21807 -110123 -139088 -11912 30528 28513 -8605 -91747 -88930 -47501 -87880 -106415
14499 -106415 -163726 -159234 -75066 15928 58493 120940 50325 87075 108287 -2012 -98953
14488 -98953 -124566 -67919 -47824 877 96918 55344 87688 72383 126900 110821 220834
14477 220834 176333 92743 11641 -47227 -63487 -1835 94848 61524 30089 -72721 -22082
14466 -22082 -18126 -71270 -181870 -135839 -85908 -127826 -118239 -91722 -89025 -98917 -109980 -84226
14454 -84226 -56496 -90983 -102128 -90131 -109208 -73501 -50139 39207 5049 -70444 -20025 10198
14442 10198 9493 -32007 8856 52057 36049 68854 6895 -26546 13130 52214 -40509 -86254
14430 -86254 -32476 -9711 -1687 -39782 -14410 -16611 -17457 2799 -145438 -248260 -202250 -143275
14418 -143275 -153865 -185683 -132468 -107506 -111100 -114152 -155321 -146802 -198387 -139141 -208932 -160377
14406 -160377 -142293 -52228 -43699 64143 466 -36661 -66956 -133234 -202802 -197895 -104621 54910
14394 54910 2154 -104791 -108972 42255 3801 -73831 -61532 -81996 18447 90333 72482
14383 72482 20701 -32310 -75842 42205 73474 74927 -4950 -63523 -87133 75035 180767
14372 180767 192098 114586 127105 12638 -20605 79048 41186 -17913 -53876 -66639 -162108
14361 -162108 -212707 -215366 -194499 15676 -19140 -216122 -156218 -113250 -65829 -66695 -103024 -169490
14349 -169490 -188246 -76427 54673 71683 66712 -46488 -52472 3588 -53448 -44772 65325
14338 65325 35906 12235 -69050 -85263 -75269 -10222 -2223 -73744 1546 8658 25995 -20461
14326 -20461 -72174 -86389 -131563 -256998 -256924 -174961 -98643 -102675 -95015 -69869 -59595 65014
14314 65014 -5995 -94702 -63396 43723 67283 -30245 -985 -47119 -48335 -33443 21643 -11330
14302 -11330 -83902 -96543 -37928 -117972 -252085 -236829 -187785 -105201 -30599 -77104 -114887
14291 -114887 -151234 -177891 -162029 -204190 -204095 -250163 -240939 -298631 -284737 -130320 -30412 -102637
14279 -102637 -42787 77138 91782 33334 -9309 3196 -88030 -192740 -211063 -188132 -152368
14268 -152368 -146458 -151698 42383 115047 148903 97233 28037 39735 14035 50137 131632 33231
14256 33231 -24745 -37204 -39795 -12145 -37786 -51710 -50448 8056 -18866 -18865 -48146 -176371 -177237
14243 -177237 -49481 83787 127586 90843 43179 17401 1962 -25313 45463 168391 108049
14232 108049 -66106 -143582 -113075 -70631 -72760 -79521 12810 -140193 -94494 -32197 -65671
14221 -65671 -94405 -146957 -158486 -156621 -232012 -201181 -79218 -61991 -86209 -51515 -126614 -132523
14209 -132523 -53973 -5466 -39416 -149944 -137638 9512 85953 -29022 -37943 75913 134982
14198 134982 97975 50935 26249 42396 97629 1510 -61059 -68810 -21330 -43562 -162293
14187 -162293 -110359 -124939 -17947 -110495 -199497 -173657 -158064 -117184 -126776 -197869 -173162
14176 -173162 -103129 -22314 63891 88008 -50079 -122043 -93358 -80362 -49197 -36063 -103296
14165 -103296 -92518 -57133 -2519 34291 111107 58141 -13131 72672 69291 22061 -819 -17396
14153 -17396 -36380 -48982 -68162 -32038 -74110 -37742 -17324 -4885 21500 -64910 -121403 -126848
14141 -126848 -131374 -146819 -106937 -56769 -86933 -98633 14057 14636 -32940 -146715 -257671
14130 -257671 -179107 -130818 -81377 -63103 34393 43715 -75131 -142711 -74279 -82999 -102728 -84151
14118 -84151 -87121 -78165 -49089 -44816 -55483 -10925 69566 58650 61420 59755 30911 -38583 -17464
14105 -17464 67623 99000 73032 39223 179147 179581 57283 -47508 -53910 -10121 17964 31686
14093 31686 53825 101130 58385 -17179 -125803 -139024 -73898 -122856 -179355 -64443 -7282
14082 -7282 -1591 29701 40721 19349 7371 -12341 -34134 59875 159019 163595 36252 -9140
14070 -9140 3664 6787 60799 137003 109752 65447 61461 40911 -16828 -95371 -114615 57233
14058 57233 24059 29158 49517 56374 30008 10255 -13206 -73176 -91655 -97303 -6465 54402
14046 54402 28586 -82355 -133266 -115754 3202 59428 45190 -10740 -22655 -111672 -23636
14035 -23636 -35770 -108970 5638 74271 -9089 -113374 33703 117508 123246 90611 43590
14024 43590 84103 55669 -14467 -24678 -32723 -56005 -45437 -25604 -116809 -43293 -11096 -51794
14012 -51794 -89808 -26244 -12106 -93544 -123325 -161730 -192230 -236404 -104855 15288 75042
14001 75042 64038 -15654 -23163 -25869 -53590 -85046 34215 146209 199441 126329 113303 -11789
13989 -11789 -94680 -9640 18948 -21307 -37458 4164 -33813 -14639 19644 29673 -27903 30713
13977 30713 -87298 -138995 -90545 -98587 3918 -58204 -199132 -231499 -127154 -46385 -6749
13966 -6749 -61122 -122435 -97982 -29765 -109926 -111704 -93449 -149153 -134904 -131489 -98198 -172037
13954 -172037 -200597 -164888 -146079 -86689 -39876 -111689 -136770 -124893 -132749 -111478 -132446 -95905
13942 -95905 -21273 -28810 -63158 20666 34227 -69321 -116506 -79563 -174980 -209767 -168783 -175527
13930 -175527 -80243 -54124 -47654 -31538 -25017 -31767 79413 135732 111917 149293 242201 258075
13918 258075 213310 333546 380783 290920 272811 242514 174243 179811 136673 217321 187390
13907 187390 134112 61075 -5499 -61745 -1987 7458 9877 23725 66794 32177 77167 96018
13895 96018 165730 169999 95461 78631 165821 84282 49018 96721 157689 215611 343615 410831
13883 410831 333183 248511 247309 261830 266485 316161 429685 640990 785621 964800 969529
13872 969529 971171 887593 747140 627431 574142 493978 302490 128475 214809 352205 297361
13861 297361 175892 168895 106265 -24723 -71860 7114 22633 89157 206687 200331 146436
13850 146436 138031 156306 75709 115198 196716 229793 230607 190296 173528 287748 309732 390211
13838 390211 431875 351832 275275 242624 272523 334500 513067 661933 676008 745563 815974
13827 815974 876768 902571 760430 573019 526095 474896 471170 472242 418425 392787 384226 338740
13815 338740 364412 373576 278499 189043 314524 319115 220718 252032 336141 301053 250307 281473
13803 281473 291548 250172 274530 183969 217002 333660 264753 266299 280434 148590 110749
13792 110749 167885 179839 177920 221155 264159 240970 230130 295284 394904 508909 535447
13781 535447 540706 430001 275185 146327 170312 169374 181393 233230 133047 46693 24070
13770 24070 27758 99997 287759 246547 256206 241270 210688 244712 352870 247753 81690
13759 81690 77677 127566 138385 161926 181323 203913 152735 209081 307865 266287 131477 -22241
13747 -22241 35071 119223 100608 98395 221917 214642 219795 255928 263962 232505 93405 -3330
13735 -3330 -40172 20994 53414 -35759 -22871 36793 79782 143963 171554 70834 27974 26100
13723 26100 91172 -42240 -158611 -90117 13387 -32327 -145710 -173461 27015 91757 60728
13712 60728 111525 106218 39040 47151 55464 -100778 -98639 23593 27457 61974 84188 60368
13700 60368 121888 189276 95907 85339 82017 16633 -44278 12539 94349 207700 210771 160480
13688 160480 126543 178738 142447 117920 226282 168508 52067 79133 170376 126815 137055
13677 137055 251188 222146 200077 197918 144688 64731 162530 241265 261619 300091 306979 268920
13665 268920 207028 148101 180597 195844 185003 242706 205012 176693 126033 51926 -17054
13654 -17054 -3281 56238 40783 78332 97823 157096 211095 297370 332080 378873 338821 221025
13642 221025 113337 1173 -52996 18783 48266 -1835 41206 32054 -2426 10720 58195
13631 58195 241754 351089 327523 359691 337093 307767 284040 280621 441504 499108 433088
13620 433088 496325 499742 414784 285018 276179 323404 258962 186705 100441 165990 184179 128171
13608 128171 78953 95021 32739 60316 101027 62235 130527 210314 197970 134818 166964
13597 166964 256680 280252 175888 160902 207126 81959 41769 95484 121396 219271 212562
13586 212562 194547 210788 274987 206641 122178 187317 161955 122829 111648 101255 127745
13575 127745 131110 132398 164504 137221 140624 215637 264500 223740 196206 231398 264184 134466
13563 134466 144044 198519 188247 144155 101537 161773 224529 229102 221234 281478 340350 420011
13551 420011 468323 459356 446085 472554 541008 515816 599897 652211 654233 639497 672199 595964
13539 595964 636073 547246 470241 476163 473672 475175 543644 621413 670296 756192 672063 648171
13527 648171 524224 545388 631025 660176 630854 510324 361563 423445 561092 544696 503318
13516 503318 433586 502923 624117 674623 635547 843253 921202 891048 830397 948119 1024675
13505 1024675 1139591 1159969 1131574 1151750 1224655 1294081 1378184 1416789 1487436 1479911 1446325
13494 1446325 1491341 1649881 1730070 1761474 1722534 1707756 1723020 1783764 1778630 1854244 1958882
13483 1958882 2091454 2185007 2279491 2323807 2485068 2618847 2829395 3089750 3392604 3651391
13473 3651391 3918882 4178876 4680278 5338023 6116980 7055453 8309685 10075849 12283323
13464 12283323 14853754 17568461 20477090 23792449 27999854 33842124 41491704 49459107
13456 49459107 54803700 55362657 51819403 45723631 38730562 32536219 27820415 24346698
13448 24346698 21774496 19775516 18339014 17188048 16219298 15496743 14741216 14088732 13773349
13439 13773349 13500320 13361298 13202774 13117788 13076516 13088792 13257181 13461928 13914030 14495546
13429 14495546 15177698 16075273 17237636 18598881 20465456 22866876 25928891 29727232
13421 29727232 34593799 40745459 47993151 56244205 65087203 74647052 86487072 103123316
13413 103123316 126000483 151714186 170729314 173706939 162554736 142652171 119300021
13406 119300021 98386247 82615700 71255203 63000780 56745395 51876411 47943842
13399 47943842 44647128 41850352 39499102 37525441 35894173 34495271 33404140 32504896
13391 32504896 31739734 31086743 30596636 30356243 30262198 30344462 30562733 30939556 31694763 32746956
13381 32746956 34170815 35974507 38323346 41346366 45015242 49587891 55501162 62508043
13373 62508043 70330301 78531692 87429100 98522056 114147562 135976311 161583772
13366 161583772 181425009 185219731 174227513 154003313 129599463 107293007 90136895
13359 90136895 77804811 68853920 62008551 56509190 52006577 48305284 44998857 42299136
13351 42299136 40063320 38055846 36332995 34938360 33657033 32631568 31823013 30991262
13343 30991262 30414520 29910840 29419453 29005265 28734917 28575870 28609828 29173823 29791091
13334 29791091 30477290 31449851 32475050 33705650 35292171 37242356 39242427 41313306
13326 41313306 43539696 46434799 50926321 57291519 64578244 70176325 71090973 67389375
13318 67389375 60433183 52058507 44339112 38260653 33587387 30037709 27210650 24945630
13310 24945630 23071808 21438783 20040146 18818357 17777018 16904445 16024841 15306292
13302 15306292 14642792 14080966 13601332 13115167 12637312 12335732 12113513 11783716 11522163
13293 11522163 11345391 11195841 10979794 10865760 10820576 10814646 10515975 10176014 9868730 9649822
13283 9649822 9377445 9009847 8584638 8104775 7580576 7046832 6619246 6296012 5997202
13274 5997202 5684948 5320516 5035952 4754458 4456723 4117701 3920953 3721790 3476426
13265 3476426 3269326 3197809 3101401 2837726 2635173 2530490 2573550 2515038 2503785 2427161
13255 2427161 2258069 2120772 2162685 2117998 1976040 1942487 1927859 1981158 2020302 2000771 1921482
13244 1921482 1917089 1979435 2033878 1951929 1915556 1725958 1618124 1564192 1458031 1421875 1320122
13233 1320122 1208633 1238911 1250425 1154326 1133708 1186342 1172916 1095466 1009472 1119981 1102012
13222 1102012 1026257 1020593 907705 857124 808725 883978 796564 744192 851400 846519 844444
13211 844444 829923 834893 804962 738617 808790 800854 715176 759521 789847 880545 895245 904475
13199 904475 864652 814646 837487 810512 682894 723746 904354 906010 787829 804838 805071
13188 805071 676770 676227 735451 800570 743453 740062 711150 692258 675001 691930 754754 766641
13176 766641 653714 531848 553436 589096 605040 657458 716980 687505 652767 598127 655035
13165 655035 770041 723488 668619 775335 771363 750102 775825 745023 705218 627948 633464
13154 633464 621554 558189 574157 457731 317874 368875 384656 351099 481092 534606 518688
13143 518688 571129 461398 463692 473056 430168 472771 475574 346313 289310 205413 257321 328231
13131 328231 277535 260222 240870 295666 251506 164979 193852 182014 166480 126356 158849
13120 158849 252756 304667 264681 199658 117602 162257 317473 458137 368199 261131 178188
13109 178188 129409 149007 100579 153205 230149 237422 269851 232617 104253 87659 154345
13098 154345 232504 141704 79285 152831 267076 298280 215779 136463 19612 -69979 -128817
13087 -128817 -127470 75270 148672 113251 238704 232241 142552 104681 126454 37522 8771
13076 8771 27397 113332 279774 286853 186379 131279 141428 208210 182723 241281 186404 123841
13064 123841 42471 25752 111431 181110 221760 164380 60195 56672 50944 107092 166247 201077
13052 201077 155418 98770 99722 187258 230789 136228 85815 80733 39802 -18071 46592 223377
13040 223377 216806 165927 79827 -26494 -29661 14202 -3781 -61547 -31697 53994 81550 55631
13028 55631 43273 13793 -43866 -138507 -192084 -140281 51676 -2667 -15395 18483 163295
13017 163295 149710 100741 108510 78560 104825 125423 54892 -9208 -67377 -26833 137921
13006 137921 45336 -54061 -40279 -52953 -106235 -86588 16559 187597 181046 52016 61423
12995 61423 207826 140724 128701 166287 224909 360823 355598 321620 379284 398303 253181
12984 253181 213090 271159 259853 211080 170658 148427 49807 1111 -23174 5975 95579
12973 95579 122494 204353 203518 105077 70749 86504 36343 56749 145108 55155 66107 68826
12961 68826 -59440 -111891 -73473 31518 77409 63142 24729 42848 109854 180014 172470
12950 172470 184278 143933 74322 128753 334205 536227 660751 788985 901693 994858
12940 994858 1048437 988486 787540 632701 562737 399968 319623 258866 243218 293872 265882
12929 265882 221186 131970 91738 161179 220249 196104 206368 232002 276031 151671 66108
12918 66108 13304 10141 28776 90566 185818 167640 135687 109780 93880 140743 260490 371593
12906 371593 338383 402269 393718 371762 364030 380416 439805 516600 591163 735499 915831
12895 915831 965924 845359 800004 714577 631221 442490 287897 161722 149782 220079 264994
12884 264994 179202 87536 113185 202328 238279 255008 319733 271522 259672 198554 89665
12873 89665 34457 181352 197634 122611 75039 73567 97311 119252 179883 204728 263579 220017
12861 220017 260397 341155 332030 328292 345094 326792 229055 227873 253777 383702 511826 571836
12849 571836 575806 432223 395365 350155 223919 125909 27296 -4574 -31996 75414 112838
12838 112838 141964 75612 4656 89102 32066 -90451 34078 186314 235009 215116 184640
12827 184640 84474 -10193 55907 142981 61112 -73827 -83124 22042 73932 145199 99656
12816 99656 10419 62148 126276 105852 121486 91966 66919 -92431 -102357 23589 -19794
12805 -19794 -35410 30622 -4686 778 2278 -61112 -108588 -77642 -68243 24162 -25972 11236
12793 11236 -10284 -20261 13506 66278 43574 -3730 6775 37365 107555 122798 56738 -27369
12781 -27369 -170632 -229588 -153296 -182751 -266773 -224665 -165641 -91778 13342 10204 84082
12770 84082 20169 -49913 -65882 -88302 5196 68916 36396 74690 38933 466 67417 24548
12758 24548 7598 22144 -58907 -87880 52237 47881 -16183 -60205 -36019 -47377 -66810 -105869
12746 -105869 -142268 -175666 -75881 -37588 25727 38285 105358 46602 -98412 -312910 -309744
12735 -309744 -292228 -208458 -211723 -233250 -123631 -71532 -118115 -228920 -189228 -109673 -123047
12724 -123047 -147597 -202323 -291825 -160511 13397 -9892 -177326 -172011 -133638 -164942 -140942
12713 -140942 -99566 -31025 1258 -27874 -43427 53982 37097 -96234 -112717 -84872 -74870
12702 -74870 -79976 -130954 -218830 -193878 -94461 -155073 -156033 -118516 -168008 -193419 -69244 -67147
12690 -67147 -42897 -27241 -126944 -247483 -164920 -8800 -13599 -34320 -117235 -35220 -41140 -32851
12678 -32851 -125372 -69640 -90854 -66326 -84294 -66697 -151215 -175355 -312576 -393583 -288860
12667 -288860 -199945 -229554 -210205 -160602 -178236 -265666 -155850 -28421 -21249 -38280 -99061
12656 -99061 -113618 -104008 -37672 -30067 -9121 -66179 -84293 -10718 -25760 -44551 -66325 -96110
12644 -96110 -71203 -53607 -57364 -90381 -73357 -56806 -68433 -140330 -191631 -130936 -43631 -7354
12632 -7354 -120396 -153220 -55490 -24550 4034 -19992 -21191 2228 -24780 -26796 -52826 -112158
12620 -112158 -51702 -64571 -184187 -226545 -139484 -63841 -28007 -135239 -130482 -99164 -61158
12609 -61158 -96081 -80197 7259 -24536 -173855 -139390 -50429 3613 -10212 -28284 -47371
12598 -47371 -30681 25328 52234 7281 -17432 3547 -83432 -98940 -47618 -7257 -21925 -71348
12586 -71348 -137683 -124675 -76525 -46993 -50023 -159639 -265476 -221539 -151128 -48670 -113035
12575 -113035 -226449 -320003 -375130 -195155 -26863 39860 -82778 -158505 -126577 -119658 -83612
12564 -83612 13435 82911 -1695 82213 59664 -16677 -19817 -89971 -196872 -250977 -240305 -281217
12552 -281217 -229177 -122522 -49847 -150788 -343317 -375700 -346925 -421789 -375801 -266854 -140851
12541 -140851 -104089 -145666 -70101 20418 -12047 -67793 -23540 -113167 -123174 -142158 -83214
12530 -83214 -81655 -176626 -163710 -90951 -183514 -225976 -242678 -256611 -192885 -149560 -60148 -118736
12518 -118736 -179994 -106747 -39574 -40605 -145996 -282742 -273421 -188613 -123328 -107284 -136093
12507 -136093 -76084 -171275 -227136 -178885 -60586 -31566 -40763 -195944 -227747 -276692 -305066
12496 -305066 -293810 -273114 -265617 -264960 -382627 -348754 -244631 -116799 -95298 -92249 -124516 -157643
12484 -157643 -216777 -38731 57009 19385 -117133 -193777 -179653 -193236 -253214 -283180 -251105
12473 -251105 -221483 -146667 -52226 -39329 -181835 -383545 -361584 -230118 -133874 -169471 -171563
12462 -171563 -213404 -295530 -284793 -253565 -195251 -79255 -72772 -90720 -177044 -225161 -282545
12451 -282545 -288262 -122934 -81801 -160535 -165357 -83247 29978 107067 50875 -40770 -154507
12440 -154507 -169096 -171016 -115330 -195297 -160714 -73595 -77090 -147784 -232149 -239032 -163029 -123398
12428 -123398 -84903 22572 52208 25140 -56821 -107857 -180998 -169045 -95044 -100929 -159399
12417 -159399 -186633 -177623 -229763 -289384 -217551 -106083 -172343 -184359 -214158 -223053 -297765 -226230
12405 -226230 -203835 -267082 -199343 -203088 -93419 -4977 -35791 -81891 -80081 -114272 -87443 -49009
12393 -49009 -48072 575 70991 45061 37560 41194 -50347 -157595 -221638 -260592 -165005 -77108
12381 -77108 -130633 -175839 -169933 -193491 -185239 -174792 -37498 -15139 -11663 -50033 -80763 -57603
12369 -57603 -67660 -112724 -121708 -123162 -135001 -117110 -176280 -215919 -108821 99235 164313 106547
12357 106547 -59015 -80628 -57487 -89270 -95337 -55228 -7195 159911 161765 11608 22738
12346 22738 36179 -44985 -104759 -35777 60183 27267 40526 66732 25190 46412 -9036 -6413
12334 -6413 -4421 -134510 -88788 -102282 -182069 -213117 -184730 -179101 -262405 -336607 -245191 -114548
12322 -114548 -108526 -151929 -175214 -245046 -227162 -194033 -108869 -83252 -85035 -135068 -247455 -364550
12310 -364550 -320933 -255877 -235939 -311712 -292908 -252520 -238602 -158652 -114230 -114156 -224219 -222602
12298 -222602 -156314 -47664 45067 79864 1847 -14722 -130762 -278283 -246086 -174593 -102348
12287 -102348 -40970 8681 -67045 -121904 -153475 -93119 -23491 76672 63565 -13738 -43831
12276 -43831 -156659 -111876 -119028 29005 24455 -69927 -117049 -110745 -86141 -151680 -258412 -324320
12264 -324320 -322689 -274965 -180084 -159838 -277532 -288938 -246106 -125064 -57900 -37524 -148663
12253 -148663 -176671 -276556 -325713 -197894 -161298 -104102 -18862 -18708 -303 -59298 -75321 46087
12241 46087 22768 -47381 -38815 -10545 22207 -39492 -84453 -143295 -100598 -34209 38070 102441
12229 102441 76137 14422 -21846 -61682 -21019 87892 112514 -22543 -165319 -160102 -52879
12218 -52879 -48495 -96694 -61990 -38100 3387 -52142 -144496 -17619 9335 -150609 -281621
12207 -281621 -250798 -62208 13615 57347 50557 99009 4376 -17504 -87578 -124304 -228804
12196 -228804 -186861 -96654 -87169 -71840 -61787 -53029 -13870 33941 446 -60520 -146190 -60072
12184 -60072 -33180 -30973 -31379 -50263 -64924 -48980 -38560 -35214 -15203 -33756 56758 100938
12172 100938 190077 284213 400080 405431 442911 541125 579561 759779 958140 1050846 1154004
12161 1154004 1303770 1545251 1873440 2392071 2957176 3290545 3501777 3529993 3255988 2886680
12151 2886680 2419338 2014434 1729996 1534316 1365520 1133505 1129437 1149811 1102939 1116902
12141 1116902 1118917 1029489 1043634 1049490 894880 908885 1090750 1177780 1078836 1183069 1365146
12130 1365146 1561857 1747028 1878777 2107672 2270594 2371525 2591429 2943685 3456386
12121 3456386 3824156 3924431 3859090 3508931 3107328 2803245 2469776 2236594 2005025 1683510
12111 1683510 1489333 1274287 1158259 1162794 1083619 958973 811619 877938 799802 577664
12101 577664 489971 503072 508722 548466 560003 531348 588522 592503 489770 431536 369008 459362
12089 459362 388220 338272 391261 483226 488590 368437 386056 414053 386388 461430 570922
12078 570922 467850 390506 453630 403029 369767 358072 265786 189454 172091 85528 51876
12067 51876 94316 110440 162649 165183 139272 131069 94736 87704 84171 -48075 -77699 -140835
12055 -140835 -31265 -39051 -161762 -180492 -168532 -145114 -65966 6377 -3576 -9230 -53132 -44082
12043 -44082 -12900 -45825 -152142 -191488 -180211 -69477 -40754 -127070 -128407 -149892 -187538
12032 -187538 -106806 -67749 -27912 59662 40444 88438 58199 14651 -27232 -25805 4264 -36628
12020 -36628 -60765 -153404 -150637 -183036 -210255 -198939 -141114 -117135 -143869 -106073 -122401 -82324
12008 -82324 -92531 -16942 13107 -50609 -70634 -40969 -86999 -163691 -205634 -245638 -189556 -229362
11996 -229362 -268898 -226352 -244878 -216270 -171507 -127809 -68186 -71788 -144844 -55490 24365 42094
11984 42094 -66331 -200163 -202298 -159797 -3291 -30273 -104965 -209817 -257290 -97297 -53968
11973 -53968 -72749 -32739 -70000 -97383 -34968 39606 32673 80214 91067 1537 -68640 -122047
11961 -122047 -146125 -147314 -100722 -93778 -235482 -232801 -222283 -220737 -189927 -179201 -184345 -108589
11949 -108589 -41620 -219517 -305029 -257754 -122705 -71923 21822 -48631 -76579 -68259 -100306
11938 -100306 -42687 -36107 -107885 -141017 -109985 -59663 -37325 -103669 -118404 -163119 -70603 -95634
11926 -95634 -147425 -175946 -245314 -269714 -192371 -87773 6106 -27926 -145232 -129584 -91227
11915 -91227 -84190 -10947 27288 45123 24686 -83992 -144501 -23503 -28677 -133149 -153260
11904 -153260 -163422 -259912 -225175 -103470 -67820 -67510 -19123 -63498 -90639 -174865 -184010 -166230
11892 -166230 -72328 -96109 -122854 -217336 -207253 -170834 -218599 -48043 86266 56821 -7569
11881 -7569 -46435 -179731 -213551 -120587 -118195 -73523 -4747 -77557 -144956 -145583 -147073 -131603
11869 -131603 -112316 -203507 -154400 -145228 -104677 -35405 -42213 -111627 -90414 -97680 -28769 -9688
11857 -9688 -150933 -134926 -82332 -91939 -114311 -144124 -83567 -65613 -84050 -167411 -78667 3105
11845 3105 -132171 -173646 -214462 -178463 -207011 -145194 -114862 -137302 -29856 4479 -123087
11834 -123087 -82644 -101106 -37791 -46850 -82036 -6237 -48348 -32180 -52356 10426 83567 2377
11822 2377 -67828 -80421 -184817 -210561 -184950 -162675 -183725 -155693 -257692 -220807 -158995
11811 -158995 -80376 -13982 -56521 -20975 70512 -31733 -66450 -59983 -93829 -154739 -191317
11800 -191317 -94778 27491 -20399 -38321 -87071 -131909 -160303 -132256 -110433 -134219 -87229
11789 -87229 -76622 -111543 -146486 -225660 -252386 -280177 -220488 -227430 -259341 -267943 -136498 -52333
11777 -52333 14151 -72801 -77987 -117648 -136084 -117544 -128247 -151950 -69914 -12064 5073 -104778
11765 -104778 -147537 -142958 -89161 -30279 -8750 76860 160155 277028 279047 235009 303342 338665
11753 338665 263059 284322 369928 365394 288406 353789 370357 303273 279149 212314 159255 160915
11741 160915 244771 367689 314617 178901 146219 227716 249645 261295 162215 77320 49347
11730 49347 144872 280651 332066 306177 320985 361696 362937 317549 338261 370945 387242 433213
11718 433213 461584 361523 467331 521554 455109 435663 434845 387467 347309 406265 450697
11707 450697 362015 275615 292962 239721 171442 140617 170178 279717 371593 490497 420947
11696 420947 327289 281542 207494 269655 408802 400581 479388 442504 414892 384552 341959
11685 341959 373248 342300 298031 305951 290919 267096 155699 222924 312452 268451 152688
11674 152688 146682 166643 189668 184009 218634 246567 254600 197137 160889 185311 243396 259444
11662 259444 132581 8291 -649 17571 7653 55123 6325 -28503 -79012 -66549 -44170
11651 -44170 4017 148412 166336 167766 73979 -15567 13760 149944 224071 186796 141311
11640 141311 98095 1555 68526 138589 131970 187506 157401 82273 14975 22512 25225 -28058
11628 -28058 -24606 -27621 -68301 -140243 -86895 -40061 -47496 -22325 97589 132640 26328 45012
11616 45012 -64954 -170552 -275875 -234856 -237875 -210787 -167250 9246 82672 28275 -63491
11605 -63491 -58987 -19683 4004 55412 89886 114446 43962 105802 122512 48160 -47536 -16211
11593 -16211 45376 77277 43828 -29454 -58259 -9695 54244 -93169 -135150 -14710 40635
11582 40635 93351 58434 51626 7386 528 35477 87181 99797 27357 42620 71185 114863
11570 114863 45247 21084 115264 141875 150479 129868 225925 315545 182088 69280 89181
11559 89181 234621 89337 -48389 55729 233201 244482 101174 -7838 -121889 -106816
11549 -106816 -74531 -16817 -20288 -17613 -27112 19066 40360 52736 134055 128838 213871 307160
11537 307160 321654 284504 212165 126482 44227 22749 -12534 71005 218457 154981 119872
11526 119872 80067 86703 79710 34343 219997 342558 354282 295022 137916 53401 77705
11515 77705 73873 30829 -18527 -22288 67728 108564 204164 286479 205612 161505 235261 329283
11503 329283 321848 251601 282597 361954 330968 258881 202150 165396 235747 283548 303524 320242
11491 320242 330543 358870 269415 290301 294247 335304 307822 191831 175314 266640 248131
11480 248131 201584 221252 163574 142761 243753 234270 209627 238779 179674 206350 199658 203490
11468 203490 170398 212759 231477 227541 193472 300974 318704 271824 284942 293894 306733 343216
11456 343216 425932 351488 201956 274538 286601 322770 301234 386378 420415 383706 428895
11445 428895 470870 383956 327210 244507 302360 527510 629740 705523 757714 701999 661556
11434 661556 650462 600274 554257 520046 651008 833636 823890 766107 778476 721616 847799
11423 847799 900434 905254 895834 934939 872655 966006 1025591 1065154 1114144 1153825 1143578 1144831
11411 1144831 1205682 1280155 1253177 1344725 1383818 1378875 1321036 1455263 1537720 1678346 1716231
11400 1716231 1638227 1635331 1760912 1934066 2060153 2170914 2197378 2205871 2177726 2269107 2384363
11389 2384363 2547811 2686917 2720188 2803694 3031009 3202729 3278567 3415083 3515935 3669768
11379 3669768 3954805 4160604 4458521 4823325 5161263 5533500 6128077 6656046 7274511
11370 7274511 7951937 8664520 9532033 10329730 11389816 12741300 14443456 16463393 18844978
11361 18844978 21569869 24960781 29018140 33696781 39203855 45634837 52814086 60654457
11353 60654457 68611300 75867795 82133073 86566107 88942806 88964325 86980262 83617664
11345 83617664 79325563 74634675 70428259 66965520 64260011 62397190 61400435 60945655
11337 60945655 61036099 61559274 62381545 63278433 63835325 64237635 64465198 64626597 64746449
11328 64746449 64910051 65302367 65885549 66863773 68295966 70012677 71925074 74001316 76185667
11319 76185667 78249356 80189219 81923175 83256708 84235494 84971967 85256048 84992199 84128703
11310 84128703 82703505 80929184 79111282 77301767 75657428 74283740 73314144 72570754
11302 72570754 72103748 72001580 72084376 72273928 72536719 72742177 72990550 73135556 73261395
11293 73261395 73673328 74441029 75497614 77009493 79079606 81942669 85797687 90478617
11285 90478617 95848689 101503803 106975902 111667420 114918213 116091999 114959212 111415746
11277 111415746 105893792 99203033 91827347 84207372 76943647 70414315 64802498 59962654
11269 59962654 55800893 52365889 49288933 46533240 44217463 42249653 40443818 38767819
11261 38767819 37233848 35827389 34586651 33425978 32236899 31186614 30223918 29385202
11253 29385202 28582744 27838821 27085229 26259901 25478003 24792230 24166622 23431906 22667829
11244 22667829 21917412 21075471 20241395 19581541 18870565 18057711 17194637 16434795 15681240
11235 15681240 14934424 14166577 13441497 12876965 12201659 11500843 10937457 10447708 10011206
11226 10011206 9618578 9166285 8695218 8234394 7769928 7366222 7001266 6779787 6496653
11217 6496653 6239523 5961056 5636241 5368996 5064278 4967261 4836661 4564820 4266986 4027803
11207 4027803 3815032 3725249 3621175 3456313 3360640 3117586 2910132 2845343 2708138 2638703
11197 2638703 2660411 2549936 2353438 2273873 2253583 2226903 2123043 2024992 1902297 1851034
11187 1851034 1855269 1827548 1764596 1721073 1556740 1518997 1530889 1561785 1491410 1385723 1322995
11176 1322995 1314814 1272424 1309630 1399609 1383051 1429066 1436593 1462200 1526297 1573852 1533131 1358800
11164 1358800 1186222 1188119 1207353 1069993 1109256 1223949 1287760 1190411 1201214 1275366 1205311
11153 1205311 1238285 1168381 1154844 1182403 1283804 1419997 1420198 1362352 1377547 1389255 1468154
11142 1468154 1442441 1317725 1287305 1239019 1155768 1289751 1328467 1247929 1329300 1475301 1564679
11131 1564679 1657637 1644984 1590026 1539597 1507852 1435132 1473460 1546571 1638275 1652395 1657176
11120 1657176 1647528 1792311 1788443 1727635 1727550 1737806 1709937 1780544 1784712 1810783 1666737 1622737
11108 1622737 1697730 1620489 1624761 1616797 1512851 1445600 1456830 1512641 1426823 1321505 1359213
11097 1359213 1410859 1360103 1352282 1443151 1409996 1472206 1625752 1626112 1562309 1453901 1388147
11086 1388147 1354928 1298582 1255558 1279567 1233391 1225744 1352797 1322547 1262134 1275164 1218652
11075 1218652 1081486 1094893 1141711 1081990 1064178 1043772 1130089 1081481 903507 832252 775761
11064 775761 746610 681152 756171 830345 789874 827063 868469 882754 899370 929835 961127
11053 961127 973011 966665 941267 899215 923174 934776 882700 819304 818864 862149 873200 740723
11041 740723 606036 579307 588830 558215 485315 436675 451469 540214 595213 626643 599746
11030 599746 522910 502982 480824 426536 356370 458634 481878 435539 391110 348967 266686
11019 266686 182791 161415 217637 135523 124314 206076 181410 264885 519598 462756 260367
11008 260367 175607 158108 118953 29449 -702 140227 181250 118523 10994 27731 -29521
10997 -29521 89699 251541 227615 130476 202396 323808 460707 409936 370254 370164 351428
10986 351428 309027 346462 433600 379638 425634 428067 444706 440567 311769 402742 467995 414925
10974 414925 358250 374187 340004 307690 299955 320143 407817 416414 442038 495837 359681 436130
10962 436130 500846 537611 487733 408250 484070 478498 448381 460386 628123 742919 685026
10951 685026 647729 703359 727088 628140 690098 745834 734539 750210 772433 869033 886642
10940 886642 850722 853925 866734 886272 820328 792157 785144 746377 770109 837044 870872 845219
10928 845219 751755 770776 762660 692129 662132 624902 664790 637063 626514 623561 711269 778627
10916 778627 774650 918850 1066690 1091719 991759 980189 1017288 987370 970805 836329 916040
10905 916040 1057932 937223 751532 690272 633223 553428 669882 751326 866499 778073
10895 778073 651630 671253 720506 681813 568387 660234 687240 715532 774415 781880 824955
10884 824955 770028 749728 828895 863721 966414 1023891 1046819 1093266 1147030 1228541 1161923
10873 1161923 1071630 1090793 982604 1004204 1023863 963198 862218 758249 725817 672703 697163
10862 697163 684932 730576 756493 768037 820511 759254 613687 560035 537925 502300 603828
10851 603828 722238 678999 761832 782138 726591 685814 620303 609434 643707 558295 575787
10840 575787 535711 473928 584137 663558 633410 548313 535083 525245 563065 573761 525890
10829 525890 520852 549796 603974 570772 459985 471515 510435 353276 313145 362751 419144
10818 419144 489925 465481 438198 553733 635362 664266 720867 805377 877966 789819 780636
10807 780636 882709 792053 804409 788004 824537 785949 797957 818235 877476 928998 909348
10796 909348 997441 999918 1033545 969467 939899 981764 1043794 1160881 1106031 1102668 1106956 1186992
10784 1186992 1229134 1331620 1400176 1406582 1386535 1369871 1408806 1563067 1603047 1629853 1679599
10773 1679599 1673577 1670693 1740155 1863379 1901799 1875491 1865196 1981602 2093408 2264680 2413067
10762 2413067 2394725 2427885 2429848 2431470 2476839 2560724 2660171 2818478 2981956 3236203 3326345
10751 3326345 3522687 3765364 3988420 4280554 4532563 4824257 5092683 5470329 6077214
10742 6077214 6746154 7407113 8100396 8966992 9981310 11186039 12476893 14009364 15897328
10733 15897328 18235028 21148594 24507420 28424994 32985305 38367667 44649901 51585787
10725 51585787 58926043 66452659 73603188 79804146 84331143 86725074 87043395 85396099
10717 85396099 81934672 77219029 72049255 67172584 62958889 59579186 57207162 55696308
10709 55696308 55049169 55158568 55718562 56834505 58374925 60292511 62275972 64179748
10701 64179748 65854677 67255478 68529760 69548742 70607361 71652521 72720075 73813727
10693 73813727 75095678 76850686 78930278 81078551 83319416 85407549 87036918 88058660
10685 88058660 88464137 88459533 87837807 86692890 85206653 83552569 81919817 80397193 79208621
10676 79208621 78286928 77774349 77525561 77359345 77323277 77266301 77032756 76685132 76206889 75541874
10666 75541874 74820357 74143713 73787149 73780288 74469035 75839814 77994250 80926433 84655983
10657 84655983 89153770 94100983 99119141 104034004 108488964 111876110 113710175 113547214
10649 113547214 111089000 106613437 100480687 93236130 85604794 78156930 71335608 65404553
10641 65404553 60366196 56209953 52629170 49484481 46902158 44675625 42640048 40815636
10633 40815636 39169279 37667597 36347533 34955098 33589997 32399462 31221008 30271406
10625 30271406 29435294 28509024 27666918 26837815 26108671 25411711 24822268 24216805 23514405
10616 23514405 22794169 22145756 21431312 20572229 19776710 18814608 18052275 17235346 16353834
10607 16353834 15627110 14960296 14247136 13519284 12771306 12189921 11603241 11074456 10559703
10598 10559703 10050405 9561492 9202762 8726729 8272497 7921409 7548934 7108953 6762468
10589 6762468 6492246 6201161 5938139 5723568 5435178 5182786 4895405 4773486 4580709
10580 4580709 4344615 4183804 4041201 3846903 3672672 3468633 3325530 3125656 3101862 3020119
10570 3020119 2961949 2894617 2797367 2726732 2625486 2529544 2374098 2278638 2140804 2041451 2038279
10559 2038279 2048978 2131816 2103217 2009376 1983328 1937472 1884087 1813566 1777071 1774397 1764126
10548 1764126 1687242 1522776 1414849 1331427 1387787 1477725 1534843 1413570 1364671 1297239 1206419
10537 1206419 1308878 1506334 1566984 1461783 1409611 1534333 1701459 1743221 1750597 1747542 1784654
10526 1784654 1722782 1648069 1513707 1402955 1347409 1289126 1260491 1353228 1335146 1351817 1416332
10515 1416332 1478495 1453870 1297974 1241800 1231561 1266376 1342242 1403334 1430473 1525974 1500072
10504 1500072 1509731 1575500 1575107 1588095 1548652 1470877 1438670 1413929 1450368 1492448 1532319 1558951
10492 1558951 1535619 1527324 1545520 1437707 1394030 1444078 1366320 1364280 1432342 1376939 1377504 1319619
10480 1319619 1276772 1282320 1356756 1309338 1281068 1325608 1291001 1257447 1217606 1112674 1082640
10469 1082640 1101899 1137514 1170624 1151554 1180374 1111336 1086912 1107251 980725 979515 976654
10458 976654 929034 871871 848078 947533 892332 885292 873907 909506 874273 867737 827692 725248
10446 725248 621263 612302 654864 655797 537459 543957 507029 515064 629378 717372 738190 678647
10434 678647 639068 578788 570603 676481 718490 652395 568301 380490 376364 415834 553365
10423 553365 584723 634634 544132 415605 235220 189615 251689 397224 430892 361504 285478
10412 285478 235149 227443 309538 286820 178205 219100 206230 256447 325916 382017 373841 289318
10400 289318 262160 297499 315154 323825 325526 297234 311818 302309 305510 218653 198385 192095
10388 192095 142238 53226 42722 23248 69839 130965 203418 259574 342639 276195 210920
10377 210920 203819 203856 227005 271656 315161 212306 128425 118431 79643 13811 91497 109112
10365 109112 135657 157508 241715 262535 187024 244641 227847 281822 297226 296332 300778 224846
10353 224846 166802 209583 170690 141330 168128 167316 194496 253809 272068 328230 494168 485127
10341 485127 473286 479369 441461 367159 358048 191044 201208 287772 261584 236447 319099 449182
10329 449182 436093 379706 296603 393040 459993 553182 612846 544345 616834 630415 706086
10318 706086 679803 626136 528477 445958 436862 386626 492979 610983 605341 549788 449928
10307 449928 456528 430162 400549 441503 551254 498139 318809 250648 225349 278869 370686
10296 370686 369574 452517 484690 444593 449717 374348 333288 374342 331583 361826 432863 397546
10284 397546 404563 508778 570505 501321 341063 369503 540308 476921 308856 332598 357928
10273 357928 335631 510864 638201 591363 552636 492981 364106 343678 303621 281163 344775
10262 344775 391857 570906 574714 434143 591081 629684 636664 597147 576595 613703 640484
10251 640484 687978 597005 532748 550556 608046 645042 653549 617854 598480 497964 334838
10240 334838 261999 354218 377677 396473 438636 350900 354964 288813 272117 223317 160278 48412
10228 48412 107863 145758 141330 148096 154021 184973 138511 30323 -12889 18484 -8543 15119
10216 15119 98069 137141 -23186 -14825 71139 109870 75341 90327 38573 45094 18785 32613
10204 32613 55511 31220 77962 37574 -28542 13001 139499 133902 29616 51052 129069
10193 129069 259361 331493 311230 287601 264609 153643 23291 31002 19464 24760 42550
10182 42550 39928 123081 112417 41550 -7649 51475 37958 13255 -120503 -126530 -122977 -138286
10170 -138286 -114149 -159887 -213160 -85389 55897 -14186 -36057 -138594 -213107 -144681 -97628
10159 -97628 -39932 114106 97665 96834 45070 23381 94951 150866 80618 126556 118374 17743
10147 17743 -4723 -57449 -68662 -73117 -102934 -221578 -157675 -211310 -164946 -58956 -49936 -77385
10135 -77385 -99004 -129716 -162906 -105161 -54582 -179644 -173167 -22467 23300 40484 32772 -46146
10123 -46146 -122015 -67259 -32152 -78995 -70924 -75601 18026 -29070 -60515 -13410 -107987 -158675
10111 -158675 -135440 -112862 -33969 -69358 -73803 -28049 -12957 -52140 -110313 -120637 -130315 -78094
10099 -78094 -6170 27523 11081 47818 -14557 -149243 -142225 -150951 -196868 -145746 -95674 30863
10087 30863 47385 -37183 20088 39938 -15410 -99173 -67576 -73075 -156676 -174832 -112182 -7000
10075 -7000 109717 66579 -46960 -83818 -64351 -105176 -50088 40834 136153 142678 94425 76829
10063 76829 -2378 -51840 -64853 -57539 -55515 -110237 -177400 -100261 -2598 -48580 -37484 18405
10051 18405 70529 134614 42378 -3796 -30775 -46725 22747 -13916 -18247 -39844 75409 127640
10039 127640 12189 -3313 77935 115337 151101 135925 -5731 -69801 -7302 -13712 -68382
10028 -68382 -94288 -83055 -28848 -26190 -16564 95719 146336 214410 191151 184139 144299 176962
10016 176962 100794 29684 27994 50796 69145 93466 174371 176633 144994 265013 292639 172040
10004 172040 -34569 -123641 -152409 -62055 -6967 -59849 -112842 -27117 -24602 -70292 -43186
9993 -43186 -165453 -96919 18192 125500 137434 83150 -35925 -33377 -39062 -63858 -20896
9982 -20896 -10381 8049 -78002 -176550 -177194 -63665 -12663 9470 -29527 -89825 -43687 51919
9970 51919 39904 -6723 -85001 15576 -22159 -76040 -79525 -96664 -93306 -66018 -78817 -5252
9958 -5252 -34139 -88695 -104640 -77756 -62255 -30996 45263 -16768 -72623 -136137 -94874 -3475
9946 -3475 97275 -42252 -145833 -210571 -165283 -32215 34366 23415 -2646 -26884 -128558
9935 -128558 -170843 -139994 -202654 -128462 -122871 -69147 21846 1722 -1928 152979 139020 102022
9923 102022 5343 -4234 143181 -22370 47447 121520 87356 68047 146346 205105 119366
9912 119366 108782 80951 34412 102137 79719 50763 263691 239644 135257 108315 81196
9901 81196 177655 216068 156054 172537 106028 159348 95075 9502 51471 31838 65921 70484
9889 70484 163669 192517 115091 84097 79088 -19791 -136501 -159553 -48549 -31687 16933 67786
9877 67786 78181 176336 218917 203868 170844 162635 283659 340677 302292 395668 456910 444181
9865 444181 356015 487085 508451 537706 517605 368302 219628 140504 99207 181896 158641
9854 158641 203450 151058 117289 180065 189368 187119 130848 94300 239045 349180 388479 362880
9842 362880 330861 305835 310958 331263 287967 306049 225051 200827 173194 127103 62222 88571
9830 88571 153552 245631 249523 195042 151130 191855 228854 238330 165457 123493 163499 240971
9818 240971 257174 232888 218004 219871 159774 207592 208775 141184 169225 177544 165084 187964
9806 187964 178862 214227 272772 271598 220845 103898 76166 110538 128034 128532 168449 109855
9794 109855 176745 181121 132335 195831 238266 225060 221562 152389 147603 115901 102607 156478
9782 156478 91188 17210 50991 125579 89905 -23588 -42225 -32363 -82249 -129112 -97397 -45989
9770 -45989 37698 16399 -6337 -102714 -142036 -137130 -100932 -80517 -23274 64741 -63244 -193642
9758 -193642 -155546 -103306 -158166 -213187 -106029 -49327 -51026 -68500 -91558 -70448 -133139 -205809
9746 -205809 -228170 -219725 -188694 -61206 -25182 -60951 -46771 -57734 -121131 -68608 -22635 115295
9734 115295 76180 4101 -4424 31984 133543 18569 -224307 -278139 -193425 -30874 74985
9723 74985 1211 -114152 -33545 -105889 -102725 -96019 -125017 -67441 -103722 -153047 -74708 -63018
9711 -63018 -59998 83824 23328 -38366 -23153 -112594 -117974 938 95913 157509 169607 91622
9699 91622 119395 128684 124663 178619 216368 178380 152791 135081 146610 138673 131988 109988 183928
9686 183928 130670 28793 53025 99855 67992 190183 270010 303759 380201 345631 261982
9675 261982 169105 21510 23813 166263 202504 220560 279510 302839 314565 219818 183838
9664 183838 198763 198097 214917 185070 265589 354142 392420 260476 227227 235922 270091 316988
9652 316988 285634 298061 311606 337534 253071 229378 244941 236503 237200 311624 321083 275742
9640 275742 335688 325127 335792 418789 366442 414596 433286 539783 552893 506430 515360 509941
9628 509941 588867 665896 729261 723331 712976 704220 663628 642291 654518 728495 694477 727660
9616 727660 684594 675263 685004 708943 751484 819886 779317 772266 827707 910856 1007409 1004289
9604 1004289 1047459 1070135 1145225 1156099 1151129 1120992 1164826 1267019 1290791 1292528 1381349 1329943
9592 1329943 1319138 1175402 1234766 1347203 1343949 1388795 1383628 1335262 1327503 1367993 1465557 1562098
9580 1562098 1675378 1787362 1938494 1988653 2102516 2095740 2199099 2255554 2393862 2535010
9570 2535010 2591068 2757611 3004333 3279296 3534644 3979554 4507472 5033236 5571598 6201262
9560 6201262 6942419 7642477 8430269 9394886 10293115 11041301 11519492 11850698 12120259 12468346
9550 12468346 12833316 13090478 13406881 13581614 13363665 13018878 12769141 12622556 12490984
9541 12490984 12281279 12203110 12352924 12547772 12983433 13547617 14271251 15259535 16378799
9532 16378799 17585357 18921503 20233074 21711324 23048979 24488035 26004904 27579496
9524 27579496 29119612 30667251 32102640 33376794 34483680 35064901 35368100 35655791 36113237
9515 36113237 36618946 37254489 37809732 38195422 38462986 38468865 38322322 38175691 38302782 38484666
9505 38484666 38862165 39372472 39906984 40535416 41251956 42125711 43274591 44538750 45807389
9496 45807389 46967257 47921224 48719315 49371862 49895516 50538897 51469288 52704159 54095961
9487 54095961 55747577 57630471 59689169 62095363 64695817 67736598 70976440 74275326
9479 74275326 77410715 80048413 81756107 82078830 80858574 78295049 74817203 71152496
9471 71152496 67651669 64632272 62316516 60564020 59396215 58786814 58544433 58458830 58718090
9462 58718090 59139384 59638960 60336031 61551199 63005218 64590016 66355614 68089761 69706481
9453 69706481 71038393 71995436 73015192 74088059 75199977 76320268 77442264 78687402
9445 78687402 79870328 80800860 81372949 81412968 80670480 78917289 76245826 72969899 69390302
9436 69390302 66041772 63082706 60575107 58679431 57298544 56284602 55565307 54915909
9428 54915909 54390085 54097600 54029882 54044826 54154211 54069540 53641337 52989287 52015232 50968273
9418 50968273 49963558 48982102 48240703 47758581 47555037 47680849 48185132 49057601 50087807
9409 50087807 51403276 52681887 53515252 53532063 52570947 50993403 48825667 46197649 43407627
9400 43407627 40705654 38173120 35737713 33632556 31717738 30079651 28773776 27784085
9392 27784085 26853640 26049491 25361304 24694916 23939584 23159712 22327657 21489718 20629796
9383 20629796 19806391 19074077 18358620 17770865 17165737 16669610 16283054 15866602 15495971
9374 15495971 15061475 14777029 14415692 14098754 13774832 13418857 13122955 12827550 12545807
9365 12545807 12206701 11814389 11448272 11194501 10951848 10598604 10224502 9947040 9796751
9356 9796751 9621244 9359682 9122690 8878620 8592740 8410420 8164013 7886927 7755873 7673674
9346 7673674 7410926 7174340 6982236 6854038 6803133 6765794 6622217 6502185 6280208 6102559
9336 6102559 5945448 5819264 5835589 5861625 5844671 5836084 5748468 5692108 5677481 5756035 5717703
9325 5717703 5710223 5676566 5650160 5546156 5490811 5497002 5567313 5570469 5658896 5661859 5581227 5602282
9313 5602282 5609620 5639324 5674577 5774015 5933400 6083593 6169207 6293143 6306274 6303241 6262329
9302 6262329 6278813 6369397 6408510 6441948 6513039 6484376 6707443 7032471 7260379 7415261 7598068
9291 7598068 7954019 8354659 8821723 9284244 9708641 10243831 10809152 11335192 11738809 12205611
9281 12205611 12572113 12895761 13448607 14073138 15031165 16310559 17775223 19444695 21460549
9272 21460549 23757899 26180775 28882842 31899787 34666586 36858129 38198463 38438907
9264 38438907 37720532 36413424 34820031 33361399 32024788 31169275 30702876 30464175 30725496
9255 30725496 31230556 31948617 33019555 34321606 35660694 36879631 37832774 38546658 38818526
9246 38818526 38894304 39204497 39715656 40508832 41844988 43712684 46149915 49204015 52841437
9237 52841437 57001920 61742819 66749139 71787572 76603875 80866111 84445421 87234883
9229 87234883 89382110 91167040 92751612 94091036 95230376 95990377 96022536 95178358 93700007
9220 93700007 91864473 89914819 88153805 86638100 85288162 84056256 83095102 82593592
9212 82593592 82586384 83318683 84646797 86165344 88037991 90167120 92614240 95462932 98998623
9203 98998623 103106648 107919922 113422138 119374866 125271569 130229474 133822367 135890397
9195 135890397 136958793 137617713 138285240 139128987 139976557 140550127 140492242 139497559 137517778
9186 137517778 134685509 131193840 127362186 123611931 120368104 117763728 116001210 114977714
9178 114977714 114548616 114510244 114537150 114416241 114195109 113951192 113747727 113790414 114011237 114209568
9168 114209568 114481418 115007666 116027371 117554239 119594421 122029998 124776429 127991111
9160 127991111 131400118 135233347 139409538 143293354 146620890 148844161 149073250 147309530
9152 147309530 143814721 139215273 134258393 129432220 124899080 120675517 116650225 112687980
9144 112687980 108905828 105553635 102546827 100027304 97737267 95785151 94068650 92681286
9136 92681286 91567447 90780530 90195666 89731092 89569562 89692934 90236495 90869233 91693407
9127 91693407 92652435 93641059 94795893 95867413 96581463 97094966 97396977 97194195 96591459
9118 96591459 95695434 94888596 94512779 95118291 96478899 97605055 97336191 94964793 90764468
9109 90764468 85264305 79515422 74269602 69905798 66431879 63498565 61029796 58892943
9101 58892943 57079402 55414894 53882226 52542127 51130382 49625459 48180791 46819291
9093 46819291 45600437 44588255 43817593 43383705 43347451 43457314 43783038 44166661 44286696
9084 44286696 44238422 44078812 43622732 42896811 41759009 40298913 38546932 36426520 34150501
9075 34150501 31972074 30048838 28204037 26586755 25208765 23873625 22778121 21859538
9067 21859538 20921397 20126488 19236249 18461102 17813765 17248166 16515360 15842593 15270584
9058 15270584 14771888 14353292 14010492 13707924 13271618 12778255 12448331 12151841 11798795
9049 11798795 11396304 11112084 10817562 10522674 10182613 9890347 9656197 9365534 9118497
9040 9118497 8889279 8591604 8255556 7909233 7602686 7357946 7120580 6885658 6649371 6385551
9030 6385551 6257359 6101846 6002097 5700487 5479735 5267886 5135796 5002904 4922690 4780120
9020 4780120 4703908 4691251 4695072 4595398 4467138 4415670 4396423 4298770 4283141 4186065 4128035
9009 4128035 4121323 4036145 3983251 3978903 4092459 4128606 4033655 3992913 4051369 4088401 4168795 4288347
8997 4288347 4279399 4204960 4088879 3914119 3750991 3460687 3402754 3365104 3330188 3261825 3214809
8986 3214809 3178306 3149215 3049367 3010425 2962812 2946114 2961004 2930812 2837630 2808961 2795471
8975 2795471 2749283 2816021 2855284 2753108 2712213 2829310 2765209 2718870 2703044 2574161 2485544
8964 2485544 2420586 2391229 2357777 2449893 2518677 2513409 2501699 2453717 2352917 2457817 2583521
8953 2583521 2592419 2597136 2523193 2373173 2236282 2166914 2197790 2277152 2277209 2074563 2035949 1936917
8941 1936917 1862220 1920269 1841188 1786833 1805494 1867552 1918943 1875570 1841916 1874184 1975441
8930 1975441 2004379 1932752 1901961 1873618 1896474 1881637 1769947 1700108 1673000 1604289 1646699
8919 1646699 1685801 1736544 1760838 1829745 1794382 1676639 1612238 1497485 1418223 1445027 1439248
8908 1439248 1405826 1376970 1267232 1196893 1249922 1221888 1174368 1139051 1245871 1303198 1296689
8897 1296689 1298341 1381250 1314395 1243545 1301076 1331399 1236270 1218082 1225319 1321294 1407220 1330318
8885 1330318 1210319 1227098 1231542 1306835 1372788 1390767 1515339 1657171 1616251 1680849 1862445
8874 1862445 1953439 2005749 2030691 1944553 1925424 1929865 1912538 1939111 1886586 1798574 1704426 1727164
8862 1727164 1767039 1750118 1770308 1738314 1717656 1689066 1768165 1787383 1871103 1928721 1980891
8851 1980891 2081839 2084407 2042292 2116651 2131595 2164134 2198921 2265313 2331653 2486640 2672336
8840 2672336 2736731 2797371 2848518 2851062 2857044 2921649 3108661 3193362 3228550 3410495 3601636
8829 3601636 3694659 3715404 3833943 3925000 3846488 3736060 3828345 3962062 3954129 4044132 4130236
8818 4130236 4231612 4238632 4306104 4422893 4722670 4964907 5021983 5190878 5585903 5992821
8808 5992821 6401612 6850778 7477084 8228378 9133494 10248933 11803982 13607735 15815133
8799 15815133 18583175 22059027 26634834 32704539 40108198 48624046 57985744 68187791
8791 68187791 80559170 97716629 121488588 149613991 172481339 179376901 170880405
8784 170880405 152039602 128142509 105855438 88637743 75929548 66662535 59695269
8777 59695269 54335356 50110051 46805053 44195718 42200230 40558240 39093717 37890512
8769 37890512 36748347 35852432 35274961 34902065 34793717 34777169 34936378 35437334 36085592
8760 36085592 37140997 38610103 40460886 43039340 46494726 50846860 56055251 62563107
8752 62563107 70967390 81788581 95358512 111228953 128279342 146580145 168737036
8745 168737036 200345285 246474853 303726150 352120212 366865523 349378585 310433118
8738 310433118 260654537 214190813 178535256 152609253 133460333 118968813 107688597
8731 107688597 98848848 91810618 86265145 81816430 78097845 74768638 71752635 69028534
8723 69028534 66637093 64642193 62883025 61293223 60019744 58963718 58124778 57602747
8715 57602747 57289988 57340379 57956437 59150349 60688583 62912502 65586614 68243180 71531718
8706 71531718 75820237 81425381 88011986 94936987 102354054 111520014 124616527 144132793
8698 144132793 168813038 190701068 198643639 190807243 172274215 148044624 124219391
8691 124219391 105268733 91194501 80743355 72675826 66216325 61007107 56852159 53470575
8683 53470575 50597229 48219849 45967418 44015870 42138261 40392697 38787243 37495144
8675 37495144 36240606 35065132 34122305 33285832 32376120 31543571 30950530 30547643 30284969
8666 30284969 30137408 30052411 29854906 29467109 28810771 28088036 27267844 26462747 25535960 24382185
8656 24382185 23059452 21776523 20566830 19487290 18474686 17487301 16775937 15939004 14978360
8647 14978360 14189468 13514855 12914638 12431991 11726300 11139350 10575093 10016143 9515740
8638 9515740 9132093 8743805 8394345 8121852 7886385 7561116 7208117 6965965 6781578 6529157
8628 6529157 6329476 6264660 6225433 6148879 5975211 5845050 5714993 5666238 5559731 5496508
8618 5496508 5351525 5184292 5070099 5023949 4813152 4617139 4375418 4140016 3888249 3728859
8608 3728859 3639864 3627921 3511233 3383716 3255701 3060562 2925434 2891118 2935720 2919341
8598 2919341 2834324 2821846 2787528 2752550 2782801 2779746 2709608 2630511 2550215 2567124 2520630 2503240
8586 2503240 2574517 2605265 2527301 2469685 2448815 2561893 2600040 2698803 2691341 2667018 2661945 2625262
8574 2625262 2710548 2769181 2776235 2822580 2826720 2809104 2854926 2817381 2602448 2521152 2555156 2526639
8562 2526639 2521198 2512672 2520517 2504546 2477441 2392994 2272138 2204699 2252971 2238517 2197305 2122877
8550 2122877 2236124 2314519 2220816 2120801 2045163 2070204 2128599 2183621 2202995 2241897 2222129
8539 2222129 2226220 2200897 2208718 2215045 2177338 2110065 2154669 2139951 2088743 2055726 1996828 1897509
8527 1897509 1881761 1993432 2043581 2115076 1994430 1953394 1848304 1832529 1838182 1844710 1862333
8516 1862333 1851583 1959584 1932199 1948277 1885380 1781366 1616079 1525406 1519747 1467641 1493451
8505 1493451 1558589 1532604 1633465 1690924 1585646 1538568 1565441 1524607 1421753 1434953 1587410
8494 1587410 1582497 1528551 1519946 1537727 1514160 1593081 1648736 1580329 1537001 1565770 1551900 1502247
8482 1502247 1453724 1408025 1296420 1224165 1191049 1120096 1151047 1126235 977038 880283 912234
8471 912234 938551 1027452 963271 962953 876802 823505 874445 971696 1029983 1064139 925293 813927
8459 813927 856333 877364 770202 731682 730967 812228 984452 976057 1056643 1082922 990440 916486
8447 916486 968387 922172 957544 966214 1051996 1130341 1041563 946416 978851 1080605 1065228 1028817
8435 1028817 941947 884904 894699 926927 905690 963926 966623 919245 873023 907533 1029150 1021239
8423 1021239 923282 968392 996198 950066 898400 862620 873874 887106 806217 766240 846008
8412 846008 871222 844357 817687 811220 842891 815799 770025 786070 872583 914693 914341 932593
8400 932593 904760 853993 728443 697983 671994 704751 757858 870501 887344 893917 920561
8389 920561 975105 1060592 1155666 1173378 1247492 1423920 1698576 1852169 1815199 1718137 1462642
8378 1462642 1223187 1139226 1095898 1146474 1176298 1112791 996857 923838 946978 919522 947999
8367 947999 875218 810318 856096 878139 817815 819660 814919 766995 745430 733833 624752 647234
8355 647234 735921 782276 763251 761213 898933 1007777 1012442 1025349 1122572 1168109 1167154 1240725
8343 1240725 1356208 1450877 1640452 1808439 2104631 2391460 2508019 2490223 2288130 1948542
8333 1948542 1606355 1460581 1319391 1172368 1105198 1114033 1142117 1061544 1056556 1093956 1120544
8322 1120544 1115028 1140844 1044947 916279 963646 1060629 1042235 895335 859046 934593 921432
8311 921432 862631 834245 901415 915299 948899 921526 959872 994786 1005334 1059713 1089447 1035651
8299 1035651 1050509 983521 1006708 1049326 1249865 1497728 1485743 1474693 1475986 1358091 1320004
8288 1320004 1314689 1301107 1223529 1238431 1083628 948283 869405 842809 848725 873031 809407
8277 809407 788405 835951 824318 870834 860663 715318 711023 707892 686922 714671 747857 771007
8265 771007 712622 641915 607146 666423 640021 612853 594845 599746 612128 590318 660359 702451
8253 702451 685871 764878 755300 624244 591846 637955 624122 597015 552565 523210 484628 451231
8241 451231 466687 418341 447334 355826 329163 387230 427236 512480 576856 609863 547765 488581
8229 488581 476800 520607 544108 496660 556350 612020 528838 517549 505833 495529 462472 400215
8217 400215 419845 440170 400899 440522 494783 530940 491234 327191 157482 306730 461259
8206 461259 480654 483465 420857 472408 454331 426887 473523 494736 525467 663360 654232 587248
8194 587248 574085 621531 553805 532088 436404 412540 467528 493342 662939 672312 634268 645526
8182 645526 725460 749898 759678 707051 709808 633717 627938 605229 526279 575979 561728 526867
8170 526867 572739 577276 634096 625884 552530 590644 649342 645039 598134 520793 483581 513273
8158 513273 584834 563729 501822 520942 640013 781249 807816 617541 719354 882078 1091827
8147 1091827 1151544 1180527 1239411 1288551 1311076 1277784 1212421 1116327 938712 835681 732601
8136 732601 631382 504155 591353 644029 643913 762341 775032 746015 664925 673658 677849 645003
8124 645003 583384 551278 682989 762141 825215 892150 912934 859937 897066 884110 949554
8113 949554 954308 1033241 1090398 1171677 1197231 1151525 1102002 1000930 947201 874750 733714
8102 733714 603375 704675 826188 926866 882043 778679 741083 694047 688164 704144 712568
8091 712568 685696 646125 694677 608829 551007 587427 620371 572228 570549 486760 496922 526906
8079 526906 618542 675277 602335 471340 488556 525459 531034 560681 605414 541293 502886 383762
8067 383762 368368 449998 457338 459185 395390 339037 369581 424623 367829 310021 343583 415015
8055 415015 411321 374163 290334 352311 417327 395259 325466 338509 301454 263164 219504 163684
8043 163684 168634 151359 260760 252026 227955 183971 214543 265346 338792 344766 231514 173464
8031 173464 173719 180728 95877 69248 119623 164076 75566 226984 307643 258223 163042 142683
8019 142683 281909 358254 377195 343812 363182 330126 322537 292108 240527 290907 328522 250428
8007 250428 240336 346542 465357 498932 419166 320361 291299 300699 246734 350434 488412
7996 488412 532230 463569 441981 350096 312906 210602 254703 386692 458529 450503 513094
7985 513094 458903 387180 391599 333509 269230 233010 195827 219880 299121 166715 55195
7974 55195 171746 306665 294390 270856 233212 210062 210921 291970 439113 486151 429410 351527
7962 351527 279296 288085 423896 350586 233237 307378 300346 414662 400226 361860 407389
7951 407389 530337 499988 463583 367416 292587 357564 349798 267271 234461 351787 421694
7940 421694 365899 328294 406866 461033 397670 349775 274134 287745 202590 171595 247576 276893
7928 276893 276057 274288 309656 329331 318511 137560 131660 180042 113809 95341 56599 31422
7916 31422 89107 239932 219928 140034 192193 213824 238890 175671 82732 105863 153347 189224
7904 189224 225042 214291 295530 380522 311729 213520 228023 261575 174147 94954 21199 37514
7892 37514 -38063 -63992 158942 198025 203289 160392 145650 102203 140757 249096 299635 275214
7880 275214 216130 241136 211689 209657 267600 295568 235688 292905 282380 256948 296148 301186
7868 301186 212173 174586 258065 256387 309044 286391 319346 323497 294010 267152 153169 114859
7856 114859 136516 204299 198688 175513 192843 237413 188923 195224 228708 209080 203126 218852
7844 218852 222686 184695 158786 83479 71769 64771 145715 125185 90621 60442 134994 77969
7832 77969 -39736 41962 41146 -31959 -95056 -24903 55029 121851 154642 94508 142075 134089
7820 134089 130421 89072 103069 107316 185754 145856 123249 59956 8808 156536 192674 186324
7808 186324 137865 81656 48620 41390 81047 156144 197565 278137 223974 123239 35655 43696
7796 43696 19395 -170007 -165108 -58091 133261 227984 180053 25869 14209 86287 240327
7785 240327 166484 90893 136336 284600 263142 186209 146510 186253 6855 -60364 40084
7774 40084 182779 256785 168791 -4658 54813 141710 255819 267533 287568 219030 253557
7763 253557 290636 278087 143000 124393 176441 193916 216247 266912 319507 316987 305222 249973
7751 249973 218147 150636 24954 -5469 -29100 56769 68727 71163 97746 116413 12920
7740 12920 18511 65121 98941 144130 39589 -96257 -113462 -13955 126242 88388 78823 199877
7728 199877 322970 219379 124311 107609 162060 181692 150617 138359 150987 48983 -338
7717 -338 -21695 52315 87492 243138 303377 208213 175628 200258 290302 290978 186799 50101
7705 50101 6687 41588 14939 92953 212983 186009 167323 174350 124269 86729 85273 101569
7693 101569 181076 274574 264496 147318 149000 192261 199622 163612 75455 98218 163816 193409
7681 193409 221823 230664 192303 217914 272241 289097 272027 301761 252379 271962 301416 276903
7669 276903 217881 176542 82378 35974 92767 123325 77810 -20682 13300 34361 70182 36915
7657 36915 47915 122062 153566 164107 142647 76460 -34263 -110770 -58478 -6040 -20146 123523
7645 123523 204231 268131 175387 93530 114436 88078 37798 76688 88900 115654 74050 69601
7633 69601 69414 172766 196842 215746 274282 263499 139852 106769 -3530 -72558 -59104 -79826
7621 -79826 29068 63189 94761 122544 65046 13428 20827 -22589 -50258 -107417 -42818 -24459
7609 -24459 -53021 -21838 -86071 -35177 132245 109291 96406 108713 165533 114055 60196 51883
7597 51883 57244 114809 33953 -16937 27927 -13554 -24831 26361 97705 129347 105030 135506
7585 135506 321517 350498 197762 77546 109277 98682 97057 113606 106919 211708 302702
7574 302702 225159 128876 195481 239638 197626 198566 199078 190309 106832 -32502 34841 94876
7562 94876 113562 192689 249586 171308 166121 131856 89938 72722 136692 147650 157152 103772
7550 103772 6867 -4845 -388 181447 238803 204456 128692 53723 22331 -22271 36138 23367
7538 23367 34891 108682 176214 130181 133466 90861 123951 168395 243380 301757 275210 163835
7526 163835 164571 160452 132564 142382 225213 266794 130582 -10392 -102992 -55844 16825 11292
7514 11292 98486 70493 49748 153358 191364 135061 166421 162556 35283 87421 180774 105252
7502 105252 153181 192080 220359 190839 109702 -18888 40747 135011 209494 248897 262037
7491 262037 272709 217906 143576 22107 165583 246124 250772 226578 120481 124618 142318
7480 142318 171449 144662 43043 -51775 14237 39462 -33279 -57677 -65709 -12736 -49015 -62409
7468 -62409 -131132 -118260 -26062 22650 75476 158661 144286 127291 129490 183083 188320 111384
7456 111384 156167 200662 213576 249329 230571 297256 283282 151977 76608 -28869 -48255
7445 -48255 -31605 -31276 73372 169920 219085 81507 73444 133797 120073 58078 47983 118353
7433 118353 105490 77733 -24066 -88210 -128436 -118216 -18142 69091 171241 92507 49869
7422 49869 210994 181642 45656 -2394 16395 32813 27975 -6498 93155 69108 76474 123502
7410 123502 94266 4703 -20418 -39849 22394 91163 65544 160467 259086 307498 342593 292028
7398 292028 348235 448418 296971 152429 31175 25128 7762 72655 206453 112265 -50372
7387 -50372 -22368 -7798 -54576 -105956 -112101 -108719 -67781 23183 126026 149418 135033 122311
7375 122311 101243 79905 107100 227129 232048 180631 139637 175702 182514 186596 214992 241222
7363 241222 254948 240116 125575 -37464 -131166 -95249 -28561 53460 79977 37196 16747
7352 16747 51250 110717 -13293 -35509 -17006 -72730 -46394 -116174 -93985 -104437 -29935 44149
7340 44149 179450 145419 71311 70915 106075 46142 -38175 -30363 -81455 8663 157049 218684
7328 218684 118127 -1071 -41271 15463 83619 196314 154777 187971 213654 226866 127132
7317 127132 140463 160869 188920 191889 162564 151988 259904 244158 199481 256812 247372 179017
7305 179017 201444 206590 42026 -31305 -8806 24177 96621 145870 83329 -21152 36989
7294 36989 76219 -61620 32713 61872 52816 182234 189620 36416 54143 136393 62035 24396
7282 24396 22815 -27619 -83988 -30093 10657 -104740 -85739 -39446 -92426 14415 36124 3099
7270 3099 27871 30602 138009 87821 -14516 -92070 -133211 -196938 -157930 -130250 -20098 44596
7258 44596 132546 238146 209052 139759 223931 239455 128311 55151 -21121 -52696 -136224
7247 -136224 -123337 -66823 -59158 -45964 8070 18891 61305 202510 199611 129799 68418 121606
7235 121606 42987 -17928 -28060 -73127 -27204 34226 36270 30611 14640 61759 183976 155488
7223 155488 19182 43747 11678 -52594 -19067 30516 8725 -76627 -21791 127753 101748
7212 101748 58129 149654 151699 96576 75470 104443 190047 128587 92759 120548 151529 189472
7200 189472 213028 68288 36917 114222 162307 91524 -34213 -5225 67297 94064 116380
7189 116380 102294 17722 11455 81350 60755 78209 53151 -51574 -20727 -46169 -26115 107589
7177 107589 130189 199045 199286 235890 170385 59959 -1420 63325 229028 224526 158831 117998
7165 117998 46000 135471 123299 38767 13617 76335 65943 -76786 -100889 -101889 -39368 127852
7153 127852 88644 128709 91725 13178 22280 53940 -37678 -90298 -67536 -16591 77141 121642
7141 121642 113351 126538 138830 101593 160998 164574 148385 80565 -5082 45506 -5786 -100056
7129 -100056 -111824 -66729 -97587 -124498 -109529 -47656 -60202 -54990 24490 134466 26648
7118 26648 -9166 -21094 28881 25623 -89126 -115714 -96221 -96251 -25907 -83500 -189452 -216205
7106 -216205 -199366 -112543 8017 84634 36122 -75944 -130891 -117502 -102557 -3284 140919
7095 140919 199840 140989 179709 183829 201975 258076 215083 153534 84504 122468 161673 43473
7083 43473 26903 -30020 -65066 58417 178089 164938 158600 187026 184187 176275 237966 169502
7071 169502 26175 22654 42937 -45948 -132429 -45420 23393 69927 1229 2191 93343 152597
7059 152597 142594 103807 18599 -10953 114014 230061 294019 286394 236050 286159 277990 166049
7047 166049 44766 102978 119452 71064 88610 104248 159764 93134 96958 89907 21908 68092
7035 68092 68557 44774 79274 81855 76040 102146 122381 8421 -49630 39484 125876 336071
7023 336071 267162 238206 203648 46514 -95338 -107222 -55851 -103663 -27805 16472 77718
7012 77718 142530 84453 86139 52122 54607 43040 33488 95187 119662 100923 124398 238670
7000 238670 243283 145177 98237 68108 -8143 -31210 -76004 -71702 -74202 -3453 60961 55104
6988 55104 45067 81263 87173 93617 166113 194489 148944 116754 87961 52541 -6731 -6740 -10208
6975 -10208 90006 28091 -85067 -41604 122104 141321 16880 -987 107986 17570 -18772
6964 -18772 -41361 40581 40994 -42721 37717 83601 49011 107963 56839 65818 16093 77827
6952 77827 97903 4722 39647 56472 55861 60012 -24913 -89411 -23418 97538 198946 141647
6940 141647 210646 225987 146756 60285 66605 96954 95599 45657 -9746 -32661 83171 72000
6928 72000 8227 -6111 -24365 -19423 74964 99052 90525 51795 -65741 -138666 -116106 -100500
6916 -100500 -15856 -107668 -117259 -77435 -115307 -132369 -66954 -36247 -116652 -161045 -193897 -119054
6904 -119054 56122 136444 168074 205673 210940 138121 72691 114784 196313 95080 56683
6893 56683 74725 -6549 -42191 -88796 -157 31095 30831 21989 7604 18062 41768 99415
6881 99415 90610 187213 203814 255188 235668 216884 209196 199851 108269 -29808 -13738 144013
6869 144013 241795 128839 63779 -11793 -16541 74724 139029 108475 106002 56988 -29476 -74939
6857 -74939 -33993 -17228 12630 25461 60346 8358 -50178 -59767 -85036 -1614 17178 -49216
6845 -49216 -98938 -155166 -95805 17102 79350 -17590 16179 134549 96968 66912 86965
6834 86965 155296 113842 85275 68880 -6513 -52442 24108 30312 15569 7087 146594 150834
6822 150834 74050 47727 30013 -32522 -14093 8133 1059 68159 33802 92223 119504 46478
6810 46478 89419 190658 200359 147048 190294 184844 146393 -10399 -109067 10781 70397 131664
6798 131664 230269 155035 78383 133325 83591 65669 -36222 -64074 -6983 25187 71898
6787 71898 136967 177508 90737 56424 23967 -4006 -78067 -176762 -193255 -212284 -186859 -31480
6775 -31480 95318 142953 179267 159814 69046 -12145 -42135 23364 98172 136173 43960 -30833
6763 -30833 48492 48017 -3500 -49768 -108930 -84838 -54495 -120060 -41160 -32443 51246 115266
6751 115266 55145 -1996 27558 51298 60022 63379 10312 43430 86908 9561 -123403 -140774
6739 -140774 -65760 -11200 -81093 -94622 -48620 -38867 62979 147094 184207 139049 96476 38556
6727 38556 -28259 -117368 -84806 -25086 -8206 68085 62668 188399 318646 272457 147327
6716 147327 157520 129200 90908 73079 49802 15392 2195 5245 -6282 29089 10369 -137162
6704 -137162 -201789 -102702 -120580 -110519 -132655 -123480 25954 110250 78812 -6581 65379 -50497
6692 -50497 -118468 -160080 -164682 -109954 -93489 -171 96456 122654 207659 132694 41812 -20184
6680 -20184 21598 5379 129800 219607 131476 31793 -58316 -41216 -57877 -71394 -109406 -81091
6668 -81091 39037 41066 -26879 32365 131347 121839 119901 73199 199585 166603 61625 -1462
6656 -1462 144865 128411 53874 39240 -41765 -66830 -129252 -165447 -74764 -7697 26085 -1038
6644 -1038 -87658 -109059 -63361 -14149 -51630 -97343 -142165 -143021 -67096 -72266 -137587 -78109 -23368
6631 -23368 -12562 -33865 69161 45370 46809 129271 109844 41091 13992 -27761 3783 -40949
6619 -40949 27308 122495 144288 210894 117006 -44591 -53714 8351 7999 -18849 -84034 -68692
6607 -68692 -24997 -88449 -13254 38953 8234 45474 121741 61829 38817 118784 72610 60281
6595 60281 12550 52298 -5077 27000 105304 141503 85680 40072 55703 134116 172667 118815
6583 118815 162627 256054 301718 313190 188109 9451 -219 94272 107511 -15339 -97500
6572 -97500 -146364 -92872 33019 51253 39336 -3677 -48503 -42390 37968 89929 78793 69596
6560 69596 -76004 -69979 -4788 67070 75619 5484 -65258 31459 163432 140073 69932 -80547
6548 -80547 -169252 -191936 -183794 -132367 -55793 -23956 -38737 -16943 -15821 -59364 -131143 -180582
6536 -180582 -190245 -162789 -98500 -19603 -44000 -39983 31411 82553 140949 216881 135028 69133
6524 69133 103623 170604 115703 93364 1928 -48817 -40057 17445 20424 -48517 -45190 -96492
6512 -96492 -163419 -95265 -104939 -155095 -145017 -75315 16046 41149 70772 90131 -15676 -18083
6500 -18083 30430 120541 87356 32668 -31249 -48667 -78256 -94023 -82720 -1297 32079 -2170
6488 -2170 25402 69699 36438 -3382 19072 60280 40317 56458 24195 39367 119172 122626
6476 122626 60275 -2573 -31206 -25833 -102845 -140681 -178511 -216297 -206769 -179747 -165184 -238469
6464 -238469 -126783 -128367 -67152 3488 -41632 -52334 -56124 -22077 -78258 -84873 18778 95283
6452 95283 134529 53826 -82926 -112301 -116181 -154101 -75332 -24247 -66802 -70161 -64162 30730
6440 30730 50239 -18198 -31867 -17737 97277 129310 223906 174571 103586 30514 29001 34398
6428 34398 -28487 -18182 1214 9079 59559 122827 214803 258587 173773 67413 68201 112697
6416 112697 102539 1789 -104888 -129453 -129421 -111325 -4981 -26853 -87556 -114173 -106278 -18966
6404 -18966 67171 117806 156501 88313 117110 130312 32275 9728 -57275 -139003 -94178 19339
6392 19339 -11469 -127229 -188888 -132151 -59067 1250 -4740 56822 21897 64677 11217 -29569
6380 -29569 -84884 29155 61427 44996 32139 -39125 -45754 5989 7425 -13053 77647 110832
6368 110832 238486 323340 304269 246822 129414 -13084 29832 -26070 -39709 55897 24074
6357 24074 6005 21693 -11368 -7299 25582 20709 -20164 -78360 -84933 -91379 -81458 -79763 -54512
6344 -54512 76152 139360 132507 155076 98643 -37800 -167156 -66800 74480 57828 31834
6333 31834 69395 175906 103709 -81270 -97927 -55557 35331 54872 35553 -140633 -155325
6322 -155325 -67763 2483 171941 173209 193083 119854 140492 199470 136531 60637 25140 96819
6310 96819 167181 250534 124588 32746 46260 -14784 49594 145596 180093 165552 24501
6299 24501 55829 144104 221552 141191 60431 75321 163492 90937 62279 87562 55899 -49038
6287 -49038 -19434 94564 164795 178994 234843 307165 298379 216096 221731 234838 193277 127625
6275 127625 209461 102665 37516 126895 155389 148597 112192 53347 -39887 -89474 -143618 -165583
6263 -165583 -170116 -125268 -86233 -95747 -41699 -38309 -5497 5873 -22706 -6878 -10835 -89944
6251 -89944 -76630 -97941 -120119 -66397 -82142 -165001 18531 125167 78472 15276 -34665
6240 -34665 44552 92980 4037 -58298 1031 64226 81693 -68526 -106593 -7713 37741 112104
6228 112104 148603 88039 -25777 -47212 -29352 -6529 -99035 -75198 29172 37709 -3906
6217 -3906 -73608 -66866 13879 -8998 -157873 -154522 -127885 -99698 -41636 20840 2759 46634
6205 46634 61402 81382 -64486 -63531 84881 98033 -17944 -129769 -174451 -87956 -50212
6194 -50212 -44666 -35551 -93045 -6320 -33843 -26910 11031 -22357 -175867 -121406 -39338 31440
6182 31440 -45480 -122116 -51862 61182 158018 94257 37496 34748 -52970 -77130 -83109 -97991
6170 -97991 -53114 -12477 -55805 -35639 -42300 11314 24522 -37018 -70275 -4452 72336 132351
6158 132351 59639 75898 378 -56305 11170 91240 59751 74214 72834 142863 155360 23395
6146 23395 5805 -5972 12616 42554 -44534 -51245 136166 174173 76766 39721 180131 229096
6134 229096 245782 151822 128878 81535 92679 81424 45419 58199 -8652 -28121 -47336 -115126
6122 -115126 -133730 -68386 -112084 -127159 -9186 73866 89933 94786 124004 129466 124821 137651
6110 137651 110181 131342 157659 210301 193955 240685 196823 170048 79693 58728 145296 205275
6098 205275 17439 -146494 -67902 1131 -50079 -102285 4134 140517 155433 37323 31615
6087 31615 36 -65027 31355 -5169 -114941 -137051 -52737 -20164 -39509 -54525 -47087 -44971
6075 -44971 -32125 -91216 -131364 -174900 -30480 34536 82125 7530 -76702 -193469 -169673
6064 -169673 -116569 -14952 -68683 -96236 -62171 13970 94691 57532 73307 75511 105871 100155
6052 100155 50660 138443 174574 133917 69323 6111 78789 -12451 -100873 -88865 -2771 12265
6040 12265 18932 -20075 -83911 -153905 -123476 -95790 -71492 -66052 29127 43928 39307 118867
6028 118867 -20351 -96206 8541 20075 53800 -13273 -26239 -104144 -41890 -12322 -71922
6017 -71922 -97659 31698 141493 90701 10384 12845 52875 28309 -5133 -11879 -93117 -86050
6005 -86050 -66236 -62842 -99079 -52710 101897 210057 170970 99997 96143 46297 91133 11946
5993 11946 26710 94886 97480 191246 222872 165407 146664 176698 119851 -3110 -51757 -72801
5981 -72801 -81176 -57201 -46602 -53867 -35587 27106 11645 4453 43797 -11584 11221 68936
5969 68936 7631 -72823 -75167 -156336 -175159 11710 27910 55941 83492 90003 175227 150322
5957 150322 95520 154300 157251 75464 25993 -26456 -394 -3931 21988 43851 18229 34488
5945 34488 120273 141972 223487 218351 124369 29946 43853 -29849 -49813 -74378 -41704 -49685
5933 -49685 -44570 -66467 72866 17787 -59959 -109017 23117 106348 79512 28460 29615 -16015
5921 -16015 -38395 -5099 -50779 -50697 -67465 -11441 171838 187454 111159 61702 -19539 -21617
5909 -21617 46855 27786 -82300 -24626 67160 63398 47116 -7324 -69496 -68192 2501 126519
5897 126519 124131 148687 141850 97551 77411 65347 38515 89883 60059 10027 39494 56817
5885 56817 105400 172152 135316 39114 -2594 -19119 -69972 -55204 -80463 -96051 -87428 -86995
5873 -86995 -94649 -165580 -106033 -30051 -23902 84128 219164 207379 188422 216480 186369 20902
5861 20902 -60893 -62727 -65387 -55098 39201 63333 -104664 -297541 -272050 -234594 -180756 -119025
5849 -119025 -63006 31915 69549 26250 -33669 87822 115550 90100 136039 114775 16207
5838 16207 -46788 -34056 72789 -21175 -54601 60934 207310 294714 161547 67109 32308
5827 32308 71441 133894 163642 150839 156379 194720 162135 113181 122483 78931 170499 172947
5815 172947 153669 161613 48770 14546 91472 46933 57463 65209 115174 112909 84549 160198
5803 160198 152684 109057 170386 64394 -8383 -26775 41698 57555 101666 94717 108605 33450
5791 33450 61307 23229 13028 -36745 -8425 4733 9207 -50972 -94044 -141784 -102825 -164558
5779 -164558 -171674 -97467 -111517 -236638 -245608 -181045 -243599 -118049 -105695 -103054 -24646 84679
5767 84679 72784 107269 169878 78178 67741 -8368 5672 -42843 -34025 11623 -44141 -83852
5755 -83852 -51687 31319 55863 -5517 -131707 1513 151977 70638 17580 55268 48735
5744 48735 -30518 -13352 -17269 -65826 -20690 108879 86685 133057 85542 30952 -36785 -55238
5732 -55238 -85869 -163793 -121759 -100442 4662 45110 -11233 -13272 -57745 -87369 -1138 104302
5720 104302 195028 91053 -116086 -195714 -143348 -23359 29181 -15511 -95840 -109131 -71937
5709 -71937 -36176 17395 24061 90817 87624 40711 -79162 -140343 -56398 29747 96889 108864
5697 108864 36133 -93922 -101382 -67484 -67735 -26347 -50400 -136656 -213190 -214532 -118971 -89500
5685 -89500 -70358 -73812 -11723 -32215 36722 34395 11821 -52645 22081 44639 95899 38672
5673 38672 -14163 -151346 -234686 -136549 -65020 -33066 -113514 -85299 43832 11893 13898 59085
5661 59085 86246 101245 1361 -83124 -57645 -69442 -5991 101574 127325 53595 -11340 9841
5649 9841 -48641 -65865 -123721 -119439 -63882 -9656 24022 38083 56791 18924 -52351 -48060
5637 -48060 -8239 30604 10459 -95893 -131849 -60250 93076 194123 125284 112333 42522
5626 42522 -14793 65772 30355 175020 262223 275193 217073 112036 126467 98841 14532
5615 14532 94347 159872 195961 88933 12484 -107999 -59120 48688 124449 173472 157334
5604 157334 10043 -130343 -152007 7944 162518 102894 36215 -81521 -168294 -116333 -84303
5593 -84303 -83850 -130408 -138208 -33931 -53098 -122879 -93166 -101272 -74146 32088 84501 28993
5581 28993 -99017 -57260 24988 69839 77506 42803 18781 -13610 -30363 -2587 29087 -7722
5569 -7722 -50875 -52024 35038 91085 36112 -12839 -60563 -151158 -131018 -81295 -39640 -117605
5557 -117605 -202419 -85822 18703 66805 85831 -20038 -98074 -34274 -59830 -49949 -32270
5546 -32270 -149985 -127525 -53289 -107601 -155293 -35598 -31690 -23327 38961 74257 19130 -1719
5534 -1719 -9482 -10405 -18843 20535 76982 214946 235255 133038 32995 29413 34571 -16380 27678
5521 27678 11221 -10499 -90799 -5664 5923 28328 -52882 -129409 -99725 -36128 23498 49294
5509 49294 64080 93461 14320 -67427 -121332 -83089 -93707 -49474 16648 68232 178086 187121
5497 187121 117517 80211 63316 4129 -103677 -99292 19654 31797 51441 43762 -20095 -127069
5485 -127069 -179237 -181137 -154743 -99708 -177365 -74038 25323 57507 128232 177303 103037 42401
5473 42401 89927 96602 20705 12427 34169 75570 101147 118762 46195 -21311 -64830 -110338
5461 -110338 -74660 22606 80490 -93343 -108767 -125674 -130726 7284 32783 -64116 -357
5450 -357 44753 11217 -45666 -48427 -89554 -34108 31535 -40968 -61043 -19337 16676 90462
5438 90462 23356 -26291 -48884 651 38112 -78948 -82910 -51890 -118431 -113013 -13412 -54382
5426 -54382 -115532 -108078 -48028 -75505 39992 112747 134478 191904 141118 81472 65606 107225
5414 107225 117113 18753 -42102 -107451 -111731 -176417 -152388 -129426 -87006 -75370 48434 58135
5402 58135 30868 -26277 -73036 67747 218337 214233 93298 13566 -66535 -107644 -128613
5391 -128613 -127763 -61576 -32027 -60863 -81077 10946 59298 -29606 29581 115855 98506 45869
5379 45869 -64029 9006 13029 23270 -23080 -108860 -110568 -97960 -48131 -39440 -90441 -201406
5367 -201406 -226495 -217178 -135402 -123550 -120471 -12947 -52273 -75141 -59531 -87852 -10533 -23220
5355 -23220 -51448 -26778 9967 -24237 -24365 -12424 -66357 -119434 -99528 -96984 -112724 -12582
5343 -12582 33618 68278 50298 75080 126731 71048 70836 14144 -75675 11073 23923 -17978
5331 -17978 -4377 -40882 -104009 -21325 -15375 -29703 -135901 -136407 -85657 -63606 -51765 -64412
5319 -64412 -17565 -47508 -62841 -5672 71593 107244 24184 -29160 -54252 -178248 -263545 -205010
5307 -205010 -139224 -16158 -3485 -18763 -79862 -155575 -144325 -90847 32343 87765 89407
5296 89407 -9335 -30522 26250 56147 -25160 -130054 -107014 -62193 -127254 -132671 -26423 -99228
5284 -99228 -198509 -200358 -121415 -57336 41436 19929 -67141 -89286 -137679 -91462 -57496 -131660
5272 -131660 -142074 -114329 -89355 -74851 -130715 -109701 27441 159593 135648 139048 91109
5261 91109 -106700 -212928 -169126 -131434 -109728 -108792 -152265 -78576 8870 38211 15826 57855
5249 57855 36862 38058 67292 102880 142411 46292 55562 107167 145427 -19088 -88029 14511
5237 14511 -105019 -91278 94043 94140 51453 68481 67726 108029 -5518 -81777 -76943 316
5225 316 62523 47737 -79109 -96780 24018 -16467 -96501 -98772 -53298 -11853 -54249 20025
5213 20025 60026 -74444 -110082 30179 118476 114304 162294 162106 68498 -22252 -16027 14033
5201 14033 27889 54699 -20883 -33015 -51918 -38859 -88836 -96133 13934 98396 9557 42045
5189 42045 63981 -563 29476 82986 96374 75762 76837 26659 -21996 -63590 5612 -5884
5177 -5884 50031 155641 111823 31228 29354 -17241 -62347 4892 -21528 -61904 -14325 -39381
5165 -39381 -372 -30511 -47753 75769 125713 148928 164379 222552 103137 22259 35939
5154 35939 64421 79895 81750 35015 -32654 -74744 5684 53113 -25824 41213 68018 17036
5142 17036 21723 -35366 -105524 -44544 17849 63413 -18896 15329 81231 143503 122945 133172
5130 133172 169319 52471 -22033 -34027 -65042 2398 4151 7979 99933 109750 59261 -87068
5118 -87068 -45196 -18797 37124 -587 -62509 -11050 -14114 13440 -7160 34365 83188 17910
5106 17910 -97677 -183566 -81811 -35340 -111552 -134224 -16806 -18224 -78975 -78555 -140079 -134674
5094 -134674 -228167 -254799 -125672 -97838 -101956 -83377 -149508 5070 56474 79556 38815
5083 38815 7577 83220 136226 114049 140278 99475 43258 -91954 -129621 -51099 -17354 28348
5071 28348 56675 56562 -29104 -33124 86681 119602 138562 43053 -36112 -73696 -89776 -67598
5059 -67598 19632 82692 205389 214221 106596 -27911 -124466 -198819 -104443 -29121 -44820
5048 -44820 -134424 -149580 -60836 33599 102229 72217 -63904 -175985 -96752 -16672 -11844 -39533
5036 -39533 28123 44793 -61380 -20752 -3449 51552 135544 94595 11197 -53520 -115664 -174482
5024 -174482 -183895 -150588 -145833 -66481 57235 -30882 -113338 -100495 -20513 -8673 7837 -83530
5012 -83530 -40787 -37976 36810 73077 91920 89198 -79719 -100479 5761 58755 17099 -57765
5000 -57765 -61513 -7224 19297 -7413 52896 125710 161265 175132 167764 45552 93809 103255
4988 103255 -31485 -35527 21594 -26367 -81077 -80379 -124813 -59854 59428 74528 -67427 -29390
4976 -29390 -52283 -101104 -106990 -16770 60999 44014 -40611 -16320 -73083 -25147 -20186 -86375
4964 -86375 -138991 -145658 -72115 -64675 -9324 -84424 -56361 54380 112924 195545 135124 61016
4952 61016 24165 17482 10371 -18033 -72780 -69377 -63953 -101007 -93831 -137955 -199958 -245635 -256897
4939 -256897 -269583 -224920 -201931 -193231 -167765 -140585 -30247 13724 -25861 -59208 -111668 -67692
4927 -67692 1656 -26360 -30507 -113707 -84881 -127628 -133465 -43102 95124 1373 -102434 -74919
4915 -74919 -16977 -82741 -70249 -47320 2173 -71319 -73080 -23842 -136512 -188030 -50689 65192
4903 65192 213791 246619 181635 63639 33379 97260 21837 -74689 -1605 27860 132846
4892 132846 78220 26328 65066 13010 21934 109688 47155 3739 34100 22416 -151630 -121493
4880 -121493 -37701 -76129 13152 28536 11148 -55209 61948 53714 -63974 -44441 -38664 -161664
4868 -161664 -137093 -116719 -97128 -102967 -145889 -105323 -44574 25511 70254 110476 82235 27922
4856 27922 -97923 -142172 69612 210104 190114 189925 231755 235946 74335 -89923 -74436
4845 -74436 -33254 27312 27923 69576 -13569 -126652 -61284 -43100 -83031 -31014 -52705 -17126
4833 -17126 10335 -18604 -118305 -74940 -74176 -104529 -183684 -94397 44758 35718 48087 96090
4821 96090 122783 80206 45580 -87789 -22744 128967 301614 264240 130223 81697 43912
4810 43912 -14198 -58917 -488 -11841 -23 7729 87930 82145 130798 129149 107020 62061
4798 62061 42574 18450 -28062 -100103 -159556 -118610 -32720 49297 34519 -19530 4184 -57892
4786 -57892 17030 92917 131963 37159 -19528 -43998 -10861 -3347 -14934 -35526 -113175 -47490
4774 -47490 69277 79430 53476 106585 60205 -125828 -61142 28101 -50177 -81327 -78435 -27033
4762 -27033 -25942 -27995 -44216 -60957 -42335 -88505 -99753 -1804 96126 149204 -47885 -99164
4750 -99164 -73432 -64377 -13731 1500 30663 -42485 -53538 -10939 -14500 15412 85237 131021
4738 131021 169187 157691 106162 26292 -38689 -53245 -93107 -90428 -175104 -74726 -56387 -83473
4726 -83473 -30842 -1614 35322 45927 55807 90574 -38115 -95928 -132283 33310 118200 2071
4714 2071 20986 102548 34473 -12466 -37485 -60391 -32867 -11583 -10703 783 4910 101986 43856
4701 43856 8003 -130365 -126667 -65344 106414 177879 154445 69952 -63312 -185080 -223746
4690 -223746 -160222 -59974 -35110 -8260 26298 -13950 -70779 -187410 -222011 -189661 -215841
4679 -215841 -134085 -108924 -121571 -131801 -196556 -221437 -135128 -131769 -145377 -202390 -249581 -293021
4667 -293021 -291301 -251093 -152555 -124924 -38256 -26001 9551 6715 -6427 -59668 -110427 -162137
4655 -162137 -92433 -52108 -31981 77720 84744 109662 139187 102997 33978 11679 48827 96386
4643 96386 107949 78057 21009 -104323 -263788 -186488 -159302 -151838 -107130 -879 -16290
4632 -16290 -103605 -69929 4279 -83472 -24472 5016 36365 -2288 40885 118419 171145 118571
4620 118571 92532 82799 -6750 -29833 -57732 -27414 -102644 -198771 -195666 -207408 -200783 -158561
4608 -158561 -219765 -229084 -199025 -179216 -13427 39599 31952 -73173 -55633 -64331 -3738 124287
4596 124287 84375 117120 143017 130095 -20358 6353 49238 30464 -14331 -48562 -51758 -162157
4584 -162157 -291356 -290051 -203285 -186905 -280717 -315754 -257632 -237325 -198155 -189249 -186993 -85118
4572 -85118 -54694 -158965 -119849 -9080 86935 168933 171439 130328 102552 63489 44568 -15405
4560 -15405 -46643 -31564 29914 65800 133268 52835 -46428 -36652 -61356 56153 -4875 -35808
4548 -35808 -11553 -25458 -45701 -73423 -52940 -22826 59423 21404 -52556 -12299 82408 140425
4536 140425 202821 118596 14240 -7376 -42845 29938 30434 -36670 86546 123980 192320 157550
4524 157550 219665 214269 137845 -1067 -37315 -78356 -77985 42852 99547 31027 22739 91309
4512 91309 105152 76168 25562 7892 17240 28745 106915 142371 144921 79216 -44709 -111225
4500 -111225 -60586 -59729 -35486 26502 -7233 17430 -26104 -119985 -73310 -26246 -22051 -4571
4488 -4571 87603 65502 28599 54776 101446 19755 38305 -3622 -58604 -96678 -133101 -68220
4476 -68220 -36282 -74814 -104201 -176783 -180618 -170620 -212082 -267651 -157273 -106785 -89443 -122674
4464 -122674 -118129 61973 66994 89866 126918 172698 164954 51823 63187 97627 40743 -28358
4452 -28358 -90275 -15172 6487 7963 -32568 -55510 -84230 -134898 -107158 -37346 -8733 46774
4440 46774 100825 -8375 -41615 13763 7069 -66037 -186035 -173721 -133285 -195871 -187525 -210932
4428 -210932 -95649 -53750 36917 6359 13007 27459 57065 80060 141292 103315 30953 -55590
4416 -55590 -120759 -156796 -110955 -71878 -114578 -125927 -44258 15320 109334 111035 43141 36757
4404 36757 39610 8334 -27669 -33764 103654 78912 -49681 -47087 -68251 -66461 40176 76268
4392 76268 -23786 -58844 -36606 67478 85686 35068 -50291 -20271 154567 187984 147519
4381 147519 151748 95869 23851 13410 -68856 -116738 -72371 -14622 81538 140917 31015 -7486
4369 -7486 58766 68516 42810 37119 12596 -87757 -57890 -2843 -30388 -100209 -129929 -137414
4357 -137414 -71098 6915 16131 -6912 30573 29853 92077 17676 -73522 -138329 -57632 -27257
4345 -27257 -124363 -116743 -55296 -1370 70063 109101 137681 52071 70114 121968 145973 23453
4333 23453 -75543 -229040 -195652 -75824 -87398 -44305 17682 60141 57427 28162 -22775 -29421
4321 -29421 -105320 -189328 -207665 -214371 -191070 -183663 -119827 -189377 -144845 -132132 -196166 -225896
4309 -225896 -135854 -20523 120968 60286 -60658 -115983 -89364 -155954 -172625 -94151 2667
4298 2667 32020 57222 16665 -88220 -101674 -17207 67095 22281 -101520 -131155 -118459 -173293
4286 -173293 -174455 -238305 -264562 -164096 -88529 -6509 -7119 16715 -13421 -42421 -102048 -100276
4274 -100276 -48289 -71790 -144961 -208778 -131009 -121707 -110428 -154604 -110868 -50914 -3607 -32984
4262 -32984 -81249 -75168 -5348 15249 -80197 -135603 -164185 -55379 -10192 28760 -119619 -207902
4250 -207902 -106908 -55932 -135249 -175962 -171303 -148475 -124309 19475 -3025 12133 18334 -1774
4238 -1774 69294 127553 77598 50690 -45645 -52042 27811 52821 -62769 -127069 -200627 -167292
4226 -167292 -127097 -129120 -81106 3572 -41088 -136987 -147645 -128167 -169766 -118642 -143383 -159996
4214 -159996 -138113 -54798 -79838 -81173 -72786 4920 4362 5841 104077 123589 69293 -51410
4202 -51410 -178734 -255937 -169460 -168144 -97507 -11483 -23494 -20489 8366 74145 34722 70113
4190 70113 142991 98835 64405 84384 -11115 -54959 -19887 24365 -17740 -47683 -8497 78960
4178 78960 103037 82547 74435 108385 178795 122004 5342 -116691 -153002 -84107 -67475 -25704
4166 -25704 51632 111698 91161 110903 11523 4593 105599 151866 108137 56094 -736 879
4154 879 -43199 -177376 -199380 -214521 -125987 -62435 -8892 90790 88807 37184 -901 -53601
4142 -53601 -63674 -54974 -86969 -27493 -51154 6229 -90846 -63442 -21023 -53997 -80429 -90188
4130 -90188 -38492 -109051 -152435 -167591 -165567 -190016 -127125 -72222 -78681 75099 125544 98634
4118 98634 11324 -37004 -96295 -58882 52506 69635 -6284 200 -79228 -129740 -175656 -159227
4106 -159227 -146391 -99069 -77255 -25897 -1650 -10884 -107563 -112132 -45665 -35333 17642 50279
4094 50279 2195 -37700 -111538 -136573 -112179 -27621 29253 -11534 -126613 -87392 -51411 -83263
4082 -83263 -140360 -240865 -150524 -65518 -23093 -69790 -114638 -172022 -199122 -183718 -117355 -84375
4070 -84375 27792 50056 -118589 -234107 -164585 -62305 -23340 44578 43784 72700 -13424
4059 -13424 -148717 -124371 -57483 -82889 -181393 -72342 -75180 -88653 -120964 -96746 -116054 -226263
4047 -226263 -129149 -40302 -25001 39088 136445 156415 178127 166268 64406 56737 102376 154148
4035 154148 155497 131373 210683 155076 39459 122295 147657 88466 92396 56136 70738 33553
4023 33553 -26482 17346 -3655 -57527 -14375 -29386 -129840 -90232 50458 58218 82103 55472
4011 55472 29903 -131286 -235083 -115204 80598 135174 55944 -26539 -45078 9974 41427
4000 41427 39558 93074 99919 39709 93889 113086 61997 13260 9961 45088 88097 151044
3988 151044 174555 174502 94944 18023 -31972 -55344 -15725 101104 178376 44744 -66027 -75528
3976 -75528 -62194 -89800 -24481 33004 133580 163514 211391 153012 85188 -28275 -22999 17431
3964 17431 103318 97431 66302 132376 191529 126499 -513 -62854 -83901 -150587 -175224 -122326
3952 -122326 -6439 -91518 -66028 -62009 -22405 101753 112566 -13005 -73087 59410 26125
3941 26125 -18263 41213 -73363 -155531 -223185 -136910 -19297 66883 70315 105300 64378 41701
3929 41701 3537 -120348 -180720 -196561 -137863 -77260 -31628 -56528 -54718 -143425 -68644 49598
3917 49598 70904 -12456 -32294 -25348 -105540 -152772 -167467 -163396 -96679 -84762 -82865 -124028
3905 -124028 -103989 -26324 -89048 -84700 -79551 -147213 -98901 4424 84138 52691 75872 14314
3893 14314 -100157 -80275 -86672 -186776 -77508 74416 109342 72762 117799 -1387 65053
3882 65053 124232 91271 -4472 -86153 -41426 -50024 53214 42723 11956 65346 104389 21299
3870 21299 -44094 62192 175819 181824 79206 -4057 75477 34369 -8892 -50718 1144
3859 1144 -2585 -156733 -131548 -129792 -173464 -280903 -254477 -258955 -191145 -167486 -212535 -223728
3847 -223728 -182616 -153856 -136006 -128311 -152832 -156005 -161815 -31828 101701 211983 209228 151306
3835 151306 72593 30876 24335 -46013 -52903 -70256 -70311 -120432 -167252 -130957 -109419 -46078 47147
3822 47147 34467 -91567 -172412 -131529 -3771 -28974 18777 58091 101736 81351 124950
3811 124950 101993 4503 -10017 43812 24388 12984 -52778 -37696 -95737 -142048 -120251 -117057
3799 -117057 -187120 -162399 -31173 2603 -47680 -132668 -153512 -187663 -276755 -142434 -71926
3788 -71926 -147181 -152004 -224032 -246599 -214475 -238091 -118160 -14330 -92529 -48405 -52400 -136586
3776 -136586 -199651 -46898 17178 31519 36792 59704 126200 64999 -13915 -42738 -138199 -189101
3764 -189101 -183953 -164478 -128187 19384 84493 176605 159838 -9242 -67295 -136433 -225083
3753 -225083 -115534 70086 -13495 -62224 -6650 83912 89547 -26790 41018 79655 -47781
3742 -47781 -156212 -63060 103388 70394 143378 212819 202204 179350 94053 -45887 -81748
3731 -81748 2154 136227 207633 126554 -11409 -130742 -162799 -191691 -131411 -142037 -110630
3720 -110630 -70160 -114033 -241286 -193592 -140330 -31644 -127780 -218369 -246962 -196534 -84610
3709 -84610 -126169 -161440 -214170 -119889 30289 4876 5528 -87810 -179186 -141924 -52133 -87491
3697 -87491 -29132 -55021 -120405 -117853 -5418 86135 115000 988 -19945 60039 86301 18655
3685 18655 -42015 -96464 -61265 -68655 -64870 -145979 -196612 -124371 -71081 -57016 -186167 -266990
3673 -266990 -103366 -80609 -58466 -81410 -211241 -172217 -41580 4409 -52536 -71811 -21520
3662 -21520 -59077 3113 54637 62499 -27338 -11480 -47985 -131707 -132425 -155156 -137589 -45770
3650 -45770 -109816 -158592 -116965 -42312 -47290 -80065 -166729 -186350 -195245 -114847 -80960 -181430
3638 -181430 -166671 -35914 55949 21240 47532 68384 -22011 -25279 -86519 -60816 -1589 36979
3626 36979 23599 74514 115038 107890 92929 118233 89717 196332 169393 82983 26463 -27472
3614 -27472 -121828 -87587 -18215 8956 -67375 -102712 -126495 -147798 -132907 -62995 -74198 -37925
3602 -37925 54981 8828 -23167 -42221 -115834 -94320 -94363 -139682 -7114 40711 28984 91544
3590 91544 171885 97410 -3528 -31017 -84605 -66134 -98555 -102833 -96779 -35849 -83676 -140453
3578 -140453 -72620 -61799 -71409 -21404 17345 -88610 -116437 -93180 -189368 -141471 -57455 57787
3566 57787 39428 -19704 59168 141623 41004 -6562 -50990 -114972 -13365 -5805 27361 23399
3554 23399 -132656 -232411 -236219 -171004 -73412 -54764 -97981 -54884 74355 114403 157378 107267
3542 107267 104444 51169 5934 30995 28940 154266 158368 159792 138870 104491 16682 75575
3530 75575 31043 -47360 42716 135903 88270 -7246 -134169 -167732 -178138 -40845 -55668
3519 -55668 -71965 12285 12166 -133981 -191602 -211873 -181017 -101186 -25241 17655 -40616 -149176
3507 -149176 -79763 37425 148796 158392 146069 111964 158295 162660 67693 -12777 -1561 -9148
3495 -9148 19099 27952 -7639 -30507 -100817 -111298 -105687 -126486 -12880 88209 94216 79414
3483 79414 19356 23932 92313 158962 234257 105685 -12780 -84068 -164436 -161578 -129485 -90864
3471 -90864 -88889 11139 44879 63719 66578 -330 -33355 -54988 26118 90770 59350 -8147
3459 -8147 -6347 -79716 -110795 -107878 -115984 -89647 -12467 59703 128671 93987 -63442 -103792
3447 -103792 28981 72020 124378 137775 156403 133978 -17547 -101664 -123962 -80682 -34872
3436 -34872 49065 74695 92318 74527 53117 81267 43347 -51393 17846 103591 100630 -6612
3424 -6612 -145748 -249466 -214353 -160058 -80461 10053 64642 111624 46746 -16643 43402 66983
3412 66983 -18469 -89594 -197612 -207474 -196411 -248722 -66429 309 -82619 -25749 43754 -2
3400 -2 -74203 -119789 -20546 29105 10508 6891 -6677 44526 -13938 25370 5398 -57032 -81997
3387 -81997 -84970 -57078 -115758 -174543 -135962 -66963 -105962 -176694 -196845 -5903 144003 143064
3375 143064 149413 65790 43881 -67630 -190989 -161653 -97432 -61505 64580 165433 131555
3364 131555 37807 -45957 -40949 888 -54083 -120985 -75131 1063 59126 22143 -34472 5452
3352 5452 -119269 -177342 -258522 -212484 -91985 -44932 -111621 -52199 -60881 -161919 -149475 -63911
3340 -63911 -104864 -144624 -75424 -32034 -137902 -95896 49372 -29668 -16912 -44524 -25969
3329 -25969 57255 -42236 -115536 -110853 -33377 -22267 -59311 -125238 -193344 -59488 -11321 3444
3317 3444 -17349 -86883 52424 33496 -104142 -245640 -270219 -213786 -193081 -165548 -156043 -12092
3305 -12092 65360 94145 70546 7382 -102243 -69468 -38 1732 25570 3557 -30293 41804
3293 41804 68886 -31199 -32901 -60164 -64863 -52141 19088 -35037 -104162 -106905 33144 -31920
3281 -31920 -77298 -69146 -80121 -128542 -197083 -214954 -115329 -99701 -20182 13950 54356 36696
3269 36696 -50895 -55924 43243 19311 -100672 -22157 -11014 -112959 -183624 -107397 -93429 -57163
3257 -57163 32879 -22577 782 -62799 -147484 -124979 -61742 -136477 -172991 -178181 -90873 71603
3245 71603 48270 -74770 23143 55641 40380 64945 -43921 -158264 -121620 -90229 -68981
3234 -68981 -7895 8762 56387 98094 92315 15046 -31662 -39012 18555 4653 112094 115976
3222 115976 97145 14916 87724 149570 159758 89680 -116537 -170754 -100546 -29418 -22991 -45530
3210 -45530 35962 728 128527 268782 225429 59866 -39996 -23504 8887 -7186 -32711
3199 -32711 86464 110321 54320 19909 -796 -9059 65079 69291 53480 64503 56056 -25854
3187 -25854 -68674 -151473 -181463 -57566 41246 102403 89095 32575 -32675 -37315 -200149 -191729
3175 -191729 -144621 -82152 -58411 -111654 -78566 8989 -26508 -81661 -157694 -161520 -90208 31624
3163 31624 35820 -99597 -140893 12987 159558 133525 72001 98482 -64828 -178880 -100940
3152 -100940 -134430 -29787 16210 -17745 -54631 6735 48842 128620 184996 94000 39790
3141 39790 6061 -54809 -93355 -64064 -58858 14376 128703 120983 137720 119993 214110 180824
3129 180824 34251 -17901 27193 -595 -37618 -13256 -18810 34071 77032 38018 -90991
3118 -90991 -88794 -16166 -635 -1695 -42820 -4246 42595 27684 -86270 -38379 68174 167664
3106 167664 141210 107055 -10836 -68297 -47637 97337 144223 181896 105609 27224 19443
3095 19443 58752 21846 27499 69303 57389 80039 -31799 -61206 -70086 -117727 -158311 -178736
3083 -178736 -112913 -94249 -61912 -3375 -22493 49343 134302 88249 44090 13476 -48873 -4618
3071 -4618 -74321 -90192 56781 75000 48064 98998 126589 78029 -22341 -125241 -191308
3060 -191308 -33989 98666 98552 76094 34637 43609 98950 86231 -4787 1029 18537 4035
3048 4035 92010 172687 84501 4497 99896 148434 119164 95152 27506 63015 55007 109774
3036 109774 49074 25408 4841 -5040 -123731 -167989 -108920 18742 64404 -70608 -116004
3025 -116004 -79768 -21185 -55253 -44803 -18667 4406 73245 16375 -170 -21950 -10805 29804
3013 29804 -20766 -95029 -92611 -82810 -9169 14607 -21037 27545 51946 -58854 -185392 -277313
3001 -277313 -130458 -1905 39585 16363 -73366 -115603 -101014 -17652 37605 101764 -47510
2990 -47510 -57182 -79550 -205916 -132902 -3405 42645 33885 -16316 -78604 -19671 125122 182700
2978 182700 141788 32876 34516 8201 1577 148311 202529 299943 250500 166428 64339
2967 64339 -42720 -116873 -132725 -53030 -84627 -106455 -82754 -75641 -17718 40420 29901 16169
2955 16169 47097 -19597 -24847 34426 56247 87665 48871 -54396 18281 10263 -79983 -148775
2943 -148775 -86179 -51026 16904 41858 -47451 -90703 -40765 -10128 -110818 -218682 -138414
2932 -138414 -45822 -23904 -26845 -3890 4735 6805 96982 18301 -33752 -75650 16698 44342
2920 44342 23679 -11519 -7433 53133 84421 93370 22258 -18406 -11565 -31107 -18553 -78481
2908 -78481 28772 44105 -4543 -92274 -127430 -97604 -67533 18700 127494 102857 61916
2897 61916 114343 126264 158113 152051 100125 6163 -42700 -71500 -107858 -78010 47475 70293
2885 70293 -9057 -44288 -32791 -72823 -131105 -127638 -238389 -253075 -189589 -16665 -32357 29427
2873 29427 30945 17955 43630 58831 89993 127073 124069 43647 -66855 -70213 -15839 -14577
2861 -14577 25092 2759 -68025 -78084 58743 108538 108113 77254 54521 32618 5088 18813
2849 18813 7599 -16953 41527 81992 123134 -35495 -144112 -144240 -26975 17917 59699 25820
2837 25820 84494 56492 -43191 -42046 -153151 -131389 17959 117271 63817 -25077 -118833 -111749
2825 -111749 -113439 -120299 1770 23769 -3606 52663 -19345 20285 93358 111045 78060 -37949
2813 -37949 -87507 -161730 -160771 -151200 -181524 -238319 -262889 -268632 -227492 -215892 -114435 -60059
2801 -60059 23909 44220 -22228 -22177 28487 20104 -55985 -72567 61585 158177 79579 120779
2789 120779 118222 29933 -106067 -55383 65459 34701 -61096 -65749 -24930 -41840 -49326 -108992
2777 -108992 -120732 -130580 -26707 120823 131930 32152 -76076 -102196 -146144 -149077 -185278
2766 -185278 -187606 -65508 -42025 68478 54839 -33630 -85418 47804 91463 83022 8805
2755 8805 73340 111245 85569 68793 89543 165432 112839 -5864 -79817 -96359 -83028 -49922
2743 -49922 72571 81781 85631 -10869 -116624 -110300 -79728 27592 58194 144691 95509 -63777
2731 -63777 -10883 65261 83392 60853 -15855 -75886 -199409 -269509 -153200 -38558 81865
2720 81865 18674 -23354 -2855 67836 42797 -53539 -72644 54101 7703 -72307 -79483 -5152
2708 -5152 91773 133200 126606 54294 -79938 -117288 -35312 86424 99106 15575 64255 63097
2696 63097 -50318 -100846 -169910 -141196 -93031 67496 80670 15522 4991 42984 94939
2685 94939 51602 -48289 -28445 -83477 -162525 -75605 26572 86658 124175 95285 34960 -36595
2673 -36595 -9091 23199 54273 64508 131318 124695 61714 -4419 2768 -11376 -64221 -21724
2661 -21724 -16206 -15025 74514 80680 51451 20032 31663 -3688 -29977 -87381 -83461 -38591 -6797
2648 -6797 78243 140616 294048 390252 353866 256793 192486 138737 155250 127604 37128 -91574
2636 -91574 48160 245222 208809 114831 75137 -447 -32470 -21402 -9228 146786 221587
2625 221587 225427 235773 230921 157139 -3816 9007 37418 -2338 -12378 61746 48477 147395
2613 147395 132740 -30529 -50981 -117290 -92228 -7837 25934 39671 75627 73362 -33855
2602 -33855 -80471 -193008 -180730 -89413 -110405 -119308 -100755 -131280 -58895 22057 33723 89091
2590 89091 138634 124053 70461 66575 68381 16294 -15525 32581 -982 -118213 -70671 -94231
2578 -94231 -120153 -58883 -9870 -31651 -61351 -79314 80989 145385 82163 44253 49984 34288
2566 34288 25748 20110 -31178 -69547 -57013 -201642 -238234 -116506 -9478 -25672 10447 13667
2554 13667 12050 -11521 -82332 -154729 -140656 -104467 -113293 -214972 -187263 -138577 -147034 -133711
2542 -133711 -197399 -306795 -249802 -53446 -23588 -80656 -32259 42673 -59102 -94532 -36048
2531 -36048 78173 153862 36462 -56965 -46217 21188 18623 -58826 -113751 -53791 7173 117098
2519 117098 132173 75395 -8198 -49995 -72939 -168268 -285862 -186949 -88823 -125117 -89193
2508 -89193 42693 82329 148850 83337 -17252 -145349 -234836 -200634 -30396 104619 111072
2497 111072 25189 9254 68174 129894 131087 24537 7974 39114 41947 41362 50376 139934
2485 139934 -27469 -147488 -74378 -15408 52444 36016 61407 179531 148869 108035 30958
2474 30958 -45039 -74403 -13880 -7539 -56140 -55980 -146608 -228377 -96513 59833 130236 104673
2462 104673 134694 153347 166501 123445 48470 -31525 -109584 -170247 -76000 -7554 56636 -33668
2450 -33668 -128778 -94475 -107688 -144177 -153673 -48404 36541 38649 93197 -44460 -117244 -155296
2438 -155296 -76578 -51462 13142 53902 37151 20104 1060 75749 75934 67915 37785 61548
2426 61548 36937 -101670 -77971 -143476 -146912 -151951 -176788 -158878 -103534 24314 58955 -64325
2414 -64325 -110501 -66090 90386 49925 59355 18686 -50231 -32621 -42922 -87118 -38346 -861
2402 -861 -8849 -19634 18093 120647 155810 69664 48822 137099 82812 126950 64373 9201
2390 9201 -3964 18396 -45049 55305 81784 17223 -59760 -106617 -54323 -121429 -184762 -190158
2378 -190158 -168461 -74849 8398 74254 52785 73101 23199 49243 130650 154495 42793
2367 42793 -176457 -189704 -193243 -161864 -200813 -152727 -34779 35259 104407 66913 31583 62941
2355 62941 73563 97178 129214 82403 81795 -102246 -139302 -73030 -156249 -152022 -137869 -125886
2343 -125886 -80875 -146750 -163571 -90174 43557 12607 29487 9883 -71380 -52049 -16742
2332 -16742 -115053 -174713 -145463 -38897 -13223 -40825 -67940 -154576 -168576 -190212 5277
2321 5277 81974 -58365 -94178 -22123 30204 30136 -83348 -7277 84474 107058 73351 40691
2309 40691 27778 -14523 -77993 -168069 -148264 -23407 88970 89894 -867 -80863 43114 105602
2297 105602 122188 32154 -5073 -74827 -156035 -63117 -55931 -123394 -190665 -101474 -4761 140162
2285 140162 54823 30409 94087 201955 315803 215642 106736 131524 133453 161796 169965
2274 169965 111496 -37741 -103127 -49578 46858 -65309 -158759 -144516 -144607 217 140066
2263 140066 120679 93166 79819 -6456 -51011 -97834 -11180 53064 62401 24624 -26226 -158269
2251 -158269 -136936 -9615 11534 -51172 -53742 -4443 -11200 -1112 89508 104176 24391 23054
2239 23054 97276 93851 22083 35421 39436 39315 60909 -621 -43627 16594 170822 255984
2227 255984 217926 179135 83837 10642 55000 42322 -61151 -109991 -4661 99201 126343
2216 126343 158255 161091 65664 -61696 -30464 -37615 -30820 50311 32797 66176 -111749 -223106
2204 -223106 -116969 -120098 -162424 -184173 -71918 -54833 89866 50774 32097 -5229 -53967
2193 -53967 60530 126790 115344 134562 66102 7274 34754 182467 157349 119205 35419
2182 35419 -22661 -94307 -119253 -136109 -95201 -97353 -111163 -189034 -112073 -86859 -39261 -47279
2170 -47279 298 95860 161512 195796 235827 113226 -7041 79741 141931 136876 138367 40139
2158 40139 7571 -30858 -2953 24679 22531 32475 17755 -50579 -96686 -80379 -94379 -75713
2146 -75713 10588 -53972 -72096 63054 50940 -67875 -34432 -7558 -42582 -43331 -69590 -141352
2134 -141352 -133386 -62061 65841 187241 85048 18277 86237 68633 90160 70700 27341
2123 27341 20593 -22677 -77048 -101784 -113724 -153161 -185955 -155285 -130094 -121305 -28376 106897
2111 106897 26317 -48055 -101329 -79405 -35856 52335 35900 4103 -20268 -100327 -24463 -41803
2099 -41803 31244 163586 158757 61192 56051 3189 -148789 -157526 -188432 -62179 15791 2279
2087 2279 26476 26872 34058 95406 137714 151112 103996 37823 -13714 54040 110093 103227 34880
2074 34880 -160345 -124538 -35679 -18311 -40923 76410 134767 138409 22745 -100500 -116817
2063 -116817 -101814 -20 -2035 -53232 -130993 -133770 -177159 -137394 -55966 -81263 -79981 -122646
2051 -122646 -105924 53325 116362 25368 -80735 -155987 -24890 11478 -33376 1850 81291
2040 81291 200959 285308 171081 139076 101302 -14210 -146497 -93580 25587 97451 187895
2029 187895 253838 287148 238736 57290 -39734 -25875 6584 -41011 -36542 41501 -9974 -22254
2017 -22254 -104782 -151077 -68066 -84489 -112370 8347 155224 137407 -11320 -86830 -73830
2006 -73830 49871 40725 -12119 -71066 989 29428 -44509 -93422 -127417 -73738 -36543 -31526
1994 -31526 -14893 -26593 -87529 -12609 12440 50383 6377 22320 53217 50399 -4494 -30118
1982 -30118 -1535 -19145 -32295 37255 43076 -708 -34580 -86081 -103039 47663 13628 -1919
1970 -1919 9142 -86863 -188533 -134148 -78259 -30818 -39943 31579 16792 80449 113113 79045
1958 79045 168439 138204 52110 -77350 -122063 -38268 -10932 -23896 -7359 28241 72102 71892
1946 71892 72077 87353 85107 -22712 -16027 17204 -112154 -274579 -370748 -369296 -215355 -109417
1934 -109417 77001 133981 122781 114921 55794 6535 -3523 65736 180754 189485 161373 180606
1922 180606 173183 108342 127300 123561 117119 150939 194110 200651 208990 156884 39028 1400
1910 1400 -65946 -105125 -173394 -186681 -129046 -107674 -112776 -110678 -32875 -17586 -91121 -67712
1898 -67712 -83190 -44207 -2508 -65294 -7751 59042 60234 21644 107887 114279 65256 -54388
1886 -54388 -158258 -136258 -150822 -221721 -209470 -182130 -92411 -282 77976 15862 -10601 31021
1874 31021 -1965 -59313 15170 94282 78793 -55903 1939 76167 76590 70793 79945 170277
1862 170277 62739 -17451 37718 53845 44546 70598 -1941 48692 43800 -22981 -68491 -171730
1850 -171730 -203050 -185727 -209052 -85638 -1251 11408 -4423 -64495 -88205 -151580 -131829
1839 -131829 34016 58325 -18178 28900 90094 27528 12429 1465 -111674 -168225 -68956
1828 -68956 -36215 -25447 -62989 -118073 -112365 -53405 -57058 -60776 -27470 -135389 -178640 -57172
1816 -57172 -33451 20624 -13432 -63406 -84299 -183439 -203877 -101003 -19006 -61655 -24294 26456
1804 26456 8130 13314 -23121 -6358 83745 63542 -27707 -1157 98407 164680 176324 93464
1792 93464 -2229 10155 61886 21829 28270 131496 151863 85590 27552 -37162 3358 61184
1780 61184 113508 35982 -3390 -57085 -30830 -44112 12911 49708 -44859 -31493 25822 6921
1768 6921 54370 29688 -58741 -11146 -15293 -17365 5084 -47127 -71835 -69138 -100373 -153849 -129820
1755 -129820 -59808 64720 134345 190337 103425 46542 74378 133148 130986 27727 -44483
1744 -44483 -79876 -31781 61310 148876 86344 -5263 37278 94535 111656 160925 229305 147765
1732 147765 71539 92246 -39207 -24651 -12362 -18498 -41634 -87390 -22094 -17417 -89542 20773
1720 20773 91080 41760 2662 -33604 -88274 -128827 -188400 -146817 -82500 -43361 60312 89524
1708 89524 -2489 78954 90879 65917 78144 128150 28078 -50078 -43023 -52755 -1647 12965
1696 12965 58497 78389 -5378 -119539 -197863 5785 111812 131774 40132 82336 98622
1685 98622 172859 147788 82940 -19725 -84825 -81540 -147435 -38834 132748 129520 -18257
1674 -18257 -71653 -68373 -3972 -27499 42042 2699 51145 110227 59840 -24735 -40215 -58387
1662 -58387 -68889 -6305 124496 80748 26113 24048 21847 8485 26586 72132 72740 105758
1650 105758 157982 120930 -2563 -29039 -179954 -257190 -92355 -69303 -13395 61670 -76383
1639 -76383 -85747 4890 -8013 -11035 3893 -60124 -13233 -3161 29848 37967 77751 61080
1627 61080 64921 140260 97702 95685 150202 153096 40981 -5586 32123 -9678 59414 203414
1615 203414 219882 207841 231012 73121 -74675 -45239 -27903 -79315 -76988 -35987 -76707
1604 -76707 -111145 22366 182751 171631 56998 65079 119825 104715 64769 66976 66909 -4596
1592 -4596 14304 75553 95837 11118 71028 27377 -33158 -58745 -60382 -35041 8650 16702
1580 16702 4065 -47148 -35133 92173 141770 128230 12582 5045 26564 40402 42214 -126593
1568 -126593 -137708 -112199 43587 76254 55756 46125 15962 -33064 -24 3931 -48751 -169040
1556 -169040 -167308 -99328 -47047 -40319 110296 112711 -19903 -96117 -72619 -125263 -197515 -127624
1544 -127624 24126 -3405 15402 20691 -27875 65293 95278 50411 9282 3081 -40397 -97999
1532 -97999 -104542 57073 66309 95375 95760 -2673 -57926 -107235 -122406 -82103 29331 99737
1520 99737 92520 44485 -9828 -87453 -105796 -77198 -6237 -43467 -135009 -105797 -31707 45348
1508 45348 93378 106045 63993 4357 -30416 45417 164955 144960 142082 43363 97073 83229
1496 83229 46820 144242 156870 202971 137320 131885 47577 -54330 -67807 24615 -2311 58633
1484 58633 24022 -43799 285 91729 155955 150462 161252 142314 92906 -53222 -69893 -106109
1472 -106109 -111290 -143316 -143464 -173799 -171883 -106225 -84127 21757 148380 30855 -82304 -1483
1460 -1483 -1507 -45166 -34364 37488 48414 52027 106449 101057 21865 -12976 82478 217112 222510
1447 222510 100353 101680 94726 41253 -2027 8503 32433 -415 -110670 -160783 -150247 -181535
1435 -181535 -165684 -40665 -85425 -76280 -69780 -101282 -141746 -177966 -151024 -84370 -138620 -88927
1423 -88927 -37013 3167 -24328 -128719 -101493 -84890 -14090 79587 44128 22127 36421 -55140
1411 -55140 -47763 -79189 -79385 -73326 -102385 16921 42808 -6847 57985 33226 -32383 -28698 93868
1398 93868 77670 -21841 -128562 -157186 -174144 -180203 -72546 -24467 -74902 -49881 -42663 -48240
1386 -48240 -93749 -116084 -51811 -34986 -49813 -56542 -66657 -31554 1741 -32992 -79298 -175109
1374 -175109 -172018 -132008 -167756 -257503 -279881 -139555 -119269 -102697 78822 85306 113440 174194
1362 174194 152923 51350 88438 23571 -41658 -4765 -6882 -12887 55765 142788 44850 -134055
1350 -134055 -209428 -172435 -175496 -117590 -5879 25994 22704 4614 -6588 111361 14046 -128293
1338 -128293 -35246 87742 144515 36668 -29387 -35528 -52674 -150727 -97090 -132517 -94773
1327 -94773 -111618 -163532 -71042 95814 35648 -28393 -41845 -12747 24694 11566 -8449 -103281
1315 -103281 -106956 21767 60469 -18816 -154772 -172194 -94571 -24139 -52369 -53160 -20949 -37704
1303 -37704 -108699 -119042 -31544 11818 -4484 28095 32374 67178 121561 15535 -51967 -7099
1291 -7099 16358 29351 -1635 63434 196111 223700 255371 317886 235389 165250 138768 57960
1279 57960 33847 88395 154397 73489 11107 -147158 -180700 -51445 60569 130430 78356
1268 78356 -76075 -93920 6991 102779 59784 45766 24263 -93893 -113938 24106 148564
1257 148564 208250 153254 98691 48041 72228 38488 39580 -17269 37164 112888 117053 46383
1245 46383 48363 4436 49165 95792 45572 -34939 -22952 75679 64935 20919 -6352 -20970
1233 -20970 -34431 29974 93396 83266 79402 71876 92051 59988 -6126 -63406 -146249 -128563
1221 -128563 -67558 -116826 -169599 -159614 4169 27630 22615 317 47408 53801 28334 80658
1209 80658 196335 179118 126471 62395 -6429 -43133 45991 108910 102824 3196 -21544 14095
1197 14095 13646 34925 44050 -12552 79752 111483 71578 37092 -20638 -12779 107418 89766
1185 89766 83796 110470 61492 125045 69030 36439 34509 59952 156735 144878 78908 131092
1173 131092 120723 113112 83496 67669 69018 253330 255009 225136 189258 114548 144167 251039
1161 251039 241088 101142 94539 15563 -132271 -172722 -148896 -60640 -11750 -41666 48785 126279
1149 126279 92855 144693 117225 34217 -34567 -48279 -101449 -11646 -27644 -66478 -17739 53968
1137 53968 81952 17983 -35785 -109420 -182783 -102834 -126535 -213271 -248984 -49083 43883 46273
1125 46273 -14388 -66672 -33654 2494 -109881 -119766 -57179 -69633 -74866 -36323 27495 42867
1113 42867 10743 89959 6429 33761 38983 19401 -31722 -44124 -40678 -19834 75263 60056
1101 60056 56583 55813 26937 18544 -130 22437 47779 118073 123448 124499 118399 247756 229190
1088 229190 284513 256524 133933 -71409 -155472 -181654 -134952 48466 67918 93911 141460
1077 141460 172349 60329 82893 42202 -53858 -64418 -80704 -38398 1063 -22360 -62136
1066 -62136 -8960 -2930 85592 87655 17457 76991 145303 95673 74537 -30650 -2447 80068
1054 80068 159448 231162 289723 212961 114880 136932 117999 48833 7786 30201 66677 119047
1042 119047 126769 31710 8449 -21960 64321 151596 82327 206189 302078 219547 130183 56191
1030 56191 90041 37945 9670 -47923 -35297 -38818 -66945 -43228 -2784 28722 -18062 13381
1018 13381 55512 129218 95138 31673 80402 81532 43668 61828 68558 43868 61198 52679
1006 52679 58793 110748 242857 207415 163308 250431 166722 72874 89811 91243 146130 87493
994 87493 6582 26999 115619 103635 104043 95052 60095 -92952 -98804 -88651 -35284 -12893 -15706
981 -15706 119482 218966 182128 75012 47344 19417 -5968 63917 65934 116 -30654 -44666
969 -44666 -44721 16328 -98293 -98743 -67608 -13829 -104033 -83881 56471 87891 2348 64106 86879
956 86879 69986 182733 162756 154089 229793 225952 121023 60636 88158 108366 114813 37542
944 37542 10365 122506 181319 192989 123890 -10468 -113027 -134825 -71797 -21770 -87534
933 -87534 -158209 -18980 80048 79124 18570 -99150 -194914 -121227 -71220 2562 -17872 -12561
921 -12561 66241 133265 254860 259758 208202 212216 196418 218731 192080 107707 165448 132363
909 132363 8927 -15971 25225 80662 41906 167731 220852 165297 118487 105227 32428
898 32428 -32330 64024 74638 113765 55703 25101 86081 186832 140391 16273 -57249 -76038
886 -76038 -92338 -36196 -104715 -138832 8740 92422 83674 31048 -53445 -81139 -5088 46461
874 46461 74266 113215 170952 195168 92609 -26532 -67832 -118724 -87915 -69741 -32824 -1821
862 -1821 109062 120192 40461 8077 -50535 6785 -41798 -122303 -168835 -154949 -41128 -94023
850 -94023 -187418 -106007 4630 51350 97115 167405 122727 -8384 -41915 93493 151206
839 151206 112000 119379 118464 97533 164338 160795 212718 255973 275200 281902 189853 199421 102056
826 102056 57433 45507 47629 23187 4252 22668 -7948 24819 27266 27037 -28535 -16378 2512
813 2512 6888 -87896 -44103 43741 39611 -22270 -75717 -86375 -107466 -108125 -119942 -91855 -66266
800 -66266 38 4831 19261 2620 96647 197391 137692 145093 72772 -14116 106375 123753
788 123753 106312 48684 -37657 3576 -30230 95904 150591 144712 75873 80826 93286 58864
776 58864 53441 6507 3373 45703 117330 63848 -18023 -91828 -124058 -108514 -97803 -169065
764 -169065 -84679 8709 21530 74949 -7995 -63804 -59785 -5386 27415 -44615 -95534 51019
752 51019 77009 17235 12931 -35276 11713 47179 138364 204112 242411 187354 111636 61441
740 61441 24938 -14695 -9612 72679 67134 144757 76566 -9781 45711 79226 36267 47277
728 47277 -4768 -8969 36646 89513 44965 -27290 -47022 -68215 -72434 2476 95700 69232
716 69232 101129 46222 41497 17880 -35113 117642 297074 346818 235397 122386 175003
705 175003 247931 224093 114765 182213 200699 226597 226125 96656 -52426 -80444 -77841 20031
693 20031 99608 177971 133722 57919 87575 83173 26498 3570 -30966 -51093 -70688 36216
681 36216 22763 -87038 -111539 -38655 47501 155215 117316 69480 80156 1810 -106568
670 -106568 -65444 -5388 -82606 -87918 -41461 -105647 -71273 -147837 -84551 965 12915 76373
658 76373 146970 144479 132547 168967 150947 55933 40021 93614 97558 42700 -120908 -282053
646 -282053 -228337 -92457 -10763 -133249 -168370 -100587 -32793 -4540 -49334 -7269 21063
635 21063 85183 135728 138210 35930 -10966 27898 -13967 29054 91008 80762 104607 -6393
623 -6393 25141 212072 140612 -575 17362 26927 -100377 -148089 3027 1745 -61044 -11563
611 -11563 -26207 -67398 -75149 -58153 -44910 -27435 94283 107723 43949 48885 73168 209405
599 209405 172718 107610 138012 90343 16014 -13154 -14431 10667 11673 33108 65987 63237
587 63237 32521 22336 66325 75453 71755 142011 78524 -3777 119637 144788 28907 76230
575 76230 62974 2452 -88850 -180242 -179022 -104617 -65107 95858 127922 64939 -79220 -93779
563 -93779 -97396 -61916 -10626 26794 48701 78000 -8347 37091 65634 -44461 9141 92228
551 92228 158523 152600 69298 -111411 -135361 -58280 -26943 81027 176740 121673 56572 76507
539 76507 76357 38875 -11245 15100 112223 35341 -96723 -113194 -41788 5475 77054 154174
527 154174 156746 89912 17439 -2805 4945 -79266 -151736 -158320 -75193 -41046 -25630 80968
515 80968 35094 -66425 -183534 -160457 25846 92124 110278 34641 -2465 8150 8345 59352
503 59352 80150 15342 55815 126788 81162 73797 13342 14508 6324 93216 135911 206488 139182
490 139182 64592 34633 5817 7481 74213 96976 141766 100036 157221 278992 280979 188313
478 188313 174151 193297 218847 282665 262237 242326 210646 182115 121180 33016 -35769 -1457
466 -1457 -52633 -40983 -6417 39107 31487 21605 102892 97103 67649 28306 24570 -87617 -131742
453 -131742 -129977 -182284 -171632 -139938 -118125 -46381 -37982 -38368 41581 75495 183067 229481
441 229481 221109 180303 70515 11534 -102083 -48753 97107 191529 145144 51201 29694
430 29694 66716 114408 21946 -180653 -185328 -88688 6022 -59374 -140596 -154175 -149358 -102924
418 -102924 22084 31980 219 -33991 33764 34336 -58775 -68016 -86924 -128111 -136872 -37378 58612
405 58612 -6141 29254 32102 -22820 -15551 -38137 11807 38624 163301 202981 102310 39815
393 39815 -2758 71562 41403 -105640 -177126 -65178 99892 155112 122603 82163 107606
382 107606 171708 225136 186537 17970 51377 118931 130465 91300 131231 189099 107851 80346
370 80346 -18992 -18136 -12867 -17831 67502 -3217 -116902 -49303 47884 46889 75409 25143 -16312
357 -16312 -38295 -11449 44268 17769 112493 193391 71663 45834 54956 70594 108805 161414
345 161414 147977 97079 147652 198347 214306 199053 183175 15351 -9274 89143 136862 115749
333 115749 165730 246936 149569 84845 68665 69163 -3029 -8183 -19688 -55391 -76938 -113959
321 -113959 -85606 -25582 9525 85738 59606 42556 935 39247 -30060 10460 9700 38260
309 38260 -15989 -48595 -38864 7720 52338 11166 49284 80305 138028 187071 196373 249326
297 249326 210223 189962 182617 53949 38797 105303 72245 30865 41518 82997 117621 96792
285 96792 51568 83854 150394 264287 362742 426286 385610 287112 119355 84968 -18311
274 -18311 -75412 -47886 22860 -836 -47201 -24568 -41870 -61603 -108899 -122107 -32813 16370
262 16370 58994 49747 22900 19738 127448 156370 140349 114857 94860 84050 40147 1366
250 1366 25506 108063 156786 147314 95794 93313 119341 69569 67859 -43731 -174689 -108716
238 -108716 -39768 12077 94730 79664 102292 111570 49780 24005 45468 -16833 -38665 -54577
226 -54577 -104491 -53302 -44508 16437 73989 97883 89379 79332 66058 85319 114434 112253 82512
213 82512 78991 56729 51984 -29709 -65078 -9932 17160 23370 11950 -22234 -48603 20699 39556
200 39556 23122 -1149 32131 22705 73068 106483 131076 130761 95248 119574 64518 -1991 73264
187 73264 65566 173626 144427 102725 153718 218623 140477 -11158 -38754 -22424 -13423 -21484
175 -21484 35672 165385 133900 44082 47433 28754 6690 24395 6790 51162 110573 50716
163 50716 2987 64145 135579 66765 -16951 -26171 -44284 -42921 -5775 39253 50343 -13466
151 -13466 10390 17205 16455 2888 -36474 -66146 -57416 -47591 23144 28065 62471 47831 41815
138 41815 40847 28622 1345 12636 86481 42673 55266 45017 5277 -13184 14914 94004
126 94004 148160 216190 158420 87690 85798 124653 140653 70667 15390 50233 51902 -46321
114 -46321 29635 148406 137170 153385 94074 59188 77918 40365 87650 158739 184435 182961
102 182961 178971 85237 90845 171274 171374 112182 51932 45269 19240 2415 -48771 -46830 -11051
89 -11051 -45808 -18937 24068 26602 34340 51192 77428 117218 48934 -11104 -69170 -30866 36303
76 36303 90304 165800 190424 126153 46913 60034 96386 101381 94018 115226 52804 -33657 -88072
63 -88072 -125710 -89954 -17941 -28287 -29707 768 81205 154334 46795 -14526 -21079 12875
51 12875 13178 15878 78548 84034 63590 23013 24956 -29173 -11932 89967 154410 103293 132291
38 132291 100779 36697 22804 103908 112463 99380 145217 149875 37315 -9945 12496 -214
26 -214 -38817 -3830 66016 39421 50313 81613 96376 170678 172002 78168 24352 46502 80992
13 80992 104142 33065 2311 54843 97495 92702 79564 94307 100238 154887 159296 88317 53638
0 53638
$$ Imaginary data points
##PAGE= N=2
##DATA TABLE= (X++(I..I)), XYDATA
32767 227370 274013 264540 271586 278809 268577 264342 299343 318697 341583 283786 253633 268886
32755 268886 270637 231207 280021 303092 245875 290810 312775 321971 304400 312288 354261 430034
32743 430034 525134 531429 453498 358278 319979 407442 456791 457959 469381 447000 464842 452603
32731 452603 338317 290436 292577 326117 399921 481626 457118 385133 365561 374587 413193 423449
32719 423449 412710 370092 342702 370074 380278 370296 355852 342511 370280 445767 425179 355751
32707 355751 364162 341829 464358 536525 540448 534031 454705 403227 335721 303521 299633 318244
32695 318244 314910 308396 344959 373398 475990 586400 618755 584082 531885 493292 486408 458617
32683 458617 419078 462086 448529 360048 412624 512217 494501 455265 477914 471176 484626 460789
32671 460789 495691 509769 491189 504720 522171 548815 543754 474831 479876 588013 674812 668891
32659 668891 607395 584022 560676 586475 580441 571108 623823 585474 609026 667535 667440 686380
32647 686380 697066 736609 712939 693240 759755 734639 693991 682579 673333 595293 608890 623451
32635 623451 642852 638692 605975 601278 682031 719864 762588 687776 612133 576883 571138 503699
32623 503699 597491 716068 713468 660679 668858 730108 742710 696381 715770 776967 785078 667536
32611 667536 653970 753107 781497 754955 719416 717547 744978 784581 805044 860725 858867 764999
32599 764999 687181 757556 841385 886172 765631 740665 681040 690824 741362 778873 811063
32588 811063 822068 782872 811505 890055 765329 766299 791303 844899 888755 885038 769442 795971
32576 795971 779490 755503 800067 792189 784333 800680 845655 942880 892343 912404 908544 889520
32564 889520 935684 921563 925705 913251 880939 889432 864444 790584 875687 966070 1054990 1042030
32552 1042030 1006151 1032727 1056410 1045825 956255 989913 1012051 953396 895483 898093 916588
32541 916588 914765 957171 940404 870784 964764 988851 1072461 1061764 1039464 921442 874981
32530 874981 919802 1003516 960928 962876 885609 803807 773652 879043 946855 971137 905436
32519 905436 870544 936477 1024765 855797 815150 878558 997019 1001172 1058132 1028473 1020365
32508 1020365 1006645 1016679 981084 940138 946469 922337 949697 1030740 1128577 1213356 1140391
32497 1140391 1145502 1108901 1046536 1040313 1023065 1061067 1083222 1081185 1077244 1077243 1045553 926252 875191
32484 875191 935711 941382 947695 981120 998106 877261 887198 997019 999696 1030854 1029773 890003
32472 890003 856978 914674 1030063 1060951 1029671 987343 1129216 1090558 1054292 1097657 1071167
32461 1071167 1040378 1054779 1057398 1034210 983819 1023180 1094654 1106431 1118298 1116997 1044931 1054554
32449 1054554 1044940 1057324 1044145 1081451 1125204 1116242 1075052 1122948 1189591 1100961 1139233 1243012
32437 1243012 1307900 1312549 1286112 1322381 1276252 1186852 1122625 1182858 1256366 1302686 1219821
32426 1219821 1132927 1132827 1029945 1134826 1087786 952524 906238 945696 962824 996208 1055371
32415 1055371 1156770 1159131 1121013 1160559 1265882 1339916 1350517 1337249 1364395 1316909 1259605
32404 1259605 1262061 1320092 1241195 1088044 1099661 1179412 1185845 1091490 1035224 1049983 1107892
32393 1107892 1086624 1049979 1037851 1129936 1161267 1112621 1152941 1257447 1306114 1278839 1265298
32382 1265298 1246692 1180656 1168603 1225038 1218743 1129272 1089028 1055219 1070530 1102097 1165431
32371 1165431 1070466 1047144 1039529 1061915 1131867 1123927 1231186 1319574 1232466 1163862 1211401
32360 1211401 1297549 1178423 1142565 1096756 1132761 1271374 1280823 1171742 1180780 1132692 1090635
32349 1090635 1120395 1220481 1117453 1114581 1096732 1015461 1070807 1114833 1130492 1212261 1288895
32338 1288895 1282126 1197850 1191516 1219088 1216407 1263108 1287583 1232203 1226486 1208710 1206316 1276724
32326 1276724 1364513 1396883 1280886 1248366 1335152 1339450 1306764 1331838 1337675 1342987 1420016 1308493
32314 1308493 1180173 1239227 1224359 1131478 1172063 1184149 1216310 1245133 1337060 1249715 1164822
32303 1164822 1205856 1276908 1342209 1337935 1309403 1276331 1195781 1176735 1181048 1195818 1163915 1228343
32291 1228343 1217439 1148388 1129310 1205368 1303184 1318365 1258037 1222604 1202593 1265545 1240864
32280 1240864 1230782 1243838 1264205 1308116 1330678 1318581 1278155 1304870 1361780 1496431 1455834
32269 1455834 1368569 1298958 1276022 1204251 1206019 1317826 1308203 1214137 1087692 1036168 973278
32258 973278 995178 1004355 1134905 1216884 1359302 1353016 1377696 1305970 1323765 1405107 1458572
32247 1458572 1430554 1351134 1252839 1263724 1367776 1371766 1272607 1311977 1268634 1270045 1326312
32236 1326312 1352036 1245243 1165682 1123129 1129469 1247959 1346190 1323880 1243515 1250514 1237837
32225 1237837 1253234 1300269 1217493 1147171 1123407 1133265 1168813 1182824 1071371 971900 934434
32214 934434 977777 1058067 1125792 1219034 1231406 1200540 1196084 1134047 1224822 1313030 1298440 1287382
32202 1287382 1317969 1347799 1391849 1386596 1346332 1385283 1312362 1279219 1237583 1261072 1333120
32191 1333120 1287273 1198698 1162381 1192196 1239699 1240493 1235292 1232906 1195986 1230744 1223059 1245607
32179 1245607 1281260 1286148 1346781 1296341 1278059 1353937 1372084 1335676 1340727 1387172 1330494 1293169
32167 1293169 1316789 1371311 1227813 1259339 1398994 1457251 1424697 1408796 1378377 1303979 1296022
32156 1296022 1257360 1250710 1284727 1369566 1460000 1484122 1488002 1404333 1362393 1269823 1184811 1277302
32144 1277302 1339485 1284735 1162934 1075089 1067624 1194440 1332056 1348880 1453689 1467389 1352675
32133 1352675 1318695 1263041 1251211 1397910 1365869 1346244 1357169 1297274 1252079 1280815 1310959
32122 1310959 1153747 1093060 1114274 1207231 1144505 1151202 1138123 1210769 1333628 1282059 1272057
32111 1272057 1335149 1346624 1355233 1329067 1270189 1362191 1362072 1317626 1241522 1255014 1359888 1367328
32099 1367328 1311946 1437527 1399929 1366983 1247372 1201214 1353778 1386325 1404157 1320952 1324761
32088 1324761 1340881 1366956 1305460 1255734 1293154 1249955 1264456 1338861 1259884 1197388 1199622
32077 1199622 1184599 1225844 1335354 1406693 1362808 1401974 1300324 1172537 1214365 1250997 1303492
32066 1303492 1285005 1340199 1362180 1270270 1277788 1235283 1241213 1176020 1243113 1234590 1239595 1332510
32054 1332510 1439854 1504059 1526576 1473111 1421160 1251042 1127850 1171955 1245684 1141175
32044 1141175 1119567 1191402 1252065 1266580 1395727 1379551 1351724 1402249 1522433 1459724 1302817
32033 1302817 1176434 1143604 1141664 1126709 1130165 1253186 1391420 1416743 1335973 1275668 1325687
32022 1325687 1282215 1373055 1414683 1298013 1189930 1152685 1250225 1184893 1113263 1089177 1154992
32011 1154992 1174240 1218194 1159917 1203705 1238011 1255605 1275069 1296803 1320355 1219098 1183079
32000 1183079 1240755 1366534 1368460 1278747 1317721 1343457 1353080 1427809 1444457 1434481 1413118 1320362
31988 1320362 1343726 1351076 1336327 1345452 1268546 1380600 1369252 1326372 1348016 1424636 1450402
31977 1450402 1433945 1448591 1458385 1376220 1312835 1401651 1395272 1338254 1320058 1297796 1328731 1377557
31965 1377557 1403618 1300748 1391232 1434514 1402564 1371252 1329558 1311360 1336295 1219414 1182224
31954 1182224 1199717 1206480 1268182 1391519 1356236 1286617 1269521 1166001 1127497 1142989 1189632
31943 1189632 1183495 1175995 1253164 1374494 1399672 1453225 1394101 1369145 1344293 1426257 1420316 1378786
31931 1378786 1309367 1318652 1401095 1432553 1399038 1451915 1442763 1369089 1406432 1389671 1342202 1436975
31919 1436975 1358473 1206259 1209112 1272953 1281979 1301748 1264088 1236841 1316418 1347544 1373344
31908 1373344 1507410 1574318 1461350 1356847 1314526 1290140 1244686 1262498 1407934 1420023
31898 1420023 1448918 1439949 1395582 1234555 1313228 1384880 1307436 1338573 1403131 1440663 1376787
31887 1376787 1339035 1406823 1344023 1201549 1250029 1364658 1386671 1433169 1433371 1397230 1374137
31876 1374137 1414693 1454367 1375530 1382615 1400302 1415647 1403201 1352694 1331171 1381225 1366162
31865 1366162 1300693 1281635 1316481 1321008 1306038 1354079 1344408 1329387 1381026 1406658 1306315
31854 1306315 1251794 1238807 1264127 1320174 1347843 1338294 1421979 1306274 1263011 1341306 1282838
31843 1282838 1232323 1337592 1388600 1475358 1523212 1467459 1385591 1340511 1321643 1340818 1316680
31832 1316680 1357101 1342296 1405312 1436288 1411385 1288694 1226459 1207296 1202171 1141028 1225350
$$ [...]
##END NTUPLES=NMR SPECTRUM
##END=
