##TITLE=Analysis number 312676
Compound Code ac 33073
Project Code qc-cat
Chemist Name andyc
##JCAMPDX= 6.0         $$ Bruker NMR JCAMP-DX V2.0
##DATA TYPE= NMR SPECTRUM
##DATA CLASS= NTUPLES
##ORIGIN= Bruker BioSpin GmbH
##OWNER= NMR
$$ XWIN-NMR		Version 3.5
$$ Wed Aug 10 15:23:56 2005 GMT Daylight Time (UT+1h)  MAYBRIDGE\NMR@NMR_250MHZ
##.OBSERVE FREQUENCY= 250.131544655141
##.OBSERVE NUCLEUS= ^1H
##.ACQUISITION MODE= SIMULTANEOUS (DQD)
##.ACQUISITION SCHEME= undefined
##.AVERAGES= 16
##.DIGITISER RES= 18
##SPECTROMETER/DATA SYSTEM= dpx250
##.PULSE SEQUENCE= zg30
##.SOLVENT NAME= DMSO
##.SHIFT REFERENCE= (INTERNAL, DMSO, 0, 16.522)
##AUDIT TRAIL= $$ (NUMBER, WHEN, WHO, WHERE, WHAT)
$$ ##TITLE= Audit trail, XWIN-NMR		Version 3.5
$$ ##JCAMPDX= 5.01
$$ ##ORIGIN= Bruker BioSpin GmbH
$$ ##OWNER= NMR
$$ C:\u/data/dgb/nmr/ADRS/7520/pdata/1/auditp.txt
$$ ##AUDIT TRAIL=  $$ (NUMBER, WHEN, WHO, WHERE, WHAT)
(   1,<2005-08-10 15:23:35.00 +100>,<MAYBRIDGE\NMR>,<NMR_250MHZ>,
      <created by zg, POWCHK disabled, PULCHK disabled
       configuration hash MD5:
       62 19 C7 07 E1 42 D1 B7 37 6C 3D D0 77 39 F9 E6
       data hash MD5: 64K
       12 B0 41 55 7E 8B 5C BC BD 7C 79 FC D0 88 2E 1D>)
(   2,<2005-08-10 15:23:46.96 +100>,<MAYBRIDGE\NMR>,<NMR_250MHZ>,
      <Start of raw data processing
       ef LB = 0.3 FT_mod = 6 PKNL = 1 SI = 32K 
       data hash MD5: 32K
       20 04 4C 54 95 39 85 D2 7C C4 E9 09 33 FF D3 5A>)
(   3,<2005-08-10 15:23:48.93 +100>,<MAYBRIDGE\NMR>,<NMR_250MHZ>,
      <apk 
       data hash MD5: 32K
       99 A0 4E 69 C7 CA 27 6F FD 97 AA 2E 7A 3E C5 44>)
(   4,<2005-08-10 15:23:49.68 +100>,<MAYBRIDGE\NMR>,<NMR_250MHZ>,
      <abs ABSG = 5 
       data hash MD5: 32K
       29 8F 3B 9D 6D 99 F1 02 92 94 B1 FE 89 05 7F 4F>)
$$ ##END=
$$ 
$$ hash MD5
$$ F3 77 52 7B BE 9A DA 13 0D 4F 06 D6 14 EF AC CD
##$RELAX= 
##$RELAX= 
##$RELAX= 
##$RELAX= 
##$RELAX= 
##$RELAX= 
##$RELAX= 
$$ Bruker specific parameters
$$ --------------------------
##$DU= <C:\u>
##$EXPNO= 7520
##$NAME= <ADRS>
##$PROCNO= 1
##$TYPE= <nmr>
##$USER= <dgb>
##$AMP= (0..31)
100 100 100 100 100 100 100 100 100 100 100 100 100 100 100 100 100 100 
100 100 100 100 100 100 100 100 100 100 100 100 100 100 
##$AQSEQ= 0
##$AQ_mod= 3
##$AUNM= <au_zg>
##$AUTOPOS= <43 >
##$BF1= 250.13
##$BF2= 250.13
##$BF3= 250.13
##$BF4= 250.13
##$BF5= 500.13
##$BF6= 500.13
##$BF7= 500.13
##$BF8= 500.13
##$BYTORDA= 1
##$CFDGTYP= 0
##$CFRGTYP= 5
##$CHEMSTR= <none>
##$CNST= (0..31)
1 1 145 1 1 1 1 1 1 1 1 1 1 1 1 1 1 1 1 1 1 1 1 1 1 1 1 1 1 1 1 1 
##$CPDPRG= <>
##$CPDPRG1= <>
##$CPDPRG2= <>
##$CPDPRG3= <>
##$CPDPRG4= <mlev>
##$CPDPRG5= <mlev>
##$CPDPRG6= <mlev>
##$CPDPRG7= <mlev>
##$CPDPRG8= <mlev>
##$CPDPRGB= <>
##$CPDPRGT= <>
##$D= (0..31)
0 1 0 0 0 0 0 0 0 0.06 0 0 0 0 0 0 0.0002 0 0 0 0 0 0 0 0 0 0 0 0 0 0 
0 
##$DATE= 1123683814
##$DBL= (0..7)
120 120 120 120 120 120 120 120 
##$DBP= (0..7)
150 150 150 150 150 150 150 150 
##$DBP07= 0
##$DBPNAM0= <>
##$DBPNAM1= <>
##$DBPNAM2= <>
$$ [...]
##$SUBNAM7= <"">
##$SUBNAM8= <"">
##$SUBNAM9= <"">
##$SW= 20.6930455092707
##$SWIBOX= (0..15)
0 0 3 0 0 0 0 0 0 0 0 0 0 0 0 0 
##$SW_h= 5175.983436853
##$TD= 65536
##$TD0= 1
##$TE= 295.16
##$TE2= 300
##$TE3= 300
##$TEG= 300
##$TL= (0..7)
0 120 120 120 120 120 120 120 
##$TP= (0..7)
150 150 150 150 150 150 150 150 
##$TP07= 0
##$TPNAME0= <>
##$TPNAME1= <>
##$TPNAME2= <>
##$TPNAME3= <>
##$TPNAME4= <>
##$TPNAME5= <>
##$TPNAME6= <>
##$TPNAME7= <>
##$TPOAL= (0..7)
0.5 0.5 0.5 0.5 0.5 0.5 0.5 0.5 
##$TPOFFS= (0..7)
0 0 0 0 0 0 0 0 
##$TUNHIN= 0
##$TUNHOUT= 0
##$TUNXOUT= 0
##$USERA1= <user>
##$USERA2= <user>
##$USERA3= <user>
##$USERA4= <user>
##$USERA5= <user>
##$V9= 5
##$VALIST= <valist>
##$VCLIST= <CCCCCCCCCCCCCCC>
##$VD= 0
##$VDLIST= <DDDDDDDDDDDDDDD>
##$VPLIST= <PPPPPPPPPPPPPPP>
##$VTLIST= <TTTTTTTTTTTTTTT>
##$WBST= 1024
##$WBSW= 4
##$XGAIN= (0..3)
0 0 0 0 
##$XL= 0
##$YL= 0
##$YMAX_a= 249568
##$YMIN_a= -350220
##$ZGOPTNS= <>
##$ZL1= 120
##$ZL2= 120
##$ZL3= 120
##$ZL4= 120
##$ABSF1= 16.522
##$ABSF2= -4.171173
##$ABSG= 5
##$ABSL= 3
##$ALPHA= 0
##$AQORDER= 0
##$ASSFAC= 0
##$ASSFACI= 0
##$ASSFACX= 0
##$ASSWID= 0
##$AUNMP= <proc_1d>
##$AZFE= 0.1
##$AZFW= 0.1
##$BCFW= 0
##$BC_mod= 0
##$BYTORDP= 0
##$COROFFS= 0
##$CY= 12.5
##$DATMOD= 1
##$DC= 0
##$DFILT= <>
##$DTYPP= 0
##$F1P= 14.0000005364418
##$F2P= -0.99999901652339
##$FCOR= 0.5
##$FTSIZE= 32768
##$FT_mod= 6
##$GAMMA= 0
##$GB= 0
##$INTBC= 1
##$INTSCL= 1
##$ISEN= 128
##$LB= 0.3
##$LEV0= 0
##$LPBIN= 0
##$MAXI= 10000
##$MC2= 0
##$MEAN= 0
##$ME_mod= 0
##$MI= 0
##$NCOEF= 0
##$NC_proc= -5
##$NLEV= 6
##$NOISF1= 0
##$NOISF2= 0
##$NSP= 0
##$NTH_PI= 0
##$NZP= 0
##$OFFSET= 16.522
##$PC= 1
##$PHC0= -88.8149
##$PHC1= 9.386839
##$PH_mod= 1
##$PKNL= yes
##$PPARMOD= 0
##$PSCAL= 4
##$PSIGN= 0
##$REVERSE= no
##$SF= 250.13
##$SI= 32768
##$SIGF1= 0
##$SIGF2= 0
##$SINO= 400
##$SIOLD= 32768
##$SREGLST= <1H.DMSO>
##$SSB= 0
##$STSI= 32768
##$STSR= 0
##$SW_p= 5175.98343685301
##$SYMM= 0
##$S_DEV= 0
##$TDeff= 65536
##$TDoff= 0
##$TI= <Analysis number 999999
Compound Code 99
Book Reference 9
Project Code 9>
##$TILT= no
##$TM1= 0
##$TM2= 0
##$TOPLEV= 0
##$USERP1= <user>
##$USERP2= <user>
##$USERP3= <user>
##$USERP4= <user>
##$USERP5= <user>
##$WDW= 1
##$XDIM= 32768
##$YMAX_p= 312526347
##$YMIN_p= -891928
$$ End of Bruker specific parameters
$$ ---------------------------------
##NTUPLES= NMR SPECTRUM
##VAR_NAME=  FREQUENCY,     SPECTRUM/REAL,   SPECTRUM/IMAG
##SYMBOL=    X,             R,               I
##VAR_TYPE=  INDEPENDENT,   DEPENDENT,       DEPENDENT
##VAR_FORM=  AFFN,          ASDF,            ASDF
##VAR_DIM=   32768,         32768,           32768
##UNITS=     HZ,            ARBITRARY UNITS, ARBITRARY UNITS
##FACTOR=    0.157963299565203, 1,           1
##FIRST=     4132.6476996994, 0,             0
##LAST=      -1043.33573715361, 0,           0
##MIN=       -1043.33573715361, -891928,     0
##MAX=       4132.6476996994, 312526347,     0
$$ Real data points
##PAGE= N=1
##DATA TABLE= (X++(R..R)), XYDATA
$$ [...]
18201E634790p3915p1346J71897R7738j10759j8015J62687J87970M6807p1266
$$ 5634790 5560875 5489529 5661426 5759164 5648405 5630390 5793077 5981047 6027854 5956588
18191E956588R229j28074j58956n4166j46705o5808j27106K03897K57967Q1853
$$ 5956588 5965817 5837743 5678787 5624621 5477916 5412108 5285002 5488899 5746866 5828719
18181E828719m3826m3859M2377P7809n5743q8891k1949J21708j9271K8840K0764
$$ 5828719 5784893 5741034 5783411 5861220 5805477 5716586 5694637 5816345 5797074 5825914 5846678
18170E846678n8616l07554K4130m7976J33023J90904J81996N5777J8437r7305
$$ 5846678 5788062 5480508 5504638 5456662 5589685 5780589 5962585 6018362 6036799 5939494
18160E939494j82290l6048n2627J964n6271O5873r7705j70745K50777J90111r7786
$$ 5939494 5757204 5721156 5668529 5670493 5614222 5680095 5582390 5411645 5662422 5852533 5754747
18149E754747j81904J42416O6154o8261q3745l8477M1146P8872N6570M709Q3198
$$ 5754747 5572843 5715259 5781413 5713152 5629407 5590930 5632076 5710948 5767518 5772227 5855425
18138E855425J85781r1962n5864j8774O9748j3936j21768j17507L3900m3513L9790
$$ 5855425 6041206 5949244 5893380 5874606 5944354 5930418 5808650 5691143 5725043 5681530 5721320
18127E721320K59042O3015q7495N700J53308j19845j86490R8005j2928k29757
$$ 5721320 5980362 6043377 5955882 5961582 6114890 5995045 5808555 5906560 5893632 5663875
18117E663875j2246M17083J89612m4046k14580N320K11304L61105j99281l63856
$$ 5663875 5651629 6068712 6258324 6214278 5999698 6005018 6216322 6577427 6378146 6014290
18107F014290J94430L6418q9694k55644q6422o8949L6542K3836l5061J18412K0997
$$ 6014290 6208720 6245138 6155444 5899800 5813378 5744429 5780971 5804807 5769746 5888158 5909155
18096E909155j46115k2630J23735O5956K3793n3523p9621q8048J23939j22012
$$ 5909155 5763040 5740410 5864145 5930101 5953894 5900371 5820750 5732702 5856641 5734629
18086E734629j40322j19042L2828M2999R2182k744L03774J73677j36756k89977
$$ 5734629 5594307 5475265 5508093 5551092 5643274 5640530 5944304 6117981 5981225 5691248
18076E691248k2048K47553j93289M7792J61616j23224l0923J94507o3967M6450
$$ 5691248 5669200 5916753 5723464 5771256 5932872 5809648 5778725 5973232 5909265 5955715
18066E955715K8243M6155M0753o2308m3739J07942J03041n1379L1840J00815r5782
$$ 5955715 5983958 6030113 6070866 6008558 5964819 6072761 6175802 6124423 6156263 6257078 6161296
18055F161296j03091n6946r489J81872N4062q0489k6711J12998J01312j14392
$$ 6161296 6058205 6001259 5991770 6173642 6227704 6147215 6120504 6233502 6334814 6220422
18045F220422j5120J2074m0387l0467k2402J93684Q2892k5011j62691j65101m0538
$$ 6220422 6205302 6217376 6176989 6146522 6124120 6317804 6400696 6375685 6212994 6047893 6007355
18034F007355K03859R4735J17761j22431L3983j61112q048J03868J01547K68347
$$ 6007355 6211214 6305949 6423710 6301279 6335262 6174150 6166102 6269970 6371517 6639864
18024F639864J28494J63438k00192j4954K57925m337r4990J18784L34544J25570
$$ 6639864 6768358 6931796 6731604 6716650 6974575 6970238 6875248 6994032 7328576 7454146
18014G454146j48719K6856N2538K14006J53676o0614J6603R1945M5903J71585
$$ 7454146 7305427 7332283 7384821 7598827 7752503 7691889 7708492 7800437 7846340 8017925
18004H017925L44067L515J6490M48756M70641M45387J95487L39577Q32427R81132
$$ 8017925 8361992 8365507 8381997 8830753 9301394 9746781 9942268 10281845 11114272 12095404
17994A2095404J033368J440927K167026K886248L602127M124542L954295K931438
$$ 12095404 13128772 14569699 16736725 19622973 23225100 27349642 31303937 34235375
17986C4235375J328215m18783j323661o66776O44768J844360K275599J645866
$$ 34235375 35563590 35144807 33821146 33154370 33799138 35643498 37919097 39564963
17978C9564963l53324k751778m291597m766491m072133l150007k375709j589140
$$ 39564963 39211639 36459861 32168264 27401773 23329640 20179633 17803924 16214784
17970A6214784j404492j157442o85295l02437l18714k90724j86220k65532L8568
$$ 16214784 14810292 13652850 12967555 12665118 12346404 12055680 11869460 11603928 11642496
17961A1642496J61076K04120K59365K95991L47255K78366O72863Q56168R43979
$$ 11642496 11803572 12007692 12267057 12563048 12910303 13188669 13861532 14717700 15661679
17952A5661679J293787J660322K161049K901183M196813N317771O927468Q600755
$$ 15661679 16955466 18615788 20776837 23678020 27874833 33192604 40120072 48720827
17944D8720827R352781P857601M665199R61476j391502j077463J40034J530192
$$ 48720827 58073608 65931209 70596408 71557884 70166382 69088919 69228953 70759145
17936G0759145K016506J171793q25816l496957n765479o222865n171223l656802
$$ 70759145 72775651 73947444 73121628 69624671 63859192 57636327 52465104 48808302
17928D8808302l082332l895588m518173m692939m405423l906233l011247k272555
$$ 48808302 45725970 41830382 37312209 32619270 28213847 24307614 21296367 19023812
17920A9023812j610190j329742q14437q21067p27321n08349m61859Q5052k3459
$$ 19023812 17413622 16083880 15269443 14448376 13721055 13212706 12750847 12835899 12812440
17911A2812440k42485j46684J31203M27579N57632M25880K38559M17010R64587
$$ 12812440 12569955 12423271 12554474 12982053 13539685 13965565 14204124 14621134 15585721
17902A5585721J382444J610344J853379K497272L703851M982904O554827P749343
$$ 15585721 16968165 18578509 20431888 22929160 26633011 31615915 38170742 45920085
17894D5920085P492308N209352J505902k061375l861210m036642k470667r8223
$$ 45920085 53412393 58621745 60127647 58066272 54205062 50168420 47697753 47599530
17886D7599530K033935L055089K457738J37171k685805n238610o287469o100795
$$ 47599530 49633465 52688554 55146292 55283463 52597658 47359048 41071579 34970784
17878C4970784m876523l246523k256327j552922j140674l21694P5171Q26355J358816
$$ 34970784 30094261 26847738 24591411 23038489 21897815 21576121 21651292 22477647 23836463
17869B3836463J776943K715789M095040N838418P316160Q446332P530526L906294
$$ 23836463 25613406 28329195 32424235 38262653 45578813 54025145 61555671 65461965
17861F5461965p92548l506831l504468j849355J138746L667314M751416K910619
$$ 65461965 64669417 61162586 57658118 55808763 56947509 60614823 65366239 68276858
17853F8276858j678603o505040q977482q929407p396562n763494m074283l200191
$$ 68276858 66598255 60093215 51115733 42186326 34789764 29026270 24951987 21751796
17845B1751796k229353j757707r91545q92237r83510m63447k88195l12808j41543
$$ 21751796 19522443 17764736 16773191 15880954 14897444 14433997 14145802 13832994 13691451
17836A3691451L1299M7511p7370J04067J40376P8930K66348L93164P29122O20215
$$ 13691451 13722750 13770261 13692891 13796958 13937334 14016264 14282612 14675776 15404898 16025113
17826A6025113R54330J614845J888791K312000L794005N006150O031493O644172
$$ 16025113 16979443 18594288 20483079 22795079 26589084 31595234 37626727 44270899
17818D4270899O187037M577777M004961M231107M729016M285600K471211M84484
$$ 44270899 50457936 55035713 59040674 63271781 68000797 72286397 74757608 75242092
17810G5242092p59596q97636p05860j63255n58778l489423p086240r193822r093180
$$ 75242092 74482496 73584860 72879000 72715745 72156967 68667544 61581304 52387482 43294302
17801D3294302p570103n666941m600668l287328k408790j947090j779058j451468
$$ 43294302 35724199 30057258 25456590 22169262 19760472 17813382 16034324 14582856
17793A4582856j039667o88872l18375m87028k11109j70137r2182k48849j17827
$$ 14582856 13543189 12854317 12535942 12048914 11837805 11667668 11575486 11326637 11208810
17784A1208810j0325o9693J7399j16385k2207K63946N65826N94198P97795J119602
$$ 11208810 11198485 11128792 11146191 11029806 11007599 11271545 11837371 12431569 13229364 14348966
17774A4348966J586585K370938L114588L998565M288795L704583J666018o54175
$$ 14348966 15935551 18306489 21421077 25419642 29708437 33413020 35079038 34424863
17766C4424863j907843j352383n09254M78882J025532M9954j916753l426112l919724
$$ 34424863 32517020 31164637 30655383 31134265 32159797 32209751 30292998 26866886 22947162
17757B2947162l777196k899520k115961j376642j075981j109727p65354l83493
$$ 22947162 19169966 16270446 14154485 12777843 11701862 10592135 9826781 9443288
17749I443288n80323l10091m44323l26856j09617j96951l03641l03575R0755j0148
$$ 9443288 8862965 8552874 8108551 7781695 7672078 7475127 7171486 6867911 6958666 6948518
17739F948518r2016j71678q3895q9643p3999q8426j49874r8536j71411m8928K53762
$$ 6948518 6856502 6684824 6600929 6511286 6437287 6348861 6198987 6100451 5929040 5880112 6133874
17728F133874J27357j53058O0351j4595j36161m1349m0587j26945j3663J95442
$$ 6133874 6261231 6108173 6168524 6153929 6017768 5976419 5935832 5808887 5795224 5990666
17718E990666J52511j15375m7024j14969J01026j54136l00383j46137N4558O6785
$$ 5990666 6143177 6027802 5980778 5865809 5966835 5812699 5512316 5366179 5420737 5487522
17708E487522o5527k36666K65937K86875J04834j63751j60779j7041L1310J89677
$$ 5487522 5421995 5185329 5451266 5738141 5842975 5679224 5518445 5501404 5532714 5722391
17698E722391K1141k09820M5777k675k7272j04006n7275Q3048Q1857l3003l836
$$ 5722391 5743532 5533712 5579489 5576814 5549542 5445536 5388261 5471309 5553166 5520163 5516327
17687E516327K1119R3282M1262n1255K3395o126q2937p6793N8519p1203J03535
$$ 5516327 5537446 5630728 5671990 5620735 5644130 5638004 5555067 5478274 5536793 5465590 5569125
17676E569125O1811j06346j39834Q163n7346j24651r6006Q5271R8924L6185k89903
$$ 5569125 5630936 5524590 5384756 5392919 5335573 5210922 5114916 5200187 5299111 5335296 5045393
17665E045393K5239J15935N2337J6973K22785J1257k36468j44166Q2728J33400
$$ 5045393 5070632 5186567 5238904 5255877 5478662 5489919 5253451 5109285 5192013 5325413
17655E325413j9410j0760L6084q1912l7853j35508J82300M2830R6952J05767k0663
$$ 5325413 5306003 5295243 5331327 5249415 5211562 5076054 5258354 5301184 5398136 5503903 5483240
17644E483240Q3011j32704k5725j70001J4993P8971r86R9387l03732Q6363O096
$$ 5483240 5566251 5433547 5407822 5237821 5252814 5331785 5330799 5430186 5126454 5212817 5218913
17633E218913k0641r9342n7845p9869P0281P0739j3557j44370N1408J56465N4248
$$ 5218913 5198272 5098930 5041085 4961216 5031497 5102236 5088679 4944309 4995717 5152182 5206430
17622E206430r1834j83411J40248R1193N0864j60407r2943k02434r1531J42439
$$ 5206430 5114596 4931185 5071433 5162626 5213490 5053083 4960140 4757706 4666175 4808614
17612D808614Q082J75614J00670O0275N7355n956k9144O7787j27254Q189j1274
$$ 4808614 4816696 4992310 5092980 5153255 5210610 5204654 5175510 5243297 5116043 5124232 5112958
17601E112958M4051n1228m4483k3941l8464L3729O968k9018k3799J63741L0567
$$ 5112958 5157009 5105781 5061298 5037357 4998893 5032622 5039590 5010572 4986773 5150514 5181081
17590E181081J9558k24392k59148p7975J31358j04192j24860J07995J92636j79604
$$ 5181081 5200639 4976247 4717099 4639124 4770482 4666290 4541430 4649425 4842061 4662457
17580D662457q8251N7006J95070P0432K31033Q0541o6388k81151p3317K4280Q6412
$$ 4662457 4574206 4631212 4826282 4896714 5127747 5208288 5141900 4860749 4787432 4811712 4898124
17569D898124K34616K4169j90807j82061J04080m210P1622p765p2823J57663J01267
$$ 4898124 5132740 5156909 4966102 4784041 4888121 4883911 4955533 4947768 4874945 5032608 5133875
17558E133875J51541j16930j75510M5785r6492m5346J14341J34895n9687l24349
$$ 5133875 5285416 5168486 4992976 5038761 4942269 4896923 5011264 5146159 5086472 4762123
17548D762123j98032P6833J25779M5234K94246J28289j8324k88535r3118j05541
$$ 4762123 4564091 4640924 4766703 4811937 5106183 5234472 5216148 4927613 4834495 4728954
17538D728954n5529J14258K13967J76398j5792r5841L4087M3279O3919l4645j31822
$$ 4728954 4673425 4787683 5001650 5178048 5162256 5066415 5100502 5143781 5207700 5173055 5041233
17527E041233J19842J6893l21219j41662r0592O8369L5475j10694m4731r4651
$$ 5041233 5161075 5177968 4856749 4715087 4624495 4692864 4728339 4617645 4572914 4478263
17517D478263Q7056J67185J6508J9093m008J61653p5268j77885J96318K11384
$$ 4478263 4565319 4732504 4749012 4768105 4764097 4925750 4850482 4672597 4868915 5080299
17507E080299l2158k46030m3126J02241J01406o18O3624M2817k34405m7675q6272
$$ 5080299 5048141 4802111 4758985 4861226 4962632 4962014 5025638 5068455 4834050 4786375 4700103
17496D700103J14057P8504p1126j25253R9483M2001j64791J39099j9617M7277
$$ 4700103 4814160 4892664 4821538 4696285 4795768 4837769 4672978 4812077 4792460 4839737
17486D839737Q6067P7132J84408n3953p4361J5291M130R2273J9870L4484o8706
$$ 4839737 4925804 5002936 5187344 5133391 5059030 5074321 5078451 5170724 5190594 5225078 5156372
17475E156372Q1866j42811j65139o2002j74878M4778J14812n4962J03770J41724
$$ 5156372 5238238 5095427 4930288 4868286 4693408 4738186 4852998 4798036 4901806 5043530
17465E043530j3741N1717M1321N3222k24288j38488J00253K561p0704J15207m4154
$$ 5043530 5029789 5081506 5122827 5176049 4951761 4813273 4913526 4916087 4845383 4960590 4916436
17454D916436N7624J41475J94276r7790j58258k45782k31884J0723j985J64344
$$ 4916436 4974060 5115535 5309811 5212021 5053763 4807981 4576097 4586820 4584835 4749179
17444D749179m5429q2551l5959N0949K01766K77299J90861l32170k51970o531
$$ 4749179 4703750 4621199 4585240 4636189 4837955 5115254 5306115 4973945 4721975 4715444
17434D715444J43725N9705J12550N168q7531Q6286M10026l6595j46544j56476
$$ 4715444 4859169 4918874 5031424 5036592 4949061 5035347 5445373 5408778 5262234 5105758
17424E105758p0447q7704j1814j17519k10184K3434m7969J510o7916K13996J17288
$$ 5105758 5035311 4947607 4935793 4818274 4608090 4631524 4583555 4585065 4517149 4731145 4848433
17413D848433K9415R6889j33459k23650j25383l8734J3945N5111p3426j12537
$$ 4848433 4877848 4974737 4841278 4617628 4492245 4453511 4467456 4522567 4449141 4336604
17403D336604J65883J52557R6545J02041P2722K3743p4400k25433K04242J34515
$$ 4336604 4502487 4655044 4751589 4853630 4926352 4950095 4875695 4650262 4854504 4989019
17393D989019J00562Q6529k10938j28000n9512K7182j30646j05257J69787n1158
$$ 4989019 5089581 5176110 4965172 4837172 4777660 4804842 4674196 4568939 4738726 4687568
17383D687568M6744j7656Q7893K76689N4566r1916J21484P612M7582k10356j8904
$$ 4687568 4734312 4716656 4804549 5081238 5135804 5043888 5165372 5172984 5220566 5010210 4991306
17372D991306j10972m2808K30474J48167L642k09035j76770k6339n4846M0838
$$ 4991306 4880334 4837526 5068000 5216167 5219809 5010774 4834004 4807665 4752819 4793657
17362D793657o0078j57574J28581o0156O0978j46953j2729J24015J34198m299
$$ 4793657 4733579 4576005 4704586 4644430 4705408 4558455 4545726 4669741 4803939 4799640
17352D799640j07526j14204r7617J9226J34609P30N3220j05174k58943J14366
$$ 4799640 4692114 4577910 4480293 4499519 4634128 4634858 4688078 4582904 4323961 4438327
17342D438327l2166k3071k4427q6236j60629K01381L8762J01726p1120r7527j59753
$$ 4438327 4406161 4383090 4358663 4272427 4111798 4313179 4351941 4453667 4382547 4285020 4125267
17331D125267q739K91149q9326j82893Q5066O3516K65618J04635k59963m4429
$$ 4125267 4116528 4407677 4318351 4135458 4220524 4284040 4549658 4654293 4394330 4349901
17321D349901J17124J45735j49437j6263N5725J71583L00766j9408l16953o9817
$$ 4349901 4467025 4612760 4463323 4447060 4502785 4674368 4975134 4955726 4638773 4568956
17311D568956J29656L74718Q5530k30610k57558L5337K5469o4346p3410l3784
$$ 4568956 4698612 5073330 5158860 4928250 4670692 4706029 4731498 4667152 4593742 4559958
17301D559958O4441k77962k76229M1537J02686N9588M0435J47967J23791J12061
$$ 4559958 4624399 4346437 4070208 4111745 4214431 4274019 4314454 4462421 4586212 4698273
17291D698273j06751m2166K21930j44807k76974K9875J10931o5430l3335j34949
$$ 4698273 4591522 4549356 4771286 4626479 4349505 4379380 4490311 4424881 4391546 4256597
17281D256597q1768j0705J81356J15057R2144K9785k22585j88572q8064R9869
$$ 4256597 4174829 4164124 4345480 4460537 4552681 4582466 4359881 4171309 4083245 4183114
17271D183114L35000Q0539p499o6162J85593j8139j68912Q6676R3138r0970o4535
$$ 4183114 4518114 4598653 4591154 4524992 4710585 4692446 4523534 4610210 4703348 4612378 4547843
17260D547843j63881j53106o5990k11039j82382Q0086K46765m85j67286J8644
$$ 4547843 4383962 4230856 4164866 3953827 3771445 3851531 4098296 4097811 3930525 3949169
17250C949169N0925K4037J57231p0913q2966j14591j27239j0679K13483J34215
$$ 3949169 4000094 4024131 4181362 4110449 4027483 3912892 3785653 3774974 3988457 4122672
17240D122672p9202p3330M3843j97460O1475J21932R1017K3792L8853m1656j14093
$$ 4122672 4043470 3970140 4013983 3816523 3877998 3999930 4090947 4114739 4153592 4111936 3997843
17229C997843K23438M7212k31594n7024K14007K65205P9701j93744q9153l21729
$$ 3997843 4221281 4268493 4036899 3979875 4193882 4459087 4538788 4345044 4255891 3934162
17219C934162p330J33363L8803n3509k5438j23715J29687q5648M1092J97408n8774
$$ 3934162 3926832 4060195 4098998 4045489 4020051 3896336 4026023 3940375 3981467 4178875 4120101
17208D120101r4007j94437k14752J07094J67425J3093K5626J84501O4208J14J81870
$$ 4120101 4026094 3831657 3616905 3723999 3891424 3904517 3930143 4114644 4178852 4178966 4360836
17197D360836j96010j10972J82452K5380j08817j35684j55380L30206J69410j64342
$$ 4360836 4164826 4053854 4236306 4261686 4152869 4017185 3861805 4192011 4361421 4197079
17187D197079k3997L830l78255r5098K35682J59314P2614j32608n994O9026L1275
$$ 4197079 4173082 4176912 3798657 3703559 3939241 4098555 4171169 4038561 4032567 4101593 4132868
17176D132868r288r1044j65379J83160M0879L429o7482L9345j64883r3069K24512
$$ 4132868 4123580 4032536 3867157 4050317 4091196 4094625 4027143 4066488 3901605 3808536 4033048
17165D033048o9593J0104o7448j14932J49203R8187r7813q1487J10741K61419
$$ 4033048 3963455 3973559 3906111 3791179 3940382 4038569 3940756 3859269 3970010 4231429
17155D231429L2889J0893j76859q8168M13j3844O7475j0227k36081o3848o5555
$$ 4231429 4264318 4275211 4098352 4010184 4010597 3996753 4064228 4054001 3817920 3754072 3688517
17144C688517P4366J24928O4058m7179k21671l97487K25337K56104J70284n4739
$$ 3688517 3762883 3887811 3951869 3904690 3683019 3285532 3510869 3766973 3937257 3882518
17134C882518l7274n2892n5596k9216q1411J44543J0082K38721j9859m2700m1590
$$ 3882518 3845244 3792352 3736756 3707540 3626129 3770672 3780754 4019475 3999616 3956916 3915326
17123C915326r4783r2076q1020P7049j6604l0194j34533K85933K34918l3844j2548
$$ 3915326 3820543 3728467 3647447 3724496 3707892 3677698 3543165 3829098 4064016 4030172 4017624
17112D017624j42144j49926m02011R6908J91483P7474J60364q264l8860j4840
$$ 4017624 3875480 3725554 3323543 3420451 3611934 3689408 3849772 3841508 3802648 3787808
17102C787808J20707k94589j23898N8840L45580K07265K3166o311j55022j3853
$$ 3787808 3908515 3613926 3490028 3548868 3894448 4101713 4124879 4118568 3963546 3949693
17092C949693N5041r4616r2678k6243J06769j25229j06356p515j60404q881J45186
$$ 3949693 4004734 3910118 3817440 3791197 3897966 3772737 3666381 3658866 3498462 3489581 3634767
17081C634767K49591N624l1817o7249R8269J18692j25833k30212o5101L9655o8101
$$ 3634767 3884358 3889982 3858165 3790916 3889185 4007877 3882044 3651832 3586731 3626386 3558285
17070C558285O2816J21920R6907j5245J74l7143l1424p8526j9601J21319J9719
$$ 3558285 3621101 3743021 3839928 3824683 3824857 3787714 3756290 3677764 3658163 3779482 3799201
17059C799201j15526K1357L1085J86529J57491q7778n6488n1249N0472k62108
$$ 3799201 3683675 3705032 3736117 3922646 4080137 3992359 3935871 3884622 3935094 3672986
17049C672986k16185m590N7612r4316J7130J29199J58454K8635j39535K8578p2933
$$ 3672986 3456801 3452211 3509823 3415507 3432637 3561836 3720290 3748925 3609390 3637968 3565035
17038C565035j25578k043p359j53462N7398P4789J30173L6362K9362J54332P4277
$$ 3565035 3439457 3437414 3430055 3276593 3333991 3408780 3538953 3575315 3604677 3759009 3833286
17027C833286L685n5822R3357p3449j22623L040p378j17173j27491J0265R9872
$$ 3833286 3836971 3781149 3874506 3801057 3678434 3681474 3674096 3556923 3429432 3439697 3539569
17016C539569J5272J72060J62580J2121j8940m7994j9294N1396p699J8683l36691
$$ 3539569 3554841 3726901 3889481 3901602 3882662 3834668 3815374 3866770 3859071 3877754 3541063
17005C541063j99618R1248M45971L9647m554r951R687o1568m179l248O2044m8139
$$ 3541063 3341445 3432693 3878664 3918311 3913757 3903806 3913493 3851925 3847746 3844498 3906542 3858403
16993C858403j08786k76155R371J95541j57627r2429K9615J18394j58965K9311
$$ 3858403 3749617 3473462 3482833 3678374 3520747 3428318 3457933 3576327 3417362 3446673
16983C446673J29650L4286j15306K07750K84133j1918j51532P4260j78908k64902
$$ 3446673 3576323 3610609 3495303 3703053 3987186 3975268 3823736 3897996 3719088 3454186
16973C454186p1738j69517p6108K35854J53176k0719j45303q3097m6365K14300
$$ 3454186 3382448 3212931 3136823 3372677 3525853 3505134 3359831 3276734 3230369 3444669
16963C444669K13380r2807O3231o3643j06636n1297J17667J15370j9525j15803
$$ 3444669 3658049 3565242 3628473 3564830 3458194 3406897 3524564 3639934 3620409 3504606
16953C504606m8504p2527l9569J4351J79952J83490l9121n5228N167P8031p7134
$$ 3504606 3456102 3383575 3344006 3358357 3538309 3721799 3682678 3627450 3632617 3710648 3633514
16942C633514j20805J04240l2724k44048R915K1313o5951J25039J58618j52051
$$ 3633514 3512709 3616949 3584225 3340177 3350092 3371405 3305454 3430493 3589111 3437060
16932C437060j36589K4914n6749N6819L63398k43029j52557j17910K01507J82831
$$ 3437060 3300471 3325385 3268636 3325455 3688853 3445824 3293267 3175357 3376864 3559695
16922C559695N1214N095Q6956J42146j89945N1371l19272r4669j1660j6369P3287
$$ 3559695 3610909 3616004 3702960 3845106 3655161 3706532 3387260 3292591 3280931 3264562 3337849
16911C337849L15163K18725j80775k84119j02702m8510o9087J49431K76919J68608
$$ 3337849 3653012 3871737 3690962 3406843 3304141 3255631 3186544 3335975 3612894 3781502
16901C781502r1990k85520j8471J53111J35520j00916r1409K5098J38776r1032
$$ 3781502 3689512 3403992 3385521 3538632 3674152 3573236 3481827 3506925 3645701 3554669
16891C554669Q6446j10025j13102J14722j08067m627J72405o9802l44742O7527
$$ 3554669 3641115 3531090 3417988 3532710 3424643 3420016 3592421 3522619 3177877 3245404
16881C245404J86602p9870m1100J35993o453p8612r5428K6250k7745K4568j14697
$$ 3245404 3432006 3352136 3311036 3447029 3440576 3361964 3266536 3292786 3265041 3289609 3174912
16870C174912p1841n2446m3751K34220K57893K13533j06888l69723j32347m92
$$ 3174912 3103071 3050625 3006874 3241094 3498987 3712520 3605632 3235909 3103562 3103070
16860C103070K35078K03262j41637j17478R7090L17671k12696k73184j51531J40046
$$ 3103070 3338148 3541410 3399773 3282295 3379385 3697056 3484360 3211176 3059645 3199691
16850C199691J88750O3936l21293P8903L38793O0882N713j87352k44616J99190
$$ 3199691 3388441 3452377 3131084 3209987 3548780 3609662 3615375 3428023 3183407 3382597
16840C382597J64126j83482j88976J35363O6391o0978k23101j09358M53149K21263
$$ 3382597 3546723 3363241 3174265 3309628 3376019 3315041 3091940 2982582 3435731 3656994
16830C656994r2285k07413k19805n6580k0586j86460j54370L39389L32060J21457
$$ 3656994 3564709 3357296 3137491 3080911 3060325 2873865 2719495 3058884 3390944 3512401
16820C512401N2039Q383k06454j18812p6636K94066l1668j80422j98295j86820
$$ 3512401 3564440 3572823 3366369 3247557 3170921 3464987 3433319 3252897 3054602 2867782
16810B867782K1925J97710k73345j02897L40765M6111n0948N1544j43403l5577
$$ 2867782 2889707 3087417 2814072 2711175 3051940 3098051 3047103 3098647 2955244 2919667
16800B919667M7273j85906O0493M14678J19148r8761K31913J7835k77116k39509
$$ 2919667 2966940 2781034 2841527 3256205 3375353 3276592 3508505 3526340 3249224 3009715
16790C009715K18172L80946j51573l01808q0101P1501J41056q8023k20608m5037
$$ 3009715 3227887 3608833 3457260 3155452 3075351 3146852 3287908 3199885 2979277 2934240
16780B934240M1451Q3595n0861j97807O8841q2688J00153L40150J80625J19955
$$ 2934240 2975691 3059286 3008425 2810618 2879459 2796771 2896924 3237074 3417699 3537654
16770C537654N2543j05132j57368K7806K0575m905j51164O8623m5190M1371O0044
$$ 3537654 3590197 3485065 3327697 3355503 3376078 3371173 3220009 3288632 3243442 3284813 3344857
16759C344857j12064k27559j54546J46714J78905j10903J9999K2255k2977k08983
$$ 3344857 3232793 3005234 2850688 2997402 3176307 3065404 3085403 3107658 3084681 2875698
16749B875698n9479J57237K4235j05015k09462M0583P8347k9131m1442J47195
$$ 2875698 2816219 2973456 2997691 2892676 2683214 2723797 2802144 2773013 2731571 2878766
16739B878766L49986Q4611j9720o4086p0158J46353J89805M671j84679k54257
$$ 2878766 3228752 3313363 3293643 3229557 3159399 3305752 3495557 3500228 3315549 3061292
16729C061292j58665r5842L2092K67528K3477J2281J78748R5250L6596j99427
$$ 3061292 2902627 2806785 2838877 3106405 3129882 3142163 3320911 3416161 3452757 3253330
16719C253330j68725R5001L8697r6829p5114P5216J94319k23295N6937l5047m3919
$$ 3253330 3084605 3179606 3218303 3121474 3046360 3121576 3315895 3092600 3149537 3114490 3070571
16708C070571j02722J758L4146K09019o1099l0657j33215m1166j63970P784J49669
$$ 3070571 2967849 2969607 3003753 3212772 3151673 3121016 2987801 2946635 2782665 2790449 2940118
16697B940118K36586k591k13852j13817L6077L3312m634k08351O0164J79132K73598
$$ 2940118 3176704 3174113 2960261 2846444 2882521 2915833 2911199 2702848 2763012 2942144 3215742
16686C215742M4942l8185j86493k06440j78532O5O6785R3520m2514N7661L7039
$$ 3215742 3260684 3222499 3036006 2829566 2651034 2651099 2717884 2811404 2768890 2826551 2863590
16675B863590k04817j38285J90K65563J69359J30068n3032j17380j8045r2397
$$ 2863590 2658773 2520488 2520678 2786241 2955600 3085668 3032636 2915256 2897211 2804814
16665B804814j93681O3919q5218J40992J73760J09687j7672j25962k29695j80568
$$ 2804814 2611133 2675052 2589834 2730826 2904586 3014273 2996601 2870639 2640944 2460376
16655B460376k6897N6063K22915J36993J07241Q2239J65177j28310j86228j83256
$$ 2460376 2433479 2489542 2712457 2849450 2956691 3038930 3204107 3075797 2889569 2706313
16645B706313J39639Q9715J63411j44414j42138l2709m3903p940J91027M6967
$$ 2706313 2845952 2935667 3099078 2954664 2812526 2779817 2735914 2727974 2919001 2965968
16635B965968o1707j8668j23693k02585J04362K7574Q259R3525R6753j36335j08345
$$ 2965968 2904261 2885593 2761900 2559315 2663677 2691251 2699510 2793035 2889788 2753453 2645108
16624B645108P0251o9948L1637j2800J83551j03277J74554K86181j2605j17549
$$ 2645108 2715359 2645411 2677048 2664248 2847799 2744522 2919076 3205257 3192652 3075103
16614C075103j63777p5547m7041J20553O5481k10606j8846L3390l00388j04670
$$ 3075103 2911326 2835779 2788738 2909291 2974772 2764166 2745320 2778710 2478322 2373652
16604B373652K4908r8201M584J03260J1573J42257P9256j7617J2947K9021j11777
$$ 2373652 2398560 2300359 2304943 2408203 2419776 2562033 2641289 2623672 2636619 2665640 2553863
16593B553863Q3069J091l0974o6631P6460O7070j45258k37667L8494J13443L32740
$$ 2553863 2636932 2638023 2607049 2540418 2616878 2683948 2538690 2301023 2339517 2452960 2785700
16582B785700J23047q5137k41j59648o4609K26075m6546k31769J32097r3431K4403
$$ 2785700 2908747 2823610 2823369 2663721 2599112 2825187 2778641 2546872 2678969 2585538 2609941
16571B609941J29048j60885k2177q7033N5370J42779J2425j09620q464J67539
$$ 2609941 2738989 2578104 2555927 2468894 2524264 2667043 2679468 2569848 2561384 2728923
16561B728923J29832j91002k00214O2205m9876j9486Q2108K03269J11719K81117
$$ 2728923 2858755 2667753 2467539 2529744 2479868 2460382 2542490 2745759 2857478 3138595
16551C138595n0246j75927O7347j61028j47241N7835j23076j06964J37795K33298
$$ 3138595 3088349 2912422 2979769 2818741 2671500 2729335 2606259 2499295 2637090 2870388
16541B870388K62988j7686l71527q3557R4819J38894p6182J03487P4568l2647
$$ 2870388 3133376 3115690 2744163 2660606 2755425 2894319 2818137 2921624 2996192 2963545
16531B963545k4361n6491p71m7760j90025K8666J03973j16096l03632K423K13075
$$ 2963545 2939184 2882693 2881922 2834162 2644137 2672803 2776776 2660680 2357048 2359471 2572546
16520B572546J51904P8321j4721q9464Q1023K01006j92136j70638j76119n2358
$$ 2572546 2724450 2802771 2788050 2698586 2779609 2980615 2788479 2617841 2441722 2389364
16510B389364j01678n7485n1807L06644J47100J8815k32538j57651O0343L19196
$$ 2389364 2287686 2230201 2178394 2485038 2632138 2650953 2418415 2260764 2321107 2640303
16500B640303j52494m16783J4225J25770J18763q8211k00888K35725J05429L4598
$$ 2640303 2487809 2071026 2085251 2211021 2329784 2241573 2040685 2276410 2381839 2416437
16490B416437m7492J77281Q3811n191R732m0895r2027j0575K02682M5143o8658
$$ 2416437 2368945 2546226 2630037 2624846 2634578 2593683 2501656 2491081 2693763 2738906 2670248
16479B670248j82182j92935N3123J16351k8695p4642N9564O9990j20591K2473
$$ 2670248 2488066 2295131 2348254 2464605 2435910 2361268 2420832 2490822 2370231 2392704
16469B392704q2215J15460L98157k29373k63239k0453L06769K9812k06704j80608
$$ 2392704 2310489 2425949 2824106 2594733 2331494 2311041 2617810 2647622 2440918 2260310
16459B260310L8485J07986q4863Q5666R6796l9518N7643k3360K9464p8867k10219
$$ 2260310 2298795 2406781 2321918 2407584 2504380 2464862 2522505 2499145 2528609 2449742 2239523
16448B239523p2939J35929J55702M4193k7382O0588O9730Q018J12318R76k8798
$$ 2239523 2166584 2302513 2458215 2502408 2475026 2535614 2605344 2613362 2725680 2726656 2697858
16437B697858r1544j69111P8272J72586r0314j00582P836n3893n9977P5361R5643
$$ 2697858 2606314 2437203 2515475 2688061 2597747 2497165 2505001 2451108 2391131 2466492 2562135
16426B562135j47773k95344q2610K29977M22263R9588j69065o0195J71682J40543
$$ 2562135 2414362 2119018 2036408 2266385 2688648 2788236 2619171 2558976 2730658 2871201
16416B871201j78287l66222L192K18796J22363O798r9527k76503K7282J61403
$$ 2871201 2692914 2326692 2329884 2548680 2671043 2677841 2578314 2301811 2329093 2490496
16406B490496j70352l2036r6044J31506O9389o2004m5593j34469J39094p893m322
$$ 2490496 2320144 2288108 2192064 2323570 2392959 2330955 2285362 2150893 2289987 2282094 2277772
16395B277772M11219J11338r9900J54862M6278l16694j74789P2011O4838K1425
$$ 2277772 2688991 2800329 2700429 2855291 2901569 2584875 2410086 2482097 2546935 2568360
16385B568360L6493N601l9112l4548j9273Q6911l5621M2759j02092j57137j39713
$$ 2568360 2604853 2610454 2571342 2536794 2517521 2604432 2568811 2611570 2509478 2352341 2212628
16374B212628q9845J20221J52950J49755R7560j8926j24047l6896J9091l2556
$$ 2212628 2122783 2243004 2395954 2545709 2643269 2624343 2500296 2463400 2482491 2449935
16364B449935j6270J10796l45048j32520K4472J97746J60559j18416J4604r0205
$$ 2449935 2433665 2544461 2199413 2066893 2091365 2289111 2449670 2331254 2345858 2255653
16354B255653j05999k33012k03849J03342L88206K05306O6013n4024j50352j06127
$$ 2255653 2149654 1916642 1712793 1816135 2204341 2409647 2475660 2421636 2271284 2165157
16344B165157m979K18421k9936n4527L0085n4206j16580K1765M1979j32628j95235
$$ 2165157 2160178 2378599 2348663 2294136 2324221 2270015 2153435 2175200 2217179 2084551 1889316
16333A889316j79898J62983J22594N1298n5978P7511K60551L6646j60478j84412
$$ 1889316 1709418 1872401 1994995 2046293 1990315 2067826 2328377 2365023 2204545 2020133
16323B020133J04244K68N8107o9315k79303R9467K40646L5205l447j19692j95738
$$ 2020133 2124377 2124645 2182752 2113437 1834134 1933601 2174247 2209452 2206005 2086313 1890575
16312A890575j82002K76876K98273m8104K2913l2576q4240M4310J29709J76493
$$ 1890575 1708573 1985449 2283722 2235618 2258531 2225955 2141715 2186025 2315734 2492227
16302B492227L2291j54190Q384N7365j31099o9900q6167j5011k47148k13082L84054
$$ 2492227 2524518 2370328 2378712 2436077 2304978 2235078 2148911 2133900 1886752 1673670 2057724
16291B057724P8610j81524l4726J04518J95801K4759J06040l8510j79305o1527
$$ 2057724 2136334 1954810 1920084 2024602 2220403 2245162 2351202 2312692 2133387 2071860
16281B071860J25978R9508L2660p0786L6610K09888J9381J30574L7600j63852
$$ 2071860 2197838 2297346 2330006 2259220 2295830 2505718 2525099 2655673 2693273 2529421
16271B529421j63951l0614J13193o0563j48026j18111K07048J27671j22968J79423
$$ 2529421 2365470 2334856 2448049 2387486 2239460 2121349 2328397 2456068 2333100 2512523
16261B512523N6046k96868j7841k8896n3775l6458p6460P353J40525K29311k30202
$$ 2512523 2568569 2271701 2253860 2224964 2171189 2134731 2058271 2065624 2206149 2435460 2205258
16250B205258j01029r5662m9341J51158O846j86022k77509Q6834J72616P9571
$$ 2205258 2104229 2008567 1959226 2110384 2117230 1931208 1653699 1740533 1913149 1992720
16240A992720j2166J0634q7853L4616L22507L4884j33946k25748o4927j81918
$$ 1992720 1980554 1991188 1903335 1937951 2260458 2295342 2161396 1935648 1870721 1688803
16230A688803K1050K22992J28313R2925n757k9461K5487j31650k4936j4197k0319
$$ 1688803 1709853 1932845 2061158 2154083 2148326 2118865 2144352 2012702 1987766 1973569 1953250
16219A953250J15651P0161o7135o2678Q5282P6835J0593j41385k34244K53253
$$ 1953250 2068901 2139062 2071927 2009249 2094531 2171366 2181959 2040574 1806330 2059583
16209B059583K83588J77305P6910m8886p8934k77094j75478j786p6702K13485
$$ 2059583 2343171 2520476 2597386 2548500 2469566 2192472 2016994 2015208 1938506 2151991
16199B151991J24319r9900n8966p79K30091k2978k51097n9181l2657M7788m824
$$ 2151991 2276310 2176410 2117444 2116665 2346756 2323778 2072681 2013500 1980843 2028631 2023807
16188B023807J8480K12232m8334q5204K9954n6304J15517N8984L6057j31699J24483
$$ 2023807 2042287 2254519 2206185 2120981 2150935 2094631 2210148 2269132 2305189 2173490 2297973
16177B297973P5092k96997k01838R3483J2796N5174n4492l4137J14082P6233O0019
$$ 2297973 2373065 2076068 1874230 1967713 1980509 2035683 1981191 1947054 2061136 2137369 2197388
16166B197388o4056m9382r218j06163j04813j41132m0861j37810p9342j46619
$$ 2197388 2133332 2083950 2074732 1968569 1863756 1722624 1681763 1543953 1464611 1317992
16156A317992j0229K02777L57312L12567o9469O6031j46301l8088q0222j97352
$$ 1317992 1307763 1510540 1867852 2180419 2110950 2176981 2030680 1992592 1912370 1715018
16146A715018j74936j0456M4946J06688J99900O8491P6224n3872J78811J07800
$$ 1715018 1540082 1529626 1574572 1681260 1881160 1949651 2025875 1972003 2150814 2258614
16136B258614k6832j53594k13233M9l8139j24472O8350j3117L2396N0005j23789
$$ 2258614 2231782 2078188 1864955 1865004 1826865 1702393 1770743 1757626 1790022 1840027 1716238
16125A716238m1624J5619j11737L3685O5604k5774j1770K81298J57276j92633
$$ 1716238 1674614 1690233 1578496 1612181 1677785 1652011 1640241 1921539 2078815 1886182
16115A886182k34945j77351L16327R1594r5678j97602j84917L09761N5308k2205
$$ 1886182 1651237 1473886 1790213 1881807 1786129 1588527 1403610 1713371 1768679 1746474
16105A746474m9452o0470O8491R852J79181K04258j5882m7359K8614m3705k23675
$$ 1746474 1697022 1636552 1705043 1714895 1894076 2098334 2082452 2035093 2063707 2020002 1796327
16094A796327O4947P6909j06320J72573Q2043m0045R4250J04328j07107k62243
$$ 1796327 1861274 1938183 1831863 2004436 2086479 2046434 2140684 2245012 2137905 1875662
16084A875662o3643o0340j57081N6276j41692K17033J09969n5148J37176R4691
$$ 1875662 1812019 1751679 1594598 1650874 1509182 1726215 1836184 1781036 1918212 2012903
16074B012903l5449K17285L4589r5395j16399J6953l5158n5327k85769J07120
$$ 2012903 1977454 2194739 2229328 2133933 2017534 2034487 1999329 1944002 1658233 1765353
16064A765353K20384J41313j4973j59125j08474j69328j50758N401J10718K22244
$$ 1765353 1985737 2127050 2112077 1952952 1844478 1675150 1524392 1529793 1640511 1862755
16054A862755J90008j35337k30703j0382Q4030k6010o2409J27380J8131L2827
$$ 1862755 2052763 1917426 1686723 1676341 1760371 1734361 1671952 1799332 1817463 1850290
16044A850290q6115j95996Q131P235Q1823j04961j17148J14689M6112J51608j02172
$$ 1850290 1764175 1568179 1576310 1583545 1665368 1560407 1443259 1557948 1604060 1755668 1653496
16033A653496j48636Q857J27042R2684J00068l312k33553k09689P5672K65578
$$ 1653496 1504860 1513717 1640759 1733443 1833511 1830199 1596646 1386957 1462629 1728207
16023A728207J72916p1395j91946o3530l9222q4045r760R4481m3775J01202M8188
$$ 1728207 1901123 1829728 1637782 1574252 1535030 1450985 1441225 1535706 1491931 1593133 1641321
16012A641321J65601K2460k07639j13251j00349J84161J94796K12640N7568J0631
$$ 1641321 1806922 1829382 1621743 1508492 1408143 1592304 1787100 1999740 2057308 2067939
16002B067939k11994j04122J9606J85553J48892J31935k13501j26173o077j35009
$$ 2067939 1855945 1751823 1771429 1956982 2105874 2237809 2024308 1898135 1892058 1757049
15992A757049j93111R5695k8184k34341O4065j47496P4228J26763J98568J50747
$$ 1757049 1563938 1659633 1631449 1397108 1461173 1313677 1387905 1514668 1713236 1863983
15982A863983J1294R503j1441j60662m9063l0173j09528J53804N8651l353Q1507
$$ 1863983 1875277 1884780 1873339 1712677 1663614 1633441 1523913 1677717 1736368 1733015 1814522
15971A814522J87100P3747k96964p8154K12941j29539m22717K1653K03500L4589
$$ 1814522 2001622 2075369 1778405 1700251 1913192 1783653 1360936 1382589 1586089 1620678
15961A620678J05880K24792j37946P5603m8040l10435p4131K32143j74814O5889
$$ 1620678 1726558 1951350 1813404 1889007 1840967 1530532 1456401 1688544 1513730 1579619
15951A579619R0499J8282K03395M1371M363j48078m6766r4147j4592J25011N3013
$$ 1579619 1670118 1688400 1891795 1933166 1937529 1789451 1742685 1648538 1633946 1758957 1811970
15940A811970L248r0089j93787j43242q0436q8884l9971L0024L4927J09736j72352
$$ 1811970 1815218 1725129 1531342 1388100 1307664 1218780 1178809 1208833 1243760 1353496 1181144
15929A181144r849J99091J27814J12727N2507q1898J26133p0248l8091j06637
$$ 1181144 1171295 1370386 1498200 1610927 1663434 1581536 1707669 1637421 1599330 1492693
15919A492693l0972j20344J58478K86763j09867q3963r8720l3275J99102J22624
$$ 1492693 1461721 1341377 1499855 1786618 1676751 1592788 1494068 1460793 1659895 1782519
15909A782519j00676l5133M9640j38107j11535j52984k3846J40152L56780P2994
$$ 1782519 1681843 1646710 1696350 1558243 1446708 1293724 1269878 1410030 1766810 1839804
15899A839804n8420p5203j96992k4653J04255j01424q3389l18871q901O4508J85332
$$ 1839804 1781384 1706181 1509189 1484536 1588791 1487367 1403978 1085107 1076206 1140714 1326046
15888A326046K86025j9917J25679r5473l31570P208n2435j34631L93767R3896
$$ 1326046 1612071 1592154 1717833 1622360 1290790 1297998 1245563 1110932 1504699 1598595
15878A598595Q6662j73200j8249J4930r5169k49631k3019K28592L3867J14222
$$ 1598595 1685257 1512057 1493808 1508738 1413569 1163938 1140919 1369511 1403378 1517600
15868A517600L2608j45920j81658m7643l3932K62091L8834k51055l750L27147
$$ 1517600 1550208 1404288 1222630 1174987 1141055 1403146 1441980 1190925 1187175 1514322
15858A514322R0030J08201k43231m4422j5439P7927J6235m0241R1102l8504q1495
$$ 1514322 1604352 1712553 1469322 1424900 1409461 1487388 1503623 1463382 1554484 1515980 1434485
15847A434485j43253O301l5337K4444m0289R0526O4023M5844K39235j03727l4693
$$ 1434485 1291232 1297533 1262196 1286640 1246351 1336877 1400900 1446744 1685979 1582252 1547559
15836A547559O5375N8332o9966k32979o1951j1321J01506O346r2251j09826K19836
$$ 1547559 1612934 1671266 1601300 1368321 1306370 1295049 1396555 1402901 1310650 1200824 1420660
15825A420660J60608k1074l9515o1450K14682K13232l29482k75541P1925K78032
$$ 1420660 1581268 1560194 1520679 1459229 1673911 1887143 1557661 1282120 1354045 1632077
15815A632077J28430q2356l21927M1175J7022r0583K9828J20772J40710J19516
$$ 1632077 1760507 1678151 1356224 1397399 1414421 1323838 1353666 1474438 1615148 1734664
15805A734664j05934l33901j14094N7226K86575M6069j3747j81478O3137n0981
$$ 1734664 1628730 1294829 1180735 1237961 1524536 1570605 1556858 1375380 1438517 1387536
15795A387536j06847m3467K04645J47442Q1413j04567P8195L6789m3493j06127
$$ 1387536 1280689 1237222 1441867 1589309 1670722 1566155 1644350 1681139 1637646 1531519
15785A531519j83133J28028P2986J34994q2315k18062q7293K29294J64493l4194
$$ 1531519 1348386 1476414 1549400 1684394 1602079 1384017 1296724 1526018 1690511 1656317
15775A656317j98727j18014N4113l3803n0792J16298K67818J10415J1200j68466
$$ 1656317 1457590 1339576 1393689 1359886 1309094 1425392 1693210 1803625 1814825 1646359
15765A646359j58218J8885N4315N7449q6053l1518N7509N5719o2919j8357j1032
$$ 1646359 1488141 1507026 1561341 1618790 1532737 1501219 1558728 1614447 1551528 1533171 1522139
15754A522139j03344q7501r4259j25318q8501J56363J37983J91246k30297N5156
$$ 1522139 1418795 1331294 1237035 1111717 1023216 1179579 1317562 1508808 1278511 1333667
15744A333667k5635J5515l3080j87488K28424K56932J77665m8694m6927j31449
$$ 1333667 1308032 1323547 1290467 1102979 1331403 1588335 1766000 1717306 1670379 1538930
15734A538930j30579O4491k28226j27263R9924K6684R289j63072l4835O8021J54354
$$ 1538930 1408351 1472842 1244616 1117353 1217277 1243961 1253250 1090178 1055343 1123364 1277718
15723A277718l9490k00389N090M0127k7760J37714o4906l2273J57432K59234J4667
$$ 1277718 1238228 1037839 1042929 1083056 1055296 1193010 1128104 1095831 1253263 1512497 1527164
15712A527164P7681j39179R1403j460j67187j67108O3552j42493r1641K14392
$$ 1527164 1604845 1465666 1557069 1555609 1388422 1221314 1284866 1142373 1050732 1265124
15702A265124J87549N3453m26j0377J70q8189r9610j41714j41809K6579J27815
$$ 1265124 1452673 1506126 1505700 1495323 1495493 1407304 1307694 1165980 1024171 1050750 1178565
15691A178565q2509n307J00825j44827j68266m3301J15958K28864K17529o9871
$$ 1178565 1096056 1090749 1191574 1046747 878481 835180 951138 1180002 1397531 1327660
15681A327660j42619N1255K77045n0864j54930k58854J4918K46986q818j26522
$$ 1327660 1185041 1236296 1513341 1462477 1307547 1048693 1063611 1310597 1301779 1175257
15671A175257m4842L3331J57313j41609P7082K11815R0386j30288j29629j15023
$$ 1175257 1130415 1163746 1321059 1179450 1256532 1468347 1558733 1428445 1298816 1183793
15661A183793j70098K9568K65974l2257j26364K8064j7335J1242j45188J5634
$$ 1183793 1013695 1043263 1309237 1276980 1150616 1178680 1161345 1172587 1027399 1043033
15651A043033q9361L2221J08636J92554K47283k5576l61127j25857J77809J75113
$$ 1043033 953672 985893 1094529 1287083 1534366 1508790 1147663 1021806 1199615 1374728
15641A374728o1710j60356o9586j17554k3612J4642M0949Q82m7657J59281Q6510
$$ 1374728 1313018 1152662 1083076 965522 941910 956552 997501 998383 950726 1110007 1196517
15630A196517j28691l26330k00403K78088Q2868K80759K55015l43019j60813R5002
$$ 1196517 1067826 741496 541093 819181 902049 1182808 1437823 1094804 933991 1028993
15620A028993P765K5084m0673J19755l7946r4311J6858p7520k4079J81500J72249
$$ 1028993 1036758 1061842 1021169 1140924 1102978 1008667 1025525 948005 923926 1105426 1277675
15609A277675K9848q3982j4320J1762J7680j36907q716r7365Q2529J6310n493
$$ 1277675 1307523 1223541 1209221 1220983 1238663 1101756 1093040 995675 1078204 1094514 1089021
15598A089021k79698n6340K17951K8143j42957K3414J40502J06483M7770n5189
$$ 1089021 809323 752983 970934 999077 856120 879534 1020036 1126519 1174289 1119100
15588A119100M1162n0350R2354J13642l5227j14040p7120K1747m6207M9257J3938
$$ 1119100 1160262 1109912 1202266 1315908 1280681 1166641 1089521 1111268 1065061 1114318 1128256
15577A128256J677N7744j44981l14879O2117K66756L51349L3526j4644n8069j27690
$$ 1128256 1129933 1187677 1042696 727817 789934 1056690 1408039 1441565 1426921 1368852 1241162
15566A241162M8044l0592Q3013q6974o9218j38527j76249n0806K18925L08657
$$ 1241162 1289206 1258614 1341627 1254653 1185435 1046908 870659 819853 1038778 1347435
15556A347435n4262k09344j80395k91938J44203J58282p1199J23178J83415J22537
$$ 1347435 1293173 1083829 903434 611496 755699 913981 842782 965960 1149375 1271912
15546A271912l0652q5898l43695n525R2888O6455K12309j10776l51431N0011J97914
$$ 1271912 1241260 1155362 811667 806142 899030 965485 1177794 1067018 715587 765598 963512
15535I63512j65649q417K01328J7433j24993J05112J5479j91339o2382Q7964p954
$$ 963512 797863 789446 990774 1008207 883214 988326 1003805 812466 750084 838048 830094
15524H30094P9059P2954L4140K12183O8159k19832k30615j7724P5530n1845j67948
$$ 830094 909153 982107 1016247 1228430 1296589 1076757 846142 828418 903948 852103 684155
15513F84155M5635J93118K31722n134J7446P1389k1001j26849k9898O6904j35328
$$ 684155 729790 922908 1154630 1149496 1166942 1238331 1217330 1090481 1060583 1127487 992159
15502I92159J74408P2743N5663R3978j60700m6608j00379j31035l0397K0684P707
$$ 992159 1166567 1239310 1294973 1388951 1228251 1181643 1081264 950229 919832 940516 948223
15491I48223Q8059K24669j04025o7688L3898r7872j87929K1421K24456j3467k14184
$$ 948223 1036282 1260951 1156926 1089238 1123136 1025264 837335 858756 1083212 1069745 855561
15480H55561k16582N7743K45549j6107Q9549K46389n2752k41661j49400J33814
$$ 855561 638979 696722 942271 926164 1015713 1262102 1209350 967689 818289 952103
15470I52103J11562j37964r9532J03860O9919n2614r8070j7399m7566j34436j79833
$$ 952103 1063665 925701 826169 930029 999948 947334 849264 831865 784299 649863 470030
15459D70030P0308J53681N8789m8634R1253P8806J68968J29563j07455m5198l4526
$$ 470030 540338 694019 752808 704174 795427 874233 1043201 1172764 1065309 1020111 985585
15448I85585L7182k4457p1986j65128L4288P5722J26039j78937j02802R895k39591
$$ 985585 1022767 998310 926324 761196 795484 871206 997245 818308 715506 725401 485810
15437D85810r5956K65826L31919q013j2621N4927k8444k7967P4390J47801K236
$$ 485810 389854 655680 987599 979586 966965 1021892 993448 965481 1039871 1187672 1189908
15426A189908k84492N9829j65901K9565J44531L03879K041J22750L5562r1643
$$ 1189908 905416 965245 799344 828909 973440 1277319 1279360 1402110 1437672 1346029
15416A346029k04294K7276M477q5354l7112P5510j9971J02998K4506j59675J2946
$$ 1346029 1141735 1169011 1173488 1088134 1051022 1126532 1106561 1209559 1234065 1074390 1087336
15405A087336O6068j51290J50l7215k15687m4195K13344Q0041J40364j82721m1426
$$ 1087336 1153404 1002114 1002264 965049 749362 705167 918511 998552 1138916 956195 914769
15394I14769m04281r1106J6793N7638k5136J10546K66355J42673Q7434n9318j35065
$$ 914769 510488 419382 436175 493813 468677 579223 845578 988251 1075685 1016367 881302
15383H81302K9312J6018o698J05339j93516l00200o6939J01526M3029j91792Q5242
$$ 881302 910614 926632 919934 1025273 831757 531557 464618 566144 609173 417381 502623
15372E02623K53939j4945l0980k8595j3522J16248K03698N0577K1580k01308j07063
$$ 502623 756562 741617 710637 682042 668520 784768 988466 1039043 1060623 859315 752252
15361G52252M9825j16144J950J75407r9089P1313J56475O0307k17212j756J20545
$$ 752252 802077 685933 687883 863290 764201 835514 991989 1052296 835084 833328 953873
15350I53873O7382m8884j71815Q2087n3520J8592M4390Q2950n166n2205L0576
$$ 953873 1021255 972371 800556 882643 829123 847715 892105 975055 969889 917684 948260
15339I48260L03155J93328L2817k54809j46365o6514n7695r6785q8872J70639
$$ 948260 1251415 1444743 1477560 1222751 1076386 1009872 952177 855392 766520 937159
15329I37159L0699L4783O9289K27679j47011j73546n3652J65550K18227l5700
$$ 937159 967858 1002641 1071930 1299609 1152598 979052 925400 1090950 1309177 1273477
15319A273477j13286o1968k73288k07727N3454K03449R0789j7360O1615M1648
$$ 1273477 1160191 1098223 824935 617208 670662 874111 964900 947540 1009155 1050803
15309A050803k10900J8665J12234J11267Q4834N0112q7661J607k24019Q4454k63548
$$ 1050803 839903 858568 970802 1082069 1166903 1217015 1129354 1130961 906942 991396 727848
15298G27848j72621N6218o9112K00636J05745j50118O1111M09394P7847q5335
$$ 727848 555227 611445 542333 742969 848714 698596 759707 1169101 1246948 1161613
15288A161613j64830k1369j4159j57377l3246J13751P9722Q5307m6752k07894
$$ 1161613 996783 975414 961255 803878 770632 884383 964105 1049412 1002660 794766
15278G94766k52542k30392J68536L15644j6263M0091l9330J2995Q9422j49591
$$ 794766 542224 311832 480368 796012 779749 819840 780510 793505 882927 733336
15268G33336k81170O5324j8409J02813M2474O488J37222j15107p0503J23950L51715
$$ 733336 452166 517490 499081 601894 644368 650856 788078 672971 602468 726418 1078133
15257A078133m7814R3890q722J00254k58749j24230j65798J44107O6959j04835
$$ 1078133 1030319 1124209 1115487 1215741 956992 832762 666964 811071 878030 773195
15247G73195Q2245K57303j97063j80117q9911J03699R0433r6529r2846P0326J11782
$$ 773195 855440 1112743 915680 735563 645652 749351 839784 743255 650409 720735 832517
15236H32517l53235Q77M8121l1253M1444J88815j1589L4745q9827j06768J35489
$$ 832517 479282 480159 528280 497027 538471 727286 715697 750442 660615 553847 689336
15225F89336J65667j6342j986O2544j15376j83558p6518r0943R5349J2064J04874
$$ 689336 855003 838661 836675 899219 783843 600285 523767 432824 528173 540237 645111
15214F45111N3198o4158J52600p8447J72887K92997n0550j5579J14016j02280
$$ 645111 698309 634151 786751 708304 881191 1174188 1123638 1108059 1222075 1119795
15204A119795j10397r2939N7458J8544J16053j23872k10869L4251J35120J80952
$$ 1119795 1009398 916459 973917 992461 1108514 984642 773773 808024 943144 1124096
15194A124096J63347l449l39128n0756J10654j35434o6097k34093L1582j44417
$$ 1124096 1287443 1283994 944866 894110 1004764 869330 803233 569140 600722 456305
15184D56305j22356J02190J68003O658k01044J12710K42729L30367j14974l12664
$$ 456305 333949 436139 604142 610800 409756 522466 765195 1095562 980588 667924
15174F67924P175N9489R1661N3265q6665P0763o7760j18532J8501R4988K83q32
$$ 667924 675099 734588 826249 879514 792849 863612 795852 677320 695821 790809 791092 790260
15162G90260J45P993J6424O6066J03554m7727M7853P4410r9415k26140j75880
$$ 790260 790405 798398 814822 880888 984442 936715 984568 1058978 959563 733423 557543
15151E57543j16705k12583L15889L68667J25838j18637l88309j41341J53204k3320
$$ 557543 440838 228255 544144 912811 1038649 920012 531703 390362 543566 520246
15141E20246R6913P9639l9606q5415L4166J31574R9832J97029j14854l48088j43186
$$ 520246 617159 696798 657192 571777 605943 737517 837349 1034378 919524 571436 428250
15130D28250O0840P8701o0574M8928J37969l1631J06688j1446k25969J0590M29375
$$ 428250 489090 567791 507217 556145 694114 662483 769171 757725 531756 542346 971721
15119I71721K55922q2607j18163N687j54737N114K4066j14894p8443R6908J2320
$$ 971721 1227643 1145036 1026873 1032560 877823 882937 907003 792109 713666 810574 822894
15108H22894j84117j03870j7214P9619J23374j23073M6345M9102K10827q0358
$$ 822894 638777 534907 517693 597312 720686 597613 643958 693060 903887 823529
15098H23529q7442O2766k01687o4215j7866K2005j32379J54034K98761k0493k03254
$$ 823529 736087 798853 597166 532951 515085 537090 404711 558745 857506 837013 633759
15087F33759o6346j11652k55475L6499M79120K18357k32397l40134K81888L29957
$$ 633759 567413 455761 200286 236785 715905 934262 701865 361731 643619 973576
15077I73576j23694l37021J4010J60852j53873j4036j19598n3219j09261J19067
$$ 973576 849882 512861 526871 687723 533850 519814 400216 346997 237736 356803
15067C56803K13835J24460J11868K11601j38693m62745l10460Q4093K31359q4646
$$ 356803 570638 695098 806966 1018567 879874 417129 106669 190762 422121 337475
15057C37475J72288N4561Q6235J26205k5258L0303m0249j65921o4333J03470j04741
$$ 337475 509763 564324 650559 776764 751506 781809 741560 575639 511306 614776 510035
15046E10035M3039O3787j85068j85709Q2006K10374J57584J01963n5147m2739
$$ 510035 553074 616861 431793 246084 328090 538464 696048 798011 742864 700125
15036G00125j16720m723J59855P5035j05747j12234j32270M5823N5504J02792
$$ 700125 583405 578682 738537 813572 707825 595591 463321 509144 564648 667440
15026F67440j92329j84608J13466K9190J04394N75j0146m31r296j38598m8717
$$ 667440 475111 290503 403969 433159 537553 538128 527982 527551 518255 379657 330940
15015C30940J23876R4070r3587j63387N9278J08279L16486K05408p4122j79109
$$ 330940 454816 548886 455299 291912 351190 459469 775955 981363 907241 728132
15005G28132N3212j8531k24356j29351n7761P0076O0157J17765J1371K24330p3083
$$ 728132 781344 762813 538457 409106 351345 421421 481578 599343 610714 835044 761961
14994G61961l7841n4693k04899K49781P4132r8499R9364j71470O6204J23536j87231
$$ 761961 724120 669427 464528 714309 788441 689942 789306 617836 684040 807576 620345
14983F20345j11763p2045j14043R1725R9710N1560J31254J5159Q1449j78287O042
$$ 620345 508582 436537 322494 414219 513929 565489 696743 711902 793351 615064 621106
14972F21106J16544P0004J6458j24481n5099K6161O2107J31372O1362j53019j0894
$$ 621106 737650 807654 824112 699631 644532 670693 732800 864172 925534 772515 761621
14961G61621J4133J7612j0541j55614J30074j32098j26761N5271J21547N1818
$$ 761621 775754 793366 782825 627211 757285 625187 498426 553697 675244 727062
14951G27062K1365j87283J29133J3206K4196k14647j0102J32846q3558k80063
$$ 727062 748427 561144 690277 703483 727679 513032 502930 635776 552218 272155
14941B72155N1006K36886K66051J05573j91091j89084j22979p641J67403p1571
$$ 272155 323161 560047 826098 931671 740580 551496 428517 420876 588279 516708
14931E16708j133Q7737q2191j8861N851j25087k8306R8896K0901j50331k6080
$$ 516708 515575 603312 521121 502260 508111 383024 354718 453614 474515 324184 298104
14920B98104K62092R3680J10827Q6084J720Q9748M394p0219j34418k00411L7638
$$ 298104 560196 653876 764703 850787 852507 942255 946649 876430 742012 541601 579239
14909E79239k39167M8833m5053p2702k0740k4595k2239p0865p9205P0731K38605
$$ 579239 340072 388905 343852 271150 250410 225815 203576 132711 53506 124237 362842
14898C62842R5909k0203O7648J17964j69704k31136K67661O0128K5862j63029
$$ 362842 458751 438548 506196 624160 454456 223320 490981 551109 576971 413942
14888D13942m4999L7470l979j39091J97462K05796n2840k12246n9794O6057P6620
$$ 413942 368943 406413 402434 263343 460805 666601 613761 401515 341721 407778 484398
14877D84398J51513j4030K3920J01j0182o3131J54930q4923r6874L9961j16694
$$ 484398 635911 621881 645801 645902 635720 572589 727519 642596 545722 585683 468989
14866D68989J03379J14214l40816j23802M0424l6801J81674J75350O3629K66309
$$ 468989 572368 686582 345766 221964 262388 225587 407261 582611 646240 912549
14856I12549O6030J08622k01406k47191k7447N9188l1878k20467o2393k8656J7172
$$ 912549 978579 1087201 885795 638604 611157 670345 638467 418000 355607 326951 344123
14845C44123K07727K62323n4238J9959L1309l50560J1100J38290k2970j53290
$$ 344123 551850 814173 759935 779894 811203 460643 471743 610033 587063 433773
14835D33773n2236J92m4123m1174o2477J71148j687J5759J94381L5192r8861j20492
$$ 433773 381537 381729 337606 296432 233955 405103 403416 419175 613556 648748 549887 429395
14823D29395K3204m5524j4606J17404J25113R9481k07303O241R7937J23150R8188
$$ 429395 452599 407075 392469 509873 634986 734467 527164 533405 631342 754492 852680
14812H52680r6293M7260n5244l48495q9136K72192K58283m0803j60726j09058
$$ 852680 756387 803647 748403 399908 310772 582964 841247 800444 639718 530660
14802E30660K9320P4918n7135j91823M4074K2430J74207J01213q9204o8458m2196
$$ 530660 559980 634898 577763 385940 430014 452444 626651 727864 638660 570202 528006
14791E28006J03281J07658K0798j62353m60482n8274K78154j62612m2946J82273
$$ 528006 631287 738945 759743 597390 136908 78634 356788 194176 151230 333503
14781C33503J99689M3281o0799K6881j08707j56740L2856J33653J9656k353L6183
$$ 333503 533192 576473 515674 542555 433848 277108 309964 443617 463273 460920 497103
14770D97103j9243j1349M6065j28953K94659K29523j96369k45415n6200j25757
$$ 497103 477860 466511 512576 383623 678282 907805 711436 466021 409821 284064
14760B84064j00346L70176L12980j46497p1761P271J148K3185k00549o6393o0410
$$ 284064 183718 553894 866874 720377 648616 655887 657035 680220 479671 413278 352868
14749C52868J93132K08600j9778k58982j12019P1154M4474L5225j64524l8690
$$ 352868 546000 754600 734822 475840 363821 434975 479449 514674 350150 311460
14739C11460m2316l3947N9898Q8474J6257j69058J90126J07360r3574Q3036K8287
$$ 311460 269144 235197 295095 383569 399826 230768 420894 528254 434680 517716 546003
14728E46003K0631j03421J58350o0208m6221K00095q8570K556m3085J42006j24247
$$ 546003 566634 463213 621563 561355 515134 715229 626659 629215 586130 728136 603889
14717F03889k9435k11312q30j32159J42398k10477K7887K92660m1086r435K4153
$$ 603889 574454 363142 362312 230153 372551 162074 189961 482621 441535 432100 456253
14706D56253J28759J19522K01776n6421j60835j52621j29238n0302J87053j4053
$$ 456253 585012 704534 906310 849889 689054 536433 407195 356893 543946 529893
14696E29893j74372p9061N2625k1324L9690j87266r9184J12039J47808P3908K45834
$$ 529893 355521 276460 329085 307761 347451 160185 61001 173040 320848 394756 640590
14685F40590q813r9631m1308n2279k43664j42756J09903j1632j70522K15070J41256
$$ 640590 631777 532146 490838 438559 194895 52139 162042 150410 -20112 194958 336214
14674C36214r2604P4773J18171J68586Q1009P5675j83951l09744j56293K58076
$$ 336214 243610 318383 436554 605140 686149 761824 577873 268129 111836 369912
14664C69912q4561k1969L05823J09499o87k07644k16580j9630K14684K55186K37139
$$ 369912 285351 263382 569205 678704 678017 470373 253793 234163 448847 704033 941172
14653I41172n3606p1997j96619j48300Q3448J96784J50151J57219Q1779k20668
$$ 941172 887566 815569 618950 470650 554098 750882 901033 1058252 1140031 919363
14643I19363j25097k50209k03588p3880k73344q0216J12971J74573J38511P0068
$$ 919363 794266 544057 340469 266589 -6755 -86971 26000 200573 339084 409152
14633D09152m7925k79117j9124K43835j20839k24229L8427J01525J70455O9929
$$ 409152 361227 82110 62986 306821 185982 -38247 180 101705 272160 342089
14623C42089J20878J754j21690P2050J40614J85719m2846p5201O6855k06196k30301
$$ 342089 462967 464721 343031 415081 555695 741414 698568 623367 690222 484026 253725
14612B53725J62933J37931j85074j34892K8063j2987K1819k6829O508o9077L0312
$$ 253725 416658 554589 369515 234623 262686 249699 271518 244689 251197 182120 212432
14601B12432m6355J84481J48988j77839k32298p5829J93580m0934l0092j3913
$$ 212432 166077 350558 499546 321707 89409 13580 207160 166226 136134 122221
14591A22221J56986J78080l3646q5664R9482L13183N6608j55794q8534J13897
$$ 122221 279207 457287 423641 337977 437459 750642 807250 651456 562922 676819
14581F76819j25453j99174p7713j08327L1340K15111j51834J77489O950P2400
$$ 676819 551366 352192 274479 166152 197492 412603 260769 438258 445208 517608
14571E17608K0182k31032k01331N9149K31967J91807n5480j9463j34313j23809
$$ 517608 537790 306758 105427 164576 396543 588350 532870 513407 379094 255285
14561B55285j74159j17649J72426J49184K37295J15756j29142k24821L604R1850
$$ 255285 81126 -36523 135903 285087 522382 638138 508996 284175 287779 379629
14551C79629M887J20284p8963k29715j8590J2304k84702m845K662O1230J82491
$$ 379629 384516 504800 425837 196122 177532 189836 -94866 -99711 -97049 -35819 146672
14540A46672L6218K23166J05658r0937k82435P9863R7157l99394n9283J94667
$$ 146672 182890 406056 511714 420777 138342 218205 315362 -84032 -143315 51352
14530E1352J66885j4489M621J20989K38744K10698m6919j76851k13277O9282J10521
$$ 51352 218237 203748 208369 329358 568102 778800 731881 555030 341753 411035 521556
14519E21556N706L6654j68637j40653Q8270q9143q8170j78515P9831Q5457K27550
$$ 521556 527262 563916 395279 254626 342896 253753 165583 -12932 66899 152356 379906
14508C79906P9453k26402l34462M917J43555P5252N0740r105q0717j9518k5501
$$ 379906 459359 232957 -101505 -96588 46967 122219 172959 163854 83137 63619 38118
14497C8118o0847j89157J44339K41934N3980Q1447l5759J11477k2165n1838K93084
$$ 38118 -22729 -211886 -67547 174387 228367 309814 274055 385532 363367 311529 604613
14486F04613k43707k87598l162N5566J05389L04999J49441j28578q5663l9068
$$ 604613 360906 73308 70146 125712 231101 536100 685541 556963 471300 432232
14476D32232O7007R6078j15995k33199L319P9767K3561o5551j54950j32324J4006
$$ 432232 499239 595317 479322 246123 249442 329209 352770 287219 132269 -55 13951
14465A3951j9507J37703J67674j63400n4238n08Q0988N4036j29781K1400K70737
$$ 13951 -5556 132147 299821 136421 82183 81675 162663 216699 86918 108318 379055
14454C79055K47274O130k14424N9596j4696j46223J62450j99677k0812J98730
$$ 379055 626329 632459 418035 477631 462935 316712 479162 279485 258673 457403
14444D57403p9502n7905J26100K4505j06796L1777J03948K6218r3898k2595N8309
$$ 457403 377901 319996 446096 470601 363805 395582 499530 525748 431850 409255 467564
14433D67564n9503J68159K9293k04220l05321q6158O1935J63935J8006Q3943k4666
$$ 467564 408061 576220 605513 401293 95972 9814 71749 235684 253690 337633 312967
14422C12967Q6189N4919O3027l20165l57611m885N768K09N573R8473J68552q3083
$$ 312967 399156 454075 517102 196937 -160674 -165559 -159791 -159582 -154009 -55536 113016 29933
14410B9933o7687p5701J51709K58083n4101J34918K03369j0074l3067j04545l4634
$$ 29933 -37754 -113455 38254 296337 242236 377154 580523 570449 537382 432837 398203
14399C98203o0310J07952k23924j21961n9769J54678J52362j89375O9521k7694
$$ 398203 337893 445845 221921 99960 40191 194869 347231 157856 227377 199683
14389A99683j07238O913O6884J37462O9272L6195O8614P5134r7316j72299p2566
$$ 199683 92445 99358 166242 303704 372976 409171 477785 552919 455603 283304 210738
14378B10738N5256M6812K1392M3850J02832J32246k8083J53007K6021R1305k26966
$$ 210738 265994 312806 334198 378048 480880 613126 585043 738050 764071 855376 628410
14367F28410j80313j2701n833k71166k46106L38435J82088J00764l9714r8595
$$ 628410 448097 435396 429563 158397 -87709 250726 432814 533578 493864 395269
14357C95269k47887L4105K05743J97384k46697O1263L3629K8391j15657j18430
$$ 395269 147382 181487 387230 584614 337917 399180 432809 461200 345543 227113
14347B27113k8060J43399j9774j26783J63713O6951l49281k05827O3684m3854
$$ 227113 199053 342452 322678 195895 359608 426559 77278 -128549 -64865 -108719
14337a08719j57280K11597J02246k70665J6704J45528J93005K8565N1285P7524
$$ -108719 -265999 -54402 47844 -222821 -206117 -60589 132416 160981 212266 289790
14327B89790P9131m8907j24493j41560K86834L09456K24323p095p1855o0500o5909
$$ 289790 368921 320014 195521 53961 340795 650251 874574 867479 795624 735124 669215
14316F69215l38342j96859p7599r9674j27021J51773r1624P7374J60348J27642
$$ 669215 330873 134014 56415 -43259 -170280 -18507 -110131 -32757 127591 255233
14306B55233j59953N5434J19654R6050L78347n1734m28164j42563Q6747p7424
$$ 255233 95280 150714 270368 366418 744765 693031 264867 122304 209051 131627
14296A31627j82649L4974J51389Q3997q5548J82929J11497k47387j06875Q4550
$$ 131627 -51022 -16048 135341 219338 133790 316719 428216 180829 73954 158504
14286A58504L9498p3797J30690M6053o2573l6149L2165J00438n8128r2850o053
$$ 158504 198002 124205 254895 300948 238375 202226 234391 334829 276701 183851 177798
14275A77798j19651J13632L44622r5628k22249j59242j43912J91166J77383j41599
$$ 177798 58147 171779 516401 420773 198524 39282 -104630 86536 263919 122320
14265A22320Q654O2428j0793O2808j27795k33482j36965Q0101J98527K57495J87767
$$ 122320 130974 193402 182609 245417 117622 -115860 -252825 -172724 25803 283298 471065
14254D71065o7884l61646K6558L27056Q0758P8985o6074l39876j95635J2411P4601
$$ 471065 403181 41535 68093 395149 475907 554892 488818 148942 -46693 -34282 40319
14243D0319J06389L17019J57329j04196j70759N7957P0944k54225J88195r4512
$$ 40319 146708 463727 621056 516860 346101 404058 475002 220777 408972 314460
14233C14460k61260r3185o1255K20383J75119o779n4623k6985p1153J19048J20523
$$ 314460 53200 -39985 -101240 119143 294262 287483 232860 205875 134722 253770 374293
14222C74293j38951N872N5914k45600j19552n1357K37061q1136j6575j33511J25060
$$ 374293 235342 241214 297128 51528 -68024 -119381 117680 36544 19969 -113542 11518
14211A1518O854j18742l8464J70043K8271k6742L1719J091J21086j69241k7419
$$ 11518 18372 -100370 -138834 31209 59480 32738 64457 65548 186634 17393 -10026
14200a0026J15034L6914n36O46n6166j18430P6195j691p1395j69223K9567J89595
$$ -10026 105008 141922 141386 142032 85866 -32564 43631 41940 -29455 -198678 -169111 20484
14188B0484P1594j03542R0025J42013J38423J4746k24406L8663J28948j28493
$$ 20484 92078 -11464 78561 220574 358997 373743 149337 188000 316948 188455
14178A88455P4972l0952L0775J23596M7321L2574j19605j25980p2148O9782J07275
$$ 188455 263427 232475 263250 386846 434167 466741 347136 221156 149008 218790 326065
14167C26065J68139o4969j45097K1370q526r6443J45012J04810m5769k9339M1080
$$ 326065 494204 429235 284138 305508 296982 200539 345551 450361 404592 375253 416333
14156D16333o4695k64472j37592k24555k64477j428J06042K00304J05003l341
$$ 416333 351638 87166 -50426 -274981 -539458 -540886 -434844 -234540 -129537 -132878
14146a32878K77961K02055j32865o54J65524J3512l06713j79211P5404l5874J39354
$$ -132878 145083 347138 214273 213619 379143 392655 85942 -93269 -17865 -53739 85615
14135H5615J19300j4933L6975M0189j44366j04326O2297R6681Q0402L1744p4141
$$ 85615 204915 189982 226957 267146 122780 18454 80751 177432 257834 289578 215437
14124B15437O9529J17128j50474L9553K33611n9034L5690l5895j7164k07630o7528
$$ 215437 284966 402094 251620 291173 524784 465750 501440 465545 448381 240751 173223
14113A73223K36062Q4523j45088l91145j82077J22463L7583m7859J95940L19623
$$ 173223 409285 493808 348720 -42425 -224502 -102039 -64456 -112315 83625 403248
14103D03248K11393k36516j00352Q4462L2273K26043Q8914j52584J16466N6724
$$ 403248 614641 378125 277773 362235 394508 620551 709465 556881 673347 730071
14093G30071J5987j40752j74159o040J13239m06024j80296K00563j02448k50184
$$ 730071 746058 605306 431147 425107 538346 132322 -47974 152589 50141 -200043
14083b00043N1731J27863l5253q6454R2572J27405j81207k01161j74777P6009
$$ -200043 -148312 -20449 -55702 -142156 -49584 77821 -103386 -304547 -479324 -403315
14073d03315L61804M07474K0928k1516J12328N0283j36996k72849K14613J32962
$$ -403315 -41511 365963 386891 365375 477703 527986 390990 118141 332754 465716
14063D65716J01850l25579l19937Q7930n4658r7060K1746M24883L30132j07053
$$ 465716 567566 241987 -77950 9980 -44678 -141738 -119992 304891 635023 527970
14053E27970m14251j41345K38723R4278J28468r6497j7027K0104o5304l07546
$$ 527970 113719 -27626 211097 305375 433843 337346 320319 340423 275119 -32427
14043c2427j7574M9815j3976K5051K02703R3836j95013j15437n4165K7710J27784
$$ -32427 -50001 -186 -14162 10889 213592 307428 112415 -3022 -57187 -29477 98307
14032I8307J66940K53898j436o5961J69572M7035j02406m0095k41077o2685j02338
$$ 98307 265247 519145 517709 451748 621320 668355 565949 525854 284777 222092 119754
14021A19754p2952L7376n8488k8455J53606l1296J3469M9184J1686K2997j4317
$$ 119754 46802 84178 25690 -2765 150841 119545 133014 182198 193884 216881 202564
14010B02564k81083o7281p6115J60502Q6624N2267J38127L23059J33275j38177
$$ 202564 -78519 -145800 -221915 -61413 25211 77478 215605 538664 671939 533762
14000E33762l08301j19077q0024l773o5428j01938J68859m9726J7546K3082O3224
$$ 533762 225461 106384 26360 22587 -42841 -144779 24080 -25646 -8100 14982 78206
13989G8206L23926n4575J04510J9049j57694k28497N2092K1317K15028M662m6040
$$ 78206 402132 347557 452067 471116 313422 84925 137017 158334 373362 378024 331984
13978C31984K6338m041M538j28558L2853J01857K8377r3288k8151l9040l9746
$$ 331984 358322 354281 358819 230261 263114 364971 393348 300060 271909 232869 193123
13967A93123J2797J99495L5931k15547n6459O4162p1072J14762J35297j78835
$$ 193123 205920 405415 441346 225799 169340 233502 162430 277192 412489 233654
13957B33654j30578J30703Q9408j40509j36732L1946J48949M3514O7248j51276
$$ 233654 103076 233779 323187 182678 45946 77892 226841 270355 337603 186327
13947A86327k3946j35552l5656O2553j54472j57511N7629J70350R0114J80603
$$ 186327 162381 26829 -8827 53726 -100746 -258257 -200628 -30278 59836 240439
13937B40439K05610k9771j48849m2213M320k9614P0002j48911q5159j05978n0907
$$ 240439 446049 416278 267429 225216 229536 199922 269924 121013 35854 -70124 -121031
13926a21031j50447R2089r2888j23220N196L33660J08536j87127J6386N5311k73609
$$ -121031 -271478 -179389 -272277 -395497 -390301 -56641 51895 -135232 -118846 -63535 -337144
13915c37144O4135K24489K35249J22633L1347j07423O1473K3960k62101J8339
$$ -337144 -273009 -48520 186729 309362 340709 233286 294759 318719 56618 74957
13905G4957P3872R5251Q1438J33398K98443Q2392k94204k77007k11117j74204
$$ 74957 148829 244080 325518 458916 757359 839751 545547 268540 57423 -116781
13895a16781k2334K44546J89234K604q3402k0398K33395q0124k05377J68514O8585
$$ -116781 -139115 105431 294665 297269 213867 193469 426864 346740 141363 309877 378462
13884C78462J9742q6292k31086J48239O3845n5011j43090n4147J12712J56778
$$ 378462 398204 311912 80826 229065 292910 237899 94809 40662 153374 310152
13874C10152j59401j01064K5889r2902o8461K26009K68215J6311l57183k39019
$$ 310152 150751 49687 75576 -17326 -85787 140222 408437 424748 67565 -171454
13864a71454j92398n6615m5635L39903J73114j54139O5871K37178j02724k7363
$$ -171454 -363852 -420467 -466102 -126199 46915 -107224 -41353 195825 93101 65738
13854F5738J79911O3556K33555m685l4888p13K26089j71339k85571j7753o8995
$$ 65738 245649 309205 542760 538075 503187 502474 728563 557224 271653 253900 184905
13843A84905L9846j58333P7139N6808p6491j16687l4950j34292J89209Q8657l547
$$ 184905 224751 66418 143557 200365 123874 7187 -27763 -162055 27154 115811 112264
13832A12264J67886O7763l94114j75891J05454J24976n156J95852K1270J8883
$$ 112264 280150 347913 -46201 -222092 -116638 8338 3182 199034 220304 239187
13822B39187J35389Q3640l7911m793j38608j88212M5895N902l6960L9804J45403
$$ 239187 374576 458216 420305 415512 276904 88692 134587 140489 103529 143333 288736
13811B88736O0956r6616n3461k8124j57634R9216K00240j12874k95133J18449
$$ 288736 349692 253076 199615 171491 13857 113073 313313 200439 -94694 23755
13801B3755K02195L7030K6022J27637M6937k82167k20171j1846J34407r0913n8022
$$ 23755 225950 262980 289002 416639 463576 181409 -38762 -50608 83799 -7114 -65136
13790f5136K08624Q8376m7253O5213J06679l8641k27387o2434R3748K61995L1777
$$ -65136 143488 231864 184611 249824 356503 317862 90475 28041 121789 383784 415561
13779D15561N3787k7705j562q5564q4694k29658j6487L1340k3813N0824n343R8148
$$ 415561 469348 441643 440081 354517 269823 40165 23678 55018 31205 82029 76686 174834
13767A74834o4453k33034J48420R5102Q0354K28201J43417k9136R5445L1223n1026
$$ 174834 110381 -122653 25767 120869 201223 429424 572841 543705 639150 670373 619347
13756F19347r990l6528k62886J02556K35300N4919J05708r3818m20068l75818
$$ 619347 609357 572829 309943 412499 647799 702718 808426 714608 294540 -81278
13746h1278j15278J49282L38835o8575n710J2599j24541m155n868m7260N9680
$$ -81278 -196556 -47274 291561 222986 217276 229875 105334 101179 95311 48051 107731
13735A07731J62259j19983k45725J28145q2652L6588n8302m487q1795K36018K06589
$$ 107731 269990 150007 -95718 32427 -50225 -13637 -71939 -76426 -158221 77797 284386
13724B84386m3913M6729R9364k63679p2348n9947J40636J21137J31477M781O6105
$$ 284386 240473 287202 386566 122887 50539 -9408 131228 252365 383842 388623 454728
13713D54728J2764k01137k72149j40117m0624K64539J37543J25351R7246M29095
$$ 454728 467492 266355 -5794 -145911 -186535 78004 215547 340898 438144 867239
13703H67239J70111L5340K9586o1983N4613M2950K97218M8813m3064k42282m97986
$$ 867239 1037350 1072690 1102276 1040293 1094906 1137856 1435074 1483887 1440823 1198541 700555
13692G00555q014j85003j02711N6111m9071q54j45302K3025q7247n3086P2185
$$ 700555 692541 507538 404827 460938 411867 411013 265711 288736 201489 148403 220588
13681B20588o95j03570P4575J70529J05220K7993l32086k46430O2432j0380J04574
$$ 220588 219893 116323 190898 361427 466647 494640 162554 -83876 -21444 -31824 72750
13670G2750Q3367k7245j1857L2765K08919J44864j21357J9486K5545J11028p6856
$$ 72750 156117 128872 117015 149780 358699 503563 382206 401692 427237 538265 461409
13659D61409j61601l7718K0444K5779j81503j4069L05473Q8443j67530j98504
$$ 461409 299808 262090 282534 308313 126810 112741 418214 506657 339127 140623
13649A40623q1058K35164K2709J81681K3969l01087j01589J18694P0510K06065
$$ 140623 59565 294729 317438 499119 523088 222001 120412 239106 309616 515681
13639E15681L6376l41682o3705P065j6885k25526j51547P2532J78711n546j05293
$$ 515681 552057 210375 146670 153735 136850 -88676 -240223 -167691 11020 5474 -99819
13628i9819o3149k1664J88560n9726P9289K8376P0187p4952N830j03546J50655
$$ -99819 -162968 -184632 3928 -55798 23491 51867 122054 47102 52932 -50614 100041
13617A00041n449j14656j33087R3397R6250l9837o2323j1082m2119R2824J37413
$$ 100041 94592 -20064 -153151 -59754 36496 -3341 -65664 -76746 -118865 -26041 111372
13606A11372O2472M831m3121n9925J13806P5508O6925L76389l3913o5753l51189
$$ 111372 173844 178675 135554 75629 189435 264943 331868 708257 674344 608591 257402
13595B57402m5774Q8261k96451k537l2132R8881n2672k11558J41081M1506Q0734
$$ 257402 211628 299889 3438 901 -31231 67650 14978 -196580 -55499 -13993 66741
13584F6741j61232Q4565K9058Q2921m4253k75141J89867K52137J8662J48321j02847
$$ 66741 -94491 -9926 19132 102053 57800 -217341 -27474 224663 243325 391646 288799
13573B88799j59412m038J1447m5776R5163J27802j30863P251J36070O1619j48295
$$ 288799 129387 125349 136796 91020 186183 313985 183122 190373 326443 388062 239767
13562B39767N6532j43223j20643L17505J82985o7067R1296o0084k72588j84513
$$ 239767 296299 153076 32433 349938 532923 465856 557152 497068 224480 39967
13552C9967m9914N2217j9379J88744J70704p8838k2297N001l6522P7477J85133
$$ 39967 -9947 42270 22891 211635 382339 303501 281204 286205 249683 327160 512293
13541E12293j89936j62234j49323K06597K16051j39399o8909J7726j2265K2779
$$ 512293 322357 160123 10800 217397 433448 294049 225140 242866 230601 253380
13531B53380J45453L2671n6009r740N527J19068o3354j11315L3245j09284p7478
$$ 253380 398833 431504 375495 365755 371282 490350 426996 315681 348926 239642 162164
13520A62164m1159L4067J24893K44198J01688M2724k19370j81811J25648l3972
$$ 162164 121005 155072 279965 524163 625851 668575 449205 267394 393042 359070
13510C59070R9301N4425J68512q3790j94095j12958J57360p448J90454L15217
$$ 359070 458371 512796 681308 597518 403423 290465 447825 440377 630831 946048
13500I46048L14517j85830M7977n4256R9453J14800j26086J62896L45872M0354
$$ 946048 1260565 1074735 1122712 1068456 1167909 1282709 1156623 1319519 1665391 1705745
13490A705745p9385P5485j90414l07002Q1621K2917j4160j73090k56014q4799
$$ 1705745 1626360 1701845 1511431 1204429 1286050 1308967 1294807 1121717 865703 780904
13480G80904P9640j60832J9502N6923k11384P1265J19060J76774l15897l55250
$$ 780904 860544 699712 719214 776137 564753 636018 755078 931852 615955 260705
13470B60705m7747K436Q3695N1614Q5143k9561n1420l53302j77463K75253J55816
$$ 260705 212958 215394 299089 350703 435846 406285 354865 1563 -175900 99353 255169
13459B55169J00063J28477N0517j20521J10822m8800R3796j1052n5814p1687J6813
$$ 255169 355232 483709 534226 413705 524527 475727 569523 558471 502657 430970 447783
13448D47783K44079K13723k31777j34729P3064J42472j37790K8020K15941k22237
$$ 447783 691862 905585 673808 539079 612143 754615 616825 644845 860786 638549
13438F38549k1261J4755j4641j89418k46739Q3233K3689j56715r3047K07318J86717
$$ 638549 617288 632043 617402 427984 181245 264478 288167 131452 38405 245723 432440
13427D32440L3413Q7612K15720j94603j2303K82838J474J18912j81492j93987
$$ 432440 465853 553465 769185 574582 562279 845117 846591 965503 784011 590024
13417E90024J23198K13213J48282j60679j40969j10513o5191j44277J5759j6978
$$ 590024 713222 926435 1074717 914038 773069 662556 597365 453088 468847 451869
13407D51869K1958L97041K7332j46906J8281o3843j4634R7521J34365j07840r098
$$ 451869 473827 870868 898200 751294 769575 705732 691098 788619 922984 815144 806046
13396H06046k4260O4236P4337r1372J20921j93388j39859n1582n3300K81609J45617
$$ 806046 781786 846022 920359 828987 949908 756520 616661 565079 511779 793388 939005
13385I39005p0781N3545r88O7570J45758K89475j54068m2867J31764J6236j58076
$$ 939005 868224 921769 920781 988351 1134109 1423584 1269516 1226649 1358413 1374649 1216573
13374A216573j68310p7462k53080N4392J90277K96198k79793k84504n567K32439
$$ 1216573 1048263 970801 717721 772113 962390 1258588 978795 694291 688724 921163
13364I21163J88331j02378k51872M1935K06063J29644j8011J26948j34904m2867
$$ 921163 1109494 1007116 755244 797179 1003242 1132886 1114875 1241823 1106919 1064052
13354A064052p7876K71083p5352m7730J05344J26175j65131r4528j04192J92716
$$ 1064052 986176 1257259 1181907 1134177 1239521 1365696 1200565 1106037 1001845 1194561
13344A194561K00492R256o3397o9846m1780j07217O313K39987K24832j2451j08228
$$ 1194561 1395053 1404309 1340912 1271066 1229286 1122069 1128382 1368369 1593201 1580750 1472522
13333A472522K03103l3112l01086j9618N76226L54724k52648j44656J21835J29279
$$ 1472522 1675625 1642513 1341427 1321809 1898035 2252759 2000111 1855455 1977290 2106569
13323B106569M7753Q1529l5772J09698j93196N1583K06843R8905R2976J93503
$$ 2106569 2154322 2235851 2200079 2309777 2116581 2168164 2375007 2473912 2566888 2760391
13313B760391K8898K10787K19825J15036K18688J97975L7695j81207R4366K58957
$$ 2760391 2789289 3000076 3219901 3334937 3553625 3751600 3789295 3608088 3702454 3961411
13303C961411J54217J01876N9998J09976M54722M73527J51192J26859L59657L68674
$$ 3961411 4115628 4217504 4277502 4387478 4842200 5315727 5466919 5593778 5953435 6322109
13293F322109N21970K08327N5640K96160N14077O96849N84589N02757O03861M70004
$$ 6322109 6844079 7052406 7108046 7404206 7918283 8615132 9199721 9702478 10306339 10776343
13283A0776343O18400R45959R60587N42325J081482J525615J421217J488616J932220
$$ 10776343 11394743 12340702 13301289 13843614 14925096 16450711 17871928 19360544 21292764
13274B1292764K336397K562369K644105K799092K982489L598639M314042M821047
$$ 21292764 23629161 26191530 28835635 31634727 34617216 38215855 42529897 47350944
13266D7350944N717600O822562P934580R594434J1879114J4399186J7686043K1345778
$$ 47350944 53068544 59891106 67825686 77420120 89299234 103698420 121384463 142730241
13258A42730241K5412233K8643995L0767150L0034271K5797676J8702553J0006352
$$ 142730241 168142474 196786469 227553619 257587890 283385566 302088119 312094471
13251C12094471M31876q932634j7905048k5349742k9309015l0046457k8169923
$$ 312094471 312526347 303593713 285688665 260338923 231029908 200983451 172813528
13244A72813528k5131815k1836712j8050006j4844255j2407822r943532q114473
$$ 172813528 147681713 125845001 107794995 92950740 80542918 70599386 62484913
13237F2484913o727371n804804n015517m349972l922660l302190k977538k606137
$$ 62484913 55757542 49952738 44937221 40587249 36664589 33362399 30384861 27778724
13229B7778724k555879k279131k012341j682245j357814j137269j202884j312395
$$ 27778724 25222845 22943714 20931373 19249128 17891314 16754045 15551161 14238766
13221A4238766j148577p96174q29358n50536o30073n56906m37673m87847l43726
$$ 14238766 13090189 12294015 11464657 10914121 10284048 9727142 9289469 8801622 8457896
13212H457896n27579m12174j22796l87782l48094k5461p0290l51940n91243l68497
$$ 8457896 7930317 7518143 7395347 7007565 6659471 6634010 6563720 6211780 5620537 5252040
13202E252040q9032j39081m46111o627J275l222k51540j95802N033l15999k42848
$$ 5252040 5163008 5023927 4577816 4571189 4572464 4569242 4317702 4121900 4126933 3810934 3568086
13191C568086j02697r5753K33k09473j34316m5422k47334j96631K22227K27301
$$ 3568086 3465389 3369636 3369869 3160396 3026080 2980658 2733324 2536693 2758920 2986221
13181B986221m56857l49051k44629N9431J14636J47973Q4594N3710l42687k50089
$$ 2986221 2529364 2180313 1935684 1995115 2109751 2257724 2342318 2396028 2053341 1803252
13171A803252R03L24378J04011p3289j69925k61051J82114O2609j12976k16220
$$ 1803252 1804155 2128533 2232544 2159255 1989330 1728279 1910393 1973002 1860026 1643806
13161A643806J01923k13374j85738P9022Q4931L4942K98344K6715k19192k08494
$$ 1643806 1745729 1532355 1346617 1425639 1510570 1545512 1843856 1870571 1651379 1442885
13151A442885P9561l5776j02827L7595J2778L8587o2843k2207K34298k06988k50340
$$ 1442885 1522446 1486670 1383843 1421438 1434216 1472803 1409960 1387753 1622051 1415063 1164723
13140A164723j04162m2126K61868j39402l48194O5807M0389k55779j0881o314
$$ 1164723 1060561 1018435 1280303 1140901 792707 858514 898903 643124 632243 625929
13130F25929K93192n5045j20857o4393K33301J98024O885k11670K5482L00681
$$ 625929 919121 864076 743219 678826 912127 1110151 1117036 905366 930848 1231529
13120A231529O0870j78533n9689r6670j46107L5030M35718O5995j54076l51671
$$ 1231529 1292399 1113866 1054177 957507 811400 846430 1282148 1348143 1194067 842396
13110H42396r7516M7255J13715j377o5332J18115n9018J05121J66756o5741r5458
$$ 842396 744880 792135 905850 904473 839141 957256 898238 1003359 1170115 1104374 1008916
13099A008916j90846n2138Q763K3368J0865m2021O9130o4604l53854L455J41728
$$ 1008916 818070 765932 774695 798063 808928 766907 836037 771433 417579 421034 562762
13088E62762J25697O4621K5208P4859K8118k86804k27173j34456L82122O1969
$$ 562762 688459 753080 778288 853147 881265 594461 367288 232832 614954 676923
13078F76923k07039l74264L7801M9002r2296n0385m976K62115J4594k03455l1266
$$ 676923 469884 95620 133421 182423 90127 39742 34766 296881 311475 108020 76754
13067G6754P7385r7154j37156j4851j43908J25461J23250m1269k2937n4437J18629
$$ 76754 154139 56985 -80171 -95022 -238930 -113469 9781 -31488 -54425 -108862 9767
13056I767l7403L34079J19243j398J21223j27036j35621j80254n6597K2084O1093
$$ 9767 -27636 306443 425686 424288 545511 418475 282854 102600 46003 68087 129180
13045A29180L31671K45718l56275k68564j33273j51520o2369m3437J55611L9076
$$ 129180 460851 706569 350294 81730 -51543 -203063 -265432 -308869 -153258 -114182
13035a14182Q043l3R7333k2922r912J27390M10228J60189j17398j45187r8716
$$ -114182 -106139 -106172 -8839 -31761 -41673 85717 495945 656134 538736 393549 294833
13024B94833k618j3193K8596J05161Q647P993q9338j77603j53057j6041R3602
$$ 294833 292215 279022 307618 412779 421426 429419 340081 162478 9421 -6620 86982
13013H6982l2951P4238K10048M5757k02377l3354o7530k8288j0356J11062j13017
$$ 86982 54031 128269 338317 384074 181697 148343 80813 52525 42169 153231 40214
13002D0214J65271J28419j66661k12393o1397j5343j52597K12288K85015j4371
$$ 40214 205485 333904 167243 -45150 -106547 -121890 -274487 -62199 222816 208445
12992B08445K6742M0653N6120L5431o7103j89756k3204M00560J31716j4566l25632
$$ 208445 235187 275840 331960 367391 300288 110532 87328 487888 619604 605038 279406
12981B79406k9510J23849q3797j7944n1947J04940n7041o5291o3979K85101K7716
$$ 279406 249896 373745 289948 272004 220057 324997 267956 202665 138686 423787 451503
12970D51503j32070L1986j47181J9438R1099J67556j78400j20310m8034j21729
$$ 451503 319433 351419 204238 223676 314775 482331 303931 183621 135587 13858
12960A3858r218N2835L3023n4226J72885J84288K80946m0125j58320N7427j5702
$$ 13858 4640 57475 90498 36272 209157 393445 674391 634266 475946 533373 517671
12949E17671j16608j46540J58011R9042j44844k31732l9768j39218k29906J41784
$$ 517671 401063 254523 412534 511576 366732 135000 95232 -43986 -273892 -132108
12939a32108K52640J36766n460j46339p9738J65160n0618L0677L32734O6271m5419
$$ -132108 120532 257298 251838 105499 25761 190921 140303 170980 503714 569985 524566
12928E24566l6041m7245q1546j66800k44543o4890K14552N1136J1888j22916J19400
$$ 524566 488525 441280 359734 192934 -51609 -116499 98053 149189 161077 38161 157561
12917A57561Q9893l78209o7068K33856J01030J70477J7406n5065k25889l8554
$$ 157561 247454 -130755 -197823 36033 137063 307540 324946 269881 43992 5438
12907E438J8104j2541n7432K5578J42867L7650Q2394J6734J67824J44982q8680
$$ 5438 23542 11001 -46431 -20853 122014 159664 242058 258792 426616 571598 482918
12896D82918j44281P5063p5219k18011K8695n764R2901J90234L02030P1570l46600
$$ 482918 338637 413700 338481 120470 149165 143401 236302 426536 728566 800136 453536
12885D53536o2987j80249n4973j99707k09545Q1810K93022K85945O2423o3877
$$ 453536 390549 210300 155327 -44380 -253925 -172115 120907 406852 469275 405398
12875D05398j06303j45963j25576q8956J01772N565J9095p3337J4942K11098Q1380
$$ 405398 299095 153132 27556 -61400 40372 45937 65032 -8305 6637 217735 299115
12864B99115q8182J3590m2234j37014m4534L6319J00863j13846J92247J23076
$$ 299115 210933 224523 182289 45275 741 37060 137923 24077 216324 339400
12854C39400j92720o4626J82406O2087k306j59971j86598j4051J44795K03335
$$ 339400 146680 82054 264460 326547 324241 164270 -22328 -36379 108416 311751
12844C11751O5077k4816K994o9112l4430l31339j93364j25775K03763P4969M5228
$$ 311751 376828 352012 355006 285894 251464 -79875 -273239 -399014 -195251 -120282 -75054
12833g5054Q7809m8139L4769n9542o4265m8208J48911J14553l3161L3151n0345
$$ -75054 12755 -35384 -615 -60157 -124422 -172630 -23719 90834 57673 90824 40479
12822D0479N2406K6130O9181J68534k9698j90799J17593O572l8980l3139k9283
$$ 40479 92885 119015 188196 356730 327032 136233 253826 260398 221418 188279 158996
12811A58996K44510l7666J05000J83119L18877K5474p2143n1157j15818m1447
$$ 158996 403506 365840 470840 653959 972836 998310 926167 875010 759192 717745
12801G17745J91567P2209P3196K94542J37695j45060p1572k7173n5511j31737
$$ 717745 909312 981521 1054717 1349259 1486954 1341894 1270322 1243149 1187638 1055901
12791A055901j1667J11353j70476l51270n6695k55048m2297m6453o5941K48366
$$ 1055901 1044234 1155587 985111 633841 577146 322098 279801 233348 167407 415773
12781D15773J73115l70243j05359j55223m1433p6934J823J57451j45842j15783
$$ 415773 588888 218645 113286 -41937 -83370 -160304 -158481 -1030 -146872 -262655
12771b62655K5114N4228q5163n2587k9655J83236J04601L4094P3857r4855m4316
$$ -262655 -237541 -183313 -268476 -321063 -350718 -167482 -62881 -28787 45070 -49785 -94101
12760i4101K23556J5753k73560r5126K15593m5803k80049J3073K53140J53535
$$ -94101 129455 145208 -128352 -223478 -7885 -53688 -333737 -320664 -67524 86011
12750H6011O4206M1728j29570J21660L946k31408J95722J1273j50435j38331P9213
$$ 86011 150217 191945 62375 184035 187981 -43427 152295 163568 13133 -125198 -45985
12739d5985j20414j15022J7467j81428K01038K70802l0198k38179K6112R9342
$$ -45985 -166399 -281421 -263954 -445382 -244344 26458 -3740 -241919 -215807 -116465
12729a16465M9887K9222j03573j4491n990P0739L3020K2032j5041K9185J15614
$$ -116465 -66578 -37356 -140929 -155420 -161410 -90671 -57651 -35619 -50660 -21475 94139
12718I4139o5897Q916J03484Q3408J97069j22886j8120J1445p1324j28377k28856
$$ 94139 28242 37158 140642 224050 421119 298233 280113 291558 220234 91857 -136999
12707a36999j6090J34005K29419P4010j3959M8982l42714l04167M0665M6576J20496
$$ -136999 -153089 -19084 210335 284345 270386 319368 -23346 -327513 -286848 -240272 -119776
12696a19776j69400J57610Q3647k8763R8428j3938J67373m3337j09830k22757
$$ -119776 -289176 -131566 -47919 -76682 21746 7808 175181 131844 22014 -200743
12686b00743J36995j9744r1350P4787J56685O6026l5618k62850J19471N7927J0234
$$ -200743 -63748 -83492 -174842 -100055 56630 122656 87038 -175812 -56341 1586 11820
12675A1820k71745r1812j37401O8460J70114J84513j16396K07788J49116r912
$$ 11820 -259925 -351737 -489138 -420678 -250564 -66051 -182447 25341 174457 164545
12665A64545k41887j50809j68254J84262J00505k5706J98297L3433k69680P0451
$$ 164545 -77342 -228151 -396405 -212143 -111638 -137344 60953 94386 -175294 -104843
12655a04843P8145K31907J86148N2641k31170k37984p6215j0516J50492M5363
$$ -104843 -26698 205209 391357 443998 212828 -25156 -101371 -111887 38605 83968
12645H3968l3320j34343p9127j6899Q8907R8636j46728J89723K97056K26271l53206
$$ 83968 50648 -83695 -162822 -179721 -90814 7822 -138906 50817 347873 574144 220938
12634B20938k16584j46431J45323Q8555j84715q9490J17144L5802N2728R772j83337
$$ 220938 4354 -142077 3246 91801 -92914 -182404 -65260 -29458 23270 33042 -150295
12623a50295j70026o5922J1722L27999j25325k46877J74953L20222M9149p9255
$$ -150295 -320321 -386243 -374521 -46522 -171847 -418724 -243771 76451 125600 46345
12613D6345k31911l0409L34983n3777j63867o7379J11161N8060j3188J9980M9531
$$ 46345 -185566 -215975 119008 65231 -98636 -166015 -54854 3206 -9982 9998 59529
12602E9529P7645j63630N4377N7018q2256m3072j15927o6434J12783R1652Q633
$$ 59529 137174 -26456 27921 84939 2683 -40389 -156316 -222750 -109967 -18315 -9682
12591i682r9796l7781o430L80118J05841j77524k15210p3296j10288J0866J00091
$$ -9682 -109478 -147259 -153689 226429 332270 154746 -60464 -133760 -244048 -233182 -133091
12580a33091K7658k012J0806J51870O881m5523k2723j78410l1106P3801K74274
$$ -133091 -105433 -107445 -96639 55231 62112 16589 -6134 -184544 -215650 -141849 132425
12569A32425J83381m66573l00942J44799K98838J72728m1934Q4930J0516k23430
$$ 132425 315806 -150767 -451709 -306910 -8072 164656 122722 207652 218168 -5262
12559e262l27797L352M5071J46785J37083J91586K5055k623j05250p0541Q5354
$$ -5262 -333059 -329707 -284636 -137851 -768 190818 215873 213250 108000 37459 122813
12548A22813O6132j59404j54015n5551K688L1926J1684n9595J161J80074r825
$$ 122813 188945 29541 -124474 -180025 -177337 -145411 -133727 -193322 -192161 -12087 -21912
12537b1912j0998j3682J6959j19124j7057O4596j41558k31595n8747n6226M4796
$$ -21912 -32910 -46592 -29633 -148757 -165814 -101218 -242776 -474371 -533118 -589344 -544548
12526e44548K23643R5676k5598J98304N7667j03516j3665j41687l2483j09608
$$ -544548 -320905 -225229 -250827 -52523 5144 -98372 -112037 -253724 -286207 -395815
12516c95815J1742j59604R0839M15541N1504r6662J25183j09563k23315j3249
$$ -395815 -384073 -543677 -452838 -37297 14207 -82455 42728 -66835 -290150 -303399
12506c03399m7509J23306J81395P7977q5687j16877q0515k38426j19041K27093
$$ -303399 -350908 -227602 -46207 31770 -53917 -170794 -251309 -489735 -608776 -381683
12496c81683K85667J56387k02559j02951J04468r4979j23918J18528L01344M3711
$$ -381683 -96016 60371 -142188 -245139 -140671 -235650 -359568 -241040 60304 104015
12486A04015J4885j30018J4747m2244j70598j60947l6849K9275K11311j23041
$$ 104015 118900 -11118 3629 -38615 -209213 -370160 -407009 -377734 -166423 -289464
12476b89464m836K67113k9674l03758J5981J47096k57941J2168J94293M4068J26891
$$ -289464 -294300 -27187 -56861 -360619 -344638 -197542 -455483 -443315 -249022 -204954 -78063
12465g8063L1110k6075P8502q6484p0468J66011K76511k07592j26031q8701J7823
$$ -78063 -46953 -73028 5474 -81010 -151478 14533 291044 83452 -42579 -131280 -113457
12454a13457q9456J14843K79762J21562o8055m37687j84639p1844J44709j6228
$$ -113457 -202913 -88070 191692 313254 245199 -192488 -377127 -448971 -304262 -320490
12444c20490J74832M7872J82733J98840j42033o5435j27121m4898N7040j37706
$$ -320490 -145658 -97786 84947 283787 141754 76319 -50802 -95700 -38660 -176366
12434a76366K787o177j92027M3975l2636Q5109j50097p2779K71542K30727K66679
$$ -176366 -173579 -179756 -371783 -327808 -360444 -275335 -425432 -498211 -226669 4058 270737
12423B70737j15558k01099o1742N0487Q5911J27518J2194m1918J19534Q4540l1264
$$ 270737 155179 -45920 -107662 -57175 28736 156254 168448 126530 246064 330604 299340
12412B99340j2458k79986k23048O8275p0614j27655m1525M4576j6301R7630K23734
$$ 299340 286882 6896 -216152 -147877 -218491 -346146 -387671 -343095 -359396 -261766 -38032
12401c8032J31779J72551p8197n05593l59810J13626J07443L37983O2864k680
$$ -38032 93747 266298 188101 -317492 -677302 -563676 -456233 -118250 -55386 -58066
12391e8066J85404j70046q0692j01574j05369L34700L50610j56255j17510l6529
$$ -58066 127338 -42708 -123400 -224974 -330343 4357 354967 198712 81202 44673
12381D4673j03847O6479R0642k23518j00242p2934J46149J0639K49963J55155
$$ 44673 -59174 7305 97947 -125571 -225813 -298747 -152598 -141959 108004 263159
12371B63159L8559j20710j97199N4113J60273J9180k38290p9397R7411J88128
$$ 263159 301718 181008 -16191 37922 198195 217375 -20915 -100312 -2901 185227
12361A85227q8110k46133J20433N7524q0184J2389J6658K56769J53045k15674
$$ 185227 97117 -149016 -28583 28941 -51243 -38854 -22196 234573 387618 171944
12351A71944n06484j93185Q8321l4529R3839N8713j81038J36232p8884K2637J06119
$$ 171944 -334540 -527725 -439404 -473933 -380094 -321381 -502419 -366187 -445071 -422434 -316315
12340c16315K70394l0537K02387j15038l1912J27134J13369q8757j11316Q5473
$$ -316315 -45921 -76458 125929 10891 -21021 106113 219482 130725 19409 104882
12330A04882q2157l9936N7256N8842J8585O6459q0497j30780K02648L9546j69019
$$ 104882 22725 -17211 40045 98887 117472 183931 103434 -27346 175302 214848 45829
12319D5829O647R2230k04906j08135j37052m2399J25465n1171k1353l8905j15232
$$ 45829 52476 144706 -60200 -168335 -305387 -347786 -222321 -273492 -294845 -333750 -448982
12308d48982M1120P7441J75188R1717k16193M2832K84022j12237J09671K49209
$$ -448982 -407862 -330421 -155233 -63516 -279709 -236877 47145 -65092 44579 293788
12298B93788p454j34755j58544J2758J93031k8831j44940l6935p0368j89030o7911
$$ 293788 286334 151579 -6965 5793 198824 169993 25053 -11882 -82250 -271280 -339191
12287c39191m246o3120l5710N6385M3888L3074J08553m5660P3228L028j25941
$$ -339191 -343437 -406557 -442267 -385882 -341994 -308920 -200367 -246027 -172799 -169771 -295712
12276b95712j39404J6753K97703R2776m1901j09904m2673j04440O9672K5153k8335
$$ -295712 -435116 -418363 -120660 -27884 -69785 -179689 -222362 -326802 -257130 -231977 -260312
12265b60312J61906K42180O1593l2849m4629p6042l22417q6143J18944N1406m602
$$ -260312 -98406 143774 205367 172518 127889 51847 -270570 -356713 -237769 -186363 -190965
12254a90965M9150J69184L34707Q7472j78583q2638Q7462j02565l88771m6303
$$ -190965 -141815 27369 362076 449548 270965 188327 275789 173224 -215547 -261850
12244b61850J32480K8359r2091j75133j12157j96K7337K16459L5100j86605l24361
$$ -261850 -129370 -101011 -193102 -368235 -480392 -480588 -453251 -236792 -201692 -388297 -712658
12233g12658l2526K43856K00585L0507j08297p9755O9290j9172J95650K69444
$$ -712658 -745184 -501328 -300743 -270236 -378533 -458288 -388998 -408170 -212520 56924
12223E6924m0179j77881j21419p306l9126J74332J81270K1167m9098k6445K6297
$$ 56924 16745 -161136 -282555 -289861 -328987 -154655 26615 47782 -1316 -27761 -1464
12212a464j06204k37530O2986J96985J60189j30370R0646J18854m2537l87061
$$ -1464 -107668 -345198 -282212 -85227 74962 -55408 35238 154092 111555 -275506
12202b75506o7714R8040J48464J66207N0931j96928n4177N74J45145J36091j54435
$$ -275506 -343220 -245180 -96716 69491 120422 -76506 -130683 -130109 15036 151127 -3308
12191c308p9382j18502O1293J04480k6852p4245J48051k56357J63102K86415N2072
$$ -3308 -82690 -201192 -139899 -35419 -62271 -136516 11535 -244822 -81720 204695 256767
12180B56767j0119R5312j09400j71768l04676M1482K6223j12216J93813j68309
$$ 256767 246648 341960 232560 60792 -243884 -202402 -176179 -288395 -94582 -262891
12170b62891k07974J79219K45087M2769r3835J7064L10904q4785j34556n5949
$$ -262891 -470865 -291646 -46559 -3790 -97625 -80561 230343 145558 11002 -44947
12160d4947J00099J40153k2476k10030n8017n2413M6282P8790N0990J37456j36604
$$ -44947 55152 195305 172829 -37201 -95218 -147631 -101349 -22559 28431 165887 29283
12149B9283j32453k8167M1391J56624O7516j19384l6799K45856J36382j27298
$$ 29283 -103170 -131337 -89946 66678 134194 14810 -21989 223867 360249 232951
12139B32951k70292m1878J07452O7854l5746l7633q2672J14213k1749k8604j91385
$$ 232951 -37341 -79219 28233 96087 60341 22708 -59964 54249 32500 3896 -187489
12128a87489j03173N8707j34753M3913L926K17996J81284j03171O7232R6894Q3505
$$ -187489 -290662 -231955 -366708 -322795 -318869 -100873 80411 -22760 44472 141366 224871
12117B24871j97673k62965k02069J01391k9207J28366J82476J64073k2622o9127
$$ 224871 27198 -235767 -437836 -336445 -365652 -237286 -54810 109263 86641 17514
12107A7514j12633l5057k1708K9618Q5784q5714q7r7259j58611J06167J14846
$$ 17514 -95119 -130176 -151884 -122266 -36482 -122196 -122283 -219542 -378153 -271986 -157140
12096a57140j10775N436j03942N0749K55323P8773j73091N9354J35606j35529
$$ -157140 -267915 -262479 -366421 -315672 -60349 18424 -154667 -95313 40293 -95236
12086i5236j09658q4793N7562j0796L1046r8732j63769N5490J61894O3862J83828
$$ -95236 -204894 -289687 -232125 -242921 -211875 -310607 -474376 -418886 -256992 -193130 -9302
12075i302J41256J79425k4630k86039j50603J17908J36527n0129Q9647j7638l94695
$$ -9302 131954 311379 286749 710 -149893 -31985 104542 54413 144060 126422 -268273
12064b68273k21649L29353N7522M1904N7837J96121j14822j4988m8626k05907
$$ -268273 -489922 -160569 -103047 -61143 -3306 192815 77993 63005 14379 -191528
12054a91528j24840M2835j67618r1858J31296K98215J54265l1997j85936J13875
$$ -191528 -316368 -273533 -441151 -533009 -401713 -103498 50767 18770 -167166 -53291
12044e3291J18719K165q4423k01334J50921N0755N986q9650k7563r3111L4057
$$ -53291 65428 67593 -16830 -218164 -67243 -16488 -10502 -100152 -127715 -220826 -186769
12033a86769J1825n7614m1478o0973l4097j24937J12095l6735o6237J05211p0259
$$ -186769 -174944 -232558 -274036 -335009 -369106 -494043 -381948 -418683 -484920 -379709 -449968
12022d49968J21335l5333P2473j9758r6091m9207J44549r7796o063j57191K01550
$$ -449968 -328633 -363966 -291493 -311251 -407342 -456549 -312000 -409796 -415859 -573050 -371500
12011c71500K24247J1673L7986O9678K6483K23278J19758n6356k18054q3795p0756
$$ -371500 -147253 -135580 -97594 -27916 -1433 221845 341603 285247 67193 -16602 -87358
12000h7358k75198J3353P0151L3578R6885J16117K51763j58100k91357O5928J9617
$$ -87358 -362556 -349203 -279052 -245474 -148589 -32472 219291 61191 -230166 -164238 -144621
11989a44621j55496P0437J18793j8898j41681k05725O3749K45235K15624n2050
$$ -144621 -300117 -229680 -110887 -129785 -271466 -477191 -413442 -168207 47417 -4633
11979d633j68630M2331O6401j82753K6447j46856j04429K66521J94066p1760l9686
$$ -4633 -173263 -130932 -64531 -247284 -220837 -367693 -472122 -205601 -11535 -83295 -122981
11968a22981J54797j09210j33972J7070K40618J54083j58758n8537k0382J19611
$$ -122981 31816 -77394 -211366 -194296 46322 200405 41647 -16890 -37272 82339
11958H2339K0957k74858r6268N4547o4168J14941Q2611o8805J62620J14621M7358
$$ 82339 103296 -171562 -267830 -213283 -277451 -162510 -79899 -148704 13916 128537 175895
11947A75895q3961K9159k28255l02027J9678l0644J46999K66177J20128j54561
$$ 175895 91934 121093 -107162 -409189 -389511 -420155 -273156 -6979 113149 -41412
11937d1412J3549K8260l9687L0901Q105j23105J28259N2997j40932k1942O6928
$$ -41412 -27863 397 -39290 -8389 -284 -123389 4870 57867 -83065 -105007 -38079
11926c8079m2225j10186m4017j27529P0800J82523k37336j40987k35K67905J08695
$$ -38079 -80304 -190490 -234507 -362036 -291236 -108713 -346049 -487036 -487271 -219366 -110671
11915a10671N937R6950J40840O1695r8568M331k01515j07679J45563K00075q7266
$$ -110671 -104734 -7784 133056 194751 96183 100514 -101001 -208680 -63117 136958 49692
11904D9692j0272N0650k9191j3248J63703l4436r3323j21278k21316L0707J7942
$$ 49692 39420 90070 60879 47631 211334 176898 83575 -37703 -259019 -228312 -210370
11893b10370n0424j2523j20269J21433J50217j8911k38331j99198M4001K68993
$$ -210370 -260794 -273317 -393586 -272153 -121936 -140847 -379178 -578376 -534375 -265382
11883b65382k676k1120j02919J45113K4448j350J31698m687j12372N411o0517
$$ -265382 -268058 -289178 -392097 -246984 -222536 -223886 -92188 -96875 -209247 -203836 -264353
11872b64353r2379k18009K70157J96403K32470j45554k01621n1578q2863Q4525
$$ -264353 -356732 -574741 -304584 -108181 124289 -21265 -222886 -274464 -357327 -272802
11862b72802M7005R9712R7179O0905L9878j09812j26832k8291J2561M4308j22517
$$ -272802 -225797 -126085 -28906 31999 71877 -37935 -164767 -193058 -180497 -136189 -258706
11851b58706J06731K34309N1028j52420k53487L8140j03001k02438K00806L82478
$$ -258706 -151975 82334 133362 -19058 -272545 -234405 -337406 -539844 -339038 43440
11841D3440K60514l2925k86067k0365J99397k34379n1695Q1685K32054M2219k05918
$$ 43440 303954 271029 -15038 -35403 163994 -70385 -122080 -40395 191659 233878 27960
11830B7960n6535P3146j50769l499j93383r7941j85375J38058L0221j7306K54255
$$ 27960 -28575 44571 -106198 -109697 -303080 -401021 -586396 -448338 -418117 -435423 -181168
11819a81168n4952n9735l7693N0374M9397J4846J41073j22225k10434N7983J68049
$$ -181168 -236120 -295855 -333548 -283174 -233777 -218931 -77858 -200083 -410517 -352534 -184485
11808a84485p174o563O0855L23441k8658k26817j80722k76928K650j8060o2159
$$ -184485 -191659 -198222 -137367 186074 157416 -69401 -250123 -527051 -524401 -542461 -604620
11797f04620K09574P6013J68624M7447q8854M402L8130Q8183J81440J20497j68096
$$ -604620 -395046 -319033 -150409 -102962 -191816 -187414 -149284 -61101 120339 240836 72740
11786G2740k64648r6750K12316M3415o713j7580O3055j73792k63769R4050K4464
$$ 72740 -191908 -288658 -76342 -32927 -39640 -57220 5835 -167957 -431726 -337676 -313212
11775c13212R0805K61376Q9295l29783j28689J63419O9653m3385j46627J75786
$$ -313212 -222407 38969 128264 -201519 -330208 -166789 -97136 -140521 -287148 -111362
11765a11362J17851L3824L274q5174r6699j19270j09532M0730P8588K26186l9841
$$ -111362 6489 40313 43587 -41587 -138286 -257556 -367088 -326358 -247770 -21584 -61425
11754f1425o4709k8478J21069O8470j59008p6132j77725J25547k77329n5913K30691
$$ -61425 -126134 -154612 -33543 34927 -124081 -200213 -377938 -252391 -529720 -585633 -354942
11743c54942L19646J57864m8017n011Q7792o041n2084k25577j26437N5196j7756
$$ -354942 -35296 122568 74551 69540 157332 151291 99207 -126370 -252807 -197611 -215367
11732b15367n3136L3081r9315k15747K37397K46299O7534J15941k49874m01853
$$ -215367 -268503 -235422 -334737 -550484 -313087 -66788 746 116687 -133187 -535040
11722e35040k9609K51521J72828K05260J79273Q2437j59569j47822j18077L734
$$ -535040 -564649 -313128 -140300 64960 244233 326670 167101 19279 -98798 -95064
11712i5064k2077J68678J13072j73734K2674J8745J6262M2224r3552j86539o4685
$$ -95064 -117141 51537 164609 -9125 13549 32294 48556 90780 -2772 -189311 -253996
11701b53996q7537J60142K96476K6460k2022j93232k31630K9279P6814J72611
$$ -253996 -341533 -181391 115085 141545 119523 -73709 -305339 -276060 -199246 -26635
11691b6635M3445K0363r9786j94299q2812K12745N455l59424q6139L38484J69644
$$ -26635 16810 37173 -62613 -256912 -339724 -126979 -121524 -480948 -567087 -228603 -58959
11680e8959N3225p5745J31721R1804l8253j14199l0694P4705J26423n414j69478
$$ -58959 -5734 -81479 50242 142046 103793 -10406 -41100 33605 160028 154614 -14864
11669a4864j21866J8168K42490J60660J53795k7354J1133j37233j58889j42785
$$ -14864 -136730 -118562 123928 284588 438383 411029 422162 284929 126040 -16745
11659a6745M5711j22781j58783J4813J82050k19736q6299j52530j20269L9102
$$ -16745 28966 -93815 -252598 -237785 -55735 -275471 -361770 -514300 -634569 -595467
11649e95467J52485J64669l2494j22424R2089K1207j06115J26768L03303P337
$$ -595467 -442982 -278313 -310807 -433231 -341142 -319935 -426050 -299282 4021 11358
11639A1358p7916k2080j04238j78905j02934r568K62841J92650K33007j98262
$$ 11358 -66558 -88638 -192876 -371781 -474715 -484283 -221442 -28792 204215 5953
11629E953j37852m7143p2103Q6916P859J26303p6383J32361j73744j01087N7869
$$ 5953 -131899 -179042 -251145 -164229 -156370 -30067 -106450 25911 -147833 -248920 -191051
11618a91051L5319o175q510m4892P3238k16170j07961J22147l4930j3787J51373
$$ -191051 -155732 -161907 -170417 -215309 -142071 -358241 -466202 -344055 -378985 -392772 -241399
11607b41399J12145J05493K6285k1749o8202j05894j84240o7826J42683R2963
$$ -241399 -129254 -23761 2524 -19225 -87427 -193321 -377561 -445387 -302704 -209741
11597b09741J88722Q6285o7099k16919j6927O7896k0144Q2635M66412l1452n39476
$$ -209741 -21019 65266 -1833 -218752 -235679 -167783 -187927 -105292 361120 329668 -209808
11586b09808j80922K12876J98754j9022K153Q8291j91545l59147j19096M1545
$$ -209808 -390730 -177854 20900 1878 4031 92322 -99223 -458370 -577466 -535921
11576e35921J73965j3597m7598J2420k1073p7135k95J36086K39781l1357j73881
$$ -535921 -361956 -375553 -423151 -410731 -431804 -508939 -509234 -373148 -133367 -164724 -338605
11565c38605j33865l968m0575K9658K64242J39824o9406k64101o1043m0514Q3028
$$ -338605 -472470 -476438 -517013 -487355 -223113 -83289 -152695 -416796 -477839 -518353 -435325
11554d35325l265r4831P62R4392J0149K50741l9988m8816J38650Q2878k9403J055
$$ -435325 -438590 -533421 -532659 -438267 -428118 -177377 -217365 -266181 -127531 -44653 -74056 -73001
11542g3001L47J93129L425J72308J15436k05302k94058q1969J4771N7979J23538
$$ -73001 -72654 120475 123900 296208 411644 206342 -87716 -169685 -154914 -96935 26603
11531B6603J69336j63664j79082J05236k2431j90061m3157j13899j062o5822R1915
$$ 26603 195939 32275 -146807 -41571 -64002 -254063 -297220 -411119 -412181 -478003 -386088
11520c86088r755J28754J96122P0173L6406l25262k68095J60332J03890J32607
$$ -386088 -395843 -267089 -70967 -794 35612 -289650 -557745 -397413 -293523 -160916
11510a60916K20399J17983l5494n0006j11004j03090o5037m521j63285J6264Q1777
$$ -160916 59483 177466 141972 91966 -19038 -122128 -187165 -191686 -354971 -338707 -256930
11499b56930j06864j19551R9315K26270n4869k42574Q2349o2651j52025J58046
$$ -256930 -363794 -483345 -384030 -157760 -212629 -455203 -372854 -435505 -587530 -429484
11489d29484K11766J5166K1846J88683k9335r0769l1079m6697K7048K29958P7704
$$ -429484 -217718 -202552 -180706 7977 -21358 -112127 -143206 -189903 -162855 67103 144807
11478A44807r7450j42999o7013m576m976K46621K36361l3668j93129M5507M3021
$$ 144807 47357 -95642 -162655 -167231 -172207 74414 310775 277107 83978 129485 172506
11467A72506k14445J0871K1827j82254j4366p3292j23101K96045K35796r1901
$$ 172506 -41939 -31068 -9241 -191495 -205861 -279153 -402254 -106209 129587 37686
11457C7686m2260j57517l9395p5223n8365J62205R0888j08962Q7704p3844J4618
$$ 37686 -4574 -162091 -201486 -276709 -335074 -172869 -81981 -190943 -103239 -177083 -162465
11446a62465j8937K0613J46304k13999n5569P8086J77340R5828k22350r7602L4086
$$ -162465 -181402 -160789 -14485 -228484 -284053 -205967 -28627 67201 -155149 -252751 -218665
11435b18665M9306J57609J7361l4711m384J49249j7614r0236J53793J5731q7507
$$ -218665 -169359 -11750 5611 -29100 -33484 115765 98151 7915 161708 177439 89932
11424H9932q2407l15577q3665J21309R411r9614J99743j24801j27993K46332K11547
$$ 89932 7525 -308052 -391717 -270408 -260997 -360611 -160868 -285669 -413662 -167330 44217
11413D4217o2630k5151J49241r726j09442p5526N6318J06852r4145j48219M4798
$$ 44217 -18413 -43564 105677 95951 -13491 -89017 -32699 74153 -19992 -168211 -123413
11402a23413K7633j46968o4625K45509J23640P256j69434k46563K35536J36424
$$ -123413 -95780 -242748 -307373 -61864 61776 69032 -100402 -346965 -111429 24995
11392B4995J19701j09966K4850j03182j84778J95046N5108o1791J74428p8870
$$ 24995 144696 34730 59580 -43602 -228380 -33334 21774 -40017 134411 55541
11382E5541j79530J50605L5134J49657l0650r1000k17722Q4373K85818j85071
$$ 55541 -123989 26616 61750 211407 180757 89757 -127965 -43592 242226 57155
11372E7155k07313M2338m3107k82812j83170J450N0749J27282M1404J94078J38632
$$ 57155 -150158 -107820 -150927 -433739 -616909 -615459 -564710 -437428 -396024 -201946 -63314
11361f3314j3124j14344M1100Q634m0524J0078J62080R5762J214j72058k37462
$$ -63314 -76438 -190782 -149682 -141048 -181572 -171494 -9414 86348 87562 -84496 -321958
11350c21958Q5004j5171j68151l13853J08900r1016N2438J06340J46369Q8305
$$ -321958 -236954 -252125 -420276 -734129 -625229 -716245 -663807 -557467 -411098 -322793
11340c22793J58265P2919P3214M6589K7947L0053k06013n364K18063M5568j17218
$$ -322793 -164528 -91609 -18395 28194 56141 86194 -119819 -125183 92880 138448 21230
11329B1230l16467l00270J61069K32321J08772O2290O071r9282q9756k2489Q4323
$$ 21230 -295237 -595507 -434438 -202117 -93345 -31055 -24984 -124266 -214022 -236511 -152188
11318a52188j56286l7017j1411l8644j31489j0455n9146K9250J79551P7275J98134
$$ -152188 -308474 -345491 -356902 -395546 -527035 -537490 -596636 -567386 -387835 -310560 -112426
11307a12426J10221j48329j13323j08384K6318n2807j29178j94976P7309M10970
$$ -112426 -2205 -150534 -263857 -372241 -345923 -398730 -527908 -722884 -645575 -234605
11297b34605O6553n2060j23024K31986L2817Q1995p7158p1229m1046j04535K3734
$$ -234605 -168052 -220112 -343136 -111150 -78333 3662 -73496 -144725 -185771 -290306 -266572
11286b66572o3516q6857o7769J04089M0860K4946o1951R8605K16664J43629k60716
$$ -266572 -330088 -416945 -484714 -380625 -339765 -314819 -376770 -278165 -61501 82128 -178588
11275a78588j34081o3493O5522O8847P8535N4277L4884K05830k52038j41079J11113
$$ -178588 -312669 -376162 -310640 -241793 -163258 -108981 -74097 131733 -120305 -261384 -150271
11264a50271K0498r007J2582n2087J78442p2270l04364O4542K25801J48026r8938
$$ -150271 -129773 -138780 -126198 -178285 157 -72113 -376477 -311935 -86134 61892 -37046
11253c7046o6416J41472J83315N6105j24517k89396r686P8304R1951p4888J97181
$$ -37046 -103462 38010 221325 277430 152913 -136483 -146169 -67865 24086 -50802 146379
11242A46379L1825j12613k744k57666N6547J55188J37923j9997N3162L5052l02942
$$ 146379 178204 65591 62847 -194819 -138272 16916 154839 134842 188004 223056 -79886
11231g9886k89509p1739K44654J73555j17187j23699N9294p8949q1893Q8028J85541
$$ -79886 -369395 -441134 -196480 -22925 -140112 -263811 -204517 -283466 -365359 -277331 -91790
11220i1790M489L956O1662K92870J00881p6837o9301l57941j40996J47708N6497
$$ -91790 -87301 -83345 -21683 271187 372068 295231 225930 -132011 -273007 -125299 -68802
11209f8802n188j00846q6326M3852N961m4845m2922J16359O0806J1456o253O0273
$$ -68802 -73990 -174836 -261162 -217310 -211349 -256194 -299116 -182757 -121951 -110495 -116748 -56475
11197e6475j34917k12221L2256K43515J91757J00318r0764j52702j2838J39508
$$ -56475 -191392 -403613 -371357 -127842 63915 164233 73469 -79233 -92071 47437
11187D7437j54243n8882K54329L25151j96929j65979p1589k12561P1511J34030
$$ 47437 -106806 -165688 88641 413792 216863 50884 -20705 -233266 -161755 -27725
11177b7725k06446J48635K36010k00614j38721n2286J05129J67611j23124k16781
$$ -27725 -234171 -85536 150474 -50140 -188861 -241147 -136018 31593 -91531 -308312
11167c08312m595J20611J8611j6193o896j68569j4069j58393K19356L13903K15073
$$ -308312 -312907 -192296 -173685 -189878 -196774 -365343 -379412 -537805 -318449 -4546 210527
11156B10527j64588j15850m1855q512l6517M4568j23713N9280J56815r2836K28614
$$ 210527 45939 -69911 -111766 -120278 -156795 -112227 -235940 -176660 -19845 -112681 115933
11145A15933J7220K27068J31814j02781j88066m7301N146j15972j04882J14005
$$ 115933 133153 360221 492035 389254 201188 153887 159033 43061 -61821 52184
11135E2184J2623k14426N5126K66997P9420q5647j58211j85249j60537j82366
$$ 52184 64807 -149619 -94493 172504 251924 166277 8066 -177183 -337720 -520086
11125e20086O1332K30005K7373R6673Q6796q5595l3104O2203J1079M7690J80156
$$ -520086 -458754 -228749 -201376 -104703 -17907 -103502 -136606 -74403 -63324 -15634 164522
11114A64522r9168j97262q6466M3442M8175K29534M4301O2618J503j96581m4138
$$ 164522 65354 -131908 -218374 -174932 -126757 102777 147078 209696 211199 14618 -29520
11103b9520J49859J21826M8603j38023m02112j56995J21425J22307K37149r916
$$ -29520 120339 242165 290768 152745 -249367 -406362 -284937 -162630 74519 64603
11093F4603j16634J39703o6465J34899j03116j45386J07291Q1846J56432p5707
$$ 64603 -52031 87672 21207 156106 52990 -92396 14895 96741 253173 177466
11083A77466j04720J80062K19616m5846l18420k23095k63991j23591J08188N7504
$$ 177466 72746 252808 472424 426578 108158 -114937 -378928 -502519 -394331 -336827
11073c36827j4295P1186J55382q7723N5136L25645J31746j02155k3982J2071j86329
$$ -336827 -351122 -279936 -124554 -212277 -157141 168504 300250 198095 174113 186184 -145
11062a45m895j68405k21985J65167J96277m2279r6591k6148j15288k8126m508
$$ -145 -5040 -173445 -395430 -230263 -33986 -76265 -172856 -199004 -314292 -342418 -346926
11051c46926J79111R3868O3706J75139L1673J15453K46483J73616m20604k88678
$$ -346926 -167815 -73947 -10241 164898 196571 312024 558507 732123 311519 22841
11041B2841r7013J40069K0457O2128k2905J12627K50421k7252J51268L05575m4382
$$ 22841 -74172 65897 86354 148482 125577 238204 488625 461373 612641 918216 873834
11030H73834N6822J55941m1342q2189J52634O1390j78789P8389K72697K37406
$$ 873834 930656 1086597 1045255 963066 1115700 1177090 998301 1076690 1349387 1586793
11020A586793L13686K3690n2908l27271k23770k68363j73003L1836q8400K0935
$$ 1586793 1900479 1924169 1871261 1543990 1320220 1051857 878854 910690 822290 843225
11010H43225K11555j29026K3819L02425r0845k43245J22963j59697k73782j20470
$$ 843225 1054780 925754 949573 1251998 1161153 917908 1040871 881174 607392 486922
11000D86922N1593q9871k32656K8900K07496j6458k93805j3023R674M5611p8691
$$ 486922 538515 448644 215988 244888 452384 435926 142121 129098 138772 184383 105692
10989A05692j98739r2810M4715O6649l998q6376r5669O6660K30392Q412k03603
$$ 105692 -93047 -185857 -141142 -74493 -78491 -164867 -260536 -193876 36516 44928 -158675
10978a58675j9642J58756m6654j14427j7905l9733J16680L30582P6003l93137
$$ -158675 -178317 -19561 -66215 -180642 -198547 -238280 -121600 208982 284985 -108152
10968a08152k88118J07186K36207N1231p7247l64084K5794K37372K47384k73432
$$ -108152 -396270 -289084 -52877 -1646 -78893 -442977 -417183 -179811 67573 -205859
10958b05859J21549K4383k52719J50529K27146R736Q1164j907j20073J6866J5156
$$ -205859 -84310 -59927 -312646 -162117 65029 74765 155929 154022 33949 50815 65971
10947F5971q2979k08308k98999O2412R7943N7833o5886K0612N7288j72813o3719
$$ 65971 -17008 -225316 -524315 -461903 -363960 -306127 -372013 -351401 -294113 -466926 -530645
10936e30645o5106J94783K88344L08770o9819j93976k46166J78008J61148N7917
$$ -530645 -595751 -400968 -112624 196146 126327 -67649 -313815 -135807 25341 83258
10926H3258j28150j23563K6867r3133k47142j07639J34294l9207P9998K64719
$$ 83258 -44892 -168455 -141588 -234721 -481863 -589502 -455208 -494415 -414417 -149698
10916a49698J47020m6465O2649M8527j5818j07341m1691J06891M5132m4494N602
$$ -149698 -2678 -49143 13506 62033 46215 -61126 -102817 4074 49206 4712 10314
10905A0314p777J0133Q9410j48249k47372q340o5756l8018M2274Q0794q9261r8089
$$ 10314 2537 12670 102080 -46169 -293541 -301881 -367637 -405655 -363381 -282587 -371848 -469937
10893d69937j4124J51928P8551J1428N7889R547J9617j36494J1133J88071L6801
$$ -469937 -484061 -332133 -253582 -242154 -184265 -174718 -155101 -291595 -280462 -92391 -55590
10882e5590M3282K02966K20116j571n5908m1934K8996j40651j22867o4875q0907
$$ -55590 -12308 190658 410774 409203 353295 311361 340357 199706 76839 11964 -68943
10871f8943m7552q0419j02104Q7275J1958P4169J13980J06143O2960j23261k1231
$$ -68943 -116495 -196914 -299018 -211743 -199785 -125616 -11636 94507 157467 34206 12975
10860A2975L3286N9568r2740k4493P4692M7716m0757K0622J07938j9808j34771
$$ 12975 46261 105829 13089 -11404 63288 111004 70247 90869 198807 178999 44228
10849D4228o0443J89152n7780o9763o010j63316j74785L14212K18217j51066J00118
$$ 44228 -16215 172937 115157 45394 39384 -123932 -298717 15495 233712 82646 182764
10838A82764J09187k19680j18129j2609n8043J48324L7008J01693N5146j52410
$$ 182764 291951 72271 -45858 -58467 -116510 31814 68822 170515 225661 73251
10828G3251R2686o0559l7579Q8065J21298l60830r2046K42002j06884m8019j89095
$$ 73251 165937 105378 67799 155864 277162 -83668 -175714 66288 -40596 -88615 -277710
10817b77710J7988n7720J50582j80687k93335K43709K32950L45472J61220k56197
$$ -277710 -259722 -317442 -166860 -347547 -640882 -397173 -164223 181249 342469 86272
10807H6272k47206J80547N9609k4679j23815L4234Q148k5315J34801K2918m2536
$$ 86272 -160934 19613 79222 54543 -69272 -35038 -26890 -52205 82596 105514 62978
10796F2978R0424R1069j66955o9797J80206j3266P9472q4061J61162J27053O5969
$$ 62978 153402 244471 77516 7719 187925 174659 254131 170070 331232 458285 524254
10785E24254o7268j05027n2242K7168Q5567p361K3680j20839Q5863j16247k34439
$$ 524254 456986 351959 299717 326885 412452 405091 428771 307932 393795 277548 43109
10774D3109j46725k004K58433K24415r6958O5586J09719o7548J52792j51148j26998
$$ 43109 -103616 -105620 152813 377228 280270 345856 455575 388027 540819 389671 262673
10763B62673N6414j2582J29948Q9235j95758j60242J34302N4686j7747N0482j66885
$$ 262673 319087 306505 436453 525688 329930 169688 303990 358676 340929 391411 224526
10752B24526j66654J01529k05661K79772L47912L5209k87926l00034k28481k9966
$$ 224526 57872 159401 -46260 233512 581424 616633 328707 28673 -199808 -229774
10742b29774K26266K23502j07229J35735O20l8600K5851j81582j30811J9147m2627
$$ -229774 -3508 219994 112765 248500 249120 210520 236371 54789 -76022 -56875 -99502
10731i9502L61L11204J20739j20987p5807j33915j4563K45479M3634O2288q3130
$$ -99502 -99141 212063 332802 211815 136008 2093 -12470 233009 276643 338931 255801
10720B55801l00090l0138K74773R6932J16791J38742J15913k16386l11709j6033
$$ 255801 -44289 -74427 200346 297278 414069 552811 668724 452338 140629 124596
10710A24596Q9305J13811p4107m9091R1194J69869L20362J7024q6467m6377P9984
$$ 124596 213901 327712 253605 204514 295708 465577 785939 802963 716496 670119 750103
10699G50103n1191l5347m3800K5570J56763j87067k72742m4068L1890K24639N1319
$$ 750103 698912 663565 619765 645335 802098 615031 342289 298221 330111 554750 606069
10688F06069j66961K520R6891j60800k0422j22379J4432L2659m7854J06012j079
$$ 606069 439108 441628 538519 377719 357297 234918 249350 282009 234155 340167 339088
10677C39088J74176M6183j27500K36843K8300Q010M1979L258J00547k36788K5386
$$ 339088 513264 559447 431947 668790 697090 705100 747079 750337 850884 614096 639482
10666F39482J27926J50509k27618k15308J4113L66222K07294K0106L4036L22904
$$ 639482 767408 917917 690299 474991 489104 855326 1062620 1082726 1116762 1439666
10656A439666j83998J0149J49839m6615L9651K35063L01931L03607L12496L5203
$$ 1439666 1255668 1265817 1415656 1369041 1408692 1643755 1945686 2249293 2561789 2596992
10646B596992k90430q7069M38220M4083K25309J82236J74682K19029J52039J85693
$$ 2596992 2306562 2219493 2657713 2701796 2927105 3109341 3284023 3503052 3655091 3840784
10636C840784R9883J86532N31625J87586M21973R34982P73613J097288J000504
$$ 3840784 3940667 4127199 4658824 4846410 5268383 6203365 6976978 8074266 9074770
10627I074770Q71441P85874J240961J534600J614429K097554L323434M201136
$$ 9074770 9946211 10732085 11973046 13507646 15122075 17219629 20543063 24744199
10619B4744199N269240O877290Q800668J1192876J2727865J2990218J0812574
$$ 24744199 30013439 36890729 45691397 56884273 69612138 82602356 93414930
10612I3414930O615266J890735j244599j723216J89559L747555Q251098J3415131
$$ 93414930 100030196 101920931 100676332 98953116 99142675 102890230 111141328 124556459
10604A24556459J9317992K3790019K4484681J8215797O438916n614771j2381595
$$ 124556459 143874451 167664470 192149151 210364948 216803864 211189093 198807498
10597A98807498j2784898q092829j023455P154762J5311882K3545335K9084258
$$ 198807498 186022600 177929771 176906316 184061078 199372960 222918295 252002553
10590B52002553K7614971J6224844k004890j8932135k7681434k7673962k1695109
$$ 252002553 279617524 295842368 293837478 274905343 247223909 219549947 197854838
10583A97854838j3677223n439824K381120R228462J3058919J1449987L171394
$$ 197854838 184177615 178737791 181118911 190347373 203406292 214856279 218027673
10576B18027673q833343j9306952k4215784k2688932j8159631j2647794p446250
$$ 218027673 209194330 189887378 165671594 142982662 124823031 112175237 104728987
10569A04728987k970290L65386J547501M89087k885313p393565j1327300j2977999
$$ 104728987 101758697 102124083 103671584 104160671 101275358 93881793 82554493 69576494
10561F9576494j2255133j0311952q299550o736967n254851m081370l107906k416082
$$ 69576494 57321361 47009409 38709859 31972892 26718041 22636671 19528765 17112683
10553A7112683k047171j608362j345720j075795r76485r60623r23570q44268n40708
$$ 17112683 15065512 13457150 12111430 11035635 10059150 9098527 8174957 7330689 6789981
10544F789981l76679l97829l54273l72626k24470k68073K03234p5211j36105k12120
$$ 6789981 6413302 6015473 5661200 5288574 5064104 4796031 4999265 4924054 4787949 4575829
10534D575829o5694k45299n65534j87873o4441k20275j45115j18679q3553p5606
$$ 4575829 4510135 4264836 3699302 3511429 3446988 3226713 3081598 2962919 2879366 2803760
10524B803760j16846j11539j57217J29912n6738k9949j43003k23796j57989O8314
$$ 2803760 2686914 2575375 2418158 2548070 2491332 2461383 2318380 2094584 1936595 2004909
10514B004909O8667J17996N8906M3520k25232j46748j75661k27707l4997o2522
$$ 2004909 2073576 2191572 2250478 2293998 2068766 1922018 1746357 1518650 1483653 1421131
10504A421131l6985k12693N8323P5177J05104J84855j35367j40332n0771j8915
$$ 1421131 1384146 1171453 1229776 1304953 1410057 1594912 1459545 1319213 1268442 1249527
10494A249527Q5538J08898J54009l43442k80318N2374J64266N0720J37187j42716
$$ 1249527 1335065 1443963 1597972 1254530 974212 1026586 1190852 1241572 1378759 1236043
10484A236043j01861q4035N6472n3513K2430J75032M1215k2519k9161k7103J47394
$$ 1236043 1134182 1050147 1106619 1053106 1075536 1250568 1291783 1269264 1240103 1213000 1360394
10473A360394J5566j55085j55113j17399l4949j11870k6279J80388k8171k6243
$$ 1360394 1375960 1220875 1065762 948363 913414 801544 775265 955653 927482 901239
10463I01239K20689K0981j67935q2690O1264M8792j40308j4525p8405m0764N7678
$$ 901239 1121928 1142909 974974 892284 953548 1002340 862032 847507 769102 728338 786016
10452G86016n4985J19652P7480M1726N480k91331k3095m1965o2366M25J797r4916
$$ 786016 731031 850683 928163 969889 975369 684038 660943 618978 556612 557037 558834 463918
10440D63918L282J32441q490R2467J28466K8477j4787L1536o1926l3345R4747
$$ 463918 467200 599641 591151 683618 812084 840561 825774 857310 795384 762039 856786
10429H56786j8121k00142k04477n7350k08672q6227J21161J37319K00633J20476
$$ 856786 838665 638523 434046 376696 168024 81797 202958 340277 540910 661386
10419F61386m3593k87766j10248l8R8218N6844O1768j23000j48677J13393j50224
$$ 661386 617793 330027 219779 219741 317959 374803 436571 313571 164894 278287 128063
10408A28063j64941M9089K11468l8001o2689K33623l18309l45718N6735K1647
$$ 128063 -36878 12211 223679 185678 122989 356612 38303 -307415 -250680 -229033
10398b29033J77626J46272j95974R329l4648L142R0722K72859J96859j24446j70186
$$ -229033 -51407 94865 -101109 -91780 -126428 -123286 -32564 240295 437154 312708 142522
10387A42522j69593Q934J12485n8629k07519J72575P5014J03312Q7031R8658J86485
$$ 142522 -27071 -18137 94348 35719 -171800 775 75789 179101 266132 364790 551275
10376E51275k0343j47189j28170k17128k16933j44439R6969J00861J07460J88738
$$ 551275 530932 383743 255573 38445 -178488 -322927 -225958 -125097 -17637 171101
10366A71101n9327m7916J42918k25614o8469K64699K16664q808k48839j53392
$$ 171101 111774 63858 206776 -18838 -87307 177392 394056 385248 136409 -16983
10356a6983K63129N4665j10134k43394n8983L04255J40072J9636L7380n4868O398
$$ -16983 246146 300811 190677 -52717 -111700 192555 332627 352263 389643 334775 341173
10345C41173J05918k95406O6360L08078q0152m3735j5310p2815j9235l3280J4186
$$ 341173 447091 151685 218045 526123 445971 402236 386926 314111 294876 261596 275782
10334B75782J53177j1027k32277k85806l2278Q3531K27250J0086J36434r5856
$$ 275782 428959 417932 185655 -100151 -132429 -48898 178352 188438 324872 229016
10324B29016N8142k00011m067Q0378o502J60571J08169k0035J96890p2498j7915
$$ 229016 287158 87147 83080 163458 156956 317527 425696 405661 602551 530053 512138
10313E12138k2001m8958n7615R624Q4993j70151k96070M4723J3729n6974r4870
$$ 512138 490137 441179 383564 393188 478181 308030 11960 56683 70412 13438 -81432
10302h1432j32700R2593J52394K97865O0938O5783p1086j80586L0691m2674p5513
$$ -81432 -214132 -121539 30855 328720 389658 455441 384355 203769 234460 191786 116273
10291A16273j16395K4805P4813m6864l632q507K4058K30649R9561m2180j1518
$$ 116273 -122 24683 99496 52632 49000 40493 64551 295200 394761 352581 341063
10280C41063j24300k25826k4695J6907J8925r121O5296N2750k4245j59665J10069
$$ 341063 216763 -9063 -33758 -16851 2074 -7047 58249 110999 86754 -72911 37158
10269C7158P4124N0116K512j37480j18424o8777p4897K20447K33603R0221q478
$$ 37158 111282 161398 163910 26430 -91994 -160771 -235668 -15221 218382 308603 300125
10258C00125m2538l3793m5182n3514r2204j00014K65843K33788J2478k25268J01024
$$ 300125 257587 223794 178612 125098 32894 -67120 198723 432511 444989 219721 320745
10247C20745k57611k93655K48717J01152J8762K30529p451L2137k45284j27290
$$ 320745 63134 -230521 18196 119348 138110 368639 361188 393325 148041 20751
10237B0751L51853P2542k60033k31364M7420J18371J4568k10242j28587L831J05389
$$ 20751 372604 445146 185113 -46251 1169 119540 134108 -76134 -204721 -200890 -95501
10226i5501J30533J25691Q4790j43959q239K439J00925J21730k09142k20022n5513
$$ -95501 35032 160723 245513 101554 93315 95754 196679 318409 109267 -110755 -166268
10215a66268K1698K82989N159j72391m4608k7990N7797J26485J7970j08811M9522
$$ -166268 -144570 138419 143578 -28813 -73421 -101411 -43614 82871 100841 -7970 41552
10204D1552K99360J72065j10171L8022q1726J44204j37311M1501O9218j97438
$$ 41552 340912 512977 402806 440828 359102 503306 365995 407496 476714 279276
10194B79276n3250j3173J17650J46500q2982K0828j64253j51404j38729J27511
$$ 279276 226026 212853 330503 477003 394021 414849 250596 99192 -39537 87974
10184H7974K47482K52622R430r3700k37106K6082J69992l4419l8322J69757P4746
$$ 87974 335456 588078 597508 503808 266702 292784 462776 428357 390035 559792 634538
10173F34538Q9177R2104K5057K54165P2471k01905L7015K16284m8517o6255q7773
$$ 634538 723715 815819 840876 1095041 1167512 965607 1002622 1218906 1170389 1104134 1016361
10162A016361J26910L2375j15144m5530K36171j4488J24411N8171J89602J20195
$$ 1016361 1143271 1175646 1060502 1014972 1251143 1236655 1361066 1419237 1608839 1729034
10152A729034j19896M3492j3859j6146j09309o2561p9066k24454k1468K11464
$$ 1729034 1609138 1652630 1638771 1622625 1513316 1450755 1371689 1147235 1125767 1337231
10142A337231K84772p7276j89393l78481j78446n8357K33565k33235J2937k46478
$$ 1337231 1622003 1544727 1355334 976853 798407 740050 973615 740380 753317 506839
10132E06839L4922n2906n6058J80898k22726q0433L8955K28112j96585j40807
$$ 506839 541761 488855 432797 613695 390969 310536 349491 577603 381018 240211
10122B40211k5888p0436Q4305k045l5689J66892j27358j27984n251k0371q378
$$ 240211 214323 143887 228192 226147 190458 357350 229992 102008 96757 76386 68008
10111F8008k51098j61466J93392P3354Q0442k23770N171M9617L566K7355J05396
$$ 68008 -183090 -344556 -151164 -77810 2632 -221138 -215967 -166350 -162784 -135429 -30033
10100c0033k05845q0483K95657K13791J13208K6936k07332j96389k08069k08546
$$ -30033 -235878 -316361 -20704 193087 306295 333231 125899 -70490 -278559 -487105
10090d87105J72999R2129K95747Q5719k03036j8183J99777k42458j72321j8056
$$ -487105 -314106 -221977 73770 159489 -43547 -61730 138047 -104411 -276732 -294788
10080b94788n2765J22936J36256p7910o5184j61286J40811J43177j4218J77356
$$ -294788 -347553 -224617 -88361 -166271 -231455 -392741 -251930 -108753 -122971 54385
10070E4385J80823j21924j45310j46518L8437L27823J392k1437K3689q3672j48045
$$ 54385 235208 113284 -32026 -178544 -140107 187716 189108 167671 191360 107688 -40357
10059d0357k334L7177k08997K2278Q5535N4414M0367J75680N6562L9104m0052
$$ -40357 -42691 -5514 -214511 -192233 -106698 -52284 -11917 163763 220325 259429 219377
10048B19377j77431N2175J08057J34281N4028j9470q7756k45642o260m4537l3611
$$ 219377 41946 94121 202178 336459 390487 371017 283261 37619 31359 -13178 -46789
10037d6789j40604Q0421k0170j12247Q1185j65849k2519Q6718k8327q7117m7145
$$ -46789 -187393 -106972 -127142 -239389 -158204 -324053 -346572 -259854 -288181 -375298 -422443
10026d22443j45861J59329L2636K55177K75151m8527q5598r0292J93828N4697
$$ -422443 -568304 -408975 -376339 -121162 153989 105462 19864 -70428 123400 178097
10016A78097K2829j17067j66198q2292K57881M9850N0931j6510j57725k07991
$$ 178097 200926 83859 -82339 -164631 93250 143100 194031 177521 19796 -188195
10006a88195k66580j336J21852J61113J43459K9358J07976j03980k3358j69165
$$ -188195 -454775 -456111 -334259 -173146 -29687 -329 107647 3667 -19691 -188856
9996a88856Q3132L4573r4250n1463J52768J48256n2662j28158L085o8807j90149
$$ -188856 -105724 -71151 -165401 -216864 -64096 84160 31498 -96660 -93575 -162382 -352531
9985c52531N4699M3182J2964L2324R0517j87424K1230Q1239p0271k5787r2032
$$ -352531 -297832 -254650 -241686 -209362 -118845 -306269 -285039 -203800 -274071 -299858 -391890
9974c91890j01861J09178Q1884R2308O7055J42567q9051L6877P8125J64166Q5918
$$ -391890 -493751 -384573 -302689 -210381 -143326 -759 -89810 -52933 25192 189358 275276
9963B75276k02752J06070q5669J953k4984r2031m1040p8503P8537J57150p3652
$$ 275276 72524 178594 92925 94878 69894 -22137 -63177 -141680 -63143 94007 20355
9952B0355O810K33780j41007l31365j1485J52282K42919j5937K6320J17487J61139
$$ 20355 27165 260945 119938 -211427 -222912 -70630 172289 156352 182672 300159 461298
9941D61298K25967Q8988j19325n0357j5058j6391M94141O29381O40857J322019
$$ 461298 687265 776253 656928 606571 591513 575122 1069263 1698644 2339501 3661520
9931C661520J528722Q90607n92220j266994j351591r86081n09359m58920k81471
$$ 3661520 5190242 6080849 5488629 4221635 2870044 1883963 1374604 915684 634213
9922F34213l5394q0489k74478j36385n930J21503j53135j08334L4578J47187n8328
$$ 634213 598819 518330 243852 107467 101537 223040 69905 -38429 -3851 143336 85008
9911H5008k0295J27949L376r34o8497o1940j36447q5571R9594J31407o0253q8333
$$ 85008 64713 192662 196038 195104 126607 64667 -71780 -157351 -57757 73650 13397 -74936
9899g4936R02j22334j40664N3436K93421J15243n7170K5781q6886J85947R7420
$$ -74936 -74034 -196368 -337032 -283596 9825 125068 67898 93679 6793 192740 290160
9888B90160p0965J8905j01399m9120K5608k1919j19510k22879j14530j01731K00160
$$ 290160 219195 238100 136701 87581 113189 91270 -28240 -251119 -365649 -467380 -267220
9877b67220J81631R0073L5298n5383l28982L29007K58585j62563l5672k44718
$$ -267220 -85589 4484 39782 -15601 -344583 -15576 243009 80446 44774 -199944
9867a99944j11220K23127L7724J2088r9810q8498j10168m2535R8837K37844j8696
$$ -199944 -311164 -88037 -50313 -38225 -138035 -226533 -336701 -379236 -280399 -42555 -61251
9856f1251l0346m4810j20745K9286L30653j19912M178j16030k25969N1598J10789
$$ -61251 -91597 -136407 -257152 -227866 102787 -17125 -12947 -128977 -354946 -303348 -192559
9845a92559q3456P2658N9696j01256O4963k2887r1087J01107K48188J9955n2j89771
$$ -192559 -276015 -203357 -143661 -244917 -179954 -202841 -293928 -192821 55367 75322 75270 -114501
9833a14501p4654J72398P2879J65043J42941J6885j5048r8324l28367j10380j1879
$$ -114501 -189155 -16757 56122 221165 364106 380991 365943 267619 -60748 -171128 -183007
9822a83007q6557J61577J44657j16424J6695N0233j21858K6202L22866l1647L2130
$$ -183007 -269564 -107987 36670 -79754 -63059 -12826 -134684 -108482 214384 182737 214867
9811B14867J35218q0478q3477j68614q0051n6284Q0586J13874K13854P1595O0858
$$ 214867 350085 269607 186130 17516 -62535 -118819 -38233 75641 289495 361090 421948
9800D21948n7012R975J84197j94083j29362k19436q6080J11765k9503p9999j10649
$$ 421948 364936 374911 559108 365025 235663 16227 -69853 41912 12409 -67590 -178239
9789a78239j230K67909J90660O4382k34466N854q1172M5512J48384J57339l2805
$$ -178239 -179469 88440 279100 343482 109016 114870 33698 79210 227594 384933 352128
9778C52128m2863M1008J07326J8542j55797j50625n4421L9417J57696J0071k99034
$$ 352128 309265 350273 457599 476141 320344 169719 115298 154715 312411 322482 23448
9767B3448j23397J00899J80117j19148j07916q11j25455l907J76827j72322l1229
$$ 23448 -99949 950 181067 61919 -45997 -46808 -172263 -176170 657 -171665 -202894
9756b02894J03120k50541l9334P6638K4061r8019R8753J20361o8537j42156N1640
$$ -202894 -99774 -350315 -389649 -313011 -288950 -386969 -288216 -167855 -236392 -378548 -326908
9745c26908J27675K05979P7532j09536j13240l2324p8271j27633K45385J43086
$$ -326908 -199233 6746 84278 -25258 -138498 -170822 -249093 -376726 -131341 11745
9735A1745l9700q0889R5068p0195o3436p3397O5222J54772M7554p5063L8798j41850
$$ 11745 -27955 -108844 -13776 -83971 -147407 -220804 -155582 -810 46744 -28319 10479 -131371
9723a31371J09123J59706p9424q5480j55952k84420O4044K7553k9457J59539L3533
$$ -131371 -22248 137458 58034 -27446 -183398 -467818 -403774 -376221 -405678 -246139 -212606
9712b12606k7116J28678R5324K28371J86459k3647l09811j50347k30866j93146
$$ -212606 -239722 -111044 -15720 212651 399110 375463 65652 -84695 -315561 -508707
9702e08707J41167J46666K67067o3535l51338j60659K77550J60517l1355j5429
$$ -508707 -367540 -220874 46193 -17342 -368680 -529339 -251789 -91272 -122627 -138056
9692a38056J33662o1529J79043O8682L4447M8235j96665j25735K9598r155m3607
$$ -138056 -4394 -65923 113120 181802 216249 264484 67819 -57916 -28318 -37473 -81080
9681h1080o9221J11127N5479P9737L59044R1915j20486l16174J49055R4171J73259
$$ -81080 -150301 -39174 16305 96042 455086 547001 426515 110341 259396 353567 526826
9670E26826J92359o2369l33040j31882j17145M5766N8872R5111j03780k45843
$$ 526826 719185 656816 323776 191894 74749 120515 179387 274498 170718 -75125
9660g5125O6114K08241r7176m6304p8506R3878K00027K91461L10965K04858J2941
$$ -75125 -9011 199230 102054 55750 -22756 71122 271149 562610 873575 1078433 1091374
9649A091374j51692k76055l23565l13289m2518M3659n6832K43648M2068k66246
$$ 1091374 939682 663627 340062 26773 -15745 27914 -28918 214730 256798 -9448
9639i448j97616L2545M3099K6901j74884k5733l226J05401k4665r6322Q0049N3776
$$ -9448 -207064 -174519 -131420 -104519 -279403 -305136 -308362 -202961 -227626 -323948 -243899 -190123
9627a90123R98j32371k3063P1692J45943J62634q1650k12727Q6076K11410N9169
$$ -190123 -189125 -321496 -344559 -272867 -126924 35710 -45940 -258667 -172591 38819 97988
9616I7988M5472j47015j20194j77116j30924J36457N1097N7281n6122J43574m5146
$$ 97988 143460 -3555 -123749 -300865 -431789 -295332 -244235 -186954 -243076 -99502 -144648
9605a44648J20018P984k69768j08865K05219J48864N9426O8143j19679k7188M597
$$ -144648 -24630 -16646 -286414 -395279 -190060 -41196 18230 86373 -33306 -60494 -55897
9594e5897O3930j76825M8994L50918J9724q6941L666m0726n3716R0758L0316O4907
$$ -55897 8033 -168792 -119798 231120 250844 163903 167569 126843 73127 163885 194201 259108
9582B59108p0649j49794Q6983l8624k13853P0623r0191o116j0818j84925R6383
$$ 259108 188459 38665 125648 87024 -126829 -56206 -146397 -152513 -163331 -348256 -251873
9571b51873L55929J54337m4084Q1357j07368l78996j65630L67824K53175k66291
$$ -251873 104056 258393 214309 295666 188298 -190698 -356328 11496 264671 -1620
9561a620J8507n2796L533K2976p3403j2263m3500r271j49312J77282j00955J58867
$$ -1620 16887 -35909 -32376 -9400 -82803 -95066 -138566 -147837 -297149 -119867 -220822 -61955
9549f1955R8709j3545M4080j37740N877k9170K10473L08608j79531l97173j26453
$$ -61955 36754 23209 67289 -70451 -64574 -93744 116729 425337 245806 -151367 -277820
9538b77820K67964K14523J97226k2074k44704j66018p2646J35444N998k44192
$$ -277820 -9856 204667 401893 379819 135115 -30903 -103549 31895 37893 -206299
9528b06299l4072r4008l4608K55926J40894j56134j11798J13896j3942P2876K64141
$$ -206299 -240371 -334379 -368987 -113061 27833 -128301 -240099 -126203 -140145 -67269 196872
9517A96872J3574j67883k16009O509j48393M1447K49555J23141j39178J5076j19272
$$ 196872 210446 42563 -173446 -166937 -315330 -273883 -24328 98813 -40365 -25289 -144561
9506a44561k91584j09227J4399J11578P3196p0408J75123l1486J6220p260J40418
$$ -144561 -436145 -545372 -530973 -419395 -346199 -416607 -241484 -272970 -256750 -264010 -123592
9495a23592K65098K8560r8974o5017k51700K40329M6809j75779j70991k8713K0666
$$ -123592 141506 170066 71092 6075 -245625 -5296 41513 -134266 -305257 -333970 -313304
9484c13304J99989M03188l5435J07969m6782j75362j20603n4950J7228j9934J10539
$$ -313304 -113315 289873 254438 362407 315625 140263 19660 -35290 -18062 -37996 72543
9473G2543N156m1316J63212m2935l14916m0106J2819n1313O0738o469l4940Q0827
$$ 72543 77699 36383 199595 156660 -158256 -198362 -185543 -236856 -176118 -182587 -217527 -136700
9461a36700O3760n7149J67667J81051M4807j03284r66p5983o3149n0256j1012
$$ -136700 -72940 -130089 37578 218629 263436 160152 159186 83203 20054 -30202 -41214
9450d1214J71891q268j96361j6618J01140K16359K77395p9824k69401j33683K04530
$$ -41214 130677 122409 -73952 -90570 10570 226929 504324 424500 155099 21416 225946
9439B25946l51100o0282O3934J27311J00960k25922j81508k6393k32055R3244
$$ 225946 -125154 -185436 -121502 5809 106769 -119153 -300661 -327054 -559109 -465865
9429d65865R9201m22K5609m2731j46200J49784J45236j52844l0703K11173J72994
$$ -465865 -366664 -367086 -341477 -384208 -530408 -380624 -235388 -388232 -418935 -207762 -34768
9418c4768L8843L447j51644N1828Q481J41652J6868j07730M5105L1191q393q3820
$$ -34768 4075 7522 -144122 -92294 -83813 57839 74707 -33023 12082 43273 34880 -48940
9406d8940k46765Q8756N9674j6119j80780K31405K27409J81844j32247j60546
$$ -48940 -295705 -206949 -147275 -163394 -344174 -112769 114640 296484 164237 3691
9396C691l20012J05872J99267j52698j86743J05978J05264L80543J21208q8663
$$ 3691 -316321 -210449 -11182 -163880 -350623 -244645 -139381 241162 362370 273707
9386B73707k98292j70677J02670J28999j30705J29971l9514k20179o5072J18457
$$ 273707 -24585 -195262 -92592 36407 -94298 35673 -3841 -224020 -289092 -170635
9376a70635o585j88516q88R8712K57842J06497j09093M0038P6711k43493P4055
$$ -170635 -177220 -365736 -366624 -267912 -10070 96427 -12666 27372 104083 -139410 -65355
9365f5355L90445N7343m03000j35218J03686l6673j19763n4033N3090L03430J51408
$$ -65355 325090 382433 -20567 -155785 -52099 -88772 -208535 -262568 -209478 93952 245360
9354B45360m9828l45165k61769n2386k2315J41519K68610J13444k92570k83079
$$ 245360 195532 -149633 -411402 -463788 -486103 -344584 -75974 37470 -255100 -538179
9344e38179M0158K04545j61590o2645N1425J37496J32720N1596K06565J8942j92204
$$ -538179 -498021 -293476 -455066 -517711 -466286 -328790 -196070 -144474 62091 81033 -111171
9333a11171j0175Q7562J3702O6225P6985J65650L6863Q1538J617j52159j52226
$$ -111171 -121346 -33784 -20082 46143 123128 288778 325641 407179 408796 256637 104411
9322A04411N3935k42662l06131Q2566J88292K44529L1553j27763j90893o7260
$$ 104411 158346 -84316 -390447 -307881 -119589 124940 156493 28730 -162163 -229423
9312b29423J53954M00233O1936l9288j29677j75327j50134j93023Q1566J65050
$$ -229423 -75469 324764 386700 347412 217735 42408 -107726 -300749 -219183 -54133
9302e4133q5078K2242L2541J13880Q9511J16858k3256J95038r2000k53707l21595
$$ -54133 -139211 -116969 -84428 29452 118963 235821 212565 407603 315603 61896 -259699
9291b59699o296J36811J70332J75715r2041K37680M0442k40121k27258n6948l7091
$$ -259699 -265995 -129184 41148 216863 124822 362502 402944 162823 -64435 -121383 -158474
9280a58474M8113M0432N2131J96210O0399j76912l7116R5027J75963k49286l61363
$$ -158474 -110361 -69929 -17798 178412 238811 61899 24783 119810 295773 46487 -314876
9269c14876j08529J15066M6662K04530J53165J69292O6095k49014k84294n4893
$$ -314876 -423405 -308339 -261677 -57147 96018 265310 331405 82391 -201903 -256796
9259b56796k06292l5972J89962J95826J20036j9687J07545J69249o602O7643k9353
$$ -256796 -463088 -499060 -309098 -113272 6764 -12923 94622 263871 257269 324912 295559
9248B95559j29078k90270r6612O9586J06157n6660n6634J3769q7376J06141J84559
$$ 295559 166481 -123789 -220401 -150815 -44658 -101318 -157952 -144183 -231559 -125418 59141
9237E9141l8681P6692J71962J04166j29319n7874m3167J6204l7391j41889J25518
$$ 59141 20460 97152 269114 373280 243961 186087 142920 159124 121733 -20156 105362
9226A05362J19490l2612j87018j21116K747O6754K14333K19516p4800n9107k92324
$$ 105362 224852 192240 5222 -115894 -113147 -46393 167940 387456 312656 253549 -38775
9215c8775p3565L3008L8847m3845l6973K0135R7050K52607N0872k94157k7579
$$ -38775 -112340 -79332 -40485 -84330 -121303 -101168 -4118 248489 299361 5204 -22375
9204b2375j54681m5343J60128K05644M8061p3875r4980j09597n5307k24567o8647
$$ -22375 -177056 -222399 -62271 143373 191434 117559 22579 -87018 -142325 -366892 -435539
9193d35539K50289Q9689n7917j79208r6172R240J07328L32N4663J19329O3884
$$ -435539 -185250 -95561 -153478 -332686 -428858 -419618 -312290 -311958 -257295 -137966 -74082
9182g4082N7236k64219o7816j43015j41679P276K23141J99545N1082k0394q1889
$$ -74082 -16846 -281065 -348881 -491896 -633575 -626299 -403158 -203613 -152531 -172925 -254814
9171b54814J41926k3094r3007k7759L688j53685J07729O5910k4204p7162n0152
$$ -254814 -112888 -135982 -228989 -256748 -253060 -406745 -299016 -233106 -257310 -334472 -384624
9160c84624k2524J91715Q8647J63639J53825j1555k34363L304l0284J23153J45956
$$ -384624 -407148 -215433 -126786 36853 190678 179123 -55240 -51936 -82220 40933 186889
9149A86889l418P003n018r4719j46806N2974J00824m0365j18946k14401q094J5333
$$ 186889 183471 190474 185456 90737 -56069 -3095 97729 57364 -61582 -275983 -284077 -268744
9137b68744N2860q0707j28765J77605J36721j6020j27267J45868j0647q5397Q4673
$$ -268744 -215884 -296591 -425356 -247751 -111030 -127050 -254317 -108449 -119096 -204493 -119820
9126a19820J00860P4839N9888m3386k02492o3088j31368j52284J16455L18388
$$ -119820 -18960 55879 115767 72381 -130111 -193199 -324567 -476851 -360396 -42008
9116d2008o0552j39061j82041P8149P790j11614l0699J8443J01318k8776N0412
$$ -42008 -102560 -241621 -423662 -345513 -337723 -449337 -480036 -461593 -360275 -389051 -338639
9105c38639R9659N6735K05403j09071M2469J26153N3517j15613L6956K0399j8158
$$ -338639 -238980 -182245 23158 -85913 -43444 82709 136226 20613 57569 77968 59810
9094E9810O4400j77860L3364J81973k22940l19821p2925J20186J24541N8223o4795
$$ 59810 124210 -53650 -20286 161687 -61253 -381074 -453999 -333813 -209272 -151049 -215844
9083b15844P3590J73401Q3673j12945k15749R0758j1667o6760J14084J81875q4811
$$ -215844 -142254 31147 114820 1875 -213874 -123116 -134783 -201543 -87459 94416 9605
9072I605Q241P5566j10822j06189k05822k04703J38856J85968M4565j83682j66725
$$ 9605 17846 93412 -17410 -123599 -329421 -534124 -395268 -209300 -164735 -348417 -515142
9061e15142k8075K76426P1364J01855j13501L6398K08277j90283N6315j50446
$$ -515142 -543217 -266791 -195427 -93572 -207073 -170675 37602 -152681 -96366 -246812
9051b46812k5818J06466J03409J29768l9581J8931R082m9133l88658K387J23053
$$ -246812 -272630 -166164 -62755 67013 27432 46363 55445 6312 -382346 -379959 -256906
9040b56906p0494q1300J32686R4872O1049J50880p2273j07180k17069K5020J17465
$$ -256906 -327400 -408700 -276014 -181142 -120093 30787 -41486 -148666 -365735 -340715 -223250
9029b23250j3417O6231J79771L6572R9443j86919j81939R6543K03844n2068n2025
$$ -223250 -236667 -170436 9335 45907 145350 -41569 -223508 -126965 76879 24811 -27214
9018b7214j13271j38487K71719L09249n1490J20012L3357j41879k31060k28784
$$ -27214 -140485 -278972 -7253 301996 250506 370518 403875 261996 30936 -197848
9008a97848r1161m358n1880j01752k2589o7507J40767L46007K04085M2489k7069
$$ -197848 -289009 -293367 -345247 -446999 -469588 -537095 -396328 -50321 153764 196253 169184
8997A69184j45767O1846m588j55098K9517J07304J63529j111L1930j62176j61796
$$ 169184 23417 85263 80675 -74423 -44906 62398 225927 224816 256746 94570 -67226
8986f7226j68038J07945O9195K54016j96271q3792j02491o2592K5864n9942P937
$$ -67226 -235264 -127319 -58124 195892 -379 -84171 -186662 -249254 -223390 -283332 -275395
8975b75395K06552M4927l38522p3888P6965P2303J49566J46158K77355q7810j65463
$$ -275395 -68843 -23916 -362438 -436326 -359361 -287058 -137492 8666 286021 198211 32748
8964C2748l04182j36828J63034J41892J15303k86094J57195L54000J36143j70922
$$ 32748 -271434 -408262 -245228 -103336 11967 -274127 -116932 237068 373211 202289
8954B02289j54628j00108J16776j14369m3242K162J4917Q2613j1058L4848K09065
$$ 202289 47661 -52447 64329 -50040 -93282 -91120 -76203 6410 -4648 30200 239265
8943B39265k2280j82606o7515R9042M3158J23784r1106r3260J79512R5719j84364
$$ 239265 216985 34379 -33136 65906 109064 232848 141742 48482 227994 323713 139349
8932A39349l63986o2133J9911K06242q2824K5339Q7536j47090j00533N17J89157
$$ 139349 -224637 -286770 -266859 -60617 -143441 -118102 -30566 -177656 -278189 -277672 -88515
8921h8515q1108j70026N8335L85165L76922N595j94752k10230j34297n0033K10214
$$ -88515 -169623 -339649 -281314 103851 480773 486368 291616 81386 -52911 -102944 107270
8910A07270N4744o1238n3453j25971J34706r6188j19765N7984J36789q1466K54074
$$ 107270 162014 100776 47323 -78648 56058 -40130 -159895 -101911 34878 -46588 207486
8899B07486J41348Q8054M9633k50461j88839k20304j43153j82335j7110M67220
$$ 207486 348834 436888 486521 236060 47221 -173083 -316236 -498571 -515681 -48461
8889d8461J54712j38666j01091k04031J44706L47985O8486k54169r0055p3554
$$ -48461 106251 -32415 -133506 -337537 -192831 155154 223640 -30529 -120584 -194138
8879a94138J02391J93437R184j03987m0586j07447L9310P220j738L46917M8766
$$ -194138 -91747 101690 110874 6887 -33699 -141146 -101836 -94616 -96354 250563 299329
8868B99329k51878n4375k9219k6611j48601Q4301R0488j7242M5718j49126Q0142
$$ 299329 47451 -6924 -36143 -62754 -211355 -127054 -36566 -53808 -8090 -157216 -77074
8857g7074P4995j54225j78307p6649m8279K69804K59569q6653p8946n1537K28733
$$ -77074 -2079 -156304 -334611 -411260 -459539 -189735 69834 -16819 -95765 -147302 81431
8846H1431l7449j85537O7631M5921k48273J02634L50314J30825j30551L6046j61392
$$ 81431 43982 -141555 -73924 -28003 -276276 -173642 176672 307497 176946 212992 51600
8835E1600l77160J92204L4414P5288p1661N2778J87610m7612k73526r7259J9018
$$ 51600 -325560 -133356 -98942 -23654 -95315 -42537 145073 97461 -176065 -273324 -254306
8824b54306J13853N8363l9717J81571o0506p2698l5547k40418j45830K63962L58182
$$ -254306 -140453 -82090 -121807 59764 -742 -73440 -108987 -349405 -495235 -231273 126909
8813A26909J68994Q1445l63774j88611j10012L7538J33082m9336k5545J53468
$$ 126909 295903 377348 13574 -175037 -285049 -247511 -114429 -163765 -189310 -35842
8803c5842r6413k24432K0454J86419J98691K3757M4442j75400k22595J11980J96089
$$ -35842 -132255 -356687 -336233 -149814 48877 72634 117076 -58324 -280919 -168939 27150
8792B7150n3927k99193j10689L7062k31662j4834J7899K65258m7872J12798L24668
$$ 27150 -26777 -325970 -436659 -399597 -631259 -646093 -628194 -362936 -410808 -298010 26658
8781B6658R369j79062n8084m3482P2054K21618j14851J01951n9998k21782M9674
$$ 26658 36027 -143035 -201119 -244601 -172547 49071 -65780 36171 -23827 -245609 -195935
8770a95935J33770J17918K92029j60108j48905N0484Q0687j44451r9634j29049
$$ -195935 -62165 55753 347782 187674 38769 89253 169940 25489 -74145 -203194
8760b03194J04221K25767J36990k23414k95142N7707l1201j8346N3719j16487
$$ -203194 -98973 126794 263784 40370 -254772 -197065 -228266 -246612 -192893 -309380
8750c09380p4692k77507l3780Q6276J29174l7419k64564Q0406L67566L11108O6136
$$ -309380 -384072 -661579 -695359 -609083 -479909 -517328 -781892 -701486 -333920 -22812 43324
8739D3324j04533j05204J27008J47738r9313K7118j42742r678j48671j32969j85861
$$ 43324 -61209 -166413 -39405 108333 9020 36138 -106604 -116282 -264953 -397922 -583783
8728e83783J77021L39371m2565o4198K8668J3714L0375n1637K15608n9932n0549
$$ -583783 -406762 -67391 -109956 -174154 -145486 -131772 -101397 -153034 62574 2642 -47907
8717d7907j38057l17603R1137K26144K22966k02422k01957n7800m4663M9676J84307
$$ -47907 -185964 -503567 -412430 -186286 36680 -165742 -367699 -425499 -470162 -420486 -236179
8706b36179R9125N03n8946J32071n9678j22281p2330M4969R1061J00380q6731
$$ -236179 -137054 -136551 -195497 -63426 -123104 -245385 -317715 -272746 -181685 -81305 -168036
8695a68036j63315K22460K99699O1609O4113l16509l41888l7815O1541q163R3685
$$ -168036 -331351 -108891 190808 252417 316530 21 -341867 -379682 -318141 -326304 -232619
8684b32619K30217J33034j85976j38209N2932r6928j07240o3511L5895R0953m4180
$$ -232619 -2402 130632 -55344 -193553 -140621 -237549 -344789 -408300 -372405 -281452 -325632
8673c25632N3435J6638o3995M0276J41813J07450k3215J34246N3139k13000j84608
$$ -325632 -272197 -255559 -319554 -279278 -137465 -30015 -53230 81016 134155 -78845 -263453
8662b63453j9113J34212j10398k8262K11844P9560r5728K4153j06126N2760r1708
$$ -263453 -282566 -148354 -258752 -287014 -75170 4390 -91338 -67185 -173311 -120551 -212259
8651b12259k09250j58601L67652L9864K6096L6790P1592K01525K54221K1479k20687
$$ -212259 -421509 -580110 -212458 -172594 -146498 -109708 -38116 163409 417630 439109 218422
8640B18422k79335m1758P6835J59442K8589k10134j48756k01471m3008J98120
$$ 218422 -60913 -102671 -25836 133606 162195 -47939 -196695 -398166 -441174 -243054
8630b43054L05145J48660L0487K5183j03601M4393J05179j9161j72225N3866J19902
$$ -243054 62091 210751 241238 266421 162820 207213 312392 293231 121006 174872 294774
8619B94774m3973r8400n2499O765J02202O6877k9795M8940j63794j6688K48595
$$ 294774 250801 152401 99902 106667 208869 275746 245951 294891 131097 114409 363004
8608C63004J23123j07868J0495l10844k18759o0018J26719K247J57326k4618O4110
$$ 363004 486127 378259 388754 77910 -140849 -200867 -74148 -71901 85425 60807 124917
8597A24917q3140j21070p8630J33625R7427j1166R8485K63821q7427n2695j13984
$$ 124917 41777 -79293 -157923 -24298 73129 61963 160448 424269 336842 284147 170163
8586A70163o8493J12416P7410j05921k0734j31750N7837R4950N7546n8j91501
$$ 170163 101670 214086 291496 185575 164841 33091 90928 185878 243424 243366 51865
8575E1865r0139o0919m9807N842O2928J01721N366k41112j05911O0134K43323
$$ 51865 -38274 -99193 -149000 -143158 -80230 21491 26857 -214255 -320166 -260032 -16709
8564a6709K29451n0932K5448M1570q1625j92577K9006J17093o8915p4600L0494
$$ -16709 212742 161810 187258 228828 147203 -45374 -16368 100725 31810 -42790 -12296
8553a2296j78667J8523K01207K7959n3376j45023p2088L5716J36717K9330r4224
$$ -12296 -190963 -172440 28767 56726 3350 -141673 -213761 -178045 -41328 -11998 -106222
8542a06222n5264K9995n7703L5787R2553J9203j33708j7187p9964P6986K70263
$$ -106222 -161486 -131491 -189194 -153407 -60854 -41651 -175359 -192546 -272510 -195524 74739
8531G4739O7140M1004M4542k41341q6345j10678J37743K22913N5662J8947L4622
$$ 74739 141879 182883 227425 -13916 -100261 -210939 -73196 149717 205379 224326 258948
8520B58948j94145k05409j25231r5113Q0545K05297L2417K290L3036l5294j02086
$$ 258948 64803 -140606 -265837 -360950 -280405 -75108 -42691 -40401 -7365 -42659 -144745
8509a44745J73710K72294l679l5432m6882J24968j88995L6602J9419l9069k56
$$ -144745 28965 301259 297580 262148 215266 340234 151239 187841 207260 168191 167935
8498A67935O3130o0614L9344r4010l5887J34717L1841J5284m8314K64567m74k11429
$$ 167935 231065 170451 209795 115785 79898 214615 246456 261740 213426 477993 477519 266090
8486B66090K79822J12160J1425J14055r0694j67651l16159j16906j0491j33047
$$ 266090 545912 658072 669497 783552 692858 525207 209048 92142 81651 -51396
8476e1396j75811N5377L15259J86788m4072M6022Q902j41695K01433m0929j44212
$$ -51396 -227207 -171830 143429 330217 286145 332167 341069 199374 400807 359878 215666
8465B15666j9526N0035J5024K1823j23077l28939N400L1269N4103O7481m3012
$$ 215666 196140 246175 261199 283022 159945 -168994 -163594 -132325 -78222 -10741 -53753
8454e3753J17331o5154j87390k6071J91392J75889l0913J42440L7609o5532K4816
$$ -53753 63578 -1576 -188966 -215037 -23645 152244 121331 263771 301380 235848 260664
8443B60664k9955n3559l6648k6605J8711J57109J07142r9420J62400j17007o9131
$$ 260664 230709 177150 140502 113897 132608 289717 396859 297439 459839 342832 273701
8432B73701j9867K18494L5892j60166j43276K192P2319j3375J83729n7975m2083
$$ 273701 253834 472328 508220 348054 204778 206970 279289 265914 449643 391668 349585
8421C49585k6770M6954n149k95212k03275m8466J30726j31614m5102M5918P8331
$$ 349585 322815 369769 364620 69408 -133867 -182333 -51607 -183221 -228323 -182405 -104074
8410a04074Q6921R3070j12552l3612J12286Q4806p5023j39409K8209K67631k13810
$$ -104074 -17153 75917 -36635 -70247 42039 126845 51822 -87587 -59378 208253 -5557
8399e557j11242K53705r347l5245J07724k85305j21481K3587j39564J20774P6610
$$ -5557 -116799 136906 127559 92314 200038 -85267 -206748 -183161 -322725 -201951 -125341
8388a25341J48462O5661K1728o0954q5260p496o6005P4106J15671j67007k97664
$$ -125341 23121 88782 110510 49556 -35704 -43200 -109205 -35099 80572 -86435 -384099
8377c84099Q5581Q4996j18866o6573Q5317J87613R6256m1672k18324j32574P8617
$$ -384099 -298518 -213522 -332388 -398961 -313644 -126031 -29775 -71447 -289771 -422345 -343728
8366c43728M6062J70503J24480J19118K77702m2404j34662j13385j52117J13428
$$ -343728 -297666 -127163 -2683 116435 394137 351733 217071 103686 -48431 64997
8356F4997k0489j652j04816o443Q672P2695J29286k15491m8164l3497L5664p0124
$$ 64997 44508 42856 -61960 -68403 -59731 12964 142250 -73241 -121405 -154902 -119238 -189362
8344a89362j70607j35472R3257L86650J16256j67419j71122J25167J21921J55978
$$ -189362 -359969 -495441 -402184 -15534 100722 -66697 -237819 -112652 9269 165247
8334A65247j38192N8663J62294n4795n0486O8326R5143j25285K6060J0684J2713
$$ 165247 27055 85718 248012 193217 142731 211057 306200 180915 206975 217659 230372
8323B30372M1557j3811q7878k3398N4971L2505j2284l59345j82114K38391J96065
$$ 230372 271929 258118 170240 146842 201813 234318 222034 -137311 -319425 -81034 115031
8312A15031m6731j62659n4361j14507P0679L0383M57521Q0976q7469j38619j42107
$$ 115031 68300 -94359 -148720 -263227 -192548 -162165 295356 376332 288863 150244 8137
8301H137k00395N7571K77984Q0483j83898P6965J53915J60928q1000j66066j11400
$$ 8137 -192258 -134687 143297 223780 39882 116847 270762 431690 350690 184624 73224
8290G3224r7196m7416m1397K5098Q9623j01749j1779P9026K28573J09901J06826
$$ 73224 -23972 -71388 -112785 -87687 1936 -99813 -111592 -32566 196007 305908 412734
8279D12734l48070l60265n5404J55961K42955L03638R7646J39020n25278l62163
$$ 412734 64664 -295601 -351005 -195044 47911 351549 449195 588215 62937 -299226
8269b99226J15053P4608L8045j29851Q7517J0097r7854k8248L7043j90996Q4904
$$ -299226 -184173 -109565 -71520 -201371 -113854 -103757 -201611 -229859 -192816 -383812 -298908
8258b98908o2719O2676K48860J27118J76964o1j24964J36396n7232j6096j36213
$$ -298908 -361627 -298951 -50091 77027 253991 253930 128966 265362 208130 192034 55821
8247E5821j9779j24009N4092o551R4065J56884J08582j1539j93570p1818M6736
$$ 55821 36042 -87967 -33875 -40426 53639 210523 319105 307566 113996 42178 88914
8236H8914P2016J21974N0333M2005l1540l13016m50574M9066J7519j5746J12121
$$ 88914 160930 282904 333237 375242 343702 30686 -419888 -370822 -353303 -369049 -256928
8225b56928J60577j16912j32511J09237k5985j41908O1508J69911L4677R2795
$$ -256928 -96351 -213263 -345774 -236537 -262522 -404430 -342922 -173011 -138334 -45539
8215d5539j74960j04111K64848K94481N47j62661j22013J51855J27319j42718
$$ -45539 -220499 -324610 -59762 234719 235266 72605 -49408 102447 229766 87048
8205H7048j64109k04301N2443K05477Q601j50173k5148o3558R1394K66586K77023
$$ 87048 -77061 -281362 -228919 -23442 -14841 -165014 -190162 -253720 -162326 104260 381283
8194C81283j27716j52740j29943P9657j42601p6036N9091Q5401j75205J10499
$$ 381283 253567 100827 -29116 50541 -92060 -168096 -109005 -23604 -198809 -88310
8184h8310J65334q931p1633k37874j50333O8781O5492K41858K48898J28939P1207
$$ -88310 77024 68093 -3540 -241414 -391747 -322966 -257474 -15616 233282 362221 433428
8173D33428j03696k00409j61797J0474J22041K65407L3414j35063k7711j51963
$$ 433428 329732 129323 -32474 -22000 100041 365448 398862 263799 236088 84125
$$ [...]
##END NTUPLES=NMR SPECTRUM
##END=
