##TITLE=Analysis number 312678
Compound Code ac 33745
Project Code qc-cat
Chemist Name andyc
##JCAMPDX= 6.0         $$ Bruker NMR JCAMP-DX V2.0
##DATA TYPE= NMR SPECTRUM
##DATA CLASS= NTUPLES
##ORIGIN= Bruker BioSpin GmbH
##OWNER= NMR
$$ XWIN-NMR		Version 3.5
$$ Wed Aug 10 15:40:18 2005 GMT Daylight Time (UT+1h)  MAYBRIDGE\NMR@NMR_250MHZ
##.OBSERVE FREQUENCY= 250.131544655141
##.OBSERVE NUCLEUS= ^1H
##.ACQUISITION MODE= SIMULTANEOUS (DQD)
##.ACQUISITION SCHEME= undefined
##.AVERAGES= 16
##.DIGITISER RES= 18
##SPECTROMETER/DATA SYSTEM= dpx250
##.PULSE SEQUENCE= zg30
##.SOLVENT NAME= DMSO
##.SHIFT REFERENCE= (INTERNAL, DMSO, 0, 16.522)
##AUDIT TRAIL= $$ (NUMBER, WHEN, WHO, WHERE, WHAT)
$$ ##TITLE= Audit trail, XWIN-NMR		Version 3.5
$$ ##JCAMPDX= 5.01
$$ ##ORIGIN= Bruker BioSpin GmbH
$$ ##OWNER= NMR
$$ C:\u/data/dgb/nmr/ADRS/7540/pdata/1/auditp.txt
$$ ##AUDIT TRAIL=  $$ (NUMBER, WHEN, WHO, WHERE, WHAT)
(   1,<2005-08-10 15:39:38.07 +100>,<MAYBRIDGE\NMR>,<NMR_250MHZ>,
      <created by zg, POWCHK disabled, PULCHK disabled
       configuration hash MD5:
       62 19 C7 07 E1 42 D1 B7 37 6C 3D D0 77 39 F9 E6
       data hash MD5: 64K
       29 5E 58 E6 34 45 28 0C C1 C6 5E 4F 25 53 78 53>)
(   2,<2005-08-10 15:39:55.90 +100>,<MAYBRIDGE\NMR>,<NMR_250MHZ>,
      <Start of raw data processing
       ef LB = 0.3 FT_mod = 6 PKNL = 1 SI = 32K 
       data hash MD5: 32K
       6E D8 FD A0 65 F5 22 A9 89 D7 E9 86 58 54 4E 7C>)
(   3,<2005-08-10 15:39:59.67 +100>,<MAYBRIDGE\NMR>,<NMR_250MHZ>,
      <apk 
       data hash MD5: 32K
       E9 E8 76 7F C3 FA E2 95 77 15 2B D4 F0 15 88 DC>)
(   4,<2005-08-10 15:40:00.79 +100>,<MAYBRIDGE\NMR>,<NMR_250MHZ>,
      <abs ABSG = 5 
       data hash MD5: 32K
       78 E4 BD 50 EB 8F 87 47 8E A8 3E 25 57 A2 F4 3C>)
$$ ##END=
$$ 
$$ hash MD5
$$ 0D 41 1F 9A 10 BF 4B 97 30 A9 CB E9 70 1F 92 05
##$RELAX= 
##$RELAX= 
##$RELAX= 
##$RELAX= 
##$RELAX= 
##$RELAX= 
##$RELAX= 
$$ Bruker specific parameters
$$ --------------------------
##$DU= <C:\u>
##$EXPNO= 7540
##$NAME= <ADRS>
##$PROCNO= 1
##$TYPE= <nmr>
##$USER= <dgb>
##$AMP= (0..31)
100 100 100 100 100 100 100 100 100 100 100 100 100 100 100 100 100 100 
100 100 100 100 100 100 100 100 100 100 100 100 100 100 
##$AQSEQ= 0
##$AQ_mod= 3
##$AUNM= <au_zg>
##$AUTOPOS= <45 >
##$BF1= 250.13
##$BF2= 250.13
##$BF3= 250.13
##$BF4= 250.13
##$BF5= 500.13
##$BF6= 500.13
##$BF7= 500.13
##$BF8= 500.13
##$BYTORDA= 1
##$CFDGTYP= 0
##$CFRGTYP= 5
##$CHEMSTR= <none>
##$CNST= (0..31)
1 1 145 1 1 1 1 1 1 1 1 1 1 1 1 1 1 1 1 1 1 1 1 1 1 1 1 1 1 1 1 1 
##$CPDPRG= <>
##$CPDPRG1= <>
##$CPDPRG2= <>
##$CPDPRG3= <>
##$CPDPRG4= <mlev>
##$CPDPRG5= <mlev>
##$CPDPRG6= <mlev>
##$CPDPRG7= <mlev>
##$CPDPRG8= <mlev>
##$CPDPRGB= <>
##$CPDPRGT= <>
##$D= (0..31)
0 1 0 0 0 0 0 0 0 0.06 0 0 0 0 0 0 0.0002 0 0 0 0 0 0 0 0 0 0 0 0 0 0 
0 
##$DATE= 1123684777
##$DBL= (0..7)
120 120 120 120 120 120 120 120 
##$DBP= (0..7)
150 150 150 150 150 150 150 150 
##$DBP07= 0
##$DBPNAM0= <>
##$DBPNAM1= <>
##$DBPNAM2= <>
$$ [...]
##$SUBNAM7= <"">
##$SUBNAM8= <"">
##$SUBNAM9= <"">
##$SW= 20.6930455092707
##$SWIBOX= (0..15)
0 0 3 0 0 0 0 0 0 0 0 0 0 0 0 0 
##$SW_h= 5175.983436853
##$TD= 65536
##$TD0= 1
##$TE= 295.16
##$TE2= 300
##$TE3= 300
##$TEG= 300
##$TL= (0..7)
0 120 120 120 120 120 120 120 
##$TP= (0..7)
150 150 150 150 150 150 150 150 
##$TP07= 0
##$TPNAME0= <>
##$TPNAME1= <>
##$TPNAME2= <>
##$TPNAME3= <>
##$TPNAME4= <>
##$TPNAME5= <>
##$TPNAME6= <>
##$TPNAME7= <>
##$TPOAL= (0..7)
0.5 0.5 0.5 0.5 0.5 0.5 0.5 0.5 
##$TPOFFS= (0..7)
0 0 0 0 0 0 0 0 
##$TUNHIN= 0
##$TUNHOUT= 0
##$TUNXOUT= 0
##$USERA1= <user>
##$USERA2= <user>
##$USERA3= <user>
##$USERA4= <user>
##$USERA5= <user>
##$V9= 5
##$VALIST= <valist>
##$VCLIST= <CCCCCCCCCCCCCCC>
##$VD= 0
##$VDLIST= <DDDDDDDDDDDDDDD>
##$VPLIST= <PPPPPPPPPPPPPPP>
##$VTLIST= <TTTTTTTTTTTTTTT>
##$WBST= 1024
##$WBSW= 4
##$XGAIN= (0..3)
0 0 0 0 
##$XL= 0
##$YL= 0
##$YMAX_a= 330811
##$YMIN_a= -475574
##$ZGOPTNS= <>
##$ZL1= 120
##$ZL2= 120
##$ZL3= 120
##$ZL4= 120
##$ABSF1= 16.522
##$ABSF2= -4.171173
##$ABSG= 5
##$ABSL= 3
##$ALPHA= 0
##$AQORDER= 0
##$ASSFAC= 0
##$ASSFACI= 0
##$ASSFACX= 0
##$ASSWID= 0
##$AUNMP= <proc_1d>
##$AZFE= 0.1
##$AZFW= 0.1
##$BCFW= 0
##$BC_mod= 0
##$BYTORDP= 0
##$COROFFS= 0
##$CY= 12.5
##$DATMOD= 1
##$DC= 0
##$DFILT= <>
##$DTYPP= 0
##$F1P= 14.0000005364418
##$F2P= -0.99999901652339
##$FCOR= 0.5
##$FTSIZE= 32768
##$FT_mod= 6
##$GAMMA= 0
##$GB= 0
##$INTBC= 1
##$INTSCL= 1
##$ISEN= 128
##$LB= 0.3
##$LEV0= 0
##$LPBIN= 0
##$MAXI= 10000
##$MC2= 0
##$MEAN= 0
##$ME_mod= 0
##$MI= 0
##$NCOEF= 0
##$NC_proc= -5
##$NLEV= 6
##$NOISF1= 0
##$NOISF2= 0
##$NSP= 0
##$NTH_PI= 0
##$NZP= 0
##$OFFSET= 16.522
##$PC= 1
##$PHC0= -102.5697
##$PHC1= 20.26001
##$PH_mod= 1
##$PKNL= yes
##$PPARMOD= 0
##$PSCAL= 4
##$PSIGN= 0
##$REVERSE= no
##$SF= 250.13
##$SI= 32768
##$SIGF1= 0
##$SIGF2= 0
##$SINO= 400
##$SIOLD= 32768
##$SREGLST= <1H.DMSO>
##$SSB= 0
##$STSI= 32768
##$STSR= 0
##$SW_p= 5175.98343685301
##$SYMM= 0
##$S_DEV= 0
##$TDeff= 65536
##$TDoff= 0
##$TI= <Analysis number 999999
Compound Code 99
Book Reference 9
Project Code 9>
##$TILT= no
##$TM1= 0
##$TM2= 0
##$TOPLEV= 0
##$USERP1= <user>
##$USERP2= <user>
##$USERP3= <user>
##$USERP4= <user>
##$USERP5= <user>
##$WDW= 1
##$XDIM= 32768
##$YMAX_p= 536399400
##$YMIN_p= -281726
$$ End of Bruker specific parameters
$$ ---------------------------------
##NTUPLES= NMR SPECTRUM
##VAR_NAME=  FREQUENCY,     SPECTRUM/REAL,   SPECTRUM/IMAG
##SYMBOL=    X,             R,               I
##VAR_TYPE=  INDEPENDENT,   DEPENDENT,       DEPENDENT
##VAR_FORM=  AFFN,          ASDF,            ASDF
##VAR_DIM=   32768,         32768,           32768
##UNITS=     HZ,            ARBITRARY UNITS, ARBITRARY UNITS
##FACTOR=    0.157963299565203, 1,           1
##FIRST=     4132.6476996994, 0,             0
##LAST=      -1043.33573715361, 0,           0
##MIN=       -1043.33573715361, -281726,     0
##MAX=       4132.6476996994, 536399400,     0
$$ Real data points
##PAGE= N=1
##DATA TABLE= (X++(R..R)), XYDATA
$$ [...]
17904E89649k2340L9728K1811k1975n750L2126L3810N498M21j3057l5062n2736
17892E72123J2316M6385J5358J7907m3657p237L7598L4681J627L143r75j8921
17880F70348l4890j9110M5631K2847M6049k8993j722m0622o4577j3196M2215j4224
17868F09756J1104O1165N877m0607n698K9047L7259J8503m3065n7512n0852R300
17856E84277N6910J0295J1366K9116P878J9185L6554j8830o2225K6330J2115j0327
17844G02644j1245m533j0075n4574J2826M4067K5919k7150j7475j0800J8034K9602
17832F97240O6200J869j1431m5906j0173r106k9661L6019J7068l0178q855O3418
17820G36504l9174Q565L0126j6381R7p6268k9287j207L6210N5034L1999k9213
$$ y = [589649, 567309, 607037, 628848, 606873, 601123, 633249, 667059, 672557, 672978, 659921, 624859, 572123, 584439, 630824, 646182, 664089, 620432, 613195, 650793, 685474, 687101, 690244, 689269, 670348, 635458, 616348, 661979, 684826, 730875, 701882, 700160, 659538, 594961, 581765, 623980, 609756, 620860, 682025, 687902, 647295, 641597, 670644, 707903, 726406, 683341, 625829, 574977, 584277, 641187, 651482, 662848, 691964, 699842, 719027, 755581, 736751, 674526, 700856, 712971, 702644, 691399, 686866, 676791, 622217, 635043, 679110, 705029, 677879, 660404, 649604, 667638, 697240, 763440, 765309, 753878, 707972, 697799, 688693, 659032, 695051, 712119, 681941, 673086, 736504, 697330, 705895, 736021, 719640, 719737, 643469, 614182, 612975, 649185, 704219, 736218, 707005]
17808G07005R51K1817k0058K798M7609N991N0587N4177k982L669l8867k0255M7893
17795H60335R341m0095N6312M9609m9923p5594O799l169l5662k1880R433K0279
17783G85785N1301J1908j3281l5453j4265M1339l1620n4680K0696J8480j4040
17772G66170j5942j0826K9482j6207J3831L5975P7166P5185k8946k3902K1557
17761I23543k0249k7484M2056N921j3640o5401l2340L6734J1331K9577l6446j5266
17749H38336J3851K5857M0431N6058n770n223l5162K5906n8559n3298p480L1591
17737H66538P129K6827O568J7044R729J5189j0758M3098K8959k0598k6802m6380
17725I16543K4981L6119R765J2087J1345p905j3661J6478j7783p95J9974r03M7244
$$ y = [707005, 707956, 729773, 709715, 712513, 760122, 766113, 816700, 870877, 867895, 871564, 832697, 812442, 860335, 869676, 829581, 885893, 935502, 885579, 809985, 816784, 813615, 777953, 756073, 765506, 785785, 837086, 848994, 835713, 800260, 785995, 827334, 795714, 741034, 761730, 780210, 766170, 750228, 739402, 768884, 752677, 766508, 802483, 879649, 954834, 925888, 901986, 923543, 903294, 875810, 917866, 923787, 910147, 844746, 812406, 849140, 860471, 890048, 853602, 838336, 852187, 878044, 918475, 974533, 968763, 963540, 928378, 954284, 895725, 842427, 834947, 866538, 873667, 900494, 907062, 924106, 933835, 949024, 938266, 981364, 1010323, 989725, 962923, 916543, 941524, 977643, 987408, 999495, 1010840, 1002935, 989274, 1005752, 987969, 987174, 1007148, 1006245, 1053489]
17712A053489M7449j0955P076l3407j0427N073j871M90k4329l4255L305j394n1659
17699I48585L4877K7622j3048K9018J3610K649L3264l0551j6865M309M363l781
17687A034052k5856j3923j950N5459J5074j7520J3878J5008J4766o4318N172L2809
17675A062651M5012K6786J7173j1289J144o249L1949N6746O040m4102J5045M4648
17663A245554k2564k5071o295J6036n6762k9856k3521m7197P8993P0806N631j6689
17651A189065K4232K023Q2L9509r293n781r588k6459O6012L5303L6816J8692n7029
17638A303584n1634o911J4140j6320k9763l6936k1824L3108M5390N1570O372M7049
17626A337825L5877P158j0523K0031j9362j7322k4544j0398J3979J189n156m122
$$ y = [1053489, 1100938, 1089983, 1097059, 1063652, 1053225, 1058298, 1056427, 1056917, 1032588, 998333, 1001638, 1000244, 948585, 983462, 1011084, 998036, 1027054, 1040664, 1043313, 1076577, 1046026, 1029161, 1033470, 1037833, 1034052, 1008196, 994273, 992323, 1047782, 1062856, 1045336, 1059214, 1074222, 1088988, 1024670, 1029842, 1062651, 1107663, 1134449, 1151622, 1140333, 1141477, 1135228, 1167177, 1223923, 1229963, 1185861, 1200906, 1245554, 1222990, 1197919, 1191624, 1207660, 1150898, 1121042, 1097521, 1050324, 1129317, 1200123, 1205754, 1189065, 1213297, 1215320, 1215402, 1254911, 1245618, 1239837, 1230249, 1203790, 1269802, 1305105, 1341921, 1360613, 1303584, 1251950, 1245039, 1259179, 1242859, 1213096, 1176160, 1154336, 1187444, 1232834, 1284404, 1290776, 1337825, 1373702, 1380860, 1370337, 1390368, 1371006, 1353684, 1329140, 1318742, 1332721, 1333910, 1328754, 1324632]
17614A324632K3988j5084j5720P728J2874M5346j3408l1205J5616J8289K0851
17603A393907K3547l6485J9075L3636m8701K3410j7649n7837M1428L3296l81J9597
17591A426843K1043L4971m8481l1438K4227K0649k4394O1714M0373K9107m0051
17580A514563L0265O719J7358k0605m008K1516j8505k4175k401K2554K3775J4271
17568A581327J4272K4095N322o900j1365p71K0041O8653M8618J5440K6841K083
17556A787656l2075j02214k161M6930L0620K2017L398o1265m8548L3172J7947
17545A695477J6756N8902j6374k0601K1294N7711O0744j0281o897k0754k9851
17534A806126N58Q176J9605j4661j3192K8280N4137j1189Q64m9634k77P3321K4451
$$ y = [1324632, 1348620, 1333536, 1317816, 1325544, 1338418, 1383764, 1370356, 1339151, 1354767, 1373056, 1393907, 1417454, 1380969, 1400044, 1433680, 1384979, 1408389, 1390740, 1332903, 1374331, 1407627, 1407246, 1426843, 1447886, 1482857, 1434376, 1402938, 1427165, 1447814, 1423420, 1485134, 1525507, 1554614, 1514563, 1544828, 1551547, 1568905, 1548300, 1544292, 1565808, 1547303, 1523128, 1520727, 1543281, 1567056, 1581327, 1595599, 1619694, 1625016, 1618116, 1606751, 1605980, 1626021, 1694674, 1743292, 1758732, 1785573, 1787656, 1755581, 1653367, 1651206, 1698136, 1728756, 1750773, 1754171, 1692906, 1644358, 1677530, 1695477, 1712233, 1771135, 1754761, 1734160, 1755454, 1813165, 1873909, 1863628, 1856731, 1835977, 1806126, 1806684, 1814860, 1834465, 1819804, 1806612, 1834892, 1889029, 1877840, 1878704, 1829070, 1828793, 1902114, 1926565]
17521A926565l4868K4306M7060j9771p513M0500j7131N4081l221l7397M0464j1212
17509B001863J2635J7983J9511k0306j3594J1012J5930L9414M3175K4281P828
17498B159732l1104k8506J4054J2681M2612L3042K5876K7790L9373J1096k0861
17487B285785k912p401R044L3438l3284K1129N6093j7690N1928L5917j9837m0166
17475B372044O903K7757O0589M1257l6487j8303J9952k6022J6133N2211M4022
17464B560056M2072p662j5579M835J2006L5514L274n284J5557K2234J5010O1819
17452B743852M0359l769J4966j2032k9290J8329J06j3251K3909N1878L4110R725
17440B878892L8395M2260L2148K9183l3130J3833K2689J6503J9658M8279O7248
$$ y = [1926565, 1891697, 1916003, 1963063, 1943292, 1935779, 1976279, 1959148, 2013229, 2010008, 1972611, 2013075, 2001863, 2014498, 2032481, 2051992, 2031686, 2018092, 2029104, 2045034, 2084448, 2127623, 2151904, 2159732, 2128628, 2100122, 2114176, 2126857, 2169469, 2202511, 2228387, 2256177, 2295550, 2306646, 2285785, 2282873, 2275472, 2284516, 2317954, 2284670, 2305799, 2361892, 2344202, 2396130, 2432047, 2412210, 2372044, 2378947, 2406704, 2467293, 2508550, 2472063, 2453760, 2473712, 2447690, 2463823, 2516034, 2560056, 2602128, 2594466, 2578887, 2583722, 2595728, 2631242, 2634516, 2629232, 2644789, 2667023, 2682033, 2743852, 2784211, 2780442, 2795408, 2783376, 2754086, 2772415, 2772521, 2759270, 2783179, 2835057, 2869167, 2878892, 2917287, 2959547, 2991695, 3020878, 2987748, 3001581, 3024270, 3040773, 3060431, 3108710, 3175958]
17429C175958m1985J6326K7215M1908O4908L2760N0282J1952J6280K0677p580
17418C408701N6709R2960M6317K2623j7109M8464Q2317L2534N1805K7650O3012
17407C915983Q3359P2499o089k3868J6779K1176O3714M3070M319k0025J0490J0561
17395D191968j4543O094n937m1563J0346J5478p539J2089L0893K5135l867J6707
17383D235261J8197J2680M9092o5475R467M3823m638l0157J5165L9547P1809l578
17371D391193N5407Q0697P8681l8647o394J5134K8841Q0445K4664N863O002P395
17359D729281K2365K8244J0235L146M7764R7021N5421K8755k3681Q485L6005Q0055
17347E123096Q3137J5883k4567m3766N5204Q9481O8684L9416J1507J4838L1295
$$ y = [3175958, 3133973, 3150299, 3177514, 3219422, 3284330, 3317090, 3367372, 3379324, 3395604, 3416281, 3408701, 3465410, 3558370, 3604687, 3627310, 3610201, 3658665, 3740982, 3773516, 3825321, 3852971, 3915983, 3999342, 4071841, 4065752, 4041884, 4058663, 4079839, 4143553, 4186623, 4190942, 4170917, 4181407, 4191968, 4177425, 4183519, 4177582, 4136019, 4146365, 4161843, 4154304, 4166393, 4197286, 4222421, 4218554, 4235261, 4253458, 4266138, 4315230, 4249755, 4259222, 4303045, 4298407, 4268250, 4283415, 4322962, 4394771, 4391193, 4446600, 4527297, 4605978, 4567331, 4560937, 4576071, 4604912, 4685357, 4710021, 4715884, 4721886, 4729281, 4751646, 4779890, 4790125, 4793271, 4841035, 4938056, 4993477, 5022232, 4998551, 5007036, 5043041, 5123096, 5206233, 5222116, 5197549, 5153783, 5208987, 5298468, 5367152, 5406568, 5418075, 5432913, 5464208]
17336E464208P5593N8222l6138K3782J02938K0634j27O6422J22584P2007K9157
17325E999282j4028N0461K5226j4747J9852Q2248Q8593Q1977N5068N6728O4322
17314F494982N6423J04799O3710P1830M2044Q224O9887Q3414J13362N2356K5182
17303G186213K8496L6331R9081J03439J24865R7290M4734K3501O3083Q5318N9775
17292G952126M2469P7859J25776O1292N3943Q3982J00709R1645P7572J06294J33826
17281H907493J41711P9608O7377Q1410J07499O0497P9306J13421J55219J04746
17271I898287R6221P2119J40109J19263J03871J26257J39657J09585J03198J63689
17261A1072256J92952J80094J23696J53455J35786J15937J15075J71541J45002
$$ y = [5464208, 5539801, 5598023, 5561885, 5585667, 5688605, 5709239, 5709112, 5775534, 5898118, 5970125, 5999282, 5985254, 6035715, 6060941, 6046194, 6066046, 6148294, 6236887, 6318864, 6373932, 6430660, 6494982, 6551405, 6656204, 6719914, 6791744, 6833788, 6842012, 6911899, 6995313, 7108675, 7161031, 7186213, 7214709, 7251040, 7350121, 7453560, 7578425, 7675715, 7720449, 7743950, 7807033, 7892351, 7952126, 7994595, 8072454, 8198230, 8259522, 8313465, 8397447, 8498156, 8589801, 8667373, 8773667, 8907493, 9049204, 9128812, 9196189, 9277599, 9385098, 9445595, 9524901, 9638322, 9793541, 9898287, 9994508, 10066627, 10206736, 10325999, 10429870, 10556127, 10695784, 10805369, 10908567, 11072256, 11265208, 11445302, 11568998, 11722453, 11858239, 11974176, 12089251, 12260792, 12405794]
17252A2405794J22962J61329J75592J47165K07471K04480J92164J59007J60929
17243A3936893J92838K24236J73100K02946K03887K49695J61017J45599K23926
17234A5714137K23794K20440K33683J90594K47165L30519K47617K29199K59272
17225A7896420L38376K88871L35762K50218K22390L22052K76619K96520L07285
17216B0534513L44051L30453L35049L60839M00856L52222L66521M16658M05872
17207B3847034M37641L72377M53198M71389M84440M94600M82558N12420N69644
17198B8125301N54982N18882N96581O44231O43966O37936O53234O51524O85807
17189C3712444O53528P74822P95637P69663Q55809Q60942Q49703R13853R06311
$$ y = [12405794, 12528756, 12690085, 12865677, 13012842, 13220313, 13424793, 13616957, 13775964, 13936893, 14129731, 14353967, 14527067, 14730013, 14933900, 15183595, 15344612, 15490211, 15714137, 15937931, 16158371, 16392054, 16582648, 16829813, 17160332, 17407949, 17637148, 17896420, 18234796, 18523667, 18859429, 19109647, 19332037, 19654089, 19930708, 20227228, 20534513, 20878564, 21209017, 21544066, 21904905, 22305761, 22657983, 23024504, 23441162, 23847034, 24284675, 24657052, 25110250, 25581639, 26066079, 26560679, 27043237, 27555657, 28125301, 28680283, 29199165, 29795746, 30439977, 31083943, 31721879, 32375113, 33026637, 33712444, 34365972, 35140794, 35936431, 36706094, 37561903, 38422845, 39272548, 40186401, 41092712]
17180D1092712Q91194R34846J011676J084503J157146J160873J147560J210456
17172D9690966J220900J306957J335301J387827J412111J474936J604637J645564
17164F1079199J670253J726830J811947J850974J924406J956022K051874K160519
17156G6232024K243678K294288K402252K470853K568810K618282K671009K761238
17148I6262434K866026K957072K998177L077969L192468L221525L211628L282406
17140A21069705L343682L385258L407025L380612L345130L363936L338507L233539
17132A47867394L140208L003245K879180K681072K488175K263974J990428J707655
17124A68021331J391460J190280Q52958M60880R1267j99379n73819r38984j278101
$$ y = [41092712, 41983906, 42918752, 43930428, 45014931, 46172077, 47332950, 48480510, 49690966, 50911866, 52218823, 53554124, 54941951, 56354062, 57828998, 59433635, 61079199, 62749452, 64476282, 66288229, 68139203, 70063609, 72019631, 74071505, 76232024, 78475702, 80769990, 83172242, 85643095, 88211905, 90830187, 93501196, 96262434, 99128460, 102085532, 105083709, 108161678, 111354146, 114575671, 117787299, 121069705, 124413387, 127798645, 131205670, 134586282, 137931412, 141295348, 144633855, 147867394, 151007602, 154010847, 156890027, 159571099, 162059274, 164323248, 166313676, 168021331, 169412791, 170603071, 171456029, 171916909, 172008176, 171808797, 171234978, 170295994, 169017893]
17115A69017893j606347j916228k198868k446969k723735k916098l035177l151827
17107A49022644l383429l551158l558837l662312l650714l631951l679886l665079
17099A20239278l570242l620032l578976l467695l335958l280717l209353l112301
17091I3064004l032948k929173k851518k729863k630779k643541k478564k284378
17083G1483240k301121k244333k171473k080936j972097j838517j854263j763396
17075E5257104j692401j673303j556084j510797j482679j391288j329939j275898
17067D3344715j216508j219748j171848j076211j019703j055547j041725r45388
17059C4598037r26837q88519q31729q21749p88946p33073p21990p70038p23478
$$ y = [169017893, 167411546, 165495318, 163296450, 160849481, 158125746, 155209648, 152174471, 149022644, 145639215, 142088057, 138529220, 134866908, 131216194, 127584243, 123904357, 120239278, 116669036, 113049004, 109470028, 106002333, 102666375, 99385658, 96176305, 93064004, 90031056, 87101883, 84250365, 81520502, 78889723, 76246182, 73767618, 71483240, 69182119, 66937786, 64766313, 62685377, 60713280, 58874763, 57020500, 55257104, 53564703, 51891400, 50335316, 48824519, 47341840, 45950552, 44620613, 43344715, 42128207, 40908459, 39736611, 38660400, 37640697, 36585150, 35543425, 34598037, 33671200, 32782681, 31950952, 31129203, 30340257, 29607184, 28885194, 28115156, 27391678]
17050B7391678p12520o69508o01762n76310n96768n57427n38030n12807n40746
17041B2085800m98515m59927m60944m35965m14782m16407l70249m40963m42284
17032A8145764m31251l92320l61311l22156l21393k70655k63902k89133k95747
17023A5197896k52295l26994l11568k77659k82698k40880k55620k44430k56000
17014A2749752k45963j86150k15728k60986k20473k04194j43384j86791j67474
17005A0918609j40850j77312k33901j79582j09286j48552j48671j46213j38281
16996I495961j49791j47774j52504j62300j14477j15730j06651j14522j25140
16987H307072j65066j23145p6214j06904j18606j79113j08297p4868r7293q3443
$$ y = [27391678, 26679158, 26009650, 25407888, 24831578, 24234810, 23677383, 23139353, 22626546, 22085800, 21587285, 21127358, 20666414, 20230449, 19815667, 19399260, 19029011, 18588048, 18145764, 17714513, 17322193, 16960882, 16638726, 16317333, 16046678, 15782776, 15493643, 15197896, 14945601, 14618607, 14307039, 14029380, 13746682, 13505802, 13250182, 13005752, 12749752, 12503789, 12317639, 12101911, 11840925, 11620452, 11416258, 11272874, 11086083, 10918609, 10777759, 10600447, 10366546, 10186964, 10077678, 9929126, 9780455, 9634242, 9495961, 9346170, 9198396, 9045892, 8883592, 8769115, 8653385, 8546734, 8432212, 8307072, 8142006, 8018861, 7942647, 7835743, 7717137, 7538024, 7429727, 7354859, 7257566, 7174123]
16977G174123r1254j89424j34706n9525m8284j10025j29903m7014r5476j36764
16967F131748l0763m4136r1402n1794j26346j28289o2841k6541r5570j16102j06315
16956E251649o4138o1280k1141n2680j00139m7516k8516q0548m8438m6592r3752
16945D606909r1224o8814l102l5003m2852p4976o4578o0651o4148o8282p2592
16934C960687J0081k5098m2016m0216l2307k6476j7702N960m2623l8169K115o9921
16922C644315j27650r1647n2653k1949k29l71J4820j5390o4041p9290o3726l6394
16910C105795k8386l0360l2302m1952k5398l009J7049m7077l8017m0020r2103
16899B744220j32810k4144N1796K0752J9841n614K0010L4313l6038r1061j19985
$$ y = [7174123, 7082869, 6893445, 6758739, 6699214, 6650930, 6540905, 6411002, 6363988, 6268512, 6131748, 6100985, 6056849, 5965447, 5913653, 5787307, 5659018, 5596177, 5569636, 5474066, 5357964, 5251649, 5187511, 5126231, 5105090, 5052410, 4952271, 4904755, 4876239, 4795691, 4747253, 4700661, 4606909, 4515685, 4446871, 4443769, 4408766, 4365914, 4290938, 4226360, 4165709, 4101561, 4033279, 3960687, 3970768, 3945670, 3903654, 3863438, 3831131, 3804655, 3786953, 3792913, 3750290, 3712121, 3714236, 3644315, 3516665, 3425018, 3372365, 3350416, 3350187, 3349816, 3364636, 3349246, 3285205, 3205915, 3142189, 3105795, 3077409, 3047049, 3014747, 2972795, 2947397, 2944388, 2961437, 2914360, 2876343, 2836323, 2744220, 2611410, 2587266, 2639062, 2659814, 2679655, 2674041, 2694051, 2728364, 2692326, 2601265, 2481280]
16888B481280p5318l081P8092N0504j2843n5708o1154m4207j5372Q482j2037l7539
16876B301099k6458p6758k0217K892k0039q194l5088m1715r908O175l7219l9114
16864A995456j7695j0098K1106L2821J8444j6743k0641O003l045q662k4013k056
16852A970877L9311k4089l2288O4271J0639l0828K5364L2913l524N2776N823n6541
16840B054704o5938L0036K9215l6399n1011n1577n900J4292L2665m6742j24939
16829A778406p3987J6130L0073l9245l296l3319m7650l0768j9957j1411l0016
16818A534960M438n444m6434k6320m7959o3415j3889l1271l8435K3379M326J1746
16806A305682j8704m0131k4108k1483L498k2089N271m5666J4216j1650l6592k3711
$$ y = [2481280, 2405962, 2402881, 2480973, 2531477, 2518634, 2462926, 2401772, 2357565, 2342193, 2350675, 2338638, 2301099, 2274641, 2197883, 2177666, 2180558, 2160519, 2152325, 2117237, 2075522, 2065614, 2071789, 2034570, 1995456, 1977761, 1967663, 1988769, 2021590, 2040034, 2023291, 2002650, 2008653, 2005608, 1996946, 1972933, 1970877, 2010188, 1986099, 1953811, 2018082, 2028721, 1997893, 2023257, 2056170, 2052646, 2105422, 2111245, 2054704, 1988766, 2018802, 2048017, 2011618, 1960607, 1909030, 1903130, 1917422, 1950087, 1903345, 1778406, 1704419, 1720549, 1750622, 1711377, 1708081, 1674762, 1627112, 1596344, 1576387, 1564976, 1534960, 1539398, 1533954, 1487520, 1461200, 1413241, 1349826, 1335937, 1304666, 1266231, 1289610, 1293936, 1305682, 1286978, 1246847, 1222739, 1201256, 1204754, 1182665, 1187936, 1142270, 1156486, 1144836, 1108244, 1084533]
16794A084533k2144l2398l6249j5585M3368j0348o292P853j9969j6870m777R577
16782I80699L9492n1333m1866r350L559L641M1061M3015n2576o0526J1247Q47
16770I07910j2282m0134n0602J6428L3052k7856n6100j5990M6366m249N230K4177
16758H25950p496k2295L5156J5051m198j5496j4996l1425m897l2957k4875J9929
16746G37451P7241K0285l8012j327J5843j0808q1905o9894K4194n457J7949N8151
16734G43711n311j6076O658k6976j8158L814j9624Q361j3624n628q2893o7073
16722E07181l2078J9050P892J8007N8440O186j4635M4804M9432o8188m8835M1154
16710E88410L5044j7147m9964k6491K1271o0151j3387J2391K0799l2913j1117
$$ y = [1084533, 1062389, 1029991, 993742, 978157, 1021525, 1011177, 1004885, 1012738, 992769, 975899, 971122, 980699, 1020191, 968858, 926992, 917642, 921201, 924842, 965903, 1008918, 956342, 895816, 907063, 907910, 895628, 855494, 804892, 821320, 854372, 826516, 770416, 754426, 800792, 796543, 801773, 825950, 818454, 796159, 831315, 846366, 842168, 826672, 811676, 780251, 775354, 742397, 717522, 737451, 814692, 834977, 796965, 795638, 811481, 800673, 718768, 648874, 673068, 667611, 685560, 743711, 738400, 722324, 728982, 702006, 683848, 687662, 668038, 676399, 662775, 657147, 574254, 507181, 475103, 494153, 502045, 520052, 578492, 584678, 570043, 614847, 664279, 596091, 547256, 588410, 623454, 606307, 556343, 529852, 551123, 490972, 477585, 489976, 510775, 477862, 466745]
16699D66745J0940p221K575J3756p447J0619k299L815K0536J8200k6954K2769
16687E26034k6846l2780l7689L4509P5572L8387m1849k8121R204j0672J2521J0233
16675E28503m323l0138K20o26j7957m9779K9197O7195m5500l2626K8897m1419
16663D31644J5700R150n6173n6460K846J9601K636k5111L4605L6966K1924L5353
16651D72681j0660l3489Q963J3232l222l4409k700J8809k2608j3832L4397j8659
16639D08503l3104J5584k1457k777o394J3745K4246J6855j938j5047j8007n48
16627C79661j7833j6162K3259j9147m7710P36J868j1473p735j2634r239o100m5766
16614B11725N1359J7370m35m08J8218J6048k4955l1597N122M0496n073J7627N7987
$$ y = [466745, 477685, 470464, 473039, 486795, 479348, 489967, 487668, 491483, 512019, 530219, 503265, 526034, 499188, 466408, 428719, 463228, 538800, 577187, 535338, 507217, 516421, 505749, 518270, 528503, 524180, 494042, 494262, 493636, 475679, 425900, 455097, 522292, 476792, 444166, 473063, 431644, 447344, 456494, 400321, 343861, 346707, 366308, 368944, 343833, 378438, 415404, 437328, 472681, 462021, 428532, 437495, 450727, 447505, 413096, 410396, 429205, 406597, 392765, 427162, 408503, 375399, 390983, 369526, 366749, 360355, 374100, 398346, 415201, 413263, 398216, 380209, 379661, 361828, 345666, 368925, 349778, 302068, 302804, 304672, 293199, 285464, 272830, 263591, 257491, 211725, 263084, 280454, 280019, 279611, 297829, 313877, 288922, 257325, 262447, 302943, 297870, 315497, 373484]
16601C73484K8765k1323k2827m7922M342K6359o0111m7321J409J1770K3749n3854
16589B16520j8726M3142K6713l359r32R920M504k9465K1182j5330m599O639K5605
16576B81814n0582l5438K349J4668N6259P3855l3895j6517k643K2450r339n3863
16564B49118n083K0106J7649L0772K4770o891p226l550m6782o6962m402j2196
16552A89323K6141M9217j0233l0485J030J0284j0748k375J372j6239m3151N0607
16540B14743P3944K08k7041q734o182J2482j4058l8370O897K0473K171m1594n4716
16527A40223l9131O1678P2358L654J597J5053R336j0194l7078j7948N0767J1422
16515B61737K3899q385j0760p547M0110J4058K4328o908j9353m9371n2169p0017
$$ y = [373484, 402249, 380926, 358099, 310177, 314519, 340878, 280767, 233446, 234855, 246625, 270374, 216520, 197794, 240936, 267649, 264290, 263358, 273278, 277782, 248317, 269499, 254169, 249570, 256209, 281814, 231232, 195794, 198143, 212811, 269070, 342925, 309030, 292513, 289870, 312320, 302981, 249118, 244035, 264141, 281790, 312562, 337332, 330441, 323215, 319665, 272883, 205921, 201519, 189323, 215464, 264681, 254448, 223963, 224993, 235277, 224529, 222154, 223526, 207287, 164136, 214743, 288687, 288895, 261854, 253120, 246938, 259420, 245362, 206992, 213889, 234362, 236533, 194939, 140223, 101092, 162770, 235128, 238782, 240379, 255432, 264768, 254574, 217496, 199548, 250315, 261737, 285636, 277251, 266491, 258944, 299054, 313112, 337440, 330532, 311179, 261808, 209639, 139622]
16503A39622n7368j2550M6212K48m4744l56Q4676M1539J7484k2248k9772R984
16491A72727N8676J7740k9575K5502L4656k1735l9973j0457N944L4482L7879k4047
16479B61819j740l1010k8108k724K0890J459l872m1790n5437L8282L9646K0959
16467B18374K0502k1852K5912j5205k9648M0225n875o7954r4717J802O6799O9470
16455B07833P193j3494l1428j993L8436N4814j0286l6651l2111P2457K1746J9350
16443B95866k772p0010j9598j5836R389k1783J1264n0445n4752J2560J0576N6182
16431A60641K0719N011J5041j1757m320O245J916K2111j9691j2147l8127l7893
16419A07749K8068Q1972M8604K1448j896m9642m7599L3922L304j9523k1639j6496
$$ y = [139622, 82254, 69704, 115916, 116164, 71420, 71064, 155740, 197279, 214763, 192515, 162743, 172727, 231403, 249143, 219568, 245070, 279726, 257991, 218018, 207561, 213505, 247987, 285866, 261819, 260079, 229069, 200961, 198237, 219127, 220586, 216714, 174924, 119487, 157769, 197415, 218374, 238876, 217024, 242936, 227731, 198083, 238308, 232433, 164479, 69762, 71564, 138363, 207833, 215026, 201532, 170104, 168111, 206547, 261361, 251075, 214424, 182313, 254770, 276516, 295866, 293094, 223084, 203486, 187650, 197039, 175256, 186520, 136075, 81323, 93883, 104459, 160641, 181360, 186371, 201412, 189655, 185335, 191580, 193496, 215607, 195916, 183769, 145642, 107749, 135817, 217789, 266393, 287841, 285945, 236303, 188704, 222626, 225930, 206407, 184768, 168272]
16407A68272J5940q797O820j1965O44M1290P2537j161q460k1854R462m1572j4386
16394B06770l0693K3095l1693j5720Q81K7395K3894m6470l9213J4676N2208n877
16382A79253J1758J7087j0466j348j7836M347J1458k284k7073j2948J1602n996
16370A57554m0q428r819j380J0505M0774N4923K5900m4167n8348Q104o006O5729
16357B35301M6021L6348j1551k3226k6487p0594l8757L3490P2723M8793K3891
16346C25952k2166n0041j1377J343o12P023J3363m7193l1209j0747P4940K7473
16334B76749J7903j2406R271Q614l8947K7451K9436j626L9336K0063k376m6311
16322C27157j2055M2840o245k7827K5811K351M26J3766J4902l4196P59j9888o4023
$$ y = [168272, 184212, 175415, 182235, 170270, 170914, 212204, 284741, 283580, 275120, 253266, 262728, 221156, 206770, 176077, 199172, 167479, 151759, 152640, 180035, 203929, 157459, 118246, 132922, 185130, 179253, 191011, 208098, 197632, 196284, 178448, 182795, 194253, 191969, 164896, 151948, 163550, 157554, 157514, 149086, 139267, 137887, 148392, 189166, 244089, 269989, 225822, 167474, 175578, 169572, 235301, 281322, 317670, 306119, 282893, 256406, 185812, 147055, 180545, 253268, 302061, 325952, 303786, 253745, 242368, 243711, 243099, 250122, 263485, 216292, 185083, 174336, 249276, 276749, 294652, 282246, 291517, 300131, 261184, 288635, 318071, 316445, 355781, 375844, 373468, 327157, 315102, 357942, 351697, 323870, 349681, 352032, 352458, 366224, 381126, 346930, 347689, 327801, 263778]
16309B63778j7837M129N5432Q121K8629R340l1012r587M0547Q283l2878q681l2152
16296B86112l127p534l1962n7596l260P0719k033j5214J3254K975J4424O2343
16284C29101j0943k38L8926N448l4052J1791p595k7784k5840m4997o0089k0476
16272A53252M5086j7297l8431P750M7959j0889k1027M0713J06500N3547o6795
16261C00368n4612M2283K3756n8735n4898k197K9458J4317k0143l3976k3519M214
16249A66316l259K9811J1502O125o790J4346j2461L3024N0934m725K8144n4645
16237B58322j3041K1079J2245L201K1541j4316j1883j1059j7367K2612K4875Q7854
16225C84063j2609l2266L630l5285J01J6044o684J1257O537J2449L3505l3129
$$ y = [263778, 245941, 250070, 305502, 313623, 342252, 351592, 320580, 310993, 351540, 359823, 326945, 318264, 286112, 282985, 275451, 243489, 185893, 182633, 253352, 251319, 236105, 249359, 252334, 266758, 329101, 318158, 317920, 356846, 362294, 328242, 340033, 332438, 304654, 278814, 233817, 173728, 153252, 198338, 181041, 142610, 150360, 198319, 187430, 166403, 207116, 313616, 367163, 300368, 245756, 288039, 311795, 253060, 198162, 195965, 225423, 239740, 219597, 185621, 162102, 166316, 163057, 192868, 204370, 210495, 203705, 218051, 205590, 238614, 289548, 284823, 312967, 258322, 245281, 266360, 278605, 281806, 303347, 289031, 277148, 266089, 248722, 271334, 296209, 384063, 371454, 339188, 342818, 307533, 307634, 323678, 316994, 328251, 334788, 347237, 380742, 347613]
16213C47613j2388L876m293j3605k5180M649M6328M3510j6820O200r666k4644
16201C45580j5173O6227K9606m5540m9638j4171p992L6154P0441R6751K1437j7538
16189E16144m0601K1109L0579j1160k5331L2658R2330L8276j2083l5493j0722
16178E95706j3503r475K2471P8775M5566L6305k3210M3573M519K0190p022J16157
16166I10052Q7652Q124R864J3946K056P489K3624L2026N0024M6310K0410j5349
16154A196228l756K0058r013j3136k7204k5253m6081p6831m9266j2594k6358j570
16142I25224l4936n9546j0188q61n3642m5837m093m0847m7018j3363k8421J8778
16130F05250L447n5161J3753R003M08k7859m3623m5422O804N4552j8853J7152
$$ y = [347613, 335225, 339101, 334808, 321203, 296023, 300672, 347000, 390510, 373690, 379890, 370224, 345580, 330407, 396634, 426240, 380700, 331062, 316891, 308899, 345053, 415494, 512245, 533682, 516144, 475543, 496652, 527231, 516071, 490740, 523398, 615728, 654004, 641921, 606428, 595706, 582203, 572728, 595199, 673974, 719540, 755845, 732635, 776208, 780727, 800917, 793895, 910052, 997704, 1005828, 1015692, 1029638, 1031694, 1039183, 1062807, 1094833, 1144857, 1191167, 1211577, 1196228, 1192472, 1212530, 1203517, 1190381, 1163177, 1137924, 1091843, 1015012, 965746, 953152, 926794, 925224, 890288, 830742, 820554, 819693, 766051, 720214, 716121, 675274, 628256, 614893, 586472, 605250, 608697, 553536, 567289, 576292, 576700, 548841, 505218, 459796, 466600, 521152, 502299, 519451]
16118E19451m2054j3374l2387r419J5207J6760k9683k1810M645k4813O1566J1141
16106D55230o0008L120K5548j8983n875J0986M382l1531J9076M3526J6088j0064
16094D51495L7121rm6579j1259L3056N9192n4563j00904p99N8R738N6608L8804
16081D71959p680n7024J0054l4029j3910J8748L1252O6855J7325l0022M315L8833
16069E16676l1532p1929J9262l5650M2002M1915l4403l1228n801j901l918L07
16057D03800k1171N6350J6980j1032k309m825J3458P3686j5568p2634N622m004
16045D38353l5848J7351J9280O4432k979k39l1591Q065M3806K0811n0982k0473
16033D69986K8815r492n2357K3532N1706J9535j5668K0040L1303L966K3375p100
$$ y = [519451, 477397, 464023, 431636, 422217, 437424, 454184, 424501, 402691, 407336, 382523, 444089, 455230, 395222, 398342, 423890, 404907, 399032, 410018, 414400, 382869, 401945, 445471, 461559, 451495, 488616, 488607, 442028, 430769, 463825, 523017, 468454, 367550, 366751, 366809, 376547, 433155, 471959, 464279, 407255, 417309, 383280, 369370, 388118, 419370, 486225, 503550, 473528, 477843, 516676, 485144, 413215, 432477, 396827, 438829, 480744, 446341, 415113, 409312, 407411, 403493, 403800, 382629, 438979, 455959, 444927, 442618, 437793, 451251, 524937, 509369, 436735, 442357, 438353, 402505, 419856, 439136, 503568, 500589, 500350, 468759, 476824, 520630, 541441, 490459, 469986, 498801, 489309, 436952, 460484, 512190, 531725, 516057, 536097, 567400, 571366, 594741, 587641]
16021E87641k225K5964O77j6718R955k8145l6925M0600M4458J1217k4354m0191
16009E71954O957K9234K9453L5325m9502p4030k0915K8865J7884M2211K5399n2243
15997E90592m0456l3698l6316K6720M9030O3897J6152o4182J7582M1598m3884
15986E87035n5533O8010L980j3251J8035M3398K8589K4533M344M5432n7159j7187
15974F80226M350m4616j0335N1659l0882l8126k2388J1476M0986J5174j5784k3733
15962F18007N0719P5275m2339L1056R439j889L0518l3280K3779k550K9751Q5192
15950H73678N189o8987n7101M5348L3084k5142L6682r79l224K175j8976K7777
15938H49524K1587l8565N987J4200J1144J7571j9062M5442N9797J2094l5507o859
$$ y = [587641, 585416, 611380, 612057, 595339, 605294, 577149, 540224, 580824, 625282, 636499, 612145, 571954, 578911, 608145, 637598, 672923, 623421, 549391, 528476, 557341, 575225, 617436, 642835, 590592, 550136, 516438, 480122, 506842, 555872, 619769, 635921, 571739, 589321, 630919, 587035, 531502, 599512, 603492, 590241, 608276, 651674, 680263, 704796, 709140, 754572, 697413, 680226, 684576, 639960, 629625, 681284, 650402, 612276, 589888, 601364, 642350, 657524, 641740, 618007, 668726, 744001, 701662, 732718, 742157, 740268, 770786, 737506, 761285, 758735, 788486, 873678, 878867, 809880, 752779, 798127, 831211, 806069, 842751, 841772, 838548, 840723, 821747, 849524, 871111, 832546, 838533, 852733, 863877, 881448, 862386, 907828, 967625, 979719, 944212, 937353]
15926I37353J1686k469k9852p2576K3974P7583O1871k4907K4271J1975O0965j0562
15914A069312k5514k0316k4991k234P2691J0741L550m580j7661K3062J4883P721
15902A106664J9126R553Q030L549j0049r286M6609q863r0389o4470q982N5439
15890A056931N4726N6400M1192K0379K8599J8621P802j2951l6118k5215o9764
15879A140602l1078N6756N7782M727k0568K3625O4492J2023j6370j62N3917P7212
15867A422958l4265j968L3852M0229L5684k6259O358Q40J0202M9094j2330m2388
15855A482007J6520N7168l0375k2454M9129j8197l7264Q5706L0412l3983L841
15844A582510L3496J040K1760Q742n079p3152N439O7199j2698k6419K6235P8330
$$ y = [937353, 949039, 946570, 916718, 844142, 868116, 945699, 1007570, 982663, 1006934, 1018909, 1079874, 1069312, 1043798, 1023482, 998491, 996257, 1068948, 1079689, 1083239, 1078659, 1060998, 1084060, 1098943, 1106664, 1125790, 1135343, 1143373, 1146922, 1136873, 1127587, 1174196, 1165333, 1074944, 1010474, 1001492, 1056931, 1111657, 1168057, 1209249, 1229628, 1258227, 1276848, 1284650, 1271699, 1235581, 1210366, 1140602, 1109524, 1166280, 1224062, 1228789, 1208221, 1231846, 1296338, 1308361, 1291991, 1291829, 1345746, 1422958, 1388693, 1386725, 1420577, 1460806, 1496490, 1470231, 1476589, 1477429, 1487631, 1536725, 1524395, 1482007, 1498527, 1555695, 1525320, 1502866, 1551995, 1533798, 1496534, 1582240, 1612652, 1578669, 1582510, 1616006, 1617046, 1638806, 1647548, 1642469, 1569317, 1574756, 1641955, 1629257, 1602838, 1629073, 1707403]
15832A707403K4098M8337l0634l697m7201O2921O1792j3799N296L9698N743k7342
15820A832615J415M8017O4454Q6648O6782r070Q369M4013M2226P7135N493J6453
15808B284550J1869m574K4860O1344L1567j7407L3212L158k3727J3731K7274N2525
15796B498382N7743J0895p96k4250k017k88L0640J5875K3347P9640J09940L5701
15784B834812K0675O2306M3764n2030P399J03260Q4743Q3780O7674K0884Q691
15773C285958P4749O9174J4962M0481J02257J1816K6405Q3734N5727L2817O6359
15762C864439J59940K8643p670M0840J3931J6174J06257N8687K3908Q1768R1282
15751D478199J19454M6494M8468J13870Q5166L7058K3470P4421O0144R2454J11381
$$ y = [1707403, 1731501, 1779838, 1749204, 1745507, 1698306, 1761227, 1823019, 1809220, 1814516, 1854214, 1859957, 1832615, 1834030, 1882047, 1946501, 2033149, 2099931, 2090861, 2099230, 2143243, 2185469, 2262604, 2268097, 2284550, 2296419, 2291845, 2316705, 2378049, 2409616, 2392209, 2425421, 2428579, 2404852, 2418583, 2445857, 2498382, 2556125, 2567020, 2566224, 2541974, 2539957, 2539669, 2570309, 2586184, 2609531, 2689171, 2799111, 2834812, 2855487, 2917793, 2961557, 2909527, 2916926, 3020186, 3104929, 3188709, 3256383, 3277267, 3285958, 3360707, 3429881, 3444843, 3485324, 3587581, 3599397, 3625802, 3709536, 3765263, 3798080, 3864439, 4024379, 4053022, 4045352, 4086192, 4100123, 4116297, 4222554, 4281241, 4305149, 4386917, 4478199, 4597653, 4644147, 4692615, 4806485, 4891651, 4928709, 4952179, 5026600, 5086744, 5179198, 5290579]
15740E290579P4120O0907N9353N5228Q5676N8546J18128J31203J33188R5399O6352
15729F228679N6444N1515J47012J38405O3019J28228J16924J36260J46861J25053
15719G338400J34240J56454J93426J90449J83689J55938J58154J72027J55668
15710H838445J88835K04855K02652J96254K15159K33174K64840K45278J79811
15701A0769303K83198K57062K52912L10568K93067K99774L46097L64860L63282
15692A3540123L92138M41697M28701M26856M23763M67061N09698N74200O05263
15683A7809500N90421N99246O52821O81024P16000P94877Q54850Q34854Q59240
15674B4392833R54169J016685J099973J138732J246739J337726J419081J491435
$$ y = [5290579, 5364699, 5425606, 5484959, 5540187, 5625863, 5684409, 5802537, 5933740, 6066928, 6162327, 6228679, 6285123, 6336638, 6483650, 6622055, 6685074, 6813302, 6930226, 7066486, 7213347, 7338400, 7472640, 7629094, 7822520, 8012969, 8196658, 8352596, 8510750, 8682777, 8838445, 9027280, 9232135, 9434787, 9631041, 9846200, 10079374, 10344214, 10589492, 10769303, 11052501, 11309563, 11562475, 11873043, 12166110, 12465884, 12811981, 13176841, 13540123, 13932261, 14373958, 14802659, 15229515, 15653278, 16120339, 16630037, 17204237, 17809500, 18399921, 18999167, 19651988, 20333012, 21049012, 21843889, 22698739, 23533593, 24392833, 25347002, 26363687, 27463660, 28602392, 29849131, 31186857, 32605938, 34097373]
15666C4097373J585072J723071J896953K007699K157478K336764K536064K728575
15658E1069049K948595L205436L434092L669912M034734M381319M820051N131515
15650H2694703N508155N896386O277635O648931P024233P297356P536805P598958
15642A36483162P445752P121121O645294O017982N113822L955833K688554J398671
15634A76870191j7292j524822k901388m134701n316729o283843p084955p647788
15626A41958673p919435q015243p995216p729593p424594p072603o648309o272373
15618H2881307n811856n328371m948649m525161m181136l839271l509442l196123
15610D7541298k976449k776694k504816k260809k080357j929210j819911j725764
$$ y = [34097373, 35682445, 37405516, 39302469, 41310168, 43467646, 45804410, 48340474, 51069049, 54017644, 57223080, 60657172, 64327084, 68361818, 72743137, 77563188, 82694703, 88202858, 94099244, 100376879, 107025810, 114050043, 121347399, 128884204, 136483162, 143928914, 151050035, 157695329, 163713311, 168827133, 172782966, 175471520, 176870191, 176852899, 175328077, 172426689, 168291988, 162975259, 156691416, 149606461, 141958673, 134039238, 126023995, 118028779, 110299186, 102874592, 95801989, 89153680, 82881307, 77069451, 71741080, 66792431, 62267270, 58086134, 54246863, 50737421, 47541298, 44564849, 41788155, 39283339, 37022530, 34942173, 33012963, 31193052, 29467288]
15602B9467288j521473j398356j291403j268655j212353j092184r72581r12089
15594A9798194q74118q30596q01953p30283o47681o47621n66115o06276o02703
15585A3490848n45844m62009m81831m03409m05569m16087m19461l83296l58518
15576I614824l10975k61101k63634k77628k79036k43240k33181k23159k88379
15567G234491k25552j78520j88708j77345j70788j87164j42107j33600j57961
15558E672746j58401j14132j33413j36753j08185q0790j33474j81313j21666n9718
15548D444901j09243j36117r1862o7626j07577j5876q3567q5937j09714l4507
15538C602875n8455j03310o1785n2108m7208j19629p4254m7146m1998n2071o6368
$$ y = [29467288, 27945815, 26547459, 25256056, 23987401, 22775048, 21682864, 20710283, 19798194, 18924076, 18093480, 17291527, 16561244, 15913563, 15265942, 14699827, 14093551, 13490848, 12945004, 12482995, 12001164, 11597755, 11192186, 10776099, 10356638, 9973342, 9614824, 9303849, 9042748, 8779114, 8501486, 8222450, 7979210, 7746029, 7522870, 7234491, 7008939, 6830419, 6641711, 6464366, 6293578, 6106414, 5964307, 5830707, 5672746, 5514345, 5400213, 5266800, 5130047, 5021862, 4941072, 4807598, 4626285, 4504619, 4444901, 4335658, 4199541, 4107679, 4040053, 3932476, 3916600, 3833033, 3747096, 3637382, 3602875, 3544420, 3441110, 3379325, 3327217, 3280009, 3160380, 3086126, 3038980, 2996982, 2944911, 2878543]
15527B878543j8191p069n7512p0842n3682q0136o2466k584j4030m2741l1536k2902
15515B414852J4005k0185m3776j2232K5247k0640m9411q4936l8231p834m5853
15504B131006n0041l9722j5302j7710k8901m8280l0549j1402n0434q0997n1382
15493A706286P3K3102j1208p6433n4588q903m3849j5283r153l2122m0157n6247
15481A381518k4335j0548k6459l0193m0610L103l9487k5371j3891k4621p6691
15470A072415l034l7136n3370m8932m4051M0044M441L56J6194k0826l25n565m0478
15457H79733J5911l3515p5419k568p736n6889j242J3497j0965m056j4663M7432
15445G49520M1041l3964m3375k956j2353O6739K9043l8010n3979J7830k5530m1775
$$ y = [2878543, 2860352, 2853283, 2795771, 2724929, 2671247, 2591111, 2528645, 2526061, 2512031, 2469290, 2437754, 2414852, 2428857, 2408672, 2364896, 2352664, 2377911, 2357271, 2307860, 2222924, 2184693, 2176859, 2131006, 2080965, 2041243, 2025941, 2008231, 1979330, 1931050, 1900501, 1889099, 1838665, 1757668, 1706286, 1706359, 1729461, 1718253, 1641820, 1587232, 1578329, 1534480, 1519197, 1510044, 1477922, 1437765, 1381518, 1357183, 1346635, 1320176, 1289983, 1249373, 1252476, 1212989, 1187618, 1173727, 1149106, 1072415, 1069381, 1032245, 978875, 929943, 885892, 925936, 930377, 930733, 946927, 926101, 925776, 920211, 879733, 895644, 862129, 786710, 784142, 776406, 719517, 718275, 731772, 720807, 716751, 702088, 749520, 790561, 756597, 713222, 710266, 697913, 764652, 793695, 755685, 701706, 719536, 694006, 652231]
15433F52231L2440J2270M510j6100j8576l8354n8236m6238J1219m8640M8006j1285
15421E23247J074j167k3154j4811L7746l0892r0327K9396K3087k2112n8309n7502
15409C16276J598J6156J4939J7410k0162p854K9646j4819k332l6612j6303J6525
15397C14468L2K690q885N8202K9153m2105k9230k8768p775J25J2722J4043k7388
15384B87284o4097J3848J0848k2109K3337J0769l936k3598k7543L542K4108J2721
15372B45174N0514q153K4k2698l1856n8141J8850P897j589J9121k4318n8872j8055
15359A17898N3192J0300m5460m8297L4773R066j3788k3122K7450M3151K0158j5168
15347A70153O1959o645l6085r2429k1221M3386J7270l9687K9754n1106n4305N825
$$ y = [652231, 684671, 696941, 701451, 685351, 666775, 628421, 570185, 523947, 535166, 486526, 534532, 523247, 524321, 523154, 500000, 485189, 522935, 492043, 401716, 431112, 454199, 432087, 373778, 316276, 317874, 334030, 348969, 366379, 346217, 338363, 368009, 353190, 350858, 314246, 297943, 314468, 314500, 317190, 308305, 366507, 395660, 353555, 324325, 295557, 287782, 287907, 300629, 314672, 287284, 223187, 237035, 247883, 225774, 249111, 259880, 255944, 232346, 204803, 208345, 232453, 245174, 295688, 287535, 287559, 264861, 233005, 174864, 193714, 201611, 200022, 219143, 194825, 135953, 117898, 171090, 181390, 135930, 87633, 122406, 131472, 117684, 94562, 122012, 165163, 185321, 170153, 232112, 225467, 189382, 96953, 75732, 119118, 136388, 96701, 126455, 75349, 21044, 26869]
15335B6869N3094J9667L3409n299M0036J1696q2376r931O671O1819m453k7523
15323A23679L3081k2707j178j2685O203K4000n9466l5948j33l6976l88l574q147
15310E761p1385M4152M9120L1744k6405l1154K8941j5881j9936j4483M2379M2378
15298F5231L4305L2205m2632J837N0279m0326j6768O3221J1579K7756M795j913
15286A89569m3621j8713m5434m2999k0189J9628L8315L1006m6744n6973M4631
15275D8476K4148J8356r006q175L3237j406J1460k4892k0163J6282k8081r1909
15263c1673J0349O2563J8662n2834M0739j1661j1989L9947L4766l0244l5956j8390
15251A4279O2502M9668m2578K1068m286m271l2071j9577K90l34J018L821m7744
$$ y = [26869, 79963, 99630, 133039, 127740, 167776, 179472, 97096, 87165, 93836, 155655, 151202, 123679, 156760, 134053, 132875, 120190, 126393, 150393, 90927, 54979, 54846, 17870, 17482, 13908, 5761, -65624, -21472, 27648, 59392, 32987, 1833, 30774, 14893, -5043, -19526, 22853, 65231, 99536, 131741, 89109, 90946, 141225, 100899, 84131, 147352, 158931, 186687, 191482, 189569, 145948, 127235, 81801, 38802, 18613, 38241, 76556, 107562, 60818, 3845, 48476, 72624, 90980, 81974, 73799, 107036, 105630, 117090, 92198, 72035, 88317, 60236, -31673, -21324, 41239, 59901, 7067, 47806, 36145, 24156, 64103, 98869, 68625, 32669, 14279, 76781, 126449, 83871, 104939, 100653, 96382, 64311, 44734, 45024, 44690, 45708, 49529, 1785]
15238A785M1978P862m2911q350M3551K6616l6102K2372j8315N9371L6947k4926
15226A09878k193q1701p8392M2416L827K0679j3546l3965l308M3925J9248J2396
15214C9264k9657m4235K3078k9873k957Q732K2283m0121o9309O0787K1884o6474
15202a06598j074K6106q321k6161K1624L0286K5484n480Q015L052l6406q989J94
15189g8268N5253J5340j8560L2871l2984k9464P421L109j7052N375J0381N0910
15177D332J6866n1425o079j0353q894J4866L1429L3780k271N446J7493o8274j0252
15164c3336K7263m7876K576K6546Q0117N836K1303q51k3850K4415L6057k8891
15152H9309l4057j4541J5098L2812m8032k0187L4985J4539k8752k5482K678J9962
$$ y = [1785, 43763, 51625, 8714, 364, 43915, 70531, 34429, 56801, 38486, 97857, 134804, 109878, 107685, 25984, -52408, -9992, -6165, 14514, 968, -32997, -36305, 7620, 26868, 39264, 9607, -34628, -11550, -41423, -44380, -35648, -13365, -53486, -122795, -62008, -40124, -106598, -107672, -81566, -89887, -116048, -94424, -64138, -38654, -44134, -36119, -33067, -69473, -78462, -78268, -23015, -7675, -26235, 6636, -26348, -55812, -48391, -45282, -62334, -56959, -46578, 4332, 21198, -30227, -36306, -46659, -55553, -40687, -9258, 24522, 22251, 27697, 45190, -23084, -33336, -6073, -53949, -51373, -24827, 55290, 61126, 82429, 81578, 57728, 82143, 118200, 89309, 55252, 40711, 55809, 88621, 40589, 20402, 55387, 69926, 41174, 15692, 18370, 38332]
15140C8332K3379L0028L7133K4933L1599J2061p3109l3723Q6756L0082j8588O8183
15128B57066P4675K1440q362n787k6473J7344N8515O2733P7568J2274K8065J00953
15116F70011Q052j2417K5943N7349M4504K6488L9940o360m7580m7821J7597R814
15104G85520k8260M361l7194l7366l6448o8983l0764L137m2302n3548l8664k9966
15092C89523l510r2716m8215Q194q991k821r226o1068l2553k0465L913q743J8076
15079A31398L5342l2344l1571k2199k7427p482k5456m6148J350K972O831K9565
15067A4831m31L0870l8697K2883M2201q236J1461q590l9318l0204j4838j8695
15055c6763j9410j1933k8065j2356K7870M7555J5586L6488n480n5358p495P589
$$ y = [38332, 61711, 91739, 128872, 153805, 185404, 197465, 124356, 90633, 177389, 207471, 188883, 257066, 331741, 353181, 344819, 339032, 312559, 329903, 388418, 451151, 528719, 540993, 569058, 670011, 678063, 665646, 691589, 748938, 793442, 819930, 859870, 853510, 805930, 758109, 775706, 785520, 757260, 761621, 724427, 687061, 650613, 581630, 550866, 554003, 511701, 458153, 419489, 389523, 386013, 293297, 245082, 253276, 244285, 241464, 232238, 171170, 138617, 118152, 122065, 113322, 131398, 166740, 134396, 102825, 80626, 53199, 45717, 20261, -25887, -24537, -21565, -14734, 14831, 14400, 45270, 6573, 29456, 71657, 63421, 74882, 66292, 26974, -3230, -18068, -36763, -56173, -68106, -96171, -108527, -80657, -33102, -17516, 18972, 13492, -41866, -49361, -41772]
15043d1772p804L1172l2958k3326N3143N768J5200m319j8788j9886j9795m7892
15031a11257J4822O0863M335l704m6173P192Q08P2555J1l733k5288k262m6471
15018g8302M70J322J2572j6504k6544Q173J6698j2460Q234L2460k5170k5031K9869
15005g4213J089r268K7319n435m2147m8196L2521N0639K8464k0720l5883k8414
14993a24244L4544L7972l0570q617m5558k5320k9416n717K211K3262m1276N827
14981b06902N6141P5246L0761j287m3516j1728J242j5527j8001P210j8667p399
14969a52427M8171K0636k2306p458j8588p9904k984L9274K0919M7991M0578k4513
14957i0611o1021o4688K3865L0403L7301N913N1919q070j5810m0925L2223L6265
$$ y = [-41772, -49576, -18404, -51362, -74688, -21545, -15777, -577, -4896, -23684, -43570, -63365, -111257, -96435, -35572, -31237, -34941, -81114, -73922, -73114, -559, -548, -4281, -29569, -31831, -78302, -77832, -76510, -63938, -80442, -106986, -98813, -82115, -94575, -86341, -53881, -79051, -104082, -74213, -73124, -82392, -55073, -60508, -102655, -150851, -118330, -67691, -39227, -59947, -95830, -124244, -89700, -51728, -82298, -90915, -136473, -161793, -191209, -196926, -194715, -171453, -212729, -206902, -150761, -75515, -44754, -46041, -89557, -101285, -100043, -115570, -133571, -126361, -145028, -152427, -104256, -83620, -105926, -113384, -131972, -211876, -214860, -175586, -154667, -106676, -66098, -90611, -151632, -216320, -192455, -162052, -124751, -118838, -66919, -74989, -90799, -131724, -99501, -63236]
14945f3236K225j3256j9898R605R051k7700N617Q7459j8317n9828n5631j2097
14933a56006j3488K7829L4284N231J1811J9823K6257j4510q383P8596J2809j63
14921B4090n2746l5012R424J2412N302n4828k5710J8190L1948R90m6439K3762
14909h8617q960L585j5627J7732n159n1186j9667N6679L2573k3794k2638K4951
14897a00128N266O596K9173l0613L5488J8826K0835l3818J3970O275l3843j6608
14885g8581q620N181r813K5838J9327k1033k5181m2437O558P749J3801K3820q529
14872i1920M340k0982p3277j583K2406Q592J9267J3788K4951k7980l2874L5013
14860a20259J6841J7994l6974K121N1168k3259m0930J2621M4998J3921O534P546
$$ y = [-63236, -61011, -74267, -94165, -84560, -75509, -103209, -97592, -10133, -28450, -88278, -143909, -156006, -169494, -141665, -107381, -102150, -90339, -70516, -44259, -58769, -67152, 11444, 24253, 24090, -28656, -63668, -54244, -41832, -36530, -91358, -117068, -98878, -66930, -65940, -112379, -88617, -97577, -93992, -109619, -91887, -97046, -148232, -167899, -111220, -78647, -102441, -125079, -100128, -94862, -88266, -59093, -89706, -54218, -35392, -14557, -48375, -34405, -28130, -61973, -78581, -87201, -82020, -91833, -65995, -46668, -67701, -92882, -135319, -128761, -121012, -107211, -83391, -91920, -87580, -108562, -181839, -183422, -161016, -152424, -133157, -119369, -94418, -122398, -155272, -120259, -103418, -85424, -122398, -120277, -69109, -92368, -133298, -120677, -75679, -61758, -55224, -47678]
14848d7678n8529l7522j4019n421L1979L52J3018L4170j4218r792k977L2747M2162
14835c5728J3343k4249m4978q2782P170R2611L2101o9477J6101L7856J3527l8962
14823h3467q6128j5699N3644k0281m545R956q750o694M655O36M3610M9985J6770
14810d6308m5020m5825k4283P409K1288j8450O4016J1222l1365m8994j217K4901
14798a32626N7092L5257M402j369j3411m1573j1187K861L443K0311j4312O683
14786h4429o3498l0647K5868R127l7481m3608l5901k1157J8342P6980L3338k1981
14774a75047J1882k6548K6678N2315J4134j4005J7841K1573k4489K2772R483m1980
14762a05391n6185J7636K7739K7471J6272K5289j6746m6163n60j3215p446l9513
$$ y = [-47678, -106207, -143729, -157748, -163169, -131190, -130838, -117820, -83650, -97868, -107660, -110637, -77890, -35728, -22385, -46634, -91612, -174394, -167224, -74613, -42512, -111989, -95888, -58032, -44505, -83467, -169595, -185294, -131650, -151931, -156476, -146520, -155270, -161964, -157309, -156673, -113063, -63078, -46308, -91328, -137153, -161436, -154027, -132739, -151189, -87173, -75951, -107316, -156310, -157527, -132626, -75534, -40277, -35875, -37244, -50655, -92228, -103415, -100554, -97111, -76800, -91112, -84429, -147927, -178574, -152706, -143579, -181060, -224668, -260569, -281726, -263384, -186404, -153066, -175047, -163165, -189713, -163035, -110720, -96586, -110591, -92750, -71177, -95666, -72894, -63411, -105391, -161576, -143940, -116201, -88730, -72458, -47169, -63915, -110078, -110638, -123853, -131299, -170812]
14750a70812J0859K2358N2084M4424R552K0668j588m1575j9623J2466k8108M2575
14738d6720k920n0468K093Q992K1940J995j3817K7492k5046n630l118P811k8693
14725a06089J5327N1561l4467o0036k4882M3348J6568j3787K7670m5042n409j885
14713a37123J0930J4822K6684L1157J1326l0621j4054N01j2484n0667o731L8608
14701a17652N2208K3283l8293l02R389J8637o3197K666K361k6655J2615M7059
14689g7881K058L96r64j5459k3809p850L1665j7257O821L2188n797Q180L4450
14676c3259L4117l5791j3746N016j7283J7108K7772k1201j9092j7704Q856K0409
14664d4798K8105J384p5271j8758r545m0936n6909J1471O2522P9897J3781m4355
$$ y = [-170812, -159953, -137595, -85511, -41087, -31535, -10867, -12455, -54030, -73653, -61187, -89295, -46720, -49640, -100108, -98015, -89023, -67083, -65088, -78905, -51413, -76459, -82089, -85207, -77396, -106089, -90762, -39201, -73668, -133704, -158586, -115238, -98670, -112457, -84787, -129829, -135238, -137123, -126193, -111371, -84687, -53530, -42204, -72825, -86879, -86378, -98862, -149529, -156260, -117652, -65444, -42161, -80454, -80756, -71367, -52730, -115927, -113261, -110900, -137555, -124940, -77881, -75823, -75427, -76391, -91850, -115659, -123509, -91844, -109101, -102280, -70092, -75889, -67709, -33259, 858, -34933, -48679, -43663, -60946, -43838, -16066, -37267, -56359, -74063, -65207, -44798, -16693, -15309, -90580, -109338, -118883, -159819, -216728, -205257, -142735, -62838, -49057, -93412]
14652i3412q5130k0678k3737k9146M7261M8064N5144L8302L0043R507p8729k44
14640a02755J4778o3690k7402K8825j841M1168j278k9611J9886K6590k9655Q191
14628a16794L1144L5462k2719j4029Q682L3798J0119J3492m181j4601m711r5495
14616a39833j7468O1868J1587J2195k1540n3352l6352J6346L0174K4835K8484
14605h3056J6839J1843O11j5494M2125L6488O039l9835n2627j2710L481L685p001
14592h9612m152J3184N1108Q918k7975m1146K5528Q585O098k637j079j4189j8214
14579h5583L7962l5517n2880k1071Q428M9591L4592J527J986K9565m4731j4911
14567i1042M990l1810L4031M020J6894k5815L396j9769l3919j0769P441M3964
$$ y = [-93412, -178542, -199220, -222957, -252103, -204842, -156778, -101634, -63332, -33289, -23782, -102511, -102755, -87977, -151667, -179069, -150244, -152085, -110917, -112195, -141806, -121920, -95330, -124985, -116794, -85650, -50188, -72907, -86936, -78254, -44456, -34337, -20845, -25026, -39627, -44338, -139833, -157301, -95433, -83846, -71651, -93191, -146543, -182895, -166549, -136375, -111540, -83056, -66217, -54374, -53763, -69257, -27132, 9356, 15395, -24440, -77067, -89777, -86296, -82611, -89612, -93764, -80580, -29472, -20554, -48529, -89675, -64147, -55562, -49464, -52101, -53180, -67369, -85583, -47621, -83138, -136018, -157089, -148661, -99070, -64478, -62951, -60965, -31400, -76131, -91042, -86052, -117862, -83831, -79811, -62917, -88732, -85336, -105105, -139024, -149793, -142352, -98388]
14555i8388L6734l2438o3831k4406M330L0984M1896J209K4938M3405k5513p715
14543f8795j1525P628k4869J0081k2201m6811p134m6238n0933m851L6595L2263
14531a96790j3332M508O2418N1504J6554k1147K4395Q866j1969K3820J232k9519
14519g9460l3702L4099k9340p4254L4704O7527k720j7809k4762M877Q0438O1856
14507B1454q0265r0386k3515J0884k7387K2826O3872j5644k1183r483N0155M1709
14495e6963J4093j8355J3536J00j5416j5666K1044K2596j6401J3248J1351o4756
14483i1589m1516P2802N6687k7626l2953j7370N5747m0443m2553L3085j8751q865
14471a03345R493M8455M5295k0417n6174j9319l7692N36J0352N0504N2954m8756
$$ y = [-98388, -61654, -94092, -157923, -182329, -177999, -147015, -105119, -103910, -78972, -35567, -61080, -68795, -80320, -72692, -97561, -87480, -109681, -156492, -163626, -209864, -260797, -265648, -229053, -196790, -210122, -205614, -143196, -91692, -75138, -96285, -71890, -63024, -74993, -51173, -49941, -79460, -113162, -79063, -108403, -182657, -147953, -80426, -83146, -100955, -125717, -120840, -40402, 21454, -58811, -149197, -172712, -161828, -189215, -166389, -102517, -118161, -139344, -148827, -98672, -56963, -42870, -61225, -47689, -47589, -63005, -78671, -57627, -35031, -51432, -38184, -26833, -91589, -133105, -60303, -3616, -31242, -64195, -81565, -25818, -66261, -108814, -75729, -94480, -103345, -93852, -45397, -102, -20519, -76693, -96012, -133704, -133168, -122816, -72312, -19358, -68114]
14459f8114m6003K9120P2987M1502k251o1457j5971K2270P168k2164l5131j2906
14447i0950L139k921l2389p219P7472l12o0236n3774m8639M207R0704m3939M9392
14434a15465M0815m3688J9596K212N2659j8103j287J9380K2313L441K4859j9830
14422a3098J6726j7618K2316p8974K8240O974K605j1666j425L1513j4628o317
14410c5352o79n7471l5363l800M1320o138L0320K8535n8147N098K65J5984q67
14397g6295o2356L751J8460K0361N1013O265O605q5554K7403N1191Q7835k584
14385D6095n4477n4574l7871m398O1489P1050l9045n4813k1637m4092K266O6842
14373f3165L3822j8130J6004m819k0422k219l940O0338l2363o918k0736m3112
$$ y = [-68114, -114117, -84997, -12010, 29492, 27241, -34216, -50187, -27917, -20749, -42913, -78044, -90950, -87811, -90732, -123121, -130340, -52868, -53180, -113416, -167190, -215829, -211622, -120918, -164857, -115465, -74650, -118338, -98742, -96530, -43871, -61974, -63261, -43881, -21568, -18127, 6732, -13098, 3628, -13990, 8326, -70648, -42408, -35434, -32829, -44495, -45920, -14407, -29035, -35352, -36031, -93502, -128865, -132665, -91345, -97483, -67163, -38628, -96775, -91677, -91412, -75428, -76295, -138651, -134900, -116440, -96079, -45066, -38801, -32196, -117750, -90347, -39156, 48679, 46095, -8382, -62956, -100827, -105225, -43736, 27314, -11731, -66544, -88181, -132273, -130007, -63165, -29343, -47473, -31469, -36288, -56710, -58929, -62869, -2531, -34894, -41812, -62548, -105660]
14361a05660L6884J1622o7541k4811K9474P0165N0241k2989k9867n8273k202R9130
14349a3827j8266o7434M491N6424l2531k8767K0897J2438J5023j8346l1538j1985
14337a13421J8386L2725o553k1798l5596K837L7972L9292L344j1916P771K4477
14325b2480m390m7675Q506k6809K9656m607L0903M8348m003l662k6275l4497o2801
14312a19786j9740J8031N8627J4730j269J6787n367K093l5195m7068n4520M2950
14300a29727P281M1912L9493k2734O239K1278Q503L0436q6046M3918J5997q3617
14288a07067r834K1976K1374l167j876J2360M8336n140o704j6750j2369k3122
14276h1983J0425L232J605k730J9367J4907m9708k2827O8401J0662k35J3385l8945
$$ y = [-105660, -68776, -57154, -124695, -149506, -120032, -49867, 374, -22615, -52482, -110755, -112957, -13827, -32093, -99527, -95036, -38612, -71143, -99910, -79013, -66575, -51552, -69898, -101436, -113421, -95035, -62310, -68863, -90661, -126257, -123420, -85448, -46156, -42812, -54728, -46957, -22480, -26870, -74545, -66039, -92848, -63192, -67799, -36896, 11452, 7449, 3787, -22488, -56985, -119786, -139526, -121495, -62868, -48138, -49407, -32620, -37987, -35894, -71089, -118157, -172677, -129727, -122446, -80534, -41041, -63775, -57536, -36258, -27755, 2681, -83365, -39447, -23450, -107067, -116901, -94925, -73551, -76718, -78594, -66234, -17898, -23038, -29742, -46492, -58861, -81983, -71558, -68326, -66721, -69451, -50084, -35177, -84885, -107712, -39311, -28649, -28884, -15499, -54444]
14263e4444m5113p021M8139P9337j2007o624l1971N0244l534l5377m3467k599
14251f4437j4816J2587m3414K101Q7434M1497K0834M547j5895m4903L972m7639
14239e8132k8264k8042K6373L0034K7662j1816k6670J1550j7322m931L294j1112
14227h7376J8608J8931K8707L8906k8720k3745j1379n9095L0191L21J3459J953
14215e9239l3070j9481N0609K5556j330J2208m3137j6213L6178L0779j9236J1431
14203b4945j7812n665j0981k5222J4309L6386l611j0194l3378k3524K2128J8451
14191f4058J3004m0846R525j7947p550K9854P571M9065l9794l7259q048N1474
14179e5009J3480M0133J417o188p197m5583n978J6136j7227l1253L6262L5604
$$ y = [-54444, -99557, -106578, -58439, 20898, 8891, 2267, -29704, 20540, 17006, -18371, -61838, -64437, -79253, -66666, -110080, -107979, -20545, 20952, 41786, 46333, 30438, -14465, -10493, -58132, -86396, -114438, -88065, -58031, -30369, -42185, -68855, -57305, -74627, -79558, -76264, -87376, -68768, -49837, -21130, 17776, -10944, -34689, -46068, -105163, -74972, -74651, -61192, -59239, -92309, -111790, -61181, -35625, -36955, -24747, -67884, -84097, -47919, -17140, -36376, -24945, -42757, -48422, -59403, -84625, -70316, -33930, -37541, -47735, -81113, -104637, -82509, -64058, -51054, -91900, -82375, -100322, -107872, -78018, -70447, -21382, -61176, -98435, -106483, -55009, -41529, -1396, 21, -6167, -13364, -58947, -64925, -48789, -66016, -97269, -61007, -25403]
14167b5403K66K1558o3960m7382J9530O5660Q567N648O4357O6740k7358l9090
14155D9133n5909k1441M379P398J7439N5527j9969n3111J2729j2129m5871K3458
14143c8367M5704Q207l842p371r973o0082K9496L1058p6813n7382J7198P1269
14131e0898L8335q250l9158K9726J0142j3668O920r284J6264J3920k3737q983
14119c8671o1868k3188N7895J4844o1497o1996J6680O6628O3202P341m3528J0473
14107e3685L134kj6005l5687j489M8423M4548L5106N6982K416l966n263o6716
14094G796j5502k727l9092n8161J2480N2259p433J648J0978N0270J3900J1129
14082C7545l832n2511k770J9776K0251j8392r1495l5057P0660P687j6019K4346
$$ y = [-25403, -25137, -3579, -67539, -114921, -95391, -29731, -21164, -15516, 48841, 115581, 88223, 49133, -6776, -28217, -23838, -16440, 999, 56526, 36557, -16554, -3825, -15954, -61825, -38367, 7337, 15544, 11702, 4331, -5642, -65724, -36228, -5170, -81983, -139365, -122167, -50898, -12563, -20813, -59971, -30245, -20103, -33771, -26851, -36135, -19871, -5951, -29688, -38671, -100539, -123727, -65832, -50988, -112485, -174481, -157801, -91173, -27971, -20630, -64158, -53685, -50551, -50553, -66558, -102245, -103734, -55311, -10763, 24343, 81325, 83741, 79775, 74512, 7796, -7706, -10433, -49525, -107686, -95206, -42947, -50380, -48732, -37754, 12516, 26416, 37545, 33713, -18798, -21568, -1792, 18459, 67, -91428, -126485, -55825, -48138, -64157, -39811]
14070c9811J9405j0768k5448j0820L8515M1654m430l0727k4574L2262j1879j8406
14058d5027J5255J0524o2049l1662P9144K5367k4906n577p668j100K6048N6338
14046C4687N281j2681k2480m3859j1823J3235k5443K9302K61k3690M6301K1143
14034A0234j5042k2973M96J8741N013O114m641R610L7341q44k3495M2549L4636
14021I7739l8942l8009m7125l5908R554J0241N9034j8800k0564k2324K0330N5809
14009C1035j904m4923J095M2170k690m412l596j0627P6296O830j09281J9344J8491
13996A7828L4733k278l509k1008L262J1975K6212m608K4974q249p175l5766K0367
13983E6758N1009l4580J1110k0517k5549j0177L5792K7336m3018n4213j9571o225
$$ y = [-39811, -20406, -31174, -56622, -67442, -28927, 12727, 8297, -22430, -47004, -14742, -26621, -45027, -29772, -19248, -81297, -112959, -33815, -8448, -33354, -38931, -46599, -47699, -21651, 34687, 39968, 27287, 4807, -39052, -50875, -37640, -63083, -33781, -33520, -57210, -10909, 10234, -4808, -27781, -27285, -8544, -3531, 2583, -2058, 7552, 44893, 44049, 20554, 63103, 97739, 58797, 20788, -26337, -62245, -52691, -42450, 16584, -2216, -22780, -45104, -24774, 31035, 29131, -15792, -14697, 27473, 24783, 20371, 16775, 6148, 82444, 89274, -20007, -663, 17828, 52561, 50283, 46774, 25766, 29028, 41003, 67215, 62607, 87581, 79332, 72157, 36391, 56758, 107767, 73187, 84297, 63780, 38231, 28054, 63846, 91182, 48164, -6049, -25620, -31845]
13971c1845m0044J7372L0365k2600l914J0863K2796P6115N312m8194l2409J1487
13959d696Q3974L8789n7487j1949q7687n2052L674K1680N7774L4944L8426L1658
13947I7048J6286m4460m698k6287N731r39p549R958L7929j1465n8788M3740K4051
13934H0557J272n086J0256k1053l3758J1699l4784J458O222J1080M6773J4979
13922H9615O698q145j527M5737M2568k6680o7243m5736J6978N596K3848n5529
13910B6180n905N9998O3718k0039k5738l6031l0436K577L8870R184n934j9022
13898E7422J4142R065L7127J1376m7503K031n749N691l7941l7951K8154M640n8128
13885a7624P134K5206J3709k5545O907N7893R283L50j3117K9987K049j8220J7253
$$ y = [-31845, -71889, -54517, -24152, -46752, -50666, -39803, -17007, 59108, 64420, 16226, -16183, -4696, 79278, 118067, 60580, 48631, -39056, -91108, -87434, -65754, -7980, 26964, 65390, 97048, 113334, 68874, 64176, 37889, 43620, 42681, 35132, 45090, 83019, 71554, 12766, 56506, 80557, 81829, 76743, 86999, 65946, 32188, 43887, 9103, 10561, 16783, 27863, 74636, 89615, 96313, 88168, 86641, 132378, 174946, 148266, 81023, 35287, 52265, 57861, 81709, 26180, 20275, 80273, 143991, 123952, 98214, 62183, 31747, 34324, 73194, 82378, 76444, 57422, 71564, 80629, 117756, 129132, 81629, 83660, 77911, 83602, 45661, 7710, 35864, 40504, -17624, -10490, 14716, 28425, 2880, 9787, 67680, 76963, 77313, 64196, 94183, 96232, 78012, 95265]
13872I5265M2043o181L912m4536p5133K7816M1409l6557l2091J723J2158J8813
13860D8641J7574l4469r757K0540K8648M5546j2777l5510L6596J0464J540m954
13848A12082j12380j1611N1901K3589Q164K2424m6411K309j5588K7420o184l5936
13836A9779j4228J0928j8167J0051j7411m4472N6076N5549J9289k384j8438j7337
13824C9235l1161m0396N467p970N3540L3317J0869L7397K5288K4324l9658m4815
13812F5437k0795p430K175K0926L1022L9650Q349j054j6545K4487N915n2244l9307
13799F0586M7120k5306n0595l3173m0832L0529R812P1009K2048r820J798l6222
13787D6954l2002K4180N2582M7364J3306R061p4675N641O2675j2396n1986k5798
$$ y = [95265, 137308, 131127, 135039, 90503, 15370, 43186, 84595, 48038, 15947, 17670, 29828, 48641, 66215, 31746, 21989, 42529, 71177, 116723, 103946, 68436, 105032, 115496, 117036, 112082, -298, -11909, 39992, 63581, 71745, 94169, 47758, 50067, 34479, 61899, 55715, 19779, 5551, 16479, -1688, 8363, -9048, -53520, 2556, 58105, 77394, 75010, 56572, 39235, 8074, -32322, -26855, -34825, 18715, 52032, 62901, 100298, 125586, 149910, 110252, 65437, 44642, 37212, 39387, 60313, 91335, 130985, 139334, 138280, 121735, 146222, 152137, 99893, 60586, 107706, 82400, 31805, -1368, -42200, -11671, -1859, 69150, 91198, 81378, 83176, 46954, 14952, 39132, 91714, 139078, 152384, 161445, 86770, 92411, 155086, 142690, 90704, 64906]
13775F4906K3466K5860J3312M126K1842J8566m7122m7948o9169L648J1451L3564
13763E6502J9629k3916J8563K4046M272k7612j861p809m7104K2096J3106J1400
13751F1312P2663J8627r377l3122L1735j31l458J0916k2758l7035k0128j7075
13739E2169k6871j0175J8163M2358k7195m6028J7428K7785N8768k5803j399M3268
13727A22468M7487j5371j5526J7836j3067n3440J7264K2966J1533j0858K7061
13716A58353p635k9423K434J1111J8332P502n867K9038K9359J6643m0399k4875
13704A64573m2060m0360j4092l0953k6365O7689P3818j5267j4429n0951k7722
13693D3881M1457N1248L0030J1838n1787n8742m3518R837Q4011J9363p310j3717
$$ y = [64906, 88372, 114232, 127544, 131670, 153512, 172078, 124956, 77008, 7839, 11487, 22938, 56502, 76131, 52215, 70778, 94824, 99096, 71484, 69623, 61814, 14710, 36806, 49912, 61312, 133975, 152602, 143225, 110103, 141838, 141707, 138249, 149165, 126407, 89372, 69244, 52169, 25298, 15123, 33286, 75644, 48449, 2421, 19849, 47634, 106402, 80599, 79200, 122468, 169955, 154584, 139058, 156894, 143827, 90387, 107651, 130617, 142150, 131292, 158353, 150718, 121295, 123729, 134840, 153172, 160674, 154807, 183845, 213204, 229847, 189448, 164573, 122513, 82153, 68061, 37108, 10743, 78432, 152250, 136983, 122554, 71603, 43881, 85338, 136586, 166616, 178454, 126667, 67925, 24407, 34244, 118255, 137618, 130308, 116591]
13681A16591j8146J9046k6809l0270m715K7226O3311Q014o156j8095N994K9241
13669A65232K707K0111L966n1675J1062l5232m8592j2913K1909j0697J3970m3712
13657C6136j6334N0528l542l6077K0154O7455K9235J0892l0149l4052L7426m2464
13645H9208k4798K3561M8910J0804j2344j805N798K7795k0357J284J8149k0146
13633A46059J490K0117L334J1890K6458J376m6837j8593M8355j2661m3945P6691
13621B13734K5513k1213R94q728R990m310L3507p0204l8140K2029P953L5467o0817
13608A45775K6375J02106k2737j6547K0772p872k6086K7492K5248P785l5740m2434
13596B04137m251P369K3928K9259k721J3576N4199l9010l9368m3672R227J2258
$$ y = [116591, 98445, 117491, 90682, 60412, 55697, 82923, 146234, 154248, 148092, 129997, 135991, 165232, 167939, 188050, 192016, 140341, 151403, 116171, 67579, 54666, 76575, 65878, 79848, 36136, 19802, 70330, 66788, 30711, 50865, 118320, 147555, 158447, 128298, 94246, 131672, 89208, 64410, 87971, 136881, 147685, 135341, 133536, 139334, 167129, 146772, 148056, 166205, 146059, 147549, 167666, 171000, 182890, 209348, 210724, 163887, 145294, 193649, 180988, 137043, 213734, 239247, 218034, 219028, 210300, 220290, 215980, 249487, 179283, 141143, 163172, 171125, 206592, 145775, 172150, 274256, 251519, 234972, 255744, 247872, 221786, 249278, 274526, 282311, 246571, 204137, 199886, 207255, 231183, 260442, 257721, 271297, 325496, 286486, 247118, 203446, 212673, 224931]
13584B24931P19k2440m5841K6371j5879J1698L6854o2990J4088N7023l7399j9736
13572A67399K0193K0429j5525q482l0234k347n554J2617j7813K919K8943m3265
13560A29280k0864q361J6670O0664L9977O99K9121o966m9170P195m162N247k2419
13547A76911o849N4534L2419n854k2854j4709j0526J0890j5581m8598j2214L771
13535A41340M3364K8324l09M3745K3260k3715l0894o3619K0506J9627j8684r126
13523A73819N807q973L3662J9544J3665k2545j7915j354k9278j2907M1149L0124
13511B24798k8740k3871N1688N2560K4442l4396j3805m5083l5648l3001n7254
13500H1690R593N3490N5906n24J1864m3478k4431J4588K3621l131K0192N2878
$$ y = [224931, 225650, 203210, 157369, 183740, 167861, 179559, 216413, 153423, 167511, 224534, 187135, 167399, 187592, 208021, 192496, 184014, 153780, 151433, 145879, 158496, 140683, 143602, 172545, 129280, 108416, 100055, 116725, 177389, 217366, 218065, 247186, 240220, 191050, 198245, 194083, 199330, 176911, 170062, 224596, 257015, 251161, 228307, 213598, 203072, 213962, 198381, 149783, 137569, 141340, 184704, 213028, 212719, 256464, 279724, 256009, 225115, 161496, 182002, 201629, 182945, 173819, 179626, 170653, 204315, 223859, 237524, 214979, 197064, 195710, 166432, 153525, 194674, 224798, 196058, 172187, 223875, 276435, 300877, 266481, 252676, 207593, 171945, 138944, 81690, 91283, 144773, 200679, 200155, 212019, 168541, 144110, 158698, 182319, 179188, 199380, 252258]
13488B52258j562l2573r563k1194M8001p707l0066l7536O2515O3948N434j5830
13476B76125m1985m4248P21L8719N8177j4032r090L885K2559O843m340P936l0671
13463B70599R245k3550R292J4564k673o9801n4779M7583L5303O5323J7513K2013
13451C40632l706m3344q062j4540N807J4376m693k2846L9242j8870n1242L5480
13439B68234K6298N182k3193l7200k5335N7265N4393k7372k6852j4002K5440J7171
13427C00029M6885L5858j360o9932k7617K8199J723K346j2508m2673q974L0915
13415B82891L4570j2492K4132k547j546m486n1996R436K9811k6790j0954j2386
13403B57643L5993j3449J7657K021p553l0302M152J361N0936K4507l6956l8235
$$ y = [252258, 250696, 218123, 208560, 187366, 235367, 227660, 197594, 160058, 222573, 286521, 291955, 276125, 234140, 189892, 190613, 229332, 287509, 273477, 264387, 268272, 290831, 297674, 293334, 301270, 270599, 279844, 256294, 265586, 280150, 277477, 207676, 152897, 200480, 235783, 301106, 318619, 340632, 336926, 293582, 285520, 270980, 276787, 291163, 286470, 263624, 302866, 283996, 232754, 268234, 294532, 299714, 276521, 239321, 213986, 271251, 325644, 298272, 271420, 257418, 282858, 300029, 346914, 382772, 381412, 311480, 283863, 312062, 313785, 316131, 303623, 260950, 251976, 282891, 317461, 304969, 329101, 326554, 325008, 320522, 268526, 277962, 307773, 280983, 270029, 257643, 293636, 280187, 297844, 299865, 292312, 262010, 266162, 267523, 318459, 342966, 306010, 267775]
13391B67775R847M9760R383K644o539l1985j0943M0280k124j313m15L196K4480
13378C54046q2875j8930J0368K9891P3047N585j2352K583O140J7711R089l9455
13366C54848P623K5291K880m6202O2738L1770l8893m096J0474K9377L5305l5154
13354D35961p9920j2919K6570N3238p198l0549k752K5477l589n5716J4915L8256
13342D01774j3697j6222J82J3525O8543j3154l0429k1552O3055M5452o2912l7796
13330C96769O214k9699J703J459m0823M3946P4904Q289J1415R178J9867l2241
13318D70981k5590k2343J3337K2653L1703l3170K957K7475k1785l3794k2308J8933
13306D29049o622k2913l5630M1523K9057K4728M0964K63J2220j9704N821j8628
$$ y = [267775, 277622, 327382, 336765, 339409, 332870, 300885, 289942, 330222, 328098, 326785, 326370, 329566, 354046, 271171, 252241, 262609, 292500, 365547, 371132, 358780, 361363, 367503, 385214, 394303, 354848, 362471, 387762, 390642, 344440, 407178, 438948, 400055, 395959, 406433, 435810, 471115, 435961, 356041, 343122, 369692, 422930, 415732, 385183, 382431, 407908, 404319, 348603, 363518, 401774, 388077, 371855, 372037, 385562, 454105, 440951, 410522, 388970, 452025, 497477, 434565, 396769, 402983, 373284, 374987, 376446, 335623, 379569, 454473, 462762, 474177, 483355, 503222, 470981, 445391, 423048, 436385, 459038, 490741, 457571, 460528, 488003, 466218, 432424, 410116, 429049, 422427, 399514, 363884, 405407, 434464, 459192, 500156, 500419, 512639, 492935, 498756, 480128]
13294D80128n2655j8991k7520K925K7317J5572r078k5027M1176L1974L2195j0005
13282D88011j8908l7581j6435K377q43J4122J8551r981K5904M9579K2026M8188
13270E85010k543l0236N257J7241n0076o3775L4519N3278J6627J2820j0999m8570
13258E18553n1724j8306L6663O6808l042n8509M1360L1828m2252J4415K2873l3162
13246E25505k9516o864Q059K5708P4509p490l6813q913L1662l1600M165q18j3909
13233E33685L4985J9267j4132K1653J3066j5105L2064j2963p9659P79k283R314
13221E40671M0789K9392K4099j0231k299m5238l7882K4266L9808O882J1322P2816
13209F94395N3879m0670k6486J9673m9316m2398l1982K5418L2638L9315J065n967
$$ y = [480128, 427473, 408482, 380962, 383887, 411204, 426776, 417698, 392671, 433847, 465821, 498016, 488011, 469103, 431522, 415087, 417464, 416621, 430743, 449294, 439313, 465217, 514796, 536822, 585010, 582467, 552231, 557488, 574729, 524653, 460878, 495397, 548675, 565302, 578122, 567123, 518553, 466829, 448523, 485186, 551994, 548952, 490443, 531803, 563631, 521379, 535794, 558667, 525505, 495989, 489125, 497184, 522892, 597401, 589911, 553098, 544185, 575847, 544247, 548412, 547594, 533685, 568670, 587937, 573805, 595458, 608524, 593419, 625483, 612520, 532861, 533640, 531357, 540671, 581460, 610852, 634951, 624720, 622421, 577183, 539301, 563567, 603375, 610257, 621579, 694395, 748274, 707604, 681118, 700791, 651475, 609077, 577095, 602513, 635151, 674466, 675531, 669564]
13197F69564l6098k2974L0966N346J30l4800m8627K2551J4634N915m511L714J9761
13184F25571L1699k9781J4155J3803j4249m132P2494N4256j1243m5015k0268M1237
13172G28527M8627L736j1468L3851k271K2811m4367L8854L6812o873K9444j8635
13160H59048m5716J701K2484O6043n0931p6223j1103J5790M8335M605j0854j1948
13148H11231p853M3061K0652K5565l6546K2669K6401M4376j2424J5592J9517k9640
13136I42601l660o8853j8836K1741j2083m6027o420K2467L2930Q345K3837j0453
13124H85589J5344K8152k371l1814J9508r241l6571K7286L6950M4286m2001l8441
13112H96676l269M8052j1820J788R297j2041K0768k9299l3115J2235K7484J9870
$$ y = [669564, 633466, 610492, 641458, 646804, 646934, 612134, 563507, 586058, 600692, 606607, 602096, 605810, 625571, 657270, 627489, 641644, 655447, 641198, 637066, 709560, 763816, 752573, 707558, 687290, 728527, 777154, 780890, 769422, 803273, 801002, 823813, 779446, 818300, 855112, 848239, 877683, 859048, 813332, 815033, 837517, 903560, 852629, 776406, 765303, 781093, 829428, 834033, 823179, 811231, 803378, 846439, 867091, 892656, 856110, 878779, 905180, 949556, 937132, 952724, 972241, 942601, 938941, 870088, 851252, 872993, 860910, 814883, 808463, 830930, 863860, 872205, 896042, 885589, 900933, 929085, 926714, 894900, 914408, 905167, 868596, 895882, 932832, 977118, 935117, 896676, 893407, 941459, 929639, 931427, 940724, 928683, 949451, 920152, 887037, 899272, 926756, 946626]
13100I46626L3103M6993K8350J9520k589K1928p014m7635N1550M3987O753K8470
13088A170042l2027L846M6940R166J1769m7Q841O6549J7965J7252P014M847J7294
13075A349451o655K2502K1809K9103Q1924L9221M3166M0904K8552M8227J00647
13064A798851M6160L4971R839O8477M7571M8307J37303J22657M8557L9227Q8985
13053B490905J33075J55882J02847R2309J84380J59240M7291R9970J29408Q1692
13043C676999J15383N2871j072K6983j6786p6781o5241q8454r9968j03415n6865
13032C363654j35663k09040p1963j50370j35335j16516j00006p9724l0833m0055
13022B294149j10907m3304n8999p913j7137p3685o8964n1618m67o067l8213n8027
$$ y = [946626, 979729, 1026722, 1055072, 1074592, 1072003, 1093931, 1086917, 1039282, 1090832, 1134819, 1141572, 1170042, 1138015, 1141861, 1188801, 1197967, 1209736, 1209689, 1218530, 1285079, 1303044, 1320296, 1327310, 1332157, 1349451, 1342796, 1365298, 1387107, 1416210, 1498134, 1537355, 1580521, 1621425, 1649977, 1698204, 1798851, 1845011, 1879982, 1889821, 1958298, 2005869, 2054176, 2191479, 2314136, 2362693, 2401920, 2490905, 2623980, 2779862, 2882709, 2975018, 3159398, 3318638, 3365929, 3465899, 3595307, 3676999, 3792382, 3845253, 3844181, 3871164, 3854378, 3777597, 3712356, 3623902, 3523934, 3420519, 3363654, 3227991, 3018951, 2946988, 2796618, 2661283, 2544767, 2444761, 2365037, 2334204, 2294149, 2183242, 2139938, 2080939, 2073026, 2055889, 1982204, 1913240, 1861622, 1861155, 1855088, 1816875, 1758848]
13010A758848n5726k5330J8311J1712m2430J0748j1751j75K1406L81k4374j6547
12998A645073l9481l7014m426L1697J9120n0545k5930M1312M330K9474m5906r5344
12986A472360l8218L9136M3614J6975n424j7836l237k442k4449m21N9739j5531
12974A524266J1783O645N564j1265K4839M5212q520n7273K8078K1486l1561K2887
12962A582141K5885M0928K2172o501j5597m7393P261L5219L6877m172k051M3431
12950A718200J4775m2774K1614L079j7494N899O4273O282o7959k353k6765J1018
12938A687795l38K7890N6532n238K8399R234l888J9156P7639l1540m200j1897
12926A849544o7528k1533L2241M0915K4817K463K4601L3008j2728q4290j5243
$$ y = [1758848, 1703122, 1677792, 1696103, 1707815, 1665385, 1676133, 1664382, 1664207, 1685613, 1685994, 1661620, 1645073, 1605592, 1568578, 1564152, 1595849, 1614969, 1564424, 1538494, 1579806, 1584136, 1613610, 1567704, 1472360, 1434142, 1473278, 1516892, 1533867, 1528443, 1510607, 1507370, 1504928, 1480479, 1480058, 1539797, 1524266, 1536049, 1542694, 1548258, 1536993, 1561832, 1607044, 1598524, 1541251, 1569329, 1590815, 1559254, 1582141, 1608026, 1648954, 1671126, 1664625, 1649028, 1601635, 1608896, 1644115, 1680992, 1676820, 1674769, 1718200, 1732975, 1690201, 1711815, 1714894, 1697400, 1703299, 1767572, 1773854, 1705895, 1703542, 1676777, 1687795, 1687457, 1715347, 1771879, 1766641, 1795040, 1804274, 1800386, 1819542, 1897181, 1865641, 1861441, 1849544, 1782016, 1760483, 1792724, 1833639, 1858456, 1860919, 1885520, 1918528, 1905800, 1821510, 1806267]
12915A806267O0949N9193K6375K4664Q262k1503L7851M5003K2194J6550L861L7925
12903B127591J9981J6371j9779j5222j053P337J6345L6864l7350L678M9881L9609
12891B244253P5845K1090J1322R845K3867j9081J345N4691N5183J8412j2021J3919
12879B498670j34O353l8616K8336M1148N2003M0366l1886J3326J7230K3624L0213
12867B680633O936M1022P583J3674J3286J7903o056J1315O790j7096K1709N8261
12855B855960N2684N0051J2008M2258M5613m6688L7146N5826N319O509J929P7320
12843C195935O2612m46p2336l6824L943L6160M4347N7187M4476O0302L1176J2097
12831C438629n991O1205O7990P6481K8713o3934n805J8167L566j8003J2848L6521
$$ y = [1806267, 1867216, 1926409, 1952784, 1977448, 1985710, 1964207, 2002058, 2047061, 2069255, 2085805, 2089666, 2127591, 2147572, 2163943, 2144164, 2128942, 2127889, 2135226, 2151571, 2188435, 2151085, 2154763, 2204644, 2244253, 2320098, 2341188, 2352510, 2362355, 2386222, 2367141, 2368486, 2423177, 2478360, 2496772, 2484751, 2498670, 2498536, 2504889, 2466273, 2494609, 2535757, 2587760, 2628126, 2596240, 2609566, 2626796, 2650420, 2680633, 2687569, 2728591, 2736174, 2749848, 2763134, 2781037, 2774981, 2786296, 2793086, 2775990, 2797699, 2855960, 2908644, 2958695, 2970703, 3012961, 3058574, 3011886, 3049032, 3104858, 3110177, 3116686, 3118615, 3195935, 3258547, 3258101, 3185765, 3148941, 3152884, 3189044, 3233391, 3290578, 3335054, 3395356, 3426532, 3438629, 3432638, 3493843, 3561833, 3638314, 3667027, 3603093, 3597288, 3615455, 3619021, 3601018, 3613866, 3650387]
12819C650387L4270J00125O1161K5015M2906j4979L3627M3157L4252K254m0163
12808C972012P060O9438O2221N0610M2362m602k4999M1974M2409L0627Q6223L227
12796D378562j3575J8072j9519K6107K2446K4230j3772J2805O0117P6037O3018
12785D634528K2531J4473m436M7573P4440R3796N6962M9509K5404N4727J06837
12774E176344L2135L9031J02728N2592J5374N2787R5604P4193N0030k544N8270
12763E746544P9589N2012L2956R4182P3930J195J5627O0761J13979O4820R1346
12752F426941R8391P4087M5594P7855K7262M8647R7129M5403L7071N9671Q1384
12741G119435P1696O8527L4816N1928J07579J29005R1219J03008R7926J23249
$$ y = [3650387, 3684657, 3784782, 3845943, 3870958, 3913864, 3898885, 3932512, 3975669, 4009921, 4012175, 3972012, 3979072, 4048510, 4110731, 4161341, 4203703, 4199101, 4174102, 4216076, 4258485, 4289112, 4375335, 4378562, 4364987, 4383059, 4363540, 4389647, 4412093, 4436323, 4422551, 4435356, 4495473, 4571510, 4634528, 4657059, 4671532, 4667096, 4714669, 4789109, 4882905, 4939867, 4989376, 5014780, 5069507, 5176344, 5208479, 5247510, 5350238, 5402830, 5418204, 5470991, 5566595, 5640788, 5690818, 5688274, 5746544, 5826133, 5878145, 5911101, 6005283, 6079213, 6080408, 6096035, 6156796, 6270775, 6335595, 6426941, 6525332, 6599419, 6645013, 6722868, 6750130, 6798777, 6895906, 6941309, 6978380, 7038051, 7119435, 7191131, 7259658, 7294474, 7346402, 7453981, 7582986, 7674205, 7777213, 7875139, 7998388]
12731G998388J07243P4952P1898J12022Q8533J92507J76250J40042J23254J15981
12721I201070J43023J30653J69144Q5179J98136J32037J12398J79709J94748K52766
12711A0798863J89846J11430J62862J70424J86578J84290J93643J78276J33249
12702A2309461K50298K61042J93158J08758J39857J67303J89417J81070J88375
12693A3988739J47759J55514K15850J96529J53911J91936K54916K84658K30611
12684A5820423K42608K38024K18470J62861K35329K83894L51517L43584L02467
12675A8199177K90239L27800L15042L11907L96223L97298L85204L84658L90357
12666B1397905M24154M79395N00281M52610M80988N21521N58037N74007N56002
$$ y = [7998388, 8105631, 8180583, 8252481, 8364503, 8453036, 8645543, 8821793, 8961835, 9085089, 9201070, 9344093, 9474746, 9643890, 9729069, 9927205, 10059242, 10171640, 10351349, 10546097, 10798863, 10988709, 11100139, 11263001, 11433425, 11620003, 11804293, 11997936, 12176212, 12309461, 12559759, 12820801, 13013959, 13122717, 13262574, 13429877, 13619294, 13800364, 13988739, 14136498, 14292012, 14507862, 14704391, 14858302, 15050238, 15305154, 15589812, 15820423, 16063031, 16301055, 16519525, 16682386, 16917715, 17201609, 17553126, 17896710, 18199177, 18489416, 18817216, 19132258, 19444165, 19840388, 20237686, 20622890, 21007548, 21397905, 21822059, 22301454, 22801735, 23254345, 23735333, 24256854, 24814891, 25388898, 25944900]
12657B5944900N79076O53377O45932O56909O68312O71908P46657P21636P92257
12648C2080964Q20058Q63973R27300R05327R03727R76565J079629J128684J169257
12639D0855484J192909J240256J315640J394699J437424J528586J621947J660098
12631E2247043J683192J821825J924408K054114K156340K260028K453065K554723
12623F9154738K745241K858591L039530L274673L436978L632565L920997M169622
12615I6232935M517345M763801N108249N474434N941875O386745O893703P433887
12607A42752974Q018804Q619276R331092J0055767J0869384J1761541J2736699
12600B14145537J3713322J4835238J6047394J7216538J8359267J9474203K0618365
$$ y = [25944900, 26523976, 27177353, 27823285, 28480194, 29148506, 29820414, 30567071, 31288707, 32080964, 32901022, 33764995, 34692295, 35597622, 36501349, 37477914, 38557543, 39686227, 40855484, 42048393, 43288649, 44604289, 45998988, 47436412, 48964998, 50586945, 52247043, 53930235, 55752060, 57676468, 59730582, 61886922, 64146950, 66600015, 69154738, 71899979, 74758570, 77798100, 81072773, 84509751, 88142316, 92063313, 96232935, 100750280, 105514081, 110622330, 116096764, 122038639, 128425384, 135319087, 142752974, 150771778, 159391054, 168722146, 178777913, 189647297, 201408838, 214145537, 227858859, 242694097, 258741491, 275958029, 294317296, 313791499, 334409864]
12593C34409864K1726724K2536466K3126219K3269043K2850929K1831300K0052903
12586D89803448J7509638J4099418R841257N073664P1975n049949r888683j4239365
12578E07221403j7838602k0622370k2573907k3660072k4110469k4002521k3517496
12571C50895966k2517006k1464216k0268809j9011438j7697426j6400801j5196909
12564B18339361j4057273j3021466j1929038j1041236j0237175r383131q680667
12557A39989375q040778p410778o838000o307482n856111n418697n022050m695600
12549I0399879m389243m062445l781482l526815l266716l030954k925229k740774
12541F2676221k583415k448446k266999k148795k062370j950153j830245j725355
$$ y = [334409864, 356136588, 378673054, 401799273, 425068316, 447919245, 469750545, 489803448, 507313086, 521412504, 531253761, 536327425, 536399400, 531349451, 521460768, 507221403, 489382801, 468760431, 446186524, 422526452, 398415983, 374413462, 350895966, 328378960, 306914744, 286645935, 267634497, 249937071, 233536270, 218339361, 204282088, 191260622, 179331584, 168290348, 158053173, 148670042, 139989375, 131948597, 124537819, 117699819, 111392337, 105536226, 100117529, 95095479, 90399879, 86010636, 81948191, 78166709, 74639894, 71373178, 68342224, 65416995, 62676221, 60092806, 57644360, 55377361, 53228566, 51166196, 49216043, 47385798, 45660443]
12533D5660443j601453j491289j518223j414390j253779j255510j185078j155161
12525C4785560j084545j021467r74218r45212r17362q19165q19090q37817p74313
12516B6592371p20594o96001o60852o44263o02104n79764n75450n77543n45436
12507B0990364m97139m45326m19271m23059m13302m71365m45301l64795l29529
12498A7181277l50875l28451l85507l31391l29675l14844l20264l05160k79625
12489A4235485k81167k20204j92645k95122k89458k77314k93193k62054k07772
12480A1916556j86634j55687j91281k23087k15440r8386j05571j88573j69768
12471A0382129j82723j87266j18112j66396j69079j46283j46422j29108j02880
$$ y = [45660443, 44058990, 42567701, 41049478, 39635088, 38381309, 37125799, 35940721, 34785560, 33701015, 32679548, 31705330, 30760118, 29842756, 29023591, 28204501, 27366684, 26592371, 25871777, 25175776, 24514924, 23870661, 23268557, 22688793, 22113343, 21535800, 20990364, 20493225, 20047899, 19628628, 19205569, 18792267, 18320902, 17875601, 17510806, 17181277, 16830402, 16501951, 16116444, 15785053, 15455378, 15140534, 14820270, 14515110, 14235485, 13954318, 13734114, 13541469, 13246347, 12956889, 12679575, 12386382, 12124328, 11916556, 11729922, 11574235, 11382954, 11159867, 10944427, 10846041, 10740470, 10551897, 10382129, 10199406, 10012140, 9894028, 9727632, 9558553, 9412270, 9265848, 9136740, 9033860]
12462I033860j07132o5556j62628j31698m7575j06417j44661r9255j23138j82622
12452G863178j05888j26612j22732n2563j08910m3527p6170j65759j72954r0723
12442F797340p2453p6121j30379j0681k0120p2575r5003j09123r6947j13838o4631
12431E935469j12265j42058j03781q9607m0918o4548p8726m6287j01897p8303
12421E077079p9931k5608o4254j30789r7972n9836j8357L116p4861p2743r8007
12410D357837r6076k3425k2301k852m2691k2236o9489l8478j7833l0371o7917
12399C924168m6439M562M4015j5477j8590o6251o3604K2590k9463r0353k8553
12388C636605o5761n2163o6682j1617j2667j8332l8529n6222m028J927n4521l3000
$$ y = [9033860, 8926728, 8861172, 8698544, 8566846, 8519271, 8412854, 8268193, 8168938, 8045800, 7863178, 7757290, 7630678, 7507946, 7455383, 7346473, 7302946, 7226776, 7061017, 6888063, 6797340, 6724887, 6648766, 6518387, 6507706, 6487586, 6415011, 6320008, 6210885, 6113938, 6000100, 5935469, 5823204, 5681146, 5577365, 5487758, 5446840, 5382292, 5303566, 5257279, 5155382, 5077079, 4997148, 4971540, 4907286, 4776497, 4678525, 4618689, 4600332, 4603448, 4528587, 4455844, 4357837, 4261761, 4238336, 4216035, 4213183, 4170492, 4148256, 4078767, 4040289, 4022456, 3992085, 3924168, 3877729, 3882291, 3926306, 3910829, 3892239, 3825988, 3762384, 3784974, 3755511, 3665158, 3636605, 3570844, 3518681, 3451999, 3440382, 3427715, 3409383, 3370854, 3314632, 3310604, 3312531, 3258010, 3225010]
12376C225010p525r7731n4816n7361j110J380o3208j1210l7405p2552r1159k8657
12364B703656k3887m6072j9698j8446J6110L1197n4494j9475J156o611M961m3893
12352B524504K098q1224j00199k5359N642J8588K5710o1003Q159K1194O55n8781
12340B279984l1892m4258k9226L6010k262m3282l216K0587k8128p0051j4015M438
12328B074689r84M429j2701m3637m0326Q600J2139q6005j31472j2858m217L8481
12316A806138Q7085j4459l9997l9847o0761p0752k6666L6020K6445K4478L3617
12305A761301l536j8596n1635J1157n0368k8113k7576N677j6308K9153O621k6079
12293A591698L806k6128m4750l7147N44K7440j7758k5385N937J1320j5892n8129
$$ y = [3225010, 3217485, 3119754, 3064938, 3007577, 3006467, 3007847, 2944639, 2933429, 2896024, 2823472, 2732313, 2703656, 2679769, 2633697, 2613999, 2595553, 2611663, 2642860, 2588366, 2568891, 2570047, 2563436, 2568397, 2524504, 2526602, 2445378, 2345179, 2319820, 2325462, 2344050, 2369760, 2308757, 2316916, 2338110, 2338765, 2279984, 2248092, 2203834, 2174608, 2210618, 2208356, 2165074, 2161858, 2182445, 2154317, 2084266, 2070251, 2074689, 2073705, 2078134, 2065433, 2021796, 1981470, 1990070, 2002209, 1916204, 1784732, 1771874, 1767657, 1806138, 1893223, 1878764, 1838767, 1798920, 1738159, 1667407, 1640741, 1676761, 1703206, 1727684, 1761301, 1757765, 1739169, 1687534, 1698691, 1648323, 1620210, 1592634, 1598311, 1582003, 1611156, 1617777, 1591698, 1595504, 1569376, 1524626, 1487479, 1488023, 1515463, 1497705, 1472320, 1478257, 1489577, 1473685, 1415556]
12281A415556J1879o2051k9796L9043L7016j3716k4660j3202K5596K2626l9524
12270A368767K7545L1829p346P083k7427q2821j7730J4925O7449j1673j3797k7390
12258A329414m5566K9946J0581j0759Q193q950j3216l2499j263N2552K6902ql5970
12245A309357m4095j5263L7548j5282P446J4831R952j3395l7265K3754k1296n0882
12233A205410n6671J6824q970p9281L5589P4295R880k9614m7214K8221O5115J4163
12221A227747q2337m2828K1539l3652J4936K1182N8283J6304m3024q2996j8834
12210A056320N0947j4863r383L951j6464M5018P490O624k5386k6637m0298N173
12198A042492N316r424M2148L9543K7689O3529j8845p953r762j1878q2898O5772
$$ y = [1415556, 1427435, 1365384, 1335588, 1374631, 1411647, 1397931, 1373271, 1360069, 1385665, 1408291, 1368767, 1396312, 1428141, 1420795, 1427878, 1400451, 1317630, 1299900, 1314825, 1382274, 1370601, 1356804, 1329414, 1283848, 1313794, 1324375, 1313616, 1321809, 1312859, 1299643, 1267144, 1265881, 1318433, 1345335, 1345327, 1309357, 1265262, 1249999, 1287547, 1272265, 1279711, 1294542, 1304494, 1291099, 1253834, 1277588, 1256292, 1205410, 1148739, 1165563, 1156593, 1077312, 1112901, 1187196, 1197076, 1167462, 1120248, 1148469, 1213584, 1227747, 1145410, 1102582, 1124121, 1090469, 1105405, 1126587, 1184870, 1201174, 1158150, 1075154, 1056320, 1107267, 1092404, 1083021, 1086972, 1070508, 1115526, 1123016, 1129640, 1104254, 1077617, 1037319, 1042492, 1047808, 1038384, 1080532, 1120075, 1147764, 1211293, 1192448, 1184495, 1174733, 1162855, 1079957, 1145729]
12186A145729M9632J3573K1563m3391n8732m471j0859P08K1224m400o9685k9236
12174A031655K2810L2132K9056N8823N4302m1010m0196N6907K6694j6654L8871
12163A253390M3000q284o480p319m5657L2346L5688M7196J7303N446J2172l2805
12151A345996J3935M087l4957L2884O6682Q8842O4626R7775N0269L9069O3291
12140A832499J6544N8911N4032M7291L4005L2619L1018J27935R9424Q6937Q0763
12129B501978Q9306R6898R2707J35889J64872J20907J34295J42551J71289Q1173
12119C731865L6551Q3655J9151M3773q525r8161q8552o2394j13272j70640o1580
12108C311871m9997j03450j23020r7498j31592j61882j14966q5295p2481q7973
$$ y = [1145729, 1195361, 1208934, 1230497, 1187106, 1128374, 1123903, 1113044, 1113752, 1134976, 1130576, 1060891, 1031655, 1054465, 1086597, 1115653, 1174476, 1228778, 1187768, 1147572, 1204479, 1231173, 1214519, 1253390, 1296390, 1288106, 1281626, 1274307, 1228650, 1260996, 1296684, 1343880, 1361183, 1366629, 1378801, 1345996, 1359931, 1364018, 1329061, 1361945, 1428627, 1517469, 1582095, 1679870, 1730139, 1769208, 1832499, 1849043, 1907954, 1961986, 2009277, 2043282, 2075901, 2106919, 2234854, 2334278, 2421215, 2501978, 2591284, 2688182, 2780889, 2916778, 3081650, 3202557, 3336852, 3479403, 3650692, 3731865, 3768416, 3852071, 3871222, 3914995, 3906470, 3808309, 3719757, 3657363, 3544091, 3373451, 3311871, 3261874, 3158424, 3035404, 2937906, 2806314, 2644432, 2529466, 2444171, 2371690, 2283717]
12098B283717p6258k2044k6722j10790o5008n1325n6698J8855m2283m4315j9466
12087A787663n0225K221L5578j5240o5889l0206k8583m2850J6982M0985l8971
12076A611465n000k5259k1069N854O3379Q422J54L1964K7075k5783m6257o1126
12064A563819J275M9547M5201M5659j4373p917r642L8069p0888l0795N7074Q4977
12052A752006K0770o0884j7271N5482J8133k1115j5065K7623L2920j8906O787
12041A780480K3486Q5987K8883O4543J07168Q1443j0153j3856K8394K7202L059
12030B206636k3126R927N3672N3438O7049R2258R5298J03104N5896M5402K5142
12019B784696O5193Q9209O2439K6268R1951Q0042P6859J41300J09964N7586Q7474
$$ y = [2283717, 2207459, 2185415, 2158693, 2047903, 1982895, 1931570, 1874872, 1893727, 1851444, 1807129, 1787663, 1737438, 1739659, 1775237, 1759997, 1694108, 1663902, 1635319, 1592469, 1609451, 1650436, 1611465, 1606465, 1581206, 1560137, 1565991, 1629370, 1637792, 1637946, 1669910, 1696985, 1671202, 1624945, 1563819, 1565094, 1614641, 1659842, 1705501, 1691128, 1683211, 1673569, 1711638, 1640750, 1609955, 1667029, 1752006, 1772776, 1711892, 1694621, 1750103, 1768236, 1747121, 1732056, 1759679, 1792599, 1773693, 1780480, 1803966, 1889953, 1918836, 1983379, 2090547, 2171990, 2161837, 2147981, 2176375, 2203577, 2206636, 2183510, 2193437, 2247109, 2300547, 2367596, 2459854, 2555152, 2658256, 2714152, 2759554, 2784696, 2849889, 2939098, 3001537, 3027805, 3119756, 3199798, 3276657, 3417957, 3527921, 3585507, 3672981]
12008C672981J23841R1585J15953J49519J01755J31750J62416J36235J24166J45845
11998D956046J63917J78119J99883K22678J91860J62588K61454K58707L13880
11989F909132L33345L68189L78967L49544L55014L88605M12734M60876M49308
11980A0405714M81142N46098O35082O03553O42245P39540P92759P93124Q80900
11971A6520157R28908J021864J136668J251961J316913J399698J425690J495958
11963B6497817J565701J691338J694277J721104J630735J511377J352444J164629
11955C8829422R82682O69383L35129n2376l61294o79335j033609j318794j511170
11946C5860038j695467j689121j706925j783619j733693j701306j612668j544466
$$ y = [3672981, 3796822, 3888407, 4004360, 4153879, 4255634, 4387384, 4549800, 4686035, 4810201, 4956046, 5119963, 5298082, 5497965, 5720643, 5912503, 6075091, 6336545, 6595252, 6909132, 7242477, 7610666, 7989633, 8339177, 8694191, 9082796, 9495530, 9956406, 10405714, 10886856, 11432954, 12068036, 12671589, 13313834, 14053374, 14846133, 15639257, 16520157, 17449065, 18470929, 19607597, 20859558, 22176471, 23576169, 25001859, 26497817, 28063518, 29754856, 31449133, 33170237, 34800972, 36312349, 37664793, 38829422, 39812104, 40481487, 40816616, 40764240, 40402946, 39723611, 38690002, 37371208, 35860038, 34164571, 32475450, 30768525, 28984906, 27251213, 25549907, 23937239, 22392773]
11938B2392773j479136j334247j201011j178762j089672j007552r16819q54338
11930A3331236q03232p46544o76632n87923n86873n53071m52790m44623m37764
11921H041784l69605l80332l24666k87319k63770l40128k71448k31721k17389
11912E355406j64471j99599k36373j90832p9958j26950k02197j52343j22274j14066
11902C766343j05291j21706j43548o7054j05511j07669q8259q2552o1162j25680
11892B757911j22465m2110l0900n4723j14753q1089m8482o4509o9831l5588o5332
11881B028129o8802K1674l0177q4391j6155o304p2139j22802n1278m4863j8883
11870A534009m4961k61j907n6653k2353k7770K6035M228l9811p6656k7475m761
$$ y = [22392773, 20913637, 19579390, 18378379, 17199617, 16109945, 15102393, 14185574, 13331236, 12528004, 11781460, 11104828, 10516905, 9930032, 9376961, 8924171, 8479548, 8041784, 7672179, 7291847, 6967181, 6679862, 6416092, 6075964, 5804516, 5572795, 5355406, 5190935, 4991336, 4754963, 4564131, 4484173, 4357223, 4155026, 4002683, 3880409, 3766343, 3661052, 3539346, 3395798, 3328744, 3223233, 3115564, 3027305, 2944753, 2883591, 2757911, 2635446, 2593336, 2562436, 2507713, 2392960, 2311871, 2263389, 2198880, 2129049, 2093461, 2028129, 1959327, 1981001, 1950824, 1866433, 1850278, 1843974, 1771835, 1649033, 1597755, 1552892, 1534009, 1489048, 1488787, 1486880, 1430227, 1407874, 1380104, 1406139, 1410367, 1370556, 1293900, 1266425, 1261664]
11858A261664l6803J0546K9856j9835l9783l2002j4648M1887l2084j01135M6059
11847A113722l5574o5629J4539j5912o0352L546M636n2593J1314j1226j1397J1982
11835I07056k0056l7285m5667j8024N5890j5198J0061J3843L4887L2248l1909
11824H85846q5559q1186J4310K5233J4390m4120k6204r918k2300L4273N229k2129
11812F87865n871J1442L4336m5198l6683l1542K4676j1252k8572k3066N1646K3541
11800F51322j7256m0438n6991o9212K5981L8180K2519J2224k0149m0887L5520
11789E40813J179k4474p1897k7732K0081L0366J5450j0373j21802k5088N8853
11778C85376M7436M1037m8911m5529l2198k6196R4048K9909n1920K855K4945l1570
$$ y = [1261664, 1224861, 1235407, 1265263, 1245428, 1205645, 1173643, 1158995, 1200882, 1168798, 1067663, 1113722, 1078148, 1012519, 1027058, 1011146, 950794, 954340, 958976, 906383, 917697, 906471, 895074, 907056, 887000, 849715, 804048, 786024, 841914, 826716, 836777, 850620, 885507, 917755, 885846, 800287, 719101, 733411, 758644, 773034, 728914, 702710, 692792, 670492, 704765, 709994, 687865, 681994, 693436, 727772, 682574, 645891, 614349, 639025, 627773, 599201, 576135, 627781, 651322, 634066, 593628, 536637, 467425, 493406, 531586, 554105, 566329, 546180, 505293, 540813, 541992, 517518, 445621, 417889, 437970, 468336, 483786, 473413, 351611, 326523, 385376, 432812, 473849, 424938, 379409, 347211, 321015, 415063, 444972, 393052, 395907, 420852, 389282]
11766C89282Q890k7861j4675J1785n193J4119l8518j397K7872O333o158K6499
11754C90978k4428j9364K3008O8067j453l3899l2531n0423M4440J7292k8901o1861
11742B90925J0599M3995k5802k2996J4123N9727J7139j7028J8405J0198n1599
11731C47686k9938L308m554p6302j4314O9215M0909J5193o0870l9962K4236R492
11719B84099j8351j5286j6530k8814N9772j4972n4626K9107k7096K7544R3866
11708C18713O652K0458j8929r7399m2854L1657P7379Q159P441K5485M7047l5961
11696C47848k9989M3843l8754m4742q4534J4429r156k4354j016r950L4166j68
11684A97623K9898N789J8112P0987k3838m0173O640k5251K671K6371n960N843
$$ y = [389282, 398172, 370311, 355636, 367421, 362228, 376347, 337829, 336432, 364304, 370637, 364479, 390978, 366550, 347186, 370194, 438261, 436808, 402909, 370378, 319955, 364395, 381687, 352786, 290925, 301524, 345519, 319717, 296721, 310844, 370571, 387710, 370682, 389087, 399285, 347686, 317748, 321056, 316502, 240200, 225886, 295101, 336010, 351203, 290333, 250371, 274607, 284099, 265748, 250462, 233932, 205118, 264890, 249918, 195292, 224399, 197303, 224847, 318713, 325365, 345823, 326894, 229495, 186641, 218298, 295677, 303836, 311277, 336762, 383809, 347848, 317859, 361702, 322948, 278206, 193672, 208101, 198945, 174591, 173575, 163625, 197791, 197623, 227521, 233310, 251422, 322409, 298571, 258398, 265038, 239787, 242458, 268829, 262869, 268712]
11672B68712K5143l2764o7869N4596K2331Q451q403J2584J7427k8758j7232o823
11660B47395k542J2545J0435K1325K9252Q398M965j7796p3147o271L6298K4326
11648B95183N213j6507j0982j1912l3172J831O5870o818l0864j7538O766j6326
11636B30744p5398l8992j4027Q075O8482K0922J7422K7574r720J1814J3511J4551
11624B74958N6452M670m7185m6546N15p321j1036j4846j6530l4833j1017K5408
11612A72689K4069o573j4382K9939R428K9115l7225k5623m3322r127K9515j3479
11600A45024k7634N1O8232j6871l0378p211N2326o69l0307n434l4625K3835M2491
11587A78830l6641k430N6662o9436n9343j147O002P452M3947j7188n065j811p010
$$ y = [268712, 293855, 261091, 193222, 247818, 270149, 278600, 270197, 282781, 300208, 271450, 254218, 247395, 244853, 257398, 267833, 289158, 318410, 326808, 331773, 313977, 240830, 234559, 270857, 295183, 300396, 283889, 272907, 260995, 227823, 229654, 295524, 288706, 257842, 240304, 247070, 230744, 155346, 116354, 102327, 110402, 178884, 199806, 217228, 244802, 235082, 246896, 260407, 274958, 331410, 336080, 288895, 242349, 242864, 235543, 224507, 209661, 193131, 158298, 147281, 172689, 196758, 190185, 175803, 205742, 215170, 244285, 207060, 181437, 138115, 128988, 158503, 145024, 117390, 117441, 185673, 168802, 138424, 131213, 183539, 182870, 152563, 147129, 112504, 136339, 178830, 142189, 139759, 196421, 126985, 67642, 66495, 72497, 79949, 123896, 106708, 101643, 99832, 92822]
11574I2822K1283j7798J990J7014K5760n528J1355k3532J8604J8835n5933p608
11562I7264l1179K3184K9402j4889R783m006O406m6546m1038M1550J9193m4344
11550D4780k4551R135J8105O8584N5267n89m9770m0585j013Q6356L171L791m388
11537A68293k8878l0379j7483N870K6074r906l867k5359M1151K5937j316m452
11525A45685p2295l973j6376k028J7648J5752K8214L5m0154J7973o84R51j1452
11512G9296J9172l1093k6698J9812N1878N5904n8309l1891j0566N571k9515j050
11500D2511K0372L017r306K8372N1010j0031j8244K2409J5255n2940k6742L3798
11488I9481K1293j0996M9563n6413n8953Q03J093n748k6670L5868L2350j5137
$$ y = [92822, 114105, 96307, 98297, 115311, 141071, 135543, 146898, 123366, 141970, 160805, 104872, 97264, 66085, 89269, 118671, 103782, 113565, 109559, 115965, 69419, 28381, 69931, 89124, 44780, 20229, 29364, 47469, 116053, 171320, 170731, 120961, 80376, 79363, 165719, 168890, 172681, 168293, 139415, 109036, 91553, 97423, 123497, 113591, 109724, 84365, 125516, 151453, 150137, 145685, 73390, 69417, 53041, 51013, 68661, 84413, 112627, 112662, 72508, 90481, 89797, 90748, 79296, 98468, 67375, 40677, 60489, 112367, 168271, 109962, 78071, 67505, 73076, 43561, 42511, 62883, 65900, 56594, 84966, 135976, 125945, 107701, 130110, 145365, 92425, 65683, 99481, 120774, 109778, 159341, 102928, 43975, 44778, 45871, 40123, 13453, 49321, 81671, 66534]
11476F6534n5287j2073K9300P729J4045j605L0230l1184l3640L6582K1905j572
11464G0964K5580M1572N90m4912o2156n4793Q0798K4091L6192K9489k3035j8805
11452A05575l5700J2258r868k934M04l3026J7563K3925J5294J0946j5042k8489
11440F0906k1282r3694J1591K2956N4589R5435L399l5063m8083K7570L0798j3205
11428I5917j9402M9676l803J636Q660m7177l6249k4141K2772M9218K9621q634
11416A18094j7074l0918J3788L8452k5770j8826K3748j1805j6674n462K1239l3366
11404E5426n7719R316N8558m295l0146l6169M00Q072O8506N7470L7597m9729m7645
11391F9642n2176q828j1615p804O1043J9932l6346j8195k8506J454j9594O6645
$$ y = [66534, 11247, -826, 28474, 36203, 50248, 48643, 78873, 47689, 14049, 50631, 72536, 70964, 96544, 138116, 138706, 93794, 31638, -23155, 57643, 81734, 117926, 147415, 124380, 105575, 69875, 82133, 72265, 69331, 69735, 36709, 54272, 78197, 93491, 104437, 89395, 60906, 39624, -54070, -42479, -19523, 35066, 130501, 133900, 98837, 50754, 78324, 109122, 95917, 76515, 126191, 122388, 124024, 132684, 85507, 49258, 25117, 47889, 97107, 126728, 118094, 101020, 70102, 83890, 122342, 96572, 77746, 101494, 89689, 73015, 67553, 88792, 55426, -2293, 7023, 65581, 61286, 31140, -5029, -4629, 3443, 71949, 129419, 167016, 117287, 69642, 17466, 8638, -2977, -10781, 50262, 70194, 33848, 15653, -12853, -11399, -30993, 35652]
11379C5652K0429o647K643l099K2200p2444k9651J7656J4641K6167j3219l5009
11367b0681r177L9172r013l0734l7406j645M4900k4871L4112N2857N9882j4410
11355H2986m0002k6403O5136M0172j0936k9580l7424P682M1978k8814j125k835
11343F0835J4701N627j832L9527M7946k0335o9679j5834j9317m5623R739O6125
11331G1880M9843l4208l2196p568j0787l8963K93K8814K2906j8924O367M7565
11319H5022R295J209J6954m9278k2262n1r398K7376J6039P3061J2038r5488l0209
11306C4308P0799J8275k7798m543M6058P4693j5632m1820R607j5220j3460j1460
11294A23807k5170k5763J7083M6599M5531O192J8413J0961K2843l3964M125J3596
$$ y = [35652, 56081, 49434, 52077, 48978, 71178, -1266, -30917, -13261, 1380, 27547, 14328, -20681, -29858, 9314, 301, -30433, -67839, -69484, -24584, -49455, -15343, 37514, 97396, 82986, 42984, 16581, 81717, 121889, 110953, 81373, 43949, 51631, 93609, 64795, 63670, 60835, 75536, 81163, 79331, 118858, 166804, 146469, 76790, 60956, 41639, -3984, 5755, 71880, 121723, 87515, 55319, 47751, 36964, -1999, -1706, 27108, 50014, 31090, 37457, 85022, 94317, 95526, 112480, 63202, 40940, 40889, 31491, 58867, 74906, 147967, 160005, 64517, 34308, 105107, 123382, 95584, 91041, 137099, 211792, 196160, 154340, 163947, 148727, 135267, 123807, 98637, 72874, 89957, 136556, 182087, 188279, 206692, 217653, 240496, 206532, 210657, 224253]
11282B24253M1j7230o4667K992j7351k8515N3185j1466J884P2117k313J5282J3533
11269B41745L682P6244M6245J1029Q3745M1721L0846m696L774J4741K2284P1672
11257F43032L0039j4010L2237n885l3781L163n7086j1837l4788o5561J6685r553
11245D92655l9079j13761j4815o773j8117J3503M1367j2176l8500l7671k2191
11234B44442L673q4810l2611k6682P659J4567Q018M3236k4727m2253K8221j0760
11222A27973K1923L727l9448q77j084m2893l2666L47M8382j4674P0L0857J3141
11209A14778K3171k7701m1456O645J0179L21M8254j2383l9452K4423K5656J5112
11197A47547N6960k5827n3096O252k5938p773M266R799j5650j8546K3061l5680
$$ y = [224253, 224294, 207064, 142397, 145389, 128038, 99523, 152708, 141242, 143126, 215243, 212930, 228212, 241745, 245427, 321671, 367916, 378945, 462690, 504411, 535257, 530561, 534335, 549076, 571360, 643032, 673071, 659061, 691298, 685413, 651632, 654795, 597709, 585872, 551084, 485523, 502208, 492655, 453576, 339815, 325000, 318227, 300110, 313613, 354980, 342804, 304304, 266633, 244442, 248115, 163305, 130694, 104012, 111671, 126238, 134256, 177492, 152765, 110512, 138733, 127973, 149896, 153623, 114175, 113298, 112214, 69321, 36655, 37002, 85384, 70710, 70780, 101637, 114778, 137949, 110248, 68792, 75437, 85616, 85937, 134191, 121808, 82356, 106779, 132435, 147547, 204507, 178680, 125584, 131836, 105898, 98125, 102391, 112190, 96540, 77994, 101055, 65375]
11185F5375j5895N580P183r104R102L2658J0940o6908j07199J1281N3551O195
11173B759Q434P437J5804O654j211l4723J0965J6471j9486j3979J6654m8300J0105
11160b2416n927m454r058k3211L4552O4908J8275j0563k0400K9784L1308m3158
11148C9640l1368q371j5790k4346r388L7928N0748J8079j0022n0067l9521M1890
11136e88L6773O219o399J6872k8392k4414N3853k1743p112K9939k9085j1370M4484
11123E9037J4330j591Q2289Q250n6040p137J595K942Q624o2883K3303K1239k1715
11110G2243j8259K5281q231L3720M848j2297j7269K3558j4752j6899j4164J5172
11098G2951L086l5448K6959N1547j7825J9498l6255k7970l1174j0026j0299L423
$$ y = [65375, 49480, 55060, 62243, 53139, 62241, 94899, 105839, 38931, -68268, -56987, -3436, 2759, 11193, 18630, 34434, 41088, 39877, 5154, 16119, 32590, 13104, -875, 15779, -32521, -22416, -28343, -32797, -41855, -65066, -30514, 34394, 52669, 42106, 21706, 51490, 82798, 39640, 8272, -99, -15889, -40235, -49623, -11695, 39053, 57132, 47110, -2957, -42478, -588, 36185, 42404, 36005, 52877, 24485, 71, 53924, 32181, 25069, 55008, 25923, 14553, 59037, 73367, 71776, 154065, 162315, 106275, 99138, 100733, 103675, 112299, 49416, 72719, 93958, 72243, 53984, 79265, 71034, 104754, 109602, 97305, 80036, 103594, 88842, 71943, 57779, 72951, 76037, 40589, 67548, 119095, 101270, 120768, 84513, 56543, 25369, 15343, 5044, 8467]
11086H467M9940L4956m809M607L889L5215N9663P760n1068l898k7484l827K1104
11073A34515k5253m5903j9874M939J7851K8691K5554K8402K520m1282j8420k6208
11061F5532O988K7556M945p0K4870J3445q156k8415o118J483N4975n0571M203
11048A10667N2578J1806L2839j7137J01L9682j5691l789k2252j1563K681m5112
11036A34810o352j5591k7668K4991J9688k5830L7832N0939J3407J9758k2652j1306
11024A92026k3805j8780l88L0773M3408j9224l9203j4373N462J0316k7258J6110
11012A55064N1841M9717j5296O146q677k6200j4067n7258k5452N6545N1412j330
11000B22445P721L1092k441Q727n8676m4174K6678L4513l8620l4683J7687m5045
$$ y = [8467, 58407, 93363, 88554, 93161, 97050, 132265, 191928, 199688, 148620, 144722, 117238, 113411, 134515, 109262, 63359, 43485, 48424, 66275, 94966, 120520, 148922, 151442, 110160, 91740, 65532, 72520, 100076, 105021, 104951, 129821, 143266, 135110, 106695, 100577, 102060, 157035, 106464, 110667, 163245, 175051, 207890, 190753, 190854, 230536, 214845, 211056, 188804, 177241, 179922, 134810, 128458, 112867, 85199, 110190, 129878, 104048, 141880, 192819, 206226, 225984, 203332, 192026, 168221, 149441, 149053, 179826, 223234, 204010, 164807, 150434, 155896, 166212, 138954, 155064, 206905, 256622, 241326, 247472, 238795, 212595, 198528, 141270, 115818, 172363, 223775, 222445, 230166, 261258, 258817, 267544, 208868, 164694, 191372, 225885, 187265, 152582, 170269, 125224]
10988A25224N821j3027m0157K9999M6863p636J4857J7687J691l75J7701m2881
10976A55767j5939k0703n0339j0520N4006m0661o985l13j5828L7298K7921L6584
10964A50288k5097L4129k3879o4283N133K9994M9055m8452j0429O7433L1292l5711
10952A59473k672J5464j1287n928J4171l226J3243m5625n7956J1007k5136n154
10940E6374L5585j1588k5146M8974L6455J3662L396M3084L0985n4478p2418l6535
10928F8350j7315J9704K7632r403Q632N9306K9180K250m2968n3607K6481l352
10916A14890n4812K4328J7009m671J1264L1176j301k4266k8184l3062m2379Q114
10904A8106J5375L6788J3932L6156K9441m2470P875m7736n242J6328m229J0894
$$ y = [125224, 131045, 118018, 77861, 107860, 154723, 147087, 161944, 179631, 181322, 180947, 198648, 155767, 139828, 119125, 68786, 58266, 112272, 71611, 64626, 64313, 48485, 85783, 113704, 150288, 125191, 159320, 135441, 71158, 76291, 106285, 155340, 106888, 96459, 163892, 195184, 159473, 156801, 172265, 160978, 155050, 169221, 165995, 179238, 133613, 75657, 86664, 61528, 56374, 91959, 80371, 55225, 104199, 140654, 154316, 157712, 200796, 231781, 177303, 104885, 68350, 51035, 70739, 98371, 88968, 97600, 156906, 186086, 188336, 145368, 91761, 118242, 114890, 60078, 84406, 101415, 96744, 108008, 139184, 137883, 113617, 85433, 52371, 9992, 18106, 33481, 70269, 84201, 120357, 149798, 107328, 115203, 67467, 62225, 78553, 74324, 85218]
10892H5218L5010M483m8106k9661J7190K1498L735L573K8731p442R807J3277L0452
10879A67765n107l5643M9441N5696l967o0708k3495L6757k5126n0571k0253L7041
10867A21830N7683k2165J1106L3186K0469Q083K3330N790L1546o2657p9272P263
10855A56192J4069j2479L9302k9223m3157M0102N5406q460l9743o5974L0982k6436
10843A10581J468l2762O9298Q1444j9966p3992M0083R0929P991m5574k7019l5077
10831A67404k0022L3081J5104k8726q522L9127J1280l552J1663P741K6147n0164
10819B00561M355O664j4757J9604J1134L3673O371M4464j4153n6268R009N6929
10807C07586o318q2N2229M2661o1647o5950l7639K2617Q4307K8483n1423k1604
$$ y = [85218, 120228, 124711, 76605, 46944, 64134, 85632, 89367, 92940, 121671, 114229, 124036, 137313, 167765, 162658, 127015, 176456, 232152, 228185, 167477, 143982, 180739, 155613, 105042, 84789, 121830, 179513, 157348, 168454, 201640, 222109, 230192, 253522, 259312, 290858, 228201, 148929, 156192, 170261, 157782, 197084, 167861, 124704, 164806, 220212, 211752, 172009, 106035, 137017, 110581, 112049, 79287, 148585, 230029, 210063, 136071, 176154, 267083, 275074, 229500, 202481, 167404, 147382, 180463, 195567, 166841, 158319, 197446, 208726, 205174, 216837, 224578, 250725, 200561, 204916, 211580, 196823, 216427, 227561, 261234, 267605, 312069, 297916, 241648, 250657, 307586, 301268, 301186, 353415, 396076, 334429, 268479, 230840, 253457, 337764, 366247, 314824, 293220]
10795B93220K7586K3689p69l8825j3374k3343L0689K3066j4913k3170m9512K987
10783B37331L1564m248L2461J1548K1751K5485j3629k4136K1588M0077K4772p9712
10771C24852j798J1335L5383N072m282Q349k9302n5746Q4222Q7547K2902j3820
10759D74714K8289k5050j3080j7015R639J4411Q33L3161q777j9196M3721K1934
10747E43584l7504l8201j3063K7921N7585J0801m5676M7109L5332k4993j2631
10736E50264P403k2673k0245L1004O677o290J9409M4819J3136J9798l470J8076
10724F57908M1496P966N2055o357l8021r957J1053k135Q101O887L4612O6128J1933
10711H41669l1733o272O1719N2543M9048K7717K3658J2001N1251m035j4683J8895
$$ y = [293220, 320806, 344495, 343726, 304901, 291527, 268184, 298873, 321939, 307026, 283856, 234344, 237331, 268895, 264647, 297108, 308656, 330407, 355892, 342263, 318127, 339715, 379792, 404564, 324852, 323054, 334389, 369772, 374844, 370562, 378911, 349609, 293863, 378085, 465632, 488534, 474714, 503003, 477953, 464873, 447858, 457497, 471908, 472741, 505902, 497125, 477929, 521650, 543584, 506080, 467879, 454816, 482737, 540322, 551123, 505447, 552556, 587888, 562895, 550264, 557667, 534994, 514749, 545753, 552430, 546140, 565549, 610368, 623504, 643302, 639832, 657908, 699404, 707370, 759425, 753068, 715047, 705090, 716143, 714008, 722109, 728996, 763608, 829736, 841669, 809936, 803664, 865383, 917926, 966974, 994691, 1018349, 1030350, 1081601, 1077566, 1062883, 1081778]
10699A081778L202M9226m364k1368L278M4539J5466j4271l1427L507N8591M2957
10687A231114R311L9650N4260K3384j5655R123M030M5160P1955j1089M0244P965
10675A509452j3478K7526n507Q6541O7738N8111J02330O6307L0223K089k4939
10664A906393Q926K2956M7639J34352R3176K2304N7475J9750J26107J03776K5507
10653B568361M0436P5820P5382J18367J20293R3618J34559J20400R9587M7465
10643C494288J02444J42834P0715J63256J75095J41118K53660K13389J48320J97101
10633E102220K35446K45652K26493K49478K81551L33685L79579L70116L57746
10624G781966M18398M33331M65378M73850N20552N50566N61792O23279O25590
$$ y = [1081778, 1084980, 1134206, 1129842, 1108474, 1111752, 1156291, 1171757, 1157486, 1126059, 1129566, 1188157, 1231114, 1240425, 1280075, 1334335, 1357719, 1342064, 1351187, 1355217, 1400377, 1472332, 1461243, 1501487, 1509452, 1495974, 1523500, 1517993, 1604534, 1672272, 1730383, 1832713, 1899020, 1929243, 1931332, 1906393, 1915319, 1938275, 1985914, 2120266, 2213442, 2235746, 2293221, 2312971, 2439078, 2542854, 2568361, 2608797, 2684617, 2759999, 2878366, 2998659, 3092277, 3226836, 3347236, 3446823, 3494288, 3596732, 3739566, 3810281, 3973537, 4148632, 4289750, 4543410, 4756799, 4905119, 5102220, 5337666, 5583318, 5809811, 6059289, 6340840, 6674525, 7054104, 7424220, 7781966, 8200364, 8633695, 9099073, 9572923, 10093475, 10644041, 11205833, 11829112, 12454702]
10615A2454702O79302P99620P82554P52636P83946P77682Q13574Q11331Q16665
10606A9472012Q24362P63588Q01041Q55786Q23571Q00381P87516P55555P22937
10597B6606749P41381O63321N95572N09737M94423M95182M42965M01179L33313
10588C1283822K66915J61013P3064l0499p5386q5429k56376k91353l59287m51792
10578C0234692m73354m65546n52039o24637o78037p37789p49955p35509p70938
10569B4446888q13292q25139q34238q19346q68522q06877q18045q41490p97277
10560A7022662p88284q15164p54329p88199p90030o53595o68489o32545o36750
10551A0495277o07995m79438m96208n51334m52645l96398m03571l53722l05101
$$ y = [12454702, 13134004, 13933624, 14716178, 15468814, 16252760, 17030442, 17844016, 18655347, 19472012, 20296374, 21059962, 21861003, 22716789, 23540360, 24340741, 25128257, 25883812, 26606749, 27348130, 28011451, 28607023, 29116760, 29611183, 30106365, 30549330, 30950509, 31283822, 31550737, 31711750, 31784814, 31754315, 31678929, 31593500, 31337124, 31045771, 30686484, 30234692, 29761338, 29295792, 28743753, 28119116, 27441079, 26703290, 25953335, 25217826, 24446888, 23633596, 22808457, 21974219, 21154873, 20286351, 19479474, 18661429, 17819939, 17022662, 16234378, 15419214, 14664885, 13876686, 13086656, 12433061, 11764572, 11132027, 10495277, 9887282, 9407844, 8911636, 8360302, 7907657, 7511259, 7107688, 6753966, 6448865]
10542F448865k69873k86397l00121k31090k30739k47625k50533k07902j85248
10533D239337j71471j45744j29836j24439j78126k01966o8650p6642p2092r2729
10523B977642r4990r3509j10963j00724r4449k9073k0424m0335p0648o8803j25241
10512B128483K094m7833p8775p7531n5060l996n3408m0794j24687r7454k1417
10501A529622j608J3471m7791o4337n9400K6544j8180n5099k0016k371k5623n4109
10489A221103n8391l0172p722l2003l1715k015m5979q711M8206l3407l6039R500
10477I92655p143k1004L668k3035l3477k4378M81k6510l3327N9030l8564m4557
10465H03839k6810l8578J6479L8204K9946r382n5988j1118Lk8414k7376L7932
$$ y = [6448865, 6178992, 5892595, 5592474, 5361384, 5130645, 4883020, 4632487, 4424585, 4239337, 4067866, 3922122, 3792286, 3667847, 3489721, 3287755, 3219105, 3142463, 3070371, 2977642, 2882652, 2789143, 2678180, 2577456, 2483007, 2453934, 2433510, 2393175, 2322527, 2253724, 2128483, 2130577, 2082744, 2003969, 1926438, 1871378, 1867382, 1813974, 1773180, 1648493, 1551039, 1529622, 1528014, 1541485, 1493694, 1429357, 1369957, 1396501, 1378321, 1323222, 1303206, 1300835, 1275212, 1221103, 1162712, 1132540, 1124818, 1092815, 1061100, 1059085, 1013106, 1004395, 1052601, 1019194, 983155, 992655, 985512, 964508, 968176, 945141, 911664, 887286, 887767, 861257, 827930, 886960, 848396, 803839, 777029, 738451, 754930, 793134, 823080, 813698, 757710, 746592, 746595, 718181, 690805, 728737]
10453G28737Q151J3108J8029m2842m1757O2749p69l8527l9302j8974j8501j5976
10441F14126L236J7627j9354l5952J0072N629o6827j5725p955l6991K0524L3858
10429E22268j2987m2386J0991J2689l3817n158j217M1099p91O938j4843q607k929
10416D71250l519q302m1858K8091J0928l7788J1585k5628m0660j4733L3791M8940
10404D32097n2807l7714n3359m1635R001O3639M3217o4170o4035L6429N7031J9080
10392C46774k0313L7307N5183o1500m1794l82j6017l1605k9216R918P4304K3441
10380C46100l0102j5565O834m4012j0357j0169l9688P7427j5680j4613L9344M709
10368B94228k8298j0207n2209J3926K6719J6750m0106m6778q580J0799J6805K0353
$$ y = [728737, 736888, 749996, 768025, 725183, 683426, 746175, 745406, 706879, 667577, 648603, 630102, 614126, 617362, 634989, 615635, 579683, 589755, 595384, 528557, 512832, 504877, 467886, 488410, 522268, 509281, 466895, 477886, 490575, 456758, 451600, 450383, 491482, 490691, 497629, 482786, 474179, 471250, 467731, 459429, 417571, 445662, 456590, 418802, 430387, 404759, 364099, 349366, 383157, 432097, 379290, 341576, 288217, 246582, 255583, 319222, 362439, 298269, 234234, 270663, 327694, 346774, 326461, 363768, 418951, 357451, 315657, 315275, 299258, 267653, 238437, 248355, 322659, 346100, 315998, 300433, 307267, 263255, 252898, 242729, 203041, 280468, 264788, 250175, 289519, 294228, 265930, 255723, 203514, 217440, 244159, 260909, 220803, 174025, 165445, 176244, 193049, 213402]
10356B13402J6470j4835j3640l1011oM0287J3761K3455M8392k657L9589j8781
10344C14426o9532m2316l753j3616j3552J7880J576k5367L4006J940k2176K090
10332A81606k7735R057J3098J1637k9456K7344l1025k0104R914L197L4112K4470
10320B06115j0845j2442k3050j2967l7017j9023J4848L0210J5626K2659j7270
10309A56844k9996k4387L189p295J1413j8211P6256M5448l7881r554n6301k0826
10297H8699M3688L0223j2147k0401L5625o6978l3792J4610N7294N1893K1307l3396
10285A76625l1802p043J8543o734K5696k0212m2226j5648M3354R151o1335K0089
10273A08458k9194o0860K8656P4450R419k9759J3366J7916j0819M286l5882K0082
$$ y = [213402, 229872, 215037, 201397, 170386, 170380, 210667, 224428, 247883, 296275, 293618, 333207, 314426, 244894, 202578, 198825, 185209, 171657, 189537, 191113, 165746, 199752, 201692, 179516, 181606, 153871, 162928, 176026, 187663, 158207, 185551, 154526, 134422, 144336, 147533, 181645, 206115, 195270, 182828, 159778, 146811, 109794, 90771, 105619, 135829, 151455, 174114, 156844, 126848, 102461, 105650, 98355, 109768, 91557, 167813, 213261, 175380, 165826, 109525, 88699, 132387, 162610, 150463, 130062, 165687, 98709, 64917, 79527, 136821, 188714, 210021, 176625, 144823, 137780, 156323, 149589, 175285, 155073, 112847, 97199, 140553, 149704, 88369, 108458, 79264, 18404, 47060, 121510, 130929, 101170, 114536, 132452, 121633, 125919, 90037, 110119]
10261A10119J7028l2059o7725K3275M4912J9499J5863l6017q629J5609L0783N1723
10249A84381J3475J4397o5973q2080k2249J7137J4319k1876p630J1412J5179K0256
10237I0748O16r936j7886O560k8112l1592L9348m7763L322j580K5597j2285N2358
10224F9395N8302j6523Q578r218J352j9703r959j3670k0333j6604K0628M3184
10212I5429K5507j586J1654k0743q0349n215M2575M0919m1813j1334K6996k0348
10200F1692K7222J7769k5835L512j5794k557K869N755J3699K0136N1835m4654
10188A15649m2052l450o887L5739M7491O5078l8084j3103l0375n5119L2165N2198
10176A59250j9257K2220m426L5941L1978j4486n2612r875J0840p0217L5695Q782
$$ y = [110119, 127147, 95088, 27363, 50638, 95550, 115049, 130912, 94895, 86266, 101875, 132658, 184381, 197856, 212253, 146280, 64200, 41951, 59088, 73407, 51531, 43901, 55313, 70492, 90748, 91364, 81428, 63542, 70102, 41990, 10398, 49746, 1983, 5305, 3725, 29322, 17037, 69395, 127697, 111174, 119752, 110534, 111886, 92183, 82224, 68554, 48221, 31617, 52245, 95429, 120936, 119350, 131004, 110261, 29912, 24697, 67272, 108191, 66378, 55044, 82040, 61692, 88914, 106683, 80848, 84360, 68566, 66009, 68878, 74633, 88332, 108468, 160303, 115649, 73597, 70147, 63260, 98999, 146490, 211568, 173484, 160381, 130006, 74887, 107052, 159250, 139993, 162213, 157787, 193728, 225706, 211220, 158608, 148733, 159573, 89356, 125051, 133833]
10164A33833N3463L4613L3377j3536r00q635J0646N4318m673j3743k2161k1016
10152B35586k9515K4850r926o5422q201M0126J0408J9535K0200m6416J3900O4361
10140B69486l4401l1047K6493M961M392l237m3031o0893k0019k5933j0020K9551
10128A06302L6292p51M9241k7934j3226k6465m76K8384L0928o402j1243l9813
10116A24837K7139J9299L2552M427m1387R036k2503m6255P040L071n4883l5895
10104B6478K1165j7952k4641M4029l7712k2196J5964j6633k9790K8979K4331j9679
10092g657M1802M9444o441J2971j5304l8296j3554P712K3625k7133N791L8511
10080G1471J4430m499k0941J5755j8971j001q328L79m7785J2157K6755j7463j2637
$$ y = [133833, 187296, 221909, 255286, 241750, 240850, 232215, 242861, 297179, 292506, 278763, 256602, 235586, 206071, 230921, 220995, 155573, 147372, 187498, 197906, 217441, 237641, 191225, 205125, 269486, 235085, 204038, 230531, 235492, 239884, 236647, 193616, 132723, 112704, 86771, 76751, 106302, 142594, 141843, 191084, 163150, 149924, 123459, 122983, 151367, 182295, 175893, 164650, 124837, 151976, 171275, 203827, 208254, 166867, 175903, 153400, 107145, 114185, 117256, 62373, 26478, 47643, 29691, 5050, 49079, 11367, -10829, 5135, -11498, -41288, -12309, 12022, -7657, 34145, 83589, 77148, 90119, 74815, 36519, 22965, 30677, 54302, 27169, 32960, 71471, 85901, 81402, 60461, 76216, 57245, 56244, 47916, 48295, 510, 12667, 39422, 21959, 9322]
10067I322L4521l901J5472j6832o9764R003M3516J1908P973K0236N598k7609m2303
10054b860j6522M303k7070l1780K856M6409N3403k2115J1452L5003q324k1306
10042B3449j884K6280N2389M6440m0734o5087k2863k0060M4634L6697l6450l7030
10030E781l6887J3725n982j5643l3424R1384O3032J3272l3722o0843k449N5541
10018E3785J0041k8519J7556K1098k4549M284n5921n4967k8588j7527O5749N7953
10006B0395j3321j5477R942K3319k8007k511k3676j7221k4636J5193J8337J188
9994c6475j0035Q48M4143m254j8769m683j9866l6261J7711J0752m838M0415J8531
9981b781r257J8271L0067j2563k4799K225l1407j0579k8927k4476K8538L5942
$$ y = [9322, 43843, 39942, 55414, 38582, -31182, -22179, 21337, 33245, 41218, 61454, 67052, 39443, -2860, -19382, -15079, -42149, -73929, -71073, -24664, 28739, 6624, 18076, 53079, 44755, 23449, 21565, 47845, 100234, 146674, 105940, 40853, 17990, -2070, 42564, 79261, 42811, 5781, -31106, -17381, -23363, -39006, -72430, 18954, 81986, 95258, 61536, 693, -1756, 53785, 63826, 35307, 52863, 73961, 49412, 53696, -2225, -57192, -85780, -103307, -37558, 20395, 7074, -8403, 1539, 24858, -3149, -5660, -29336, -46557, -71193, -56000, -37663, -36475, -46510, -45662, -1519, -5773, -24542, -29225, -49091, -85352, -67641, -56889, -61727, -21312, -2781, -12038, 6233, 36300, 23737, -1062, 1163, -30244, -40823, -69750, -94226, -65688, -29746]
9969b9746L5770K933L5872J9852j095l2419l0625J2779n538o814l81n034L7013
9956C2567K5055K0951r085J1856L2741m3806k9895P838l4594l5535n0255p155
9944g9317J5052P781J7466N1437R4300j7247n8118j2062m4417L1373l855J380
9932C773M9242J5183K3842j6118m6300j1713M60K6925L0988l4520l4940L0844
9920C7666k7106J6983P890J0959k1758k5126p802j009L1023J5313k5844n3917
9908d2728J4103k38k0116L4902K9375l8311p0705J4972M1830M2643r519k7825
9896c1617l5452N0352L5004J505l082m3747m639M5354K3608K5289k1931m0686
9884d2j7082P4047K919o5411q082K0998K6536k203J7887N7420Q60n1427R189k2204
$$ y = [-29746, 6024, 8957, 44829, 64681, 63586, 31167, 542, 13321, 7783, 969, 588, -4446, 32567, 57622, 78573, 69488, 81344, 114085, 70279, 40384, 48222, 13628, -21907, -72162, -79317, -64265, -56484, -39018, 12419, 106719, 89472, 31354, 19292, -25125, 6248, 2393, 3773, 53015, 68198, 92040, 75922, 29622, 17909, 18369, 45294, 76282, 41762, 6822, 37666, 10560, 27543, 35433, 46392, 24634, -492, -8294, -9303, 21720, 37033, 11189, -42728, -28625, -28863, -48979, -14077, 15298, -23013, -93718, -78746, -36916, 5727, -3792, -31617, -67069, -16717, 18287, 19792, 16710, -27037, -31676, 13678, 37286, 62575, 40644, -42, -17124, 56923, 59842, -5569, -13651, 7347, 33883, 31680, 49567, 106987, 107847, 56420, 65609, 43405]
9870D3405m7348M2263L698l968j2845k1856m2289k6856K00k6644J8991J0575R460
9857e3214L1870q982o5533j2887K6700K0676M0214J5430L5210p5188q816j6629
9845g1149J4749M5080L5408K4643L7683R672l7633p7412k8280J7036L4144M1343
9833D5284n7634k4557j2323j6647J2702l2366n6666L7485J4900K6593j7298K5763
9821e4764K1044J2523J5251L6121m252n6522m4747J8202K8458K9659P464N740
9809A4177J9397j183p738K1643k3334j1887q287L1333k2605l3721l1888j725M2164
9796a3654l9590J6695K1537j8464J9501K6110j6711k2909p403K8060L4625m7196
9784a9399K844j9698k2011k0483M1385P597m5628m4866N979o066M5372J1033n080
$$ y = [43405, -3943, 38320, 42018, 38050, 25205, 3349, -38940, -65796, -65596, -92240, -73249, -62674, -53214, -21344, -30326, -95859, -108746, -82046, -61370, -21156, -5726, 29484, -45704, -54520, -71149, -56400, -11320, 24088, 48731, 86414, 96086, 58453, -18959, -47239, -30203, 3941, 45284, -12350, -36907, -49230, -65877, -53175, -85541, -142207, -104722, -89822, -63229, -80527, -54764, -33720, -21197, -5946, 30175, 25923, -30599, -75346, -57144, -28686, 973, 8437, 14177, 33574, 32391, 24653, 46296, 22962, 11075, 2788, 34121, 11516, -22205, -54093, -55818, -13654, -53244, -36549, -15012, -33476, -13975, 12135, -4576, -27485, -34888, -6828, 27797, -19399, -16555, -36253, -58264, -78747, -37362, -29765, -75393, -120259, -114280, -120346, -74974, -63941, -69021]
9771f9021L6577J5591k1640J4431M4812l63k5795P423N0756L4084L828j2888l439
9758G4356j4741M662J877j2760j3600P242j2745m1764p4344l0030j0316M3473
9746g8690q421J4036P9401K3022j9799j5489L1142q348p6105l356K2446j9712
9734e9873m1479j6981j5505J8795j866n038J9839O2106M6869J7903q304k5485
9722i019l5045j1613j2693k8049m7408j616L3214K5767N4754K1164j1408q279
9710c0231J2732K9655O184m9407J9175K8407j5188L7115M0338l5220m9937L9290
9698C2913j3560m8245k3059j9642L3516J1331J2845j4370l5121Q324M2060N5321
9686D2313n7669k8302M3809L9874L156M5270J1292q1710k1381k4798J237L0446
$$ y = [-69021, -32444, -16853, -38493, -24062, 20750, 20387, -5408, 2015, 52771, 86855, 90683, 77795, 74356, 59615, 64277, 66154, 53394, 39794, 47036, 34291, -7473, -81817, -111847, -122163, -78690, -87111, -73075, 6326, 29348, 9549, -5940, 25202, 16854, -59251, -62607, -40161, -59873, -101352, -118333, -133838, -115043, -116909, -121947, -102108, -40002, 6867, 24770, 16466, -9019, -44064, -55677, -68370, -96419, -143827, -145443, -112229, -86462, -31708, -10544, -21952, -30231, -17499, 12156, 18340, -31067, -11892, 16515, 1327, 38442, 78780, 43560, -6377, 32913, 19353, -28892, -51951, -71593, -38077, -26746, -13901, -28271, -63392, -55068, -13008, 42313, -15356, -43658, 151, 40025, 43181, 88451, 99743, 18033, -3348, -28146, -26909, 3537]
9674C537K477K3026m3608j1265J3867N1357j9175j1918k3305r557L0288M8112
9662E3836k8745J0095p4887l3982O2753K6049j9806l4010J199L0069J9151j9248
9650g526m9126K1535J2277M163L3837k82n6837L3099J1145J2592P49j4031n6544
9637e4949q825M0905M3180J1151l0850l0649r719K3145P248L127L062m573m1947
9624d9694L0571O8284k1550k4020L0291J4091j7563l1614m574j9521K7462l8775
9612c6612j335J4951O956l4783L4064L6881j7966j5151l2374N5565M2977m0618
9600A2555k3762l5651l6616L2534N2594O637n9145l5260M5802o009j6750l5970
9588i9041N0707k313j3091L1337O1945j9261n1833o7211J1201K8801M2293M8663
$$ y = [3537, 6014, 29040, -14568, -25833, -11966, 39391, 20216, 8298, -15007, -24564, 5724, 53836, 25091, 35186, -39701, -73683, -10930, 15119, -4687, -38697, -37498, -7429, 11722, -7526, -56652, -35117, -22840, -18677, 15160, 14878, -41959, -8860, 2285, 14877, 15626, 1595, -54949, -63774, -22869, 20311, 31462, 612, -30037, -39756, -16611, -9363, -6236, -3174, -7747, -49694, -19123, 49161, 27611, 3591, 33882, 47973, 30410, -1204, -5778, -25299, 2163, -36612, -37947, -22996, -16040, -50823, -16759, 20122, 2156, -12995, -45369, 10196, 53173, 12555, -11207, -46858, -83474, -50940, 1654, 8291, -50854, -86114, -40312, -46321, -63071, -99041, -48334, -50647, -63738, -32401, 29544, 10283, -41550, -108761, -97560, -68759, -26466, 22197]
9576B2197J8319M732j2215r310j3621N317l2647k5914J8780P1867K5108k3049
9564D9564j9823l5493q252M0121m8867m6717J1391L0593O298j8948M2469p993
9552e657K8532R002M720j2483p748n010J9735M6561j3057m9057j4711K4682K9217
9539E4726O4820j7597m627L1529m7123j1058L819l9118J1913J812o883n0138J8960
9526A1035N8992K0018Q578k4995k4939n5317J6184N143L241m7633k7946k015j6362
9513g6016K5792J505p046k097m4159M938m468N0522Q052R232m91m4203K6063m1852
9499i4228M3086J16893J7646o7621n4722j8651M3169O695j5187J7489l2180j3608
9487e1219l1163K2377N4825j0899k6833p865m5208K7765O969J6661O2708P361
$$ y = [22197, 40516, 45248, 33033, 23723, 10102, 15419, -17228, -43142, -24362, 47505, 72613, 49564, 29741, -5752, -14004, 26117, -22750, -69467, -58076, -27483, -21185, -40133, 2336, -5657, 22875, 31877, 36597, 24114, 16366, 11356, 31091, 77652, 64595, 15538, 827, 25509, 54726, 119546, 101949, 97322, 128851, 81728, 70670, 74489, 35371, 47284, 49096, 42213, -7925, 11035, 70027, 90045, 98623, 73628, 48689, -6628, 9556, 14699, 17940, -29693, -57639, -59654, -76016, -50224, -48719, -55765, -57862, -102021, -97083, -101551, -51029, -42977, -33745, -34236, -78439, -52376, -94228, -51142, 65751, 83397, 15776, -38946, -57597, -14428, -7733, -22920, -5431, -37611, -51219, -82382, -60005, -5180, -16079, -42912, -50777, -95985, -68220, -61251, -44590, 18118, 25479]
9475B5479q805p567K9660k6781M1916J8187l9683N853q3848o2795k3556P928O2689
9462f1323O0264L7921J4559l6614j2974j0160n7955O620o282J7530J9634j3628
9450d2408m477k1184l6798M5886J8664k0785M6989L5803k1077o551k1056J656
9438b5338M9051m1504n796L5907L5803j5142J619J3106K2777o546k0708l6990
9426F239l1372n0192R633L9436L5959N481j6232m056r861R320L5152l5522n650
9413a1665m616K319R619J2794O781O835m1565k4204J7834q953P760j3622o8730
9400a09413m0064l1026k473O373J9711J9212L4907J0407j7693J3620M3704M3500
9388i235j342l3927k9519l7653o826M1607L8727R042l4165J3224q04J3168P364
$$ y = [25479, 16674, 9107, 38767, 11986, 53902, 72089, 32406, 38259, -45589, -108384, -131940, -124012, -61323, -1059, 36862, 51421, 14807, 1833, -8327, -66282, -59662, -65944, -48414, -28780, -42408, -46885, -68069, -104867, -58981, -40317, -61102, -14113, 21690, 613, -5938, -26994, -25338, 23713, -17791, -23587, 12320, 48123, 32981, 34600, 47706, 70483, 63937, 43229, 6239, -25133, -75325, -65692, -26256, 9703, 15184, -1048, -5104, -14965, -5645, 29507, -6015, -11665, -16281, -13962, -4343, 8451, 15232, 22067, -19498, -43702, -25868, -34821, -27061, -40683, -109413, -149477, -180503, -182976, -176603, -156892, -137680, -102773, -92366, -110059, -96439, -52735, -9235, -10577, -44504, -74023, -111676, -118502, -76895, -38168, -29126, -63291, -50067, -50871, -37703, -30339]
9375c0339j007k6057J2152j1968j4991Q520Q912J4584o3193J0535K6003k609m1968
9362a11426P5017l532l5049q636Q054J3582L4528k455N501K2416Q095J7840K7116
9349E1051k0741n666N15K0787J6741n0707k9151P295j826R347j8589R309M3278
9336C1643l5083j8775m4150o4589j155M9222L4161O5452l8509k8526K0799Q003
9324b1507J0157K0658M4973O959q4K249J0453K570K5235L0324m9882m6941j9937
9311A5227k0785l406j3533m898L0875Q113L2828k2226M042L2124O819K3736L761
9298I2677o5184m9417M7511j3982K2408J8363p0571J1305J9673l0295p436j7903
9286d2851k0285j4681J3672J9402J2865N498j5345J8195K2473L542m9033J3808
$$ y = [-30339, -31346, -57403, -45251, -57219, -72210, -63690, -54778, -40194, -103387, -92852, -66849, -69458, -111426, -36409, -39941, -74990, -83626, -75572, -61990, -27462, -29917, -24416, -2000, 6095, 23935, 51051, 30310, 24644, 25159, 45946, 62687, 11980, -17171, -9876, -11702, -2355, -20944, -11635, 31643, -3440, -22215, -66365, -130954, -132109, -82887, -48726, 16726, -21783, -50309, -29510, -21507, -11350, 9308, 54281, 61240, 61156, 63405, 73858, 76428, 101663, 131987, 82105, 35164, 15227, -5558, -8964, -22497, -27395, 3480, 11593, 44421, 22195, 26237, 58361, 65180, 88916, 92677, 27493, -21924, 25587, 11605, 34013, 52376, -18195, -6890, 12783, -17512, -24948, -42851, -63136, -77817, -64145, -44743, -31878, -26380, -41725, -23530, -1057, 2485, -46548, -32740]
9274c2740O1349p192k4991j7196k5226l8017k414J9739K1457M510M125J5133L6062
9261A4599O460K6069l5202k8060k3282K0203M7129q312m8054k2377j6673K5209
9249d2291N582K5138M1064L0396N376k552J4939m4185k4407k3806m0058L7725
9237a7079L845j9485M6753R2186l2117j2849j1061L927k5759m4558N956L7404
9225B7163L0803J8156K1351L627j1976n1587m1668K5099p5716l709O6123k6861
9213a9195N345j8427k3169n1639n3349n312O3385M0683J332k111J8387M472K9565
9200a0033J6306J6662o45j6275R173J1074l9428J742K682J5242L6508r620L0762
9187F4150l4455n9455J7039k5028P258N9044J4147M387n7773N129M6822L2278
$$ y = [-32740, 28609, 21417, -3574, -20770, -45996, -84013, -86427, -66688, -45231, -40721, -36596, -21463, 14599, 21059, 47128, 11926, -16134, -39416, -19213, 27916, 19604, -28450, -50827, -67500, -42291, -36709, -11571, 29493, 59889, 65265, 62713, 77652, 33467, 9060, -14746, -54804, -17079, -13234, -32719, 14034, 106220, 74103, 61254, 50193, 54120, 28361, -16197, -10241, 27163, 57966, 76122, 97473, 101100, 89124, 37537, -4131, 20968, -54748, -58457, 7666, -19195, -13850, -32277, -55446, -107085, -160434, -165746, -102361, -61678, -60346, -62457, -44070, -39598, -10033, 6273, 22935, 22290, 6015, 15188, 26262, -13166, -11424, -8742, 6500, 43008, 33388, 64150, 29695, -29760, -12721, -37749, -30491, 28553, 42700, 47087, -10686, -5557, 41265, 73543]
9175G3543M1992J6182l0938j05106l1030O3910O3601L7985j3545J2292k0107p1798
9163C6981J7668J6313l2180J2124j0106l7757L6713l161r1376l6610K8598K3982
9151c8811K9775K0370K2804n9861j8966L5595o749K646p225p848K9295M9084j5068
9138C5041o8015j0274M8315q923k7068P687O811l8237k1183M5933P845o4823K9389
9125e7502K6500K6147K2072k5444l9949J8527J4142m1269m3825L6484M1193j1918
9113c4842j1190j6309j6658N6662L8153M862o1814l0431O2658K7423J2050m8018
9101a7454l5749j891J8561j5336N617L9184K4070q856j1565j0506M1572J2945
9089D0592p862k364R229j0862l4676K904J0277L3951j3494p4193J938L5049k7473
$$ y = [73543, 115535, 131717, 100779, -4327, -35357, 28553, 92154, 130139, 116594, 128886, 108779, 36981, 54649, 70962, 38782, 50906, 40800, 3043, 39756, 36595, -54781, -91391, -62793, -38811, -9036, 11334, 34138, -25723, -44689, -9094, -15843, -13197, -20422, -28270, 1025, 50109, 35041, -32974, -43248, 5067, -3856, -30924, -23237, -16426, -54663, -75846, -29913, -22068, -86891, -57502, -31002, -4855, 17217, -8227, -48176, -29649, -15507, -56776, -100601, -64117, -22924, -34842, -46032, -62341, -78999, -22337, 15816, 20678, -41136, -71567, -8909, 18514, 30564, -17454, -53203, -55094, -36533, -51869, -46252, -7068, 17002, 8146, -3419, -13925, 27647, 40592, 32730, 30366, 39595, 28733, -5943, -3039, 7238, 41189, 27695, -46498, -44560, -9511, -36984]
9076c6984J1457L5358m8700l33L5689K5105q7001l8349L1907k0647R716K5057
9064e7725N194q542K0142K6230k6593o419l571K3350n078J4303J1165k1910J5376
9051a4078j9875m9062L914L5861N3026K5008k9283n2214J4660L1519j0819j7246
9039b8589o21j1059j5222K3939K193K2014k7687q576k9629K0196N2802k5454p135
9026c2828N4935M8966M4478k9337q9693m4549j5371K853M375j9740M2119L3168
9014f24J9998m3459n1892J1698L1418J7285j1013j8489j5000O003J3012L5000
9002f063k7311J6056K6466j8848l1624K048L1963M4821P164o47m2902k9373j405
8989b9655k0037k0458N0409P4988j1002o1822m4448j2534m4873P560N4411P0647
$$ y = [-36984, -25527, 9831, -38869, -39202, -3513, 21592, -65409, -103758, -71851, -92498, -82782, -57725, -52531, -61073, -40931, -14701, -41294, -47713, -51284, -27934, -33012, -18709, -7544, -29454, -14078, -33953, -83015, -79101, -43240, 9786, 34794, 5511, -46703, -32043, -524, -11343, -28589, -29210, -40269, -55491, -31552, -29359, -7345, -35032, -43608, -73237, -53041, -239, -25693, -32828, 22107, 71073, 115551, 86214, -3479, -48028, -63399, -60546, -56171, -75911, -33792, -624, 19374, -24085, -75977, -64279, -32861, -15576, -26589, -45078, -60078, -54075, -41063, -6063, -33374, -17318, 9148, -9700, -41324, -39276, -7313, 37508, 44672, 44025, 1123, -28250, -29655, -49692, -70150, -19741, 55247, 44245, -17577, -62025, -74559, -119432, -111872, -57461, 13186]
8977A3186k759J6962l6644m7435n078K6203k3974M9887k258L538K1070K8375M302
8964D5375j7757l6881m3167j3268M6089K7846R030n5777M424k613J3024K5809
8952B134p085k056K0006N436m6725n305j0540j5271K1525M085K6957N699N358
8939D218j827l4995K3313N6988l3297k0013r699K9916n664M746l4131N219K7278
8926A2052l2110N7185K4817j0092k9821j5839k2305L7588l043j3187M1081j7747
8914B8579r450j3061k7453k7944K03M8075J7631K5267K7528l8475m3993j2990
8902b6083o101N6795M9204o7973m5024k4095Q057P336L1877k9146P307N0293M1010
8889E3457o101q591O236p36j4925l1290o856L367K9644l2204j2682M87Q747N0948
$$ y = [13186, 10427, 27389, -9255, -56690, -61768, -35565, -59539, -9652, -11910, -8372, 12698, 41073, 45375, 27618, -9263, -52430, -65698, -19609, 8237, 17267, -38510, -34086, -36699, -23675, 2134, -4951, -7007, 12999, 18435, -28290, -33595, -44135, -59406, -37881, -33796, -6839, -1140, 4218, 2391, -32604, -9291, 47697, 14400, -5613, -15312, 14604, 8940, 13686, -20445, -15226, 12052, -20058, 37127, 61944, 51852, 22031, 6192, -16113, 21475, 18432, 5245, 46326, 28579, 19129, 6068, -21385, -49329, -49126, -1051, 16580, 41847, 69375, 30900, -13093, -26083, -32184, 24611, 73815, 5842, -39182, -63277, -55220, -47884, -16007, -45153, -37846, 12447, 53457, 47356, 38765, 45001, 44265, 29340, -1950, -8806, -5439, 24205, -7999, -20681, -20194, -11447, 39501]
8875C9501L4099N595m0194M713K0357J2421K400n513k0161L6374l4743k4759J2851
8862D2941m270K6992L5239k0712l4274p7864M6253J7259k1562o252j6786l0164
8850d3200j6215m3186K708L8346M6943P367k7239k9013Q357Q3533k3017m8799
8838d3415k2768j6977M575M1493L2760J4215k7687Q024k4844m672n167o8454k2254
8825a35171P4822J10259J6308P584j5554p4159m3730J3596N6898q84L0769k1281
8813A9457n386k2619m9361j0778L8102N4147m018k8921j3948K985j8457K2858
8801a5939n8754m389k6355l1302J0126Q4500m731M0577M0407L650N308p5104n346
8788c7352L1k5343l6106J8287L8045N2398J9550p391O89L5959j8892l1734R235
$$ y = [39501, 73600, 79195, 39001, 43714, 64071, 76492, 78892, 73379, 53218, 89592, 54849, 30090, 42941, 38671, 65663, 100902, 80190, 45916, -31948, 14305, 31564, 10002, 3750, -13036, -43200, -59415, -102601, -99893, -61547, -14604, -7237, -34476, -63489, -55132, 28401, 5384, -43415, -66183, -83160, -78585, -37092, -4332, 9883, -17804, -9780, -34624, -39296, -44463, -112917, -135171, -60349, 49910, 66218, 73802, 58248, -15911, -59641, -46045, 10853, 9969, 40738, 19457, 14071, -8548, -57909, -68687, -30585, 23562, 19544, -9377, -23325, -20340, -38797, -15939, -74693, -79082, -105437, -136739, -126613, -42113, -46844, -6267, 34140, 37790, 43098, -32006, -37352, -37321, -62664, -98770, -80483, -42438, 9960, 29510, 22119, 22808, 58767, 39875, 8141, 17376]
8775A7376m0378j4712J82K4088j4641M0101N010k2036k0701m995k2241L2935q726
8762b8738n6780R153N3402M5307K4407l3106l292J4574l0976k6020M7168K3644
8750C8743j6353L6081j9199j6780J5173l2566O324O3977Q245n2205p7977J7280
8738b9257L9299N7813M5978k8861n1652p1022o6926K718M2890M9049l218j1938
8726b5127q843J3234L3378P8950k4438Q192m9715p7153j2009J488j1843J4274
8714e9612K0844N1994n010m5230J6564j4478L925L7006K7391K2795k8646k7923
8702c80M1l427k7257K1942l081j3683k064q275J3944N4612r993J0648J225j369
8688C2883Q895J7626J1734k6947O0J2271L3467j4072k8050l8852l5366O38k2480
$$ y = [17376, -23002, -37714, -37532, -13444, -28085, 12016, 17026, -5010, -25711, -30706, -52947, -20012, -28738, -85518, -76365, -22963, 22344, 46751, 13645, 10353, 24927, -6049, -32069, 15099, 38743, 22390, 58471, 39272, 22492, 37665, 5099, 11423, 75400, 83645, 31440, -46537, -29257, 10042, 67855, 113833, 84972, 33320, -37702, -104628, -101910, -59020, -9971, -13189, -25127, -33970, -20736, 12642, 91592, 67154, 75346, 25631, -51522, -63531, -62043, -73886, -59612, -38768, 13226, 8216, -37014, -20450, -34928, -31003, 6003, 33394, 56189, 27543, -380, -339, -3766, -31023, -9081, -12162, -25845, -27909, -36184, -22240, 32372, 22379, 33027, 34252, 32883, 41778, 59404, 71138, 44191, 44251, 56522, 89989, 75917, 47867, 9015, -26351, -25713, -48193]
8675d8193J7066N3518J9672l8764k928K5179l2386K0633N4895j4603n579K1230
8663F9740J8923j7780l3863p0437k0357n2629M1330N5884J0899k3949l1327k130
8651e5696J0875K0911J2129j5490K0018K3267J3994j0609o6920k6824Q4415K4163
8639C4233l5883j2272j4793N3157P2603J0880j7573K3244j6478k7713p8328m8813
8627e7736l7360k207L8948J5911k073O050L977J8280L0577L2222P661J7845m883
8614F7212M306k6363L0537J2289R314q9989n3374J361N5986l322k18K3209k9305
8601A643j1350M2862J4885L7653M1453l4925j8197L084j7305k8253J8966K0819
8589G1335j2505J8953R845o9791l2547N8616N5841o67K2353q171J590L554n677
$$ y = [-48193, -31127, 22391, 42063, 3299, 371, 25550, -6836, 13797, 68692, 54089, 48510, 69740, 88663, 70883, 37020, -33417, -53774, -106403, -65073, -9189, 1710, -22239, -53566, -55696, -44821, -23910, -11781, -27271, -7253, 16014, 30008, 19399, -47521, -74345, 10070, 34233, -1650, -13922, -28715, 24442, 97045, 107925, 90352, 113596, 97118, 69405, -8923, -57736, -95096, -97303, -58355, -42444, -44517, -38467, -34490, -16210, 14367, 46589, 54250, 72095, 67212, 71518, 45155, 75692, 87981, 97295, 7306, -46068, -44707, 11279, 7957, 7739, 30948, 1643, -9707, 33155, 48040, 85693, 127146, 92221, 74024, 77108, 59803, 31550, 50516, 71335, 58830, 77783, 87628, 17837, -14710, 43906, 99747, 99080, 121433, 113262, 114852, 118406, 112729]
8576A12729J1744J8751K4262L967M39l1054o436k8295j6457M258L9275N8951j7452
8563A74682r952k271j1671J5334l7653O196N0441K3482l6849l9155p657k1761
8551A03166Q040j9236K2294K3034k035l1203k8924O0582O2816m8773l6837m4010
8539F8914p69K1960L151K874M102j7338j8188J5549M1229m695l09m0302n5612
8526B0566o1256L7753O4104J9241k9851k2440k5881N9182K1266J3046J0705J5147
8514A21582Q827l6654n3693l5578m135J5961Q306K2672O9880j7620o0789n536
8502C3223N0120m815m9077m7591k0881R94k4140K7086J0947K085K192K5106N485
8489A0734L2883q882j4875N0931O672j5058j8324p237k1447o4444K1519J3181
$$ y = [112729, 124473, 143224, 167486, 171453, 171892, 140838, 134402, 106107, 89650, 93908, 133183, 192134, 174682, 164730, 162459, 150788, 166122, 128469, 134665, 185106, 208588, 171739, 132584, 124927, 103166, 111206, 91970, 114264, 137298, 135263, 104060, 75136, 135718, 198534, 149761, 112924, 68914, 68145, 90105, 93256, 96130, 100232, 82894, 64706, 80255, 121484, 116789, 116480, 76178, 20566, -40690, -2937, 61167, 80408, 50557, 28117, 2236, 61418, 82684, 95730, 106435, 121582, 130409, 93755, 40062, 4484, 349, 16310, 24616, 47288, 117168, 99548, 38759, 33223, 83343, 78528, 29451, -18140, -39021, -38027, -62167, -35081, -24134, -22049, -19857, 5249, 10734, 43617, 34735, 19860, 70791, 77463, 62405, 44081, 36844, 15397, -49047, -27528, -14347]
8477a4347O4538K0189N06K116l5238l695L583L8245L7714p874k9771k3577o000
8464D6389M728n4189l9814k103k5952n815P3306N3174J0926K8318M558q981l4413
8451E0132k7257L6711K5096l7741j7662l6028n924N5J8334N1858j3148k182m328
8438C7916m2327m2547J9971k228j7618p803O5515M6570K5785m466L9708m0438
8426G8038q4337j0690N8586K4046k3147p4208L3937O2265Q554n9712q7038R813
8414f3893R5554P0879J393m5122p6472K9668M4551L8427M501n1876o0083k8106
8402d0579p868N4598k039m5629k1545L3983m041j2643m513L2853L3134K8262l80
8389D3593l4365n3604l8012k8783n18Q6364J6377k0064o022j0480j5689O2748
$$ y = [-14347, 50191, 70380, 70886, 73002, 37764, 34069, 37652, 75897, 113611, 105737, 75966, 52389, 46389, 51117, -3072, -42886, -44989, -70941, -76756, -3450, 49724, 60650, 88968, 93526, 84545, 50132, 22875, 59586, 84682, 46941, 29279, -6749, -12673, -12618, 5716, 57574, 44426, 42244, 37916, -4411, -46958, -26987, -29215, -46833, -54636, 10879, 57449, 83234, 78768, 118476, 78038, -6299, -16989, 41597, 65643, 42496, -31712, 2225, 64490, 73044, 13332, -73706, -63893, 31661, 102540, 103933, 58811, -17661, 12007, 56558, 94985, 99486, 47610, -12473, -40579, -48447, 6151, 4112, -41517, -63062, -29079, -33120, -45763, -50276, -17423, 15711, 43973, 43593, 9228, -44376, -82388, -111171, -111689, -25325, -8948, -29012, -35034, -45514, -61203, 1545]
8377A545P4492M1822l7716m8728l544k0576n0293J1529Q108M4707R260o359r130
8364A5117K7563j3716J4074M3400N401k1846o0713k1j3192N671J6657O7345K784
8351H8524n9912j8376J826L606k0650n1886l4624M6761M8890p58m3237L64J1556
8338b7916k3543M120L0825O569j7721J1049p914k0926L5974M620k4807k5436J0593
8325d4513J6729k8847j8635J6565N432L4309K9502J4004p831o328J4546R691p554
8312B7070L7272K9677n5535m9368k8801n1205L600n694L5707P5899K1536n997
8300C4161m7753Q348q294j7278k5227L8913L6783k228J8581J6233j5948l6440
8288a49o0057l4969M0247N1064p403p87l1148K2872O5830k0073j429l2127J3111
$$ y = [1545, 76037, 117859, 80143, 31415, 27871, 7295, -42998, -31469, -23361, 21346, 30606, 24247, 15117, 42680, 28964, 43038, 86438, 91839, 69993, 9280, 9259, -3933, 1738, 18395, 85740, 88524, 28612, 10236, 12062, 15668, -4982, -56868, -91492, -44731, 4159, 3401, -39836, -39472, -27916, -51459, -47339, -16514, -9945, -27666, -16617, -24531, -45457, -9483, -4863, -29670, -55106, -44513, -27784, -56631, -75266, -58701, -53269, -18960, 10542, 24546, 16715, 10387, 24933, 34624, 27070, 64342, 94019, 38484, -10884, -39685, -90890, -87290, -92984, -57277, 18622, 40158, 34161, -13592, -5244, -13538, -30816, -56043, -17130, 19653, 17425, 36006, 52239, 36291, -149, -60206, -95175, -54928, -3864, -11267, -12054, -43202, -20330, 45500, 25427, 23998, -8129, 4982]
8275D982J2850l5190j8732p955J5599M793j1240l4480J3758P4808K2980k9197
8263A2976m5385K551L7976o730j4038K6578j6333k5852k133j0656m763M652k3419
8250f4576j5841O4707R141J6115k0861j719L4884l3572K9306N393K1960p149j5821
8237B1967J2197M9166l5667o1229j2851K0116J1620p710p7213l6614N8790N3927
8225c501J9859p342P844K1854l4290l026o1421J2195r437m4829k672O5770M6691
8212G695o242j9424N849K340j9591m5757K3314R5694J0267M533K502j02532J5106
8199b6246M985L6289K6701m8307L6297J0164q206J2745k7899o4654k1570M493
8187f5208L0712N0805J9783n0382m0335L6285L6107m2933k5109K0580o257m5909
$$ y = [4982, 17832, -17358, -36090, -44045, -28446, -23653, -34893, -69373, -55615, 19193, 42173, 12976, -32409, -29858, 8118, 1388, -12650, 13928, -2405, -28257, -30390, -41046, -45809, -41157, -64576, -80417, -15710, -6569, 9546, -11315, -13034, 21850, -11722, 17584, 22977, 44937, 37788, 21967, 34164, 83330, 47663, -13566, -26417, -6301, 5319, -2391, -79604, -116218, -57428, -3501, 16358, 9016, 16860, 38714, 4424, 1398, -60023, -47828, -57265, -102094, -104766, -38996, 7695, 1453, -17971, -12122, -9782, -29373, -75130, -51816, 43878, 54145, 58678, 61180, -41352, -26246, -21261, 15028, 41729, -6578, 29719, 39883, 31677, 44422, 16523, -48131, -69701, -65208, -34496, 16309, 36092, -14290, -54625, -18340, 17767, -25166, -50275, -29695, -35952, -81861]
8175h1861j9465K2318L9009J3005L4499l7042k0736M3576N8890o857l1940m66
8163A2930M9872k3628K0271j4699m383j6963L6348l4933j0935n291k2271l663
8151a7345O7813N481o5618l8094l9172K0346O053J0065J8352L8636j4602p969
8139a6054J4659K115Q807K7779n348p6282l6261L6859O5387O6033j6193k046l1397
8126C8058l5257j9308K0436m3400J3195M3846k5561M7216J5097n2268j0346j5950
8114b4242j7564M683J1680j3773k8392K150O4705o794n276K1067P554o563m2720
8101c3485j221k1532J4029L9001k3358P521L0629n5854k4399N2957N6574N138
8089D6000l8103k4882J9837M9329n4562j0419k1807k0673J6462j7763M6473J7447
$$ y = [-81861, -101326, -79008, -39999, -26994, 7505, -29537, -50273, -6697, 52193, 45336, 13396, 12930, 62802, 39174, 59445, 44746, 40363, 23400, 59748, 24815, 13880, 8589, -13682, -17345, 50468, 55949, -9669, -47763, -86935, -66589, -60536, -50471, -32119, 6517, -8085, -16054, -1395, 720, 9527, 37306, 31958, -44324, -80585, -43726, 21661, 87694, 71501, 69455, 38058, 2801, -16507, 3929, -39471, -26276, 17570, -7991, 39225, 54322, 2054, -8292, -24242, -41806, -37123, -25443, -39216, -67608, -65458, -753, -7547, -12823, 8244, 15798, 9235, -33485, -34706, -56238, -42209, -3208, -26566, -19045, 11584, -44270, -68669, -15712, 40862, 46000, 7897, -16985, 2852, 52181, -2381, -12800, -34607, -55280, -38818, -56581, -10108, 7339]
8077G339J6671M0206m6016m4734K5555J4059J6383j7431j1047j6025J4522m957
8065e475o863K8564K7742j1741K0786K247l2730j2261J9230M602O614k458J2683
8052E0940j4683k9600L1852K0382m0831J1869J5731o636m2562m5025J3125K5177
8040a0261k0594J8120j0826j0122K3355L9227m0427k54L7180K6393n237K9398
8028G5952J4727Q832l8554j7631o9769R181R0619J1103k4709M8469L644l6497
8016G5367l4282N545J440m2871J9623m892j8397q91K9965J7099l9799k9790J2713
8003i170k161L9902J1387K107n3335m0851K2222K8642J8761k5675q820L7280J4241
7990C4530k0952k0185p789J7886j3837m222L5351L8718l0027M457O995k3335j1299
$$ y = [7339, 24010, 64216, 18200, -26534, -979, 13080, 29463, 12032, 985, -15040, -518, -5475, -12338, 16226, 43968, 32227, 53013, 55260, 22530, 10269, 29499, 34101, 40715, 38257, 50940, 36257, 6657, 38509, 58891, 18060, 29929, 45660, 39024, -3538, -48563, -35438, -10261, -30855, -12735, -23561, -33683, -10328, 28899, -11528, -11782, 25398, 51791, 46554, 75952, 90679, 99511, 60957, 43326, -26443, -17262, 73357, 84460, 59751, 108220, 111864, 75367, 41085, 46630, 48070, 5199, 24822, 19930, 1533, 642, 30607, 47706, 7907, -21883, -9170, -11331, 28571, 39958, 42065, -11270, -52121, -29899, -1257, 17504, -8171, -16991, 20289, 34530, 13578, -6607, -14396, 3490, -10347, -14569, 20782, 59500, 29473, 33930, 40925, 17590, 6291]
7977F291L2608N615j755m3699J7709L117R435N6023K621o6399r232j0109j1164
7964h939O5519j0114k3906J7588Q39K2124L2467o9042o1397K8018N2432J2223
7952E7812j7011O385M927j460L1400k446k8506k2175M062m804n2754n1441q494
7939h4505J2271m6758K6124R787k431O934J2656L3832K5885K9561J4579r625L2779
7926F1089m3307J1989j3807L5873j3943l7326K684J3320K5336j2065K022j2391
7914A9474k4597K0692l095l2883J5720Q747L6982o438m8740O759K2123M0439J0707
7901F5890j6877k727m290l47k2392n3271J6129P494k2409J6942M3798M3080k4423
7888D6597k8591q114l226K4709L9452J2087l7443m1140j9688J8453L1047k2218
$$ y = [6291, 38899, 44514, 42759, -940, 16769, 19886, 29321, 85344, 87965, 21566, 12334, 2225, -8939, 56580, 46466, 22560, 40148, 40987, 63111, 95578, 26536, -34861, -6843, 45589, 57812, 40801, 47186, 52113, 50653, 82053, 79607, 51101, 28926, 32988, 28184, -24570, -76011, -84505, -72234, -118992, -92868, -83081, -85512, -78578, -65922, -32090, -6205, 23356, 37935, 28310, 61089, 17782, 29771, 15964, 51837, 37894, 568, 3252, 16572, 41908, 29843, 31865, 19474, -5123, 15569, 12474, -20409, -4689, 4058, 41040, 34602, -14138, -7379, 14744, 55183, 65890, 49013, 46286, 41996, 41649, 19257, -34014, -17885, -10391, -32800, -15858, 27940, 71020, 46597, 18006, 9892, 6666, 31375, 70827, 82914, 45471, 4331, -15357, 3096, 34143, 11925]
7876A1925o3451K2603L10j4890j6862p833l4620L9025J4337l265J0602K6520L2452
7863A6853j1294p308J7071j4898k0541l967L2663m2045m6160N442j1802N786N2788
7850b7412N9846J3140n78j6144n7758J0347L1648J4774M5640k3756m1029o4323
7838e5605o52o671O378k9493J9441N7969M0470r873j483k9108K260p783k7170
7825d1320m933L4411L4947m0332n1275M1401j5964n403p901n424N6772l1026L264
7812c2783L6969N7230j3383n2238q106P3610J7830j6355J5498O870p9584k2230
7800a6672J2215k3633m4397K1344j0731K4194j575J5036P9458K8393m6400l956
7788C3276l9282K1174N05k9817q44m3570r193J3646J0348J8344j2476J8284j2853
$$ y = [11925, -51526, -28923, -28613, -43503, -60365, -68198, -102818, -63793, -49456, -52721, -42119, -15599, 16853, 5559, -1749, 15322, 424, -20117, -24084, 8579, -33466, -79626, -74184, -85986, -80200, -27412, 32434, 45574, 44996, 28852, -28906, -18559, 13089, 27863, 73503, 49747, 8718, -55605, -56257, -62928, -56550, -86043, -66602, -8633, 31837, 21964, 20481, -8627, -6367, -14150, -41320, -46253, -11842, 23105, -17227, -68502, -27101, -43065, -48468, -56369, -61793, -5021, -36047, -32783, 4186, 61416, 48033, -4205, -12311, 61299, 79129, 62774, 78272, 85142, 5558, -16672, -4457, -28090, -72487, -51143, -61874, -37680, -39255, -24219, 55239, 83632, 37232, 33276, -6006, 15168, 15673, -14144, -14988, -58558, -67751, -54105, -43757, -25413, -37889, -19605, -32458]
7775c2458N0690O358j1758l62N1062O6817k8435q1323j1461r787N319R394q349
7762E707j7723q903J3735M0605n5088J4293M0745k6027m32K2745L374m7164j2701
7749b6834J0135J8796J9778j8129k5336K2927n5187n9688M6045N4216O79l1354
7737d3952K7350J5924l912l3327J0266K581k8961m4903K0341K0080j4720p767
7725h1000K0609O1313N9551L807L3040k2926k2006L3933L3560m8342l8667J7204
7713E0076n1800m0092M565L31l891N7962J1887k2776K4000J9742k6211k0170O9614
7700G3237L7040l4389l5760m4179k0202q558L9498j508o1227l7340P0101J7769
7688e518J2364N5928J9238r025l1108K4547L86n9357l3687K3695L496k2591N1270
$$ y = [-32458, 18232, 24590, 12832, 12470, 63532, 130349, 101914, 20591, 9130, -657, 4662, 14056, 5707, -12016, -20919, -7184, 33421, -21667, -7374, 33371, 7344, 6912, 29657, 33031, -14133, -26834, -16699, 2097, 21875, 3746, -21590, 1337, -53850, -113538, -67493, -13277, -12598, -43952, -16602, -678, -4590, -37917, -27651, -25070, -54031, -98934, -78593, -58513, -73233, -81000, -60391, 922, 60473, 64280, 97320, 74394, 52388, 86321, 119881, 71539, 32872, 50076, -1724, -41816, -37251, -36920, -40811, 17151, 29038, 6262, 30262, 50004, 23793, 3623, 73237, 110277, 75888, 40128, -4051, -24253, -32811, 6687, 5179, -56048, -93388, -23287, -5518, 6846, 62774, 82012, 72987, 41879, 66426, 66812, 7455, -26232, -2537, 959, -21632, 29638]
7675B9638l2834r346j6230N376j9206L5964J0518m3834n14K7277p734k4356l383
7662d8664M0094M6003J8293J7463k512o4705m1481M327N0609M8892N243l5847
7650C7715p1356K4399M0126l5091n0118k555M221J4036N3276J5584K5186l3991
7638B1432m343L2731K2689k0631p2069j8972J3601L7101k7751k4244J4541J0136
7626a5779J3281Q7525j1101l4578L8186K0549k1235k7365m0750m9657K8023l2279
7614d5180n8937J3349L2316q465K1688K5271L337o9960j2389M1194L3597l719
7602b7898K2418Q6736k9437k2211k7622j4900j8989J2353r743K0942J4150K6263
7590C2062j3406o0810j7907L4537J9038k3112j9647N9334j2083O271J7687O897
$$ y = [29638, -3196, -12542, -28772, -23396, -42602, -6638, 3880, -39954, -40468, -13191, -20925, -45281, -48664, -8570, 37433, 55726, 73189, 70677, 5972, -35509, -31182, 19427, 68319, 73562, 37715, -33641, -9242, 30884, -4207, -54325, -56880, -52659, -38623, 14653, 30237, 55423, 21432, 17089, 49820, 72509, 51878, -20191, -39163, -25562, 11539, -16212, -40456, -25915, -15779, -2498, 85027, 73926, 39348, 77534, 98083, 76848, 49483, 8733, -40924, -12901, -45180, -104117, -90768, -58452, -66917, -45229, -19958, -16621, -86581, -98970, -57776, -24179, -27898, -5480, 81256, 51819, 29608, 1986, -12914, -31903, -19550, -29293, -8351, 5799, 32062, 18656, -42154, -60061, -25524, -6486, -29598, -49245, 10089, -1994, 4277, 21964, 28861]
7578B8861K9418J6358J0235n5384l6608o9400j3032L6683j4793j9881J7399L4404
7566c5740K1887o562K7257r296j7293K8007K0384M353o6263k1202K2503J66j6147
7553d7946N4100L3070j9643P980m4031j5678N5117P2009M859p8045l6202J1471
7541b939j9186L3184L4050n9148l7102m1143K5670M3739K4889j9863r292p3397
7529a00538L699M1278M7905J0512o895O14J8850J0900l6188q0589J745N0927k9640
7516f7420j1040L953M3196O710n9733K9832L0896J8590N0611m9471k3703L5986
7504H407k2288L0152j0387K2355L0568M816j2363k4677k8127J667J02468k0466
7492H2125o414m3791l8248J5216K8658J6185n106K0864l8809l6330j2257j7295
$$ y = [28861, 58279, 74637, 84872, 29488, -7120, -76520, -89552, -52869, -67662, -87543, -70144, -35740, -13853, -20415, 6842, -2454, -19747, 8260, 28644, 32997, -33266, -54468, -31965, -31799, -47946, 6154, 39224, 19581, 27561, -16470, -32148, 22969, 94978, 99837, 21792, -14410, -2939, -22125, 11059, 45109, -14039, -51141, -92284, -66614, -22875, 2014, -17849, -27141, -100538, -96839, -55561, -7656, 2856, -4039, -3425, 15425, 26325, -9863, -90452, -88707, -37780, -67420, -78460, -74507, -31311, -24601, -84334, -54502, -23606, -5016, 45595, -3876, -27579, 8407, -13881, 16271, 5884, 28239, 58807, 63623, 51260, 26583, -1544, 123, 102591, 82125, 75711, 31920, -6328, 8888, 37546, 53731, 48625, 69489, 30680, -5650, -17907, -35202]
7480c5202M6608m8264j5981J2137K7065N3882M714j2411k355k2054j888k9693
7468b3442M053K460O893k010j1879j3445N925O90Q28k4344L2522K2905m119o992
7454i955O1792l146l0467l77l4582m1261k1474J0404M8269M3050o215n9900K312
7441d1550K5262O924l1982L5626O7474N584m1024M454k596M6559n3622p2349K4962
7428b6278J4723P004L981J1801o424o372K8897J1405O036k177m0802o9094l1415
7415i8715N1746L4059j1865O044p968k3193k1362j4467K4662O9948q752L0610
7403C0747j2142L3487J1645k5954m8196m5652q729J4104M6936J8956J3138K8894
7391E7234K922l2465m0305j337j4332J92m1923j8293K2488m6969o5489M0568P0958
$$ y = [-35202, 11406, -36858, -52839, -40702, -13637, 40245, 44959, 32548, 30193, 8139, 6251, -23442, -19389, -16929, -10036, -12046, -23925, -37370, -31445, -30755, -29927, -54271, -21749, 1156, -2963, -9955, 51837, 48691, 18224, 17847, -16735, -57996, -79470, -69066, -20797, 22253, 16038, -43862, -41550, -16288, -9364, -41346, -5720, 61754, 67338, 26314, 30768, 28172, 74731, 21109, -51240, -26278, -11555, -4551, -570, 11231, 4807, -1565, 27332, 38737, 44773, 42596, 1794, -67300, -98715, -46969, -12910, -24775, -18731, -26699, -49892, -71254, -85721, -61059, 8889, 137, 30747, 18605, 52092, 63737, 37783, -10413, -56065, -64794, -50690, -3754, 15202, 28340, 57234, 60156, 27691, -12614, -13951, -28283, -28091, -70014, -88307, -65819, -112788, -178277, -137709, -66751]
7378f6751O4166J4734j1591l5884j5700n7642K9845M3050Q758K8543k2106r869
7366c0447j4778R819K0573M3504j1029J5173L8016l5879r528J6017J7316o0783
7354b026o00k2410j8047o010l2998N4703r730P178O3418p838k9242k758N6493
7341E0133L2580J6430K5819r891J0125q1574l3418N5602j6939j4880k6632J7960
7329B5315K7669l1660m6588q172o214K3464L7510K4195k242O167n586l9891k5417
7316b1450J5447M9122N0547K539l9234l023L1944P703K6984m7310k8929N5261
7304I9601l227j6594k7662j9985J1636n0951n3237k7074k1231Q070M2072K8553
7292c0029J015k6643r355N8126j9789m7199k6839J2760K0867L1029O8736K1291
$$ y = [-66751, -2585, 12149, 558, -35326, -51026, -108668, -78823, -35773, -27015, 1528, -20578, -30447, -45225, -35406, -14833, 28671, 17642, 32815, 70831, 34952, 25424, 41441, 58757, -2026, -2626, -25036, -43083, -49093, -82091, -27388, -37118, -29940, 33478, 25640, -3602, -6360, 50133, 82713, 99143, 124962, 115071, 125196, 43622, 10204, 65806, 48867, 33987, 7355, 25315, 52984, 21324, -25264, -33436, -39650, -16186, 21324, 45519, 43277, 49444, 43858, 3967, -21450, -6003, 43119, 93666, 96205, 56971, 53948, 85892, 93595, 120579, 73269, 44340, 99601, 96374, 79780, 52118, 32133, 43769, -7182, -60419, -87493, -108724, -100654, -58582, -30029, -29014, -55657, -65012, -6886, -26675, -73874, -100713, -87953, -67086, -36057, 32679, 53970]
7280E3970L2400k7445j7311l7892m042m1770l1826L6402j0638j6000J3798M5935
7268d419J6033k4925M6780P291m9510m2245J610Q4434M7495m0399l3085l4636
7256b5576n053m7463L5604L2259l4850L2671j736k4008j5125J3935l1523k6146
7244i7011L4093P339K6409K6337L1897K3837j7763o0977o6206R892N9812L3581
7232A1240k6679J5449L6876j3985k9323l6783J0349K2571J1689l0185p1997J4035
7220h6743M9240O626m7338k5866J5100O2177P2880L57j9664p37m8650r798L8672
7207F256J887L3438j528O852q88o1943J3120K1292O239j4160q008n097j6464K2823
7193C819K8784n2365N570R837k4231l9817O9527L9153O383m700N965J5273m2521
$$ y = [53970, 86370, 58925, 41614, 3722, -320, -42090, -73916, -37514, -48152, -64152, -50354, -4419, 11614, -13311, 33469, 40760, -8750, -50995, -49385, 35049, 82544, 42145, 9060, -25576, -30629, -78092, -42488, -10229, -45079, -12408, -14144, -38152, -53277, -39342, -70865, -97011, -62918, -55579, -29170, -2833, 29064, 52901, 35138, -25839, -92045, -82153, -22341, 11240, -15439, 10, 36886, 22901, -6422, -43205, -32856, -10285, 1404, -28781, -100778, -86743, -37503, -30877, -78215, -104081, -88981, -26804, 46076, 46433, 26769, 26032, -22618, -32416, 6256, 8143, 41581, 40053, 46905, 46017, -15926, -2806, 18486, 24725, 10565, 2557, -2540, -19004, 3819, 32603, -19762, -14192, -4355, -28586, -68403, 1124, 40277, 46660, 41960, 47925, 63198, 20677]
7180B0677o2468l6602k7637l6969L9902R063L1332Q4198m47r86n356n692J6501
7167B5516R173n5602p0584L5520M2725p000p697Q575n901M0069j8737l1090j6456
7154e1489n069N523J0602l05O8980K3313J7599p781k9116M265j901K0924j1614
7141D3931j9291j4917L2653O5005K4807o5828o4011q212M3380p736k8997L4582
7129C5366n348m7791M0723n2484l7616J8788K0183Q409j4415l1544M891J5399
7117d5439K3066L0455K5617m7314o7763j3896j3729N15O9891N7709J2662n3957
7105b2183j8590j5278j6840j7573j71P6827j9337m7248k5876L2679M0227O672
7093b6691l4612K4181k4024j8671L6243k646l0l211P366m9032l5304Q577J0033
$$ y = [20677, -41791, -78393, -106030, -142999, -103097, -94034, -62702, 21496, 21049, 20063, 14707, 9015, 25516, 34689, -20913, -91497, -55977, -13252, -20252, -27949, -19374, -25275, 14794, -3943, -35033, -51489, -56558, -51035, -40433, -40738, 28242, 51555, 69154, 61373, 32257, 36522, 34621, 55545, 43931, 24640, 9723, 42376, 107381, 132188, 66360, 2349, -5863, 37517, 29781, 784, 35366, 30018, -17773, 22950, -29534, -67150, -48362, -28179, -19770, -34185, -65729, -60838, -45439, -22373, 8082, 33699, -13615, -81378, -95274, -109003, -108488, -38597, 19112, 31774, -22183, -40773, -56051, -72891, -90464, -90635, -13808, -33145, -80393, -106269, -73590, -33363, -26691, -61303, -37122, -61146, -79817, -43574, -46220, -46250, -49461, -42095, -91127, -126431, -117854, -107821]
7080a07821Q748O116P575M8622L0612M5570Q39q663n9762r8336m519Q6558O1615
7067A7154K141m6594l5339N625N054O7472L7305m0l3193l6760j4357J9096N1377
7054C8941M4893M371k5005j054p6977j5257J360J7073l3835j2502O3693J0159
7042A5860k3873m443P146j1557Q166m257j5253M547K4924L7218k9723J9800K649
7029C1204J1116n8215j1049J3019L2374n791n750r511r313j4473J1027m4651K4093
7016c5920J04365n821m6060l1771m886J2952K9979J7311Q994j0108l0873l0559
$$ y = [-107821, -99073, -92957, -85382, -36760, -6148, 39422, 40261, 31598, -28164, -126500, -131019, -44461, 17154, 19295, -27299, -62638, -57013, -51959, 15513, 52818, 52778, 19585, -17175, -31532, -12436, 38941, 83834, 88205, 63200, 62146, -14831, -30088, -28728, -11655, -45490, -57992, 5701, 15860, -8013, -12456, -5310, -16867, -8701, -12958, -28211, -23664, 1260, 38478, 8755, 28555, 31204, 42320, -15895, -26944, -13925, 18449, 12658, 6908, -2603, -11916, -26389, -15362, -60013, -35920, 68445, 62624, 16564, -15207, -20093, -7141, 22838, 40149, 49143, 39035, 8162, -22397]
$$ [...]
##END NTUPLES=NMR SPECTRUM
##END=
