##TITLE=Analysis number 312675
Compound Code ac 34875
Project Code qc-cat
Chemist Name andyc
##JCAMPDX= 6.0         $$ Bruker NMR JCAMP-DX V2.0
##DATA TYPE= NMR SPECTRUM
##DATA CLASS= NTUPLES
##ORIGIN= Bruker BioSpin GmbH
##OWNER= NMR
$$ XWIN-NMR		Version 3.5
$$ Wed Aug 10 15:16:25 2005 GMT Daylight Time (UT+1h)  MAYBRIDGE\NMR@NMR_250MHZ
##.OBSERVE FREQUENCY= 250.131544655141
##.OBSERVE NUCLEUS= ^1H
##.ACQUISITION MODE= SIMULTANEOUS (DQD)
##.ACQUISITION SCHEME= undefined
##.AVERAGES= 16
##.DIGITISER RES= 18
##SPECTROMETER/DATA SYSTEM= dpx250
##.PULSE SEQUENCE= zg30
##.SOLVENT NAME= DMSO
##.SHIFT REFERENCE= (INTERNAL, DMSO, 0, 16.522)
##AUDIT TRAIL= $$ (NUMBER, WHEN, WHO, WHERE, WHAT)
$$ ##TITLE= Audit trail, XWIN-NMR		Version 3.5
$$ ##JCAMPDX= 5.01
$$ ##ORIGIN= Bruker BioSpin GmbH
$$ ##OWNER= NMR
$$ C:\u/data/dgb/nmr/ADRS/7510/pdata/1/auditp.txt
$$ ##AUDIT TRAIL=  $$ (NUMBER, WHEN, WHO, WHERE, WHAT)
(   1,<2005-08-10 15:16:06.03 +100>,<MAYBRIDGE\NMR>,<NMR_250MHZ>,
      <created by zg, POWCHK disabled, PULCHK disabled
       configuration hash MD5:
       62 19 C7 07 E1 42 D1 B7 37 6C 3D D0 77 39 F9 E6
       data hash MD5: 64K
       A3 19 5F 15 84 E6 70 85 D9 B9 0C 11 60 52 6E D8>)
(   2,<2005-08-10 15:16:16.81 +100>,<MAYBRIDGE\NMR>,<NMR_250MHZ>,
      <Start of raw data processing
       ef LB = 0.3 FT_mod = 6 PKNL = 1 SI = 32K 
       data hash MD5: 32K
       8E F6 A3 EB E0 9F A3 D9 DE DD C9 D1 33 46 CC 39>)
(   3,<2005-08-10 15:16:18.53 +100>,<MAYBRIDGE\NMR>,<NMR_250MHZ>,
      <apk 
       data hash MD5: 32K
       B0 9F 50 96 17 86 90 0F 88 86 37 97 17 0E 23 B8>)
(   4,<2005-08-10 15:16:19.25 +100>,<MAYBRIDGE\NMR>,<NMR_250MHZ>,
      <abs ABSG = 5 
       data hash MD5: 32K
       7A 40 C2 08 FE 61 E3 6E 12 16 C3 8E 61 D9 13 22>)
$$ ##END=
$$ 
$$ hash MD5
$$ FB DB 48 1F 18 15 26 95 F9 F1 45 54 CD 7E 27 A4
##$RELAX= 
##$RELAX= 
##$RELAX= 
##$RELAX= 
##$RELAX= 
##$RELAX= 
##$RELAX= 
$$ Bruker specific parameters
$$ --------------------------
##$DU= <C:\u>
##$EXPNO= 7510
##$NAME= <ADRS>
##$PROCNO= 1
##$TYPE= <nmr>
##$USER= <dgb>
##$AMP= (0..31)
100 100 100 100 100 100 100 100 100 100 100 100 100 100 100 100 100 100 
100 100 100 100 100 100 100 100 100 100 100 100 100 100 
##$AQSEQ= 0
##$AQ_mod= 3
##$AUNM= <au_zg>
##$AUTOPOS= <42 >
##$BF1= 250.13
##$BF2= 250.13
##$BF3= 250.13
##$BF4= 250.13
##$BF5= 500.13
##$BF6= 500.13
##$BF7= 500.13
##$BF8= 500.13
##$BYTORDA= 1
##$CFDGTYP= 0
##$CFRGTYP= 5
##$CHEMSTR= <none>
##$CNST= (0..31)
1 1 145 1 1 1 1 1 1 1 1 1 1 1 1 1 1 1 1 1 1 1 1 1 1 1 1 1 1 1 1 1 
##$CPDPRG= <>
##$CPDPRG1= <>
##$CPDPRG2= <>
##$CPDPRG3= <>
##$CPDPRG4= <mlev>
##$CPDPRG5= <mlev>
##$CPDPRG6= <mlev>
##$CPDPRG7= <mlev>
##$CPDPRG8= <mlev>
##$CPDPRGB= <>
##$CPDPRGT= <>
##$D= (0..31)
0 1 0 0 0 0 0 0 0 0.06 0 0 0 0 0 0 0.0002 0 0 0 0 0 0 0 0 0 0 0 0 0 0 
0 
##$DATE= 1123683365
##$DBL= (0..7)
120 120 120 120 120 120 120 120 
##$DBP= (0..7)
150 150 150 150 150 150 150 150 
##$DBP07= 0
##$DBPNAM0= <>
##$DBPNAM1= <>
##$DBPNAM2= <>
$$ [...]
##$SUBNAM7= <"">
##$SUBNAM8= <"">
##$SUBNAM9= <"">
##$SW= 20.6930455092707
##$SWIBOX= (0..15)
0 0 3 0 0 0 0 0 0 0 0 0 0 0 0 0 
##$SW_h= 5175.983436853
##$TD= 65536
##$TD0= 1
##$TE= 295.16
##$TE2= 300
##$TE3= 300
##$TEG= 300
##$TL= (0..7)
0 120 120 120 120 120 120 120 
##$TP= (0..7)
150 150 150 150 150 150 150 150 
##$TP07= 0
##$TPNAME0= <>
##$TPNAME1= <>
##$TPNAME2= <>
##$TPNAME3= <>
##$TPNAME4= <>
##$TPNAME5= <>
##$TPNAME6= <>
##$TPNAME7= <>
##$TPOAL= (0..7)
0.5 0.5 0.5 0.5 0.5 0.5 0.5 0.5 
##$TPOFFS= (0..7)
0 0 0 0 0 0 0 0 
##$TUNHIN= 0
##$TUNHOUT= 0
##$TUNXOUT= 0
##$USERA1= <user>
##$USERA2= <user>
##$USERA3= <user>
##$USERA4= <user>
##$USERA5= <user>
##$V9= 5
##$VALIST= <valist>
##$VCLIST= <CCCCCCCCCCCCCCC>
##$VD= 0
##$VDLIST= <DDDDDDDDDDDDDDD>
##$VPLIST= <PPPPPPPPPPPPPPP>
##$VTLIST= <TTTTTTTTTTTTTTT>
##$WBST= 1024
##$WBSW= 4
##$XGAIN= (0..3)
0 0 0 0 
##$XL= 0
##$YL= 0
##$YMAX_a= 336162
##$YMIN_a= -478944
##$ZGOPTNS= <>
##$ZL1= 120
##$ZL2= 120
##$ZL3= 120
##$ZL4= 120
##$ABSF1= 16.522
##$ABSF2= -4.171173
##$ABSG= 5
##$ABSL= 3
##$ALPHA= 0
##$AQORDER= 0
##$ASSFAC= 0
##$ASSFACI= 0
##$ASSFACX= 0
##$ASSWID= 0
##$AUNMP= <proc_1d>
##$AZFE= 0.1
##$AZFW= 0.1
##$BCFW= 0
##$BC_mod= 0
##$BYTORDP= 0
##$COROFFS= 0
##$CY= 12.5
##$DATMOD= 1
##$DC= 0
##$DFILT= <>
##$DTYPP= 0
##$F1P= 14.0000005364418
##$F2P= -0.99999901652339
##$FCOR= 0.5
##$FTSIZE= 32768
##$FT_mod= 6
##$GAMMA= 0
##$GB= 0
##$INTBC= 1
##$INTSCL= 1
##$ISEN= 128
##$LB= 0.3
##$LEV0= 0
##$LPBIN= 0
##$MAXI= 10000
##$MC2= 0
##$MEAN= 0
##$ME_mod= 0
##$MI= 0
##$NCOEF= 0
##$NC_proc= -4
##$NLEV= 6
##$NOISF1= 0
##$NOISF2= 0
##$NSP= 0
##$NTH_PI= 0
##$NZP= 0
##$OFFSET= 16.522
##$PC= 1
##$PHC0= -90.35186
##$PHC1= 4.250285
##$PH_mod= 1
##$PKNL= yes
##$PPARMOD= 0
##$PSCAL= 4
##$PSIGN= 0
##$REVERSE= no
##$SF= 250.13
##$SI= 32768
##$SIGF1= 0
##$SIGF2= 0
##$SINO= 400
##$SIOLD= 32768
##$SREGLST= <1H.DMSO>
##$SSB= 0
##$STSI= 32768
##$STSR= 0
##$SW_p= 5175.98343685301
##$SYMM= 0
##$S_DEV= 0
##$TDeff= 65536
##$TDoff= 0
##$TI= <Analysis number 999999
Compound Code 99
Book Reference 9
Project Code 9>
##$TILT= no
##$TM1= 0
##$TM2= 0
##$TOPLEV= 0
##$USERP1= <user>
##$USERP2= <user>
##$USERP3= <user>
##$USERP4= <user>
##$USERP5= <user>
##$WDW= 1
##$XDIM= 32768
##$YMAX_p= 463227205
##$YMIN_p= -225373
$$ End of Bruker specific parameters
$$ ---------------------------------
##NTUPLES= NMR SPECTRUM
##VAR_NAME=  FREQUENCY,     SPECTRUM/REAL,   SPECTRUM/IMAG
##SYMBOL=    X,             R,               I
##VAR_TYPE=  INDEPENDENT,   DEPENDENT,       DEPENDENT
##VAR_FORM=  AFFN,          ASDF,            ASDF
##VAR_DIM=   32768,         32768,           32768
##UNITS=     HZ,            ARBITRARY UNITS, ARBITRARY UNITS
##FACTOR=    0.157963299565203, 1,           1
##FIRST=     4132.6476996994, 0,             0
##LAST=      -1043.33573715361, 0,           0
##MIN=       -1043.33573715361, -225373,     0
##MAX=       4132.6476996994, 463227205,     0
$$ Real data points
##PAGE= N=1
##DATA TABLE= (X++(R..R)), XYDATA
$$ [...]
$$ plain form
15817 42769624 38138111 33072441 27892754 23232656 19412623 16379910 13842856 11696702
15809 11696702 9885226 8395174 7213552 6269915 5553068 5010153 4537972 4082592 3683136
15800 3683136 3338500 3070709 2857932 2668745 2462623 2255306 2093024 1929266 1789107
15791 1789107 1678775 1588879 1466490 1363088 1247953 1113645 1047380 1041907 1082466 1025180
15781 1025180 988636 968424 922418 869427 810109 770764 796102 765803 660633 626285 589817
15770 589817 594619 586045 526018 527251 565085 549814 536779 607262 614449 598398 524277 511180
15758 511180 538245 489195 424184 360345 393152 428325 462993 415781 400528 384237 351287
15747 351287 343309 345305 317082 316666 255280 222622 245108 265606 295382 292434 315044 307023 282584
$$ packed form
15817D2769624m631513n065670n179687m660098l820033l032713k537054k146154
15809A1696702j811476j490052j181622r43637p16847n42915m72181m55380l99456
15800C683136l44636k67791k12777j89187k06122k07317j62282j63758j40159
15791A789107j10332q9896j22389j03402j15135j34308o6265n473M0559n7286
15781A025180l6544k0212m6006n2991n9318l9345K5338l0299j05170l4348l6468
15770E89817M802q574o0027J233L7834j5271j3035P0483P187j6051p4121j3097
15758E11180K7065m9050o5011o3839L2807L5173L4668m7212j5253j6291l2950
15747C51287p978J996k8223m16o1386l2658K2486K0498K9776k948K2610q021k4439
$$ plain form
15734 282584 280530 320020 294857 315290 324771 326792 337153 332292 303410 268093 265371 279774
15722 279774 276173 263082 252349 259583 271491 288195 289764 262353 258329 295120 285883 304814
15710 304814 300820 305395 311324 306440 219308 183583 137435 102197 154830 193572 181960 222651
15698 222651 233387 190684 190772 216659 260202 257859 237078 179178 155295 193062 175036 190756
15686 190756 193028 179649 202640 247540 299039 298155 284252 214875 158566 208575 212878 91534
15674 91534 57784 100307 155102 218719 176297 98510 115014 165692 133681 105448 80105 97973
15662 97973 159283 132745 97223 116330 128855 202898 203268 112771 75038 63674 79883 144524
15650 144524 144575 126311 100466 73631 46951 98715 146357 158754 144340 97035 66746 64577
$$ packed form
15734B82584k054L9490k5163K0433R481K021J0361m861k8882l5317k722J4403
15722B79774l601j3091j0733P234J1908J6704J569k7411m024L6791r237J8931
15710C04814l994M575N929m884q7132l5725m6148l5238N2633L8742j1612M0691
15698B22651J0736m2703Q8K5887M3543k343k0781n7900k3883L7767j8026J5720
15686A90756K272j3379K2991M4900N1499q84j3903o9377n6309N0009M303j21344
15674I1534l3750M2523N4795O3617m2422p7787J6504N0678l2011k8233k5343J7868
15662I7973O1310k6538l5522J9107J2525P4043L70r0497l7733j1364J6209O4641
15650A44524N1j8264k5845k6835k6680N1764M7642J2397j4414m7305l0289k169
$$ plain form
15638 64577 66296 120946 107225 100206 101159 133145 115577 86689 119182 114362 152718 165462 153297
15625 153297 106019 101204 128682 122004 38964 69025 51807 24785 -8069 10542 27226 90815
15613 90815 74986 98264 126687 80921 40578 63584 54564 54377 94357 95997 97409 83958 88011
15600 88011 122152 128130 125880 130118 68790 -9266 -34216 -28299 23808 71333 53523 73921
15588 73921 113282 103554 67577 52040 41978 61567 109541 77001 50567 27237 72478 108234
15576 108234 75245 28267 38604 109626 105386 151062 205845 227297 175411 200525 248677 282004
15564 282004 267257 204771 176412 175070 180925 200202 250400 339280 445915 540612 569636 534491
15552 534491 546393 593543 573971 461560 418074 404109 351050 315131 288074 263331 277618
$$ packed form
15638F4577J719N4650j3721p019R53L1986j7568k8888L2493m820L8356J2744j2165
15625A53297m7278m815K7478o678q3040L0061j7218k7022l2854J8611J6684O3589
15613I0815j5829K3278K8423m5766m0343K3006r020j87L9980J640J412j3451M053
15600H8011L4141N978k250M238o1328p8056k4950N917N2107M7525j7810K0398
15588G3921L9361r728l5977j5537j0062J9589M7974l2540k6434k3330M5241L5756
15576A08234l2989m6978J0337P1022m240M5676N4783K1452n1886K5114M8152L3327
15564B82004j4747o2486k8359j342N855J9277N0198Q8880J06635R4697K9024l5145
15552E34491J1902M7150j9572j12411m3486j3965n3059l5919k7057k4743J4287
$$ plain form
15541 277618 274093 262140 206784 152045 128226 108565 94087 95618 66362 57891 69485 86871
15529 86871 47177 77932 114006 113040 142248 128604 133964 119248 96576 56040 82772 92892
15517 92892 68698 47873 5894 -2409 17206 39034 71010 123673 148282 132814 115207 121478
15505 121478 93602 27599 28303 25416 -12035 -35446 -15059 63369 88772 57960 22067 62421
15493 62421 57360 -20505 -10981 -30017 -43350 -8831 -23653 4660 20227 76155 142548 96327
15481 96327 54995 77549 62601 73308 114390 67603 -14651 -3567 -25442 -13904 -8227 -12927
15469 -12927 8387 23444 42233 77230 73807 -5882 -3299 29602 29136 -6407 10749 54593
15457 54593 38552 64821 122245 149424 114760 96500 9618 -58230 -39697 -77597 -107458 -23970
$$ packed form
15541B77618l525j1953n5356n4739k3819j9661j4478J531k9256q471J1594J7386
15529H6871l9694L0755L6074r66K9208j3644N360j4716k2672m0536K6732J0120
15517I2892k4194k0825m1979q303J9615K1828L1976N2663K4609j5468j7607O271
15505A21478k7876o6003P04k887l7451k3411K0387P8428K5403l0812l5893M0354
15493F2421n061p7865R524j9036j3333L4519j4822K8313J5567N5928O6393m6221
15481I6327m1332K2554j4948J0707M1082m6787q2254J1084k1875J1538N677m700
15469a2927K1314J5057J8789L4997l423p9689K583L2901m66l5543J7156M3844
15457E4593j6041K6269N7424K7179l4664j8260q6882o7848J8533l7900k9861Q3488
$$ plain form
15445 -23970 18842 -17050 62192 137935 150313 110935 44180 13235 37834 61380 40462 -13285
15433 -13285 -43559 -57101 -78892 -21881 34233 64982 50437 23570 -36171 -94762 -144135 -135293
15421 -135293 -124897 -95031 -28467 3935 11146 -47608 -42346 -11853 31681 -5432 -1159 18590
15409 18590 8010 39251 43775 48015 67960 40165 -39378 -64768 -125074 -120950 -90906 -82224
15397 -82224 -33381 -38616 -25809 -65653 -81679 -53557 -16388 54517 15715 -36990 -52033 -48188
15385 -48188 -90151 -119163 -63307 -1339 -42995 -126142 -98357 -4716 7709 39298 45743 19256
15373 19256 -1001 -51323 -91340 -106663 -74343 -75130 -70333 41270 125921 144019 136046 105121
15361 105121 23450 3082 -40676 -28756 48166 129475 110348 91256 -5297 -793 37214 10615
$$ packed form
15445b3970M2812l5892P9242P5743J2378l9378o6755l0945K4599K3546k0918n3747
15433a3285l0274j3542k1791N7011N6114L0749j4545k6867n9741n8591m9373Q842
15421a35293J0396K9866O6564L2402P211n8754N262L0493M3534l7113M273J9749
15409A8590j0580L1241M524M240J9945k7795p9543k5390o0306M124L0044Q682
15397h2224M8843n235J2807l9844j6026K8122L7169P0905l8802n2705j5043L845
15385d8188m1963k9012N5856O1968m1656q3147K7785R3641J2425L1589O445k6487
15373A9256k0257n0322m0017j5323L2320p87M797J11603Q4651J8098p973l0925
15361A05121q1671k0368m3758J1920P6922Q1309j9127j9092r6553M504L8007k6599
$$ plain form
15349 10615 -7846 10803 13612 3748 11911 -16933 -52322 -47742 -12486 -32056 -31235 -10508 31437
15336 31437 15614 52242 63952 49864 36153 20043 -37283 -84050 -63445 -6712 -20994 -47840
15324 -47840 -44029 -30854 -8787 13051 69712 60912 90862 174566 211676 193736 192735 235245
15312 235245 286951 288859 279085 251533 266727 275339 332267 372072 384844 402879 397668 450406
15300 450406 439894 395932 403526 426077 382982 434182 441446 451471 448989 457107 441846 410190
15288 410190 377439 348646 275612 243850 268202 259288 177196 129096 160495 184029 201811 156573
15276 156573 139220 131822 117439 145295 140395 66338 -3027 11888 94140 81552 78346 32970
15264 32970 12269 4836 26640 29429 -13311 14193 8649 -436 30969 20379 2318 5702 -28888
$$ packed form
15349A0615j8461J8649K809r864Q163k8844l5389M580L5256j9570Q21K0727M1945
15336C1437j5823L6628J1710j4088j3711j6110n7326m6767K0605N6733j4282k6846
15324d7840L811J3175K2067K1838N6661q800K9950Q3704L7110j7940j001M2510
15312B35245N1706J908r774k7552J5194Q612N6928L9805J2772J8035n211N2738
15300D50406j0512m3962P594K2551m3095N1200P264J0025k482Q118j5261l1656
15288D10190l2751k8793p3034l1762K4352q914q2092m8100L1399K3534J7782m5238
15276A56573j7353p398j4383K7856m900p4057o9365J4915Q2252j2588l206m5376
15264C2970k0701p433K1804K789m2740K7504n544r085L1405j0590j8061L384l4590
$$ plain form
15251 -28888 -50661 -57234 -12170 18907 30619 -10144 6469 66059 28051 30200 76766 -401
15239 -401 -31440 -6667 10154 -27663 25479 42580 11945 10609 38883 31259 -2663 30798
15227 30798 51189 76324 43839 7009 23983 31317 -393 -50913 -115186 -107705 -13391 74998
15215 74998 95172 41799 -25945 -64467 -34836 -29594 19505 -514 -11668 1664 47191 47675
15203 47675 -5779 8397 -43581 -39741 -39236 -31888 -22548 35936 37162 14652 36236 -8508 -47289
15190 -47289 -35372 -21241 -60274 -98109 -91276 -54038 -50556 3286 38172 42029 35892 19156
15178 19156 -18584 -52979 -3916 4478 30914 44415 -8313 -54270 -14072 15246 59730 14327
15166 14327 -5422 -27377 -60799 -63856 -103074 -128927 -37123 -40383 -53620 -36386 -5165 -13378
$$ packed form
15251b8888k1773o573M5064L1077J1712m0763J6613N9590l8008K149M6566p7167
15239d01l1039K4773J6821l7817N3142J7101l0635j336K8274p624l3922L3461
15227C0798K0391K5135l2485l6830J6974P334l1710n0520o4273P481R4314Q8389
15215G4998K0174n3373o7744l8522K9631N242M9099k0019j1154J3332M5527M84
15203D7675n3454J4176n1978L840N05P348R340N8484J226k2510K1584m4744l8781
15190d7289J1917J4131l9033l7835O833L7238L482N3842L4886L857o137j6736
15178A9156l7740l4395M9063Q394K6436J3501n2728m5957M0198K9318M4484m5403
15166A4327j9749k1955l3422l057l9218k5853R1804l260j3237J7234L1221q213
$$ plain form
15154 -13378 -52764 -52532 -52403 -55987 -51001 -42884 -63128 -52455 -56956 -18654 65639 47274 14487
15141 14487 42181 61469 41719 56544 70504 101027 94869 42940 50794 56618 337 -18581
15129 -18581 -52164 3208 -16051 -1481 25204 15922 19441 7692 28631 78156 75073 72239
15117 72239 36693 -46599 -47893 -3175 1102 20998 16183 1573 -6296 -6761 -11890 39000 47219
15104 47219 20002 23011 70476 83396 39682 16030 -2963 -908 40262 41202 37995 36716 -22027
15091 -22027 -71356 -62399 -6994 11024 -6731 -27355 -76630 -66291 -97551 -90351 -63387 -56208
15079 -56208 -8462 32661 47024 2370 -17338 -26049 -4952 2933 17204 -33097 -80287 -100618
15067 -100618 -75660 -31095 21741 67225 82125 60023 -2724 -34773 -49652 -13692 9456
$$ packed form
15154a3378l9386K32J29l584M986Q117k0244J0673m501L8302Q4293j8365l2787
15141A4487K7694J9288j9750J4825J3960L0523o158n1929P854N824n6281j8918
15129a8581l3583N5372j9259J4570K6685r282L519j1749K0939M9525l083k834
15117G2239l5546q3292j294M4718M277J9896m815j4610p869m65n129N0890Q219
15104D7219k7217L009M7465J2920m3714k3652j8993K055M1170R40l207j279n8743
15091b2027m9329Q957N5405J8018j7755k0624m9275J0339l1260P200K6964P179
15079e6208M7746M1123J4363m4654j9708q711K1097P885J4271n0301m7190k0331
15067a00618K4958M4565N2836M5484J4900k2102o2747l2049j4879L5960K3148
$$ plain form
15056 9456 -14993 -18901 -9733 -90331 -128843 -112689 -64594 -52789 -33075 -8289 2031 -50413
15044 -50413 -39620 -15926 -22694 -32754 -29688 -44323 -76045 -50297 -53794 -50917 -40865 -61008
15032 -61008 -102855 -125658 -114615 -81332 -69703 -67026 -23046 -2833 16354 -18704 -57450 -60058
15020 -60058 -53914 -46583 -52195 -81575 -45616 4946 -28369 -92130 -86854 -98477 -81933 -77870 -72607
15007 -72607 -51409 -29387 19896 63167 82921 86617 58981 8268 -1294 8207 -35464 -71529
14995 -71529 13541 -5920 -65611 -45358 -21869 -85517 -105676 -88906 -152112 -155058 -100260 5674
14983 5674 18190 61354 91316 12480 -30085 -17491 -8671 26897 56092 76497 72550 45805
14971 45805 9071 19329 -3241 -30019 -13687 -47328 -4499 -9486 -23274 -51229 -90805 -126936
$$ packed form
15056I456k4449l908R168q0598l8512J6154M8095J1805J9714K4786J0320n2444
15044e0413J0793K3694o768j0060L066j4635l1722K5748l497K877J0052k0143
15032f1008m1847k2803J1043L3283J1629K677M3980K0213J9187l5058l8746k608
15020f0058O144P331n612k9380L5959N0562l3315o3761N276j1623J6544M063N263
15007g2607K1198K2022M9283M3271J9754L696k7636n0713r562R501m3671l6065
14995g1529Q5070j9461n9691K0253K3489o3648k0159J6770o3206k946N4798J05934
14983E674J2516M3164K9962p8836m2565J2594Q820L5568K9195K0405l947k6745
14971D5805l6734J0258k2570k6778J6332l3641M2829m987j3788k7955l9576l6131
$$ plain form
14959 -126936 -86684 -78348 -105731 -96554 -119250 -143434 -111073 -21162 33035 36855 19496 41
14947 41 10876 64735 45240 -20409 -85460 -92281 -83644 -55922 -79075 -39279 -19444 -63218 -105688
14934 -105688 -48089 -36189 -90070 -60713 5107 -28215 -55888 -40036 -11014 -29695 -20100 -16177
14922 -16177 -12844 8979 -13632 -37830 -32989 -5441 -4582 -36893 -86132 -96851 -37074 -40083 -22341
14909 -22341 19239 49452 37611 40907 9856 16987 51353 106823 126965 113294 54812 23311
14897 23311 -57937 -67514 -55828 -51534 -33746 -2207 32232 7934 -91840 -115278 -10299 51237
14885 51237 44951 65649 48954 -32101 -25781 32418 77409 84725 49951 -10706 -85703 -83120
14873 -83120 -81249 -26816 -46244 -60099 -43446 8162 2546 -41552 -65157 -62544 -68832 -6987
$$ packed form
14959a26936M0252Q336k7383R177k2696k4184L2361Q9911N4197L820j7359j9455
14947D1J0835N3859j9495o5649o5051o821Q637K7722k3153L9796J9835m3774m2470
14934a05688N7599J1900n3881K9357O5820l3322k7673J5852K9022j8681R595L923
14922a6177L333K1823k2611k4198M841K7548Q59l2311m9239j0719N9777l009J7742
14909b2341M1580L0213j1841L296l1051P131L4366N5470K0142j3671n8482l1501
14897B3311q1248r577J1686M294J7788L1539L4439k4298r9774k3438J04979O1536
14885E1237o286K0698j6695q1055O320N8199M4991P316l4774o0657p4997K583
14873h3120J871N4433j9428j3855J6653N1608n616m4098k3605K613o288O1845
$$ plain form
14861 -6987 -15238 -7277 -8201 -41298 -1767 -28364 -52208 -65694 -44562 -31853 -33558 5106 -20648
14848 -20648 -87830 -54965 11991 15328 15866 16344 43852 53823 -16770 -24201 740 24335 2867
14835 2867 -20816 5115 16777 41013 44481 31032 -1907 37583 18449 66045 126667 113545
14823 113545 86159 45473 48328 18850 13994 14609 -11767 -45088 -35281 -54551 -59634 -18415 -2726
14810 -2726 42158 75537 68709 29968 -21589 -23831 -25475 -50154 -19518 -7357 32896 85227
14798 85227 59645 -38102 -62475 209 36873 -14068 -5021 -44260 -42374 1352 -52720 -62174
14786 -62174 -46478 -31470 -8061 -36567 -16367 575 12384 12424 -35314 -30020 -3967 -46990
14774 -46990 -21958 42180 47257 -19567 -12972 -33227 -76166 -38575 -18961 -18944 -67161 -75661 -124793
$$ packed form
14861f987q251P961r24l3097L9531k6597k3844j3486K1132J2709j705L8664k5754
14848b0648o7182L2865O6956L337N38M78K7508R971p0593p431K4941K3595k1468
14835B867k3683K5931J1662K4236L468j3449l2939L9490j9134M7596O0622j3122
14823A13545k7386m0686K855k9478m856O15k6376l3321R807j9270n083M1219J5689
14810b726M4884L3379o828l8741n1557k242j644k4679L0636J2161M0253N2331
14798H5227k5582r7747k4373O2684L6664n0941R047l9239J886M3726n4072r454
14786f2174J5696J5008K3409k8506K0200J6942J1809M0m7738N294K6053m3023
14774d6990K5032O4138N077o6824O595k0255m2939L7591J9614J7m8217q500m9132
$$ plain form
14761 -124793 -102023 -114406 -99856 -63174 -55608 -46531 -37917 -24090 -52314 -58731 -110636 -147548
14749 -147548 -129452 -136487 -64928 -53180 -21877 20037 42888 88302 64743 -38710 -110991
14738 -110991 -86212 -25273 28358 2590 -30817 -48366 -64771 -89765 -48456 -26966 -18545 21816
14726 21816 49963 40233 43104 6164 -61163 -62150 -68611 -90140 -69553 -57095 -69129 -26418 50816
14713 50816 67000 30080 -27080 -6489 50748 4931 -12728 -33439 -49050 -14115 39308 22998
14701 22998 405 16272 65366 43102 40571 -27548 -101431 -111215 -134380 -107743 -86433 -66072
14689 -66072 21584 27424 -70029 -90574 -33731 -29074 -32406 -14879 -85836 -64204 11574 -3671
14677 -3671 -46286 -49127 -41146 -20570 -41992 -15856 22612 57165 49589 -15748 -27375 -57953
$$ packed form
14761a24793K2770j2383J4550L6682P566R077Q614J3827k8224o417n1905l6912
14749a47548J8096p035P1559J1748L1303M1914K2851M5414k3559j03453p2281
14738a10991K4779O0939N3631k5768l3407j7549j6405k4994M1309K1490Q421M0361
14726B1816K8147r730K871l6940o7327r87o461k1529K0587J2458j2034M2711P7234
14713E0816J6184l6920n7160K0591N7237m5817j7659k0711j5611L4935N3423j6310
14701B2998k2593J5867M9094k2264k531o8119p3883r784k3165K6637K1310K0361
14689f6072Q7656N840r7453k0545N6843M657l332J7527p0957K1632P5778j5245
14677c671m2615k841P981K0576k1422K6136L8468L4553p576o5337j1627l0578
$$ plain form
14665 -57953 -93772 -41949 -30589 -19880 15955 70226 1718 -54370 -75521 -23904 3973 -28185
14653 -28185 -54675 -64442 -36193 -30764 -81257 -93330 -31308 -9371 5758 7887 -18498 -65613
14641 -65613 -67114 -66440 -58615 27596 89508 110546 52187 -47350 -5429 45285 75536 95840
14629 95840 87185 69131 85582 26409 -59824 -46646 -59990 -59992 -79374 -62955 -49014 -26716 57791
14616 57791 88421 40944 -33879 -6218 31779 42733 45747 68182 98198 99382 84574 86768
14604 86768 65719 20219 -26952 -86378 -75537 -4418 286 -36307 -59347 -72511 -45532 -40017
14592 -40017 -9705 -55090 -111870 -114889 -106310 -106437 -108378 -87618 -83089 -70914 -55206 12700 63356
14579 63356 29545 -43212 -84463 -76885 -77820 -88992 -32904 -26973 511 4116 28317 33790 4347
$$ packed form
14665e7953l5819N1823J1360J0709L5835N4271o8508n6088k1151N1617K7877l2158
14653b8185k6490r767K8249N429n0493j2073O2022K1937J5129K129k6385m7115
14641f5613j501O74P825Q6211O1912K1038n8359r9537M1921N0714L0251K0304
14629I5840q655j8054J6451n9173q6233J3178j3344kj9382J6419J3941K2298Q4507
14616E7791L0630m7477p4823K7661L7997J0954L014K2435L0016J184j4808K194
14604H6768k1049m5500m7171n9426J0841P1119M704l6593k3040j3164K6979N515
14592d0017L0312m5385n6780l019Q579j27j941K0760M529J2175J5708O7906N0656
14579F3356l3811p2757m1251P578r35j1172N6088N931K7484L605K4201N473k9443
$$ plain form
14566 4347 8852 -33660 -106313 -164426 -135291 -96790 -56146 -46692 -33542 -41805 -25022 49575
14554 49575 -10602 -50640 -46399 -58886 -24468 15257 17179 -24444 6677 22394 -13272 29102
14542 29102 15292 21775 48285 99349 35195 33093 66636 50209 6862 29476 27713 27962 17045
14529 17045 8363 -16925 -32915 -35069 -21211 7501 23380 61707 62942 37380 10410 -2300
14517 -2300 26917 22275 -38137 -68328 -47896 -20285 -6323 2669 -35050 -78291 -55459 43439
14505 43439 71533 117872 114868 87256 -133 6915 16073 44625 69838 44134 26279 -17795
14493 -17795 18045 5395 50801 47697 21931 6294 39591 32220 -10647 27996 72992 15962
14481 15962 -36921 -43746 -11375 37353 -3053 -57520 -48690 -32322 4602 -31157 -47188 -62942
$$ packed form
14566D347M505m2512p2653n8113K9135L8501M0644R454J3150q263J6783P4597
14554D9575o0177m0038M241j2487L4418L9725J922m1623L1121J5717l5666M2374
14542B9102j3810O483K6510N1064o4154k102L3543j6427m3347K2614j763K49j0917
14529A7045q682k5288j5990k154J3858K8712J5879L8327J235k5562k6970j2710
14517b300K9217m642o0412l0191K0432K7611J3962Q992l7719m3241K2832R8898
14505D3439K8094M6339l004k7612q7389P048R158K8552K5213k5704j7855m4074
14493a7795L5840j2650M5406l104k5766j5637L3297p371m2867L8643M4996n7030
14481A5962n2883o825L2371M8728m0406n4467Q830J6368L6924l5759j6031j5754
$$ plain form
14469 -62942 -50361 -27094 -51910 12113 24750 -32151 -103979 -104889 -589 12402 -1559 5282
14457 5282 47690 60010 36518 34783 32143 -10565 -6110 -10099 -63871 -53958 22803 33117 -11305
14444 -11305 -27301 -50560 -28347 -47460 -44512 -12473 12947 2575 -25576 14219 40848 -16571
14432 -16571 -20333 -79190 -84174 -74928 -87394 -91315 -57735 -26998 -17011 -21587 -79684 -31959 -12112
14419 -12112 -91990 -80532 -83067 -56653 -20850 35091 85904 54764 10876 41440 21915 -15382
14407 -15382 -11392 -13612 -25551 -22820 8837 24728 81061 54839 -6813 -48532 -65407 -75548
14395 -75548 -89479 -45510 -9682 -3396 -27994 -85672 -86590 6938 -3063 -54063 -69633 -14627
14383 -14627 -62694 -65793 -11946 -15037 18122 -28024 -27266 -40535 -72495 -58848 -30298 -39271 -26247
$$ packed form
14469f2942J2581K3267k4816O4023J2637n6901p1828r10J04300J2991j3961O841
14457E282M2408J2320k3492j735k640m2708M455l989n3772R913P6761J0314m4422
14444a1305j5996k3259K2213j9113K948L2039K5420j0372k8151L9795K6629n7419
14432a6571l762n8857m984R246j2466l921L3580L0737R987m576n8097M7725J9847
14419a2112p9878J1458k535K6414L5803N5941N0813l1140m3888L0564j9525l7297
14407a5382L990k220j1939K731L1657J5891N6333k6222o1652m1719j6875j0141
14395g5548j3931M3969L5828O286k4598n7678r18R3528j0001n1000j5570N5006
14383a4627m8067l099N3847l091L3159m6146P58j3269l1960J3647K8550q973J3024
$$ plain form
14370 -26247 -48035 -52342 -93830 -187823 -184191 -138389 -151217 -143495 -91155 -50669 -15776 39616
14358 39616 7522 -69657 -96331 -38557 -24626 -44921 -61835 -57908 -43975 -43958 -8708 33429
14346 33429 -3045 -46672 -36596 35416 53078 3005 -47637 -30345 -31019 -64406 -15467 17964
14334 17964 85231 120544 96612 66034 12045 -1458 -9828 -69288 -73014 -52287 -31949 -36706
14322 -36706 -64772 -46779 -17770 -8312 10271 96387 107329 71270 49323 2570 -25616 -21718
14310 -21718 -10715 28699 -32920 723 42412 21153 -19313 -88098 -113705 -66005 -36460 -68273
14298 -68273 -83595 -57655 -10015 14824 28446 43510 6693 1789 -2432 14097 -1057 15748
14286 15748 38222 49767 22496 4890 64203 93872 153284 131470 68032 30985 10505 10052
$$ packed form
14370b6247k1788m307m1488r3993L632M5802j2828P722N2340M0486L4893N5392
14358C9616l2094p7179k6674N7774J3931k0295j6914L927J3933J7L5250M2137
14346C3429l6474m3627J0076P2012J7662n0073n0642J7292o74l3387M8939L3431
14334A7964O7267L5313k3932l0578n3989j3503q370n9460l726K0727K0338m757
14322c6706k8066J7993K9009R458J8583Q6116J0942l6059k1947m6753k8186L898
14310b1718J1003L9414o1619L3643M1689k1259m0466o8785k5607M7700K9545l1813
14298f8273j5322K5940M7640K4839J3622J5064l6817m904m221J6529j5154J6805
14286A5748K2474J1545k7271j7606N9313K9669N9412k1814o3438l7047k0480m53
$$ plain form
14274 10052 -73197 -47146 -12572 9907 23622 35771 -9616 -98399 -79621 -57890 -20591 -48523
14262 -48523 -80294 -54632 -39453 -38923 -10967 26882 47958 56641 19968 28572 54179 34600
14250 34600 64753 55786 5367 35532 97808 53466 9442 37506 25264 -14233 -1852 11756
14238 11756 -15196 -73225 -80707 -39989 -25353 -58853 -81182 -52204 -5749 29877 55184 75087
14226 75087 58631 44659 -3421 -36850 -13938 -18227 -23834 -26873 -58203 3497 74732 69308
14214 69308 -44279 -105079 -95297 -35912 57157 71045 34224 42582 45653 -6307 -47403 35041
14202 35041 83160 103203 75574 121036 103747 43460 58403 88140 55312 46481 1399 19382
14190 19382 81384 63008 21159 16808 17193 39436 35073 -8771 -5549 35927 53610 46101 96350
$$ packed form
14274A0052q3249K6051L4574K2479J3715J2149m5387q8783J8778K1731L7299k7932
14262d8523l1771K5662J5179N30K7956L7849K1076Q683l6673Q604K5607j9579
14250C4600L0153q967n0419L0165O2276m4342m4024K8064j2242l9497J2381J3608
14238A1756k6952n8029p482M0718J4636l3500k2329K8978M6455L5626K5307J9903
14226G5087j6456j3972m8080l3429K2912m289n607l039l1330O1700P1235n424
14214F9308j13587o0800R782N9385R3069J3888l6821Q358L071n1960m1096Q2444
14202C5041M8119K0043k7629M5462j7289o0287J4943K9737l2828q831m5082J7983
14190A9382O2002j8376m1849m351L85K2243m363m3844L222M1476J7683p509N0249
$$ plain form
14177 96350 111943 119361 103669 73709 8195 24758 66379 94077 98224 68170 91789 70195
14165 70195 -3414 -48132 -7440 3860 -8121 -34644 -21129 63186 34560 -3322 3370 -1462
14153 -1462 -57960 18622 90580 76581 81838 50057 52955 61476 83237 77936 35130 13962 9560
14140 9560 -16862 -50823 -19216 67495 94300 9743 -49216 -55148 -1650 14516 20733 57117
14128 57117 47815 15034 -24713 12806 -41774 -54726 -71868 -32325 4315 -30493 -44517 -48147
14116 -48147 -49608 -3196 -12695 -26795 671 -28218 -41575 2161 41130 31739 24822 14989 16509
14103 16509 19546 2494 -21315 -29025 28317 3514 46806 101781 108674 33832 -33868 10892
14091 10892 106295 117210 2554 -88321 -94419 -53104 -41112 -20594 -11445 10062 11242 20889
$$ packed form
14177I6350J5593P418j5692k9960o5514J6563M1621K7698M147l0054K3619k1594
14165G0195p3609m4718M0692J1300j1981k6523J3515Q4315k8626l7882O692m832
14153a462n6498P6582P1958j3999N257l1781K898Q521K1761n301m2806k1168m402
14140I560k6422l3961L1607Q6711K6805q4557n8959n932N3498J6166O217L6384
14128E7117r302l2781l9747L7519n4580j2952j7142L9543L6640l4808j4024l630
14116d8147j461M6412r499j4100K7466k8889j3357M3736L8969r391o917r833J520
14103A6509L037j7052k3809p710N7342k4803M3292N4975O893p4842o7700M4760
14091A0892R5403J0915j14656r0875o098M1315J1992K0518R149K1507J180R647
$$ plain form
14079 20889 7444 -24621 -10852 36070 12327 48116 34084 -8052 -21604 19319 39543 -19574
14067 -19574 -68791 -21342 -6294 -17818 18518 -28153 -80756 -67578 -17041 -11255 -9920 66809
14055 66809 73847 63220 88445 51380 68504 71361 37246 58737 64118 69460 68089 88924 111001
14042 111001 136408 146594 155558 133387 183360 248262 307910 326358 315871 301089 323713 292102
14030 292102 275015 312809 384759 399742 367416 371482 359489 318285 308244 280143 179553
14019 179553 183464 227241 196567 179169 154122 111382 179970 275231 240708 196580 149798 69694
14007 69694 67944 65980 110911 158124 155413 158081 108646 66310 29749 52154 104132 136222
13995 136222 148454 92933 34242 48946 83092 87964 52398 45651 50154 69276 56846 58478
$$ packed form
14079B0889j3445l2065J3769M6922k3743L5789j4032m2136j3552M0923K0224n9117
14067a9574m9217M7449J5048j1524L6336m6671n2603J3178N0537N786J335P6729
14055F6809P038j0627K5225l7065J7124K857l4115K1491N381N342j371K0835K2077
14042A11001K5407J0186Q964k2171M9973O4902N9648J8448j0487j4782K2624l1611
14030B92102j7087L7794P1950J4983l2326M066j1993m1204j0041k8101j00590
14019A79553L911M3777l0674j7398k5047m2740O8588R5261l4523m4128m6782q0104
14007F9694j750j964M4931M7213k711K668m9435m2336l6561K2405N1978L2090
13995A36222J2232n5521n8691J4704L4146M872l5566o747M503J9122j2430J632
$$ plain form
13983 58478 68076 51728 36942 10571 -6848 11636 -3762 12732 66111 51992 48189 89575
13971 89575 101743 64651 -23011 -36661 -6842 23669 100961 167783 176993 134793 59707 14351
13959 14351 74106 130343 196937 240774 202963 116689 133377 179111 136691 55512 32809 48358
13947 48358 116558 95710 30894 61059 107100 83885 119384 99698 77846 51059 82558 95444
13935 95444 53019 29328 -17767 5712 56586 83961 142773 163475 168218 182631 156118 149582
13923 149582 217325 166168 166213 151917 108852 76436 131911 108833 95115 89011 109865 111311
13911 111311 89617 69245 89358 158993 204300 161149 115994 104807 78795 58611 93727
13900 93727 89029 126942 158047 185623 163805 170508 141496 144335 165336 217111 257233 203760
$$ packed form
13983E8478R598j6348j4786k6371j7419J8484j5398J6494N3379j4119l803M1386
13971H9575J2168l7092q7662j3650K9819L0511P7292O6822R210m2200p5086m5356
13959A4351N9755N6237O6594M3837l7811q6274J6688M5734m2420q1179k2703J5549
13947D8358O8200k0848o4816L0165M6041k3215L5499j9686k1852k6787L1499J2886
13935I5444m2425k3691m7095K3479N0874K7375N8812K0702M743J4413k6513o536
13923A49582O7743n1157M5j4296m3065l2416N5475k3078j3718o104K0854J446
13911A11311k1694k0372K0113O9635M5307m3151m5155j1187k6012k0184L5116
13900I3727m698L7913L1105K7576k1818O703k9012K839K1001N1775M0122n3473
$$ plain form
13888 203760 198710 201849 203419 200930 140391 126484 180832 163460 157856 128908 123720 130469 135596
13875 135596 138583 161669 150087 155257 175279 197563 211826 193992 115567 86955 146826 149379
13863 149379 135115 145631 160169 147515 155001 135706 114257 142788 134929 114020 142531 196224
13851 196224 206688 219759 199450 191366 178878 164875 135511 180741 195017 187209 218162 243093
13839 243093 225652 213891 242382 215400 142341 159152 175332 211651 226374 248746 275079
13828 275079 213608 185751 191559 241192 212581 190535 211732 147844 91848 113833 216166
13817 216166 240833 217099 145732 181052 260360 263926 223276 164455 168202 239573 246430 263288
13805 263288 254359 235089 256038 294002 285003 242287 193881 195980 184527 181128 189070 214674
$$ packed form
13888B03760n050L139J570k489o0539j3907N4348j7372n604k8948n188O749N127
13875A35596K987K3086j1582N170K0022K2284J4263j7834p8425k8612N9871K553
13863A49379j4264J0516J4538j2654P486j9295k1449K8531p859k0909K8511N3693
13851A96224J0464J3071k0309q084j2488j4003k9364M5230J4276p808L0953K4931
13839B43093j7441j1761K8491k6982p3059J6811J6180L6319J4723K2372K6333
13828B75079o1471k7857N808M9633k8611k2046K1197o3888n5996K1985J02333
13817B16166K4667k3734p1367L5320P9308L566m0650n8821L747P1371O857J6858
13805B63288q929j9270K0949L7964q999m2716m8406K099j1453l399P942K5604
$$ plain form
13793 214674 238431 258416 274436 323460 357466 355056 320821 284337 252461 246005 265557 242270
13781 242270 249534 234646 294625 322101 378073 420761 374387 358319 363417 324745 300598 344777
13769 344777 396515 364636 330003 310334 336631 328902 331700 337408 361599 362097 331602 343856
13757 343856 362431 412400 475490 455170 400258 376822 356167 391712 439611 441684 419807 419949
13745 419949 409577 452849 429259 476268 506797 436525 393389 430582 468782 416839 387435
13734 387435 433904 476808 452767 446249 490893 489591 400798 354024 370768 433115 509085 516923
13722 516923 511463 533326 517148 541755 594254 560356 502830 496113 507692 512357 536871 601680
13710 601680 600349 587131 601713 638041 623511 549261 566403 592093 596337 583694 655477 731589
$$ packed form
13793B14674K3757J9985J6020M9024L4006k410l4235l6484l1876o456J9552k3287
13781B42270P264j4888N9979K7476N5972M2688m6374j6068N098l8672k4147M4179
13769C44777N1738l1879l4633j9669K6297p729K798N708K4191M98l0495J2254
13757C43856J8575M9969O3090k0320n4912k3436k0655L5545M7899K073k1877J42
13745D19949j0372M3272k3590M7009L0529p0272m3136L7193L8200n1943k9404
13734C87435M6469M2904k4041o518M4644j302q8793m6774J6744O2347P5970P838
13722E16923n460K1863j6178K4607N2499l3898n7526o717J1579M665K4514O4809
13710F01680j331j3218J4582L6328j4530p4250J7142K5690M244j2643P1783P6112
$$ plain form
13698 731589 730994 628076 565443 619114 667663 667480 669956 634171 650702 671918 659637 685894
13686 685894 696178 687475 690986 734472 727257 719768 658092 605356 655392 708596 682589 697340
13674 697340 735379 798948 834488 809357 774921 795904 844120 837454 836268 890965 879136 863796
13662 863796 872495 922610 926124 912715 922170 907943 922405 922375 964427 981812 971407 948055 967093
13649 967093 1008358 1009364 1026254 1082891 1071687 1049278 1066675 1129517 1160536 1188653 1194079 1244560
13637 1244560 1204573 1216426 1275504 1281258 1326346 1356380 1337444 1308519 1268011 1302487 1350405
13626 1350405 1335504 1347671 1365980 1373994 1401005 1492747 1571246 1586770 1604776 1632636 1737564
13615 1737564 1760435 1755482 1727279 1753605 1819679 1837394 1895054 1948924 1975770 1970006 2010532 2024134
$$ packed form
13698G31589n95j02918o2633N3671M8549j83K476l5785J6531K1216j2281K6257
13686F85894J0284q703L511M3486p215p489o1676n2736N0036N3204k6007J4751
13674F97340L8039O3569L5540k5131l4436K0983M8216o666j186N4697j1829j5340
13662H63796Q699N0115L514j3409R455j4227J4462l0M2052J7385j0405k3352J9038
13649I67093M1265J006J6890N6637j1204k2409J7397O2842L1019K8117N426N0481
13637A244560l9987J1853N9078N754M5088L0034j8936k8925m0508L4476M7918
13626A350405j4901J2167J8309Q014K7011R1742P8499J5524J8006K7860J04928
13615A737564K2871m953k8203K6326O6074J7715N7660N3870K6846n764M0526J3602
$$ plain form
13603 2024134 2077087 2126347 2168705 2205114 2244502 2268696 2326322 2359682 2364278 2344179 2375252
13592 2375252 2457828 2558066 2571087 2634286 2720849 2749575 2833321 2868415 2879657 2942488 3060276
13581 3060276 3150343 3291731 3364931 3397993 3400012 3404660 3456834 3509718 3577424 3682107 3791433
13570 3791433 3963456 4066761 4168379 4232745 4236811 4319635 4421392 4510558 4565830 4654674 4791236
13559 4791236 4927347 5061970 5236886 5361446 5458704 5646379 5777115 5969163 6147735 6345322
13549 6345322 6503622 6605340 6722877 6902457 7136962 7370463 7588006 7842258 8201069
13540 8201069 8438320 8654940 8906719 9185861 9490105 9837949 10252963 10694675 11069545
13531 11069545 11430096 11884100 12406624 12876518 13314127 13828023 14451746 15115870 15769793
$$ packed form
13603B024134N2953M9260M2358L6409L9388K4194N7626L3360M596k0099L1073
13592B375252Q2576J00238J3021O3199Q6563K8726Q3746L5094J1242O2831J17788
13581C060276R0067J41388P3200L3062K019M648N2174N2884O7706J04683J09326
13570C791433J72023J03305J01618O4366M066Q2824J01757Q9166N5272Q8844J36562
13559D791236J36111J34623J74916J24560R7258J87675J30736J92048J78572J97587
13549F345322J58300J01718J17537J79580K34505K33501K17543K54252L58811
13540H201069K37251K16620K51779K79142L04244L47844M15014M41712L74870
13531A1069545L60551M54004N22524M69894M37609N13896O23723O64124O53923
$$ plain form
13522 15769793 16479083 17169869 17926449 18725871 19589808 20522967 21594168 22684304 23798574
13513 23798574 25014837 26299153 27659164 29137465 30746341 32445730 34244960 36192669
13505 36192669 38214849 40341137 42629601 45119372 47746456 50465893 53342475 56398348
13497 56398348 59579064 62930096 66305294 69801925 73332272 76983222 80642750 84329304
13489 84329304 87901476 91317298 94568472 97599780 100277057 102545647 104459028 105849219
13481 105849219 106618030 106862373 106555617 105598748 104050025 102005055 99493992 96621488
13473 96621488 93404442 89856508 86189579 82433456 78637566 74798308 71005165 67296256
13465 67296256 63712659 60258771 56925816 53772749 50794447 47977705 45291074 42764185
$$ packed form
13522A5769793P09290O90786P56580P99422Q63937R33159J071201J090136J114270
13513B3798574J216263J284316J360011J478301J608876J699389J799230J947709
13505C6192669K022180K126288K288464K489771K627084K719437K876582L055873
13497E6398348L180716L351032L375198L496631L530347L650950L659528L686554
13489H4329304L572172L415822L251174L031308K677277K268590J913381J390191
13481A05849219P68811K44343l06756r56869j548723k044970k511063k872504
13473I6621488l217046l547934l666929l756123l795890l839258l793143l708909
13465F7296256l583597l453888l332955l153067k978302k816742k686631k526889
$$ plain form
13457 42764185 40476200 38302270 36296284 34473000 32739622 31106276 29534707 28075280
13449 28075280 26669596 25402099 24229559 23154874 22074855 21072650 20179741 19347659
13441 19347659 18560560 17788761 17027647 16376446 15738778 15100365 14506259 13958845 13475136
13432 13475136 13004738 12567430 12075019 11644555 11223120 10795998 10417192 10065254 9756623
13423 9756623 9477166 9170703 8860288 8631888 8388637 8158220 7963207 7770115 7510890
13414 7510890 7264006 7041509 6890008 6710277 6564965 6375684 6180561 6070425 5909641
13405 5909641 5722259 5502671 5430680 5371663 5261019 5133544 4989514 4910341 4815589 4671109
13395 4671109 4512648 4420313 4336777 4239731 4176407 4081972 4018799 3916637 3840562 3795344 3698114
$$ packed form
13457D2764185k287985k173930k005986j823284j733378j633346j571569j459427
13449B8075280j405684j267497j172540j074685j080019j002205q92909q32082
13441A9347659p87099p71799p61114o51201o37668o38413n94106n47414m83709
13432A3475136m70398m37308m92411m30464m21435m27122l78806l51938l08631
13423I756623k79457l06463l10415k28400k43251k30417j95013j93092k59225
13414G510890k46884k22497j51501j79731j45312j89281j95123j10136j60784
13405E909641j87382k19588p1991n9017j10644j27475j44030p9173r4752j44480
13395D671109j58461r2335q3536r7046o3324r4435o3173j02162p6075m5218r7230
$$ plain form
13384 3698114 3658792 3700517 3659193 3535581 3440398 3384405 3368359 3374522 3333400 3277482 3202273
13373 3202273 3107803 3006481 2913587 2858994 2808925 2787105 2735966 2656859 2615294 2570313 2539951
13362 2539951 2515348 2428381 2425504 2358304 2312572 2322393 2288489 2315503 2268353 2174264 2128999 2066737
13350 2066737 1999076 1960965 1975355 2023620 2001634 1938341 1895719 1871174 1865289 1884146 1857322
13339 1857322 1834500 1802314 1801812 1836721 1826496 1767207 1770824 1781027 1709232 1618902 1548393 1473981
13327 1473981 1519828 1547610 1518618 1474022 1447853 1484690 1445050 1412072 1419552 1367727 1334776
13316 1334776 1368200 1339080 1236116 1150574 1155091 1247924 1312589 1275572 1246592 1202079 1189581
13305 1189581 1178262 1136906 1160993 1169069 1197348 1174643 1105680 1094027 1047983 1011227 999679
$$ packed form
13384C698114l9322M1725m1324j23612r5183n5993j6046O163m1122n5918p5209
13373C202273r4470j01322r2894n4593n0069k1820n1139p9107m1565m4981l0362
13362B539951k4603q6967k877o7200m5732R821l3904K7014m7150r4089m5265o2262
13350B066737o7661l8111J4390M8265k1986o3293m2622k4545n885J8857k6824
13339A857322k2822l2186n02L4909j0225n9289L617J0203p1795r0330p0509p4412
13327A473981M5847K7782k8992m4596k6169L6837l9640l2978P480n1825l2951
13316A334776L3424k9120j02964q5542M517R2833O4665l7017k8980m4513j2498
13305A189581j1319m1356K4087Q076K8279k2705o8963j1653m6044l6756j1548
$$ plain form
13294 999679 1064184 1008973 1006699 979228 974588 989736 942882 881162 864983 880666 865894 829616
13282 829616 840425 858862 904891 895555 838572 805586 826589 866898 856879 841365 811518 795360
13270 795360 766945 787103 763729 734502 759271 772072 744532 695146 699795 764250 819746 781834
13258 781834 717577 747387 722613 748470 738143 684582 676798 693076 702389 733505 756048 734911
13246 734911 633709 635696 702254 756853 669701 545813 561203 584930 488979 422441 449501
13235 449501 493682 560284 552080 514190 512840 505198 494458 465643 465721 470034 474477 519303 555932
13222 555932 516001 491320 484487 521413 564092 610939 611287 583743 553844 546478 588309 554583
13210 554583 546098 546065 477109 449140 407198 405074 417580 444264 503649 500835 495364 442514 411692
$$ packed form
13294I99679O4505n5211k274k7471m640J5148m6854o1720j6179J5683j4772l6278
13282H29616J0809J8437M6029r336n6983l2986K1003M0309j0019j5514k9847j6158
13270G95360k8415K0158k3374k9227K4769J2801k7540m9386M649O4455N5496l7912
13258G81834o4257K9810k4774K5857j0327n3561p784J6278R313L1116K2543k1137
13246G34911j01202J987O6558N4599q7152j23888J5390K3727r5951o6538K7060
13235D49501M4181O6602q204l7890j350p642j0740k8815P8M313M443M4826L6629
13222E55932l9931k4681o833L6926M2679M6847L48k7544k9899p366M1831l3726
13210E54583q485l3o8956k7969m1942k124J2506K6684N9385k814n471n2850l0822
$$ plain form
13197 411692 457444 424136 407294 421016 457209 494600 470925 487287 492403 494693 482276 473560
13185 473560 536407 523983 499696 433816 404292 408267 425537 455733 449880 433887 427492 365018
13173 365018 365482 399919 354824 326801 381339 456085 453185 392267 373153 428281 420272 404858
13161 404858 424522 402662 421219 363981 322854 339867 336766 375902 375111 403815 440694 417351
13149 417351 433201 471866 429562 395156 356838 320985 313416 255743 230756 309164 294660 297725
13137 297725 365498 373204 314885 297338 237843 272813 283768 307816 279477 285711 359835 360882
13125 360882 391104 341499 388804 433361 347319 354910 340297 295534 370655 385959 352757 325439
13113 325439 326967 335387 333337 287364 293150 337268 287221 287743 288580 278622 284970 255967 204830
$$ packed form
13197D11692M5752l3308j6842J3722L6193L7391k3675J6362N116K290j2417q716
13185D73560O2847j2424k4287o5880k9524L975J7270L0196n853j5993o395o2474
13173C65018M64L4437m5095k8023N4538P4746k900o0918j9114N5128q009j5414
13161D04858J9664k1860J8557n7238m1127J7013l101L9136p91K8704L6879k3343
13149D17351J5850L8665m2304l4406l8318l5853p569n7673k4987P8408j4504L065
13137B97725O7773P706n8319j7547n9495L4970J0955K4048k8339O234P4124J047
13125C60882L0222m9605M7305M4557q6042P591j4613m4763P5121J5304l3202k7318
13113C25439J528Q420k050m5973N786M4118n0047N22Q37r958O348k9003n1137
$$ plain form
13100 204830 206004 198932 181430 176272 196214 223625 253998 258190 231825 184456 185927 189551 194172
13087 194172 183903 153960 237267 293682 291624 238896 227070 259298 257697 300703 329537 297306
13075 297306 225610 211691 227218 279854 318065 302630 290268 343135 349233 321824 280341 270640
13063 270640 277813 239510 230495 212827 219610 274371 270648 207296 153980 127122 152810 215231
13051 215231 227108 168521 237093 282504 299142 271803 249741 228854 207797 191842 160706
13040 160706 207196 224453 249585 257844 284390 287429 249037 215887 166537 138048 172112 218467
13028 218467 230415 208995 191625 192181 154015 156644 162366 126673 169436 165394 125202 123542 141448
13015 141448 108336 129950 130991 65709 81586 113296 162192 211424 214859 177783 144554 59865
$$ packed form
13100B04830J174p072j7502n158J9942K7411L0373M192k6365m7369J471L624M621
13087A94172j0269k9943Q3307N6415k058n2728j1826L2228j601M3006K8834l2231
13075B97306p1696j3919J5527N2636L8211j5435j2362N2867O098k7409m1483r701
13063B70640P173l8303r015j7668O783N4761l723o3352n3316k6858K5688O2421
13051B15231J1877n8587O8572M5411J6638k7339k2062k0887k1057j5955l1136
13040A60706M6490J7257K5132Q259K6546L039l8392l3150m9350k8489L4064M6355
13028B18467J1948k1420j7370N56l8166K629N722l5693M2763m042m0192j660J7906
13015A41448l3112K1614J041o5282J5877L1710M8896M9232L435l7076l3229q4689
$$ plain form
13003 59865 100430 111214 181189 262853 209068 188941 213137 174516 166285 191218 203252 178422
12991 178422 97056 145632 196436 191357 152385 103692 114457 133239 155478 225321 236304 224730
12979 224730 183260 135103 177170 196742 188483 157803 125251 137921 179119 204240 167639 91597
12967 91597 23586 57706 149548 228243 187243 143370 121290 171217 180987 173877 148255 175670
12955 175670 171663 107072 85696 74658 61982 73070 100614 149141 180676 242914 259402 215264
12943 215264 181057 112443 32424 39107 90525 107011 93975 105159 75865 72134 71272 101957
12931 101957 135425 189934 183230 136121 122926 55667 27519 39015 49263 68641 99814 118467
12919 118467 146354 169111 163213 105337 43880 71826 113773 165772 198750 182633 122384 74443
$$ packed form
13003E9865M0565J0784O9975Q1664n3785k0127K4196l8621q231K4933J2034k4830
12991A78422q1366M8576N0804n079l8972m8693J0765J8782K2239O9843J0983j1574
12979B24730m1470m8157M2067J9572q259l0680l2552J2670M1198K5121l6601p6042
12967I1597o8011L4120R1842P8695m1000m3873k2080M9927R770p110k5622K7415
12955A75670m007o4591k1376j1038j2676J1088K7544M8527L1535O2238J6488m4138
12943B15264l4207o8614q0019O683N1418J6486j3036J1184k9294l731q62L0685
12931A01957L3468N4509o704m7109j3195o7259k8148J1496J0248J9378L1173J8653
12919A18467K7887K2757n898n7876o1457K7946M1947N1999L2978j6117o0249m7941
$$ plain form
12907 74443 -7298 -44057 -7545 19916 60780 65417 95807 115592 160832 207612 190044 126189
12895 126189 96171 128470 167596 185214 130544 155999 146663 137472 91250 43697 76178 74224
12883 74224 85577 89496 69948 100187 122385 111634 113618 76039 28787 9355 69832 87381
12871 87381 69823 117664 177456 219572 180466 94593 58795 64038 107551 132228 111931 88973
12859 88973 54727 65004 46021 -5045 -7835 28224 55625 15928 18300 61638 59418 76636
12847 76636 77598 74335 71351 75523 116807 174574 215125 188022 128177 131305 161989 163214 215453
12834 215453 184003 146988 129556 103742 87414 86670 85751 131491 103004 39286 12707 26869
12822 26869 23718 40217 79642 59558 49058 38378 70423 111572 128463 115113 116390 119307
$$ packed form
12907G4443q1741l6759L6512K7461M0864M637L0390J9785M5240M6780j7568o3855
12895A26189l0018L2299L9126J7618n4670K5455r336r191m6222m7553L2481j954
12883G4224J1353L919j9548L0239K2198j0751J984l7579m7252j9432O0477J7549
12871H7381j7558M7841N9792M2116l9106q5873l5798N243M3513K4677k0297k2958
12859H8973l4246J0277j8983n1066k790L6059K7401l9697K372M3338k220J7218
12847G6636R62l263k984M172M1284N7767M0551k7103n9845L128L0684J225N2239
12834B15453l1450l7015j7432k5814j6328p44r19M5740k8487o3718k6579J4162
12822B6869l151J6499L9425k0084j0500j0680L2045M1149J6891j3350J277K917
$$ plain form
12810 119307 106661 129846 71029 -565 25164 89151 115115 177395 199157 170835 113430
12799 113430 147158 131834 183927 246889 244235 218251 201853 141476 85953 94763 143849 142794
12787 142794 76435 63885 91282 151724 141154 100090 120715 74392 58098 122551 139364
12776 139364 122143 145975 189242 136483 164149 179911 146132 99285 114521 156090 181025
12765 181025 164708 156742 113235 46057 73090 98034 178995 156263 135432 84592 46062 49965
12753 49965 116830 134718 88750 39199 65943 104192 129056 159507 186854 148363 117766 165701
12741 165701 197489 227138 252910 196330 167747 153034 74758 96620 105066 99304 160912 188505
12729 188505 125544 111234 142317 151856 144523 130985 110177 112077 39613 44350 74383 111947
$$ packed form
12810A19307j2646K3185n8817p1594K5729O3987K5964O2280K1762k8322n7405
12799A13430L3728j5324N2093O2962k654k5984j6398o0377n5523Q810M9086j055
12787A42794o6359j2550K7397O0442j0570m1064K0625m6323j6294O4453J6813
12776A39364j7221K3832M3267n2759K7666J5762l3779m6847J5236M1569K4935
12765A81025j6317p966m3507o7178K7033K4944Q0961k2732k0831n0840l8530L903
12753D9965O6865J7888m5968m9551K6744L8249K4864L0451K7347l8491l0597M7935
12741A65701L1788K9649K5772n6580k8583j4713p8276K1862Q446n762O1608K7593
12729A88505o2961j4310L1083R539p333j3538k0808J900p2464M737L0033L7564
$$ plain form
12717 111947 95492 119997 91619 52675 4740 -19293 8565 60683 105920 102867 102964 77936
12705 77936 95649 99382 42693 2816 -21311 -21604 22059 41037 70580 20301 -10541 32043
12693 32043 105647 133384 87357 87296 81882 57333 7717 35783 7911 70940 78404 85492 34133
12680 34133 7417 22337 72227 48214 48259 63732 82074 103325 130085 131087 95631 67349
12668 67349 89395 90951 112767 39261 -5532 60 -24944 6972 -8279 -27320 4442 45188
12656 45188 28695 27074 51327 51091 50929 55086 63786 131922 145686 129127 127258 101437 126171
12643 126171 189218 158450 106256 46078 72492 96506 -5269 -25779 30768 63817 38333
12632 38333 32725 91005 123365 116056 86790 -4365 -20123 60666 50973 18282 23813 51989
$$ packed form
12717A11947j6455K4505k8378l8944m7935k4033K7858N2118M5237l053R7k5028
12705G7936J7713L733n6689l9877k4127k93M3663J8978K9543n0279l0842M2584
12693C2043P3604K7737m6027o1n414k4549m9616K8066k7872O3029P464P088n1359
12680C4133k6716J4920M9890k4013M5J5473J8342K1251K6760J002l5456k8282
12668F7349K2046J556K1816p3506m4793N592k5004L1916j5251j9041L1762M0746
12656D5188j6493j621K4253k36j62M157Q700O8136J3764j6559j869k5821K4734
12643A26171O3047l0768n2194o0178K6414K4014j01775k0510N6547L3049k5484
12632C8333n608N8280L2360p309k9266r1155j5758Q0789r693l2691N531K8176
$$ plain form
12620 51989 52029 79412 86618 57973 80207 89112 27449 -17930 -51987 -20213 34056 51920 81761
12607 81761 109721 95985 112014 88118 61345 17637 6587 48977 79845 143919 190017 176677
12595 176677 120199 96468 97491 54808 30741 8391 31169 57916 28739 -22169 -36016 -36308
12583 -36308 -10898 86218 116964 131711 145854 146876 181338 217543 185960 125721 93999 122982
12571 122982 109876 133065 167291 175131 199097 240755 198599 125544 136694 78429 50121 97973
12559 97973 161742 146482 122601 113443 102380 105885 80742 49693 52117 72186 67135 81880
12547 81880 59146 80366 107722 111973 74720 56636 97321 120377 65321 -1778 219 16065
12535 16065 41503 85806 145016 115574 71804 58652 20603 13557 -26909 -39928 -57288 -88102
$$ packed form
12620E1989M0K7383P206k8645K2234Q905o1663m5379l4057L1774N4269J7864K9841
12607H1761K7960j3736J6029k3896k6773m3708j1050M2390L0868O4074M6098j3340
12595A76677n6478k3731J023m2683k4067k2350K2778K6747k9177n0908j3847k92
12583c6308K5410R7116L0746J4747J4143J022L4462L6205l1583o0239l1722K8983
12571A22982j3106K3189L4226P840K3966M1658m2156p3055J1150n8265k8308M7852
12559I7973O3769j5260k3881r158j1063L505k5143l1049K424K0069n051J4745
12547H1880k2734K1220K7356M251l7253j8084M0685K3056n5056o7099J997J5846
12535A6065K5438M4303N9210k9442m3770j3152l8049p046m0466j3019j7360l0814
$$ plain form
12523 -88102 -136515 -173140 -57091 25920 81711 50158 5815 -50409 -59702 -91448 -31410 40867
12511 40867 64279 75849 123010 79357 65382 55631 16376 14943 14987 -24986 11028 54416 37835
12498 37835 47655 44437 47339 110749 134140 94359 103910 116813 94030 146098 101709 14475
12486 14475 -5368 31211 48294 74572 90037 76772 64510 50791 86024 97916 71586 57157
12474 57157 59290 35663 -33338 -7207 -10092 -19556 -19959 25048 48791 35978 55061 69093 8376
12461 8376 28942 53280 65974 83085 34910 -5101 -30114 -66313 -14084 24611 9095 6349
12449 6349 25792 58324 69964 27908 21041 31943 41815 14866 20122 76427 96569 87898 64808
12436 64808 -25729 -32127 18127 50506 139418 177392 98232 80422 108334 69248 75661 59173
$$ packed form
12523h8102m8413l6625J16049Q3011N5791l1553m4343n6224r293l1746O0038P2277
12511D0867K3412J1570M7161m3653j3975r751l9255j433M4l9973L6014M3388j6581
12498C7835R820l218K902O3410K3391l9781R551J2903k2783N2068m4389q7234
12486A4475j9843L6579J7083K6278J5465j3265j2262j3719L5233J1892k6330j4429
12474E7157K133k3627o9001K6131k885r464m03M5007K3743j2813J9083J4032o0717
12461H376K0566K4338J2694J7111m8175m0011k5013l6199N2229L8695j5516k746
12449F349J9443L2532J1640m2056o867J0902R872k6949N256N6305K0142q671k3090
12436F4808r0537o398N0254L2379Q8912L7974p9160j7810K7912l9086O413j6488
$$ plain form
12424 59173 46848 58471 61046 63102 57052 14834 13414 -25598 -90722 -68937 -21797 -58893
12412 -58893 -62536 -67873 -80740 5278 42230 -1111 21550 33985 62614 41441 40368 69596
12400 69596 93976 113304 114897 34652 19707 69506 30127 43623 97250 104866 27028 -30697
12388 -30697 -11290 370 -4612 46756 87760 56142 37388 26382 42004 46887 60620 67054
12376 67054 30715 54767 16303 42000 83015 58424 56896 59235 90191 88342 43826 60793
12364 60793 32113 15873 37434 -4777 -33075 36251 46296 62961 108301 108025 54375 50578
12352 50578 64999 80400 47816 37747 33694 49328 29144 2289 45574 29065 47610 33416
12340 33416 31128 97459 86208 46018 43431 57937 72601 71363 67640 58296 62445 62526 78834
$$ packed form
12424E9173j2325J1623K575K056o050m2218j420l9012o5124K1785M7140l7096
12412e8893l643n337j2867Q6018L6952m3341K2661J2435K8629k1173j073K9228
12400F9596K4380J9328J593q0245j4945M9799l9379J3496N3627P616p7838n7725
12388c0697J9407J1660m982N1368M1004l1618j8754j1006J5622M883J3733O434
12376F7054l6339K4052l8464K5697M1015k4591j528K339L0956j849m4516J6967
12364F0793k8680j6240K1561m2211k8298O9326J0045J6665M5340k76n3650l797
12352E0578J4421J5401l2584j0069m053J5634k0184k6855M3285j6509J8545j4194
12340C3416k288O6331j1251m0190k587J4506J4664j238l723r344M149Q1J6308
$$ plain form
12327 78834 53970 66782 115767 143451 190148 126444 119465 141591 149697 102479 44028 32450
12315 32450 73233 76687 -2450 -17051 7434 8001 58248 52888 68389 71350 56430 50869 77584
12302 77584 -8993 -309 60995 81812 75554 36772 13813 71305 87852 35867 57940 68414
12290 68414 33552 64034 40847 49437 112404 76471 41667 -14854 -7968 64794 84646 109668
12278 109668 110460 92085 20304 21259 29627 22266 -16172 -14931 46285 94481 34892 -7002 -37578
12265 -37578 -41046 -41917 -62335 -21910 62537 41517 21173 -18404 -31480 -3900 90881 104775
12253 104775 83884 14007 -29567 15936 29233 5649 14003 -9548 6334 20829 50978 70284
12241 70284 129678 117318 64963 57969 108611 165834 184730 163531 71715 9459 -2933 48
$$ packed form
12327G8834k4864J2812M8985K7684M6697o3704o979K2126Q106m7218n8451j1578
12315C2450M0783L454p9137j4601K4485N67N0247n360J5501K961j4920n561K6715
12302G7584q6577Q684O1304K0817o258l8782k2959N7492J6547n1985K2073J0474
12290F8414l4862L0482k3187Q590O2967l5933l4804n6521O886P2762J9852K5022
12278A09668P92j8375p1781R55Q368p361l8438J241O1216M8196n9589m1894l0576
12265c7578l468q71k0418M0425Q4447k1020k0344l9577j3076K7580R4781J3894
12253A04775k0891o9877m3574M5503J3297k3584Q354k3551J5882J4495L0149J9306
12241G0284N9394j2360n2355o994N0642N7223J8896k1199r1816o2256j2392K981
$$ plain form
12229 48 -6981 21994 14835 50568 40186 9355 41389 68162 98967 108005 89551 92938 84149
12216 84149 44192 119365 136024 112071 102361 97506 94314 70587 107085 164877 131554 124870
12204 124870 151160 148275 138826 118479 171792 184810 179865 165841 141984 128740 144855 148704
12192 148704 97742 81332 99642 108224 133637 192460 198146 141720 139002 152817 156283 128712
12180 128712 145637 152191 132722 134214 123240 114622 160564 173497 192015 193178 147685 144584
12168 144584 106914 85246 87125 100424 142613 144651 187842 217536 177604 172323 171284 137408
12156 137408 33001 49423 145179 132883 141694 215097 207213 195457 194246 239151 255673 196311
12144 196311 134601 124872 137175 109563 76775 87647 74612 86682 116558 167648 155486 180910
$$ packed form
12229D8p029K8975p159L5733j0382l0831L2034K6773L0805R038j8454L387q789
12216H4149l9957P5173J6659k3953r710m855l192k3727L6498N7792l3323o684
12204A24870K6290k885r449k0347N3313J3018m945j4024k3857j3244J6115L849
12192A48704n0962j6410J8310Q582K5413N8823N686n6426k718J3815L466k7571
12180A28712J6925O554j9469J492j0974q618M5942J2933J8518J163m5493l101
12168A44584l7670k1668J879J3299M2189K038M3191K9694l9932n281j039l3876
12156A37408j04407J6422R5756j2296Q811P3403p884j1756j211M4905J6522n9362
12144A96311o1710r729J2303k7612l2788J0872j3035J2070K9876N1090j2162K5424
$$ plain form
12132 180910 205097 271224 327800 285452 285499 255125 217337 205536 227002 185787 174265 227932
12120 227932 250984 239396 218465 166872 102384 100105 221701 292132 332043 386210 343968
12109 343968 257243 210742 217392 217247 257407 265390 220959 242403 294451 272232 252862 216501
12097 216501 249594 289931 262448 239782 256420 268180 309015 298975 291692 301121 291283 334613
12085 334613 288227 255946 215428 260503 301556 340714 359790 301539 300923 329232 354967 349322
12073 349322 348852 358217 399709 387221 357808 385943 437075 360404 365859 348988 349020 402121 463367
12060 463367 522331 533530 528414 505293 492361 495763 505707 501268 461661 474864 551309 563372
12048 563372 533284 537426 509389 531374 590088 599570 617852 624873 603891 578672 558908 624521
$$ packed form
12132A80910K4187O6127N6576m2348M7l0374l7788j1801K1466m1215j1522N3667
12120B27932K3052j1588k0931n1593o4488k279J21596P0431L9911N4167m2242
12109C43968q6725m6501O650j45M0160P983m4431K1444N2048k2219j9370l6361
12097B16501L3093M0337k7483k2666J6638J1760M0835j0040p283R429r838M3330
12085C34613m6386l2281m0518M5075M1053L9158J9076n8251o16K8309K5735n645
12073C49322m70R365M1492j2488k9413K8135N1132p6671N455j6871L2N3101O1246
12060D63367N8964J1199n116k3121j2932L402R944m439l9607J3203P6445J2063
12048E63372l0088M142k8037K1985N8714R482J8282P021k0982k5219j9764O5613
$$ plain form
12036 624521 737392 799685 786170 755791 786358 780262 771605 774697 781630 699399 674844 693689
12024 693689 709008 785815 857915 874405 879505 877804 907469 969160 989039 996630 1003366 986479
12012 986479 1027485 1011830 1080930 1148953 1161725 1170720 1253915 1309202 1328643 1341978 1413373 1429550
12000 1429550 1446226 1441193 1511436 1595440 1626591 1689174 1775701 1830985 1885044 1884656 1922033 1985272
11988 1985272 2070563 2118492 2203911 2282983 2346416 2429830 2527694 2663195 2760732 2838189 2908353
11977 2908353 3002810 3154241 3285331 3436329 3619484 3778484 3913084 4079651 4240901 4449633
11967 4449633 4697816 4960369 5185427 5426166 5698923 5935176 6260055 6587967 6970413
11958 6970413 7393210 7813631 8206477 8676683 9229404 9792958 10356382 10935732 11552885
$$ packed form
12036F24521J12871O2293j3515l0379L0567o096q657L092O933q2231k4555J8845
12024F93689J5319P6807P2100J6490N100j701K9665O1691J9879P591O736j6887
12012I86479M1006j5655O9100O8023J2772Q995Q3195N5287J9441J3335P1395J6177
12000A429550J6676n033P0243Q4004L1151O2583Q6527N5284N4059l88L7377O3239
11988A985272Q5291M7929Q5419P9072O3433Q3414R7864J35501R7537P7457P0164
11977B908353R4457J51431J31090J50998J83155J59000J34600J66567J61250K08732
11967D449633K48183K62553K25058K40739K72757K36253L24879L27912L82446
11958F970413M22797M20421L92846M70206N52721N63554N63424N79350O17153
$$ plain form
11949 11552885 12266259 13050154 13768799 14557814 15361823 16205651 17131770 18077796 18936858
11940 18936858 19862025 20791653 21700480 22617519 23418368 24082156 24660417 25109893 25393402
11931 25393402 25637678 25733125 25649210 25428418 24935527 24364862 23708708 22917220 22096042 21202873
11921 21202873 20218826 19239375 18210383 17195214 16219819 15274425 14456101 13622965 12877511
11912 12877511 12074561 11306150 10616587 9942604 9367980 8871235 8363122 7900302 7406547
11903 7406547 6924615 6484519 6157105 5916019 5629350 5394084 5101704 4777318 4566109
11894 4566109 4414112 4231310 4010738 3795247 3678418 3518195 3348380 3246687 3154185 2962750
11884 2962750 2806470 2769783 2698614 2529144 2397746 2313448 2263838 2192480 2093628 2005079 1878219
$$ packed form
11949A1552885P13374P83895P18645P89015Q04009Q43828R26119R46026Q59062
11940A8936858R25167R29628R08827R17039Q00849O63788N78261M49476K83509
11931B5393402K44276R5447q3915k20792m92891n70665o56154p91488q21178q93169
11921B1202873r84047r79451j028992j015169r75395r45394q18324q33136p45454
11912A2877511q02950p68411o89563o73983n74624m96745n08113m62820m93755
11903G406547m81932m40096l27414k41086k86669k35266k92380l24386k11209
11894D566109j51997j82802k20572k15491j16829j60223j69815j01693r2502j91435
11884B962750j56280l6687p1169j69470j31398q4298m9610p1358r8852q8549j26860
$$ plain form
11873 1878219 1818359 1800711 1833813 1816717 1772221 1715054 1601053 1487401 1440956 1385065 1361010
11862 1361010 1333152 1298192 1271985 1215737 1119052 1062153 1114947 1099495 1002514 950790 917005
11851 917005 930542 962740 923244 851663 904318 887176 871661 855641 828463 790843 685469
11840 685469 635198 645224 636203 597204 591337 566425 574142 618492 623025 573552 562319 597551
11828 597551 609621 617909 635762 563894 540832 537206 523659 535794 528356 481995 489386 478966
11816 478966 457405 452143 487825 453243 405685 420088 400644 414462 394383 389572 383206 406155
11804 406155 392264 340881 290611 317874 378699 406124 396290 431075 401596 373532 385449 434913
11792 434913 449843 437130 384271 362058 365508 381415 365219 324529 269194 250593 256160 243924
$$ packed form
11873A878219n9860j7648L3102j7096m4496n7167j14001j13652m6445n5891k4055
11862A361010k7858l4960k6207n6248r6685n6899N2794j5452r6981n1724l3785
11851I17005J3537L2198l9496p1581N2655j7142j5515j6020k7178l7620j05374
11840F85469n0271J0026r021l8999n867k4912P717M4350M533m9473j1233L5232
11828E97551J2070Q288J7853p1868k3062l626j3547J2135p438m6361P391j0420
11816D78966k1561n262L5682l4582m7558J4403j9444J3818k0079m811o366K2949
11804D06155j3891n1383n0270K7263O0825K7425r834L4785k9479k8064J1917M9464
11792D34913J4930j2713n2859k2213L450J5907j6196m0690n5335j8601N567j2236
$$ plain form
11780 243924 259496 268802 235669 245230 261141 240472 209762 186300 156364 192099 227762 249163
11768 249163 235798 195414 178318 195479 155584 156102 166814 160540 138269 169337 181855 156753
11756 156753 144973 166794 149799 132182 153380 207336 161353 165175 193058 182175 165792 133670
11744 133670 137539 112193 110995 152704 129342 110404 125108 97426 102798 111589 96689 59564
11732 59564 3962 -4529 14076 14675 3034 53012 82941 126521 117320 166227 171003 138769 105758
11719 105758 72070 112229 105224 78686 83331 78108 125657 173638 120243 71313 85707 60671
11707 60671 37517 51983 46722 13261 -14750 -30580 21105 32965 73220 65231 40716 -3958
11695 -3958 12794 22028 -3870 -39034 -35672 -3349 -13190 16438 28920 28468 47937 65114 66766
$$ packed form
11780B43924J5572R306l3133R561J5911k0669l0710k3462k9936L5735L5663K1401
11768B49163j3365m0384j7096J7161l9895N18J0712o274k2271L1068J2518k5102
11756A56753j1780K1821j6995j7617K1198N3956m5983L822K7883j0883j6383l2122
11744A33670L869k5346j198M1709k3362j8938J4704k7682N372Q791j4900l7125
11732E9564n5602q491J8605N99j1641M9978K9929M3580r201M8907M776l2234l3011
11719A05758l3688M0159p005k6538M645n223M7549M7981n3395m8930J4394k5036
11707F0671k3154J4466n261l3461k8011j5830N1685J1860M0255p989k4515m4674
11695c958J6752R234k5898l5164L362L2323r841K9628J2482m52J9469J7177J652
$$ plain form
11682 66766 54740 95102 81007 18948 32513 96542 150906 162651 135776 79514 61109 106600
11670 106600 136715 107960 46371 26185 9334 70397 138776 154376 141586 109800 156713
11659 156713 177280 202061 190006 214545 220342 168774 151125 194590 205647 243389 180072 171978
11647 171978 201722 230526 188062 129768 85652 62911 72768 65148 51692 52325 74945 97441
11635 97441 113564 109533 99933 50728 40586 58975 89664 76087 25702 22362 25078 13366
11623 13366 21228 23396 16029 24515 -9794 -10011 8365 9542 -13493 -56191 -64223 -1373 5407
11610 5407 35103 32615 15417 42102 56775 71370 58388 33025 70620 109653 84213 63664
11598 63664 78496 121387 133039 68138 38897 25877 6751 -2150 -29007 -22153 -1607 62147
$$ packed form
11682F6766j2026M0362j4095o2059J3565O4029N4364J1745k6875n6262j8405M5491
11670A06600L0115k8755o1589k0186j6851O1063O8379J5600j2790l1786M6913
11659A56713K0567K4781j2055K4539N797n1568j7649M3465J1057L7742o3317q094
11647A71978K9744K8804m2464n8294m4116k2741R857p620j3456O33K2620K2496
11635I7441J6123m031r600m9205j0142J8389L0689j3577n0385l340K716j1712
11623A3366P862K168p367Q486l4309k17J8376J177k3035m2698q032O2850O780
11610E407K9696k488j7198K6685J4673J4595j2982k5363L7595L9033k5440k0549
11598F3664J4832M2891J1652o4901k9241j3020j9126q901k6857O854K0546O3754
$$ plain form
11586 62147 118150 132868 91568 69935 14310 34879 71442 72580 81199 54524 42852 -5430
11574 -5430 -39537 -26968 41937 77439 60670 -40619 -94458 -67893 -57258 -22096 19125 44982
11562 44982 22345 -35025 -32175 -21871 2225 58881 68129 61923 59164 -3736 19468 88011
11550 88011 17432 1410 -5584 -17748 -37569 -35524 12886 -4409 -66416 -80110 -113857 -55190
11538 -55190 40427 44717 -37178 -20496 44265 42405 47405 4285 -56210 -48730 7960 33609
11526 33609 30522 33427 18241 31108 38580 35089 62788 45443 67517 47149 49169 74621 97445
11513 97445 79421 46714 18316 1434 -40046 -31970 31431 15197 -23845 5928 49004 73903
11501 73903 47101 38027 -5819 -86525 -81663 -4681 40436 927 14304 -15106 -11024 6526
$$ packed form
11586F2147N6003J4718m1300k1633n5625K0569L6563J138Q619k6675j1672m8282
11574e430l4107J2569O8905L5502j6769j01289n3839K6565J0635L5162M1221K5857
11562D4982k2637n7370K850J0304K4096N6656R248o206k759o2900K3204O8543
11550H8011p0579j6022o994j2164j9821K045M8410j7295o2007j3694l3747N8667
11538e5190R5617M290q1895J6682O4761j860N000m3120o0495P480N6690K5649
11526C3609l087K905j5186J2867P472l491K7699j7345K2074k0368K020K5452K2824
11513I7445j8024l2707k8398j6882m1480Q076O3401j6234l9042K9773M3076K4899
11501G3903k6802r074m3846q0706M862P6982M5117l9509J3377k9410M082J7550
$$ plain form
11489 6526 2024 -16769 -51249 -51198 -48856 -48103 -61576 -30850 -45964 -61930 -94091 -69210 -51928
11476 -51928 -26212 -36169 -51218 -68610 -56256 -86723 -34136 35366 62662 53132 -47087 -55665
11464 -55665 2962 -9989 -52293 -12669 27693 18615 -9558 8497 27399 22130 27934 3414
11452 3414 4969 15445 -16522 -13510 18458 49144 62054 17336 7173 -17702 9235 9397 5598
11439 5598 20377 10545 -16051 377 9696 31124 6358 -2823 3125 45899 46938 3010 -24472
11426 -24472 -85789 -18842 55684 881 -62460 -98695 -116155 -72612 26438 30065 -44004 -20928
11414 -20928 9970 -35134 -50070 -3108 23627 7777 -18213 -67317 -42659 1556 27909 20769
11402 20769 63246 108552 114918 125185 166748 146669 97660 84942 80597 50074 18024 25366
$$ packed form
11489F526m502j8793l4480N1K342P53j3473L0726j5114j5966l2161K4881J7282
11476e1928K5716r957j5049j7392J2354l0467N2587O9502K7296r530j00219q578
11464e5665N8627j2951m2304L9624M0362r078k8173J8055J8902n269N804k4520
11452C414J555J0476l1967L012L1968L0686J2910m4718j0163k4875K6937J62l799
11439E598J4779r832k6596J6428R319K1428k4766r181N948M2774J039m3928k7482
11426b4472o1317O6947P4526n4803o3341l6235j7460M3543R9050L627p4069K3076
11414b0928L0898m5104j4936M6962K6735j5850k5990m9104K4658M4215K6353p140
11402B0769M2477M5306O366J0267M1563k0079m9009j2718m345l0523l2050P342
$$ plain form
11390 25366 -112 -29459 -3436 36787 45439 4498 -8722 4214 1741 -18476 -36870 -54749
11378 -54749 -64363 -82387 -130330 -63957 -42877 -36075 -38265 -47008 -6559 11972 33551 5376
11366 5376 5367 2393 7102 2124 21728 25894 4267 1289 37517 416 -58094 -92146 -76372 -88440
11352 -88440 -125010 -115580 -72724 -68361 -102401 -74651 -7840 -19711 -70910 -95170 -94392 -117846
11340 -117846 -144262 -152814 -155821 -164102 -92215 -72495 -93391 -109060 -79345 -76241 -73989 -51839
11328 -51839 -77478 -64889 -11506 18958 -13108 -70320 -77838 -40230 2868 -11942 -65270 -73992
11316 -73992 -76953 -61064 -16514 18227 21168 34601 18412 21858 56113 77451 36034 3989
11304 3989 -17964 4621 44063 47304 -95621 -93981 -47601 42135 12435 -59561 -53164 -22892
$$ packed form
11390B5366k5478k9347K6023M0223Q652m0941j3220J2936k473k0217j8394j7879
11378e4749r614j8024m7943O6373K1080O802k190q743M0449J8531K1579k8175
11366E376rk974M709m978J9604M166k1627k978L6228l7101n8510l4052J5774j2068
11352h8440l6570R430M2856M363l4040K7750O6811j1871n1199k4260P78k3454
11340a17846k6416q552l007q281P1887J9720k0896j5669K9715L104K252K2150
11328e1839k5639J2589N3383L0464l2066n7212p518L7608M3098j4810n3328q722
11316g3992k961J5889M4550L4741K941J3433j6189L446L4255K1338m1417l2045
11304C989k1953K2585L9442L241j42925J640M6380Q9736k9700p1996O397L0272
$$ plain form
11292 -22892 26203 9425 -23716 -25091 6318 -39920 -107657 -106216 -97898 -121910 -72531 -48673
11280 -48673 -8232 20454 -8222 -49232 -27989 6170 1858 12584 36380 13656 42167 26318
11268 26318 30062 2874 -31248 -69709 -5422 21920 39998 -7245 -54243 -3528 -226 -59725
11256 -59725 -67897 -53603 -66557 -50245 -21312 -51335 -72075 -93094 -108616 -115234 -69110 28962
11244 28962 30608 31523 39124 63658 39679 -35718 -52948 -28012 -32194 -105188 -122846 -57066 -6162
11231 -6162 -8263 -78643 -149121 -43191 16014 -8731 335 -28234 -64431 -43192 -78052 -60158
11219 -60158 -52096 -83940 -137809 -141193 -101322 -49647 -5229 42386 30362 36261 17064 -57077
11207 -57077 -57317 -17725 15437 9883 -29335 -46805 -84105 -97612 -102915 -67488 -85436 -59638
$$ packed form
11292b2892M9095j6778l3141j375L1409m6238o7737J441Q318k4012M9379K3858
11280d8673M0441K8686k8676m1010K1243L4159m312J0726K3796k2724K8511j5849
11268B6318L744k7188l4122l8461O4287K7342J8078m7243m6998N0715L302n9499
11256e9725q172J4294j2954J6312K8933l0023k0740k1019j5522o618M6124R8072
11244B8962J646R15P601K4534k3979p5397j7230K4936m182p2994j7658O5780N0904
11231f162k101p0380p0478J05930N9205k4745R066k8569l6197K1239l4860J7894
11219f0158Q062l1844n3869l384L9871N1675M4418M7615j2024N899j9197p4141
11207e7077k40L9592L3162n554l9218j7470l7300j3507n303L5427j7948K5798
$$ plain form
11195 -59638 -68904 -75766 -57229 -48895 -47992 -63790 -116183 -97877 -32669 -13956 -29983 14550 38102
11182 38102 -17295 101 19974 18703 63765 55083 58124 85059 -4699 -56940 -41778 -32231
11170 -32231 -35060 -27473 1606 -10394 -8105 7349 3266 53461 85058 -2860 -34635 -53527
11158 -53527 -49198 -38274 -29249 21454 39058 41694 16057 20194 30889 -5804 -31234 -8944
11146 -8944 10718 -8958 11178 -14098 63102 97878 133038 104220 55834 37309 14939 -23543
11134 -23543 -29588 -14033 -13535 -22146 23022 38951 12334 1055 -13448 -23167 -53490 -18458 -7695
11121 -7695 -30574 -8309 -39684 -20418 -12295 -33632 -23941 33263 64130 19570 -49861 -88379
11109 -88379 -53344 -37680 -95523 -106279 -28424 -4357 -18142 -26992 4928 -16222 -88016 -100757
$$ packed form
11195e9638r266o862J8537Q334R03j5798n2393J8306O5208J8713j6027M4533K3552
11182C8102n5397J7396J9873j271M5062q682L041K6935q9758n2241J5162R547
11170c2231k829P587K9079j2000K289J5454m083N0195L1597q7918l1775j8892
11158e3527M329J0924R025N0703J7604K636k5637M137J0695l6693k5430K2290
11146h944J9662j9676K0136k5276P7200L4776L5160k8818m8386j8525k2370l8482
11134b3543o045J5555M98q611M5168J5929k6617j1279j4503r719l0323L5032J0763
11121g695k2879K2265l1375J9266Q123k1337R691N7204L0867m4560o9431l8518
11109h8379L5035J5664n7843j0756P7855K4067j3785q850L1920k1150p1794j2741
$$ plain form
11097 -100757 -53543 -40898 -29069 -41545 -13403 7837 19364 53121 21024 -22251 -4383
11086 -4383 16717 31964 24964 681 -18718 -12368 -63553 -115187 -126591 -90094 -39284 -27005
11074 -27005 -46888 -10768 15440 -2089 4350 -4325 4763 -24502 -1807 -30292 -69470 -42878
11062 -42878 -24076 4967 -27335 951 27629 83332 64676 85343 72342 -13332 -5450 47321
11050 47321 82859 83877 114578 82464 33999 28588 20973 21372 84024 182808 174311 128553 127624
11037 127624 115353 118544 103645 128928 186585 175450 194271 248242 262495 271743 232560 228560
11025 228560 289879 289104 269188 246942 257141 292936 291278 321522 323787 345400 358574 330298
11013 330298 244712 195876 204927 212083 215015 184366 230527 253334 270130 236277 149575 111606
$$ packed form
11097a00757M7214J2645J1829j2476K8142K1240J1527L3757l2097m3275J7868
11086d383K1100J5247p000k4283j9399O350n1185n1634j1404L6497N0810J2279
11074b7005j9883L6120K6208j7529O439q675R088k9265K2695k8485l9178K6592
11062d2878J8802K9043l2302K8286K6678N5703j8656K0667j3001q5674P882N2771
11050D7321L5538J018L0701l2114m8465n411p615L99O2652R8784q497m5758r29
11037A27624j2271L191j4899K5283N7657j1135J8821N3971J4253R248l9183m000
11025B28560O1319p75j9916k2246J0199L5795j658L0244K265K1613J3174k8276
11013C30298q5586m8836R051P156K932l0649M6161K2807J6796l3853q6702l7969
$$ plain form
11001 111606 106204 86357 71503 122497 144353 118235 119154 92902 99802 57750 54489 50660 72539
10988 72539 44175 -13265 -51204 -68548 -46030 -30634 -34184 1063 36210 9561 24349 53929
10976 53929 70109 102059 51887 88121 53363 53105 79001 11515 -30377 -31767 -32177 -49835 -78653
10963 -78653 -62009 -60042 -65936 -61253 -45389 -52647 -49878 -55749 -28230 -33510 1294 3332 34599
10950 34599 86351 77747 36544 36203 38808 37685 47326 55714 46066 52553 71914 75302 2904 -33846
10936 -33846 -4729 23459 19920 32940 28438 -4563 -15252 215 59907 78012 1342 -30868
10924 -30868 -35990 -27033 -46999 -129878 -134668 -109222 -90408 -57615 -69307 -57231 -64425 -5449
10912 -5449 -29809 -106962 -123893 -129743 -122905 -85900 -89995 -79295 -144882 -96873 -46937 -28944
$$ packed form
11001A11606n402j9847j4854N0994K1856k6118R19k6252O900m2052l261l829K1879
10988G2539k8364n7440l7939j7344K2518J5396l550L5247L5147k6649J4788K9580
10976E3929J6180L1950n0172L6234l4758k58K5896o7486m1892j390m10j7658k8818
10963g8653J6644J967n894M683J5864p258K769n871K7519n280L4804K038L1267
10950C4599N1752q604m1203l41K605j123R641Q388r648O487J9361L388p2398l6750
10936c3846K9117K8188l539J3020m502l3001j0689J5467N9692J8105p6670l2210
10924c0868n122Q957j9966q2879m790K5446J8814L2793j1692J2076p194N8976
10912e449k4360p7153j6931n850O838L7005m095J0700o5587M8009M9936J7993
$$ plain form
10900 -28944 -31091 -52665 -119242 -146029 -86758 -40963 -23850 -32192 -4523 -27701 -43658 7859
10888 7859 39758 -30586 -44469 -15943 -5683 2848 9213 52834 40838 21449 2758 50679
10876 50679 81159 54701 30063 53676 43310 28714 7430 3953 -55977 -75335 -52885 -31705
10864 -31705 -27597 -57149 -27544 6508 40429 51255 14955 7961 56177 33936 37918 -16097
10852 -16097 -20190 45275 74787 103180 61702 47019 51786 36045 38198 -16950 -15402 14108
10840 14108 -3374 8052 3210 -9039 -32031 19053 12539 -15438 -23488 -11710 -8981 29439
10828 29439 47122 -15594 -6116 -35549 -17478 -24813 -58526 -11350 37321 64416 125865 77556
10816 77556 22914 -21174 -82869 -68627 -49713 -68815 -89192 -87912 -117741 -115966 -64285 -73797
$$ packed form
10900b8944k147k1574o6577k6787N9271M5795J7113q342K7669k3178j5957N1517
10888G859L1899p0344j3883K8526J0260Q531O365M3621j1996j9389j8691M7921
10876E0679L0480k6458k4638K3613j0366j4596k1284l477n9930j9358K2450K1180
10864c1705M108k9552K9605L4052L3921J0826l6300o994M8216k2241L982n4015
10852a6097m093O5465K9512K8393m1478j4683M767j5741K153n5148J548K9510
10840A4108j7482J1426m842j2249k2992N1084o514k7977q050J1778K729L8420
10828B9439J7683o2716R478k9433J8071p335l3713M7176M8671K7095O1449m8309
10816G7556n4642m4088o1695J4242J8914j9102k0377J280k9829J775N1681r512
$$ plain form
10804 -73797 -7520 51865 37678 15515 20289 18411 17491 60279 74508 54074 33869 70980
10792 70980 77182 51880 83796 55058 27069 2128 60467 61500 49442 46156 59550 123878
10780 123878 119175 74212 271 -74249 -66919 -23913 5358 -33438 -54557 -48971 -63869 -64690
10768 -64690 -67801 -55294 -12600 -5868 -2058 23228 43399 51541 75445 38392 96884 121574
10756 121574 125498 95713 83270 49217 32706 52712 27887 -20238 -66443 178 39365 54767
10744 54767 51434 52109 78728 76782 33663 12962 -17989 13724 21573 20913 44064 63201 66264
10731 66264 78701 92150 140706 107696 96037 101058 128999 169928 146779 122693 136260 158066
10719 158066 113255 86762 50447 84676 104266 172208 167473 135042 137285 205928 255405 202004
$$ packed form
10804g3797O6277N9385j4187k2163M774j878r20M2788J4229k0434k0205L7111
10792G0980O202k5302L1916k8738k7989k4941N8339J033j2058l286J3394O4328
10780A23878m703m4963p3941p4520P330M3006K9271l8796k1119N586j4898q21
10768f4690l111J2507M2694O732L810K5286K0171Q142K3904l7053N8492K4690
10756A21574L924k9785j2443l4053j6511K0006k4825m8125m6205O6621L9187J5402
10744E4767l333O75K6619j946m3119k0701l0951L1713P849o60K3151J9137L063
10731F6264J2437J3449M8556l3010j1659N021K7941M0929k3149k4086J3567K1806
10719A58066m4811k6493l6315L4229J9590O7942m735l2431K243O8643M9477n3401
$$ plain form
10707 202004 173546 161861 185844 233094 233928 202752 199188 257892 256610 243507 206286 226728
10695 226728 323736 297523 251364 191653 162192 145820 176540 275193 283704 253959 310228 312110
10683 312110 283862 305039 338738 328762 298221 300174 298221 303926 282695 279643 294080 291120 295688
10670 295688 309345 377505 385645 436082 516149 553961 620747 677467 686421 736953 814459 902488
10658 902488 1031586 1135735 1315251 1538980 1746154 1934702 2184655 2386907 2541240 2716184
10648 2716184 2889225 2980861 2936204 2804562 2683763 2516744 2348636 2133570 1950169 1806364
10638 1806364 1668929 1565126 1502188 1538500 1640963 1713768 1778421 1853659 2134888 2484824
10628 2484824 2824009 3130640 3496367 3942204 4429047 4945520 5581584 6420437 7346657
$$ packed form
10707B02004k8458j1685K3983M7250Q34l1176l564N8704j282j3103l7221K0442
10695B26728R7008k6213m6159n9711k9461j6372L0720R8653Q511k9745N6269J882
10683C12110k8248K1177L3699r976l0541J953j953N705k1231l052J4437k960M568
10670B95688J3657O8160Q140N0437Q0067L7812O6786N6720Q954N0532P7506Q8029
10658I02488J29098J04149J79516K23729K07174J88548K49953K02252J54333J74944
10648B716184J73041R1636m4657j31642j20799j67019j68108k15066j83401j43805
10638A806364j37435j03803o2938L6312J02463P2805O4653P5238K81229L49936
10628B484824L39185L06631L65727M45837M86843N16473O36064Q38853R26220
$$ plain form
10619 7346657 8533302 9998198 11782850 13878412 16246657 18775426 21133481 23229701
10611 23229701 25032553 26628782 27936119 28938327 29721256 30817683 32657004 35407219
10603 35407219 38971973 42809070 46179614 48792164 50797003 52190106 52696932 52251837
10595 52251837 51285303 50705258 51301221 53358233 56613098 60218699 62985421 64539533
10587 64539533 65098504 64609583 62693262 59202800 54800181 50663064 47865834 46631434
10579 46631434 46608452 47083614 47205234 46653213 45524294 43763758 41142545 37527425 33398307
10570 33398307 29614131 26723041 24859246 23719190 22887923 22013730 20992058 19710707
10562 19710707 18151609 16261537 14021722 11656817 9480464 7695810 6234410 5094382
$$ packed form
10619G346657J186645J464896J784652K095562K368245K528769K358055K096220
10611B3229701J802852J596229J307337J002208P82929J096427J839321K750215
10603C5407219L564754L837097L370544K612550K004839J393103N06826m45095
10595E2251837r66534n80045N95963K057012L254865L605601K766722J554112
10587F4539533N58971m88921j916321l490462m402619m137117k797230j234400
10579D6631434k2982M75162J21620n52021j128919j760536k621213l615120m129118
10570C3398307l784176k891090j863795j140056q31267q74193j021672j281351
10562A9710707j559098j890072k239815k364905k176353j784654j461400j140028
$$ plain form
10554 5094382 4226695 3598013 3082053 2753523 2489678 2236109 1999354 1789861 1623832
10545 1623832 1498761 1393999 1322715 1238878 1118072 1019824 978895 907728 830229 761375 754077
10534 754077 754242 684767 646848 601113 553298 528829 540068 540878 522736 510980 489955 462451
10522 462451 481908 497196 473594 487227 577340 587383 525079 498969 553869 553064 531540 521961
10510 521961 565974 586889 518203 461339 470590 510860 540829 519087 463195 480015 490371 491095
10498 491095 510832 510697 507972 499400 471768 479131 497689 489454 494846 514240 479649 474505 514965
10485 514965 498641 496052 575035 563664 546389 520641 485308 490150 529178 596223 570867 554743
10473 554743 532808 522932 485894 514781 561561 593245 573052 542450 485283 488859 556957 590055
$$ packed form
10554E094382q67687o28682n15960l28530k63845k53569k36755k09493j66029
10545A623832j25071j04762p1284q3837j20806r8248m0929p1167p7499o8854p298
10534G54077J65o9475l7919m5735m7815k4469J1239Q10j8142j1756k1025k7504
10522D62451J9457J5288k3602J3633R0113J0043o2304k6110N4900q05k1524r579
10510E21961M4013K0915o8686n6864R251M0270K9969k1742n5892J6820J0356P24
10498D91095J9737j35k725q572k7632P363J8558q235N392J9394l4591n144M0460
10485E14965j6324k589P8983j1371j7275k5748l5333M842L9028O7045k5356j6124
10473E54743k1935r876l7038K8887M6780L1684k0193l0602n7167L576O8098L3098
$$ plain form
10461 590055 553613 533740 499446 460187 449303 426439 480364 556040 574928 613772 527770
10450 527770 600508 635205 580886 530717 547866 626115 669885 717779 744897 801291 843676
10439 843676 813003 736211 654208 671357 723457 735508 750802 734462 715842 771812 829132
10428 829132 858930 941885 1025230 1047243 1063252 1055776 1052378 1056492 1129187 1196811 1253614 1269370
10416 1269370 1313017 1358300 1457779 1535592 1559626 1632642 1711656 1755080 1784310 1784395 1779522 1801753
10404 1801753 1793009 1803441 1851256 1886568 1840591 1795365 1797093 1869842 1912720 1913842 1902124 1981005
10392 1981005 2064632 2125067 2103755 2139244 2174254 2149361 2088171 2016138 1948844 1826567 1798614
10381 1798614 1777836 1691148 1652985 1634904 1565547 1437273 1365031 1327547 1322896 1403393 1396221
$$ packed form
10461E90055l6442j9873l4294l9259j0884k2864N3925P5676J8888L8844q6002
10450E27770P2738L4697n4319n0169J7149P8249M3770M7894K7118N6394M2385
10439H43676l0673p6792q2003J7149N2100J2051J5294j6340j8620N5970N7320
10428H29132K9798Q2955Q3345K2013J6009p476l398M114P2695O7624N6803J5756
10416A269370M3647M5283R9479P7813K4034P3016P9014M3424K9230Q5m873K2231
10404A801753q744J0432M7815L5312m5977m5226J728P2749M2878J122j1718P8881
10392A981005Q3627O0435k1312L5489L5010k4893o1190p2033o7294j22277k7953
10381A798614k0778q6688l8163j8081o9357j28274p2242l7484m651Q0497p172
$$ plain form
10370 1396221 1339451 1317411 1350551 1352237 1319858 1303209 1329810 1353269 1399977 1458649 1520573
10359 1520573 1549634 1536847 1510868 1551650 1562168 1542589 1547370 1528287 1520490 1521711 1471566 1445046
10347 1445046 1435488 1496140 1522606 1520945 1499888 1529095 1523373 1528254 1448575 1477373 1497564 1485831
10335 1485831 1476106 1448556 1456591 1430096 1470225 1523523 1520721 1546169 1494785 1526212 1569653 1552431
10323 1552431 1558716 1547026 1524400 1460733 1504264 1622736 1685937 1735986 1782803 1800164 1814689
10312 1814689 1896370 1990899 2099573 2227195 2275940 2320446 2435973 2542077 2656853 2740800
10302 2740800 2835604 2935528 3079583 3203745 3351042 3495103 3622790 3728549 3838900 4020169
10292 4020169 4174534 4359846 4556012 4773750 5030912 5346841 5725482 6143154 6605605
$$ packed form
10370A396221n6770k2040L3140J686l2379j6649K6601K3459M6708N8672O1924
10359A520573K9061j2787k5979M0782J0518j9579M781j9083p797J221n0145k6520
10347A445046r558O0652K6466j661k1057K9207n722M881p9679K8798K0191j1733
10335A485831r725k7550Q035k6495M0129N3298k802K5448n1384L1427M3441j7222
10323A552431O285j1690k2626o3667M3531J18472O3201N0049M6817J7361J4525
10312A814689Q1681R4529J08674J27622M8745M4506J15527J06104J14776Q3947
10302B740800R4804R9924J44055J24162J47297J44061J27687J05759J10351J81269
10292D020169J54365J85312J96166K17738K57162L15929L78641M17672M62451
$$ plain form
10283 6605605 7074060 7594944 8224995 8957029 9855828 10922974 12123326 13434345 14991066
10274 14991066 16915142 19308713 22099822 25375249 29295063 33822513 38936331 44746221
10266 44746221 51349907 58920362 67660789 77802936 89352794 102388346 117016854
10259 117016854 134172622 155249365 181795882 214847088 253786882 295696764 336242437
10252 336242437 372359183 403500221 430442512 451916200 463227205 459930729 441927601
10245 441927601 413756129 380473104 343969083 303224488 258061507 211556680 168507489
10238 168507489 132579310 104759602 84018972 68627009 57184456 48427540 41633408
10231 41633408 36361091 32160668 28753863 25947515 23589449 21578081 19808337 18222586
$$ packed form
10283F605605M68455N20884O30051P32034Q98799J067146J200352J311019J556721
10274A4991066J924076K393571K791109L275427L919814M527450N113818N809890
10266D4746221O603686P570455Q740427J0142147J1549858J3035552J4628508
10259A17016854J7155768K1076743K6546517L3051206L8939794M1909882M0545673
10252C36242437L6116746L1141038K6942291K1473688J1311005l296476j8003128
10245D41927601k8171472l3283025l6504021m0744595m5162981m6504827m3049191
10238A68507489l5928179k7819708k0740630j5391963j1442553q756916o794132
10231D1633408n272317m200423l406805k806348k358066k011368j769744j585751
$$ plain form
10223 18222586 16813279 15576052 14449957 13441784 12550525 11684034 10926540 10237765 9554817
10214 9554817 9007702 8536491 8089982 7650308 7183620 6719569 6253103 5868630 5491253
10205 5491253 5073896 4780648 4553198 4327542 4125556 3917168 3705397 3562610 3407896
10196 3407896 3353151 3273807 3157471 3067273 2998734 2977401 3016520 3004094 2932214 2837123 2867280
10185 2867280 2860811 2687780 2604242 2527439 2468560 2393992 2383352 2407894 2417892 2364661 2292825
10174 2292825 2268776 2306042 2298848 2262621 2256431 2228641 2248216 2212773 2201778 2212267 2182578 2155237
10162 2155237 2140873 2059032 2008456 1951039 1850084 1857367 1897633 1862250 1796174 1745140 1756553
10151 1756553 1739347 1688281 1687232 1677998 1654441 1638474 1595967 1602836 1661132 1701980 1684565 1679329
$$ packed form
10223A8222586j409307j237227j126095j008173q91259q66491p57494o88775o82948
10214I554817n47115m71211m46509m39674m66688m64051m66466l84473l77377
10205E491253m17357k93248k27450k25656k01986k08388k11771j42787j54714
10196C407896n4745p9344j16336r0198o8539k1333L9119j2426p1880r5091L0157
10185B867280o469j73031q3538p6803n8879p4568j0640K4542R998n3231p1836
10174B292825k4049L7266p194l6227o190k7790J9575l5443j0995J0489k9689k7341
10162B155237j4364q1841n0576n7417j00955P283M0266l5383o6076n1034J1413
10151A756553j7206n1066j049r234k3557j5967m2507O869N8296M0848j7415n236
$$ plain form
10139 1679329 1628129 1541101 1456695 1439589 1422136 1396511 1373654 1364122 1332670 1272900 1239169
10128 1239169 1278638 1356966 1324747 1336170 1314038 1314730 1359455 1286866 1233710 1232892 1206956 1155063
10116 1155063 1072734 1050009 1085392 1097370 1093692 1109967 1126840 1106948 1138943 1123524 1078801
10105 1078801 1130908 1128058 1088656 986800 963186 952068 925506 870892 813267 784915 779343
10094 779343 828701 860054 823157 818636 763867 743175 740324 777078 756864 753397 743359 673834
10082 673834 636211 589984 616327 628856 563818 492971 474530 424119 443111 487235 515379
10071 515379 488633 467713 423663 414780 426784 453678 438773 450300 454921 442820 436776 465771
10059 465771 475900 409155 362416 300929 325208 327535 298440 261838 288820 319403 273257 292470
$$ packed form
10139A679329n1200q7028q4406j7106j7453k5625k2857r532l1452n9770l3731
10128A239169L9469P8328l2219J1423k2132O92M4725p2589n3156q18k5936n1893
10116A155063q2329k2725L5383J1978l678J6275J6873j9892L1995j5419m4723
10105A078801N2107k850l9402j01856k3614j1118k6562n4614n7625k8352n572
10094G79343M9358L1353l6897m521n4769k0692k851L6754k0214l467j0038o9525
10082F73834l7623m6227K6343J2529o5038p0847j8441n0411J8992M4124K8144
10071E15379k6746k0920m4050q883J2004K6894j4905J1527M621j2101o044K8995
10059D65771J0129o6745m6739o1487K4279K327k9095l6602K6982L0583m6146J9213
$$ plain form
10047 292470 335976 341037 362459 380387 412856 401395 401015 378811 392185 336452 323528 344474
10035 344474 396888 411897 458315 418105 416469 344223 318368 362345 415103 420982 405906 383980
10023 383980 342860 345037 362729 348357 376545 351746 304903 306215 348361 371156 350232 331044
10011 331044 328825 400990 410415 275690 246479 267685 281472 304090 351705 332151 364023 342939
9999 342939 336494 397281 389868 333595 333048 312383 283828 259790 204304 197661 226606 266958 322480
9986 322480 334085 338812 319692 302476 347126 379593 355510 282007 242429 188462 183996 231983
9974 231983 293995 349973 373082 399605 370518 321817 312560 349284 353197 356234 336084 273365
9962 273365 183304 179860 230297 255544 201089 194686 209228 276453 309720 275352 237402 153086
$$ packed form
10047B92470M3506N061K1422J7928L2469j1461l80k2204J3374n5733j2924K0946
10035C44474N2414J5009M6418m0210j636p2246k5855M3977N2758N879j5076k1926
10023C83980m1120K177J7692j4372K8188k4799m6843J312M2146K2795k0924j9188
10011C31044k219P2165R425j34725k9211K1206J3787K2618M7615j9554L1872k1084
9999C42939o445O0787p413n6273n47k0665k8555k4038n5486o643K8945M0352N5522
9986C22480J1605M727j9120j7216M4650L2467k4083p3503l9578n3967m466M7987
9974B31983O2012N5978K3109K6523k9087m8701r257L6724L913L037k0150o2719
9962B73365r0061l444N0437K5247n4455o403J4542O7225L3267l4368l7950q4316
$$ plain form
9950 153086 72162 143792 168053 160142 120071 184759 245682 268851 298113 307509 298733 251217
9938 251217 238680 317423 420332 451753 533655 644421 747945 801602 805958 847752 919681
9927 919681 958610 934940 758269 613782 553917 557805 577974 611529 582834 494949 445783
9916 445783 414500 379404 353014 381173 349680 337229 278990 290192 327929 354175 362421 330510
9904 330510 285206 271088 292782 287595 254419 186528 191642 146546 172273 264185 331623 312776
9892 312776 280134 302893 369071 336336 371078 376167 330545 300726 285017 299983 245795 219491
9880 219491 216441 240915 223574 199112 166173 202467 220880 211302 230569 259963 268551 303941
9868 303941 309218 361581 417730 435074 411179 401992 450395 471805 513722 563871 599859 680863
$$ packed form
9950A53086q0924P1630K4261p911m0071O4688O0923K3169K9262R396q776m7516
9938B51217j2537P8743J02909L1421Q1902J10766J03524N3657M356M1794P1929
9927I19681L8929k3670j76671j44487n9865L888K0169L3555k8695q7885m9166
9916D45783l1283l5096k6390K8159l1493j2451n8239J1202L7737K6246Q246l1911
9904C30510m5304j4118K1694n187l3176o7891N114m5096K5727R1912O7438j8847
9892C12776l2642K2759O6178l2735L4742N089m5622k9819j5709J4966n4188k6304
9880B19491l050K4474j7341k4462l2939L6294J8413r578J9267K9394Q588L5390
9868C03941N277N2363N6149J7344k3895r187M8403K1410M1917N0149L5988Q1004
$$ plain form
9856 680863 800204 883368 986236 1127232 1237054 1413372 1591087 1744551 1990307 2185979
9846 2185979 2376838 2491421 2574594 2618286 2532455 2404699 2282279 2110261 1902245 1698525
9836 1698525 1450879 1212247 1018212 869708 738017 639431 598447 514257 432149 401891
9826 401891 341514 254431 283959 367922 344421 256357 232705 227089 233885 191722 174765 208591
9814 208591 187803 183397 159221 150588 116598 148515 127852 112515 123793 168231 185634 206516
9802 206516 203261 192523 166092 130980 154735 184552 125769 128902 168749 166174 183923 240756
9790 240756 256576 242345 212723 201601 231008 204547 167897 141478 136115 143852 134252 141886
9778 141886 173063 162291 167454 163315 125355 119673 126317 116952 98952 146376 143940 134792 186806
$$ packed form
9856F80863J19341Q3164J02868J40996J09822J76318J77715J53464K45756J95672
9846B185979J90859J14583Q3173M3692q5831j27756j22420j72018k08016k03720
9836A698525k47646k38632j94035j48504j31691r8586m0984q4190q2108l0258
9826D01891o0377q7083K9528Q3963k3501q8064k3652n616O796m2163j6957L3826
9814B08591k0788m406k4176q633l3990L1917k0663j5337J1278M4438J7403K0882
9802B06516l255j0738k6431l5112K3755K9817n8783L133L9847k575J7749N6833
9790B40756J5820j4231k9622j1122K9407k6461l6650k6419n363P737r600P634
9778A41886L1177j0772N163m139l7960n682O644r365j8000M7424k436r148N2014
$$ plain form
9765 186806 194712 172844 186476 228312 216116 200498 243037 225364 173324 117926 98035 169004
9753 169004 191909 167306 131608 86770 68647 101925 157295 204879 253980 239323 172024 184714
9741 184714 188078 184673 134208 90592 121844 181968 176051 123189 107562 140494 209999 205377
9729 205377 195906 179381 148025 125975 181712 211631 158040 140191 176718 208810 268385 257148
9717 257148 216216 246775 268998 267649 250055 189154 154283 133577 153055 180929 217755 301290
9705 301290 319583 298869 270972 302045 366938 379374 339259 349067 378678 354981 351218 471538
9693 471538 554758 623527 688178 688246 765416 867127 879849 950523 1021902 1047740 1104229 1122486
9681 1122486 1106219 1135926 1072133 963080 851115 785511 787411 730781 647286 592078 508221
$$ packed form
9765A86806P906k1868J3632M1836j2196j5618M2539j7673n2040n5398j9891P0969
9753A69004K2905k4603l5698m4838j8123L3278N5370M7584M9101j4657o7299J2690
9741A84714L364l405n0465m3616L1252O0124n917n2862j5627L2932O9505m622
9729B05377r471j6525l1356k2050N5737K9919n3591j7849L6527L2092N9575j1237
9717B57148m0932L0559K2223j349j7594o0901l4871k0706J9478K7874L6826Q3535
9705C01290J8293k0714k7897L1073O4893J2436m0115R808K9611k3697l763J20320
9693D71538Q3220O8769O4651O8P7170J01711J2722P0674P1379K5838N6489J8257
9681A122486j6267K9707o3793j09053j11965o5604J900n6630q3495n5208q3857
$$ plain form
9670 508221 460970 400746 390021 352263 324750 328352 314963 269475 253938 248887 247753 316686
9658 316686 346097 315396 259607 208881 224094 298066 279294 179806 174640 185152 179968 138160
9646 138160 114749 166348 235226 242687 218249 197147 158738 151669 147742 161826 144993 105966
9634 105966 51627 27097 60074 88096 63247 83179 122913 124190 152119 158745 61803 4350
9622 4350 19911 17899 70577 120184 163346 123364 64655 90989 57230 64842 74962 60183
9610 60183 81628 125413 134704 136255 174161 174845 180265 185185 165141 166126 185936 164274 111270
9597 111270 50644 50567 28094 65409 87591 75174 122476 158306 172548 130769 95205 96141 120934
9584 120934 167126 171339 136439 133645 172550 139273 106482 77851 74088 83559 141519 119540
$$ packed form
9670E08221m7251o0224j0725l7758k7513L602j3389m5488j5537n051j134O8933
9658C16686K9411l0701n5789n0726J5213P3972j8772r9488n166J0512n184m1808
9646A38160k3411N1599O8878P461k4438k1102l8409p069l927J4084j6833l9027
9634A05966n4339k4530L2977K8022k4849J9932L9734J277K7929O626r6942n7453
9622D350J5561k012N2678M9607M3162l9982n8709K6334l3759P612J0120j4779
9610F0183K1445M3785R291J551L7906O84N420M920k0044R85J9810k1662n3004
9597A11270o0626p7k2473L7315K2182j2417M7302L5830J4242m1779l5564R36K4793
9584A20934M6192M213l4900k794L8905l3277l2791k8631l763R471N7960k1979
$$ plain form
9572 119540 88616 62035 68060 114350 119271 84715 52029 39146 49769 92719 88304 100912
9560 100912 133753 133253 128726 192889 226439 190069 149829 63645 -15784 7545 31292 40589
9548 40589 69613 70396 144856 176094 77140 53487 68355 69490 113017 97864 49657 26949
9536 26949 36274 61517 47271 8367 -5421 9131 68857 94096 94735 123029 124646 90438 87404
9523 87404 97948 78277 99937 62000 52065 85259 84411 66797 17509 31964 143064 197337
9511 197337 208244 153399 57562 29516 50276 20449 17951 65271 109895 81726 62558 18909
9499 18909 88633 170708 190016 151911 186475 200971 184599 178684 125170 54572 62370 76111
9487 76111 89130 53021 31698 78479 54536 27387 48238 23663 669 -7577 30141 57720
$$ packed form
9572A19540l0924k6581O025M6290M921l4556l2686j2883J0623M2950m415J2608
9560A00912L2841n00m527O4163L3550l6370m0240q6184p9429K3329K3747R297
9548D0589K9024P83P4460L1238r8954k3653J4868J135M3527j5153m8207k2708
9536B6949R325K5243j4246l8904j3788J4552N9726K5239O39K8294J617l4208l034
9523H7404J0544j9671K1660l7937r935L3194q48j7614m9288J4455J11100N4273
9511A97337J0907n4845r5837k8046K0760k9827k498M7320M4624k8169j9168m3649
9499A8909O9724Q2075J9308l8105L4564J4496j6372n915n3514p0598P798J3741
9487G6111J3019l6109k1323M6781k3943k7149K0851k4575k2994q246L7718K7579
$$ plain form
9475 57720 63575 28874 -870 14347 39314 63246 62057 -36821 -39232 8199 25870 12206
9463 12206 36122 44821 68563 20793 22623 -29023 23554 61513 91992 64941 25720 35710
9451 35710 42742 50745 46083 56286 75752 49943 29823 39196 39712 5209 19260 73916 90840
9438 90840 60932 35626 -9090 -13976 17931 41953 34486 18363 57668 73905 75437 44243
9426 44243 -12280 -41605 42726 142120 136633 144734 136711 72297 46046 39486 47347 71794 33246
9413 33246 -4660 -22759 -32351 -87917 -18274 87550 105678 65142 70781 110925 169728 167776
9401 167776 184587 170409 188119 160858 137933 55253 46300 76937 45687 77741 60361 -9679
9389 -9679 -22397 5694 38260 54694 96950 24370 46644 79553 17806 35970 53786 74994
$$ packed form
9475E7720N855l4701k9744J5217K4967K3932j189r8878k411M7431J7671j3664
9463A2206K3916Q699K3742m7770J830n1646N2577L7959L0479k7051l9221R990
9451C5710P032Q003m662J0203J9466k5809k0120R373N16l4503J4051N4656J6924
9438I0840k9908k5306m4716m886L1907K4022p467j6123L9305J6237J532l1194
9426D4243n6523k9325Q4331R9394n487Q101q023o4414k6251o560P861K4447l8548
9413C3246l7906j8099r592n5566O9643J05824J8128m0536N639M0144N8803j952
9401A67776J6811j4178J7710k7261k2925q2680q953L0637l1250L2054j7380p0040
9389i679j2718K8091L2566J6434M2256p2580K2274L2909o1747J8164J7816K1208
$$ plain form
9377 74994 84085 53675 59139 102183 99868 8910 13664 54077 99585 91314 39106 49236 79566
9364 79566 69166 8058 3673 -6850 49228 109915 79600 68868 53841 61249 95111 82067
9352 82067 50461 -16459 11483 52095 100907 107686 99305 81135 58994 44348 38756 55924
9340 55924 62052 90935 88929 38234 18454 45081 101851 48658 27650 84656 95068 48862
9328 48862 36269 40293 17307 14475 61479 81919 89946 73815 50174 62237 14173 2917
9316 2917 -4699 75284 78843 19649 -10680 9143 28529 39022 43140 59583 56131 46073 35714
9303 35714 30722 -12270 -1439 9182 29234 78618 142461 142326 89822 66204 38703 65145
9291 65145 115277 140087 150798 159537 155716 230571 286447 258150 234840 196498 218711 238885
$$ packed form
9377G4994R091l0410N464M3044k315r0958M754M0413M5508q271n2208J0130L0330
9364G9566j0400o1108m385j0523N6078O0687l0315j0732j5027P408L3862j3044
9352H2067l1606o6920K7942M0612M8812O779q381j8170k2141j4646n592J7168
9340E5924O128K8883k006n0695j9780K6627N6770n3193k1008N7006J0412m6206
9328D8862j2593M024k2986k832M7004K0440Q027j6131k3641J2063m8064j1256
9316B917p616P9983L559n9194l0329J9823J9386J0493M118J6443l452j0058j0359
9303C5714m992m2992J0831J0621K0052M9384O3843j35n2504k3618k7501K6442
9291F5145N0132K4810J0711Q739l821P4855N5876k8297k3310l8342K2213K0174
$$ plain form
9279 238885 229094 230373 209318 171307 99896 151326 199151 160944 113490 99899 77031 29360
9267 29360 -8163 47165 78172 101462 97873 118595 137203 153049 167418 153200 134510 89938
9255 89938 52 -48966 20855 110435 103552 112068 116620 51975 52263 72302 19271 58961 39831
9242 39831 -13805 -11817 29598 14207 31147 34178 6860 36336 78867 83627 73824 64812 101314
9229 101314 61262 33237 -14277 -5966 28146 11218 -14163 -13688 4829 36338 65057 98766
9217 98766 79510 80467 48727 8081 5777 57640 88822 81591 122142 159538 132218 77374 91709
9204 91709 48679 -4574 14268 59068 22541 6867 11650 -19760 -52050 -27607 -6497 -23256
9192 -23256 -21291 -1152 29142 51670 -53833 -137115 -73064 21158 67387 85586 40249 -28106
$$ packed form
9279B38885r791J279k1055l8011p1411N1430M7825l8207m7454j3591k2868m7671
9267B9360l7523N5328L1007K3290l589K0722J8608J5846J4369j4218j8690m4572
9255H9938q9886m9018O9821Q9580o883Q516M552o4645K88K0039n3031L9690j9130
9242C9831n3636J988M1415j5391J6940L031k7318K9476M2531M760r803r012L6502
9229A01314m0052k8025m7514Q311L4112j6928k5381M75J8517L1509K8719L3709
9217I8766j9256R57l1740m0646k304N1863L1182p231M0551L7396k7320n4844J4335
9204I1709m3030n3253J8842M4800l6527j5674M783l1410l2290K4443K1110j6759
9192b3256J965K0139L0294K2528j05503q3282O4051R4222M6229J8199m5337o8355
$$ plain form
9180 -28106 -31325 -12524 -37486 22195 69875 76297 60473 105371 94884 111804 144123 117746
9168 117746 43829 1367 15065 37377 30936 67873 95316 93932 61562 7099 36188 61680
9156 61680 80998 100993 109628 15303 -14804 -84503 -82561 -36776 -11767 26368 5652 -44942
9144 -44942 -46171 279 56258 98160 88440 40691 19675 23666 68124 96355 70084 33276
9132 33276 -28747 -58678 -14658 36976 53770 2356 27331 10618 15405 -49159 2990 59343
9120 59343 34129 -25277 -19729 -9139 -45752 -44658 -69137 -104461 -72790 -68706 -18553 -34066
9108 -34066 -68247 -82755 -16029 -18113 -49160 -38341 17359 60365 38760 41573 16463 2459
9096 2459 1287 15143 46705 85981 83638 54152 26350 -9727 -46545 -58593 -65053 -12404 51462
$$ packed form
9180b8106l219J8801k4962N9681M7680O422j5824M4898j0487J6920L2319k6377
9168A17746p3917m2462J3698K2312o441L6937K7443j384l2370n4463K9089K5492
9156F1680J9318J9995Q635r4325l0107o9699J942M5785K5009L8135k0716n0594
9144d4942j229M6450N5979M1902r720m7749k1016L991M4458K8231k6271l6808
9132C3276o2023k9931M4020N1634J6794n1414K4975j6713M787o4564N2149N6353
9120E9343k5214n9406N548J0590l6613J094k4479l5324L1671M084N0153j5513
9108c4066l4181j4508O6726k084l1047J0819N5700M3006k1605K813k5110j4004
9096B459j172J3856L1562L9276k343k9486k7802l6077l6818j2048o460N2649O3866
$$ plain form
9083 51462 60812 46448 58434 76498 68431 74139 33839 59388 34145 4948 5343 21094 14243
9070 14243 -13956 4003 -59649 -31646 7916 49018 10981 -27983 636 34689 28615 -49252
9058 -49252 -77085 -27443 -26848 -9573 7271 9639 48134 40500 11809 56582 37853 -37530 -55290
9045 -55290 -38421 -62875 -63076 -64804 -45654 -7352 52855 54497 37566 18970 32467 76544 142785
9032 142785 53919 -7201 -64291 -52893 24137 41190 19179 18898 29694 26989 16042 -11609
9020 -11609 -43414 -67806 -54713 -15128 -18994 13696 35357 -13580 -48250 9003 24460 -37446
9008 -37446 -38278 -24266 13297 48219 51151 18735 -9317 -5536 42007 86275 79700 53442 52192
8995 52192 8303 -17890 -7211 4156 -4115 -2737 44032 38222 19619 14609 -21478 -45125 -17626
$$ packed form
9083E1462R350j4364J1986J8064q067N708m0300K5549k5243k9197L95J5751o851
9070A4243k8199J7959o3652K8003L9562M1102l8037l8964K8619L4053o074p7867
9058d9252k7833M9642N95J7275J6844K368L8495p634k8691M4773j8729p5383j7760
9045e5290J6869k4454k01j728J9150L8302O0207J642j6931j8596J3497M4077O6241
9032A42785q8866o1120n7090J1398P7030J7053k2011k81J0796k705j0947k7651
9020a1609l1805k4392J3093L9585l866L2690K1661m8937l4670N7253J5457o1906
9008c7446q32J4012L7563L4922K932l2416k8052L781M7543M4268o575k6258j250
8995E2192m3889k6193J0679J1367q271J378M6769n810j8603n010l6087k3647K7499
$$ plain form
8982 -17626 -45982 -42330 -36224 -34772 2202 -41917 -29949 -2848 -34511 -83744 -38726 -37365 -2060
8969 -2060 5976 14728 40434 44084 -672 -1613 -18187 -13133 -11316 -26401 -17073 -17886 -50709 -55644
8955 -55644 -32832 -33805 -41377 27905 46837 17280 29013 -28092 -62880 -41631 -35074 -3229 29461
8942 29461 17432 55293 86519 40687 49308 39389 86649 147150 125632 110992 95857 76897
8930 76897 36879 -1200 42128 94952 78392 26295 24560 49007 23342 -56216 -51138 -32735
8918 -32735 -12514 19711 37698 19179 -698 15408 50018 112028 52929 10937 40664 37445
8906 37445 60287 35287 -5708 6173 -40701 -61082 2855 52234 75847 46560 9951 88329
8894 88329 110454 83779 78123 9272 -9055 -2812 55309 25545 -1191 5379 -162 344 21367
$$ packed form
8982a7626k8356L652O106J452L6974m4119J1968K7101l1663m9233M5018J361L5305
8969b060Q036Q752K5706L650m4756r41j6574N054J817j5085R328q13l2823m935
8955e5644K2812r73p572O9282J8932k9557J1733n7105l4788K1249O557L1845L2690
8942B9461j2029L7861L1226m5832Q621r919M7260O0501k1518j4640j5135j8960
8930G6897m0018l8079M3328N2824j6560n2097j735K4447k5665p9558N078J8403
8918c2735K0221L2225J7987j8519j9877J6106L4610O2010n9099m1992K9727l219
8906C7445K2842k5000m0995J1881m6874k0381O3937M9379K3613k9287l6609P8378
8894H8329K2125k6675n656o8851j8327O243N8121k9764k6736O570n541N06K1023
$$ plain form
8881 21367 -6807 -7862 44561 79164 72064 84948 72381 96613 61989 -27365 2355 -28424
8869 -28424 32813 106155 120436 138871 102845 97333 6956 -3518 -13990 -34749 -62267 -66422
8857 -66422 -658 69290 127985 74334 22300 4278 -2489 -19837 -25184 -24826 -50165 -43372 -55641
8844 -55641 10599 24115 -16447 -8771 14128 43105 73586 118851 83873 -42145 -76272 -34203
8832 -34203 17217 43986 8182 5318 58812 78475 8503 -22018 -44070 -94581 -111046 -91538
8820 -91538 -59724 -25834 9241 -509 -14611 11051 6684 25201 17094 -35426 -25549 -16535 13099
8807 13099 -6550 -9935 12399 12882 71803 83519 40916 34895 24105 30028 21372 46148 104616
8794 104616 104019 104216 120896 140634 93742 67762 39142 46747 69231 54776 35989 16952 32794
$$ packed form
8881B1367k8174j055N2423L4603p100J2884j2567K4232l4624q9354K9720l0779
8869b8424O1237P3342J4281J8435l6026n512r0377j0474j0472k0759k7518m155
8857f6422O5764O9948N8695n3651n2034j8022o767j7348n347L58k5339O793j2269
8844e5641O6240J3516m0562P676K2899K8977L0481M5265l4978j26018l4127M2069
8832c4203N1420K6769l5804k864N3494J9663o9972l0521k2052n0511j6465J9508
8820i1538L1814L3890L5075r750j4102K5662m367J8517q107n2520R877R014K9634
8807A3099j9649l385K2334M83N8921J1716m2603o021j0790N923q656K4776N8468
8794A04616n97J97J6680J9738m6892k5980k8620P605K2484j4455j8787j9037J5842
$$ plain form
8781 32794 13363 31686 10980 -31384 -36341 -8190 -9460 11814 17835 37615 34687 1133 -27978
8768 -27978 29931 44015 56173 94961 71888 -60153 -38322 20233 51169 55885 72112 88684
8756 88684 108795 132443 97519 58204 42793 8491 8179 11029 42458 33278 24085 67334 77673
8743 77673 59613 43646 55264 18246 42271 33140 -13280 -19622 -15010 -27095 22571 59671
8731 59671 60005 106431 114463 101075 48448 5092 -3839 1196 -1562 9872 24329 13159 -18322
8718 -18322 5030 31516 22272 7746 22430 76411 75018 13817 40661 97223 101809 59597
8706 59597 41050 11755 51655 60776 34943 42059 -6140 -22400 25198 -3413 1204 -7560 28440
8693 28440 -1877 49437 51940 62721 122981 134284 118577 78868 -254 11370 9956 18722
$$ packed form
8781C2794j9431J8323k0706m2364m957K8151j270K1274O021J9780k928l3554k9111
8768b7978N7909J4084J2158L8788k3073j32041K1831N8555L0936M716J6227J6572
8756H8684K0111K3648l4924l9315j5411l4302l12K850L1429r180r193M3249J0339
8743G7673j8060j5967J1618l7018K4025r131m6420o342M612j2085M9666L7100
8731E9671L34M6426Q032j3388n2627m3356q931N035k758J1434J4457j1170l1481
8718a8322K3352K6486r244j4526J4684N3981j393o1201K6844N6562M586m2212
8706E9597j8547k9295L9900R121k5833P116m8199j6260M7598k8611M617q764L6000
8693B8440l0317N1314K503J0781O0260J1303j5707l9709p9122J1624j414Q766
$$ plain form
8681 18722 -34375 -16307 27264 -54034 -97872 -125791 -59480 13673 54925 39675 27284 2030
8669 2030 7933 43066 52019 72113 113560 132404 171428 130372 79015 78845 107964 82782 93788
8656 93788 109756 90088 112908 65708 44298 14051 7226 57307 -16127 -2798 -1891 -25322
8644 -25322 57566 37803 -19397 -22763 37693 85413 124371 131890 43875 43156 79293 57860 38148
8631 38148 57142 62224 21129 45281 -3080 -61153 -15579 -18775 -43580 -87167 -66408 -263
8619 -263 50186 63604 35915 41045 77459 93047 100051 122190 128974 103324 94547 117144 128895
8606 128895 168733 223625 202747 153803 122257 114515 70952 65438 29227 61223 147662 175217
8594 175217 194993 179302 135380 158369 169835 184658 194763 181636 178448 160859 204310 212621
$$ packed form
8681A8722n3097J8068M3571q1298m3838k7919O6311P3153M1252j5250j2391k5254
8669B030N903L5133Q953K0094M1447J8844L9024m1056n1357j70K9119k5182J1006
8656I3788J5968j9668K2820m7200k1410l0247o825N0081p3434J3329R07k3431
8644b5322Q2888j9763n7200l366O0456M7720L8958P519q8015p19L6137k1433j9712
8631C8148J8994N082m1095K4152m8361n8073M5574l196k4805m3587K0759O6145
8619b63N0449J3418k7689N130L6414J5588P004K2139O784k5650q777K2597J1751
8606A28895L9838N4892k0878m8944l1546p742m3563n514l6211L1996Q6439K7555
8594A75217J9776j5691m3922K2989J1466J4823J0105j3127l188j7589M3451Q311
$$ plain form
8582 212621 228239 211265 184460 150673 114918 121695 100374 67322 31806 50391 42339 63895
8570 63895 75931 40113 16435 16282 39424 20138 14595 -12541 -57266 -66448 -67857 -63078 -54647
8557 -54647 -28544 -7822 -26670 -16839 1687 25597 24310 27627 48848 88434 89847 73582 34896
8544 34896 8855 -1530 8893 -3101 -22064 -64758 -56410 -37875 -27948 11637 70050 78090
8532 78090 36340 31775 42942 10465 -28189 -48460 -2895 -8042 2226 58208 63166 40788
8520 40788 -8389 -21869 -64104 -47465 5705 10024 -7823 21777 49386 7229 20826 40933
8508 40933 -2206 -1504 74927 41836 49792 95133 97887 60594 76993 71038 75166 21974 -14986
8495 -14986 -31344 -21835 -23628 -16670 -5577 24552 69326 -6410 -34408 -48746 -44885 -12320 -55823
$$ packed form
8582B12621J5618j6974k6805l3787l5755O777k1321l3052l5516J8585q052K1556
8570F3895J2036l5818k3678j53K3142j9286n543k7136m4725r182j409M779Q431
8557e4647K6103K0722j8848R831J8526K3910j287L317K1221L9586J413j6265l8686
8544C4896k6041j0385J0423j1994j8963m2694Q348J8535R927L9585N8413Q040
8532G8090m1750m565J1167l2477l8654k0271M5565n147J0268N5982M958k2378
8520D0788m9177j3480m2235J6639N3170M319j7847K9600K7609m2157J3597K0107
8508D0933m3139P02P6431l3091P956M5341K754l7293J6399n955M128n3192l6960
8495a4986j6358R509j793O958J1093L0129M4774p5736k7998j4338L861L2565m3503
$$ plain form
8482 -55823 -91660 -108187 -77814 -32225 -34815 -110888 -139733 -129470 -81727 -49986 -20439 18847
8470 18847 39575 3552 25274 67741 72969 82914 30063 31915 -17706 -16866 -26353 -19988 -72658
8457 -72658 -72064 -15943 41330 57603 102953 88470 65633 99369 105124 99432 123069 104523 96874
8444 96874 69374 109511 119610 111305 155723 162457 160474 118266 47280 3551 30522 72114
8432 72114 64259 53880 57251 72347 76635 91578 73634 26749 71633 77741 33657 7932 72212
8419 72212 132656 81754 75121 121952 61417 -1419 25441 63688 97743 80776 91823 75488
8407 75488 1652 -26376 18703 30479 -6273 -55728 -76888 -38145 -55377 -52000 -63037 -53260
8395 -53260 -9741 13959 -7871 8382 30980 -19206 -34058 -15120 11530 42707 58302 43521
$$ packed form
8482e5823l5837j6527L0373M5589k590p6073k8845J0263M7743L1741K9547L9286
8470A8847K0728l6023K1722M2467N228R945n2851J852m9621Q40r487O365n2670
8457g2658N94N6121N7273J6273M5350j4483k2837L3736N755n692K3637j8546p649
8444I6874k7500M0137J0099q305M4418O734j983m2208p0986m3729K6971M1592
8432G2114p855j0379L371J5096M288J4943j7944m6885M4884O108m4084k5725O4280
8419G2212O0444n0902o633M6831o0535o2836K6860L8247L4055j6967J1047j6335
8407G5488p3836k8028M5079J1776l6752m9455k1160L8743j7232L377j1037R777
8395e3260M3519K3700k1830J6253K2598n0186j4852J8938K6650L1177J5595j4781
$$ plain form
8383 43521 33207 184 -4731 3638 29118 44701 32546 20193 6192 -7581 6123 -36976
8371 -36976 -19586 25213 21164 33462 72042 -11403 -54317 -30160 -56481 -46976 -57450 -47159
8359 -47159 -2631 35800 60058 65904 91333 97766 12761 6313 94598 125326 105812 67165
8347 67165 36559 -35339 -23212 11450 5513 -26296 -54979 -76372 -55507 18836 -16644 -35364
8335 -35364 -50199 -87689 -61211 27599 25021 55074 66843 62367 80141 56893 63171 26631
8323 26631 -14283 11566 -2445 28055 36843 10418 -7703 19258 4172 -4391 -32821 -3762
8311 -3762 -2145 -37742 -88339 -83999 -56503 -23060 701 91877 122060 90453 42651 -7179
8299 -7179 -8390 58620 7151 -25989 14362 38613 19714 713 -50526 -87786 -32034 43085
$$ packed form
8383D3521j0314l3023m915Q369K5480J5583j2155j2353j4001j3773J3704m3099
8371c6976J7390M4799m049J2298L8580q3445m2914K4157k6321R505j0474J0291
8359d7159M4528L8431K4258N846K5429O433q5005o448Q8285L0728j9514l8647
8347F7165l0606p1898J2127L4662n937l1809k8683k1393K0865P4343l5480j8720
8335c5364j4835l7490K6478Q8810k578L0053J1769m476J7774k3248O278l6540
8323B6631m0914K5849j4011L0500Q788k6425j8121K6961j5086q563k8430K9059
8311c762J617l5597n0597M340K7496L3443K3761R1176L0183l1607m7802m9830
8299g179j211O7010n1469l3140M0351K4251j8899j9001n1239l7260N5752P5119
$$ plain form
8287 43085 68027 77531 50870 -24522 -67541 -94250 -19926 48586 60242 50692 3659 -27240
8275 -27240 -2654 25618 9937 -15460 -32633 -41070 -7778 13275 -21692 -47889 -33075 -40956
8263 -40956 -35227 12280 14375 31156 44874 51576 31609 51358 52410 11684 -31199 -7560 -35090
8250 -35090 13033 -20256 27142 84093 74660 14951 28579 5203 -42470 -36669 13601 -19166
8238 -19166 -11496 -53802 -111041 -114852 -63122 -82384 -46307 -28259 -2885 -34338 -57502 -27120
8226 -27120 17446 39680 32482 23890 20645 31721 -11392 -78337 -20993 50773 46269 13568 17178
8213 17178 -3158 -26478 -63118 -26756 8284 39587 64254 66158 47227 -17792 -46151 -13177
8201 -13177 17984 34377 16842 29162 70502 86370 103462 100967 124888 98287 33962 615
$$ packed form
8287D3085K4942R504k6661p5392m3019k6709P4324O8512J1656r550m7033l0899
8275b7240K4586K8272j5681k5397j7173q437L3292K1053l4967k6197J4814p881
8263d0956N729M7507K095J6781J3718O702j9967J9749J052m0726m2883K3639k7530
8250c5090M8123l3289M7398N6951r433n9709J3628k3376m7673N801N0270l2767
8238a9166P670m2306n7239l811N1730j9262L6077J8048K5374l1453k3164L0382
8226b7120M4566K2234p198q592l245J1076m3113o6945N7344P1766m504l2701L610
8213A7178k0336k3320l6640L6362L5040L1303K4667J904j8931o5019k8359L2974
8201a3177L1161J6393j7535J2320M1340J5868J7092k495K3921k6601o4325l3347
$$ plain form
8189 615 -45585 -107954 -85145 -31338 25415 31718 -4384 11000 -7652 -60889 -58345 -95794 -36708
8176 -36708 34139 45270 -4247 -41262 -70899 -85055 -47391 28753 55293 20278 -26856 -45402
8164 -45402 -57551 11176 17846 -13856 -31979 -46510 -43880 -163 21875 -22154 13793 30079
8152 30079 -17469 -30634 -38185 18985 42360 8285 -28459 -8593 14306 12345 29848 57157
8140 57157 68796 35881 43555 -1747 -39310 -12588 9424 43083 8891 9760 -28088 -22112 -4113
8127 -4113 24745 43856 14822 -36818 -42069 -47700 -21521 -4793 -3645 -21174 852 -1910 6521
8114 6521 63607 74557 39565 41625 63957 73636 15441 22262 15613 18870 32560 56443 52951
8101 52951 33451 -37611 -48819 21956 43242 27477 -6038 8441 7971 -30180 -51562 -57851
$$ packed form
8189F15m6200o2369K2809N3807N6753O303l6102J5384j8652n3237K544l7449N9086
8176c6708P0847J1131m9517l7015k9637j4156L7664P6144K6540l5015m7134j8546
8164d5402j2149O8727O670l1702j8123j4531K630M3717K2038m4029L5947J6286
8152C0079m7548j3165p551N7170K3375l4075l6744J9866K2899j961J7503K7309
8140E7157J1639l2915P674m5302l7563K6722K2012L3659l4192Q69l7848N976J7999
8127d113K8858J9111k9034n1640n251n631K6179J6728J148j7529K2026k762Q431
8114F521N7086J0950l4992K060K2332R679n8195O821o649L257J3690K3883l492
8101E2951j9500p1062j1208P0775K1286j5765l3515J4479m70l8151k1382o289
$$ plain form
8089 -57851 -38625 -42241 -14796 -15128 -21091 -20373 35986 30704 -11079 -17914 -37442 -30687 -27487 -11765
8075 -11765 32763 39565 35242 21036 21377 9992 -15316 18039 5944 -11565 26654 55354 77111
8062 77111 99487 35015 13275 20098 14211 -19955 17198 -6448 -9767 -6030 -51628 -18595 7751
8049 7751 37865 86288 95619 124434 115459 64453 17115 -15286 -26192 -55959 -82963 -81101 -40267
8036 -40267 -20589 -35067 -31251 -23838 -31222 -27931 -44612 -55919 -89632 -39577 -15455 292 -11834
8023 -11834 -42254 -72278 -53797 -65215 -83280 -52999 -74253 -77236 -58543 -28524 27403 38364
8011 38364 87822 53657 16209 -9547 13689 -7895 -20714 -31233 -27032 6242 83731 48363
7999 48363 -13354 -61295 -31004 3016 -6023 -59894 -63141 -59312 -32962 -25601 13689 21736 -12494
$$ packed form
8089e7851J9226l616K7445l32n963P18N6359n282m1783o835j9528O755L200J5722
8075a1765M4528O802m323j4206L41j1385k5308L3355j2095j7509L8219K8700K1757
8062G7111K2376o4472k1740O823n887l4166L7153k3646l319L737m5598L3033K6346
8049G751L0114M8423R331K8815q975n1006m7338l2401j0906k9767k7004J862M0834
8036d0267J9678j4478L816P413p384L291j6681j1307l3713N0055K4122J5747j2126
8023a1834l0420l0024J8481j1418j8065L0281k1254k983J8693L0019N5927J0961
8011C8364M9458l4165l7448k5756K3236k1584j2819j0519M201L3274P7489l5368
7999D8363o1717m7941L0291L4020r039n3871l247L829K6350P361L9290Q047l4230
$$ plain form
7986 -12494 -46791 -82740 -57182 -9045 34813 35742 -4428 -22796 -63006 -31159 29660 135
7974 135 -4995 4178 19296 1704 -7729 -12902 51784 15930 20036 125360 149351 99186 16040
7961 16040 -2488 12121 38362 7452 24699 -27939 17941 22637 7123 26171 5566 66820
7949 66820 125068 97586 53895 53174 1902 -16289 -20918 27105 56454 15762 9535 65060 67074
7936 67074 -8498 -10112 76912 103965 32192 12887 26764 32842 -32548 -31422 6007 72260
7924 72260 92575 17260 -66316 -57555 -69615 -12466 -27322 -29566 -76307 -58529 -7506 37774
7912 37774 50730 47168 56376 39634 6057 2661 -15550 -40563 15355 -837 -42936 4392
7900 4392 41541 21003 -11006 -60771 -44450 9608 34614 -13067 -55677 -88785 -35698 32197
$$ packed form
7986a2494l4297l5949K5558M8137M3858R29m0170j8368m0210L1847O0819k9525
7974A35n130R173J5118j7592r433n173O4686l5854M106J05324K3991n0165q3146
7961A6040j8528J4609K6241l0910J7247n2638M5880M696j5514J9048k0605O1254
7949F6820N8248k7482m3691p21n1272j8191m629M8023K9349m0692o227N5525K014
7936F7074p5572j614Q7024K7053p1773j9305J3877O078o5390J126L7429O6253
7924G2260K0315p5315q3576Q761j2060N7149j4856k244m6741J7778N1023M5280
7912C7774J2956l562R208j6742l3577l396j8211k5013N5918j6192m2099M7328
7900D392L7149k0538l2009m9765J6321N4058K5006m7681m2610l3108N3087O7895
$$ plain form
7888 32197 18049 32883 -14034 12272 24340 -19864 -30630 -14431 14636 6898 -9938 -12638
7876 -12638 -24349 -21104 -37305 -60306 -38091 -17370 -30930 -26610 46566 37032 13251 8927 18353
7863 18353 -5677 -64517 -39891 35141 56191 70796 83506 74005 53666 56318 78782 95320
7851 95320 123570 120907 63818 7344 11332 48715 23588 73000 81635 68941 43991 13315
7839 13315 -36629 -95667 -114488 -95173 25215 35234 7780 -24088 1808 4548 39497 33727
7827 33727 67048 31719 -24644 -10939 -18080 -64742 -52079 9886 39161 91229 64507 22518
7815 22518 16061 -17182 -53139 -46121 -76381 -57942 -44498 3223 -6363 -13879 -10077 -65014 -58122
7802 -58122 -40487 -72600 -92754 -69740 -109463 -134552 -133158 -149125 -166453 -113514 -106168 -116843
$$ packed form
7888C2197j4148J4834m6917K6306J2068m4204j0766J6199K9067p738j6836k700
7876a2638j1711L245j6201k3001K2215K0721j3560M320P3176r534k3781m324R426
7863A8353k4030n8840K4626P5032K1050J4605J2710r501k0339K652K2464J6538
7851I5320K8250k663n7089n6474L988L7383k5127M9412Q635j2694k4950l0676
7839A3315m9944n9038j8821J9315J20388J0019k7454l1868K5896K740L4949n770
7827C3727L3321l5329n6363J3705p141m6662J2663O1965K9275N2068k6722m1989
7815B2518o457l3243l5957P018l0260J8439J3444M7721r586p516L802n4937O892
7802e8122J7635l2113k0154K3014l9723k5089J394j5967j7328N2939P346j0675
$$ plain form
7790 -116843 -114760 -103366 -58632 24323 39904 1404 -28750 -37148 -42121 -65467 -36146 -79269
7778 -79269 -88410 -39034 -40746 -1581 -1425 29868 29638 38445 36035 3289 13198 5172 34146 9037
7764 9037 -31209 -49629 -41961 -50430 -74701 -85013 -46580 -18788 8796 -8781 -6772 -7760 -31962
7751 -31962 -57536 -16603 -26908 -13000 -32283 22126 80809 74056 -11299 -33936 14225 -55054
7739 -55054 -143198 -152732 -153921 -106854 -68556 -35288 -31492 -18370 13330 29198 19255 29727 -3556
7726 -3556 -21774 -42172 -49284 -8973 -22234 -24496 15474 52833 50904 15697 -13239 -106477 -86972
7713 -86972 -24215 -13196 -9384 18815 25066 38222 34501 13206 2584 -23223 -25448 65489 95669
7700 95669 69176 67682 32780 53800 21537 5046 52678 100527 44957 -34045 -27903 -49759
$$ packed form
7790a16843K083J1394M4734Q2955J5581l8500l0154q398m973k3346K9321m3123
7778g9269r141M9376j712L9165J56L1293k30Q807k410l2746R909q026K8974k5109
7764I037m0246j8420P668q469k4271j0312L8433K7792K7584j7577K009r88k4202
7751c1962k5574M0933j0305J3908j9283N4409N8683o753q5355k2637M8161o9279
7739e5054q8144r534j189M7067L8298L3268L796J3122L1700J5868r943J0472l3283
7726c556j8218k0398p112M0311j3261k262L9970L7359j929l5207k8936r3238J9505
7713h6972O2757J1019L812K8199O251J3156l721k1295j0622k5807k225R0937L0180
7700I5669k6493j494l4902K1020l2263j6491M7632M7849n5570p9002O142k1856
$$ plain form
7688 -49759 -43252 -90538 -129227 -136127 -111243 -157849 -187684 -89273 -23116 -12983 -20775 -34137
7676 -34137 -19815 -32612 -41922 -37654 -6495 -39152 -83523 -156223 -162015 -104864 -102956 -93408 -75962
7663 -75962 -79313 -46207 7649 -21486 -23067 22796 18990 2348 35962 -4508 -26434 -30284 -1123
7650 -1123 -27733 -23423 -65493 5226 48160 36554 -24330 -83671 -56219 -76951 -63292 -28453
7638 -28453 -11709 8013 -11015 -50805 -46027 -42777 -35590 -51661 -67037 -61495 -64732 -67245 -44823
7625 -44823 -58937 -143415 -89211 8538 24385 27140 37200 -10827 -27433 -22029 -29702 -29454 -50705
7612 -50705 -42667 6261 -26093 -67245 -55490 -41946 17019 19096 -37287 -78664 -109567 -31744
7600 -31744 10837 8760 -9691 -28118 -20879 -37576 -22623 -62841 -52261 -90684 -100987 -80336
$$ packed form
7688d9759O507m7286l8689o900K4884m6606k9835R8411O6157J0133p792j3362
7676c4137J4322j2797r310M268L1159l2657m4371p2700n792N7151J908R548J7446
7663g5962l351L3106N3856k9135j581M5863l806j6642L3614m0470k1926l850K9161
7650a123k6610M310m2070P0719M2934j1606o0884n9341K7452k0732J3659L4839
7638b8453J6744J9722j9028l9790M778L250P187j6071j5376N542l237k513K2422
7625d4823j4114q4478N4204R7749J5847K755J0060m8027j6606N404p673K48k1251
7612e0705Q038M8928l2354m1152J1755J3544N8965K077n6383m1377l0903P7823
7600c1744M2581k077j8451j8427P239j6697J4953m0218J0580l8423j0303K0651
$$ plain form
7588 -80336 -47799 -16887 -18430 -5074 -56364 -29266 7164 12274 -7535 -14934 -67039 -63571 -46796
7575 -46796 -69571 -107018 -89907 -52291 -82018 -152132 -133248 -138309 -95746 -23122 -7928 20556
7563 20556 -23731 -25448 -27064 -15457 -514 31473 79260 71901 -29211 -69983 -40503 -35406
7551 -35406 -45925 -133272 -57091 11045 -5380 -84190 -121332 -55825 22130 55325 32144 -21888
7539 -21888 -54150 -72848 -50927 -49652 -17741 -42341 -33760 -68904 -36229 35394 70834 32137
7527 32137 -54013 -46258 -47885 -109199 -111024 -62158 -66415 -82457 -69848 -66779 -27884 -10626 -2209
7514 -2209 -7234 13106 50552 12180 -38485 -87385 -43927 -6338 -19814 -31575 -84295 -115878
7502 -115878 -109164 -84806 4665 56912 27143 -28850 -5900 -15765 -33160 -35108 -79864 -51650
$$ packed form
7588h0336L2537L0912j543J3356n1290K7098L6430N110j9809p399n2105L468J6775
7575d6796k2775l7447J7111L7616k9727p0114J8884n061M2563P2624J5194K8484
7563B0556m4287j717j616J1607J4943L1987M7787p359j01112m0772K9480N097
7551c5406j0519q7347P6181O8136j6425p8810l7142O5507P7955L3195k3181n4032
7539b1888l2262j8698K1921J275L1911k4600Q581l5144L2675P1623L5440l8697
7527C2137q6150P755j627o1314j825M8866m257j6042J2609L069L8895J7258Q417
7514b209n025K0340L7446l8372n0665m8900M3458L7589j3476j1761n2720l1583
7502a15878O714K4358Q9471N2247k9769n5993K2950r865j7395j948m4756K8214
$$ plain form
7490 -51650 -18399 -82271 -83696 -26867 -59549 -120687 -105577 -49239 -63077 -35455 22198 -3488
7478 -3488 -26572 -13155 -7371 -27329 -18775 -19763 -2067 2647 18663 -37422 -51632 -9372 2239
7465 2239 13255 -35676 -96988 -151024 -111511 -18067 9384 328 76010 87898 39997 24981
7453 24981 -22786 -61005 -35641 17684 32101 -637 -8210 -23386 19858 -7732 -34479 -48058
7441 -48058 -64474 -74972 -58209 -63347 -56127 -43400 -80044 -25173 -26802 27865 52151 -1903
7429 -1903 -72295 -62476 -28661 -24826 -56670 -31913 -25528 -12729 -63726 -109138 -112550 -78373 -98735
7416 -98735 -100252 -65394 -52292 -103102 -80626 -50781 -39190 -12898 -4901 17408 -31707 -38464
7404 -38464 -34029 -16123 14168 -410 24097 -15046 -76526 -41331 -72243 -114115 -81393 -17978
$$ packed form
7490e1650L3251o3872j425N6829l2682o1138J5110N6338j3838K7622N7653k5686
7478c488k3084J3417N784j9958Q554r88J7696M714J6016n6085j4210M2260J1611
7465B239J1016m8931o1312n4036L9513R3444K7451r056P5682J1888m7901j5016
7453B4981m7767l8219K5364N3325J4417l2738p573j5176M3244k7590k6747j3579
7441d8058j6416j0498J6763n138P220J2727l6644N4871j629N4667K4286n4054
7429a903p0392R819L3815L835l1844K4757O385J2799n0997m5412l412L4177k0362
7416i8735j517L4858J3102n0810K2476K9845J1591K6292P997K2309m9115o757
7404c8464M435J7906L0291j4578K4507l9143o1480L5195l0912m1872L2722O3415
$$ plain form
7392 -17978 10984 3410 -11516 -5333 -36080 -99458 -76280 -64677 -121899 -55673 -53135 -72356
7380 -72356 -131193 -114139 -24104 13886 -46233 -92180 -98300 -101684 -86962 -118846 -123749 -102013
7368 -102013 -88540 -43366 28786 3482 35182 59554 84690 130623 118811 85938 44153 22554
7356 22554 -61493 -89519 -43722 52671 65726 30046 -2842 -5043 14546 33734 47853 -4772
7344 -4772 -44063 -40522 -61240 -75536 -65332 -24904 21896 56591 45524 17735 -26310 977
7332 977 35538 24356 12964 6941 -30101 -46105 -36271 -35571 -48603 -48144 -37406 -4661 381 -36175
7318 -36175 -44598 -21954 -34636 -29782 2161 3044 -47691 -66110 -89910 -92937 -95697 -55035 -59132
7305 -59132 -46257 10293 46564 35129 -16363 -15058 -27180 -52151 -72285 -78039 -42149 -21490
$$ packed form
7392a7978K8962p574j4926O183l0747o3378K3178J1603n7222O6226K538j9221
7380g2356n8837J7054R0035L7990o0119m5947o120l384J4722l1884m903K1736
7368a02013J3473M5174P2152k5304L1700K4372K5136M5933j1812l2873m1785k1599
7356B2554q4047k8026M5797R6393J3055l5680l2888k201J9589J9188J4119n2625
7344d772l9291L541k0718j4296J0204M0428M6800L4695j1067k7789m4045K7287
7332I77L4561j1182j1392o023l7042j6004R834P00j3032M59J0738L2745N042l6556
7318c6175q423K2644j2682M854L1943Q83n0735j8419k3800l027k760M0662m097
7305e9132J2875N6550L6271j1435n1492J305j2122k4971k0134n754L5890K0659
$$ plain form
7293 -21490 -10984 2610 14182 9696 3187 -43924 -39825 -59208 -89751 -54396 -29740 38748
7281 38748 94339 59383 18367 6549 -23338 -74402 -85794 -92027 -49233 -9075 52791 104375
7269 104375 68900 62037 -2328 -67175 -63722 -25011 2090 32842 37427 56637 61456 48097
7257 48097 -50435 -59792 -21291 23652 -4228 9733 29997 38085 -2731 -35729 -28151 -47301
7245 -47301 -11295 -15782 -30722 -55142 -70614 -67303 -62248 -15408 -4289 -26281 -36540 23029
7233 23029 74109 91135 57140 49855 49520 110015 145860 114258 73011 -20594 -15367 2805 -23179
7220 -23179 -35508 -26028 7319 -14224 -11209 -9575 -8533 -11409 -1468 -11931 -337 8920 -66955
7207 -66955 -32815 168 17897 -4967 -9652 -45215 -32085 -18571 -18382 24795 809 -60040
$$ packed form
7293b1490J0506J3594J1572m486o509m7111M099j9383l0543L5355K4656O8488
7281C8748N5591l4956m1016j1818k9887n1064j1392o233M2794M0158O1866N1584
7269A04375l5475o863o4365o4847L453L8711K7101L0752M585J9210M819j3359
7257D8097r8532r357L8501M4943k7880J3961K0264Q088m0816l2998P578j9150
7245d7301L6006m487j4940k4420j5472L311N055M6840J1119k1992j0259N9569
7233B3029N1080J7026l3995p285l35O0495L5845l1602m1247r3605N227J8172k5984
7220b3179j2329R480L3347k1543L015J634J042k876R941j0463J1594R257p5875
7207f6955L4140L2983J7729k2864m685l5563J3130J3514J89M3177k3986o0849
$$ plain form
7195 -60040 -71540 -90216 -87414 -93934 -76962 -17552 6894 -536 -16386 -96093 -145659 -89857
7183 -89857 -58721 -50917 -54721 -94817 -93894 -49432 -17717 43580 39514 6404 -9088 -44185 9937
7170 9937 97107 102221 53454 31050 27751 19940 69982 50885 58228 -20211 -46180 -62426 -75947
7157 -75947 -5873 7663 -25531 -25608 -2945 -32011 -82656 -62307 -55870 -20824 16929 21710 49001
7144 49001 45887 47176 34942 57465 32577 26431 51546 7833 -22505 -83264 -89797 -129363 -152122
7131 -152122 -120475 -88262 -46347 22245 27635 4699 11025 31383 -1958 -17569 -5995 -45935
7119 -45935 -95789 -76399 -87932 -49686 33465 29842 -26223 -30515 -51284 -49846 -57229 -81074 -60953
7106 -60953 -64268 -26024 55154 49163 34312 31784 3930 -39504 -32922 -18741 -21329 -6799 53006
$$ packed form
7195f0040j1500j8676K802o520J6972N9410K4446p430j5850p9707m9566N5802
7183h9857L1136P804l804m0096R23M4462L1715O1297m066l3110j5492l5097N4122
7170I937Q7170N114m8767k2404l299p811N0042j9097P343p8439k5969j6246j3521
7157g5947P0074J3536l3194p7K2663k9066n0645K0349O437L5046L7753M781K7291
7144D9001l114J289j2234K2523k4888o146K5115m3713l0338o0759o533l9566k2759
7131a52122L1647L2213M1915O8592N390k2936O326K0358l3341j5611J1574l9940
7119d5935m9854J9390j1533L8246Q3151l623n6065m292k0769J438p383k3845K0121
7106f0953l315L8244Q1178n991j4851k528k7854m3434O582J4181k588J4530N9805
$$ plain form
7093 53006 54785 56754 64455 34558 23500 -62056 -78441 -8040 21698 22436 -15820 9588 40075
7080 40075 60322 26443 -4410 -14100 -18361 4765 29891 36625 25047 29171 -18596 -33743 -1553
7067 -1553 -14134 -48411 -49326 -47545 -50287 -30446 -24166 -34123 -38808 -2246 34697 49927 -913
7054 -913 -8777 -20906 2962 54894 21839 -51848 -50936 -26041 -17789 -44162 -76321 -96246 -61096
7041 -61096 -43648 -58219 -51546 -32953 -70410 -98546 -95438 9915 49404 -2502 -12688 -17430
7029 -17430 -54024 -41702 -46123 -58792 -51265 -81268 -55117 -25797 -40844 -109824 -72604 -20251
7017 -20251 -3585 12811 14364 37359 -2184 -18191 -41489 -15115 -24137 -49707 -34232 -47383
7005 -47383 -46776 -7197 24229 -25581 -18189 43559 81667 62676 26245 -5686 -34422 -10348
$$ packed form
7093E3006J779J969P701k9897j1058q5556j6385P0401K9738P38l8256K5408L0487
7080D0075K0247l3879l0853r690m261K3126K5126O734j1578M124m7767j5147L2190
7067a553j2581l4277r15J781k742J9841O280r957m685L6562L6943J5230n0840
7054i13p864j2129K3868N1932l3055p3687R12K4895Q252k6373l2159j9925L5150
7041f1096J7448j4571O673J8593l7457k8136L108J05353L9489n1906j0186m742
7029a7430l6594J2322m421j2669P527l0003K6151K9320j5047o8980L7220N2353
7017b0251J6666J6396J553K2995l9543j6007k3298K6374r022k5570J5475j3151
7005d7383O07L9579L1426m9810P392O1748L8108j8991l6431l1931k8736K4074
$$ plain form
6993 -10348 -12616 -7227 -30114 -34512 -34926 -23802 -34288 -29118 -11523 -1738 -3943 3882 48410 15506
6979 15506 -32916 -22624 -29450 -3588 53084 13788 -33182 -86915 -69832 -49761 -84772 -76694
6967 -76694 -66804 -87536 -50542 -15512 42651 81558 26034 6438 -40906 -5548 36758 33150
6955 33150 53464 19469 6135 13983 13662 30617 16470 -26740 -39621 -4507 6393 33581
6943 33581 26067 -50618 -93718 -120376 -57210 10917 48862 71546 54549 18422 17449 -16632
6931 -16632 -33997 -21009 59690 52685 -21557 -70361 -61696 -50872 -41085 -2268 28944 11863
6919 11863 21411 16087 -41766 -28284 -21495 -8443 3081 13403 -6201 -84564 -97124 -107737
6907 -107737 -79368 -23387 -23787 -15888 -44505 -65122 -58301 3225 -420 21199 26583 20102 9192
$$ packed form
6993a0348k268N389k2887m398m14J1124j0486N170J7595R785k205P825M4528l2904
6979A5506m8422J0292o826K5862N6672l9296m6970n3733J7083K0071l5011Q078
6967g6694R890k0732L6994L5030N8163L8907n5524j9596m7344L5358M2306l608
6955C3150K0314l3995j3334P848l21J6955j4147m3210j2881L5114J0900K7188
6943C3581p514p6685m3100k6658O3166O8127L7945K2684j6997l6127r73l4081
6931a6632j7365J2988Q0699p005p4242m8804Q665J0824R787L8817L1212j7081
6919A1863R548n324n7853J3482O789J3052J1524J0322j9604p8363j2560j0613
6907a07737K8369N5981m00P899k8617k0617O821O1526l645K1619N384o481j0910
$$ plain form
6894 9192 -1964 -4605 -7315 -9637 -20245 -74978 -53259 -71213 -78518 -19139 -27080 -15647 9366
6881 9366 5023 47825 108861 56048 -15643 -13198 27401 588 30097 54000 -2102 -22279
6869 -22279 -16279 -42651 -58237 -77088 -82559 -72849 -62192 -21869 -24756 -21372 -38107 -42344 -68419
6856 -68419 -83384 -113132 -146160 -193018 -166584 -115775 -104887 -66788 2065 6397 -34649 -50888
6844 -50888 -53433 -29861 -34197 -14340 4739 -51642 -28855 28749 32284 32449 35710 63543 73137
6831 73137 39107 935 -12477 -22767 -29297 -50900 13548 48004 48506 -2243 -35225 -8321
6819 -8321 -19756 -28415 -35051 2813 944 -49846 -35568 -2477 -36702 -93450 -87565 -71419 -10767
6806 -10767 -12508 -36961 -11450 -13449 -6151 -38008 -63046 -46511 33051 37267 -6357 11147 -7574
$$ packed form
6894I192j1156k641k710k322j0608n4733K1719j7954p305N9379p941J1433K5013
6881I366m343M2802O1036n2813p1691K445M0599k6813K9509K3903n6102k0177
6869b2279O000k6372j5586j8851n471R710J0657M0323k887L384j6735m237k6075
6856f8419j4965k9748l3028m6858K6434N0809J0888L8099O8853M332m1046j6239
6844e0888k545K3572m336J9857J9079n6381K2787N7604L535J65L261K7833R594
6831G3137l4030l8172j3412j0290o530k1603O4448L4456N02n0749l2982K6904
6819h321j1435q659o636L7864j869n0790J4278L3091l4225n6748N885J6146O0652
6806a0767j741k4453K5511j999P298l1857k5038J6535P9562M216m3624J7504j8721
$$ plain form
6793 -7574 -27742 -33879 -44540 -25074 -55386 -25127 44571 53174 73057 88612 68433 66529 25383
6780 25383 16167 19289 1131 -3661 40618 49790 45431 -813 -34699 -53554 24721 32950 -47583
6767 -47583 -25511 -4927 -35241 -63837 -129168 -158388 -80454 -59240 -22755 5762 9356 -9343
6755 -9343 -45533 -61985 -22156 22842 31676 61320 80482 -19670 -107462 -109423 -118119 -118025 -64612
6742 -64612 -57673 -62730 -81153 -49309 -49880 -55392 -22732 -55254 -57509 -15932 22580 44133 -18276
6729 -18276 -57009 -5513 13197 22115 -8679 -37727 -59172 -76654 -19924 18529 -14523 -20171
6717 -20171 -12645 -24252 26748 44145 22419 42848 41272 7642 -40299 -32605 -33352 -40530 -74614
6704 -74614 -96514 -101312 -116145 -72849 -72501 -83346 -84325 -57987 -31867 -7725 3427 -24256 -43858
$$ packed form
6793g574k0168o137j0661J9466l0312L0259O9698Q603J9883J5555k0179j904m1146
6780B5383r216L122j8158m792M4279R172m359m6244l3886j8855P8275Q229q0533
6767d7583K2072K0584l0314k8596o5331k9220P7934K1214L6485K8517L594j8699
6755i343l6190j6452L9829M4998Q834K9644J9162j00152q7792j961q696R4N3413
6742f4612O939n057j8423L1844n71n512L2660l2522k255M1577L8512K1553o2409
6729a8276l8733N1496J8710Q918l0794k9048k1445j7482N6730L8453l3052n648
6717b0171P526j1607N1000J7397k1726K0429j576l3630m7941P694p47p178l4084
6704g4614k1900m798j4833M3296L48j0845r79K6338K6120K4142J1152k7683j9602
$$ plain form
6691 -43858 -33098 32744 78743 49010 -49419 -31651 26405 42496 -2599 -31187 -58703 -15281
6679 -15281 22714 -4226 -5650 -17423 -23626 -64178 -111637 -153847 -162852 -138456 -125569 -100697
6667 -100697 -77551 -49883 -15340 -12016 -1241 -12404 -25347 -57776 -105031 -47173 -10193 -22235
6655 -22235 -44665 -51480 -38149 -3316 11347 -32493 -74467 -116403 -98522 -117580 -137931 -90907
6643 -90907 -43225 -52401 -67702 -90781 -66639 -8902 -31756 -46493 -51310 -1656 95338 58611
6631 58611 -15828 -60678 -40217 -30705 -1779 -17232 -25462 -26333 -26322 -69674 -39488 -29671 -44254
6618 -44254 -43642 -19735 -29986 -41842 -40100 -51772 -42771 -25234 7766 23004 30339 52915 53076
6605 53076 8566 -46521 -65207 -37243 10775 26826 33862 -7822 3792 8016 7865 4992 42058
$$ packed form
6691d3858J0760O5842M5999k9733r8429J7768N8056J6091m5095k8588k7516M3422
6679a5281L7995k6940j424j1773o203m0552m7459m2210r005K4396J2887K4872
6667a00697K3146K7668L4543L324J0775j1163j2943l2429m7255N7858L6980j2042
6655b2235k2430o815J3331L4833J4663m3840m1974m1936J7881j9058k0351M7024
6643i0907M7682r176j5301k3079K4142N7737k2854j4737m817M9654R6994l6727
6631E8611p4439m4850K0461R512K8926j5453q230q71J1m3352L0186R817j4583
6618d4254O12K3907j0251j1856J742j1672R001J7537L3000J5238P335K2576J61
6605E3076m4510n5087j8686K7964M8018J6051P036m1684J1614M224j51k873L7066
$$ plain form
6592 42058 53164 37742 52009 40064 8795 42283 87868 79824 35759 23201 44854 56729
6580 56729 51283 90014 36557 -8841 27465 16186 -66669 -66415 -27294 5926 20204 12265 10322
6567 10322 9665 9172 6326 -4675 -857 -1741 29749 -17004 -33204 -4592 2628 13203 50283 69269
6553 69269 10947 -35719 -9409 21251 -42119 -82200 -55207 -28585 -30095 -49619 -15265 30349
6541 30349 14521 -42961 -5809 47375 15314 5287 23478 11987 -14127 -4907 76065 138192
6529 138192 146044 99690 65373 56600 7096 -15656 5441 -81033 -101378 -89901 -107473 -122498
6517 -122498 -75330 -47631 -33124 -51734 -99665 -70760 -97547 -112589 -64194 -89490 -67680 9236
6505 9236 -5063 -25042 -40518 -123295 -68934 -79952 -92047 -43899 -16088 -3639 -2198 12517
$$ packed form
6592D2058J1106j5422J4267j1945l1269L3488M5585q044m4065j2558K1653J1875
6580E6729n446L8731n3457m5398L6306j1279q2855K54L9121L3220J4278p939j943
6567A0322o57m93k846j1001L818q84L1490m6753j6200K8612P220J0575L7080J8986
6553F9269n8322m6666K6310L0660o3370m0081K6993K6622j510j9524L4354M5614
6541C0349j5828n7482L7152N3184l2061j0027J8191j1491k6114R220Q0972O2127
6529A38192P852m6354l4317q773m9504k2752K1097q6474k0345J1477j7572j5025
6517a22498M7168K7699J4507j8610m7931K8905k6787j5042M8395k5296K1810P6916
6505I236j4299j9979j5476q2777N4361j1018j2095M8148K7811J2449J441J4715
$$ plain form
6493 12517 18749 18034 23896 21921 -7998 -92565 -108792 -61511 -42464 -66746 -73202 -95678 -63837
6480 -63837 -73904 -107878 -141879 -115537 -71982 4841 50499 9672 5256 -29697 -99759 -60310
6468 -60310 -31962 -25819 -11937 -28349 -36394 -24932 -19065 -33184 -38682 -5939 5670 12445 67013
6455 67013 35100 13350 -67661 -66233 -736 13452 -43376 -69709 -31567 28136 53317 56047
6443 56047 24756 -48186 -49040 -43927 -35955 -11213 -35236 -30356 45171 75690 51792 -8780 -95212
6430 -95212 -112357 -63513 -57646 -54165 -42197 -57017 -93455 -126192 -126276 -90645 -27264 9487 3860
6417 3860 -20186 15624 -4153 -37172 -38486 -50487 -41679 -25068 -39559 -83325 -117140 -54568
6405 -54568 -48407 -34334 4102 20788 -7906 -65364 -88666 -120751 -91551 -70207 -36271 23227
$$ packed form
6493A2517O232p15N862j975k9919q4567j6227M7281J9047k4282o456k2476L1841
6480f3837j0067l3974l4001K6342M3555P6823M5658m0827m416l4953p0062L9449
6468f0310K8348O143J3882j6412q045J1462N867j4119n498L2743J1609O775N4568
6455F7013l1913k1750q1011J428O5497J4188n6828k6333L8142N9703K5181K730
6443E6047l1291p2942q54N113P972K4742k4023M880P5527L0519k3898o0572q6432
6430i5212j7145M8844N867L481J1968j4820l6438l2737q4L5631O3381L6751n627
6417C860k4046L5810j9777l3019j314j2001Q808J6611j4491m3766l3815O2572
6405e4568O161J4073L8436J6686k8694n7458k3302l2085K9200K1344L3936N9498
$$ plain form
6393 23227 20797 59952 40345 -4860 5742 -14475 -45799 -22494 26237 17056 -26625 -27300 -30531
6380 -30531 44289 77010 86069 83303 60538 17398 -22060 -8735 -46586 -117522 -113014 -123036
6368 -123036 -86698 -41349 -77310 -43943 -20113 -91772 -90831 -28712 11323 22940 -16719 -44034
6356 -44034 -78852 -75104 -37147 40995 50031 -35960 -30175 -46507 -52947 -8044 33308 3985 -53419
6343 -53419 -123080 -126583 -27339 12366 -12738 -44270 -69833 -17384 6715 66667 59402 35339
6331 35339 37098 51562 50133 -1645 -49847 -44980 -20974 -14742 -10941 -43090 -82951 -48941 25557
6318 25557 61022 -8301 -53031 -42005 -599 9742 2890 -6173 35389 9727 -44706 -48517
6306 -48517 -45032 -7851 15445 -6469 -38921 -35632 -5635 -15695 -39669 -70434 -63205 -50683
$$ packed form
6393B3227k430L9155j9607m5205J0602k0217l1324K3305M8731r181m3681o75l231
6380c0531P4820L2721R059k766k2765m3140l9458J3325l7851p0936M508j0022
6368a23036L6338M5349l5961L3367K3830p1659R41O2119M0035J1617l9659k7315
6356d4034l4818L748L7957P8142R036q5991N785j6332o440M4903M1352k9323n7404
6343e3419o9661l503R9244L9705k5104l1532k5563N2449K4099N9952p265k4063
6331C5339J759J4464j429n1778m8202M867K4006O232L801l2149l9861L4010P4498
6318B5557L5465o9323m4730J1026M1406J0341o852r063M1562k5662n4433l811
6306d8517L485L7181K3296k1914l2452L289K9997j0060k3974l0765P229J2522
$$ plain form
6294 -50683 -43241 -49450 -57148 -29156 -13554 -34743 -15056 -25412 -66718 -67180 -67939 -80464 -77830
6281 -77830 -38523 -36521 -21549 -26408 -46540 -7992 -23753 -21626 -34078 -89553 -129592 -123001 -150519
6268 -150519 -105224 -85647 -77678 -131635 -81488 -73665 -123513 -139965 -70105 -79137 -179987 -190119
6256 -190119 -137503 -55317 20199 22628 -60943 -86375 -117034 -115614 -97476 -123711 -178105 -173554
6244 -173554 -161639 -86332 -16495 -62104 -91101 -71494 -38607 -48545 -39303 -65933 21032 83966
6232 83966 74104 45617 20575 -1417 19956 38651 70550 95212 55251 10359 -24958 -14164
6220 -14164 30419 15526 15573 -19254 -22916 -8044 -18889 16487 75283 76582 12044 -38945 -4744
6207 -4744 -29323 -98679 -109776 -46978 -32406 -49216 -190 19604 -11396 -54465 -1643 7862
$$ packed form
6294e0683P442o209p698K7992J5602k1189J9687j0356m1306m62p59j2525K634
6281g7830L9307K002J4972m859k0132L8548j5761K127j2452n5475m0039O591k7518
6268a50519M5295J9577P969n3957N0147P823m9848j6452O9860r032j00850j0132
6256a90119N2616Q2186P5516K429q3571k5432l0659J420J8138k6235n4394M551
6244a73554J1915P5307O9837m5609k8997J9607L2887r938R242k6630Q6965O2934
6232H3966r862k8487k5042k1992K1373J8695L1899K4662l9961m4892l5317J0794
6220a4164M4583j4893M7l4827l662J4872j0845L5376N8796J299o4538n0989L4201
6207d744k4579o9356j1097O2798J4572j6810M9026J9794l1000m3069N2822R505
$$ plain form
6195 7862 14873 2205 -14478 -20631 -47075 -78075 -2034 63100 20920 -55507 -100454 -74377
6183 -74377 -25042 11892 -13765 -26088 -76256 -105913 -22480 -13222 -15281 -50168 -76876 -54310
6171 -54310 -94104 -98453 -68400 -94726 -70197 -62003 -58859 -29483 26297 -52494 -106693 -84153
6159 -84153 -10921 24002 39399 61488 13482 -75745 -32505 -15291 -27342 -15978 -803 10383
6147 10383 15629 6842 22704 -19586 -28912 -42527 -39177 -6313 10831 40763 -1830 -12096 -13391
6134 -13391 -8356 -20039 32813 52476 71636 19493 -7445 -12333 -14082 11335 -2165 -76730
6122 -76730 -31319 11472 28810 19271 -25483 -1797 10214 -68990 -58622 -40454 -45178 -25169
6110 -25169 -22805 -62707 -87822 -23523 22061 21011 -5657 -4534 44893 69437 40920 2716
$$ packed form
6195G862P011j2668j6683o153k6444l1000P6041O5134m2180p6427m4947K6077
6183g4377M9335L6934k5657j2323n0168k9657Q3433R258k059l4887k6708K2566
6171e4310l9794m349L0053k6326K4529Q194L144K9376N5780p8791n4199K2540
6159h4153P3232L4923J5397K2089m8006q9227M3240J7214j2051J1364J5175J1186
6147A0383N246q787J5862m2290r326j3615L350L2864J7144K9932m2593j0266j295
6134a3391N035j1683N2852J9663J9160n2143k6938m888j749K5417j3500p4565
6122g6730M5411M2791J7338r539m4754K3686J2011p9204J0368J8168m724K0009
6110b5169K364l9902k5115O4299M5584j050k6668J123M9427K4544k8517l8204
$$ plain form
6098 2716 -40369 -85342 -138265 -168472 -121190 -60780 -34295 -11870 -3630 54984 62121 -44148
6086 -44148 7313 19840 5161 18228 41713 1244 -51959 -34288 -14837 -7293 -15857 -32062
6074 -32062 -55119 -35317 22673 21138 43848 34128 53094 42297 18056 30858 56131 64728
6062 64728 90728 20318 -33073 -48363 -2046 14296 25408 43570 85272 76813 10640 39771
6050 39771 68049 70279 63657 77476 56027 36658 -31210 -8459 4252 24643 31959 -22607
6038 -22607 -82802 -118619 -82687 -34527 -51438 -110338 -153520 -97922 -34942 23679 50446 59655
6026 59655 17961 5749 -2442 -9988 44428 96409 120252 127761 74478 -7878 -79423 -44858
6014 -44858 -35878 -28980 8176 -16458 -52633 -84650 -76097 -5663 78693 88369 39501 2894 54616
$$ packed form
6098B716m3085m4973n2923l0207M7282O0410K6485K2425Q240N8614P137j06269
6086d4148N1461J2527j4679J3067K3485m0469n3203J7671J9451P544q564j6205
6074c2062k3057J9802N7990j535K2710r720J8966j0797k4241J2802K5273Q597
6062F4728K6000p0410n3391j5290M6317J6342J1112J8162M1702q459o6173K9131
6050C9771K8278K230o622J3819k1449j9369o7868K2751J2711K0391P316n4566
6038b2607o0195l5817L5932M8160j6911n8900m3182N5598O2980N8621K6767R209
6026E9655m1694j2212q191p546N4416N1981K3843P509n3283q2356p1545L4565
6014d4858Q980O898L7156k4634l6175l2017Q553P0434Q4356R676m8868l6607N1722
$$ plain form
6001 54616 41081 22461 -14814 14007 58972 67023 59435 45296 16656 28860 33027 47692
5989 47692 67504 57528 36856 35637 7122 18262 87882 72220 -11029 -60762 -113622 -170137
5977 -170137 -203210 -142721 -79230 -54063 -23552 -65794 -98103 -107758 -74023 -106810 -105704 -94151
5965 -94151 -103810 -76349 -56532 -61618 2167 -22257 -71316 -9601 25462 4362 -13719 -1476
5953 -1476 69351 39596 37498 52517 50418 26856 -6617 53962 -1905 -7486 56226 81260 67355
5940 67355 67001 49708 40318 1254 -24999 -30046 -151 -15590 -61239 -31137 380 6349 16212
5927 16212 22971 15371 14686 35526 60447 28564 -19270 -33062 -5068 -30093 -23543 21703 32330
5914 32330 2501 5708 2106 -51487 -60857 -55928 -56505 -56801 -29900 -75679 -124982 -73928 -20082
$$ packed form
6001E4616j3535j8620l7275K8821M4965Q051p588j4139k8640J2204M167J4665
5989D7692J9812r976k0672j219k8515J1140O9620j5662q3249m9733n2860n6515
5977a70137l3073O0489O3491K5167L0511m2242l2309r655L3735l2787J106J1553
5965i4151r659K7461J9817n086O3785k4424m9059O1715L5063k1100j8081J2243
5953a476P0827k9755k098J5019k099k3562l3473O0579n5867n581O3712K5034j3905
5940F7355l54j7293r390l9064k6253n047K9895j5439m5649L0102L1517N969R863
5927A6212O759p600o85K0840K4921l1883m7834j3792K7994k5025O550M5246J0627
5914C2330k9829L207l602n3593r370M929n77k96K6901m5779m9303N1054N3846
$$ plain form
5901 -20082 -49486 -77776 -60336 -31832 -18379 -49027 -8976 -61764 -130536 -130164 -98286 -33880
5889 -33880 -16764 20137 26839 5797 32340 37757 9896 -36523 -55322 -16395 6485 -18934
5877 -18934 -93268 -27706 -20124 -51453 -27492 15364 15292 -14308 -483 1465 -21004 -40356 -48232
5864 -48232 -18162 -13363 -49565 -81653 -60245 -31963 -2851 14707 17366 3079 -22190 -73371
5852 -73371 -77449 -50755 -25506 25042 61404 62394 47669 65737 105974 147850 109544 58481
5840 58481 30445 1231 -30841 -56429 -110614 -148137 -135365 -115352 -52766 -47288 -95111 -127927
5828 -127927 -68182 -83756 -54421 -3389 31700 39657 53588 32843 29498 -113 -22019 -4016
5816 -4016 -27280 -23724 45423 26269 -36799 -58141 -56411 -62289 -69763 -126541 -117116 -60043 20153
$$ packed form
5901b0082k9404k8290J7440K8504J3453l0648M0051n2788o8772L72L1878O4406
5889c3880J7116L6901O702k1042K6543N417k7861m6419j8799L8927K2880k5419
5877a8934p4334O5562P582l1329K3961M2856p2k9600J3825J948k2469j9352p876
5864d8232L0070M799l6202l2088K1408K8282K9112J7558K659j4287k5269n1181
5852g3371m078K6694K5249N0548L6362R90j4725J8068M0237M1876l8306n1063
5840E8481k8036k9214l2072k5588n4185l7523J2772K0013O2586N478m7823l2816
5828a27927N9745j5574K9335N1032L5089P957J3931k0745l345k9611k1906J8003
5816d016k3264L556O9147j9154o3068k1342J730n878p474n6778R425N7073Q0196
$$ plain form
5803 20153 33722 4430 -24029 -16939 -8323 -22078 -79493 -96670 -68310 -47445 -44439 -29226
5791 -29226 -39588 -22900 55586 69082 49834 -29050 -28981 -37006 -65681 -20097 672 -32441 -47083
5778 -47083 -8717 -13779 -83720 -80493 -54176 -17341 -31028 -43765 -48766 -7772 -71825 -140224
5766 -140224 -145421 -139516 -131918 -100740 -30860 -26726 -26572 -46053 -46171 -40423 -4278 -20128 -13120 -14032
5752 -14032 -11833 -62717 -57079 -68185 -31239 2577 39902 60459 59896 67739 96626 66522 24797
5739 24797 -12437 -46867 -5677 -31854 -77343 -67400 -25827 -15470 -10256 12651 32474 30603
5727 30603 37481 61971 40026 3369 -27553 -37654 19137 35221 5120 31221 42961 -6089
5715 -6089 18443 -59490 -49173 -20120 -48878 -47909 -52414 -22591 3721 -28652 -17741 165 14683
$$ packed form
5803B0153J3569k9292k8459P090Q616j3755n7415j7177K8360K0865L006J5213
5791b9226j0362J6688P8486J3496j9248p8884O9q025k8675M5584K0769l3113j4642
5778d7083L8366n062o9941L227K6317L6835j3687j2737n001M0994o4053o8399
5766a40224n197N905P598L1178O9880M134J54j9481j18N748L6145j5850P008r12
5752a4032K199n0884N638j1106L6946L3816L7325K0557n63P843K8887l0104m1725
5739B4797l7234l4430M1190k6177m5489R943M1573J0357N214K2907J9823j871
5727C0603O878K4490k1945l6657l0922j0101N6791J6084l0101K6101J1740m9050
5715f089K4532p7933J0317K9053k8758R69m505K9823K6312l2373J0911J7906J4518
$$ plain form
5702 14683 -46848 -84087 -70635 -35749 -25082 31194 48501 53698 62597 48990 -17974 -12197
5690 -12197 -12016 32956 39663 8830 33918 30547 -4037 -13877 -97681 -152252 -96504 -21411 -36938
5677 -36938 -102152 -134602 -163317 -145641 -152972 -64307 -2312 22923 12255 16280 25403 9767
5665 9767 16785 38582 45558 66718 97410 77294 47228 42262 8525 -71756 -65950 -6733 8479
5652 8479 10748 -34426 -42760 -24168 -30093 -20159 55742 36321 2925 32414 56440 9388 1798
5639 1798 1754 -22160 29665 44480 23160 22948 17643 18016 56690 23347 -6930 -33311 -77656 -85965
5625 -85965 -45523 -23150 -54128 -58140 -42981 -34258 -80979 -109078 -56134 -43797 -57304 -76954
5613 -76954 -55064 -48564 19295 24896 -23278 -58739 -73311 -34002 1573 34265 15949 -23811
$$ packed form
5702A4683o1531l7239J3452L4886J0667N6276J7307N197Q899j3607o6964N777
5690a2197J81M4972O707l0833K5088l371l4584r840q3804n4571N5748P5093j5527
5677c6938o5214l2450k8715J7676p331Q8665O1995K5235j0668M025R123j5636
5665I767P018K1797O976K1160L0692k0116l0066m966l3737q0281N806N9217J5212
5652H479K269m5174q334J8592n925R934P5901j9421l3396K9489K4026m7052p590
5639A798m4k3914N1825J4815k1320k12n305L73L8674l3343l0277k6381m4345q309
5625h5965M0442K2373l0978m012J5159Q723m6721k8099N2944J2337j3507j9650
5613g6954K1890O500O7859N601m8174l5461j4572L9309L5575L2692j8316l9760
$$ plain form
5601 -23811 -66285 -102142 -116235 -86296 -44698 -87738 -88179 -38938 -14289 -15483 24994 63119
5589 63119 29251 -7390 -27024 23507 2888 4416 4150 -19022 -28353 -60087 -31275 -14823 9103
5576 9103 57401 43411 24134 40405 34447 47063 36362 26109 43316 41322 23616 -2097
5564 -2097 -9341 -41213 -1475 35219 -1292 19098 15819 -33881 -51455 6529 29954 -8905
5552 -8905 -1945 41846 39956 11617 -23682 -13644 10366 17654 61066 34659 1312 -13597 26517
5539 26517 28455 14240 27203 28796 50019 15258 -55115 -51998 883 22701 7458 32611
5527 32611 9331 49676 -385 11140 27554 35538 18417 -15935 -57298 -78437 -47314 -1300
5515 -1300 -19537 -47655 -37732 -3457 44214 1892 -24603 19106 48932 55815 75336 41370
$$ packed form
5601b3811m2474l5857j4093K9939M1598m3040m41M9241K4649j194M0477L8125
5589F3119l3868l6641j9634N0531k0619J528k66k3172r331l1734K8812J6452K3926
5576I103M8298j3990j9277J6271n958J2616j0701j0253J7207j994j7706k5713
5564b097p244l1872L9738L6694l6511K0390l279m9700j7574N7984K3425l8859
5552h905O960M3791j890k8339l5299J0038K4010P288M3412k6407l3347j4909M0114
5539B6517J938j4215J2963J593K1223l4761p0373L117N2881K1818j5243K5153
5527C2611k3280M0345n0061J1525J6414P984j7121l4352m1363k1139L1123M6014
5515a300j8237k8118R923L4275M7671m2322k6495M3709K9826O883J9521l3966
$$ plain form
5503 41370 13784 -35980 -64176 -9502 3771 38630 34945 -30631 -36549 643 235 5023 24104
5490 24104 28957 -20653 -49369 -88202 -31987 -2628 2164 -27346 -7106 13090 -15393 -24187
5478 -24187 -101892 -105545 -61280 -33942 -60372 -96108 -91330 -30203 29739 21362 21542 16556 -3806
5465 -3806 -4179 -5248 8697 3669 -5737 -12420 -7048 -16011 -43570 -48785 -76952 -65376 -55405 -70860
5451 -70860 -55844 -13726 415 40612 43492 75831 66577 53666 19944 -62631 -99462 -62712
5439 -62712 -28229 -19906 -27137 -7410 -30531 -10341 14539 -68033 -71551 -67046 -48477 -43803 -58547
5426 -58547 -56952 -25420 17760 59029 75682 29049 -64226 -68578 -76875 -95050 20760 61879
5414 61879 8688 -26754 -53225 -2407 43697 26902 -57172 -47893 8739 -17001 -51938 -11051
$$ packed form
5503D1370k7586m9764k8196N4674J3273L4859l685o5576n918L7192m08M788J9081
5490B4104M853m9610k8716l8833N6215K9359M792k9510K0240K0196k8483q794
5478b4187p7705l653M4265K7338k6430l5736M778O1127N9942q377J80m986k0362
5465c806l73j069J3945n028r406o683N372q963k7559n215k8167J1576R971j5455
5451g0860J5016M2118J4141M0197K880L2339r254j2911l3722q2575l6831L6750
5439f2712L4483Q323p231J9727k3121K0190K4880q2572l518M505J8569M674j4744
5426e8547J595L1532M3180M1269J6653m6633r3275m352q297j8175J15810M1119
5414F1879n3191l5442k6471N0818M6104j6795q4074R279N6632k5740l4937M0887
$$ plain form
5402 -11051 30616 26732 10993 -27007 -71567 -68116 -61959 -72877 -13005 -35122 -12471 37776
5390 37776 31149 37969 -10449 -45832 -3857 -50392 -7793 -5999 -37162 -64363 -84213 -114254
5378 -114254 -100674 -97447 -46591 -9734 7144 24127 48467 33340 -25979 -16688 28197 60183
5366 60183 18172 -13342 34489 12870 -30099 -20722 -156 -41095 -64096 -96215 -39918 -68841
5354 -68841 -93575 -50877 -65856 -70100 -97333 -75315 -74297 -95412 -124736 -91631 -71337 -39854
5342 -39854 -17569 -12427 5909 -14038 -60919 -89799 -82846 -28675 -34437 -16632 -1985 20086
5330 20086 31561 21845 36036 17296 -31440 -33754 -36793 -52976 -5238 35757 1517 -70064
5318 -70064 -59791 -39241 -306 34522 89423 94421 73361 101229 89751 22849 73925 101936
$$ packed form
5402a1051M1667l884j5739l8000m4560L451O157j0918N9872k2117K2651N0247
5390C7776o627O820m8418l5383M1975m6535M2599J794l1163k7201j9850l0041
5378a14254J3580L227N0856L6857J6878J6983K4340j5127n9319R291M4885L1986
5366F0183m2011l1514M7831k1619m2969R377K0566m0939k3001l2119N6297k8923
5354f8841k4734M2698j4979m244k7233K2018J018k1115k9324L3105K0294L1483
5342c9854K2285N142J8336j9947m6881k8880O953N4171n762J7805J4647K2071
5330B0086J1475r716J4191j8740m8736k314l039j6183M7738M0995l4240p1581
5318g0064J0273K0550L8935L4828N4901M998k1060K7868j1478o6902N1076K8011
$$ plain form
5306 101936 65583 47026 78393 11508 -43684 -90482 -103990 -66143 -24224 -721 -25360 -6342
5294 -6342 11752 62596 29997 31972 29058 -12592 6648 83132 78115 19857 -15466 -12316 -30105
5281 -30105 -119647 -138732 -127206 -129317 -133785 -86114 -34511 -1786 -8230 -18315 -41012 -43228 -41826
5268 -41826 -5164 45889 71077 29516 5533 -4922 925 -18298 -28480 -68789 -47227 732
5256 732 -4613 -38239 -32576 -24953 10137 30777 12028 18206 -51800 -76884 -48737 -31307 -29305
5243 -29305 25991 13924 -48726 -58991 -625 60327 57768 110745 96941 49031 39051 26862
5231 26862 5029 -5570 3066 -35956 -32751 -22353 3065 6582 -15354 -48662 -59763 -58724 -31487
5218 -31487 18035 2841 -1203 -83904 -125110 -94953 -36042 -49941 -54725 -13565 24715 56165
$$ packed form
5306A01936l6353j8557L1367o6885n5192m6798j3508L7847M1919K3503k4639J9018
5294f342J8094N0844l2599J975k914m1650J9240P6484n017n8258l5323L150j7789
5281c0105q9542j9085J1526k111m468M7671N1603L2725o444j0085k2697k216J402
5268d1826L6662N1053K5188m1561k3983j0455N847j9223j0182m0309K1562M7959
5256G32n345l3626N663P623L5090K0640j8749O178p0006k5084K8147J7430K002
5243b9305N5296j2067o2650j0265N8366O0952k559N2977j3804m7910r980j2189
5231B6862k1833j0599Q636l9022L205J0398K5418L517k1936l3308j1101J039K7237
5218c1487M9522j5194m044q2701m1206L0157N8911j3899m784M1160L8280L1450
$$ plain form
5206 56165 15111 -9820 15952 39861 -20366 -30911 27839 28874 1967 -36600 -30453 -74762
5194 -74762 -66278 -42583 -79630 -66579 -31915 15067 28304 55619 51941 21308 10721 6733
5182 6733 -22161 -10301 -33654 -83191 -60812 -91883 -67242 25723 34212 61680 104001 60439
5170 60439 1101 11063 -36391 -12833 -12067 31301 38335 38380 11869 -52937 -99987 -91257 -82754 -69294
5156 -69294 -78173 -63506 -91582 -82719 -55919 -48452 -54618 -50863 -72255 -91300 -51387 -57057 -30969
5143 -30969 -44755 -106148 -115284 -89871 -68115 -48574 -36286 31977 54179 55973 45493 3611
5131 3611 6309 14854 -31335 -23243 -21725 21662 45675 17466 -6130 -8378 17845 26593 27803
5118 27803 53756 100059 96194 24938 -79916 -101134 -66674 -58360 -84505 -95651 -112186 -90688
$$ packed form
5206E6165m1054k4931K5772K3909o0227j0545N8750J035k6907l8567O147m4309
5194g4762Q484K3695l7047J3051L4664M6982J3237K7315l678l0633j0587l988
5182F733k8894J1860k3353m9537K2379l1071K4641R2965Q489K7468M2321m3562
5170F0439n9338R962m7454K3558P66M3368P034M5k6511o4806m7050Q730Q503J3460
5156f9294q879J4667k8076Q863K6800P467o166L755k1392j9045L9913n670K6088
5143c0969j3786o1393r136K5413K1756J9541J2288O8263K2202J794j0480m1882
5131C611K698Q545m6189Q092J518M3387K4013k8209k3596k248K6223Q748J210
5118B7803K5953M6303l865p1256j04854k1218L4460Q314k6145j1146j6535K1498
$$ plain form
5106 -90688 -39682 -65318 -17564 -53446 -63881 -70779 -90519 -94761 -106929 -71155 -7258 72945
5094 72945 18995 -66438 -83104 -56787 -20219 -12697 5392 35097 37812 27710 -16086 -42164
5082 -42164 -45264 -56361 -36616 32672 57266 75225 23707 27407 20955 -17609 -63363 -81611
5070 -81611 -79061 -39303 4700 -4616 -39967 -70065 -24121 21620 31014 -5689 -26326 -46203
5058 -46203 -1192 24737 32890 -18382 -43438 -2208 19809 8200 -3386 -55750 -89376 -85400
5046 -85400 -86642 -104091 -37218 -22510 19309 45965 20147 -1673 41306 50488 57687 36978
5034 36978 88315 64379 33310 25059 49342 16688 6163 54970 36609 34146 13933 -20653
5022 -20653 7463 -9157 5982 2638 -31431 -20586 22088 10303 -18100 -43628 -56477 -68824
$$ packed form
5106i0688N1006k5636M7754l5882j0435o898j9740m242j2168L5774O3897Q0203
5094G2945n3950q5433j6666K6317L6568P522J8089K9705K715j0102m3796k6078
5082d2164l100j1097J9745O9288K4594J7959n1518L700o452l8564m5754j8248
5070h1611K550L9758M4003r316l5351l0098M5944M5741R394l6703k0637j9877
5058d6203M5011K5929Q153n1272k5056M1230K2017j1609j1586n2364l3626L976
5046h5400j242j7449O6873J4708M1819K6656k5818k1820M2979R182P199k0709
5034C6978N1337k3936l1069q251K4283l2654j0525M8807j8361k463k0213l4586
5022b0653K8116j6620J5139l344l4069J0845M2674j1785k8403k5528j2849j2347
$$ plain form
5010 -68824 -145372 -117326 -72835 -64120 -53371 -56591 -36278 13472 58487 46363 69924 64476
4998 64476 31142 54944 36864 24734 21986 35321 87268 98278 -1775 -3920 -8643 -51933
4986 -51933 -104397 -84827 -27138 18538 17182 26141 57251 53283 19668 4154 36717 66625
4974 66625 75040 53338 54646 35249 36301 52116 38622 58090 28434 69752 52070 34105
4962 34105 79011 31341 33873 37294 -3334 -40934 -53320 -43931 -24940 29510 -1751 -16830
4950 -16830 27557 19763 -51301 -69244 -123342 -97530 -78793 -77734 -19203 -8451 -32811 -53649
4938 -53649 -8048 7543 -19159 -55272 -2574 32925 25559 22502 -58024 -90575 -42967 347
4926 347 19810 28138 -22669 -55231 -13309 3706 -30606 -50686 2359 -8631 -62772 -33452
$$ packed form
5010f8824p6548K8046M4491Q715J0749l220K0313M9750M5015j2124K3561n448
4998F4476l3334K3802j8080j2130k748J3335N1947J1010j00053k145m723m3290
4986e1933n2464J9570N7689M5676j356Q959L1110l968l3615j5514L2563K9908
4974F6625Q415k1702J308j9397J052J5815j3494J9468k9656M1318j7682j7965
4962C4105M4906m7670K532L421m0628l7600j2386R389J8991N4450l1261j5079
4950a6830M4387p794p1064j7943n4098K5812J8737J059N8531J0752k4360k0838
4938e3649M5601J5591k6702l6113N2698L5499p366l057q0526l2551M7608M3314
4926C47J9463Q328n0807l2562M1922J7015l4312k0080N3045j0990n4141K9320
$$ plain form
4914 -33452 3455 16434 43913 39608 15024 -12742 1355 18261 10453 3383 -5556 -50644 -82876
4901 -82876 -107110 -46377 34654 65417 43275 40544 24078 -37972 -86392 -59599 -38941 -84496
4889 -84496 -83555 -50842 38601 74667 71268 81985 63588 97677 26080 22621 8699 21561 34231
4876 34231 41610 49975 32465 -62267 -102553 -93294 -42881 -7733 12887 24093 11170 -23217
4864 -23217 -46942 -87965 -69823 -105644 -96151 -100864 -114891 -49912 -48659 19136 21647 22296 3910
4851 3910 18493 17407 25651 18858 71657 110305 126244 54966 40619 12103 -34767 -34373 -67101
4838 -67101 -91456 -96538 -31801 -984 -38924 -50005 -43455 -53626 -67635 -50455 -83738 -56861
4826 -56861 -79790 -110149 -132873 -104278 -66221 -19657 -15378 2658 -23158 -11863 33016 78412
$$ packed form
4914c3452L6907J2979K7479m305k4584k7766J4097J6906p808p070q939m5088l2232
4901h2876k4234O0733Q1031L0763k2142k731j6466o2050m8420K6793K0658m5555
4889h4496R41L2713Q9443L6066l399J0717j8397L4089p1597l459j3922J2862J2670
4876C4231P379Q365j7510r4732m0286R259N0413L5148K0620J1206j2923l4387
4864b3217k3725m1023J8142l5821R493m713j4027O4979J253O7795K511O49j8386
4851C910J4583j086Q244o793N2799L8648J5939p1278j4347k8516m6870L94l2728
4838f7101k4355n082O4737L0817l7940j1081O550j0171j4009J7180l3283K6877
4826e6861k2929l0359k2724K8595L8057M6564M279J8036k5816J1295M4879M5396
$$ plain form
4814 78412 50698 12079 59748 77187 80327 98200 78542 36937 34174 10553 8935 -19333
4802 -19333 -18729 -1861 34812 -16035 -52174 -109897 -119785 -64457 -58187 -44262 -24543 39666 72193
4789 72193 42563 6477 14528 23662 18332 -5364 -9997 5857 -906 -44842 -98823 -75927 5573
4776 5573 42126 -11868 -51835 -25229 16915 30144 27349 36184 32651 -6395 -9303 -9366 -889 -11021
4762 -11021 -19448 -40542 -90859 -92519 -74900 -101667 -88901 -32032 23604 40961 25367 -10218
4750 -10218 -47177 -75742 -86053 -125210 -136536 -139616 -64764 -19643 -6061 -14153 -19073 -56535
4738 -56535 -96024 -134444 -107433 -41903 -25629 -80791 -52176 -11099 21672 18362 3530 -73110
4726 -73110 -78252 -84963 -88801 -46916 -53672 -15855 12336 28198 4854 776 -8923 11176 35815
$$ packed form
4814G8412k7714l8619M7669J7439L140J7873j9658m1605k763k3621j618k8268
4802a9333O04J6868L6673n0847l6139n7723r888N5328O270J3925J9719O4209L2527
4789G2193k9630l6086Q051R134n330k3696m633J5854o763m3936n3981K2896Q1500
4776E573L6553n3994l9967K6606M2144J3229k795Q835l533l9046k908o3Q477j0132
4762a1021q427k1094n0317j660J7619k6767J2766N6869N5636J7357j5594l5585
4750a0218l6959k8565j0311l9157j1326l080P4852M5121J3582q092m920l7462
4738e6535l9489l8420K7011O5530J6274n5162K8615M1077L2771l310j4832p6640
4726g3110n142o711l838M1885o756L7817K8191J5862k3344m078r699K0099K4639
$$ plain form
4713 35815 5603 40124 83259 55303 12048 -12301 22425 -6635 -26667 -9101 -22409 -96378
4701 -96378 -58201 -45041 -112896 -56694 1177 -5473 6472 1280 -22287 -77408 -118941 -116447
4689 -116447 -69875 8670 21132 13513 -22530 -57088 -83114 -63692 -54366 -37695 -12250 20115
4677 20115 60418 15473 -42229 -14768 -41673 -24189 -42905 -34231 -7961 777 -62199 -111377
4665 -111377 -68087 -27225 -71686 -76688 -56084 -44623 -54634 -46461 -103842 -149986 -113294 -92092
4653 -92092 -109388 -84384 -88158 15177 58430 -6200 -17848 -7362 -16582 -49685 -30253 10973
4641 10973 29146 60213 26992 22347 -1675 -49949 -63523 -100682 -106778 -73085 -55951 -9528
4629 -9528 17385 14974 49538 44256 11438 38804 133949 128956 53849 -17197 -52703 -43726 -18810
$$ packed form
4713C5815l0212L4521M3135k7956m3255k4349L4726k9060k0032J7566j3308p3969
4701i6378L8177J3160o7855N6202N7871o650J1945n192k3567n5121m1533K494
4689a16447M6572P8545J2462p619l6043l4558k6026J9422R326J6671K5445L2365
4677B0115M0303m4945n7702K7461k6905J7484j8716Q674K6270Q738o2976m9178
4665a11377M3290M0862m4461n002K0604J1461j0011Q173n7381m6144L6692K1202
4653i2092j7296K5004l774J03335M3253o4630j1648J0486r220l3103J9432M1226
4641A0973J8173L1067l3221m645k4022m8274j3574l7159o096L3693J7134M6423
4629i528K6913k411L4564n282l2818K7366R5145m993p5107p1046l5506Q977K4916
$$ plain form
4616 -18810 -9806 12598 3236 789 -4107 -8379 -32519 -3365 -17244 -588 12066 -91886 -145013
4603 -145013 -96138 -7000 9315 39414 13910 7433 10316 3286 -4337 -7461 -40231 -49889 -27491
4590 -27491 -5106 14805 -21274 -54378 -63420 -70004 -5523 41082 -23239 -75372 -91150 -83016
4578 -83016 -38103 -18042 38061 65888 40251 1579 -54063 -81043 -27398 25907 104109 119695
4566 119695 47726 24245 52649 39526 -23853 -25826 -700 7938 -14961 -17416 36934 28600
4554 28600 44262 104762 87608 78652 131101 128530 132247 102427 48055 10280 -4594 40017
4542 40017 22943 -39408 -47072 -8177 31438 61783 20244 -28472 13204 72240 108887 97289
4530 97289 56502 10280 -4322 6638 47010 33687 -1408 31673 49526 67702 82772 67245
$$ packed form
4616a8810R004K2404r362k447m896m272k4140K9154j3879J6656J2654j03952n3127
4603a45013M8875Q9138J6315L0099k5504o477K883p030p623l124l2770r658K2398
4590b7491K2385J9911l6079l3104r042o584O4481M6605o4321n2133j5778Q134
4578h3016M4913K0061N6103K7827k5637l8672n5642k6980N3645N3305P8202J5586
4566A19695p1969k3481K8404j3123o3379j973K5126Q638k2899k455N4350q334
4554B8600J5662O0500j7154q956N2449k571L717k9820n4372l7775j4874M4611
4542D0017j7074o2351p664L8895L9615L0345m1539m8716M1676N9036L6647j1598
4530I7289m0787m6222j4602J0960M0372j3323l5095L3081J7853J8176J5070j5527
$$ plain form
4518 67245 25316 34895 19295 -25580 -48233 -106784 -120093 -37466 5133 -22493 -27730 -10699
4506 -10699 -65816 -79163 -77878 -44110 -2757 49923 33104 38917 53834 10867 -8737 -9713 -24815
4493 -24815 3808 -23548 -6541 51335 84382 44495 21168 51372 65559 86053 71128 13214
4481 13214 -34122 -24907 -12903 -30053 -52586 -45052 -34273 -39602 12221 36248 4844 -8338
4469 -8338 -5305 -21959 -37229 -29136 -46591 -56193 -53208 -56093 2312 13469 30355 40716 35364
4456 35364 23039 31736 47543 -6196 -5785 -32038 -15358 44554 22841 -13515 1271 6361 -1353
4443 -1353 -34557 66332 97094 52756 31252 51618 31502 15792 3120 11013 9261 -1906
4431 -1906 -101241 -87716 -31761 7160 94904 112188 13367 -63547 -92953 -90919 -28014 24080
$$ packed form
4518F7245m1929R579j5600m4875k2653n8551j3309Q2627M2599k7626n237J7031
4506a0699n5117j3347J285L3768M1353N2680j6819N813J4917m2967j9604r76j5102
4493b4815K8623k7356J7007N7876L3047l9887k3327L0204J4187K0494j4925n7914
4481A3214m7336R215J2004j7150k2533P534J0779n329N1823K4027l1404j3182
4469h338L033j6654j5270Q093j7455r602K985k885N8405J1157J6886J0361n352
4456C5364j2325Q697J5807n3739M11k6253J6680N9912k1713l6356J4786N090p714
4443a353l3204J00889L0762m4338k1504K0366k0116j5710j2672P893j752j1167
4431a906r9335J3525N5955L8921Q7744J7284r8821p6914k9406K034O2905N2094
$$ plain form
4419 24080 -3672 759 -462 24304 47655 15481 11509 781 -36418 -51434 -51260 -40318 -6817
4406 -6817 21777 -12563 -78873 -102951 -18721 27126 24933 -1026 22536 27621 -29081 -37342 -5843
4393 -5843 -38198 -80353 -70384 -107477 -45169 -13967 -26861 -35533 -59036 -34357 2637 -7171 -25282
$$ packed form
4419B4080k7752M431j221K4766K3351l2174l972j0728l7199j5016J74J0942L3501
4406f817K8594l4340o6310k4078Q4230M5847k193k5959K3562N085n6702q261L1499
4393e843l2355m2155R969l7093O2308L1202j2894q672k3503K4679L6994r808j8111
$$ [...]
##END NTUPLES=NMR SPECTRUM
##END=
