##TITLE=Analysis number 307095
Compound Code ac 35900
Book Reference 4
Project Code adrs
Chemist Name frontier
##JCAMPDX= 6.0         $$ Bruker NMR JCAMP-DX V2.0
##DATA TYPE= NMR SPECTRUM
##DATA CLASS= NTUPLES
##ORIGIN= Bruker BioSpin GmbH
##OWNER= NMR
$$ XWIN-NMR		Version 3.5
$$ Wed Apr 20 14:55:31 2005 GMT Daylight Time (UT+1h)  MAYBRIDGE\NMR@NMR_250MHZ
##.OBSERVE FREQUENCY= 250.131544655141
##.OBSERVE NUCLEUS= ^1H
##.ACQUISITION MODE= SIMULTANEOUS (DQD)
##.ACQUISITION SCHEME= undefined
##.AVERAGES= 16
##.DIGITISER RES= 18
##SPECTROMETER/DATA SYSTEM= dpx250
##.PULSE SEQUENCE= zg30
##.SOLVENT NAME= DMSO
##.SHIFT REFERENCE= (INTERNAL, DMSO, 0, 16.522)
##AUDIT TRAIL= $$ (NUMBER, WHEN, WHO, WHERE, WHAT)
$$ ##TITLE= Audit trail, XWIN-NMR		Version 3.5
$$ ##JCAMPDX= 5.01
$$ ##ORIGIN= Bruker BioSpin GmbH
$$ ##OWNER= NMR
$$ C:\u/data/dgb/nmr/ADRS/1870/pdata/1/auditp.txt
$$ ##AUDIT TRAIL=  $$ (NUMBER, WHEN, WHO, WHERE, WHAT)
(   1,<2005-04-20 14:55:12.02 +100>,<MAYBRIDGE\NMR>,<NMR_250MHZ>,
      <created by zg, POWCHK disabled, PULCHK disabled
       configuration hash MD5:
       62 19 C7 07 E1 42 D1 B7 37 6C 3D D0 77 39 F9 E6
       data hash MD5: 64K
       8C 80 CD E6 BE E6 04 4E B7 8C 21 31 52 36 04 13>)
(   2,<2005-04-20 14:55:22.96 +100>,<MAYBRIDGE\NMR>,<NMR_250MHZ>,
      <Start of raw data processing
       ef LB = 0.3 FT_mod = 6 PKNL = 1 SI = 32K 
       data hash MD5: 32K
       8F 56 DF 9A 01 EA 93 38 ED 0E E8 F6 D4 05 EB 63>)
(   3,<2005-04-20 14:55:25.08 +100>,<MAYBRIDGE\NMR>,<NMR_250MHZ>,
      <apk 
       data hash MD5: 32K
       B1 DF 41 17 6D F4 C8 6B E2 FC 5C 1D 1C 5A 8D 6E>)
(   4,<2005-04-20 14:55:25.76 +100>,<MAYBRIDGE\NMR>,<NMR_250MHZ>,
      <abs ABSG = 5 
       data hash MD5: 32K
       B5 84 27 DD ED A2 99 6A B4 E1 01 44 7D 08 A4 36>)
$$ ##END=
$$ 
$$ hash MD5
$$ 81 6F D5 E3 6E E3 AF EB B7 57 BE 72 DA D7 5D A6
##$RELAX= 
##$RELAX= 
##$RELAX= 
##$RELAX= 
##$RELAX= 
##$RELAX= 
##$RELAX= 
$$ Bruker specific parameters
$$ --------------------------
##$DU= <C:\u>
##$EXPNO= 1870
##$NAME= <ADRS>
##$PROCNO= 1
##$TYPE= <nmr>
##$USER= <dgb>
##$AMP= (0..31)
100 100 100 100 100 100 100 100 100 100 100 100 100 100 100 100 100 100 
100 100 100 100 100 100 100 100 100 100 100 100 100 100 
##$AQSEQ= 0
##$AQ_mod= 3
##$AUNM= <au_zg>
##$AUTOPOS= <28 >
##$BF1= 250.13
##$BF2= 250.13
##$BF3= 250.13
##$BF4= 250.13
##$BF5= 500.13
##$BF6= 500.13
##$BF7= 500.13
##$BF8= 500.13
##$BYTORDA= 1
##$CFDGTYP= 0
##$CFRGTYP= 5
##$CHEMSTR= <none>
##$CNST= (0..31)
1 1 145 1 1 1 1 1 1 1 1 1 1 1 1 1 1 1 1 1 1 1 1 1 1 1 1 1 1 1 1 1 
##$CPDPRG= <>
##$CPDPRG1= <>
##$CPDPRG2= <>
##$CPDPRG3= <>
##$CPDPRG4= <mlev>
##$CPDPRG5= <mlev>
##$CPDPRG6= <mlev>
##$CPDPRG7= <mlev>
##$CPDPRG8= <mlev>
##$CPDPRGB= <>
##$CPDPRGT= <>
##$D= (0..31)
0 1 0 0 0 0 0 0 0 0.06 0 0 0 0 0 0 0.0002 0 0 0 0 0 0 0 0 0 0 0 0 0 0 
0 
##$DATE= 1114005311
##$DBL= (0..7)
120 120 120 120 120 120 120 120 
##$DBP= (0..7)
150 150 150 150 150 150 150 150 
##$DBP07= 0
##$DBPNAM0= <>
##$DBPNAM1= <>
$$ [...]
##$SUBNAM7= <"">
##$SUBNAM8= <"">
##$SUBNAM9= <"">
##$SW= 20.6930455092707
##$SWIBOX= (0..15)
0 0 3 0 0 0 0 0 0 0 0 0 0 0 0 0 
##$SW_h= 5175.983436853
##$TD= 65536
##$TD0= 1
##$TE= 295.16
##$TE2= 300
##$TE3= 300
##$TEG= 300
##$TL= (0..7)
0 120 120 120 120 120 120 120 
##$TP= (0..7)
150 150 150 150 150 150 150 150 
##$TP07= 0
##$TPNAME0= <>
##$TPNAME1= <>
##$TPNAME2= <>
##$TPNAME3= <>
##$TPNAME4= <>
##$TPNAME5= <>
##$TPNAME6= <>
##$TPNAME7= <>
##$TPOAL= (0..7)
0.5 0.5 0.5 0.5 0.5 0.5 0.5 0.5 
##$TPOFFS= (0..7)
0 0 0 0 0 0 0 0 
##$TUNHIN= 0
##$TUNHOUT= 0
##$TUNXOUT= 0
##$USERA1= <user>
##$USERA2= <user>
##$USERA3= <user>
##$USERA4= <user>
##$USERA5= <user>
##$V9= 5
##$VALIST= <valist>
##$VCLIST= <CCCCCCCCCCCCCCC>
##$VD= 0
##$VDLIST= <DDDDDDDDDDDDDDD>
##$VPLIST= <PPPPPPPPPPPPPPP>
##$VTLIST= <TTTTTTTTTTTTTTT>
##$WBST= 1024
##$WBSW= 4
##$XGAIN= (0..3)
0 0 0 0 
##$XL= 0
##$YL= 0
##$YMAX_a= 318900
##$YMIN_a= -280762
##$ZGOPTNS= <>
##$ZL1= 120
##$ZL2= 120
##$ZL3= 120
##$ZL4= 120
##$ABSF1= 16.522
##$ABSF2= -4.171173
##$ABSG= 5
##$ABSL= 3
##$ALPHA= 0
##$AQORDER= 0
##$ASSFAC= 0
##$ASSFACI= 0
##$ASSFACX= 0
##$ASSWID= 0
##$AUNMP= <proc_1d>
##$AZFE= 0.1
##$AZFW= 0.1
##$BCFW= 0
##$BC_mod= 0
##$BYTORDP= 0
##$COROFFS= 0
##$CY= 12.5
##$DATMOD= 1
##$DC= 0
##$DFILT= <>
##$DTYPP= 0
##$F1P= 14.0000005364418
##$F2P= -0.99999901652339
##$FCOR= 0.5
##$FTSIZE= 32768
##$FT_mod= 6
##$GAMMA= 0
##$GB= 0
##$INTBC= 1
##$INTSCL= 1
##$ISEN= 128
##$LB= 0.3
##$LEV0= 0
##$LPBIN= 0
##$MAXI= 10000
##$MC2= 0
##$MEAN= 0
##$ME_mod= 0
##$MI= 0
##$NCOEF= 0
##$NC_proc= -6
##$NLEV= 6
##$NOISF1= 0
##$NOISF2= 0
##$NSP= 0
##$NTH_PI= 0
##$NZP= 0
##$OFFSET= 16.522
##$PC= 1
##$PHC0= -86.8584
##$PHC1= 14.17064
##$PH_mod= 1
##$PKNL= yes
##$PPARMOD= 0
##$PSCAL= 4
##$PSIGN= 0
##$REVERSE= no
##$SF= 250.13
##$SI= 32768
##$SIGF1= 0
##$SIGF2= 0
##$SINO= 400
##$SIOLD= 32768
##$SREGLST= <1H.DMSO>
##$SSB= 0
##$STSI= 32768
##$STSR= 0
##$SW_p= 5175.98343685301
##$SYMM= 0
##$S_DEV= 0
##$TDeff= 65536
##$TDoff= 0
##$TI= <Analysis number 999999
Compound Code 99
Book Reference 9
Project Code 9>
##$TILT= no
##$TM1= 0
##$TM2= 0
##$TOPLEV= 0
##$USERP1= <user>
##$USERP2= <user>
##$USERP3= <user>
##$USERP4= <user>
##$USERP5= <user>
##$WDW= 1
##$XDIM= 32768
##$YMAX_p= 489349630
##$YMIN_p= -1347147
$$ End of Bruker specific parameters
$$ ---------------------------------
##NTUPLES= NMR SPECTRUM
##VAR_NAME=  FREQUENCY,     SPECTRUM/REAL,   SPECTRUM/IMAG
##SYMBOL=    X,             R,               I
##VAR_TYPE=  INDEPENDENT,   DEPENDENT,       DEPENDENT
##VAR_FORM=  AFFN,          ASDF,            ASDF
##VAR_DIM=   32768,         32768,           32768
##UNITS=     HZ,            ARBITRARY UNITS, ARBITRARY UNITS
##FACTOR=    0.157963299565203, 1,           1
##FIRST=     4132.6476996994, 0,             0
##LAST=      -1043.33573715361, 0,           0
##MIN=       -1043.33573715361, -1347147,    0
##MAX=       4132.6476996994, 489349630,     0
$$ Real data points
##PAGE= N=1
##DATA TABLE= (X++(R..R)), XYDATA
$$ [...]
23927C11880l02865k58614p3541P5315M8577J48710L72494P242j78769r5299M7400
23916A02530j46992L9257R4030j9198j40930J20626m4637j6823K56882M7506p6691
23905B15560j70768p8389J58069o6653p4187K05244j58868n5372o1153j2366K35387
23894A36504L7548L4042J76034j82703j79719j52200l63114J15760L35575J74888
23884A32615l6139j44817K1219K7027j73891m3706M62244n7286j80523P3827q1102
23873e32k05822j38998J05094Q2369J953k1142l7782L7825J23179J57339j04357
23862h74J37693l5976j71176j0781O2041J29905j3675j80121l74426n9826J41242
23851c75974J84670j16007j82556O8817K34351K92971o1675k09758N1540J41077
$$ y = [311880, 9015, -249599, -323140, -247825, -199248, -50538, 321956, 329198, 150429, 55130, 102530, -44462, -5205, 88825, 69627, -71303, 49323, 4686, -12137, 244745, 292251, 215560, 44792, -33597, 124472, 57819, -16368, 188876, 30008, -25364, -86517, -98883, 136504, 174052, 208094, 384128, 201425, 21706, -130494, -493608, -377848, -42273, 132615, 96476, -48341, -27122, -95, -173986, -217692, 244552, 187266, 6743, 80570, -532, -206354, -345352, -240258, -157889, -155936, -177078, -214860, -177035, -53856, 103483, -874, 136819, 100843, -70333, -81114, -19073, 110832, 97157, -82964, -457390, -517216, -375974, -191304, -307311, -489867, -421050, -186699, 106272, 44597, -165161, -113621, 27456]
23841B7456M1855j08145j94160N2476K18361K80480j00384l36920j92662p6436
23831c88079p3999J71084L7092R6648O9631J53981M7186k7943j23652q5102O1846
23820f1307J46930P3736J12729K09883l97300l58491j35240o4319l0148N2284
23810d51243L4509M3784K71558J91594k04594j88936J09559Q1954L00372p71m59448
23799b71662P3454K22403J00155L0838Q4352j51795K49718k4243k48613Q3160
23789A47767j38023q6122p9704l3945J19842M9763J23037J61212r1291j55328
23779A7208k266K49920j33948l82923j9743J68194k28739r4693k1534J08001p1133
23768d11656L69786L07985l0073k64697j53176q462J04211o522j28262J06282
$$ y = [27456, 69311, -38834, -232994, -180518, 37843, 318323, 217939, -118981, -311643, -388079, -462078, -290994, -253902, -157254, -87623, 66358, 113544, 85601, -38051, -123153, -61307, 85623, 159359, 272088, 481971, 84671, -273820, -409060, -473379, -503527, -451243, -416734, -372950, -101392, 90202, -114392, -303328, -193769, -111815, 188557, 187786, -271662, -198208, 24195, 124350, 155188, 239540, 87745, 337463, 313220, 64607, 147767, 9744, -76378, -156082, -190027, -70185, -20422, 102615, 263827, 172536, 17208, 14942, 264862, 130914, -252009, -271752, -103558, -332297, -426990, -448524, -340523, -411656, -41870, 266115, 236042, -28655, -181831, -190293, -86082, -92604, -220866, -114584]
23758a14584O2647j67642k75719J27126J30459K26373M1114j92076J33024j45736
23748a75014o9291J70229M6428j5093K0337J25385M0328k14405j48990K44747
23738B4661M3184J18171L40633q8809k29930j72285o1884j85201j53871r7945
23728d63276J75953j0439J253K40368J09810J12570k40202q2506k56973J78192
23718b35250J75634K18201J21236j28344n9629j25076j69375o5936j00347Q421
23708c60465J85377j84632K45084K08642J2036j10292k8076j17528j25811r3544
23698c69209j9000l2269J35228J08384J00901k31083j1473J84131n4474l02566
23688d91430K488L3222j4701k9657k5115L5641l6844k381L25352r228j05388o5433
$$ y = [-114584, -51937, -219579, -495298, -368172, -237713, -11340, 29774, -162302, -29278, -175014, -244305, -74076, -27648, -42741, -22404, 102981, 143309, -71096, -220086, 24661, 67845, 186016, 526649, 437840, 207910, 35625, -26259, -211460, -365331, -463276, -287323, -297762, -296509, -56141, 53669, 166239, -73963, -156469, -413442, -235250, -59616, 158585, 279821, 151477, 91848, -33228, -202603, -268539, -368886, -360465, -175088, -359720, -114636, 94006, 106042, -4250, -32326, -149854, -275665, -369209, -388209, -420478, -285250, -176866, -75965, -307048, -318521, -134390, -188864, -491430, -488942, -455720, -470421, -500078, -525193, -489552, -526396, -528777, -203425, -212653, -318041, -383474]
23676c83474o9370K95953R7567j19280o0937J376J22175p0229l67190j3485K11602
23665c55292J37222K02583R188o6345j905k00265j64245q4664j7627L46521R6510
23654i8319m9004M30815L7515l16841J83946R8369K0177l8186k36973j62340J23684
23643g157L20051q5521p8104k17658j05244O7971K0275m0225K10595K50456l00199
23632C5240j27462N6166L05562l2439n4593j25171l526R2558J3083N4441M5703
23621B59562j94686K8652n0365m5296K1139J17280P424k43296l11430M0921K80693
23610h9402K15791J1474K74574m514q8881j20030j03282p7925l1709M7356N278
23599C8730l3902r8036j45371M9319M8163J86364k07392o2770j34301J77304J07782
$$ y = [-383474, -452844, -156891, -59324, -178604, -239541, -238165, -115990, -186219, -553409, -566894, -355292, -218070, -15487, -6299, -72644, -74549, -274814, -439059, -523723, -541350, -194829, -98319, -147323, 283492, 321007, 4166, 188112, 286481, 306658, 268472, 31499, -130841, -7157, 312894, 227373, 149269, -68389, -173633, -105662, -85387, -125612, 84983, 335439, 35240, -92222, -36056, 269506, 237067, 182474, 57303, 53777, 146335, 159418, 213859, 259562, 64876, 93528, 43163, -2133, 19006, 136286, 143710, -99586, -411016, -370095, -89402, 126389, 137863, 412437, 407923, 319042, 199012, 95730, 17805, -13904, 33452, 38730, 4828, -93208, -238579, -189260, -141097, 45267, -162125, -224895, -359196, -181892, -74110]
23588g4110J48133k1877J10930j00047o5742p8304k61609n8435M1163Q0095K1621
23577b58182R9902K20236k51099P6503J90796K31473K00811k31918m16580j18321
23567b56379j69542j48326J35521k37764k22745J16855K19273J76493J33584K04498
23557d8532j4336R3958Q2921M6554J42929J52445j22657k38057o4613J33776j35511
23546B8877l7115q7543L8669K78865k7098K589p3512j21783k26535P969K95623
23535G9006R1861l73775r6138L2851M55279K20737n797j38786k20315M4751q44
23524H8830K72154M0190j95036j02381o1098J5779q6134L6395O7250l72766j57977
23513d54794k99108J47993L02384K13432M6345n101Q4125J91095P3789k55019
$$ y = [-74110, 74023, 52146, 163076, 63029, -2713, -81017, -342626, -401061, -359898, -279803, -258182, -158280, 61956, -189143, -112640, 78156, 309629, 510440, 278522, -138058, -256379, -425921, -574247, -438726, -676490, -899235, -782380, -563107, -386614, -253030, -48532, -62868, 31090, 114011, 160565, 303494, 455939, 333282, 95225, 30612, 164388, 28877, -8238, -95781, -57112, 221753, 194655, 197244, 123732, 1949, -224586, -216617, 79006, 170867, -202908, -299046, -266195, 189084, 409821, 404024, 265238, 44923, 89674, 88830, 360984, 401174, 206138, 103757, 42659, 58438, -27696, 8699, 75949, -296817, -454794, -753902, -605909, -303525, -90093, -43748, -48849, 35276, 226371, 300160, 45141]
23503D5141l72933q3830j05059j79110j20381N97828K87839J82074j43965q0283
23493B7321l7107l26113j50335L5509J27974k8500j20335j73195J92162J69848
23483b82771P4475J15508j38895K1406O838j74526J65854J07816K33450k60582
23473a31427j75593R0185m5459O9650P5317k0933P6819r0944l2359p3043j2574
23462b70361j81693Q3371k7020J49193J90513j0543l806k38227k41369P1459J45693
23451c32790J28300j30352j29524J23460J61047M03067K6601j97312j93038k14502
23441c55043L1364l9607O884J72650N5479O5632J42366P1186M0308R7339n3784
23430B34774o0081J56551r3514k49128M656J40184M9066P3257J09763K877j28527
$$ y = [45141, -327792, -411622, -516681, -695791, -816172, -218344, 69495, 251569, 107604, 27321, -9786, -335899, -486234, -450725, -322751, -351251, -471586, -644781, -452619, -282771, -208296, -92788, -231683, -210277, -203439, -377965, -212111, -104295, 129155, -131427, -307020, -216835, -262294, -192644, -117327, -138260, -61441, -152385, -184744, -257787, -270361, -452054, -368683, -395703, -246510, -55997, -66540, -70346, -308573, -549942, -478483, -332790, -204490, -334842, -464366, -340906, -179859, 223208, 249809, 52497, -140541, -355043, -323679, -363286, -356402, -183752, -128273, -62641, 79725, 150911, 191219, 288558, 234774, 174693, 331244, 237730, -11398, -6742, 133442, 182508, 255765, 365528, 368405, 239878]
23419B39878o2951j79430j73988j30893J5100N3422J07210k06k83903J19687P2670
23408b23404J17133r7939O339K3681N9574L4714K8222k80280j69333K24527Q941
23397b67825j37345J98042J79320k97258Q142K32957P4672N5826N9270R581R3724
23386B09106l4277j58976K25005J03939p0806m08457k67213J09777J65982L8634
23376h7286l8467k03528J51253J12398J8464j83206j60810Q2232k8402J1442M2715
23365b83195j65134p5862K39456k372J11088p687J20171j11750N0488K93873l5058
23354A34018m72996j65358J2954q8017J78498n698o6900K02576J73811k5251k16602
23343c38965J91588J08660P4890j28978j1751j16189j42179j26031P5125K85015
$$ y = [239878, 176927, -2503, -176491, -307384, -292284, -238862, -131652, -131858, -415761, -296074, -223404, -106271, -204210, -197871, -174190, -114616, -79902, -51680, -331960, -501293, -276766, -267825, -405170, -207128, -27808, -325066, -316924, -83967, -9295, 46531, 105801, 115382, 209106, 174829, 15853, 240858, 344797, 273991, -134466, -401679, -291902, -125920, -87286, -125753, -329281, -178028, -65630, -47166, -230372, -391182, -308950, -337352, -325910, -283195, -448329, -524191, -284735, -287107, -176019, -183706, -63535, -175285, -124797, 169076, 134018, -338978, -504336, -491382, -579399, -400901, -406599, -473499, -270923, -97112, -122363, -338965, -147377, -38717, 36173, -92805, -104556, -220745, -362924, -488955, -413830, -128815]
23333a28815N4265k55185K518R2675k14279p1471Q0358L6351J2998n3189j42163
23322e85937j05944K76952L17860K65761J86216k05732K66013j6646k9003j22222
23312B47318q3051j83584j00912m3257O8924j42545j64860Q7185O5655J31085
23302a18042L1745N5800k38850j83304J17055j5940k6897J79927P7562P203N0215
23291f3526L993m06061l44920O4754L08529j09758n1473J7102L53619K47293q6058
23280f6506p8006k14511J50132L62696j52407J04832J23024N9953l14832r4397
23270a20022L6246R9246j93245o1075K65001O6704J32755r6712j56034j86538
23260b13674j3870M9674m9153m6838J1185J3885J44330K48016L52898J34122l17045
$$ y = [-128815, -74550, -329735, -327217, -234542, -448821, -520292, -439934, -403583, -390585, -443774, -585937, -691881, -414929, -97069, 168692, 354908, 149176, 415189, 398543, 369540, 247318, 164267, -19317, -120229, -163486, -94562, -237107, -401967, -314782, -249127, -118042, -86297, -30497, -269347, -452651, -335596, -351536, -378433, -198506, -120944, -113741, -63526, -59533, -465594, -810514, -745760, -437231, -546989, -598462, -581360, -227741, 19552, -66506, -144512, -359023, -208891, 153805, 1398, 106230, 229254, 289207, -25625, -120022, -83776, 15470, -177775, -238850, 26151, 92855, 225610, 128898, -27136, -213674, -227544, -177870, -227023, -273861, -262676, -248791, -104461, 143555, 496453, 630575, 313530]
23249C13530l12988k14102j11431N2022Q7340k2343Q78J27742J8155p1194M3461
23238h8930K22003K66760j70856r805q7090j25206R7225l6589j88502j47476O6646
23227b01820P2913j61274K42797J65007m7841p6744Q0252o0318j40377j25083
23217b52488q2531P1068j53957j35063J66256k8576P9983j12444K54280J39047
23207e4425r2067q3124K30639K25437L1763j32939m7037k64022q0495L38140J82583
23196B54453j73695p4160r3827j27109P74K29064q2866l44903O04k268O5523j28850
23184d77260k30378L33575K24580l9639N8172O4408l04096O6221J25259J45668
23174c3490K07981j08074k4022r4048j17021l6837j2254L41441o6340r3105J62123
$$ y = [313530, 542, -213560, -324991, -272969, -185629, -207972, -207094, -79352, -61197, -132391, -88930, 133073, 399833, 228977, 219172, 132082, 6876, 104101, 67512, -120990, -268466, -201820, -128907, -290181, -47384, 117623, 69782, -6962, 73290, 12972, -127405, -252488, -335019, -263951, -417908, -552971, -386715, -415291, -335308, -447752, -193472, -54425, -146492, -229616, 1023, 226460, 258223, 125284, 78247, -185775, -266270, 71870, 254453, 80758, 6598, -87229, -214338, -213564, 15500, -67366, -412269, -411665, -413933, -348410, -477260, -707638, -374063, -149483, -189122, -130950, -66542, -370638, -304417, -179158, -33490, 174491, 66417, 42395, -51653, -168674, -205511, -217765, 123676, 57336, -35769, 126354]
23163A26354l31047m02296K9471K44589K04528J09904O471j11304M763q481J6515
23152a10533m7053r2657J34292K11526K36378J79582j64044l83060J45570j16770
23142f769p7572p9404L7507J18908J81772J76251q2084k42310q9028k74899J5848
23131c21780L8121m2849n1167N8796Q0298j29315L1512j5644L3402J74699P7029
23120f6898n1108j14276k37142j60634L60849J31946j13532l4380k20964J23068
23110c83071l6156q2290j16787M7655J76874J76089m6784n6435Q2336q6045K73487
23099e1127K05285O7573k22074k17377j48550J6041L5972K4081k20681M8408J06410
23088c56039r127j73777Q7781Q0490k06877q5037J57317P3213P5900k037M9443
$$ y = [126354, -204693, -606989, -577518, -332929, -128401, -18497, -12026, -123330, -118567, -127048, -110533, -157586, -250243, -115951, 95575, 331953, 511535, 347491, -35569, 110001, -6769, -84341, -163745, -126238, -7330, 174442, 350693, 268609, 26299, -62729, -337628, -321780, -283659, -326508, -377675, -318879, -238581, -367896, -336384, -352028, -318626, -143927, -66898, -118006, -232282, -469424, -630058, -269209, -137263, -250795, -285175, -506139, -383071, -419227, -501517, -618304, -570649, -393775, -217686, -264470, -320905, -238569, -324614, -51127, 154158, 221731, -343, -217720, -366270, -350229, -314257, -290176, -510857, -462449, -356039, -365166, -538943, -451162, -370672, -577549, -662586, -505269, -432056, -356156, -358193, -308750]
23077c08750j39391k01043j4953K80316K79755J03920J11876J34565j48652k82258
23067a84615j95027P1694k97991j51088L47428K48236K32481L06100O1899k46424
23057A92693k9752K3417j78352j93452J08028P4594O3038k67198j77627q866p2902
23046d66379R1772J01379J74372O690j78415J31606N683J46699N4034J92974j11903
23035A48512j94974J5611r0187J40992j18690j23242j27240k837J31355m8966
23025b69666J99094R213J70619P4934j02776m1373L4650j15792r3158K03928J41335
23014B11008p8123j54015k14774l8166P9208J17497P5585R5892J36523j34775
23004I5860j23609l48052J95092M8062j2428j71791j42435l746j69854j02539
$$ y = [-308750, -448141, -649184, -664137, -383821, -104066, -146, 111730, 246295, 97643, -184615, -379642, -307948, -605939, -757027, -409599, -161363, 71118, 377218, 439117, 192693, 162941, 186358, 8006, -185446, -77418, -2824, 60214, -206984, -384611, -393477, -466379, -374607, -273228, -98856, -92166, -270581, -138975, -133292, 13407, 67441, 260415, 148512, -46462, -30851, -121038, 19954, -98736, -221978, -349218, -352055, -220700, -269666, -70572, -61359, 109260, 184194, 81418, 40045, 74695, -41097, -134255, 69673, 211008, 132885, -21130, -235904, -274070, -194862, -77365, -1780, 94112, 230635, 95860, -27749, -375801, -180709, -132647, -145075, -316866, -459301, -463047, -632901, -735440]
22994g35440q8583K11940J56512K0577J77568J85534L7308j34231o3281J96401
22984c5695j97008r0470J64666J38950k6643J1123J93205l39457l04621j94747
22974f80697J58310J24925J53709J79868J80723k01662l45679J43243p7008p0078
22964d34346L45768K28721k65693j06626k3968k5909L6069j34278k45306k0582
22954f46150J50084L13882J20476k30926J08989J9107R6725J61714K68366J34043
22944D96310k43214l5770j28015l61211n0067K14578J32466P6718K22154J17312
22934D41261l1654k64057j74643k33148M5953K20323L40219n6594o7768J46481
22924C66373j27859m415j21534k59001q136K40714n5583Q0554q0453P0725j14357
$$ y = [-735440, -824023, -612083, -455571, -434994, -257426, -71892, -34584, -168815, -232096, -35695, -232703, -323173, -158507, -19557, -46200, -35077, 158128, -181329, -485950, -680697, -522387, -397462, -243753, -63885, 116838, -84824, -430503, -287260, -364268, -434346, -88578, 140143, -125550, -232176, -256144, -282053, -245984, -380262, -625568, -646150, -496066, -182184, -61708, -292634, -183645, -164538, -67813, 93901, 362267, 496310, 253096, 217326, 89311, -271900, -321967, -107389, 25077, 101795, 323949, 441261, 409607, 145550, -29093, -262241, -216288, 4035, 344254, 287660, 219892, 366373, 238514, 234099, 112565, -146436, -154572, 86142, 30559, 111113, 30660, 101385, -12972]
22913a2972j14409L3145R4182J58449J2968q7079j56285q9917J82834K09678j57897
22902G2697O7996o3444j58163P361k008P5393k71222j50207p662r9600o6560Q8267
22890e07152J77074K72208k0798k49495j40602l13737m5426L37221L18801q5953
22880b57859O0345J07546k92537J361p7372l9411K05492j12058j09534J37566
22870c76461J21774J9389M5968j7852O6249N3430j19400j28566J04911J69595
22860f0963J6688m7024K00534J9550j57611k15366J58510n2018N6644j00492R668
22849a71880J38169k14954p2089K83603J6831r7901Q8859j01195j8400j28202
22839b77159J65476L95508k8270k72643j83663J81620k64195l78377K89430M39005
$$ y = [-12972, -127381, -94236, -54, 158395, 171363, 84284, -72001, -161918, 20916, 230594, 72697, 140693, 77249, -80914, -73553, -75561, -168, -271390, -421597, -429259, -528859, -595419, -507152, -330078, -57870, -78668, -328163, -468765, -782502, -827928, -490707, -171906, -257859, -197514, -89968, -382505, -381144, -458516, -497927, -292435, -404493, -514027, -376461, -254687, -235298, -189330, -207182, -140933, -87503, -206903, -335469, -230558, -60963, -44275, -91299, 109235, 128785, -28826, -244192, -85682, -137700, -81056, -181548, -171880, -33711, -248665, -320754, -37151, -20320, -118221, -29362, -130557, -148957, -277159, -111683, 283825, 255555, -17088, -200751, -19131, -283326, -661703, -372273, 66732]
22829F6732l2182n3290k10037k72023r4758K6593K36039K51509J10731q4183l62023
22818d16892j78819J74174l0145O6507K50313K5632l338n9501j62691L070P4013
22807b57677j10143j97693J44147J03416l3194K54148J03012J24689o9405j31180
22797f9880Q2000k18941k17049q8459N2882J77148l9023L01219l29309l9239k0739
22786d09390J14493P6728O0356l0661n8518j04451r4360O8038K48146p517j06039
22775b43175k97764k24432J25285J62853O184R5050J41093o0276k1202l35758
22765f52142k63776j37724L20775J78208J69006k3368K14167J86054M10437Q8681
22755D90318k31512k59308k13735j35112n1314j75342j00394K06770L9190j92319
$$ y = [66732, 34550, -18740, -228777, -500800, -595558, -568965, -332926, -81417, 29314, -54869, -416892, -595711, -421537, -451682, -385175, -134862, -109230, -112568, -172069, -334760, -331690, -257677, -367820, -565513, -421366, -317950, -351144, -96996, 6016, 130705, 61300, -69880, 12120, -206821, -423870, -512329, -459447, -282299, -321322, -20103, -349412, -388651, -409390, -294897, -218169, -157813, -188474, -246992, -351443, -445803, -377765, -129619, -137136, -243175, -540939, -765371, -640086, -477233, -471049, -375999, -234906, -295182, -316384, -652142, -915918, -1053642, -732867, -554659, -385653, -409021, -194854, -8800, 401637, 490318, 258806, -502, -214237, -349349, -400663, -576005, -676399, -469629, -430439, -622758]
22745f22758j01720K25129L08922n053l1839J88533m8609J10028O7155j41734
22735e1946J02222j85971j55145N3922J06251J34099j1376K9645j51416k03128
22725c32843q3000l609K45195o8574J25953K63761j72274o4785k44361l29400
22715f63937K61202K68777m9924p5328L6822Q0277k8723j69554M8869K00251P4906
22704a6362k65139n2802p0909p7787M6463J83305P2328Q19K35499j12767P4321
22693A6969k9737k51615j54078j52843j35967J25929Q3177P7620l2417J74098
22683b78864Q7629j3882O2850o5841j31789O1017j8075Q6683K24758J02335j53351
22672c6530k60247j90042j12677J83697J22642j30852J05400K130n6729K31427
$$ y = [-622758, -724478, -499349, -190427, -195480, -227319, -38786, -87395, 22633, 89788, -51946, 50276, -135695, -290840, -236918, -130667, 3432, -7944, 21701, -129715, -332843, -415843, -419452, -174257, -242831, -116878, 146883, -25391, -90176, -334537, -663937, -402735, -133958, -183882, -259210, -222388, -142111, -170834, -340388, -291519, -91268, -16362, -281501, -334303, -405212, -482999, -436536, -253231, -180903, -180084, 55415, -57352, 16969, -12768, -264383, -418461, -571304, -707271, -581342, -498165, -420545, -452962, -278864, -191235, -205117, -142267, -208108, -339897, -278880, -296955, -210272, 14486, 116821, -36530, -296777, -486819, -599496, -415799, -293157, -424009, -318609, -316479, -373208, -141781]
22662a41781J27277j81812j87648K18915R0819j02839J24170n0553j16420l67784
22652e87656n6295L76553J64698k53861q047J49462K22920K87495R6924q1042
22642C11151j5827K9045j98330o5149j0519Q3640N9701O5057o517m8968k83143
22631g9859j04353K72083j18044m1442m4932q8142o5926N8129N2684j23016P2741
22620b10077K18500l02821k57586K73084j7211j51237J0453K96987j5655P8480
22610g7083Q5319k55477r5239J01485J13100p197j01200k59410j57193J8582J10527
22599e23786K00714K23965Q9812r7916K07074j61311j41035J0731M3776O1380
22589h6596k8014j77649J93744O9305O4869j71695P1001N6316Q4525r3744P534
$$ y = [-141781, -14504, -196316, -383964, -165049, -74230, -177069, -52899, -103452, -219872, -587656, -643951, -267398, -102700, -356561, -364608, -215146, 7774, 295269, 392193, 311151, 295324, 324369, 126039, 60890, 50371, 134011, 193712, 258769, 252252, 203284, -79859, -184212, 87871, -30173, -71615, -116547, -204689, -270615, -212486, -159802, -282818, -210077, 8423, -294398, -551984, -278900, -296111, -447348, -436895, -139908, -155563, -77083, 8236, -247241, -342480, -240995, -127895, -135092, -236292, -495702, -652895, -634313, -523786, -323072, -99107, -9295, -107211, 99863, -61448, -202483, -191752, -147976, -86596, -114610, -292259, -98515, -29210, 35659, -136036, -65035, -8719, 75806, -17938, -10404]
22578a0404R149J17552J86674N8218l02160j70143L0065K42941n1315j18073k15950
22567b23446l4258j5961l3228o9029J42301q8536r480J26614N5062J53689p579
22556c851j44928j20875R184n3406n3353O5418q3652j1211K7439P0371K12839
22545h6025L05093J67490k5249l9158o0390k33463J60493J33480j54032k96722
22535a28483j25797k4629N9000K99618J77837J89415K2117j40023j96821k43780
22525a11546j0811P0621O043J13148J00941j27587k14905M8204J12639r0033q1405
22514a84691R4499J7395j61860P2411R3785J50277j0189k40512m35950Q1739j0224
22503e33320K38966J22013K26828l4964o5665k51277n1216R457j90813k0739r5997
$$ y = [-10404, -1255, 116297, 302971, 361189, 59029, -111114, -81049, 161892, 110577, -7496, -223446, -257704, -273665, -306893, -375922, -233621, -322157, -331637, -205023, -149961, 3728, -3851, -148779, -269654, -260470, -313876, -367229, -301811, -385463, -396674, -369235, -298864, -86025, 219068, 386558, 361309, 322151, 261761, 28298, 188791, 322271, 168239, -128483, -254280, -278909, -219909, 79709, 257546, 446961, 469078, 329055, 132234, -111546, -122357, -51736, -45693, 67455, 168396, 40809, -174096, -125892, -13253, -103286, -184691, -90192, -72797, -234657, -162246, -68461, 81816, 71627, -168885, -604835, -523096, -533320, -294354, -172341, 54487, 19523, -46142, -297419, -348635, -339178, -529991, -550730, -646727]
22492f46727n6441P5169J82033J50917L98885m7778j87271k29220j62775J22548
22482d00660K55378K43682j08003j85393P3339J59725j03492k23692j1106K04391
22472i5831J66794j26249k06297j10890n2664L4548J06376K70052J1293K05308
22462B02440r0452j94330n8518j61858J75430k4827L788q9705J78021J21738j07888
22451d6161J45033J39985k52369Q953l2639k32076j67825R7360J02251K68103
22441C0615K65512R6607M8245k29218m57985j97814o0012J60526L7960k82555
22431e88119O6280J28225L33700K23973j07808k14584j21306k86754j20086K97991
22421c88488K06839K66105Q4504k2384k1787j2999k20790l34683k43842m2413
$$ y = [-646727, -703168, -627999, -445966, -295049, 103836, 56058, -131213, -360433, -523208, -400660, -145282, 98400, -9603, -194996, -121657, 38068, -65424, -289116, -300222, -95831, 70963, -55286, -261583, -372473, -425137, -390589, -284213, -14161, -2868, 202440, 111988, -82342, -140860, -302718, -127288, -152115, -148327, -238032, -60011, 61727, -46161, 98872, 238857, -13512, -4559, -37198, -269274, -437099, -339739, -237488, 30615, 296127, 392734, 440979, 211761, -246224, -444038, -504050, -343524, -305564, -588119, -521839, -393614, -59914, 164059, 56251, -158333, -279639, -566393, -686479, -388488, -181649, 84456, 168960, 146576, 124789, 111790, -109000, -443683, -687525, -729938]
22411g29938Q4133R5680M80306M5116j05670m9280K9343j29173r197J46461o5954
22400b08173j09210J28272j94402n6323r734J00054l61L12482M3907m427j89843
22389a87758k77580N0934K03114j39527k5321J15529k8155J29796q6005R9331
22379a45642J3423J58712K43202m2523n198k6638J31135R5311k69782l67051m8117
22368b63168r8236J0632R1996j72407J95222r0829j27268M0644j30068j70529
22358g14011j09105J06692J07553L9554j32074P5862M36118K83797J55177l16460
22348f6897j39520k40924J78794J46557k13538p4754j8525J41249J09897k4719
22338b02380q6197P8628l0114j6001o2293j19341j161M52543J18959j4479O3068
$$ y = [-729938, -645805, -550125, -69819, -24703, -130373, -179653, -150310, -279483, -288680, -142219, -208173, -317383, -189111, -383513, -439836, -449570, -349516, -349877, -37395, 6512, 2085, -187758, -465338, -414404, -211290, -350817, -376138, -260609, -288764, -158968, -244973, -145642, -132219, 26493, 269695, 227172, 221974, 195336, 326471, 421782, 152000, -215051, -263168, -361404, -350772, -258776, -431183, -235961, -326790, -454058, -413414, -543482, -714011, -823116, -716424, -608871, -569317, -701391, -625529, -189411, 94386, 249563, -66897, -206417, -447341, -268547, -121990, -335528, -410282, -428807, -287558, -177661, -202380, -288577, -209949, -240063, -256064, -318357, -437698, -438859, 13684, 132643, 118164, 181232]
22327A81232p2690j18664k6654k40035L0949P4381Q6629j84874N3311J35252j66603
22316b47766j63943m3797J5969P128K73065J91532p4663l7813j40727L2423K23048
22305C4456K77o45M3296r1943K9147L24230m7633k58575O1043o7010m78213J24538
22293c27032K84043j94317k24735L3180J09236o0167p3385L24499J17690M1508
22283C0520K80564j5110k72767m55708Q340J67316K59088j58706N5230o8990J44197
22272b6026J59085m1462M1681n7601J5924J96579k30457N9012l7027R778J6210
22261A05696k36798O4793l5853k48429j43713j26566J6599j1567q293m7893Q785
22250f63239J37836J41724O4124K95774N6473j77229r9785j77412O1964J08454
$$ y = [181232, 108542, -10122, -36776, -276811, -245862, -171481, -84852, -269726, -216415, -81163, -247766, -411709, -455506, -439537, -432409, -159344, 32188, -42475, -80288, -221015, -188592, 34456, 34733, 34088, 77384, -14559, 14588, 338818, 291185, 32610, 93653, 26643, -451570, -327032, -42989, -237306, -462041, -428861, -319625, -379792, -453177, -128678, -10988, 30520, 311084, 295974, 23207, -432501, -424161, -256845, 2243, -156463, -101233, -170223, -26026, 133059, 91597, 133278, 75677, 91601, 288180, 57723, 116735, 79708, 89486, 105696, -131102, -66309, -102162, -350591, -494304, -620870, -604271, -615838, -624131, -672024, -663239, -525403, -383679, -319555, -23781, 32692, -144537, -244322, -421734, -359770, -251316]
22240b51316J12904m5410R6263Q0516J81152k15375j9244N8279P7457k5791L1980
22229H1415k00373k26328K73153J33765J54376J67085j4070j43580n2170l1982
22219A41291j16358j50623Q2100j36642k05985P1744J71185j05824j65956j27128
22209e42196j53661K58594J20060P9664P725P7904j15851N975l4883M2850J17658
22198a36161n6202J51538L6611L0851r5392M7803l6259k27001j10923L1476P632
22187c56027K34021J84759q6400k60498P4650J61595N7535O325j20186j182r2057
22176a97465r555j38488R7450J81459K1130j52030J24817k37826k40897K83186
22166b68219O8258k94177n3044K93589L8680o4950o5345J63524K08965j33057
$$ y = [-251316, -138412, -183822, -87559, -7043, 174109, -41266, -60510, -2231, 75226, 49435, 81415, -118958, -345286, -72133, 61632, 216008, 383093, 369023, 225443, 173273, 141291, 24933, -125690, -43590, -180232, -386217, -314473, -143288, -249112, -415068, -542196, -695857, -437263, -317203, -237539, -229814, -151910, -267761, -261786, -296669, -253819, -136161, -192363, -40825, -4214, 26637, -68755, -20952, -57211, -284212, -395135, -363659, -356027, -122006, 62753, -23647, -284145, -209495, -47900, 9635, 15960, -104226, -105408, -197465, -207020, -345508, -248058, -66599, -45469, -197499, -72682, -310508, -551405, -268219, -199961, -494138, -547182, -253593, -214913, -279863, -345208, -181684, 27281, -105776]
22156a05776M207M97844O2747j70086k41967j96386j16499J84503J51031j6746
22146E2872n4553j53448r0919j90187l6128o2823J70433J45491M6126O2495J01680
22135h961P0607j78930m5239K0783M9669J42936J57362j13704k35454j02712p1253
22124c14896q5623L02438L9538L11006K1289l09618l01984M8346J32376j9925
22114a77053m8209M8679k9327J097j7625P085l9051J25984j1057k62640J75209
22103b26908M56379j41924l65581J55160N660j52398j47948l4212j77878q497
22093f38147K66306J77983k21807k10657J32005L38679L01677J25640n9331n04247
22083b91899k67944K32183J1631M7145J25446R7727J21763K60562r9588j02818
$$ y = [-105776, -101569, 396275, 459022, 288936, 46969, -149417, -265916, -81413, 69618, 52872, -1681, -155129, -246048, -436235, -472363, -535186, -364753, -219262, -173136, -110641, -8961, 61646, -117284, -162523, -141740, -92071, 50865, 208227, 94523, -140931, -243643, -314896, -400519, -98081, -58543, 252463, 273752, -35866, -337850, -289504, -157128, -177053, -225262, -176583, -205910, -204813, -222438, -215353, -254404, -128420, -139477, -402117, -226908, 229471, 87547, -278034, -122874, -117214, -269612, -417560, -451772, -629650, -638147, -371841, -193858, -415665, -626322, -494317, -155638, 146039, 271679, 212348, -291899, -559843, -327660, -316029, -268884, -143438, -45711, 76052, 336614, 237026, 134208]
22073A34208K5173m8963k41657R4501R4269p2982j25897p2168J46209J29648k11997
22062a49656j68450q312J55698j20022R6761K93918L890q6261J82340Q2693O1937
22051C44536p0904m06730k62879J8603r8305J22842K38033L3187j2875q1563R9022
22040g7033L8692q7872j1263m1961j53073q5972j0089p9684J29451L6368P5846
22029b66590L5517J15976j77519k04492p4257R6925R0443k79761J92582J88320
22019b82856K05537j9672j7070K37335J23416k71085J40265J98237j13229j87066
22009A3812j43245M5875n4544N8609O4638j6343n7846j65556O0475J19155j59874
21998b34844J8604J23748J2776k31529J06739K3428L6020n0834k23046R134J22238
$$ y = [134208, 159381, 110418, -131239, -36738, 57531, -15451, -141348, -213516, -67307, 62341, -149656, -318106, -326418, -170720, -290742, -193981, 99937, 103827, 17566, 199906, 282599, 344536, 273632, -133098, -395977, -377374, -475679, -352837, -114804, -81617, -94492, -176055, -77033, -38341, -126213, -137476, -179437, -332510, -418482, -428571, -508255, -378804, -342436, -266590, -231073, -115097, -292616, -497108, -571365, -474440, -383997, -663758, -471176, -282856, -77319, -96991, -114061, 123274, 246690, -24395, 115870, 314107, 200878, 13812, -129433, -83558, -138102, -79493, -14855, -31198, -89044, -254600, -194125, -74970, -234844, -216240, -92492, -79716, -311245, -204506, -181078, -145058, -195892, -418938, -409804, -287566]
21987b87566K10427O9505J82242J60774l74443k86361l2029K75351j47083P6932
21977a52251J10231O403j0375j17325r3934J87111j50917j27765j06533K12066
21967b43289j22628o6732K64416K52265k55745j28811q5636J95479J18492p2735
21957a44924J60753L16145j1525J10392k25682k7760L4073j94583O4241m1607
21947C9523L6400j21372j1737J07916k29405l06846N3516J15650J83918J67300
21937C4863l5185j19463k55805J96723J61766k61427J19199J58849P6053j83286
21927a07713N6653J06369j84403k50704K42615J44103O4001k4093N7490j9951
21917H4367r5883k53180m6636K51412K25617J32573m2584l02339J77524l7918
$$ y = [-287566, -77139, -7634, 174608, 335382, -39061, -325422, -357451, -82100, -229183, -152251, -42020, -35617, -45992, -163317, -257251, -70140, -221057, -348822, -455355, -243289, -365917, -432649, -168233, 84032, -171713, -300524, -386160, -190681, -72189, -144924, 15829, 331974, 320449, 430841, 205159, 177399, 211472, 16889, 81130, 39523, 75923, -45449, -57186, 50730, -178675, -485521, -432005, -316355, -132437, 34863, -322, -119785, -375590, -178867, -17101, -278528, -159329, -480, 75573, -107713, -51060, 55309, -129094, -379798, -137183, 6920, 70921, 46828, 104318, 84367, -11516, -264696, -311332, -59920, 165697, 298270, 255686, -46653, 130871, 92953]
21907I2953k71091J38495M05688r5818p35541j60382M1737Q5292M27307L31162
21897B59802m36845j22342J26076R9637m4530j68321M9629L9133N5276j65619
21887c08104r0277m6434P6914J43952p1365j18925J22660J39383L5191k1503L5284
21876a03224J6599O261q276J32148j81221j07743M4207n109O1041K8822K81209
21865A64714J76254r2198l38282k4333L0290J52405J83051O2368j23605l10898
21855a20234k70941l8337J07296M18015K49002l10233j80760p0362j14448n2244
21845c83246N1841J6773M1589j36917n6704K2288j176R9467P2238r6911l9387
21834d10145J26724R8036P6384J09830j09196m9445Q1793J93094R3998M0109j41135
$$ y = [92953, -178138, -39643, 366045, 270227, -465314, -625696, -583959, -498667, -71360, 259802, -177043, -299385, -173309, -73672, -118202, -286523, -236894, -197761, -142485, -308104, -398381, -444815, -367901, -223949, -295314, -414239, -291579, -152196, -117005, -138508, -103224, -86625, -80364, -88640, 43508, -137713, -245456, -201249, -206358, -145317, -116495, 164714, 340968, 248770, -89512, -113845, -83555, 68850, 251901, 314269, 190664, -120234, -391175, -429512, -322216, 95799, 344801, 34568, -146192, -216554, -331002, -383246, -331405, -314632, -273043, -409960, -466664, -444376, -445552, -346085, -273847, -370758, -410145, -283421, -185385, -109001, 829, -108367, -157812, -76019, 117075, 211073, 251182, 110047]
21823A10047j35497j73551J1389J15655j71804J85883L46952k74720J27627l5373
21813A06608q54N727k83842l2L5020j15184M80694K53389K14197N492l22320m35258
21801e6363j99557Q6819K19552K098l36486n228O8840R8693n1816M40821R7872
21790C65245q7314r793K6194l9296k53103m7546k0072K6572j14868J12484j01260
21779a42757j40307p5353J67883J07929K660r8714J52630j48600N6709J22689
21769D769L6145j62613J08154k28995R0551J70219n0046j53104o586J8185j26395
21758b99716j6618N7077k870J28478j56431j59672j9438L87107K15933R5802j32372
21747I7280J5814r0477K80611O6417l19113j60028J1994j90068J63241L9672k20568
$$ y = [110047, -25450, -199001, -187612, -71957, -243761, -57878, 289074, 14354, 141981, 106608, 105754, 111481, -172361, -172393, -137373, -252557, 228137, 481526, 695723, 701215, 378895, -56363, -255920, -169101, 50451, 52549, -283937, -289165, -220325, -121632, -173448, 267373, 365245, 277931, 268138, 294332, 255036, 1933, -45613, -65685, -39113, -153981, -41497, -142757, -283064, -358417, -190534, -82605, -79945, -178659, -26029, -174629, -117920, 4769, 40914, -121699, -13545, -242540, -151989, 18230, -31816, -184920, -191506, -173321, -299716, -316334, -259257, -262127, -133649, -290080, -449752, -469190, -82083, 133850, 229652, 97280, 113094, 22617, 303228, 369645, 50532, -109496, -97502, -287570, -124329, -84657, -305225]
21736c05225J33277K32293J77745j61396j7122L047K600k8255j2309P3227j07723
21725i841q9559N2601J31262J40381J36719N3849j37886j61281j09864l30477
21715c24096k40632Q7057j8930J80122K8051R0242L42062J77664o0740J17795
21705C78595n2671p0832r0057r8503k4098q2784k02021j61987M5570p4011j9778
21694d52577K02331K95922K07803q4565j94655k04050M0108P6044p5263k16506
21684d05408j42275K83046K00483j7244o9600o5731J16858J15199j55051J31196
21674h527K22980j31585j99012j97625J03766R6474K3451q5780l33233l46333
21664h55424L47068Q7849P2428L28204k1458O8303O8670J07758j68352k47682
$$ y = [-305225, -171948, 60345, 238090, 76694, 59572, 62619, 65219, 36964, 24655, 97882, -9841, -99400, -46799, 84463, 224844, 361563, 415412, 277526, 116245, 6381, -324096, -564728, -477671, -496601, -316479, -288428, -198186, 143876, 321540, 260800, 378595, 325924, 255092, 165035, 66532, 42434, -40350, -242371, -404358, -358788, -432799, -452577, -250246, 45676, 253479, 168914, -25741, -229791, -189683, -113639, -188902, -405408, -547683, -264637, -64154, -81398, -150998, -216729, -99871, 15328, -139723, -8527, 214453, 82868, -116144, -313769, -210003, -113529, -90078, -175858, -509091, -855424, -508356, -420507, -348079, -19875, -41333, 26970, 95640, 203398, 35046, -212636]
21654b12636l56114j14771K1579K20902J21451J14118j00274j09115j35684K3232
21644e27312L6633K00221J53043N1602j54322p4208L5058J03020P8200J45195
21634D7130M1101j60596j6917k93086j8661M06485J76252o4237M0058j57381l9333
21623c9185j0372R2865j90182j23699L768J72451L29191O7023k53133N2779M6579
21612A48085k9439L1437Q6511M5020L31820k31323k77940L1513l6418k49371l41650
21601d91755j7283L71370K2554r897j12671K2779N44034J25386j68486J80027
21591D66058l8669l83305p0591L06143J84992j99241k19553J14170J18563k50448
21581B8119j84431k6983J79041L759j9849q8457j05994R3763p3291J08767j0085
$$ y = [-212636, -568750, -683521, -661942, -441040, -319589, -205471, -305745, -414860, -550544, -527312, -490679, -290458, -137415, -85813, -240135, -314343, -279285, -176265, -98065, 47130, 88231, -72365, -89282, -382368, -401029, 5456, 181708, 117471, 157529, 148, -39185, -49557, 43308, -146874, -270573, -266805, -94354, 234837, 301860, 48727, 101506, 148085, 118646, 150083, 236594, 281614, 613434, 382111, 104171, 135684, 99266, -150105, -491755, -509038, -137668, -115114, -125011, -237682, -214903, 329131, 454517, 286031, 466058, 427389, 44084, -26507, 279636, 464628, 265387, 45834, 160004, 278567, 28119, -156312, -183295, -4254, -495, -20344, -108801, -214795, -121032, -194323, -85556, -95641]
21570i5641k91253J06278R0298k8513J39452j4519j52626J09590J45694K4833
21560C3593K76276m3085j9218l1043j33526j40753p0960n6307O5632P5976O1621
21549A8206J09117k55115k49267j15589K17582L21581J65843k66638J0371J07991
21539F4082m5935L27493p7571l29870J01558j44134N9754J7464o4505N8311L34090
21528C00737J62428J8428J2942j65317j68354k49874l7755j54362L8780K67809
21518B5462J74114R2757j55793j30712J49424j51199j78230P3764k2246l23527
21508d46186J26788K60847K01136j47996j98333J81027J54025j1980j26508j71761
21498a78941m38J2787j55709K23251M9055j50032Q1694K39290K5177j58667M8548
$$ y = [-95641, -386894, -280616, -190318, -218831, -79379, -93898, -246524, -136934, 8760, 33593, 309869, 266784, 247566, 216523, 82997, -57756, -128716, -185023, -119391, -43415, 18206, 127323, -127792, -377059, -492648, -275066, 46515, 212358, -54280, -43909, 64082, 18147, 345640, 268069, -61801, 39757, -104377, -44623, -27159, -91664, -33353, 300737, 463165, 481593, 494535, 329218, 160864, -89010, -126765, -281127, -242347, 25462, 199576, 292333, 136540, 5828, 155252, 4053, -174177, -100413, -122659, -446186, -319398, -58551, 142585, -5411, -203744, -22717, 131308, 119328, -7180, -178941, -179379, -166592, -322301, -99050, -49995, -200027, -118333, 120957, 146134, -12533, 36015]
21487C6015j60603k28108L9674J91719M6247J42936L9112q8354l6773r8389j42742
21476b59266O0697P7164J6028J87492j52911J3922K4742p5450k23282j27968J78799
21465b80033M1889j27788P1475q9878P1720J65050L35960Q2667j87705j16025
21455c2668j76487p5490j14027r5823J05004K944l58712Q3242L47818J17276k149
21444a99072j89492K58847J57387k8822K1465k4586j81272q7504J50908K26422
21434A04281j00201J8452L81960k7462k20151m01172K4091J48619L72792K5788
21424C26997l02048o0109K1345o0531j8336K421K04003j39078M871J29625N8944
21413A68104j3710j78166k40028p4106j28495O5912K4066J27896O8861J08674
$$ y = [36015, -124588, -352696, -313022, -121303, -75056, 67880, 106992, 18638, -18135, -116524, -259266, -198569, -121405, -105377, 82115, -70796, -56874, -32132, -107582, -330864, -458832, -280033, -238144, -365932, -294457, -384335, -312615, -147565, 188395, 271062, 83357, -32668, -209155, -284645, -398672, -494495, -389491, -386547, -745259, -662017, -314199, -196923, -199072, -388564, -129717, 27670, -1152, 20313, -4273, -185545, -273049, -122141, 104281, 4080, 22532, 404492, 377030, 156879, -244293, -220202, -71583, 301209, 326997, 24949, -35160, -13815, -74346, -92682, -90261, 113742, -25336, -20465, 109160, 168104, 154394, -23772, -263800, -337906, -466401, -400489, -376423, -248527, -179666, -70992]
21403g0992K08540r1741k92318k0584L73883K86657R9534j82814l49763j78445
21393b18043o0368K10073Q8982n6649j32831k27064M9440J8576P4716J30709k05486
21382c27945Q192J51713L11773O5031k9774Q036N1388Q6123M39519k53653m78723
21371C1680J27590K26897l75218j76113J61185J41850l6519o6962j47632k3390
21361a36632m372k72350k49252J09941L6119j59967J01146M3529N3921q121o4932
21350e50970K02762L45366K0899k80587j07848p5118J12315J07860k1375J14671
21340a32025r9589p223j72420K1024K92906L27909O1602k50433l15336j86138
21330d59723J6949K62971K61374j08184K1818n0196k34285l4417n3163J79579
$$ y = [-70992, 137548, 45807, -246511, -267095, 106788, 393445, 492979, 310165, -39598, -218043, -278411, -68338, 20644, -36005, -168836, -395900, -346460, -327884, -253168, -122459, -327945, -319753, -168040, 143733, 208764, 178990, 187026, 238414, 324537, 764056, 510403, 31680, 159270, 386167, 10949, -165164, -3979, 137871, 101352, 34390, -113242, -136632, -141004, -413354, -662606, -552665, -516546, -676513, -575367, -531838, -477917, -486038, -550970, -348208, -2842, 18057, -262530, -370378, -445496, -333181, -225321, -246696, -132025, -231614, -238837, -411257, -390233, -97327, 230582, 292184, 41751, -273585, -459723, -442774, -179803, 81571, -26613, -4795, -54991, -289276, -323693, -376856, -197277]
21320a97277J93553O7528M3625J31487J0805o6110j23191j33397j4417k02863
21310b90257N8335J09166j71015O3814J97881m6997Q56J23590J58040m5114j31380
21299B6919N7901L39339P1636J1457l5638j94614j1271j05315J11518j6434J05052
21288C60550m3072J8443k27717j61927J73947j05927J02773K17449P8488m9761
21278C63246k17108L6583L2066j73395J2112q5596J93392Q8002j07300K7313P2532
21267B41847Q5750j14212j60727n0042P8419J5680J38463k5255j55294m9384R411
21256A4656R4525P6956q6869N6017L71617P615k34643O127K07865J26526j75772
21245D64620j80910j5989J3591m3328L393J22535o3561n4796j61510J4457M11967
$$ y = [-197277, -3724, 63804, 107429, 238916, 249721, 183611, 60420, -72977, -87394, -290257, -231922, -122756, -293771, -229957, -32076, -79073, -78217, 45373, 203413, 158299, 26919, 84820, 424159, 495795, 507252, 471614, 277000, 265729, 160414, 271932, 255498, 360550, 317478, 335921, 108204, -53723, 120224, 14297, 117070, 334519, 413007, 363246, 146138, 182721, 214787, 41392, 53504, -32092, 161300, 249302, 142002, 169315, 241847, 327597, 213385, 52658, 2616, 81035, 96715, 235178, 209923, 54629, 5245, 14656, 109181, 186137, 99268, 155285, 526902, 534517, 299874, 306001, 513866, 640392, 464620, 283710, 267721, 281312, 237984, 241377, 363912, 300351, 245555, 84045, 98502, 510469]
21234E10469k26234k88510J24848J80872J43833p1118k11420j37125l54100r7562
21224d26047J87547K18469J75884k16119j12961J31819j5511J38090P6925j8879
21214A39217k65797j25411J34949J63209K6076k36427j45279Q7343O6579K59098
21204A03557K2264q1871q4238K04446o7754Q338r8869j39485J02942J67410J18842
21193B55582k07942j23459P364K43212K3687j19959J64871l4658l65378q7851
21183b44531M3590J15095L13295J57022l8896l01242k30459J05372J60337J32133
21173B11716J62531j74789k6558L8142j31926j8349p9283J25142P2754l1620J22272
21162B70032q3659m4262J09833j9507r8949J34294M82644O357l81736j76370J65907
$$ y = [510469, 284235, -4275, 120573, 301445, 445278, 374160, 162740, 25615, -328485, -426047, -238500, -20031, 155853, -60266, -173227, -41408, -56919, 81171, 158096, 139217, -126580, -251991, -117042, 46167, 72243, -164184, -309463, -222120, -155541, 103557, 125821, 43950, -40288, 164158, 96404, 104742, 5873, -133612, -30670, 136740, 255582, 47640, -75819, -68455, 174757, 198444, 78485, 243356, 208698, -156680, -244531, -200941, -85846, 227449, 384471, 345575, 44333, -186126, -80754, 79583, 211716, 374247, 199458, 172900, 211042, 79116, 60767, -18516, 106626, 179380, 147760, 270032, 186373, 142111, 251944, 232437, 133488, 267782, 750426, 756783, 375047, 198677, 364584]
21151C64584r441k07094j37759k15256k57473J91522K12989J64114k4179j18927
21141c6920j85386K5897J28649K03798K02532j69343j9667r925Q5018j7157j76581
21130C0915r0582J74584L2723j35417n1743j77196Q5032J13089m0329J38104L10517
21119C89697J2844l54020j08127K09985J7433R2753k12858J94493J73025P0000
21109D85225n1382l32283j97457r1743J03702P0641K12503q3377k14570o8501
21099a67242l938o4041L85873P6782k11229J19763J20429j55863l73438k19281
21089d92185J01616p4572j524l7264L19865K18284j62915L68452K28143j43834
21079C24066j21572k2722n8621n8672j17805M1249J42350r6730j88483J115O8638
$$ y = [364584, 355143, 148049, 10290, -204966, -462439, -270917, -57928, 106186, 82007, -36920, -222306, -196409, -67760, 136038, 338570, 169227, 149560, 139635, 224653, 207496, 30915, -59667, 114917, 147640, 12223, -39520, -216716, -131684, -18595, -58924, 79180, 389697, 402541, 48521, -59606, 150379, 167812, 260565, 47707, 242200, 415225, 485225, 433843, 101560, -95897, -187640, -83938, -13297, 199206, 115829, -98741, -167242, -171180, -235221, 150652, 227434, 16205, 135968, 256397, 100534, -272904, -492185, -390569, -465141, -466665, -503929, -184064, 34220, -128695, 239757, 467900, 324066, 202494, 179772, 121151, 62479, -55326, -14077, 128273, 31543, -156940, -155825, -87187]
21068h7187m1298K17176q2259j83273K5101o5689J3285l6693k3482l3897j39863
21057d38079k5625J12588O1560k4451L7429J21011j52092J63904Q2054r927K7319
21046d4309J37973k31106n2516o2055K0081J62842L6943L66875n7543k53338j20178
21035i6331K02306o4301m5026j65187O7887M01996K38575P0970l00521l05532
21025D836k49511p9561K5488J52288R9402P2927J78514q679j55491j20617J51052
21014G0648K19542p892j7796K6875n5833k44293j7207O6089j32195m3515n303
21003a40880J09949P7133K78612O8401j40969o1826J08186j69217j59815J8200
20993a2226l7409l5780k3962J73557Q8541J24756q9742q8464k13213j81867m6005
$$ y = [-87187, -128485, 88691, 6432, -176841, -151740, -217429, -204144, -240837, -264319, -298216, -438079, -463704, -351116, -289556, -314007, -276578, -155567, -307659, -143755, -61701, -71628, -44309, 93664, -137442, -189958, -252013, -231932, -69090, -32147, 334728, 277185, 23847, -96331, 105975, 41674, -3352, -168539, -100652, 301344, 539919, 610889, 310368, 4836, -244675, -324236, -298748, -146460, -47058, 25869, 204383, 195704, 40213, -80404, 70648, 290190, 282298, 264502, 291377, 235544, -8749, -25956, 40133, -92062, -135577, -140880, -30931, 46202, 324814, 393215, 252246, 190420, 298606, 129389, -30426, -12226, -49635, -85415, -109377, 64180, 152721, 277477, 187735, 99271, -113942, -295809, -341814]
20982c41814m0201Q9156n3880k47065O3287K76407J20662M2362p930J57846j7558
20971D1272l17189l76121k3229K47032L6499j64024j9410K40448M06257J55459
20961B26994n8617j57703m3382L3075J16184O0387j48057k81501n3338J10136
20951a95822L01966J52192m4672j24184j07739O4312J56864j0036J51585o9757
20941B74709l70532k46387L5048O1726K92655K49479N2852k30412j88159q7557
20931a56578K05752K0308Q8299K27192o8372j10398J5138j7451j64639K02447
20921B41698O3085J05085j48571l40134l83232j46015O4003J98960L16071M86652
20911D57602R4501j04786k01895j47086j44140k33139k3859J59701L4444J16119
$$ y = [-341814, -382015, -292859, -346739, -593804, -530517, -254110, -133448, -91086, -99016, 58830, 41272, -275917, -652038, -675267, -428235, -391736, -555760, -575170, -334722, 71535, 226994, 168377, 10674, -32708, 367, 116551, 176938, 28881, -252620, -305958, -195822, 106144, 258336, 213664, 89480, -18259, 46053, 202917, 192881, 344466, 274709, -95823, -342210, -307162, -245436, 47219, 296698, 349550, 119138, -69021, -156578, 49174, 69482, 157781, 384973, 316601, 206203, 221341, 203890, 39251, 241698, 304783, 409868, 261297, -78837, -462069, -608084, -544081, -345121, -29050, 457602, 552103, 447317, 245422, 98336, -45804, -278943, -302802, -143101, -108657, 7462]
20901G462K18811n0948j21969q7086M6565K54710J01728N4847k36404k0765K06474
20890C73425L5609j41258k65268j64012K10243K6496L4745L796N055M2019n894
20879A54956r4364j24281j27941L33430J92763J63843r8378j20171m3802L3890
20869B69945M0816O8202p2741l3532p4273k44803j86067J61478J81411J48224
20859B58660Q4283q4102j82371K0748J05504R241j7311l5675L1304j99192O5643
20848E6732M18135l4048n0566j06287K3311L0458J09055o4708R5279m7663k38521
20837A91177J05473R0235M3176m9936j10176n9464K05371j6511l76393j1614M36308
20826D47646j04028j14156o7164j00024M8171J02527p3517K00994Q2803k88499
$$ y = [7462, 226273, 175325, 53356, -33730, 12835, 267545, 369273, 424120, 187716, 166951, 373425, 409034, 267776, 2508, -161504, 48739, 75235, 109980, 113776, 118831, 160850, 154956, 60592, -63689, -191630, 141800, 334563, 498406, 400028, 279857, 236055, 269945, 310761, 378963, 306222, 272690, 198417, -46386, -232453, -70975, 110436, 258660, 342943, 258841, 76470, 97218, 202722, 211963, 194652, 158977, 190281, -8911, 56732, 474867, 440819, 390253, 283966, 307277, 337735, 446790, 382082, 477361, 429698, 191177, 296650, 386885, 430061, 380125, 269949, 210485, 415856, 399345, 22952, 11338, 447646, 343618, 229462, 162298, 62274, 110445, 212972, 139455, 340449, 423252, 134753]
20816A34753O0848K2232r7074l30537r5777J0999K8157K31323J71245r1679J10414
20805A54904j08490q4317N4972l9852n8496L46728M8979J1262Q3863j09392j76789
20794A23372p8232J80492N9025q189j32146K27357J79202o1274q217j906p636
20783D71848l36412j56878J28538R5249j26518l19721M4773Q5179K42163J21213
20773B49434m1611k679j1683p10J29735J23673N6529k77672l06157Q3035R8057
20762I9951L0363J62423j18590r1733L40575L9899J2443l6084j3004o1790J9166
20751C83619J9553J36131L37943j40907l51733k13860k39251K9315J1872L02015
20741B74697M0946O2675r3240Q0976J67840J44534J60973k6416j69199k64874
$$ y = [134753, 195601, 217833, 120759, -209778, -305555, -294556, -266399, -35076, 136169, 44490, 154904, 46414, -37903, 17069, -22783, -81279, 265449, 314428, 325690, 409553, 300161, 123372, 45140, 225632, 284657, 276468, 144322, 371679, 550881, 489607, 481390, 479484, 471848, 135436, -21442, 107096, 202345, 75827, -243894, -199121, -113942, 128221, 249434, 207823, 205144, 193461, 192751, 322486, 446159, 502688, 225016, -81141, 1894, 99951, 130314, 292737, 174147, 82414, 422989, 462888, 475331, 439247, 426243, 364453, 383619, 403172, 539303, 877246, 736339, 384606, 170746, -68505, -39190, -27318, 274697, 315643, 378318, 285078, 366054, 533894, 678428, 839401, 812985, 643786, 378912]
20731C78912n4572O118j0872j87159l41525K16845M46991J53285N5037J00800
20721G63860k74564j8551N7969r5194J18774j72450k43847Q6814j0960k5334k0540
20710A65977J17137Q8720P1878J27368L3321k52692k62955m883L15368J02582
20700E01821J18841j98340K53974K85480O0883k66791k62683k27905j44591M1884
20690A62573j5083L13403m5708k62204k13937L31121L44142M5879J8931j32541
20680E46576j13647k18709K20392J37032k33867k08815J76476j0608r0741k77900
20670g3811J25862N1528l5923L2065q2216j25518N3478J82467L7102Q3951j9335
20659B29650r3068j61675j77942n3070J24141J48525L20095J5487l5675n334J72066
$$ y = [378912, 324340, 330458, 319586, 132427, -209098, 7747, 454738, 608023, 663060, 763860, 489296, 470745, 528714, 433520, 552294, 379844, 135997, 222811, 211851, 186517, 165977, 283114, 371834, 443712, 571080, 604401, 351709, 88754, 83871, 399239, 501821, 620662, 422322, 676296, 961776, 1022659, 755868, 493185, 265280, 120689, 162573, 147490, 460893, 415185, 152981, -60956, 270165, 614307, 660186, 679117, 546576, 432929, 214220, 434612, 571644, 337777, 128962, 305438, 294830, 204089, -73811, 52051, 103579, 67656, 99721, 17505, -108013, -54535, 127932, 165034, 248985, 229650, 136582, -25093, -203035, -256105, -131964, 16561, 336656, 352143, 316468, 311134, 483200]
20648D83200K48962j09986o4605n3070j27557o6651J008j01138J60764q8046M8475
20637C31356j21146q0206k6150K57773J78717q3124M6353J17251l5005j57668
20627D28151M2652o0788j2634o551N6288k43735J20839J35211n535m1059Q2184
20616D95023L23337k1433j88417K243j42247o5655J43259o3806K52647J77524
20606I12475J7314j66218R3337j47211k31956k10254p2785P7524R7208O9717K21351
20595F60502L8248L7816k21559j64944L4221k5395k84804R8699j45278O8319J62218
20584B58043R0565R1128R4024J6467k26340N1771k71809P7344K51142j54544l19272
20573d1481L542O6158J48109L66007K5775K36656m823j09950j37907J5851k35450
$$ y = [483200, 732162, 622176, 557571, 504501, 376944, 310293, 311301, 210163, 370927, 282881, 331356, 210210, 130004, 103854, 361627, 540344, 457220, 503573, 620824, 585819, 428151, 470803, 410015, 397381, 390830, 447118, 203383, 324222, 459433, 453898, 412839, 495023, 818360, 796927, 608510, 610753, 468506, 402851, 546110, 482304, 734951, 912475, 929789, 763571, 856908, 709697, 477741, 267487, 194702, 272226, 369434, 439151, 660502, 698750, 736566, 515007, 350063, 384284, 358889, 74085, 172784, 27506, 95825, 258043, 348608, 439736, 533760, 550227, 323887, 375658, 103849, 181193, 432335, 277791, -41481, -37939, 28219, 176328, 542335, 568110, 804766, 799943, 689993, 552086, 567937, 332487]
20562C32487K10688n071k2511j52966K05170K0865J37560L02911K5550j68605
20552H86078j20593k30695r2215Q7883L30832J31099j68456k82879k78113J08520
20542C71461j79498O4265n3053M8672J04210j46697O0239L01052J22213k73415
20532D19449j60905L1816j56539j85044R8052J88201O287R6120k8915j68176n0753
20521H9593J39656J56091R4110L8919j73364K603J18958J61899J36004k67371
20511D97098q7967R0022j32518J14273O7499N5508P7512M5741R3040j18089K1036
20500G23155r3304j48006J9346p540j4589j6711k846p3672K00987J6135R4019
20489F96974K8302j04174J38199L08588K06437l302m3386N4817J35089k12544
$$ y = [332487, 543175, 538104, 515593, 362627, 567797, 588662, 726222, 1029133, 1054683, 886078, 765485, 534790, 442575, 530458, 861290, 992389, 823933, 541054, 262941, 371461, 191963, 256228, 203175, 251847, 356057, 209360, 269599, 570651, 692864, 419449, 258544, 290360, 133821, -51223, 46829, 235030, 241317, 337437, 308522, 140346, 89593, 229249, 385340, 479450, 518369, 345005, 347608, 466566, 628465, 764469, 497098, 409131, 499153, 366635, 480908, 548407, 603915, 681427, 727168, 820208, 702119, 723155, 629851, 481845, 501191, 493651, 479062, 462351, 459505, 385833, 586820, 602955, 696974, 725276, 621102, 759301, 1067889, 1274326, 1271024, 1227638, 1282455, 1417544, 1205000]
20479A205000l70338j72495q3000k35930P0056J4497k0668L6214k7082m2585j5217
20468C58452K18413k0919J75229k7226P2956J23743J61952k87997k17819l4363
20458E22421M0434J50356J07262R4807J5302m2538m7004J4413m5569L4061j44215
20447F99730r444j6818J60707J35963l03362m8202j08834l9147J16689k8177l9161
20436E19944j65164R4692J40188l2407J46843M3553j52580N898K51218K20406
20426A072591N6801p9536J563j82280N5912P1883j05214k69502K7791J8845J70109
20415H38963J0439N4026O3456k36142J13428L80566j30900o8321j22049K8194
20405I31660M05022o4813l16148j01305Q4250J28074k5169k95942k19755J37072
$$ y = [1205000, 834662, 662167, 579167, 343237, 413293, 427790, 407122, 443336, 416254, 373669, 358452, 576865, 555946, 731175, 703949, 776905, 900648, 1062600, 774603, 556784, 522421, 562855, 713211, 820473, 915280, 930582, 888044, 841040, 855453, 809884, 843945, 699730, 690286, 673468, 834175, 970138, 666776, 618574, 509740, 470593, 587282, 559105, 519944, 354780, 449472, 589660, 557253, 704096, 747649, 595069, 600967, 852185, 1072591, 1129392, 1049856, 1051419, 869139, 925051, 996934, 891720, 622218, 650009, 668854, 838963, 849402, 903428, 966884, 730742, 844170, 1224736, 1093836, 1025515, 903466, 931660, 1336682, 1271869, 955721, 854416, 938666, 1066740, 1041571, 745629, 525874, 662946]
20395F62946J90940J13714r9542M0530L7569O6612K8178j90462n7731K12815j08061
20384H97508j09454k2525J985Q3908K55550k9989j88535j2925J03418J92549j86595
20373I84895j49520K51648J11948p2891k09979J29746M892j45874j33337P3469
20363H44997O6323J78802Q200j67245j25890N2046J30945K5176j0592j15158N2507
20352I40111N7044j61232k9962L50086J10746R524Q9281l30132K4457J31266k1703
20341A169486n1977L9974l2949j08331q6386j2982q7869J56497j10272O155K78262
20330A159608J09086J52459J6021K7179K4755o0923l189L02091j9585J2200j11597
20319A608105q0113m0978k36717k21868J93016L82234j54690k58689K2793K25492
$$ y = [662946, 853886, 967600, 868058, 908588, 946157, 1012769, 1040947, 850485, 792754, 1005569, 897508, 788054, 765529, 767514, 851422, 1106972, 1076983, 888448, 875523, 978941, 1171490, 984895, 835375, 1087023, 1198971, 1126080, 916101, 1045847, 1050739, 904865, 771528, 844997, 911320, 1090122, 1098322, 931077, 805187, 857233, 988178, 1013354, 1002762, 887604, 940111, 997155, 835923, 805961, 1156047, 1266793, 1276317, 1365598, 1035466, 1059923, 1191189, 1169486, 1117509, 1157483, 1124534, 1016203, 929817, 916835, 828966, 985463, 875191, 881346, 1159608, 1268694, 1421153, 1437174, 1464353, 1489108, 1428185, 1424996, 1727087, 1707502, 1719702, 1608105, 1527992, 1487014, 1250297, 1028429, 1221445, 1603679, 1448989, 1190300, 1213093, 1438585]
20309A438585m489k420j44790J63042J62295j6336J19389k91506j20701n5563
20299A247506J83651J77614K6408j37343l09214k464o7948K06984L10243r440
20289A625997q7600J55432j87924q1456K40426r2556j85873n9179q2373R4559
20279A339453L35611p2719j82331P922K72438k96453k67445o360J98437J98446
20269A526999J21567J65965M5049n10751n1054J07694O7360o5364J34549R5424
20259A637438L6651M5842j20808k31703m1298K6351R7217J05445M33267j83070
20249A805332l58216j77225M8237K92676L01722Q9084p9025k3022M4594r1731
20239A852426k85929l2458R2411q6712j30225J39423n3794L80795J89408r1363
$$ y = [1438585, 1434096, 1431676, 1286886, 1449928, 1612223, 1595887, 1715276, 1423770, 1303069, 1247506, 1431157, 1608771, 1635179, 1497836, 1188622, 1186158, 1118210, 1325194, 1635437, 1625997, 1538397, 1693829, 1505905, 1424449, 1664875, 1572319, 1386446, 1327267, 1244894, 1339453, 1675064, 1602345, 1420014, 1427936, 1700374, 1403921, 1136476, 1130116, 1328553, 1526999, 1648566, 1814531, 1859580, 1348829, 1297775, 1405469, 1472829, 1407465, 1542014, 1637438, 1674089, 1719931, 1599123, 1367420, 1326122, 1352473, 1449690, 1555135, 1988402, 1805332, 1447116, 1269891, 1318128, 1610804, 1912526, 2001610, 1922585, 1899563, 1944157, 1852426, 1566497, 1534039, 1626450, 1539738, 1409513, 1548936, 1495142, 1875937, 2065345, 1973982]
20229A973982n2423K29183N1960j46623K72135Q4551j8978l31590j73826m0657
20219A847714J39720j3852r5527j06693K11251J45153l01031j80327J15900k21412
20209A540896K12803L57721M8341J46019q556o1630k09748p8694P173M79953K2389
20198B456667j69668q1817J6886L05812o286j74141j71118K42465J70958r4253
20188B495505k14324j48033k46325l47807J80265J54083K79350J72106J14939
20179B439759j12017j23676J06209K22250j74304K431N7128J40241n4788k60644
20169B242589P476K33542k21397l7452L16412L47794j10579j96968k94102o2171
20159B225144L21926j75447J25751m367j50966J18098L0495P7146J03074k32106
$$ y = [1973982, 1921559, 2150742, 2202702, 2056079, 2328214, 2412765, 2393787, 2062197, 1888371, 1847714, 1987434, 1973582, 1878055, 1771362, 1982613, 2127766, 1826735, 1646408, 1762308, 1540896, 1753699, 2111420, 2159761, 2305780, 2297224, 2235594, 2025846, 1947152, 1954325, 2434278, 2456667, 2286999, 2205182, 2222068, 2527880, 2521594, 2347453, 2176335, 2418800, 2589758, 2495505, 2281181, 2133148, 1886823, 1539016, 1719281, 1873364, 2152714, 2324820, 2439759, 2327742, 2204066, 2310275, 2532525, 2358221, 2360652, 2417780, 2558021, 2503233, 2242589, 2250065, 2483607, 2262210, 2224758, 2541170, 2888964, 2778385, 2581417, 2287315, 2225144, 2547070, 2371623, 2497374, 2493007, 2342041, 2460139, 2490634, 2567780, 2670854, 2438748]
20149B438748J8714P3064J22729j01506L07784M5849R0538L5862p1803k65274
20139B694705j58562j39540k31413L0659J93885L22636J51128J86978j71549j21215
20129B757712R1346J70116J37095O4614m7570Q1946j17164j79438K45098P3558
20119C277313j73608O5554J43467M7294k99440j59850J08439k22245n1603L05494
20109C040815J19797L2907k2079O1337J9378J43877K2811m2842j13441j04094
20099C158466n9294n9979J53327L6935n4337j7064p6845M4252L62073J77178k144
20088C662568m4495j46900p9368J75277J09137M9962O7001Q4310q9054K38772
20078D027210J29336J03343q8591l05222k33920K26587M48038J24779k65161q2397
$$ y = [2438748, 2457462, 2530526, 2653255, 2551749, 2859533, 2905382, 2995920, 3031782, 2959979, 2694705, 2536143, 2396603, 2165190, 2195849, 2389734, 2712370, 2863498, 3050476, 2878927, 2757712, 2849058, 3019174, 3156269, 3220883, 3173313, 3255259, 3138095, 2958657, 3203755, 3277313, 3103705, 3169259, 3312726, 3360020, 3060580, 2900730, 3009169, 2786924, 2735321, 3040815, 3160612, 3193519, 3171440, 3232777, 3252155, 3396032, 3418843, 3376001, 3262560, 3158466, 3099172, 3039193, 3192520, 3229455, 3175118, 3158054, 3081209, 3125461, 3487534, 3664712, 3662568, 3618073, 3471173, 3391805, 3567082, 3676219, 3726181, 3793182, 3877492, 3788438, 4027210, 4156546, 4259889, 4171298, 3866076, 3632156, 3858743, 4306781, 4431560, 4166399, 4084002]
20068D084002J52304k55658l56561J20460K98339j39341o8104K12715J00796j04228
20058D044724j1336Q0398L13704K36629L4285N8556p8239m7894J4691Q9385p6514
20047D658389n6773J78350J29191K22029k09002P9709j5651R653q4132k12656
20037D699107L71549L5270j72153o2227p4816L09880M088J4128k5763N243p7656
20026E026650L3343J02975m1728J61029l8265k5116J97337P4605K4531j05003
20016E410358k5956J20953M40670l071j2913l6982R7569J03446j1450k1175J87509
20005F248958P9186k604p5929r8901n6355k49067P0460J91909J70064P6309K62028
19994F616058L8979k9362p1488j79672J75411J2470R2590Q3237M44641J0972p8251
$$ y = [4084002, 4236306, 3980648, 3624087, 3744547, 4042886, 3903545, 3835441, 4048156, 4148952, 4044724, 4033388, 4113786, 4427490, 4664119, 4698404, 4756960, 4678721, 4630827, 4645518, 4734903, 4658389, 4601616, 4779966, 4909157, 5131186, 4922184, 5001893, 4986242, 4995895, 4911763, 4699107, 5070656, 5105926, 4933773, 4871546, 4796730, 5106610, 5110698, 5124826, 5099063, 5104306, 5026650, 5059993, 5162968, 5121240, 5282269, 5244004, 5218888, 5416225, 5490830, 5515361, 5410358, 5384402, 5505355, 5946025, 5942954, 5930041, 5893059, 5990628, 6094074, 6082624, 6061449, 6248958, 6328144, 6325540, 6249611, 6150710, 6094355, 5845288, 5915748, 6107657, 6277721, 6354030, 6616058, 6655037, 6625675, 6554187, 6374515, 6549926, 6562396, 6654986, 6738223, 7182864, 7193836, 7115585]
19983G115585P7016j04881k02554j70034K34892J65546k4380q4103K77691L99539
19973G684317j31856k03186j50352K18176J555K07475J32286K53202K25582J89852
19963H427051j7478p3357n8296m9210J01096k75209P9210J55764j7636L17448
19953H589383M22587k490j22395N6151J60982J12054j51908l11311J10362R0279
19943H953694k95784N364K81887M88708J46731O7802M75680J09452p4040l8834
19933A0120660j56004P4769r9660l5222O190J82693J96084K97790K03270j27255
19923A0663315k38873J0597K7934L00520N024J10277J16965j11480K7411K10733
19913A1122423L11602j3180K27077J27871q2005O4457L2393R2625L34439M54925
$$ y = [7115585, 7192601, 7087720, 6885166, 6715132, 6950024, 7115570, 7091190, 7007087, 7284778, 7684317, 7552461, 7349275, 7198923, 7417099, 7418654, 7626129, 7758415, 8011617, 8237199, 8427051, 8409573, 8336216, 8277920, 8228710, 8329806, 8054597, 8133807, 8289571, 8271935, 8589383, 9011970, 9009480, 8887085, 8943236, 9104218, 9216272, 9064364, 8753053, 8863415, 8953694, 8657910, 8663274, 8945161, 9433869, 9580600, 9648402, 10124082, 10233534, 10159494, 10120660, 9964656, 10039425, 9939765, 9904543, 9910733, 10093426, 10289510, 10587300, 10790570, 10663315, 10424442, 10435039, 10462973, 10763493, 10768517, 10878794, 10995759, 10884279, 10911690, 11122423, 11434025, 11420845, 11647922, 11775793, 11693788, 11758245, 11790638, 11883263, 12217702, 12672627]
19903A2672627J04419L308K07289J7338J26985q6503j90210J12898N08228L03681
19893A3780060k57098J25446K66410K58693J66113j11082p3505K28576N5678L6150
19883A4475441K74106M24528J759K11616K13055M4493P6086K47610P5235j37943
19873A5905986K99031M06730K02935K25896K48346l3898J03662j04001J12075
19864A7366762K34388K24243J79837K04921k772J14167K07067M29680J86875n2969
19854A9092199j51111K60992N22141K06109P5522J33021K54937Q451K7840M76397
19844B0906498J0293j10943K88575J99701M58918N49443j23295j78939J21634
19835B2121885K65924K36482L01163K75615J48386L84314K16512J93249K76623
$$ y = [12672627, 12777046, 12780354, 12987643, 13004981, 13131966, 13045463, 12855253, 12968151, 13476379, 13780060, 13522962, 13648408, 13914818, 14173511, 14339624, 14228542, 14155037, 14383613, 14439291, 14475441, 14749547, 15174075, 15175834, 15387450, 15600505, 15644998, 15721084, 15968694, 16043929, 15905986, 16205017, 16611747, 16814682, 17040578, 17288924, 17255026, 17358688, 17254687, 17366762, 17601150, 17825393, 18005230, 18210151, 18207379, 18321546, 18528613, 18958293, 19145168, 19092199, 18941088, 19202080, 19724221, 19930330, 20005852, 20138873, 20393810, 20402261, 20430101, 20906498, 20916791, 20805848, 21094423, 21294124, 21753042, 22302485, 22179190, 22000251, 22121885, 22387809, 22624291, 22925454, 23201069, 23349455, 23733769, 23950281, 24143530, 24420153]
19826B4420153K41164L62699L04690R8073O6403L64972M90911L45319L64625K25651
19816B7284660J4044J88155L85029N31719L64608K45016J51098p9759K20796K99794
19806B9605160J53438L23945N21867N05720K35526L61011J26308L49501L99283
19797C2581759M08362L50967J03046K97951J80412P3475R4670L31829O51280J52864
19787C5226615M25311K69942R9408N46670L30349N7492L84323K49566M13527K90139
19777C8293342K75066L11163N06898O05618L53606N46379K29585J00469Q772J11662
19767D1342560N87883N17793K08825N56676N53452L63995L10592L49948M04944
19758D5196668N1418J11734L53807J98537L43019N54694J03128L69031N23070
$$ y = [24420153, 24661317, 25024016, 25328706, 25426779, 25493182, 25858154, 26349065, 26694384, 27059009, 27284660, 27298704, 27486859, 27871888, 28403607, 28768215, 29013231, 29164329, 29084570, 29305366, 29605160, 29758598, 30082543, 30604410, 31110130, 31345656, 31706667, 31832975, 32182476, 32581759, 32990121, 33341088, 33444134, 33742085, 33922497, 33995972, 34090642, 34422471, 35073751, 35226615, 35651926, 35921868, 36021276, 36567946, 36898295, 36955787, 37340110, 37589676, 38003203, 38293342, 38568408, 38879571, 39386469, 39992087, 40345693, 40892072, 41121657, 41222126, 41230898, 41342560, 41930443, 42448236, 42657061, 43213737, 43767189, 44131184, 44441776, 44791724, 45196668, 45248086, 45359820, 45713627, 45912164, 46255183, 46809877, 46913005, 47282036, 47805106]
19749D7805106K38892N8126L01248L39507M31683L3465K93515L31869N31765L06512
19739E0671688L7110K47317L64687K7547j63562P9615N05842M71339M52271L15506
19729E3009360r067j48401J5814K57162L13675Q16K86650l9444J64609K61370
19719E4112544K11740L37419O3395K5117K32080M3628n5988j92574L201m9886
19709E4730676q1691M6924K1470j23326r6098n3337L3188M6951k00666q2454M2163
19698E4283800M0217J08105p5878k40125p4041o9477q5766k4407p9619k9389j47965
19687E3605455l03664m90776j93533k41380o7467J46190k2678l82733n29191k33383
19677E1286840j61213j97471p1564j84944m50526m68179m71574n26052Q2454L0518
$$ y = [47805106, 48043998, 48102124, 48403372, 48742879, 49174562, 49208027, 49501542, 49833411, 50365176, 50671688, 50708798, 50956115, 51320802, 51348349, 51184787, 51264402, 51770244, 52241583, 52693854, 53009360, 53000293, 52851892, 52867706, 53124868, 53438543, 53439359, 53726009, 53686565, 53851174, 54112544, 54324284, 54661703, 54725098, 54750215, 54982295, 55025923, 54969935, 54777361, 54780562, 54730676, 54648985, 54695909, 54717379, 54594053, 54497955, 54444618, 54477806, 54524757, 54324091, 54241637, 54283800, 54324017, 54432122, 54356244, 54116119, 54042078, 53972601, 53886835, 53862428, 53782809, 53753420, 53605455, 53301791, 52811015, 52617482, 52376102, 52308635, 52454825, 52432147, 52049414, 51520223, 51286840, 51125627, 50928156, 50856592, 50671648, 50221122, 49752943, 49281369, 48755317, 48837771, 48868289]
19667D8868289j89707j91077m23844k79841k19525j42963l69361k73522l75741
19658D6402708m54225l31479m43437k06299l24020l23645l13984l49806m48847
19649D3206966m59831l58920k73602M5479k52353p07350k68093j04930l75662
19640D0451704n17911l82626l28316l48282j90045L6715j63041m12442m21825
19631C7723931j51162n9649j28105m73478m76130m43584k86890m42160l73847
19622C4888926k79097k31042j10019k87361l87330k67324m0978l16090l29867
19613C2639818k18738l53064j77458l36899q5608k52044m24598k43639k80914
19604C0266856m01239n41062l69555j25015l68795l29714j85276k32368k43223
$$ y = [48868289, 48678582, 48487505, 48063661, 47783820, 47564295, 47421332, 47051971, 46778449, 46402708, 45948483, 45617004, 45173567, 44967268, 44643248, 44319603, 44005619, 43655813, 43206966, 42747135, 42388215, 42114613, 42160092, 41907739, 41200389, 40932296, 40827366, 40451704, 39933793, 39551167, 39222851, 38874569, 38684524, 38721239, 38558198, 38145756, 37723931, 37572769, 37513120, 37385015, 36911537, 36435407, 35991823, 35704933, 35262773, 34888926, 34609829, 34378787, 34268768, 33981407, 33594077, 33326753, 33285775, 32969685, 32639818, 32421080, 32068016, 31890558, 31553659, 31468051, 31216007, 30791409, 30547770, 30266856, 29865617, 29324555, 28955000, 28829985, 28461190, 28131476, 27946200, 27713832, 27470609]
19595B7470609k13406k11154l11608m0735n3578j39179j34808m05119l28329m7517
19585B5585176j64476j60810j83810j96397k67518l11957j76575j81508l28774
19576B3613351k60519k12461k17326K80584R5778k31824l12700n87295k95392
19567B1872196k37092j76304j49385k74634j39295j09658l42698l37237k77136
19558A9828757r3968m09146m91686j26252J72331L3448J99082M9498k02643l39809
19548A8619612K5781j99280k15563l42452p2479j25527r6734m45326k34375L7536
19538A6951193K52749N5400k24116j60177l41478k33331R8715j37604m09025j46046
19528A5706280K54865K08773M526j08453j79603m84498k70973J50260J50371J5847
$$ y = [27470609, 27257203, 27046049, 26734441, 26693706, 26640128, 26500949, 26366141, 25961022, 25632693, 25585176, 25420700, 25259890, 25076080, 24879683, 24612165, 24300208, 24123633, 23942125, 23613351, 23352832, 23140371, 22923045, 23203629, 23299407, 23067583, 22754883, 22167588, 21872196, 21635104, 21458800, 21309415, 21034781, 20895486, 20785828, 20443130, 20105893, 19828757, 19734789, 19325643, 18833957, 18707705, 18880036, 18913484, 19112566, 19162064, 18959421, 18619612, 18645393, 18446113, 18230550, 17888098, 17815619, 17690092, 17593358, 17148032, 16913657, 16951193, 17203942, 17259342, 17035226, 16875049, 16533571, 16300240, 16398955, 16261351, 15852326, 15706280, 15961145, 16169918, 16174444, 16065991, 15886388, 15401890, 15130917, 15281177, 15431548, 15447395]
19518A5447395j08199k39975k89440r3713r597o8351k82622J35679J87765j59480
19508A4519462k21524j35233p9806j67078Q0783P3438o1643p4967Q9061j02626
19498A3919867L6480N4176m6994j88405J4669N2877J78528J7057j34762J5013
19488A3918506j24311P0703l20197J74928J85405k2825l174l06103j81084K65784
19478A3657632j14944k35630m16938j72291j71161k46598p4922p0285k3600k19052
19468A1912211j10602r6031k3141j3420o6903j34222j38137m8858j4634k58712
19458A1007551k69141l67586l94615k38682j53852j41726k3434k62111L502j00037
19448I059869M5891k40730k91803j17311L45761K43146J22774k93766l63865j19106
$$ y = [15447395, 15339196, 15099221, 14809781, 14716068, 14706471, 14638120, 14355498, 14491177, 14678942, 14519462, 14297938, 14162705, 14082899, 13915821, 13996604, 14070042, 14008399, 13933432, 14022493, 13919867, 13956347, 14010523, 13963529, 13775124, 13789793, 13842670, 14021198, 14038255, 13903493, 13918506, 13794195, 13864898, 13544701, 13719629, 13905034, 13882209, 13879035, 13572932, 13391848, 13657632, 13542688, 13307058, 12890120, 12717829, 12546668, 12300070, 12225148, 12154863, 12131263, 11912211, 11801609, 11705578, 11682437, 11669017, 11602114, 11467892, 11329755, 11280897, 11266263, 11007551, 10738410, 10370824, 9976209, 9737527, 9583675, 9441949, 9418515, 9156404, 9159906, 9059869, 9105760, 8865030, 8573227, 8455916, 8801677, 9044823, 9167597, 8873831, 8509966, 8390860]
19438H390860L48479j38710k08486j24728j82878j19899j79131j34100K14086
19429G865493P4324p5814k10973L1098K683L8590o223L40704n8708j32279l59029
19418G509866K4867J62008j21788j4061l96j13523R9754P670j75264j4072r9278
19407G265783l02127k007M3466r5645k24116J53708J55521L25580j2723k42570
19397G064870P5172L7665j5606N6609q8679j66421J43765K64529m6394n6570j20766
19386G148174j4158r8397j30842K55186q052k05876j72276L4075K0156p0566j13065
19375F644359j43201j71057j58498n8222q6470k09997O7739J30526J75961J42102
19365F333242L6140k02084n4216j87972o8689K3086j30759j14326O196l70994
$$ y = [8390860, 8739339, 8600629, 8392143, 8267415, 8084537, 7964638, 7785507, 7651407, 7865493, 7939817, 7864003, 7653030, 7684128, 7686811, 7725401, 7719178, 8059882, 8001174, 7868895, 7509866, 7534733, 7696741, 7574953, 7560892, 7560496, 7446973, 7546727, 7554397, 7379133, 7365061, 7265783, 6963656, 6961649, 7005115, 6909470, 6685354, 6839062, 6994583, 7320163, 7307440, 7064870, 7140042, 7177707, 7162101, 7218710, 7130031, 6963610, 7107375, 7371904, 7325510, 7268940, 7148174, 7134016, 7035619, 6904777, 7159963, 7151911, 6946035, 6773759, 6807834, 6827990, 6757424, 6644359, 6501158, 6330101, 6171603, 6113381, 6026911, 5816914, 5884653, 6015179, 6191140, 6333242, 6369382, 6167298, 6113082, 5925110, 5856421, 5879507, 5748748, 5634422, 5640618, 5269624]
19355E269624J8389K16132l2937J11182L52494Q0583k00753L5752L9576j65199
19345E724843J1030L12736P5717k40449k21169o8402J54286J11791J01352K7227
19335E988962p3569p2444j49559k60572j99820j4648J05989j67417j65401k58229
19325D733292k01620M5471J68046l12069j51304J02573M6948j72420n7170J63547
19315D365294J16730J0571M8159K3217p7704K4517o8625o2195J36459K93771M3871
19304D854065j80679j68523j82956q0170J33383k3766k56440q7221j01406N2192
19294C958479j8418K01271k0563O9853j075k20904j11289K33915O0618j01388
19284D050499J07551j35137j04981k08509J2544l3573j20681k3947j32606p2122
$$ y = [5269624, 5288013, 5504145, 5471208, 5582390, 5934884, 6015467, 5814714, 5850466, 5890042, 5724843, 5735873, 6048609, 6124326, 5883877, 5662708, 5594306, 5748592, 5860383, 5961735, 5988962, 5915393, 5842949, 5693390, 5432818, 5232998, 5218350, 5324339, 5156922, 4991521, 4733292, 4531672, 4577143, 4745189, 4433120, 4281816, 4384389, 4431337, 4258917, 4201747, 4365294, 4482024, 4492595, 4540754, 4563971, 4486267, 4510784, 4442159, 4379964, 4516423, 4810194, 4854065, 4673386, 4504863, 4321907, 4241737, 4375120, 4351354, 4094914, 4007693, 3906287, 3958479, 3940061, 4141332, 4120769, 4190622, 4189547, 3968643, 3857354, 4091269, 4151887, 4050499, 4158050, 4022913, 3917932, 3709423, 3721967, 3688394, 3567713, 3543766, 3411160, 3339038]
19274C339038R0481o441j40622K37701L70193K19706j2162k44443m18124P7135
19264C512462M92204K37765k40358q5358j35403p2261J85006j01470k28926k11286
19254C352375J05616J00048M0118R9492k25563j48406p481n6666k8926J27560
19244C358167K3549J8653L09770O9282l3484j59804l29068J15059J96462J96929
19234C765515K90739o1716l24401j56264K06760R7104J5138k2300P2716l3136
19224C850155j42431J14661n8718j3729j32747K3841L12072R7055m51022l91171
19214C207966O008J73614j39812r8443j9648J82323J74596J67434l2047k24473
19204C397518j20445K99406J55090j85237J2440k23186K489j39356Q4869j89054
$$ y = [3339038, 3429519, 3423078, 3282456, 3520157, 3890350, 4110056, 4097894, 3853451, 3435327, 3512462, 4004666, 4242431, 4002073, 3916715, 3781312, 3709051, 3894057, 3792587, 3563661, 3352375, 3457991, 3558039, 3598157, 3697649, 3472086, 3323680, 3316199, 3259533, 3230607, 3358167, 3381716, 3400369, 3710139, 3779421, 3745937, 3586133, 3257065, 3372124, 3568586, 3765515, 4056254, 3994538, 3670137, 3513873, 3720633, 3817737, 3832875, 3810575, 3883291, 3850155, 3707724, 3822385, 3763667, 3749938, 3617191, 3641032, 3953104, 4050159, 3599137, 3207966, 3213974, 3387588, 3247776, 3149333, 3129685, 3312008, 3486604, 3654038, 3621991, 3397518, 3277073, 3576479, 3731569, 3546332, 3558772, 3335586, 3338075, 3198719, 3283588, 3094534]
19194C094534O4291m5338n3855J87980J10767k49991J3798K81020K39407m3971
19184C598642j64081K4593K5556k25765K8819j16866p3877m5896J74020Q0680
19174C305825J0090o8263j48849k0592M2747Q97k3115o807k8634j5588M07457
19163C455168P0789j24020K75487J74587j05588l41219r6717M8188M9085j69159
19153C236601P4042k12695K11146J56150J74200J43587m1993o4319r3496R2054
19143C675277L29721l00971j60237k84909L55300K41741J93444L34793J92748
19134D576907k65083J73502M00665O0550N9376K06825K39171J01144j84730m91199
19124D877128k30391j77369J62637L10581m1280o2906j8890l14423L9538J82744
$$ y = [3094534, 3158825, 3113487, 3059632, 3247612, 3358379, 3108388, 3122186, 3403206, 3642613, 3598642, 3434561, 3459154, 3484710, 3258945, 3287764, 3170898, 3097021, 3051125, 3225145, 3305825, 3315915, 3247652, 3098803, 3078211, 3120958, 3121855, 3098740, 3091933, 3063299, 3047711, 3455168, 3525957, 3401937, 3677424, 3852011, 3746423, 3405204, 3308487, 3356675, 3405760, 3236601, 3310643, 3097948, 3309094, 3465244, 3639444, 3783031, 3741038, 3676719, 3583223, 3675277, 4004998, 3704027, 3543790, 3258881, 3614181, 3855922, 4049366, 4384159, 4576907, 4311824, 4485326, 4885991, 4946541, 5005917, 5212742, 5451913, 5553057, 5368327, 4877128, 4646737, 4469368, 4632005, 4942586, 4901306, 4838400, 4819510, 4505087, 4544625, 4727369]
19114D727369M2498j05673j94726j4800n5274p5172o6512J19352K6918K32941
19104D636921M7979J43488k6151L4000O5695J93698K88661j276K75911L96316
19094F055242j03688P4407M36039M22335L07737n0339J26950J09131K2637O945
19084G407396L09420J40357J21266j94403j49628J29526K79333L85512L80345
19075H809124P517K8172L22249M16649J40030O9822j04102k74595K21189L52257
19065I988312n4875K0154L43006K06969L3842J5893O9517N60395K80956K5954
19055A1490123K46949M80601M84751L78201K31286K58025M38672M55663L85450
19046A4849721L24243M12016O02464R80674J406495J622479J874786J986414K841621
$$ y = [4727369, 4769867, 4664194, 4469468, 4454668, 4399394, 4324222, 4257710, 4377062, 4403980, 4636921, 4684900, 4828388, 4802237, 4836237, 4901932, 5095630, 5384291, 5383015, 5658926, 6055242, 5951554, 6025961, 6462000, 6884335, 7192072, 7141733, 7268683, 7377814, 7400451, 7407396, 7716816, 7857173, 7978439, 7784036, 7634408, 7763934, 8043267, 8428779, 8809124, 8816641, 8844813, 9167062, 9583711, 9723741, 9793563, 9689461, 9414866, 9636055, 9988312, 9933437, 9953591, 10296597, 10503566, 10537408, 10553301, 10622818, 11183213, 11464169, 11490123, 11737072, 12217673, 12702424, 13080625, 13311911, 13569936, 14008608, 14464271, 14849721, 15173964, 15585980, 16188444, 17169118, 18575613, 20198092, 22072878, 24059292, 26900913]
19037B6900913L530961M192958N211844N973390O366518O814191O861950O059384
19029G1912109N603998N466731N296102N449137N198410M313605L534947K962459
19021A09737498J784060O74303n72031j547483j972491j575686p67779K9077O35257
19012A06424725n8248j509573l289060m802994n516081n492894n504705m958003
19004G5293167m187233l145667j435800k66365N57055J567170K973946M295092
18996G5651365O038495Q093240J0625620J3559026J6172760J8827408K1442400
18989A70410314K3539766K5827580K7489394K8041543K6505854K2115377J5269141
18982C39198969P699769J099187k065920k347881p31558K142411O241635J0906191
$$ y = [26900913, 30431874, 34624832, 39836676, 45810066, 52176584, 58990775, 65852725, 71912109, 77516107, 82982838, 88278940, 93728077, 98926487, 103240092, 106775039, 109737498, 111521558, 112195861, 111623830, 110076347, 108103856, 106528170, 105760391, 105789468, 106424725, 106366477, 104856904, 101567844, 96764850, 91248769, 85755875, 80251170, 75293167, 71105934, 67960267, 66524467, 66258102, 66815157, 68382327, 71356273, 75651365, 81689860, 89783100, 100408720, 113967746, 130140506, 148967914, 170410314, 193950080, 219777660, 247267054, 275308597, 301814451, 323929828, 339198969, 346898738, 347997925, 345932005, 343584124, 342852566, 344994977, 351236612, 362142803]
18974C62142803J5142923J9755608K3775094K5065927K2572078J5159287N735910
18967D89349630k754863q364967j2668243j4065316j2764963j2328902j2611376
18960D13791000j2674455j3035965j4497000j3470870r962055o230619m315584
18953C39604452k813479j266773j810881k364504j122980j599042n717775j0794028
18945C12114990j5730933k1881849k7930085l1019160l0413990k6753503k1642285
18938A36743185j6780872j3318165j0693264q864040p811322p181505o142752
18931F5951265n359869m741902m487801l810998l086199k978582k452307j769923
18923C7263684j485126j492764j367489r41295o96695r28698j054917j035929
$$ y = [362142803, 377285726, 397041334, 420816428, 445882355, 468454433, 483613720, 489349630, 486594767, 478229800, 465561557, 451496241, 438731278, 426402376, 413791000, 401116545, 388080580, 373583580, 360112710, 350150655, 343920036, 339604452, 336790973, 335524200, 333713319, 331348815, 330225835, 328626793, 322909018, 312114990, 296384057, 274502208, 246572123, 215552963, 185138973, 158385470, 136743185, 119962313, 106644148, 95950884, 87086844, 79275522, 72094017, 65951265, 60591396, 55849494, 51361693, 47550695, 44464496, 41485914, 39033607, 37263684, 35778558, 34285794, 32918305, 31977010, 31280315, 30351617, 29296700, 28260771]
18915B8260771j457822j280764p79150p88619o18756l01048l01333r2090R5387
18906B2736576J86285P6273K89358O88758Q88102J105052J226220J687664K560890
18897C1445178L338947M082163N908305Q385334J1733143J5403371J8297646J7676761
18889A16270848J1902357N206548J077830K141242Q174004J5905756K0412383
18882A81090968J7981396P621948n980427j5376566j8302393j4653637p290620
18875A45090669j281823m39606n056057j1119091j5068521j5659394j3624785
18868H2841392j0905489q170207o112602m721150l510639k773291k171566k002152
18860D2474296j805885j439411o60197k25284K02164N75201J021206J875427K725683
$$ y = [28260771, 26802949, 25522185, 24743035, 23954416, 23335660, 23034612, 22733279, 22641189, 22736576, 22922861, 22999134, 23288492, 23977250, 24865352, 25970404, 27196624, 28884288, 31445178, 34784125, 38866288, 44774593, 53159927, 64893070, 80296441, 98594087, 116270848, 128173205, 133379753, 134457583, 136598825, 144772829, 160678585, 181090968, 199072364, 206694312, 200713885, 185337319, 167034926, 152381289, 145090669, 143808846, 143369240, 138313183, 127194092, 112125571, 96466177, 82841392, 71935903, 63765696, 57653094, 52931944, 49421305, 46648014, 44476448, 42474296, 40668411, 39229000, 38568803, 38343519, 38545683, 39120884, 40142090, 42017517, 44743200]
18851D4743200L846723N328465P642093J1297077J5545743J9759577K1181435
18844A29344313J7236219R413312L484114K605275P528036J5595206K1583290
18837B06789765K0407199J0356841l675814j5255994j9752158j7155482j0129168
18830A71585189l002912j168794o009687j2724195j7581547j9296803j7307153
18823I4494098j4350049j0954387q601034o904503n409557m163109l777283l535403
18815C6798773l173914k584297k387947k273341j741354j426951j160825j008160
18807B1041984j287784j084173r46002q49636r77069r44736n52985q41028r04988
18798A2653583o66848q07975n27846o28904m03786l37224n22938k95996n49909
$$ y = [44743200, 48589923, 53918388, 61560481, 72857558, 88403301, 108162878, 129344313, 146580532, 155993844, 159477958, 162083233, 169611269, 185206475, 206789765, 227196964, 237553805, 233877991, 218621997, 198869839, 181714357, 171585189, 168582277, 167413483, 161403796, 148679601, 131098054, 111801251, 94494098, 80144049, 69189662, 60588628, 53684125, 48274568, 44111459, 40334176, 36798773, 33624859, 31040562, 28652615, 26379274, 24637920, 23210969, 22050144, 21041984, 19754200, 18670027, 17724025, 16874389, 15897320, 14952584, 14399599, 13558571, 12653583, 11986735, 11178760, 10650914, 10022010, 9618224, 9281000, 8758062, 8462066, 7912157]
18789G912157k83405k73782l75101l37952l19370m56376j23769K34566J10824
18780F087792o4259K9416k05474l39212n3567n8193j17919k51390p2823O6515
18770E020886k62498k17421P0147K80182R3886j32178k25180Q8334m8813j03537
18760D563808J67745M5804k9329p1203k49076k22455j83455J24038j29373q0558
18750C935946J91699j87404J62723L41812J24401j47509j01779o6310J60166j1930
18740D401815l00478j45441Q6496K18048K89842K48789J53842m6849j71816o7625
18730D666623J05327R7497J23149J55924J39965j88584Q6335M11326L42852M01223
18720F341637L45273K5131J84621J77443M0280O3691K36868J35474K22917K88098
$$ y = [7912157, 7628752, 7354970, 6979869, 6641917, 6322547, 5866171, 5742402, 5976968, 6087792, 6023533, 6052949, 5847475, 5508263, 5454696, 5396503, 5278584, 5027194, 4954371, 5020886, 4758388, 4540967, 4611114, 4891296, 4985182, 4853004, 4627824, 4716158, 4667345, 4563808, 4731553, 4777357, 4748028, 4676825, 4427749, 4205294, 4021839, 4145877, 4016504, 3935946, 4127645, 3940241, 4102964, 4444776, 4569177, 4421668, 4319889, 4253579, 4413745, 4401815, 4101337, 3955896, 4042392, 4260440, 4550282, 4799071, 4952913, 4906064, 4734248, 4666623, 4771950, 4869447, 4992596, 5148520, 5288485, 5099901, 5186236, 5597562, 5940414, 6341637, 6686910, 6712041, 6896662, 7074105, 7114385, 7178076, 7414944, 7550418, 7773335, 8061433]
18710H061433L43216M38893P41464Q39160Q21336J008903R41723J094250P84337
18701A5074715R62217J261129J357076J342316J028144J005870Q71149J170510
18693B4073126J365231J414244J275183J027020J339111J768728K072015K269703
18685C6604361K659930K606861K288410J609309M59929q12091j847547k290501
18677D1278661k608391k173609j466289j340256j192617n42831P0493j45605j32712
18668C1746844n31235p64320o40969r32561j320656j172587j416161j668548j780980
18659B1518827j620006j218853q65976k69581k29167j67713K55674N41958N03979
18650A8449142K68047k11965n05728o20223r07733q05965o64502q77629q83014
$$ y = [8061433, 8404649, 8843542, 9585006, 10424166, 11245502, 12254405, 13196128, 14290378, 15074715, 16036932, 17298061, 18655137, 19997453, 21025597, 22031467, 22902616, 24073126, 25438357, 26852601, 28127784, 29154804, 30493915, 32262643, 34334658, 36604361, 39264291, 41871152, 44159562, 45768871, 46228800, 45416709, 43569162, 41278661, 38670270, 36496661, 35030372, 33690116, 32497499, 31954668, 32025161, 31879556, 31746844, 31215609, 30451289, 29810320, 28877759, 27557103, 26384516, 24968355, 23299807, 21518827, 19898821, 18679968, 17813992, 17544411, 17315244, 17147531, 17403205, 17945163, 18449142, 18717189, 18505224, 17999496, 17379273, 16471540, 15665575, 15001073, 14123444, 13240430]
18641A3240430j130643j065629p13225q06610p84674n67347o49186p47391q53498
18632E922227k47174j11475k52986k78733k95141l96505O9541O8840o7175l12449
18622D098970l47168l30300k94924k55520m9156L58043R0838N9958p3568J27224
18612C384397L92557K79510M2531l51343m41931l36723j7953L73004P3388j15015
18602C282422j22036j68922J9164k66509k81923m0245o3379J89559J00626j05585
18592B543172l5893J67355K01220K9737k08841j16769m0727K3964J65814q4713
18582B644319N0944q6750n8434K67089J95339l2896l0618j22860O7025K98036
18572C191194M9655q8759j4371P1029K0207j02181j16955M9837L3791J69477K85410
$$ y = [13240430, 12109787, 11044158, 10330933, 9524323, 8739649, 8172302, 7523116, 6775725, 5922227, 5675053, 5563578, 5310592, 5031859, 4736718, 4340213, 4409754, 4478594, 4411419, 4098970, 3751802, 3421502, 3126578, 2871058, 2821902, 3179945, 3270783, 3330741, 3257173, 3384397, 3776954, 4056464, 4098995, 3747652, 3305721, 2968998, 2951045, 3324049, 3397437, 3282422, 3160386, 2991464, 3010628, 2744119, 2462196, 2421951, 2358572, 2548131, 2648757, 2543172, 2507279, 2674634, 2875854, 2905591, 2696750, 2579981, 2539254, 2563218, 2729032, 2644319, 2695263, 2608513, 2550079, 2817168, 3012507, 2979611, 2948993, 2826133, 2893158, 3191194, 3240849, 3152090, 3137719, 3208748, 3228955, 3126774, 3009819, 3059656, 3093447, 3262924, 3548334]
18561C548334K28341J53388K4649J47345J45482l3997n0029J37502q1309M45433
18551D665139K62922L33841q8902m33915k07170j01606J91092O9634k11479O4661
18541D544217K26473j23114o9694L13600J37125K34815K97636P2470j69236j34484
18531E329808l14821o035K5830Q9799J79957Q3720P58j9800J88996L50523J10666
18520F019401j13475P2534L33956K57678K26110O7332O1444K48106K92362N53049
18510H018497O98465N82574N73708N67611M01535J25581M92663J068910J156953
18501A3686497J324758J548152J957172K208180K517484K406708K278665K334003
18493C0261619J569998J033214Q55452Q14760J473300K903092L905930M873250
$$ y = [3548334, 3776675, 3930063, 3954712, 4102057, 4247539, 4213542, 4163513, 4301015, 4219706, 4665139, 4928061, 5261902, 5173000, 4739085, 4531915, 4430309, 4621401, 4691035, 4479556, 4544217, 4770690, 4647576, 4577882, 4891482, 5028607, 5263422, 5561058, 5633528, 5464292, 5329808, 5014987, 5008952, 5034782, 5124581, 5304538, 5388258, 5389016, 5369216, 5558212, 5908735, 6019401, 5905926, 5978460, 6312416, 6570094, 6796204, 6863536, 6924980, 7173086, 7465448, 8018497, 8716962, 9299536, 9873244, 10440855, 10842390, 10967971, 11460634, 12529544, 13686497, 15011255, 16559407, 18516579, 20724759, 23242243, 25648951, 27927616, 30261619, 31831617, 32864831, 33720283, 34535043, 36008343, 38911435, 42817365, 47690615]
18485D7690615N713379O596689O001458N726929O273790P848561R922523R674136
18477A05448080N650663L36316l289139l914423j247712M269142R935970J3769412
18469A30958309J1563083M437758k093232o106392n805155l149261k629641m191131
18461A22984338o394782p383532n583039j348755L696642P769939R042897M699429
18453A27483137r46087n290099p056048m836516m54175M238383P851553J0475997
18445A31466145J0809793Q938451N861443K719605P01915K56446J520712M540034
18437A66814544R198212J4298708J8615479K1868756K3042124K2900030K1755649
18430B98493502K2354085K5240861K8321426K5438789J5708167N083152k567120
$$ y = [47690615, 53403994, 60000683, 66002141, 71729070, 78002860, 85851421, 95773944, 105448080, 111098743, 111435059, 108145920, 104231497, 102983785, 107252927, 117188897, 130958309, 142521392, 146959150, 144865918, 138759526, 132954371, 129805110, 127175469, 122984338, 116589556, 109206024, 103622985, 102274230, 105970872, 113740811, 122783708, 127483137, 126537050, 121246951, 114190903, 109354387, 108900212, 113138595, 120990148, 131466145, 142275938, 151214389, 157075832, 159795437, 160497352, 160753798, 162274510, 166814544, 176012756, 190311464, 208926943, 230795699, 253837823, 276737853, 298493502, 320847587, 346088448, 374409874, 399848663, 415556830, 420639982, 418072862]
18423D18072862n109218r36056P384371J4632933J5864105Q578504l716685j3336222
18415D41434594j6902042j4721735j3034040j8838198k7512296l3499293l3988704
18408B82938286k6978669j5148043l937740L168894J867622p207774j7251643
18401B17450933k4809273k7031703k3819153j8216131j3307171r558840o966126
18394I3742536n468986l891460k966575k052930o49638P53496K636839M634131
18386H6737413P003878Q744281R769271R978469Q936562P446845O280096N320899
18378A50217714L871474J869706j155857m838835p760434r758460j0536607j0620187
18370A11288514r419726q267878o739970n652983m724466m644960m346273m168266
$$ y = [418072862, 412963644, 412027588, 419411959, 434044892, 449908997, 458487501, 454770816, 441434594, 424532552, 409810817, 396776777, 377938579, 350426283, 316926990, 282938286, 255959617, 240811574, 236873834, 240042728, 241910350, 234702576, 217450933, 192641660, 165609957, 141790804, 123574673, 110267502, 100708662, 93742536, 88273550, 84382090, 81415515, 79362585, 78712947, 79466443, 82103282, 86737413, 93741291, 102485572, 112254843, 122233312, 131169874, 138616719, 144896815, 150217714, 154089188, 155958894, 154803037, 149964202, 142203768, 132445308, 121908701, 111288514, 101868788, 93600910, 86860940, 81207957, 76483491, 71838531, 67492258, 63323992]
18362F3323992l594200k902364j727574p29370Q9063J501058L263350N044968
18354F4268923P807766J2113334J7981252K6044343L4176769L7884709L2862196
18347B33139292K2977913J2225074j679738j6864521k7260062l2432828l2167678
18340A57937452k6446115j8875758j2454483q232196m932110k840829j277937
18333H2878024k69070k14349n69143o99656p97947r24556j697828k406343k879854
18324G2419278l784383m637681m444252m396451l557545k553871j823985j238305
18316D5982805n42921K14334N27166Q27207J724424K815460M271296O126688R288326
18307G1234785J3626106K0134946K8216437L4205039L4739833K9826921K3818805
$$ y = [63323992, 59729792, 56827428, 55099854, 54370484, 54459547, 55960605, 59223955, 64268923, 72076689, 84190023, 102171275, 128215618, 162392387, 200277096, 233139292, 256117205, 268342279, 266662541, 249798020, 222537958, 190105130, 157937452, 131491337, 112615579, 100161096, 91928900, 86996790, 84155961, 82878024, 82608954, 82394605, 81825462, 81125806, 80327859, 79403303, 77705475, 75299132, 72419278, 68634895, 63997214, 59552962, 55156511, 51598966, 49045095, 47221110, 45982805, 45439884, 45654218, 46181384, 47008591, 48733015, 51548475, 55819771, 61946459, 71234785, 84860891, 104995837, 133212274, 167417313, 202157146, 231984067, 255802872]
18300B55802872J5819265N258820m675396j2706839j7235832j7993539j8804390
18293B05464961j9432244k0054650j8867095j6609497j3086582r487946o922119
18286A01004828n209874m086041l039870k726462k299324k759844l411332l849931
18278G3622150m897385n263772n087437m813562m172800l424358k841592k112909
18270D1008335j662630j193197n23593Q9246L18232L85074L64219J05563j26019
18261C8765230l36595k5476J218049K176578L859057O741697J0633210J4793161
18253G7824911J6884335J5236830J1258783O049922q83766p961597j1976799j3908373
18245I2524246j3439196j1387182q939151p420508o207147m946321m195308l928517
$$ y = [255802872, 271622137, 276880957, 272205561, 259498722, 242262890, 224269351, 205464961, 186032717, 165978067, 147110972, 130501475, 117414893, 107926947, 101004828, 95794954, 91708913, 88669043, 85942581, 83643257, 80883413, 77472081, 73622150, 68724765, 63460993, 58373556, 53559994, 49387194, 45962836, 43121244, 41008335, 39345705, 38152508, 37628915, 37718161, 38036393, 38421467, 38785686, 38891249, 38765230, 38428635, 38403159, 39621208, 41797786, 45656843, 52398540, 63031750, 77824911, 94709246, 109946076, 121204859, 127254781, 126371015, 118409418, 106432619, 92524246, 79085050, 67697868, 58758717, 51338209, 45131062, 40184741, 35989433, 32060916]
18237C2060916l241910l058163k500250j875113j754727j432636j313363j403090
18229A5481664j048978r85329r36880j039771n75317j85220m89664m54612l77802
18220I388091k57141n21796p04156l27350j74004j38181k54204l25759l21885
18211F363615j27940k68355k54892J342K28607j51733q0734L5081j28111J0235
18201E627115J42225J84335K67229L64347L72662K77938j13490m06159q7375j53784
18191F475043n84840k90228k16846l19791k07479j92538j56386l79743n11674
18182C615518j49948J25118k01443j08539K70973j0475j26674m8385l77350k73312
18172B715483m9423J83065J76178J41171o8512p4023O3197k74847j76248m5718
$$ y = [32060916, 28819006, 25760843, 23260593, 21385480, 19630753, 18198117, 16884754, 15481664, 14432686, 13447357, 12510477, 11470706, 10895389, 10710169, 10220505, 9765893, 9388091, 9130950, 8609154, 7904998, 7577648, 7403644, 7265463, 7011259, 6685500, 6363615, 6235675, 5967320, 5712428, 5713770, 5942377, 5790644, 5709910, 5744991, 5616880, 5627115, 5769340, 5953675, 6220904, 6585251, 6957913, 7235851, 7122361, 6716202, 6628827, 6475043, 5890203, 5599975, 5383129, 5063338, 4855859, 4663321, 4506935, 4127192, 3615518, 3465570, 3590688, 3389245, 3280706, 3551679, 3541204, 3414530, 3366145, 2988795, 2715483, 2666060, 2849125, 3025303, 3166474, 3097962, 3023939, 3087136, 2812289, 2636041, 2590323]
18162B590323l7928J17172K33862M345j84046k65864k70004J17311J02693K62994
18152B670858m0981o2854k0474k65245L5077j79686k28317J55816j03944j52605
18142A807645J91935m5374j890k0414M1526J21421k1542q8271j02568n6327J47144
18131A973285j9267Q7258K2875j16038Q9509J10805j73477K23062o6743j30936
18121B000333j93558n5731r1199O1020J27705j28346n6257j88445J83372K68075
18111A926969K3862L739K03662j8807j95406m18294k51674L5217Q4985J59277
18101A553530l634J76894j96503O4174J80532J2988j27681q5135k16659J1865
18091A370371n3032j55903q52J76332K4006j00822J63732J78041K83183M2031
$$ y = [2590323, 2552395, 2669567, 2903429, 2907774, 2723728, 2457864, 2187860, 2305171, 2407864, 2670858, 2629877, 2567023, 2546549, 2281304, 2316381, 2136695, 1908378, 2064194, 1960250, 1807645, 1999580, 1954206, 1952316, 1931902, 1973428, 2094849, 2073307, 1985036, 1882468, 1826141, 1973285, 1954018, 2041276, 2064151, 1948113, 2037622, 2148427, 1974950, 2198012, 2131269, 2000333, 1806775, 1751044, 1659845, 1720865, 1848570, 1720224, 1663967, 1475522, 1658894, 1926969, 1950831, 1954570, 2158232, 2139425, 1944019, 1525725, 1274051, 1309268, 1394253, 1553530, 1549896, 1726790, 1530287, 1594461, 1774993, 1787981, 1660300, 1575165, 1358506, 1370371, 1317339, 1161436, 1160584, 1336916, 1360922, 1260100, 1423832, 1601873, 1885056, 1927087]
18081A927087j79606l19657j46820j43465k12972K1737K81576L0650j25389J10516
18071A243657J85138J09745J70630j0075k44859o8189J86218K4936k38249o9771
18061A289181p5970K91203J77102L1010L3319k65641j15748j49944J6904l1387
18051A200029l8539J67084l2877p3506R8016Q8864M2199j87813l12251K9788K17542
18040A198536L00723J035P9950J06664l34759k05877m1382j87526j36989q3559
18030F96816J49871L02549K1305J88393M03326M7883K9662K38853j13223j42405
18020A823030l24242k07386O8100N7501R6705J9651k51919j52743o7812J40952
18010A201837J54116J7758M0760J23915m1050k05675k89905j89325j89144J97021
$$ y = [1927087, 1747481, 1427824, 1281004, 1137539, 924567, 946304, 1227880, 1258530, 1133141, 1243657, 1428795, 1538540, 1709170, 1699095, 1454236, 1386047, 1572265, 1597201, 1358952, 1289181, 1213211, 1504414, 1681516, 1712526, 1745845, 1480204, 1364456, 1214512, 1231416, 1200029, 1161490, 1328574, 1295697, 1222191, 1320207, 1409071, 1451270, 1263457, 951206, 980994, 1198536, 1499259, 1500294, 1580244, 1686908, 1352149, 1146272, 1104890, 917364, 780375, 696816, 846687, 1149236, 1170541, 1358934, 1762260, 1810143, 1839805, 2078658, 1965435, 1823030, 1498788, 1291402, 1359502, 1417003, 1513708, 1533359, 1281440, 1128697, 1060885, 1201837, 1355953, 1373711, 1414471, 1538386, 1497336, 1291661, 1001756, 812431, 623287, 820308]
18000H20308M78798J29866j42328n9842j81162k09526R672K6862j40799O2567
17990G94416l7675j36114K9774K00444P8665j36658n0904L54884J17318k6067
17980A188083j9560k07870j24491J83821P6852m269k18510N0188K11300l2705
17970A102839q5566j44918J8804L43317Q6301k31851j64066j2538l7759L91097
17960A265660L54806L29849J06832k2998j53267n5134J6945j64779j2529k4085
17950A641300j72823k48296P1824L89036K97850l6070j14876q2603m3721J21976
17940A823597j31761N3376j28880k82192M3331K71867K74563Q9316j23773j9254
17930A870190K57181K9920j23009n2326k25880L7426R4526J88048L415L6592j48889
$$ y = [820308, 1299106, 1428972, 1286644, 1226802, 1045640, 836114, 845786, 872648, 731849, 794416, 756741, 620627, 650401, 850845, 929510, 792852, 741948, 1096832, 1214150, 1188083, 1168523, 960653, 836162, 1019983, 1096835, 1092566, 874056, 924244, 1135544, 1102839, 1017273, 872355, 891159, 1234476, 1320777, 1088926, 924860, 912322, 874563, 1265660, 1620466, 1950315, 2057147, 2034149, 1880882, 1825748, 1842693, 1677914, 1665385, 1641300, 1468477, 1220181, 1292005, 1681041, 1978891, 1942821, 1827945, 1745342, 1701621, 1823597, 1691836, 1745212, 1616332, 1334140, 1377471, 1649338, 1923901, 2013217, 1889444, 1870190, 2127371, 2157291, 2034282, 1981956, 1756076, 1793502, 1888028, 2076076, 2079491, 2116083, 1967194]
17919A967194k86041O8165o606k13600k07892j97746k1630M55721m2771k72894
17909A241900J88588k04875j49406K19808N0065k91103J70990j49918P4144L26775
17899A476968J66741K5788L7615k62710J52799Q4797J02833m8127j87253N8492
17889A607943K00775K20390j8459P2258M8421j73364l06470p4096o3434j75506
17879A338458J9967Q6986J56636L59601K6292j4477J40145j23486k25662J54222
17869A918682M73545J12183j36763l14930j16773J29138l09711k64388o6752p7072
17859A347159k6971j78438r7546j21244R011q391J83343l9800k53183J62610L21804
17848A298354l15878l41630M9043k8443J02113J60405J04728M93126J48884L0568
$$ y = [1967194, 1681153, 1749318, 1742712, 1529112, 1321220, 1123474, 1101844, 1557565, 1514794, 1241900, 1430488, 1225613, 1076207, 1296015, 1346080, 1054977, 1225967, 1076049, 1150193, 1476968, 1643709, 1669497, 1707112, 1444402, 1597201, 1681998, 1784831, 1736704, 1549451, 1607943, 1808718, 2029108, 2010649, 2082907, 2131328, 1957964, 1651494, 1577398, 1513964, 1338458, 1358425, 1445411, 1602047, 1961648, 1987940, 1973463, 2113608, 1990122, 1764460, 1918682, 2392227, 2504410, 2367647, 2052717, 1935944, 2065082, 1755371, 1490983, 1424231, 1347159, 1320188, 1141750, 1044204, 922960, 931971, 923580, 1106923, 1067123, 813940, 976550, 1298354, 982476, 640846, 689889, 661446, 763559, 923964, 1028692, 1521818, 1670702, 1701270]
17838A701270l8538l024L81N4628K883j13337k10228Q594q7241r8625p2244j33106
17826A011413j09683o1563j49810k15729k5443L3511K03456K0040Q3028Q32j26846
17815F63206k81625K0444M0962J42594L33472J28020J11839j04533j65791j13465
17805G75123j0727Q493j88900R1584K16626R5970N6923r8153K84555L31017k04132
17794A358379m296K27134J82565j06816q7967K19831L15426l9915P1934k26216
17784A910059k10353p5028j18869l53392p9694P7625p5720j39316m1249o9459
17774H24604J8246J92158J18052q2825Q8952M9858j51614l67697j45020k6717
17764E17997J15270K5058K28601j17112l24876O8160Q8485k10672L677J30455
$$ y = [1701270, 1662732, 1659708, 1660089, 1714717, 1717600, 1604263, 1394035, 1402629, 1315388, 1216763, 1144519, 1011413, 901730, 840167, 690357, 474628, 449185, 482696, 686152, 706192, 789220, 790052, 663206, 381581, 402025, 442987, 585581, 919053, 1047073, 1158912, 1054379, 888588, 775123, 764396, 772889, 583989, 675573, 892199, 988169, 1045092, 946939, 1231494, 1562511, 1358379, 1354083, 1581217, 1763782, 1656966, 1568999, 1788830, 2104256, 2064341, 2136275, 1910059, 1699706, 1624678, 1505809, 1152417, 1072723, 1150348, 1074628, 935312, 894063, 824604, 842850, 1035008, 1153060, 1070235, 1159187, 1209045, 1057431, 689734, 544714, 517997, 633267, 658325, 886926, 769814, 444938, 513098, 601583, 390911, 394588, 525043]
17754E25043J59158P7654K82333q8468j92021K33004m8155k53284j30285Q5113
17744F50092j03865J30957J36697K02374j9425j5003O7737J96290J08693J28631
17734A483178k6158J9834l28688M0116j29875l85612l5859P5271O5754r9918k24468
17723D53575J10086q5610k4458j44480j4359l8511p5300L419K80176J60779q6998
17712E38319J06917m6038j3962k34856j55803L9708n7827P0909J57422J65528
17702E70317N7177j79148J4974j21007J00706l0168j63848M76529J84466k60457
17692F49541l70275j91373o587R0823Q994J32482K27814K294J037k43736j13721
17681A87293O64K9959J5634Q6599l1117k16309M1485q0929K41820K58409j8044
$$ y = [525043, 684201, 761855, 1044188, 955720, 763699, 996703, 948548, 695264, 564979, 650092, 546227, 677184, 813881, 1016255, 996830, 981827, 1049564, 1245854, 1354547, 1483178, 1457020, 1476854, 1148166, 1188282, 1058407, 672795, 636936, 712207, 777961, 678043, 453575, 563661, 478051, 453593, 309113, 294754, 256243, 180943, 184362, 464538, 625317, 538319, 645236, 599198, 585236, 350380, 194577, 234285, 176458, 247367, 404789, 570317, 627494, 448346, 463320, 342313, 443019, 412851, 249003, 725532, 909998, 649541, 279266, 87893, 81306, 172129, 181123, 313605, 541419, 543713, 544750, 301014, 187293, 187957, 217916, 233550, 320149, 289032, 72723, 114208, 33279, 275099, 533508, 515464]
17670E15464k47178k58382L11717J39283Q9047k56049k16677o2808J55816J26661
17660B96894N6376N7248J25033j52152k3862M661L20701p444j79287r8508k81088
17649A18572J53675N9414j34022N1656J91430k1739J14348L01963j73922k56485
17639D04890L14049Q3861j80791k69951J42924K53076j12483k28840m10181K5114
17629B1668M8770l7013L7118J20860P7355q9730K14246j3016P1597L7810K2723
17618E12388J00220k93275k26057J77540L41342K57734j30963k65811N0685j81820
17608C41983k99175r822J93933J18057J74470L4292j87162k41851n3887j43452
17598g2614j47244J55195K57685O081J20762n7996j49974p8717J45567N0429k77330
$$ y = [515464, 268286, 9904, 321621, 460904, 549951, 293902, 77225, 14417, 170233, 296894, 353270, 410518, 535551, 383399, 359537, 364198, 684899, 677455, 498168, 399660, 118572, 272247, 331661, 197639, 249295, 440725, 418986, 533334, 835297, 661375, 404890, 718939, 802800, 622009, 352058, 494982, 748058, 635575, 406735, -3446, 21668, 70438, 33425, 70543, 191403, 268758, 179028, 393274, 380258, 451855, 489665, 512388, 612608, 319333, 93276, 270816, 612158, 869892, 738929, 473118, 523803, 341983, 42808, 32986, 226919, 344976, 519446, 553738, 366576, 124725, 70838, -72614, -219858, -64663, 193022, 199103, 319865, 261869, 111895, 33178, 178745, 229174, -48156]
17587d8156q9510K42384J37516k30028P9046k03860k596J99274Q3955q332k1291
17576A38402j09223Q2962j5930k99033q2575k0510K54465J50849K72311K23963
17566E95681m9541J6824J76197Q2537q0806p5858q4866j4205j28279j50685P5342
17555C62341j37022J21514o9673j47692J48484m6640k49947l26944q0829K08708
17545b17700m03O6705R1575J19577Q5476p8170J07134j09541m7014o7846j57324
17534b07531P7111j1295K6951L1419K45873j8111j43321j14622J97217q3989k9643
17523b9941L20048P0712l31890j4K41849M5579O6825q0235p4848Q7837j64442
17512A51480r9855P4995P3294j9240Q1369k5022j61750n4113L03851m93M3578
$$ y = [-48156, -137666, 104718, 242234, 12206, 91252, -112608, -115204, 84070, 168025, 159693, 138402, 29179, 112141, 96211, -202822, -285397, -305907, -51442, 99407, 371718, 595681, 546140, 562964, 739161, 821698, 740892, 665034, 580168, 565963, 437684, 286999, 362341, 225319, 346833, 277160, 129468, 277952, 231312, -18635, -345579, -426408, -217700, -218103, -151398, -59823, 59754, 145230, 67060, 174194, 64653, 17639, -50207, -207531, -130420, -141715, -114764, -83345, 162528, 144417, 1096, -113526, 83691, -298, -29941, 290107, 360819, 28929, 28915, 270764, 316343, 383168, 302933, 228085, 315922, 151480, 51625, 126620, 199914, 180674, 262043, 237021, 75271, 21158, 325009, 324516, 368094]
17501C68094q0707n0690j70986N805J89930o618Q5840p6980j8550K18668m5081
17490D18725J2284J50958o3484J215k00437p7950j89143k9703J5563N6949P8498
17479A73475k0619L80666m9707j82448j63219j60761j13529K53410J89996K5629
17469C32893J73302O6884l00691l75895K7994M4848n1142m734J29129K38338O0163
17458C41089p7380J79355o9639J13963j96478k57110J01637j86281q8818j84340
17448c24002Q6647j25469K99144K90570j27989j23560J3273L7656L03980J37154
17438D67404q2131j3652J5304Q8133P0885l95086l02124J14924J86304J85377
17428C35338l3562R9060L5326j38974l0395K2197p0742N2351J32607R3751j49036
$$ y = [368094, 287387, 236697, 65711, 71516, 261446, 254828, 340668, 263688, 245138, 463806, 418725, 431009, 581967, 518483, 519698, 319261, 241311, 52168, 22465, 38028, 94977, 173475, 152856, 533522, 483815, 301367, 138148, -22613, -136142, 117268, 307264, 332893, 506195, 573079, 272388, -103507, -75513, -30665, -81807, -86541, 42588, 280926, 341089, 263709, 443064, 373425, 487388, 290910, 33800, 135437, -50844, -139662, -324002, -237355, -362824, -63680, 226890, 98901, -24659, -11386, 26270, 330250, 467404, 385273, 371621, 386925, 475058, 545943, 150857, -151267, -36343, 149961, 335338, 301776, 400836, 436162, 297188, 266793, 288990, 218248, 270599, 403206, 496957, 347921]
17417C47921l7341J44331J31395J2360j09641K17865J74541k52168j00490r0473
17407D38300k53244r1000L64308J58727j41798o7601l516m8060q4879J20432K06109
17396E97778m3004Q5696k59018j32737k6166J81778l6910P624q7411k0506J05679
17385C72803j02234k16398J34832K09240K00129r8976L9259M8694p8173k7342
17375D81834j80082j14477o0253j84935l76588L48201M95241m7712j99527p403
17365A54299M9574J7330J33786P9211j01359R8965J6529K7729R9138j02192p9471
17354C93539K02914k9886j86126l68059J40158K43292j22180K18328j34597r3227
17344B64156P1727Q084O1817j28211k10714j35212J11538k9970j00470j31956
$$ y = [347921, 310580, 454911, 586306, 598666, 489025, 706890, 881431, 629263, 528773, 438300, 185056, 94056, 458364, 617091, 475293, 407692, 404176, 356116, 271237, 391669, 597778, 554774, 640470, 381452, 248715, 222549, 404327, 367417, 375041, 287630, 267124, 372803, 270569, 54171, 189003, 398243, 598372, 499396, 538655, 587349, 509176, 481834, 301752, 187275, 127022, -57913, -434501, -86300, 408941, 361229, 161702, 154299, 203873, 221203, 354989, 434200, 332841, 431806, 448335, 476064, 575202, 473010, 393539, 596453, 566567, 380441, 12382, 152540, 395832, 273652, 491980, 357383, 264156, 335883, 343967, 405784, 277573, 66859, -68353, 43185, 13215, -87255, -219211]
17334b19211L66446L01418j50350n0682K79052n1231m05787j81569l1633K06554
17324F3007J75813J55843J2373K9335J9912M3033K37245J17722P8155J02393m01840
17313F32991j54871j62804l1284r3909j79228j14256m583Q2137L1974J83332J69502
17302C59001k948j60438k2472R8413k56567j69096J63671J55307L1415m6219n6926
17291I3141q07j54616J47754O7299L5698j9247L6570R5472K81822j54182q0437
17280C48467L8291j33581l8459J9981K63117Q3786j32934l33680k33240Q5303
17270c2949R1660J40531j65380j24748l4488J69811J52548r0221J88787J87068
17260D82619K42199J54668R2134m18462l30956K59905O4802O267j28292j2525
$$ y = [-219211, 147235, 448653, 298303, 247621, 526673, 475442, 69655, -111914, -143547, 63007, 238820, 394663, 407036, 436371, 456283, 499316, 736561, 854283, 932438, 1034831, 632991, 478120, 315316, 284032, 190123, 10895, -103361, -107944, -25807, 6167, 189499, 359001, 356053, 195615, 173143, 271556, 14989, -154107, 9564, 164871, 196286, 150067, 93141, 92334, -62282, 85472, 152771, 188469, 169222, 205792, 301264, 583086, 428904, 348467, 386758, 253177, 214718, 234699, 497816, 581602, 448668, 114988, -118252, -32949, 58711, 199242, 33862, -90886, -125374, 44437, 196985, 106764, 295551, 482619, 724818, 879486, 971620, 553158, 222202, 482107, 546909, 553176, 424884, 412359]
17250D12359k9842p1465K09588K30970q5508l84719k07396K52034J94297k7141
17240D93177k77920l1240K80014k2659j8135k11850N3779j29333o1761K75145
17230C49217J41752j2776j15526l9252J43329j19650j74975k35170P3110J03352
17220A13411O832J30816P3166k7461j75728J11743L03910m6743l37386J3093q9260
17209G6393K1366J82725L4624n5836j29225L4555J2978M9897J77777R5990j33678
17198C67566R3891K46705J28313j08763m367j00395l66098k19889k8263K48224
17188B56924J03354j05988J4845k34016P6904J323m0718O6210j18939q74j3597
17177E428J57720L0776j1622j56430r2257Q5028K73901K1751j00122k84272j97113
$$ y = [412359, 382517, 311052, 520640, 751610, 666102, 281383, 73987, 326021, 520318, 493177, 215257, 184017, 464031, 441372, 423237, 211387, 265166, 135833, 74072, 349217, 490969, 478193, 362667, 323415, 466744, 347094, 172119, -63051, 10059, 113411, 120243, 251059, 324225, 296764, 121036, 232779, 536689, 489946, 152560, 165653, 76393, 97759, 280484, 315108, 259272, 130047, 164602, 177580, 227477, 405254, 501244, 367566, 461457, 708162, 836475, 727712, 723345, 622950, 256852, 36963, 8700, 256924, 360278, 254290, 269135, 35119, 112023, 113346, 72628, 138838, 19899, 19025, 5428, 163148, 193924, 182302, 25872, -66385, 18643, 292544, 314295, 214173, -70099, -267212]
17166b67212L22548K41634J48379p3740k45521q1474l6167K98212L18844J65202
17156G90705j33787j09124r7782j69964j73204J45571O4544n8032J17979K65107
17146F42013o0309k41213J1380J65394J87088j3114k69279l1658j12226r1546
17136A86530K04447J9603K18996n1688k32514k08749K38138l517q5535p106Q4272
17125C62877K61060P714o4227K8489o2915r3077o1375K90007k12676l64138O9446
17114A61185m6760N2410j00705M8472N2990j17782O9783J89773n4745k87922j37703
17103a71004j90159R730J61527J89558n040R1000K52859N5477k33905k38377O8209
17092a0125J91215j573J6545O2621Q5017R1817j66813l58246j24810K79009J87067
$$ y = [-267212, 55336, 296970, 445349, 371609, 126088, 44614, 8447, 306659, 625503, 790705, 656918, 547794, 450012, 280048, 106844, 252415, 316959, 258927, 376906, 642013, 581704, 340491, 351871, 517265, 704353, 691239, 421960, 390302, 278076, 186530, 390977, 410580, 629576, 577888, 345374, 136625, 374763, 371246, 285711, 278605, 362877, 623937, 631651, 567424, 595913, 532998, 439921, 378546, 668553, 455877, 91739, 161185, 114425, 166835, 66130, 114602, 167592, 49810, 119593, 309366, 254621, -33301, -171004, -361163, -351433, -189906, -348, -5388, 85612, 338471, 393948, 160043, -78334, -10125, 181090, 179517, 196062, 258683, 343700, 435517, 268704, -89542, -214352, 64657, 251724]
17081B51724J30227k94646j14540M8248K27609P435k23360N8877J85081K48713
17071E25368O9719k90199j09159J19454j66483J42963L29518J00903j95794m9373
17061D76917J12968j32707j27290K3206K05388k62556j08388K07319J41527l9871
17051D96513o1548L4431j60604l06693K29958L11193j30670k25303J10604q4900
17041B12981l07613k40022K48363J82520k12930K36434J89620J47956j18897k24229
17031A14183j0710J03613J60406J94571Q8094n9816Q7487j5199J40006j29235
17021F73400o1620j06880N459N4501q4120j65226k42212j36427K06505K01552
17011C44932Q0218j73656K69790J47481j88536k2044j42460j70886k23487L04038
$$ y = [251724, 381951, 87305, -27235, 21013, 248622, 256057, 32697, 91574, 276655, 525368, 595087, 304888, 195729, 315183, 148700, 291663, 621181, 722084, 526290, 476917, 589885, 457178, 329888, 353094, 558482, 295926, 187538, 394857, 536384, 496513, 434965, 469396, 308792, 2099, 232057, 543250, 412580, 187277, 297881, 212981, -94632, -334654, -86291, 96229, -116701, 119733, 309353, 457309, 338412, 114183, 103473, 207086, 367492, 562063, 650157, 590341, 677828, 662629, 802635, 673400, 611780, 504900, 510359, 564860, 480740, 315514, 73302, -63125, 143380, 344932, 425150, 251494, 521284, 668765, 480229, 458185, 315725, 144839, -78648, 225390]
17001B25390J95309P6476j51248N4622R6215p9479J00912Q4633j57616m09161
16991C6053j0942J71656J07959j46036k33905m7822J62891K50820M0071K26849
16981E57594n1513k44053J04916j14112j45398J4539j56845j74044J59903R9076
16971E0063P9327J50113n6807j95376J53453L9402n3348r2765j40512J25191L02098
16960C60839J44766j85177k51594j53151J67356J59908k3862J86765j59472j12507
16950A33871j34934J32271J05148K0362m2626j3256Q7687m627j40065j16617N5583
16939H2797j54998j37608j82589J47299k7316M0606L21481L54806r0571K85211
16929F39118j10891n60029o4895L2999K78877P0387j80898j5502K08523Q7897
$$ y = [225390, 420699, 497175, 345927, 400549, 496764, 417285, 518197, 602830, 445214, 36053, 25111, 196767, 304726, 158690, -75215, -123037, 39854, 290674, 330745, 557594, 506081, 262028, 366944, 252832, 107434, 121973, -34872, -208916, -49013, 50063, 129390, 279503, 222696, 27320, 180773, 220175, 166827, 74062, -66450, 58741, 360839, 505605, 320428, 68834, -84317, 83039, 242947, 219085, 405850, 246378, 133871, -1063, 131208, 236356, 256718, 214092, 200836, 288523, 283896, 143831, 27214, 82797, -72201, -209809, -392398, -245099, -272415, -231809, 89672, 444478, 353907, 639118, 528227, -31802, -96697, -63698, 215179, 285566, 104668, 89166, 297689, 385586]
16919C85586o4601M4090K17941q0949j68568j01369n9423K80010p0890k2180j73015
16908A86632k36947j60844J48868J10105J5292Q863J93388K24345j41013o3784
16898B84905j1654O4715J63909p5354k41349m8823J48923m5396l38350k585K14512
16887A13453Q0108P860j19619k21637L3175R9520J59584r5607J29811K08907k48159
16876A47396k31092P3756L9192Q5124J8094M2958j27459j06405K7491k1293P8260
16865B6022j3334K59126K5198k63786k61061K12057K06596q6840j52782J10522
16855F1718K7438J87439J29873k35337r8414L04839K18893j52857k73436m193
16845A65963j52068j06031L3933P5581Q9604j51477O1336O6846k9013j47303J27580
$$ y = [385586, 320985, 365075, 583016, 502067, 333499, 232130, 172707, 452717, 381827, 359647, 186632, -50315, -211159, -62291, 47814, 63106, 71969, 265357, 489702, 348689, 284905, 273251, 337966, 501875, 426521, 185172, 136349, 285272, 239876, -98474, -101059, 113453, 193561, 201421, 81802, -139835, -106660, -7140, 152444, 56837, 186648, 395555, 147396, -83696, -9940, 29252, 114376, 132470, 175428, 47969, -58436, -30945, -52238, 26022, 12688, 271814, 297012, 33226, -227835, -15778, 190818, 103978, -48804, 61718, 89156, 276595, 406468, 171131, 72717, 377556, 596449, 443592, 170156, 165963, 13895, -92136, -58203, 17378, 106982, -44495, 16841, 83687, 54674, -92629, 34951]
16834C4951k1958R3141J83727O1063K6597k6650m35410j00391J50798J76531R5118
16823B37517p1829k14805o8975K0507J02081J59885L00670J13999Q0975J2938
16813F72963l43099J979K13074l48771o0648K09256j69908k12436l5825J70417
16803I7002N5148O8143Q8202j48827m9719K74928N0197o9763J04219k0359j56393
16792B92778k2909J00350j17965k867j11455j89437k6063j08394q4932K49195
16782b1699J45027j3785m183J42345k9670J00015J93487Q944k4642q9949o7155
16771C38735J8347J4606J56194J51014k42148k00678J60750J3421k53228j20997
16761C6016Q1938n3463J08786J07489j17881k49618K0104k2950j70279q5495K64914
$$ y = [34951, 12993, 106134, 289861, 350924, 377521, 350871, -84539, -184930, -34132, 142399, 237517, 165688, -49117, -118092, -97585, 4496, 164381, 465051, 579050, 660025, 672963, 329864, 331843, 544917, 196146, 135498, 344754, 174846, -37590, -73415, 97002, 152150, 220293, 308495, 159668, 109949, 384877, 435074, 365311, 469530, 449171, 292778, 269869, 370219, 252254, 249387, 137932, -51505, -77568, -185962, -270894, -21699, 123328, 109543, 105360, 247705, 218035, 318050, 511537, 520481, 495839, 405890, 338735, 357082, 371688, 527882, 678896, 436748, 236070, 396820, 410241, 157013, 36016, 117954, 64491, 173277, 280766, 162885, -86733, -66629, -89579, -259858, -345353, -80439]
16750h0439K89723N4666n76m644K25109j7297p4952j95002l9781K02534J06497
16739D65838j85179k79837K06266K44065q6335k84844J34578j51349K4449J8742
16729A06394j18816j38064Q0416Q4346J12030j43624j52895J74331J97565Q062
16719B09745J42548J27626L287O8394j06189k42347j65727R1937P7445j6835j62504
16708B7380M691k04092J28455J8583k9200n8258Q944J59886Q5457P2623J16069
16697C30538j75042m07096N2570L49210L00882p6895m67755p4968J9930K29143
16687H0517J86689j51047n3499k39495R7891K30611J24101j56389q6202j26040
16677i2863j7232k17708K11141J88892O404j87715J12028P8498L1562R8292n5244
$$ y = [-80439, 209284, 263950, 263374, 258730, 483839, 466542, 391590, 196588, 156807, 359341, 465838, 280659, 822, 207088, 451153, 364818, 79974, 214552, 63203, 87652, 106394, -12422, -150486, -70070, 14276, 126306, -17318, -170213, 4118, 201683, 209745, 352293, 479919, 483206, 551600, 445411, 203064, 37337, 129274, 206719, 189884, 27380, 32071, -172021, -43566, -24983, -54183, -112441, -103497, 56389, 141846, 214469, 330538, 155496, -251600, -199030, 150180, 451062, 374167, -93588, -168556, -148626, 80517, 267206, 116159, 62660, -176835, -78944, 151667, 275768, 119379, 33177, -92863, -110095, -327803, -116662, 72230, 78634, -109081, 2947, 81445, 113007, 211299, 156055]
16666A56055j88294Q1067J87943L567J3634l3401j3818j05720j72839m5817L43189
16655B25566K49634M720j43558r5305j08177j2179r8805Q5135L3728j72203N3142
16644B1698j41617q1417J41143R1888J80487O3142k9700J63183n2268R623J1604
16633C77766J25234N257j94526k21019j65020J0464J09497J51336J12968m5428
16623B66529k1322N0727j97955k29064j96161K2177K49234K33309J71325O5603
16613D14402j045k56366l8484K27108k206J00187j02607q8364k68258j36554k6702
16602a78889K7481J78397j3330O2940K13746j17767j68356L349K74929J18281
16592D00781l51505j59247J85094J4318m53n0439m00r784J42951J76191j91323
$$ y = [156055, -32239, 48828, 236771, 240338, 253972, 220571, 206753, 101033, -71806, -117623, 225566, 475200, 479920, 336362, 241057, 132880, 120701, 21896, 107031, 140759, -31444, 21698, -119919, -201336, -60193, 31695, 212182, 275324, 245624, 408807, 356539, 366162, 377766, 503000, 508257, 313731, 92712, -72308, -61844, 47653, 198989, 311957, 266529, 245207, 295934, 97979, -131085, -327246, -305069, -55835, 177474, 348799, 414402, 413357, 156991, 118507, 345615, 343409, 443596, 340989, 252625, -15633, -152187, -178889, -151408, 26989, 13659, 76599, 290345, 172578, 4222, 7571, 282500, 400781, 49276, -109971, 75123, 89441, 88988, 38549, 38149, 28365, 171316, 347507, 156184]
16581A56184k7021J28650J83897o6749j29535j57074k7678J82366O768j23347
16571A26461J24934p1895L2475R6225M7271j84199k17508J22469N334J96042J04639
16560C82248P1725j89060p2360M0102r4866o0639k59684j84272J29266O6374R9595
16549g1571k6643Q0937l3239J29346N1510q3663K8260P4795k01198K50528J63121
16538C62183j06460k00495J67861n9382o1197j48429K88105J19386J07416j79330
16528B89658k87748j51381J24400K73645o8120J52557j06455j42846j22678J3129
16518b5839J46429L53249q0569j5625j70889K33535K11928p7271m29916J24421
16508B69453K59229j87667k61503j62969j14720P9197O7538p8781j4156J44236
$$ y = [156184, 129163, 257813, 441710, 374961, 245426, 88352, 60674, 243040, 249808, 126461, 251395, 179500, 211975, 308200, 355471, 171272, -46236, 76233, 81567, 277609, 382248, 453973, 264913, 192553, 232655, 137789, 77150, -182534, -366806, -237540, -171166, -71571, -98214, -17277, -50516, 78830, 130340, 46677, 74937, 149732, -51466, 199062, 362183, 255723, 55228, 223089, 163707, 102510, -45919, 242186, 361572, 468988, 289658, 1910, -149471, -25071, 248574, 180454, 333011, 226556, 83710, -38968, -25839, 120590, 473839, 393270, 377645, 206756, 440291, 652219, 574948, 145032, 269453, 528682, 341015, 79512, -83457, -198177, -118980, -51442, -130223, -144379, -143]
16498a43k12903P4779L85461p5097Q7788J4690l28273K77990J35301k23133j56002
16487a9542K86092q1924l14028l02892p5741J0891K48818J79086J62604j13026
16477a9662m7585R7778M0199p7891j60713K1828K10139J73243P8659J15321R6989
16466E28305l4358k67048o9089N1983k15631k6277L46237J16652m0282j3574j15506
16455B61412j18328J01229O1052j79157j08082j91076N2063K39455N1700l06835
16445a36567k07854J62798J11090n5819k2849Q5880J92673L8660k5729J35407
16435B77690j6906j46988L3166J3807K871J13030j16771j46041j70274k90539
16425d46955J42045K37641n6631q3028J93315P0609p9668k3466R7179P8605k30574
$$ y = [-143, -213046, -138267, 247194, 172097, 259885, 274575, -53698, 224292, 359593, 136460, -19542, 266550, 184626, -129402, -432294, -508035, -497144, -248326, -69240, 93364, -19662, -67247, 30531, 70730, -7161, -167874, -146046, 64093, 237336, 315995, 431316, 528305, 493947, 226899, 157810, 209793, -5838, -32115, 314122, 430774, 390492, 376918, 261412, 143084, 244313, 305365, 126208, 18126, -172950, -120887, 118568, 170268, -136567, -344421, -181623, -70533, -126352, -149201, -63321, 129352, 168012, 142283, 277690, 260784, 113796, 146962, 160769, 163640, 276670, 159899, 13858, -156416, -446955, -304910, -67269, -123900, -206928, -13613, 56996, -22672, -46138, 51041, 129646, -100928]
16414a00928j84621O9066J38556l1228Q4560K86223J79323k20915l71145Q365
16404a42744L66341J85131k79844k55868J76238J71109p2651j66116m1015l28917
16394c88336n6920j4916q9583R9068O9596r3004K1692r8289J47595J09131J59092
16383a34874K8706L2511k63906p9694K33359J61320L46972J75858l4209l61016
16373A05027k2753l8702J03640N5145j14425j55760k02431j12171L1625K8310
16363c22495o2420n729M4829l0705J53508J14285M573K06703L5705l8706K037
16352A01585k55572r5502m4721J98906j2697K22380q9224r6381r3315P8208o9752
16341a56085L83344j2025j33965j82427m25968K06597L41658k4408K51288K29558
$$ y = [-100928, -285549, -216483, -77927, -109155, -24595, 261628, 440951, 220036, -151109, -142744, 223597, 408728, 128884, -126984, 49254, 220363, 147712, -18404, -59419, -388336, -445256, -460172, -549755, -450687, -381091, -474095, -452403, -550692, -403097, -293966, -134874, -106168, -73657, -337563, -417257, -183898, -22578, 324394, 500252, 466043, 105027, 82274, 43572, 147212, 202357, 87932, -67828, -270259, -382430, -350805, -322495, -384915, -390644, -345815, -376520, -223012, -108727, -104154, 102549, 138254, 99548, 101585, -153987, -249489, -294210, -95304, -108001, 114379, 25155, -71226, -164541, -86333, -156085, 227259, 215234, 81269, -101158, -527126, -320529, 21129, -3279, 248009, 477567]
16331D77567j39079k37292M1641j6048O1652k99311o8011P323J20868J8937k39335
16320b71088j38410J84493K28814Q6879J45422l5293k05034J70645k4232l62867
16310b20671l48919o8523K19682K40051k2445j25410k7272l0151K00867J95356
16300A2565n8486N4681K3048o0080j4337k11998r7793j48388R2316M00450P3263
16289F5241l10596m4937O6676M5054o5645J2682R5775m3075q2196K09982P1093
16278B0054K54157N1925Q5699N4197R500k58846j29967l8532j9886J32837l1997
16267A29141n1154M026j63237j82484j9932J7175K13806K986Q8175P2403k1505
16256H9400j62619k17835K8884r6953j54266J27834K57003p1952J31764L76279
$$ y = [477567, 338488, 101196, 142837, 126789, 188441, -110870, -178881, -171558, -50690, -31753, -271088, -409498, -225005, 3809, 90688, 236110, 200817, -4217, 166428, 142196, -220671, -569590, -638113, -418431, -178380, -200825, -326235, -353507, -383658, -182791, 12565, -45921, 8760, 31808, -28272, -42609, -254607, -352400, -500788, -408472, -8022, 65241, -245355, -290292, -223616, -178562, -244207, -231525, -135750, -178825, -261021, -51039, 20054, 274211, 326136, 411835, 466032, 475532, 216686, 86719, 48187, 28301, 161138, 129141, 77987, 82013, -81224, -263708, -283640, -266465, -52659, -49673, 38502, 110905, 89400, -73219, -291054, -262170, -359123, -513389, -385555, -128552, -200504, -68740, 307539]
16246C07539J73144N6202j27523l3538r4326k7604n9019j47950l9219q0946J24102
16235E0862j2242R113j86561O8412K90992J69609J54037j25156j59509o0122q1517
16224A17918O9372j37051l34344p3433Q713J74290L57897Q1682l520k67760J2048
16213E812L88691p4831r4515M7412J45928j73421j22103p6715R0684J7464j81727
16202b7321m1925M8231k22366j11111J53816P3517L5887j4807j65942K1416j19089
16191c69694l2375K14943J65637J78606J8874k31933j86191R4795l9577J61770
16181b5145J19950j08183l42271l4561J55176j59573j82031j81296l942K07965
16171e53911J72789K18151o9320l18768l35595K33202L12133J0065L0891J14826
$$ y = [307539, 480683, 536885, 409362, 375824, 281498, 253894, 194875, 46925, 7706, -73240, 50862, 38620, 47733, -138828, -70416, 220576, 390185, 544222, 419066, 259557, 199435, 117918, 187290, 50239, -284105, -357538, -348825, -174535, 183362, 265044, 261524, -6236, 5812, 394503, 319672, 225157, 272569, 418497, 245076, 122973, 46258, 136942, 154406, -27321, -69246, -21015, -243381, -354492, -200676, -127159, -91272, -106079, -272021, -250605, -369694, -402069, -187126, -21489, 157117, 175991, -55942, -242133, -147338, -186915, -25145, 94805, -13378, -355649, -390210, -235034, -394607, -576638, -757934, -761876, -553911, -381122, -162971, -232291, -551059, -886654, -653452, -341319, -331254, -300363, -185537]
16161a85537r8334k32369j4292J85976L18501j61022j41117m3970j04405L38414
16151a38155p8254j91606P2951J72542N3708N7935l27333k09907N45127K83283
16141B40291K08686J3645k31528k43544O8966K4729j59089k357J38043M1507j49294
16130d9945K4299j69652j80803J92783p7542j1870K46001L2637k69124j13220
16120c76436J68854j14904R3479J55666J1742n9100l07522Q3276q3206j17346
16110e45497J00135J88734J90375j14557k7319K54477K93227p5917m05654k40498
16100c82494p3960K17481N9102J0327P4306k8672j58729L1639K75170J90994R4895
16089C10059o1094r2313n2770M0272l1803r7073o1546J21526j03509k16821J02387
$$ y = [-185537, -283871, -516240, -530532, -344556, -26055, -187077, -328194, -372164, -476569, -138155, -216409, -408015, -335064, -162522, -108814, -50879, -378212, -588119, -42992, 240291, 448977, 462622, 231094, -12450, 56516, 81245, -77844, -80201, 57842, 99349, -49945, -25646, -195298, -376101, -183318, -260860, -272730, -26729, 5908, -263216, -376436, -207582, -322486, -229007, -73341, -61599, -120699, -428221, -344945, -428151, -545497, -445362, -256628, -66253, -180810, -208129, 46348, 339575, 263658, -141996, -382494, -456454, -238973, -179871, -169544, -95238, -123910, -282639, -251000, 24170, 215164, 310059, 248965, 156652, 103882, 144154, 112351, 15278, -46268, 75258, -28251, -245072, -142685]
16078a42685R0257K2605p7111L8798Q2140M8572J94909J12698j24925l2358n1253
16067A61647j76668l0130J9470R7588k04083O8470n4642m6133K50839m3939k51220
16056b08801j0598r140J36043J27637l831L0523R5230p3921j61171Q6338M1536
16045D9845l1052O4930Q5501L6561j06793j00740j8603J50128Q3668j20739J39677
16034B32383P3983j3536Q6062J24787m6171p0015L7940m1477k50568o5040n3198
16023A5150K8726J15963l0329J88545L94077k51822k20752k12163j63095K6035
16013a09665O6600R8284m1399l0441j32810J57906J04667j04673j57430j2492
16003a61453R100j92761P2405L15643O0187j06980j22513J40396K39508Q4466
$$ y = [-142685, -52428, -29823, -106934, -68136, 14004, 62576, 257485, 370183, 245258, 212900, 161647, -15021, -45151, -25681, 71907, -132176, -63706, -118348, -164481, 86358, 42419, -208801, -219399, -228539, -92496, 35141, 31310, 61833, 157063, 83142, -78029, 8309, 49845, 18793, 83723, 169224, 205785, 98992, -1748, -20351, 129777, 213445, 92706, 232383, 306366, 292830, 378892, 503679, 457508, 387493, 425433, 383956, 133388, 68348, 15150, 43876, 159839, 129510, 318055, 712132, 460310, 239558, 27395, -135700, -109665, -43065, 55219, 13820, -16621, -149431, 8475, 113142, 8469, -148961, -161453, -152353, -345114, -272709, 42934, 103121, -3859, -126372, 14024, 253532, 337998]
15993C37998l84264m07646J39713Q8413j21626j48470K59482M62870n0787j49163
15983B6520P372K09577K7l26267j72530O7105j35318j62016J58128J87463l1834
15972a71773L4694j02603l60253k03021n3982J42119K79389J43781K89242l7510
15962c9917j14604j17582k3823m2572j02396p2326j0555K37078K6926J01294K06398
15951D7921J22242n9217m3898k37028p5616m6857L41657P2934n466k35475l5465
15940a54268j20892K3505r9171J72750J97787J51987J09046R691l80861J20298
15930B9872p4852J6002Q2154l3647j09378J6237J25479J0232n8299j04051J87692
15919H7441k03299m2592P0823O2919J461n9402j13975k7888P6466L4261M8695
$$ y = [337998, -46266, -453912, -314199, -225786, -347412, -495882, -236400, 226470, 175683, 26520, 33892, 243469, 243496, -82771, -255301, -188196, -323514, -485530, -327402, -139939, -171773, -137079, -239682, -599935, -802956, -856938, -714819, -435430, -291649, -2407, -39917, -154521, -272103, -295926, -338498, -440894, -513220, -523775, -286697, -259771, -158477, 47921, 170163, 110946, 67048, -169980, -245596, -292453, 49204, 122138, 116672, -118803, -154268, -275160, -251655, -350826, -178076, 19711, 171698, 280744, 290435, -90426, 29872, -44980, -28978, 53176, 19529, -89849, -73612, 51867, 62099, 3800, -100251, 87441, -115858, -158450, -87627, -24708, -23247, -82649, -196624, -224512, -148046, -113785, -65090]
15908f5090j25689Q8615P0454j08190j31481K6456J44273J08149J203j46015K5670
15897a11645q792q8805j28081P4466L96752N0971j86130L55322L6956k35963k77774
15886a22723k99523j19790J32186L20728J05941n4095j24126J33811k08638k05046
15876d41275M42531J90131k66577k07325j29890K06983q4355q2904m5288J24550
15866b93419N4991J72840J15389L5941n6212K12668J14842Q1539m5604J05581
15856D98556p4623m17172P895k2491O6428j0997j66279j2520o8001k96722j13260
15845f09186L59142K84776r4257n6571k69438k06144Q0542J60805J54192M2247
15835a53892J90j08767J98308j78163j19242K04129J66339j45259r8305L8990
$$ y = [-65090, -190779, -102164, -31710, -139900, -271381, -244925, -100652, 7497, 8700, -137315, -111645, -120437, -209242, -337323, -262857, 133895, 184866, -1264, 354058, 391014, 155051, -122723, -422246, -542036, -409850, -89122, 16819, -37276, -161402, -27591, -236229, -441275, 1256, 191387, -75190, -282515, -412405, -205422, -289777, -372681, -417969, -293419, -238428, -65588, 49801, 85742, 29530, 242198, 357040, 438579, 392975, 498556, 423933, 6761, 14656, -7835, 58593, 47596, -118683, -131203, -199204, -495926, -609186, -250044, 34732, -59525, -116096, -385534, -591678, -511136, -350331, -196139, -153892, -153702, -262469, -64161, -242324, -361566, -157437, 8902, -136357, -234662, -195672]
15825a95672P4561J52679J41229J31842J803o7651l3174Q3998r021j00860j16026
15814F3708j01885J09308J73590o1702p0858j17336k6985K2448N4518n1608j54798
15803a61600j45819L9016J06881k2393n1293k21527K2282M673P639j2760l4453
15792d69354L1653J21706J82059j26433l2842J31540L1446Q2564K06611j9205
15782A39745j92881J53611j48349k74798J93189J56902k03510j2117O9579J6637
15772a01992N750P2373J26075k0568p2845j80177O1182K17855l9076O805k34449
15761a59067k07928M08983J44959p5481N091k33178L5280Q4798K7120P1867j56008
15750e3564l506J71499k1106l28041j12837K48995K19173O6876j89772O6969j1731
$$ y = [-195672, -121111, 31568, 172797, 304639, 306442, 238791, 205617, 289615, 280594, 179734, 63708, -38177, 71131, 244721, 183019, 112161, -5175, -32160, -9712, 44806, -6802, -161600, -307419, -268403, -161522, -183915, -235208, -456735, -434453, -429780, -422141, -434901, -469354, -437701, -315995, -133936, -260369, -293211, -161671, -130225, -47661, 158950, 139745, -53136, 100475, -47874, -322672, -129483, 27419, -176091, -188208, -118629, -101992, -96242, -23869, 102206, 81638, 8793, -171384, -110202, 107653, 68577, 75382, -159067, -366995, 41988, 186947, 111466, 116557, -116621, -81341, 3457, 30577, 102444, -53564, -57070, 114429, 93323, -234718, -347555, -98560, 120613, 187489, -2283, 64686, 52955]
15739E2955J49635P504k68391k40390j59934o0596k372p3585N6376R8934N3688
15728c86176J86486j01880l65099q5762L58033l7653N8982K16949J38896P7910
15718F0686k04272k8677j18536m3590N1385J72206j73402k45570j65845L9256
15708f56359L7982N2841J24827L8076Q998K95842p1333L963K33201l7746J24573
15697A54865K19381j31178k41180r7077O7835K33489R1894j06922k70182K8681
15687e0394j18260j47946J76007L0387K0610q4958R6527J2748j01982j08876J73136
15676a03001O6166J50432p9685J5805k13484k57573O3273K444n6265K63520J21060
15665b7308o5185K08373J02937j17563j16190j81964n1742j95418Q9153q5285
$$ y = [52955, 202590, 210094, -58297, -298687, -458621, -519217, -521589, -595174, -538798, -439864, -386176, -199690, -301570, -666669, -752431, -394398, -432051, -373069, -156120, -17224, 60686, -143586, -172263, -290799, -334389, -283004, -110798, -284200, -529770, -695615, -656359, -618377, -565536, -440709, -402633, -393635, -97793, -169126, -165163, 68038, 30292, 154865, 374246, 243068, 1888, -95189, -27354, 206135, 298029, 191107, -79075, -50394, -168654, -316600, -140593, -110206, -89596, -174554, -78027, -65279, -167261, -276137, -103001, -36835, 113597, 33912, 49717, -163767, -421340, -358067, -355623, -411888, -148368, -27308, -92493, 115880, 218817, 101254, -14936, -196900, -248642, -444060, -354907, -440192]
15655d40192k2805K64740J71397n3313J14012k1521m1376j33585l9267k21492
15645d23402K07399J11557K32323J30402k34380o8320J21902N8746K85085N917
15635D27229l22862j24504k51645j18626j7216k83631K64382K31993n1489r0334
15625c36703J37586K06132q1804k29804P9584j04897l2556P6561r5763J65558
15615b16106K8427J87948J86534j06561L730K28704k41349m26808j17206q9289
15605e61976J38964j14367O5141K56102J66054k5465L0660k7113k12294p2879
15595c57173r3693j0351j83834k1658J28610K24552P7264J08714J1985j87199
15585c02783R3613J00182j48339j36375Q2076K87147o6266q0657m5617R9708n050
$$ y = [-440192, -462997, -198257, -26860, -80173, 33839, 12318, -29058, -162643, -201910, -423402, -216003, -104446, 127877, 258279, 23899, -44421, 77481, 136227, 421312, 427229, 104367, -20137, -271782, -390408, -407624, -691255, -426873, -194880, -246369, -336703, -199117, 7015, -74789, -304593, -225009, -329906, -362462, -285901, -381664, -216106, -187679, 269, 186803, 80242, 83972, 312676, 71327, -355481, -472687, -561976, -423012, -537379, -472238, -216136, -50082, -75547, -44887, -72000, -284294, -357173, -450866, -461217, -645051, -666709, -538099, -313547, -236283, -127569, -115584, -302783, -209170, -108988, -257327, -393702, -311626, -24479, -90745, -171402, -217019, -117311, -122361]
15574a22361N4068j04884m1769n5283K11179n5093K3992j7539Q2972r7283j02340
15563b24341l4983o2792J20878J01968Q9017k60818J131N2590o9611k7897K5115
15552b89743J64576p5128n414J63512J682K07366n9546K62687K98837l3268k42074
15541C93487l43295o0277m6754j78562r4680j65663l4547n4473J79489L08112
15531i7163J74855J8870Q9942j98893k13322n8189l6199L9672K20507K28804l3798
15520A35086k0747L7807k07280j80502j38008q4983j0582L9492P9119n7372J2791
15509c95179L109K11630Q4353O7143J30078R8465R9113m0503O0970k20386k72444
15498a73651p121J64907j43455o0111J04096J93852l1274J87820L2118L1343j38591
$$ y = [-122361, -68293, -173177, -214946, -270229, -59050, -114143, -90151, -107690, -24718, -122001, -224341, -259324, -322116, -201238, -99270, -10253, -271071, -269940, -217350, -286961, -314858, -289743, -125167, -200295, -205709, -42197, -40515, 166851, 107305, 369992, 668829, 635561, 393487, 50192, -10085, -56839, -235401, -330081, -495744, -530291, -584764, -405275, -97163, 77692, 96562, 186504, -12389, -225711, -283900, -320099, -280427, -59920, 168884, 135086, 114339, 152146, -55134, -235636, -373644, -458627, -469209, -429717, -350598, -407970, -395179, -392070, -180440, -96087, -28944, 101134, 199599, 298712, 258209, 319179, 98793, -173651, -180772, -15865, -159320, -219431, -115335, 78517, 47243, 235063, 267181, 298524, 159933]
15487A59933l8445J17070J22329j23318k91762j45652j11432J89368L06961M9948
15477B35000m4442k2008O1159p1748n1179J43658J7390k37118l0722N6629n6633
15466a4n0328l1878J08885n4833K15705K36991j7415k7003l97720k40242J78699
15455g9153K30547K41834r0556j73923J01160J01743l0330j86653j86668J38903
15445F6904p3567k36434k36903k12109J67793P4946J80828j12670o6587K59552
15435a88247K03931p5629k5043r0520J41834n902k15083j01243K83814K19366
15425A47278P1805m6311M2327j99590p5489J47263Q5732J15349r2952k03981j09943
15414a18512o6459P1403J46047J51373q7162J7952M745Q7622k9696j92462j86348
$$ y = [159933, 121488, 238558, 360887, 237569, -54193, -199845, -311277, -121909, 185052, 235000, 190558, 168550, 229709, 157961, 106782, 250440, 267830, 30712, -10, 56619, -14, -50342, -82220, 26665, -28168, 187537, 424528, 407113, 380110, -17610, -257852, -79153, 151394, 393228, 302672, 128749, 229909, 331652, 301322, 114669, -71999, 66904, -6663, -243097, -480000, -692109, -524316, -449370, -268542, -381212, -447799, -188247, 15684, -59945, -84988, -175508, -33674, -39576, -254659, -355902, -72088, 147278, 219083, 172772, 215099, 15509, -59980, 87283, 173015, 288364, 195412, -8569, -118512, -184971, -113568, 32479, 183852, 96690, 114642, 119387, 207009, 177313, -15149, -201497]
15403b01497r2369m4212k3565k5711N0750P1113J4208l8234j37291Q1850J94865
15392a50093k66941N0334J98266M7170j38840J91396M18264Q471J10340j95186
15382B73181R2286J23600k21732j94251j41750m3415J58160Q6585j20504k73323
15372b61163L548K00408Q0324j72671O1548O4942k85501p6197j8130q1267K11052
15361b73107j47858q5173J8806l3693N5061M28342K2159J34149j12007j97984
15351a91305n0653J47663L40382J17193l87041k16374j80521K04756P4523j3671
15341a55048J45008L21440J14854p0940l69809k03134k75411K2945J40190J07876
15331b22029K62175l0894l81723r2173J25493j22487j36224J37299K72846P5607
$$ y = [-201497, -293866, -338078, -361643, -387354, -336604, -265491, -251283, -289517, -426808, -344958, -150093, -417034, -366700, -168434, -121264, -260104, -68708, 349556, 358027, 468367, 273181, 365467, 489067, 267335, 73084, -68666, -112081, 46079, 132664, 12160, -261163, -257615, -57207, 23117, -149554, -88006, -23064, -308565, -384762, -402892, -484159, -273107, -420965, -506138, -487332, -521025, -465964, -37622, -15463, 118686, 6679, -191305, -241958, -94295, 246087, 363280, -23761, -240135, -420656, -215900, -141377, -155048, -10040, 311400, 426254, 355314, -14495, -217629, -493040, -470095, -329905, -222029, 40146, 9252, -372471, -464644, -339151, -461638, -597862, -460563, -187717, -112110]
15321a12110j43941r1965r1864K56338K22394n4833j56303R893M2132O1412K2639
15310c6208K17247J79920J58124j94311M4823n7580J87134j55240l45047k21590
15300b22728K62417J48428K3409j81624k21138P397J7180j95758J9954J25739
15290b16724J09722M0645k38153m7634K77058L9911q1555K12277O6438k44115
15280h2130K70816J98264j5806j12165l9016k78031l00772j0462K49606Q4995
15270c4701j98702J08079l2598j1049k3858j59500j37452Q4875L95150j68116
15260a77872m26543Q9206p631R0469N3003R8966l402K1318R4042N8066J8788l06561
15248c98151J48883L56753j3949k47803j78842m163J90551j1417q5840J43199
$$ y = [-112110, -256051, -348016, -439880, -183542, 38852, -15981, -172284, -162391, -120259, -58847, -36208, 181039, 360959, 519083, 324772, 369595, 312015, 499149, 343909, -1138, -222728, 39689, 188117, 211526, 29902, -191236, -183839, -166659, -362417, -342463, -216724, -107002, -66357, -304510, -352144, -75086, -35175, -116730, 95547, 161985, -82130, 188686, 386950, 371144, 258979, 219963, -58068, -358840, -369302, -119696, -34701, -233403, -125324, -157922, -168971, -192829, -352329, -489781, -404906, -9756, -177872, -604415, -515209, -522840, -432371, -379368, -280402, -283804, -262486, -168444, -110378, -91590, -398151, -249268, 107485, 93536, -154267, -333109, -337272, -146721, -158138, -243978, -100779]
15238a00779q8397k42180P5518J49938j28837J14369j3076L18721J40003j55083
15228G0197k56760r7149k7254p0778J80317J88387K22419N4948q8286j07141J52175
15217B21075j9754j934p3819j23816k48131L2906K18814L3355j32944M3686l3414
15206h3976j7405j2775P6406P7823j6995m34029l80962J42318m5490k0863n2313
15195g68261P9358K71323J55933K9487j88229K74322Q5604K29936j27027j71835
15185a29389l5556J70346K5205j22012J9899M2832J6548r6794m9300J31492R2145
15174F5416j26600m1184l34965O6913K33760L12337j03321l1568L28N5707j79861
15163h3038K18274J9184p2723k0326J33656L1478k87657J08460M120k74917P4293
$$ y = [-100779, -189176, -431356, -355838, -205900, -334737, -220368, -233444, 85277, 225280, 70197, -186563, -283712, -310966, -381744, -201427, -13040, 209379, 264327, 176041, 68900, 221075, 201321, 199387, 125568, 1752, -246379, -213473, 5341, 38696, -94248, -50562, -83976, -101381, -114156, -37750, 40073, 23078, -410951, -791913, -649595, -695085, -715948, -768261, -688903, -417580, -261647, -232160, -420389, -146067, -60463, 169473, 42446, -129389, -164945, 5401, 30606, -91406, -71507, -28675, -12127, -108921, -158221, -26729, 65416, -61184, -102368, -437333, -370420, -136660, 175677, 72356, 40788, 41116, 96823, -83038, 135236, 154420, 81697, 61371, 195027, 226505, -61152, 47308, 51428, -223489, -149196]
15152a49196J99770J37677L1212n9638J82451J07295j49679l93261r7003K77161
15142H6789J82692q3976l50765j65834K6275l0330J38981j14677j8k4229L98693
15131F3601j70216k77971L64946J28145J27351N9111j0872j60265j73692J19046
15121F9184J9482L02976J20617l33176o17869j64084K2550K08966J12481M4272
15111b14601L4473K71L6129K1496k47298P417J511J98347J24811q6638m9811k12720
15099c86613L5197k2182R6442L74155M1451J72807m6351k46353m3137j16539j85116
15088c26239N9512j82029R4578K49036j22431J6326L00893o5818j66481J26510
15078a6143M0027J36583J94845j54373j10600J04440k89659j72720o8016J79080
$$ y = [-149196, 50574, 188251, 219463, 159825, 342276, 449571, 299892, -93369, -190372, 86789, 269481, 185505, -165260, -331094, -304819, -335149, -196168, -310845, -310863, -335092, 63601, -106615, -384586, -19640, 108505, 235856, 294967, 284095, 123830, -49862, 69184, 88666, 391642, 512259, 179083, -438786, -602870, -580320, -371354, -258873, -214601, -180128, -179857, -143728, -122232, -369530, -362113, -360602, -162255, -37444, -124082, -173893, -386613, -351416, -373598, -277156, 96999, 138450, 311257, 264906, 18553, -24584, -141123, -326239, -266727, -448756, -354178, -105142, -227573, -211247, 89646, 23828, -142653, -16143, 23884, 160467, 355312, 200939, 90339, 194779, -94880, -267600, -335616, -156536]
15068a56536K7067J80734q9828o5722m4973r0553r4201J78816J3959q3532Q7227
15057a37542k6046J76628j8969j45805k24644M2496N7330k2404R4702j23824L2602
15046b95476J49690J08760j71599m6343J08484o6789O9361L0515M639J96514R6024
15035A83780o3799k16623j99031J14870J11907K41960O6152k41841o1419P4625
15025A0581m153k31823K01366L3635N2419K10286K05104J22678k48340k93009
15015E8744J76204l5899j71529J68302J8538j38914q2271J41910l16846l54229
15005e35990j25994r57J79952J01481o2797J82398j18467n3827R0072J22244o311
14994b28196k7004p4539l3582O7322J53140p9719M863j10591r5118M7829K40847
$$ y = [-156536, -129469, 51265, -38563, -104285, -149258, -239811, -334012, -155196, -141237, -224769, -137542, -163588, 13040, -5929, -151734, -376378, -333882, -276552, -298956, -204254, -328078, -295476, -145786, -37026, -208625, -254968, -146484, -213273, -143912, -113397, -108758, 87756, 183780, 119981, -96642, -295673, -180803, -68896, 173064, 239216, -2625, -64044, 10581, 6428, -225395, -24029, 9606, 62025, 272311, 477415, 600093, 351753, 58744, 234948, 199049, 27520, 195822, 214360, 75446, -6825, 135085, -181761, -535990, -661984, -662941, -482989, -381508, -444305, -261907, -380374, -434201, -344129, -221885, -228196, -255200, -329739, -363321, -295999, -142859, -222578, -217715, -328306, -423424, -375595, -134748]
14983a34748L3491j37490J06236K4283r6278m1117j47082m373J71128K50693o8162
14972d3419j52531J08669J26224K04455K21162j3847j88350l44639m8502r2170
14962b22948o0736j10295j7254O1717m8675R1961L61644J50270M5170l7359m7218
14951A66277J38508l85934j53260J19499J27804j14196J25003K4875j49406Q9151
14941a1679P4931l8434J79489J49137p6560j82183n9723j96071L7433J5420j42365
14930b50605j09238M9295Q3801K73959o8888j05557j64415K7192N0228J59925
14920e4303N9288j04695J65153j12685j46736m5200M0881k15595q2497P7598l8130
14909d56921l0458j3998N422J74201K06962K09906q6570j13395L70222K01014
$$ y = [-134748, -101257, -238747, -132511, -108228, -204506, -245623, -392705, -397078, -225950, 24743, -43419, -195950, -87281, 38943, 243398, 464560, 450713, 262363, -82276, -130778, -222948, -283684, -393979, -411233, -349516, -398191, -306230, 55414, 205684, 250854, 213495, 166277, 304785, -81149, -234409, -114910, 12894, -101302, 23701, 48576, -100830, -11679, 63252, 24818, 204307, 353444, 276884, 94701, 34978, -161093, -123660, -108240, -250605, -359843, -310548, -226747, 47212, -21676, -127233, -291648, -264456, -214228, -54303, 4985, -99710, 65443, -47242, -193978, -239178, -198297, -413892, -496389, -418791, -456921, -487379, -501377, -495955, -321754, -114792, 95114, 8544, -104851, 265371, 466385]
14899D66385M998m17284l68578m00529j18434J04972Q9450L56092L33305j1588
14889C8789N079j40651k4638M7383K60875K62007n3407J02438R6128l79324k52613
14878c7934L8027j03475j68270r4671J44651J05036q5727j16607q6101J35581
14868b69490P3848r0797j45799j98371K78737J96955o8764j15644P4500J97881
14858f6944J77084j22994l02407j53767L3171K07968K86070J87202O4751k43788
14848F6346M8368k21645j24524M9588L7278M8443M3315n4776m7665j63691n9988
14837c78951K39589N7184O1425k75067k13616J85558J47131q4122J84928Q6792
14827A0851L9109j68577j19227K5114L910j24546K87747J36871j09952j78321
$$ y = [466385, 471383, 54099, -314479, -715008, -833442, -728470, -639020, -282928, 50377, 38789, 43868, -96783, -121421, -74038, 186837, 448844, 395437, 497875, 594003, 214679, -37934, 93, -103382, -271652, -366323, -221672, -116636, -202363, -318970, -405071, -269490, -195642, -286439, -432238, -630609, -351872, -154917, -223681, -339325, -264825, -66944, 110140, -12854, -315261, -469028, -435857, -227889, 58181, 245383, 310134, 66346, 114714, -106931, -231455, -181867, -144589, -96146, -52831, -107607, -155272, -318963, -378951, -139362, -82178, -20753, -295820, -509436, -323878, -176747, -260869, -75941, 10851, 49960, -118617, -237844, -212730, -208820, -333366, -45619, 91252, -18700, -197021]
14817a97021k85371n6155j23029J13827J73381J72924K36278o243k07584K056
14807a76937M3104j87940J6385j58274J43718N1155N0281j97407l7829r8044j24669
14796f76457Q4728J1416K18872J05942p7917P4183L1216j71554j61379O4384K0333
14785d76233J47010j39247M6059J2586j37937m7840J74954J99725J01909P8685
14775d0329o2199J61109J39306j54621k11224J70784M5391j88637r0611n3196
14765b84227J45917K85289p1251l35498r2772m452j1936J02395J54419K19504
14755A07388R1076j24611j8324j45445q9264L7998l8955n3489O6262q1327K57058
14744H367J23371J34786j25678k93519J518J23692Q2010m2896J51586K58132j78093
$$ y = [-197021, -482392, -538547, -661576, -547749, -374368, -201444, 34834, 28591, -178993, -176937, -133833, -321773, -305388, -463662, -319944, -268789, -218508, -415915, -453744, -551788, -676457, -591729, -580313, -361441, -255499, -333416, -259233, -228017, -399571, -560950, -496566, -476233, -329223, -468470, -422411, -409825, -547762, -595602, -420648, -220923, -119014, -40329, -102528, 58581, 197887, 43266, -167958, 2826, 48217, -140420, -231031, -284227, -138310, 146979, 75728, -259770, -352542, -356994, -368930, -266535, -112116, 107388, 198464, 73853, 55529, -89916, -179180, -141182, -180137, -233626, -167364, -248691, 8367, 131738, 266524, 140846, -152673, -151155, -27463, 54547, 11651, 163237, 421369, 243276]
14733B43276j51887k58471j06769K00492J50663J68968J20133q0133L5890p5858
14723B46304k46167p8248J00961j65867j89133m0700l1920J2182L5887J51543
14713b05158J7620J14894o8293k6045L6550O4533p0411k20280Q0148L37413j00346
14702c9375k10279Q0035k04032k23455J00981K52490J98893j89099N134N4656
14692a74051K27844J36685M8044j7532k34675j15024k25930N0563m5476j2279
14682c61831k4301K55644L47874J3553p2834q1696j95819N5768j408l6668q0728
14671a82446K3057K08471j09355j72149l06319J35022P2948q072J01914K71937
14661C5008K27572L4809L5467k69764j01412l18743q0836K03746K55843J21697
$$ y = [243276, 91389, -167082, -273851, -73359, 77304, 246272, 366405, 286272, 322162, 246304, 137, -78111, 22850, -143017, -332150, -372850, -404770, -392588, -356701, -205158, -187538, -72644, -140937, -166982, -130432, -65899, -136310, -356590, -276442, 60971, -39375, -249654, -169619, -373651, -597106, -496125, -243635, -44742, -233841, -228707, -174051, 53793, 190478, 238522, 220990, -13685, -128709, -354639, -304076, -349552, -361831, -386132, -130488, 217386, 230939, 158105, 76409, -119410, -63642, -65050, -101718, -182446, -159389, 49082, -60273, -232422, -538741, -403719, -330771, -338843, -236929, 35008, 262580, 297389, 332856, 63092, -38320, -357063, -437899, -234153, 21690, 143387]
14651A43387j73698l29862J45042j6534o7453P8658K78189L5352j47666J31227
14641G6642K69715l6824k61826k73536r5486K25224J75673Q2733j79380k0735
14631c7800k59669j17465n4894K56024J43255J31313p3295j39661k33968R0931
14621b95229l8202L372R0912J22908J23168J60789j9054j36856j08456k15376
14611c12024j95934J98674L76194J80329n2603j78612K1232j42652j05254r6126
14601c06776j98698K7221J31492J32910J35956Q788j01490l2581Q191n8854o8234
14590c22075J65303j43164M0779J5555r0950J15147K98084Q0050k55735o5747
14580a62753O9333r2539p8325J10038J07467R0317k05145j21113r2173J5369N0698
$$ y = [143387, -30311, -360173, -215131, -231665, -299118, -220460, 57729, 93081, -54585, 76642, 346357, 309533, 47707, -225829, -321315, -96091, 79582, 162315, -17065, -37800, -297469, -414934, -469828, -213804, -70549, 60764, -12531, -152192, -386160, -295229, -333431, -330059, -239147, -116239, 6929, 167718, 148664, 11808, -96648, -312024, -507958, -309284, 66910, 247239, 194636, 16024, 37256, -105396, -210650, -306776, -505474, -478253, -346761, -213851, -77895, -69107, -170597, -203178, -194987, -253841, -322075, -156772, -299936, -259157, -243602, -334552, -219405, 78679, 158729, -97006, -162753, -93420, -185959, -264284, -154246, -46779, 43538, -161607, -282720, -374893, -359524, -308826]
14569c08826M3200J24369l11348N1373L48474O7566p6974n6904L3848Q0953p3744
14558g8013j33676k26528m7112K31947l9364J18018K8021K80991K21381j21262
14548B34403j94859N3513j50112j71142J79581j8796N3525r6234j38468O3120
14538a85469K7460J43121O0257P1833l35939j86600L07887J40554n0242M123k05436
14527b08451j21274J29414J21113J25136K07987N7309k47134k90162m35073Q4890
14517e76245l5010o1737J05280j02785K56371J6980k236p1260J4741J98489Q116
14506b49296j2615K23736J37065k63070l339O7336k06544j87875J27478n1958
14496d19082J47290J57699r3549j02656K96982K78483K6019k53247J39366K17351
$$ y = [-308826, -265626, -141257, -452605, -401232, -52758, 14808, -62166, -119070, -85222, -4269, -78013, -211689, -438217, -485329, -253382, -292746, -174728, -146707, 134284, 355665, 234403, 39544, 93057, -57055, -228197, -48616, -67412, -13887, -110121, -248589, -185469, -158009, -14888, 45369, 117202, -218737, -405337, -97450, 43104, -7138, -3015, -208451, -329725, -200311, -79198, 45938, 253925, 311234, 64100, -226062, -661135, -576245, -611255, -672992, -567712, -670497, -414126, -397146, -399382, -470642, -455901, -257412, -249296, -261911, -38175, 98890, -164180, -167519, -100183, -306727, -494602, -367124, -419082, -271792, -114093, -207642, -310298, -13316, 265167, 291186, 37939, 177305, 394656]
14486C94656K2691n9073j38891k95153j02062N4589r9086p3027K82366Q7399o1281
14475A3128q7796l67942j08043L21212J2842R972J70951j66644j68946J19040
14465b52226j47567k04337K4953K50179r4575K57369K56720J18343q6194k61975
14455a39310j01499m7968O9983J16461J62159j82024j5231K21864n3978k2483
14445G974J88424p0968k25481j67704K1204J53652J45671J5989R4846p988p9652
14434G5967j5985r3092j9978J04638K6828r0326j25955j7159J57076O6009r0998
14423b2975l8818K22896N6024j02648m7928K9757L4254O2933k41136j76134K12241
14412a1534L35832m0173j03195q1387k77615J03688j24818M4239M8501j58918
$$ y = [394656, 417347, 358274, 219383, -75770, -177832, -123243, -222329, -295356, -12990, 74409, 13128, -74668, -442610, -550653, -229441, -216599, -206627, -35676, -202320, -371266, -252226, -399793, -604130, -579177, -328998, -423573, -166204, 90516, 208859, 122665, -139310, -240809, -288777, -218794, -102333, 59826, -122198, -137429, 84435, 30457, 7974, 196398, 125430, -100051, -267755, -246551, -92899, 52772, 68761, 163607, 155619, 75967, 59982, -33110, -53088, 51550, 78378, -11948, -137903, -155062, 2014, 68023, -22975, -61793, 161103, 217127, 114479, 66551, 96308, 130562, 193495, -47641, -223775, -11534, 324298, 284125, 180930, 99543, -178072, -74384, -199202, -154963, -106462, -265380]
14402b65380J33698J11612k08202j50104r0920j54565l7367J84642P0249N9887
14392c46450k0113O3562J11402Q6511O7896k7229Q1956j3695o2831q3163K18502
14381G6348J62347p1627j63890M5472K36112j19812m2813k14029k36161j04165
14371d32218J83512M32170j12070j05947J03693r6477k22474j85247K72777J87660
14361B5379n8019J89171J30829o6156M24316K58543j44810l13523m07764l79366
14351c41400j74003K4417K23203K84005p1598o9507m2501q3891q9936j44978L77997
14340a08192L60048j30562J21275o1722k41492k13177m5375P834m2597j82400
14330e36360K24967K79785J32K0171J25062N8110l363R5187q5434j07020k8954
$$ y = [-265380, -131682, -20070, -228272, -378376, -469296, -623861, -661228, -476586, -406337, -346450, -366563, -303001, -191599, -105088, -37192, -64421, 17535, 3840, -58991, -142154, 76348, 238695, 167068, 3178, 48650, 284762, 164950, 122137, -91892, -328053, -432218, -248706, 183464, 71394, -34553, 69140, -27337, -249811, -435058, -162281, 25379, -32640, 156531, 287360, 221204, 645520, 904063, 759253, 445730, 37966, -341400, -515403, -490986, -267783, 16222, -55376, -124883, -167384, -251275, -341211, -486189, -108192, 251856, 121294, 242569, 180847, -60645, -273822, -319197, -311363, -353960, -536360, -311393, -31608, -31476, -11305, 113757, 171867, 168504, 263691, 178257, 71237, 42283]
14319D2283o4060q1405l4824p6096k18393L23305j4093j43647J59769J95313J705
14308H9857j26468P6033k27305q934J0524K03433J14161k41294m5029k5910j3058
14297a93990L15370K0474l5521K59416l7892K7395N2863k63277l72514J59485
14287f8191M78040j1435O3708q5871j81774j18852k472n7154j86539j43195J42138
14276a71597j7853k2562p0243j45541l05755l3013J29928N10404K29431p8897
14266B4302j48683l13257L0639K57151k04620r4862P2492K36850J8302O2867J80288
14255A21469M448l71111j77521L02758O5281l11K6680j25039M2226o2843k6450
14244b00413J89235k38497J03830J30682R8053J9995j44836j04854J21586K27357
$$ y = [42283, -21777, -103182, -138006, -214102, -432495, -109190, -123283, -266930, -107161, 88152, 89857, -36611, 39422, -187883, -196817, -186293, 17140, 131301, -109993, -155022, -180932, -193990, 121380, 141854, 106333, 365749, 327857, 355252, 408115, 144838, -227676, -68191, 409849, 398414, 462122, 376251, 194477, 75625, 73153, 15999, -170540, -313735, -171597, -189450, -212012, -282255, -427796, -733551, -766564, -636636, -126232, 103199, 24302, -124381, -437638, -406999, -149848, -354468, -449330, -376838, -139988, -121686, -58819, 121469, 125917, -245194, -422715, -119957, -54676, -54987, -28307, -153346, -111120, -173963, -200413, -11178, -249675, -145845, -15163, 82890, 102885, -41951, -146805, -25219, 202138]
14234B02138j89714j7973k11433k25482J75373J17197l7317p5869q721J30791
14224a41010L2879K53722j03747m2969j50530l6022K1335j5262J9905M4548K04045
14213H6894J4807j09862j95982j19784k22515P7916N98644J74873j60162k34396
14203h9567P6831K70489K63510n6042j59776j14801o9615l83837k57691Q1149
14193d39350O1317L2724j14860j04051J00634K60938J67488K08560R9617r5316
14183A77701j85519j94371n1271J04125O4535l3399r223j44894l5437J35152Q5260
14172h7341j47392J6907Q6241K57382k4343j63147R3539p3646j15291q8071K7619
14161b17543o5610r9777P8021p3005K85659J11433J12328r1984p276P7692j15597
$$ y = [202138, 12424, -5549, -216982, -442464, -267091, -149894, -187211, -263080, -271801, -141010, -108131, 145591, 41844, -1125, -151655, -187677, -166342, -181604, -161699, -117151, 86894, 101701, -8161, -204143, -323927, -546442, -468526, 130118, 304991, 144829, -89567, -12736, 257753, 521263, 465221, 305445, 190644, 121029, -262808, -520499, -439350, -378033, -345309, -460169, -564220, -463586, -202648, -35160, 173400, 273017, 177701, -7818, -202189, -253460, -149335, -84800, -118199, -127422, -272316, -307753, -172601, -87341, -234733, -217826, -131585, 125797, 101454, -61693, 31846, -41800, -157091, -245162, -217543, -283153, -382930, -304909, -377914, -92255, 19178, 131506, 39522, 32246, 109938, -5659]
14150e659j73746l4633j81228M3459J43452o588J96168l0602R5858K75829M7977
14139C70287k48121l5340J5373r6376Q2772k04684j55111K49187M7477m377j02660
14128h1573Q8762p2350N5240l7265j59842P7023j8484l4987R2861J70506q6837
$$ y = [-5659, -179405, -214038, -395266, -351807, -208355, -214943, -18775, -49377, 46481, 322310, 370287, 122166, 86826, 102199, 5823, 88595, -116089, -271200, -22013, 25464, 21087, -81573, 7189, -65161, -9921, -47186, -207028, -130005, -148489, -183476, -90615, 79891, -6946]
$$ [...]
##END NTUPLES=NMR SPECTRUM
##END=
