##TITLE=Analysis number 307223
Compound Code ac 35903
Project Code adrs
Chemist Name stores
##JCAMPDX= 6.0         $$ Bruker NMR JCAMP-DX V2.0
##DATA TYPE= NMR SPECTRUM
##DATA CLASS= NTUPLES
##ORIGIN= Bruker BioSpin GmbH
##OWNER= NMR
$$ XWIN-NMR		Version 3.5
$$ Mon Apr 25 12:24:27 2005 GMT Daylight Time (UT+1h)  MAYBRIDGE\NMR@NMR_250MHZ
##.OBSERVE FREQUENCY= 250.131544655141
##.OBSERVE NUCLEUS= ^1H
##.ACQUISITION MODE= SIMULTANEOUS (DQD)
##.ACQUISITION SCHEME= undefined
##.AVERAGES= 16
##.DIGITISER RES= 18
##SPECTROMETER/DATA SYSTEM= dpx250
##.PULSE SEQUENCE= zg30
##.SOLVENT NAME= DMSO
##.SHIFT REFERENCE= (INTERNAL, DMSO, 0, 16.522)
##AUDIT TRAIL= $$ (NUMBER, WHEN, WHO, WHERE, WHAT)
$$ ##TITLE= Audit trail, XWIN-NMR		Version 3.5
$$ ##JCAMPDX= 5.01
$$ ##ORIGIN= Bruker BioSpin GmbH
$$ ##OWNER= NMR
$$ C:\u/data/dgb/nmr/ADRS/2150/pdata/1/auditp.txt
$$ ##AUDIT TRAIL=  $$ (NUMBER, WHEN, WHO, WHERE, WHAT)
(   1,<2005-04-25 12:24:09.07 +100>,<MAYBRIDGE\NMR>,<NMR_250MHZ>,
      <created by zg, POWCHK disabled, PULCHK disabled
       configuration hash MD5:
       62 19 C7 07 E1 42 D1 B7 37 6C 3D D0 77 39 F9 E6
       data hash MD5: 64K
       A8 29 DD 69 C6 50 DB 74 94 57 23 93 25 C2 81 F4>)
(   2,<2005-04-25 12:24:20.13 +100>,<MAYBRIDGE\NMR>,<NMR_250MHZ>,
      <Start of raw data processing
       ef LB = 0.3 FT_mod = 6 PKNL = 1 SI = 32K 
       data hash MD5: 32K
       39 DD BD 6B B3 60 8D B6 CC D9 E7 EE 35 0A 20 00>)
(   3,<2005-04-25 12:24:22.05 +100>,<MAYBRIDGE\NMR>,<NMR_250MHZ>,
      <apk 
       data hash MD5: 32K
       E6 40 66 3F BC 95 26 CD 78 C7 37 60 12 1C 2B 6A>)
(   4,<2005-04-25 12:24:22.76 +100>,<MAYBRIDGE\NMR>,<NMR_250MHZ>,
      <abs ABSG = 5 
       data hash MD5: 32K
       4D 67 40 C0 B4 2D 4B C1 7C BF 2C 32 D1 9E 07 F1>)
$$ ##END=
$$ 
$$ hash MD5
$$ F6 15 42 C8 FA E2 4A 88 E2 FF 7C 6F 68 50 DB 57
##$RELAX= 
##$RELAX= 
##$RELAX= 
##$RELAX= 
##$RELAX= 
##$RELAX= 
##$RELAX= 
$$ Bruker specific parameters
$$ --------------------------
##$DU= <C:\u>
##$EXPNO= 2150
##$NAME= <ADRS>
##$PROCNO= 1
##$TYPE= <nmr>
##$USER= <dgb>
##$AMP= (0..31)
100 100 100 100 100 100 100 100 100 100 100 100 100 100 100 100 100 100 
100 100 100 100 100 100 100 100 100 100 100 100 100 100 
##$AQSEQ= 0
##$AQ_mod= 3
##$AUNM= <au_zg>
##$AUTOPOS= <22 >
##$BF1= 250.13
##$BF2= 250.13
##$BF3= 250.13
##$BF4= 250.13
##$BF5= 500.13
##$BF6= 500.13
##$BF7= 500.13
##$BF8= 500.13
##$BYTORDA= 1
##$CFDGTYP= 0
##$CFRGTYP= 5
##$CHEMSTR= <none>
##$CNST= (0..31)
1 1 145 1 1 1 1 1 1 1 1 1 1 1 1 1 1 1 1 1 1 1 1 1 1 1 1 1 1 1 1 1 
##$CPDPRG= <>
##$CPDPRG1= <>
##$CPDPRG2= <>
##$CPDPRG3= <>
##$CPDPRG4= <mlev>
##$CPDPRG5= <mlev>
##$CPDPRG6= <mlev>
##$CPDPRG7= <mlev>
##$CPDPRG8= <mlev>
##$CPDPRGB= <>
##$CPDPRGT= <>
##$D= (0..31)
0 1 0 0 0 0 0 0 0 0.06 0 0 0 0 0 0 0.0002 0 0 0 0 0 0 0 0 0 0 0 0 0 0 
0 
##$DATE= 1114428248
##$DBL= (0..7)
120 120 120 120 120 120 120 120 
##$DBP= (0..7)
150 150 150 150 150 150 150 150 
##$DBP07= 0
##$DBPNAM0= <>
##$DBPNAM1= <>
##$DBPNAM2= <>
##$DBPNAM3= <>
$$ [...]
##$SUBNAM7= <"">
##$SUBNAM8= <"">
##$SUBNAM9= <"">
##$SW= 20.6930455092707
##$SWIBOX= (0..15)
0 0 3 0 0 0 0 0 0 0 0 0 0 0 0 0 
##$SW_h= 5175.983436853
##$TD= 65536
##$TD0= 1
##$TE= 295.16
##$TE2= 300
##$TE3= 300
##$TEG= 300
##$TL= (0..7)
0 120 120 120 120 120 120 120 
##$TP= (0..7)
150 150 150 150 150 150 150 150 
##$TP07= 0
##$TPNAME0= <>
##$TPNAME1= <>
##$TPNAME2= <>
##$TPNAME3= <>
##$TPNAME4= <>
##$TPNAME5= <>
##$TPNAME6= <>
##$TPNAME7= <>
##$TPOAL= (0..7)
0.5 0.5 0.5 0.5 0.5 0.5 0.5 0.5 
##$TPOFFS= (0..7)
0 0 0 0 0 0 0 0 
##$TUNHIN= 0
##$TUNHOUT= 0
##$TUNXOUT= 0
##$USERA1= <user>
##$USERA2= <user>
##$USERA3= <user>
##$USERA4= <user>
##$USERA5= <user>
##$V9= 5
##$VALIST= <valist>
##$VCLIST= <CCCCCCCCCCCCCCC>
##$VD= 0
##$VDLIST= <DDDDDDDDDDDDDDD>
##$VPLIST= <PPPPPPPPPPPPPPP>
##$VTLIST= <TTTTTTTTTTTTTTT>
##$WBST= 1024
##$WBSW= 4
##$XGAIN= (0..3)
0 0 0 0 
##$XL= 0
##$YL= 0
##$YMAX_a= 379335
##$YMIN_a= -266487
##$ZGOPTNS= <>
##$ZL1= 120
##$ZL2= 120
##$ZL3= 120
##$ZL4= 120
##$ABSF1= 16.522
##$ABSF2= -4.171173
##$ABSG= 5
##$ABSL= 3
##$ALPHA= 0
##$AQORDER= 0
##$ASSFAC= 0
##$ASSFACI= 0
##$ASSFACX= 0
##$ASSWID= 0
##$AUNMP= <proc_1d>
##$AZFE= 0.1
##$AZFW= 0.1
##$BCFW= 0
##$BC_mod= 0
##$BYTORDP= 0
##$COROFFS= 0
##$CY= 12.5
##$DATMOD= 1
##$DC= 0
##$DFILT= <>
##$DTYPP= 0
##$F1P= 14.0000005364418
##$F2P= -0.99999901652339
##$FCOR= 0.5
##$FTSIZE= 32768
##$FT_mod= 6
##$GAMMA= 0
##$GB= 0
##$INTBC= 1
##$INTSCL= 1
##$ISEN= 128
##$LB= 0.3
##$LEV0= 0
##$LPBIN= 0
##$MAXI= 10000
##$MC2= 0
##$MEAN= 0
##$ME_mod= 0
##$MI= 0
##$NCOEF= 0
##$NC_proc= -6
##$NLEV= 6
##$NOISF1= 0
##$NOISF2= 0
##$NSP= 0
##$NTH_PI= 0
##$NZP= 0
##$OFFSET= 16.522
##$PC= 1
##$PHC0= -79.65362
##$PHC1= 6.477446
##$PH_mod= 1
##$PKNL= yes
##$PPARMOD= 0
##$PSCAL= 4
##$PSIGN= 0
##$REVERSE= no
##$SF= 250.13
##$SI= 32768
##$SIGF1= 0
##$SIGF2= 0
##$SINO= 400
##$SIOLD= 32768
##$SREGLST= <1H.DMSO>
##$SSB= 0
##$STSI= 32768
##$STSR= 0
##$SW_p= 5175.98343685301
##$SYMM= 0
##$S_DEV= 0
##$TDeff= 65536
##$TDoff= 0
##$TI= <Analysis number 999999
Compound Code 99
Book Reference 9
Project Code 9>
##$TILT= no
##$TM1= 0
##$TM2= 0
##$TOPLEV= 0
##$USERP1= <user>
##$USERP2= <user>
##$USERP3= <user>
##$USERP4= <user>
##$USERP5= <user>
##$WDW= 1
##$XDIM= 32768
##$YMAX_p= 413710416
##$YMIN_p= -1256963
$$ End of Bruker specific parameters
$$ ---------------------------------
##NTUPLES= NMR SPECTRUM
##VAR_NAME=  FREQUENCY,     SPECTRUM/REAL,   SPECTRUM/IMAG
##SYMBOL=    X,             R,               I
##VAR_TYPE=  INDEPENDENT,   DEPENDENT,       DEPENDENT
##VAR_FORM=  AFFN,          ASDF,            ASDF
##VAR_DIM=   32768,         32768,           32768
##UNITS=     HZ,            ARBITRARY UNITS, ARBITRARY UNITS
##FACTOR=    0.157963299565203, 1,           1
##FIRST=     4132.6476996994, 0,             0
##LAST=      -1043.33573715361, 0,           0
##MIN=       -1043.33573715361, -1256963,    0
##MAX=       4132.6476996994, 413710416,     0
$$ Real data points
##PAGE= N=1
##DATA TABLE= (X++(R..R)), XYDATA
$$ [...]
24395f9773K28263j71037j91885j137P8361j85248K80630K88638O1611n4746k42682
24384B0995k64220m4134J43288J75741R1366Q6735K17253o6398m11501K18837
24374A67962L52347j19543m34222J7502n5234k96879q0572O1881Q8708K50407
24364d7643J59950L04205k07682j49681k22462J50654O3886k22958k50578Q7058
24354c35251L17437r5047p5193K1035K25096k3076J26375N9524j74051q8295l5331
24343g6777j28853r3459L0269J56416P1332K68543K1963j19618l45923J27461
24333h8646L60627j96884n7302j34577K71014K22759m0266j13479l17145j02000
24323a95899n3837J69750K74859l45689l51815k51667j10568J90215N03578J03827
$$ plain form
24395 -69773 158490 -12547 -204432 -205569 -127208 -312456 -31826 256812 318423 263677 20995
24384 20995 -243225 -287359 -144071 31670 123036 209771 427024 360626 -50875 167962
24374 167962 520309 400766 -33456 -15954 -71188 -368067 -448639 -386758 -298050 -47643
24364 -47643 112307 416512 208830 59149 -163313 -12659 51227 -171731 -422309 -335251
24354 -335251 -17814 -112861 -188054 -167019 58077 35001 161376 220900 46849 -41446 -76777
24343 -76777 -205630 -299089 -268820 -112404 -41072 227471 249434 129816 -216107 -88646
24333 -88646 271981 75097 17795 -116782 154232 376991 336725 223246 -93899 -195899
24323 -195899 -249736 -79986 194873 -150816 -502631 -754298 -864866 -674651 -171073 -67246
24313f7246J56043j49791q07j49473j75143J2442K40571L50708k40794n9169P410
24302g5249J05561m0476J24704J32873l4291q2208J23926Q8097K74726Q2601l00079
24291D00185j38366j57108J46632J22325q777j64041k49577K4018K18959J13596
24281C07846j14783P2309r5712J11817j42613k53863k59258r517K22644L21169
24271A60039J78448m5187l97032M8601k32194k55700L3438J40754l0643K69714
24261a29762j72865k00284K74689o7792p614K70087j2032q0507N5145j01609m7414
24250b19958P1627K22206J01450r9849K9852p3125K15836J5112N2506M0862k54563
24239A01956k29316j77946J09397o7822l90191J03906J36698K04261M25640N2924
$$ plain form
24313 -67246 88797 -60994 -61801 -211274 -386417 -373975 -133404 217304 -23490 -82659 -75249
24302 -75249 30312 -10164 114540 247413 213122 130914 254840 342937 617663 700264 400185
24291 400185 261819 104711 251343 373668 364891 200850 -48727 -24709 194250 307846
24281 307846 193063 265372 169660 281477 138864 -114999 -374257 -383774 -161130 160039
24271 160039 338487 293300 -103732 -55131 -287325 -543025 -509587 -368833 -399476 -129762
24261 -129762 -302627 -502911 -228222 -296014 -303628 -33541 -45573 -126080 -70935 -172544 -219958
24250 -219958 -148331 73875 175325 75476 105328 32203 248039 263151 315657 356519 101956
24239 101956 -127360 -305306 -195909 -263731 -653922 -550016 -413318 -209057 216583 269507
24229B69507j54634l54530N6285J74372K32550l9200J2799L29251J31021k02161
24219D55260k41008j51248k64944j25598J25740M0351J05055o9541J78378J58470
24209B10915q8376k16542k09805l10883L34829J98356q8952p3890P0001L6239
24199a38108j50363j8209M79665m4720k73614k09286K73006k222j95429k06641
24189d85921L2515J42811j15376j14414K00240K65029k90093M7432k3252j57475
24179d98504L32350l1242l7371J0908L45498K9509q5828J48932l5127k91239j18003
24168b30117L4348J71105O2834K25026M9403k2581l7190o5158K14152j30258K0545
24157B92109l9188k9316k11008k45610J441L08744M9748m7276j01872M3873K83079
$$ plain form
24229 269507 114873 -239657 -183372 -9000 223550 184350 197149 526400 657421 455260
24219 455260 214252 63004 -201940 -327538 -201798 -161447 -56392 -125933 52445 210915
24209 210915 122539 -94003 -303808 -614691 -279862 -81506 -170458 -244348 -174347 -138108
24199 -138108 -288471 -306680 172985 128265 -145349 -354635 -81629 -83851 -279280 -485921
24189 -485921 -453406 -310595 -425971 -540385 -340145 -75116 -365209 -317777 -341029 -498504
24179 -498504 -166154 -197396 -234767 -223859 121639 151148 65320 214252 179125 -112114 -230117
24168 -230117 -195769 -24664 38170 263196 312599 290018 252828 187670 401822 271564 292109
24157 292109 252921 223605 12597 -233013 -231572 77172 126920 79644 -22228 21645 304724
24146C04724J98284k83856j50389n9831k46722Q8384j45961Q1689K32562p6920
24136e8036J46379J74859K02266L05653q3840k70022l15875j69589k1345O5579
24126b3971j55798k26019j59899K46291l1553J20730K28888k00354p1861J06201
24116a67345J50390K30236k32063m6075k48511j99592L26071J58172J02650Q8181
24106A62114q6351j38418m4247L7538l63239k38960K67782K61818j0923j47434
24096c00320J9321j52463q8994M76248J1210q0490Q8050O5963k37155k10006L52890
24085e5746J07451j87997J49399j07400p7032j36427O30340J44353j92648n2075
24075B22218k6055j06197q3389M9333J01419r6947J51100j35776J18081J90446
$$ plain form
24146 304724 503008 219152 68763 8932 -237790 -149406 -295367 -213678 18884 -58036
24136 -58036 88343 263202 465468 771121 687281 417259 101384 -68205 -89550 -23971
24126 -23971 -179769 -405788 -565687 -319396 -350949 -230219 -1331 -201685 -273546 -167345
24116 -167345 -16955 213281 -18782 -64857 -313368 -512960 -186889 -28717 73933 162114
24106 162114 75763 -62655 -106902 -69364 -432603 -671563 -403781 -141963 -152886 -300320
24096 -300320 -280999 -433462 -522456 -46208 -34998 -115488 -27438 38525 -198630 -408636 -55746
24085 -55746 51705 -136292 13107 -94293 -171325 -307752 322588 466941 274293 222218
24075 222218 196163 89966 6577 55910 157329 60382 211482 75706 193787 384233
24065C84233j42949m0518q0853j21755p7806j04162L54706j9627l98594j38068
24055c85393K18295J65840M4874J09320k24978k3342k30909P0369J37727K29782
24045A11585N9245J93286k29398j14871J70288J6678L0028K41966J20459o4779
24035E34487k70741k71883J19630j75982q0929r321J95696l60507j10685J89551
24025b40684J6716K1191Q9820n4082J32751K83140K80685n4964l78964R915K4185
24014A29709m0432k17857j17785m0402L15028J21285R6291J8916k49539k045R2809
24003A05978J33955k4990n2863k02170p9882m1734J12448K09181j56222k84468
23993b80767k41996J77654L09479N7319r8226j490j09807Q7359P2426L30560J90285
$$ plain form
24065 384233 241284 200766 119913 -1842 -79648 -183810 170896 151269 -247325 -385393
24055 -385393 -167098 -1258 43616 152936 -72042 -95384 -326293 -255924 -118197 111585
24045 111585 170830 364116 134718 19847 190135 206813 236841 478807 599266 534487
24035 534487 263746 -8137 111493 -64489 -145418 -154739 40957 -319550 -430235 -240684
24025 -240684 -223968 -202777 -112957 -167039 -34288 248852 529537 474573 95609 105524 129709
24014 129709 89277 -128580 -246365 -286767 28261 149546 245837 264753 15214 13169 105978
24003 105978 239933 214943 162080 -40090 -119972 -161706 -49258 159923 3701 -280767
23993 -280767 -522763 -345109 -35630 21689 -76537 -78027 -187834 -100475 -28049 302511 492796
23982D92796p9983J33352j61683k51168r439r2962q8078J21313j28647j38298
23972b02797m02990k93854N38793M54591L9623k09495k60607J7551J62777P9932
23962g6476K15484J436j09375r1182M8244L273J57706J35087K2327k46738k66791
23951b07005l56380J11091M21690K71323K16354l3028J17172k38162j07615k94507
23941i9067k03862J04154K925J66176L62577l06262k11942K78749K63360M5448
23931D02256J60742j19650j28794J6573m25617m03279N7139K87441K88812k4613
23921A11010j35281L7820O5735q7470q8599l7695j15368j16444j08589o5540k23454
23910g63875m0334M84828J78119j22842j88391k37401J15938j18763J2767K74647
$$ plain form
23982 492796 412813 546165 384482 133314 123875 30913 -57165 64148 -64499 -202797
23972 -202797 -605787 -899641 -360848 93743 133366 -76129 -336736 -319185 -156408 -76476
23962 -76476 139008 140444 31069 -60113 -11869 -8596 149110 284197 306524 59786 -207005
23951 -207005 -563385 -452294 -30604 240719 457073 424045 541217 303055 195440 -99067
23941 -99067 -302929 -198775 -195850 -29674 332903 26641 -185301 93448 356808 402256
23931 402256 562998 443348 314554 331127 -94490 -497769 -440630 -153189 135623 111010
23921 111010 -24271 13549 79284 -8186 -96785 -134480 -249848 -366292 -474881 -540421 -763875
23910 -763875 -804209 -319381 -141262 -264104 -452495 -689896 -573958 -692721 -679954 -405307
23900d05307j85202K57455K31725j04110j00535J70587K25681K63200R5509j10574
23890C38429j73234l32307j50704J28816N3083k9824k29548J9969L30945J38550
23880I4175j12457l7924j67415J6733K99016j20945j52842J68355K58291j87733
23870E7254O923q9753k27187P6565K20845J1603M7482l9951J62461k30629l15329
23859c19716o1424M2133k09197M26939Q5344J8214j64514L4034J12625J03629
23849F8067j5257J91526M9697L60830j09892j73039j53593l54982j59525R3944
23839b02224M6297J64764L89614K73470j68076J19875K9494k90621n31369j25770
23829b94546L1742r8774k20882k8636L69946K93440Q1417K01820J15317l07028
$$ plain form
23900 -405307 -590509 -333054 -101329 -205439 -305974 -135387 90294 353494 449003 338429
23890 338429 165195 -167112 -317816 -189000 -135917 -165741 -395289 -375320 -44375 94175
23880 94175 -18282 -56206 -223621 -206888 92128 -28817 -181659 -13304 244987 57254
23870 57254 64177 -25576 -252763 -176198 44647 56250 103732 63781 226242 -4387 -319716
23859 -319716 -381140 -339007 -548204 -121265 -35921 -17707 -182221 -148187 -35562 68067
23849 68067 52810 244336 294033 654863 544971 371932 218339 -136643 -296168 -202224
23839 -202224 -155927 8837 398451 671921 503845 623720 653214 362593 -168776 -294546
23829 -294546 -262804 -361578 -582460 -611096 -241150 52290 133707 335527 450844 143816
23819A43816m6067p9903k81370O3355L87737J60492j61736j70994R3187p4289
23809C4228j2597L83657k39794j41772o8797O7536j23311k79533K1381J37359
23799b21643J08524J3R2026J68987k38985j39906K12418J41670l58667q2346M09987
23788I2078J20706m1155j41092Q3831N6682o4866k13240j15989J02497K34442
23778A13894l4527k05373j43782N5428k1377K04515j79922k4004K40676K8403
23768C3931k29983j36104j9605k2851j71400j50367j25806J4813K32116J71676
23758d03580K02353J69449q1240K3639j10429q6418Q5480l7829O5128M33204k02010
23747E7747k73834k35862K10964J73883j98090k44779o4526K49700K83812r2835
$$ plain form
23819 143816 97749 17846 -263524 -200169 187568 348060 186324 15330 108517 34228
23809 34228 21631 405288 165494 23722 -45075 22461 -100850 -380383 -359002 -221643
23799 -221643 -113119 -113106 -21080 147907 -91078 -230984 -18566 123104 -235563 -317909 92078
23788 92078 212784 171629 30537 114368 171050 106184 -107056 -223045 -120548 113894
23778 113894 79367 -126006 -269788 -214360 -235737 -31222 -211144 -235148 5528 33931
23768 33931 -196052 -332156 -351761 -374612 -546012 -696379 -822185 -807372 -575256 -403580
23758 -403580 -201227 -31778 -113018 -89379 -199808 -286226 -200746 -238575 -173447 259757 57747
23747 57747 -216087 -451949 -240985 -67102 -265192 -509971 -574497 -324797 -40985 -133820
23737a33820M225J22366n6603l43418K00009L1592J57267J20347j79623q7680
23727a65338J09958O7442l7638m0486K18789j6542k75505J17385l8930j51036
23717b11901l61527j39854K43121n442N619K89631O5886P2396K92218n5565l14853
23706a20271J15873L54830j76306k44506j78507L4987J38989K239j23300Q1376
23696a14596o9630j96038j40316K5352L08107J2602O1441M1916j26259j71429
23686c68850J87432Q1371k5894K5050o6843Q0666l0758j67337J26826L73047j17684
23675I7026j87766l6579k22479p8535K10419Q3447j5332O4996p6606j60781n9759
23664c81949J61485j46532k4460n7746O6778K86117J4380N9336J14780n27471
$$ plain form
23737 -133820 -129595 -7229 -63832 -407250 -207241 -175649 -18382 101965 -77658 -165338
23727 -165338 -55380 12062 -25576 -66062 152727 136185 -139320 -21935 -60865 -211901
23717 -211901 -573428 -713282 -470161 -475603 -469984 -180353 -114467 -42071 250147 194582 -120271
23706 -120271 -4398 350432 174126 -70380 -248887 -213900 -74911 -72672 -195972 -114596
23696 -114596 -184226 -380264 -520580 -495228 -187121 -174519 -113078 -71162 -197421 -368850
23686 -368850 -181418 -100047 -125941 -100891 -167734 -87068 -117826 -285163 -158337 214710 97026
23675 97026 -90740 -127319 -349798 -428333 -217914 -134467 -149799 -84803 -161409 -322190 -381949
23664 -381949 -220464 -366996 -391456 -449202 -382424 -96307 -81927 -22591 92189 -435282
23654d35282k54774J66295K92986P1927j51942n0909R8596K32063M52596j16856
23644C04700l27605m66780n1730M076j42707J61240K03641j2822k9462K7655J36285
23633a93509O2565l1555K26488K85575q2802k92140l82645J64957K09390K26313
23623A92637q2373J24757r6803k6663j71620k6388J18815r2390j09327r3496k14722
23612d77573j43240K03497K99816J48121K36397L00175K38810m02982l97941q1084
23602g6004K59099K52996j27403l98790l51607l14392N06747j5635R2282J75038
23592B331o5058O6069O7219r3857k0369j71599j91209K11928j47246J96229K1479
23581a24083j82122J31411N21210k70922j02405K0689J49169o6838m688j02821
$$ plain form
23654 -435282 -690056 -523761 -230775 -158848 -310790 -361699 -263103 -31040 421556 304700
23644 304700 -22905 -489685 -541415 -537339 -680046 -518806 -315165 -327987 -357449 -329794 -193509
23633 -193509 -130944 -162499 63989 349564 266762 -25378 -408023 -243066 -33676 192637
23623 192637 110264 235021 138218 111555 -60065 -86453 32362 -60028 -169355 -262851 -477573
23612 -477573 -620813 -417316 -117500 30621 267018 567193 806003 403021 5080 -76004
23602 -76004 183095 436091 308688 -90102 -441709 -756101 -249354 -264989 -172707 2331
23592 2331 -62727 3342 70561 -23296 -43665 -215264 -406473 -194545 -341791 -145562 -124083
23581 -124083 -306205 -174794 346416 75494 -26911 -6222 142947 76109 71421 -31400
23571c1400J5240J63730j92781j38573R0438P5329O4752L8634O8044j01943k86322
23560b34852o1675k15937J65682K32751J39519K661k674q7608n2412o3447J3732
23549a64260j20630J62407K21734o0807k98734l88247L50578J48282j20463j18548
23539c88688r587K9476k80253k05693K58331K58206K11032j12056J47601j3591
23529a05222j00764L67756K73272r0066L8774l46700m38204j26696M8202K87275
23519a92373J62092N8768k30203k0772J61558J71219R8907p4386m4628k17918
23509a27736p1568K45465k3008J93444j95839k99163l48320k0706J13056J01718
23499d32657J41051K56647K56014K30297q1275J242m9657m12632k72866K06933
$$ plain form
23571 -31400 -16160 147570 -45211 -183784 -93346 -18017 46735 85369 153413 51470 -234852
23560 -234852 -296527 -512464 -346782 -114031 25488 28149 25475 -62133 -114545 -177992 -164260
23549 -164260 -284890 -122483 99251 38444 -260290 -648537 -297959 -149677 -270140 -388688
23539 -388688 -398275 -368799 -649052 -854745 -596414 -338208 -127176 -239232 -91631 -105222
23529 -105222 -205986 161770 435042 344976 383750 37050 -401154 -527850 -479648 -192373
23519 -192373 -30281 28487 -201716 -222488 -60930 110289 209196 134810 90182 -127736
23509 -127736 -199304 46161 23153 216597 20758 -278405 -626725 -647431 -534375 -432657
23499 -432657 -291606 -34959 221055 451352 370077 371319 321662 -90970 -363836 -156903
23489a56903j42929r1739J9878L63198J08484k153q1315m2481l64273n2017J49447
23478b92803K29582K99223Q8108j55947k1662L6444j0786k97746L5367M2422j01024
23467a48822J46277K4358j97399j21720J79528L0022k07651J77259J23652r8509
23457i3005L66877j74113m97779j77167R2066M0112k06842m0583M95774M63382
23447B68722l04058r2170o7734J33780r8143j72856n5438K74921O6687j59144
23437b05433j08415K97593L31080k9721l72620j51492l985R7329K52600N1471
23427A58407J27009j55170o7043K46726j7197j07924p8043N3610o4340M2159k7319
23416A10875J23528l80983l68579k77912K49097J07582K06996K08428l9190n3440
$$ plain form
23489 -156903 -299832 -391571 -371693 -8495 99989 97836 16521 -25960 -390233 -442250 -292803
23478 -292803 -63221 236002 324110 168163 146501 182945 172159 -125587 -90220 -47798 -148822
23467 -148822 -2545 21813 -175586 -297306 -117778 -87756 -295407 -118148 5504 -93005
23457 -93005 273872 99759 -398020 -575187 -483121 -443009 -649851 -690434 -194660 268722
23447 268722 -35336 -127506 -195240 -61460 -159603 -332459 -387897 -112976 -46289 -205433
23437 -205433 -313848 -16255 314825 285104 -87516 -239008 -242993 -145664 106936 158407
23427 158407 285416 130246 63203 309929 292732 184808 106765 160375 96035 138194 110875
23416 110875 234403 -146580 -515159 -793071 -543974 -436392 -229396 -20968 -60158 -113598
23406a13598J55842l56485J46513K68964J76513k6675j97846n15624k95564L58211
23396c99749N01177R3973O4973K4625k27123j83629j40540J83178P2704J30495
23386A20084k66918j38236J43586K51189j83488o3563m7635k24975Q9094j80611
23376e01473Q6884K61840m22477j59666N16803L93985j3230k98370N441J48878
23366A8615l07472J34661j34736M3677q1880j06146K69884j51525p6049M33690
23356D2719Q8857l08416n21338n515o3664K30743K15219l5137Q9758k76371k37844
23345g80989J22271L29223K87491p7600R7770L47413J90382L5600l37550j64214
23335D9797J81671j28557l62326J984J00590k42516l29241J55377L49246K50470
$$ plain form
23406 -113598 42244 -314241 -167728 101236 277749 251074 53228 -462396 -757960 -399749
23396 -399749 101428 195401 260374 284999 57876 -125753 -266293 -83115 -10411 120084
23386 120084 -146834 -285070 -141484 109705 -73783 -137346 -184981 -409956 -320862 -501473
23376 -501473 -414589 -152749 -575226 -734892 -218089 175896 162666 -135704 -130263 18615
23366 18615 -288857 -154196 -288932 -245255 -327135 -433281 -163397 -314922 -390971 42719
23356 42719 131576 -176840 -698178 -703693 -767357 -536614 -321395 -356532 -266774 -543145 -780989
23345 -780989 -658718 -329495 -42004 -119604 -21834 325579 515961 551561 214011 49797
23335 49797 231468 102911 -259415 -257431 -156841 -399357 -728598 -573221 -223975 26495
23325B6495J7034L0743j76384k74492j32333N93025K94605m69004J65422K96177
23315C71288q3628k94168Q3567q5264Q4818K23555j65190l12245M1215m6978j02742
23304b85772p1697j8236J10824J70654j89745j50038P5391m9693J74631K17124
23294a6557J21011m2050j42597L61119J31623l75105l49685j44493N32404J69766
23284B45436k6814m2618l5079J0932j43024j51721J75023j31139Q2702M08153
23274C91851L12143j06728o2029O7672o080p7362J18689r4744k16257r9076j11733
23263A16346k51043j97939N167J48673L3193K10547J52316M4636n5189k0584l8870
23252A47253J89081k91303j97117M226J77759J02391m70304j48676j23290l77
$$ plain form
23325 26495 43529 74272 -102112 -376604 -508937 84088 378693 -90311 75111 371288
23315 371288 287660 -6508 77059 -8205 76613 300168 134978 -177267 -136052 -183030 -285772
23304 -285772 -357469 -375705 -264881 -94227 -283972 -434010 -358619 -408312 -233681 -16557
23294 -16557 104454 62404 -80193 280926 412549 37444 -312241 -456734 75670 245436
23284 245436 218622 176004 140925 151857 8833 -142888 32135 -99004 -16302 391851
23274 391851 703994 597266 535237 602909 596829 519467 638156 543412 327155 228079 116346
23263 116346 -134697 -332636 -327469 -178796 -145603 64944 217260 261896 206707 186123 147253
23252 147253 336334 45031 -152086 -147860 29899 132290 -338014 -486690 -609980 -610357
23242f10357m5602k89968N02067J84731l1647m2115P4570K15193J89938P9013
23232B25823l06078k63743q1521J01733O3665J54112k4450J47633j70405o7021
23222b20252K16191L11624J12677k79466n4279Q0096L51747j93885l65548j98563
23212b39658Q679p993k4383K10357j80900j8734j40157j61543P8197M4384n4946
23201d86697J61871K86692j08685j85715o2730P5414R3385J27337J97038K9862
23191A27772J22389j1562j84571J55073j15935k50062L0783j83664J73938L71134
23181B35295L6127j55273k76820N5141l08564k92851Q0696K84420K05268K14641
23171G8080m5898K19654R6422o5691k6232k70956j25805j314r657J87247J34687
$$ plain form
23242 -610357 -655959 -945927 -443860 -259129 -290776 -332891 -258321 -43128 146810 225823
23232 225823 -80255 -343998 -425519 -323786 -260121 -106009 -130459 17174 -153231 -220252
23222 -220252 -4061 307563 420240 140774 86495 166591 518338 324453 -41095 -239658
23212 -239658 -230979 -238972 -263355 -52998 -233898 -252632 -392789 -554332 -476135 -431751 -486697
23201 -486697 -324826 -38134 -146819 -332534 -395264 -319850 -226465 -99128 97910 127772
23191 127772 250161 238599 54028 209101 93166 -156896 -126113 -309777 -135839 235295
23181 235295 271422 116149 -160671 -105530 -414094 -706945 -626249 -341829 -136561 78080
23171 78080 32182 251836 348258 282567 256335 -14621 -140426 -141740 -151397 35850 170537
23160A70537j50646J71608k46628k42021j44216M483K29663l8530j04455L8608
23150c11597r1887J31869N2541q908L65893K9824m04337k11931K21218L81076
23140A53761J86536k42390k11630J37546J52106m7517j91720K21966J30889j08737
23130A80810k73850k4957J39993k63834K3141K6680j09393L6735o3638N0457r687
23119b87543L44383N21844J52824m94237l22431q7351P8322k4809j62539n4924
23109c36461J38986L30905J51804M3128m3853j73704k1657k19512M624P9512n692
23098e1920J00961j9427o5233J94212p2079N5289j7912L2837l28881N9845L64435
23087B52127j40245J0159P818J49317P6365l0668L4662R1716J52776l83548J2125
$$ plain form
23160 170537 19891 191499 -55129 -297150 -441366 -436883 -207220 -245750 -350205 -311597
23150 -311597 -403484 -271615 -219074 -227982 137911 167735 -236602 -448533 -227315 153761
23140 153761 340297 97907 -113723 23823 175929 128412 -63308 158658 289547 180810
23130 180810 -93040 -117997 21996 -241838 -218697 -192017 -301410 -264675 -328313 -277856 -287543
23119 -287543 56840 578684 731508 237271 -85160 -172511 -94189 -118998 -281537 -336461
23109 -336461 -197475 133430 285234 328362 284509 110805 89148 -130364 -125740 -46228 -51920
23098 -51920 49041 29614 -35619 158593 86514 141803 123891 156728 -172153 -112308 252127
23087 252127 111882 122041 129859 279176 355541 324873 359535 451251 604027 220479 232604
23076B32604k8936J9718K91149J06477o2334l5479j51975o5972j08060J19174
23066C16366J78357K4386r3446J77765P5510k35108k76929m3674q4142m9200J94982
23055A84867k23726J09446J655k06778j46682l4420j16139R5938K26892J14058
23045E111Q672o6317K281J56873K46920k80437n30366n7178K04784J9204K18350
23034g2103J30968L18878k2342m16005O0803m39072K39477L561q7399r860J82836
23023a10258L80156J29784J79732r5419n3612k2026r1465r1426k01960j34845
23013a11339j78768k31609J04029M53073Q1153k41239j71055K93134M06924J76009
23003E80312K10018P9873k46387l21961o8072R8145j11004o8500o5623K74696
$$ plain form
23076 232604 203668 223386 514535 621012 558678 523199 371224 305252 197192 316366
23066 316366 494723 519109 425663 603428 678938 443830 166901 123227 39085 -10115 184867
23055 184867 -38859 70587 72242 -134536 -281218 -315638 -431777 -335839 -108947 5111
23045 5111 13783 -52534 -50253 106620 353540 73103 -457263 -514441 -309657 -290453 -72103
23034 -72103 58865 377743 355401 -60604 199 -438873 -199396 -195835 -283234 -293094 -110258
23023 -110258 269898 399682 579414 483995 430383 408357 316892 225466 23506 -111339
23013 -111339 -290107 -521716 -417687 35386 116539 -124700 -295755 -2621 404303 580312
23003 580312 790330 870203 623816 301855 233783 331928 220924 152424 86801 361497
22993C61497L30833j60920k56519r0220j6931q7608m27023r32K96360K94245k46613
22982c831r0267J73081k40485j28195j25491r0482N9577J41055L66904Q7241J64673
22971C13780J47001j77583m20640q8851K9821k04420K9737k8001j96235M63877
22961a31514r748k40845n6475l6358M76235J69510j81175K4059r7768l18465j6144
22950d18688J65596k34766O3830J56720K39807p9507l66625J86470J57433l7150
22940a66880J95612K81990O0541k23345j68657O5905J15326M52606k43007l27046
22930D3045K09552K2238m04127J5595J49382j39656j27714J91270k9568j99341
22920b69324p0861j75618j23963L54399N68154K40672n49015O6888J91244j45915
$$ plain form
22993 361497 692330 531410 274891 184671 167740 80132 -346891 -347823 -51463 242782 -3831
22982 -3831 -94098 78983 -161502 -289697 -415188 -505670 -446093 -305038 61866 149107 313780
22971 313780 460781 283198 -137442 -226293 -196472 -400892 -371155 -399156 -595391 -131514
22961 -131514 -141262 -382107 -438582 -474940 1295 170805 -10370 13689 -84079 -402544 -418688
22950 -418688 -253092 -487858 -424028 -267308 -27501 -107008 -473633 -287163 -129730 -166880
22940 -166880 28732 310722 371263 147918 -20739 45166 160492 613098 370091 43045
22930 43045 252597 274835 -129292 -113697 35685 -103971 -231685 -40415 -69983 -269324
22920 -269324 -340185 -515803 -639766 -285367 282787 523459 -25556 41332 232576 86661
22910H6661J61651j64708j62546n8602p4622K5944J19000N6017k93481k97302
22900f01988L28551N23297K5805k99917l85469M6908L75639k23455j10584N07681
22890A86468M87442l34785k26041j31954p084J2224K5800J94084J50497k17319
22880A39332q1965M1086o569Q2946J31812r8737L3927n50612o4070n4917N8123
22869c69644L36915K14135k55346j61404j60030j7348L04438m00l601Q7593J47546
22858A22854J12503J73875j35645l33906j09865j86667j66848r8254q6338J44906
22848e63385L10219J73780N0899q1931J70974P3720J15340J10369l30494K23828
22838B53319J16879M082q7361j41066K7186j86135p5937L81662j07470j51538
$$ plain form
22910 86661 248312 83604 -78942 -137544 -212166 -186222 -67222 -11205 -304686 -601988
22900 -601988 -273437 249860 275665 -24252 -409721 -362813 12826 -210629 -321213 186468
22890 186468 673910 339125 113084 -18870 -25954 -13730 12070 206154 356651 139332
22880 139332 57367 98453 91884 174830 306642 207905 241832 -308780 -372850 -427767 -369644
22869 -369644 -32729 181406 -73940 -235344 -395374 -412722 -108284 -108684 -112285 -24692 122854
22858 122854 235357 409232 273587 -60319 -170184 -356851 -523699 -621953 -708291 -563385
22848 -563385 -253166 -79386 -28487 -110418 60556 134276 249616 359985 29491 253319
22838 253319 370198 374280 286919 145853 173039 -13096 -89033 292629 185159 33621
22828C3621O7662j70488j02488J22997q9877J2140L9208k49926L8089L5943L024
22817b60095p6566J38342o3255k56533j9180J27679L40349R7420J3638J41782
22807A83581Q8324j1966j26509J69010J45649k63136l53301J27252K03885L4737
22797A97526j75608q1239k8752K34629J9638q0735l85125j35561J7958K42520
22787a74749j05958p4544J02557K7685j6518K51855l0126j48488o5708K00813
22777c3181L96685p6236L4261l0108k34429j98348K76911r681j76129Q3011K4252
22766E7008J72370k45298m25852j41667j11717J87450L49841r5592j60104R2393
22756c21168q0737K5733j49106j49848r1693K37547J6333l09951q8092J58145
$$ plain form
22828 33621 101283 -69205 -171693 -48696 -138573 -126433 -87225 -337151 -299062 -263119 -260095
22817 -260095 -336661 -198319 -261574 -518107 -537287 -409608 -69259 28161 41799 183581
22807 183581 271905 259939 133430 302440 448089 184953 -168348 -41096 162789 197526
22797 197526 21918 -59321 -88073 146556 166194 85459 -299666 -435227 -417269 -174749
22787 -174749 -280707 -355251 -252694 -225009 -241527 10328 -19798 -168286 -233994 -33181
22777 -33181 363504 287268 321529 291421 56992 -141356 135555 125874 -50255 32756 57008
22766 57008 229378 -15920 -441772 -583439 -695156 -507706 -157865 -253457 -413561 -321168
22756 -321168 -401905 -376172 -525278 -675126 -766819 -529272 -512939 -822890 -910982 -752837
22746g52837L39583L68131J71262k07147l83630l26744j86076J65519O39585J46761
22736b5593j72831K44132j07776K11955K62232l27023l10039M24499P8806l16729
22726c8367j5261L09531R2752r8677l4719J40426j14596O0441r9240j26519j3956
22715F1815q6865o8076p5798K00529J59601l9735j33796J16694J49259K75104
22705E58732J76566j77372k2759k64939j74683j426O1644j82247k26027P8462
22695a74049m2561j11801l81451L65514R88539M4741k64711R2177p6416n7109
22685C82873p4684p1600k06937j4929J59230j42558q1434K24845j3138j58373
22675C295j0876K7402J44867M28706l842j30664m16370j50094K46904M5500J185
$$ plain form
22746 -752837 -413254 -45123 126139 -81008 -464638 -791382 -977458 -811939 -172354 -25593
22736 -25593 -198424 45708 -62068 149887 412119 85096 -224943 199556 278362 -38367
22726 -38367 -53628 255903 348655 249978 215259 355685 241089 301530 202290 75771 61815
22715 61815 -25050 -93126 -168924 31605 191206 151471 17675 134369 283628 558732
22705 558732 735298 557926 535167 270228 95545 94119 155763 -26484 -252511 -174049
22695 -174049 -216610 -328411 -709862 -344348 644191 688932 424221 516398 439982 382873
22685 382873 308189 236589 29652 14723 173953 31395 -50039 174806 161668 3295
22675 3295 -7581 19821 164688 593394 589552 458888 42518 -107576 139328 184828 186013
22664A86013J49714j11780L08964p0251j28985R9197l90406k35326K11808K14905
22654B33853j85847j49752K43035K57672K03344P9190j67035l93587k31170k27837
22644c38134M5084N35204J77244n7018k4078K06044o4869o5844j90274n6666J8704
22633A85397R8832N2193l09641l17484J20308M85050o6993m10134k97775J26681
22623c33566J70460n3266K3549J66072j437q3925Q1312K7077l50825j47942R9095
22612d03396J3023j05424k82651J18149q5849Q0350L31311n300o9453K31712L81721
22601B04193q623J11176j14664k10903J50528J39092M3960K7784k65072j57470
22591g9999m5268o100r7136j39477O9653L507o6871O8867M65211J16981O145j49233
$$ plain form
22664 186013 335727 223947 532911 462660 333675 432872 42466 -192860 18948 233853
22654 233853 48006 -101746 141289 398961 602305 681495 514460 120873 -110297 -338134
22644 -338134 -293050 242154 419398 362380 338302 544346 479477 413633 223359 166693 185397
22633 185397 284229 336422 26781 -290703 -170395 314655 247662 -162472 -460247 -333566
22623 -333566 -163106 -216372 -192823 -26751 -28188 -112113 -30801 -3724 -354549 -502491 -403396
22612 -403396 -390373 -495797 -778448 -660299 -746148 -665798 -334487 -339787 -409240 -177528 204193
22601 204193 195570 306746 192082 -18821 131707 270799 314759 342543 77471 -79999
22591 -79999 -125267 -131367 -228503 -367980 -298327 -294820 -361691 -292824 172387 289368 295513 146280
22579A46280k15812l3965l245j30990J15454K03470o527J11441J19024m0925o7193
22568A97012j21759o4232J81742k55581R5563m4820k60421p3640o8263L49620
22558f4779O8019k82049R1974j66133o2862J49171J47385p9861l0653k217q3476
22547c15481K15391M63217j18724m43080o207K57392J89266L9131k6853m4488
22537B09564l87403J06545Q6807J92702P218K79366q2000k23976j44488l99755
22527c55420R3717q8775r5567J5379K2968N6976N8216j39032J23484k17430K19322
22516c06162K82824J75260j99383J27472j34179K2009o1501M0344l4094p5697
22506a63107P418M0250j65903O1029J10547j49835Q7251l20959p8001j02599J33591
$$ plain form
22579 146280 -69532 -103497 -106742 -237732 -122278 81192 74665 186106 305130 264205 197012
22568 197012 75253 11021 192763 -62818 32745 -12075 -272496 -346136 -414399 -64779
22558 -64779 3240 -278809 -186835 -352968 -415830 -266659 -119274 -199135 -229788 -232005 -315481
22547 -315481 -100090 363127 244403 -198677 -204884 52508 241774 280905 254052 209564
22537 209564 -177839 -71294 15513 208215 215433 494799 412799 188823 44335 -355420
22527 -355420 -261703 -350478 -446045 -430666 -407698 -350722 -292506 -431538 -308054 -525484 -306162
22516 -306162 -23338 151922 -47461 80011 -54168 -32159 -93660 -53316 -87410 -163107
22506 -163107 -155689 -115439 -281342 -220313 -109766 -259601 -172350 -493309 -571310 -673909 -540318
22495e40318J025K22568M93084M48855p6473n97201L9381R4976J11538Q4383r9723
22484A82095l57269Q2765M52794N5084k32656m11178j59775p543M9084O3664K39912
22473d3023J29898K48712J82706j86355q1858k48185K35921L34239P07N2904k82720
22462C42946n46846R0169M32915r6672n0767N46667K04107n64889p2096j50718
22452A34816k9470J31337k82237N5760K02648q0462Q3731J01619o9083k49167
22442e08j72685J3531p888N4420K23368J21536K43362j05278P0540l18482j31331
22431i415J68648j54683l33629O1943K8736K09681J59878K10571K86948K5943
22421F54621l89140l11787K65752j95558l09373o6219l7832p702K3489n1032K85660
$$ plain form
22495 -540318 -539293 -316725 176359 625214 548741 -48460 -9079 85897 197435 281818 182095
22484 182095 -175174 -92409 360385 415469 182813 -228365 -388140 -395683 -346599 -282935 -43023
22473 -43023 86875 335587 518293 331938 250080 1895 237816 572055 572762 625666 342946
22462 342946 -203900 -113731 319184 222512 171745 718412 922519 357630 285534 134816
22452 134816 105346 236683 -45554 10206 212854 132392 216123 317742 248659 -508
22442 -508 -173193 -159662 -167550 -113130 110238 231774 475136 369858 440398 121916 -9415
22431 -9415 159233 4550 -329079 -267136 -238400 -28719 131159 341730 628678 654621
22421 654621 265481 -46306 219446 23888 -285485 -351704 -389536 -397238 -373749 -424781 -139121
22410a39121K55523K93544J74412r960j53873m3881j78012N3477J2567K49891
22400E14567L2122p7853j58802j19198K21453Q2696j02743k36351j95275N0209
22390A0825K96439r3455l4265m4444o317L5357J58000L34646n729j27547k78289
22379B45221j49230J15175K59370n8829l73380l67224l3427j08551j0780K16425
22369b65230L60761N8819k80898j62554N80166P0940l95080m65350j83928K20459
22359d61895M49148K01519J06589q1477p2605n0301o0281q7565r2259j31321j40480
22348d20928M8764J65740J61856J9669J89029P4301k15161q2656k91518j25170
22338d76074L59208P3425j62020l9285j11341j94356J44894M7428n8640K49291
$$ plain form
22410 -139121 116402 409946 584358 574398 420525 376644 198632 252109 264676 514567
22400 514567 546689 468836 310034 190836 412289 494985 392242 155891 -39384 10825
22390 10825 307264 213809 179544 135100 128783 164140 322140 656786 651057 523510 245221
22379 245221 95991 211166 470536 411707 38327 -328897 -362324 -470875 -481655 -265230
22369 -265230 95531 154350 -126548 -289102 291064 362004 -33076 -498426 -682354 -461895
22359 -461895 -12747 188772 295361 213884 141279 90978 30697 -56868 -149127 -280448 -420928
22348 -420928 -372164 -206424 -44568 -24899 164130 238431 23270 -59386 -350904 -476074
22338 -476074 -116866 -43441 -205461 -244746 -356087 -550443 -405549 -358121 -416761 -167470
22328a67470K63501Q5971L0239j13313k59554l614j9445k41763K83648q232k61298
22317d11330K74252L88316j83264j42641M2254K165L86032l7283k91939j73305
22307a46743J79164K96139j08425k56518J37055O63p5853q5880j35050k32466
22297d27914l9748K71398J24665k91017j63877J95343n7786L25267M21385k37523
22287A20193l41243m56640K43283L54601M9052M5966m9713j75952O353L86214
22277A82114P3038j16710k08234J8017k40721L7939K6040l18303M2453K33686
22267b70681J4223k52237J95925J56967J13285p1460j5125k68975j90714K42774
22257c46018M43208K49724P1988k10551K67636j15255q8220k41502m05349J23841
$$ plain form
22328 -167470 96031 182002 212241 98928 -160626 -164240 -183685 -425448 -141800 -150032 -411330
22317 -411330 -137078 251238 67974 -74667 -32413 -30248 355784 318501 26562 -146743
22307 -146743 32421 328560 220135 -36383 100672 101335 25482 -60398 -195448 -427914
22297 -427914 -467662 -196264 -71599 -362616 -526493 -331150 -388936 -63669 357716 120193
22287 120193 -221050 -677690 -434407 -79806 -30754 15212 -34501 -210453 -204100 182114
22277 182114 255152 138442 -69792 -51775 -292496 -254557 -228517 -546820 -504367 -270681
22267 -270681 -256458 -508695 -312770 -155803 -42518 -113978 -129103 -398078 -588792 -346018
22257 -346018 97190 346914 418902 208351 475987 360732 272512 31010 -374339 -250498
22247b50498K37892n4990m0697M3945j9054j69733N33042o4666l0792j1860o0259
22236A12330k27212k99528o088J09081k50998M5806k0790K64905R4129J38834
22226c9531o773K50155p0152j12547m31043k47617K18882P3345R4058L78874J01083
22215B08734k09078j45237K54258k60217j05964k29829K73777J86749K15075j87946
22205C22m54842p081L00121O4956l61048k03612J45485k7594L4369L33267L33430
22194A57773k0979j166j9172k08478K44674J85295J5205j05513q7148j15002l89231
22183c43742J77105J97209j36877q4404n7691J83K45015L66015p3282l21721m47687
22172d79877k33625J7550L9245N47003L14213j16011k23815k93777J81424K65037
$$ plain form
22247 -250498 -12606 -67596 -108293 -64348 -83402 -253135 279907 215241 184449 172589 112330
22236 112330 -114882 -414410 -420498 -311417 -562415 -516609 -537399 -272494 -178365 -39531
22226 -39531 -46304 203851 133699 21152 -409891 -657508 -438626 -365281 -271223 107651 208734
22215 208734 -344 -145581 108677 -151540 -257504 -487333 -213556 -26807 188268 322
22205 322 -454520 -461601 -161480 -96524 -457572 -661184 -515699 -543293 -508924 -175657 157773
22194 157773 136794 135628 116456 -92022 152652 337947 353152 247639 160491 45489 -343742
22183 -343742 -166637 30572 -106305 -190709 -248400 -248217 -3202 362813 289531 -32190 -479877
22172 -479877 -713502 -695952 -656707 -109704 204509 88498 -135317 -429094 -247670 17367
22162A7367J12351l38658k36294J86795l64751K12530J53516k58176j94637J61232
22152e48725J90257j59825M0293J93367J58368J90647L2604k46847j95576M6166
22142b99271J07288P3769j52761j52978K30947j02864r859J46429L51368j27294
22132F4774l45323R4587L07796K96032k12398l92794p7528k2625M461O3605J02786
22121a16627K29658L9001m45983k09557P7820j04346J47607J57060K60521l0285
22111D869R1897j54246m56549j24522L88868J92792o4839j19887q543J62600O8035
22100a9525j24788k30574K60079K34140M9386k00152j51660k50743r7728J39034
22090c92531J55506K7648j75295J13700j5204l67222M57412J64962n0525J87715
$$ plain form
22162 17367 129718 -208940 -445234 -258439 -623190 -410660 -257144 -515320 -709957 -548725
22152 -548725 -358468 -518293 -478000 -284633 -126265 64382 96986 -149861 -345437 -299271
22142 -299271 -191983 -118214 -270975 -423953 -193006 -295870 -305729 -159300 192068 64774
22132 64774 -280549 -185962 121834 417866 205468 -187326 -264854 -287479 -283018 -219413 -116627
22121 -116627 113031 152032 -293951 -503508 -425688 -530034 -382427 -225367 35154 4869
22111 4869 96766 -57480 -514029 -638551 -249683 -56891 -121730 -241617 -250160 -87560 -19525
22100 -19525 -144313 -374887 -114808 119332 168718 -31434 -183094 -433837 -531565 -392531
22090 -392531 -237025 -209377 -384672 -270972 -286176 -653398 -195986 -31024 -81549 106166
22080A06166r3738L43006j06942J07138j44153k07717j45392j35035J0428j22093
22070c88332k77022j799K07489j74859l2485O0222L6590M7647m1967j1973J10189
22059d66300R936L42350J31391J535j36652k58543P1451M0451Q8953K73442Q0884
22048A78898j74147k0748n645o1205j10224n1411o764K22928Q3437J43648m4357
22037A54410n6179K2511j17522j02509N5024p4319k08569r0564J22027J48262
22027a47428J0429o8993j27728j24600K54432O5058j70906Q6164M8884r775J58947
22016b5516j74688j5449j01890j36724r8609N02770j64100k24181J07939J36344
22006a94104K69242L5598l76081j21742J51125r1548j81289R8443m303K76827
$$ plain form
22080 106166 12428 355434 248492 355630 211477 3760 -141632 -276667 -266239 -388332
22070 -388332 -665354 -667153 -459664 -634523 -667008 -606786 -570196 -522549 -564516 -576489 -466300
22059 -466300 -456364 -114014 17377 18912 -117740 -376283 -304832 -264381 -175428 98014 178898
22048 178898 4751 -15997 -21642 -82847 -193071 -244482 -251246 -28318 55119 198767 154410
22037 154410 98231 120742 3220 -99289 -44265 -118584 -327153 -417717 -295690 -147428
22027 -147428 -136999 -205992 -333720 -458320 -203888 -138830 -309736 -223572 -174688 -184463 -25516
22016 -25516 -200204 -215653 -317543 -454267 -552876 -50106 -214206 -438387 -330448 -194104
22006 -194104 75138 110736 -265345 -387087 -235962 -327510 -508799 -410356 -414659 -137832
21996a37832K09823p2649j90861n4988K19477J44184j59027r1531j02381j20183
21986c55968N58N1045N4518m7836R3978j10016m2410J04614j18509k7205j03938
21975e01169R9557J67177J61174j63829j88245k74559J51006J16708K29446R3118
21965a09616q7967J8582K65392j10718j40611j11233k11432q3758J17193Q0103
21955c74065J28609K33978l1696O689L106J5960J447o4064k361L0677k71235j10519
21943d33474J88387L30607J17649k85140J06290K15293J13146k63806m3993K9346
21933G4305j36221k33312J32005J21617Q6690j42078k21929j13240K72250N2753
21923a07160j54977K23248j86083k65110j08318J21116P8301K04270K23538R5991
$$ plain form
21996 -137832 71991 -658 -191519 -246507 -27030 117154 -41873 -133404 -235785 -355968
21986 -355968 -355410 -304365 -249847 -297683 -203705 -313721 -356131 -251517 -370026 -397231 -501169
21975 -501169 -401612 -234435 -73261 -237090 -425335 -699894 -548888 -432180 -202734 -109616
21965 -109616 -197583 -179001 86391 -24327 -164938 -276171 -487603 -571361 -454168 -374065
21955 -374065 -245456 -11478 -43174 -36485 -33379 -17419 -15972 -80036 -82397 -51720 -322955 -433474
21943 -433474 -245087 85520 203169 -81971 24319 239612 352758 88952 44959 74305
21933 74305 -61916 -295228 -163223 -41606 45084 -96994 -318923 -432163 -159913 -107160
21923 -107160 -262137 -38889 -224972 -490082 -598400 -477284 -398983 -194713 28825 124816
21913A24816l85234n55269k19468K50065K25576k31288j18216M44082L73153j89276
21903b81059k18828j52088j38053J86859J63523J59600J68750J68795l07354j29205
21893c79060K73291J88230l876l27558k21605J43590k0998k7014J83965J6987
21883a74048k85543k91607K98331P5521L43019L43144Q3439Q2506m88566j54022
21873a67826O4485l21318j62059L65682L6310M9811J15917J74342m180J21873
21863B73037j81246j38624k7925q8116O8626K14331j08376j36275K54801J68046
21853B98279J16891k76893l00441J04408q5270k20455j62116L60020N2322K51184
21843A37929n4649K77184j15230l82093R2725j3385M0701m46065j98626O1388
$$ plain form
21913 124816 -260418 -815687 -1035155 -785090 -559514 -790802 -909018 -464936 -91783 -281059
21903 -281059 -499887 -651975 -790028 -603169 -439646 -280046 -111296 57499 -249855 -379060
21893 -379060 -105769 82461 78585 -248973 -470578 -326988 -347986 -375000 -191035 -174048
21883 -174048 -459591 -751198 -452867 -377346 -34327 308817 392256 474762 -13804 -167826
21873 -167826 -103341 -424659 -586718 -221036 -184726 -134915 -18998 155344 151164 273037
21863 273037 91791 -46833 -74758 -162874 -94248 120083 11707 -124568 130233 298279
21853 298279 415170 138277 -162164 -57756 -143026 -363481 -525597 -165577 -113255 137929
21843 137929 83280 360464 245234 -136859 -44134 -57519 -16818 -462883 -661509 -600121
21833f00121N2526L63378J74236J54916J98079m18594m41377K66211N4546O3580
21823a32620K6369k17322l1139J89644L62963j36377p9616j28557j38153M9916
21813b34892j49986M298j02680k23230O9145J34724p7806J3902p1399J54060K25957
21802b57907J92134J44326k4843j36591m05504O1005L7226L97232m4211o467O4946
21791B1346J67137J36325k46522j62521J19459J35595N4728J02767q2023j17450
21781A28841j92328j08830m5179J25344K40254J50203j77756J14236j76448K07705
21771B66042J1159l39377o8448M0086n8422j02637J05747P8718n7246k311j29915
21760b56604K4369J02828J32581K10159J04384j4992k51927j92746N4008m2607
$$ plain form
21833 -600121 -547595 -184217 -9981 144935 343014 -75580 -516957 -250746 -196200 -132620
21823 -132620 -106251 -323573 -354712 -165068 197895 61518 -18098 -146655 -284808 -234892
21813 -234892 -384878 -380580 -483260 -706490 -637345 -502621 -580427 -566525 -637924 -483864 -257907
21802 -257907 -65773 78553 53710 -82881 -488385 -427380 -390154 7078 -37133 -43600 21346
21791 21346 188483 324808 78286 -84235 35224 170819 225547 328314 246291 128841
21781 128841 -63487 -172317 -217496 -92152 148102 298305 120549 234785 58337 266042
21771 266042 277201 -62176 -130624 -90538 -148960 -251597 -145850 -67132 -124378 -126689 -256604
21760 -256604 -232235 -129407 3174 213333 317717 302725 50798 -141948 -87940 -130547
21750a30547j47093J00329m5528j27884N5937J75807k18857l82465k85742J02452
21740i03591j16161J25060N92005J17253l71823r8923R5430J77277J04608L6526
21730b42339J12482j07144l2568L49315m2246j92787Q5158k0736j9886k12461
21720c23212q1630K64641j23268j1369L29166K58765k46520k55609O4547J50357
21710B5868K1189r4978M2293j41593o565M13003K01081k46087J5605j22898k03863
21699i6945N0481o824K2322j48749n7725M52356l1380k09631m81088j42466L48904
21688c00745J40317k07379J49571K4504P4943j09691k1271o007K0632n7620Q5454
21677b07292j58178R4322Q6075J68660N44592q666o27386j5126l0355m42756J2371
$$ plain form
21750 -130547 -277640 -177311 -222839 -350723 -294786 -118979 -337836 -720301 -1006043 -903591
21740 -903591 -1019752 -894692 -302687 -185434 -557257 -656180 -560750 -383473 -278865 -242339
21730 -242339 -129857 -237001 -269569 79746 37500 -155287 -70129 -90865 -110751 -323212
21720 -323212 -404842 -140201 -263469 -274838 54328 313093 66573 -189036 -124489 25868
21710 25868 47057 -47921 -5628 -147221 -153786 259217 460298 214211 229816 106918 -96945
21699 -96945 -46464 -53288 -30966 -179715 -237440 214916 183536 -26095 -507183 -649649 -300745
21688 -300745 -160428 -367807 -218236 -193732 -118789 -228480 -249751 -255758 -235126 -292746 -207292
21677 -207292 -365470 -271148 -185073 -16413 528179 519513 -107873 -122999 -153354 -596110 -583739
21666e83739L73697K82137J67510m47916R6583J66031j9710j39556k58854p5518
21656d39335O0442J83580K17944J05590K35088j10717k08215j01059L2121J83038
21646A58477k0433M0663J14394l89407j79479j03181J23423O0172l01615j61265
21636f58251K09786J85193K65657M0065j33625J8832k25889J0726L29038J66765
21626B08297p4908r7460K49397P9387j46237l85784l64470k159k1883O2202J31920
21615c61698L28444J97380l8864l21872J80299M44823M965l39739l55468J00244
21605a61486K56956o9456K02353n2934m9416j84593m91790R2934M8376P492o0767
21594d62331K07491K07503k54412j6268J58884q8486j60415q3039R3367k55670
$$ plain form
21666 -583739 -210042 72095 239605 -208311 -111728 54303 34593 -104963 -363817 -439335
21656 -439335 -378893 -195313 22631 128221 363309 252592 44377 -56682 -24561 158477
21646 158477 138044 178707 293101 -96306 -275785 -378966 -255543 -195371 -496986 -658251
21636 -658251 -448465 -263272 2385 42450 -91175 -72343 -298232 -287506 41532 208297
21626 208297 133389 35929 285326 364713 218476 -167308 -531778 -533937 -555820 -493618 -361698
21615 -361698 -33254 164126 125262 -196610 -16311 428512 433477 93738 -261730 -161486
21605 -161486 95470 26014 228367 175433 126017 -58576 -550366 -457432 -409056 -401564 -462331
21594 -462331 -254840 -47337 -301749 -318017 -159133 -247619 -408034 -491073 -397706 -653376
21584f53376j1175Q6487K49006K16597j9723q1347L0945R7255j28810j45507j83098
21573e42746j15399J22364K39395M6466P3812Q0839k55535n7622q6610L33919
21563a61117R8121k3601J12931K46254K07048M5050m02243l27476r8403P6545
21553b26891r9517N9662Q5419J06267r182J60078p9364K17159P4516m35926l52284
21542e00063L7216J35995K87498j11648j30294L132m9240l6971K27427L25738
21532A88790J25196l36593j14009N5140M8603k35539m28549q5783L47160p5094
21522e10678K33168L11458J40848J56749k86748j02959p7773n0955k7163K713
21512b11340l9366J77119J89988L4548P5189N05549k34192k61173K49936J9266
$$ plain form
21584 -653376 -664551 -578064 -329058 -112461 -132184 -213531 -182586 -85331 -214141 -359648 -542746
21573 -542746 -658145 -535781 -296386 -249920 -176108 -95269 -350804 -408426 -495036 -161117
21563 -161117 -62996 -86597 26334 272588 479636 524686 122443 -205033 -303436 -226891
21553 -226891 -326408 -266746 -181327 -75060 -84242 75836 -3528 213631 288147 -147779 -500063
21542 -500063 -462847 -326852 -39354 -151002 -281296 -278164 -327404 -364375 -136948 188790
21532 188790 313986 -22607 -136616 -81476 -32873 -268412 -696961 -782744 -435584 -510678
21522 -510678 -277510 33948 174796 331545 44797 -58162 -135935 -186890 -214053 -211340
21512 -211340 -250706 -73587 116401 150949 226138 731687 497495 236322 486258 505524
21502E05524k7612j05900l13911k18254P2400L53267O622P4117j81565j28433
21492C6255J31622q9930r9085O2144k70878l9107O3721K60398r3633r5356n3804
21481a87653M9743M10162l61272l53565K32337l7943l49978j28367J35855L38001
21471b52680j87536j9223K06393j49746l41924J58930K10872J36943R7652M40955
21461C00636M57235m2133j37605l50190k17304K1297K76126j1865n9264j44025
21451I2908j36450r0276P8704K29814L4770l5963J40616J52647m21431m49534
21441d04195J81980L82731p5670J20741p8462j49089m6581P310M8776R6125K55126
21430C38792K42171J49335j87148j23609p4843l30260m69580P4208k8567K00853
$$ plain form
21502 505524 477912 372012 58101 -160153 -87753 265514 272136 346253 164688 36255
21492 36255 167877 77947 -21138 41006 -229872 -268979 -205258 55140 -38493 -133849 -187653
21481 -187653 -137910 272252 -89020 -442585 -210248 -248191 -598169 -726536 -590681 -252680
21471 -252680 -440216 -459439 -253046 -402792 -744716 -585786 -374914 -237971 -140319 300636
21461 300636 757871 715738 578133 227943 10639 31936 308062 296197 236933 92908
21451 92908 -43542 -133818 -55114 174700 209470 173507 314123 466770 45339 -404195
21441 -404195 -222215 160516 84846 205587 127125 -21964 -68545 -61235 -12459 83666 338792
21430 338792 580963 730298 543150 419541 344698 14438 -455142 -380934 -409501 -208648
21420b08648L33885J10711j21837k38766r9721J49472Q40j06443k912J38805k65033
21409c09647N194j5056l59476j40702K91548N23160K3475p3473L99008q1905J1203
21398B73329o2912N9967R558m04391l7170k08284k51700L27262K29904K82047
21388B17610J58341j71244j15922O950j19155J49142J8391m87383J19476J04388
21378a19406J29522k04329J7048l5239N5871K7702N29514L50342l64906m16349
21368c0230l77050M9408L84238L14688n0265M5616J44672N8878m13080j26389
21358D86j41411l0156J22985O381j35331j22342J47387K88991K209m041J94049
21347C29207j1147l94638j67429J90617k4450L27294R7809p707k25904K49599
$$ plain form
21420 -208648 125237 235948 114111 -124655 -224376 -74904 -74064 -180507 -183419 -44614 -309647
21409 -309647 -304453 -319509 -678985 -819687 -528139 -4979 18496 -54977 344031 262126 273329
21398 273329 210417 270384 279942 -124449 -161619 -369903 -621603 -294341 -64437 217610
21388 217610 375951 204707 88785 95735 -23420 125722 144113 -343270 -223794 -119406
21378 -119406 10116 -194213 -177165 -212404 -156533 -128831 400683 751025 386119 -30230
21368 -30230 -407280 -357872 26366 341054 290789 336405 481077 539955 126875 486
21358 486 -140925 -171081 -48096 -41715 -177046 -299388 -152001 136990 139199 135158 329207
21347 329207 318060 -76578 -244007 -53390 -77840 249454 347263 339556 113652 363251
21337C63251j72676l7819J72817Q3750J99461j44292j54312j21223k93204k27484
21327c31731L1470L46562R641Q4864L49409N6785m46818l88431p6534J31041L47813
21316A14071k30743n961M9132m56083n9860Q9192j16670M8109J19703K1412J38445
21305b89253K41332n3804j24252M4652K74805P1644j52241L45889J47882j23997
21295C82657l52322m46525j38593j78805K70089K43408j74471J12379L0765j49139
21285d00557L5374J01184J02373p3884J52904J28060k28912j03761K02338j35443
21275b20324L9623J24731l5626j6399j4706M4866J10499O9981Q61j6020j48690
21264f1204m14620p7378L1164m6894L3880J67553J6421p5047J33778l40763k02016
$$ plain form
21337 363251 190575 152756 325573 409323 608784 464492 310180 188957 -104247 -331731
21327 -331731 -300261 46301 55942 140806 490215 547000 100182 -288249 -364783 -233742 114071
21316 114071 -116672 -122633 -73501 -529584 -589444 -500252 -616922 -568813 -449110 -427698 -289253
21305 -289253 -47921 -101725 -225977 -181325 93480 165124 12883 358772 506654 382657
21295 382657 30335 -416190 -554783 -733588 -463499 -220091 -394562 -282183 -251418 -400557
21285 -400557 -365183 -263999 -161626 -235510 -82606 45454 -183458 -287219 -84881 -220324
21275 -220324 -180701 -55970 -91596 -107995 -122701 -77835 32664 102645 103506 87486 -61204
21264 -61204 -475824 -553202 -522038 -568932 -535052 -367499 -351078 -426125 -292347 -633110 -835126
21253h35126l4352L34043N9833O347M3821k04960M8493L94444J14018L037k60794
21242c31196k92324j16302K48059P6084K11007P5311P1961J25368r0085n525J53906
21231A26264M9222l36784O2191J42008k1765M6414O4415j86552n53313j22400
21221g30300L19752M42833k16391l40478L5174K12424P2120K72902L1748k37547
21211a37763L6611j7444k40943P313L561p5896o6040L15692M31621J35720j88134
21200B04298K3252k32997j60164K53527k25578l74837p4890M9981L88601N9669
21190h9138j04782j81047K78149P5000k20668n9730L86785L51599j56294j55687
21180A24187j11032R24J15734p8364j45232p8490j07067n4773j7912k0435j01500
$$ plain form
21253 -835126 -869478 -535435 -475602 -469255 -425434 -630394 -581901 -187457 -73439 -70402 -331196
21242 -331196 -623520 -739822 -491763 -415679 -204672 -129361 -57400 67968 -22117 -27642 126264
21231 126264 175486 -161298 -99107 42901 21136 67550 131965 -54587 -607900 -730300
21221 -730300 -410548 32285 -184106 -524584 -489410 -276986 -204866 68036 99784 -137763
21211 -137763 -101152 -118596 -359539 -352226 -348665 -424561 -490601 -174909 256712 392432 204298
21200 204298 227550 -5447 -165611 87916 -137662 -512499 -587389 -537408 -148807 -89138
21190 -89138 -193920 -374967 -96818 -21818 -242486 -302216 84569 436168 279874 124187
21180 124187 13155 14079 129813 51449 -93783 -172273 -279340 -334113 -352025 -372460 -473960
21169d73960K66351L62875L98898M9799l96594r4556k10246M1624o0730o25K70655
21158A53491j13858k74444J3901O1120L465J45986N5501P3905L4705K65971J06259
21147E26002N1417N9056j84026k76073j54020P9863K42617K46569O5364n40312
21137A16457m39503J50034n35L8667J79480K31749J64197J59402L9975q6454k96543
21126B56926q0157j65477j93739K23779K11550q1938l26606J19998M41923M99119
21116I05378o218k47215q5041o0550K1493J29763k11870j62513j07138r7806K1885
21105A00168n0973J06554p150k82022K18384L86579k260k10981J93779o9540q5556
21094B96982j24488k98440J62065J91179K48632M53136m8465l16310m16783J69050
$$ plain form
21169 -473960 -207609 155266 554164 603963 207369 112813 -97433 -55809 -116539 -117164 153491
21158 153491 39633 -234811 -220910 -159790 -156325 -10339 45162 119067 153772 419743 526002
21147 526002 577419 636475 452449 176376 22356 102219 344836 591405 656769 116457
21137 116457 -323046 -173012 -173547 -134880 44600 276349 440546 599948 639923 553469 256926
21126 256926 176769 11292 -182447 41332 252882 170944 -155662 -35664 406259 905378
21116 905378 899160 651945 566904 506354 527847 657610 445740 283227 176089 78283 100168
21105 100168 49195 155749 148599 -133423 84961 471540 469280 258299 452078 382538 296982
21094 296982 172494 -125946 36119 227298 475930 929066 880601 564291 147508 316558
21084C16558J31558k76450l90682j53488J04171M76610L24930q7553n2583k35169
21074A57902J8668K54466m6110k58878p9969M99926k1609N41477J07064l75468
21064G97469j14443j07711R3612m4789k33328J18103R8075l28655l41538k3631
21054h6836j71815J83583J56237J46385J99739j7272K14544l1525q5880J25185
21044F32345o2529P0037L3571k0817j47169k18293k7055K45792K19048j75697
21034E49233k33075r8868L49667L0981L8622q9471j64978M3751K84318L08616
21024A018796j4880j53656k90424k27066m50993K21856L61281j81412j50823J27385
21014B60064J28972N4346p858m24210M4496K56953K50098k0912L78502j83308
$$ plain form
21084 316558 448116 171666 -219016 -372504 -268333 208277 533207 445654 393071 157902
21074 157902 176570 431036 384926 126048 46079 546005 524396 1065873 1172937 797469
21064 797469 683026 575315 668927 624138 390810 508913 606988 278333 -63205 -86836
21054 -86836 -258651 -75068 81169 227554 427293 410021 624565 593040 507160 632345
21044 632345 569816 639853 673424 652607 505438 287145 260090 505882 724930 549233
21034 549233 316158 217290 566957 597938 636560 547089 382111 425862 710180 1018796
21024 1018796 1003916 850260 559836 332770 -118223 103633 464914 283502 132679 260064
21014 260064 389036 443382 435524 11314 55810 312763 562861 541949 920451 737143
21004G37143l25612q1939L81688l3779l36273j43203K5386K065j5609j08206J33204
20993B34865J3384J8524j29767L8675J64783k10360j67848m0586L63380N1153
20983C36203K05271J51985j36404j0271P5183L8123j85598Q2075k44315k96453
20973A5799j64527J55819L79456K22106j94591J02459m5239O9137j99975j64362
20963A76082j57242o4732K5862L00231J93332k4266O0076r0545j72444q6380K6136
20952A86110j90943O1756j62999j00886n6164m0235r3441L85732L65051L10674
20942F64655q3784L1804n0249j35478r2325k48642m3397l5567j25275L06j70415
20931b88367K79483k29754o7460J37227K22561k91872l01932p3624j3924M60550
$$ plain form
21004 737143 411531 329592 711280 677501 341228 198025 223411 225476 209867 101661 234865
20993 234865 248249 266773 137006 175681 340464 130104 -37744 -78330 285050 336203
20983 336203 541474 693459 557055 546784 621967 660090 474492 556567 312252 15799
20973 15799 -148728 7091 386547 608653 414062 516521 471282 540419 340444 176082
20963 176082 18840 -45892 -20030 280201 473533 449267 509343 418798 246354 159974 186110
20952 186110 -4833 56923 -106076 -206962 -263126 -303361 -396802 -11070 353981 664655
20942 664655 580871 612675 562426 426948 334623 85981 42584 7017 -118258 -117952 -288367
20931 -288367 -8884 -238638 -306098 -168871 53690 -238182 -540114 -613738 -627662 -167112
20921a67112K42903p5919J9507m13871L7061K83651J23241K14425j40654j07184
20911A6048L96069L26220r2608k85571l75194n5376Q6243J26675l1160J98466
20901C09812L41033j81038k93502m5794q9653J73450J96816R760J85176J60381
20891G66441m4731m78394k59930l4720L72788R7596j35710q3146L04152p2681
20881D31665k0938j48869k77111j79250J68449J47845K10221J00898o437k82042
20871A44431j69502J25070M4537J20016K40432K00168o7425j11993o1202p7411
20861C87121o3024n7945k01469k75491J43701J79223J28140k57480K08122J6360
20851B07258J89333J03811l71835j79234L42260j44837J0508K20507J23450J9860
$$ plain form
20921 -167112 75791 -128 19379 -394492 -357431 -73780 49461 263886 123232 16048
20911 16048 412117 738337 645729 360158 -15036 -70412 15831 142506 111346 309812
20901 309812 650845 469807 176305 130511 40858 214308 411124 420884 606060 766441
20891 766441 721710 243316 -16614 -51334 321454 419050 283340 200194 504346 431665
20881 431665 410727 261858 -15253 -194503 -26054 121791 332012 432910 426473 144431
20871 144431 -25071 99999 144536 264552 504984 705152 637727 525734 464532 387121
20861 387121 324097 266152 64683 -210808 -67107 112116 240256 -17224 190898 207258
20851 207258 396591 500402 128567 -50667 291593 146756 157264 377771 501221 521081
20841E21081j41916j90421j11954M1792Q3799J60184K33127l8059K9485K97112
20831H84230j77704m125Q3796p1219k05486k57440O0473J76817M2269l73855K9176
20820A86932K66519J22784j74609k43933j20563P7544j79578K5151Q3465L07890
20810C51602j65387J423M3179J13557p253k62232M57397K9051L08451K48327j51294
20799I66821J5135j63687n52771j44450k9329P5518J5145j59116K53640M03287
20789F80193q0368l80692j11945J3372r7013j18992l6283J87244O7260o1398O2986
20778A24364m5404J11080J98580M2247J68151L072R6637K9817L171k27665l58489
20767A45561r6474j65103k47357j61874J21145J93931L94020K47155K02558j49065
$$ plain form
20841 521081 379165 188744 76790 118582 202381 362565 595692 557633 587118 884230
20831 884230 706526 702401 786197 714978 509492 252052 312525 489342 531611 157756 186932
20820 186932 453451 576235 401626 157693 37130 114674 -64904 -39753 43712 351602
20810 351602 186215 187638 230817 344374 337121 74889 532286 561337 869788 1118115 966821
20799 966821 981956 818269 265498 121048 91719 167237 182382 23266 276906 680193
20789 680193 599825 219133 107188 120560 23547 -95445 -131728 55516 122776 61378 124364
20778 124364 78960 190040 388620 430867 599018 602090 698727 728544 731715 504050 145561
20767 145561 49087 -116016 -363373 -525247 -404102 -210171 183849 431004 633562 484497
20757D84497k75572l52262K50686K56049q392J4871J91791l11441J27798k70466
20747A07559k50080R0256J86317j07508K20788N01281r5316k71831l53281j03797
20737g5612J78192O548L27858J26550q3716J12136K57666j2707j22605k02296
20727E12014J4498J28030J35533J77170r739q9421L3077l00622n20104l03361
20717b22925J73624L66517P1198j47689M8111O5486j33079l16837L76506N11760
20707G92672j22592J16044R0894l3206l43697j91574p957l24213J9919K99913
20697B96203J67752N1682k55290Q5610j14719K0954L872J57132o1207j94409k8933
20686A28647K16471k66410l8661O18919L55219k93591M1801Q6238l29728r8355
$$ plain form
20757 484497 208925 -143337 107349 363398 355006 369877 561668 250227 378025 107559
20747 107559 -142521 -52265 134052 26544 247332 748613 653297 381466 28185 -75612
20737 -75612 102580 109128 436986 563536 479820 591956 849622 836915 714310 512014
20727 512014 526512 654542 790075 967245 957506 868085 901162 600540 80436 -222925
20717 -222925 -49301 317216 388414 240725 288836 354322 221243 -95594 280912 792672
20707 792672 670080 786124 877018 843812 500115 308541 300584 -23629 -3710 296203
20697 296203 463955 515637 260347 345957 231238 252192 256064 413196 351989 157580 128647
20686 128647 345118 78708 40047 658966 1014185 720594 762395 848633 518905 420550
20676D20550L03300K50297l86613j78881m4481j8728n678N9792K95552j00411
20666E94699J76093J11641m00076k15810L61480k7088k89401J0109q3980J4114
20656B51781J01189J80090J5761J23974n6426j39671J88970O7040j7760j29727
20646E85221k60558j26969K84726L9383J91047K19436n52783o48043M0865K10636
20636a7039j05805j4412R6473K17221L3733k18853R9076J58903M0075l8092J18976
20625C70256k556p449O142m0471L97052l2311k10858L05543l4644j20543k53385
20614C76776K31199K27891m765k61105l00783j40437p5588k25521J68052K27057
20604B22776q8538J22314j14113K3719M72288k5110N042m9898J33984K8810k55933
$$ plain form
20676 420550 723850 974147 587534 408653 364172 345444 339766 399558 695110 594699
20666 594699 770792 882433 482357 266547 628027 600939 311538 321647 237667 251781
20656 251781 352970 533060 548821 672795 616369 476698 665668 732708 714948 585221
20646 585221 324663 197694 482420 521803 712850 932286 379503 -268540 -227675 -17039
20636 -17039 -122844 -137256 -40783 176438 210171 -8682 90394 249297 289372 251280 370256
20625 370256 367700 360251 366393 325922 722974 690663 479805 785348 750704 630161 376776
20614 376776 607975 835866 831101 569996 269213 128776 53188 -172333 -4281 222776
20604 222776 134238 256552 142439 166158 638446 613336 618378 568480 702464 731274 475341
20593D75341m01K15800k95447k60278J67443L13718j45875k76507J00923M89971
20583G84688J34885k76593J29309L6671j22914k79143j85905J06492K96675J43568
20573G67733M8920j22237m89094k50088K9903K08789L52652J46297l4982j75252
20563D82641k06372J56230J99838j54458k25885q340L5190L40520M32458o224
20553A045598k22473j43425k91416k49012j34916L16769J75659M6831j19794K94900
20543G18721J36080N4004O1835r5816j51705J1703l0646o2806L61395o9908j40904
20532G91953J50120P439j25275J15687k18992j39448M12143O5605l50620R5231
20522H03843k46230j28935l39369j4464J40937J44219M70222R1501J33567l3436
$$ plain form
20593 475341 474940 690740 395293 135015 302458 616176 470301 193794 294717 784688
20583 784688 919573 642980 772289 808960 686046 406903 220998 327490 624165 767733
20573 767733 816653 694416 205322 -44766 -14863 193926 546578 692875 657893 482641
20563 482641 276269 432499 632337 477879 251994 243654 278844 619364 1051822 1045598
20553 1045598 823125 679700 388284 139272 4356 321125 496784 543615 423821 718721
20543 718721 854801 908805 970640 874824 723119 734822 704176 641370 1002765 932857 791953
20532 791953 942073 949512 824237 939924 720932 581484 993627 1059232 708612 803843
20522 803843 557613 428678 89309 74845 215782 360001 830223 921724 1055291 1021855
20512A021855j40521N1282j13968j59825j05928k04196q1467J61575l34765J95303
20502B89345L98689Q2457J87445J30773p094k5139R6550k75586j43544K9074K4811
20491G87781N840j38709l21993O2383J59080M9361K56487J08477K32242J06784
20481A307733j74202M5761K5949j1135J10954j60486Q8419K46869k73839j55015
20471A051008J38210m2713k56823j22510K64637M4929n2121m1790j56373L01746
20461A128200j32698j13456k03674O4448N4642K76322q2359k15146m666j05840
20451F65773L28491K73181N2517l25739n1676p3512P1562L03211j73254k9432
20441A041122J99686q8424K09610K65760O0825k57803l67814m38844o0193L70699
$$ plain form
20512 1021855 881334 932616 818648 658823 552895 348699 267232 428807 94042 289345
20502 289345 688034 770491 957936 1088709 1081615 1056476 1153026 877440 733896 762970 787781
20491 787781 793621 654912 332919 395302 554382 603743 860230 968707 1200949 1307733
20481 1307733 1133531 1179292 1205241 1194106 1305060 1144574 1232993 1479862 1206023 1051008
20471 1051008 1189218 1146505 889682 767172 1031809 1076738 1024617 982827 826454 1128200
20461 1128200 995502 882046 678372 742820 797462 1073784 991425 776279 771613 665773
20451 665773 994264 1267445 1319962 994223 942547 869035 940597 1243808 1070554 1041122
20441 1041122 1240808 1152384 1361994 1627754 1688579 1430776 1062962 624118 563925 934624
20431I34624j59581P6237L823m1795R2625J71273O2040J52578J22375J81662m41775
20420A154086m59334K19092M62237N1738m37143j4853l0784J68031r091N2879
20410A156858r9653k74320K756L02715N54761J76006k17746k32007l22220j55310
20400H91840l03940j90017J4373J88110J55625K10473L78J01189M0688J37277
20390A245996N3004l9819K3326K59361n7041Q7577L2331J91403K80991n6670P5444
20379B095903O2521k05166j9169K40851m3346k28606q5648j50324r0145L42831
20369A919702K89562p9260j86179j7859K40226K37459K29360l5888n52096r5302
20359A949725J3957K38182j47506P8874J14207n3515J4731r3371j71141k79483
$$ plain form
20431 934624 775043 851280 855103 813308 905933 1077206 1139246 1291824 1414199 1595861 1154086
20420 1154086 694752 913844 1376081 1427819 990676 975823 945039 1113070 1103979 1156858
20410 1156858 1057205 782885 785641 1088356 1643117 1819123 1601377 1369370 1047150 891840
20400 891840 587900 397883 412256 600366 755991 966464 966842 1068031 1108719 1245996
20390 1245996 1299000 1259181 1282507 1541868 1484827 1572404 1604735 1796138 2077129 2020459 2095903
20379 2095903 2158424 1953258 1934089 2174940 2131594 1902988 1817340 1667016 1576871 1919702
20369 1919702 2209264 2130004 1943825 1925966 2166192 2403651 2633011 2597123 2045027 1949725
20359 1949725 1963682 2201864 2054358 2133232 2247439 2193924 2208655 2115284 1944143 1664660
20349A664660L36300J4064k16814J28309J79223Q2949l83013j67879K68333L51144
20339B257276P4664k84503j67332k26535R0371L12064J56072K14J55574K65404
20329B633269Q8717n2220j68292k5444k14920K119J51534L28916j31542k09461
20319B402676J50959p0499m58736q0567Q8923L27694M6392k63692k35819J02764
20309B010095K27594L04508k63580o9515J99201J15974l45579k04430L11883k98553
20299A987598L2569J61792K11921J66533k00732M2875L39027r3522k86714k27492
20289B133855L9178J18597j87052L095K90870j2004p6422j32787L60112M1122
20279B578564r3420j31766j07548J35038L83045J39519k26424l22889j26154K95610
$$ plain form
20349 1664660 2000960 2015024 1798210 1926519 2105742 2188691 1805678 1637799 1906132 2257276
20339 2257276 2331940 2047437 1880105 1653570 1743941 2056005 2212077 2212291 2367865 2633269
20329 2633269 2721986 2669766 2501474 2476030 2261110 2263229 2414763 2743679 2612137 2402676
20319 2402676 2553635 2483136 2024400 1943833 2032756 2360450 2406842 2143150 1907331 2010095
20309 2010095 2237689 2542197 2278617 2209102 2408303 2524277 2178698 1974268 2286151 1987598
20299 1987598 2020167 2181959 2393880 2560413 2359681 2402556 2741583 2648061 2361347 2133855
20289 2133855 2173033 2291630 2104578 2107673 2398543 2386539 2310117 2177330 2537442 2578564
20279 2578564 2485144 2353378 2245830 2380868 2763913 2903432 2677008 2354119 2227965 2523575
20269B523575K34788k5925l27748N8704J06320k07748k67007J10474j8866l6986
20259B149581K33367J43006N4896J41166L425r8662L9078j18163n8072M34454
20249B924076K46398R3136N6704J68357j2995m0083j46521j9351K38514L59165
20239C867400j32583j13802k07772j54676l06188l47784P774L27082M55602J88239
20229C583292J64322J4783l443J188P5760J76880J00230k99227R9344j7955J25561
20218D020735L08755L33061L51788k08158N2653J01307N4687K2935P2908j03993
20208E006678k83200K10035J31188k20089j77717J11891p145Q237J58904j10401
20198D828381k12237j28706m01935J3000P07423K39502q5417J20954m8374K58507
$$ plain form
20269 2523575 2758363 2732438 2404690 2463394 2569714 2361966 2094959 2205433 2186567 2149581
20259 2149581 2382948 2525954 2580850 2722016 2725441 2626779 2665857 2547694 2489622 2924076
20249 2924076 3170474 3263610 3320314 3488671 3475676 3435593 3289072 3269721 3508235 3867400
20239 3867400 3734817 3621015 3413243 3258567 2952379 2604595 2612369 2939451 3395053 3583292
20229 3583292 3747614 3762397 3758954 3760142 3835902 4012782 4113012 3813785 3913129 3895174 4020735
20218 4020735 4329490 4662551 5014339 4806181 4858834 4960141 5014828 5037763 5110671 5006678
20208 5006678 4723478 4933513 5064701 4844612 4666895 4778786 4771641 4779878 4938782 4828381
20198 4828381 4616144 4487438 4085503 4098503 4805926 5045428 4960011 5080965 5032591 5291098
20188E291098J11303K35684M7901p4562j69453j50358K2233L49196J60504J24358
20178E947904j49912j068L7618l2670l42900k17351L71337M02399K26449J77714
20168F419520K1757j14902J05826Q1677K69534j55803j93887N6037R0494M3886
20158F624139J06780M94005K18639p4199j99968r5508m1117K51242J94190J23491
20148G601694j75485r58M92826M08209J9072J44032J4436k11991j29385J20461
20138H282911J53119L28167M0151j74776J07997J06705K92104K99902j12834K98945
20128I622391K89183P6285j65124j64659K61032K99525K89971K92567K8843O1866
20118A0891880L17085K6470K0217K1701J12978L64200M82181K65884L2503n045
$$ plain form
20188 5291098 5402401 5638085 5685986 5611424 5441971 5291613 5313846 5663042 5823546 5947904
20178 5947904 5797992 5796924 5834542 5801872 5458972 5241621 5612958 6015357 6241806 6419520
20168 6419520 6441277 6326375 6432201 6513878 6783412 6627609 6433722 6489759 6580253 6624139
20158 6624139 6730919 7224924 7443563 7369364 7169396 7073888 7032771 7284013 7478203 7601694
20148 7601694 7426209 7425251 7918077 8326286 8345358 8489390 8503826 8291835 8162450 8282911
20138 8282911 8436030 8764197 8804348 8629572 8737569 8844274 9136378 9436280 9323446 9622391
20128 9622391 9911574 9987859 9822735 9658076 9919108 10218633 10508604 10801171 10830014 10891880
20118 10891880 11208965 11235435 11255652 11277353 11390331 11754531 12236712 12502596 12535099 12530054
20108A2530054k82653k90603J86715M70658N15341o5871j58686J3606P6318K98463
20098A3293342R5669K33618M78717M07091L54305L56237L02867J38848p7486J09383
20088A5692591N53595M57172K07940j9011j77030N4724O1264L54817L12784J50907
20078A7649753K28838J72900N29152M71218K13843J58515O2423L04647M57303
20069B0248592J78295K3594N25714L11492K86210J55558J21977J42675L66028
20060B2360135Q21748N89133O09528P11307J63063k12002L73689N21088P02635
20051B6640324N16012M92127O39688K77532M01255M98637Q06765Q61368M52593
20042C1586301L53269K77654O55136P81167Q08154O08989R28567J205768R14577
$$ plain form
20108 12530054 12247401 11956798 12143513 12614171 13129512 13063641 12904955 12918561 12994879 13293342
20098 13293342 13389011 13622629 14101346 14508437 14862742 15218979 15521846 15660694 15583208 15692591
20088 15692591 16246186 16703358 16911298 16892287 16715257 16769981 16831245 17186062 17498846 17649753
20078 17649753 17878591 18051491 18580643 19051861 19265704 19424219 19486642 19791289 20248592
20069 20248592 20426887 20450481 20976195 21287687 21573897 21729455 21851432 21994107 22360135
20060 22360135 23181883 23771016 24380544 25091851 25254914 25042912 25416601 25937689 26640324
20051 26640324 27156336 27648463 28288151 28565683 28966938 29465575 30272340 31133708 31586301
20042 31586301 31939570 32217224 32872360 33653527 34461681 35070670 35999237 37205005 38119582
20033C8119582K29750N07403N54687P08512P45392J093058M04162M67390Q19806
20024D3649742O68701R19850P75456M65429M43369J220635R91848N60835Q32833
20015E0528698R08034J168038R49779P68980J098148Q26213R10435J326052J235860
20006E9720237J191025J265945J162443J095291J384600J403067J225523J104063
19998F9552194J111551J583883J714548J575203J660430J335969J300494J517912
19990H1352184J753001J969078J891310J794957J454751J716628J855696J789784
19982I5577389J702861J485818J633828J650656K072195K114746K010705J742683
19974A09990881J576457J857810J396345K102784J999297J810868J892686J943118
$$ plain form
20033 38119582 38349332 38856735 39411422 40119934 40865326 41958384 42362546 42829936 43649742
20024 43649742 44318443 45238293 46013749 46479178 46922547 48143182 49135030 49695865 50528698
20015 50528698 51436732 52604770 53554549 54323529 55421677 56247890 57158325 58484377 59720237
20006 59720237 60911262 62177207 63339650 64434941 65819541 67222608 68448131 69552194
19998 69552194 70663745 72247628 73962176 75537379 77197809 78533778 79834272 81352184
19990 81352184 83105185 85074263 86965573 88760530 90215281 91931909 93787605 95577389
19982 95577389 97280250 98766068 100399896 102050552 104122747 106237493 108248198 109990881
19974 109990881 111567338 113425148 114821493 116924277 118923574 120734442 122627128 124570246
19966A24570246J596962J517235J617969J329372J240162J341240J453724J639500
19958A36306410J474236R09271P57737R72007J042524J102671O91679M02180O67524
19949A44326239N78776J00488k76855j42433o9052J58450K536l05109m68488p36677
19939A43167875q85482j008170j220922j286651j402206j428176j547389j614564
19931A32774315j153105j387435j868645k373201j898469j687006j620034j894343
19923A18892077j864836k014666k137023k305098k055824j554582j995992j732451
19915A03231605j596498j514292j962419j622379j697713j763609j253345j324943
19907I0496407j593450j783398j789455j296651j553470j441910j137645j639605
$$ plain form
19966 124570246 126167208 127684443 129302412 130631784 131871946 133213186 134666910 136306410
19958 136306410 137780646 138689917 139447654 140419661 141462185 142564856 143256535 143658715 144326239
19949 144326239 144905015 145005503 144728648 144586215 144517163 144675613 144678149 144373040 143904552 143167875
19939 143167875 142282393 141274223 140053301 138766650 137364444 135936268 134388879 132774315
19931 132774315 131621210 130233775 128365130 125991929 124093460 122406454 120786420 118892077
19923 118892077 117027241 115012575 112875552 110570454 108514630 106960048 104964056 103231605
19915 103231605 101635107 100120815 98158396 96536017 94838304 93074695 91821350 90496407
19907 90496407 88902957 87119559 85330104 84033453 82479983 81038073 79900428 78260823
19899G8260823j678990j612953j761982j428709j180835j070199j518100j246805
19891F6762250j219814j561555j066299q12873j072285j103581r79765j039202
19883E7906876j122360j243469j217781j017772r28016j099546j034451o42155
19875D9601326o18198q50381r53287j050062r49636r68872q12648l77318m85773
19866D2535151k93962m27310r97176p92684q55934o16714m27609m05204q00100
19857C6918458n34123o56973p00863k59080o11875m75009l04344n95301n51361
19848C2229529n64975p28402n85539m47267o62052o39706p97466m77067k65962
19839B7061093k01983m25601p73576m59414o68771o53909r3427J80472m82646
$$ plain form
19899 78260823 76581833 74968880 73206898 71778189 70597354 69527155 68009055 66762250
19891 66762250 65542436 63980881 62914582 62101709 61029424 59925843 58946078 57906876
19883 57906876 56784516 55541047 54323266 53305494 52377478 51277932 50243481 49601326
19875 49601326 48983128 48132747 47179460 46129398 45179762 44210890 43398242 43020924 42535151
19866 42535151 42241189 41813879 40816703 40024019 39168085 38551371 38123762 37718558 36918458
19857 36918458 36384335 35727362 35026499 34767419 34155544 33680535 33376191 32780890 32229529
19848 32229529 31664554 30936152 30350613 29903346 29241294 28601588 27804122 27327055 27061093
19839 27061093 26859110 26433509 25659933 25200519 24531748 23877839 23784412 23964884 23482238
19830B3482238M5056r0461j56002l68298m84804l06262k29875k89254l59472k40753
19820B1002113M3416J68035K3562m5777m42331n58513o49654n06840r9236R4333
19810A9029108k62946j84417n43398o41183k74342K82556k5764k5828M6141j80059
19800A7219868M6392L3555n15505m89296j40374M9895k65834r5551j50073l42194
19790A5350883l31311K60403Q1881l89571j73042j26643l30178k03231J75862
19781A4315053J56252q9644k44410m22106j62361l28400o28120J11262K97321
19772A3004847Q9328J40361k61990p20822l36738r598m15272k24926M81132J76109
19762A1922431J43410K10300M2180j88433j27327k39l1876L17228j0157j90921
$$ plain form
19830 23482238 23527294 23436833 23280831 22912533 22427729 22121467 21891592 21602338 21242866 21002113
19820 21002113 21045529 21213564 21237126 21191349 20749018 20190505 19540851 19034011 18934775 19029108
19810 19029108 18766162 18581745 18038347 17397164 17122822 17405378 17379614 17353786 17399927 17219868
19800 17219868 17266260 17299815 16784310 16295014 16154640 16204535 15938701 15843150 15693077 15350883
19790 15350883 15019572 15279975 15361856 14972285 14799243 14672600 14342422 14139191 14315053
19781 14315053 14471305 14381661 14137251 13715145 13552784 13224384 12596264 12707526 13004847
19772 13004847 13094175 13234536 12972546 12251724 11914986 11905388 11490116 11265190 11746322 11922431
19762 11922431 12065841 12276141 12318321 12129888 12002561 12002322 11970446 12287674 12277517 12086596
19752A2086596j28102R0309P7319J09264n2002k41471J75631M81974j0261k455
19742A2586802n6837J22525k64939R9732j79673k57592Q6546q5221j91802J15775
19732A1975316K54266O9941n44880k60071l743k88617l49295L37529n0912j89512
19722A0950022j79702K23406L90729J10469O05383N37057J55147r2088K43413
19713A2943836K53850L04730N03151M83298P27397J086109R04468J172192Q80484
19704A9259515J399832J407049J599379K189178K361338K547342K280667K232909
19696C5277209K666686K596910K355953K063073K060846K149836J836192K101952
19688E3108657J413176J142264Q07577O05680K94226k30673m23344l87202j007512
$$ plain form
19752 12086596 11958494 12048803 12126122 12235386 12183384 11941913 12117544 12599518 12589257 12586802
19742 12586802 12529965 12652490 12387551 12487283 12307610 12050018 12136564 12051343 11859541 11975316
19732 11975316 12229582 12299523 11754643 11494572 11490829 11202212 10852917 11190446 11139534 10950022
19722 10950022 10770320 10993726 11384455 11494924 12100307 12637364 12792511 12700423 12943836
19713 12943836 13197686 13502416 14005567 14488865 15216262 16302371 17206839 18379031 19259515
19704 19259515 20659347 22066396 23665775 25854953 28216291 30763633 33044300 35277209
19696 35277209 37943895 40540805 42896758 44959831 47020677 49170513 51006705 53108657
19688 53108657 54521833 55664097 56471674 57077354 57371580 57140907 56717563 56330361 55322849
19679E5322849j391408j126510j868526k002173k564705k628053k544289k628980
19671C8568205k469940k029908j681221j508467j320799j029539q45166n30831
19663B7152334l98423L84655P60661N13438P80655R50744J002542Q20880N26846
19654C2494332M86827J048168J022871Q75894L84930l168j54525l48706j017442
19645C4789181p34161r07374j489353j249650j084512r34711r93734j099300j138352
19636B5158034j310969j478916j202595p71543j121697p54272o67179j58745l07955
19627A7384163m97108q89223q22189k19117J34542P9407J43909J41397L24275
19618A5780056P37072P49207L91871O42015J543853J814596J759973J362058J079560
$$ plain form
19679 55322849 53931441 52804931 50936405 48934232 46369527 43741474 41197185 38568205
19671 38568205 36098265 34068357 32387136 30878669 29557870 28528331 27683165 27152334
19663 27152334 26753911 27138566 27899227 28412665 29193320 30144064 31146606 31967486 32494332
19654 32494332 32981159 34029327 35052198 35928092 36313022 36309854 36155329 35806623 34789181
19645 34789181 34055020 33147646 31658293 30408643 29324131 28389420 27395686 26296386 25158034
19636 25158034 23847065 22368149 21165554 20394011 19272314 18518042 17850863 17692118 17384163
19627 17384163 16887055 15997832 15175643 14956526 15091068 15170475 15314384 15455781 15780056
19618 15780056 16517128 17266335 17658206 18300221 19844074 21658670 23418643 24780701 25860261
19609B5860261J020793J293020J304722J572098J456887J255920Q28195K11617
19601C4803513K14921k1978l61952o34480p71350r93268j563337j403052j223618
19592B8045399j360609j169794j446752j433240j282959r74470r49958j131974
19584A8295643r06675j105168o68698k74424m96517l79778n28452n20746l52174
19575A3063011O8778K50722K38141Q2779J27708j25003j39737j08229l57110j61
19565A3100899m53195l3842L32906L71466M68782J94238p4399p9610l35169m75064
19555A3017012q75074j85829O1767L63562N66094L17606N05523P18584N42478
19546A5031723J49336J50272J74741K76883N68041J104881J445919J490851J501269
$$ plain form
19609 25860261 26881054 28174074 29478796 31050894 32507781 33763701 34591896 34803513
19601 34803513 35018434 34996456 34634504 34000024 33228674 32235406 30672069 29269017 28045399
19592 28045399 26684790 25514996 24068244 22635004 21352045 20377575 19427617 18295643
19584 18295643 17388968 16283800 15615102 15340678 14844161 14464383 13935931 13415185 13063011
19575 13063011 13131789 13382511 13620652 13703431 13831139 13706136 13566399 13458170 13101060 13100899
19565 13100899 12647704 12613862 12946768 13318234 13787016 13981254 13906855 13827245 13492076 13017012
19555 13017012 12141938 11956109 12017876 12381438 12947532 13265138 13770661 14489245 15031723
19546 15031723 15181059 15331331 15506072 15782955 16350996 17455877 18901796 20392647 21893916
19537B1893916J322154K104159K676494L040189L786325N784921P775461J0990964
19529E9374583J5384265K0741271K5473070K5656407K3539981K3286243K4259300
19522B17715120K3062897J9253390J8820089K2003158K2073525K0600599K2934818
19515C66463596K4022575J7263755N960490j373965m573458r228872j1203699
19508C87330422p197443m994437r862691j3718300j3303265j5115285k0780015
19501C02358986k7144073l0147421l0677204k9966191k6816927k2272588j8213924
19494A17120658j4247556j1613959r606351q058383p114853o613459n751604m873799
19486D9240694l935903l742329k840509k350596k900721k450864k219402j789066
$$ plain form
19537 21893916 23216070 25320229 27996723 31036912 34823237 40608158 48383619 59374583
19529 59374583 74758848 95500119 120973189 146629596 170169577 193455820 217715120
19522 217715120 240778017 260031407 278851496 300854654 322928179 343528778 366463596
19515 366463596 390486171 407749926 413710416 412336451 407762993 398534121 387330422
19508 387330422 380132979 375138542 365275851 351557551 338254286 323139001 302358986
19501 302358986 275214913 245067492 214390288 184424097 157607170 135334582 117120658
19494 117120658 102873102 91259143 81652792 73594409 66479556 59866097 54114493 49240694
19486 49240694 45304791 41562462 38721953 36371357 33470636 31019772 28800370 27011304
19478B7011304j242520j026278n40948q31956p63547n74067n37544k12372m8326
19469B1233746k73852K7392K12545l5834J77780O00832P76902J123649J413900
19460B5257060J974402K722631M147338N936126Q617988J2485447J7396367K2275283
19452A00812642K2694240J6030932P551994L449480K102122N579512J4741736
19445A72962658K5368839L0124479K1152644L924864r702137j8241530k1514850
19438B04074967j7464772r142129j728398r84307o536281j1692663j5610186j8493698
19430A22422533j8166712j5431202j1879112r177476o385051n132427m452857
19423E1797696l712261l149393k216669k163921j921856k182463j074583m41515
$$ plain form
19478 27011304 25768784 24742506 24201558 23369602 22606055 22031988 21494444 21282072 21233746
19469 21233746 20959894 20987286 21199831 21163997 21341777 21942609 22719511 23843160 25257060
19460 25257060 27231462 29954093 34101431 40037557 48655545 61140992 78537359 100812642
19452 100812642 123506882 139537814 147089808 150539288 152641410 158220922 172962658
19445 172962658 198331497 228455976 249608620 253533484 243831347 225589817 204074967
19438 204074967 186610195 177468066 175739668 174755361 168219080 156526417 140916231 122422533
19430 122422533 104255821 88824619 76945507 67768031 61382980 56250553 51797696
19423 51797696 48085435 44936042 42719373 40555452 38633596 36451133 35376550 34935035
19415C4935035j51477J0334P66057J562734K229158M069015O582638J0102180
19407F0105674J4478885K0622774K4976875K3809639J5281530P085365L270539
19400A69631281L092427Q561556J9760336L0904812L2415677J7691084p83669
19393B81273504j3557835k1631748k3250685j7024123p151757o68957k531917
19386A95456482r113931j5456147j9858380k1655596k0551343j7264349j3358821
19379G8197915r872434p514596o214297n549877m967657m471305l926572l537346
19371C2143831k762581k615174k143015j674595j482168j558535j871323j282940
19363A6753500j140357j271651o03154q61037n27557n54350r53594o28068o70441
$$ plain form
19415 34935035 34783558 34793892 35559949 37122683 39351841 43420856 50003494 60105674
19407 60105674 74584559 95207333 120184208 143993847 159275377 166360742 169631281
19400 169631281 172723708 181285264 201045600 231950412 264366089 282057173 281273504
19393 281273504 267715669 246083921 222833236 205809113 198657356 197988399 195456482
19386 195456482 186342551 170886404 151028024 129372428 108821085 91556736 78197915
19379 78197915 68325481 60810885 54596588 49046711 44079054 39607749 35681177 32143831
19371 32143831 29381250 26766076 24623061 22948466 21466298 19907763 18036440 16753500
19363 16753500 15613143 14341492 13738338 12877301 12349744 11795394 10841800 10213732 9543291
19354I543291m91861j94778j88919n84718k81148K72454p8914L52248L06191j48743
19344H505103J0852k46111j21199j9470J77154j18401J31998L07933o1096J59487
19334H726250k45138k35102l43670j29995K42399J49798k40906r4622L3516P8937
19324G941467k06663m05317l90194m20544l87656l24400j89228r5311K42928P3513
19314E838595k49678l429N2030l1786k75208J45796K68608L32416K78580P4578
19304F430502l81662m25223J83262N96266O98801N31183L69510K82733j74674
19295H110698l38023R6089K22721O24812M00133O97735O75660M145k06014j25694
19285A0162262l7408K97789k69578p37619j75486L0634l72901m5744K73793j3292
$$ plain form
19354 9543291 9051430 8856652 8667733 8083015 7801867 8074321 7995407 8347655 8653846 8505103
19344 8505103 8515955 8269844 8148645 8129175 8306329 8187928 8319926 8627859 8566763 8726250
19334 8726250 8481112 8246010 7902340 7772345 8014744 8164542 7923636 7829014 7862530 7941467
19324 7941467 7734804 7329487 6939293 6518749 6131093 5806693 5617465 5522154 5765082 5838595
19314 5838595 5588917 5585488 5637518 5605732 5330524 5476320 5744928 6077344 6355924 6430502
19304 6430502 6048840 5623617 5806879 6403145 7101946 7633129 8002639 8285372 8110698
19295 8110698 7772675 7868764 8091485 8716297 9116430 9814165 10489825 10493970 10287956 10162262
19285 10162262 10124854 10422643 10153065 9415446 9239960 9270594 8897693 8851949 9125742 9112450
19275I112450o93694q27846k88800m30030m78550j69763K13444L20949j6359r3532
19265F648269j6073j50649j91669k61747j7169J51919p9211q1793j68404p6164
19255E757309K04702J90095P31210O77828L24349O56517N16952j61509J55377
19246I052830M72206r0737j07304R3400j00517P6586L43318J67787M11989n8092
19236A0261466k54798r9817j31162n1675j61414l04428P7877j7879m96091l50905
19226H471174m20219l44582l17219j20248N9345L89025M13833k04343k08373j88923
19216G529470K14531K94800j01248n53334k53267q0547P1230j13386l48605J25518
19206F785162J0660k10080O6675K40521K51374K62629N71969K52535k50280k16504
$$ plain form
19275 9112450 8418756 7590910 7302110 6872080 6393530 6223767 6437211 6758160 6741801 6648269
19265 6648269 6632196 6481547 6289878 6028131 6010962 6162881 6083670 6001877 5833473 5757309
19255 5757309 5962011 6152106 6883316 7561144 7885493 8542010 9058962 8897453 9052830
19246 9052830 9525036 9434299 9326995 9420395 9319878 9396464 9739782 9907569 10319558 10261466
19236 10261466 10006668 9906851 9775689 9724014 9562600 9258172 9336049 9318170 8822079 8471174
19226 8471174 8050955 7706373 7389154 7268906 7328251 7717276 8131109 7926766 7718393 7529470
19216 7529470 7744001 8038801 7937553 7384219 7130952 7050405 7121635 7008249 6659644 6785162
19206 6785162 6795822 6585742 6652417 6892938 7144312 7406941 7978910 8231445 7981165 7764661
19196G764661K12902J94613N2695K7161k53407n7013O3332k66190j0362L95127
19186H123519n5018k10674j40180l1442M2741J15351r4965L85991m99505q97617
19176F738201j13705j01639l0825M5418J72949L59141K42165M42376N78461K54333
19166H586875k94243m49958n69846l97478m7737K82776q356m47286m52425J39303
19156F341625L44262P7840j64869L4708r0211P1006N51370N27989R67160J146438
19146I807318R76086N28218M59796L39780N49067R64726J326424J443702J406415
19137A7801532J940480J852582K072238K766270L478176L914045M716957O007319
19129D4549599Q341814J2507697J8001246K3177322K4229767J5721127N311920
$$ plain form
19196 7764661 7977563 8172176 8224871 8252032 7998625 7941612 8004944 7738754 7728392 8123519
19186 8123519 8068501 7857827 7717647 7686205 7728946 7844297 7749332 8135323 7635818 6738201
19176 6738201 6624496 6522857 6492032 6537450 6710399 7069540 7311705 7754081 8332542 8586875
19166 8586875 8292632 7842674 7272828 6875350 6827613 7110389 7102033 6654747 6202322 6341625
19156 6341625 6685887 6763727 6598858 6633566 6543355 6614361 7165731 7693720 8660880 9807318
19146 9807318 10783404 11311622 11771418 12111198 12660265 13624991 14951415 16395117 17801532
19137 17801532 19742012 21594594 23666832 26433102 29911278 33825323 38542280 44549599
19129 44549599 52891413 65399110 83400356 106577678 130807445 146528572 151840492
19122A51840492r63050l629829k177966M463477J4980103K4120341K3356987J6495651
19114B28486206J1436299M49317j3432332k0053354k0394577j7166847j0310989
19107A59013723r49014P264500O802267k780352j1075336j6077577j9365243j9760183
19099A03072785j6301510j1488894p678229n801618m316876l489420l197389k514666
19091D8284183k061111j367650n05083M52322Q24625J162980J241804K147512
19083E0179582K916461M456845O707737R789560J4965531K2273611K9914896L0865811
19075A72070034J8572307N216947k080234n703535m762757L379836J5485766K5643299
19067B27821663K6533038K2249069J7034760K309590j5980790k4352000k5759714
$$ plain form
19122 151840492 150877442 147247613 145069647 149533124 164513227 188633568 211990555 228486206
19114 228486206 239922505 240371822 226939490 206886136 186491559 169324712 159013723
19107 159013723 158064709 165329209 172131476 169351124 158275788 142198211 122832968 103072785
19099 103072785 86771275 75282381 67604152 61802534 57485658 53996238 50798849 48284183
19091 48284183 46223072 44855422 44350339 44802661 45627286 46790266 48032070 50179582
19083 50179582 53096043 57552888 64260625 74050185 89015716 111289327 141204223 172070034
19075 172070034 190642341 195859288 193779054 188075519 183312762 186692598 202178364 227821663
19067 227821663 254354701 276603770 293638530 295948120 279967330 255615330 229855616
19060B29855616k3135162j4527585l057588O005581N855057m282507j3665667
19053A83047745j9937368k3674247k3508629k0011565j4995005j0894942q204991
19046F1820998o150644n696411n274945m776291m134737l097804k830794k385667
19038B7473705k173257k023223j763279j460929j371697j450787j169690j048848
19030A5011995q69100o37470n08435o45279p32449l54408J36139l94739j25892
19021A0880362o29797n25985l91055m66835k61411j74432O0815q3030l38163K10274
19011H280743J55688m4544l69980r4339j44738j28748j60270j3365j47789p296
19001G325362K50775K37363L6420K14797P00466P93343N14052O66898N99705J10405
$$ plain form
19060 229855616 206720454 192192869 189135281 195140862 200995919 196713412 183047745
19053 183047745 163110377 139436130 115927501 95915936 80920931 70025989 61820998
19046 61820998 55670354 49973943 44698998 39922707 35787970 32690166 29859372 27473705
19038 27473705 25300448 23277225 21513946 20053017 18681320 17230533 16060843 15011995
19030 15011995 14142895 13505425 12996990 12351711 11619262 11264854 11400993 11006254 10880362
19021 10880362 10250565 9724580 9333525 8866690 8605279 8430847 8491662 8408632 8070469 8280743
19011 8280743 8436431 8391887 8021907 7927568 7782830 7654082 7493812 7480447 7332658 7325362
19001 7325362 7576137 7813500 7849920 8064717 8765183 9558526 10072578 10739476 11339181 11449586
18991A1449586J13953j34982m96040p47334p99993o48639k63489j03467m94131
18982G875464m61754j25831j80778k18499j37487k12306l46686l26302j39154
18973E726667J39370j36018l56327k18863m1591l21479m27781j01161l34268j7784
18963C910765j07354J43421J69624P8184R5733J57900O747k3436M4324J34552
18953D610460J13463j66221k18341K66451L57655l2060L1944L02810J44415J58337
18943E568913j30396J77399M87757j7466k53378o44697l79592k72898l14146m1645
18933D179851l7986j7241m191k8792J1468k43951j76749l0486m22301j36897j49277
18922B943448r9753j34412J6059J31535K11363P9030j48034k60788j5661o7736
$$ plain form
18991 11449586 11563539 11428557 10932517 10185183 9385190 8736551 8473062 8369595 7875464
18982 7875464 7413710 7287879 7107101 6888602 6751115 6538809 6192123 5865821 5726667
18973 5726667 5866037 5730019 5373692 5154829 5113238 4791759 4363978 4262817 3928549 3910765
18963 3910765 3803411 3946832 4116456 4194640 4290373 4448273 4455020 4431584 4475908 4610460
18953 4610460 4723923 4557702 4339361 4605812 4963467 4931407 4963351 5266161 5410576 5568913
18943 5568913 5438517 5615916 6103673 6086207 5832829 5188132 4808540 4535642 4221496 4179851
18933 4179851 4141865 4124624 4120433 4091641 4103109 3859158 3682409 3651923 3229622 3092725 2943448
18922 2943448 2843695 2709283 2725342 2856877 3068240 3147270 2999236 2738448 2722787 2655051
18912B655051J25355j1081k71232j22811L0758p9927n9005l44338R2940j65851
18902A849859j51862k0457J99380k2320J22166J54699J68237j13391P945M26375
18892B620631K93778l97071n00678k56054m225L53540O99039L04656j17040p291
18882B989285n8107J79149L8140k20007j42218N7574k15744q5455r6016k86213
18872B160388M5518k86297r3078j45066Q7522J17305j56614n71731J47871K01660
18862A507478k82218N5598M04680M27906l47429j76242K44459J78101J00360L9308
18852B152001m5861l66702j79456O85734J1353o17625M2273J43598L8991J02638
18842A966944J83174k55510p6140j58562J1131K17670K19960j13046J55859M4607
$$ plain form
18912 2655051 2780406 2769325 2498093 2375282 2406040 2326113 2267108 1922770 2015710 1849859
18902 1849859 1697997 1677540 1876920 1854600 1976766 2131465 2299702 2186311 2194256 2620631
18892 2620631 2914409 2517338 2016660 1760606 1756381 2109921 2808960 3113616 2996576 2989285
18882 2989285 2931178 3110327 3148467 2928460 2786242 2843816 2628072 2542617 2446601 2160388
18872 2160388 2205906 1919609 1826531 1681465 1768987 1886292 1729678 1157947 1305818 1507478
18862 1507478 1225260 1280858 1685538 2113444 1766015 1589773 1834232 2012333 2112693 2152001
18852 2152001 2106140 1739438 1559982 2245716 2257069 1639444 1681717 1825315 1864306 1966944
18842 1966944 2150118 1894608 1818468 1659906 1671037 1888707 2108667 1995621 2151480 2196087
18832B196087k67936l98314L034R7450R8514j90854l90890K1622q5311n5592J37700
18821A165510K07915J88742k8815q9862J64573J20995m85620k93386p0252K08994
18811A088794K18273Q2300P9878N5803L09292K2779m14701j36625K40396O1853
18801A608042j54352P6249O4524J30802N0921M61889j89600j91491j18487o6432
18791A672065L0324K5573m1816J40628M23858L43200K2602r5520m3967J65518
18781B642465q9079j84367J62186n8503N646p5625k69780k49797j46139l36261
18771A400746J29761l5023k64226j2973J56468J09301O2134j99363K1329M0121
18761A408275K03569J08701K42366P5935L36603L77622l7213P0670k97853k84217
$$ plain form
18832 2196087 1928151 1529837 1532871 1630321 1728835 1537981 1147091 1168713 1083402 1027810 1165510
18821 1165510 1373425 1562167 1533352 1443490 1608063 1729058 1243438 950052 879800 1088794
18811 1088794 1307067 1389367 1469245 1525048 1834340 1857119 1442418 1305793 1546189 1608042
18801 1608042 1453690 1529939 1594463 1725265 1776186 2238075 2048475 1856984 1738497 1672065
18791 1672065 1702389 1727962 1686146 1826774 2250632 2593832 2616434 2520914 2476947 2642465
18781 2642465 2553386 2369019 2531205 2472702 2478348 2402723 2132943 1883146 1737007 1400746
18771 1400746 1530507 1495484 1231258 1218285 1374753 1484054 1546188 1346825 1368154 1408275
18761 1408275 1611844 1720545 1962911 2038846 2375449 2753071 2715858 2786528 2488675 2204458
18751B204458K55293k26003m4655J22218J37212L41862L04616R4392J33535P2087
18741C395015L63291l3336J96604L04441K49797N13843J77126J19340L82176K33845
18731E902142o3586P943J84489J35223M32027Q03591O23296O18561J151325R65949
18721A0760960J326088J865963J918196K017581J992083J800178J166319N03532
18713B3350900J03674J86542l02283j215510j592979j689379j546196j122257
18705A6172512r61757j225362r76146p04957n33589o53432n63268k46535l05264
18696A0002202k40917K93255J87543K74527K13695j28237R5342L81760O09790
18687A1688960J83955J53786N50146K75148K06058L39148K69620P82938R11716
$$ plain form
18751 2204458 2459751 2233748 2189093 2311311 2448523 2790385 3095001 3189393 3322928 3395015
18741 3395015 3758306 3724970 3921574 4226015 4475812 4989655 5166781 5286121 5668297 5902142
18731 5902142 5838556 5846499 6030988 6166211 6598238 7401829 8025125 8643686 9795011 10760960
18721 10760960 12087048 13953011 15871207 17888788 19880871 21681049 22847368 23350900
18713 23350900 23454574 23641116 23338833 22123323 20530344 18840965 17294769 16172512
18705 16172512 15210755 13985393 13009247 12304290 11770701 11117269 10554001 10307466 10002202
18696 10002202 9761285 10054540 10242083 10516610 10730305 10602068 10697410 11079170 11688960
18687 11688960 11872915 12026701 12576847 12851995 13058053 13397201 13666821 14449759 15361475
18678A5361475R71319J475464J611107K181109K221198L100977L762244L747454
18670C4432347L569853M112537M239027L373459L223232L234089L640835M341729
18662F4167108O345072J0664623J7007281K5308606L2555301L1151934K1476009
18655B08675934J5647177J2932560M349174j0016194k0632748k4828856k6992653
18648A59134394k6132040k2331736j7540235j2865945r258272p200113n962579
18641E7843474n912368n126438m309546l166750k804792k755278j874706j625408
18633C0268188j342683p88596n93555o91610j98059k5268M09199P61234Q72818
18624B8671668J364405J752042K297258K685814K719472L219111M144800M536817
$$ plain form
18678 15361475 16332794 17808258 19419365 21600474 23821672 26922649 30684893 34432347
18670 34432347 38002200 42114737 46353764 49727223 52950455 56184544 59825379 64167108
18662 64167108 70512180 81176803 98184084 123492690 156047991 187199925 208675934
18655 208675934 224323111 237255671 241604845 231588651 210955903 186127047 159134394
18648 159134394 133002354 110670618 93130383 80264438 71006166 63806053 57843474
18641 57843474 51931106 46804668 42495122 39328372 36523580 33768302 31893596 30268188
18633 30268188 28925505 28136909 27543354 26851744 26653685 26628417 27037616 27798850 28671668
18624 28671668 30036073 31788115 34085373 36771187 39490659 42709770 46854570 51391387
18616E1391387N255019P825188J1877370J8783575K8637249M1376506N3047905
18609B18194199N4403035M3882682L2113636K4355912J2793706p308366k7175177
18602C51259627l9196965m3862800m3562606l9173059l1844362k4346034j7867637
18595A11406164j3822054j1661453r791579q389793p358387n941635n476535m501234
18587D4463494l706301l233050k764450k298648j967851j758645j694342j393629
18579B5646578j035680r09864o98982q03482m03574l69040j47240J79634N82844
18570B2041194J266441J600641K308435L170602M240897O719899J0539829J5101816
18562F6989754K1704773K6099442K1714883J4296746J1424246R133987R19191
$$ plain form
18616 51391387 56646406 64471594 76348964 95132539 123769788 165146294 218194199
18609 218194199 272597234 316479916 348593552 372949464 385743170 378434804 351259627
18602 351259627 312062662 268199862 224637256 185464197 153619835 129273801 111406164
18595 111406164 97584110 85922657 76131078 67741285 60382898 54441263 48964728 44463494
18587 44463494 40757193 37524143 34759693 32461045 30493194 28734549 27040207 25646578
18579 25646578 24610898 23701034 23002052 22198570 21794996 21425956 21278716 21458350 22041194
18570 22041194 23307635 24908276 27216711 30387313 34628210 41348109 51887938 66989754
18562 66989754 88694527 114793969 136508852 150805598 162229844 171363831 172283022
18555A72283022j0579577j6974605j9173781j9863930j8440362j5101623j1453193
18548F0695951q150707o168221m825114m225770m098116l540949k441910k393344
18540B4851820k791815k087732j558148j184762j161320j055224o61261o79241
18532A3672317l38837l47288l63648p5748m29073l75994k67769o44972p21388
18523A0107600o66517n30376n38662l0539R6516j52040j38290n52183o86443k65208
18513F643858m43047m68428J6320k40560r8355k84446k91748p0734J39005K64202
18503E166067L70252m39539k25681J0941K29625o4761p3958J78429J66886L55352
18493E673613M59487J52089n02024o34181p4651l12916K55812Q1905K67985P81696
$$ plain form
18555 172283022 161703445 144728840 125555059 105691129 87250767 72149144 60695951
18548 60695951 52545244 46377023 41551909 37326139 33228023 29687074 27245164 24851820
18540 24851820 22060005 19972273 18414125 17229363 16068043 15012819 14351558 13672317
18532 13672317 13333480 12986192 12622544 12546796 12117723 11741729 11473960 10828988 10107600
18523 10107600 9441083 8910707 8372045 8341506 8438022 8285982 8147692 7595509 6909066 6643858
18513 6643858 6200811 5732383 5748703 5508143 5409788 5125342 4833594 4762860 4901865 5166067
18503 5166067 5536319 5096780 4871099 4882040 5111665 5046904 4972946 5151375 5318261 5673613
18493 5673613 6133100 6285189 5783165 5148984 5074333 4761417 5017229 5099134 5367119 6148815
18483F148815L63646K70690M39990O72234K1568j46665p67628p41683l92738k99872
18473E568357j74588k93173J2633k09443J98781l11695r3619J04066l34971j81684
18463D284664k57210j79531N621r7824k07320j74553l5539p6606K236j65464j18175
18452B980299K35182j5797j13710J16059K52355p5556K12936K87099r9316K6365
18442C805916j00177q4756J73939k19462K5436L05167J52949J99947O6809J85642
18432D511410J72950K21458J1118j68353k39856k38133m06465m43205k36000n7962
18422C126962p4465K50607j23465k39382j5458R7011J03288l38783r360K49836
18412C026791j80188l49383l00733m4337j36278j1602J57436R3089j39881j22392
$$ plain form
18483 6148815 6512461 6783151 7223141 7895375 7916943 7770278 7002650 6260967 5868229 5568357
18473 5568357 5393769 5100596 5113229 4903786 5102567 4790872 4697253 4801319 4466348 4284664
18463 4284664 4027454 3847923 3853544 3755720 3548400 3373847 3338308 3261702 3263938 3098474 2980299
18452 2980299 3215481 3199684 3085974 3202033 3454388 3378832 3591768 3878867 3779551 3805916
18442 3805916 3705739 3620983 3794922 3575460 3600896 3906063 4059012 4258959 4325768 4511410
18432 4511410 4684360 4905818 4916936 4748583 4508727 4270594 3864129 3420924 3184924 3126962
18422 3126962 3052497 3303104 3179639 2940257 2924799 3021810 3125098 2786315 2776955 3026791
18412 3026791 2846603 2497220 2196487 2152150 2015872 2004270 2161706 2254795 2114914 1992522
18402A992522L5696M89523N04234L5421j92262j74110K9665N14658L3264l26094
18392B942517j79791l00646p1500L6966j3689j70569n2939j53139K5014J34947
18382B197171J16558m540j06284L9944J40530m0654j94023j89997J4429J25066
18372B098200j14447j11027K2605j30471j71814K18564l031L70076R4140j7056
18362B255739j48708l70483R0890J95497J6391j23514j68263K11828L54553J28090
18352B442020J32397K28120P5649O933m9481R910K72313j75418j31102j09455
18342B701886l13664n9641O8919J15945q9436o80763n63830J08997M20486J68563
18332A877462R5378p7587j71926j057L53261K8775j37017J32636q2513j90984
$$ plain form
18402 1992522 2028218 2517741 3021975 3057396 2865134 2691024 2720689 3235347 3268611 2942517
18392 2942517 2762726 2462080 2390580 2427546 2413857 2243288 2190349 2037210 2062224 2197171
18382 2197171 2313729 2309189 2202905 2242849 2383379 2342725 2148702 1958705 1973134 2098200
18372 2098200 1983753 1872726 1895331 1764860 1593046 1811610 1808579 2178655 2272795 2255739
18362 2255739 2107031 1736548 1827438 2022935 2039326 1915812 1747549 1959377 2313930 2442020
18352 2442020 2574417 2802537 2878186 2885119 2835638 2845548 3117861 2942443 2811341 2701886
18342 2701886 2388222 2328581 2397500 2513445 2424009 1743246 1179416 1288413 1708899 1877462
18332 1877462 1972840 1895253 1723327 1722270 2075531 2104306 1967289 2099925 2017412 1826428
18322A826428k22238j30049j09190j82417K24447r0348m3077K31806J71051j59150
18312A517263J4693J88819k22778k85461J6910K24372l91J43092O7871L17437
18302A981827M75821K20503O488m82465m09291l10270r6337m33476K53504P19381
18292A925685M2356n81269j23037Q2585N1172j26801j43347p7692K41501J68245
18282A459398j47297J61585K32875L00829J74551j07167J32362J5918k18475j97062
18272A807517j14765m53375k60961O6346j93796j60536m2321J69080j2719l11423
18262D93047j55064J25267K28865k7574P0033K04346J03274r1696j52482j36505
18252F61511O70O1225m5087O2294j67233l28896m60244J54447j1141j72826K58770
$$ plain form
18322 1826428 1604190 1474141 1364951 1182534 1406981 1316633 1273556 1505362 1676413 1517263
18312 1517263 1531956 1720775 1497997 1212536 1229446 1453818 1453427 1596519 1664390 1981827
18302 1981827 2457648 2678151 2684639 2202174 1792883 1482613 1386276 952800 1206304 1925685
18292 1925685 1968041 1386772 1263735 1346320 1397492 1270691 1127344 1049652 1291153 1459398
18282 1459398 1312101 1473686 1706561 2007390 2181941 2074774 2207136 2223054 2004579 1807517
18272 1807517 1692752 1239377 978416 1044762 850966 690430 648109 817189 804470 493047
18262 493047 337983 463250 692115 664541 734574 938920 1042194 950498 798016 661511
18252 661511 662181 723406 678319 740613 573380 244484 -215760 -61313 -72454 -245280 13490
18241A3490O4671J25799N12002m7243k92001K94604L77139J27333k63431O8458
18231I80821J38660k28647J10078L1601k19748J50949K93676j13424k10339k25859
18221G07768l36197J71642J17814k39067j84382j03787J01272J8641j90807p8842
18211a5945L13336L57133P2874J65804K10916P2102K85070j37063k48295k61370
18201H14562j14284L90651J57668j0318k29829P3280r6479J63444j01593l0630
18191A016472Q8470J071o7843K27902L87435j59868k07961j75707j72924K06169
18181A143216m58292M94810K32823k12329j91610J93271J01129o9555o4988j89242
18171I79233l7667j70713j15291k90776j20309K84708m0620Q5080j002J55019
$$ plain form
18241 13490 78161 203960 715962 668719 376718 671322 1048461 1175794 912363 980821
18231 980821 1119481 890834 1000912 1032513 812765 963714 1257390 1143966 933627 707768
18221 707768 371571 543213 661027 421960 237578 133791 235063 253704 62897 -15945
18211 -15945 297391 654524 727398 893202 1104118 1176220 1461290 1324227 1075932 814562
18201 814562 700278 1090929 1248597 1238279 1008450 1081730 985251 1148695 1047102 1016472
18191 1016472 1104942 1106013 1038170 1266072 1653507 1493639 1285678 1109971 937047 1143216
18181 1143216 684924 1179734 1412557 1200228 1008618 1201889 1303018 1233463 1168475 979233
18171 979233 941566 770853 655562 364786 244477 529185 488565 573645 572643 727662
18161G27662J08359K14854R7674M735O7681q0998p9923k80364o2475L33834l3075
18150A017964l38149l50860J91183K76668j02032J8749J10938K6084p2991j5483
18140G62071J86708R6684n7014K55009M5123p2296R0396K98331j42850J75411
18130A637573n1713L0090n1045j55098J17565J68970m52561l04726m5839m3060
18120H50156j2636m1832j97229j21809O2723K23294n2699O1100m9084o9781j08965
18109E43238l76685p4227J96531J76764K64058k5262r3736J26412k45901k15233
18099B75959m17267n9486L17950K61035K01220l1770L71618K47513K29658j12581
18089A283849j50842j05212O76188L34539Q2920O3610j87259l27639p7954q7798
$$ plain form
18161 727662 836021 1050875 1148549 1153284 1220965 1139967 1060044 779680 717205 1051039 1017964
18150 1017964 679815 328955 520138 796806 694774 713523 824461 850545 777554 762071
18140 762071 948779 1045463 988449 1243458 1288581 1216285 1306681 1605012 1462162 1637573
18130 1637573 1585860 1615950 1564905 1409807 1527372 1696342 1243781 939055 893216 850156
18120 850156 837520 795688 598459 476650 539373 762667 709968 771068 721984 652203 543238
18109 543238 166553 92326 288857 465621 729679 704417 610681 737093 491192 275959
18099 275959 -141308 -200794 117156 378191 579411 547641 919259 1166772 1396430 1283849
18089 1283849 1133007 1027795 1703983 2038522 2121442 2185052 1997793 1670154 1592200 1504402
18079A504402k19608p33271M8414J75145p1576l38103K2822J4672j15902K88350
18069E75345K24509K10781K26092l23187J43642M1810k18987k7707k12589j23932
18059E15777k50947K03211k6050k77625L7597R5469J31503q4690J32118j82812
18049B93551M8001J88490J2985q3887K6023K86460q8940K5046J29676N5868M4936
18038I38209J39949K1945j28601j06219J11364M30074k00624n32253j59719r5039
18028D19086L26526Q4209l40496k96159k88547N0691R5035m636o1494p2524K75342
18017A87033J57982j53384L2880L16276Q9428o2240J75772j43692k77095L99039
18007G21999o9269O6147n8332m46590l55767N996J61132M6377r8057L44056n3057
$$ plain form
18079 1504402 1284794 551523 599937 775082 703506 365403 388225 402897 286995 575345
18069 575345 799854 1010635 1236727 913540 1057182 1098992 880005 852298 639709 515777
18059 515777 264830 468041 441991 164366 201963 297432 428935 344245 476363 293551
18049 293551 341552 530042 543027 459140 485163 771623 682683 707729 837405 893273 938209
18038 938209 1078158 1100103 971502 865283 976647 1406721 1206097 673844 514125 419086
18028 419086 745612 829821 489325 193166 -95381 -44690 50345 45709 -15785 -88309 187033
18017 187033 345015 191631 224511 540787 630215 567975 743747 600055 322960 721999
18007 721999 652730 718877 660545 213955 -141812 -135816 25316 71693 -26364 317692 264635
17996B64635p1916k4326K12182m014j98818K24395O6065K18328r888R8487M1308
17985H16438j19289m77567l90121L3678R3590n3165J31185Q1495R514R4275K74144
17974D94177K0149j70606m86583j96792J91691Q900j11698J86261K6546j08941
17964a46896P9996J03625N4496o0251J37283M07494j31302k02631P4801J9537
17954C36152l78308k09343K75769k2485k03222r4736L76021j2553K4165O4362
17944A55822l01671k13170K48136L15764j19855M3673k34634k61670J75962L21314
17934A29671k5911p1464K8296j29574P5146L38275K81816q6926k28815l9821J75871
17923D46564M7426k80735m82326K69710p446j90861j59471q268P8038L44386k7344
$$ plain form
17996 264635 192719 168393 380575 376561 177743 402138 468203 686531 676643 775130 816438
17985 816438 697149 219582 -170539 -136861 -43271 -96436 34749 116244 125758 220033 494177
17974 494177 514326 343720 -142863 -339655 -147964 -139064 -250762 -64501 -37955 -146896
17964 -146896 -66900 36725 91221 30970 168253 575747 444445 241814 316615 336152
17954 336152 -42156 -251499 24270 1785 -201437 -296173 79848 67295 91460 155822
17944 155822 -145849 -359019 -110883 204881 85026 128699 -105935 -367605 -191643 129671
17934 129671 103760 32296 60592 -68982 6164 344439 626255 539329 310514 270693 446564
17923 446564 493990 213255 -269071 639 -6807 -197668 -357139 -365407 -287369 57017 29673
17912B9673Q7516K02652j38901k5510q2454q7059l44561o7844L8347l50923K35032
17901e04032M50924K15234P848l6358j66526j74429J05767Q3487r8465L17886
17891B01336n5185r0832P5922R8945K32006N1812j56103j90783j35169J88692
17881B20641j01239l24528m3281m600M275o6600J53345J55632J44453j05936J75091
17870B07253L22963m1293R3777m0156j23215m630k14005l9059K3453k04062N8261
17859C9287J1456r9712J19261K28768J31943n7751L28068J80873l41308m19263
17849A21622P2864l0494m582M6735K34640j85116k62553j54619o2150J69769K22580
17838A68696L30996L58204l03984l5254p5818J39421K14988k23222k12970l7590
$$ plain form
17912 29673 117189 319841 180940 155430 72976 -14083 -358644 -426488 -388141 -739064 -504032
17901 -504032 -53108 162126 169974 133616 -32910 -207339 -101572 -18085 -116550 201336
17891 201336 146151 55319 131241 230186 462192 514004 357901 167118 31949 220641
17881 220641 119402 -205126 -248407 -253007 -248732 -315332 -161987 -6355 138098 32162 207253
17870 207253 530216 488923 582700 542544 419329 414699 200694 161635 185088 -18974 39287
17859 39287 50743 -48969 70292 299060 431003 373252 701320 882193 540885 121622
17849 121622 194486 163992 159410 206145 440785 255669 -6884 -161503 -223653 -53884 168696
17838 168696 499692 857896 553912 518658 442840 582261 797249 574027 361057 323467
17828C23467J41776j49189j40440L75263j52251j23732k25142L55243J83417q8674
17818D99738k78507j88245J05494r5398Q9288j21115m7045J70495j07760J03074
17808A30019K72765k47691k91472P1040N5524k22903k533J31193K78074j7569
17798A56447k34042o3824J14844j4274j75537J45476L31081K44380J57611j23703
17788E38459k96642N6509K86307j01430m15291k94860N1595O4281K92243L11826
17778D92997J19233K87287Q9343r8393p4561J14793r0608r5144J95266j76638
17768G63575m52117k81845K21229K9930L23792L1533m52340P4593J90796q4237
17758C64909M470q7343k48496R3689J75088k83003o8941L73468L3914m9229k32115
$$ plain form
17828 323467 465243 316054 175614 550877 398626 274894 49752 404995 588412 499738
17818 499738 221231 32986 138480 43082 132370 11255 -35790 134705 26945 130019
17808 130019 402784 155093 -136379 -65339 -9815 -232718 -235251 -104058 174016 156447
17798 156447 -77595 -141419 -26575 -40849 -216386 -70910 260171 504551 662162 538459
17788 538459 241817 298326 584633 483203 67912 -226948 -175353 -111072 181171 492997
17778 492997 612230 899517 988860 890467 815906 930699 840091 744947 940213 763575
17768 763575 311458 29613 250842 280772 604564 636097 183757 258350 449146 364909
17758 364909 369379 282036 33540 127229 302317 19314 -49627 323841 357755 308526 76411
17747G6411k42874O6733K37169r5547J81465L45808J08541O1029j34229j83300
17737D21206k48548J12478j89247Q9898j3287j06594L00386K74893k03310m77436
17727c9561l09834L50003k8831q2258Q2254J87340J02265j90915l04989P6420
17717a58106M34432J05435l54907J30869J89870J0065K86970k01289K22600j09495
17707E56444l08034k88335j86950r3908N393L77858P9591J81620j22516M1842
17697B43005P3173o2838m15756k38117J94936K31780K00085O7881l22957L5770
17687F962j08777l27378J15646K21316J1050k07314R9007L04545j24892o863J08358
17676I1660J46624J43978o9237l29477j89119q9150M72405m8991k72666J56968
$$ plain form
17747 76411 -166463 -99730 137439 41892 223357 569165 677706 738735 604506 421206
17737 421206 172658 285136 95889 185787 172500 65906 366292 641185 437875 -39561
17727 -39561 -349395 608 -28223 -110481 -28227 159113 261378 70463 -234526 -158106
17717 -158106 276326 381761 26854 157723 347593 357658 644628 443339 665939 556444
17707 556444 248410 -39925 -226875 -320783 -315390 62468 142059 323679 201163 243005
17697 243005 316178 253340 -162416 -400533 -205597 26183 226268 294149 -28808 6962
17687 6962 -101815 -429193 -313547 -92231 -81181 -288495 -189488 115057 -9835 -16698 91660
17676 91660 238284 382262 313025 -16452 -205571 -294721 177684 128693 -143973 12995
17666A2995L18674m4875l8909j06883n1902j88034K25170J03790p4169k8531j52203
17655b4877j30628J83680N6651p9750l5363K40908j3403j17516L18490o7470m94600
17644a63878k61590J19030K64635k5649j47363J73236L07467j3244J58561J04205
17634E15410n7286j54853l24593J79382K98827j21087k38172j46726J14033J5984
17624H0919K51077R660j43661N5550l27835o6088K0226J28398J39838J33146j60840
17613A20390k65379J87248L36215J37315m8991J06379j77411O6176L50228J54348
17603I66518j15764j10847n24873j85337k33977N4955L93509J56155l82854k56773
17593b39288L50421K99385k9061m28885m16219r958M19249J21938J74916l4122
$$ plain form
17666 12995 331669 286794 247885 141002 89100 -98934 126236 230026 155857 127326 -24877
17655 -24877 -155505 28175 84826 5076 -30287 210621 197218 79702 398192 330722 -163878
17644 -163878 -425468 -306438 -41803 -67452 -214815 -41579 265888 252644 411205 515410
17634 515410 458124 303271 -21322 158060 456887 335800 97628 -49098 64935 80919
17624 80919 331996 341656 197995 253545 -74290 -140378 -120152 8246 148084 281230 120390
17613 120390 -144989 42259 378474 515789 466798 573177 395766 461942 812170 966518
17603 966518 850754 739907 215034 29697 -204280 -149325 244184 400339 17485 -239288
17593 -239288 111133 410518 381457 -47428 -463647 -473605 -54356 67582 242498 208376
17583B08376j80160k55870l75513r9012K36090J532M24324j83074Q0670K56560
17573A13923l96241k61041M0322O0930L35062K71890k42349O215K48050J5001
17563A91762l50956L1362L49542K38207j13584l63452p0292o0775j81372K81397
17553d8161L03460L2245L3108k53386o3652L96785l8916l03447r2655j45811k54419
17542d34849l6805P2863K6541K84650K43325j31089k32876M7371k50799O5562
17532c46106M74884O2879m5472J82317N7783J11814M4052K62419j11409m78365
17522B14796p8979J6706j57659J69497J19502J01989j49429K85256L58642J80014
17512A060335j89252k56063J96861N80978l50639m73942j14703m33250k30711
$$ plain form
17583 208376 28216 -227654 -603167 -702179 -466089 -464557 -40233 -223307 -142637 113923
17573 113923 -282318 -543359 -503037 -442107 -107045 164845 -77504 -71289 176761 191762
17563 191762 -159194 -127832 221710 459917 346333 -17119 -87411 -148186 -329558 -48161
17553 -48161 255299 287544 320652 67266 3614 400399 361483 58036 -34619 -180430 -434849
17542 -434849 -471654 -398791 -372250 -87600 155725 24636 -208240 -160869 -411668 -346106
17532 -346106 128778 191657 146185 328502 386285 498099 542151 804570 693161 214796
17522 214796 135817 152523 -5136 164361 283863 385852 236423 521679 880321 1060335
17512 1060335 871083 615020 811881 1392859 1042220 568278 453575 20325 -210386
17503b10386J41498j8211k93929j07979J48535J84412J67892Q8915j89126j6356
17493a04735J93276J25521J4728j6546j09559l14547Q0168P1431n2456J90429
17483G7710l4820q7491j29395J5108J37799L9333Q4555k55446k13909j51791J67288
17472c51059j29260j19382J95817K50796r3600J76220l6523L7877k19677l8213
17462c27004p9623K49217K15277N9371k20456q6855j72362R7534j11453l9109
17452d15463L18443R6666k234R8831J68361l18353j38582L74677J83333p2312
17442B93367j36832P5904J45466j3052k02886k76J99057Q5898K88271q9830n51329
17431I3758j24103j32550K54591J02320j11600J75827j89866k06520p3113L07147
$$ plain form
17503 -210386 -68888 -87099 -381028 -489007 -340472 -156060 11832 100747 -88379 -104735
17493 -104735 88541 214062 228790 212244 102685 -211862 -131694 -60263 -112719 77710
17483 77710 42890 -44601 -173996 -158888 -21089 18244 102799 -152647 -366556 -518347 -351059
17472 -351059 -480319 -599701 -403884 -153088 -246688 -70468 -106991 -69114 -288791 -327004
17462 -327004 -406627 -157410 57867 117238 -103218 -190073 -362435 -264901 -376354 -415463
17452 -415463 -97020 -354 -2588 96243 264604 -53749 -192331 182346 365679 293367
17442 293367 156535 232439 377905 364853 161967 161691 360748 446646 734917 645087 93758
17431 93758 -30345 -162895 91696 194016 82416 258243 68377 -138143 -211256 95891
17421I5891J92851K5584j23659o5739n1666J58055J57820J08128K2621m35121
17411H4765j98194o2874K1811j02893j0696p507l9557K4960O1063L86139K32626
17400C89643J04576j84040L4409k24910r5012J8527J05108J37330k40593q5600
17390d0562R6539M3558J4205j21114J9121j01594p3859L01455J2881j60013L0939
17379B1556K13336j72694m8413n9766j10823J12502Q6687Q3457N8909Q9711k08587
17368F5875j03320J4955k20723J05767j61079J5333K17039J59070K98249j77392
17358B13774j27407L39000j51876o9852J89942k85601k15283K46701J04797L2084
17348B76279N1700j74636k32905j98379m15330M8010J12310J48512J34187Q1047
$$ plain form
17421 95891 288742 314326 190667 124928 73262 231317 389137 497265 519886 84765
17411 84765 -113429 -176303 -154492 -257385 -268081 -275588 -315145 -290185 -229122 157017 389643
17400 389643 494219 310179 344588 119678 24666 43193 148301 285631 45038 -40562
17390 -40562 55977 99535 113740 -7374 11747 -89847 -163706 137749 150630 -9383 21556
17379 21556 234892 62198 13785 -45981 -156804 -44302 42385 125842 184751 274462 65875
17368 65875 -37445 -22490 -243213 -137446 -298525 -283192 -66153 92917 391166 213774
17358 213774 86367 425367 273491 203639 393581 107980 -107303 139398 244195 276279
17348 276279 327979 153343 -79562 -277941 -693271 -645261 -532951 -384439 -250252 -169205
17338a69205o8847L2450p385j92829k47392l1795J62324L25938J90701K11097
17328B05057l37990n9039o0852O9832P1173O8620k01379K24733k0613J28770J88872
17317B77184r5649J17686N1560k32234p7399o1699k3123r4726p4207k5548L0728
17306b07427o4772m22977M1242O2897K03515N9827m1901J13376J31579k04281
17296c28922K9611K44599j57606l36037j40808J99966M481K45726L57899R4463
17286B13372r971R646O6230j64734J6437J26860M6949j54134R2943K53338J16203
17275F13139l6033m46143l17354J48270j16249J56171j31341l43863J19528J48105
17265b05770K95037j44564k1752R9856K81410j94892j61797j70143K92357J49540
$$ plain form
17338 -169205 -238052 -205602 -212987 -405816 -653208 -685003 -522679 -196741 -6040 205057
17328 205057 -132933 -191972 -252824 -182992 -111819 -43199 -244578 -19845 -40458 88312 277184
17317 277184 181535 299221 350781 118547 41148 -20551 -43674 -138400 -212607 -238155 -207427
17306 -207427 -272199 -695176 -653934 -591037 -387522 -327695 -369596 -256220 -124641 -328922
17296 -328922 -299311 -54712 -212318 -548355 -689163 -489197 -484716 -238990 118909 213372
17286 213372 203401 213047 279277 114543 130980 257840 304789 150655 243598 496936 613139
17275 613139 577106 130963 -186391 -38121 -154370 1801 -129540 -473403 -353875 -205770
17265 -205770 89267 -55297 -77049 22807 304217 109325 -52472 -222615 69742 219282
17255B19282o7612j65730p7762m9903k7316o3213k4954L68593K36539j0559k47139
17244I0226J53871l07957k55895P4916m6466j57244J62461L03980m3435j39651
17234a65194q6793R2426O06918R7368j92663k07938k89508M5325J59193p4266
17224a5132K71838N4242K0735j17304j85517K2831K12835j08514l27226n1506
17214b22718P04421J11569j6254l05965p2736J2410j23580k01594j19037P2927
17204a60557q9433l63640J61792K49585j91961l97785n2330M23180j31553j2620
17194e65322J13724N7853Q2390J13809Q6755P8905M0085k8686J10873k0838J55979
17183B25527J80506J5566j35830N7509q0707j14888J07731k66710O1165K18028
$$ plain form
17255 219282 151670 -14060 -91822 -141725 -169041 -232254 -257208 111385 347924 337365 90226
17244 90226 244097 -63860 -319755 -244839 -291305 -448549 -286088 17892 -25543 -165194
17234 -165194 -251987 -159561 447357 544725 352062 144124 -145384 -100059 59134 -15132
17224 -15132 256706 310948 331683 214379 28862 51693 264528 156014 -171212 -222718
17214 -222718 481703 593272 577018 271053 198317 210727 87147 -114447 -233484 -160557
17204 -160557 -249990 -613630 -451838 -202253 -394214 -791999 -844329 -421149 -552702 -565322
17194 -565322 -451598 -393745 -311355 -197546 -110791 -31886 8199 -20487 90386 69548 225527
17183 225527 406033 421599 285769 343278 262571 147683 255414 -11296 49869 267897
17173B67897L24965J537k08148L1200k3496L1582k71984r2940k10319j50159L59756
17162E9891M11445l01444O5393n9196k54139J55325j05931k46239J48963P4142
17152e1790J64535j03167O0045K06071K21646j75654m3721K09967L6450l41476
17142A82906j38573J6267k9880j42648k636J58742n4997l07030n8286o3671J53707
17131b86099r0580M3376L30330j77021k619M60265k90735k51414J22348J35626
17121f523J35681K6712l05943K8660K46106K17302j00625k88739K14355J89561
17111C56547l03046o6646k32775K76278K26955J57561n68247o2331K05042J28737
17101A18075L86138j24892n81713o4740K19913O0027K00957R0534n2552j52499
$$ plain form
17173 267897 592862 594399 386251 417451 393955 425537 153553 60613 -149706 -299865 59891
17162 59891 471336 169892 235285 176089 -78050 77275 -28656 -274895 -125932 -51790
17152 -51790 112745 9578 69623 275694 497340 321686 277965 487932 524382 182906
17142 182906 44333 60600 30720 -111928 -114564 44178 -10819 -317849 -376135 -439806 -286099
17131 -286099 -376679 -333303 -2973 -179994 -182613 277652 -13083 -264497 -142149 -6523
17121 -6523 129158 155870 -150073 -121413 124693 341995 241370 -47369 166986 356547
17111 356547 53501 -13145 -245920 30358 257313 414874 -153373 -215704 -10662 118075
17101 118075 504213 379321 -202392 -267132 -47219 12808 213765 304299 251747 99248
17091I9248p6425k30513j06939L44377J96267j37194J63946M45176n1933l95502
17081B50508m0409Q4682l1075l0854N7497j77220K4827J73072K84914j71894k06362
17070B17686L6375N4234O2974k60969r9594k39384l2876L70537J09411j9055j47458
17059E1881Q8389o9985m62211J63543L91606K1450O944l5814l4547J49985J12723
17048C83964j70215J61696L26731j8957m19506Q4656K57770j34105k46248o0050
17038A65736K9578J14183j53300j15640l8292N0171j03949J77778K2054j04407
17028D3912J16638j46000q5272n277K43876L42155K5756l62466r8406k32844l32760
17017d90688r9084J62111L60738K60600l20544j43865k4498j14650Q6288O7228
$$ plain form
17091 99248 22823 -207690 -314629 29748 226015 88821 252767 697943 646010 250508
17081 250508 210099 294781 263706 232852 290349 113129 137956 311028 595942 424048 217686
17070 217686 254061 308295 371269 110300 10706 -228678 -261554 108983 218394 199339 51881
17059 51881 140270 70285 -391926 -228383 163223 184673 191617 155803 121256 271241 383964
17048 383964 213749 375445 702176 683219 263713 348369 606139 472034 225786 165736
17038 165736 195314 309497 156197 40557 2265 52436 -51513 126265 148319 43912
17028 43912 160550 14550 -70722 -75999 167877 510032 535788 173322 74916 -157928 -490688
17017 -490688 -589772 -427661 -66923 193677 -126867 -270732 -295230 -409880 -323592 -256364
17007b56364j61327K487K76741L94349J48963p4103j08758m9585K05000J33244
16997E10647k31210l55786l81207L93386O29156J75646m16361j11169m03476k53296
16987d43670J70704N6794n5964J85286L52271J82761l1855j43159l41551k47137
16977c15520r3235N2402N50434j05599j53548K92391Q1427j35464J81795q1835
16967B73248k4786k23225p5482r7732j43093j63542K49977J78655m35609r2389
16957e53978K43156k420k8745n883L68361J08611p1648j18389l9952K01588K8221
16946A28922p6945k31104K28298O8898O0702K52031M64979j81031l45356j65621
16936B03773j26783K68073K46728p5767j92465q23J04168j39439J17185o3174
$$ plain form
17007 -256364 -417691 -415204 -138463 255886 404849 330746 221988 172403 377403 510647
16997 510647 279437 -76349 -457556 -64170 564986 740632 324271 213102 -190374 -443670
16987 -443670 -272966 -216172 -272136 -86850 265421 448182 416327 273168 -68383 -315520
16977 -315520 -408755 -356353 194081 88482 -65066 227325 308752 173288 355083 273248
16967 273248 248462 25237 -50245 -147977 -291070 -454612 -204635 -25980 -461589 -553978
16957 -553978 -310822 -313242 -341987 -347870 20491 129102 57454 -60935 -100887 100701 128922
16946 128922 51977 -179127 49171 118069 178771 430802 895781 714750 369394 203773
16936 203773 76990 345063 591791 516024 323559 322736 426904 287465 404650 341476
16926C41476k15269j517J86118j59171J78062K41823P4475j35162l887l56836
16916A50112l99390j93149p6009q1797J06954O25568M31329P0032J60619k47057
16906E47212R9638j78573M1616J97631n0733m9948m8122j93209j92301l3903j77002
16895c7694k90942L7384K35143j60300l65635J41257J86746k58639j68368J42951
16885e38097K22384j9152j96739l992n5251J3212q1494m8492N57367K87154K59451
16874C96351K96877k59768j57287k77943N4167J48185Q0166k4147j67537m4311
16864D4753j59756J20306L07357r3324R8931J72331j948j69519k23281J04037
16854A99887o6551r6983l3530j03406l49849q9190J01100K33665Q5940k91980
$$ plain form
16926 341476 126207 124690 310808 151637 329699 571522 645997 510835 506948 150112
16916 150112 -249278 -442427 -518436 -600233 -493279 132289 563618 633650 794269 547212
16906 547212 646850 468277 509893 707524 656791 606843 558721 365512 173211 139308 -37694
16895 -37694 -328636 -291252 -56109 -216409 -582044 -440787 -254041 -512680 -681048 -538097
16885 -538097 -315713 -334865 -531604 -535596 -590847 -577635 -659129 -707621 -150254 136900 396351
16874 396351 693228 433460 276173 -1770 52397 200582 280748 256601 89064 44753
16864 44753 -115003 5303 312660 219336 318267 490598 488650 319131 95850 199887
16854 199887 133336 36353 2823 -100583 -450432 -539622 -438522 -204857 -118917 -410897
16844d10897k11000M7959l0687q9467K9583K1697l5276J15153L19612K26598j9893
16833c6618o2404m07327J61363J63310J78946r7776P1099L55034j68896j90997
16823c4266l14026n2974L90549J73387K3235l35068l8761Q096L6819L48473K72911
16812D78375j63249k27385l73387K34533K98810J1194R560j28054J4007J25141
16802B79545l7535j57096j78737K02686l02360l36250R7705L48626M906k7719
16792a06229k13865J56796J89461L9254k78523j18742L46909J95237k35886l78477
16782d04065j81097j33399L58926L34135J40587j37059k01451J2280J1261L19116
16772A19234l7549n0284N1612J62799j11737m0984j41177j96439j78516P9665
$$ plain form
16844 -410897 -621897 -573938 -604625 -694092 -664509 -642812 -678088 -562935 -243323 -16725 -36618
16833 -36618 -99022 -506349 -344986 -181676 -2730 -100506 -29407 325627 156731 -34266
16823 -34266 -348292 -401266 -10717 162670 185905 -149163 -187924 -179828 -143009 205464 478375
16812 478375 315126 87741 -285646 -51113 247697 258891 268451 140397 154404 279545
16802 279545 242010 84914 -93823 108863 -193497 -529747 -432042 -83416 -78510 -106229
16792 -106229 -320094 -163298 26163 65417 -213106 -331848 15061 210298 -25588 -404065
16782 -404065 -585162 -718561 -359635 -25500 115087 -21972 -223423 -211143 -199882 119234
16772 119234 81685 31401 83013 245812 134075 93091 -48086 -244525 -423041 -343376
16762c43376j38987L23995J25929J5223m8405q141O8453j2445l65013m4412j86335
16751f13514L51844O02882J15956k78812k63429m1636J63431K05187L78324j64778
16741D55455l69405k34978p0470p8698l7001j4740j72085Q5356N8777q3810r5311
16730e56910L71934K82331k98485j54127J46332j70576l3110J03696j890P5955
16720b34850J9673K12314L28011K4086j00515l62598j29507j36657O917l9408
16710d12534J78877L81308j41753k66997n1859K70929J95903J15553k85128j54351
16700a70052L43872J58313j16627j64P7750l04021K02936M09229r8255k30519
16690B72462K19057K12981j15324o7562j60348j8503p8456j16005j44521J74337
$$ plain form
16762 -343376 -482363 -158368 -32439 -17216 -65621 -73762 -5309 -17754 -382767 -427179 -613514
16751 -613514 -261670 341212 457168 178356 -85073 -126709 36722 241909 620233 455455
16741 455455 86050 -148928 -219398 -298096 -335097 -349837 -521922 -436566 -377789 -461599 -556910
16730 -556910 -184976 97355 -201130 -355257 -208925 -379501 -412611 -308915 -310805 -234850
16720 -234850 -215177 -2863 325148 349234 248719 -113879 -243386 -380043 -373126 -412534
16710 -412534 -233657 147651 5898 -261099 -312958 -42029 153874 269427 -15701 -170052
16700 -170052 173820 332133 215506 215342 293092 -10929 192007 601236 502981 272462
16690 272462 491519 704500 589176 521614 361266 342763 264307 148302 3781 178118
16680A78118k8191j49525J31500o6704k89837n3793J28246L31253N1475p766r5294
16669A29482J87334M1166l38025k1293O6940j63078l37121R2415J78848K37908
16659G4576n8496l8301K31005J57462j56202l0768q8361j43329m871q7792J09728
16648c5349L16573K497k12399j71319k10355r7494J45124Q5640J38157q5649J6586
16637a07988K11921K05893k39618k02879J80325o832j57292J19142Q7363m14849
16627c24814k21132Q0774L06108K53773n1690N2638J2450l4003J21791q975j51331
16616C5589j55884j82942R1975O85905K47643l28738o3269J19044r3247K07278
16606E63354J0128K29066J2220m32252j21992O9182k90965m6664j65479J11391
$$ plain form
16680 178118 149927 402 131902 65198 -224639 -278432 -150186 181067 232542 224776 129482
16669 129482 316816 357982 19957 -1336 65604 -97474 -434595 -342180 -163332 74576
16659 74576 16080 -22221 208784 366246 210044 179276 90915 -52414 -57285 -145077 -35349
16648 -35349 281224 283721 71322 -99997 -310352 -407846 -262722 -177082 -38925 -124574 -107988
16637 -107988 103933 309826 70208 -132671 47654 40822 -116470 2672 90035 -324814
16627 -324814 -545946 -465172 -159064 94709 43019 95657 108107 74104 195895 186920 35589
16616 35589 -120295 -303237 -211262 474643 722286 393548 330279 449323 356076 563354
16606 563354 573482 802548 814768 382516 260524 329706 38741 -7923 -173402 -62011
16596f2011M2219j20727j13350n8159m5659j46069L36531L94306M1037L90318
16586F58436p3623n23438k73225J51601K4256n8746k02706R0181j89615P3481
16576c23398L11100j4650j83457l70398L10582K79484K65457K16495j59911j89302
16566A42002P2905J36943l7378k65596J65431L45321m3791n3918p0018q4404j52565
16555A54932j63349J1355Q7909L34866k49545m36327K05398J94127k38964l3767
16545a33365J19679J51637j54612j83l4804m8826P2642Q130p5558K87678J14700
16534C07118K33452o80650j65214J16425J75014J97598j06572K06814j83396j79713
16524g9124O0017m5385P3456J59010P8219k52177l31785J3130K8964k55594K49172
$$ plain form
16596 -62011 -19792 -140519 -253869 -312028 -357687 -503756 -167225 227081 268118 658436
16586 658436 584813 61375 -211850 -60249 -35993 -94739 -297445 -207264 -396879 -323398
16576 -323398 -12298 -26948 -210405 -580803 -270221 9263 274720 491215 331304 142002
16566 142002 214907 351850 314472 48876 214307 559628 515837 461919 391901 307497 154932
16555 154932 -8417 2938 90847 425713 176168 -260159 -54761 139366 -99598 -133365
16545 -133365 -13686 137951 -16661 -16844 -51648 -100474 -27832 -19702 -95260 192418 307118
16534 307118 540570 -140080 -305294 -188869 -13855 183743 77171 283985 100589 -79124
16524 -79124 -19107 -64492 8964 167974 246193 -5984 -337769 -324639 -295675 -551269 -302097
16513c02097J47912K64961N23445K39172M4146n67966k26622L7865n4384k63874
16503a57442k50744J37959K78245j1380k80839m0953M18356J3307J18029K78393
16493E02931p5580p3996j55918k33360j33817Q9261M5795J27274J76191N622J03032
16482C77435l09843M3908k4698j43418J50484l23615l42007k82981j5460P9032
16472g91163P3737J68630M68815j22339k48307N1657k05588L34022L76398K94218
16462D00080j17001k83873l16042P5985O1954K55187j45053j72872q2158M1097
16452b82696R6291k28392K28124M93570K61149k59313j78518J84466p9321p4308
16442A61052L6876l04863j15927K03564L73630O3137k29970k98346M1216J49713
$$ plain form
16513 -302097 -154185 110776 634221 873393 917539 349573 122951 160816 106432 -157442
16503 -157442 -408186 -270227 8018 -3362 -284201 -325154 93202 106509 224538 502931
16493 502931 427351 353355 197437 -35923 -169740 -80479 -34684 92590 268781 274403 377435
16482 377435 67592 111500 86802 -56616 93868 -229747 -571754 -854735 -870195 -791163
16472 -791163 -717426 -548796 -79981 -202320 -450627 -398970 -604558 -270536 105862 400080
16462 400080 283079 -794 -316836 -240851 -178897 76290 -68763 -241635 -323793 -282696
16452 -282696 -186405 -414797 -186673 306897 568046 308733 130215 314681 235360 161052
16442 161052 197928 -106935 -222862 -19298 354332 417469 187499 -110847 -69631 80082
16432H0082o2855P3085k54954j64980J0294K35715P0849O6376m5275P4698J0560
16421I3595j22332k81689M7986q9191l7747j28380p4713N5949L55433L14552j70670
16410c7207k30202M7013J30148K94104J9893q3409k9960l02376M7816K79432K69277
16399D04529r6172j24137j53279l43659k34290M3529L00501L48344J30861o0545
16389B15682l19952j82715O8177K1083L01518k39771j26805m49847k74311M43782
16379e43159K65784k8309M7062K3110K87763J02555l89313j23858n0416L7678
16369c71103K0138P4899j62942K25149j99890j24883J34666L58788M27522j1217
16359C71127l55203j33890j71394k97572M24759M18260j27073J60509J3780j00115
$$ plain form
16432 80082 17227 90312 -164642 -329622 -319328 -83613 -12764 53612 8337 83035 93595
16421 93595 -28737 -310426 -262440 -351631 -389378 -517758 -592471 -536522 -181089 133463 -37207
16410 -37207 -267409 -220396 -90248 203856 223749 140340 110380 -191996 -144180 135252 404529
16399 404529 308357 184220 30941 -312718 -547008 -503479 -202978 145366 276227 215682
16389 215682 -104270 -286985 -218808 -197725 103793 -135978 -262783 -712630 -986941 -543159
16379 -543159 -277375 -305684 -258622 -235512 52251 154806 -234507 -358365 -408781 -371103
16369 -371103 -350965 -276066 -439008 -213859 -413749 -538632 -403966 -45178 382344 371127
16359 371127 15924 -117966 -289360 -586932 -162173 256087 129014 289523 303303 203188
16349B03188k15638j7376m99735l00212J73974M00734K54203q7736k33246k34158
16339e56002j18327M49852J67297J07291n816j77344p957J0122M6348O7194j74698
16328a92040o5546m7269J53204K18241R1751j13250k42060j44343P146J66829
16318a67337J8199r6930J69546L14163p328q8055q6309k82849k27635J91383L17682
16307E4530N8964j47549J87541q8670R3638Q8763j0196k07015l2242J68158j32473
16296C3449n0728K75312j66029J25477L4872j2796j76792m37612J47397L3494
16286a93956J68520k3608L15343J43402q7041k27989j71302J6387m8048R7953
16276a0339k8414J82922j20666o2971K17225l6765l14805p6491n765K89937o7852
$$ plain form
16349 203188 -12450 -29826 -529561 -829773 -655799 -255065 -862 -88598 -321844 -556002
16339 -556002 -674329 -224477 -57180 50111 44295 -133049 -141006 -130884 -84536 -17342 -192040
16328 -192040 -257586 -304855 -151651 66590 158341 45091 -196969 -341312 -334166 -167337
16318 -167337 -149138 -246068 -76522 237641 230313 142258 55949 -226900 -454535 -263152 54530
16307 54530 113494 -34055 153486 64816 158454 247217 237021 30006 -2236 165922 33449
16296 33449 -17279 258033 92004 217481 252353 239557 62765 -374847 -227450 -193956
16286 -193956 -25436 -49044 266299 409701 322660 94671 -76631 -60244 -108292 -10339
16276 -10339 -38753 144169 23503 -39468 177757 140992 -173813 -250304 -256069 33868 -33984
16265c3984o494R7435K23942j38500l54645j96088L93392P8875O9898l6135L1722
16254A29418j36478q6424K7868O2127j39506K4756M984j27668K48792P9406m5968
16243D1307J02930J03930j01453m66177K7063j6652n0114l4815Q6349J19366l3388
16232b21654l37666J23309L24893L0353K7630Q6129q540j84990n0477l11170j40329
16221f62512j93541j23799J55239O22092L56338L8658j54745n2615l1316n11239
16211e57440L5126J97603J28223j09305o716r7362K96276k1826p9260k35404j03031
16200e53116L37895J73704l90484K4353M33378J20717n1627j45265k99860j46821
16190d97126j0667K17270J30311K51422M3418k61890k12523L793K9701o9855n6828
$$ plain form
16265 -33984 -40478 56957 280899 142399 -212246 -408334 -14942 63933 133831 97696 129418
16254 129418 -7060 -93484 -65616 -3489 -142995 -118239 -113255 -240923 7869 87275 41307
16243 41307 144237 248167 146714 -319463 -292400 -309052 -359166 -393981 -307632 -188266 -221654
16232 -221654 -559320 -436011 -111118 -80765 -53135 32994 24454 -160536 -211013 -522183 -662512
16221 -662512 -856053 -979852 -824613 -202521 153817 192475 37730 -14885 -46201 -557440
16211 -557440 -522314 -324711 -196488 -305793 -312509 -409871 -113595 -135421 -214681 -450085 -553116
16200 -553116 -215221 -41517 -432001 -407648 25730 146447 94820 -50445 -350305 -497126
16190 -497126 -507793 -290523 -160212 91210 134628 -127262 -339785 -335992 -306291 -376146 -432974
16179d32974K56507K59855L7078n8087j38861j62812j15063p8138j34468K64969
16169c01994o9527K58443K7739J01660r8742m06757q3389l6004O8220J89002J32141
16158b19208M18950J54026o185q2012j29814j96690l98825J9901Q0345k21757
16148e81269Q1058K07065k46553K1012J63314J51818k15775j26646M08284K86376
16138A48684K8893J33538j93961J1380L0445j31021N7379L80998j7367j84513
16128B64455p4671j16041l0499N2173N010k84719k24853M3513k28387L26813L35809
16117F8603Q8279J17210j3259j48356M64k70000M9764J14815q710J3942K40310
16106B53062K68332J30074N3537l23701K2307R9316k42777k76913J6111j01810
$$ plain form
16179 -432974 -176467 83388 120466 62379 -76482 -239294 -354357 -432495 -566963 -301994
16169 -301994 -371521 -113078 -85339 16321 -82421 -489178 -572567 -608571 -540351 -351349 -219208
16158 -219208 199742 353768 347583 265571 135757 -60933 -459758 -439857 -359512 -581269
16148 -581269 -500211 -293146 -539699 -518687 -355373 -203555 -419330 -545976 -137692 148684
16138 148684 177577 311115 117154 128534 158979 27958 85337 466335 448968 264455
16128 264455 189784 73743 43244 95417 100427 -184292 -409145 -365632 -594019 -267206 68603
16117 68603 156882 274092 260833 112477 112941 -157059 -107295 7520 -1190 12752 253062
16106 253062 521394 651468 705005 381304 403611 502927 260150 -16763 -652 -102462
16096a02462L7065R8537J23136L71011j5914m63056k22271L67154r0158k89361
16086a86319J29906J7977M5441L85385L8781k51305j10709j7666j23097J55180
16076H3574J6324Q671q9921m13241M2982J25661J20338j2832j57594q9563K93875
16065g1726J78473k82228l55943l95104k99206J78209N49764L00982j65515J2167
16055c50127J7661j11496J53751J30983M8429J93082m3157o6276L25570K75662
16045E74082m69892Q764l6156r5491o5599P5479P3219J12730J44709n5234J16890
16034C83501l12041k55630L53689j14820j98530k2162R1508m9736k29076O6023
16024b87274K35372l15027k30852J53051J78852k07883L40115L65564j17983j12568
$$ plain form
16096 -102462 -65397 33140 156276 527287 511373 48317 -173954 193200 103042 -186319
16086 -186319 -56413 -38436 7005 392390 431171 179866 69157 51491 -71606 83574
16076 83574 99898 108569 18648 -394593 -351611 -225950 -105612 -118444 -276038 -365601 -71726
16065 -71726 106747 -175481 -531424 -926528 -1225734 -1047525 -497761 -196779 -362294 -350127
16055 -350127 -332466 -443962 -290211 -159228 -110799 82283 39126 -27150 298420 574082
16045 574082 104190 112954 76798 -18693 -84292 -8813 64406 177136 321845 266611 383501
16034 383501 71460 -184170 169519 54699 -143831 -165993 -74485 -124221 -353297 -287274
16024 -287274 -51902 -366929 -597781 -444730 -265878 -473761 -133646 231918 113935 1367
16014A367m9724J70532L3617r7143k47594k7696J36636J52653j17748K18603M9326
16003B22829J01480l3841J533m46299j84198N1811K22256k9583j7127k54662j20830
15992d86631j9854R4593J90628L07931R6738q625k71419m02098j3295J18040j73276
15981e67268l05663M6694J95181m0128M08505K33795J54664k6307q108j09273
15971a7908K06754j18533m41764l87004J28903K16185j07694j46608K0031K35253
15961d12385K39764K50321N1663j81769j44840m10304j23145M48306L09787K54287
15951B81685p5771J66892k08456l41600N4207Q0703j41924l47386o0019n6428
15941f48097j7047J0490K57290K03189K89802J85984k21267j26205j4644N5929
$$ plain form
16014 1367 -48357 122175 155792 58649 -188945 -216641 -80005 72648 -45100 173503 222829
16003 222829 324309 290468 292001 -154298 -338496 -286685 -64429 -94012 -111139 -365801 -486631
15992 -486631 -506485 -411892 -221264 86667 183405 174780 -96639 -498737 -512032 -393992 -567268
15981 -567268 -872931 -826237 -631056 -671184 -262679 -28884 125780 99473 91365 -17908
15971 -17908 188846 70313 -371451 -758455 -629552 -413367 -521061 -667669 -647638 -412385
15961 -412385 -172621 77700 129363 -52406 -197246 -607550 -730695 -282389 27398 281685
15951 281685 205914 372806 164350 -177250 -123043 -42340 -184264 -531650 -591669 -648097
15941 -648097 -665144 -654654 -397364 -194175 95627 281611 60344 -65861 -80505 -24576
15931b4576q5122j90221j05787l41642L01490K16827L05708j02424j94723j2333
15921b32803p0992K05951K80744j37005j23375O7094N5487j35233l38540k40403
15911f69075Q7983K68172L41207L89051R3181k266J1001m35345j71130j43628
15901b30849j03356L53631L98303j05168k69625J36642J32962k37486m5961J09013
15891A38106Q5314p1260k19453J9895K51667J47606j0212l33187K50887j02401
15881A56962K7051m0989l3974j09890O4535L21408m4708J51824p4992j41252K42957
15870E18932J0472k88656k03131J77185P5977l88459n1105k17129k35495k6532
15860f27941M13771M79065Q2594o5144k81048k74707K49865J96875L8505J21885
$$ plain form
15931 -24576 -109698 -299919 -405706 -747348 -445858 -229031 76677 -25747 -220470 -232803
15921 -232803 -303795 -97844 182900 45895 -77480 -10386 45101 -90132 -428672 -669075
15911 -669075 -581092 -312920 28287 417338 510519 508253 519254 83909 -87221 -230849
15901 -230849 -334205 19426 417729 312561 42936 179578 312540 75054 29093 138106
15891 138106 223420 152160 -67293 -47398 204269 351875 341663 8476 259363 156962
15881 156962 184013 143024 109050 -840 63695 385103 340395 492219 417227 275975 518932
15870 518932 529404 240748 37617 214802 290779 -97680 -148785 -365914 -601409 -627941
15860 -627941 -214170 264895 347489 282345 1297 -273410 -23545 173330 211835 333720
15850C33720j57305o1200P8685j26610j34455j25841J00957J20297L7709k11965
15840a46008k79357J17712L65389k92117k78214n2035M7014j36173L26122P2660
15830b55007j99440K21676L33509q8183l26387l90394L08243J12149j02135J13679
15820b72290K04117l28207p82P4364R9082J0509M91224N00333k58514o40679j68159
15809b89002j34217J00191L48359Q7300p0514Q2299k23761k97148k8730K04105
15799b21118M54681J55673q8579J18645n5516J57335k41604L14943J4193j24J09832
15788G18361l22150j84392j21876p6249O8435k9325k09972l19660K0016m9572
15778e06384j16461M66467M26230j5996l84195j02427L18089J12280L8386j21202
$$ plain form
15850 333720 176415 115215 193900 67290 -67165 -193006 -92049 28248 65957 -146008
15840 -146008 -425365 -307653 57736 -234381 -512595 -564630 -517616 -653789 -327667 -255007
15830 -255007 -454447 -232771 100738 12555 -313832 -704226 -395983 -283834 -385969 -272290
15820 -272290 -68173 -396380 -397162 -322798 -223716 -213207 278017 778350 519836 -120843 -289002
15809 -289002 -423219 -323028 25331 112631 42117 124416 -99345 -396493 -425223 -221118
15799 -221118 233563 389236 300657 419302 363786 521121 279517 594460 608653 608529 718361
15788 718361 396211 211819 89943 13694 82129 52804 -157168 -476828 -456812 -506384
15778 -506384 -622845 -156378 269852 253856 -130339 -232766 85323 197603 235989 114787
15768A14787J05019K77600l13605j86277k5233R121k67143l63537P0793M14744
15758a63731M169M3092J48324J77325k1978k0466N627j77826m34583r0206Q820
15747e21433j00026K53308N7303q7469Q5556L7036k82769l34066Q6292K47948
15737e58320K87332n2124L4035j29228j40363N6097M50901r0388k49484L21613
15727f9929K23137K913j33322L27995j72712k10949L1048R5284m04074k06981
15717e17590M93868k8883m4479J21528J60163j7138j5414k96234j65817o8530
15707c78526J68460J64344J07198K4368L03647L90132j97201n79083l80699l5801
15697d13161O4153k3514J45565K97864N6118Q4477r3661o5182p0387m3641k21981
$$ plain form
15768 114787 219806 497406 183801 -2476 -27709 -18588 -285731 -649268 -578475 -163731
15758 -163731 -159562 -116470 31854 209179 187201 166735 172362 -5464 -440047 -530253 -521433
15747 -521433 -621459 -368151 -310848 -398317 -312761 -275725 -558494 -892560 -806268 -558320
15737 -558320 -270988 -323112 -289077 -418305 -558668 -502571 -51670 -142058 -391542 -69929
15727 -69929 153208 156121 22799 350794 178082 -32867 -1819 93465 -310609 -517590
15717 -517590 -23722 -52605 -97084 24444 184607 167469 152055 -144179 -309996 -378526
15707 -378526 -210066 -45722 61476 85844 389491 779623 582422 3339 -377360 -413161
15697 -413161 -349008 -372522 -226957 70907 127025 211502 117841 52659 -17728 -61369 -283350
15686b83350j9678K45238L10382K10290j44504l30167K07888J21459l2943k49751
15676C4864O0882j64471O2241k3614n6276K57693j02416j08168r9468j8175m0590
15665a97498k80061j62398L34440L32038L30044l84828q9842L3604p5615P9408
15655h0708K8328j71219M8595J61651l6327o5457o1526Q4732R0312J28442J15276
15644B42099j58213o0337O6824K14568j39690m7445J14728N2603k44102k68460
15634b27425k96803J18910L10380m35741p3772K36929r8285n1110K13365J17249
15624a86303L9485k01685J5814m5390j73097J999J25796K11681J73869K94092
15614B56261P0988j18559J1787k77098l0778j8027j16249L41890q2997l58276
$$ plain form
15686 -283350 -303028 -57790 252592 462882 318378 -11789 196099 317558 284615 34864
15676 34864 95746 -68725 -6484 -30098 -86374 171319 68903 -39265 -138733 -156908 -197498
15665 -197498 -477559 -639957 -305517 26521 356565 -28263 -118105 -84501 -160116 -80708
15655 -80708 -52380 -223599 -175004 -13353 -49680 -115137 -176663 -91931 -1619 126823 242099
15644 242099 83886 23549 90373 304941 165251 117806 232534 285137 41035 -227425
15634 -227425 -524228 -405318 -94938 -530679 -604451 -367522 -465807 -516917 -303552 -186303
15624 -186303 -146818 -348503 -332689 -378079 -551176 -549177 -423381 -211700 -37831 256261
15614 256261 327249 208690 220477 -56621 -87399 -105426 -221675 120215 37218 -321058
15604c21058j78470m51K77811K03685M8622J16761M6975m0399q999k46192j18405
15593b20120L64435J39645k47452l01312j50353K04144L43732k1745Q2426k16523
15583b3123k82120l300J27152K37260J72826J93274R2507j44621j95972R841J38760
15572C22484Q1650L9852p0972J17125l57120j83160m6082J3769k37617l6500J06692
15561b49879N7073J53075J81310K01634R6666j79175k34885l24946l27913M2350
15551e84690N023P4503P3605m7645l1382k96422P6871L31120O5231K28837L80585
15540B75636k778n7374K3100q9535j44242J17889q8759j64272p8770J37306J92772
15529A20973k1443l1680j79247m3048l04738l79688K32791K38265L39064J12098
$$ plain form
15604 -321058 -499528 -499979 -222168 -18483 30139 146900 193875 153476 144477 -101715 -220120
15593 -220120 144315 283960 36508 -264804 -415157 -211013 132719 110974 193400 -23123
15583 -23123 -305243 -308543 -181391 55869 228695 421969 514476 369855 173883 183724 322484
15572 322484 404134 443986 373014 490139 133019 -50141 -96223 -82454 -320071 -356571 -249879
15561 -249879 -192806 -39731 141579 343213 439879 260704 25819 -299127 -627040 -584690
15551 -584690 -579667 -505164 -431559 -479204 -510586 -807008 -730137 -399017 -333786 -104949 275636
15540 275636 272858 215484 238584 149049 4807 122696 33937 -130335 -209105 -71799 120973
15529 120973 99530 67850 -111397 -154445 -459183 -838871 -606080 -367815 -28751 83347
15519H3347R2516J46094o3634Q3352k24859r3676k3651j18073j75074n9409Q0807
15508b72260j43703O4260k2201J48335n9624o5935K06248J32848L39001n2125
15498B74844l12131K6352k91061k16371J0159L52693O2499Q707r7877j90717j01861
15487d74764K3808P1659q5624J41483J72452K65325K92634r3313k02901k32270
15477a21511J30390l7031j93773j15045J15866J16006L8373R9880p3916q4686
15467a25447K80126j11660j49943j9566M8912l2525r8181J58044j35402o0969
15457b46611m9980k424k04399J14855r6418p8511K95395M31151O4246j88994O3591
15446A01901k64253m22481k36306l5898j79276N58121O61546n6168J15479K64155
$$ plain form
15519 83347 175863 321957 258323 341675 116816 23140 -511 -118584 -293658 -353067 -272260
15508 -272260 -415963 -351703 -373904 -225569 -285193 -351128 -144880 -12032 326969 274844
15498 274844 -37287 -10935 -301996 -518367 -508208 -155515 -93016 -84309 -182186 -372903 -474764
15487 -474764 -450956 -379297 -464921 -323438 -150986 114339 406973 313660 110759 -121511
15477 -121511 8879 -28152 -221925 -336970 -221104 -105098 -66725 33155 -40761 -125447
15467 -125447 154679 43019 -106924 -126490 -77578 -110103 -208284 -50240 -185642 -246611
15457 -246611 -296591 -299015 -503414 -388559 -484977 -563488 -268093 163058 227304 38310 101901
15446 101901 -162352 -584833 -821139 -857037 -1036313 -478192 183354 127186 242665 506820
15436E06820Q9634O2878J3394m1998k19569o1050j44331J92198Q9452j26150J427
15425C62705k43818l16716m00488J49136K61418J5831k53697K77706P2412j9166
15415i4677N7051k57865Q6414J73219J69093j3507j07019j74611O2810k61929
15405c61021J70992n8815J74385J75778n7309J7272L4290O7383j23361j73364
15395a33770k06293P9341J73139Q5913j95961j38839l3254J92341k83811m8646
15385e09840q4838K18380m2084j80104p2270l6661L35099K32458O8805J08088
15375C7033L8714k76498k53672K45002K20187K13577l38265P6948L16307o2578
15365B16755o2740M8060j21199k77294o974K62822P022P3971J67190J16097n7230
$$ plain form
15436 506820 596454 659332 672726 630728 411159 350109 205778 397976 487428 361278 362705
15425 362705 118887 -197829 -598317 -449181 -187763 -171932 -425629 -147923 -75511 -94677
15415 -94677 -37626 -295491 -209077 -35858 133235 119728 12709 -161902 -99092 -361021
15405 -361021 -190029 -248844 -74459 101319 44010 61282 95572 162955 39594 -133770
15395 -133770 -340063 -260722 -87583 -1670 -197631 -336470 -369724 -177383 -461194 -509840
15385 -509840 -594678 -376298 -418382 -598486 -670756 -707417 -372318 -139860 -71055 37033
15375 37033 75747 -200751 -454423 -209421 10766 224343 -113922 -36974 279333 216755
15365 216755 154015 202075 80876 -196418 -203392 59430 66452 140423 307613 423710 366480
15354C66480l51273K23972K32376J88962l1290j54174L00944M8380l08991n44643
15344b9257n8344j536J1830J24144p8782J16587K9569o2490K64688o6116k45019
15333E274n17755j37311J00691j35340j323R0553L80569K08272J64790K32093
15323C90513j00751k32668l02752j22447L27062J32467O148O0330j66661R4765
15313H6006L88611K67561l95388k88264j66771m1884l59424J06151J02864j05657
15303d06195M9474j09924K93093L04582K2535J7374k06888j42797k60725K30179
15293b09292k99597J27340L16204J42305J8812K4299Q8201N8732j41786n6379
15283F8839j79351K8269K87092k01484J79131K07821k62188L73702P823l83131
$$ plain form
15354 366480 15207 239179 471555 660517 629227 475053 775997 824377 515386 -29257
15344 -29257 -87601 -89137 -77307 46837 -31945 84642 114211 51721 316409 250293 5274
15333 5274 -512481 -649792 -549101 -684441 -685764 -595211 -214642 -6370 158420 390513
15323 390513 289762 57094 -245658 -368105 -41043 91424 97572 157902 -8759 86006
15313 86006 474617 742178 346790 58526 -108245 -150129 -509553 -403402 -300538 -406195
15303 -406195 -356721 -466645 -173552 131030 153565 170939 -35949 -178746 -439471 -209292
15293 -209292 -508889 -381549 -65345 76960 95772 120071 208272 267004 125218 68839
15283 68839 -110512 -82243 204849 3365 182496 390317 128129 501831 509654 126523
15273A26523l7133j49196J04281p7659r0666J67196L56257r9251n50831k18700
15263d69179J06276K42218J7537L23176J25413j73534q6668j54264N978j84959
15253b48006j27520l0297q0712r5051K96740k1704m3873K16348l44811k90577
15243g69463o007K50541K83768O5254K95904j29477m97452N3385Q9224M02078
15233C7755J29261j14915j42623j80101R6580m3830M2245K0607r140o0619L75022
15222A50242k39268n0338K59030L12154k26678j03435K33252J23803K15531n0552
15212F23741j99654k07505K556j20006K71169J61878j00782j94522q4782L78678
15202E30771k28018k76159j56282J10157J13360P9743j16252j16265j88591J46226
$$ plain form
15273 126523 89390 -59806 44475 -33184 -123850 43346 399603 300352 -250479 -469179
15263 -469179 -362903 -120685 -103148 220028 345441 171907 85239 -69025 -63047 -248006
15253 -248006 -375526 -405823 -486535 -581586 -284846 -306550 -350423 -134075 -478886 -769463
15243 -769463 -775470 -524929 -241161 -175907 119997 -9480 -506932 -453547 -364323 37755
15233 37755 167016 52101 -90522 -270623 -174043 -217873 -175628 -155021 -164161 -224780 150242
15222 150242 -89026 -139364 119666 431820 205142 101707 334959 458762 674293 623741
15212 623741 424087 216582 219138 99132 370301 532179 431397 236875 152093 530771
15202 530771 302753 26594 -129688 -19531 93829 173572 57320 -58945 -247536 -101310
15192a01310M71958p5088j64512n22363J11963J21080k0989j95212L03295j90122
15182b61300k44500L00081L5387m9405l0148K16594l0186j46608K37063M03628
15172D30606O9708j50731j10529O734k49558j55987K69018n4133L7757j1002L3838
15161A15721k98779l25911j84506J84531k24299J16925L40543J82582O3058j97435
15151b27570n77515P9701K95977L45856l19071l16436J64557k553Q9052O7582
15141d00420k19291k8377K9128r0951r0435K45418o7909K3183K34584J19722J37069
15130a08279K06528M676q0895o7685K99508J60516N443j41647l6844Q257j06782
15119A42796j72787j87126J8406J88269N1633p8105j56947l1101p8605k20392
$$ plain form
15192 -101310 370648 295560 131048 -391315 -279352 -158272 -179261 -374473 -71178 -261300
15182 -261300 -505800 -205719 -170332 -219737 -249885 -33291 -63477 -210085 26978 430606
15172 430606 500314 349583 239054 245788 -3770 -159757 109261 55128 92885 81883 115721
15161 115721 -183058 -508969 -693475 -508944 -733243 -616318 -275775 -93193 -30135 -227570
15151 -227570 -805085 -725384 -429407 -83551 -402622 -719058 -554501 -557054 -468002 -400420
15141 -400420 -619711 -648088 -618960 -709911 -800346 -554928 -622837 -599654 -365070 -245348 -108279
15130 -108279 98249 102925 22030 -45655 253853 414369 419812 278165 241321 249578 142796
15119 142796 -29991 -217117 -198711 -10442 41191 -36914 -193861 -224962 -303567 -523959
15109e23959o4452n1401M54695J78939J9155k55569m51111j43150K96726M83102
15099e7025J58998L52624p7360j52503j4116m57861J74574J93209k99839j14170
15089b93469j80417M9819j1646J79771J32398J16875J05471l57790l91318J39824
15079e10482K54549j4656j45162j08063J72780K96594j1660j22771J61286K30208
15069B02623j69901J76863j09664l25219K09689P2617l01693l248J14935P5131
15059e7867l2437j32764L6217J81953J34607K9865K29111J22559q184k96112j88176
15048A8772k07963l11449r1670Q0852P6531k98614j57762L64217J66385M24941
15038F4240J34308J25146j9337J44588J29381j14131J2174k53050j97957J29553
$$ plain form
15109 -523959 -588411 -639812 -185117 -6178 12977 -242592 -693703 -836853 -540127 -57025
15099 -57025 101973 454597 377237 224734 210618 -247243 -72669 120540 -179299 -293469
15089 -293469 -473886 -424067 -435713 -255942 -123544 -6669 98802 -258988 -650306 -510482
15079 -510482 -255933 -270589 -415751 -523814 -351034 -54440 -66100 -188871 -27585 202623
15069 202623 32722 209585 99921 -225298 -15609 57008 -244685 -247933 -132998 -57867
15059 -57867 -90304 -223068 -186851 -4898 129709 159574 388685 511244 503060 206948 18772
15048 18772 -189191 -500640 -592310 -511458 -434927 -733541 -891303 -527086 -360701 64240
15038 64240 198548 323694 304357 448945 578326 464195 476369 223319 25362 154915
15028A54915J39213m02718m67172J05488J81253K3541j54235r9707P9536J12113
15018c27773j28888J74215J65914K41236J4168J52289n1670k44708J8884K1894
15008C5561k93647J67578L70206O5159l01088J11972k5013l85577J70690J03665
14998A9506P7752j5427K60776j912o3321k82561j21956j4369J0841M7520k21870
14987c05021K54998J3766k15926J04445K8766L2501L5911k12871j15407K63892
14977a14946j91255j99379j11263o3023L39930L05521N6067k42689J13189J53102
14967D5254J90584J09811k99180l39397L7556o6594Q118j17236k43563M9903K56409
14956c68335J41126l9025J7730j58814Q6383K86699J71104l01210m19636l16654
$$ plain form
15028 154915 294128 -108590 -575762 -470274 -289021 -265480 -419715 -519422 -439886 -327773
15018 -327773 -456661 -282446 -116532 124704 138872 291161 239491 -5217 13667 35561
15008 35561 -258086 -90508 279698 344857 43769 155741 130728 -254849 -84159 19506
14998 19506 97258 81831 342607 340695 277374 -5187 -127143 -141512 -130671 -83151 -305021
14987 -305021 -50023 -36257 -252183 -147738 -118972 -86471 -50560 -263431 -378838 -114946
14977 -114946 -306201 -505580 -616843 -679866 -339936 -34415 21652 -221037 -107848 45254
14967 45254 235838 345649 46469 -292928 -255372 -321966 -313848 -431084 -674647 -624744 -368335
14956 -368335 -227209 -266234 -248504 -407318 -320935 -34236 136868 -164342 -583978 -900632
14946i00632L88111J1795Q8132O17790L76462m529j39079o5364j54286M026J91546
14935D13972r3888k87095k53562k11872L01342J40772j18320l3984j44401l8519
14925c25555L6418L72930L04605Q2595k21238j38311j39325j26937K75416K16665
14915C37263k97558O93J49865p0951q9973O9907j46097J81823l52125j71954K95258
14904i3849j11000J44704O1777m5531K56091K07153l08732j72743j45892L082
14894b04940J60166k68525O5306O8396J39640K00094l87266l79403K8302K03507
14884c74723j05514R573r6736K40589L34472J29507K26717k81563k43343k23482
14874c84503j14212K67422M15594j61135j03039k48692k56383K66808L56335J24816
$$ plain form
14946 -900632 -512521 -500726 -412594 205196 581658 577129 438050 372686 218400 222426 413972
14935 413972 320084 32989 -220573 -432445 -131103 9669 -108651 -142635 -287036 -325555
14925 -325555 -289137 83793 388398 470993 249755 111444 -27881 -154818 120598 337263
14915 337263 39705 40398 190263 119312 29339 99246 -46851 134972 -217153 -389107 -93849
14904 -93849 -204849 -60145 1632 -43899 212192 419345 110613 -62130 -208022 -204940
14894 -204940 -44774 -313299 -247993 -179597 -39957 160137 -227129 -606532 -578230 -374723
14884 -374723 -480237 -470664 -567400 -326811 7661 137168 363885 82322 -161021 -384503
14874 -384503 -498715 -231293 184301 23166 -79873 -328565 -584948 -318140 38195 163011
14864A63011K6308k28102k71595K68075L43788K72285n1647k65932k50466k12023
14854b06298k21151l28366J15341J33543M2938L2630L92199P0556k11114J59960
14844a9762q973j15782M2273j51262k43664j51610J74276k3952R4333j0590k60731
14833f75444J15401L17933L79968j97447j15953j56974j47029K91267K04741L9563
14823E6026q5614j52064j51222K63324K48890J77584m59380m2140J64256L8694
14813E8354k94808L8978J71852r1054J57862J04980m6685j09733j23241J590J43200
14802A1295j9778k9463k04966j64882k71142J81660r8534K24404L90068M365j12141
14791h9114j96997k19662l6855K11495J13160K50951j5399J00978m4718J63371
$$ plain form
14864 163011 189319 -38783 -310378 -42303 301485 573770 522123 256191 5725 -206298
14854 -206298 -427449 -755815 -640474 -506931 -463993 -431363 -39164 31392 -179722 -19762
14844 -19762 -28735 -144517 -102244 -253506 -497170 -648780 -474504 -498456 -404123 -414713 -675444
14833 -675444 -560043 -242110 137858 -59589 -175542 -332516 -479545 -188278 16463 56026
14823 56026 -29588 -181652 -332874 -69550 179340 356924 -102456 -144596 19660 58354
14813 58354 -236454 -197476 -25624 -116678 41184 146164 99479 -10254 -133495 -131905 11295
14802 11295 -8483 -37946 -242912 -407794 -678936 -497276 -595810 -371406 18662 23027 -89114
14791 -89114 -286111 -505773 -542628 -331133 -217973 32978 17579 118557 73839 237210
14781B37210k3361J29931j02742j91955N5633J32588j37906J9333K23576k26567
14771A15740k35935l2909L85106R2501k36187Q6018k92615L6758J49568q5844
14761a7799n2967J07302L59247J22497k63300r1146M4697k40836k51049k24736
14751e08090j21128M0579K58938k37212r6792M02240R0969Q3829m1622K29963
14741A01674J37900m62111l64985J16049K61700O4042L16641Q616l00431j41323
14731b62228O0356r8670J48760L10857J81884j64730j38996k2078J64681q1224
14721I8612k13870J3207K63029k06053k11355L4922j69042l1735M19073M206j12357
14710a11363K58636n9422J40904k41579k31315K58987L8839q8411J5479M1757
$$ plain form
14781 237210 213849 343780 241038 49083 104716 237304 99398 118731 342307 115740
14771 115740 -120195 -153104 232002 324503 88316 174334 -118281 -81523 68045 -17799
14761 -17799 -70766 36536 395783 518280 254980 163834 208531 -32305 -283354 -508090
14751 -508090 -629218 -588639 -329701 -566913 -663705 -261465 -170496 -86667 -128289 101674
14741 101674 239574 -222537 -587522 -471473 -209773 -145731 170910 179526 -120905 -262228
14731 -262228 -201872 -300542 -151782 159075 340959 176229 37233 15155 179836 98612
14721 98612 -115258 -102051 160978 -45075 -256430 -221508 -390550 -422285 -3212 994 -111363
14710 -111363 147273 87851 228755 -12824 -244139 14848 53687 -34724 -19245 22512
14700B2512L633l62173m51930J29474J74396K75248L64680l659k25638j75804
14690b49261k37926J43772J27295j2292J09721J29601J51723O121j65625j57227
$$ plain form
14700 22512 26145 -336028 -787958 -658484 -484088 -208840 155840 152181 -73457 -249261
14690 -249261 -487187 -343415 -216120 -228412 -118691 10910 162633 168754 3129 -154098
$$ [...]
##END NTUPLES=NMR SPECTRUM
##END=
