##TITLE=Analysis number 307094
Compound Code ac 35916
Project Code adrs
Chemist Name frontier
##JCAMPDX= 6.0         $$ Bruker NMR JCAMP-DX V2.0
##DATA TYPE= NMR SPECTRUM
##DATA CLASS= NTUPLES
##ORIGIN= Bruker BioSpin GmbH
##OWNER= NMR
$$ XWIN-NMR		Version 3.5
$$ Wed Apr 20 14:48:14 2005 GMT Daylight Time (UT+1h)  MAYBRIDGE\NMR@NMR_250MHZ
##.OBSERVE FREQUENCY= 250.131544655141
##.OBSERVE NUCLEUS= ^1H
##.ACQUISITION MODE= SIMULTANEOUS (DQD)
##.ACQUISITION SCHEME= undefined
##.AVERAGES= 16
##.DIGITISER RES= 18
##SPECTROMETER/DATA SYSTEM= dpx250
##.PULSE SEQUENCE= zg30
##.SOLVENT NAME= DMSO
##.SHIFT REFERENCE= (INTERNAL, DMSO, 0, 16.522)
##AUDIT TRAIL= $$ (NUMBER, WHEN, WHO, WHERE, WHAT)
$$ ##TITLE= Audit trail, XWIN-NMR		Version 3.5
$$ ##JCAMPDX= 5.01
$$ ##ORIGIN= Bruker BioSpin GmbH
$$ ##OWNER= NMR
$$ C:\u/data/dgb/nmr/ADRS/1860/pdata/1/auditp.txt
$$ ##AUDIT TRAIL=  $$ (NUMBER, WHEN, WHO, WHERE, WHAT)
(   1,<2005-04-20 14:47:54.43 +100>,<MAYBRIDGE\NMR>,<NMR_250MHZ>,
      <created by zg, POWCHK disabled, PULCHK disabled
       configuration hash MD5:
       62 19 C7 07 E1 42 D1 B7 37 6C 3D D0 77 39 F9 E6
       data hash MD5: 64K
       EC 46 28 3F D1 7D E7 8D 2C B7 8E 8A C8 CC 36 69>)
(   2,<2005-04-20 14:48:05.52 +100>,<MAYBRIDGE\NMR>,<NMR_250MHZ>,
      <Start of raw data processing
       ef LB = 0.3 FT_mod = 6 PKNL = 1 SI = 32K 
       data hash MD5: 32K
       9A CF D9 B1 34 B0 C5 EE 7E B1 38 B6 70 D0 B5 6D>)
(   3,<2005-04-20 14:48:07.32 +100>,<MAYBRIDGE\NMR>,<NMR_250MHZ>,
      <apk 
       data hash MD5: 32K
       F2 EC E3 C3 C4 DA CA 20 8A C2 2E 87 21 B1 ED 6A>)
(   4,<2005-04-20 14:48:08.04 +100>,<MAYBRIDGE\NMR>,<NMR_250MHZ>,
      <abs ABSG = 5 
       data hash MD5: 32K
       89 B8 DE A5 DC C6 A4 03 01 F4 65 A2 1E 19 B2 61>)
$$ ##END=
$$ 
$$ hash MD5
$$ 53 07 96 C0 42 B3 05 D4 CE FD 86 59 9E 45 FF 84
##$RELAX= 
##$RELAX= 
##$RELAX= 
##$RELAX= 
##$RELAX= 
##$RELAX= 
##$RELAX= 
$$ Bruker specific parameters
$$ --------------------------
##$DU= <C:\u>
##$EXPNO= 1860
##$NAME= <ADRS>
##$PROCNO= 1
##$TYPE= <nmr>
##$USER= <dgb>
##$AMP= (0..31)
100 100 100 100 100 100 100 100 100 100 100 100 100 100 100 100 100 100 
100 100 100 100 100 100 100 100 100 100 100 100 100 100 
##$AQSEQ= 0
##$AQ_mod= 3
##$AUNM= <au_zg>
##$AUTOPOS= <27 >
##$BF1= 250.13
##$BF2= 250.13
##$BF3= 250.13
##$BF4= 250.13
##$BF5= 500.13
##$BF6= 500.13
##$BF7= 500.13
##$BF8= 500.13
##$BYTORDA= 1
##$CFDGTYP= 0
##$CFRGTYP= 5
##$CHEMSTR= <none>
##$CNST= (0..31)
1 1 145 1 1 1 1 1 1 1 1 1 1 1 1 1 1 1 1 1 1 1 1 1 1 1 1 1 1 1 1 1 
##$CPDPRG= <>
##$CPDPRG1= <>
##$CPDPRG2= <>
##$CPDPRG3= <>
##$CPDPRG4= <mlev>
##$CPDPRG5= <mlev>
##$CPDPRG6= <mlev>
##$CPDPRG7= <mlev>
##$CPDPRG8= <mlev>
##$CPDPRGB= <>
##$CPDPRGT= <>
##$D= (0..31)
0 1 0 0 0 0 0 0 0 0.06 0 0 0 0 0 0 0.0002 0 0 0 0 0 0 0 0 0 0 0 0 0 0 
0 
##$DATE= 1114004873
##$DBL= (0..7)
120 120 120 120 120 120 120 120 
##$DBP= (0..7)
150 150 150 150 150 150 150 150 
##$DBP07= 0
##$DBPNAM0= <>
##$DBPNAM1= <>
##$DBPNAM2= <>
$$ [...]
##$SUBNAM7= <"">
##$SUBNAM8= <"">
##$SUBNAM9= <"">
##$SW= 20.6930455092707
##$SWIBOX= (0..15)
0 0 3 0 0 0 0 0 0 0 0 0 0 0 0 0 
##$SW_h= 5175.983436853
##$TD= 65536
##$TD0= 1
##$TE= 295.16
##$TE2= 300
##$TE3= 300
##$TEG= 300
##$TL= (0..7)
0 120 120 120 120 120 120 120 
##$TP= (0..7)
150 150 150 150 150 150 150 150 
##$TP07= 0
##$TPNAME0= <>
##$TPNAME1= <>
##$TPNAME2= <>
##$TPNAME3= <>
##$TPNAME4= <>
##$TPNAME5= <>
##$TPNAME6= <>
##$TPNAME7= <>
##$TPOAL= (0..7)
0.5 0.5 0.5 0.5 0.5 0.5 0.5 0.5 
##$TPOFFS= (0..7)
0 0 0 0 0 0 0 0 
##$TUNHIN= 0
##$TUNHOUT= 0
##$TUNXOUT= 0
##$USERA1= <user>
##$USERA2= <user>
##$USERA3= <user>
##$USERA4= <user>
##$USERA5= <user>
##$V9= 5
##$VALIST= <valist>
##$VCLIST= <CCCCCCCCCCCCCCC>
##$VD= 0
##$VDLIST= <DDDDDDDDDDDDDDD>
##$VPLIST= <PPPPPPPPPPPPPPP>
##$VTLIST= <TTTTTTTTTTTTTTT>
##$WBST= 1024
##$WBSW= 4
##$XGAIN= (0..3)
0 0 0 0 
##$XL= 0
##$YL= 0
##$YMAX_a= 401069
##$YMIN_a= -373966
##$ZGOPTNS= <>
##$ZL1= 120
##$ZL2= 120
##$ZL3= 120
##$ZL4= 120
##$ABSF1= 16.522
##$ABSF2= -4.171173
##$ABSG= 5
##$ABSL= 3
##$ALPHA= 0
##$AQORDER= 0
##$ASSFAC= 0
##$ASSFACI= 0
##$ASSFACX= 0
##$ASSWID= 0
##$AUNMP= <proc_1d>
##$AZFE= 0.1
##$AZFW= 0.1
##$BCFW= 0
##$BC_mod= 0
##$BYTORDP= 0
##$COROFFS= 0
##$CY= 12.5
##$DATMOD= 1
##$DC= 0
##$DFILT= <>
##$DTYPP= 0
##$F1P= 14.0000005364418
##$F2P= -0.99999901652339
##$FCOR= 0.5
##$FTSIZE= 32768
##$FT_mod= 6
##$GAMMA= 0
##$GB= 0
##$INTBC= 1
##$INTSCL= 1
##$ISEN= 128
##$LB= 0.3
##$LEV0= 0
##$LPBIN= 0
##$MAXI= 10000
##$MC2= 0
##$MEAN= 0
##$ME_mod= 0
##$MI= 0
##$NCOEF= 0
##$NC_proc= -5
##$NLEV= 6
##$NOISF1= 0
##$NOISF2= 0
##$NSP= 0
##$NTH_PI= 0
##$NZP= 0
##$OFFSET= 16.522
##$PC= 1
##$PHC0= -79.8177
##$PHC1= 9.494161
##$PH_mod= 1
##$PKNL= yes
##$PPARMOD= 0
##$PSCAL= 4
##$PSIGN= 0
##$REVERSE= no
##$SF= 250.13
##$SI= 32768
##$SIGF1= 0
##$SIGF2= 0
##$SINO= 400
##$SIOLD= 32768
##$SREGLST= <1H.DMSO>
##$SSB= 0
##$STSI= 32768
##$STSR= 0
##$SW_p= 5175.98343685301
##$SYMM= 0
##$S_DEV= 0
##$TDeff= 65536
##$TDoff= 0
##$TI= <Analysis number 999999
Compound Code 99
Book Reference 9
Project Code 9>
##$TILT= no
##$TM1= 0
##$TM2= 0
##$TOPLEV= 0
##$USERP1= <user>
##$USERP2= <user>
##$USERP3= <user>
##$USERP4= <user>
##$USERP5= <user>
##$WDW= 1
##$XDIM= 32768
##$YMAX_p= 271018605
##$YMIN_p= -638717
$$ End of Bruker specific parameters
$$ ---------------------------------
##NTUPLES= NMR SPECTRUM
##VAR_NAME=  FREQUENCY,     SPECTRUM/REAL,   SPECTRUM/IMAG
##SYMBOL=    X,             R,               I
##VAR_TYPE=  INDEPENDENT,   DEPENDENT,       DEPENDENT
##VAR_FORM=  AFFN,          ASDF,            ASDF
##VAR_DIM=   32768,         32768,           32768
##UNITS=     HZ,            ARBITRARY UNITS, ARBITRARY UNITS
##FACTOR=    0.157963299565203, 1,           1
##FIRST=     4132.6476996994, 0,             0
##LAST=      -1043.33573715361, 0,           0
##MIN=       -1043.33573715361, -638717,     0
##MAX=       4132.6476996994, 271018605,     0
$$ Real data points
##PAGE= N=1
##DATA TABLE= (X++(R..R)), XYDATA
$$ [...]
24019D23281j86709k60348p4326j64731P421j1183Q129J81682p9287j34003q2680
$$ 423281 236572 -23776 -98102 -262833 -255412 -266595 -258466 -76784 -156071 -290074 -372754
24008c72754J16893R5113O0654Q054K9706J07798Q1442R574n832R632j03341P8791
$$ -372754 -255861 -160748 -100094 -92040 -62334 45464 126906 136480 130648 140280 36939 115730
23996A15730M1435r3243Q9403J3865J32482p8899l4300j7242K1312j13805p8359
$$ 115730 157165 63922 153325 167190 299672 220773 186473 169231 190543 76738 -1621
23985a621L8491R4193k74739k6142M5740o3307j1030m7649J26047l7009O6860
$$ -1621 36870 131063 -143676 -169818 -124078 -187385 -198415 -246064 -120017 -157026 -90166
23974i0166R2075j41589j40984n6651K88071J99191O3231k0160j47116k91013
$$ -90166 1909 -139680 -280664 -337315 -49244 149947 213178 193018 45902 -245111
23964b45111n5928N3532J47107j6968o5565K0116Q9215O1531N1390o249p7943
$$ -245111 -301039 -247507 -100400 -117368 -182933 -162817 -73602 -12071 39319 33070 -44873
23953d4873j05842m0850R4194K0992p4731J25086J94653O6615m8919p7490m6543
$$ -44873 -150715 -191565 -97371 -76379 -151110 -26024 168629 235244 186325 108835 62292
23942F2292r5155J8264M7392n9877j11256J12456K69210N5074r1754j11477j04218
$$ 62292 -32863 -14599 32793 -27084 -138340 -25884 243326 298400 206646 95169 -9049
23931i049l5657o6936J29386J71487j83451k35806j17554M1285K42888j7683l4232
$$ -9049 -44706 -111642 17744 189231 5780 -230026 -347580 -306295 -63407 -81090 -115322
23920a15322L4699O24Q5891J21890M9257j66486J05686k6924Q499k7571n1827
$$ -115322 -80623 -79999 5892 127782 177039 10553 116239 89315 97814 70243 18416
23909A8416j61608l9387j13969m4300J89352R2878O526j93880j43521J05828J19355
$$ 18416 -143192 -182579 -296548 -340848 -151496 -58618 -52092 -245972 -389493 -283665 -164310
23898a64310j7205m7040r7411R580J08869J11482J01008J13950M4586r2730l004
$$ -164310 -181515 -228555 -325966 -316386 -207517 -96035 4973 118923 163509 70779 67775
23887F7775J45169m3960j05806j2480p1797j10291q0786M3304Q6310M8864O5992
$$ 67775 212944 168984 63178 50698 -21099 -131390 -212176 -168872 -82562 -33698 32294
23876C2294k980j11283n2316M8372P8123m9203j02783J15356Q6843N8232o3060
$$ 32294 29314 -81969 -134285 -85913 -7790 -56993 -159776 -44420 42423 100655 37595
23865C7595q0158p4194O8274o804n2178j16831m2961J11318J79853J17798J14206
$$ 37595 -42563 -116757 -48483 -55287 -107465 -224296 -267257 -155939 23914 141712 255918
23854B55918J24499k71163j34894L6645l1304j9043o040p5870l003R0296K9199
$$ 255918 380417 109254 -25640 11005 -20299 -39342 -45382 -121252 -124255 -33959 -4760
23843d760j1228M4062M4499n7878j79898j18804l7038N0973K10464J49209M1575
$$ -4760 -15988 28074 72573 14695 -165203 -284007 -321045 -270072 -59608 89601 131176
23832A31176r8854j31116j17771m030K35383M0215n4431k14974k9608J21516J69539
$$ 131176 32322 -98794 -216565 -220595 14788 55003 572 -214402 -244010 -122494 47045
23821D7045J20783m7862j71961n8762o4281J25409J71737l7064k93396M7367J5405
$$ 47045 167828 119966 -51995 -110757 -175038 -49629 122108 85044 -208352 -160985 -145580
23810a45580m009J45958n7013j05562J13316J29880r1282k39308n1394J62429
$$ -145580 -149589 -3631 -60644 -166206 -52890 76990 -14292 -253600 -304994 -142565
23800a42565K43084M9265k62181n3676M1939p2386p6057J42192J20691l3333L1030
$$ -142565 100519 149784 -112397 -166073 -124134 -196520 -272577 -130385 -9694 -43027 -11997
23789a1997j64416j24400J4179J26800J11094j29554n0219p730O1108L6908k8600
$$ -11997 -176413 -300813 -286634 -159834 -48740 -178294 -228513 -236243 -175135 -138227 -166827
23778a66827J85184J82777J8413o1988j53376j37460J08744o1370k2328J12618
$$ -166827 18357 201134 219547 157559 4183 -133277 -24533 -85903 -108231 4387
23768D387K3417j19846J8076j394q103J39190k6021n9793m7130o8283P2311l6879
$$ 4387 27804 -92042 -73966 -75360 -83463 55727 29706 -30087 -77217 -145500 -73189 -110068
23756a10068n0323q4514J7708J07036J03859j84295N7713K04440R6443J0942j33492
$$ -110068 -160391 -244905 -227197 -120161 -16302 -200597 -142884 61556 157999 168941 35449
23745C5449j07322m0889M0687J25737m4158j38919K4758J28360O7605l9414o2384
$$ 35449 -71873 -112762 -72075 53662 9504 -129415 -104657 23703 91308 51894 -10490
23734a0490r0223o8303R9673J35458j18466q7598n5301l9550N532L4775N8791
$$ -10490 -100713 -169016 -69343 66115 -52351 -139949 -195250 -234800 -229268 -194493 -135702
23723a35702J05849J9746Q5215Q6486n2105J44591J26333j0302L4585K21417j12404
$$ -135702 -29853 -10107 75108 161594 109489 254080 380413 370111 404696 626113 513709
23712E13709l4432J40044m0572k37564j53474J6112J88655k08249k27062n7351
$$ 513709 479277 619321 578749 341185 187711 203823 392478 184229 -42833 -100184
23702a00184J38105M8081p2612k989j7835j2274r579k4515J05823R9830l161p6299
$$ -100184 37921 86002 13390 10401 -7434 -19708 -29287 -53802 52021 151851 148690 72391
23690G2391j26568j10669R9721J04281J22493k777j79699j01410q818J27394N8549
$$ 72391 -54177 -164846 -65125 39156 161649 158872 -20827 -122237 -131055 -3661 54888
23679E4888J4022k8178q872J18106O6885j14900N9184O4268j55440j78071m2627
$$ 54888 68910 40732 31860 149966 216851 101951 161135 225403 69963 -108108 -150735
23668a50735J3747J29832L1167o5323L032p3533N1453k4340o7944N7981o6699
$$ -150735 -136988 -7156 24011 -41312 -38280 -111813 -60360 -84700 -152644 -94663 -161362
23657a61362o8845j3151J06783p921R7231n9355j20684J54688O5047k04451o3897
$$ -161362 -230207 -243358 -136575 -144496 -47265 -106620 -227304 -72616 -7569 -212020 -275917
23646b75917Q8409K1957n6991m4056N695J54658Q8922j1473p0980L0054J50299
$$ -275917 -187508 -165551 -222542 -266598 -260903 -106245 -17323 -28796 -99776 -69722 80577
23635H0577j0080L3265K5446R4678K7157r2680M1083j49283k98813m8657K08047
$$ 80577 70497 103762 129208 223886 251043 158363 199446 50163 -248650 -297307 -89260
23624h9260J33378n0988o4734O8415J2951J22821l7097k02989j42580L3120K07069
$$ -89260 44118 -6870 -71604 -3189 9762 132583 95486 -107503 -250083 -216963 -9894
23613i894l5900R816r6096q5648J06756M0515L642P1023M8687K9870p5256n5401
$$ -9894 -45794 -35978 -132074 -217722 -110966 -70451 -66809 4214 52901 82771 7515 -47886
23601d7886j41415J41214K69840K12230R6111l52222n9847j46727j29990J47621
$$ -47886 -189301 -48087 221753 433983 530094 177872 118025 -28702 -158692 -11071
23591a1071L4916M3969j13666O876R752K3132J124R879J12278L8565j22528j39716
$$ -11071 23845 67814 -45852 -38976 -29224 -6092 -4968 4911 117189 155754 33226 -106490
23579a06490J6553P6745M8464k00531m4560j05521L4598J24449K12584q0938k49274
$$ -106490 -89937 -13192 35272 -165259 -209819 -315340 -280742 -156293 56291 -24647 -273921
23568b73921k1355K11961J15733l4986R995k6803l28618J2001J17473J70027L3934
$$ -273921 -295276 -83315 32418 -2568 7427 -19376 -347994 -335993 -218520 -48493 -14559
23557a4559k1225L5105Q3476K16571K87764j95338j81263j32110j62938r265R1559
$$ -14559 -35784 -679 82797 299368 587132 391794 210531 78421 -84517 -93782 -2223
23546b223m8489L0557l9437L6382J44525r5570N1444J08421L5945k2354q322k3050
$$ -2223 -50712 -20155 -59592 -23210 121315 25745 77189 185610 221555 199201 190879 167829
23534A67829j57436P2972n8284j70561q3262k11650N8328K28517P0509k9031O9752
$$ 167829 10393 83365 25081 -145480 -228742 -440392 -382064 -153547 -83038 -112069 -42317
23523d2317R1923j17866O9018m0030m8674P7761q6610j19912N2625o6725J62041
$$ -42317 49606 -68260 758 -39272 -87946 -10185 -96795 -216707 -164082 -230807 -68766
23512f8766J34841K3629l3154l9057O2647J24102j26162j1644K19725p3621k97298
$$ -68766 66075 89704 56550 17493 80140 204242 78080 66436 286161 212540 -84758
23501h4758j91517j7487J11324L6215J06028m8957L4109Q524J6810r1006j1699
$$ -84758 -276275 -293762 -182438 -146223 -40195 -89152 -55043 -46519 -29709 -120715 -132414
23490a32414p5587O7628N6344k7994J54023L6145r033o7990p3072r5980P8022
$$ -132414 -208001 -140373 -84029 -112023 42000 78145 69112 1122 -71950 -167930 -89908
23479h9908J04631Q7290p1537p7219k2900J11712J3594r0767k12877n5845J46068
$$ -89908 14723 102013 30476 -46743 -69643 42069 55663 -35104 -247981 -303826 -157758
23468a57758J17127m55k31519j07543J16322J8967K9777o4109m9512J52793K43915
$$ -157758 -40631 -41086 -272605 -380148 -263826 -244859 -215082 -279191 -328703 -175910 68005
23457F8005J21185k3116j08796L8474M0478j80538j09916J01298J50779L6056
$$ 68005 189190 166074 57278 95752 136230 -44308 -154224 -52926 97853 133909
23447A33909o8394j27981K960Q2075j15853j16216n4928J0543M7355N6673O7162
$$ 133909 65515 -62466 -59506 22569 -93284 -209500 -264428 -253885 -206530 -149857 -82695
23436h2695J34617k7750l0838K0884M550K50261k2060j02458k9587j39801o3028
$$ -82695 51922 24172 -6666 14218 18768 269029 246969 144511 114924 -24877 -87905
23425h7905n3659m3353J68070l4321Q0131M4267o9953q275L9334J03392J8062
$$ -87905 -141564 -184917 -16847 -51168 28963 73230 3277 -4998 34336 137728 155790
23414A55790P728M2254P0763j28382j36641k0180O4862P6404o7685K705p7506
$$ 155790 163518 205772 276535 148153 11512 -8668 56194 132598 64913 67618 -9888
23403i888j08368J2708R3189j36441P5385m4502l3797j606K10519Q0328K7182
$$ -9888 -118256 -105548 -12359 -148800 -73415 -117917 -151714 -153320 57199 137527 164709
23392A64709j7060M3625j64192j99188J5537J27814j13463J40920J00375q9106
$$ 164709 147649 191274 27082 -172106 -156569 -28755 -142218 -1298 99077 9971
23382I971j6217K0616j06285l777J26044J14840o4975j11553j36552n9543Q1760
$$ 9971 -6246 14370 -91915 -95692 30352 145192 80217 -31336 -167888 -227431 -145671
23371a45671K16667K10217M654n4890j39827n5697L2876o7830j086m1051M3380
$$ -145671 70996 281213 285867 230977 91150 35453 68329 499 -587 -41638 1742
23360A742L1690R3980j7198J0592n1235L1475j8417j00695l1856j2164j3925j82394
$$ 1742 33432 127412 110214 120806 69571 101046 82629 -18066 -49922 -62086 -76011 -258405
23348b58405J4222K01403r7350j54362J37313P6291M2208J24621j67163k07081
$$ -258405 -244183 -42780 -140130 -294492 -157179 -80888 -38680 85941 -81222 -288303
23338b88303N3592K37619j3646q8586L1324k2513O0600J3118J43642m9130L0799
$$ -288303 -234711 2908 -10738 -99324 -68000 -90513 -29913 -16795 126847 77717 108516
23327A08516J31174k3446j11879m2311l8777K0378J0722j10683M865M8957o9718
$$ 108516 239690 216244 104365 62054 23277 43655 54377 -56306 -51441 -2484 -72202
23316g2202q4929L9839K1270O117j51843m0448J26671J72111J56984p3376j44676
$$ -72202 -157131 -117292 -96022 -89905 -241748 -282196 -155525 16586 173570 100194 -44482
23305d4482p5116J4013O6975P8149j06493l6855N4775l6928p2061O9894J7169
$$ -44482 -119598 -105585 -38610 39539 -66954 -103809 -49034 -85962 -158023 -88129 -70960
23294g0960q2856J95509r6217j38001q7430J23375j7665p0333M1983K63546J1813
$$ -70960 -153816 41693 -54524 -192525 -279955 -156580 -174245 -244578 -202595 60951 72764
23283G2764o2661R8451J55952J620o3619j38861J24039J0788j83777L1259j25036
$$ 72764 10103 108554 264506 266126 202507 63646 187685 198473 14696 45955 -79081
23272g9081L0885J30037J15391J58021j4221j03698j64849k47725k5311R5838
$$ -79081 -48196 81841 197232 355253 341032 237334 72485 -175240 -200551 -104713
23262a04713o5698J44967K25879k4831j29372R922r2397j42811J83441R0243R5443
$$ -104713 -170411 -25444 200435 175604 46232 56154 -36243 -179054 4387 94630 190073
23251A90073r7660J6540q4791J21313Q6898J7711J0386O1894k19770k51409M6840
$$ 190073 92413 108953 24162 145475 232373 250084 260470 322364 102594 -148815 -101975
23240a01975K42187j2478j31808J07936j0306j32929k16666k2831J84212J41269
$$ -101975 140212 127734 -4074 103862 93556 -39373 -256039 -278870 -94658 46611
23230D6611J24105q4818n8286l6889j01628L3314K49668J34650P1142L2224j63479
$$ 46611 170716 85898 27612 -9277 -110905 -77591 172077 306727 377869 410093 246614
23219B46614j04868J1103Q1849j18756L1715j08585L6114N2884L7954j55102j89454
$$ 246614 141746 152849 234698 115942 147657 39072 75186 128070 166024 10922 -178532
23208a78532j3915J46611M6100o8272K9065P6234k3300j73570q6580J5778J3956
$$ -178532 -192447 -45836 264 -68008 -38943 37291 13991 -159579 -246159 -230381 -216425
23197b16425J14592J36298j17483q2174J43174R9189K186q1073n7776j67945K1196
$$ -216425 -101833 34465 -83018 -165192 -22018 77171 79357 -1716 -59492 -227437 -206241
23186b06241J21077o8607k526j22539J06269O1331L4365J60414L5298J5766Q0060
$$ -206241 -85164 -153771 -156297 -278836 -172567 -111236 -76871 83543 118841 134607 214667
23175B14667m2769j54572l1130J21189l5630Q1055j26597j41515l8309O8120O3079
$$ 214667 171898 17326 -13804 107385 71755 152810 26213 -115302 -153611 -85491 -22412
23164b2412k354n8956r426p4162q93R6692R1003K4512o9288j3524o3206j0891
$$ -22412 -24766 -83722 -93148 -167310 -168203 -71511 19492 44004 -25284 -38808 -102014 -112905
23152a12905K0150J07735J02461p6084j03927J33829J4283j89251M9053n3562
$$ -112905 -92755 14980 117441 41357 -62570 71259 85542 -103709 -54656 -108218
23142a08218J56596j4998o1926o0545O4504j45920j29814O7597J19900R9014J00559
$$ -108218 48378 33380 -28546 -89091 -24587 -170507 -300321 -232724 -112824 -13810 86749
23131H6749k1073M6460J01220j64765l5267J3523l516j37655P3648J08370j0473
$$ 86749 65676 112136 213356 48591 13324 26847 23331 -114324 -40676 67694 57221
23120E7221k3992o023k2799K3566Q8745L1205l4264J1563P162J33131J59150M3520
$$ 57221 33229 27206 4407 27973 116718 147923 113659 125222 132384 265515 424665 468185
23108D68185k9913j95725k14141o3136J3588R006J84356N2332j5780j54531j35280
$$ 468185 438272 242547 28406 -34730 -21142 -12136 172220 224552 208772 54241 -81039
23097h1039j66000J06542K51945p9572j9946N6593K3151n1454L8016n022j11296
$$ -81039 -247039 -140497 111448 31876 11930 68523 91674 40220 78236 73214 -38082
23086c8082k05616l6044O3856J07200Q7219J6533L5664K6127P772O8106l720N8136
$$ -38082 -243698 -279742 -215886 -108686 -21467 -4934 30730 56857 64629 132735 129015 187151
23074A87151l1736j48552j7738j08992Q087O4737M9840p3481j11852p1180K10216
$$ 187151 155415 6863 -10875 -119867 -111780 -47043 2797 -70684 -182536 -253716 -43500
23063d3500K96701j6022k87745j67383j2266N6083L3999J694J10807J5237j31399
$$ -43500 253201 237179 -50566 -217949 -230215 -174132 -140133 -138439 -27632 -12395 -143794
23052a43794l4558k6342p9253N0417J24072J48538J45598K269o3753M4426J45852
$$ -143794 -178352 -204694 -283947 -233530 -109458 39080 184678 186947 123194 167620 313472
23041C13472L4374O0090j89224j61851K9176K8219j19491j63516J7872q9323O3064
$$ 313472 347846 407936 218712 56861 86037 114256 -5235 -168751 -150879 -240202 -177138
23030a77138J26842M8244p404J49310P187k06570q463P4705j2030J64269J66664
$$ -177138 -50296 -2052 -9456 139854 147041 -59529 -67992 6713 -5317 158952 325616
23019C25616j65084l12940j78764O934J00979R9867J07459K302O0532l0884j50470
$$ 325616 160532 -152408 -331172 -324238 -223259 -123392 -15933 -13631 46901 16017 -134453
23008a34453J52778J91349r4059j53675p7684J00929R9007q910J14604j22158
$$ -134453 18325 209674 115615 -38060 -115744 -14815 84192 75282 189886 67728
22998F7728j84706J14820M7103L0523J5414k769j98536k8026K87955P9115m5798
$$ 67728 -116978 -2158 44945 75468 90882 88113 -110423 -138449 149506 228621 182823
22987A82823P2236l3246j25114J85931p1553o7461N0426R0344k45610k23888j51773
$$ 182823 255059 221813 96699 282630 211077 143616 194042 284386 38776 -185112 -336885
22976c36885O0280K9504k7367J19438p1419j52627n3912J58339k0911O6687J13223
$$ -336885 -276605 -247101 -274468 -155030 -226449 -379076 -432988 -274649 -295560 -228873 -115650
22965a15650N2493J30801R76n8501J20878l2689j96600j70288p4525J29884J61374
$$ -115650 -63157 67644 68620 10119 130997 98308 -98292 -268580 -343105 -213221 -51847
22954e1847J0999j72429M3557J09601R1693M4856L0983j32798n2690N5622J22328
$$ -51847 -40848 -213277 -169720 -60119 31574 76430 107413 -25385 -78075 -22453 99875
22943I9875M5492j00979j37845O4209J48069J5502m6976P5418L5161J3167k97464
$$ 99875 145367 44388 -93457 -29248 118821 134323 87347 162765 197926 211093 -86371
22932h6371J8743J18897p2280p0953M6514j01030n6010M9709J08663J28008N3004
$$ -86371 -67628 51269 -21011 -91964 -45450 -146480 -202490 -152781 -44118 83890 136894
22921A36894j3992l348j55256r4048J09422K2120k4590k0624L178R3632K1442
$$ 136894 122902 119554 -35702 -129750 -20328 1792 -22798 -43422 -40244 53388 74830
22910G4830j30355P3438J07095l3990P0446p6263l5634r8274J8876M3981R2432
$$ 74830 -55525 17913 125008 91018 161464 85201 49567 -48707 -29831 14150 106582
22899A06582j57715j47368K1201J6075J05737J3203N0233j50712k2881M0612n8817
$$ 106582 -51133 -198501 -177300 -161225 -55488 -42285 7948 -142764 -165645 -125033 -183850
22888a83850J67962M9036m9271J6548N8570j2446l2342q8982q1941p6582k37825
$$ -183850 -15888 33148 -16123 425 58995 46549 14207 -74775 -156716 -233298 -471123
22877d71123j3785J83469L28878J15923P8230p8994J36782K9982r4276l8905K02005
$$ -471123 -484908 -301439 27439 143362 221592 142598 279380 309362 215086 176181 378186
22866C78186M8274j13349p7j18877j61281l4678q1582q1093n8059O5495N3227
$$ 378186 426460 313111 313034 194157 32876 -1802 -83384 -164477 -222536 -157041 -103814
22855a03814r7487q891J17723O8433j8516M8798J71178K8573k349q3374m0532
$$ -103814 -201301 -210192 -92469 -24036 -42552 6246 177424 205997 203648 120274 79742
22844G9742R8872J68230j49047k01244j2060P6781L2728J3765J7401R6373m3483
$$ 79742 178614 346844 197797 -3447 -15507 61274 94002 107767 125168 221541 178058
22833A78058j11114r76O9876o7840q4064M1348q1065r7215K17693r2547j46572
$$ 178058 66944 65968 135844 68004 -16060 25288 -55777 -152992 64701 -27846 -174418
22822a74418M564N4725J27927J43492j53161j28766K0614J14347J83680j85894
$$ -174418 -169854 -115129 12798 156290 3129 -125637 -105023 9324 193004 7110
22812G110k07083j26051Q5188L8850N4435j32342k2006R6438J08996o6922O8661
$$ 7110 -199973 -326024 -240836 -201986 -147551 -279893 -301899 -205461 -96465 -163387 -94726
22801i4726P5809J41647j5776r3052j58314k5249J00588J03638L281l789j25693
$$ -94726 -18917 122730 106954 13902 -144412 -169661 -69073 34565 37846 34057 -91636
22790i1636n0882n2136M7877m7183k9386j4010j2873R7560J51369j16865j73968
$$ -91636 -142518 -194654 -146777 -193960 -223346 -237356 -250229 -152669 -1300 -118165 -292133
22779b92133j54024Q3916J55910J24924J97834O6080n7554j54860K0687j6185
$$ -292133 -446157 -362241 -206331 -81407 116427 182507 124953 -29907 -9220 -25405
22769b5405M1720L9366j15898J30293M3692n2755k9944k7234O1808k247q8783
$$ -25405 16315 55681 -60217 70076 113768 61013 31069 3835 65643 63396 -25387
22758b5387L2120j81438j05298J19491K37410l3996l98L7721j4752Q0123P5973
$$ -25387 6733 -174705 -280003 -160512 76898 42902 42504 80225 65473 145596 221569
22747B21569j03056j99902n2856J38991j2201j3460j9030r91K4647j292R71o3688
$$ 221569 118513 -81389 -134245 4746 -7455 -20915 -39945 -40936 -16289 -17581 -16610 -80298
22735h0298K3533q5446O007Q2481J11271q0740N6931m4234j72303j0040O9897
$$ -80298 -56765 -142211 -136204 -53723 57548 -23192 33739 -10495 -182798 -192838 -122941
22724a22941j8261J58537K8825j33466L7908l357R9046N5981l0847j260J6144
$$ -122941 -141202 17335 46160 -87306 -49398 -52755 46291 102272 71425 70165 86309
22713H6309q0629k8994k5888m2749j4043j7550K39964j58758k07370L8003n4519
$$ 86309 5680 -23314 -49202 -91951 -105994 -123544 116420 -42338 -249708 -211705 -266224
22702b66224n2020M9406J29923P2776J5776J46416o0629j64687j26200l0563M3702
$$ -266224 -318244 -268838 -138915 -66139 -50363 96053 35424 -129263 -255463 -286026 -242324
22691b42324K6094k613J16583J8272O783O0450o2022p9898p5170o6813o0605J68155
$$ -242324 -216230 -218843 -102260 -83988 -77205 -16755 -78777 -158675 -233845 -300658 -361263 -193108
22679a93108L675m828R1839R589m3659q5493n1055J45350O0146j0095n7581N2813
$$ -193108 -189433 -194261 -102422 -92833 -136492 -221985 -273040 -127690 -67544 -77639 -135220 -82407
22667h2407O0722n0577p571n7652k2160N1551L5644j45231k12949m7334J18959
$$ -82407 -21685 -72262 -79833 -137485 -159645 -108094 -72450 -217681 -430630 -477964 -359005
22656c59005R9827K60932Q0447O4585k34642m0244K6421O2349J01081M7781j58977
$$ -359005 -259178 1754 82201 146786 -87856 -128100 -101679 -39330 61751 109532 -49445
22645d9445p5533m4035R7357J56851J80013l3747j58715K8081p1584j9185j31441
$$ -49445 -124978 -169013 -71656 85195 265208 231461 72746 100827 29243 10058 -121383
22634a21383m5725J89264j04154j96666L1866O205R4908J40644J35011j16512
$$ -121383 -167108 22156 -81998 -278664 -246798 -240593 -145685 -5041 129970 13458
22624A3458p5291N432P1279o5988L3263N502j12763j51057J46799K06530L5434
$$ 13458 -61833 -56401 14878 -51110 -17847 -12345 -125108 -276165 -129366 77164 112598
22613A12598n3068J8318p2491O1531P9925q7076j32315N538O5440k0367j06702
$$ 112598 59530 77848 5357 66888 146813 59737 -72578 -67040 -1600 -21967 -128669
22602a28669m6981K5256K06898O9243j14989k65271j07340k5723K95055J5733
$$ -128669 -175650 -150394 56504 125747 10758 -254513 -361853 -387576 -92521 -76788
22592g6788o0644o5983P3324J37319M8206p3131j06845O928j65249r5269Q6142
$$ -76788 -137432 -203415 -130091 7228 55434 -17697 -124542 -117614 -282863 -378132 -291990
22581b91990J77861J49333k23068K733O8751R042j3291P0926J0261K4022l7444
$$ -291990 -114129 35204 -187864 -185131 -116380 -107338 -120629 -49703 -39442 -15420 -52864
22570e2864j14937m5236O8853J36716R8874m9179R435j38800q1183K5593P9373
$$ -52864 -167801 -213037 -144184 -7468 91406 42227 51662 -87138 -168321 -142728 -63355
22559f3355L4476k7960J4477p8646m0928j2295p1803j24028O0287R4807Q6126
$$ -63355 -28879 -56839 -42362 -121008 -161936 -174231 -246034 -370062 -309775 -214968 -128842
22548a28842R6462m3281L8616J50595O9433M8913p4918j37142q796J50145o2534
$$ -128842 -32380 -75661 -37045 113550 182983 231896 156978 19836 11040 161185 98651
22537I8651j75165P0989J28072o8594K6825j28788L501r069j09713k1712M789
$$ 98651 -76514 -5525 122547 53953 80778 -48010 -44509 -53578 -163291 -185003 -180214
22526a80214L8596O3453J13253l4680j50287n8574R4450K9490j32368P7481j17530
$$ -180214 -141618 -78165 35088 408 -149879 -208453 -114003 -84513 -216881 -139400 -256930
22515b56930k12181M9769J20075l6076Q1026J68366Q9781q5515N2437R8941J18947
$$ -256930 -469111 -419342 -299267 -335343 -254317 -85951 3830 -81685 -29248 69693 188640
22504A88640j20902j97828l1831Q5153J9703O1522L6653J58345J6494r4812J16425
$$ 188640 67738 -130090 -161921 -76768 -57065 4457 41110 199455 215949 121137 237562
22493B37562j3755k09824K0496p0199j32012n5585Q860j53305J6985K0646j02626
$$ 237562 223807 13983 34479 -35720 -167732 -223317 -214457 -367762 -350777 -330131 -432757
22482d32757n789J04354P0957O3530J1790N2755m3697j15010O0656J07838J66391
$$ -432757 -438546 -334192 -263235 -199705 -187915 -135160 -178857 -293867 -233211 -125373 41018
22471D1018O0585q6764l0819o0615r9174l1805M6748M3542k0237k9521K91942
$$ 41018 101603 14839 -15980 -76595 -175769 -207574 -160826 -117284 -137521 -167042 124900
22460A24900P5409k44707j86591R0557K15985K9782j29460j91955o9179N3654
$$ 124900 200309 -44398 -230989 -140432 75553 105335 -24125 -216080 -285259 -231605
22450b31605j7352J0955J40494P9064k679K4611r0063p0169R5544m4460q7897
$$ -231605 -248957 -238002 -97508 -18444 -21123 3488 -86575 -156744 -61200 -105660 -193557
22439a93557q5417K68927M4183j34436q9115M7389K10802J20587J51423j90864
$$ -193557 -278974 -10047 34136 -100300 -189415 -142026 68776 189363 340786 149922
22429A49922j19936p732o6196l00468M936l6442M8208P9967R6312M4182K0012
$$ 149922 29986 22254 -43942 -344410 -339474 -375916 -327708 -247741 -151429 -107247 -87235
22418h7235P195j41136J9385M3583Q22Q4350J88101Q3448j22429r4271N7010L6467
$$ -87235 -80040 -221176 -201791 -158208 -157386 -73036 115065 198513 76084 -18187 38823 75290
22406G5290J6858j72534K1175J77770P0360j59655P952j6617q0287j41954r7156
$$ 75290 92148 -80386 -59211 118559 188919 29264 37216 20599 -59688 -201642 -298798
22395b98798J12726O0137R5039l6289K4216l0782k5813p8824J4292L7463J8860
$$ -298798 -186072 -125935 -30896 -67185 -42969 -73751 -99564 -178388 -164096 -126633 -107773
22384a07773o540o1319j0065O7270P4722n4894R7745J30272l8921j75872k35958
$$ -107773 -114313 -175632 -185697 -118427 -43705 -98599 -854 129418 90497 -85375 -321333
22373c21333J48402J47516l2965j16940Q79J5745j8695J7874N7722l9370l2285
$$ -321333 -172931 -25415 -58380 -175320 -174441 -158696 -177391 -159517 -101795 -141165 -173450
22362a73450j6070L2433j3241J13550R6507P1369N4127m7366k0971l0208p6677
$$ -173450 -189520 -157087 -170328 -56778 39729 111098 165225 117859 96888 66680 -9997
22351i997J9709m770j03134J1776N0390L9971K5765n7307J4243N9563j18857j59369
$$ -9997 9712 4942 -98192 -86416 -36026 3945 29710 -27597 -13354 46209 -72648 -232017
22339b32017L4620N9602L9392O753m105P4860L517n922k0642o2121R0616L2500
$$ -232017 -197397 -137795 -98403 -91650 -95755 -20895 -17378 -23300 -43942 -106063 -15447 17053
22327A7053j4338J1031K2847M4359j16324o3591K5243J27145m4404R105J20514
$$ 17053 2715 13746 36593 80952 -35372 -98963 -73720 53425 9021 18126 138640
22316A38640N2004P441j47551j19729P5774J54074P7016l8883j14705J41288o8548
$$ 138640 190644 198085 50534 -69195 6579 160653 237669 198786 84081 225369 156821
22305A56821k84474n6238K09752J55002j14566K6238o2552k30945q5660K48735
$$ 156821 -127653 -183891 25861 180863 66297 92535 29983 -200962 -286622 -37887
22295c7887J78645n6005l1843j01836L7454J23890J38189K5582n1804j96621j1120
$$ -37887 140758 84753 52910 -48926 -11472 112418 250607 276189 224385 27764 16644
22284A6644m2360p9725r0482J0989k3358J96859Q2084j32568j87913J18612K17352
$$ 16644 -25716 -105441 -195923 -184934 -208292 -11433 70651 -61917 -249830 -131218 86134
22273H6134K02j14607m4155J04380l6296q7059p3451j41720M7427K03696N5584
$$ 86134 86336 -28271 -72426 31954 -4342 -91401 -164852 -306572 -259145 -55449 135
22262A35j44694j45324p2485M7064j12498J4224J26831j17951j00162Q1465J63878
$$ 135 -144559 -289883 -362368 -315304 -427802 -413578 -286747 -404698 -504860 -423395 -259517
22251b59517l0843n358J25483q6795K6643j0791Q3659M7600j88031p166K50698
$$ -259517 -290360 -295718 -170235 -257030 -230387 -241178 -157519 -109919 -297950 -305116 -54418
22240e4418n6645j33130J39342j29767K861R5065m8576P3209q2330j20074J85372
$$ -54418 -111063 -244193 -104851 -234618 -231757 -136692 -185268 -112059 -194389 -314463 -129091
22229a29091J43749l7982N7840k2109P0818r186o3036j54135Q1105J4544j40042
$$ -129091 14658 -23324 34516 12407 83225 74039 11003 -143132 -62027 -47483 -187525
22218a87525j47462O2976N2990P2015J47182J0413j21598R7218L0571J29403O2586
$$ -187525 -334987 -272011 -219021 -147006 176 10589 -111009 -13791 16780 146183 208769
22207B08769q5229n1740L1434N0924O1402j59135k59351O4087M0889J07112N7797
$$ 208769 123540 71800 103234 154158 215560 56425 -202926 -138839 -97950 9162 66959
22196F6959K5533O4303j28481k21617o3934k7009m923J08138K63397L2916l4004
$$ 66959 92492 156795 28314 -193303 -257237 -284246 -289169 -181031 82366 115282 81278
22185H1278N578j57796q313q7990P2145N822J14995L590p5989r6620m7160Q8009
$$ 81278 86856 -70940 -79253 -167243 -95098 -89276 25719 29309 -46680 -143300 -190460 -102451
22173a02451O5057j03299J81250J76404P6298n9935r6386m0191j61423R0370l8627
$$ -102451 -37394 -140693 40557 216961 293259 233324 136938 96747 -64676 25694 -12933
22162a2933o8766Q0469O4539j03823l8456l1147M194J48195J77476P1668j11149
$$ -12933 -81699 -1230 63309 -40514 -78970 -110117 -105923 42272 219748 291416 180267
22151A80267p9779K6725J7138j67932Q8863r3387m0373Q5998N9432j28498j55257
$$ 180267 100488 127213 144351 -23581 65282 -28105 -68478 17520 76952 -51546 -206803
22140b06803m8600J55007J06114K1087m3066m9697J77445J21130q8597n4405o4099
$$ -206803 -255403 -100396 5718 26805 -16261 -65958 111487 232617 144020 89615 25516
22129B5516j73760n32K06022O8768k64235j43833r1989J57333J79431o8418l6038
$$ 25516 -148244 -148776 57246 126014 -138221 -282054 -374043 -216710 -37279 -105697 -141735
22118a41735m702L1254N5783k0433l13765j33021J68776J31774J09228l9029m1843
$$ -141735 -146437 -115183 -59400 -79833 -393598 -526619 -357843 -226069 -116841 -155870 -197713
22107a97713J63655R014n7173q952k2715j51280l2540J84904R9271J6l5271m3863
$$ -197713 -34058 -25044 -82217 -91169 -113884 -265164 -297704 -112800 -13529 -13513 -48784 -92647
22095i2647J4790K3112J07881M8048k1426j84590l0961J55089j3738q3167N1518
$$ -92647 -77857 -54745 53136 101184 79758 -104832 -135793 19296 5558 -77609 -26091
22084b6091l2516j45427r689R5995R1409m8649k4528j7708n0051Q3027K32095
$$ -26091 -58607 -204034 -213723 -117728 -26319 -74968 -99496 -117204 -167255 -84228 147867
22073A47867O4983j4062j55492j99183l6199J03761r583N8242l4030k3529l7597
$$ 147867 212850 198788 43296 -155887 -192086 -88325 -97908 -39666 -73696 -97225 -134822
22062a34822K0739k4616l7575P709j055N6498K7987M7951k016P1411M0578k5703
$$ -134822 -114083 -138699 -176274 -168565 -169620 -113122 -85135 -37184 -39200 32211 72789 47086
22050D7086p204R8046j13099m8924K988N6447M4667k9503J06855O54J5424j57450
$$ 47086 39882 137928 24829 -24095 -21107 35340 80007 50504 157359 158013 173437 15987
22038A5987j56118q3852j50828m295J71940q307J432J46558J18091j59362m3899
$$ 15987 -140131 -223983 -374811 -379106 -207166 -215473 -214041 -67483 50608 -108754 -152653
22027a52653R9268k458p2740j6975J42444M1972j6725j3120J5615j12111j58487
$$ -152653 -53385 -55843 -128583 -145558 -3114 38858 22133 9013 24628 -87483 -245970
22016b45970K7053K3006j86781K4386J92086M9918j0989J19230P378j21016M0381
$$ -245970 -218917 -195911 -382692 -358306 -166220 -116302 -127291 -8061 -683 -121699 -81318
22005h1318J5040q797j9710O202O5005N8855j58237j71199Q2693J64267K10920
$$ -81318 -66278 -75075 -94785 -88583 -23578 35277 -122960 -294159 -211466 -47199 163721
21994A63721j11688j40789N6857O6979J30281Q2007j29849j76472m0256J21722
$$ 163721 52033 -88756 -31899 35080 165361 247368 117519 -58953 -99209 22513
21984B2513J52057k7032p5441j2554j93465l2984J09046J12343Q7950l0606p6009
$$ 22513 174570 147538 72097 59543 -133922 -166906 -57860 54483 142433 111827 35818
21973C5818k86324M1930l9086J36154N6966m8204q718L9538J17255L2292J6812
$$ 35818 -250506 -208576 -247662 -111508 -54542 -102746 -111464 -71926 45329 77621 94433
21962I4433O6936K538j11398r8335M4371M6233o1028n5055P5629J29353o4247
$$ 94433 161369 163907 52509 -45826 -1455 44778 -16250 -71305 4324 133677 69430
21951F9430Q38R8523P1j93267r0819J97609J94969o2420j50198k93236j55369
$$ 69430 70268 168791 168862 -24405 -115224 82385 277354 214934 64736 -228500 -383869
21940c83869r1352O8181K56602J61547Q7684J81861k7362j11527j92655l464r7965
$$ -383869 -475221 -407040 -150438 11109 98793 280654 253292 141765 -50890 -54354 -152319
21929a52319j73387J071N6334O4447m437q2271q9466k2695L5197J56879J51205
$$ -152319 -325706 -324635 -268301 -203854 -208291 -290562 -380028 -402723 -367526 -210647 -59442
21918e9442r2465k0047J2510m2175L1860J5572n6154Q9507J20313P030k49776
$$ -59442 -151907 -171954 -159444 -201619 -169759 -154187 -210341 -120834 -521 6509 -243267
21907b43267j56386J05727J28301R3882j50710n0895K17393J0715j43356N6896
$$ -243267 -399653 -293926 -165625 -71743 -222453 -273348 -55955 -45240 -188596 -131700
21897a31700K10592P5844r0490j4822j17126j53672K3021M4115N7500J18333q855
$$ -131700 78892 154736 64246 49424 -67702 -221374 -198353 -154238 -96738 21595 12740
21886A2740k02155k33817m8547J55192O7725R1341l410n3732j07855K2277Q3972
$$ 12740 -189415 -423232 -471779 -316587 -248862 -157521 -160931 -214663 -322518 -300241 -216269
21875b16269P1902M0911Q3812L5259O1427n4112j28866J63766m967q1599l6121
$$ -216269 -144367 -103456 -19644 15615 77042 22930 -105936 57830 52863 -28736 -64857
21864f4857K7382J2048l2049q6108J15186R1049o9431j82958m0930K29277J97376
$$ -64857 -37475 -25427 -57476 -143584 -28398 62651 -6780 -189738 -230668 -1391 195985
21853A95985j2118r5302L9313o9955n3998J9605L7788j00877N9847N0087o1531
$$ 195985 183867 88565 127878 57923 3925 23530 61318 -39559 20288 70375 8844
21842H844Q847r9980q1585J05288J11595N8314m54J30139J5150o9015N341j05050
$$ 8844 17691 -82289 -163874 -58586 53009 111323 110869 241008 256158 187143 192484 87434
21830H7434n1336n9637O9250L7793R7551m0033p8774J9063J4886q9771o3428n7520
$$ 87434 36098 -23539 45711 83504 181055 141022 62248 81311 96197 6426 -57002 -114522
21818a14522J28179O9209j48796J960o2796j43798r3618J13940J39738Q8405L4148
$$ -114522 13657 82866 -65930 -63970 -126766 -270564 -364182 -250242 -110504 -22099 12049
21807A2049j02995N0111l4126J30901N0401j64533L2545j20050j22268k2901J40406
$$ 12049 -90946 -40835 -74961 55940 106341 -58192 -25647 -145697 -267965 -290866 -150460
21796a50460J56215O3050k60966j17101Q645J45983K8103P8132j25106J8507K522
$$ -150460 5755 68805 -192161 -309262 -300617 -154634 -126531 -48399 -173505 -154998 -152476
21785a52476R7442Q3014K3136m6294q7464L9907J99861l768r2124J3471p5748
$$ -152476 -55034 27980 51116 4822 -82642 -42735 157126 153358 61234 74705 -1043
21774a043n8128J24109J9233K5345J2057p5207j72935K490K6581J41120K4140
$$ -1043 -59171 64938 84171 109516 121573 46366 -126569 -124079 -97498 43622 67762
21763F7762N7997j02900q5947L3144K05852P2185j11870J8359K6249r9333m5004
$$ 67762 125759 22859 -63088 -29944 175908 248093 136223 154582 180831 81498 36494
21752C6494p1681j39413Q6988J39126k3671j1893L722j754n0346k2401J60712
$$ 36494 -35187 -174600 -87612 51514 27843 15950 19672 17918 -32428 -54829 105883
21741A05883k892l5496j02501q5069J6197R9453O2332k4484k25506o3900M5875
$$ 105883 102991 67495 -35006 -120075 -103878 -4425 57907 33423 -192083 -255983 -210108
21730b10108L7303j44887j04106r9981J60424J71095R2899N2096j06261L5326
$$ -210108 -172805 -317692 -421798 -521779 -361355 -190260 -97361 -45265 -151526 -116200
21720a16200n13M1272m773M7191J47863L8426j06994l0336n1714J20410j11174
$$ -116200 -116713 -75441 -80214 -33023 114840 153266 46272 15936 -35778 84632 -26542
21709b6542o2012q5478P9548J11703n487M4531L7855l5061o1133m8561J69931
$$ -26542 -88554 -174032 -94484 17219 11732 56263 94118 59057 -2076 -50637 119294
21698A19294K4668O1774O0855j91312K8270o4940j01521n0543k7512O943N4001
$$ 119294 143962 205736 266591 75279 103549 38609 -62912 -113455 -140967 -134024 -80023
21687h0023R3459o0255j3322k6292j70466J6214K36345K92697O0628k80554k28866
$$ -80023 13436 -46819 -60141 -86433 -256899 -240685 -4340 288357 348985 68431 -160435
21676a60435K6678N0692O1571K4103j87616l4230J93507R5875j17071j4514j25112
$$ -160435 -133757 -83065 -21494 2609 -185007 -219237 -25730 70145 -46926 -61440 -186552
21665a86552L1216P983K7042m5962N7324p7190n8008N2028P4833j5440k2968L1403
$$ -186552 -155336 -147353 -120311 -166273 -108949 -186139 -244147 -192119 -117286 -132726 -155694 -124291
21653a24291J45746J28837k18576l5753l5686J6436l23m4746j8388k27329K32124
$$ -124291 21455 150292 -68284 -104037 -139723 -123287 -123610 -168356 -186744 -414073 -181949
21642a81949J91890l962m0107L699J14077r341L7638j41592o3386J1734M5563
$$ -181949 9941 5979 -34128 -30429 83648 74307 111945 -29647 -93033 -81299 -35736
21631c5736J47747P534o7549j10299k6534l4712P8571j12655r5470N6991J37835
$$ -35736 112011 119545 51996 -58303 -84837 -119549 -40978 -153633 -249103 -192112 -54277
21620e4277p5259j47802L6965N1058j20255j68985j06666K00301J13734J58153
$$ -54277 -129536 -277338 -240373 -189315 -309570 -478555 -585221 -384920 -271186 -113033
21610a13033P54l749k1490Q8437N4333N8552q147m4731q2104Q7642K31341o317
$$ -113033 -112279 -116028 -137518 -49081 5252 63804 55657 10926 -71178 16464 247805 241488
21598B41488j07980J11524q8861j39570j08857n7531J39320N0065n981Q3476N1426
$$ 241488 133508 245032 156171 16601 -92256 -149787 -10467 39598 33617 117093 168519
21587A68519j20428j75875M1856J55278J9468K4251j03999L1097O2280k42017
$$ 168519 48091 -127784 -85928 69350 88818 113069 9070 40167 102447 -139570
21577a39570j76197J45775K13659l7442j53144j12887J04921J29325n8498k35169
$$ -139570 -315767 -169992 43667 6225 -146919 -259806 -154885 -25560 -84058 -319227
21567c19227j23667J85676K41388L4529k32704j28086m2102K49187K79482k2106
$$ -319227 -442894 -257218 -15830 18699 -214005 -342091 -384193 -135006 144476 122370
21557A22370r9550j82819j17961J95273r0120K8704P9563K22047J19067j77980
$$ 122370 22820 -159999 -277960 -82687 -172807 -144103 -64540 157507 276574 98594
21547I8594p4094q6746q0320M7360J12619J04177p6367q5318j16834j2180J14717
$$ 98594 24500 -62246 -142566 -95206 17413 121590 45223 -40095 -156929 -169109 -54392
21536e4392O878j0129O3441J8965m4437p9663M7823J95750m8340j34327n1547
$$ -54392 -47514 -57643 5798 24763 -19674 -99337 -51514 144236 95896 -38431 -89978
21525h9978K3179o4245Q1348M0135O4839n7960m5131J00184l0367J6628J29893
$$ -89978 -66799 -131044 -49696 -9561 55278 -2682 -47813 52371 22004 38632 168525
21514A68525j24054p8941L1408o3565r6777J60451J5348o2251J7262K0087r4135
$$ 168525 44471 -34470 -3062 -66627 -163404 -2953 12395 -49856 -32594 -12507 -106642
21503a06642k1393J9998N3742N4674L4789R5676q2975N831O2199n9345K3840J61611
$$ -106642 -128035 -108037 -54295 379 35168 130844 47869 53700 115899 56554 80394 242005
21491B42005J05444j056n0796k09323M671K9937k11206r5411m8539n3481J86283
$$ 242005 347449 346393 295597 86274 90945 120882 -90324 -185735 -234274 -287755 -101472
21480a01472L716m1411j55358o5750K29955r6942j5729O8392J02646P051K3357
$$ -101472 -97756 -139167 -294525 -360275 -130320 -227262 -242991 -174599 -71953 -64902 -41545
21469d1545k22006k404J05636P4444L8379J5579m4729K6765L3432k0956O6604
$$ -41545 -263551 -265955 -160319 -85875 -47496 -31917 -76646 -49881 -16449 -37405 29199
21458B9199Q1980j16787j33302j04619M1374K5104J78047P8325J66324n9362n9516
$$ 29199 111179 -5608 -138910 -243529 -202155 -177051 996 79321 245645 186283 126767
21447A26767J0770L5039j18713r6167j75130j09843L2075J77240L0306m5664r4058
$$ 126767 137537 172576 53863 -42304 -217434 -327277 -295202 -117962 -87656 -133320 -227378
21436b27378K7400R0611j3337R2354J24571L7980j84072r3105m5022o7491N3103
$$ -227378 -199978 -109367 -122704 -30350 94221 132201 -51871 -144976 -189998 -257489 -204386
21425b04386O6457q6065J00026Q9978J53207K9116J27557r173k6891k1937J03458
$$ -204386 -137929 -223994 -123968 -33990 119217 148333 275890 266717 239826 217889 321347
21414C21347J5984K4778j27991j92575r6736j43460n9215K21902l6879n4237M1073
$$ 321347 337331 362109 234118 41543 -55193 -198653 -257868 -35966 -72845 -127082 -86009
21403h6009P1546O8170o8469K5395K17K8912J3565J17489l2457j8440l9734p4435
$$ -86009 -14463 53707 -14762 10633 10850 39762 53327 170816 138359 119919 80185 5750
21391E750o6720j39526L1454J17432O63j04415j16749J54608l7240j2902J64271
$$ 5750 -60970 -200496 -169042 -51610 -50947 -155362 -272111 -117503 -154743 -167645 -3374
21380c374l2284k9697o0584q4414N4835R2518M5946k8332J01016r7156j33527
$$ -3374 -35658 -65355 -125939 -210353 -155518 -63000 -17054 -45386 55630 -41526 -175053
21369a75053o507J57624o997P3881Q606q7893p6683q7948P6402m3206J01195R4194
$$ -175053 -181560 -23936 -30933 42948 51554 -36339 -113022 -200970 -124568 -167774 -66579 27615
21357B7615j21200j01005j9401J79880J16128o3409k68443O4145J53199J76589
$$ 27615 -93585 -194590 -213991 -34111 82017 18608 -249835 -185690 -32491 144098
21347A44098J45253m2277j68481k6085k8377j12447P6294J09526j44610r1820
$$ 144098 289351 247074 78593 52508 24131 -88316 -12022 97504 -47106 -138926
21337a38926o9994J33316J70407J73122m3287p0018O1491k00781r0823N6353J69939
$$ -138926 -208920 -75604 94803 267925 224638 154620 216111 15330 -75493 -19140 150799
21326A50799M5261q6265j27465k6949O9363r1256j65629N7770K71878K4364m9944
$$ 150799 196060 109795 -17670 -44619 24744 -66512 -232141 -174371 97507 121871 71927
21315G1927q2267J47815J06121r6663KQ3234l1895k948j01836K7921K9064r8341
$$ 71927 -10340 137475 243596 146933 146935 230169 198274 195326 93490 121411 150475 52134
21303E2134l6230j19442M4834J8683k8899j70768m5729K71483r994J18290P8580
$$ 52134 15904 -103538 -58704 -40021 -68920 -239688 -285417 -13934 -23928 94362 172942
21292A72942q6227o6538j55010K5363L194q302J7152Q0419j6183p1395K0180J706
$$ 172942 86715 20177 -134833 -109470 -106276 -114578 -97426 -17007 -33190 -104585 -84405 -82699
21280h2699r4301J00053J09177k40485j7026J62890j37801J31211K76767j5612
$$ -82699 -177000 -76947 32230 -208255 -225281 -62391 -200192 -68981 207786 192174
21270A92174j5716r7555p3790N5262J45591p7947q5929J7201J69956o2052K9735
$$ 192174 176458 78903 5113 60375 205966 128019 42090 59291 229247 167195 196930
21259A96930q8567o7914R092q0922K03792k3606p335R342K75m4114j94099k9322
$$ 196930 108363 40449 49541 -31381 172411 148805 141470 150812 151087 106973 -87126 -116448
21247a16448r057Q0907N3007p8957l7542Q0598K8347M3418p3684N8792J15775
$$ -116448 -125505 -44598 8409 -70548 -108090 -27492 855 44273 -29411 29381 145156
21236A45156N0870N340m8311q4660O3502m8198p5750o015o5037J11220L4758K8651
$$ 145156 196026 201366 153055 68395 131897 83699 7949 1934 -63103 48117 82875 111526
21224A11526M761m8128K6702j02722m2871l058j26423J13915j8687O5866m488
$$ 111526 116287 68159 94861 -7861 -50732 -53790 -180213 -66298 -84985 -19119 -23607
21213b3607O5860n9109K34173O7502K2297n8840j53023p8078J9713n7597N9451
$$ -23607 42253 -16856 217317 284819 307116 248276 95253 17175 36888 -20709 38742
21202C8742O5038J2636q612j71891r4763O698J44458J26535q4395N0633J01076
$$ 38742 103780 116416 107804 -64087 -158850 -152152 -7694 118841 34446 85079 186155
21191A86155j03485j41930Q4286J38260j26048L6464J03549M3295o5191j79765
$$ 186155 82670 -59260 25026 163286 37238 73702 177251 220546 155355 -24410
21181b4410O1319l8438j04275N483M8961N7738l4131q7659N638j15735K5641J36823
$$ -24410 36909 -1529 -105804 -100321 -51360 6378 -27753 -115412 -109774 -225509 -199868 -63045
21169f3045J09485J24916K0327r9107J05695j42944j00968n9954P4659k3580J01485
$$ -63045 46440 171356 191683 92576 198271 55327 -45641 -105595 -30936 -54516 46969
21158D6969p0391o9759p4622j5729O4304Q0855j42126M5111J25082j11885j20190
$$ 46969 -23422 -93181 -167803 -183532 -119228 -38373 -180499 -135388 -10306 -122191 -242381
21147b42381J23824J85275J2835r2645j5380K7274n1895L71j5331p8214O3571
$$ -242381 -118557 66718 79553 -13092 -28472 -1198 -53093 -52722 -68053 -146267 -82696
21136h2696k9217J807R1033l4941j291n862m0609j0035K35652K17638j04254l7977
$$ -82696 -111913 -110106 -19073 -54014 -55305 -61167 -101776 -111811 123841 341479 237225 199248
21124A99248m2993k3240l2329J2968o063q064j09903m3536N9970Q901J5507M7108
$$ 199248 156255 133015 100686 113654 107591 99527 -10376 -53912 6058 14959 30466 77574
21112G7574j35630j05175N9597P2231P1293k1673r800N8800L7422n691j48185
$$ 77574 -58056 -163231 -103634 -31403 39890 18217 8417 67217 104639 98948 -49237
21101d9237J08162j8424l6821n1944J0672k3445o9989Q3807M7543N1746j3640
$$ -49237 58925 40501 3680 -48264 -37592 -61037 -131026 -47219 324 52070 38430
21090C8430p6844J48869j02402k2185k0232J16388J21917O7202p6844o4850j64180
$$ 38430 -38414 110455 8053 -14132 -34364 82024 203941 271143 194299 129449 -34731
21079c4731j13468Q208J21018L5809q898l039m3416M2947J27298k9771j19979
$$ -34731 -148199 -139991 -18973 16836 7938 4899 -38517 4430 131728 101957 -18022
21068a8022O6714M9403R1086M8370k19467k15285j12799R8880N0682L5065j19474
$$ -18022 48692 98095 189181 237551 18084 -197201 -310000 -211120 -160438 -125373 -244847
21057b44847J28865J76499k6546J3966l8296m1654j02491j9491Q3893K1247P4894
$$ -244847 -115982 60517 33971 47937 9641 -32013 -134504 -153995 -70102 -48855 26039
21046B6039j03335J4968j14172j18613O4062J33366J22161j04624l3967K5761
$$ 26039 -77296 -62328 -176500 -295113 -231051 -97685 24476 -80148 -114115 -88354
21036h8354O2901K5376N8515k9071j18658j05516p6922K6803K00841J25959j8527
$$ -88354 -25453 -77 58438 29367 -89291 -194807 -271729 -244926 -44085 81874 63347
21025F3347p6890p1778M5543L9716n9935o5253m9311K2211n7155R1305O1462R1087
$$ 63347 -13543 -85321 -39778 -62 -59997 -125250 -174561 -152350 -209505 -118200 -56738 34349
21013C4349k376m1515n3602O5907L8597R707K4594K38687N8938j03147j59530
$$ 34349 31973 -9542 -63144 2763 41360 51067 75661 314348 373286 270139 110609
21002A10609p8784j674N9695q8294j37174k52R5670J07220J12328J55128m6235
$$ 110609 31825 30151 89846 1552 -135622 -135874 -40204 67016 179344 334472 288237
20991B88237j32217j19540J8253o3552j2845J15442P401M2752N7465j3089K4580
$$ 288237 156020 36480 54733 -8819 -21664 93778 101179 143931 201396 188307 212887
20980B12887k1792J02058o3321r139j7784J39755k7310j41636l8396m9845o4726
$$ 212887 191095 293153 229832 220693 202909 342664 315354 173718 135322 85477 20751
20969B0751j76407n9009k0973J18351J05780n6011j14663j43977J07761J0340
$$ 20751 -155656 -214665 -235638 -117287 -11507 -67518 -182181 -326158 -218397 -208057
20959b08057M8769K23579J47582J11348j5698m5284k03131j46655N923M0469q7684
$$ -208057 -159288 64291 211873 323221 307523 262239 59108 -87547 -81624 -41155 -128839
20948a28839Q4798l9491j15550n534Q0733J06670Q3269M4283L7777o2876l2456
$$ -128839 -44041 -83532 -199082 -204616 -123883 -17213 66056 110339 148116 85240 52784
20937E2784N9169K9733J19688p3341j56335n8026m7475n7221J36569J42726J62158
$$ 52784 111953 141686 261374 188033 31698 -26328 -73803 -131024 5545 148271 310429
20926C10429j08613r1181p6692K4708M1225k1430m3415J30907n5138L1995r667
$$ 310429 201816 110635 33943 58651 99876 78446 35031 165938 110800 142795 133128
20915A33128j64298j29047L0981j6162n6453j5967L8226K5568n7233j10462N6579
$$ 133128 -31170 -160217 -129236 -145398 -201851 -217818 -179592 -154024 -211257 -321719 -265140
20904b65140K7341n3896o173K12780J49676m2628L2578Q4250R3733L5777j28914
$$ -265140 -237799 -291695 -297868 -85088 64588 21960 54538 138788 232521 268298 139384
20893A39384j52831j16859j64646N4613R7771J02839K33635k9775k08903k9248
$$ 139384 -13447 -130306 -294952 -240339 -142568 -39729 193906 164131 -44772 -74020
20883g4020J48877J29659o2348l5666J8128R1874o1533m6130k7920j06852O1032
$$ -74020 74857 204516 142168 106502 124630 216504 154971 108841 80921 -25931 35101
20872C5101Q4000Q0389J6473k17898p623J39267J19906L139m2268N4837j11289
$$ 35101 119101 199490 215963 -1935 -9558 129709 249615 252754 210486 265323 154034
20861A54034j40844o3858Q5120J54345j8654j33398Q1098M4398q203J3385m2430
$$ 154034 13190 -50668 34452 188797 170143 36745 117843 162241 154038 167423 124993
20850A24993N7628J5456n435J08623M930r9890k85806j9539M712J97671J98691
$$ 124993 182621 198077 192642 301265 306195 206305 -79501 -99040 -94328 103343 302034
20839C02034J07399j14081p9262M6286j40318q0404m7156J57169J48275r5131
$$ 302034 409433 295352 216090 262376 122058 41654 -5502 151667 299942 204811
20829B04811j3026P6747j27617k29516j0193J09479j21742M717N5649l8627M6942
$$ 204811 191785 268532 140915 -88601 -98794 10685 -111057 -106340 -50691 -89318 -42376
20818d2376Q3174l8785n2671p4815m996Q7109J43985O2742N989j13485j08310
$$ -42376 40798 2013 -50658 -125473 -130469 -43360 100625 163367 169356 55871 -52439
20807e2439j0788J42839R1206M4317k05673p7640K6334m6329J49523m4690k3776
$$ -52439 -63227 79612 170818 215135 9462 -68178 -41844 -88173 61350 16660 -7116
20796g116J98722l2285n8080R6474O8144l1104n798m3492n7505L0090K2141j44202
$$ -7116 191606 159321 101241 197715 265859 234755 228957 185465 127960 158050 180191 35989
20784C5989M4694K01619J16573L3580k11528k10232n3129Q6592J11875N0506r6447
$$ 35989 80683 282302 398875 432455 220927 10695 -42434 44158 156033 206539 110092
20773A10092k33344o3825r0843J9487J18167k409K04604K8625n0411n3503j84491
$$ 110092 -123252 -187077 -277920 -258433 -140266 -142675 61929 90554 40143 -13360 -197851
20762a97851Q1514L9024j86153j7469M9968J22912J64938N6242l6387j12964l8660
$$ -197851 -116337 -77313 -263466 -280935 -230967 -108055 56883 113125 76738 -36226 -74886
20751g4886l9383j28072N2110n830n6542k0087Q5916J57561N7386L6171J89845
$$ -74886 -114269 -242341 -190231 -196061 -252603 -272690 -186774 -29213 28173 64344 254189
20740B54189Q5400p773l2641j14624q3067K4600n3949o5711O106p0321J42696
$$ 254189 339589 331816 299175 184551 101484 126084 72135 6424 12530 -57791 84905
20729H4905O9702l7234m3756j46926M9020Q5741j06498m6131r9779J09640K18622
$$ 84905 154607 117373 73617 -73309 -24289 61452 -45046 -91177 -190956 -81316 137306
20718A37306J58535n2611j10360o6359p619j247j20220m4084J1071J59822P9034
$$ 137306 295841 243230 132870 66511 58892 57645 -62575 -106659 -95588 64234 143268
20707A43268k7669j58213q2520o811Q5629m9557n7470J29501K8106M4165P6504
$$ 143268 115599 -42614 -125134 -131945 -46316 -95873 -153343 -23842 4264 48429 124933
20696A24933L7829q0207o502L0065P2188j5995j79817K7011Q4114o7038n1866
$$ 124933 162762 82555 76053 106118 178306 162311 -17506 9505 93619 26581 -25285
20685b5285L4305K9502J86229J49526M0031j58564j41959J05483J4273m1060r6593
$$ -25285 9020 38522 224751 374277 414308 255744 113785 219268 233541 192481 95888
20674I5888r242k21142n5552J1649J26721P3414p7814p0652O5630J22614r3407
$$ 95888 86646 -134496 -190048 -178399 -51678 21736 -56078 -126730 -61100 61514 -31893
20663c1893R648R3311K3866J12847r1687j93461P9127Q8606j92496P6670L7953
$$ -31893 -22245 71066 94932 207779 116092 -77369 1758 90364 -102132 -25462 12491
20652A2491j83034J45407M2611o7733m7375L875j1947j5484J3604q0536M9354
$$ 12491 -170543 -25136 17475 -50258 -97633 -93758 -105705 -121189 -107585 -188121 -138767
20641a38767J31616L289j31604l7403p0191K39517J96486m4677j64183l1824o8743
$$ -138767 -7151 -3862 -135466 -172869 -243060 -3543 192943 148266 -15917 -47741 -116484
20630a16484J81056O5276J2293p2300J08717M0210j2789K0625Q3602K1441m9942
$$ -116484 64572 129848 142141 69841 178558 218768 205979 226604 310206 331647 281705
20619B81705l9403k8391N9983J0904J27212l1978j60384M2104l4922j09743n622
$$ 281705 242302 213911 273894 284798 412010 380032 219648 261752 226830 117087 111465
20608A11465N0981j00456J35257K2840j39752n9494M6481j03444n0448K198J19477
$$ 111465 162446 61990 197247 220087 80335 20841 67322 -36122 -86570 -84372 35105
20597C5105L3731M9051R972m441m9404n6175j54007r9192N8096J39163Q5727p3879
$$ 35105 68836 117887 127859 123418 74014 17839 -136168 -235360 -177264 -38101 47626 -26253
20585b6253m9919N6092J05824m33O6996N0597J51472J1059j5753J0801k7797j97779
$$ -26253 -76172 -20080 85744 85311 152307 202904 354376 365435 349682 360483 332686 134907
20573A34907j97164j82767J58240J74263J0842J2J02373J52026n5655o2205j2859
$$ 134907 -62257 -245024 -86784 87479 98321 98333 200706 352732 297077 234872 222013
20562B22013j25476n6245k17545N6317K7518Q7460k6886K4853J53674P0513J33744
$$ 222013 96537 40292 -177253 -120936 -93418 -5958 -32844 -7991 145683 216196 349940
20551C49940k6440k08813N3765J63167j23348j35391J22303J68190j3321j78936
$$ 349940 323500 114687 168452 331619 208271 72880 195183 363373 350052 171116
20541A71116n2949R8928l8680L954O635m868k03580O207L3311K28405O0879r0625
$$ 171116 118167 217095 178415 182369 189004 184136 -19444 -13237 20074 248479 309358 218733
20529B18733k21796O0367p3251p6865R1451J11518Q6039m8497n6909j30493j20418
$$ 218733 -3063 57304 -15947 -92812 -1361 110157 196196 147699 90790 -39703 -160121
20518a60121J43306J29794Q1690o5447m6031N4682J3674L7884k9459q0452o5389
$$ -160121 -16815 112979 194669 129222 83191 137873 151547 189431 159972 79520 14131
20507A4131Q8941J01640K20204m3578l51390k14471K78839J23144R1359m7002
$$ 14131 103072 204712 424916 381338 29948 -184523 94316 217460 308819 261817
20497B61817j89437J1618O1815N7178j02526m9658k4020O233l8750n5095R8771
$$ 261817 72380 83998 145813 202991 100465 50807 26787 33020 -5730 -60825 37946
20486C7946L5035N1616O7123J45776J0446L0214K7287L5330N4985m1392k66951
$$ 37946 72981 124597 191720 337496 347942 378156 405443 440773 495758 454366 187415
20475A87415L1249O8975J10392j19376j85328o147q2086l1895J50880R5868q8941
$$ 187415 218664 287639 398031 278655 93327 87180 5094 -26801 124079 219947 131006
20464A31006k03764j05964K32387K45235J35679M5924r1671o5347j61149R4333
$$ 131006 -72758 -178722 53665 298900 434579 480503 388832 323485 162336 256669
20454B56669J08861j87030J996J47181r9944k39222j01913k806J22007P9075K0511
$$ 256669 365530 178500 180496 327677 227733 -11489 -113402 -116208 5799 84874 105385
20443A05385j11954j06200M8357J04478J09991m5420k8311M2862J76295N1123
$$ 105385 -6569 -112769 -64412 40066 150057 104637 76326 119188 295483 346606
20433C46606L3589r2632j21393r7001j13258J2690K0741Q4473J87577l6199o806
$$ 346606 380195 287563 166170 69169 -44089 -31399 -10658 73815 261392 225193 218387
20422B18387K11471N6487j81667q1337r8837K8873K32555l6727R1060j19124l3532
$$ 218387 429858 486345 304678 223341 124504 153377 385932 349205 440265 321141 287609
20411B87609m8728M4760L5184Q965n3942q4648R3970J11486J17066l9940j68927
$$ 287609 238881 283641 318825 327790 273848 189200 283170 394656 511722 471782 302855
20400C02855p2716J79807J11856j97857k36282J0700j1294J04395m2230J162L3087
$$ 302855 230139 409946 521802 323945 87663 98363 87069 191464 149234 150396 183483
20389A83483j08616o7091R3347R7891L4850J03183J9494j56171k3697M7441m7867
$$ 183483 74867 7776 101123 199014 233864 337047 356541 200370 176673 224114 176247
20378A76247k2970P0043J29887Q6212J0610j15137K622n7777o3151N7049J86672
$$ 176247 153277 223320 353207 439419 450029 334892 337514 279737 216586 273635 460307
20367D60307J8850J4836j3896n4273j99565j06843J1270J08253J04904O9256n2924
$$ 460307 479157 493993 480097 425824 226259 119416 130686 238939 343843 413099 360175
20356C60175k25784j12977J32720j08353j59129p9088J20384Q0387P0390J73894
$$ 360175 134391 21414 154134 45781 -113348 -192436 -72052 8335 78725 252619
20346B52619J87682N3281j28625m3749P6391j01769p2161k134p1043k80752O5965
$$ 252619 440301 493582 364957 321208 397599 295830 223669 221535 150492 -130260 -64295
20335f4295J87892M1121m9960J38474N9836k4935J21812j47054j38653R346K0909
$$ -64295 123597 164718 114758 253232 313068 288133 409945 262891 124238 133584 154493
20324A54493p1282Q191m979K8894q3798R9428J40913J28194r577k0456P9428j6117
$$ 154493 83211 91402 86423 115317 31519 130947 271860 400054 390477 370021 449449 433332
20312D33332r1046r5240q6385O4586l1720Q7022J11382k0173m5181k08535j31333
$$ 433332 342286 247046 160661 225247 193527 280549 391931 371758 326577 118042 -13291
20301a3291k3736N2417M9897Q0298Q9977j3217J0271j01245q7454J08506Q1555
$$ -13291 -37027 15390 65287 145585 235562 222345 232616 131371 43917 152423 233978
20290B33978k429q9199J65324J98083J4754J815r2690n0955j47569Q0655K6329
$$ 233978 231549 142350 307674 505757 520511 522326 429636 378681 231112 311767 338096
20279C38096K7391j08238K5014K24929J6516j9720m2327m9197J4921m2040J22938
$$ 338096 365487 257249 282263 507192 523708 503988 461661 412464 427385 385345 508283
20268E08283J07016L8295j227k06269j31521r3470J4828J09239K43840J81374
$$ 508283 615299 653594 652367 446098 314577 221107 235935 345174 589014 770388
20258G70388n9813j14830q1001L4766N8873q1265j88725n0061K5587J18095j13924
$$ 770388 710575 595745 514744 549510 608383 527118 338393 288332 313919 432014 318090
20247C18090q9451j0325J47664J02739p74k7767l7366r6968J14378K04295n4486
$$ 318090 228639 218314 365978 468717 467943 440176 402810 305842 420220 624515 570029
20236E70029j41135J52952J74916j0812j33944j3431j83445l0650k7993q361O0867
$$ 570029 428894 581846 756762 745950 612006 598575 415130 384480 356487 348126 408993
20225D08993J99993q8497j14320j24805J29022O7456n3031k1415p7730L7585O5433
$$ 408993 608986 520489 406169 281364 410386 477842 424811 403396 325666 363251 428684
20214D28684q8127J04656J01158j3428M8894J05227j96301J25704l7571j89087
$$ 428684 340557 445213 546371 532943 581837 687064 490763 616467 578896 389809
20204C89809L5275J48832m7236j0729R5405K2348k00580r5893L8894P5495n4602
$$ 389809 425084 573916 526680 515951 611356 633704 433124 337231 376125 451620 397018
20193C97018N3803Q5413P4469P1333l4657O333q7802j13792M9854o1636p7848
$$ 397018 450821 536234 610703 682036 647379 653712 565910 452118 501972 440336 362488
20182C62488J19163J08275m3064J72727K63814m968j84100j62579J3187m8386
$$ 362488 481651 589926 546862 719589 983403 978435 794335 631756 644943 596557
20172E96557o2133o0933J98834o104j54239K2220j0432j16833k5172R5924R6142
$$ 596557 534424 473491 672325 666221 511982 534202 523770 406937 381765 477689 573831
20161E73831j0223L0715R0159J47272L4616j28212j32272n7687Q0191L1038J50845
$$ 573831 563608 594323 684482 831754 866370 738158 605886 548199 628390 659428 810273
20150H10273k0586j24662L5404M7891K3579j0578j2057K3662m10j7759j72419
$$ 810273 789687 665025 700429 748320 771899 761321 749264 772926 772516 754757 582338
20139E82338j42807J08060N20m5539O2004J33944L6424l6660J44148N6768K1590
$$ 582338 439531 547591 548111 502572 564576 698520 734944 698284 842432 899200 920790
20128I20790N4648L7349r7648q9723Q2101j24822j3915M5939M6129p5394m1894
$$ 920790 975438 1012787 915139 825416 907517 782695 768780 814719 860848 785454 743560
20117G43560q1192J29223o7947N1098l7107q0875J32563K4207j16416N0363R8528
$$ 743560 662368 791591 723644 774742 737635 656760 789323 813530 697114 747477 846005
20106H46005K066l2193J15647M1390J39612q165j30538O1754J63601l5395j15990
$$ 846005 848071 815878 931525 972915 1112527 1104362 973824 1035578 1199179 1163784 1047794
20095A047794j51367k2522r118l6628R2815J08399j62837j76977m3867K0058J76273
$$ 1047794 896427 873905 864787 828159 920974 1029373 866536 689559 645692 665750 842023
20084H42023Q8271L0518j6904p9285j15549q451k2742l4163Q5587l978J08321
$$ 842023 930294 960812 943908 864623 749074 740623 717881 683718 769305 765327 873648
20073H73648M1206R5178L9975J77770O7397J6649j76646r8568q6965J03390O4361
$$ 873648 914854 1010032 1050007 1227777 1295174 1311823 1135177 1036609 949644 1053034 1117395
20062A117395Q0131j48924m0099J33616k6276r8681J17046O1533j8492m4133R0169
$$ 1117395 1197526 1048602 1008503 1142119 1115843 1017162 1134208 1195741 1177249 1133116 1223285
20051A223285J65076p615K7789j550j03613j5438J74291n6350j19188r8563j19679
$$ 1223285 1388361 1380746 1408535 1406985 1303372 1287934 1462225 1405875 1286687 1188124 1068445
20040A068445L9688J37282M3714L8591K3366J17261j6356j50954l5390o8788j59552
$$ 1068445 1108133 1245415 1289129 1327720 1351086 1468347 1451991 1301037 1265647 1196859 1037307
20029A037307J61136K05215l8502j01496Q1237L1698k4572J70163J52275l0405
$$ 1037307 1198443 1403658 1365156 1263660 1344897 1376595 1352023 1522186 1674461 1644056
20019A644056k44484j69396J73993K84792K0450k05214l9570k1288R4091j984
$$ 1644056 1399572 1230176 1404169 1688961 1709411 1504197 1464627 1443339 1537430 1535446
20009A535446l5765J10244q5824j37400L2020m0549J38044J88470Q025j30741
$$ 1535446 1499681 1609925 1524101 1386701 1418721 1378172 1516216 1704686 1712711 1581970
19999A581970j02048P7428J33446M9675j05818l4744J03371O8393p8211O6354
$$ 1581970 1479922 1557350 1690796 1740471 1634653 1599909 1703280 1771673 1693462 1759816
19989A759816K51727P1617L1816l1618k01993j02112Q8344P7836k02241Q4329
$$ 1759816 2011543 2083160 2114976 2083358 1881365 1779253 1867597 1945433 1743192 1827521
19979A827521O7139Q5957P8522J6035j09068p9880j01941J05638J32451O2305
$$ 1827521 1894660 1980617 2059139 2075174 1966106 1886226 1784285 1889923 2022374 2084679
19969B084679J43852n0105J9974J80363J07232L7336n609k31987M3873j35414
$$ 2084679 2228531 2178426 2198400 2378763 2485995 2523331 2517722 2285735 2329608 2194194
19959B194194n1157J13485m4854o1446J20763J48521Q3818m3993j83030Q6173
$$ 2194194 2143037 2256522 2211668 2150222 2270985 2419506 2503324 2459331 2276301 2362474
19949B362474R8330M069L8527l1860J8636m3826O063k8723p6760J26120J61522
$$ 2362474 2460804 2464873 2503400 2471540 2490176 2446350 2452413 2423690 2346930 2473050 2634572
19938B634572m6543j14789j86954p9929J64716K20389K08907k1638j642m4143
$$ 2634572 2588029 2473240 2286286 2206357 2371073 2591462 2800369 2778731 2777089 2732946
19928B732946l7263L2628j4234Q2622J32595l2640P4386L2374J5491R2712Q5245
$$ 2732946 2695683 2728311 2714077 2796699 2929294 2896654 2971040 3003414 3018905 3111617 3196862
19917C196862J18934l1268p8719K5967R4654K8176R0742O3258j1776m6604J30933
$$ 3196862 3315796 3284528 3205809 3231776 3326430 3354606 3445348 3508606 3496830 3450226 3581159
19906C581159M6253n8944Q2943J11331j72374n6296m3906k1510J38064J02897
$$ 3581159 3627412 3568468 3651411 3762742 3590368 3534072 3490166 3468656 3606720 3709617
19896C709617J5472n0659N0482J30931j18278l2736P6296J14943M6959O0322J25327
$$ 3709617 3725089 3674430 3724912 3855843 3737565 3704829 3781125 3896068 3943027 4003349 4128676
19885D128676J29807R6681R6208j73971L2706Q6720J26817L4133P3150J40029
$$ 4128676 4258483 4355164 4451372 4277401 4310107 4396827 4523644 4557777 4630927 4770956
19875D770956p8459Q157N816J46715k0474n2013K43147P621M9477M2377J53752
$$ 4770956 4692497 4700654 4706470 4853185 4832711 4780698 5023845 5031466 5080943 5123320 5277072
19864E277072N9706K0457R8446J87355J65423Q8782p9263Q0246L1537q5155J74183
$$ 5277072 5336778 5357235 5455681 5643036 5808459 5897241 5817978 5898224 5929761 5844606 6018789
19853F018789p7310M6570J68306J08796P5684J59141j2553l19036P060J54884
$$ 6018789 5941479 5988049 6156355 6265151 6340835 6499976 6487423 6168387 6175447 6330331
19843F330331J73277O0361K5348Q7041J03118L5348J02981J23643K08243K97934
$$ 6330331 6503608 6563969 6589317 6676358 6779476 6814824 6917805 7041448 7249691 7547625
19833G547625K43443K6220j20733j95675K20223K65212N2455m4289m0447K06744
$$ 7547625 7791068 7817288 7696555 7500880 7721103 7986315 8038770 7994481 7954034 8160778
19823H160778J98322k78850j56480R0438J98616Q1694L03302J55203J09775J08413
$$ 8160778 8359100 8080250 7923770 8014208 8212824 8294518 8597820 8753023 8862798 8971211
19813H971211J74642K31606P8523K087l3157M2270J17067J93758J01012J160K9540
$$ 8971211 9145853 9377459 9455982 9458069 9424912 9467182 9584249 9778007 9879019 9880179 9909719
19802I909719J51507J72110J31116K30244N4185Q5301R3797L5796L4702K0061
$$ 9909719 10061226 10233336 10364452 10594696 10648881 10734182 10827979 10863775 10898477 10918538
19792A0918538Q7998J27195J09179J53327J69725P9035O5958J53422K00431J20559
$$ 10918538 11006536 11133731 11242910 11396237 11565962 11644997 11710955 11864377 12064808 12185367
19782A2185367O3592J29094J61267R9304J47108Q6005j56356L8591J63835J58944
$$ 12185367 12248959 12378053 12539320 12638624 12785732 12871737 12715381 12753972 12917807 13076751
19772A3076751O8029k1940M7630K16143K16045J60064j8046M7793m0834q809k646
$$ 13076751 13144780 13122840 13170470 13386613 13602658 13762722 13744676 13792469 13751635 13742826 13740180
19761A3740180R7497L56250K26814M0046J5079P9594l7888j09460j9230R9194
$$ 13740180 13837677 14193927 14420741 14460787 14475866 14555460 14517572 14408112 14388882 14488076
19751A4488076J39625o4056J05191Q571M5485N0823J09726q8933k477J50352K5593
$$ 14488076 14627701 14563645 14668836 14677407 14722892 14773715 14883441 14794508 14792031 14942383 14967976
19740A4967976k83141j44513J66911K69407M9891k03399r6004m3269k6033m6017
$$ 14967976 14684835 14540322 14707233 14976640 15026531 14823132 14727128 14683859 14657826 14611809
19730A4611809j88624Q0679K06013j9288J2293L0191r6081j64205k2103p6971
$$ 14611809 14423185 14503864 14709877 14690589 14702882 14733073 14636992 14472787 14450684 14373713
19720A4373713j28429j76147p7179k076N8103k9975j02948j40520k0196N0816
$$ 14373713 14245284 14069137 13991958 13989882 14047985 14018010 13915062 13774542 13754346 13805162
19710A3805162j61212k19297j23770j38168J9074J4726o4740j22869r3142R3317
$$ 13805162 13643950 13424653 13300883 13162715 13181789 13196515 13131775 13008906 12915764 13009081
19700A3009081k39597j08792K1837K1816l8476j49921r7270j63411j45046k26245
$$ 13009081 12769484 12660692 12682529 12704345 12665869 12515948 12418678 12255267 12110221 11883976
19690A1883976k55624k5839P8407Q1342k48833j73399l8184j22977j7677o4019
$$ 11883976 11628352 11602513 11680920 11762262 11513429 11340030 11301846 11178869 11161192 11097173
19680A1097173r8603N964r1325q1387j42726o0953k35047p1390k9971M6740n3996
$$ 11097173 10998570 11004534 10913209 10831822 10689096 10628143 10393096 10321706 10291735 10338475 10284479
19669A0284479l17837L8466j60040r2199m0266j70425k30672k11062o5277r9454
$$ 10284479 9966642 10005108 9845068 9752869 9712603 9542178 9311506 9100444 9035167 8935713
19659H935713k08786Q6985O7999j36423k32620j10287L4454j91724K8111j17052
$$ 8935713 8726927 8813912 8881911 8745488 8512868 8402581 8437035 8245311 8273422 8156370
19649H156370j68421j18197n0173O7988j7896j97714k03207J9445M8154m3162
$$ 8156370 7987949 7869752 7819579 7887567 7869671 7671957 7468750 7488195 7536349 7493187
19639G493187j30271q8512k5033p3522j14549j97553p6844l4867j97351j47473
$$ 7493187 7362916 7274404 7249371 7175849 7061300 6863747 6786903 6752036 6554685 6407212
19629F407212O236J4792m5476l690p0207j02933J5576R3652q2625n7707k14611
$$ 6407212 6413448 6428240 6382764 6379074 6308867 6205934 6221510 6315162 6232537 6174830 5960219
19618E960219j44637R1201m4513j89475o3818Q4798J58985L0069p2573j01402
$$ 5960219 5815582 5906783 5862270 5672795 5608977 5693775 5852760 5882829 5810256 5708854
19608E708854k3770j82117r3323M2823L8637j41489j24170m6915J44853j54428
$$ 5708854 5685084 5502967 5409644 5452467 5491104 5349615 5225445 5178530 5323383 5168955
19598E168955k22138l9667j7919j82101p999k7961l1701p637l6738k9755n8024
$$ 5168955 4946817 4907150 4889231 4707130 4699131 4671170 4639469 4631832 4595094 4565339 4507315
19587D507315j38422m7235o012j0033J22896l2481m9468J47977R126j72871j48432
$$ 4507315 4368893 4321658 4315646 4305613 4428509 4396028 4346560 4494537 4503663 4330792 4182360
19576D182360j37676j00915m6034M2571P1458J42795J6535k93280j11793L7897
$$ 4182360 4044684 3943769 3897735 3940306 4011764 4154559 4171094 3877814 3766021 3803918
19566C803918Q1607k1660r1155J36773j6899j96622k87834q6556k0569j05554
$$ 3803918 3885525 3863865 3772710 3909483 3892584 3695962 3408128 3321572 3301003 3195449
19556C195449J2749p3180j3463K09460J36631m4902j86257j20996l0298M4247
$$ 3195449 3208198 3135018 3121555 3331015 3467646 3422744 3236487 3115491 3085193 3129440
19546C129440k5960j4470m2568j43448j03752m6188P5598J57873P3766m7218k35936
$$ 3129440 3103480 3089010 3046442 2902994 2799242 2753054 2828652 2986525 3060291 3013073 2777137
19535B777137K8964R6104P1059l7163j32477k228J45701J9063j86638l37879O7447
$$ 2777137 2806101 2902205 2973264 2936101 2803624 2801396 2947097 2966160 2779522 2441643 2509090
19524B509090J58381K5985J3990K4790Q3862M3596L6702k2163j6561o089k5085
$$ 2509090 2667471 2693456 2707446 2732236 2816098 2859694 2896396 2874233 2857672 2851583 2826498
19513B826498q0798k2633j8470J0463J02134m5748k5080J84885k9017q1835K478
$$ 2826498 2745700 2723067 2704597 2715060 2817194 2771446 2746366 2931251 2902234 2820399 2822877
19502B822877M0742R2506q1187J6431N9462R4490J73213k86j28805q8342o7196
$$ 2822877 2863619 2956125 2874938 2891369 2950831 3045321 3218534 3218248 3089443 3001101 2933905
19491B933905l05118j82878J06092o9137k23306n185J46802R0545j62385k37124
$$ 2933905 2628787 2445909 2552001 2482864 2259558 2254373 2401175 2491720 2329335 2092211
19481B092211p2880K35306O7335l1679j79434j49319m6318k3899Q0607K59303
$$ 2092211 2019331 2254637 2321972 2290293 2110859 1961540 1915222 1891323 1971930 2231233
19471B231233R925j2191K24J6968r7820j37372K8834N5400p9684r164M409K10108
$$ 2231233 2241158 2228967 2229191 2246159 2148339 2010967 2039801 2095201 2015517 2006353 2010762 2220870
19459B220870J39352m2960J18553L740l5381j02174j83041l7396J9191O0748P0466
$$ 2220870 2360222 2317262 2435815 2439555 2404174 2302000 2118959 2081563 2100754 2161502 2231968
19448B231968m773O5713j29352K225r5968J42981j7174P6549J00949M2975p563
$$ 2231968 2227195 2292908 2163556 2165781 2069813 2212794 2195620 2272169 2373118 2416093 2408530
19437B408530l8995J17961n1305j87164J25802N4674m576J6989J47085K7457j17324
$$ 2408530 2369535 2487496 2436191 2249027 2374829 2429503 2424927 2441916 2589001 2616458 2499134
19426B499134n1211J44252r7244j07054l9848r1493o755k16183j97797J30932
$$ 2499134 2447923 2592175 2494931 2387877 2348029 2256536 2249781 2033598 1835801 1966733
19416A966733n0894N304j2852J37916J23696p1365l5646O1723r260j71401k28448
$$ 1966733 1915839 1921143 1908291 2046207 2169903 2098538 2062892 2124615 2115355 1943954 1715506
19405A715506m9310K383n835o0091r9387M3337J12335r9318j51526o9832l3666
$$ 1715506 1666196 1668579 1662744 1602653 1503266 1546603 1658938 1559620 1408094 1338262 1304596
19394A304596J62015K97702o288j27072m4368J12418J37723j204K2449J69254
$$ 1304596 1466611 1764313 1758025 1630953 1586585 1699003 1836726 1835522 1857971 2027225
19384B027225J05241n7899J71576J37548m4194O4884J33046Q4014j15624l8308
$$ 2027225 2132466 2074567 2246143 2383691 2339497 2404381 2537427 2621441 2505817 2467509
19374B467509M6203P0817J36781J64599J82185P7260l6204o5777j5284m4293j0414
$$ 2467509 2513712 2584529 2721310 2885909 3068094 3145354 3109150 3043373 3028089 2983796 2973382
19363B973382j9335k23847r9832l6681J17756K1295j45892o5648j35164q2640
$$ 2973382 2954047 2730200 2630368 2593687 2711443 2732738 2586846 2521198 2386034 2303394
19353B303394j95210j0644r9979j64264k9926R3089J6603l1K1835r2184r3607
$$ 2303394 2108184 2097540 1997561 1833297 1803371 1896460 1913063 1913032 1934867 1842683 1749076
19342A749076N1973K13495o2401J36886l8019N0075J38412n0577q1030Q7536K01392
$$ 1749076 1801049 2014544 1952143 2089029 2051010 2101085 2239497 2188920 2107890 2195426 2396818
19331B396818L7207J46988J45685K32811R3106l0408p9376l9144o963k09801r1575
$$ 2396818 2434025 2581013 2726698 2959509 3052615 3022207 2942831 2903687 2896724 2686923 2595348
19320B595348j9251o700J10367Q1615J97040q7876j2295j02129j93213r5032j51969
$$ 2595348 2576097 2569397 2679764 2761379 2958419 2870543 2858248 2756119 2562906 2467874 2315905
19309B315905j53202q0518j18483j40262n2829J10835J56158m6975M0181k4945
$$ 2315905 2162703 2082185 1963702 1823440 1770611 1881446 2037604 1990629 2030810 2005865
19299B005865j04329j33458Q9536L1867K7515j02847P5170Q5766p6771p9766j2970
$$ 2005865 1901536 1768078 1857614 1889481 1916996 1814149 1889319 1975085 1898314 1818548 1805578
19288A805578L107K8408J090J05074j54058j19244O7258p6619Q9862J20055R5165
$$ 1805578 1808685 1837093 1838183 1943257 1789199 1669955 1737213 1660594 1750456 1870511 1965676
19277A965676J65235n136Q9238L902m5386p5053k13706J7920J09643j69555k00340
$$ 1965676 2130911 2125775 2215013 2218915 2173529 2098476 1884770 1902690 2012333 1842778 1642438
19266A642438p4509j1260J2832M1457j87520p5419J1673Q6850J5273j85679q7854
$$ 1642438 1567929 1556669 1569501 1610958 1423438 1348019 1359692 1446542 1461815 1276136 1188282
19255A188282Q06N6050k00937J6142m5192J3775j00389j17197R184J05281n786
$$ 1188282 1189088 1245138 1044201 1060343 1015151 1028926 928537 811340 820524 925805 920019
19244I20019l7697n8366j14226J722J07804k6570O6489k1936J0472Q8601n1067
$$ 920019 882322 823956 709730 711452 819256 792686 859175 837239 847711 936312 885245
19233H85245L4774m8023M1635O6658K6198l2803n0116j10882P4975Q6666m321
$$ 885245 920019 871996 913631 980289 1006487 973684 923568 812686 887661 974327 970006
19222I70006K41821o2813j11833Q334k2058o4762J3194l8086p5339o4771J18867
$$ 970006 1211827 1149014 1037181 1045515 1023457 958695 971889 933803 858464 793693 912560
19211I12560J41332Q7004r1980n5444j35844L2238P0572J21131j38999R540L0138
$$ 912560 1053892 1140896 1048916 993472 857628 889866 960438 1081569 942570 952110 982248
19200I82248o4038j8964O1006M764m9288j199j04790r3600j25593q92J80459J30120
$$ 982248 918210 899246 960252 965016 915728 914529 809739 716139 590546 589654 770113 900233
19188I00233K3021o1065j24862J40263J27685P1189K5403j60835K2652J56208
$$ 900233 923254 862189 737327 877590 1005275 1076464 1101867 941032 963684 1119892
19178A119892J39441N0591j10416r8626j12244N6369K3634J13172L1916L3066
$$ 1119892 1259333 1309924 1199508 1100882 988638 1045007 1068641 1181813 1213729 1246795
19168A246795J0009M8831j34602p9576L3005Q5208o302q4873p6294j1829o0703
$$ 1246795 1256804 1305635 1171033 1091457 1124462 1209670 1203368 1118495 1042201 1030372 969669
19157I69669l9739K9538R3364J2058o1030Q1024O2150r7834j2975M8695j9996
$$ 969669 929930 959468 1052832 1064890 1003860 1084884 1147034 1049200 1036225 1084920 1064924
19146A064924j464o7579j4664N2779L1213J94593q2652q0393l0546j26963J69313
$$ 1064924 1063460 995881 981217 1033996 1065209 1259802 1177150 1096757 1066211 939248 1108561
19135A108561K4534k8101n1712j166m2150N5304O4852l0336O5731M9513k38881
$$ 1108561 1133095 1104994 1053282 1052116 1009966 1065270 1130122 1099786 1165517 1215030 976149
19124I76149q6061J18615N9259J45116J53505q771Q6085J00616K2294K3243J65879
$$ 976149 890088 1008703 1067962 1213078 1366583 1357812 1443897 1544513 1566807 1590050 1755929
19113A755929N9991o029J112J15383K58107J82380k10978J29422p7541l7461P0867
$$ 1755929 1815920 1809891 1811003 1926386 2184493 2366873 2155895 2285317 2207776 2170315 2241182
19102B241182K23353O2477n8232l3588n615K6843l3429j55576j33743j98407j00983
$$ 2241182 2464535 2527012 2468780 2435192 2429577 2456420 2422991 2267415 2133672 1935265 1834282
19091A834282M4225J51462M3032m2588N095j45525j72157j14046j4291Q9091o1024
$$ 1834282 1878507 2029969 2073001 2030413 2035508 1889983 1717826 1603780 1589489 1678580 1617556
19080A617556Q3468j582N2293K4571m0615j47433n9329k2391j15921K16670J35406
$$ 1617556 1701024 1699442 1751735 1776306 1735691 1588258 1528929 1506538 1390617 1607287 1742693
19069A742693N0006P2K8427q6739j72590J19103J47491J94202J5757J53970J41283
$$ 1742693 1792699 1792771 1821198 1734459 1561869 1680972 1828463 2022665 2038422 2192392 2333675
19058B333675j6484O2974K24937J24772Q3596K57202J82733J037J82444J05981
$$ 2333675 2317191 2380165 2605102 2729874 2813470 3070672 3253405 3254442 3436886 3542867
19048C542867l3565Q6445J91152J34262J88250O999J55356P6551P9821k3250L5361
$$ 3542867 3509302 3595747 3786899 3921161 4109411 4116410 4271766 4348317 4428138 4404888 4440249
19037D440249L521k21323o416N5917M7173J40214K6613K6274L16289J25147j11649
$$ 4440249 4443770 4222447 4216031 4271948 4319121 4459335 4485948 4512222 4828511 4953658 4842009
19026D842009r2294n5576J40712J14905j15164N9052K93581J75127O4934L20685
$$ 4842009 4749715 4694139 4834851 4949756 4834592 4893644 5187225 5362352 5427286 5747971
19016E747971M29084K93277N76174L80680K62799M22197M80180L94858N13795
$$ 5747971 6177055 6470332 7046506 7427186 7689985 8112182 8592362 8987220 9501015
19007I501015N40113P11193P37617R10077J079995J383869J616516J895523K359747
$$ 9501015 10041128 10752321 11489938 12400015 13480010 14863879 16480395 18375918 20735665
18998B0735665L125043L948318N009696O655689Q372300R900789J1502977J1970639
$$ 20735665 23860708 27809026 32818722 39474411 47846711 57747500 69250477 81221116
18990H1221116J1608141R867037P192751M673209K955034K067405K048282K939857
$$ 81221116 92829257 102696294 109889045 114562254 117517288 119584693 121632975 124572832
18982A24572832L878402L722926K682856M50447k655281n989632q487331r858235
$$ 124572832 128451234 132174160 134857016 135307463 132652182 126662550 118175219 108316984
18974A08316984j0613493j0381903r794225q642888p407788o345102n343752m536476
$$ 108316984 97703491 87321588 77527363 68884475 61476687 55131585 49787833 45251357
18966D5251357l737365l172448k605488k223276j921365j458442j303539j102730
$$ 45251357 41513992 38341544 35736056 33512780 31591415 30132973 28829434 27726704
18958B7726704q59655q05204o45204l88756k67023l21397n5080J00906L63848
$$ 27726704 26867049 26061845 25416641 25027885 24760862 24439465 24384385 24485291 24849139
18949B4849139L15997N37956P59273J062184J615397J866923K459396L339042
$$ 24849139 25165136 25703092 26462365 27524549 29139946 31006869 33466265 36805307
18941C6805307M341052N605053P208921R084367J0531996J1732572J2280917J1660161
$$ 36805307 41146359 46751412 53960333 63044700 73576696 85309268 97590185 109250346
18933A09250346R809937P429106N377630M053677L784780M641551O165932P607576
$$ 109250346 119060283 126489389 131867019 135920696 139705476 144347027 150512959 158120535
18925A58120535Q676986R141648Q139719O490639N179445L554948J952170N6441
$$ 158120535 166797521 175939169 184078888 190569527 195748972 199303920 201256090 201312531
18917B01312531j932704l794487m647693m197196k798982p09111J374873K580635
$$ 201312531 199379827 195585340 190937647 186740451 183941469 183232358 184607231 187187866
18909A87187866J860215p18661m348648q402754j1641849j3342612j4508996j4402220
$$ 187187866 189048081 188329420 183980772 175578018 163936169 150593557 136084561 121682341
18901A21682341j3215638j1839117j0452035q810915p380735o106565n185189
$$ 121682341 108466703 96627586 86175551 77364636 69983901 63877336 58692147
18894E8692147m378824l527600k988412k592919k251634j976255j623581j239365
$$ 58692147 54313323 50785723 47797311 45204392 42952758 40976503 39352922 38113557
18886C8113557r39682m70718k40288j01019n7019L44834P21612J077258J609168
$$ 38113557 37173875 36703157 36462869 36361850 36304831 36649665 37371277 38448535 40057703
18877D0057703K044247K590157L303095M486279O273248P866509R773693J2068683
$$ 40057703 42101950 44692107 47995202 52481481 58754729 66621238 76394931 88463614
18869H8463614J4324406J6262408J7543877J7986315J7682271J6866853J5417238
$$ 88463614 102788020 119050428 136594305 154580620 172262891 189129744 204546982
18862B04546982J3457241J1009955Q485611O369528N544108N195748N586410N392516
$$ 204546982 218004223 229014178 237499789 243869317 249413425 254609173 260195583 265588099
18854B65588099M161518J268988k871706p592505j1840039j5029590j6814307
$$ 265588099 269749617 271018605 268146899 260554394 248714355 233684765 216870458
18847B16870458j7071101j6287200j5151241j3425910j1417959r322087o820432
$$ 216870458 199799357 183512157 168360916 154935006 143517047 134194960 127374528
18840A27374528l944064r44494K203261M903530O591565O882939N933490M299587
$$ 127374528 123430464 122485970 124689231 129592761 136184326 143067265 149000755 153300342
18832A53300342K837681J353610N11463J56084l74919j172008j919368k008656
$$ 153300342 156138023 157491633 158003096 158159180 157784261 156612253 154692885 152684229
18824A52684229j706745j071814k94232P84948J977090K878138L389855L272086
$$ 152684229 150977484 149905670 149611438 150396386 152373476 155251614 158641469 161913555
18816A61913555K766586J972289J052752P28335R07764J089596J578911J654415
$$ 161913555 164680141 166652430 167705182 168433517 169341281 170430877 172009788 173664203
18808A73664203J449965M78443p52336j749066k954222l759745m362480n162128
$$ 173664203 175114168 175592611 174840275 173091209 170136987 166377242 162014762 156852634
18800A56852634n723385o511600p282746p792518p789462p283604o249589m999095
$$ 156852634 151129249 144617649 137334903 129542385 121752923 114469319 108219730 103220635
18792A03220635l379575j768657k42940J003067J961452L508117M895507O170209
$$ 103220635 99841060 98072403 97829463 98832530 100793982 104302099 109197606 115367815
18784A15367815P617109Q166297Q268859P664140O602861N340387M056497K540757
$$ 115367815 122984924 131151221 139420080 147084220 153687081 159027468 163083965 165624722
18776A65624722Q04675p95291k085973l042584l944504m554813m954739n387637
$$ 165624722 166429397 165634106 163548133 160505549 156561045 152006232 147051493 141663856
18768A41663856o172225p420534q321030q969211r487663r466511r182882q340658
$$ 141663856 135491631 128071097 119750067 110780856 101293193 91826682 82643800 74303142
18760G4303142p224976o089113m864539l718976k649089k131532k073383j801323
$$ 74303142 67078166 60989053 56124514 52405538 49756449 47624917 45551534 43750211
18752D3750211j577875j528799j162047q14909o07494n13561p76675r83877j118676
$$ 43750211 42172336 40643537 39481490 38666581 38059087 37545526 36768851 35784974 34666298
18743C4666298j144077j196171j291176j042441j025424j166193j415943j661112
$$ 34666298 33522221 32326050 31034874 29992433 28967009 27800816 26384873 24723761
18735B4723761j787338j532736j162620j076133q92652n23442m25888k8892M51866
$$ 24723761 22936423 21403687 20241067 19164934 18272282 17748840 17322952 17294060 17745926
18726A7745926O85800J034784J269866J287199J088104P82476O11463M99838L51421
$$ 17745926 18431726 19466510 20736376 22023575 23111679 23894155 24505618 25005456 25356877
18717B5356877L67553P36610N33780J03403p476l97848l11945k42404o2902M23444
$$ 25356877 25724430 26461040 26994820 27098223 27090747 26692899 26380954 26138550 26075648 26499092
18707B6499092O54655P27955Q34983R05063N44354L25571j39534l56037P7223
$$ 26499092 27153747 27881702 28716685 29621748 30166102 30491673 30352139 29996102 30073325
18698C0073325K13740L29579O03038M24045L81608j78837l45938q62019j026025
$$ 30073325 30287065 30616644 31219682 31643727 32025335 31846498 31500560 30638541 29612516
18689B9612516r05874q46279q16025r64997j410315j532416j652419j733375j587096
$$ 29612516 28706642 27860363 27044338 26079341 24669026 23136610 21484191 19750816 18163720
18680A8163720j395299q92229m78955j89286K01331M92821Q53204J161429J499834
$$ 18163720 16768421 15876192 15397237 15207951 15409282 15902103 16755307 17916736 19416570
18671A9416570J586406J439632R22685O18646O35685O66974Q37852Q49048P67263
$$ 19416570 21002976 22442608 23365293 23983939 24619624 25286598 26124450 26973498 27740761
18662B7740761L11880k26429l30434o86386r56589r59874p03013o37350q28181
$$ 27740761 28052641 27826212 27495778 26809392 25852803 24892929 24189916 23552566 22724385
18653B2724385j201965j666155j939679k047359j868576j663608j351367j057855
$$ 22724385 21522420 19856265 17916586 15869227 14000651 12337043 10985676 9927821
18645I927821q72177p92393o12715n06974o21607o22070l48421k53452l82462
$$ 9927821 9055644 8263251 7650536 7143562 6521955 5899885 5551464 5298012 4915550
18636D915550l15221j16062k08355k95140k23114k55049p3923q1914L0733r4111
$$ 4915550 4600329 4484267 4275912 3980772 3757658 3502609 3428686 3346772 3377505 3283394
18626C283394q949J1555q8504k36923j77371L4546J14362k89808j31561j8401
$$ 3283394 3274445 3286000 3197496 2960573 2783202 2817748 2932110 2642302 2510741 2492340
18616B492340K6015p5028j05537p4934M0591p0713Q4554J15787M7969n8139l9740
$$ 2492340 2518355 2443327 2337790 2262856 2303447 2232734 2317288 2433075 2481044 2422905 2383165
18605B383165P7228q0145R3383N8524M0412M6582J06494J07476P4027J2353m1226
$$ 2383165 2460393 2380248 2473631 2532155 2572567 2619149 2725643 2833119 2907146 2919499 2878273
18594B878273J34365K6766j05829J69262M9469k62313j39640o6338n1910o1453
$$ 2878273 3012638 3039404 2933575 3102837 3152306 2889993 2750353 2684015 2632105 2570652
18584B570652k31952k73955r7708q4553L201r853L9564k572n3087O9450j00044
$$ 2570652 2338700 2064745 1967037 1882484 1885685 1875832 1915396 1912824 1859737 1929187 1829143
18573A829143l9058o2100r851J90010l9677j9174r0298J0525K7425q3570j7586
$$ 1829143 1790085 1727985 1718134 1908144 1868467 1849293 1758995 1769520 1796945 1713375 1695789
18562A695789M6535N675P1318j61876j59325j06016N9861J14485J61153R073J566
$$ 1695789 1742324 1747999 1819317 1657441 1498116 1392100 1451961 1566446 1727599 1736672 1738238
18551A738238J90741j9530K9697J66939R6915o4620J49282K61792J88033j27250
$$ 1738238 1928979 1909449 1939146 2106085 2203000 2138380 2287662 2549454 2737487 2610237
18541B610237n8776K5062J2876r0430k0495J27218K03031R2778J9037J20412J01127
$$ 2610237 2551461 2576523 2589399 2498969 2478474 2605692 2808723 2901501 2920538 3040950 3142077
18530C142077R3340n6315j18533N6422K18238L46866L31008L14987J52360q413
$$ 3142077 3235417 3179102 3060569 3116991 3335229 3682095 4013103 4328090 4480450 4472037
18520D472037M9565J09561q9318k30330j17298l65922l38464k33756l0205L3635
$$ 4472037 4521602 4631163 4541845 4311515 4194217 3828295 3489831 3256075 3225870 3259505
18510C259505r6546j16588p8918l10450k67479O8479J40651k31370O3039J04035
$$ 3259505 3162959 3046371 2967453 2657003 2389524 2458003 2598654 2367284 2430323 2534358
18500B534358k1518j23843j6308j39380m2790j1744J3390L0686R8645J82555K7851
$$ 2534358 2512840 2388997 2372689 2233309 2190519 2178775 2192165 2222851 2321496 2504051 2531902
18489B531902J8613O8706J48296J51739J45332P5052K01009K52440K11651K05225
$$ 2531902 2550515 2619221 2767517 2919256 3064588 3139640 3340649 3593089 3804740 4009965
18479D009965J73277L93116K29814L25306M12642L43441M07759K29717K25363
$$ 4009965 4183242 4576358 4806172 5131478 5544120 5887561 6295320 6525037 6750400
18470F750400J24246N8794J8090P1116L3052J50493J66947L58755L76174K99127
$$ 6750400 6874646 6933440 6951530 7022646 7055698 7206191 7373138 7731893 8108067 8407194
18460H407194K84643K95589K68999K57632J66978L17304L53174K80165K20309
$$ 8407194 8691837 8987426 9256425 9514057 9681035 9998339 10351513 10631678 10851987
18451A0851987N24928N48008J012527J114892J058058J356465J957074K668875
$$ 10851987 11376915 11924923 12937450 14052342 15110400 16466865 18423939 21092814
18443B1092814L706463N236138O960329R212829J1748304J3991750J5457919J4637075
$$ 21092814 24799277 30035415 36995744 46208573 57956877 71948627 87406546 102043621
18435A02043621J0841566N149178j258965p005959j0708812j2013696j1356576
$$ 102043621 112885187 118034365 116775400 109769441 99060629 87046933 75690357
18428G5690357j0084050q151974o278850m902701m107661l492284l003596k314628
$$ 75690357 65606307 57454333 51175483 46272782 42165121 38672837 35669241 33354613
18420C3354613j806130j177384n59530K28712J029235J780445K254671K450041
$$ 33354613 31548483 30371099 29811569 30040281 31069516 32849961 35104632 37554673
18412C7554673K285551J206703n6785j376525k150749k413712k026703j678777
$$ 37554673 39840224 41046927 40990142 39613617 37462868 35049156 33022453 31343676
18404C1343676j125453n88087j86659n4253K86763P31249R51110J357748K128268
$$ 31343676 30218223 29630136 29443477 29389224 29675987 30407236 31358346 32716094 34844362
18395C4844362K794035M067416N626982P562299J0146209J3283553J7141591K1008564
$$ 34844362 37638397 41705813 47332795 54895094 65041303 78324856 95466447 116475011
18387A16475011K3883057K4503041K1505801J4667614N305706m417016j2327632
$$ 116475011 140358068 164861109 186366910 201034524 206340230 201923214 189595582
18380A89595582j7728386j9307656j8223876j5814395j2591207r347413o545076
$$ 189595582 171867196 152559540 134335664 118521269 105930062 96582649 90037573
18373I0037573m020415j684284P53338L804871P023147J0259554J3033102J4604896
$$ 90037573 86017158 84332874 85086212 88891083 95914230 106173784 119206886 133811782
18365A33811782J3726768J0482808N419678m62605n808112r858930j2407861j3457220
$$ 133811782 147538550 158021358 163441036 162978431 157170319 147311389 134903528 121446308
18357A21446308j3241757j2032332j0636899q890688p120529n558711m257112
$$ 121446308 108204551 96172219 85535320 76644632 69524103 63965392 59708280
18350E9708280l124880k198737j465950n68178L63860J472456K633704L771754
$$ 59708280 56583400 54384663 52918713 52350535 52714395 54186851 56820555 60592309
18342F0592309M414704M761636M777309N032218N815820P215077Q779667R156914
$$ 60592309 65007013 69768649 74545958 79578176 85393996 92609073 101388740 110545654
18334A10545654P855768M740334J47639m069307p459568r175252r241056p789388
$$ 110545654 118401422 123141756 123289395 119220088 111760520 102585268 93344212 85554824
18326H5554824n682039l506337j510413N75438K839641N601706Q696699J2333299
$$ 85554824 79872785 76366448 74856035 75431473 78271114 83872820 92569519 104902818
18318A04902818J6287320J9850209K1740521K1530587J7873894J1083311K410639
$$ 104902818 121190138 141040347 162780868 184311455 202185349 213268660 215679299
18311B15679299o287719j3495494j7847532j9750686j9399572j7736254j5408892
$$ 215679299 209391580 195896086 178048554 158297868 138898296 121162042 105753150
18304A05753150j2656209j0398402q517330p045130n565845m503271l266527k134756
$$ 105753150 93096941 82698539 74181209 67136079 61570234 57066963 53800436 51665680
18296E1665680j119278R712J191892K406687L210302L121256K130968K12077j888257
$$ 51665680 50546402 50556114 51748006 54154693 57364995 60486251 62617219 62829296 60941039
18287F0941039l552342m746695n391250m930029l972861l131016k392164j877834
$$ 60941039 57388697 52642002 47250752 42320723 38347862 35216846 32824682 30946848
18279C0946848j233320j038667r58627n28469M7598N97584J165756J888229K691022
$$ 30946848 29713528 28674861 27716234 27187765 27235363 27832947 28998703 30886932 33577954
18270C3577954L867504N255235O862827Q437066R907194J0128176Q878964N996126
$$ 33577954 37445458 42700693 49563520 58000586 67907780 78035956 86914920 92911046
18262I2911046J877588k402686o214657q585483r341076r199128q072750o573458
$$ 92911046 94788634 92385948 86171291 77585808 68244732 59045604 50972854 44399396
18254D4399396n370815m287738l410173k749531k437252j842563j490952j242869
$$ 44399396 39028581 34740843 31330670 28581139 26143887 24301324 22810372 21567503
18246B1567503q51002m04774m2684N17979J004932J374751J607631J274299K25927
$$ 21567503 20716501 20311727 20269043 20787022 21791954 23166705 24774336 26048635 26274562
18237B6274562o43106j536448k090311k439428k367967k122364j663017j297865
$$ 26274562 25631456 24095008 22004697 19565269 17197302 15074938 13411921 12114056
18229A2114056j090421r23782q40838o32661o03482n21944l76073l63725l80644
$$ 12114056 11023635 10099853 9259015 8626354 8022872 7500928 7124855 6761130 6380486
18220F380486j98549l05336j97254k16112j25743j95352j90281k12499j72554
$$ 6380486 6181937 5876601 5679347 5463235 5337492 5142140 4951859 4739360 4566806
18211D566806j74607j45222j62888m1612m386j008n737o645j98454r9080J10765
$$ 4566806 4392199 4246977 4084089 4042477 4038091 4037083 4031346 4024701 3826247 3727167 3837932
18200C837932K76361Q3567j44154l8931P3533j05327k1550k25732l18960r9295
$$ 3837932 4114293 4197860 4053706 4014775 4088308 3982981 3961431 3735699 3416739 3317444
18190C317444K381r9604l628r4109j03328l9331r5708j07157j13761O3028L4430
$$ 3317444 3319825 3220221 3216593 3122484 3019156 2979825 2884117 2776960 2663199 2726227 2760657
18179B760657l0233j32734m8495j05398j15757j99547j26691k6682m4112j09735
$$ 2760657 2730424 2597690 2549195 2443797 2328040 2128493 2001802 1975120 1931008 1821273
18169A821273j79354o024J22193M5718R0073k6245j15196J24132J76054N8936
$$ 1821273 1641919 1635895 1758088 1803806 1893879 1867634 1752438 1876570 2052624 2111560
18159B111560j9940j96732p695j82173j17272N3848r7585J02175P3252K2803P8767
$$ 2111560 2091620 1894888 1887193 1705020 1587748 1641596 1544011 1646186 1719438 1742241 1821008
18148A821008M65953Q6852o7054J18209J02532k2685l0977j52083k59575k33763
$$ 1821008 2286961 2373813 2306759 2424968 2527500 2504815 2473838 2321755 2062180 1828417
18138A828417J6171J64175P3904Q4337O996j80303P3668J28895M0602k48368M6416
$$ 1828417 1844588 2008763 2082667 2167004 2174000 1993697 2067365 2196260 2236862 1988494 2034910
18127B034910K806j02456L1952R5859O8783J09793k1716k67804j51525j07844
$$ 2034910 2037716 1935260 1967212 2063071 2131854 2241647 2219931 1952127 1800602 1692758
18117A692758m7577j4573Q5585P7250j16453m4708L6152J68180P9119k21031j89891
$$ 1692758 1645181 1630608 1716193 1793443 1676990 1632282 1668434 1836614 1915733 1694702 1504811
18106A504811k06229m4650Q6659R7216K2051k48923p0724J56669J97525k10744
$$ 1504811 1298582 1253932 1340591 1437807 1459858 1210935 1140211 1296880 1494405 1283661
18096A283661j84147J46542r465K12315Q7085k9654j28135o8903k0886K663M4203
$$ 1283661 1099514 1246056 1236591 1448906 1535991 1506337 1378202 1309299 1288413 1291076 1335279
18085A335279J21316J0748L1415j6410J54042k0851J06149J68031J1064J03787
$$ 1335279 1456595 1467343 1498758 1482348 1636390 1615539 1721688 1889719 1900783 2004570
18075B004570l1278K7355J26742J3575j44629J0193K45241J27366q5888J34925
$$ 2004570 1973292 2000647 2127389 2140964 1996335 2006528 2251769 2379135 2293247 2428172
18065B428172k603N5673J14200j28138m4282r2102j08735p3616l24151J2685p0141
$$ 2428172 2425569 2481242 2595442 2467304 2423022 2330920 2222185 2148569 1824418 1837103 1766962
18054A766962N9831j30155k67722J7506Q5346q8831p9863Q4660j23502j71386
$$ 1766962 1826793 1696638 1428916 1446422 1531768 1442937 1363074 1447734 1324232 1152846
18044A152846K0644p0818j01969n0674N1567j4395O1299N3474j59861n6562j02513
$$ 1152846 1173490 1102672 1000703 950029 1001596 987201 1048500 1101974 942113 885551 783038
18033G83038j11978o3396J01845J30061J10248J46554M4230K4858n0106k04069
$$ 783038 671060 607664 709509 839570 949818 1096372 1140602 1165460 1115354 911285
18023I11285J9540J07693J40026J9536j3018J36069M6505Q689J25527j3996R8971
$$ 911285 930825 1038518 1178544 1198080 1185062 1321131 1367636 1376325 1501852 1487856 1586827
18012A586827j58659r3980J18980l9958J19860l7944r4109j23170j50088o2727
$$ 1586827 1428168 1334188 1453168 1413210 1533070 1495126 1401017 1277847 1127759 1065032
18002A065032O4063K11420L03m5253j8997J4716j70114k09587j77096K48990J1902
$$ 1065032 1129095 1340515 1340818 1295565 1276568 1291284 1121170 911583 734487 983477 995379
17991I95379r5397j2129k65273j85281O9179K24407L07318K3704k11108k47366
$$ 995379 899982 887853 622580 437299 506478 730885 1038203 1061907 850799 603433
17981F03433j8590J28500M2568M6017l1201k5456j68000j35133J17217J60272
$$ 603433 584843 713343 755911 801928 770727 745271 577271 442138 559355 719627
17971G19627J43766K3344j43727j04916j18514j9497M2280n9638k7080J12267
$$ 719627 863393 886737 743010 638094 519580 500083 542363 482725 455645 567912
17961E67912j00165o4629L6424N3362Q6536j6483j63656l2498j1259L6514l5855
$$ 567912 467747 403118 439542 492904 579440 562957 399301 366803 355544 392058 356203
17950C56203K05052Q2335K5227P8389j55975j28080J28429R2656p2934R6267P017
$$ 356203 561255 643590 668817 747206 591231 463151 591580 684236 611302 707569 714586
17939G14586j18676M6364k07842q3052L0685M9521K6890J6945p5114O4809p7896
$$ 714586 595910 642274 434432 351380 382065 431586 458476 475421 400307 465116 387220
17928C87220P9825M4419L5821J54543j16696l0678J5389Q4588J21177R5196K38440
$$ 387220 467045 511464 547285 701828 585132 554454 569843 654431 775608 870804 1109244
17917A109244J51660j23138j70570P7231J65587R7752m6979j06178n3602N1897
$$ 1109244 1260904 1137766 967196 1044427 1210014 1307766 1260787 1154609 1101007 1152904
17907A152904l1859j45599P1737R6670L00O862n8327j82112j3544j93757j02243
$$ 1152904 1121045 975446 1047183 1143853 1144153 1151015 1092688 910576 897032 703275 601032
17896F01032j9182Q9306M2536q2828O0133J52717O0744m5388P074n7061J52169
$$ 601032 581850 671156 713692 630864 690997 843714 904458 859070 866144 809083 961252
17885I61252m912p3001n003J34736j29052L8291K38800J92033J26746j80826k55121
$$ 961252 956340 883339 878336 1013072 884020 922311 1161111 1353144 1479890 1299064 1043943
17874A043943j97230J2262r443Q8380J74204J51024j9601L7758J24791J50562
$$ 1043943 846713 858975 849532 937912 1112116 1263140 1243539 1281297 1406088 1556650
17864A556650K07324J60750L8734j02245q014j22943m879l4879k24964p3727J16375
$$ 1556650 1763974 1924724 1963458 1861213 1853199 1730256 1725377 1690498 1465534 1391807 1508182
17853A508182M4220j10477K4686k26555j27713l6015q7843m0131J14949K10614
$$ 1508182 1552402 1441925 1466611 1240056 1112343 1076328 988485 948354 1063303 1273917
17843A273917J5125j78611K5032J18315K11835K3164j01703n2602J51500J09280
$$ 1273917 1289042 1110431 1135463 1253778 1465613 1488777 1387074 1334472 1485972 1595252
17833A595252K8150K7934Q899o0214j51328j77707j12119o4518j7648J43604J17940
$$ 1595252 1623402 1651336 1660235 1600021 1448693 1270986 1158867 1094349 1076701 1220305 1338245
17822A338245n2848o8426j83662o1489J52413P7800K7044l4289N5700M5375l4239
$$ 1338245 1285397 1216971 1033309 971820 1124233 1202033 1229077 1194788 1250488 1295863 1261624
17811A261624j48480m918l5837K7144N7880M552k17014k65221O9678P9978k9253
$$ 1261624 1113144 1108226 1072389 1099533 1157413 1161965 944951 679730 749408 829386 800133
17800H00133k4600o3855m1532J14825J83693N7213J79884J1662l3087q8922J2514
$$ 800133 775533 711678 670146 784971 968664 1025877 1205761 1217423 1184336 1095414 1107928
17789A107928l7170p171K9959j29572R064m8918J2555q1769N3437J32406L3104
$$ 1107928 1070758 1063587 1093546 963974 973038 924120 936675 854906 908343 1040749 1073853
17778A073853j44425j84518j19347m4578M5463Q4554N6361n6973j1774l6370q4176
$$ 1073853 929428 744910 625563 580985 626448 711002 767363 710390 698616 662246 578070
17767E78070n2116O4278k23126l9952J46670K30301L9774j04780j18548j80946
$$ 578070 525954 590232 367106 327154 473824 704125 743899 639119 520571 339625
17757C39625j38531K4436K0636K06493l6095q7826J4190J86602k3634q6951r3271
$$ 339625 201094 225530 246166 452659 416564 328738 342928 529530 505896 418945 325674
17746C25674M4108K6078o2322R216m9471j23714J02749K30115P7426k1593J5800
$$ 325674 369782 395860 333538 342754 293283 169569 272318 502433 579859 558266 574066
17735E74066j64191j25823O8088J39631m506L1609N0830o6124j71449R2025m0056
$$ 574066 409875 284052 352140 491771 487265 518874 569704 503580 332131 424156 384100
17724C84100n4512N1474o3054L0105m5759L8022j7550n6076n3669P7274K2237
$$ 384100 329588 381062 318008 348113 302354 340376 322826 266750 213081 290355 312592
17713C12592M5663l3583J00164J33714n5549p4068j66930n5229j79618o2553J35965
$$ 312592 358255 324672 424836 558550 503001 428933 262003 206774 27156 -35397 100568
17702A00568L8085j56952p8241j07306J58593J25045K0279n0710j87046k54414
$$ 100568 138653 -18299 -96540 -203846 -45253 79792 100071 49361 -137685 -392099
17692c92099K7228K38953J36732j4196j14467O7785Q2235m9602l8290k3055N0553
$$ -392099 -364871 -125918 10814 -3382 -117849 -50064 32171 -17431 -55721 -78776 -28223
17681b8223K3120l0155J13198J28863K4684J1007Q800k10477j54053K4942J28260
$$ -28223 -5103 -35258 77940 206803 231487 242494 251294 40817 -113236 -88294 39966
17670C9966L7438j34329p7612Q1850J01253j21674o9480M8667J6603N6587J17941
$$ 39966 77404 -56925 -134537 -52687 48566 -73108 -142588 -93921 -77318 -20731 97210
17659I7210q3413p3620Q8085O5695p6257j52760m313J13778O3557J5529p8434
$$ 97210 13797 -59823 28262 93957 17700 -135060 -139373 -25595 37962 53491 -24943
17648b4943N0047J42705Q2087K1448o8527m8187k6845L3981M7238j32279p9954
$$ -24943 25104 167809 249896 271344 202817 154630 127785 161766 209004 76725 -3229
17637c229n8643J531J49270P2470M9706j36900q8525o7634n338M7379P6940l6142
$$ -3229 -61872 -60341 88929 161399 211105 74205 -14320 -81954 -87292 -39913 37027 885
17625H85k9912P8327L7986n6787m6309J77811m0265O576J04056j39420j7063P9164
$$ 885 -29027 49300 87286 30499 -15810 162001 121736 128312 232368 92948 75885 155049
17613A55049p3014j60474J80369L794j31260n8571J4309L9637k739J1322o5196
$$ 155049 82035 -78439 101930 105724 -25536 -84107 -69798 -30161 -32900 -21578 -86774
17602h6774N8760J97419n4741p8190N1856J71511O1915P408N9883n7053j4372
$$ -86774 -28014 169405 114664 36474 88330 259841 321756 329164 389047 331994 317622
17591C17622r0979o2849Q2800j20601j74633O3015J97440L8761P3488K4009j54030
$$ 317622 226643 163794 246594 125993 -48640 14375 211815 250576 324064 348073 194043
17580A94043j39125n3105l7812J10317K7058Q5307p234K1522K6803J976k4558
$$ 194043 54918 1813 -35999 74318 101376 186683 179449 200971 227774 229750 205192
17569B05192j46965k00745l0838J99435p7853j10820K0360J75060K28422N2276
$$ 205192 58227 -142518 -173356 26079 -51774 -162594 -142234 32826 261248 313524
17559C13524m0907J04464L3229j2235n581j14836p7574j51636p9806J78485o3628
$$ 313524 272617 377081 410310 398075 392494 277658 200084 48448 -31358 147127 83499
17548H3499J56027J76911k3721j74006k61243k6480J80164r742j4333J7337O7160
$$ 83499 239526 416437 392716 218710 -42533 -69013 111151 101409 87076 104413 171573
17537A71573j59485L1866J24511M444j03151k2020P3869J7654j8555P115R60q1804
$$ 171573 12088 43954 168465 172909 69758 47738 121607 139261 120706 127821 128781 46977
17525D6977n626n8578O2292P3067O5732k9849P3809k3059j76399j7570J49969
$$ 46977 41351 -17227 45065 118132 183864 154015 227824 204765 28366 10796 160765
17514A60765j5827j21569r7515r057P2699N6039p8546O0041J7789o9400Q1715
$$ 160765 144938 23369 -74146 -83203 -10504 45535 -33011 27030 44819 -24581 57134
17503E7134l7631n8546J24119J69057J16375r2968j93790q5499r1209J07269K9717
$$ 57134 19503 -39043 85076 254133 370508 277540 83750 -1749 -92958 14311 44028
17492D4028Q4203L9188K370j82977K779k4340R29N0194q6233N5678K3107J8305
$$ 44028 128231 167419 169789 -13188 -10409 -34749 -33820 16374 -69859 -14181 8926 27231
17480B7231J10713m7935M5906J18928j57994o0260n9650j53955o9855j2548J43841
$$ 27231 137944 90009 135915 254843 96849 36589 -23061 -177016 -246871 -259419 -115578
17469a15578P977R2076J11642k9243j23545J659J39423m4663j58244K809N6598
$$ -115578 -107601 -15525 96117 66874 -56671 -55012 84411 39748 -118496 -115687 -59089
17458e9089p1684J86895J12585L272r0695R857J3632j01736J66473K5514j98434
$$ -59089 -130773 56122 168707 171979 81284 91141 104773 3037 169510 195024 -3410
17447c410k1921N040P3229j30854k03260j8374J56369L7379P9819J31929Q7487
$$ -3410 -25331 -20291 52938 -77916 -281176 -299550 -143181 -105802 -25983 105946 193433
17436A93433K4544o4837r1382R5952n1997J327j39474j14852M1062M6462J41068
$$ 193433 217977 153140 61758 157710 105713 107040 -32434 -147286 -106224 -59762 81306
17425H1306Q3738R1820O6884j45708l4303M40P920q3105o6475l0500q4254P504
$$ 81306 165044 256864 323748 178040 143737 144177 152097 68992 2517 -27983 -112237 -104733
17413a04733J32253J49367M1120j83808p431L8232k5056o5445N1465R6704K7407
$$ -104733 27520 176887 218007 34199 26768 65000 39944 -25501 25964 122668 150075
17402A50075M8662L6664k8764o4495L1657O2022P2621j93937r3346P498J41994
$$ 150075 198737 235401 206637 142142 173799 235821 308442 114505 21159 28657 170651
17391A70651N2112k6218k2322j29121r1970K2427l4416N5584O3451L9782O1556
$$ 170651 222763 196545 174223 45102 -46868 -24441 -58857 -3273 60178 99960 161516
17380A61516j0358P363K404j78868l8817j166K5760J38058J52901l7233r4312
$$ 161516 151158 158521 160925 -17943 -56760 -57926 -32166 105892 258793 221560 127248
17369A27248O0839k07713j7237J24879N7787J04123p5226j78854l8189J04228
$$ 127248 188087 -19626 -36863 88016 145803 249926 174700 -4154 -42343 61885
17359F1885J50759Q4168q4564k18781J5508L8252O1736J9834n2363j8414P4573
$$ 61885 212644 296812 212248 -6533 8975 47227 108963 128797 76434 58020 132593
17348A32593K1996Q9344j92479k05398k02171j9204J22662P6464o3735N6464r1135
$$ 132593 154589 243933 51454 -153944 -356115 -375319 -252657 -176193 -239928 -183464 -274599
17337b74599j3568J39075Q6478M716Q7395Q9869q4508j49758n0866P4873J03571
$$ -274599 -288167 -149092 -62614 -57898 29497 119366 34858 -114900 -165766 -90893 12678
17326A2678O7704P397j89585L1469N6277j19138L8071M3012n4634N2870M5797
$$ 12678 80382 87779 -101806 -70337 -14060 -133198 -95127 -52115 -106749 -53879 -8082
17315h082j4032M6918J71697k295R35P9485j55027j19412q1078j64971J04276
$$ -8082 -22114 24804 196501 194206 195141 274626 119599 187 -80891 -245862 -141586
17304a41586J59593J23699n4074p4851q2283n5945Q9948n9877m4847J79131J65332
$$ -141586 18007 141706 87632 12781 -69502 -125447 -35499 -95376 -140223 38908 204240
17293B04240j9563n689r1471m7120j0854M7093N5304n7076n5952q9542l7581j0434
$$ 204240 184677 178988 87517 40397 29543 76636 131940 74864 18912 -70630 -108211 -118645
17281a18645j32683P3184K26164J35389n9462j35654Q6851J6072j09475P8061
$$ -118645 -251328 -178144 48020 183409 123947 -11707 75144 91216 -18259 59802
17271E9802o919o7042M5522O8217J20303L2255l3980J4254j10352n3419M7584
$$ 59802 52883 -14159 31363 99580 219883 252138 218158 232412 122060 68641 116225
17260A16225k1479j34905M2311K8468l9417j9321j5544Q6929k24718J5673K12978
$$ 116225 94746 -40159 2152 30620 -8797 -28118 -43662 43267 -181451 -165778 47200
17249D7200k8253O40P8486J8109N6129J33249n4719m8916n2890j16643l9706J6451
$$ 47200 18947 19587 98073 116182 172311 305560 250841 201925 149035 32392 -7314 9137
17237I137o3365J56986P378m4297k1403l4067J16431j1574j23665K4572O602P5786
$$ 9137 -54228 102758 110136 65839 44436 10369 126800 115226 -8439 16133 22735 98521
17225I8521k6848O0338j8471p1318N9664k212K0388q826j07483p4762j7715M8268
$$ 98521 71673 132011 113540 42222 101886 99674 120062 111236 3753 -71009 -88724 -40456
17213d0456n3891N816M4007o6675J33185P7560j03703O467J4573k4314j15965
$$ -40456 -94347 -88531 -44524 -111199 21986 99546 -4157 2310 16883 -7431 -123396
17202a23396j3178n9163M7175J6550j30846q456L9288P5545O6394N8626k0513
$$ -123396 -136574 -195737 -148562 -132012 -262858 -271314 -232026 -156481 -90087 -31461 -51974
17191e1974J14546J13910P8494n7873k3282j9323r2153k6265q972j8679P629j61481
$$ -51974 62572 176482 254976 197103 173821 154498 62345 36080 27108 8429 16058 -145423
17179a45423J32466J46599P6971n5513m9304j64420L3526K8907j39974j04856
$$ -145423 -12957 133642 210613 155100 105796 -58624 -25098 3809 -136165 -241021
17169b41021l3140J76075K27866J05871k3085j06865J05216r1070k9651p4106
$$ -241021 -274161 -98086 129780 235651 212566 105701 210917 119847 90196 16090
17159A6090o1453J70353M5953m3082J66025P898j5946O3198J812j34706j75742
$$ 16090 -45363 124990 170943 127861 293886 301784 285838 349036 350848 216142 40400
17148D0400o6262k1933R4342M0558O7989J3665k45247k05565o3681N0926p582
$$ 40400 -25862 -47795 46547 87105 155094 168759 -76488 -282053 -345734 -294808 -302390
17137c02390j1993J24699K28315J27611o8124j01343Q2313L0362k2663o542K7700
$$ -302390 -314383 -189684 38631 166242 98118 -3225 79088 109450 86787 80245 107945
17126A07945n6335m3771R7718M4503j48721m9581j99928k2067J23251J19130Q2615
$$ 107945 51610 7839 105557 150060 1339 -48242 -248170 -270237 -146986 -27856 54759
17115E4759K5353M9517j20667j43681p8824L703J04851J09090l2190j41749K8021
$$ 54759 80112 129629 8962 -134719 -213543 -209840 -104989 4101 -28089 -169838 -141817
17104a41817J31175J22327L0203K2995j5022j19577j19205J35886J13011m0889
$$ -141817 -10642 111685 141888 164883 149861 30284 -88921 46965 159976 119087
17094A19087j6539k2345O994q7645N2771L4681j33677q3799n9697J11077L5369
$$ 119087 102548 80203 87197 -448 52323 87004 -46673 -130472 -190169 -79092 -43723
17083d3723k47493M4921R7727J00189K615q014L8338K26313R7893q5209k4334
$$ -43723 -291216 -246295 -148568 -48379 -45764 -53778 -15440 210873 308766 223557 199223
17072A99223k02270p1132J6426N645J0876O5922j04337r6806O0083n4037k3738
$$ 199223 -3047 -74179 -57753 -52108 -41232 24690 -79647 -176453 -116370 -170407 -194145
17061a94145K9821m8996J5984J40152R9851m836l5007m9922Q2461J47695r1741
$$ -194145 -164324 -213320 -197336 -57184 42667 37831 2824 -47098 35363 183058 91317
17050I1317j29651M7394J18718K27474P9878q7038j82072k5796o9900j04245j34305
$$ 91317 -38334 9060 127778 355252 435130 348092 166020 140224 70324 -33921 -168226
17039a68226Q2654M5060J62755P3709N92q8332j67348L742M6856R9143O5374l6974
$$ -168226 -85572 -40512 122243 195952 196544 108212 -59136 -55394 -8538 90605 155979 119005
17027A19005j09412J31955N5055J9293J08921j58496j02466L5084J9363j2699
$$ 119005 9593 141548 196603 215896 324817 166321 63855 98939 118302 105603
17017A05603J01515r6457j17496J75511J09195o8179k04458p0152o1305K2052
$$ 105603 207118 110661 -6835 168676 277871 209692 5234 -64918 -126223 -104171
17007a04171J10638L7370o0400p9949k7212J08227J87922j0639r5687M6818p8636
$$ -104171 6467 43837 -16563 -96512 -123724 -15497 172425 161786 66099 112917 34281
16996C4281n8051K78241l9085k18141O7974J32595q8084r3669p6480L4408j03870
$$ 34281 -23770 254471 215386 -2755 65219 197814 109730 16061 -60419 -26011 -129881
16985a29881p8044O3540J49252n9238n8916j11199m9963Q8578J56029k1511j6570
$$ -129881 -207925 -144385 4867 -54371 -113287 -224486 -274449 -185871 -29842 -51353 -67923
16974f7923J0031P0837R7848J3732K5452J8398Q4946j86831n3519o0998j53408
$$ -67923 -57892 12945 110793 124525 149977 168375 253321 66490 12971 -48027 -201435
16963b01435m062P4214R9040R263n2447Q9930r3507J1793M9853L1586k8746n8175
$$ -201435 -205497 -131283 -32243 -22980 -75427 14503 -79004 -67211 -17358 14228 -14518 -72693
16951g2693J0310J63927j64780P2961O0210o9039j00465j14306j05037J2922J85843
$$ -72693 -62383 101544 -63236 9725 69935 896 -99569 -213875 -318912 -305990 -120147
16940a20147K31620L1698J24818L472k60225J0638K07928J20528p7676j31555
$$ -120147 111473 143171 267989 271461 11236 21874 229802 350330 272654 141099
16930A41099j89467j28253P0069K9451J25913L2277J8847M9236n2623J41431q235
$$ 141099 -48368 -176621 -106552 -77101 48812 81089 99936 149172 96549 237980 229745
16919B29745j491j71443j47003J835j1548J21613J41897J0850m2344j3453j09452
$$ 229745 228254 56811 -90192 -88357 -99905 21708 163605 174455 132111 118658 9206
16908I206l3948j1105J06737K82595K1718j62938j72352P6274L760P0046k4643
$$ 9206 -24742 -35847 70890 353485 375203 212265 39913 116187 119947 189993 165350
16897A65350j96574l0715R6371K274k14478q1389J16962J27620j44586J15333
$$ 165350 -31224 -61939 34432 36706 -177772 -259161 -142199 -14579 -159165 -43832
16887d3832J2334Q1393J9821P205k05191j3508J30655k4622l1478O067j3275Q9798
$$ -43832 -31498 49895 69716 76921 -128270 -141778 -11123 -35745 -67223 -61156 -74431 15367
16875A5367K56094R3518o2716j06497J14135M3075R3891j21912M7582J4229r3400
$$ 15367 271461 364979 302263 195766 309901 352976 446867 324955 372537 386766 293366
16864B93366k57371J25999k3967j17623m5139J46042p6751j12843J3123l8453
$$ 293366 35995 161994 138027 20404 -24735 121307 44556 -68287 -55164 -93617
16854i3617j23798N658M7299K2130L9015L6045k35l1462P3838M0480j12685J7696
$$ -93617 -217415 -211757 -164458 -142328 -103313 -67268 -67503 -98965 -25127 15353 -97332 -79636
16842g9636J07783J15776J8731J7184j55789r8709n6629M5126J14594R9038O487
$$ -79636 28147 143923 162654 179838 24049 -74660 -131289 -86163 28431 127469 133956
16831A33956K0598l7782K5778P7556J79958j46803j44650j25990r9812l849P2083
$$ 133956 154554 116772 142550 220106 400064 253261 108611 -17379 -117191 -121040 -48957
16820d8957P2868R6446J66860j94730j80662K7427J59036L1982M5098K3273j75218
$$ -48957 23911 120357 287217 92487 -88175 -60748 98288 130270 175368 198641 23423
16809B3423k10707k8043q7556J70192P8866P7149K2546N7575R6862K6784n7958
$$ 23423 -187284 -215327 -302883 -132691 -53825 23324 45870 103445 200307 227091 169133
16798A69133m3415j03042j07453J44962J5077q4615r6944Q0342M6059p2377p3686
$$ 169133 125718 22676 -84777 60185 75262 -9353 -106297 -25955 20104 -52273 -125959
16787a25959l1092J34452r1608j34871M5396j8834R0199M8005l9007o45o553j08045
$$ -125959 -157051 -22599 -114207 -249078 -203682 -222516 -132317 -84312 -123319 -123964 -130517 -238562
16775b38562l688J10546n9484O286O3421L2136J98556J78402j69989j54718Q7984
$$ -238562 -242250 -131704 -191188 -184902 -121481 -89345 109211 287613 117624 -37094 50890
16764E0890o2963q6275J4063J47345R5578m9492j23055N0397l0005j5964j09742
$$ 50890 -12073 -98348 -84285 63060 158638 109146 -13909 36488 6483 -9481 -119223
16753a19223j35591k3581R4616O4218J7924q9087m7899n3289k575J75351J61833
$$ -119223 -254814 -278395 -183779 -119561 -101637 -190724 -238623 -291912 -294487 -119136 42697
16742D2697L7979K16163P9927n2271j19239J14503l1748j70214q6434p7901K6590
$$ 42697 80676 296839 376766 324495 205256 319759 288011 117797 31363 -46538 -19948
16731a9948K49470m7083L2792J64676m8462j28377j57098k27605l6776J29616
$$ -19948 229522 182439 215231 379907 331445 203068 45970 -181635 -218411 -88795
16721h8795P2417N7321l4963M9118l1524r2865p2086K95338l2960N6383j7409
$$ -88795 -16378 40943 5980 55098 23574 -69291 -141377 153961 121001 177384 159975
16710A59975K410M0460p3684k43202K14140N1187p802o2947l2590k1174j39274
$$ 159975 162385 202845 129161 -114041 100099 151286 143484 80537 47947 26773 -112501
16699a12501p1506K9145J86116n7345M4443M1256j10349k6681J70374m8161p9711
$$ -112501 -184007 -154862 31254 -26091 18352 59608 -50741 -77422 92952 44791 -34920
16688c4920j7383o4077L1477N972r9931l4591L292R8141M7160o1860r2034R1551
$$ -34920 -52303 -116380 -84903 -78931 -178862 -213453 -210161 -112020 -64860 -126720 -218754 -127203
16676a27203M8515L4947L1231k4637K2160l5240m5878J82536j7092p6115k5930
$$ -127203 -78688 -43741 -12510 -37147 -14987 -50227 -96105 86431 69339 -6776 -32706
16665c2706J2891Q2790m8130K9733L59j06668R8546K2237m9030J0905n2004j09193
$$ -32706 -19815 62975 14845 44578 44937 -61731 36815 59052 10022 20927 -31077 -140270
16653a40270K4955M626q0725J18618N72j89315j28246N0497J49594R929l0991
$$ -140270 -115315 -110689 -191414 -72796 -72224 -261539 -389785 -339288 -189694 -179765 -210756
16642b10756j08982J91076J08205J42265R4311M186J698j77045n0J01880j19062
$$ -210756 -319738 -128662 -20457 121808 216119 220305 222003 44958 44908 146788 27726
16631B7726J07717J07232j14777J7752j5428p5652j59887o4565k878K20539l1236
$$ 27726 135443 242675 127898 145650 130222 54570 -105317 -169882 -172760 47779 16543
16620A6543o9394O2266o1995q3988j4989J17257N2909l5445l945J3333J16423
$$ 16543 -52851 9415 -52580 -136568 -151557 -34300 18609 -16836 -20781 -7448 108975
16609A08975K34361N132q6098j41467k0201L4166k185k3355R5336l2526j11750
$$ 108975 343336 348468 262370 120903 100702 134868 132683 109328 204664 172138 60388
16598F0388O2807K4224j12344m026J71541R4412r2638l2610m278j17224j0533
$$ 60388 123195 147419 35075 31049 202590 297002 204364 171754 167476 50252 39719
16587C9719l9311n9004k4354N2886J12031m8432l7796Q7898l5410j50233k0531
$$ 39719 408 -58596 -82950 -30064 81967 33535 -4261 83637 48227 -102006 -122537
16576a22537M410p5841R9126O9372j39856k4802K9485K3801J48715N6532P1002
$$ -122537 -118127 -193968 -94842 -25470 -165326 -190128 -160643 -136842 11873 68405 139407
16565A39407P5854o6371m4006k9898j25988L8841l1264m8820J9352l114n2402
$$ 139407 215261 148890 104884 74986 -51002 -12161 -43425 -92245 -72893 -76007 -128409
16554a28409j38839N8109J33320j7745j2278P863l2478O5070P0308K5265j21622
$$ -128409 -267248 -209139 -75819 -93564 -105842 -97979 -130457 -65387 4921 30186 -91436
16543i1436q7318j57417l4100J11240J98884o2432L9537J16205L7774q827Q2057
$$ -91436 -178754 -336171 -370271 -259031 -60147 -122579 -83042 33163 70937 62110 144167
16532A44167Q0325j11007k95929j19075J48418m974K5100M4813N9718P2328R7067
$$ 144167 224492 113485 -182444 -301519 -153101 -158075 -132975 -88162 -28444 43884 140951
16521A40951Q7754k17152P5589Q0266j22931K1260j02735j0726o091j1912O315
$$ 140951 228705 11553 87142 167408 44477 65737 -36998 -47724 -53815 -65727 -59412
16510e9412O0049J34749l4684o1158k7960o0172m8030M7003R0641K2112j05200
$$ -59412 637 135386 100702 39544 11584 -48588 -96618 -49615 41026 63138 -42062
16499d2062k8662p487m2645m3725O5243j24670L0353L6415M3535k1220K4811J4745
$$ -42062 -70724 -78211 -120856 -164581 -99338 -224008 -193655 -157240 -113705 -134925 -110114 -95369
16487i5369P3627K67442M748j73898o667J04083j39089n7205J24955J02342l2598
$$ -95369 -21742 245700 250448 76550 69883 173966 34877 -22328 102627 204969 172371
16476A72371J3250q2299j05336k2497M1768l7415j7604L30M0150K9084M3318j3118
$$ 172371 185621 103322 -2014 -24511 17257 -20158 -37762 -37432 2718 31802 75120 62002
16464F2002k03086O5510M0534n4249K00010J33021J4301j20712k40374k26784
$$ 62002 -141084 -75574 -35040 -89289 110721 243742 258043 137331 -103043 -329827
16454c29827j37739P5103K31458K29996J2177j28812k724J2266Q8302P4272p7298
$$ -329827 -467566 -392463 -161005 68991 81168 -47644 -50368 -38102 50200 124472 47174
16443D7174o6434M0321M5504Q1794L9999j20812J94976J46482j44357p6002R38
$$ 47174 -19260 21061 66565 148359 188358 67546 262522 409004 264647 188645 189583
16432A89583j2669K3553K1789k467J9769K6637N3478j74216L9353N5410l1518
$$ 189583 176914 200467 222256 219789 239558 266195 319673 145457 184810 240220 208702
16421B08702k35898j03981P2401L3366j06297K9716J08937j39559m2356P1060
$$ 208702 -27196 -131177 -58776 -25410 -131707 -101991 6946 -132613 -174969 -103909
16411a03909l3449m6746j61522M0642L6034J30159L4990J0901N906M6002P3356
$$ -103909 -137358 -184104 -345626 -304984 -268950 -138791 -103801 -92900 -86994 -40992 32364
16400C2364M2462M2006m0519p9321j04359n9838l0713J8097J9918l5580J07041
$$ 32364 74826 116832 76313 -3008 -107367 -167205 -197918 -179821 -159903 -195483 -88442
16389h8442K69673k6180k37450M524j03367o6103l975L9745J06994J5618K5262
$$ -88442 181231 155051 -82399 -77875 -181242 -247345 -251320 -211575 -104581 -88963 -63701
16378f3701L1055J1648J10735R4374R2596M0002n316j34719l9950M1308J67148
$$ -63701 -32646 -20998 89737 184111 276707 316709 311393 176674 136724 178032 345180
16367C45180p5517l7521O9978o9264k26781L2611l2901j27155Q690K27055P7607
$$ 345180 269663 232142 302120 232856 6075 38686 5785 -121370 -112680 114375 191982
16356A91982j10202K3826r8511n2500j23636p4976J68839J37485n6064k8694J13107
$$ 191982 81780 105606 7095 -45405 -169041 -244017 -75178 62307 6243 -22451 90656
16345I0656l3626K4459P78j41161r1155L07057J00048l41301j13166R6997J05277
$$ 90656 57030 81489 82267 -58894 -150049 157008 257056 -84245 -197411 -100414 4863
16334D863K6014J03755J2826o3992N1637m7330L6546Q4638j0095l3593M2561j44682
$$ 4863 30877 134632 147458 83466 135103 87773 124319 208957 198862 165269 207830 63148
16322F3148j32727O8132K5116M3263q2530j02483P5014J20200J31431R0984o8599
$$ 63148 -69579 -1447 23669 66932 -15598 -118081 -43067 77133 208564 299548 230949
16311B30949m7226q0919k8852j64416M3595J66034L0448J223J26217m0966K2347
$$ 230949 183723 102804 73952 -90464 -46869 119165 149613 150836 277053 236087 258434
16300B58434N690P9212P323n0709o5890P95r4522j77043j41305K8686k8969J11178
$$ 258434 264124 343336 350659 299950 234060 234855 140333 -36710 -178015 -149329 -178298 -67120
16288f7120O9956n8267j25611J49960J42804N6286K3580J6685j8089o7388j06813
$$ -67120 2836 -55431 -181042 -31082 111722 168008 191588 208273 190184 122796 15983
16277A5983R830K1713J70845R9188k2098q3686o7168m5525J06198O7829k1639
$$ 15983 25813 47526 218371 317559 295461 211775 144607 99082 205280 273109 251470
16266B51470j89053r8733N4406j53069j50896P9442K4862j5267l3726l4805M5494
$$ 251470 62417 -36316 18090 -134979 -285875 -206433 -181571 -196838 -230564 -265369 -219875
16255b19875J17332K4184j08536Q9145J61268p3824j70351J00914r6065M4700
$$ -219875 -102543 -78359 -186895 -97750 63518 -10306 -180657 -79743 -175808 -131108
16245a31108J52069J69960N396q5652j04424J2895R5152J02894m6621j27695J062
$$ -131108 20961 190921 196317 110665 6241 19136 114288 217182 170561 42866 43928
16234D3928J00903m7450j75844Q065K24727L9966n2082n9551O5682J00761P6931
$$ 43928 144831 97381 -78463 -70398 154329 194295 142213 82662 148344 249105 326036
16223C26036j11696j23352k51003j71932J11863L6238O5133m4481O525o530r783
$$ 326036 214340 90988 -160015 -331947 -220084 -183846 -118713 -163194 -156669 -163199 -172982
16212a72982R0727J04483Q5741n2225J0437j00176o0075N6077o6472J66331N3679
$$ -172982 -82255 22228 107969 55744 66181 -33995 -94070 -37993 -104465 61866 115545
16201A15545r5546R456L7947l5175j97378j78348k6658J1499Q8069k3283K27657
$$ 115545 19999 29455 67402 32227 -165151 -343499 -370157 -358658 -270589 -293872 -66215
16190f6215O1866R7445M6246n5365o7357N2313J53900Q1553l2897l2260j42176
$$ -66215 -4349 93096 139342 83977 16620 68933 222833 304386 271489 239229 97053
16179I7053j0329L2970p7699J53070k3356q5272m6442j9213n3263N0436J78722
$$ 97053 86724 119694 41995 195065 171709 86437 39995 20782 -32481 17955 196677
16168A96677O8669j94944k15646p1470l7507j7958J08530J41719O376k03742O3213
$$ 196677 265346 70402 -145244 -216714 -254221 -272179 -163649 -21930 -15554 -219296 -156083
16157a56083O5131m2433J1656k4381m1496N4700O3872j0130l3663N3771M9944
$$ -156083 -90952 -133385 -121729 -146110 -187606 -132906 -69034 -79164 -112827 -59056 -9112
16146i112J63145l0810j63538o1104K1206J09486j32708j79207R1040J13676O734
$$ -9112 154033 123223 -40315 -101419 -80213 29273 -103435 -282642 -191602 -77926 -71192
16135g1192m4861j41949P1754J1117Q4835N1818k8954Q5489m1430j9106j4920
$$ -71192 -116053 -258002 -186248 -175131 -90296 -38478 -67432 18057 -23373 -42479 -57399
16124e7399n1048j20858p4202P8055J4080q0019Q7997N9893p9689k8251l3186
$$ -57399 -108447 -229305 -303507 -225452 -211372 -291391 -203394 -143501 -223190 -251441 -284627
16113b84627J01672Q5695R5401K688j23044k1874l2888M0595l5409m6654J88668
$$ -284627 -182955 -97260 -1859 829 -122215 -144089 -176977 -136382 -171791 -218445 -29777
16102b9777J08966L9300N9853p2307P9288n1080p1280j9240j34162J2512O8826
$$ -29777 79189 118489 178342 106035 185323 134243 62963 43723 -90439 -77927 -9101
16091i101Q212r1779N525k8184j36641L9722N5889L8538K14132R157M68p0574
$$ -9101 -889 -92668 -87143 -115327 -251968 -212246 -156357 -117819 96313 105470 105938 35364
16079C5364p2998J18303r4931M881J65609Q9764j00746k41931q4669n4725j6121
$$ 35364 -37634 80669 -14262 -9381 156228 245992 145246 -96685 -181354 -236079 -252200
16068b52200K11306K32391l4773j82108p8144J7250P9722J15828j15565k08758
$$ -252200 -40894 191497 156724 -25384 -103528 -86278 -6556 109272 -6293 -215051
16058b15051l2382K8734M256l9191M4118J2372L1877L1279J25464m8363p1618
$$ -215051 -247433 -218699 -214443 -253634 -209516 -197144 -165267 -133988 -8524 -56887 -128505
16047a28505j7658K11403J09214q0112j50931L4931O0853j21607j6819m0318o7397
$$ -128505 -146163 65240 174454 94342 -56589 -21658 39195 -82412 -99231 -139549 -206946
16036b06946P045j2833o1041n2404J36712R8884m6903J27148M011j2663m6219
$$ -206946 -199901 -212734 -273775 -326179 -189467 -90583 -137486 -10338 -6327 -18990 -65209
16025f5209m8073J06769R5721j15322j24483q3697m4885j0009N6956J05634j1527
$$ -65209 -113282 -6513 89208 -26114 -150597 -234294 -279179 -289188 -232232 -126598 -138125
16014a38125J5222O9280K6538L1261k0990j57329m2816j01795O3839N1229j0997
$$ -138125 -122903 -53623 -27085 4176 -16814 -174143 -216959 -318754 -254915 -203686 -214683
16003b14683m6439l5673J16956J08813n0088M5335j32848J6825L7640J91673p8013
$$ -214683 -261122 -296795 -179839 -71026 -121114 -75779 -208627 -191802 -154162 37511 -40502
15992d0502q0016M9141q583L5657j1946m7990n2830j39290Q1349L6253O4115J41561
$$ -40502 -120518 -71377 -79960 -44303 -56249 -104239 -157069 -296359 -215010 -178757 -114642 26919
15980B6919j4910k07248j35638K3234J89695m9228p1278N4659P7566n7451M6796
$$ 26919 12009 -195239 -330877 -307643 -117948 -167176 -238454 -183795 -106229 -163680 -116884
15969a16884K3099K6669m1452J09399Q2967m4454l4852K5861J3396J29321L851
$$ -116884 -93785 -67116 -108568 831 83798 39344 4492 30353 43749 173070 176921
15958A76921N271l1206r8999J20479q97o9765l3237n2255k4161M1889L4545L9789
$$ 176921 182192 150986 51987 172466 171569 101804 68567 16312 -7849 34040 68585 108374
15946A08374j6576K1696j60296j23556M5402Q6279J12122P2493J05629m6442q6032
$$ 108374 91798 113494 -46802 -170358 -124956 -38677 73445 145938 251567 205125 119093
15935A19093k6945K4792L7153r9938r9020p476j0144l2662K4688P7811j24107
$$ 119093 92148 116940 154093 54155 -44865 -52341 -62485 -95147 -70459 7352 -116755
15924a16755j45003O7711N6072K3698j6765O0954l0316j05815q6309K00233j5245
$$ -116755 -261758 -194047 -137975 -114277 -131042 -70088 -100404 -206219 -292528 -92295 -107540
15913a07540p6133Q4788o2674r136J05535M9200j46053R851J22257P0636j40745
$$ -107540 -183673 -98885 -161559 -170695 -65160 -15960 -162013 -152162 -29905 40731 -100014
15902a00014k1892J83843J60150O5207j86013p6132O8529o0382l0807K8095n319
$$ -100014 -121906 61937 222087 287294 101281 25149 93678 33296 2489 30584 25265
15891B5265j51003J54506J22093L3335q9907K3258p1839O3801n4993M0685r4620
$$ 25265 -125738 28768 150861 184196 94289 117547 45708 109509 54516 95201 581
15880E81j45575p0343J18659K0872J12329N1156J2084p252j41872J673J78440
$$ 581 -144994 -215337 -96678 -75806 36523 87679 99763 92511 -49361 -47688 130752
15869A30752j34207j07883Q7342L8065P3450o689r8971o772P342L9375R2614k0992
$$ 130752 -3455 -111338 -23996 14069 87519 80830 -18141 -24913 -17571 21804 114418 93426
15857I3426p0923k2461M6011j11274r0945Q7337l4862L937l1754j5629Q2996j2840
$$ 93426 22503 42 46053 -65221 -156166 -68829 -103691 -99754 -131508 -147137 -64141 -76981
15845g6981p1009l4192J35679J214M3046K19544n4710j30112j42849n3881j11400
$$ -76981 -147990 -182182 -46503 -45289 -2243 217301 162591 32479 -110370 -164251 -275651
15834b75651m763R6507M8064k0391K7703m5732l3191m6846J23956Q4859j30531
$$ -275651 -280414 -183907 -135843 -156234 -128531 -174263 -207454 -254300 -130344 -45485 -176016
15823a76016j13809j5704R0595O2801k9469J3691K37430R0013k16951j75277J60187
$$ -176016 -289825 -305529 -214934 -152133 -181602 -167911 69519 159532 -57419 -232696 -72509
15812g2509M6237k135o2071M0541Q6547P6217j28302q6565P718j9042J933J57853
$$ -72509 -26272 -28407 -90478 -49937 36610 112827 -15475 -102040 -94322 -113364 -111431 46422
15800D6422l1515j7337l6726k2133n0934r693j18107l0471K87365P9324o3763
$$ 46422 14907 -2430 -39156 -61289 -112223 -121916 -240023 -270494 16871 96195 32432
15789C2432N8337j3034r5844J01944P9987q9777j46012j76481l8559J37131L25221
$$ 32432 90769 77735 -18109 83835 163822 74045 -71967 -248448 -287007 -149876 175345
15778A75345j6493n1073n2774p4724N2809k107N2204O799k4064j49320J39961
$$ 175345 158852 107779 55005 -19719 33090 30983 83187 89986 65922 -83398 56563
15767E6563J01090n0258O0223P6090o8071J25476n0264j83705O0879n6511P7587
$$ 56563 157653 107395 167618 243708 175637 301113 250849 67144 128023 71512 149099
15756A49099n6421j18632j25956M2475R4086p8447o540K8251J8565M6111o7312
$$ 149099 92678 -25954 -151910 -109435 -15349 -93796 -100336 -72085 -53520 -7409 -74721
15745g4721l6037P1319P4442l2850j26341j14521j6986M3411J35957l8841q3458
$$ -74721 -110758 -39439 35003 2153 -124188 -238709 -255695 -212284 -76327 -115168 -198626
15734a98626o9594J55741J48161O7645o7316J4074j4953K1660K4090p5873k20532
$$ -198626 -268220 -112479 35682 103327 36011 50085 35132 56792 80882 5009 -215523
15723b15523M2283R6630R4118k0353m3709n6380q2321m925J79087N90P562O4110
$$ -215523 -173240 -76610 17508 -2845 -46554 -102934 -185255 -190180 -11093 -10503 -2941 61169
15711F1169p2751M7704p8662k2601J45473J72638q2789L6613J80824K9713k73615
$$ 61169 -11582 36122 -42540 -65141 80332 252970 170181 206794 387618 417331 143716
15700A43716l15691p605n5066R0442K46680J88295m7829r5319N2670p9503j58542
$$ 143716 -171975 -179580 -234646 -144204 102476 290771 242942 147623 200293 120790 -37752
15689c7752l6882M9766J76486J34680j15330j27645j22280j540O8701J58789J25241
$$ -37752 -74634 -24868 151618 286298 170968 43323 -78957 -80497 -11796 146993 272234
15678B72234R542j38483l8537j56445p3740P5933N4150R4563M7298J70038j07287
$$ 272234 281776 143293 104756 -51689 -125429 -49496 4654 99217 146515 316553 209266
15667B09266j96186M2114p8082k28061P3372J31296k0903o5938n6328L1077Q5167
$$ 209266 13080 55194 -22888 -250949 -177577 -46281 -67184 -133122 -189450 -158373 -73206
15656g3206p4139j18800o3708L9680k1019M8972J20819K18571j21537j05356p7549
$$ -73206 -147345 -266145 -329853 -290173 -311192 -262220 -141401 77170 -44367 -149723 -227272
15645b27272L7319l1839L3406q1969l9899J05854L0709J38472K4417j11651k09048
$$ -227272 -189953 -221792 -188386 -270355 -310254 -204400 -173691 -35219 -10802 -122453 -331501
15634c31501j98555N6794O5437K54744K02176j93880j15716L4880J17965j1917
$$ -331501 -530056 -473262 -407825 -153081 49095 -144785 -260501 -225621 -107656 -119573
15624a19573J08280J24783n6221j7655j00827J0022N2043J03551J44915j67122
$$ -119573 -11293 113490 57269 39614 -61213 -51191 852 104403 249318 82196
15614H2196l26238K8078J71032o1038p9224o2431o9530K64733J96032k5304j0413
$$ 82196 -244042 -215964 -44932 -105970 -185194 -247625 -317155 -52422 143610 118306 107893
15603A07893j21686m0917N642r8923m9633K17850Q5264N3280o2253j25064j842
$$ 107893 -13793 -54710 -49068 -147991 -197624 20226 105490 158770 96517 -28547 -30389
15592c0389m8893j34981L5580l7197J21678K47376J12165L6448n6550j26377l637
$$ -30389 -79282 -214263 -178683 -215880 -94202 153174 265339 301787 245237 118860 115223
15581A15223R6993j132q8815m1495o8450m6398o1537J6218l5699r5789K09711
$$ 115223 212216 211084 122269 80774 12324 -34074 -95611 -79393 -115092 -210881 -1170
15570a170J92459n9242o9877l5433P6311Q5888p4754j69571j46420M4777J09308
$$ -1170 191289 132047 62170 26737 103048 188936 114182 -55389 -201809 -157032 -47724
15559d7724M2631J89980K8746j79419j07734N5109R6963K588j06541J8490m8927
$$ -47724 -5093 184887 213633 34214 -73520 -18411 78552 81140 -25401 -6911 -55838
15548e5838j02327l680L0690j94398J5388J71122k5409o4372J47050L3714J7571
$$ -55838 -158165 -161845 -131155 -325553 -310165 -139043 -164452 -228824 -81774 -48060 -30489
15537c0489K01847J23790J545o9260j36195q6743r4569L863K8499J9909N3481
$$ -30489 171358 295148 296693 227433 91238 4495 -90074 -86211 -57712 -37803 15678
15526A5678Q1215j5865p5594q1057k3754P2075K52992K22305p3048j40086J803
$$ 15678 96893 81028 5434 -75623 -99377 -27302 225690 447995 374947 234861 236664
15515B36664J09552r4039j48160j1065L6398L7593l6097j29889j40787q8811O6622
$$ 236664 346216 252177 104017 92952 129350 166943 130846 957 -139830 -228641 -162019
15504a62019Q3968N9488Q9958J64648K086j61866o6527L7072j14436L0722q8302
$$ -162019 -78051 -18563 71395 236043 238129 76263 9736 46808 -67628 -36906 -125208
15493a25208j69889J09282J83638R4510N5511M6514n3259K0539j02421k373n8034
$$ -125208 -295097 -185815 -2177 92333 147844 194358 141099 161638 59217 56844 -1190
15482a190k34768p9682J98191K29719o276j16977p7961M2724J41278K1626m2767
$$ -1190 -235958 -315640 -117449 112270 105994 -10983 -88944 -46220 95058 116684 73917
15471G3917k7197j53698P5026p584n609j02084j32071J16708K74449r234q6228
$$ 73917 46720 -106978 -31952 -39536 -45145 -147229 -279300 -162592 111857 102623 16395
15460A6395M8236q4166j58517Q6740J11511L3457p4337j06370P9575j11438m5796
$$ 16395 64631 -19535 -178052 -91312 20199 53656 -20681 -127051 -47476 -158914 -204710
15449b04710O5336K3830L2213n0096J04259n538l5703j36899j9270O1569J40572
$$ -204710 -139374 -115544 -83331 -133427 -29168 -34706 -70409 -207308 -226578 -165009 -24437
15438b4437Q1158l2954k00K8178K860Q130j6621j45206o0258J8844R4630K7543
$$ -24437 56721 23767 23567 51745 54605 62735 46114 -99092 -159350 -140506 -45876 -18333
15426a8333o4117q5147j26286K5466P1085M4612P8743P8039p3261O7247J06337
$$ -18333 -82450 -167597 -293883 -268417 -197332 -152720 -73977 4062 -69199 -1952 104385
15415A04385j20759K6123r3905j50213n4791K0758m0207K16969L9005l1749p428
$$ 104385 -16374 9749 -84156 -234369 -289160 -268402 -308609 -91640 -52635 -84384 -91812
15404i1812J78318J44315j94486j14791Q0152M2768j65689L6442M0230N682M0550
$$ -91812 86506 230821 36335 -78456 1696 44464 -121225 -84783 -44553 -38871 1679
15393A679o6242J69050J94361j4334J7699j02397q1897k8677k23237j58155J63864
$$ 1679 -64563 104487 298848 284514 302213 199816 117919 89242 -133995 -292150 -128286
15382a28286O6448l3195O5081k3545Q7891J7252J06772o3017q7738Q3399J49293
$$ -128286 -61838 -95033 -29952 -53497 34394 51646 158418 95401 7663 91062 240355
15371B40355o1688j36077q8232R0198o7121N5626Q9972m6547K3152Q4108j19556
$$ 240355 178667 42590 -45642 44556 -22565 33061 123033 76486 99638 183746 64190
15360F4190k16827r3631J36576m9595J32799J88838K8262n157K7617L9162j01283
$$ 64190 -152637 -246268 -109692 -159287 -26488 162350 190612 185455 213072 252234 150951
15349A50951j61464o2098p9056J01806p4158L8239J91064M2650l8077J47814Q1944
$$ 150951 -10513 -72611 -151667 -49861 -124019 -85780 105284 147934 109857 257671 339615
15338C39615n3783r3719l02215j97705m1428Q0462J84229J19343P0582j48772
$$ 339615 285832 192113 -110102 -307807 -349235 -268773 -84544 34799 105381 -43391
15328d3391J1286L4904p3438q4874q2098J52531J14792r0629r8557R3576K14356
$$ -43391 -32105 2799 -70639 -155513 -237611 -85080 29712 -60917 -159474 -65898 148458
15317A48458k4148j26803r2157j01863J27951j8012j33509k37252J16563J91621
$$ 148458 124310 -2493 -94650 -196513 -68562 -86574 -220083 -457335 -340772 -149151
15307a49151r732n2567k4953j55110m317K61962O9909j90962k547R651J30175
$$ -149151 -158883 -211450 -236403 -391513 -395830 -133868 -63959 -254921 -257468 -247817 -117642
15296a17642M8466J39681r0889j55103K8889M8106j6333J9931q6494K325J36134
$$ -117642 -69176 70505 -20384 -175487 -146598 -98492 -114825 -94894 -181388 -179063 -42929
15285d2929O4694o2600J323j10544o4138J59168N8989j27727R5771k5611J0891
$$ -42929 21765 -40835 -39512 -150056 -214194 -55026 3963 -123764 -27993 -53604 -42713
15274d2713q1936j64p2808k8272q9367r3043J12333M1204q8281N8902O8714P5266
$$ -42713 -124649 -124813 -197621 -225893 -315260 -408303 -295970 -254766 -343047 -284145 -215431 -140165
15262a40165q8186J30860P3789Q0859R3212J0946j43914k5639j10709j01976K0709
$$ -140165 -228351 -97491 -23702 57157 150369 161315 17401 -8238 -118947 -220923 -200214
15251b00214O5555M6795P4801r9955N9110L38002j06792j52419j82423Q8049J1138
$$ -200214 -134659 -87864 -13063 -113018 -53908 284094 177302 24883 -157540 -69491 -58353
15240e8353k11682K8409J40122O6210N2152k0877J02320M8490j48797o1785P4758
$$ -58353 -270035 -241626 -101504 -35294 16858 -4019 98301 146791 -2006 -63791 10967
15229A0967L4273k2102J8906J24825p9413j16427l4706q1235o306j40885O8586
$$ 10967 45240 23138 42044 166869 87456 -28971 -63677 -144912 -151218 -292103 -223517
15218b23517N4887K1429P1647K0642q6213J2495l4115j4546J1761J675P5792J53727
$$ -223517 -168630 -147201 -75554 -54912 -141125 -128630 -162745 -177291 -165530 -163855 -88063 65664
15206F5664M5847k01644M940P2J2612L4539L302p1155J50396P2831p2125k3646
$$ 65664 111511 -90133 -85193 -85121 -72509 -37970 -34668 -105823 44573 117404 45279 21633
15194B1633M6902r2075m9136j21412J472J08592J58133J12692j4695N0465j4353
$$ 21633 68535 -23540 -72676 -194088 -192616 -84024 74109 186801 172106 222571 208218
15183B08218L662N0676p255j43129l2578m7876j11537j28389J33421J07774R0580
$$ 208218 211880 262556 255301 112172 79594 31718 -79819 -208208 -74787 32987 123567
15172A23567n6787m3106J0506k1409m7112K14338J00994o307r7550O3613K451
$$ 123567 66780 23674 34180 12771 -34341 179997 280991 274684 177134 240747 243198
15161B43198r674J25960l80722k28878K13428M1822j4244L8432K02913L6157j44582
$$ 243198 233524 359484 -21238 -250116 -36688 5134 -9110 29322 232235 268392 123810
15150A23810K7863J04338n9302o9074p0218k3122p4380j33689L4576N6628R1246
$$ 123810 151673 256011 196709 127635 57417 34295 -40085 -173774 -139198 -82570 8676
15139H676R2500K8515k08678j6044R7311O7046P5115K0521J100k8072j25644k4624
$$ 8676 101176 129691 -78987 -95031 2280 69326 144441 164962 166062 137990 12346 -12278
15127a2278M7037j25858N0478J02764k04333j68636J67100Q3904J7210j12462
$$ -12278 34759 -91099 -40621 62143 -142190 -310826 -143726 -59822 -42612 -155074
15117a55074o0208p541O0136R3230j2137R4056n1450j38544n4271n4113N19J06636
$$ -155074 -215282 -222823 -162687 -69457 -81594 12462 -38988 -177532 -231803 -285916 -285397 -178761
15105a78761L8024n7165J74672P3333q8802j32717r2034O8968K09898l0925j03378
$$ -178761 -140737 -197902 -23230 50103 -38699 -171416 -263450 -194482 15416 -15509 -118887
15094a18887j18023j36032P4335J87269K2411J3045L3810J50184l0786J3430M6895
$$ -118887 -236910 -372942 -298607 -111338 -88927 -75882 -42072 108112 77326 90756 137651
15083A37651L5066r3538j54350N7380K4935j08535l933j15457j0265L1165P1035
$$ 137651 172717 79179 -75171 -17791 7144 -101391 -105324 -220781 -231046 -199881 -128846
15072a28846n6317L2438N925q9604j0710m3999J12534L1475P9371o491j21274
$$ -128846 -185163 -152725 -146800 -236404 -247114 -291113 -178579 -147104 -67733 -74224 -195498
15061a95498n8913R4490N6168j16355O609N1761Q580k06502k8352K67417R2246
$$ -195498 -254411 -159921 -103753 -220108 -213499 -161738 -153158 -359660 -388012 -120595 -28349
15050b8349o9347L9775J9258J36139P6191q3477j00154m1122l6499j08469j10497
$$ -28349 -97696 -57921 -38663 97476 173667 90190 -9964 -51086 -87585 -196054 -306551
15039c06551K3061L142J07049O5519J33553o927J5556j68691j15184q0746J00051
$$ -306551 -283490 -280348 -173299 -107780 25773 18846 34402 -134289 -249473 -330219 -230168
15028b30168J71692M8409j43942O2239Q8638N6850o8646k17448o375J18653J60375
$$ -230168 -58476 -10067 -154009 -91770 -3132 53718 -14928 -232376 -238751 -120098 40277
15017D0277J35192O3768k9361r5817L1118M6961q7971o5517L3990k9224j36707
$$ 40277 175469 239237 209876 114059 145177 192138 104167 38650 72640 43416 -93291
15006i3291o0249O4895K5202j7409l9581L0962j26367j02353L3231J7709K4643
$$ -93291 -153540 -88645 -63443 -80852 -120433 -89471 -215838 -318191 -284960 -267251 -242608
14995b42608K72477J47800L7214p1356j58201j43257K9571N0915K7173L8107l7024
$$ -242608 29869 177669 214883 143527 -14674 -157931 -128360 -77445 -50272 -12165 -49189
14984d9189L0623m447o4058q4296M7044q9461m9330K14076K45186J22096k36749
$$ -49189 -18566 -23013 -87071 -171367 -124323 -213784 -263114 -49038 196148 318244 81495
14973H1495q0398j14715M4665oo8912k1682J38226k8056j28894p2248J15319N3329
$$ 81495 1097 -113618 -68953 -68959 -137871 -159553 -21327 -49383 -178277 -250525 -135206 -81877
14961h1877j30200J16607j025k7266k933M1452j5071m3034K6262M3941o2196k5607
$$ -81877 -212077 -95470 -96495 -123761 -126694 -85242 -100313 -143347 -117085 -73144 -135340 -160947
14949a60947P0737r3885L0639j76343j11890P2526K24164R8724o3085K3538L3756
$$ -160947 -90210 -184095 -153456 -329799 -441689 -369163 -144999 -46275 -109360 -85822 -52066
14938e2066j6803m9939n3813N1771r3699Q5547J84621j27317j8531q1793M3707
$$ -52066 -68869 -118808 -172621 -120850 -214549 -129002 55619 -71698 -90229 -172022 -128315
14927a28315J50593J9803l010r5233j6776j43628N8813N9740R1292o94K29223
$$ -128315 22278 42081 39071 -56162 -72938 -216566 -157753 -98013 -6721 -7415 221808
14916B21808J3081k79912L3516J94684m3876O6094M1038q8857q2480n8703j35713
$$ 221808 234889 -45023 -11507 183177 139301 205395 246433 157576 75096 16393 -119320
14905a19320k4966J18098m4780j75247O1980J22829q3851P3268r5042j58649K4067
$$ -119320 -144286 -26188 -70968 -246215 -184235 -61406 -145257 -71989 -167031 -325680 -301613
14894c01613K48799J47793J71810K3157L0202K6670j85286k12646j49398J48750
$$ -301613 -52814 94979 266789 289946 320148 346818 161532 -51114 -200512 -51762
14884e1762J15223p5630L3888L0151m7373J11978m868n7080r8041L1953o2353
$$ -51762 63461 -12169 21719 51870 4497 116475 111607 54527 -43514 -11561 -73914
14873g3914K9501K15318L7008k823L2444k9705N0972R0452j13643j16910j33160
$$ -73914 -44413 170905 207913 205090 237534 207829 258801 349253 235610 118700 -14460
14862a4460Q6397O3270k5761k3250L7544k7322L6239R7388O3370j88220m2872
$$ -14460 71937 135207 109446 86196 123740 96418 132657 230045 293415 105195 62323
14851F2323Q793J5189M1222N8031j15068k48435K6706R5697M1218l6622p2915
$$ 62323 71116 86305 127527 185558 70490 -177945 -151239 -55542 -14324 -50946 -123861
14840a23861n8k9009n3943K26678K02421L9292j75688j41315O9692j09892j35004
$$ -123861 -123919 -152928 -206871 19807 222228 261520 85832 -55483 14209 -95683 -230687
14829b30687j13002J61928J43857J57179o8830L5362j03956m9947P9714j9665
$$ -230687 -343689 -181761 -37904 119275 50445 85807 -18149 -68096 11618 -8047
14819h047n3370M5725N5970r6611J8275r8863k0209j22579k6234L7745J12748
$$ -8047 -61417 -15692 40278 -56333 -38058 -136921 -157130 -279709 -305943 -268198 -155450
14808a55450R8091K44471J4255o979k1464r2179J7634j48292p6976M3253J89898
$$ -155450 -57359 187112 201367 194388 172924 80745 98379 -49913 -126889 -83636 106262
14797A06262o8472j28802K8586P4177n445n3048l5298O0436K72190K3824j23512
$$ 106262 37790 -91012 -62426 11751 6306 -46742 -82040 -21604 250586 274410 150898
14786A50898J23093M5439j20832o2066j71615j14397O3489K3674m8185j5310q9078
$$ 150898 273991 319430 198598 136532 -35083 -149480 -85991 -62317 -110502 -125812 -214890
14775b14890j16192M8221P0454l0567J7675j06099k7216J53689J54177N1039q5109
$$ -214890 -331082 -282861 -212407 -242974 -225299 -331398 -358614 -204925 -50748 291 -84818
14764h4818Q1427M1239P6422Q328P0525O4060o3075k5331n340r8048j47583J6974
$$ -84818 -3391 37848 114270 122598 193123 257183 194108 168777 163437 65389 -82194 -65220
14752f5220J84448L1399m5008J27677L9328p5681n3033m3637M3941j663j18745
$$ -65220 119228 150627 105619 233296 272624 196943 143910 100273 144214 142551 23806
14741B3806r3074P1214m1523j76305K14419K16892k69781j3978J08472J48623
$$ 23806 -69268 1946 -39577 -215882 -1463 215429 -54352 -68330 40142 188765
14731A88765J3722k53194q2572R8857J44111N1112j32951q9871l0985m961r2477
$$ 188765 202487 -50707 -133279 -34422 109689 160801 27850 -62021 -93006 -97967 -190444
14720a90444J02278n460j21873m4975J15485n7488m3769K31817J37815K4585o3185
$$ -190444 -88166 -93626 -215499 -260474 -144989 -202477 -246246 -14429 123386 147971 84786
14709H4786O1076l7060J00028O8754j41566o7569j71288M8847J6547k2402L644
$$ 84786 145862 108802 208830 277584 136018 68449 -102839 -53992 -37445 -59847 -56203
14698e6203N1694j51201J01047j2891j8899O5793j65354j80638L6674J64789n3082
$$ -56203 -4509 -155710 -54663 -67554 -86453 -20660 -186014 -366652 -329978 -165189 -218271
14687b18271r2388J5815J45315J39311K4374n4972J61510n17l9290m19K5564k7695
$$ -218271 -310659 -294844 -149529 -10218 14156 -40816 120694 120177 80887 80468 106032 78337
14675G8337j24164J7504J01568M4175k2723m4780j9659j8587m9220o7075N6038
$$ 78337 -45827 -28323 73245 117420 94697 49917 30258 11671 -37549 -104624 -48586
14664d8586l9290r3089J2502N3490M4053q6944j2035K9290R6449J06302k3679
$$ -48586 -87876 -180965 -168463 -114973 -70920 -157864 -169899 -140609 -44160 62142 38463
14653C8463o559r8067R184l0006p7933R5057J02338J03332j00988j23554p8818
$$ 38463 31904 -66163 -56979 -86985 -164918 -69861 32477 135809 34821 -88733 -167551
14642a67551m5459l4323J71448J22100N2771k4727q9250M1623P101K8176q0968
$$ -167551 -213010 -247333 -75885 46215 98986 74259 -14991 26632 33733 61909 -19059
14631a9059j23060J14117n452K9102J0157q6105r5385L9360P4626p8601n5084
$$ -19059 -142119 -28002 -33454 -4352 5805 -80300 -175685 -136325 -61699 -140300 -195384
14620a95384m982J70765K33075J54726J2142k20173o4338j49178j98437l6477
$$ -195384 -200366 -29601 203474 358200 370342 150169 85831 -63347 -261784 -298261
14610b98261K80094J07911J0522K7421m6564j69811J1812o632L3987N7454K3344
$$ -298261 -18167 89744 100266 127687 81123 -88688 -76876 -83508 -49521 7933 31277
14599C1277K4330M5453L5971n7336L48n8071q2047J14694J90557k2967l6024q3280
$$ 31277 55607 101060 137031 79695 80043 21972 -60075 54619 245176 222209 186185 102905
14587A02905q0526o3873J11682K6765n3483L1089j2407M3911J39233m2423j32486
$$ 102905 22379 -41494 70188 96953 43470 74559 62152 106063 245296 202873 70387
14576G0387k7110R664M7347N877l8200p4265k5824Q8525l6611o4394L0447J33794
$$ 70387 43277 52941 100288 106165 67965 -6300 -32124 56401 19790 -44604 -14157 119637
14564A19637o3882j76268l7806J57653J70775P3174m6882j67909j51378j61275
$$ 119637 55755 -120513 -158319 -666 170109 243283 196401 28492 -122886 -284161
14554b84161J8183J05871J727n149p425M5778l6972j7799Q072p0073J07338J6930
$$ -284161 -265978 -160107 -158380 -163529 -170954 -125176 -162148 -179947 -171875 -241948 -134610 -117680
14542a17680p6241N7005N1378J4931M4627J12687k2709j37773m9386J16827j2791
$$ -117680 -193921 -136916 -85538 -70607 -25980 86707 63998 -73775 -123161 -6334 -19125
14531a9125q4125q0933J47780K3494r7838l0995o091M6851P0044J32915P9667
$$ -19125 -103250 -184183 -36403 -12909 -110747 -141742 -147833 -100982 -30938 101977 181644
14520A81644j00099r9473J09300j31214p0531r5774Q6259L4356P8287J0203J11583
$$ 181644 81545 -17928 91372 -39842 -110373 -206147 -119888 -85532 -7245 2958 114541
14509A14541p0571j41087o5472r1401K30095J24008l4055l199j41524j93489J0708
$$ 114541 43970 -97117 -162589 -253990 -23895 100113 66058 62859 -78665 -272154 -261446
14498b61446R5109J85968m3833l18j66322k0413k2540K0362J90374K4341P4432
$$ -261446 -166337 19631 -24202 -24520 -190842 -211255 -233795 -213433 -23059 1282 75714
14487G5714L2145o036m4097J08297J91903J0574l11899l17354m6708O8536L9486
$$ 75714 107859 101823 57726 166023 357926 368500 56601 -260753 -307461 -238925 -199439
14476a99439K11984J25802J45181P5636r477k40320k77033J712O7559J14245o6606
$$ -199439 12545 138347 283528 359164 349687 109367 -167666 -165954 -98395 15850 -50756
14465e0756O451M9990o0423k2339N1849r348o2977j2997N6583o9417r9874J09564
$$ -50756 -44305 5685 -54738 -77077 -25228 -34576 -97553 -110550 -53967 -123384 -223258 -113694
14453a13694p3303k155J01J75019J14168J01331J13272m3045p5473l2796q1268
$$ -113694 -186997 -189152 -189051 -14032 100136 201467 314739 271694 196221 163425 82157
14442H2157j47432O8672R3335K2852j77918j02428J80797j14o3482o3350O8800
$$ 82157 -65275 3397 96732 119584 -58334 -160762 20035 19921 -43561 -106911 -38111
14431c8111R9664k0649k50508k00312N9132K16743J64005m7629j23401j03113
$$ -38111 61553 40904 -209604 -409916 -350784 -134041 29964 -17665 -141066 -244179
14421b44179M8521o3559N9115J34553J6343j75876m8758J68755j35643L57K35786
$$ -244179 -195658 -259217 -200102 -65549 -49206 -225082 -273840 -105085 -240728 -240371 -4585
14410d585K40170R491N8797o4822o1550Q9134k26115l7072m1272J3972j11502
$$ -4585 235585 245076 303873 239051 177501 266635 40520 3448 -37824 -23852 -135354
14399a35354P9595j13478r5005J44713j6414L0235L8267J55916n2871M6091R0878
$$ -135354 -55759 -169237 -264242 -119529 -135943 -105708 -67441 88475 35604 81695 172573
14388A72573j19025j15278k4183j47062N0214J99493P7986m9222J2507j14666
$$ 172573 53548 -61730 -85913 -232975 -182761 16732 94718 45496 58003 -56663
14378e6663N832p155K4584J5377l848j13557L8886J52046j75227R479N1608J0159
$$ -56663 -50831 -57986 -33402 -18025 -21873 -135430 -96544 55502 -119725 -110246 -58638 -48479
14366d8479P6802q1230P4285L4443P739j46201j9897j1747R544p389j06090j46041
$$ -48479 28323 -52907 21378 55821 63560 -82641 -102538 -114285 -104741 -112130 -218220 -364261
14354c64261J28190K00032Q4540j42247L6167Q7658j18191p1477R8218R9472j488
$$ -364261 -236071 -36039 48501 -93746 -57579 30079 -88112 -159589 -61371 38101 36613
14343C6613O1412j8505q8746j37177M4356j39572O5349K41616R6557l4767N9072
$$ 36613 98025 79520 -9226 -146403 -102047 -241619 -176270 65346 161903 127136 186208
14332A86208J8440o2048j61152o5925P1933m5258o397L3502l5696j40214q4903
$$ 186208 204648 142600 -18552 -84477 -12544 -57802 -64199 -30697 -66393 -206607 -291510
14321b91510J94829J05553o6789J78981n5395j38638J33700R6777p1050J43581
$$ -291510 -96681 8872 -57917 121064 65669 -72969 60731 157508 86458 230039
14311B30039J6891N02J182O1141q509O1380n4826n2314r741k13258L159m7313
$$ 230039 246930 247432 248614 309755 301246 362626 307800 255486 245745 32487 35646 -11667
14299a1667N3532J29259L2491m6761L4379O0062L9475L9679o291j34821p0447
$$ -11667 41865 171124 203615 156854 191233 251295 290770 330449 324158 189337 118890
14288A18890J331p0500j65909q4623r8284O1807J26298m4229L0862J36026R9494
$$ 118890 120221 49721 -116188 -200811 -299095 -237288 -110990 -155219 -124357 11669 111163
14277A11163O6622j08641j12685q0372o0820K6304k5162J32347J83103m2240q7794
$$ 111163 177785 69144 -43541 -123913 -184733 -158429 -183591 -51244 131859 89619 1825
14266A825j65840n7655k1952l3303K1643O976P6900N4185J07481p6389J15712
$$ 1825 -164015 -221670 -243622 -276925 -255282 -248306 -171406 -117221 -9740 -86129 29583
14255B9583n1179j40459N765J53708j79625m6203L1008K9327M8111K38200R5316
$$ 29583 -21596 -162055 -156290 -2582 -182207 -228410 -197402 -168075 -119964 118236 213552
14244B13552r9720j08743l5452Q7851Q3625n1404o5555N6852J3543k2235J50812
$$ 213552 113832 5089 -30363 57488 141113 89709 24154 81006 94549 72314 223126
14233B23126n5804j03734j94019m2629Q1572r5599Q5828P0596j0082n5058J03347
$$ 223126 167322 63588 -130431 -173060 -91488 -187087 -101259 -30663 -40745 -95803 7544
14222G544k5432n9658m7625J21073L6327k6233j56611m9028K49769J37865j53227
$$ 7544 -17888 -77546 -125171 -4098 32229 5996 -150615 -199643 50126 187991 34764
14211C4764r2877L8866J8592q9036L6297J00923o2026P5552p2132n9772k6155
$$ 34764 -58113 -19247 -655 -89691 -53394 47529 -14497 61055 -11077 -70849 -97004
14200i7004O0021J649k7224O8940O7263o82J9698j79178k2878p2939K7121J20110
$$ -97004 -36983 -35334 -62558 6382 73645 72963 92661 -86517 -109395 -182334 -155213 -35103
14188c5103J29119Q8400o875j23873r5254o2836j1763L9064P4924j3700o3897
$$ -35103 94016 182416 175541 51668 -43586 -106422 -118185 -79121 -4197 -17897 -81794
14177h1794l7745q760P7161p3660k5230L2836q6350o2059Q9165K57590q0582j50291
$$ -81794 -119539 -128299 -51138 -124798 -150028 -117192 -203542 -265601 -176436 81154 572 -149719
14165a49719p388k9763J42478R712m8193R9960L2122q6842j7353j8957R1768J26822
$$ -149719 -157107 -186870 -44392 -34680 -82873 17087 49209 -37633 -54986 -73943 17825 144647
14153A44647P021m1365m4057n9936J59085j50450r0105n0309J771J28513L9252
$$ 144647 151668 110303 66246 6310 165395 14945 -75160 -125469 -123698 4815 44067
14142D4067p0572L2675o5911J81216J3485j71087q082J59114N8384l0984m9364
$$ 44067 -26505 6170 -59741 121475 134960 -36127 -44209 114905 173289 142305 92941
14131I2941j09177j35665J0776n2386K24903J77438J01954j54815j78041j08297
$$ 92941 -16236 -151901 -141125 -193511 31392 208830 310784 155969 -22072 -130369
14121a30369k8265J23487J12255m43J3119l665R8723o7376j80838j1089J39003
$$ -130369 -158634 -35147 77108 76665 89784 86119 184842 117466 -63372 -74461 64542
14110F4542M0811j3042j8437n9393J46518J22613q6784j3508O1527n7379K6300
$$ 64542 105353 92311 73874 14481 160999 283612 196828 183320 244847 187468 213768
14099B13768l9827k08896k4223M4615M6784o3655o222l6885J59265L4533j76486
$$ 213768 173941 -34955 -59178 -14563 32221 -31434 -37656 -74541 84724 119257 -57229
14088e7229r7564J24690J02753J3816m8887K9166j9236j7591o8020M3958J6168
$$ -57229 -154793 -30103 72650 86466 37579 66745 47509 29918 -38102 5856 22024
14077B2024j49042j40412J21939L4327O2795L9027q839j31945o5966Q983J05558
$$ 22024 -127018 -267430 -145491 -111164 -48369 -9342 -18181 -150126 -216092 -207109 -101551
14066a01551J83451J60317j13380j03881j6674l0596n9289K6716L3196M7075J49989
$$ -101551 81900 242217 128837 24956 8282 -22314 -81603 -54887 -21691 25384 175373
14055A75373J03086q0707j67229j04723K8081l4954j08746J67086N2836j37421
$$ 175373 278459 197752 30523 -74200 -46119 -81073 -189819 -22733 30103 -107318
14045a07318j32679j3675N2517r6238k025Q3425L06838J09170p3840L1197J8290
$$ -107318 -239997 -253672 -201155 -297393 -299418 -215993 90845 200015 126175 157372 175662
14034A75662M7232J1501j1217k15520n4074j14258N8907J89852K1189N9814o8474
$$ 175662 222894 234395 223178 7658 -46416 -160674 -101767 88085 109274 169088 100614
14023A00614n5441n2949j3490M5160J68884l2231l2149n7950j1825o1953L0758
$$ 100614 45173 -7776 -21266 23894 192778 160547 128398 70448 58623 -3330 27428
14012B7428K07657J49042q5564l8977M3218j26046j20108J7713J3471L5052j15444
$$ 27428 235085 384127 298563 259586 302804 176758 56650 74363 87834 122886 7442
14001G442k0992q9451k474j76179L5181j0079m4150J94116N6956M6902N2075l6887
$$ 7442 -13550 -103001 -105475 -281654 -246473 -256552 -300702 -106586 -49630 -2728 49347 12460
13989A2460k8616L2646J23438L3144j30670J54225J93520l1845j17950K8338P875
$$ 12460 -16156 16490 139928 173072 42402 196627 390147 358302 240352 268690 276565
13978B76565q1805n419L0786j35483m0309j5952p1958J20690J2476m4520Q65J05726
$$ 276565 194760 189341 220127 84644 44335 28383 -43575 77115 89591 45071 45936 151662
13966A51662q9236P7615m3009m5993N8199K07786L1807j91637k26320k74330K31453
$$ 151662 62426 140041 97032 51039 109238 317024 348831 157194 -69126 -343456 -112003
13955a12003K55430k2795m044k3809r545n4030k5121M500j2119o1599J22553j03967
$$ -112003 143427 120632 116588 92779 83234 29204 4083 8583 -3536 -65135 57418 -46549
13943d6549p3597o8436o5806Q9313K19284J36178j97259j3148Q2055Q0382Q8991
$$ -46549 -120146 -188582 -254388 -165075 54209 190387 -6872 -20020 62035 142417 231408
13932B31408l146J4841q8488n2594o4387q5133p23J19083k4530j5690j61466j77980
$$ 231408 228262 243103 154615 102021 37634 -47499 -48222 70861 46331 30641 -130825 -308805
13920c08805k055J05001k9869J24510N3805j00712o6330j07344Q5041J32731j2307
$$ -308805 -310860 -205859 -235728 -111218 -57413 -158125 -224455 -331799 -246758 -114027 -126334
13909a26334M0497Q1832N2210j7667o8354j03662J32522L1285l3690k11948O3452
$$ -126334 -85837 -4005 48205 30538 -37816 -141478 -8956 22329 -11361 -223309 -159857
13898a59857J045j55182j3135J64018J33658J13357R4229q5990o3449j3057Q8004
$$ -159857 -158812 -313994 -327129 -163111 -29453 83904 178133 92143 28694 15637 103641
13887A03641J30710K6165l5193r2565m04269N2406J89338j123o4548N0969J81996
$$ 103641 234351 260516 225323 132758 -271511 -219105 -29767 -30890 -95438 -44469 137527
13876A37527N707L8985K0049j52740n2437j467l7579J3668j584p7080l4019l3701
$$ 137527 143234 182219 202268 49528 -2909 -4376 -41955 -28287 -29871 -106951 -140970 -174671
13864a74671p074m701L1915O3373J51117P1535O8183k7144r3974J4716O8679q0669
$$ -174671 -181745 -186446 -154531 -91158 59959 131494 199677 172533 78559 93275 161954 81285
13852H1285L6485P3316k3472j68182J15370L1067M411q1539l7507j5080r9555
$$ 81285 117770 191086 167614 -568 114802 145869 150280 68741 31234 16154 -83401
13841h3401m3960O8558j5273l2048L5032J7252P2949r6922o4317j7494L8338p1786
$$ -83401 -127361 -58803 -74076 -106124 -71092 -53840 19109 -77813 -142130 -159624 -121286 -193072
13829a93072l6759K76775R6332p3849j13677P3135M2699k1372m9414j6549J36839
$$ -193072 -229831 46944 143276 69427 -44250 28885 71584 50212 798 -15751 121088
13818A21088J30620J5379j03196k35038r5674k6358n8592O3826J20605M4603K6247
$$ 121088 251708 267087 163891 -71147 -166821 -193179 -251771 -187945 -67340 -22737 3510
13807C510K7060M3246L1659l3452Q1833K59o4984R7397q9415j44991n0004P3636
$$ 3510 30570 73816 105475 72023 153856 154115 89131 186528 97113 -47878 -97882 -24246
13795b4246J85334J29046Q8288P3652K039n9486k93092j31692O7028L6653k959
$$ -24246 161088 290134 378422 452074 454113 394627 101535 -30157 36871 73524 70565
13784G0565j57991R1805J13220J27712j23273j04208p1426J29228P1155o7518
$$ 70565 -87426 4379 117599 245311 122038 17830 -53596 75632 146787 79269
13774G9269j99938k1417j8268P8389N4087J76347K07788m3235Q2564j05748p5576
$$ 79269 -120669 -142086 -160354 -81965 -27878 148469 356257 313022 395586 289838 214262
13763B14262j7634K1179j9304J29077R5171j98566j01331r7145j22543j7093R8188
$$ 214262 196628 217807 198503 327580 422751 224185 122854 25709 -96834 -113927 -15739
13752a5739O9010o658L4357K45659J7538j35724j96943k8393j326p8639J6273
$$ -15739 53271 46613 80970 326629 344167 208443 11500 -16893 -18219 -96858 -80585
$$ [...]
##END NTUPLES=NMR SPECTRUM
##END=
