##TITLE=Analysis number 312319
Compound Code aw 00182
Project Code adrs
Chemist Name fudan
##JCAMPDX= 6.0         $$ Bruker NMR JCAMP-DX V2.0
##DATA TYPE= NMR SPECTRUM
##DATA CLASS= NTUPLES
##ORIGIN= Bruker BioSpin GmbH
##OWNER= NMR
$$ XWIN-NMR		Version 3.5
$$ Mon Aug  1 13:12:48 2005 GMT Daylight Time (UT+1h)  MAYBRIDGE\NMR@NMR_250MHZ
##.OBSERVE FREQUENCY= 250.131544655141
##.OBSERVE NUCLEUS= ^1H
##.ACQUISITION MODE= SIMULTANEOUS (DQD)
##.ACQUISITION SCHEME= undefined
##.AVERAGES= 16
##.DIGITISER RES= 18
##SPECTROMETER/DATA SYSTEM= dpx250
##.PULSE SEQUENCE= zg30
##.SOLVENT NAME= CDCl3
##.SHIFT REFERENCE= (INTERNAL, CDCl3, 0, 16.522)
##AUDIT TRAIL= $$ (NUMBER, WHEN, WHO, WHERE, WHAT)
$$ ##TITLE= Audit trail, XWIN-NMR		Version 3.5
$$ ##JCAMPDX= 5.01
$$ ##ORIGIN= Bruker BioSpin GmbH
$$ ##OWNER= NMR
$$ C:\u/data/dgb/nmr/ADRS/6980/pdata/1/auditp.txt
$$ ##AUDIT TRAIL=  $$ (NUMBER, WHEN, WHO, WHERE, WHAT)
(   1,<2005-08-01 13:12:27.98 +100>,<MAYBRIDGE\NMR>,<NMR_250MHZ>,
      <created by zg, POWCHK disabled, PULCHK disabled
       configuration hash MD5:
       62 19 C7 07 E1 42 D1 B7 37 6C 3D D0 77 39 F9 E6
       data hash MD5: 64K
       CE 49 3C 6E 1F A4 C2 E7 8A EB 5C 93 DD 5E 6E 0F>)
(   2,<2005-08-01 13:12:39.48 +100>,<MAYBRIDGE\NMR>,<NMR_250MHZ>,
      <Start of raw data processing
       ef LB = 0.3 FT_mod = 6 PKNL = 1 SI = 32K 
       data hash MD5: 32K
       09 BF 74 B3 D0 03 A2 D4 56 48 2E FD D8 19 D2 90>)
(   3,<2005-08-01 13:12:41.76 +100>,<MAYBRIDGE\NMR>,<NMR_250MHZ>,
      <apk 
       data hash MD5: 32K
       39 79 24 E8 4C 26 49 EA 74 4A A0 71 21 2D 3E 4D>)
(   4,<2005-08-01 13:12:42.68 +100>,<MAYBRIDGE\NMR>,<NMR_250MHZ>,
      <abs ABSG = 5 
       data hash MD5: 32K
       B7 8A 2A A7 1F F9 73 41 1F 7E A8 38 F3 75 79 C8>)
$$ ##END=
$$ 
$$ hash MD5
$$ E4 CA 06 6F 93 71 1D C0 68 30 70 DF A1 33 4C 97
##$RELAX= 
##$RELAX= 
##$RELAX= 
##$RELAX= 
##$RELAX= 
##$RELAX= 
##$RELAX= 
$$ Bruker specific parameters
$$ --------------------------
##$DU= <C:\u>
##$EXPNO= 6980
##$NAME= <ADRS>
##$PROCNO= 1
##$TYPE= <nmr>
##$USER= <dgb>
##$AMP= (0..31)
100 100 100 100 100 100 100 100 100 100 100 100 100 100 100 100 100 100 
100 100 100 100 100 100 100 100 100 100 100 100 100 100 
##$AQSEQ= 0
##$AQ_mod= 3
##$AUNM= <au_zg>
##$AUTOPOS= <30 >
##$BF1= 250.13
##$BF2= 250.13
##$BF3= 250.13
##$BF4= 250.13
##$BF5= 500.13
##$BF6= 500.13
##$BF7= 500.13
##$BF8= 500.13
##$BYTORDA= 1
##$CFDGTYP= 0
##$CFRGTYP= 5
##$CHEMSTR= <none>
##$CNST= (0..31)
1 1 145 1 1 1 1 1 1 1 1 1 1 1 1 1 1 1 1 1 1 1 1 1 1 1 1 1 1 1 1 1 
##$CPDPRG= <>
##$CPDPRG1= <>
##$CPDPRG2= <>
##$CPDPRG3= <>
##$CPDPRG4= <mlev>
##$CPDPRG5= <mlev>
##$CPDPRG6= <mlev>
##$CPDPRG7= <mlev>
##$CPDPRG8= <mlev>
##$CPDPRGB= <>
##$CPDPRGT= <>
##$D= (0..31)
0 1 0 0 0 0 0 0 0 0.06 0 0 0 0 0 0 0.0002 0 0 0 0 0 0 0 0 0 0 0 0 0 0 
0 
##$DATE= 1122898346
##$DBL= (0..7)
120 120 120 120 120 120 120 120 
##$DBP= (0..7)
150 150 150 150 150 150 150 150 
##$DBP07= 0
##$DBPNAM0= <>
##$DBPNAM1= <>
##$DBPNAM2= <>
$$ [...]
##$SUBNAM7= <"">
##$SUBNAM8= <"">
##$SUBNAM9= <"">
##$SW= 20.6930455092707
##$SWIBOX= (0..15)
0 0 3 0 0 0 0 0 0 0 0 0 0 0 0 0 
##$SW_h= 5175.983436853
##$TD= 65536
##$TD0= 1
##$TE= 295.16
##$TE2= 300
##$TE3= 300
##$TEG= 300
##$TL= (0..7)
0 120 120 120 120 120 120 120 
##$TP= (0..7)
150 150 150 150 150 150 150 150 
##$TP07= 0
##$TPNAME0= <>
##$TPNAME1= <>
##$TPNAME2= <>
##$TPNAME3= <>
##$TPNAME4= <>
##$TPNAME5= <>
##$TPNAME6= <>
##$TPNAME7= <>
##$TPOAL= (0..7)
0.5 0.5 0.5 0.5 0.5 0.5 0.5 0.5 
##$TPOFFS= (0..7)
0 0 0 0 0 0 0 0 
##$TUNHIN= 0
##$TUNHOUT= 0
##$TUNXOUT= 0
##$USERA1= <user>
##$USERA2= <user>
##$USERA3= <user>
##$USERA4= <user>
##$USERA5= <user>
##$V9= 5
##$VALIST= <valist>
##$VCLIST= <CCCCCCCCCCCCCCC>
##$VD= 0
##$VDLIST= <DDDDDDDDDDDDDDD>
##$VPLIST= <PPPPPPPPPPPPPPP>
##$VTLIST= <TTTTTTTTTTTTTTT>
##$WBST= 1024
##$WBSW= 4
##$XGAIN= (0..3)
0 0 0 0 
##$XL= 0
##$YL= 0
##$YMAX_a= 584997
##$YMIN_a= -516369
##$ZGOPTNS= <>
##$ZL1= 120
##$ZL2= 120
##$ZL3= 120
##$ZL4= 120
##$ABSF1= 16.522
##$ABSF2= -4.171173
##$ABSG= 5
##$ABSL= 3
##$ALPHA= 0
##$AQORDER= 0
##$ASSFAC= 0
##$ASSFACI= 0
##$ASSFACX= 0
##$ASSWID= 0
##$AUNMP= <proc_1d>
##$AZFE= 0.1
##$AZFW= 0.1
##$BCFW= 0
##$BC_mod= 0
##$BYTORDP= 0
##$COROFFS= 0
##$CY= 12.5
##$DATMOD= 1
##$DC= 0
##$DFILT= <>
##$DTYPP= 0
##$F1P= 14.0000005364418
##$F2P= -0.99999901652339
##$FCOR= 0.5
##$FTSIZE= 32768
##$FT_mod= 6
##$GAMMA= 0
##$GB= 0
##$INTBC= 1
##$INTSCL= 1
##$ISEN= 128
##$LB= 0.3
##$LEV0= 0
##$LPBIN= 0
##$MAXI= 10000
##$MC2= 0
##$MEAN= 0
##$ME_mod= 0
##$MI= 0
##$NCOEF= 0
##$NC_proc= -5
##$NLEV= 6
##$NOISF1= 0
##$NOISF2= 0
##$NSP= 0
##$NTH_PI= 0
##$NZP= 0
##$OFFSET= 16.522
##$PC= 1
##$PHC0= 139.7784
##$PHC1= -12.06339
##$PH_mod= 1
##$PKNL= yes
##$PPARMOD= 0
##$PSCAL= 4
##$PSIGN= 0
##$REVERSE= no
##$SF= 250.13
##$SI= 32768
##$SIGF1= 0
##$SIGF2= 0
##$SINO= 400
##$SIOLD= 32768
##$SREGLST= <1H.CDCl3>
##$SSB= 0
##$STSI= 32768
##$STSR= 0
##$SW_p= 5175.98343685301
##$SYMM= 0
##$S_DEV= 0
##$TDeff= 65536
##$TDoff= 0
##$TI= <Analysis number 999999
Compound Code 99
Book Reference 9
Project Code 9>
##$TILT= no
##$TM1= 0
##$TM2= 0
##$TOPLEV= 0
##$USERP1= <user>
##$USERP2= <user>
##$USERP3= <user>
##$USERP4= <user>
##$USERP5= <user>
##$WDW= 1
##$XDIM= 32768
##$YMAX_p= 417927849
##$YMIN_p= -755316
$$ End of Bruker specific parameters
$$ ---------------------------------
##NTUPLES= NMR SPECTRUM
##VAR_NAME=  FREQUENCY,     SPECTRUM/REAL,   SPECTRUM/IMAG
##SYMBOL=    X,             R,               I
##VAR_TYPE=  INDEPENDENT,   DEPENDENT,       DEPENDENT
##VAR_FORM=  AFFN,          ASDF,            ASDF
##VAR_DIM=   32768,         32768,           32768
##UNITS=     HZ,            ARBITRARY UNITS, ARBITRARY UNITS
##FACTOR=    0.157963299565203, 1,           1
##FIRST=     4132.6476996994, 0,             0
##LAST=      -1043.33573715361, 0,           0
##MIN=       -1043.33573715361, -755316,     0
##MAX=       4132.6476996994, 417927849,     0
$$ Real data points
##PAGE= N=1
##DATA TABLE= (X++(R..R)), XYDATA
$$ [...]
17077d020P291l102o629J1154J537l575O710j694j1725L91o131n179l148Q071
17063a0049Q150Q526o173m684P402Q57j902q622q091L265Q530J0145J1604K3115
17049D2073L593j906o726k6427k1718l148N857j213k494P91M755L882K894l140
17035b927n522j0927J191q178L786P510P822L788K062l269N214J2537n918j2266
17021e097M370o978Q54K689Q143M078j112r283M148k214O442J1206j571j973n834
17006G868n771n898q621k921M512R641J0727k236r484o484o796n176k584Q651
16992a4572j108k758P252m568M121M599k055j589L86J4762J1882j3213l2p891
16978d784N762j0056k754l532r583M632J0510P426l830O448N351j0008k76o47
$$ plain form
17077 -4020 3271 169 -6460 4694 6231 2656 9366 7672 -4053 -3662 -9793 -14972 -18120 -10049
17063 -10049 -1899 6627 454 -4230 3172 4029 2127 -6495 -14586 -11321 -2791 7354 18958 42073
17049 42073 45666 43760 37034 10607 -11111 -14259 -8402 -9615 -12109 -11318 -6563 -2681 213 -2927
17035 -2927 -8449 -19376 -18185 -26363 -22577 -15067 -7245 -3457 -1395 -4664 550 13087 7169 -5097
17021 -5097 -727 -7705 -6851 -4162 3981 8059 6947 -2336 1812 -402 6040 17246 15675 13702 7868
17006 7868 2097 -3801 -12422 -15343 -10831 -1190 9537 7301 -2183 -8667 -15463 -20639 -23223 -14572
16992 -14572 -15680 -18438 -11186 -15754 -11633 -7034 -9089 -10678 -10292 4470 16352 3139 3107 -4784
16978 -4784 978 -9078 -11832 -15364 -24947 -20315 -9805 -2379 -6209 239 5590 -4418 -4694 -5341
16964e341K484J887j0965j3869k366N509O934L077k85q781J363r825m613Q225
16950b6566N923K938k383L353L123j895j92k96p797N923L291K619K49q603m927
16935b5240j207m05o425N597p299r678M611J1237O319P369N213J6898j4505q657
16921a6172Q82j3900p702j437l007J2921J1872J0600L542l196m736o1k438O156
16907f676K802J0575M597L988m910j1227O176M605R838m464o420N66p110o440
16893d100j0241J963J7702M957o344q063m798k681p092K229M569k142k411J2860
16879c592k520j322m904M65m545K035k970K267o795o681K72O856M733q018J285
16864b3434P3K508l626R176Q901R736l412o384K015O680R845k95o302k220L630
$$ plain form
16964 -5341 -2857 -970 -11935 -25804 -28170 -22661 -15727 -12650 -12935 -21716 -20353 -30178 -34791 -26566
16950 -26566 -20643 -17705 -20088 -16735 -13612 -15507 -15699 -15995 -23792 -17869 -14578 -11959 -11710 -20313 -25240
16935 -25240 -26447 -26852 -33277 -27680 -34979 -44657 -40046 -28809 -22490 -15121 -9908 6990 -7515 -16172
16921 -16172 -15290 -29190 -36892 -38329 -41336 -28415 -16543 -5943 -2401 -5597 -10333 -10394 -12832 -6676
16907 -6676 -3874 6701 11298 15286 10376 -851 5325 9930 19768 15304 8884 9450 2340 -4100
16893 -4100 -14341 -12378 5324 10281 3937 -4126 -8924 -11605 -18697 -16468 -11899 -14041 -16452 -3592
16879 -3592 -6112 -7434 -12338 -11873 -16418 -14383 -17353 -15086 -21881 -28562 -28290 -21434 -16701 -24719 -23434
16864 -23434 -23361 -20853 -24479 -15303 -6402 3334 -78 -6462 -4447 2233 12078 11783 5481 3261 6891
16849F891r319j3107L06R95J0951O90j1621q736L430J0859j762n505j4799l187
16835c3914J3856N631j3409P987O030J0157j0684l659K660J595J517M776L253
16822d204P926J1749p216k3331l983L687M478N598m002L569L056R579P685r123
16808E468o52o426r103p629k316N060Q53M460J0210l782r702k094Q907O493q51
16793a104l835O017j378j5256K066J749o279J2757M059l712O209L802m228k0363
16779a9496r080Q450J0622O070M35m453K029q539P930J1911K324L97j3042j3420
16765a7862J695j833J820K825q400m643J0565J8666k949j0050r320N159M3p366
16751b1650n601n147L715J0884K4591L780k500j541k420j0288j1706o734o779
$$ plain form
16849 6891 -2428 -15535 -15229 -14234 -3283 -2593 -14214 -22950 -19520 -8661 -10423 -15928 -30727 -33914
16835 -33914 -20058 -14427 -27836 -19849 -13819 -3662 -14346 -18005 -15345 -13750 -12233 -7457 -4204
16822 -4204 3722 15471 8255 -15076 -19059 -15372 -10894 -5296 -9298 -5729 -2673 6906 14591 5468
16808 5468 4816 -1610 -10713 -18342 -20658 -15598 -14745 -10285 -75 -3857 -13559 -15653 -6746 -253 -1104
16793 -1104 -4939 1078 -300 -15556 -13490 -11741 -18020 -5263 -1204 -4916 1293 5095 867 -19496
16779 -19496 -28576 -20126 -9504 -3434 -2999 -7452 -5423 -13962 -6032 5879 8203 8600 -4442 -17862
16765 -17862 -16167 -18000 -16180 -13355 -21755 -26398 -15833 2833 -116 -10166 -19486 -14327 -14284 -21650
16751 -21650 -27251 -32398 -28683 -17799 6792 10572 8072 6531 4111 -6177 -17883 -24617 -31396
16738c1396J5455J7276K850m703K080N367M767Q09J611l961n254j5915l585Q467
16724f132N515k884P613J661o798J927l106o901j42k499J947j249j64J3255Q68
16709B911m896m757J53j571r758p84Q070L01K834M221l503J505L348K376K940
16694C390n087n554j1067j4030l513J6060J0535j317p965l564L4k580k54J570
16680b3342O89L240k640L62O47m237O682P678q014j0469r121J2893J7584K671
16666e377P539o331o511Q86M255K027p395q27r12p081j015L713P909k354m07P252
16650d629Q39o862r090J1716N266j2165k960N663J0994K979p646o008o450j1806
16636c0159n047R537M548P290K217l343M281O673L293q281p989q856M961L02n609
$$ plain form
16738 -31396 -15941 1335 4185 -518 1562 6929 11696 12505 14116 10155 4901 -11014 -14599 -6132
16724 -6132 -617 -3501 4112 5773 -1025 902 -2204 -9105 -9247 -11746 -9799 -11048 -11212 2043 2911
16709 2911 -1985 -6742 -6589 -8160 -17918 -18702 -10632 -10331 -7497 -3276 -6779 -5274 -1926 450 3390
16694 3390 -1697 -7251 -18318 -32348 -35861 -19801 -9266 -10583 -18548 -22112 -22078 -24658 -24912 -23342
16680 -23342 -22653 -19413 -22053 -21691 -21044 -25281 -18599 -10921 -18935 -29404 -38525 -25632 -8048 -5377
16666 -5377 2162 -4169 -10680 -9794 -5539 -3512 -10907 -11734 -12646 -19727 -20742 -17029 -9120 -11474 -11881 -4629
16650 -4629 -3790 -10652 -19742 -8026 -2760 -14925 -17885 -12222 -1228 1751 -5895 -11903 -18353 -30159
16636 -30159 -35206 -25669 -21121 -13831 -11614 -14957 -10676 -4003 -710 -8991 -16980 -25836 -20875 -20573 -26182
16621b6182p867O698M398O101J3732M445P056m761n681M46J2211j0325k1929k393
16607b4051J1303l985o313o16J2359J1648j5388j5075J9735M506K135l357k127
16594i226j2753q215L222J0131K808R766M446j030q260q637J2677J4885o897j7138
16580a4221m724N034p667k892k627l487m830K677k539J1479K2035K943r783K777
16566e825P953m924o554j2786J508m5m619J1029O041o861L009R892l927k460R629
16551A060O811q430m502Q435j888k67j0333k917N727j902j942n045K336N428r58
16536h387N738K62Q940L656p352q480Q681O235o361j2118j10M657l368m285M90
16521a1802K260R636K162j3832j3448R269R886P29L016m418q630O795L933m48
$$ plain form
16621 -26182 -34049 -27351 -22953 -16852 -3120 1325 8381 3620 -2061 -1615 10596 271 -21658 -24051
16607 -24051 -12748 -16733 -23046 -23662 -11303 345 -15043 -30118 -10383 -5877 -3742 -7099 -9226
16594 -9226 -21979 -30194 -26972 -16841 -14033 -4267 179 -851 -9111 -17748 -5071 9814 2917 -14221
16580 -14221 -18945 -13911 -21578 -24470 -27097 -30584 -35414 -32737 -35276 -23797 -1762 1181 -8602 -5825
16566 -5825 2128 -2796 -9350 -22136 -20628 -20673 -25292 -14263 -8222 -15083 -12074 -2182 -6109 -8569 1060
16551 1060 7871 -559 -5061 3374 1486 1219 -9114 -12031 -6304 -8206 -10148 -15193 -12857 -7429 -8387
16536 -8387 -2649 -2387 6553 10209 2857 -5623 3058 9293 2932 -9186 -9296 -4639 -8007 -12292 -11802
16521 -11802 -9542 94 2256 -11576 -25024 -15755 -5869 -5140 -2124 -6542 -15172 -8377 -4444 -4892
16507d892m086o788k881J072N259j0592O981L587r751n630N284m534M678K202
16493b0091J797K717m56K046j987j916M997J1925l01J854Q745O060o271m684j0774
16478f339l532Q759n06j8385J446J0399K386R96j04N917q961j0889p439l369n311
16463c4932l033J773R238J8334J3017K46J0602l374N603j030m924q777k433n875
16449e565j2310o481J0783j0530j134P968k115j832M595j779R830J5217P22K28
16435G597j6039j7362L365P83N801m586j2388Q541L316L080L681m395p228J7989
16421g845J0925O261o690n145m769M376N135o08n153Q01L893j2571j7160K067
16407b6483J3540K979j2000L434Q426P092r176n318k889M270n41o83k739K757
$$ plain form
16507 -4892 -8978 -15766 -18647 -17575 -12316 -22908 -15927 -12340 -22091 -27721 -22437 -26971 -22293 -20091
16493 -20091 -18294 -15577 -16033 -13987 -15974 -17890 -12893 -968 -1269 585 9330 15390 9119 4435 -6339
16478 -6339 -9871 -1112 -1618 -20003 -18557 -8158 -5772 -4776 -4880 1037 -7924 -18813 -26252 -29621 -34932
16463 -34932 -37965 -36192 -26954 -8620 4397 4643 15245 11871 17474 16444 11520 2743 310 -5565
16449 -5565 -17875 -24356 -13573 -24103 -25237 -17269 -19384 -21216 -16621 -18400 -8570 6647 7369 7597
16435 7597 -8442 -25804 -22439 -21656 -15855 -20441 -32829 -24288 -20972 -17892 -14211 -18606 -25834 -7845
16421 -7845 3080 9341 2651 -2494 -7263 -2887 2248 1640 -3513 -2712 1181 -11390 -28550 -26483
16407 -26483 -12943 -9964 -21964 -18530 -10104 -3012 -12188 -17506 -20395 -16125 -16666 -17349 -20088 -17331
16393a7331k48J257L428j159J163o711J066J577J013q456K345l80J83N442P01
16378a6110p438l385J1888n81L680r109j2459Q51J1461M432m330N763j7885m861
16364c8083J1640j421L884k438j912O518j3069r376J9860K265M917K6674J0479
16351A9938r663k3354J235P373J699j7336j4602N133J3953M268L699K1153L537
16338A7033j7218k2330m084r71K555l529J32R708J4813J0083k867j2869M871L237
16324a436l489J991j383R96p38p018k694L83k479O018P578l7j557n359m434l007
16308a6665J7182J2457j3747q543j601N711o295j1100j1636M319M073J2921P58
16295a2166m365l63L737L97j0127P669J0102j63j141j2053n944j929Q052J841
$$ plain form
16393 -17331 -17579 -16322 -12894 -14053 -12890 -19601 -18535 -16958 -15945 -24401 -22056 -22436 -22253 -16811 -16110
16378 -16110 -23548 -26933 -15045 -15626 -11946 -21055 -33514 -32663 -21202 -16770 -21100 -15337 -33222 -38083
16364 -38083 -26443 -27864 -23980 -26418 -28330 -21812 -34881 -44257 -24397 -22132 -17215 9459 19938
16351 19938 10275 -13079 -11844 -4471 -2772 -20108 -34710 -29577 -15624 -11356 -7657 13496 17033
16338 17033 -185 -22515 -26599 -27570 -25015 -28544 -28412 -18704 -3891 6192 3325 -9544 -4673 -1436
16324 -1436 -4925 -2934 -4317 -3321 -4059 -11077 -13771 -13388 -15867 -9849 -2271 -2308 -3865 -9224 -13658 -16665
16308 -16665 517 12974 -773 -9316 -10917 -5206 -11501 -22601 -34237 -29918 -25845 -12924 -12166
16295 -12166 -16531 -16894 -13157 -12760 -22887 -15218 -5116 -5279 -6420 -18473 -24417 -26346 -18294 -16453
16281a6453N992j5317m749M430J3589P648J557o840l300N321J279q882J825j030
16267a4930l759j903q003l470M17N555J1762P43n51M14j0294j2616r135P170l703
16252d2303L607J2514J8126J3087n424n010j0342l61R810N010l007m452j1367
16239b0112m863J0796O618o473Q763N363K746n960n651R959J3337q212j2127m285
16225a0101m892Q245K929j353J0298q741j8111m791O5K204l517r33M246P954J1483
16210e015K176n560l337m0j528j3440q590j1965J1267P305O17L166P536K304r21
16195a6025L324k301r286j5935l300J8381J3399j4889j1989N510N654M809O604
16182a6044K035J826j4409j3841R280O064q554N296J4058L060j0756q599l634
$$ plain form
16281 -16453 -10461 -25778 -30527 -26097 -12508 -4860 -3303 -10143 -13443 -8122 -6843 -15725 -13900 -14930
16267 -14930 -18689 -20592 -28595 -32065 -31648 -26093 -14331 -13588 -14139 -13725 -24019 -36635 -45770 -38600 -42303
16252 -42303 -38696 -26182 -8056 5031 -393 -5403 -15745 -16106 -6296 -1286 -4293 -8745 -20112
16239 -20112 -24975 -14179 -7561 -14034 -5271 92 2838 -3122 -8773 1186 14523 6311 -5816 -10101
16225 -10101 -14993 -6748 -3819 -5172 5126 -3615 -21726 -26517 -26452 -24248 -27765 -28698 -24452 -16498 -5015
16210 -5015 -2839 -8399 -11736 -11776 -13304 -26744 -35334 -47299 -36032 -28727 -28110 -24944 -17408 -15104 -16025
16195 -16025 -12701 -15002 -24288 -40223 -43523 -25142 -11743 -26632 -38621 -33111 -27457 -22648 -16044
16182 -16044 -14009 -12183 -26592 -40433 -31153 -25089 -33643 -28347 -14289 -11229 -21985 -30584 -34218
16169c4218L21N783l347L893N441J6320j940K324J5180r266o252j5082J102J1442
16155h299J349N90j0913O500k568M334n89l090P81j533j2261J687J3459p233q218
16140b6004J181n366K718P116O056K874l750R294O175j4568k000m998K551j0112
16126b8833J1043J0310Q3j496m602j9853k041J4026J5328N835o670q083p6K871
16112a2158l258q493N484J15l187j525J1173P331L791m043j1098N513k04j4015
16098b4574k063K712J1471N989m312K427k286o018n260R923k535o593K956M535
16084a3628k826N981j3072J665R484r664q93L89R918L702q457M842R249m41J70
16069c581K345j1820l80J1143j570L482K398j3596M11J871l209j7640l921P163
$$ plain form
16169 -34218 -33897 -28114 -31461 -27568 -22127 -5807 -7747 -5423 9757 491 -5761 -20843 -19741 -8299
16155 -8299 -6950 -6360 -17273 -10773 -13341 -9007 -9596 -12686 -11905 -13438 -25699 -24012 -10553 -17786 -26004
16140 -26004 -24823 -30189 -27471 -20355 -14299 -11425 -15175 -5881 294 -14274 -16274 -21272 -18721 -28833
16126 -28833 -17790 -7480 -7397 -8893 -13495 -33348 -35389 -21363 -6035 -200 -6870 -14953 -15029 -12158
16112 -12158 -15416 -23909 -18425 -18310 -21497 -23022 -11849 -4518 -727 -4770 -15868 -10355 -10559 -24574
16098 -24574 -26637 -23925 -12454 -6465 -10777 -8350 -10636 -16654 -21914 -11991 -14526 -21119 -18163 -13628
16084 -13628 -16454 -10473 -23545 -21880 -12396 -22060 -22953 -22564 -12646 -8944 -17401 -12559 -3310 -3751 -3581
16069 -3581 -1236 -13056 -13436 -2293 -3863 -381 2017 -11579 -11168 -9297 -12506 -30146 -34067 -26904
16055b6904j269q720J0127J0240K922k693l400M90J0846n140p788K554M132q76
16041a5479l712J1968n406j771o345l869P119q79p088J833l855j0835p632R995
16027c5956J2879R399j305n025q86J0311K646k882k068l248R131j593R19q507
16013a6185J348M192K603J623K775Q191n012M53r656j0241r42k358O08P749P132
15998g720l249N598L971k062k977N346o170k904j1460j5172P029J8631J7781r173
15984b531q452p061N355L563N855n64n163k007M430Q020Q685j016p959M686N21
15969F362j440p243q878j4606l253J577n421J811J2989J3655K326j1475j650n534
15955b0780l079L838j600L853J0221J0075l433l845k303K49k008L045P21n799
$$ plain form
16055 -26904 -28173 -36893 -26766 -16526 -13604 -16297 -19697 -19207 -8361 -13501 -21289 -18735 -14603 -15479
16041 -15479 -19191 -7223 -12629 -14400 -20745 -24614 -17495 -18374 -25462 -23629 -27484 -38319 -45951 -35956
16027 -35956 -23077 -13678 -14983 -20008 -20894 -10583 -7937 -10819 -12887 -16135 -7004 -8597 -7678 -16185
16013 -16185 -14837 -10645 -8042 -6419 -3644 4547 -465 -12 -9668 -19909 -20851 -23209 -22601 -14852 -7720
15998 -7720 -10969 -5371 -1400 -3462 -6439 -1093 -7263 -10167 -21627 -36799 -29770 -11139 6642 -2531
15984 -2531 -10983 -18044 -12689 -9126 -3271 -3835 -8998 -11005 -6575 1445 10130 9114 1155 5841 6362
15969 6362 4922 -2321 -11199 -25805 -29058 -27481 -32902 -31091 -18102 -4447 -2121 -13596 -15246 -20780
15955 -20780 -23859 -20021 -21621 -17768 -7547 2528 -905 -4750 -7053 -6804 -8812 -5767 -5046 -10845
15941a0845j0807p652J12J2303L108m336n55m524k496k071p275J5012N852n663
15927a9837J4366M148j5685Q66M275k169p15M810l597p255R015m219p902L442
15913b0457M217J0396N055n312r605l386k943j075O939l761r00m930j441J653
15899b5550J6089J0485l423m329n913k251j2242j3138J363Q181L657k990m59P463
15885b3057n843q788l796P163O019R907p02L010O271m77j760o236o396q07J0194
15870a5298M654J0146j5800r428k979k889M606p54N972o468K773J997J1608Q056
15856c804p459O286l314K210K818m464j850L090o55r445m232J1124J3055o576
15842c216l111j0298P06N897p799J1846q854p028p46K197j669J146J384J0115
$$ plain form
15941 -10845 -21652 -29304 -29192 -16889 -13781 -18117 -18672 -23196 -25692 -27763 -35038 -20026 -14174 -19837
15927 -19837 -5471 -1323 -17008 -16142 -11867 -14036 -14751 -9941 -13538 -20793 -11778 -15997 -23899 -20457
15913 -20457 -16240 -5844 -789 -6101 -15706 -19092 -22035 -23110 -16171 -19932 -20832 -25762 -27203 -25550
15899 -25550 -9461 1024 -2399 -6728 -12641 -14892 -27134 -40272 -38909 -30728 -27071 -30061 -30520 -23057
15885 -23057 -28900 -37688 -41484 -34321 -28302 -18395 -19097 -16087 -9816 -10293 -12053 -18289 -24685 -25492 -15298
15870 -15298 -10644 -498 -16298 -25726 -28705 -31594 -26988 -27742 -21770 -28238 -25465 -23468 -11860 -3804
15856 -3804 -11263 -4977 -8291 -6081 -3263 -7727 -9577 -6487 -7142 -16587 -20819 -9695 3360 -3216
15842 -3216 -6327 -16625 -15919 -10022 -17821 -5975 -14829 -21857 -22603 -20406 -22075 -20929 -19545 -9430
15828i430n025l548q748k0571M80K1937Q000N060N137M138n742L149J08p413M753
15813g715J0856Q750j1553j0202m347k32L082P397j037l393K293N271j0456q007
15799a9293N920K833m846Q566N602N819j2642j3304N281L308m904j4075j3699
15786d5434k846J2122J0279Q531j267J160n309j097P28J338l327K1J073K306M666
15771a7056J0805P479L563m219o298j806J712O812L035J02l385J668l105k051
15757b744p000N228M320m614M42p396q190L736Q617K465k032j3422r123R75m598
15742c3336p12P184K614Q213K972J1842q558K83n394j1444P953O504k723j1433
15728b6035k719O026k554K459N608O35k935k949N51K489O219P428n594N315m813
$$ plain form
15828 -9430 -14455 -18003 -26751 -47322 -46842 -24905 -16905 -11845 -6708 -2570 -8312 -5163 -5055 -12468 -7715
15813 -7715 3141 11891 338 -9864 -14211 -14443 -11361 -3964 -5001 -8394 -6101 -830 -11286 -19293
15799 -19293 -13373 -10540 -15386 -6820 -1218 4601 -8041 -21345 -16064 -12756 -17660 -31735 -45434
15786 -45434 -48280 -36158 -25879 -17348 -18615 -17455 -22764 -23861 -23133 -21795 -25122 -25101 -24028 -21722 -17056
15771 -17056 -6251 1228 4791 572 -5726 -7532 -5820 992 4027 4129 744 2412 -693 -2744
15757 -2744 -9744 -4516 -196 -4810 -4368 -11764 -19954 -16218 -7601 -5136 -7168 -20590 -29713 -28738 -33336
15742 -33336 -34048 -26864 -24250 -16037 -13065 -1223 -9781 -9498 -14892 -26336 -18383 -11879 -14602 -26035
15728 -26035 -28754 -22728 -25282 -22823 -17215 -16580 -19515 -22464 -21913 -19424 -13205 -5777 -11371 -6056 -10869
15713a0869n297M441J2718l787K974J203p803j2005m448L158N208L237L405p446
15699a5311j0801o891k884J0928J1809J3399l41j3828J423K181q089o225M383
15686b0247p109j585R23R543M630j1495Q896p96l461l967n494J597P193K747J0112
15671h513P074n384J086N878j2251j7046K332J0118m354N287J667j1340L844J1249
15657a0353Q408P072J0887j660q586o22j1683n897j757J986l708K92P395l483
15643a1709l028O289P300n125p727j2269q078k704J72J1922J604n274k088J5966
15629a4749J0712m316Q409o807q431M860N81j230m017K8R274n057P62L581M186
15614b214r50J036J0524j0630j8727j493n587K554O743J0444J5847P781O193j477
$$ plain form
15713 -10869 -16166 -11725 993 -2794 180 1383 -6420 -18425 -22873 -19715 -14507 -11270 -7865 -15311
15699 -15311 -26112 -33003 -35887 -24959 -13150 249 -92 -13920 -12497 -10316 -18405 -24630 -20247
15686 -20247 -27356 -28941 -28018 -18475 -13845 -25340 -16444 -17240 -20701 -24668 -30162 -28565 -21372 -18625 -8513
15671 -8513 -1439 -6823 -5737 141 -12110 -29156 -26824 -16706 -21060 -15773 -14106 -25446 -21602 -10353
15657 -10353 -1945 5127 16014 14354 5768 5146 -6537 -12434 -14191 -12205 -15913 -15621 -8226 -11709
15643 -11709 -14737 -8448 -1148 -6273 -14000 -26269 -34347 -37051 -36879 -24957 -23353 -28627 -30715 -14749
15629 -14749 -4037 -8353 56 -6751 -15182 -10322 -9741 -10971 -14988 -14960 -5686 -10743 -9981 -6400 -2214
15614 -2214 -3164 -2128 8396 -2234 -20961 -22454 -28041 -25487 -18744 -8300 7547 15328 21521 20044
15600B0044j6496j0560l020o232o628M800j803q79N852N861j547o805r069j023
15586b7505K700k026n591J4746J2819M883l286K375j982q76J915n318n679n21
15572a3346O206L053p06j629j1154P436L87L500j644j944n270j4836o408L503
15558c2852J3740p631r646k768J1547N869J5268m210m348j7329J627Q226K385
15545b0122o851j1146J1558O046O97p15M015R089K594p312M555R250m881l947
15531g170K263N51M22Q67o391O952l775j0886k124O010j66l495N850Q668k042
15516d466J593j099K65k167j3209K490N401p08k542n568N40q183L057J1509l36
15501a3423l373n626l350R282J1102p687M525N244M99m381M532J5808K42r294
$$ plain form
15600 20044 3548 -7012 -10032 -16264 -22892 -18092 -19895 -20774 -14922 -9061 -10608 -17413 -26482 -27505
15586 -27505 -24805 -26831 -32422 -17676 -4857 26 -3260 -885 -2867 -3743 -1828 -7146 -12825 -13346
15572 -13346 -7140 -4087 -4793 -6422 -17576 -10140 -9753 -6253 -7897 -9841 -15111 -29947 -36355 -32852
15558 -32852 -19112 -26743 -36389 -39157 -27610 -21741 -6473 -10683 -15031 -32360 -30733 -22507 -20122
15545 -20122 -26973 -38119 -26561 -20515 -19818 -20533 -16518 -7429 -4835 -12147 -7592 1658 -3223 -7170
15531 -7170 -4907 -4356 -3934 -3067 -9458 -2506 -6281 -17167 -19291 -13281 -13447 -16942 -11092 -2424 -4466
15516 -4466 -2873 -3972 -3707 -5874 -19083 -16593 -11192 -11900 -14442 -20010 -19470 -27653 -24596 -13087 -13423
15501 -13423 -16796 -22422 -25772 -16490 -5388 -13075 -8550 -3306 -2807 -7188 -2656 13152 13394 4100
15487D100Q558J810j4220l343M453l148L65p356J525m941J113J3379m530l539
15473e774l328J469j1280j901M61k595K209J7053O530k621k345k990p441Q729
15459c824j4389J101M336J7744J6162j4521j6426k367K060m952k963L261J419
15446a3359m899q4R804J0650J510j080J628j1772q613R165M029N539m874M1J126
15431a189j071l410L357L291L520o969m439j1359m752K138M585j623j971N75J3537
15416e780K500k628J704K126l468J198o714m817J1216P772m468O691L562L121
15402A2015K866M253k203J021o384q302r432r213J1048Q982J3120m499p474l170
15388B628O201q33R77j0953p288m467o610R419q99k513n981l016K046J730O559
$$ plain form
15487 4100 12658 14468 248 -3095 1358 -1790 -1425 -8781 -7256 -12197 -11084 2295 -2235 -5774
15473 -5774 -9102 -7633 -18913 -20814 -20353 -22948 -20739 -3686 2844 223 -2122 -5112 -12553 -3824
15459 -3824 -18213 -17112 -12776 4968 21130 6609 -9817 -12184 -10124 -15076 -18039 -14778 -13359
15446 -13359 -18258 -18342 -8538 2112 3622 2542 4170 -7602 -16215 -7050 -3021 2518 -2356 -2315 -1189
15431 -1189 -2260 -5670 -2313 978 4498 -2471 -6910 -18269 -23021 -20883 -16298 -17921 -19892 -19317 -5780
15416 -5780 -3280 -5908 -4204 -2078 -5546 -4348 -11062 -15879 -4663 3109 -1359 5332 8894 12015
15402 12015 14881 19134 16931 17952 11568 3266 -6166 -15379 -4331 4651 17771 13272 5798 2628
15388 2628 8829 7996 8973 -1980 -9268 -13735 -20345 -10926 -11825 -14338 -20319 -23335 -21289 -19559 -13000
15373a3000Q183k748n366n850N288P163P211M542L260l110L747P287n206n436
15359E965j0994l958J1543M813K051j91L839N414N236J298L756k424j0515r81
15345A4852K251l285n700j0281j0356N1O290O676j719l872J0490j2239j0823j2752
15331c0417L788j0638R341L34k536j905N323J2417J6994j6048j1897J1010R833
15318d401J917L736l970N246N2Q637K050L484k67j6429j6461O24j690j0579k181
15303c0232P826M216J0041J574Q011J3251k227j0449j2041m789M01q11K610P232
15289e387O165R32l810j2306j1693n740n479J1555J1750K728N943K20R461k259
15275B080p479j278j637m460R305N123N663R711n078l024n406l042j756M842j720
$$ plain form
15373 -13000 -4817 -7565 -12931 -18781 -13493 -6330 881 5423 8683 5573 9320 16607 11401 5965
15359 5965 -5029 -8987 2556 7369 9420 9229 13068 18482 23718 25016 28772 26348 15833 14852
15345 14852 17103 13818 8118 -2163 -12519 -12468 -6178 498 -1221 -5093 5397 -6842 -17665 -30417
15331 -30417 -26629 -37267 -27926 -27592 -30128 -32033 -26710 -14293 2701 -13347 -25244 -14234 -4401
15318 -4401 -2484 1252 -2718 2528 2580 11217 13267 16751 16484 55 -16406 -15782 -17472 -28051 -30232
15303 -30232 -22406 -18190 -8149 -6575 1436 14687 12460 2011 -10030 -14819 -14418 -15229 -12619 -5387
15289 -5387 778 1710 -2100 -14406 -26099 -31839 -37318 -25763 -14013 -11285 -5342 -5122 4339 2080
15275 2080 -5399 -6677 -8314 -12774 -3469 1654 7317 17028 11950 8926 3520 478 -1278 3564 1844
15260A844N178r38j339l904L136o096p152L122q319p65p72k943N832l249m971
15245b1336k879J94J0102J7918J755l983j2146r341L923M835P108O914j361N749
15231G452k827L449P361K039k904L279p185j4250l512J674L429l762k333p152
15217a5242j1020j925M045J1033J1956n972j797K148l315K450L333J1045r114
15204b375r409L833o381j6869N412J1883K4340O368r552j2573j573l662j2543
15191b3101o162l831m276Q241J2832O052J5626r94Q173k684o829o451j6762K147
15177a8019M639j989p82M153J247M238l416p328Q299J3522M232n43j164o7J219
15162H241r716r051L309N443J0755o465j2335l866j1868n751J5367J7403J548
$$ plain form
15260 1844 7022 6084 4745 841 3977 -2119 -9271 -6149 -14468 -15233 -16005 -18948 -13116 -16365 -21336
15245 -21336 -24215 -24021 -13919 3999 5754 1771 -10375 -19716 -15793 -10958 -3850 3064 1703 7452
15231 7452 4625 8074 15435 17474 14570 17849 10664 -3586 -7098 -5424 -1995 -5757 -8090 -15242
15217 -15242 -26262 -28187 -24142 -13109 -1153 -7125 -8922 -6774 -10089 -7639 -4306 6739 -2375
15204 -2375 -11784 -7951 -14332 -31201 -25789 -13906 10434 16802 7250 -5323 -6896 -10558 -23101
15191 -23101 -29263 -33094 -37370 -29129 -16297 -10245 5381 4387 12560 9876 3047 -3404 -20166 -18019
15177 -18019 -13380 -15369 -16151 -11998 -10751 -6513 -9929 -17257 -8958 4564 8796 8253 7089 7022 8241
15162 8241 -1475 -10526 -7217 -1774 8981 2516 -9819 -13685 -25553 -31304 -15937 1466 3014
15149C014j5756j0749k38N572Q41M93l620K263K771k800O944Q464L157k016k707
15134d367L638O080j132j3533J273J4712j263p30M356q431r838p438j949K661
15120a5961L341K138J1945n55k0716L155J2533R183q226k429j0099n317K697J951
15106a6360J0996l359r150o932Q333o704M11Q409l662P801r7J1891K86n278p665
15091a1080N508R177j72r418j737j130J1269N861n347M503n097p208L30J363n6
15076c234J2246J374j288O528k253j397m043o58L977o695j2305j932R215P845
15062G380l401M084j026r144j189r556m969O23R868L264O29L791J1200N967L954
15047B1475l506o127j4182j4969p951M124J6653O582n59k761m113J865J737N611
$$ plain form
15149 3014 -12742 -23491 -23729 -18157 -17316 -16823 -20443 -18180 -15409 -18209 -11265 -2801 356 -1660 -4367
15134 -4367 -729 5351 4219 -9314 -8041 6671 5408 4678 9034 603 -9235 -16673 -18622 -15961
15120 -15961 -12620 -10482 1463 908 -19808 -16653 -4120 5063 -3163 -5592 -15691 -21008 -18311 -16360
15106 -16360 -5364 -8723 -17873 -24805 -16472 -23176 -22765 -14356 -18018 -10217 -10314 1577 1863 -3415 -11080
15091 -11080 -5572 3605 3433 -5985 -7722 -8852 2417 8278 2931 7434 2337 -4871 -4541 -3178 -3234
15076 -3234 9012 10386 9098 15626 13373 11976 7933 7275 11252 4557 -7748 -9680 -465 7380
15062 7380 3979 8063 7037 -2107 -3296 -12852 -17821 -17198 -7330 -4066 -3437 354 11554 17521 21475
15047 21475 17969 11842 -2340 -17309 -25260 -21136 -4483 2099 1540 -1221 -5334 -3469 -1732 3879
15033C879l988j834M01n907J2663L463o976N221J060M155K648m255m889Q839J0842
15018B5322M996r335J145p899n159m139o760j1821j6376n74O080L992Q932j467
15004a3063j831N132q63n796n610M215m846k381P833M248P262J0621J339m146
14990B114j3346p937N458j1565J1962K620M527j1733l219J440J1797J0269r385
14977f998O109J1483o694l336R314j683n657p084n479J3542P552r152p239k902
14963h224k223k278p545O497q452J317L918P790J8678K628j4073o110O99j9680
14949b7058j4464R464R860J4165M212P680P658M700K084N518k458j0384j551J341
14935A0767n674L609P354n812n233P80R139L092j948j4173k0175j3641R77K78
$$ plain form
15033 3879 -109 -1943 -1542 -7449 5214 8677 1701 6922 7982 12137 14785 10530 5641 14480 25322
15018 25322 30318 20983 22128 14229 9070 4931 -1829 -13650 -30026 -30600 -24520 -20528 -11596 -13063
15004 -13063 -14894 -9762 -10625 -16421 -22031 -17816 -22662 -25043 -17210 -12962 -5700 4921 6260 2114
14990 2114 -11232 -19169 -13711 -25276 -13314 -10694 -6167 -17900 -21119 -19679 -7882 2387 -6998
14977 -6998 -889 10594 3900 564 9878 8195 2538 -4546 -10025 3517 11069 1917 -5322 -8224
14963 -8224 -10447 -12725 -20270 -13773 -22225 -20908 -16990 -9200 9478 12106 -1967 -8077 -7378 -27058
14949 -27058 -41522 -32058 -22198 -8033 -3821 3859 11517 16217 18301 23819 21361 10977 9426 10767
14935 10767 5093 8702 16056 10244 5011 5791 14930 18022 16074 1901 -18274 -31915 -30938 -30660
14921c0660k494L993Q253J842o806O977O494o945M740K372O912P536m238j1722
14907a3746j1140J0784O674l366R862k343k086R33m410K192l886N473R384J2848
14893A7173J20j2070j0941l929P417o679o271n831p066R476L096R876J1948N729
14879A2048j1234n428O890m75l141j2750L497J0478p077N005J3120J2389j893
14866B1429j7403j7521o76J2560k244p160J1273J1136J1399r561o642q760p584
14853i754R49o864m792J3627Q472K0226J5347r56l681j6238p971r408j6875K19
14839a7699J2946Q446K090R946M298n524k925J1083J2125p704r863j3148p615
14826c544K793J2690j840n631k506j6282j3874m616K4935R541k997M361O185m644
$$ plain form
14921 -30660 -33154 -29161 -20908 -19066 -25872 -18895 -12401 -19346 -14606 -12234 -5322 2214 -2024 -13746
14907 -13746 -24886 -14102 -7428 -10794 -932 -3275 -5361 -4428 -8838 -6646 -10532 -5059 4325 17173
14893 17173 17293 5223 -5718 -9647 -2230 -8909 -15180 -21011 -28077 -18601 -15505 -5629 6319 12048
14879 12048 814 -4614 2276 1801 -1340 -14090 -10593 -115 -7192 -2187 10933 23322 21429
14866 21429 4026 -13495 -14171 -1611 -3855 -11015 258 11394 22793 13232 6590 -2170 -9754
14853 -9754 -8805 -15669 -20461 -6834 1638 21864 37211 36255 32574 16336 8365 -1043 -17918 -17699
14839 -17699 -4753 3693 5783 15729 20027 14503 11578 22661 34786 27082 17219 4071 -3544
14826 -3544 -751 11939 10099 4468 1962 -14320 -28194 -32810 -7875 1666 -1331 3030 9215 4571
14812D571K860k370o324p903P279R474J1114j2575j5412m114J5356L547m084J1620
14798A3039O617j1131j216m601q60M875k966j335j20k106j4370n342J6701J0180
14784G365j011R40R071J3028K57n071q848r81j3835l559R788J882l007m458K063
14769C624O681l103j0862l636l359O116J1245r079M107M524K262j078l107l486
14755H49j5187k82J5165j326K199J3124O243j375j0364p750P558K985o059p575
14741a795N925O424m230k743o535l902J64K702j3023J833K846K191L484J1950
14727E291K215L98O4q968q318P727J2251J7602n491m360l031j1384k326L976l232
14712B414j2088N789j631K010l313K580L312Q434k610l509Q107J0754m258q2M240
$$ plain form
14812 4571 7431 5061 -1263 -9166 -1887 7587 18701 6126 -9286 -13400 1956 5503 1419 13039
14798 13039 19656 8525 7309 2708 1848 6723 3757 2422 2302 196 -14174 -19516 -2815 7365
14784 7365 6354 7294 16365 29393 29650 24579 15731 14750 915 -2644 7144 9026 6019 1561 3624
14769 3624 10305 7202 -3660 -7296 -10655 -4539 6706 -2373 1734 6258 8520 7442 4335 849
14755 849 -14338 -14620 545 -781 1418 14542 20785 19410 9046 1296 8854 11839 5780 -1795
14741 -1795 4130 10554 6324 3581 -2954 -6856 -6692 -3990 -17013 -15180 -12334 -10143 -6659 5291
14727 5291 7506 7904 7968 -1000 -9318 -1591 10660 28262 22771 18411 15380 3996 1670 5646 2414
14712 2414 -9674 -3885 -5516 -3506 -6819 -4239 -927 7507 4897 1388 9495 20249 15991 15909 20149
14697B0149J868M32q201J748n311N23m312K42K47j426k628p142J468K047J790
14682A494k065j901R7l402J492O974l29o17q182J737o32l720q118P650P941m9
14666a630j878j0107M977J0218N556k519o695j351K2L006o722m696l675N840N177
14651d477M860J4113O712o464p015j1686N99k121K01J960O851Q105J2056j2692
14637A1002j7507M576L533q501l658J290R649K363p684K61J4622O994j437j2196
14623C307j2066N677J403J4120Q38l939J3086o662o439l160k447l673P198M682
14609A1925p596j1036M206j266Q398n850o466J448N944N099L796O753l747l399
14595H209j492j6596j2795N70Q646J1149N63J4242O387q085j2059O81P124O013
$$ plain form
14697 20149 22017 22449 14248 15996 10685 11208 6896 7138 7385 5959 3331 -3811 -2343 -296 1494
14682 1494 -571 -2472 -2375 -5777 -4285 2689 2360 1743 -6439 -4702 -5334 -9054 -17172 -9522 -1581 -1630
14666 -1630 -3508 -13615 -8638 1580 7136 4617 -2078 -3429 -3407 -401 -7123 -11819 -15494 -9654 -4477
14651 -4477 383 14496 21208 14744 7729 -3957 -3358 -5479 -5278 -3318 3533 11638 23694 11002
14637 11002 -6505 -1929 1604 -6897 -10555 -9265 384 2747 -4937 -4676 9946 16940 15503 3307
14623 3307 -8759 -3082 -1679 12441 13279 9340 22426 15764 9325 6165 3718 45 7243 11925
14609 11925 4329 -6707 -2501 -3767 4631 -1219 -7685 -6237 -293 4806 8602 15355 11608 8209
14595 8209 6717 -9879 -22674 -22104 -13458 -2309 -1746 12496 18883 10798 -1261 -580 6544 12557
14581A2557n95K299M25M64r524o850p256R75O869K429r748K708k339O936J9256
14566A8606P905o488J0513N798M12o8j7742j4919n517o988l328p651o24j258j284
14551b2633j213M653J5820j120j2861J259P79K897J0370l5r46M952K941m131n18
14536B14J7106n332J529K348K335R313K456j4095r893N698M463m468O293N349
14522B3316M608L213J952j2466j7595R58M371l330j2261j859j3457l080Q493J5029
14508b108Q249q724j2453l32J9437O264l142J3109J0044J0598R777n882R80l728
14494D2089l676q769k315j0680j5371k9O797J529k019k795o816J923M415k246
14480B037J666K872m66R781j261j5451n066l719k946P021O728o323p894K494J1567
$$ plain form
14581 12557 11962 14261 14686 15150 5626 -1224 -8480 -7505 -636 1793 -7955 -5247 -7586 -650 18606
14566 18606 26511 20023 30536 36334 36746 36678 18936 4017 -1500 -8488 -11816 -19467 -20091 -21349 -22633
14551 -22633 -23846 -19193 -3373 -4493 -17354 -16095 -15316 -12419 -2049 -2084 -3030 1922 4863 732 214
14536 214 17320 11988 13517 15865 18200 27513 29969 15874 5981 11679 16142 11674 17967 23316
14522 23316 27924 31137 33089 20623 3028 3986 8357 5027 -7234 -9093 -22550 -25630 -17137 -2108
14508 -2108 6141 -2583 -15036 -15368 4069 10333 7191 20300 30344 40942 50719 44837 45817 42089
14494 42089 38413 29644 27329 16649 1278 1249 8046 9575 7556 4761 -2055 -132 4283 2037
14480 2037 3703 6575 6109 15890 14629 -822 -5888 -9607 -12553 -5532 1196 -5127 -13021 -10527 1040
14465A040N398O064J959J487o600K880J0682O784o414o935m227n56O083n382l407
14450H856R101J618j4838p255J30J08m471J2192J4791Q20M906m828M75j021j878
14435A8706m759l251j4465p705m632J0592J0920j2450m858O682J2253R753r13
14422A5873r275M60P164j4241q231M85j60J350M823J4737Q131l309R26l496P718
14407B2955M234m57J458j978n44l825l403l98r02K745K719m895o132J467J45O794
14391A9983q584k5132m992J2466J5n283j3785Q972K1658J0737K848r32p18k38
14377A7015l563n473q921L111K4522l338p909L122q756l289K3320L505K678J959
14363C7983r239l804o915N341K162O270K89j2473j2692p389m412R259k627J643
$$ plain form
14465 1040 6438 12502 14461 15948 9348 12228 22910 29694 23280 16345 12118 11562 17645 12263 8856
14450 8856 17957 19575 4737 -2518 -2388 -2280 -6751 5441 20232 21052 25958 21130 21605 20584 18706
14435 18706 13947 10696 -3769 -11474 -16106 -5514 5406 -7044 -11902 -5220 7033 16786 15873
14422 15873 6598 7058 14222 -19 -8250 -7765 -7925 -6575 -1752 12985 21116 17807 18733 15237 22955
14407 22955 27189 26732 28190 26212 25668 21843 18440 18042 17140 19885 22604 17709 11577 13044 13189 19983
14391 19983 11399 -13733 -18725 -6259 -6244 -11527 -25312 -16340 5318 16055 18903 17971 17253 17015
14377 17015 13452 7979 -942 2169 26691 23353 15444 18566 9810 6521 29841 33346 36024 37983
14363 37983 28744 24940 18025 23366 25528 31798 32087 19614 6922 -467 -4879 4380 1753 3396
14349C396M449Q555k3j6944j930J0684L468J1586P606J0042M897J822k193R18
14335D6333n244l81L13j5847j4129p344k371K495m277Q36N071J3199j904r897
14321F853m843j556O601P356O428m08j3488j5174O531R907j494o129L167N942
14307I693J0145m000J560L286o36Q673N40l312j0032j426p577n110j888o86K108
14292A338P163J5585n332N134J851m560j2412m040j128p222q721k674q61J615
14278a4264J2117J133J0467K089j3402j4977k608P083J0023K3411P667p19j2110
14265A5910O071J9380J1997j0158k0105J52Q890j0202j0522L423j136K756q41
14252A5615J235r104m57k203L676J2264K098O189N846k655o200O155Q842j2870
$$ plain form
14349 3396 7845 16400 16377 -567 -2497 8187 11655 23241 30847 40889 45786 47608 45415 46333
14335 46333 41089 40708 41021 25174 11045 3701 1330 3825 -452 384 5455 18654 16750 6853
14321 6853 2010 454 7055 14411 20839 20431 6943 -8231 -1700 8207 6713 584 3751 9693
14307 9693 19838 15838 17398 20684 20048 28721 29261 25949 15917 14491 6914 1804 -84 -770 1338
14292 1338 8501 24086 18754 23888 25739 21179 8767 4727 3599 -3623 -12344 -15018 -15879 -14264
14278 -14264 -2147 -1014 9453 11542 -1860 -16837 -19445 -12362 -2339 21072 28739 28020 15910
14265 15910 21981 41361 53358 43200 23095 23247 32137 21935 11413 14836 13700 16456 15615
14252 15615 16850 7746 7289 5086 8762 21026 23124 29313 35159 32504 26304 32459 41301 28431
14238B8431k256J231J0338J0519p63r688j0908J234m48l180m475j06j954Q03l181
14223A5597r462p005O025J6181m792q365j0564l103n02R657K322n83K743o618
14209A531j89p249L467J3146o225K612j461P914M909J879M512o663m506o429P773
14194A5021N324Q279J0161L153j3304j1380L163J1327k939l460j0402p49p31m198
14180I265j0261L744r378n061J1918R104j0657K16L987M303j394n027K943J801
14166E503r453O24J180P35k325P988J2047m003R00K550J1013l04o590r574l53
14151I938j0701O889k396l162J5705J1395p312o085k114J0310P799r962j1557
14138H747K2729O196j0832q223n98p617J1531L171l892j455M071L732j0451p914
$$ plain form
14238 28431 26175 27406 37744 48263 47500 37812 26904 28138 27690 24510 20035 19929 17975 18778 15597
14223 15597 6135 -870 5155 21336 16544 8179 -2385 -5488 -5990 3667 5989 5406 8149 1531
14209 1531 1342 -5907 -2440 10706 4481 7093 5632 13546 18455 20334 24846 18183 13677 7248 15021
14194 15021 20345 28624 38785 41938 28634 17254 20417 31744 28805 25345 14943 14194 13463 9265
14180 9265 -996 2748 -6630 -11691 227 9331 -1326 -1110 2877 7180 5786 759 3702 5503
14166 5503 -3950 -3326 -2146 -1411 -3736 4252 16299 12296 13196 15746 26759 26455 19865 10291 9938
14151 9938 -763 6126 3730 568 16273 27668 20356 14271 12157 22467 30266 20304 8747
14138 8747 31476 37672 26840 18617 18019 10402 21933 25104 21212 19757 23828 27560 17109 9195
14124I195J1385J2836R378k555n069k641j082Q74k777o437L069J5668O005q371
14110C9478n206j0925N906O710o204m307O239N209j330L903K41j392J389n244
14096C4467N1O865r9j246j1759o570o093O019P09l576j640J221J7010m38Q117
14081D3038J3238o184r914p084j207m205p240m414J931J708r51j0784L836k919
14067H849p325Q693L370J6437J0713l874k352J1091J1046M893r850o649j863q346
14053C4833p322k705p896J141k08L501J2283N904o079r08K770J388o319L643M043
14038C8069Q005L385q451l279l885j569m376J923m147n732J3131J203P06q13J4298
14023D8468O493j5718q53l677k3952j0450J2559J4031P20r152J6371N182p533
$$ plain form
14124 9195 20580 33416 42794 40239 35170 32529 31447 32321 29544 23107 26176 41844 47849 39478
14110 39478 34272 23347 29253 35963 29759 25452 31691 36900 35570 39473 39714 38322 39711 34467
14096 34467 34518 41383 41284 40038 28279 21709 15616 21635 22344 18768 17128 18349 35359 34921 43038
14081 43038 56276 50092 40178 33094 31887 27682 20442 16028 17959 19667 18716 7932 11768 8849
14067 8849 1524 10217 13587 30024 40737 36863 34511 45602 56648 61541 51691 45042 43179 34833
14053 34833 27511 24806 16910 18051 17843 21344 33627 39531 33452 32544 35314 36702 30383 34026 38069
14038 38069 46074 49459 41008 37729 33844 32275 27899 29822 25675 19943 33074 34277 34983 34170 48468
14023 48468 54961 39243 38390 34713 10761 311 12870 26901 27621 18469 34840 40022 32489
14010C2489r629j500n901l762n235j040M617J1270J4767J918r844l565L326l280
13996B4631j1699p95q112j0871O914K239M330Rn537R842M599j5578J1868Q569
13982B0409L294K960k40m646o790o83l980J1236R504O729J3064n761k1996j3175
13968I925M93M770K925M893R905L514o795J1508r09j2811P507M264N03n875R46
13953C4763L31j0742j0348r848l976K302R215L477j627N336R424r124m915O801
13939B1069N258n65j385L895J6747j1232j6173J0007J2886j09m973J2197L337
13926E0959m117q995J8126R33j3116L323q9K957k816j8849j1616Q118N325q707
13912B1436L347j345J0546R206j81j083r89M35Q208J3548R172k322o452j0146
$$ plain form
14010 32489 22860 21360 15459 11697 6462 5422 10039 21309 36076 37994 28150 24585 27911 24631
13996 24631 12932 12137 4025 -6846 68 2307 6637 6646 1109 10951 15550 -28 11840 20409
13982 20409 23703 26663 26423 21777 14987 14304 10324 21560 31064 37793 50857 45096 23100 9925
13968 9925 10418 15188 18113 23006 32911 36425 29630 41138 40229 27418 34925 39189 39692 33817 34763
13953 34763 35094 24352 14004 4156 180 2482 11697 15174 13547 18883 28307 19183 14268 21069
13939 21069 26327 25762 24377 28272 45019 33787 17614 27621 40507 40398 35425 47622 50959
13926 50959 46842 37847 55973 56906 43790 47113 47024 49981 47165 28316 16700 24818 30143 21436
13912 21436 24783 23438 33984 43190 43009 41926 40937 41372 49580 63128 72300 69978 63526 53380
13898E3380j3337l633M689q442o229n560n39R061P49K106O090Q547O863m477Q173
13883E7441J4451Q938p278o095m132j0198j5914p756n430J356q533l218O868M596
13869B5096J067M92k372l069M34j2042j987n853K592Q462N126K19J2P28J2441
13854C1346O713j718o856k428K402j924J512M264l109O200O983j982o790r18j68
13839C3527j8920q320O687P556J1463M985J0957P263l959n859J314p250m071J2625
13825D7998j373p560J1395n471o516n912p451k658j1232j865J1994l560j0853
13812F936K947Q656O357M276J91k003j196J1837q056j7114J4599K1376N876l715
13798E0967M410J0981m000j2074o103j0831p006M592O406N310J0039j1362k847
$$ plain form
13898 53380 40043 36410 41099 32657 26428 20868 20329 29390 30139 32245 38335 46882 53745 49268 57441
13883 57441 71892 80830 73552 67457 63325 53127 37213 29457 24027 25383 16850 13632 20500 25096
13869 25096 26163 26655 24283 21214 21648 9606 7619 1766 4358 12820 17946 18165 18177 18905 31346
13854 31346 38059 36341 29485 27057 29459 27535 29047 33311 30202 36402 43385 41403 34613 33695 33527
13839 33527 14607 6287 12974 20530 31993 36978 47935 55198 51239 45380 46694 39444 35373 47998
13825 47998 46625 39065 50460 44989 38473 32561 25110 22452 11220 9355 21349 17789 6936
13812 6936 9883 18539 24896 29172 29363 27360 26164 38001 29945 12831 27430 48806 54682 50967
13798 50967 55377 66358 62358 50284 44181 33350 26344 30936 37342 42652 52691 41329 38482
13785C8482M694k813r579Q647p03M076J289P266J2665j128j9988q038q1j3486
13771B1303l120Q941P629L329Q349N616j0794j4228N474k503n535L448O390N985
13757D0284k748n91R613r303o426Q782K468n992N125R130R472K273O920L68r37
13742F8438j2869m116M377j3955j0865l925j096k457j474l409j97J7098j53j2983
13728B2414Q991J1484K920N905n546o444l623J3600P363m654Q017J5659J284j5518
13714F1852j5386m373l412o060M147Q187M241J6855M900J288q703k665j6781q436
13700C5654O752J76M98m268j448k758J06O219l142O82J1598J8872J3302j2183
13686G0060j009p32M738J0112j1600j3063j0725n461r293j2664O795J1842R55
$$ plain form
13785 38482 43176 40363 30784 39431 38728 42804 44093 51359 64024 62896 42908 34870 34789 21303
13771 21303 18183 27124 34753 38082 46431 52047 41253 27025 32499 29996 24461 27909 34299 40284
13757 40284 37536 36945 46558 37255 30829 39611 42079 36087 41212 50342 59814 62087 69007 69375 68438
13742 68438 55569 51453 55830 41875 31010 27085 25989 23532 22058 18649 18452 35550 35397 22414
13728 22414 31405 42889 45809 51714 46168 39724 36101 49701 57064 52410 60427 76086 77370 61852
13714 61852 46466 42093 38681 32621 36768 44955 49196 66051 70951 72239 63536 60871 44090 35654
13700 35654 42406 42582 43080 38812 37364 34606 34712 40931 37789 38471 50069 68941 82243 70060
13686 70060 69051 68319 73057 83169 71569 58506 47781 42320 33027 20363 27158 39000 39955
13673C9955O804J2220P942L159o609p491n258p476j2528J886o089n5J0001J4044
13659E0505J100J232n156j2027j1220P881N575L895P876l265J284J09k317K578
13645D8050M501L195J439l076o983M303n011j0417l999J850j0721j1483N542K3005
13631D0195R303J2024K1169l7l215q535L282j1648n93o157l815N628K601j3185
13617D7017O251N550J451m993m240O794R258J270M216P32o86O11o470j0718J739
13602E7782q76p245O44M901J375n133J2546R724o880m733l415Q392O160k945o188
13587F4109L239J0286Q140n723P429O846j5058N500J364n918j246l346R395R690
13573I4707O884q52p553j1748j0821p855j9252k118r163p451L600J0186J2070
$$ plain form
13673 39955 46759 58979 66921 70080 63471 55980 50722 43246 30718 32604 26515 26460 36461 50505
13659 50505 51605 52837 47681 35654 24434 32315 37890 41785 49661 46396 47680 47789 45472 48050
13645 48050 52551 55746 57185 54109 47126 51429 46418 36001 32002 33852 23131 11648 17190 40195
13631 40195 49498 61522 82691 82654 79439 70904 74186 62538 61945 55788 51973 57601 60202 47017
13617 47017 53268 58818 60269 55276 51036 57830 67088 68358 72574 73306 72620 73231 66761 56043 57782
13602 57782 56906 49661 50305 55206 56581 51448 63994 73718 66838 62105 58690 67082 73242 70297 64109
13587 64109 67348 77634 85774 80051 87480 94326 79268 84768 86132 80214 78968 75622 85017 94707
13573 94707 101591 100739 93186 81438 70617 62762 43510 41392 32229 24778 28378 38564 50634
13560E0634M886p558M217l61r171p641k63m718M52P587q31R150O232n977q486
13545C8152j6246j741R831J9423K0888J0727m723l103L29j7681r093j3888r229
13532B3646M514J735R589P509K565M680j244R977m53J1849O745p973m838n257
13518F3044r582j842K133J0567o083J239R605o011j3463K191J917j2202M445J0721
13504E6679J7809nN750J344j3341r723j2032O825K4368J8072N830j7134o021N886
13490H4307J1949j0073L237M547m832j16o815j9874k5181q232M063J2292R535
13477E4807J2523L856n590j3375j0653K658O483p225q03O246k70K721J0869J4108
13463G6355p605K543J2141m160q677k728l691k220j241Q39J3770L657k845j0248
$$ plain form
13560 50634 55520 47962 52179 51818 42647 35006 34743 30025 30477 38064 37233 46383 52615 46638 38152
13545 38152 21906 20165 29996 49419 70307 81034 76311 73208 73537 55856 46763 32875 23646
13532 23646 28160 29895 39484 46993 49558 54238 52994 62971 62518 74367 81112 73139 68301 63044
13518 63044 53462 51620 53753 64320 58237 59476 69081 63070 49607 51798 53715 41513 45958 56679
13504 56679 74488 74483 80233 81577 68236 58513 46481 53306 77674 95746 101576 84442 78421 84307
13490 84307 96256 86183 89420 93967 89135 89019 82204 62330 37149 28917 32980 45272 54807
13477 54807 67330 71186 65596 52221 41568 44226 50709 43484 42681 48927 48657 51378 62247 76355
13463 76355 68750 71293 83434 79274 70597 67869 64178 61958 60717 61556 75326 78983 76138 65890
13449F5890j0865n118j2509j2744n903N641K0447J9240O730M318n566j1482k947
13436E5132J450M333J0378O687J121K787J0815n786m925j0754k0276j0191J310
13423D2081P76Q030O064k071O82N737R702m96L826L51j67j962j0416o870P122
13408F2389J0094J2278J5754J19j3723k770L119k890p962n586Q316K965j532j6174
13394F4397r18J465p193J772K182J1905J1112n854r675k00L699Q135J003M656
13380H6486L461j1125j535K124q608J735j242m236R29R290j401p722l974m459
13366E9723N250P106k002M993r945j0442l215p223R253J0885j36M294N3L2k572
13351F6054m916j521R505l886j751J5518L241j1861L381m296n067l205j20M037
$$ plain form
13449 65890 55025 49907 37398 24654 18751 24392 44839 64079 70809 75127 69561 58079 55132
13436 55132 56582 60915 71293 77980 79101 81888 92703 86917 81992 71238 50962 40771 42081
13423 42081 42857 50887 56951 54880 55562 61299 71001 70505 74331 74682 74515 72553 62137 55267 62389
13408 62389 72483 84761 100515 100634 86911 84141 87260 84370 76408 70822 79138 82103 80571 64397
13394 64397 63479 64944 57751 59523 61705 73610 84722 78868 69193 68993 72692 80827 81830 86486
13380 86486 89947 78822 77287 79411 70803 72538 71296 67060 67989 77279 75878 68156 64182 59723
13366 59723 64973 72079 70077 75070 65125 54683 51468 44245 53498 64383 64247 68541 68594 68626 66054
13351 66054 61138 59617 69122 65236 63485 79003 82244 70383 73764 69468 64401 61196 61076 65113
13337F5113J2018J956j3426k687J5885Q720J223j6990J966O602p99j2745k241
13324F4595k603L563P365L245Q3N299N053n99j384L149n995q241J3056L525M05
13309I0516N156n887J592J460k995j2416L670l929q351q34M89n745q248J9463
13295G3941J1898L597L299k379J124R296j347n574P756j2999j639M491M744N407
13281A01615J036p162m503M192r86j1022m474P867Q107L806m041o011O687j1343
13267H3768m507L023k748n92K054r102n710l966n065Q484Q323L7N193J898N785
13252H6875N316O0j224J5908K609j4547O517p089Q0J1879K301j7451j1537P00
13238H0397r05K249J0646J0976R80N617l718l065q496r003L972P139j4920k0962
$$ plain form
13337 65113 77131 79087 65661 62974 78859 87579 88802 71812 73778 80380 79581 66836 64595
13324 64595 61992 65555 72920 76165 76248 81547 86600 86001 84617 87766 81771 73530 86586 90111 90516
13309 90516 95672 89785 91377 92837 89842 77426 81096 77167 68816 67982 68471 62726 54478 73941
13295 73941 85839 89436 92735 90356 91480 100776 99429 93855 101611 88612 86973 91464 96208 101615
13281 101615 102651 95489 90986 95178 94192 83170 78696 86563 94670 98476 94435 88424 95111 83768
13267 83768 79261 82284 79536 78944 80998 71896 66186 62220 57155 65639 73962 73999 79192 81090 86875
13252 86875 92191 92251 91027 106935 109544 94997 101514 94425 94505 106384 108685 91234 79697 80397
13238 80397 79492 81741 92387 103363 104343 109960 106242 103177 94681 85678 89650 96789 81869 60907
13224F0907p30N900l06j219Q659Q511P664L932N157k549j7680k318m41O978k81
13209H2184M825j383j887r356M613J2918L846J9931R552m92j4441j8445k1959
13196F9906l011K571k060l548L824m0P135M675k323j992Q50J0056N813p818l086
13181H0952M257J931n658o497o061N34p772J3051J5668j275N662K954N816M708
13167A08270j3625k081J7606P891n627j1855j4367l430Q037o169N646j119p599
13154H1578O576R270J0668N31O343J4689M898N211j6476j4771j4689j040k696
13141I0092K679O029K0105J1763P585K799K58j4058j6944m254j0294L788O091
13128A05639m90J598J132M347n124k45P603O281L645p054n203J013L538R264o136
$$ plain form
13224 60907 60177 66077 65771 64552 73211 81722 89386 93318 98475 95926 78246 75928 75487 82465 82184
13209 82184 87009 85626 83739 74383 78996 91914 95760 115691 125243 124751 110310 91865 69906
13196 69906 66895 69466 67406 63858 67682 67642 74777 79452 77129 75137 75987 86043 91856 84038 80952
13181 80952 85209 87140 81482 74985 68924 69458 61686 74737 90405 89130 94792 97746 103562 108270
13167 108270 94645 92564 110170 118061 112434 100579 86212 82782 90819 84650 90296 89177 81578
13154 81578 88154 97424 108092 108623 114966 129655 134553 139764 123288 108517 93828 92788 90092
13141 90092 92771 98800 118905 130668 138253 141052 141310 127252 110308 106054 95760 99548 105639
13128 105639 105149 106747 107879 112226 107102 106857 114460 120741 124386 117332 112129 113142 116680 125944 119808
13113A19808j0490M751L832P64L329O669n133j2054k955N930K0278J2221J670
13100A48620o158L1n455l655l711j6731j3806p493m458O453K993L651Q418Q750
13086A17449q491r8N213K693k317p620r767p963J3958K664j4817p42Q498K220
13072A00880J854M501J1924P057R164l105J345R673N834p899j6064j5066n940
13059A04158l664J9163L607K469J26J0795O2p68l404n779l657K942q909L254j02
13044A20293k152r97o047r730n894N758J4087K0656P417p199p638j856p930j2316
13030A06452R084R928q756L664J0868L024n225l322R4N777k578k296N989L119
13016A35822J2733J8l817j9260k0112J4545K1158L60N839J4520q461r878J879
$$ plain form
13113 119808 109318 114069 117901 118665 121994 128663 123530 111476 108521 114451 134729 146950 148620
13100 148620 142462 142493 137038 133383 129672 112941 99135 91642 87184 93637 96630 100281 108699 117449
13086 117449 108958 108860 114073 116766 114449 106829 97062 89099 103057 105721 90904 90162 98660 100880
13072 100880 102734 107235 119159 126216 135380 132275 133620 143293 149127 141228 125164 110098 104158
13059 104158 100494 119657 123264 125733 125859 136654 136716 135948 132544 126765 123108 126050 117141 120395 120293
13044 120293 118141 117144 111097 101367 95473 101231 115318 135974 143391 136192 128554 126698 118768 106452
13030 106452 115536 125464 116708 120372 131240 134264 129039 125717 125811 131588 129010 126714 132703 135822
13016 135822 148555 148573 144756 125496 105384 119929 141087 141447 147286 161806 153345 143467 145346
13003A45346P886L963o002o382J203n668j5871Q550m070n326o286P142N483j420
12989A28548k813J141M760n916L62o597l731J2877R591M037o986p015J1501N480
12975A45239j396m39O941j1953l78L146Q810O991q987j2143o51M26j762r795l467
12960A20582N808J8856L415p625r827O396k61J848J7071j1793n020J2109O228
12947A57787j290j823O429j428j0393n498M836J3483J2462q091j4969m979j6529
12934A29997l955L787M537R414J7235J1651j762l747o812l450r52M162N677M178
12920A69960l279o440R799K486q011j0867K207p292m474J2849Q722l397L58O124
12906A68745J2123l438q811m860n341n249j4436m051P349R469m900k331N29k374
$$ plain form
13003 145346 153232 157195 151193 144811 146014 140346 124475 133025 128955 123629 117343 124485 129968 128548
12989 128548 125735 126876 131636 125720 126082 119485 115754 128631 138222 142259 135273 128258 139759 145239
12975 145239 143843 143404 150345 138392 138014 141160 149970 156961 147974 135831 135180 135606 133844 124049 120582
12960 120582 126390 145246 148661 141036 131209 137605 137344 139192 156263 144470 139450 151559 157787
12947 157787 156497 154674 161103 159675 149282 143784 148620 162103 174565 166474 151505 146526 129997
12934 129997 126042 129829 134366 143780 161015 172666 170904 167157 160345 156895 155943 160105 165782 169960
12920 169960 166681 160241 170040 172526 164515 153648 155855 148563 144089 156938 165660 162263 162621 168745
12906 168745 180868 177430 168619 163759 158418 153169 138733 134682 142031 151500 146600 144269 144798 142424
12892A42424O714J706p806Q047o204K921M859J1281J6254P93P310P620k164j7477
12878A76278r316M90l667Q552Q432N923L490l672q994N993O805j2079o769j4173
12864A57293m867L357K369q696q668k880L54r093J3884Q151J430J048l247L814
12850A54249Q458N051m150j0139j546l352L698J9277R921n045o373r354N196Q592
12836A74483p246m830r981k164j734j2203j0728l166P046J5675K435O325Q068
12823A61980j1307k316m022M207J0648p017J2952J0828l116L516J8797n420q927
12810A80803l824n70J64J1409K185p988q790O489J0605l193j1983N302Q308O174
12796A95091r375j43J0680L894L392K090k61m015k114K070k599l305j891J776
$$ plain form
12892 142424 149138 150844 143038 151085 144881 147802 152661 163942 180196 180989 188299 195919 193755 176278
12878 176278 166962 167452 163785 172337 180769 186692 190182 186510 177516 183509 190314 178235 171466 157293
12864 157293 152426 155783 158152 149456 140788 137908 138262 129169 143053 151204 152634 153682 150435 154249
12850 154249 162707 167758 163608 153469 151923 148571 152269 171546 181467 176422 170049 160695 165891 174483
12836 174483 167237 162407 152426 150262 148528 136325 125597 122431 129477 145152 147587 153912 161980
12823 161980 150673 148357 144335 148542 159190 152173 165125 175953 172837 176353 195150 189730 180803
12810 180803 176979 176409 176573 187982 190167 182179 173389 179878 190483 187290 175307 180609 188917 195091
12796 195091 185716 185573 196253 200147 203539 205629 205368 201353 199239 201309 198710 195405 193514 195290
12782A95290K302j0760j4810q126L168P015N506L956J983L035R623k62J863j3243
12768A86540J557K957l820J145k90p43Q797q58n485M087P590O647P537N891k079
12753B19473J089J599p805L645M444j430M376K927j5627n159J2266L959M141N387
12739B33285O844p332q422L222M143j278m125L080K802p33n323j4357p86L990
12725B15010O749j55l95L600m915j614r524j2878j3417k714J1099O057m459q079
12711A84365j2256J2063J6698J4139L547O426k2l800Q238J1985L490q722L409
12698B39560O531j5588K26M127n27l176r471K896l357j17m519j516Q217J361L
12683B24650r253j2023n693j157P316N439k060m187L751J1013P555m193J3487
$$ plain form
12782 195290 197592 186832 172022 163896 167064 174079 179585 183541 185524 188559 198182 197920 199783 186540
12768 186540 188097 191054 187234 188379 188089 187346 196143 195285 189800 193887 201477 208124 215661 221552 219473
12753 219473 220562 222161 214356 218001 222445 221015 225391 228318 212691 207532 219798 223757 227898 233285
12739 233285 240129 232797 224375 227597 231740 230462 226337 229417 232219 231486 226163 211806 211020 215010
12725 215010 221759 221604 221209 224809 219894 218280 208756 195878 182461 179747 190846 196903 192444 184365
12711 184365 172109 184172 200870 215009 218556 224982 224960 221160 229398 241383 244873 236151 239560
12698 239560 246091 230503 230729 234856 234329 231153 221682 224578 221221 221104 216585 215069 223286 224647 224650
12683 224650 215397 203374 197681 196524 203840 209279 207219 203032 206783 217796 225351 221158 234645
12670B34645Q990o986r547o528o336P425j5738q702O540P735O708J6138K923n771
12656B31496L817J729R288l333n453J1492O639J637k4287j1778N691k7q809j1530
12642B06572j3147j1515N92J1168J7534K2673J5044J5478Q985n278m000q983K733
12629B57856l728P63N003P087j1344j8225N9N067J0362Q512N996p319M784Q945
12615B73818j3948o787j738n885j218R631M472k832o044J0711K696J605R94N92
12601B66067R466K0784O524K12J0618J0709m102r051n723r978n408J1432J4207
12588C15757n372o641j3834j2293r581K895J4213J2689K1476K1817J7403K3412
12576C81941J6930L781J1483K7276N4135Q1552J09478J16062J53248J59561J21440
$$ plain form
12670 234645 243635 236649 227102 220574 214238 221663 205925 197223 203763 211498 218206 234344 237267 231496
12656 231496 235313 237042 246330 242997 237544 249036 255675 257312 233025 221247 226938 226911 218102 206572
12642 206572 193425 181910 182502 193670 211204 233877 248921 264399 273384 268106 264106 255123 257856
12629 257856 254128 254891 259894 266981 255637 237412 237471 242538 252900 261412 267408 260089 264873 273818
12615 273818 259870 253083 251345 245460 244242 253873 258345 255513 249469 260180 262876 264481 265475 266067
12601 266067 275533 296317 302841 303053 313671 324380 320278 311227 305504 295526 290118 301550 315757
12588 315757 310385 303744 289910 277617 268036 270931 285144 297833 319309 341126 358529 381941
12576 381941 398871 402652 414135 441411 495546 577098 686576 802638 955886 1115447 1236887
12565A236887K7676l2385o2971q5935j12212j05490q7226p4345q1575o8023m9770
12554E04631l3349k3341j6584k2112p905j398j519N335K0714K6349K4772L1431
12542E07024K9255J7219K4016L8270M2487P0636J26334K04848K47510K59502K66163
12531A833264J91103O2789j1343p6095j57667k00490k07570j90287j74951j46272
12521I22481j06123p9271n8482m5049l6637k1615k8307k4943j3072j2194j1341
12510D85447j0158J3682J3922n153r758K043J4814K3579K8553L7811O7889J00344
12498G63015J51671J81437J51772R2331O856m8479q3565j26558j38118j28029
12488H22333j23517r3042q8753m0984k4660k9912k1843q792J201J590R878k974
$$ plain form
12565 1236887 1264563 1232178 1169207 1083272 971060 865570 778344 703999 622424 554401 504631
12554 504631 471282 447941 431357 409245 401340 399942 398423 403758 424472 450821 475593 507024
12542 507024 536279 553498 577514 615784 658271 728907 855241 1060089 1307599 1567101 1833264
12531 1833264 2024367 2087156 2075813 1999718 1842051 1641561 1433991 1243704 1068753 922481
12521 922481 816358 737087 678605 633556 596919 575304 546997 522054 508982 496788 485447
12510 485447 475289 488971 502893 497740 487982 490025 504839 528418 556971 594782 662671 763015
12498 763015 914686 1096123 1247895 1340226 1347082 1298603 1215038 1088480 950362 822333
12488 822333 698816 605774 517021 476037 451377 421465 399622 390830 392031 393621 403499 400525
12476D00525L946M00Q119m69m814j2135k3518l988o712l249O247p216k1505j4950
12462C20681j2588M065N721J1297J2117J9633J7377O729p957k0831k0707j6304
12450C19233M93O610m587j6318j3943j1679l888P556J1957K3413K0609K8861J7929
12437C86246J0476j0802j3010l2311k3026k905j5274j9456j888r866Q956J2991
12425B90131J11P782J0549K0210L990j0177p675j1669j6872j0709p21O327J0853
12412B92130J0881Q593j278l527J0691J3209J0992N628O845q696j6050m568m781
12399C20069l041R538p731M846Q575R479J599m00k0685j3788q470K41L481R230
12385C12943J9799K6926K7288K4286K9030K5075K3509K2815Q792j0069k5101k5315
$$ plain form
12476 400525 404471 404871 412990 412521 407707 395572 372054 368066 361354 358105 364352 357136 335631 320681
12462 320681 308093 312158 317879 329176 341293 360926 378303 385032 377075 356244 335537 319233
12450 319233 319726 326336 321749 305431 291488 279809 275921 283477 295434 318847 339456 368317 386246
12437 386246 396722 385920 372910 340599 317573 314668 299394 279938 278050 268184 277140 290131
12425 290131 290242 298024 308573 328783 332773 322596 314921 303252 286380 275671 274950 281277 292130
12412 292130 303011 311604 310326 306799 317490 330699 341691 347319 354164 345468 329418 324850 320069
12399 320069 317028 326566 318835 323681 332256 341735 343334 342934 322249 308461 299991 300232 303713 312943
12385 312943 332742 359668 386956 411242 440272 465347 488856 511671 520463 510394 485293 459978
12373D59978k3207j1539q201o446l152j1180j2723j6337j2803J0673K0770J309
12361C87142J820k435n35J1764J0848J480m614N734J8312J5081N224K1145L4139
12348E05105L4458K5804K3301L4029M4356K4674m320j9353l5596l4350m0876j5105
12336E42127j6491k3524j6808j33r67k8037j3935L734k468o597n25R072J4118
12323D59566K4435J8310L737m376R447J8892J8577J7089m439n816P964r041L272
12310E57617K3183L1176J3797j6097k2607l3270k9736m9195l0927K66R738p518
12298D46427r098j6384m915J5647K4587J1812m578N202N472J4299J9882J0663
12286E19016J4655J7487P408K4845J7391J029n255m908r849j602O059P15j358
$$ plain form
12373 459978 436771 425232 417031 410585 407433 396253 383530 367193 354390 365063 385833 387142
12361 387142 388962 386527 385992 397756 408604 410084 405470 411204 429516 444597 449821 470966 505105
12348 505105 539563 565367 588668 622697 667053 691727 687407 668054 632458 598108 557232 542127
12336 542127 525636 502112 485304 485171 484204 456167 442232 445966 443498 436901 436376 445448 459566
12323 459566 484001 502311 506048 501672 511119 530011 548588 565677 561238 555422 563386 554345 557617
12310 557617 580800 611976 625773 609676 587069 553799 524063 474868 443941 444207 453945 446427
12298 446427 437329 420945 416030 431677 456264 468076 463498 468700 474172 488471 508353 519016
12286 519016 533671 551158 558566 583411 600802 601831 596576 591668 581819 580217 586276 586991 585633
12273E85633k627r202j0510j6442j2448k0042j1165l846J3971j467O746J6548
12261E35149J6949J7141L1878K7158J7592K4102K3894J2469M1342M7910N9802
12250H55386Q6049R8639P7900L2074J3l3169l7042m7639l6913k6642k0074j2521
12238I36061n938P429J7430J1730k4764l0264j6085k227j6950K137J6190O035
12226I00784K1307J6104O921K0024K0438K7266L5696L9922N5866Q1268J20311
12215A345907J40073J26668R5335O2737J1310l6361m5745n5917o7700o2752o9748
12204A443807o2857n0162l1533k8389l8503k2211j9982j3321j1080j4890j7415
12193A133464L0K184Q318K2329J6249j165L1147M8264N8399O2230P7655Q7290
$$ plain form
12273 585633 583006 573804 563294 546852 534404 514362 503197 499351 513322 511855 518601 535149
12261 535149 552098 569239 601117 628275 645867 669969 693863 706332 747674 795584 855386
12250 855386 941435 1040074 1117974 1150048 1150061 1116892 1079850 1032211 995298 968656 948582 936061
12238 936061 930123 937552 954982 966712 941948 911684 895599 893372 876422 878559 894749 900784
12226 900784 922091 938195 945116 965140 985578 1012844 1048540 1088462 1144328 1225596 1345907
12215 1345907 1485980 1612648 1707983 1770720 1782030 1745669 1699924 1644007 1576307 1513555 1443807
12204 1443807 1380950 1330788 1299255 1270866 1232363 1210152 1190170 1176849 1165769 1150879 1133464
12193 1133464 1133494 1135678 1143996 1166325 1182574 1181409 1212556 1260820 1319219 1381449 1459104 1546394
12181A546394R1797J14546J21841J09301Q0386L2965J4206J2488m62j2118o430
12170B104914o088j3396l7851m1753k6964o691L6144M8068M7857O6687P8048P5611
12158B324586Q8969R6583J03372J16623J32820J52583J65483J83971K00739K26843
12148C792572K37314K49323K73376L03178L51969M08679M69051N62678O87403
12139G335543P98203R10730R92424J105883J254679J486522J803387K222522K812798
12130B0722691L614430M712362O234169Q427124J1672263J6641830K3666801L1161860
12122A26853530L3119987K3284313O415241o303207j3470517j9129219k2928019
12115A27842109k3080367k0195026j6166579j2328108r160925o720737m916404
$$ plain form
12181 1546394 1638191 1752737 1874578 1983879 2064265 2097230 2111436 2123924 2123462 2111344 2104914
12170 2104914 2098826 2085430 2047579 2005826 1978862 1972171 2008315 2056383 2104240 2170927 2248975 2324586
12158 2324586 2413555 2510138 2613510 2730133 2862953 3015536 3181019 3364990 3565729 3792572
12148 3792572 4029886 4279209 4552585 4855763 5207732 5616411 6085462 6648140 7335543
12139 7335543 8133746 9044476 10036900 11142783 12397462 13883984 15687371 17909893 20722691
12130 20722691 24337121 29049483 35283652 43710776 55383039 72024869 95691670 126853530
12122 126853530 159973517 183257830 189673071 183369864 169899347 150770128 127842109
12115 127842109 104761742 84566716 68400137 56072029 46911104 40190367 35273963
12108C5273963l516349k340010j314931l71985N21321J415081K399534L507147
12100C5573771M454386M580180L867147L498302M115983N297410P101781J0083228
12092G8572188J4842641K2009330L2298258M4676537N2949750M8118747L1327068
12085C24794519J4016274J96184j5654965l1337054l9085896l9642284l7292370
12078A75994408l3100332k7276888k0989855j5303375j0586537p073387n283609
12071E6380425m906372m605911l977997l476201l064749k497724j755294r69747
12063C1126430j82768O00690J401913K350739L513697N001015P029241R954490
12055F0795447J4328465K0722292K8926870L5377235L2154186J6392482j345667
$$ plain form
12108 35273963 31757614 29417604 28102673 27730688 28252009 29667090 32066624 35573771
12100 35573771 40028157 44608337 48475484 51973786 56089769 61387179 68488960 78572188
12092 78572188 93414829 115424159 147722417 192398954 245348704 293467451 324794519
12085 324794519 338810793 339006977 323352012 292014958 252929062 213286778 175994408
12078 175994408 142894076 115617188 94627333 79323958 68737421 61664034 56380425
12071 56380425 51474053 46868142 42890145 39413944 36349195 33851471 32096177 31126430
12063 31126430 30943662 31544352 32946265 35297004 38810701 43811716 50840957 60795447
12055 60795447 75123912 95846204 124773074 160150309 192304495 208696977 207351310
12048B07351310j2066557j8718589k4212430k6655869k5061054k1073569j6628458
12041F2934784j2711323r630590p353595n709974m505195l542983k761422k145505
12033A4574197j650657j268746r88490p87973o49099n51446m66208m21259l71663
12024G418656l01147k52026k52072k75388k70954k58947k45833k44986k29863
12015E087440k16341k14013j92096j64321j45088j30482j06629r2205j02840j09380
12005C614045j14418j26615j33720j25231j20786r4232q3115p7520o5934o0605
11995B611869n5186l7937k1694p38J7973N0222R4292J28608J15668J03202R3671
11984C099950P2657O076o3916j15938j29952j49997j58237j51773j42558j17859
$$ plain form
12048 207351310 195284753 176566164 152353734 125697865 100636811 79563242 62934784
12041 62934784 50223461 40592871 33239276 27529302 23024107 19481124 16719702 14574197
12033 14574197 12923540 11654794 10666304 9878331 9229232 8677786 8211578 7790319 7418656
12024 7418656 7117509 6865483 6613411 6338023 6067069 5808122 5562289 5317303 5087440
12015 5087440 4871099 4657086 4464990 4300669 4155581 4025099 3918470 3826265 3723425 3614045
12005 3614045 3499627 3373012 3239292 3114061 2993275 2899043 2815928 2738408 2672474 2611869
11995 2611869 2556683 2518746 2497052 2496314 2514287 2564509 2658801 2787409 2903077 3006279 3099950
11984 3099950 3172607 3178683 3114767 2998829 2868877 2718880 2560643 2408870 2266312 2148453
11974B148453o3473m9528n2218l8957l4132j6604j8918r214k2849j5396l136n902
11962A818126k741J0470J1410L591n64Q77N920q243k697R155O162J6125L5163
11949A902754N7176Q0863P4865M0453J7659N763l0274o7929o0215o9666n0820
11938A900629k0451k5253l1228l1450l2467l8735n9270n5585m5918m7048n4575
11927A458649m2053k7019j6328k2363j1168J594J3991K2107K1745L6732M4891
11916A480778O0562P7163R1457R6406R0693O6110N6681M1861K5585j3864m6312
11905B027120p9559j08685j22453j11183j12617r5525p4398n7653n5816l9444
11895A169787p981k768R659J2560J2229L8636L9914L8224L3166K1775J9266K8177
$$ plain form
11974 2148453 2084980 2035452 1983234 1944277 1910145 1893541 1874623 1865409 1842560 1827164 1824028 1818126
11962 1818126 1815385 1825855 1837265 1840856 1840292 1841169 1847089 1838846 1836149 1845304 1851466 1867591 1902754
11949 1902754 1959930 2040793 2115658 2156111 2173770 2179533 2149259 2081330 2021115 1951449 1900629
11938 1900629 1880178 1854925 1823697 1792247 1759780 1721045 1661775 1606190 1560272 1513224 1458649
11927 1458649 1416596 1389577 1373249 1350886 1339718 1341312 1355303 1377410 1399155 1435887 1480778
11916 1480778 1541340 1618503 1709960 1806366 1897059 1963169 2019850 2061711 2087296 2073432 2027120
11905 2027120 1947561 1838876 1716423 1605240 1492623 1397098 1322700 1265047 1209231 1169787
11895 1169787 1161806 1159038 1168697 1181257 1193486 1232122 1272036 1310260 1343426 1365201 1384467 1412644
11883A412644L8315M5062N8287M7369K4686O359j9905l4080l6616n8117m9728
11872A434276l0112j9569K902J9194J7536M96j4660m3478n0353n4029n1767m0616
11860A169820l1893l6259j1830q099o784M096J8894J2396K4747N9307P6101R4426
11848A364922R0812P6281N7583L6055K1375k1209o4624p6240p9891p9855p8388
11837A246821o6171m3779m0765k6725q184j2439j0339j4822j7376j7442r636j0447
11825I68696j863m598p017L464L238K841J1681J9018K1417J6773O125p813K958
11812A034920L918j5871k0988j7615p258j6733j0067p872k562q994j7201P96L224
11799I17697J7124K6850J3569O709p277p411K933N718M931j5630j7660q041o835
$$ plain form
11883 1412644 1450959 1496021 1554308 1601677 1626363 1632722 1612817 1578737 1542121 1484004 1434276
11872 1434276 1404164 1384595 1387497 1406691 1424227 1424723 1410063 1366585 1316232 1262203 1210436 1169820
11860 1169820 1137927 1101668 1089838 1081739 1074955 1079051 1097945 1110341 1135088 1194395 1270496 1364922
11848 1364922 1455734 1532015 1589598 1625653 1647028 1625819 1561195 1484955 1405064 1325209 1246821
11837 1246821 1180650 1136871 1096106 1069381 1061197 1048758 1038419 1023597 1006221 988779 979143 968696
11825 968696 966833 962235 955218 958682 961920 964761 976442 995460 1016877 1033650 1039775 1031962 1034920
11812 1034920 1038838 1022967 1001979 984364 977106 960373 950306 942434 939872 930878 913677 914473 917697
11799 917697 934821 961671 975240 981949 974672 967261 970194 975912 980843 965213 947553 939512 932677
11786I32677O055M017m406j2094n401k090J3330J1050m157Q357P327j0178k3068
11773I21419q474K398J3848L335p908J89k246n342J926l434J8133L1667K0556
11760I86067J2882r753j2878n641m437o955N448J0947Q036O325q883k2452L71
11747I59077O34p698J6935K6905J5216j814k574J041P02o053R66K36O403P172
11733A017148L208j2636r325k934M58N790K360J0262J498J718m064j5272o770
11720I91441p099N764O590j2019Q577K1001j676n758l743q491o001K279P778J0885
11706A009528J5851L021O863q34K600J9043K3223J4233L25L394J467o536J756
11693A093934q026k805R43J9578n151j774L609K1917J2467K467M496J0556P99
$$ plain form
11786 932677 938732 942749 938343 926249 920848 918758 932088 943138 938981 947338 954665 944487 921419
11773 921419 912945 915343 929191 932526 924618 924807 922561 917219 919145 915711 933844 965511 986067
11760 986067 998949 989196 976318 970677 966240 959285 964733 975680 983716 990041 981158 958706 959077
11747 959077 959711 952013 968948 995853 1011069 1009255 1006681 1007722 1008424 1002371 1003337 1003573 1009976 1017148
11733 1017148 1020356 1007720 998395 995461 995919 1001709 1004069 1014331 1015829 1017547 1013483 998211 991441
11720 991441 984342 990106 996696 984677 993254 1014255 1012579 1006821 1003078 994587 988586 990865 998643 1009528
11706 1009528 1025379 1028400 1035263 1034429 1037029 1056072 1079295 1093528 1093853 1097247 1098714 1092178 1093934
11693 1093934 1085908 1083103 1084046 1103624 1098473 1096699 1100308 1122225 1134692 1137159 1141655 1152211 1153010
11680A153010j0330O842K4198J8732M9661O3245O1371Q2661J21268J45604J58679
11669A874941J31686O7541J8952l2644n7247r6494j20094j05429q3040o7951o5152
11658A465069m3485j9302k3462l4506k8432L171L162K1449L3140N2369L5813J8074
11646A483060K2168R269L1562K0823M4097O8576P8498J10404J55971K15665K62009
11635B502102K55411J89956J15315L3048l2101j29704j94396k12556k00826j86583
11625B139666j49506j15450q5695o0563m3911l3552j6252j6689j7721k7530k5995
11614A546802k342j193j1862k902R332J5009K2586L1776K8682L2152N3114P2315
11602A793469R1440J35778J73717J62520J09076L0945l9271r7238j30012j41127
$$ plain form
11680 1153010 1142680 1149522 1173720 1192452 1242113 1305358 1366729 1449390 1570658 1716262 1874941
11669 1874941 2006627 2074168 2093120 2060476 2003229 1906735 1786641 1681212 1598172 1530221 1465069
11658 1465069 1421584 1402282 1378820 1344314 1315882 1319053 1322215 1343664 1376804 1429173 1464986 1483060
11646 1483060 1505228 1514497 1546059 1566882 1610979 1679555 1758053 1868457 2024428 2240093 2502102
11635 2502102 2757513 2947469 3062784 3095832 3063731 2934027 2739631 2527075 2326249 2139666
11625 2139666 1990160 1874710 1789015 1728452 1684541 1650989 1634737 1618048 1600327 1572797 1546802
11614 1546802 1544460 1543267 1531405 1528503 1537835 1552844 1575430 1607206 1635888 1668040 1721154 1793469
11602 1793469 1884909 2020687 2194404 2356924 2466000 2496945 2457674 2360436 2230424 2089297
11592B089297j44299j35246j13840q3420n5295m6494k6504j8740j7792q033q815
11581A430819M31J0712M566j251j01k878r162N618p527o828n972j6927n231N902
11567A402171n532j3379l019N127J8473k394N654J687r00Q844L889J04N590J0406
11553A436721J3554m75j0614r153O011K515p979J029Q387J2772J9305J7425J4979
11540A504477N182r32R301J4519M046J0990J1590J6009M2350N1021O2385R1737
11528A822675J36209J67745J67276R9689K9888k2155o5656r6224j15904j08346
11518B015197j06257r0612o2417k5409j9380j0121j0726p83J685o005l185J2939
11506A694926R01N722K5277K8935M4561L8431K6377N3038O1974M4808O0575Q5840
$$ plain form
11592 2089297 1944998 1809752 1695912 1612492 1557197 1510703 1484199 1465459 1447667 1439634 1430819
11581 1430819 1431250 1441962 1446528 1445277 1445176 1442298 1433136 1438754 1431227 1424399 1418427 1401500 1396269 1402171
11567 1402171 1396639 1383260 1380241 1385368 1403841 1401447 1407101 1408788 1407888 1416732 1420621 1420725 1426315 1436721
11553 1436721 1450275 1449800 1439186 1430033 1436044 1438559 1430580 1431609 1439996 1452768 1472073 1489498 1504477
11540 1504477 1509659 1508727 1518028 1532547 1536593 1547583 1559173 1575182 1617532 1668553 1730938 1822675
11528 1822675 1958884 2126629 2293905 2393594 2423482 2401327 2335671 2239447 2123543 2015197
11518 2015197 1908940 1818328 1755911 1730502 1711122 1701001 1690275 1689492 1691177 1685172 1681987 1694926
11506 1694926 1695827 1701549 1726826 1755761 1800322 1838753 1865130 1918168 1980142 2024950 2085525 2171365
11494B171365R2784J05615J40557J80635K24518K52413K67708K53232J81912O4690
11484C935429k9084j15321j76277j94804k11674k26440k03018j55409j14242r1974
11474B417186p7304m3312k8958k1025k0209k004L4407M1831M9495N5070M4668
11463B449845N3740M7300K8958P669K0553M4336O8361P7602J02173J32144J51505
11452C184186J59670J42499J30216R9891K8920n3748j16189j27201j49449j50934
11442C147861j24492r3668q0448p2614o8326p0896p5659o3613l8955l0978l3640
11431B394572l7379j7908L795J9735L0975L5341N4563O4719P8056J10437J36752
11420B873658J33233J09295N5759o097n5085q1721j18287j29098j21179r8376
$$ plain form
11494 2171365 2264149 2369764 2510321 2690956 2915474 3167887 3435595 3688827 3870739 3935429
11484 3935429 3906345 3791024 3614747 3419943 3208269 2981829 2778811 2623402 2509160 2417186
11474 2417186 2339882 2296570 2267612 2246587 2226378 2224374 2258781 2300612 2350107 2405177 2449845
11463 2449845 2503585 2550885 2579843 2587512 2608065 2652401 2720762 2798364 2900537 3032681 3184186
11452 3184186 3343856 3486355 3616571 3716462 3745382 3691634 3575445 3448244 3298795 3147861
11442 3147861 3023369 2929701 2849253 2776639 2708313 2637417 2561758 2498145 2459190 2428212 2394572
11431 2394572 2357193 2339285 2343080 2362815 2393790 2429131 2483694 2548413 2626469 2736906 2873658
11420 2873658 3006891 3116186 3171945 3165848 3110763 3029042 2910755 2781657 2660478 2562102
11410B562102q7158n6478m1343k4711q261q127K972p314j4579j4506L50Q294j1576
11397B299665J14P928P39J0308J4670J7989L0634J6616J2591K5574R994L201J2598
11384B462621M893K977q67q765K020K347q56k3218j0784J846N681J2865l475o034
11370B441251J171P598J8383L1200L7783L9970L4621L0091K895j2513k6399k1367
11358B584684L096M746L661P1p876p154k167j68N084P084N602J4943J1262J2867
11344B635735j366J1456J095P570L3393K2636J1011Q971J2789J9413K3489J8019
11332B804211L2961L2706M2555M3671M8732M6822M4297K1272m299j2963j2291
11321C087674m792o296K578K465j1780k1918j5774j6495j4613q477J2534P207
$$ plain form
11410 2562102 2474944 2418466 2377123 2352412 2344151 2336024 2338996 2331682 2317103 2302597 2302947 2311241 2299665
11397 2299665 2299779 2307707 2308446 2318754 2333424 2351413 2382047 2398663 2411254 2436828 2446822 2450023 2462621
11384 2462621 2467514 2470491 2469624 2460859 2462879 2465226 2464370 2441152 2430368 2432214 2437895 2450760 2447285 2441251
11370 2441251 2442422 2450020 2468403 2499603 2537386 2577356 2611977 2642068 2644963 2632450 2606051 2584684
11358 2584684 2587780 2592526 2596187 2596258 2588382 2581228 2579061 2578893 2583977 2591061 2596663 2611606 2622868 2635735
11344 2635735 2634369 2645825 2646920 2654490 2687883 2710519 2721530 2730501 2743290 2762703 2786192 2804211
11332 2804211 2837172 2869878 2912433 2956104 3004836 3051658 3095955 3117227 3112928 3099965 3087674
11321 3087674 3082882 3076586 3079164 3081629 3069849 3047931 3032157 3015662 3001049 2992572 3005106 3012313
11309C012313N722P886K7888K5680K9604N0109M3651L5376L0631J8173K1322K6613
11297C334968K6621K1990K0175J0231M679R42j1820j0261K0354K6714J3637R543
11285C467773j0746l7443k0849M258J4880K4905K2499R012J3210J5245J9900K3498
11273C546142K8613J5170K4679K6495K4271K4425J6506L9964N4018N3850N9568
11262C913701O9926N6387L9402K5225K0863J4972J9063L9101M1776M8631O5745
11251D354792Q1088R1406J11206J01210O2624L5410K0544j8446m6196o8979o9835
11240D654824n3346k5171K796Q357L7972P9924R7002P0588K2426j2184j6331j2555
11228D854302m89L915J1942J8857K7814M6105M0404N3517O0430R6569J00990J04513
$$ plain form
11309 3012313 3018035 3025921 3053809 3079489 3109093 3159202 3202853 3238229 3268860 3287033 3308355 3334968
11297 3334968 3361589 3383579 3403754 3413985 3418664 3419606 3407786 3397525 3417879 3444593 3458230 3467773
11285 3467773 3457027 3419584 3398735 3402993 3417873 3442778 3465277 3474289 3487499 3502744 3522644 3546142
11273 3546142 3574755 3589925 3614604 3641099 3665370 3689795 3706301 3746265 3800283 3854133 3913701
11262 3913701 3983627 4040014 4079416 4104641 4125504 4140476 4159539 4198640 4240416 4289047 4354792
11251 4354792 4435880 4527286 4638492 4739702 4802326 4837736 4858280 4839834 4793638 4724659 4654824
11240 4654824 4601478 4576307 4579103 4587460 4625432 4705356 4802358 4872946 4895372 4883188 4866857 4854302
11228 4854302 4853813 4857728 4869670 4888527 4916341 4962446 5002850 5056367 5116797 5213366 5314356 5418869
11216E418869J07505J12720J10258J17500J19106J14779J21394R5935N8370J5483
11206F391919r320j4868k1763l4737N547M4604O2837R0057J22471J27073J09210
11195F873030N8106J7776k3178m5584n5499l8111l7779n7915n6259n1710l9182
11184F543695k9414k0027K228K9697N4010Q4023J13207J52869J92731K12367K34713
11173G570099K34339K11088J88600J53533J25016J03391R2817P1510Q1794Q5316
11163H917503Q0988J01830R7565J30497J50812J53382J15032O6197k2056q4839
11153I706911j11130j11213p4977k6608J1718O1291Q2424J07470J33102J61549
11143I940537J80170K04995K13932K37785K66472L01764L40715M24485N24189
$$ plain form
11216 5418869 5526374 5639094 5749352 5866852 5985958 6100737 6222131 6318066 6376436 6391919
11206 6391919 6382599 6367731 6345968 6311231 6316778 6361382 6424219 6514276 6636747 6763820 6873030
11195 6873030 6931136 6948912 6925734 6880150 6824651 6786540 6748761 6690846 6634587 6582877 6543695
11184 6543695 6514281 6494254 6496482 6526179 6580189 6664212 6777419 6930288 7123019 7335386 7570099
11173 7570099 7804438 8015526 8204126 8357659 8482675 8586066 8678883 8750393 8832187 8917503
11163 8917503 8998491 9100321 9197886 9328383 9479195 9632577 9747609 9813806 9791750 9706911
11153 9706911 9595781 9484568 9409591 9382983 9394701 9455992 9538416 9645886 9778988 9940537
11143 9940537 10120707 10325702 10539634 10777419 11043891 11345655 11686370 12110855 12635044
11134A2635044O16639O65205O60372O51703O78605O97776P03916P36800P94845
11125A8840905Q70594R15557R37746R47590J008508J161936J409358J811560K383070
11116C0286824L140873M161007N526444P447097J0355856J4760528K0977973K7959803
11108A24616405L1691793K6771489J3353169j014038j0766401j7005593k1311672
11101A46335152k2822971k1141343j7489246j3379769r800894p040702n019932
11094D9640295l494559k250260j160563j75241P25302J554190K396788L192983
11086E0428935L839831M362869M962074N645436O224469O656337P011883P572798
11078I6704632Q992594J1825441J6349135K2670201L0344162L7732987M3239210
$$ plain form
11134 12635044 13251683 13916888 14577260 15228963 15907568 16605344 17309260 18046060 18840905
11125 18840905 19711499 20627056 21564802 22512392 23520900 24682836 26092194 27903754 30286824
11116 30286824 33427697 37588704 43115148 50562245 60918101 75678629 96656602 124616405
11108 124616405 156308198 183079687 196432856 195418818 184652417 167646824 146335152
11101 146335152 123512181 102370838 84881592 71501823 61700929 54660227 49640295
11094 49640295 46145736 43895476 42734913 42559672 43284974 44839164 47235952 50428935
11086 50428935 54268766 58631635 63593709 69239145 75463614 82119951 89131834 96704632
11078 96704632 105697226 117522667 133871802 156542003 186886165 224619152 267858362
11071B67858362M6194213M4965364L6607463K0731637J570810j5167904k6590245
11064C76169700l3352827l7243834l8551679l6570406l1810374k5978181k0194694
11057A52467705j4810518j0300850p109846m820465k389116N10521L596631O615167
11049A23759229Q921192R920700J0175022R991848Q359961N840965N009778O517943
11041A88496638Q767101J0171136J0395852R916370Q601450N733321K624469K389362
11033B47095699O462648J3137839J7950131J5020633L860490p706147j3674735
11026B82146558j5892392j7081687j7452223j6934294j5423702j3760722j3803266
11019A71798272j5117199j5579178j4677630j3094374j1004813q341861n290515
$$ plain form
11071 267858362 314052575 359017939 395625402 416357039 417927849 402759945 376169700
11064 376169700 342816873 305573039 267021360 230450954 198640580 172662399 152467705
11057 152467705 137657187 127356337 120246491 115426026 113036910 113547431 117144062 123759229
11049 123759229 132680421 142601121 152776143 162767991 171127952 176968917 181978695 188496638
11041 188496638 197263739 207434875 217830727 227747097 236348547 242081868 244706337 247095699
11033 247095699 253558347 266696186 284646317 299666950 303527440 295821293 282146558
11026 282146558 266254166 249172479 231720256 214785962 199362260 185601538 171798272
11019 171798272 156681073 141101895 126424265 113329891 102325078 93983217 88692702
11012H8692702k052637J338701N134789R619715J5061569K1408266K7565671L0469346
11004A97238122K7038337J7567238N424791n765052j4313613k0998816k6056629
10997A80134378k7309720k5076885k1717765j8138272j4576583j1355090q746187
10990E3213876o751422n233451m064441l149063k408019j832579j405298j135345
10982B7234258r71266q78166q04312p65674p01591o12271n09710m14189l39395
10973B1237684l20634l13728l18644l17543k85483k50767k20953k02071j51967
10964A8855894r2285n2155k2185K6641P0719R2665O6677J4849n6972j18109j33693
10953A8652046j40364j44894j28932j00098o2164k0659J0468K8676Q1794R7911
$$ plain form
11012 88692702 86640065 87978766 93113555 102733270 117794839 139203105 166768776 197238122
11004 197238122 224276459 241843697 247268488 241503436 227189823 206191007 180134378
10997 180134378 152824658 127747773 106030008 87891736 73315153 61960063 53213876
10990 53213876 46462454 41229003 37164562 34015499 31607480 29774901 28369603 27234258
10982 27234258 26262992 25384826 24580514 23814840 23113249 22500978 21991268 21577079 21237684
10973 21237684 20917050 20603322 20284678 19967135 19681652 19430885 19209932 19007861 18855894
10964 18855894 18763609 18711454 18689269 18715910 18786629 18879294 18945971 18960820 18903848 18785739 18652046
10953 18652046 18511682 18366788 18237856 18137758 18075594 18054935 18065403 18094079 18175873 18273784
10943A8273784J02437J03950J19909J15798Q9958P9611O8866M6686M4107L5189
10933A9080295N2640P4564P2657P0106P4054R7582J14044J32931J25401J20131
10923B0014405J28224J33905J40027J54754J71508J81579K18144K85108L49625
10914B1777279M03863M52452M69806M55569M22477L24113J58907J0824j05206
10905B4370084j81991k10328k23272k14672k06692j58580r0542k5602M673J6154
10895B3079232K9935M7956O8694J10734J13255J24197J40029J56678J79484J74518
10885B4224712J59708J48517J27796J11847J01588J07504J18595J29286J45746
10876B5375299J78053J92987K40546K78336L40970M38942N79362P14567P81880
$$ plain form
10943 18273784 18376221 18480171 18600080 18715878 18805836 18885447 18954313 19000999 19045106 19080295
10933 19080295 19132935 19207499 19280156 19350262 19424316 19521898 19635942 19768873 19894274 20014405
10923 20014405 20142629 20276534 20416561 20571315 20742823 20924402 21142546 21427654 21777279
10914 21777279 22181142 22633594 23103400 23558969 23981446 24305559 24464466 24475290 24370084
10905 24370084 24188093 23977765 23754493 23539821 23333129 23174549 23084007 23058405 23063078 23079232
10895 23079232 23109167 23157123 23225817 23336551 23449806 23574003 23714032 23870710 24050194 24224712
10885 24224712 24384420 24532937 24660733 24772580 24874168 24981672 25100267 25229553 25375299
10876 25375299 25553352 25746339 25986885 26265221 26606191 27045133 27624495 28339062 29120942
10867B9120942O88668M48606K01516L1382p2840j34136j30368o7151L4299J44135
10857C0265053K54574L88196N31588O44952P58377Q45606R01153R72410J070359
10848C6632268J188796J371125J661395K015409K459033L060127L902748N104351
10840E7395252O832957R279052J2466655J5984127J8816049J9837124J8542736
10833A59153952J4914073R227258K420890m663703j0965978j5090794j6762233
10826A38233465j6669240j5291430j3013664j0322564p703529n436142l537042
10819F6259854j946780n76899O51274J705279K551754L118566L428441L570219
10811G8761708L677719L908832M425879N258663O331262P585937Q991318J0296036
$$ plain form
10867 29120942 29809610 30258216 30459732 30491114 30418274 30284138 30153770 30086619 30120918 30265053
10857 30265053 30519627 30907823 31439411 32084363 32842740 33688346 34589499 35561909 36632268
10848 36632268 37821064 39192189 40853584 42868993 45328026 48388153 52290901 57395252
10840 57395252 64228209 73507261 85973916 101958043 120774092 140611216 159153952
10833 159153952 174068025 183295283 185716173 181052470 170086492 154995698 138233465
10826 138233465 121564225 106272795 93259131 82936567 75233038 69796896 66259854
10819 66259854 64313074 63736175 64387449 66092728 68644482 71763048 75191489 78761708
10811 78761708 82439427 86348259 90774138 96032801 102364063 109950000 118941318 129237354
10803A29237354J1227878J1954835J2779300J3468243J3529150J2718443J0897971
10796B15813174Q123216M626038O78021l257552o512426q541745r438916r636264
10788A91853546r376154q834689q045097p007058n782550m214497j883309J342006
10780A48052198N385174J0076273J4733800J8257592J9752926J8901121J5831168
10773B50990252J0862444M326791l138416j0164536j5147745j7293633j7011370
10766B03423787j4716628j0216885l887966L539189J1069723J7404244K1285359
10759B27900823K1945014J9260931J4074626O840183j873284j0110436j6412670
10752B61625187k0387978k1849569k1375790j9515538j6329780j1992683p070221
$$ plain form
10803 129237354 140465232 152420067 165199367 178667610 192196760 204915203 215813174
10796 215813174 223936390 228562428 229240449 225982897 219470471 210928726 201489810 191853546
10788 191853546 182477392 173642703 165597606 158590548 152807998 148593501 146710192 148052198
10780 148052198 153437372 163513645 178247445 196505037 216257963 235159084 250990252
10773 250990252 261852696 266179487 263041071 252876535 237728790 220435157 203423787
10766 203423787 188707159 178490274 174602308 178141497 189211220 206615464 227900823
10759 227900823 249845837 269106768 283181394 290021577 288148293 278037857 261625187
10752 261625187 241237209 219387640 198011850 178496312 162166532 150173849 143103628
10745A43103628j939043L022521P271838J0427132J2176910J1930380R609763
10738A95603129O154127K464073q32288l340382n052474n736524n297430n019102
10730A78943129n648445o408606p030351p531399p363851o349450m285427p02338
10722A33623262M672713J2228384K2104987L1818600L3446995K0785417L343878
10715B62024236o220762j0312820j3770033j5003479j2796667r012804n875702
10708A89031969m176014l732035m380796o137858q638109j0994009j2480098j2708084
10700A25784966j1670056r719947p117082m421084k832188k573727k029982p71918
10692H4648982N99700K382310N187138R387366J5402637K3779736L3790756M0769947
$$ plain form
10745 143103628 141164585 144187106 151458944 161886076 174062986 185993366 195603129
10738 195603129 201757256 204221329 203389041 200048659 194996185 189259661 183962231 178943129
10730 178943129 173294684 166886078 159855727 152324328 144960477 138611027 134325600 133623262
10722 133623262 138295975 150524359 172629346 204447946 237894941 258680358 262024236
10715 262024236 255803474 245490654 231720621 216717142 203920475 194907671 189031969
10708 189031969 184855955 181123920 176743124 170605266 161967157 150973148 138493050 125784966
10700 125784966 114114910 104394963 97277881 92856797 90024609 87450882 85420900 84648982
10692 84648982 85248682 87630992 92818130 102205496 117608133 141387869 175178625 215948572
10684B15948572M1378803M1130584L7592871K0369575n301190k4071897l2540264
10677B94507054l7448529m0067662l8020260l2059455k4841063j8091567j2418216
10670I1560302q252976o363838o155822n748741n019812m563424m121446l389098
10662D7945145k472054j594641q62921k71259L24390J019920J863928K956196
10654D8908704M404827O402122R299350J3600373J9800657K7474289L2420016
10647A62310338K6707048J0139152m789747j2419446j7901728k2563869k3843786
10640A17637962k1539189j7596896j3640074j0344361p805281n940008m630080
10633C6142073l731087l112445k610633k180979j816265j518720j259860j039812
$$ plain form
10684 215948572 257327375 298457959 336050830 356420405 351119215 327047318 294507054
10677 294507054 257058525 216990863 178970603 146911148 122070085 103978518 91560302
10670 91560302 83307326 76943488 70787666 65038925 60019113 55455689 51334243 47945145
10662 47945145 45473091 43878450 43015529 42744270 43068660 44088580 45952508 48908704
10654 48908704 53313531 59715653 69015003 82615376 102416033 129890322 162310338
10647 162310338 189017386 199156538 194366791 181947345 164045617 141481748 117637962
10640 117637962 96098773 78501877 64861803 54517442 46712161 40772153 36142073
10633 36142073 32410986 29298541 26687908 24506929 22690664 21171944 19912084 18872272
10625A8872272q62395p10810n87572m99392m43439l92106l71652l67304l47179
10616A4290423l23206k94563k56663k00016j32688r6199q2220q5930p8150n5710
10606A2685078p1145j06784j55091k12033k61814k72158k63428k46100k62876
10597A0833649k57306k36533k26784k18461k12701k07824j76266j63774j53438
10588H980562j32085j12351r4080j03418r6763p9370p4924o6873m5076m0950l6765
10577H097907m6981n1914p5420q2983q4308q4676p6772o1945l3124m5757o7303
10566G386724p3098p1106p7803q6821j05790j08229q8507q1499o7762o4138o0345
10555F501626n9973o6915o5703p4792p2293p0408o4279n3469m5454m0404m4973
$$ plain form
10625 18872272 18009877 17299067 16711495 16212103 15768664 15376558 15004906 14637602 14290423
10616 14290423 13967217 13672654 13415991 13215975 13083287 12987088 12904868 12818938 12740788 12685078
10606 12685078 12613933 12507149 12352058 12140025 11878211 11606053 11342625 11096525 10833649
10597 10833649 10576343 10339810 10113026 9894565 9681864 9474040 9297774 9134000 8980562
10588 8980562 8848477 8736126 8642046 8538628 8441865 8362495 8287571 8220698 8175622 8134672 8097907
10577 8097907 8050926 7999012 7923592 7840609 7756301 7671625 7594853 7532908 7499784 7454027 7386724
10566 7386724 7313626 7242520 7164717 7077896 6972106 6863877 6775370 6693871 6626109 6561971 6501626
10555 6501626 6441653 6374738 6309035 6234243 6161950 6091542 6027263 5973794 5928340 5887936 5842963
10544E842963n9457m5808m2161m5786l9239k5398k5119k1566k7341j8040r570
10533E483478j5079r561n695l5808m3065k8472l7869m2763n1277m8695l9473m5752
10521E079969l9414m5701o0301m4167l3937l3725m7000l7686k7007k5551j9031
10510D666449k9084k9279j6395j0289j0742k3304k7876j8449j5224k8253m5332
10499D412222l8255l0639l1638k4907j6166j9422k4174j1430o777j5972k9396
10488D163446k5266k3450j5360l0956l1598k4183k5191j8676k1985j3494j5498
10477C917789k8106m1453j3792j5021j7106k963n299k364j3750j1368J90l576
10465C763181K888j7396k4175k3137k3668k9388j9544l5260l9580k0396j5690
$$ plain form
10544 5842963 5783506 5737698 5695537 5649751 5610512 5585114 5559995 5538429 5511088 5493048 5483478
10533 5483478 5468399 5458838 5453143 5417335 5374270 5345798 5307929 5265166 5213889 5165194 5125721 5079969
10521 5079969 5040555 4994854 4934553 4890386 4856449 4822724 4775724 4738038 4711031 4685480 4666449
10510 4666449 4637365 4608086 4591691 4581402 4570660 4547356 4519480 4501031 4485807 4457554 4412222
10499 4412222 4373967 4343328 4311690 4286783 4270617 4251195 4227021 4215591 4208814 4192842 4163446
10488 4163446 4138180 4114730 4099370 4068414 4036816 4012633 3987442 3968766 3946781 3933287 3917789
10477 3917789 3889683 3848230 3834438 3819417 3802311 3799348 3794049 3791685 3777935 3766567 3766757 3763181
10465 3763181 3766069 3748673 3724498 3701361 3677693 3648305 3628761 3593501 3553921 3533525 3517835
10454C517835j6726j6442m302j396J4997J2330K0986J60j3640j8873j9986k4289
10442C450654j1719k4554k9101k0331k7291k4949k3845j8133p624j2053K917J945
10430C255916j718M013j5694k7337j8881k3369k1889j5462j467m591J3890M6005
10418C189416L2897N9001Q4867J15406J19785J17094J05367O1139Q693n3436r5530
10407C744699j23749j36729j26913j16360q7112q3764p4935m6326k1393j8362
10397B909056m550K995M291J2520J0171M127m140R234J4511K9851L3658K5753
10385C047477L1145L2209L6398M2243M3923N0174P2754R6117R4910Q4900M5138
10374C677388K6902J694k9006m4107o0537q5401q2356p3016n3226n0491m1267
$$ plain form
10454 3517835 3501109 3484667 3480365 3478969 3493966 3506296 3527282 3527442 3513802 3494929 3474943 3450654
10442 3450654 3438935 3414381 3385280 3364949 3337658 3312709 3288864 3270731 3263107 3251054 3253971 3255916
10430 3255916 3254198 3258211 3242517 3215180 3196299 3172930 3151041 3135579 3134112 3129521 3143411 3189416
10418 3189416 3222313 3281314 3366181 3481587 3601372 3718466 3823833 3884972 3893665 3840229 3744699
10407 3744699 3620950 3484221 3357308 3240948 3153836 3070072 2995137 2948811 2927418 2909056
10397 2909056 2904506 2907501 2911792 2924312 2934483 2938610 2934470 2943704 2958215 2988066 3021724 3047477
10385 3047477 3078622 3110831 3147229 3189472 3233395 3283569 3356323 3452440 3547350 3632250 3677388
10374 3677388 3704290 3705984 3676978 3632871 3572334 3486933 3404577 3331561 3278335 3227844 3186577
10363C186577n0362k9978J0937M5402O5118R7669Q1290O3649N7976K8757k4641
10352C532394o2079q5099r6893r3416q7236q8259o5889l7276j6747J4120M3256
10341B956876R8231J35696J48413J51334J31557Q2913K5908l2264n9152r4214
10331C545298j26869j22372j20720j12372p6397m6628k0129J511L3374L8996M7534
10320C041226R590j6568k7670m2132o0508o2834m2471l3370j5126k0276l3705
10309B696156m7709m2706m5082m3237l3766m1753k5932J292J4202N6848R0492
10298B578805J20410J70049K00516J53268O8219K7053J1009k9952o4902q3719
10288C150756p8016p6589j14530j22365j26256j21468j17610j10371q4347p7380
$$ plain form
10363 3186577 3136215 3106237 3117174 3162576 3227694 3325363 3406653 3470302 3528278 3557035 3532394
10352 3532394 3470315 3385216 3288323 3194907 3107671 3019412 2953523 2916247 2899500 2913620 2956876
10341 2956876 3055107 3190803 3339216 3490550 3622107 3705020 3730928 3698664 3639512 3545298
10331 3545298 3418429 3296057 3175337 3062965 2986568 2939940 2919811 2921322 2954696 2993692 3041226
10320 3041226 3050816 3034248 3006578 2964446 2903938 2841104 2798633 2765263 2750137 2729861 2696156
10309 2696156 2648447 2605741 2560659 2517422 2483656 2441903 2415971 2417263 2431465 2488313 2578805
10298 2578805 2699215 2869264 3069780 3223048 3291267 3318320 3329329 3299377 3234475 3150756
10288 3150756 3072740 2996151 2881621 2759256 2633000 2511532 2393922 2283551 2199204 2121824
10278B121824o3489l6091k0512q983o469M853o427j0919j752J5740K1941N6284
10266B066000P7075J17157J77262K12914K12752K04437J51875P0811n6477j15351
10256C118455j74317k03559k00264j85144j57981j14586r0171o4888m4627j0518
10246A872400k1811m0010k4261l6543k6102j8153j7344j9728j1615p053n372q058
10234A636350J1485R487J3918K4561M8019N9748R3888J20670J20040J08724N3237
10223B300127k8030p8658r8140j08062j14952j12565r9335q1736o7004m7171l1236
10212A433238l1845j9523k953r699L155k339k2149j4350k0214j1643m113q310
10200A289255l79m482j3866m638J236k837k989J1247Q665L102J0791k000q468
$$ plain form
10278 2121824 2058335 2022244 2001732 1992749 1986280 1991133 1984706 1973787 1972035 1987775 2009716 2066000
10266 2066000 2143075 2260232 2437494 2650408 2863160 3067597 3219472 3290283 3233806 3118455
10256 3118455 2944138 2740579 2540315 2355171 2197190 2082604 1992433 1927545 1882918 1872400
10246 1872400 1850589 1810579 1786318 1749775 1723673 1705520 1688176 1668448 1656833 1649780 1644408 1636350
10234 1636350 1647835 1657322 1671240 1695801 1743820 1803568 1897456 2018126 2138166 2246890 2300127
10223 2300127 2272097 2193439 2095299 1987237 1872285 1759720 1660385 1578649 1511645 1464474 1433238
10212 1433238 1401393 1381870 1378917 1369218 1372373 1370034 1347885 1333535 1313321 1301678 1297565 1289255
10200 1289255 1288876 1284394 1270528 1265890 1267126 1264289 1261300 1272547 1281212 1284314 1295105 1293105 1284637
10187A284637q021q541q854j0052k5907j8869P978j1905j3517k06l530p996j948
10174A173269p512j0106l602n336k097L514J879K7j569l117J4194J6972K1823
10161A198339L3194L9455K2859L111n193r892k4556k3235l0792k6717k3138j8311
10149A135124o571q347r541k2373j6998N346j193j5806j1874p445m809K047K866
10136A040426j040q011j799j4404q000J930o135j1812o45r313n188K269J5101
10123I93379n051n450O514L105k954m092m143J8916J7531J1924q640l163L304
10110A021180p199j710k1463k067l753j6190j1279Q08N143n614q351j558j1189
10097I36758N388j055L231J512p074J2100J1921j0077j6240q094j1828O16m010
$$ plain form
10187 1284637 1276616 1268075 1259221 1249169 1223262 1204393 1212371 1200466 1186949 1186743 1183213 1175217 1173269
10174 1173269 1165757 1155651 1152049 1146713 1144616 1148130 1150009 1150036 1148467 1145350 1159544 1176516 1198339
10161 1198339 1231533 1270988 1293847 1296958 1291765 1281873 1257317 1234082 1203290 1176573 1153435 1135124
10149 1135124 1128553 1120206 1110665 1088292 1071294 1076640 1075447 1059641 1047767 1040322 1035513 1037560 1040426
10136 1040426 1039386 1031375 1029576 1015172 1007172 1009102 1002967 991155 990510 981197 976009 978278 993379
10123 993379 988328 982878 989392 992497 989543 985451 981308 1000224 1017755 1029679 1021039 1017876 1021180
10110 1021180 1013981 1012271 990808 988741 984988 968798 957519 958327 963470 957856 949505 947947 936758
10097 936758 942146 941091 944322 945834 938760 950860 962781 952704 936464 928370 916542 917158 913148
10084I13148j0370r730J903K560J1233R634o390j1394j160J4486J2125N928j0956
10071I21017k4568q369N678j52K881Q39j5138j3877k137q416k488L857n611n21
10057H52995O657J8984K0163J0179q397q008L448k65j6144m598J0835j575j7152
10044H67122M968J998j7496n643K40n775n587K942K937N342J932r561j4673l188
10030H25558K234n573R74M809J556R744J986J1946K26p114p157j9866j4737L077
10016H07663J3004L836r947j483k781q613j2246o401n337n558j200M795J7459
10003G93191l877j2812K649m070j0510j416n141j560J3385M084o031j6722R636
9990G60806O471m248N783J5359J7866Q916l263j5502k1973L577j1582j4168l024
$$ plain form
10084 913148 902778 893048 894951 897511 908744 918378 911988 900594 899434 913920 926045 931973 921017
10071 921017 896449 888080 893758 893606 896487 897326 882188 868311 866174 857758 855270 859127 853516 852995
10057 852995 859652 878636 898799 908978 900581 892573 896021 895756 879612 875014 885849 884274 867122
10044 867122 872090 874088 856592 850949 851189 845414 839827 842769 845706 851048 852980 843419 828746 825558
10030 825558 827792 822219 823193 828002 829558 839302 841288 853234 853460 846346 839189 819323 804586 807663
10016 807663 820667 824503 814556 813073 810292 801679 789433 783032 777695 772137 770937 775732 793191
10003 793191 789314 776502 779151 775081 764571 763155 758014 756454 769839 773923 767892 751170 760806
9990 760806 767277 763029 768812 784171 802037 810953 807690 792188 770215 773792 762210 748042 745018
9977G45018j272Q595r23L546P115o940j4607o46n335O735J3054j1712k3299o198
9963G13131m355m074p764M839r365J183J771P139o271j0103M434r73p858j264
9949F80470P099K569R279j7353j1338j789m043O906n330q86n601j9388p600m05
9935F32590r291o32K1361j624r330j908k945j386L361j420K655j289P549K5271
9921F62962J3634O793K448j3890J041J5260J572n752j2422j7555K50L276K061
9908F59678O14p547o057k0534J1470J5337j3394m399K711O233r94m042n102p842
9894F26132M318k779j2327P328J4554k990n723p267N400J6664N362j4023J501
9881F36150M514m765j0672k503R221j1035L662p807n625l045r166K664Q844J025
$$ plain form
9977 745018 743746 752341 751418 754964 762079 755139 740532 739886 734551 741286 754340 742628 719329 713131
9963 713131 708776 704702 696938 701777 692412 693595 695366 702505 696234 686131 690565 689592 681734 680470
9949 680470 687569 690138 699417 682064 670726 668937 664894 671800 666470 665584 659983 640595 632995 632590
9935 632590 623299 622667 644028 642404 633074 631166 628221 626835 630196 628776 631431 630142 637691 662962
9921 662962 676596 683389 685837 671947 672988 688248 689820 684068 671646 654091 654341 657617 659678
9908 659678 660292 652745 646688 626154 637624 652961 639567 635168 637879 644112 643118 639076 633974 626132
9894 626132 630450 627671 615344 622672 637226 634236 628513 621246 626646 643310 648672 634649 636150
9881 636150 640664 635899 625227 622724 631945 620910 624572 616765 611140 608095 598929 601593 610437 611462
9867F11462J1643J7579J2546R90n807j2052J2027j593P41l833r228J220j1522
9854F24173j6383j4666l272j351L020O374N094l395M629k653q85k14R779N411
9840F15661Q87m796k341q106j1420J88j0291J709n364R28R760L324l94p127q249
9825E74369j386R34n591J941R787J3492J0012j5239k466J3998K437j1389o347
9812E84552l859q930K725O410k828j5131j2407j0277o843O310Q778k711o734R759
9798E48814k06j0617J641K367j3607j501J2607J0055j274k891J1435M239R223
9785E70285J2786N4j7751r61K5052J2511o14o635k71K633l509Q569L571j3367
9771E92353j8733o508q824k3765p579m831m901J1163J7147r76K354J3249L194
$$ plain form
9867 611462 623105 640684 653230 654220 648413 636361 648388 646795 647536 643703 634475 635695 624173
9854 624173 607790 593124 589852 588501 591521 597895 602989 599594 604223 601570 600685 600471 610250 615661
9840 615661 616548 611752 609411 601305 589885 590073 579782 581491 576127 577055 586815 590139 589745 582618 574369
9825 574369 572983 573917 568326 570267 580054 593546 603558 588319 585853 599851 602288 590899 584552
9812 584552 580693 571763 574488 580898 578070 562939 550532 540255 533412 539722 548500 545789 539055 548814
9798 548814 548608 537991 539632 541999 528392 526891 539498 549553 548279 545388 556823 561062 570285
9785 570285 583071 583125 565374 564413 589465 601976 601362 594727 594456 597089 593580 602149 605720 592353
9771 592353 573620 567112 558288 534523 526944 522113 517212 528375 545522 544546 546900 560149 563343
9758E63343J420M122J0329K464P175q33J926K809q776j4044j8420k0133k399J297
9744E30280J4799J2578M454J292l872j4924L288N040j530o799l719N078j2983
9731E32982j9450o029P881K048O774J1190m495j2998r496M167J648P627J7557
9718E39406J8725P831P481P960m336l378K472j3948k599K1139K1257J8982J3562
9705F34554K0718L0232L9465L8415M2415K0317J416j8640l0838l3028m4009l8440
9693F62577j8043j7202j2439j4870p808n659k2887j7879L890K48J916J3997J7304
9680E83145J0526K134J8878K2026P506K1453K6952K7584J9487K8275L4708L0523
9668H33197K7351K2868L8189N1848O9939O3274N5686M3531J7188j5511l2867l8745
$$ plain form
9758 563343 564763 568885 579214 581678 588853 588020 589946 592755 583979 569935 551515 531382 528983 530280
9744 530280 545079 557657 562111 563403 559531 544607 547895 552935 551405 544606 540887 545965 532982
9731 532982 513532 507503 515384 517432 524206 535396 530901 517903 508407 512574 514222 521849 539406
9718 539406 558131 565962 573443 581403 577067 573689 576161 562213 559614 580753 602010 620992 634554
9705 634554 655272 685504 724969 763384 805799 826116 827532 808892 778054 745026 701017 662577
9693 662577 644534 627332 614893 600023 592215 586556 563669 545790 549680 549928 551844 565841 583145
9680 583145 593671 595805 614683 636709 644215 665668 692620 720204 739691 767966 802674 833197
9668 833197 860548 883416 921605 973453 1043392 1106666 1162352 1205883 1223071 1207560 1174693 1135948
9656A135948n1873n5608o2260m5042l9680l0339k0197p855j3892n821r785j1387
9644G82209j2962j5362k1361K771O209Q315K3438J7080J7118L3996L6862M5000
9632I23313L4219K7271K3620L6349N0564O9140P3749P2273P1349N0317Q623k2327
9620A418460o0699n7731o4156o3975p3500n8000m2498m6833m6982m3752m8849
9609H11485k4908j4380j60J3673R377N261J5513L409J854j4492m967O391J2945
9596H21001J4067J1940R251P598R841O669K0442K8857N3672M4458K6832J5554
9584A070182M746l1134l7969l1492l0468l6956k2019l1138m7617m8518l3150k6193
9572F98274r175p759j5444M903R193J4468N438k0226k426m665k4682l0629j852
$$ plain form
9656 1135948 1084075 1028467 966207 921165 881485 851146 830949 823094 809202 803381 793596 782209
9644 782209 769247 753885 732524 735295 741504 749819 773257 790337 807455 841451 878313 923313
9632 923313 957532 984803 1008423 1044772 1095336 1164476 1238225 1310498 1381847 1432164 1440787 1418460
9620 1418460 1357761 1300030 1235874 1171899 1098399 1040399 997901 951068 904086 860334 811485
9609 811485 786577 772197 772037 785710 795087 800348 815861 819270 821124 806632 801665 808056 821001
9596 821001 835068 847008 856259 863857 873698 880367 900809 929666 983338 1027796 1054628 1070182
9584 1070182 1074928 1043794 1005825 974333 943865 906909 884890 853752 806135 757617 724467 698274
9572 698274 689099 681340 665896 670799 679992 694460 699898 679672 677246 672581 647899 617270 615418
9559F15418Nn975p061j4564n674J7299J9646K7234L7981M5828K9593q543j4149
9546G37038j2549j830N85j0641k2792j9818r701m797n61j0856j9736j6198l013
9533F05131J7835J2561K9831M1559R295o265o162o189q291j3211K069J7843J4276
9520G10282j6605n861L110j2412k0868r084n938o485J0070N011J541r264P874
9507F51371N416N068k151R062r232m622o3Q964P856n79p475k292J9468K2039J8533
9492G21363R460P912J7335M357J850j4513k0029j6981m548J715P953K111O969
9479G24954J974L014M008j2710j1845K431m79m825o04j044O899R766J6285J7386
9465G55210J1015K0310J7457J1113l084j351q72k655o796l385J257N20J4874K0645
$$ plain form
9559 615418 615423 609448 602387 587823 582149 599448 619094 646328 684309 730137 759730 751187 737038
9546 737038 724489 722659 723244 712603 689811 669993 660292 655495 654934 644078 624342 608144 605131
9533 605131 622966 635527 665358 706917 716212 709947 703785 697596 689305 676094 678163 696006 710282
9520 710282 693677 687816 690926 678514 657646 648562 642624 636139 646209 651220 652761 643497 651371
9507 651371 656787 661855 659704 668766 659534 654912 654849 663813 671669 671090 663615 661323 680791 702830 721363
9492 721363 730823 738735 756070 760427 762277 747764 727735 710754 706206 707921 715874 717985 724954
9479 724954 726928 729942 733950 721240 709395 711826 711347 706522 705918 704874 711773 721539 737824 755210
9465 755210 766225 786535 803992 815105 812021 810670 809798 807143 800347 796962 798219 798739 813613 834258
9451H34258K8639K1411J8672L1935J6150J9084K6642J714j3848k4846k0355j0162
9439I29294j291R088J1940j087K923J6965j723q479L513Q183N919K340R447J0685
9425I97717o84j1324Q001J5011J7521J6973J2626J5127L1690J8906M191K1172
9413A146927L5967L5090M8130M7212M2280L3270J0043M771J461j6199k6053j5987
9401A346912o641N925J2954R771K2879L0479J0752O314J2179K8891N0885L8943
9389A570243K7724K1269K8250J1920Q570l016n022j85J1613l424J296J3049L2894
9376A715181L3962O4070P8975R3695R4834P3115M6636J2149j9578j8722m486k0985
9364B148846r681J3059N1098O8992O8524O0526M4732J2491n955O46J0909K3147
$$ plain form
9451 834258 862897 884308 902980 934915 951065 970149 996791 998505 984657 959811 939456 929294
9439 929294 928003 937091 949031 947944 950867 967832 966109 957630 961143 969326 975245 977585 987032 997717
9425 997717 997033 985709 993710 1008721 1026242 1043215 1055841 1070968 1102658 1121564 1125755 1146927
9413 1146927 1182894 1217984 1266114 1313326 1355606 1388876 1398919 1403690 1405151 1388952 1362899 1346912
9401 1346912 1340271 1346196 1359150 1368921 1391800 1422279 1433031 1439345 1451524 1480415 1531300 1570243
9389 1570243 1597967 1619236 1647486 1659406 1667976 1664960 1659938 1659753 1671366 1667942 1669238 1682287 1715181
9376 1715181 1749143 1813213 1892188 1985883 2080717 2153832 2200468 2212617 2193039 2174317 2169831 2148846
9364 2148846 2139165 2152224 2203322 2272314 2340838 2401364 2446096 2458587 2452632 2453278 2464187 2487334
9352B487334L4716M4663K2206J7954K6216K5848J8727J3702L8279P2937Q5116
9341B887698J04901J04382J21166J37924J33066J29167J35528J21997J00313J00358
9331D076500J06378J20142J39096J65240J97427K34653K71062L35984L98639M72231
9321F517352N61037O81745Q19745R47958J129416J361313J702125K262524L050956
9312A9034171M125796N419270O626513P095578O071899L349458j6190k526667
9304D9179828m061069n052494n426973n074695m240762l260149k362880j617201
9296A8083605j023248n51938j73835K14225O23440J052913J513997J897190K053059
9287B3689408J980566J937990K140811K500738K845472L163438L640563M307467
$$ plain form
9352 2487334 2522050 2566713 2588919 2606873 2633089 2658937 2677664 2691366 2729645 2802582 2887698
9341 2887698 2992599 3096981 3218147 3356071 3489137 3618304 3753832 3875829 3976142 4076500
9331 4076500 4182878 4303020 4442116 4607356 4804783 5039436 5310498 5646482 6045121 6517352
9321 6517352 7078389 7760134 8579879 9527837 10657253 12018566 13720691 15983215 19034171
9312 19034171 23159967 28579237 35205750 42301328 48373227 51722685 51706495 49179828
9304 49179828 45118759 40066265 34639292 29564597 25323835 22063686 19700806 18083605
9296 18083605 17060357 16508419 16334584 16548809 17172249 18225162 19739159 21636349 23689408
9287 23689408 25669974 27607964 29748775 32249513 35094985 38258423 41898986 46206453
9279D6206453M702771M612100M860290N737821O363491O431195P089536Q630817
9271I4634474R490387Q304535N147273J373144j506904l419977n185235p124654
9263A01713043q587850q936162q300698p146698n693832m064878k626318j491244
9255E4865363n50919j58940m71930q68825r39207q85190p34948j98005Q52970
9246E0910369K327231L872431M881589M614161L260949K231718K249989L015640
9238G7364077M631269P556833J1769619J6451631J9600010J8997372J4301527
9231A70672338O810357j592676q641187j3191713j5432547j5509427j3652867
9224A09462278j0929806q745416p471788o505957n802612n390737m837356l924524
$$ plain form
9279 46206453 50909224 55521324 60381614 66119435 72482926 78914121 86003657 94634474
9271 94634474 104124861 112429396 117576669 118949813 117442909 114022932 108837697 101713043
9263 101713043 93125193 84189031 75888333 68741635 63047803 58982925 56356607 54865363
9255 54865363 54314444 54155504 53683574 52814749 51875542 50990352 50255404 50057399 50910369
9246 50910369 53237600 57110031 61991620 66605781 69866730 72098448 74348437 77364077
9238 77364077 81995346 89552179 101321798 117773429 137373439 156370811 170672338
9231 170672338 177482695 175890019 167248832 154057119 138624572 123115145 109462278
9224 109462278 98532472 89787056 82315268 75809311 70006699 64615962 59778606 55854082
9216E5854082k780078j591984o11828o4775q8877m06570o02244p24587q39419
9207D8143720o82532j8751J164623K742480M326952N218187M983967M157184L831429
9198G3867259M466957N559544O372537O157128M632447K393882R2524k143915
9190A01398363m427136o323532p152600p156688p140383p133941o597755n751559
9182D9714769n154585m688351l982452l223577k725195k555717k525182k419695
9174B2440015k221097j994860j768735j465255j121906p72572m78604j80726R3352
9165A2529612L87362P18253J150632J756295K582045L670130M873184N621198
9157C3288711N104140L078921L95064j907353l466813m464923m922101m786012
$$ plain form
9216 55854082 53074004 51482020 50870192 50805417 50716540 50309970 49707726 48983139 48143720
9207 48143720 47461188 47442437 48607060 51349540 55676492 60894679 65878646 70035830 73867259
9198 73867259 78334216 83893760 90266297 96423425 101055872 103449754 103542278 101398363
9190 101398363 96971227 90647695 83495095 76338407 69198024 62064083 55466328 49714769
9182 49714769 44560184 39871833 35889381 32665804 29940609 27384892 24859710 22440015
9174 22440015 20218918 18224058 16455323 14990068 13868162 13095590 12616986 12436260 12529612
9165 12529612 12916974 13635227 14785859 16542154 19124199 22794329 27667513 33288711
9157 33288711 38392851 41471772 41866836 39959483 36492670 32027747 27105646 22319634
9149B2319634m181670l392119k657642k035072j529485j148387q80841p03640
9141E790778n85640m98967m41176m01973l54470l07121k83078k68163k41229k04400
9131B204561j73609j58231j55832j40709j17563j03130j10438q7453o5354o2272
9121A029970o2670n1469l9639m3797k4584k2786k7452k4699k1802o098n67j1841
9109F92566l800O212K3666M4668N0946M8457J9764j1125l6333n6124n8722n5491
9097F64684l8873l5385l5595k1840n950k3729k8057j6192k9472k9742j2012m345
9085C83492j0918j4819k0150m690n183j4561j4748m627j649j9607j3552j937k5959
9072B31092j8903q591o596R51J5006Q548J5386J6364R435j1199j789R340O790
$$ plain form
9149 22319634 18137964 14745845 12088203 10053131 8523646 7375259 6494418 5790778
9141 5790778 5205138 4706171 4264995 3863022 3508552 3201431 2918353 2650190 2408961 2204561
9131 2204561 2030952 1872721 1716889 1576180 1458617 1355487 1245049 1157596 1092242 1029970
9121 1029970 967300 915831 876192 832395 807811 785025 757573 732874 711072 704974 704407 692566
9109 692566 688766 694978 718644 763312 814258 862715 882479 871354 835021 778897 720175 664684
9097 664684 625811 590426 554831 532991 527041 503312 475255 459063 429591 399849 387837 383492
9085 383492 372574 357755 337605 332915 327732 313171 298423 293796 292147 272540 258988 257051 231092
9072 231092 212189 203598 197002 197953 212959 221507 236893 253257 262692 251493 249704 259044 265834
9059B65834q07J6914J5606N204M320P90j3172r494j3356j1412j5370j8131j4921
9046B12005q234j5202q311m329O070J2185l407j1980j4565m786r227o012j582
9033A42625P632K720j3628j8721p111O426j939n257j1521k059R027J2922J1461
9020A32577J3747J0721L5052J6700n286n769p974q531O72q76j3435k6069k3934
9007A17595j5229j1497n910P923J901Q828R824j226n298j2802q607m547J096J723
8993H3774K8302Q433j5146p847j9766O62J0716k644N119J982M506M379q389j4865
8979G9216r495J688J0790p41L836k108k0122m934m457Q325r057n893J200Q806
8965E7054R715J5291J4351K1199J1050M263Q67k52R074k267j2848j4910q084J15
$$ plain form
9059 265834 265027 281941 297547 302751 307071 307861 294689 285195 271839 260427 245057 226926 212005
9046 212005 203771 188569 180258 175929 181999 194184 190777 178797 164232 159446 150219 144207 142625
9033 142625 150257 152977 139349 120628 113517 119943 118004 112747 101226 99167 108194 121116 132577
9020 132577 146324 157045 192097 208797 203511 197742 189768 181237 181909 181033 167598 141529 117595
9007 117595 102366 90869 84959 92882 94783 103611 113435 112209 106911 94109 85502 80955 82051 83774
8993 83774 112076 120509 105363 97516 77750 78412 89128 86484 91603 93585 98091 102470 94081 79216
8979 79216 69721 71409 82199 81458 85294 83186 63064 58130 53673 61998 52941 47048 48248 57054
8965 57054 66769 82060 96411 117610 128660 132923 133790 133538 142612 140345 127497 112587 104503 104618
8951A04618j1285k3250M80P824O543M840O573L258R234J1625M209J70l852M26
8937A21413K0506P737r065j1288m895l99j571j1152j3513r148M003M552J0743
8924A07923R470o417l60P236J1271K2034J4207j247J0187J3031J2945J6762K8122
8911B45164M1059L4416K801k1423n991p732k0252m4005m1437l0123j3461j0545
8899A28471o472P93J1065J3085l870l695N261J6448K3078J9932J1169Q982K0599
8886B44846J1452Q458l18K5691L2778L2890K0017K6054K5459J9422J7705K9692
8874D94146M5716M6812N3623M1567K649l819k7158l6766l4186l9914n7396m7823
8862D37451m5170k9435k3381j6828j395Q383K480j0587M772J2163o379M165O793
$$ plain form
8951 104618 93333 70083 70563 78387 84930 89770 96343 99601 108835 120460 124669 124839 120987 121413
8937 121413 141919 149656 140591 129303 124408 124009 122438 111286 97773 88625 92628 97180 107923
8924 107923 117393 110976 110616 117852 129123 151157 165364 164117 174304 187335 200280 217042 245164
8911 245164 286223 320639 323440 302017 296026 288294 268042 224037 182600 152477 139016 128471
8899 128471 121999 122792 133857 146942 143072 139377 144638 161086 184164 204096 215265 224247 244846
8886 244846 256298 264756 264438 290129 322907 355797 375814 401868 427327 446749 464454 494146
8874 494146 539862 586674 640297 681864 684513 680694 653536 616770 582584 542670 485274 437451
8862 437451 392281 362846 339465 322637 321242 329625 332105 321518 326290 338453 332074 336239 343032
8849C43032l17J9679M3584M0006J5453P456J5847J9234J2458O993K6838N6546
8837F06809Q2303R1412Q8814O5182L4808jk8030o0785p7878p5194p6145n9221
8825E92074n4320l5902l8715l7420l6837k5406j4984k0261j6045j2971L549J448
8813C04210R276l183k426l580l231L054R389J6320K4745K8493M0263K6914J7761
8800D68005L4744K8685L7173L1307J4404O923q891j2449j9009m3417n7439k7238
8788D52798l4434k8169j5616l5390k4031j5718k1241j1690l203j8224k5775k1297
8776A98010j6306j4332n503p956j6068q010q8j009L603L491J5181Q609M900J7973
8762A82495K0572K6883K3877K3668O536L72k137j2063k2819k0698k1796k9388
$$ plain form
8849 343032 342715 362394 405978 445984 461437 468893 484740 503974 516432 523425 550263 606809
8837 606809 689112 780524 869338 934520 969328 969327 941297 880512 802634 727440 651295 592074
8825 592074 537754 501852 463137 425717 388880 363474 348490 328229 312184 299213 302762 304210
8813 304210 313486 310303 307877 304297 301066 304120 313509 329829 354574 383067 423330 450244 468005
8800 468005 502749 531434 568607 599914 614318 621241 612350 599901 580892 537475 480036 452798
8788 452798 418364 390195 374579 339189 315158 299440 278199 266509 263306 245082 219307 198010
8776 198010 181704 167372 161869 153913 137845 129835 129747 128738 132341 135832 151013 159622 164522 182495
8762 182495 203067 229950 253827 277495 284031 284403 282266 270203 247384 226686 204890 175502
8750A75502k4327k3092j1775j7481k3512j2105j8308j4430L083J4012M961p76
8738E1752M94m602O511J0287l179J0764R819K225k806o853O00q81j6004j4439
8724D3688n235k141j70N165K2953J9763K175J3591L887j7963r883k392M012N449
8710H2899r168k363q264o884j0006j4631k1745r330K682p251k3579M447J3574
8697i619o065M856N290k150m08J5400J767j551p073J41l164J72j829j9686J609
8682b2310O610R125K7261J3469K2175L2901J5886J1230J0306O539J141j2823j5008
8669A06502k3453j9045o598j6392l072l726j4646j3830j587J444q426L291J3845
8656A4307P391O048q402j8171j3429n638m922o991j2482N810L1J1274J3013k215
$$ plain form
8750 175502 151175 128083 116308 98827 75315 63210 44902 30472 33555 47567 52528 51752
8738 51752 52246 47644 54155 64442 61263 72027 81846 84071 81265 74412 75012 74131 58127 43688
8724 43688 38453 36312 36142 41307 64260 84023 86198 99789 103676 85713 75830 73438 77450 82899
8710 82899 73731 71368 63104 56220 46214 31583 9838 508 3190 -4061 -27640 -23193 -9619
8697 -9619 -15684 -10828 -5538 -7688 -8096 7304 9071 7520 447 588 -2576 -2404 -4233 -23919 -22310
8682 -22310 -15700 -6575 20686 34155 56330 89231 105117 116347 126653 133192 134333 121510 106502
8669 106502 83049 64004 57406 41014 37942 34216 19570 5740 4153 5597 -2829 462 14307
8656 14307 21698 27746 19344 1173 -12256 -17894 -22816 -29807 -42289 -36479 -36448 -25174 -12161 -14376
8642a4376N319P923J2977o811j0369j815K1093J8950J4055J6432J6775K775Q791
8629I1719Q11n431j5190j4596m03j1802q928j4069j2307p855o254j4346l918n36
8615b3105k65J762r2r86L902k692n062M756L57j0808l900Q810P982l763J0810
8600a2294J2987R58J654M365j55m839m569J171J7547K0180p74j942j7697j6961
8586c69j183O069k792j2759K083l79j5694M839R715P608l121q978L069n875m31
8571a8198l634j121k891j0554N279R191m861o036L011n234n459N554j503R413
8557b7043N948J747M955R632Q924j0789j6584m829L12j743l898J1414J364m185
8543b4775M581J2367J6789P070N51J6137p989j1804m075q463j1128K513K662O640
$$ plain form
8642 -14376 -9057 -1134 11843 5032 -5337 -7152 13941 32891 46946 63378 80153 82928 91719
8629 91719 92530 87099 71909 57313 56910 45108 36180 22111 9804 1949 -4305 -18651 -22569 -23105
8615 -23105 -23370 -21608 -21700 -22686 -18784 -21476 -26538 -21782 -21425 -32233 -36133 -27323 -19341 -23104 -12294
8600 -12294 693 1651 3305 7670 7515 2676 -1893 -722 16825 37005 36231 34289 16592 -369
8586 -369 -1552 4517 1725 -11034 -8951 -9330 -25024 -20185 -10470 -2862 -5983 -14961 -11892 -17767 -18198
8571 -18198 -21832 -22953 -25844 -36398 -31119 -21928 -26789 -32825 -29814 -35048 -40507 -34953 -36456 -27043
8557 -27043 -21095 -19348 -14393 -4761 4163 -6626 -23210 -28039 -27727 -29470 -33368 -21954 -20590 -24775
8543 -24775 -20194 -7827 8962 16032 16583 32720 24731 12927 8852 389 -10739 -8226 -5564 1076
8529A076R27N487k284l524M437J35j4157j1707J214k811K683m549N574p66P045
8514a1220L219j6031l569j981J0231J1832j514K298P119Q043k340j4297n862O776
8500g296n543L508J2878m514J694Q576L391m94o345L18L329m936j9193m655m079
8485b3361r016m697p875M203K0010R271K73R194l196l186j0327j0459J0872j130
8471a9424P468j849m795n346J0414N163p923o492O29J403l709O78p305N940M100
8456b1048P442R514q974J598K217q138M232M432r014l317R421M790M069O416j6250
8441a2610n46j313J574O235M688j350L264R898q732P316J1625k724k87j4230j7021
8426a4213o323L46K964J5011M484l355k570L076J1314K917j279K89k977k44k900
$$ plain form
8529 1076 2003 7490 5206 1682 6119 6254 -7903 -19610 -18396 -21207 -18524 -23073 -17499 -18265 -11220
8514 -11220 -8001 -24032 -27601 -29582 -19351 -7519 -9033 -6735 384 8427 6087 -8210 -14072 -7296
8500 -7296 -12839 -9331 3547 -967 727 9303 12694 12200 5855 6173 9502 4566 -14627 -19282 -23361
8485 -23361 -32377 -37074 -44949 -40746 -20736 -11465 -11192 -1998 -5194 -8380 -18707 -29166 -18294 -19424
8471 -19424 -11956 -13805 -18600 -23946 -13532 -8369 -16292 -22784 -22155 -20752 -24461 -23783 -31088 -25148 -21048
8456 -21048 -13606 -4092 -13066 -11468 -9251 -17389 -13157 -8725 -17739 -21056 -11635 -6845 -2776 3640 -12610
8441 -12610 -13156 -14469 -12895 -6660 -1972 -3322 -58 9840 1108 8424 20049 17325 17038 2808 -14213
8426 -14213 -20536 -20190 -17226 -2215 2269 -1086 -3656 -580 10734 13651 12372 12661 9684 9440 6540
8411F540n202K627l183N629N918q598j2575O553M318N151J6903L948q839l233
8397A5957m000Q825M635O27j440o033J3758p10k047J3285J442n587j1788j1526
8383A5398n040l572L071J2490O647j4029p868q881m735L357j396p218p363Q088
8369a1051K174r502N935J495p059J812L397n015J3526M640j817L447R048J5279
8355B6309M550q457j2910j1260P375j1662n966j744M526L325J0529q93J218j482
8341C458j0004q283m591k507J9164Q755o525r981J141J4846R645L106q737j2622
8327c135o370q439K367L430n240P073N403r810m465r587k039n237j387P176J950
8312b8310J2432J5150Q999K531Q32j131j0203j3547P868m584M472P575j878o781
$$ plain form
8411 6540 1338 3965 782 6411 12329 3731 -8844 -2291 2027 7178 24081 28029 19190 15957
8397 15957 11957 20782 25417 26044 24604 18571 32329 31619 29572 42857 44299 38712 26924 15398
8383 15398 10358 6786 9857 22347 28994 14965 7097 -1784 -6519 -3162 -4558 -11776 -19139 -11051
8369 -11051 -8877 -18379 -12444 -10949 -18008 -16196 -12799 -17814 -4288 352 -1465 1982 11030 26309
8355 26309 30859 22402 9492 -1768 5607 -6055 -12021 -13765 -9239 -5914 4615 3722 4940 3458
8341 3458 -6546 -14829 -19420 -21927 -2763 5992 -533 -10514 -9373 5473 15118 18224 9487 -3135
8327 -3135 -9505 -17944 -15577 -12147 -17387 -10314 -4911 -14721 -19186 -28773 -30812 -36049 -37436 -30260 -28310
8312 -28310 -15878 -728 8271 10802 11634 10503 300 -13247 -5379 -9963 -5491 2084 206 -6575
8298f575m411K907m045P233M314m349j0728q196R609N294J847j206J2025K326
8284F045n153j2665j0899j1190J457Q881J8975K2111L529n830o527r95n712j6347
8270a4320k541l982J0835J0611L371n253Q099n679N131L029N636k43n29J2049
8256B6214Q351K559J1774p608j6000n306N95P999P599K881Q379o584r951K116
8242C3018l928k866n903J174l077l77J1333O72q263o867p025J352N269r865j15
8227D532J5510K2012l166L259P4j7279l997j5499O69K1715J3118O366j346k770
8213D3198j1519q391j3005k385r58M4R93K30J4326J0778J1215N458N507O249N116
8198F6856m047p037l072J403m422r229L514r168L908o236Q019J0936m492n757
$$ plain form
8298 -6575 -10986 -8079 -12124 -4891 -577 -4926 -15654 -23850 -14241 -8947 -7100 -8306 3719 6045
8284 6045 892 -11773 -22672 -33862 -32405 -23524 -4549 17562 21091 15261 8734 7739 2027 -14320
8270 -14320 -16861 -20843 -10008 603 3974 -1279 6820 1141 6272 9301 14937 14694 14165 26214
8256 26214 34565 37124 48898 41290 25290 19984 20579 28578 36177 39058 47437 40853 30902 33018
8242 33018 29090 26224 20321 21495 18418 18041 29374 30046 21783 14916 7891 9243 14512 4647 4532
8227 4532 20042 42054 38888 42147 42221 24942 20945 5446 6115 27830 40948 47314 45968 43198
8213 43198 31679 23288 10283 7898 6940 6984 7977 8207 22533 33311 44526 49984 55491 61740 66856
8198 66856 62809 55772 52700 54103 49681 40452 43966 34798 38706 32470 40489 51425 46933 41176
8184D1176o532o86r559p378O903J3494J3318M850r876O5M011M162j1706j1348
8170C0894m03n565k478r413L856J0476n870P553o210j3718j493M36o051p306P524
8155B232m580Q716J8562R002L646O331J2583o697n626J5874K84j877j8054m449
8141C5947k516q968l451R91O621K069J971q108l381J496j2435n942J5679m073
8127A5900J743N150r032q591l663o04M793o438K892J1263Q018J0399o901j4502
8113A0427j21n708j21J0981R613j976J356N063Q848J9690J6253R614L308O638
8099I3865l766N931j5941k5597j1725q439j1466m703M309J4593R422J796P270
8086E5549R360K719o715j0564O523J5252l521j2442J131Q326K516m559o742j2558
$$ plain form
8184 41176 34644 33958 24399 17021 23924 37418 50736 55586 45710 45775 49786 53948 42242 30894
8170 30894 30491 24926 22448 13035 16891 27367 21497 29050 22840 9122 7629 8065 2014 -5292 2232
8155 2232 -2348 6368 24930 33932 37578 43909 56492 49795 44169 60043 60327 58450 40396 35947
8141 35947 33431 24463 21012 22003 28624 30693 32664 24556 21175 22671 10236 4294 19973 15900
8127 15900 17643 22793 13761 5170 1507 903 5696 -742 2150 13413 21431 31830 24929 10427
8113 10427 10306 4598 4477 15458 25071 23095 24451 29514 38362 58052 74305 83919 87227 93865
8099 93865 90099 96030 80089 54492 42767 34328 22862 18159 22468 37061 46483 48279 55549
8086 55549 64909 67628 60913 50349 56872 72124 68603 56161 57292 65618 68134 63575 56833 44275
8072D4275k477Q774p155o192o371r211K63m464n550R035R113r76K249m244j298
8057B5771J4521J6434j852n905q91o229l253q426n401k367j2429O990L449j593
8043A8819J3186j943O774J4160J8210l100j487q438j0005j1979q30N925p879p246
8029B4167l971m610p706l881p168q323m728r63R39L159J5324O515r693K615N396
8014G072J22j0291k002J0991Q1m465m494r680k882O420n420o720j991R522J170
7999a2567L521R612r054j3353j934P105Q51P035J26l146N521O923j5270P05K629
7984a1296j1760k506K614r044P268K890P533p106J12K426K008L982k213L610L506
7969g976p885p045K840J122K599R84j2675N276Q267l487l008L430L46O779K099
$$ plain form
8072 44275 41798 50572 43417 37225 30854 21643 21906 17442 11892 20927 30040 29064 31313 27069 25771
8057 25771 40292 56726 54874 48969 48078 41849 38596 30170 24769 22402 9973 16963 20412 18819
8043 18819 32005 30062 36836 50996 69206 66106 64619 56181 46176 34197 33367 39292 31413 24167
8029 24167 20196 15586 7880 3999 -3169 -11492 -16220 -17183 -16244 -13085 2239 8754 -939 1676 7072
8014 7072 7194 -3097 -5099 5892 5973 1508 -2986 -12666 -15548 -9128 -14548 -21268 -23259 -13737 -12567
7999 -12567 -9046 566 -8488 -21841 -23775 -16670 -15819 -8784 -8658 -11804 -6283 640 -14630 -13925 -11296
7984 -11296 -23056 -25562 -22948 -31992 -24724 -21834 -14301 -21407 -21295 -18869 -16861 -12879 -15092 -11482 -7976
7969 -7976 -15861 -22906 -20066 -18944 -16345 -15361 -28036 -22760 -14493 -17980 -20988 -17558 -17212 -10433 -8334
7954h334k897M207N013P0j4197q914J0598J2389O988L308j995M778p815J229P328
7939A1756l588m642l559P540O473Q474J832m126j3281m077L724j4594j2078N806
7925a4340J3985K644M987J9097J2713P636M012N736j070o723l547j643j725R00
7911D2662N970J3870J625k4721j8377N225l503j0950o79l462N765J0764P616P126
7897C8931K440P829j499o995n391o39J1566R069j372R09P025J0375J3731K1868
7883A07847K1415K9785J6955j1603k3554j8538j0254J2293k488j0618j387J3495
7871A23348P179K9249L1036L8998J6504M765P087j7014l3078k2440k7836k9912
7859A27886j7928k3056j6080j0840j4935j1627K251J379l451m526O829J0558N952
$$ plain form
7954 -8334 -11231 -7024 -2011 -1941 -16138 -25052 -14454 -2065 4923 8231 6236 11014 3199 4428 11756
7939 11756 8168 3526 -33 7507 13980 22454 24286 20160 6879 2802 6526 -8068 -20146 -14340
7925 -14340 -355 2289 7276 26373 39086 46722 50734 56470 55400 48677 45130 43487 41762 42662
7911 42662 48632 62502 64127 39406 21029 26254 22751 11801 11122 7660 13425 24189 31805 38931
7897 38931 41371 49200 47701 40706 35315 34676 46242 55311 53939 54848 61873 72248 85979 107847
7883 107847 129262 159047 176002 164399 140845 122307 112053 124346 121858 111240 109853 123348
7871 123348 130527 159776 190812 229810 246314 251079 258166 241152 208074 185634 157798 127886
7859 127886 109958 86902 70822 59982 45047 33420 35671 37050 33599 29073 35902 46460 52412
7846E2412J5215J4363N418o362O957J9277R298J6290L6796L5804L7988M1691J3529
7833B98676N210r123l1223l6537k5969k3980k1165m698Q122Q046J3137J9373O652
7820B06521J1841J7077m820j9159j7529j0355l0327l7391k7486k6687j2108o781
7808D2796N387J739M839J010o108k462j2740j1398l058n405l067J4352J6799R903
7794E2587N49N532J3134J5903N224J753J7262J2537p669r679j4008q400j3125
7781G1600j1668o27j576k181p29L932J749J855K972n526j3368j781K806j462o440
7766C9556j7438j5532p282k317k948J1003L809j27n736l578M478K251m161p255
7752e277o549J003Q281j1286o130J2190P736R858o361l391k885p1m240m403J708
$$ plain form
7846 52412 67627 81990 87408 81046 88003 107280 116578 132868 169664 205468 243456 285147 298676
7833 298676 303886 294763 263540 227003 201034 177054 155889 151191 159313 167359 180496 199869 206521
7820 206521 218362 235439 230619 211460 193931 183576 153249 115858 88372 61685 49577 42796
7808 42796 48183 49922 54761 55771 49663 47201 34461 23063 20005 14600 11533 25885 42684 52587
7794 52587 53136 58668 71802 87705 92929 94682 111944 124481 116812 107133 93125 84725 71600
7781 71600 59932 59305 57729 55548 54819 58751 60500 62355 65327 59801 46433 44652 47458 45996 39556
7766 39556 22118 6586 -696 -3013 -5961 5042 8851 8724 2988 -590 3888 6139 1978 -5277
7752 -5277 -11826 -10823 -2542 -13828 -19958 -7768 -32 9826 3465 74 -2811 -2882 -7122 -11525 -9817
7737i817j1670n222K85P022q262Q932J4632l290j2997K997M8O451J4214J0511
7723A3834n517R413p296j3105q2n389k018P631J580j992r80j281q996m803K4027
7708E026Q041r736k9M078n52P086l269j1992j1498l477j1196K625J1574R241J3008
7693H930P299o130j3537m352O829O848l799l913j0989m772k919J1567J4834l394
7679B502j2084n781k470K083N092r057k890J3621P757m147L306K662L949j771
7665B772l574k254r888R18M935J000J5047l182J957p341q383j1360q69j860m827
7650b6909k282j4939n228M239n39N778J1071Q449n523J6933J1312N29p73M680
7636F798J347R008r14j1520k627q139l161R436L234j059l258j3699l131J714P386
$$ plain form
7737 -9817 -21487 -26709 -26424 -19402 -27664 -18732 -4100 -7390 -20387 -17390 -17342 -10891 3323 13834
7723 13834 8317 17730 10434 -2671 -2753 -8142 -10160 -2529 -949 -2941 -3921 -5202 -14198 -19001 5026
7708 5026 13067 3331 3302 7380 6828 13914 10645 -1347 -12845 -16322 -27518 -24893 -13319 -4078 8930
7693 8930 16229 10099 -3438 -7790 -961 5887 2088 -1825 -12814 -17586 -20505 -8938 5896 2502
7679 2502 -9582 -15363 -17833 -15750 -10658 -19715 -22605 -8984 -1227 -5374 -2068 594 4543 2772
7665 2772 -802 -3056 -12944 -12026 -7091 -6091 8956 5774 7731 390 -7993 -19353 -20222 -22082 -26909
7650 -26909 -29191 -44130 -49358 -45119 -45658 -39880 -28809 -20360 -25883 -8950 2362 2891 2118 6798
7636 6798 8145 17153 16239 4719 2092 -6047 -9208 228 3462 2403 -855 -14554 -17685 -15971 -8585
7621h585K922L466K505J939K088M306o787p235m137K107k368J1432r21J2194q487
7606D439j3764J0449O381o311p010k1197J0382Q871k809n799O288M337j507J888
7592e362L561m883k764l421m45k532n44P957J4455L707P75Q269J495l947k5450
7577i129q176L022j0006p916J7339Q231R77J5806o773q458j8057R454J1017R87
7563a682k204M460j1493m245N49J434L35K732N133J24L337m188O41l639k766k205
7547a3677p32K0J353j972R477o271j9612m668p55L085Q458O336N628M809n504
7532a4025j4080j077J3443J808k25J6101P00r196L792r085j3544k654Q295k424
7518b2171K635L338Q665q021j9538q534J873Q915J810O043P909l219j19J4701
$$ plain form
7621 -8585 -5663 -2197 308 2247 4335 8641 1854 -5381 -9518 -7411 -9779 1653 732 12926 4439
7606 4439 -9325 1124 7505 1194 -5816 -27013 -16631 -7760 -10569 -16368 -10080 -5743 -7250 -5362
7592 -5362 -1801 -6684 -9448 -12869 -13314 -15846 -16390 -8433 6022 9729 10504 18773 20268 16321 -9129
7577 -9129 -17305 -14283 -24289 -32205 -14866 -6635 -5658 10148 3375 -5083 -23140 -13686 -2669 -1682
7563 -1682 -3886 574 -10919 -15164 -14615 -13181 -12846 -10114 -4981 -4857 -1520 -5708 -5067 -8706 -11472 -13677
7547 -13677 -14409 -14389 -13036 -15008 -5531 -11802 -31414 -36082 -36837 -33752 -25294 -18958 -13330 -8521 -14025
7532 -14025 -28105 -29182 -15739 -13931 -14156 1945 2645 -6551 -2759 -11844 -25388 -28042 -19747 -22171
7518 -22171 -19536 -16198 -7533 -15554 -35092 -43626 -41753 -32838 -31028 -24985 -17076 -20295 -20414 -5713
7504e713o087o597n543K983O559L959l080l44o370j1606m260N15J0540P987R495
7489g562R352q420j4277K415L633L678J2496l376j0591k652n325J107J0387J5100
7475E965q46k226j0908o650j3454r989P289L580k931J5113J4726K070Q659K056
7461A2454p54j559O616j4833j2013Q170K005J279N202m520k144o491K492k340
7447f436o317J795K510K999n463l455j03J0389k749q70k165o09J7363J0113P488
7432B4490l653l098L232l92n865l329p039l448Q698o084M734O76K944r665r152
7417f951l18k961J3362q214j1450J6107l547j6129M237N592R838j2187j1406j5101
7403c9128n361O274J2362J1537N630o229L848q737K660J8901j1751k501O574p938
$$ plain form
7504 -5713 -11800 -18397 -23940 -20957 -14398 -10439 -13519 -13863 -20233 -31839 -36099 -35584 -25044 -17057 -7562
7489 -7562 1790 -6630 -20907 -18492 -14859 -11181 1315 -2061 -12652 -15304 -20629 -19522 -9135 5965
7475 5965 5119 2893 -8015 -14665 -28119 -38108 -30819 -27239 -30170 -15057 -331 1739 10398 12454
7461 12454 11700 10141 16757 1924 -10089 -1919 86 1365 6567 2047 -97 -6588 -4096 -6436
7447 -6436 -12753 -10958 -8448 -5449 -10912 -14367 -14470 -4081 -6830 -7700 -9865 -10474 6889 17002 24490
7432 24490 20837 17739 20971 20579 14714 11385 4346 898 9596 3512 8246 8922 11866 2201 -6951
7417 -6951 -7269 -10230 3132 -5082 -16532 -425 -3972 -20101 -15864 -10272 -434 -12621 -24027 -39128
7403 -39128 -44489 -38215 -25853 -14316 -8686 -14915 -11067 -19804 -17144 1757 -9994 -12495 -5921 -13859
7389a3859m869J0535J5019o002j3969k060M43k957K201m169j896K905K911M318
7375a1449N330m870L114M125m206l387O549q92q792o102L844J0884m212o674K980
7360a3758L411q353n571j210K0914j01n967m909J5471n847j1590N0n310o061Q727
7345b0104J1661r284q133J012L374N900J313l670l573k276K136j203M709L938
7331a4200M558O408j1959p569l097L672J8621R160k97p441m15q132N121R832R493
7316A3755q601j526k658P05J298p796j8831K558M747r618o429L157O044R142L231
7301a0822J721j0423M843P426Q472P443l973O4o809m554k502Q191L196J670k393
7286A550k23K346J954N539J304j328j1307q050P691N843j923K473j1435k2192
$$ plain form
7389 -13859 -18728 -8193 6826 824 -13145 -15205 -14762 -17719 -15518 -19687 -21583 -18678 -15767 -11449
7375 -11449 -6119 -10989 -7875 -3750 -7956 -11343 -4794 -5686 -14478 -20580 -16736 -5852 -10064 -16738 -13758
7360 -13758 -10347 -18700 -24271 -25481 -4567 -4668 -10635 -15544 -73 -5920 -17510 -17460 -22770 -28831 -20104
7345 -20104 -8443 -17727 -25860 -24848 -21474 -15574 -14261 -17931 -21504 -23780 -21644 -22847 -18138 -14200
7331 -14200 -9642 -3234 -15193 -22762 -25859 -22187 -3566 5594 5297 -2144 -2559 -10691 -5570 4262 13755
7316 13755 5154 3628 970 1675 2973 -4823 -23654 -21096 -16349 -25967 -32396 -29239 -23195 -14053 -10822
7301 -10822 -9101 -19524 -14681 -7255 1217 8660 4687 4751 -2058 -6612 -9114 -923 2273 3943 1550
7286 1550 1327 3673 5627 11166 12470 11142 -165 -8215 -524 5319 3396 5869 -5566 -27758
7272b7758l784K1686O063k780N928J546K425Q528Q235o596p752n247o332j0600
7258a6438Q99M716P260R259J4135k138o802l621P459L430Q69n010k2978q032L571
7243a3421N55R897J2928p578o542K747M278l10n91q374j7772q32N893k546j1707
7228c3375o756M057J0691l875j213Q266N315M29p359m643k055J5493N478q716
7214a8263q34L937Q014l691J276Q727J0222k578j6280o204N245M363r297o224
7200b1587R440O022M539L378p486m409P732q42r376q247J0163J983j462J842k691
7185a1001o658l483j0179o516L396P640J3413J2054J236K842K510m627o350J805
7171c918q469l116N275j845p696P608J2444J4757Q42L792j0063r091j1248k837
$$ plain form
7272 -27758 -31542 -9856 -3793 -6573 -645 901 3326 11854 20089 13493 5741 494 -5838 -16438
7258 -16438 -15539 -10823 -3563 5696 19831 17693 10891 7270 14729 18159 19028 14018 -8960 -16992 -13421
7243 -13421 -12866 -2969 9959 2381 -4161 -1414 2864 2554 1963 -6411 -24183 -25015 -19122 -21668 -33375
7228 -33375 -40131 -36074 -25383 -29258 -30471 -22205 -16890 -16461 -23820 -28463 -30518 -15025 -9547 -18263
7214 -18263 -19097 -15160 -7146 -10837 -9561 -834 9388 6810 -9470 -15674 -10429 -6066 -15363 -21587
7200 -21587 -12147 -6125 -1586 1792 -5694 -10103 -2371 -3213 -12589 -20836 -10673 -8690 -10152 -8310 -11001
7185 -11001 -17659 -21142 -31321 -37837 -34441 -26801 -13388 -1334 -98 2744 5254 627 -5723 -3918
7171 -3918 -12387 -15503 -10228 -12073 -19769 -12161 283 15040 15882 19674 9611 520 -10728 -13565
7157a3565p53J769J0798n866r649J0649J1402K507j674n677m211m339o526k96
7143a5431J1047m612j1941j18K085L572L373j340J243O084Q48k873N947m776r540
7128a6432q541N26J0180j895k87M357O109Q613q013p258Q11r732r070J8212K0513
7113H093L067j4613k0987J488J560J1584m729O501M70p87j2534r615J2566n395
7099b3331L550Q232K492r533o001N446l164P983P159j1223L360J0676J0123j149
7085D620j1879O887n221p947k265j555N126R846O738m449R294L362o779j4140
7071h362M394K360l509o677q449N882P04k655k089K319j0639J592Q401J2037l640
7056h331n817r723P814P972m501p820N960l123K84O992P249N81l239Q335K417
$$ plain form
7157 -13565 -14318 -12549 -1751 -7617 -17266 -6617 4785 7292 5618 -59 -4270 -8609 -15135 -15431
7143 -15431 -4384 -8996 -20937 -21055 -18970 -15398 -12025 -13365 -12122 -6038 -5190 -8063 -2116 -6892 -16432
7128 -16432 -24973 -24447 -14267 -16162 -16449 -12092 -5983 2630 -5383 -12641 -11830 -21562 -30632 -12420 8093
7113 8093 11160 -3453 -24440 -22952 -21392 -9808 -14537 -8036 -7566 -8353 -20887 -30502 -17936 -23331
7099 -23331 -19781 -11549 -9057 -18590 -24591 -19145 -22309 -14326 -7167 -18390 -15030 -4354 5769 4620
7085 4620 -7259 -372 -5593 -13540 -15805 -17360 -12234 -2388 4350 -99 9195 12557 5778 -8362
7071 -8362 -3968 -1608 -5117 -11794 -20243 -14361 -13657 -16312 -18401 -16082 -26721 -25129 -16728 -4691 -8331
7056 -8331 -14148 -23871 -16057 -8085 -12586 -20406 -14446 -17569 -17285 -10293 -3044 -2463 -5702 2633 5050
7041E050j728m413Q11k793k50O600l708n856J404P43p72N870J3658q234o286j3771
7025a3675k5908J996J2844r246m960o38J7675M885K223j787j0832p538P800R294
7011a7867j2633o598P511N437J5528P418q97o937k329n251o45l984j2397o027
6997c9671K4406Q467j1379l77P618Q675J697p972J870r438l958J0668k580j0236
6983b2210L425K830q203j7174k428K615M687K2990N461K278p70k783M102O120
6969I40R801p86k156p999Q23n388k336o821j0024J328J0677N401N316n438L678
6954b984l929k21J0414j3641o135J5578O41j010J2186J3242m642j3408k13j6017
6940a0139r648M190o59O74K0830N243j1019l707O52J26j6655j0885j470M264Q334
$$ plain form
7041 5050 3322 -1091 -280 -3073 -3323 3277 -431 -6287 -4883 -4140 -4912 958 14616 6382 96 -13675
7025 -13675 -39583 -37587 -24743 -33989 -38949 -39587 -21912 -17027 -14804 -16591 -27423 -34961 -27161 -17867
7011 -17867 -30500 -37098 -29587 -24150 -8622 -1204 -2101 -9038 -11367 -16618 -17263 -21247 -33644 -39671
6997 -39671 -15265 -6798 -18177 -18554 -10936 -2261 -564 -8536 -6666 -16104 -20062 -9394 -11974 -22210
6983 -22210 -18785 -15955 -24158 -41332 -43760 -41145 -36458 -13468 -8007 -5729 -6499 -9282 -5180 940
6969 940 10741 9955 7799 -200 623 -4765 -7101 -13922 -23946 -22618 -11941 -6540 -1224 -6662 -2984
6954 -2984 -6913 -7134 3280 -10361 -16496 -918 -277 -1287 10899 24141 19499 6091 5878 -10139
6940 -10139 -19787 -15597 -16256 -15582 5248 10491 -528 -4235 -3583 -3457 -20112 -30997 -32467 -28203 -19869
6925a9869J305Q023R334R869l596k640p320N227m174j1953m90Q550K563M437p397
6910h131J289O126P127p50j7101o772o04j421r37j117O300n846q176k62k647N773
6894b7149M515K408Q573J4184l440r00q596n017P97m438j524M271Q038N265k669
6879e682k382J1939R368K837j2053O100l303p107j5742j9982m225J1657K416J1634
6865a4525J8156O81j1692J483o871J687M037R31k630R300k192j613R335k090k7531
6850b3534j7749R056J3184M998k405M945J947p756n39M836L676j339j121P047
6836d754K746M419j0574j836J1921M359j305m176p802M23L491n386m05L54N738
6821b787m490r456j0529n602M552J8742o598j1564n328R636J2549N404N852j7518
$$ plain form
6925 -19869 -18564 -10541 -1207 8662 5066 2426 -4894 333 -3841 -15794 -16284 -7734 -5171 -734 -8131
6910 -8131 -6842 -716 6411 5661 -11440 -18212 -18816 -20237 -21174 -22291 -15991 -21837 -30013 -30275 -32922 -27149
6894 -27149 -22634 -20226 -11653 2531 -909 -1809 -10405 -15422 -14625 -19063 -20587 -16316 -8278 -3013 -5682
6879 -5682 -8064 3875 13243 16080 4027 10127 6824 -283 -16025 -36007 -40232 -28575 -26159 -14525
6865 -14525 3631 4312 -7380 -5897 -12768 -11081 -7044 -6113 -8743 557 -1635 -3248 6087 3997 -23534
6850 -23534 -41283 -32227 -19043 -14045 -16450 -11505 -9558 -17314 -17853 -13017 -9341 -10680 -11801 -4754
6836 -4754 -2008 2411 -8163 -9999 1922 6281 4976 800 -7002 -6579 -3088 -8474 -8879 -8525 -2787
6821 -2787 -7277 -16733 -27262 -32864 -28312 -9570 -16168 -27732 -33060 -23424 -10875 -5471 381 -17137
6807a7137q151J5626J6253K902r987o68k558p392j1999L920J6994K458j0731m148
6793a4618J1047O199J546J6011m455j4279o774r728m259R804J1233j56M99J372
6779C442n085m884k697O634P522j0239m874j5252l791J0636O657j090j0285K27
6765b3079L413Q454R598l578N141Q326l955l010M717K684k337n809j4928r329
6751b3692J1424R883J300o835k876Q844O212m259j721l571j055J1090k135q971
6737f362k635N637N798J1683j1731p28J827k419m281p477n197j3339m588K175
6723c1637M939J1518L774p10q73J389J4408M318P93p870j681k750O806J2665O396
6708B1485k465J61p271n690k220q843k486r258j694N526K481k315K934m591R342
$$ plain form
6807 -17137 -25288 -9662 6591 9493 -494 -1162 -3720 -11112 -23111 -19191 -2197 261 -10470 -14618
6793 -14618 -3571 2628 4174 20185 15730 1451 -5323 -15051 -19310 -9506 1727 1571 2070 3442
6779 3442 -1643 -6527 -9224 -2590 4932 -5307 -10181 -25433 -29224 -18588 -11931 -13021 -23306 -23079
6765 -23079 -19666 -11212 -1614 -5192 -51 8275 4320 1310 6027 8711 6374 565 -14363 -23692
6751 -23692 -12268 -2385 -1085 -7920 -10796 -1952 4260 1 -1720 -5291 -6346 4744 2609 -6362
6737 -6362 -8997 -3360 2438 14121 2390 1662 3489 1070 -3211 -10688 -15885 -29224 -33812 -31637
6723 -31637 -26698 -15180 -11406 -12116 -12989 -11600 2808 7126 7919 49 -1632 -4382 2424 15089 21485
6708 21485 19020 19181 11910 6220 4000 -4843 -7329 -16587 -18281 -12755 -10274 -12589 -9655 -14246 -4904
6693d904m21o239Q104m264r244k199jJ4593n911n177q746m88P307n141j895k712
6677b7338J7865Q081K044o830n496M510J0536k210j1802m78K346q803K42J804
6663a5529o114l6j981O692Q887L425K116l902n025j3215j542R345J0579Q041L536
6648E277J111L297J374r294J697o131j03Q284N393O318l63m609j2258r755J649
6633h113J946K784J125j0471P033N423j5552j0517O815P716J628p68k326J1142
6619b135J5853M351l555j4728q851j3091o486P410J0994m351j3285k732R685Q167
6605a2754k865j0258o733L404L852Q707L324k426N249L146l858J558L745R080
6591C171l196m411m221l903n117o461q129J7218M773K902J634N977m804j443l359
$$ plain form
6693 -4904 -5325 -11564 -3460 -7724 -16968 -19167 -19168 -4575 -10486 -15663 -24409 -24897 -17590 -22731 -24626 -27338
6677 -27338 -9473 -1392 652 -6178 -11674 -7164 3372 1162 -10640 -11118 -8772 -17575 -17333 -15529
6663 -15529 -21643 -21679 -23660 -16968 -8081 -4656 -2540 -6442 -11467 -24682 -26224 -16879 -6300 1741 5277
6648 5277 6388 9685 11059 1765 3462 -2669 -2772 5512 10905 17223 16860 12251 -7 -9762 -8113
6633 -8113 -6167 -3383 -2258 -12729 -5696 -273 -15825 -26342 -19527 -11811 -10183 -10951 -13277 -2135
6619 -2135 13718 18069 14514 -214 -9065 -22156 -28642 -21232 -10238 -14589 -27874 -30606 -20921 -12754
6605 -12754 -15619 -25877 -32610 -29206 -25354 -16647 -13323 -15749 -10500 -7354 -11212 -9654 -5909 3171
6591 3171 -25 -4436 -8657 -12560 -17677 -24138 -32267 -15049 -10276 -7374 -5740 237 -4567 -6010 -9369
6576i369N864k788O88M060J1794J722l005j3807p609J519M854k379j5319K089
6562b1686K0435J0832J213N846L19j2289k954q221q045m864o511k86m151J0649
6548a9713O873M261N433J688O19q809j1430P361k416M138J626N318J1719N506
6534A2174l936j7J199m129k0365M239N738k43L736j973q628l883j2023p31N618
6519b3224j080k196P342Q631o643m829J546Q555Q618m09N823O673j0462q587N414
6504d828m940p680R680N53p122M491o183j3638o553J0140J1213N667n844j451
6490a6495J5335J1144j231q737k00O557j613r277o039M350m176j6177M993J3491
6476h075Q65m678P334L225j0471o041J4128M979j0333J442O279r243j6209J1048
$$ plain form
6576 -9369 -3505 -6293 -5605 -1545 10249 11971 8966 -4841 -12450 -10931 -6077 -8456 -23775 -21686
6562 -21686 -1251 9581 10794 16640 16959 4670 1716 -6505 -14550 -19414 -25925 -26211 -30362 -19713
6548 -19713 -12840 -8579 -3146 -1458 -839 -9648 -21078 -13717 -16133 -11995 -10369 -5051 6668 12174
6534 12174 8238 8221 9420 5291 -15074 -10835 -5097 -5340 -1604 -3577 -12205 -16088 -28111 -28842 -23224
6519 -23224 -24304 -26500 -19158 -10527 -17170 -21999 -20453 -11898 -3280 -3689 2134 8807 -1655 -10242 -4828
6504 -4828 -9768 -17448 -7768 -7215 -14337 -9846 -16029 -29667 -36220 -26080 -14867 -9200 -15044 -16495
6490 -16495 -1160 9984 8753 16 -184 6373 4760 -4517 -10556 -6206 -10382 -26559 -21566 -8075
6476 -8075 -7210 -11888 -4554 -1329 -11800 -17841 -3713 1266 -9067 -7625 -1346 -10589 -26798 -15750
6462a5750N204j903M895l246q048r92J931J2581J2810Q36J2559J995L383k725
6448B3530n865N300m559l583o053m304q406p090M686O63n576Q616n930k1716k479
6433c2766J2530J0940j546j69j0014q29M700J222n096j1232j248J2811L756k374
6419a9315k333J8655Q405k422n725k706P676Q21j2071l653j2198K268J112k254
6405b3740J675L59N29L019l534M929K430j0300o366N853M202Q67R621N256K030
6390c170j884j761j1299o772M325P406J0915n85j365Q651M961l878j2915j4529
6376b1900J111K7458J3845n223j7451r973J2665q27j2082J0007Q51r867L949L991
6362c446q900m521M587M224P784N665O471l058k814m471j413q568r845l37L672
$$ plain form
6462 -15750 -10546 -12449 -7554 -10800 -18848 -19840 -17909 -5328 7482 8318 20877 22872 26255 23530
6448 23530 17665 22965 18406 14823 8770 4466 -3940 -11030 -6344 -5681 -11257 -2641 -8571 -30287 -32766
6433 -32766 -20236 -9296 -10842 -11011 -21025 -21854 -17154 -15932 -21028 -32260 -33508 -20697 -16941 -19315
6419 -19315 -21648 -2993 5412 2990 -2735 -5441 2235 3056 -9015 -12668 -24866 -22598 -21486 -23740
6405 -23740 -22065 -21706 -21177 -18158 -21692 -16763 -14333 -24633 -30999 -25146 -20944 -20077 -10456 -5200 -3170
6390 -3170 -5054 -6815 -18114 -24886 -20561 -13155 -2240 -2825 -4190 4461 9422 5544 -7371 -21900
6376 -21900 -20789 6669 20514 15291 -2160 -12133 532 -295 -12377 -2370 -1519 -11386 -7437 -3446
6362 -3446 -12346 -16867 -12280 -8056 -272 5393 11864 8806 5992 1521 108 -8460 -18305 -18642 -14970
6347a4970P16j359J0468Q343J631J5838q85P50l461j1377l54P50j0757n682K056
6332h293j0044Q54P680o98M941k667k982J0532R795n453N905q036K533j817r900
6317g650j684K428P995M861j2957M212R330k027k1404p311N235N595K194P906
6303c277J4943N343j0059q222M026M767R511P988q340j3117m492j0778k344j813
6289a5864K084J0895m432J944J0949j214n623p449M965K565j317P076J2697N940
6275B3216p281r176l935l463M637O900o364n518L021j4681N412J6773k510J254
6261H285l926k365n811k759J776O134M073p181J052n161K026j524q444R166L103
6246a556Q660L361L019N859r179j0290o139r539N049n903k972L87L648J5989j135
$$ plain form
6347 -14970 -14254 -15613 -5145 3198 4829 20667 19782 20532 17071 5694 5340 6090 -4667 -10349 -8293
6332 -8293 -18337 -17483 -9803 -10501 -5560 -8227 -11209 -677 9118 3665 9570 1534 4067 2250 -7650
6317 -7650 -9334 -6906 1089 5950 -7007 -2795 6535 4508 -16896 -24207 -18972 -13377 -11183 -3277
6303 -3277 11666 17009 6950 -1272 2754 7521 17032 25020 16680 3563 -929 -11707 -14051 -15864
6289 -15864 -13780 -2885 -7317 -5373 5576 4362 -1261 -8710 -3745 -1180 -2497 4579 17276 23216
6275 23216 15935 6759 2824 -639 3998 10898 4534 -984 2037 -12644 -7232 9541 7031 8285
6261 8285 4359 1994 -3817 -6576 -4800 1334 5407 -1774 -722 -5883 -3857 -5381 -13825 -4659 -1556
6246 -1556 7104 10465 13484 19343 10164 -126 -6265 -15804 -10755 -16658 -19630 -19243 -15595 394 -741
6231g41L799j89p886J654O172l880m489j469K11N971P885m329j7724j7948m765
6216c7728K442P839M830k048Q905O257Q214p363j0192q478K850N437P900K046
6202i089n002j417L203J5465J0282o621r262L458o062o070K99j665j523J5332
6188A328R520q277j4095O694J2614o042j1688L533P818o78q776O165j6m544j3648
6173b0092L258R388N584L545m468j0389p63J1463Q609j302p816k734J0224j0086
6159e579r022R135O138L209O875P175o321j1220p842r600J037O208J2120r59p002
6144e648m094o667j77Q828O78n861N328m418o438N902J0199L375o297r328J1235
6129c383J3515n70k718p373j64j0211j0607R114j27k018p458q95J4186J0283M648
$$ plain form
6231 -741 3058 2869 -5017 -3363 2809 -1071 -5560 -7029 -6818 -847 7038 2709 -15015 -32963 -37728
6216 -37728 -35286 -27447 -22617 -24665 -15760 -9503 -1289 -8652 -18844 -27322 -24472 -19035 -11135 -9089
6202 -9089 -14091 -15508 -12305 3160 13442 6821 -2441 1017 -5045 -11115 -10816 -12481 -14004 1328
6188 1328 10848 2571 -11524 -4830 7784 1742 -9946 -6413 1405 727 -8049 -1884 -1900 -6444 -20092
6173 -20092 -16834 -7446 -1862 1683 -2785 -13174 -13937 -2474 6135 4833 -2983 -5717 4507 -5579
6159 -5579 -14601 -5466 672 3881 10756 17931 11610 390 -7452 -17052 -16015 -9807 2313 1354 -5648
6144 -5648 -9742 -16409 -16586 -7758 -7080 -12941 -7613 -12031 -18469 -12567 -2368 1007 -5290 -14618 -3383
6129 -3383 10132 9562 6844 -529 -693 -10904 -21511 -12397 -12524 -14542 -22000 -22895 -8709 1574 6222
6114F222j306j4576N627j135Q46n848m435l372J7274J2944j1201r101J659L405
6100b997r030j1454J3508J6685l92m326k747k364o100n702N930K031J637j953
6086g274M586J781j069J543k2026k0610n178J1867J4785O550L989O686m955j510
6072a0835m806k235j513L937R469J8213L018m191J310o659o951k316o886K204
6058h241J7900J330j4172n891o127M305j133j787Q082J4349L143J121K817j066
6044A4630K285n958J361K499n246o214j1065j5747j1176O005n21R362J0152N646
6030c987m582j0687j0972k47J3615j784j47L79J4368m99p300R494p240N447k825
6015f967j0301m914R000J6093J3781l256O785J995q034o559j3232k287L478k04
$$ plain form
6114 6222 4916 -9660 -4033 -5168 -4322 -10170 -14605 -17977 -703 12241 1040 -8061 -6402 -2997
6100 -2997 -12027 -23481 -9973 6712 6320 1994 -753 -3117 -9217 -14919 -8989 -6958 -5321 -7274
6086 -7274 -2688 -907 -1976 -433 -22459 -43069 -48247 -36380 -21595 -15045 -11056 -4370 -9325 -10835
6072 -10835 -15641 -17876 -19389 -15452 -5983 12230 15248 11057 12367 5708 -1243 -3559 -10445 -8241
6058 -8241 9659 10989 -3183 -9074 -15201 -10896 -12029 -13816 -5734 8615 11758 12879 15696 14630
6044 14630 16915 10957 12318 14817 9571 3357 -7708 -23455 -34631 -28626 -29147 -19785 -9633 -3987
6030 -3987 -8569 -19256 -30228 -30475 -16860 -18644 -18791 -18412 -4044 -4543 -11843 -2349 -9589 -4142 -6967
6015 -6967 -17268 -22182 -13182 2911 16692 13436 20221 22216 14182 7623 -5609 -7896 -4418 -4622
6001d622J1267L584n674P66p696j0207N168J2806J316j6313j6072l706J5329J3178
5987h76L41q24K259q397k107P436J5351O239n296p648N183R203q122o197N507
5972A2052K6r662j2298n24J971M918M072R185K123n853l739J2269R836q497r116
5957F763j1873m191L586J1755p489r853M450p408J561P965j394J99L078l31p396
5942a0578L12Q379l805Q52L197k027J326L792o93j5152p871J797J2764J1073o790
5927c424k722m904q906L152K894p384m319Q575j16P310J076J0797K128J021j1020
5912e842n983j3591j1997L968P955p26o139J6050L256Q728Q812Q90j7381q210
5898b0210j721k685K955J3263k009j390l04P199K355l898K964L582J0377L824
$$ plain form
6001 -4622 6645 10229 4555 5321 -2375 -12582 -7414 5392 6708 -9605 -25677 -29383 -14054 -876
5987 -876 -535 -1359 900 -7497 -9604 -2168 13183 19422 14126 6478 11661 20864 12742 6545 12052
5972 12052 12078 2416 -9882 -10406 -8435 -3517 555 9740 11863 6010 2271 14540 24376 15879 6763
5957 6763 -5110 -9301 -5715 6040 -1449 -11302 -6852 -14260 -12699 -4734 -6128 -5929 -2851 -3182 -10578
5942 -10578 -10266 -1887 -5692 -4840 -1643 -3670 -2344 1448 755 -14397 -22268 -20471 -7707 3366 -3424
5927 -3424 -6146 -11050 -19956 -16804 -13910 -21294 -25613 -17038 -17154 -9844 -8768 2029 4157 5178 -5842
5912 -5842 -11825 -25416 -37413 -33445 -25490 -26216 -32355 -16305 -13049 -4321 4491 5381 -12000 -20210
5898 -20210 -21931 -24616 -21661 -8398 -10407 -11797 -12101 -4902 -2547 -6445 -3481 101 10478 14302
5884A4302m579p276j4592q508n885l108O203J0466K981J1333M68n829q61n128
5870a0013K861L238p604n900K190R845L466o175l042N207L338k140m791l387N164
5855g743J6614m619j1961l723L498j712J0295K792L444j106q26L587k119n669
5841G52N814m605J571k317k434j0l796j2422m449M210J233M925N293J1107n643
5826g71J288j0734J3031N050j2962j685J9908m601j8923p209n641J6440Q196q683
5812g296N581J5762q056l548p9j0981J113Q997m37n473m185J391J622q819n864
5797b0272N247Q978P977K985O14L427K002N78r566P595R179m024q189O578K601
5782A5710q280j3068J936N302lQ30p552N782j876j1094j1708n990O424R064M469
$$ plain form
5884 14302 9723 2447 -12145 -20653 -26538 -29646 -23443 -12977 -9996 1337 1805 -4024 -4885 -10013
5870 -10013 -7152 -3914 -11518 -17418 -15228 -5383 -1917 -8092 -11134 -5927 -2589 -4729 -9520 -12907 -7743
5855 -7743 8871 4252 -7709 -11432 -7934 -9646 649 3441 6885 5779 4953 8540 6421 752
5841 752 6566 1961 3532 1215 -1219 -1229 -5025 -17447 -21896 -17686 -16453 -11528 -6235 4872 -771
5826 -771 517 -10217 2814 7864 -5098 -6783 13125 8524 -10399 -17608 -23249 -6809 1387 -7296
5812 -7296 -1715 14047 5991 2443 2364 -8617 -7504 1493 1056 -4417 -8602 -7211 -5589 -14408 -20272
5797 -20272 -15025 -6047 1930 4915 5529 8956 10958 11536 1970 9565 18744 14720 6531 13109 15710
5782 15710 7430 -5638 -3702 1600 1597 2427 -5125 657 -1219 -12313 -24021 -30011 -23587 -14523 -10054
5767a0054N551n801J4273J238j158j96o563j1534N9l333K611J4453J1537l769
5753G314o51k625r78n263l661N978M118K406J729m597m92p316K062N862q583l911
5737h608N806P56O663m016o913M5N118q583Q636O217k392P115o716n789K690N660
5721E689N054J211j0352L216M859J57l703l458N92p054m305n575k593J1772P008
5706B518j123n55q381L74K105O55k29L204K530N33M377n200j191L678l480k390
5690b575l647j628j030M428k99m863M629K119J382N42k331k21J75r01p723P65
5674a1178Q23L811L76o29J134o410j915K499p976j839N36Q907O805Q428k705J54
5658H21j2119m49l098j3085n40J0668R790P008J2316o187r153k043m158K170r0
$$ plain form
5767 -10054 -4503 -10304 3969 5207 4049 3853 -2710 -14244 -14185 -17518 -14907 -454 11083 7314
5753 7314 6663 4038 3060 -2203 -5864 114 4232 6638 8367 3770 3278 -4038 -1976 3886 -4697 -8608
5737 -8608 -2802 -2046 4617 601 -6312 -6267 -1149 -9732 -1096 5121 2729 9844 3128 -2661 29 5689
5721 5689 10743 11954 1602 4818 9677 9834 6131 2673 3265 -3789 -8094 -13669 -16262 -4490 2518
5706 2518 1395 840 -7541 -7167 -5062 -4407 -4636 -1432 1098 1631 6008 808 -383 3295 -185 -2575
5690 -2575 -6222 -7850 -8880 -4452 -4751 -9614 -4985 -2866 -1484 -942 -3273 -3494 -3319 -4220 -11943 -11178
5674 -11178 -10355 -6544 -6168 -6797 -5663 -12073 -13988 -11489 -19465 -21304 -20768 -11861 -5056 3372 667 821
5658 821 -11298 -11747 -14845 -27930 -28470 -17802 -8012 -1004 11312 5125 -4028 -6071 -10229 -8059 -8149
5643h149J1584p44q712p088J2445Q043q567k936o750k01J1138O604J6344J611
5629B4622q975m600k959k921K987J320q065m189L26k241J0427L899j760m852q212
5614e193P556J018q720n984M061J875L403J0239K331n685k459j0721k937J584
5600i632J1154J4646M821m657j3638N3N930Q929r82n028l430n893j3348R983k446
5585c538K935M702J112l690l733K261L484n648j4505O821J4030N242j241n868
5571B364l510q729n162L89J394K301j2487o937N276K2723Q365R787P984j157j0830
5556A1771K253q73j469j1229q55l297j630L411N919R129o355j5465o916l605L417
5541a5794Q286k696J476l134O043J0730n370j0702j1412Q801L333j347n024L958
$$ plain form
5643 -8149 3435 2691 -6021 -13109 -664 7379 -1188 -4124 -10874 -11075 63 6667 23011 24622
5629 24622 15647 11047 8088 5167 8154 9474 1409 -2780 -2454 -4695 5732 9631 7871 3019 -5193
5614 -5193 2363 3381 -5339 -11323 -7262 -5387 -1984 8255 10586 4901 2442 -8279 -11216 -9632
5600 -9632 1522 16168 20989 16332 2694 2747 8677 17606 16624 11596 8166 2273 -11075 -1092 -3538
5585 -3538 -603 4099 5211 1521 -2212 49 3533 -2115 -16620 -9799 4231 9473 8232 2364
5571 2364 -1146 -9875 -15037 -14648 -13254 -10953 -23440 -30377 -25101 -2378 5987 15774 23758 22601 11771
5556 11771 14024 13151 11682 453 -402 -3699 -5329 -1918 4001 13130 6775 -8690 -15606 -19211 -15794
5541 -15794 -7508 -10204 -8728 -11862 -5819 4911 -459 -11161 -22573 -13772 -10439 -11786 -16810 -12852
5527a2852J0518p998m6m013o44l87O595J0397n668n678M239j1220j639O659K148
5512i589K984n570r582o072K631O409L845K302P508Q88p156q383p607K442K814
5497b2136R063N315J1984J491j335m007l8O99M411J868j2906j6125L554j528K635
5482a7055K1212k342j0708J2043J0925K046j0742k633K939Q919K935j1455j0758
5469d674r65O634N311J756k726P323L252j308K820J925j2409j2845m02J0795L20
5454D807q70q298N733J0828j5952r955Q117R142P487J616L840K851j1402n451
5440B493j0056j269K016J5428j173m31L074j636n60M633k433j231J691l36p867
5425B343l489k938k793p963M477o564MJ5495J191j385l163j600k56N438J063n697
$$ plain form
5527 -12852 -2334 -10332 -10378 -14391 -15035 -15422 -8827 1570 -4098 -9776 -5537 -16757 -18396 -11737 -9589
5512 -9589 -6605 -12175 -21757 -27829 -25198 -18789 -14944 -12642 -5134 -4246 -11402 -19785 -27392 -24950 -22136
5497 -22136 -13073 -7758 4226 5717 4382 375 337 1036 5447 7315 -5591 -21716 -18162 -19690 -17055
5482 -17055 4157 1815 -8893 3150 14075 16121 5379 2746 5685 14604 17539 6084 -4674
5469 -4674 -5639 995 6306 8062 5336 12659 15911 14603 17423 19348 6939 -5906 -6308 4487 4807
5454 4807 3937 -4361 1372 12200 -3752 -13707 -5590 3552 11039 12655 16495 19346 7944 2493
5440 2493 -7563 -8832 -6816 8612 7439 7008 10082 8446 7886 12519 10086 8855 10546 10210 2343
5425 2343 -1146 -4084 -6877 -14840 -10363 -16927 -16923 -1428 -237 -1622 -4785 -6385 -6641 -1203 -140 -5837
5409e837K646N24k355j3831n972M827J6052p57l923Q142n589l055R604O532M905
5394A1913o053k708r14j2251j340J805p189j558k01K0290J0726k106q059Q340
5380A0695j0388r264k819K498j725K587N376K623M379M390k089o535K347J1077
5366A3152J785M563j1622j1202l149R47M716r78K667J3797M82j761N189m742j820
5351A2024R942k860j4264Q64n469m865J925P594M856J329j366l871L854J700p393
5336D000l579m136l077k152L166L253j895J322m15L767j06Q99J708r77O674M394
5320A2846m531j993m893q598J1977j1947m584J3634L067m50j3962k224J4687K074
5306E103k177r568l65N732p008n520J7232J386l696L067m021K856p568k388Q896
$$ plain form
5409 -5837 -3191 -2667 -5022 -18853 -24825 -19998 -3946 -4703 -8626 -484 -6073 -9128 476 7008 11913
5394 11913 5860 3152 2238 -10013 -11353 -9548 -16737 -18295 -18496 1794 12520 10414 2355 10695
5380 10695 307 -8957 -11776 -9278 -11003 -8416 -3040 -417 3962 8352 6263 -272 2075 13152
5366 13152 14937 19500 7878 -3324 -6473 -5526 -810 -1788 879 14676 15158 13397 18586 13844 12024
5351 12024 21966 19106 4842 5706 237 -4628 -2703 4891 9747 11076 9710 5839 9693 11393 4000
5336 4000 421 -3715 -6792 -8944 -5778 -2525 -4420 -3098 -3513 254 148 1047 2755 1778 8452 12846
5320 12846 8315 6322 1429 -7169 4808 -7139 -11723 1911 4978 4528 -9434 -11658 3029 5103
5306 5103 2926 -6642 -7007 -1275 -8283 -13803 3429 4815 1119 4186 165 3021 -4547 -6935 1961
5291A961l243p830M472R134r758L06P332o82j3437o862K19L908P775O286l4r507
5275i960k651j9K465n965O047k432r001J3675P634M76k831R228N826o439n871
5260A82K879j184m851q522J575J3144k494o267N345L097r576Q475N290M271n707
$$ plain form
5291 1961 -1282 -9112 -4640 4494 -5264 -4958 2374 1692 -11745 -18607 -18388 -14480 -6705 -419 -453 -9960
5275 -9960 -12611 -12630 -10165 -16130 -10083 -12515 -21516 -7841 -207 269 -2562 6666 12492 6053 182
5260 182 3061 1877 -2974 -11496 -9921 3223 729 -5538 -193 2904 -6672 1803 7093 11364 5657
$$ [...]
##END NTUPLES=NMR SPECTRUM
##END=
