##TITLE=Analysis number 312572
Compound Code aw 00680
Project Code adrs
Chemist Name fudan
##JCAMPDX= 6.0         $$ Bruker NMR JCAMP-DX V2.0
##DATA TYPE= NMR SPECTRUM
##DATA CLASS= NTUPLES
##ORIGIN= Bruker BioSpin GmbH
##OWNER= NMR
$$ XWIN-NMR		Version 3.5
$$ Tue Aug  9 10:00:47 2005 GMT Daylight Time (UT+1h)  MAYBRIDGE\NMR@NMR_250MHZ
##.OBSERVE FREQUENCY= 250.131544655141
##.OBSERVE NUCLEUS= ^1H
##.ACQUISITION MODE= SIMULTANEOUS (DQD)
##.ACQUISITION SCHEME= undefined
##.AVERAGES= 16
##.DIGITISER RES= 18
##SPECTROMETER/DATA SYSTEM= dpx250
##.PULSE SEQUENCE= zg30
##.SOLVENT NAME= DMSO
##.SHIFT REFERENCE= (INTERNAL, DMSO, 0, 16.522)
##AUDIT TRAIL= $$ (NUMBER, WHEN, WHO, WHERE, WHAT)
$$ ##TITLE= Audit trail, XWIN-NMR		Version 3.5
$$ ##JCAMPDX= 5.01
$$ ##ORIGIN= Bruker BioSpin GmbH
$$ ##OWNER= NMR
$$ C:\u/data/dgb/nmr/ADRS/7350/pdata/1/auditp.txt
$$ ##AUDIT TRAIL=  $$ (NUMBER, WHEN, WHO, WHERE, WHAT)
(   1,<2005-08-09 10:00:28.32 +100>,<MAYBRIDGE\NMR>,<NMR_250MHZ>,
      <created by zg, POWCHK disabled, PULCHK disabled
       configuration hash MD5:
       62 19 C7 07 E1 42 D1 B7 37 6C 3D D0 77 39 F9 E6
       data hash MD5: 64K
       9A 09 1B 93 3C 7D EE FF 77 74 8A D1 9A B8 56 76>)
(   2,<2005-08-09 10:00:39.84 +100>,<MAYBRIDGE\NMR>,<NMR_250MHZ>,
      <Start of raw data processing
       ef LB = 0.3 FT_mod = 6 PKNL = 1 SI = 32K 
       data hash MD5: 32K
       85 B1 72 2A BE 0F A4 40 DC E8 DD 91 2F 56 AD 00>)
(   3,<2005-08-09 10:00:41.75 +100>,<MAYBRIDGE\NMR>,<NMR_250MHZ>,
      <apk 
       data hash MD5: 32K
       CB 1B FC 99 DF DB E8 B6 74 AA D2 A8 07 AB A5 3B>)
(   4,<2005-08-09 10:00:42.45 +100>,<MAYBRIDGE\NMR>,<NMR_250MHZ>,
      <abs ABSG = 5 
       data hash MD5: 32K
       7D AF 11 91 B2 13 84 43 96 CD A7 24 D2 8B CA 56>)
$$ ##END=
$$ 
$$ hash MD5
$$ 19 C9 D2 FB C0 2A C9 EB B7 7A B4 66 3B FD 28 27
##$RELAX= 
##$RELAX= 
##$RELAX= 
##$RELAX= 
##$RELAX= 
##$RELAX= 
##$RELAX= 
$$ Bruker specific parameters
$$ --------------------------
##$DU= <C:\u>
##$EXPNO= 7350
##$NAME= <ADRS>
##$PROCNO= 1
##$TYPE= <nmr>
##$USER= <dgb>
##$AMP= (0..31)
100 100 100 100 100 100 100 100 100 100 100 100 100 100 100 100 100 100 
100 100 100 100 100 100 100 100 100 100 100 100 100 100 
##$AQSEQ= 0
##$AQ_mod= 3
##$AUNM= <au_zg>
##$AUTOPOS= <7 >
##$BF1= 250.13
##$BF2= 250.13
##$BF3= 250.13
##$BF4= 250.13
##$BF5= 500.13
##$BF6= 500.13
##$BF7= 500.13
##$BF8= 500.13
##$BYTORDA= 1
##$CFDGTYP= 0
##$CFRGTYP= 5
##$CHEMSTR= <none>
##$CNST= (0..31)
1 1 145 1 1 1 1 1 1 1 1 1 1 1 1 1 1 1 1 1 1 1 1 1 1 1 1 1 1 1 1 1 
##$CPDPRG= <>
##$CPDPRG1= <>
##$CPDPRG2= <>
##$CPDPRG3= <>
##$CPDPRG4= <mlev>
##$CPDPRG5= <mlev>
##$CPDPRG6= <mlev>
##$CPDPRG7= <mlev>
##$CPDPRG8= <mlev>
##$CPDPRGB= <>
##$CPDPRGT= <>
##$D= (0..31)
0 1 0 0 0 0 0 0 0 0.06 0 0 0 0 0 0 0.0002 0 0 0 0 0 0 0 0 0 0 0 0 0 0 
0 
##$DATE= 1123578027
##$DBL= (0..7)
120 120 120 120 120 120 120 120 
##$DBP= (0..7)
150 150 150 150 150 150 150 150 
##$DBP07= 0
##$DBPNAM0= <>
##$DBPNAM1= <>
##$DBPNAM2= <>
##$DBPNAM3= <>
$$ [...]
##$SUBNAM7= <"">
##$SUBNAM8= <"">
##$SUBNAM9= <"">
##$SW= 20.6930455092707
##$SWIBOX= (0..15)
0 0 3 0 0 0 0 0 0 0 0 0 0 0 0 0 
##$SW_h= 5175.983436853
##$TD= 65536
##$TD0= 1
##$TE= 295.16
##$TE2= 300
##$TE3= 300
##$TEG= 300
##$TL= (0..7)
0 120 120 120 120 120 120 120 
##$TP= (0..7)
150 150 150 150 150 150 150 150 
##$TP07= 0
##$TPNAME0= <>
##$TPNAME1= <>
##$TPNAME2= <>
##$TPNAME3= <>
##$TPNAME4= <>
##$TPNAME5= <>
##$TPNAME6= <>
##$TPNAME7= <>
##$TPOAL= (0..7)
0.5 0.5 0.5 0.5 0.5 0.5 0.5 0.5 
##$TPOFFS= (0..7)
0 0 0 0 0 0 0 0 
##$TUNHIN= 0
##$TUNHOUT= 0
##$TUNXOUT= 0
##$USERA1= <user>
##$USERA2= <user>
##$USERA3= <user>
##$USERA4= <user>
##$USERA5= <user>
##$V9= 5
##$VALIST= <valist>
##$VCLIST= <CCCCCCCCCCCCCCC>
##$VD= 0
##$VDLIST= <DDDDDDDDDDDDDDD>
##$VPLIST= <PPPPPPPPPPPPPPP>
##$VTLIST= <TTTTTTTTTTTTTTT>
##$WBST= 1024
##$WBSW= 4
##$XGAIN= (0..3)
0 0 0 0 
##$XL= 0
##$YL= 0
##$YMAX_a= 519038
##$YMIN_a= -399023
##$ZGOPTNS= <>
##$ZL1= 120
##$ZL2= 120
##$ZL3= 120
##$ZL4= 120
##$ABSF1= 16.522
##$ABSF2= -4.171173
##$ABSG= 5
##$ABSL= 3
##$ALPHA= 0
##$AQORDER= 0
##$ASSFAC= 0
##$ASSFACI= 0
##$ASSFACX= 0
##$ASSWID= 0
##$AUNMP= <proc_1d>
##$AZFE= 0.1
##$AZFW= 0.1
##$BCFW= 0
##$BC_mod= 0
##$BYTORDP= 0
##$COROFFS= 0
##$CY= 12.5
##$DATMOD= 1
##$DC= 0
##$DFILT= <>
##$DTYPP= 0
##$F1P= 14.0000005364418
##$F2P= -0.99999901652339
##$FCOR= 0.5
##$FTSIZE= 32768
##$FT_mod= 6
##$GAMMA= 0
##$GB= 0
##$INTBC= 1
##$INTSCL= 1
##$ISEN= 128
##$LB= 0.3
##$LEV0= 0
##$LPBIN= 0
##$MAXI= 10000
##$MC2= 0
##$MEAN= 0
##$ME_mod= 0
##$MI= 0
##$NCOEF= 0
##$NC_proc= -2
##$NLEV= 6
##$NOISF1= 0
##$NOISF2= 0
##$NSP= 0
##$NTH_PI= 0
##$NZP= 0
##$OFFSET= 16.522
##$PC= 1
##$PHC0= -87.28705
##$PHC1= -0.5584467
##$PH_mod= 1
##$PKNL= yes
##$PPARMOD= 0
##$PSCAL= 4
##$PSIGN= 0
##$REVERSE= no
##$SF= 250.13
##$SI= 32768
##$SIGF1= 0
##$SIGF2= 0
##$SINO= 400
##$SIOLD= 32768
##$SREGLST= <1H.DMSO>
##$SSB= 0
##$STSI= 32768
##$STSR= 0
##$SW_p= 5175.98343685301
##$SYMM= 0
##$S_DEV= 0
##$TDeff= 65536
##$TDoff= 0
##$TI= <Analysis number 999999
Compound Code 99
Book Reference 9
Project Code 9>
##$TILT= no
##$TM1= 0
##$TM2= 0
##$TOPLEV= 0
##$USERP1= <user>
##$USERP2= <user>
##$USERP3= <user>
##$USERP4= <user>
##$USERP5= <user>
##$WDW= 1
##$XDIM= 32768
##$YMAX_p= 279617939
##$YMIN_p= -211973
$$ End of Bruker specific parameters
$$ ---------------------------------
##NTUPLES= NMR SPECTRUM
##VAR_NAME=  FREQUENCY,     SPECTRUM/REAL,   SPECTRUM/IMAG
##SYMBOL=    X,             R,               I
##VAR_TYPE=  INDEPENDENT,   DEPENDENT,       DEPENDENT
##VAR_FORM=  AFFN,          ASDF,            ASDF
##VAR_DIM=   32768,         32768,           32768
##UNITS=     HZ,            ARBITRARY UNITS, ARBITRARY UNITS
##FACTOR=    0.157963299565203, 1,           1
##FIRST=     4132.6476996994, 0,             0
##LAST=      -1043.33573715361, 0,           0
##MIN=       -1043.33573715361, -211973,     0
##MAX=       4132.6476996994, 279617939,     0
$$ Real data points
##PAGE= N=1
##DATA TABLE= (X++(R..R)), XYDATA
$$ [...]
21987 2744 -7544 -11987 -8238 -7298 -10268 -10545 -9511 -7050 -1067 -1582 -5508 -13894 -21942 -18784 -20399
21972 -20399 -26252 -20199 -4326 -838 -2318 -7200 -16212 -10532 1702 2056 -6351 -8320 -7385 -4208
21958 -4208 1284 -984 883 -3454 -10750 -5636 -3615 -10498 -9397 -9131 155 4933 30 2108 -2727
21943 -2727 -4937 7010 9210 2978 -5868 -9968 -14517 -15320 -13087 -7564 -12894 -11891 -17780 -19164 -18508
21928 -18508 -10903 -7460 -4337 -3592 -2374 -1616 91 -4447 -8491 -12200 -7207 -4820 -2159 -17292 -23247
21913 -23247 -14850 -11529 -14117 -19210 -19136 -16392 -9864 2874 4164 6011 4183 -2351 -6577 -5514 -7000
21898 -7000 -5838 2596 -6784 -7901 -12323 -19597 -17555 -7077 4607 1103 -14891 -24747 -24290 -21188
21884 -21188 -19995 -16934 -11979 -13119 -16600 -16156 -15963 -16554 -16185 -12642 -9458 -13675 -21499 -19906 -10399
21869 -10399 -16583 -17676 -5655 3690 12457 8163 -6755 -13180 -9630 -10804 -17581 -14755 -16248 -13660
21855 -13660 -10198 -17686 -17751 -8989 -14935 -17440 -23588 -22806 -19560 -9610 -115 9312 4988 -3171 -27
21840 -27 -463 -435 -2910 4614 -125 -7139 -13620 -16902 -13382 -12302 -1310 1801 -1763 3811 -632 -12071
21824 -12071 -24717 -31384 -23162 -20918 -18272 -9299 4942 11172 3543 -2370 -1648 -8895 -21002 -12261
21810 -12261 1684 2571 -3283 -8834 -20893 -16316 -8344 1820 3796 -2374 -4870 -4068 -16175 -5883
21796 -5883 -3276 -5677 -6199 -2477 -256 5838 6069 11930 25051 25137 23784 29697 34890 30307 29919 22609
21780 22609 23345 25020 23420 21770 23557 26393 16426 11206 12312 14194 11369 12055 5124 -492 -1297
21765 -1297 -4051 -17495 -25353 -27392 -13895 -7876 -10384 -5976 -5266 -4771 -1999 -4603 -1734 5418 -5377
21750 -5377 -17547 -12176 3973 2126 2618 717 -8444 -7373 1330 14625 15420 11230 1764 -9008
21736 -9008 -9059 -10939 -10460 -8766 -9932 -12610 -11764 -12425 -15164 -16779 -15086 -5801 5069 -677 -11984
21721 -11984 -9063 -8441 -10477 -14773 -17153 -15247 -16165 -17765 -22241 -15343 -11339 -3161 -10251 -19143 -11173
21706 -11173 -6706 -3605 220 -3180 -8178 -10340 -10781 -14053 -12392 -8158 -3982 -4241 -5019 -5042 -6390 -4633
21690 -4633 -657 -5612 -3860 1775 4882 3088 5783 2448 -4414 -9661 -8487 -13684 -15972 -9849 234
21675 234 -960 -12160 -16214 -14125 -7251 -10510 -10890 -17060 -14823 -6340 4025 10611 23009 19621
21661 19621 9666 1218 -9862 -7730 180 7246 7837 12674 7396 -6541 -4238 7266 6444 3833
21647 3833 689 2892 -8303 -15971 -11336 -7112 -6636 -3735 -12250 -18601 -24717 -18199 -10616 -5055 -8860
21632 -8860 -3655 1151 -6685 -9299 -3503 -3575 -10393 -18664 -18058 -11237 -12718 -13980 -7891 -3851 9111
21617 9111 -2835 -8566 -780 5261 11201 2721 -5983 -10008 -11341 -13228 -11049 -13400 -11301 -8672
21603 -8672 -16308 -9161 -9212 -11203 -13957 -13705 -10543 -20373 -25222 -23942 -18269 -15586 -19993 -22430 -13746
21588 -13746 -8276 -9302 -15656 -15854 -13348 -22936 -17277 -4949 -14782 -22885 -11904 -9718 -18192 -22993
21574 -22993 -8490 -6534 -6922 -8919 -4270 -5543 -7829 -5242 -7749 -21223 -31350 -23942 -19772 -18808
21560 -18808 -14330 -12172 -15090 -17171 -13977 -17874 -16412 -10559 -2714 -6056 -13726 -5118 -937 -3586
21546 -3586 -1632 5809 4004 -8953 -7300 -10563 -14999 -14643 -10650 -7425 -11401 -11812 -12808 -21324 -28333
21531 -28333 -26239 -23203 -22254 -24467 -28514 -22882 -22046 -11129 -3814 -12596 -16153 -8766 -12774 -23326
21517 -23326 -16664 -13164 -15729 -7691 -4798 -5917 -3939 -10169 -10814 -12215 -19429 -26114 -17746 -7687
21503 -7687 -11392 -11829 -8835 -7365 -8807 -10185 -10250 -10139 -12831 -10894 -2485 466 -1391 -4790 -5009 -4235
21487 -4235 -13937 -14332 -14018 -13176 -4631 -4754 -5380 -5058 -7818 91 -2807 6199 16858 8338 6342 299
21471 299 6940 11643 10059 13836 13062 7924 6496 -1991 -6534 -8834 -14568 -6823 -2636 -5428 -7824
21456 -7824 -8553 -13021 -15335 -6372 -1233 -930 -4276 -4353 -3373 -6590 -5082 -2284 -5855 -4293 6661 11130
21440 11130 9054 3418 -6646 -4601 -1870 -2711 -981 -5139 -8530 -10010 -12712 -9687 -15098 -17384
21426 -17384 -19726 -18453 -13763 -8039 -6085 -3263 -93 4051 -5506 -16362 -15044 -12858 -17832 -7175
21412 -7175 -8392 -11332 -6631 -8676 -10318 -9714 -7320 -6675 -3836 -4607 -8838 -10775 -11219 -9958 -10940 -18878
21396 -18878 -32443 -35537 -28673 -24957 -29291 -22718 -15899 -10418 -6462 -755 5610 -5479 -19072 -26137
21382 -26137 -25555 -21349 -21380 -17430 -13605 -14682 -10734 -6907 -1477 -8708 -15317 -9570 -12743 -17448 -12802
21367 -12802 -13619 -12313 -17175 -15452 -22432 -22790 -16178 -13622 -16210 -16603 -16442 -15099 -9460 -2036 5305
21352 5305 1142 -7613 -15214 -23408 -27192 -32846 -28972 -17322 -15019 -20081 -17855 -8665 -10276 -14670
21338 -14670 -7037 -1795 -2300 1303 3925 -1410 -11746 -12982 -15031 -17748 -13786 -3730 8903 20487
21324 20487 27238 17543 15532 12841 13247 7855 2511 3283 6162 14477 15359 10947 12345 -394 -213
21309 -213 2961 4870 -4215 -14637 -3106 3121 6591 5158 -3512 -3984 -3333 -980 -50 -7741 -8814
21294 -8814 -6335 -12423 -12336 -8414 -7008 -18877 -17367 -6872 -16083 -11569 -14206 -19567 -9954 -2814 -1561
21279 -1561 -5473 -7192 -1119 -77 2778 -4631 -4365 4121 8044 3797 -2571 -1695 1918 -1165 -7996
21264 -7996 -6139 -1334 990 2382 3404 -259 2730 -2075 -1542 4407 1085 -765 -1223 -150 8171
21249 8171 12609 12078 15612 16093 26079 35090 35198 32800 34239 52358 63893 59122 58790 74291 81639
21234 81639 78194 77294 84993 94115 100928 99511 94801 102336 114133 132494 142998 158315 170354
21221 170354 186839 197259 219884 256059 297286 346922 402470 473859 580356 734160 934272
21210 934272 1175738 1457127 1804438 2212561 2628786 2994097 3314047 3644066 3971479 4207252
21200 4207252 4305590 4296271 4278349 4308852 4320410 4283400 4262731 4317725 4368135 4370927 4388350 4451423
21188 4451423 4460497 4344174 4105059 3820136 3529364 3198153 2785421 2341281 1949993 1608823
21178 1608823 1325135 1063670 843799 679053 568951 478779 403461 357471 327468 295813
21168 295813 263055 244128 225315 209582 196783 178954 158659 144876 132125 122614 120861 117623
21156 117623 114135 106676 102538 102175 97497 90827 85696 83953 76587 72216 58979 51105 53909 55227
21142 55227 49221 59316 61924 55966 48744 41795 39047 36282 31774 37312 33144 31285 32464 28449
21128 28449 22048 19579 27128 27790 26042 26074 22951 21059 14852 13120 17288 23026 20845 11869 3886
21113 3886 1791 -853 -795 790 -841 -2879 1886 2762 1764 8935 9987 700 3334 2029 -7419 -7203
21097 -7203 -4606 3325 3798 1140 2412 5131 -4466 -10551 -5615 10446 17392 11424 5941 3832 -1186
21082 -1186 -4975 -980 -611 6615 17398 14687 25976 20037 10944 5541 -235 -4665 -4022 -514 278
21067 278 -1873 2461 -2888 -5618 -192 -4125 -5926 -1827 5116 6894 2799 -3047 -6137 -8190 -10153
21052 -10153 -2991 3251 788 4095 6556 7786 14122 16235 10570 6643 9857 11882 9099 11522
21038 11522 7982 5507 8126 13507 6006 3403 5907 3205 -121 -1737 -3430 -4269 -5658 -1201 852
21023 852 1797 -4468 -11969 -7100 6031 4028 -2049 3036 3503 4195 5857 4568 10431 5992 7796
21008 7796 11509 -456 -986 1506 1226 1886 -270 -994 6064 1289 -8795 -14306 -9552 62 5256
20993 5256 620 -4984 -5498 -9652 -20350 -17974 -8467 6434 6330 -3643 -7130 4746 10010 4878
20979 4878 4317 3066 -7452 -2410 4085 -595 -8205 -3236 -3391 -3556 -1464 -1446 -109 -235 150 12473
20963 12473 7150 -3486 -7822 -11982 -16530 -10514 247 -1376 -6427 45 1006 -6678 -7348 -14082
20949 -14082 -14745 -16138 -16251 -16687 -16909 -13448 -10531 -17050 -12369 -8502 -7010 -5325 -6804 1430 195
20934 195 -2210 -3480 -4224 -11524 -14474 -10508 -4403 1162 -7017 -8453 -8068 -11490 -14233 -16774 -9161
20919 -9161 296 -279 -8219 -13823 -9651 -16329 -20790 -22625 -22451 -18476 -18501 -18629 -11050 -9213 -6799 -9227
20903 -9227 -5391 -5920 -7561 -11559 -1049 2894 -2752 -5335 -6054 -13313 -15626 -15803 -19688 -18734 -19657 -16574
20887 -16574 -9810 -14563 -15182 -8912 1763 866 -1842 -5913 -7996 -5464 -3292 -8214 -6863 -2523 -8113
20872 -8113 -13829 -10833 -16571 -24076 -22185 -19800 -20494 -19279 -19496 -14657 -10971 -14335 -13714 -14368 -21837 -27133
20856 -27133 -25249 -19151 -7910 1764 -3695 -1019 -7533 -9389 -4442 -620 -2166 -1846 -9022 -11912
20842 -11912 -8823 1186 -9666 -14718 -6446 -973 -9226 -940 2401 -1098 -6063 -16428 -30132
20829 -30132 -29834 -23601 -15170 -782 4762 1637 -5100 -6669 -8723 -9953 -10040 -10346 -10342 -8469 -6059 -3503
20813 -3503 -1247 -355 -4661 -4365 -2704 856 -3474 -265 519 -4217 -5300 -118 -1449 -1663 -9423 -2089
20797 -2089 14183 14057 7532 6275 10949 8976 3939 4947 3156 9795 8540 -5084 -12618 -6910
20783 -6910 -3185 -341 -1873 -2661 -1161 -3657 -9420 -11796 -5462 -1067 -5678 -11799 -15311 -7963 -1731
20768 -1731 -5174 -2279 -8978 -12218 -2221 -5584 -9486 -7995 -2551 994 -5790 -10866 -15775 -8281 -1117
20753 -1117 6429 1487 -4084 -947 -3644 -3431 2295 7589 -1825 -7352 1095 8100 6034 10343 9929
20738 9929 5371 3364 -1729 -4109 -4856 -8166 -14993 -16824 -14267 -19885 -24097 -23327 -8178 3647 1428
20723 1428 -2941 868 -3920 -6616 -5956 -2999 -769 3810 15367 10665 -12 6135 8962 4069
20709 4069 9777 7528 7413 363 -536 10636 11577 875 -1965 -2638 -9650 -13874 -2000 -5383 -13290
20694 -13290 -15748 -10240 -5278 -8832 543 2298 -2245 -3517 -3472 4398 704 1924 2664 2676 -4521 -1159
20678 -1159 -3207 5512 5271 -1074 -5831 -3895 -2000 2419 4363 -895 -6886 -4431 2587 5748 9873
20663 9873 13524 18022 16124 3970 -2940 -3106 -4795 -6125 -9236 -9756 -12791 -10837 -8238 -9558 -6836
20648 -6836 -9672 -13975 -10653 -5023 4950 5047 6911 9748 6799 16578 19884 17198 14975 13407 13796
20633 13796 7566 -1719 982 -1961 -12261 -11273 -3026 5382 9578 9627 11100 13048 16396 18813 15773
20618 15773 17671 12507 11530 15302 13988 9892 2723 -1604 3994 20215 18751 19038 24289 19398 21165
20603 21165 21337 15487 18639 21438 20574 22722 30075 31263 22916 16527 21144 17688 11835 9941 2088
20588 2088 -7976 -5080 1077 -543 -1881 -2343 9081 8581 1664 -623 4774 -375 -4349 1767 9826
20573 9826 2836 -4322 -15836 -13473 -7755 3424 5026 2918 91 -1603 -2700 5149 8542 5574
20559 5574 5066 -3995 1859 -3376 -12531 -11417 -13369 -16227 -14409 -16498 -21440 -15487 -14006 -24345 -20729
20544 -20729 -12505 -14764 -13700 -9486 -11196 -3316 -5031 -2945 -99 -3781 -740 -4590 -5708 -8799
20530 -8799 -922 9029 8553 3051 -3300 -5617 -9628 -11663 -14754 -12454 -7459 -9472 -927 8304 -489
20515 -489 -4552 -8265 -9873 -13349 -4216 2160 8952 9352 2046 -846 1924 2071 6244 10817 20288
20500 20288 19664 7234 6280 11793 17605 17302 12968 10838 10021 13895 12456 10140 16617 36061 46080
20485 46080 52640 58144 67564 91749 117777 128488 136318 153224 161302 178703 171975 165579 156811
20472 156811 143765 127799 117534 100890 83723 71277 64930 52550 48641 40369 24570 16249
20460 16249 29205 31831 22815 7417 -5586 -4755 1745 5058 5163 8684 21113 28893 11443 8944
20446 8944 19464 22151 11700 2723 7192 12723 23951 30239 28988 33847 46598 61082 67808
20433 67808 77876 93379 107383 126165 138460 140751 157121 166715 169530 172004 175218 178462 166981
20420 166981 149918 141624 126976 106793 93062 81061 59957 41304 36180 30669 20238 12306
20408 12306 -571 -6151 8746 12938 20081 25319 20765 13355 8959 11734 1204 -1529 867 11055
20394 11055 6858 -907 4824 9102 388 -5732 -7853 -9891 -8471 -3394 -1372 -1 1482 -6863
20380 -6863 -9907 691 3226 -1628 -3300 -9518 -11634 -17414 -19764 -13697 -8450 -9789 -3777 1661
20366 1661 -2832 -8862 -578 -5558 -4501 -11008 -16679 -12995 -10180 -8807 -7639 -4281 -401 -2132 -999
20351 -999 1623 4881 -654 -2453 -2613 -4551 -14839 -15319 -13992 -22600 -24282 -11313 3920 -5954 -9316
20336 -9316 -12051 -15636 -10419 719 3354 7478 11562 4142 -2756 -6825 -6012 106 2512 6835 3633
20321 3633 -7382 -11137 -9819 -8475 2042 3933 2142 618 -2849 -2667 -3329 -861 1352 2588 2015
20306 2015 -6202 -18308 -16122 -15465 -18025 -22937 -20147 -14367 -10386 -11231 -19244 -18671 -21080 -24368 -13417
20291 -13417 1937 3257 -7168 -15711 -13830 -11363 -14851 -12269 -5412 -888 12848 18018 11381 15940
20277 15940 10244 11516 7809 4552 9573 9370 11427 10607 15855 23725 19859 12316 6530 -3422 -299
20262 -299 616 -701 4572 16930 19071 16613 4906 -4602 -6752 -1691 -947 2758 1355 5263 9296
20247 9296 11412 144 -9878 -5437 -5459 1505 138 537 3513 7250 10190 12053 10744 1260 -4344
20232 -4344 -6899 -661 7593 10425 14312 10372 -1788 638 5973 -1149 -1172 -7299 1678 10856 9415
20217 9415 12427 9891 7076 20357 24543 18325 19706 17458 11354 7658 17740 23770 17915 19256
20203 19256 27436 27824 16185 6723 6538 6442 16907 26513 24793 33466 40917 45044 50424 57236 59243
20188 59243 61601 60516 60753 63866 70438 76794 73502 68124 65194 70882 85180 81218 81923 79483 85082
20173 85082 94315 102011 104727 108071 115818 134333 151549 162461 179684 201648 235226 284653 350195
20160 350195 438135 550789 705629 892288 1094003 1321821 1587575 1853690 2038001 2101485
20150 2101485 2136107 2218515 2293213 2246412 2104263 1999240 1971408 1986282 2009117 2069237 2173991
20139 2173991 2248436 2234562 2177117 2154449 2134633 2019023 1787274 1526237 1320605 1149333
20129 1149333 975941 800568 651467 537143 461796 406342 362198 329877 300321 285920
20119 285920 280165 276626 269998 266412 266384 275947 294309 327229 378324 430983 493982 592276 737354
20106 737354 922090 1145413 1394139 1673020 1980281 2252420 2398390 2430893 2472977 2541525
20096 2541525 2554543 2439340 2286173 2202583 2213268 2262074 2322860 2427201 2554797 2607382
20086 2607382 2545932 2476998 2454962 2379223 2160806 1846531 1563699 1356128 1166581 967577
20076 967577 779090 623278 518636 447074 400448 363325 331524 324808 320635 315138 301675
20065 301675 287372 280300 271719 263287 240916 217921 204873 186527 174600 161868 140035 129779
20053 129779 116417 105275 102137 90765 78980 79104 86393 87322 81144 74971 75316 76443 78792 76298
20039 76298 78533 83343 84188 76667 73489 78719 79232 76342 73910 63852 65527 65188 63625 75677 88741
20024 88741 93752 111680 137287 145937 158196 178721 197154 217109 235709 251890 253696 244998
20012 244998 243584 238201 226802 224270 223173 226070 220561 210938 198763 186707 186369 189357 185546 175377
19998 175377 173501 184085 197174 189973 190989 203302 209078 220381 226312 232872 241087 249168 260708
19985 260708 276070 290485 312024 329135 348515 381206 412536 442721 483521 523165 568770
19974 568770 618251 677975 746214 806561 871244 956787 1054920 1157517 1264297 1382077 1505059
19963 1505059 1654951 1838321 2059052 2329048 2665636 3105433 3709763 4525705 5611402
19954 5611402 7049635 8874651 11115610 13777105 16831957 20202793 23702103 26942332
19946 26942332 29610314 31658685 33050888 33662035 33395839 32243860 30380911 27869936
19938 27869936 24826431 21566048 18404703 15498802 12852652 10490605 8476814 6861098
19930 6861098 5622263 4691155 4004839 3501141 3128144 2862534 2665908 2523052 2417149
19921 2417149 2332924 2288983 2270494 2264783 2264393 2278861 2313340 2367628 2442772 2542426 2687942 2877833
19909 2877833 3137144 3474861 3949002 4597068 5483339 6680048 8278335 10352611 12925102
19900 12925102 15990626 19501654 23371582 27351275 31015742 33995037 36225414 37633354
19892 37633354 38058844 37453341 35897946 33567162 30557196 27040827 23363283 19843941
19884 19843941 16642481 13748285 11174997 9000253 7241755 5871454 4832761 4057276
19876 4057276 3472234 3023375 2676247 2407444 2190807 2003617 1824803 1671849 1542368
19867 1542368 1419562 1310184 1201149 1104671 1020303 933407 857983 800743 746019 689659 632221
19856 632221 591230 560208 539696 524335 493854 461259 442081 426317 414614 404682 386954 368899
19844 368899 350275 337214 325341 316407 310791 295828 280679 278764 271702 256978 243899 242963 238939
19831 238939 235082 235361 224085 210278 199767 178504 166536 171732 177336 170234 153473 147094 136824
19818 136824 129737 120798 114661 112584 109101 109197 111448 105043 99707 104767 111283 109360 109252 108652 100033
19803 100033 92173 83707 80273 82681 81203 78214 80755 90976 97904 96914 104927 104652 100919 100064 96449
19788 96449 88686 95726 100214 105131 105756 107554 101754 107661 97387 85314 85184 86258 81681 71078
19774 71078 61549 60444 61332 54491 56120 43442 31697 21053 24054 35264 40922 42009 38729 33848
19760 33848 39644 47055 51354 60166 66266 56596 55935 61538 61534 58223 49988 50724 53707 52299 47041 60781
19744 60781 75670 79812 84082 83974 80350 73157 75806 78829 80128 84621 91926 95795 100375 94068
19730 94068 74996 77152 80473 75271 76578 68052 55484 54634 51746 49692 60006 64913 64532 58021
19716 58021 52556 48201 43859 44889 51626 53804 51507 42430 44562 46160 44464 46878 56546 64950
19702 64950 55328 47022 50988 51341 51702 43734 47413 44676 45264 48354 44951 43979 44694 51698 55950 40972
19686 40972 33765 39443 37252 33152 38737 45524 56602 50723 46974 37307 40463 55868 54711 52885
19672 52885 50261 48479 51924 50834 43960 54274 51697 53190 48285 43270 40786 37341 31855 38300
19658 38300 32730 42103 47194 43480 37828 40074 39435 35084 31837 35463 31647 25251 30582 42147
19644 42147 55640 59368 54948 36996 29799 24243 22132 24376 47040 49983 41691 36272 38382 33798
19630 33798 31010 26949 31340 39355 34244 28893 40148 43018 41596 43805 41230 35000 35765 42560
19616 42560 41707 43209 33992 38689 51276 45275 42273 49116 50805 53632 54485 49946 46701 48407 51544
19601 51544 45368 46014 52080 53449 49825 41026 39798 40142 35875 35456 41293 44358 54644 56215 58370
19586 58370 70055 76091 72257 80157 91540 100043 114737 131355 145026 161328 193758 220878
19574 220878 251236 274953 276732 267847 259759 248009 228208 209348 187309 153578 126868 107353
19562 107353 87690 80696 82297 71851 56241 51398 47909 43184 39307 38327 42329 46986 49054 53799
19548 53799 58484 52736 54941 55328 47620 43028 40352 43625 45755 38307 34490 41589 44212 47623 48688
19533 48688 51840 55918 68721 78353 94048 114321 130538 149017 164458 187523 199991 212011
19521 212011 222148 226904 221746 194767 176161 164817 146781 128277 113544 104079 92360 80145
19509 80145 67450 60241 54746 50920 47569 49321 57429 47787 39197 42591 36629 33632 39014 45023
19495 45023 48138 46656 54143 60430 59418 56887 54559 48978 51430 43763 39608 35519 37362 35865
19481 35865 37647 31714 30105 29795 28702 31886 33473 36171 40637 51416 51146 55122 59889 62894 61433
19466 61433 58240 62083 59443 55514 52515 49280 45401 54412 61941 65030 64912 57019 58450 52288 43810
19451 43810 39409 29982 30065 35725 46006 54469 62293 55434 53246 54443 49596 42570 45709 41784 40902
19436 40902 53094 48241 40492 35320 31575 31948 44201 45490 51414 60757 56836 53739 44682 45119
19422 45119 63382 73095 78724 73775 67385 75966 94709 96561 111046 124197 147873 171421 189698
19409 189698 204533 214581 217592 220596 225702 229449 217946 212943 211548 205018 190654 178698 167012
19396 167012 155850 157306 159508 158253 161037 174539 187629 198764 219141 233649 243491 249377 284040
19383 284040 339250 394475 463842 562242 695688 900859 1200784 1635978 2247266 3010663
19373 3010663 3803455 4419920 4706331 4745774 4731434 4787614 4856573 4711354 4232385 3514457
19363 3514457 2753111 2117278 1648701 1314328 1071170 906232 787574 699475 627928 571666
19353 571666 521978 480155 441500 414234 387819 349173 322159 305968 294689 273263 248677
19342 248677 232769 221956 221023 224670 222158 236067 251668 264900 265235 283329 310551 346849 399651
19329 399651 468207 570658 712693 910271 1206579 1649411 2227888 2914162 3583218 4052099
19319 4052099 4225124 4185840 4136549 4180358 4197924 3994700 3486966 2792715 2104722 1558081
19309 1558081 1161038 883880 693901 556442 455559 380748 335337 307289 283458 257719
19299 257719 228626 205313 187819 170927 152531 140575 131156 114906 111338 102040 97429 91911
19287 91911 84016 86483 88968 83805 83478 85070 90961 98825 93567 84744 89191 86812 87193 91499 93302
19272 93302 95319 96397 92810 92152 86467 79668 71834 67109 60950 56291 55545 53798 54018 49367 40903
19257 40903 50031 55293 50157 46364 37440 37821 35917 36383 37195 38821 28225 12659 19122 28687 31796
19242 31796 36756 38509 42834 41453 36604 27718 24110 41496 54172 61479 54100 50291 52257 63489
19228 63489 68678 74932 74638 69736 67458 69390 76454 85716 87075 95578 108517 110942 115987 133219
19214 133219 139537 131137 121384 123619 127528 130325 119556 114709 117424 108250 93002 81327 72943
19201 72943 62786 48318 42995 40009 34608 34923 27490 23096 12483 6306 3998 -3219 -1147 5214
19187 5214 6334 -4116 -2878 3132 4504 10077 23554 33137 32860 28799 30172 31818 36613 39202
19173 39202 38900 37187 39223 44069 48744 63544 88591 105410 114057 117873 138842 171474 198449
19160 198449 213557 236846 260221 273779 283428 296442 294004 278381 261074 244037 229638 200745
19148 200745 171574 157722 150978 146876 128181 112414 105100 93769 91769 90973 89997 93931 96018
19135 96018 95886 90653 93569 101318 103110 101014 89373 83371 94863 103339 101927 100201 93686 91784
19121 91784 90421 93805 91653 92087 96309 103618 110270 110482 114038 136585 153664 176524 200580 220209
19107 220209 242910 263930 286576 293114 302593 312552 319358 328647 332468 330950 347098 361530 373838
19094 373838 399975 439033 468488 498579 537087 560594 554908 553082 557732 558956 565008 565791 553488
19081 553488 523384 499208 481804 467979 446759 431604 430110 434601 442520 449319 455895 460646 472907
19068 472907 485509 507699 534534 554384 580060 621641 669199 721459 788583 871949 962144
19057 962144 1059524 1178523 1302252 1435705 1576891 1742314 1934691 2154584 2415433 2755201
19047 2755201 3216561 3830213 4653238 5800615 7408896 9614339 12551484 16316436 20883894
19038 20883894 26120020 31722180 37089494 41401962 44128600 45266318 44950204 43049959
19030 43049959 39445824 34535104 29107234 23859041 19142957 15117018 11859275 9324619
19022 9324619 7419918 6009548 4964876 4193949 3624083 3189888 2856097 2604308 2411037
19013 2411037 2262597 2136719 2030547 1935172 1870591 1835464 1814892 1812044 1837343 1883650 1940409
19002 1940409 2008095 2090928 2204790 2368513 2580207 2854413 3225393 3739734 4457259 5455218
18992 5455218 6860593 8807177 11417618 14758661 18812675 23466042 28439585 33238058
18984 33238058 37175143 39648829 40575625 40175516 38433981 35204596 30729171 25756350
18976 25756350 20967205 16692389 13071077 10151690 7908876 6234440 5000402 4088701
18968 4088701 3415400 2923757 2548123 2253732 2019542 1824542 1651926 1517023 1404484
18959 1404484 1292788 1183254 1081342 988665 893500 817885 764860 706715 654306 607007 580611
18948 580611 545671 514776 491889 474908 452570 425612 405950 386652 372840 362076 356144 345428
18936 345428 335967 323105 315331 306046 297700 287253 276712 263144 249083 243977 241756 239314 235318
18923 235318 219545 211342 205071 196668 206049 203939 187225 182648 177186 160648 145476 125440 110677
18910 110677 113479 113870 101639 101034 101676 108500 117575 122442 117916 116505 115882 108341 112131 109640 106074
18895 106074 105854 97305 91527 95381 90998 86977 91768 89675 86687 88097 87819 90871 96598 90453 90872
18880 90872 96870 102357 103350 103579 100909 96821 94810 95445 99645 102224 104196 99653 96486 92976 79325
18865 79325 73815 64379 45972 32042 21290 15011 15265 13289 8522 1192 4136 10353 26213 31950
18851 31950 33040 36343 47779 52025 45140 54236 57137 55302 52684 47694 41500 49403 54326 63512
18837 63512 68835 59543 57196 64479 60682 63013 68100 76517 82550 88866 89246 90414 89147 93436 96635
18822 96635 92318 91587 84423 81709 81493 85486 82146 73898 65190 61024 64078 62022 53708 42346 37899
18807 37899 36904 40131 42484 34467 31992 36144 33177 37229 36729 27354 26053 23474 26351 31963 31049
18792 31049 38858 47318 51579 50581 53833 53712 52703 41225 29615 33369 43291 51260 57063 59853
18778 59853 48224 54891 55596 49860 54217 62519 58546 59185 56229 57508 61149 61563 61513 59343 54139
18763 54139 51145 51470 47920 55454 50905 37825 34902 35351 33098 33108 36142 46998 42731 36441 32955
18748 32955 35236 36311 26082 23630 22824 25480 28220 26654 27379 27336 29390 27255 26398 30067 29047
18733 29047 28050 36771 44363 33933 30984 29117 21486 25072 22579 14231 15126 23631 28790 22383 21286
18718 21286 33020 41562 39887 34521 36775 47153 51864 52688 44821 38504 32640 24712 22645 15159
18704 15159 10357 11806 26231 36725 44991 41934 36627 41367 36742 25883 22343 23069 31454 30531
18690 30531 25060 31448 32689 27718 19399 15682 22230 33152 35372 30071 31389 32924 26363 27574
18676 27574 24524 22541 22589 24329 28915 35772 30032 25603 23422 25539 22033 20282 17977 24006 22499
18661 22499 19880 14490 8297 10437 21623 22120 18134 21974 18291 11594 10666 7235 1310 3727 8713
18646 8713 14140 10580 14287 18971 20351 20653 18515 17295 14814 11370 17738 20180 20481 12983 17458
18631 17458 24806 21194 10733 18125 25501 22016 15665 6687 -108 6584 7290 11144 18517 24510
18617 24510 26531 18380 13552 12059 14323 26425 23418 14747 14559 17261 14077 11714 17854 22994
18603 22994 21563 15629 9233 12158 25778 29805 22205 9027 6081 332 -7647 -1459 5364 11273
18589 11273 19213 16513 12050 18998 13414 8408 15308 17023 13436 19183 26317 20244 7602 8490
18575 8490 28199 38251 42447 36650 29678 20949 26492 29883 29632 32649 26122 14407 16659 19668
18561 19668 16267 7087 6211 7922 11412 12770 13724 5071 13072 13582 9463 19246 24424 29353 25336
18546 25336 17749 8147 5173 9554 9765 16570 13486 9524 8441 16016 18356 17617 15151 9579 19045
18531 19045 19743 19339 16839 12374 12031 9501 3389 7367 4522 338 5139 7724 4310 6909 8222
18516 8222 10755 10560 14115 17866 15014 17902 21499 12192 13555 17521 25300 33630 43756 37642 35209
18501 35209 42772 45052 43355 47874 61090 69192 82539 111002 131284 155914 184617 202862 208020
18488 208020 218667 229518 230032 209862 193877 176437 151217 126459 99679 82241 77550 71407
18476 71407 63298 57474 44792 38863 40619 44814 41555 44319 35033 37954 29641 14131 12984 12858
18462 12858 7313 11747 19993 34783 35517 36713 30408 25672 11187 13044 15690 19807 28818 27713
18448 27713 26533 33904 52709 73092 89644 98491 111019 136498 163508 187377 195990 204155 204863
18435 204863 197123 184779 174275 151665 132520 109035 88177 67493 56846 49015 45505 36921
18423 36921 36644 32988 30405 35666 34150 23393 9911 7344 11684 6892 7027 12373 20529 19900 20684
18408 20684 22797 16222 12216 7817 2499 5615 11086 14583 8949 7437 5312 5197 1467 3366 9161
18393 9161 5590 2562 -2314 2172 6042 10099 14311 7614 10408 12038 6605 11744 14203 26027
18379 26027 15602 7644 13511 21931 20867 24919 21975 24263 29226 13105 4199 10912 10704 12050
18365 12050 5796 157 5783 4312 3643 5760 14796 15384 7620 7128 8561 5717 -117 2313 3403
18350 3403 1627 713 4627 13637 8022 3256 7235 7896 7758 10379 13452 10528 16382 20489 28235
18335 28235 25877 22108 25851 26088 14436 7843 8186 4863 21134 33317 34216 30971 34194 34448 35722
18320 35722 34023 25220 19023 12700 14164 11732 4802 -3382 4953 10391 11319 9741 5511 7422 9085
18305 9085 7101 6145 2178 -3290 -7799 -5568 -2719 -7810 -5161 -1533 1902 6677 6947 -3557 -18800
18290 -18800 -10724 -1422 58 1297 -718 5495 13606 16756 22813 20143 15632 7239 12345 21590
18276 21590 20678 16163 16592 18058 17791 22529 29739 26264 25525 12405 6122 5719 9355 12873 15470
18261 15470 16358 22443 18175 27350 31602 27443 20327 14117 17673 20558 18043 15683 9886 7162 7980
18246 7980 -1357 -6172 -1187 -3783 -3534 5588 6413 4558 1190 4237 4085 -2876 -9947 -4344 -8148
18231 -8148 -3339 7888 3031 1321 5858 4231 6218 10532 13071 1940 4152 12995 6207 -10337
18217 -10337 -13560 -3913 3559 2926 3586 -1240 1123 -1650 -12362 1749 18923 22053 18749 7832
18203 7832 -8001 -1507 4888 3403 14247 15373 -526 5997 16569 15623 13309 9770 7655 3391
18189 3391 172 -554 14033 29563 29207 19875 26702 29242 20729 17694 8824 8827 11612 11088 4636 6853
18173 6853 18891 10962 4572 8629 14034 4374 2175 6520 10436 12025 10137 8333 14184 16367
18159 16367 14073 13025 10980 14291 13664 8613 11142 3865 9478 12244 13247 11716 12014 21498 21943
18144 21943 24668 24123 27366 20390 18314 17925 16531 12817 21434 26589 28165 27128 29101 29957 29153
18129 29153 22601 18750 22721 26416 17650 9550 988 -6837 -3893 930 299 1688 9968 15973 8784
18114 8784 7576 19103 19221 18272 16497 14887 13896 18966 18160 13974 15945 20797 25701 27272 13896
18099 13896 8418 10243 8719 3847 -155 4987 -2586 -4747 12477 10601 11114 18522 13946 5239
18085 5239 64 5941 4970 6304 6598 2377 1816 5877 2340 -4149 -4091 8280 16796 19733 22608 18730
18069 18730 16198 19802 19198 15904 13029 18436 28228 34193 31876 27446 21379 14864 22088 18708 10036
18054 10036 11995 24117 26233 16220 11061 15887 5690 1480 2672 4034 5648 -5232 -12177
18041 -12177 -16015 -9437 2979 4146 6009 1922 2040 -544 1382 7739 1554 3974 12978 14128
18027 14128 8941 11047 11769 14543 17747 8847 -5864 -14706 -4925 11709 19700 18740 19996 18357
18013 18357 6878 7686 13172 12808 20135 12244 10354 17956 31687 34830 37488 37399 44472 47361 55911
17998 55911 61863 67325 76111 81466 85527 90875 94480 98306 106381 108316 115777 117027 109240 112139
17984 112139 115927 115107 117915 118038 122251 119352 109115 102650 96672 92095 91903 84985 74379 61779
17970 61779 56634 51129 49081 58524 58592 70269 75068 77358 84867 82888 83856 81598 79373 71781 65123
17955 65123 71599 75457 66492 63735 64058 52726 41811 38586 40465 48231 47739 44120 39196 28537
17941 28537 29923 27017 24745 19957 15466 11723 9829 8889 15215 14096 20866 23984 22777 25551 27805
17926 27805 20569 19176 19737 18376 22482 24864 29617 42086 54536 59894 54645 46151 40200 40403
17912 40403 52603 63710 69972 67501 74430 76172 78551 78341 72342 74738 72998 72137 67493 60661
17898 60661 61594 53219 53478 58438 60329 51413 44981 48428 41848 41934 47446 40016 29479 37594 45832
17883 45832 46421 50713 62152 68047 74776 99774 127840 151239 177683 209471 250371 292994 335540
17870 335540 367732 394628 413853 439318 451045 450998 455303 457891 454040 449420 462972 465040 462966
17857 462966 458737 449193 440769 423727 396995 375122 344652 301103 262862 226148 190940 154161
17845 154161 124059 110245 97143 77160 60771 54005 45842 36118 31834 25341 29291 40253 41041
17832 41041 33798 27968 17919 20183 19508 22474 28989 28026 15022 10247 6697 3255 8635 12034
17818 12034 12644 8930 11035 12883 11171 5678 5143 15899 14875 8792 8983 1039 1481 -3608 -4317
17803 -4317 9182 7684 4882 11550 13930 20976 21310 13838 9379 9009 17139 12311 4388 5612 3933
17788 3933 -2992 -1503 -1981 -2295 8696 7050 5849 4980 13912 20500 27438 22305 14385 12543 10179
17773 10179 4692 9769 5845 -2198 5041 -613 -2908 -5201 2739 2866 1591 4071 5813 -1190 -7191
17758 -7191 995 5971 -1285 -6892 -4966 4108 6842 6789 -9539 -19297 -20644 -20500 -7760 -4738 -12565
17743 -12565 -5192 224 -10620 -15590 -4225 1936 -2192 -4997 -4860 2395 14790 11847 6932 10963
17729 10963 15702 10772 7170 4512 -6 4173 4267 -3188 2922 7063 8541 4126 -819 3875 5363
17714 5363 13311 17956 21028 21204 12207 4239 5784 12486 14661 13321 8553 2954 -4134 -5159 -287
17699 -287 2339 -1118 125 1205 2146 6180 8907 5823 7461 15269 22731 21946 22343 31434 36549 28534
17683 28534 19336 11766 14090 12439 11451 9629 10591 8218 9504 2133 -322 -4398 3591 2523 -2950
17668 -2950 -12018 -3641 1016 -3948 -10980 -9862 -9111 -5196 3521 2775 2267 1560 4823 1737 3998 1092
17652 1092 -1662 2807 -2375 555 3445 4655 -517 302 5257 7493 15813 3850 2780 2339 -6073
17637 -6073 -137 8290 16961 20974 14631 5830 -2292 -3142 553 6314 11664 9494 256 -7200 -1464
17622 -1464 9166 9321 4117 1273 2002 638 -8058 -15461 -18418 -10129 -16975 -10478 -1715 3489 1862
17607 1862 -5940 -9091 -8964 -8488 -5949 988 7261 7243 3289 -2658 -10877 -5089 4302 965 817 -4917
17591 -4917 -14694 -11595 -1230 3218 4631 5052 2934 4801 3750 -4855 -4097 5018 10489 7032 823
17576 823 6739 10626 1445 6942 18769 20447 22572 13693 8276 12902 11627 7659 8172 11911 16228
17561 16228 13151 12705 15610 7982 9959 8482 13280 18761 16434 14102 10458 14936 13756 18761 25511
17546 25511 25532 18959 11537 6435 6232 9129 13056 15672 14030 12639 11949 9598 3125 -4240 -7433
17531 -7433 -9493 -10033 -14900 -18184 -13818 -7402 -6108 -15022 -13903 -8647 -11046 -6390 1492 1981 -6566
17516 -6566 -11528 -5812 -8530 -6959 8349 13944 6412 6646 6180 9445 3456 -1821 4031 6845 6726
17501 6726 15575 17332 9396 8192 4925 6870 15310 15901 12161 6322 11422 3600 -6104 -6971 -4508
17486 -4508 -4510 -8399 -11378 -14509 -1056 5044 5905 8380 10256 8352 2844 -4360 -8893 -1643 2102
17471 2102 -6459 -11932 -11572 -9220 -9672 -5780 -2307 -7525 -12778 -12514 -15372 -22357 -18029 -9720 -7385
17456 -7385 -864 -4695 -3959 6651 15322 13973 9286 5902 7207 -4323 -13125 -8674 -6043 -3270
17442 -3270 472 -2318 -424 -1664 -7294 -8627 -4987 -1776 -1256 -3370 -2695 -4428 -12172 -10603 605
17427 605 -251 -4574 8150 13333 11724 3298 -2345 -6689 -5466 -12294 -6943 410 -4389 -4614 -5668
17412 -5668 -5545 -4606 -8606 -337 2810 5494 -1084 -1199 -448 -2869 -8965 -6290 3695 15321 20196
17397 20196 14842 6246 6395 10758 5771 -4251 -10269 -11058 -13671 -7771 5041 8537 -672 -1670 -4861
17382 -4861 -7026 -8955 -7809 -8701 -8129 3090 2741 -230 135 3173 -6778 -11979 -2208 2052 -6155
17367 -6155 -9308 -9640 -7130 -7773 -6489 765 2193 -2167 3687 3631 -9311 -7181 -1452 339 5051
17352 5051 4435 6164 9467 12949 18077 21650 22901 23365 17984 14787 13376 12601 17230 20601 29202
17337 29202 32887 41146 46449 52692 60392 69913 82476 109976 138166 165520 196692 225744 236219
17324 236219 247234 250683 252444 251570 239561 228936 218433 211575 221300 237539 247118 248839 247034
17311 247034 240295 219697 200411 182754 159192 129497 96489 73533 60206 53748 50794 34259
17299 34259 34678 36378 31570 25952 21967 16726 15950 18562 20793 27301 26943 28363 34177 31665 27568
17284 27568 29385 31940 39260 42994 55907 71342 99905 120915 147453 181103 197410 211631
17272 211631 221666 225212 229183 238726 228522 209899 208153 206970 211964 220934 230628 244070 245521
17259 245521 231882 218053 200735 174284 139669 117230 100973 80494 61548 49811 37626
17248 37626 34111 35429 25767 24268 18111 20706 25187 23402 22517 20236 17383 18903 23890 31935 28308
17233 28308 18371 18853 27204 22612 21126 9433 4962 -2008 -7774 -1050 -8338 -10596 4266 6748
17219 6748 60 -6738 -3408 -1268 3201 11941 8976 4924 -2107 -2761 -2984 1074 -3465 -8512 -8537 -4523
17203 -4523 -6695 -4436 -6567 -4705 -5536 -5362 -5066 -4475 -11486 -15004 -8485 155 -2203 -8175 -15685 -20787
17187 -20787 -13333 -12086 -1494 2591 567 5089 6805 5467 10042 8918 5025 6471 4009 7061
17173 7061 14475 17438 8048 4589 7079 -553 -2761 -122 10188 13627 9659 7749 4179 3564 4978
17158 4978 5579 6381 -2622 -4940 -7854 -13630 -274 7179 9229 7676 2000 -3966 1029 4566 5198
17143 5198 8422 -3293 -12476 -6235 3512 10393 12144 10436 -1796 -10742 -11286 -8992 -10421 -13859
17129 -13859 -10712 -2531 719 -747 6114 4176 332 4787 9201 12157 8896 2882 5538 11206
17115 11206 22313 17973 2094 -4896 -2271 -3318 -1041 -5798 -11500 -16073 -9290 -8983 -10166 8492
17101 8492 7263 3584 -1716 361 -1347 -8863 -10938 -9059 -13738 -12850 -10842 -6832 -742 8188 6498
17086 6498 920 6870 14806 10592 6975 2397 -3495 420 6226 1582 -2190 -3752 -10944 -14951 -6603
17071 -6603 -3557 -3623 3483 8882 8426 5249 3387 -2894 -289 1594 -705 -9800 -11131 -10572 -9932 -4983
17055 -4983 -6346 -16015 -15799 -13166 -10886 -1955 -1611 193 -3084 -10332 -18178 -24766 -18106 -19306 -21905
17040 -21905 -19186 -8115 -272 1694 4928 7410 389 4092 9715 16573 20757 13558 966 -5694
17026 -5694 -13237 -13214 -14262 -11482 -3492 -10910 -18544 -13146 -5652 -4139 2522 4736 -2439 1952 2267
17011 2267 8011 8837 8093 6205 6033 8129 6969 8888 2677 -6101 -4761 -485 3991 3164 1424 -656
16995 -656 -315 -6480 -10389 -10700 -6130 -9440 -5604 1527 6441 6319 5149 6270 1888 -2096 -6473 -4129
16979 -4129 -2634 -2387 -7160 -2154 -1830 4640 6305 4319 8560 9747 4384 -6053 -1671 7298 4221
16964 4221 1164 -1816 6252 -214 -6974 -4895 -3144 -8317 -1858 11566 11976 9623 712 -4445 -1
16949 -1 80 7855 20246 28940 18112 16336 11584 10332 9334 2164 -5821 -5797 -6350 -7944 997 1948 -10093
16932 -10093 -8812 489 -3568 -3470 757 2902 -30 12857 8319 7411 6433 2793 950 -303 -1401
16917 -1401 -5262 -10630 -9202 -3689 -6077 -4934 -2193 853 2941 2631 3721 5353 -6138 -4480 -9737
16902 -9737 -10538 -8066 -8784 -3307 -3259 693 6084 1616 1725 6095 794 -3183 -213 -1359 -7330 -8211
16886 -8211 -3395 -8510 -16402 -17989 -11427 -1575 -4262 -5730 -2293 5443 6664 1643 -15526 -18209
16872 -18209 -6381 1676 6121 9505 1485 1320 3625 -2103 -19272 -17145 -4672 -7483 -18303 -12698
16858 -12698 -3160 5174 6690 8418 1601 -4407 -2831 4071 -1243 -8058 -8133 -7448 -9783 -2064 1076
16843 1076 900 6687 2621 2087 8581 6198 2186 4201 4773 3206 6903 8496 10103 2438 -9395
16828 -9395 -5684 -2125 126 -4280 3117 6298 -2632 -7189 -904 -50 -2732 -40 -849 -2179 7723
16813 7723 2303 3589 5072 4071 3834 613 -7016 -1373 4632 5992 1449 -15099 -15645 -11325 -10435
16798 -10435 -14716 -10576 -10877 -5486 -2499 -4078 -2806 1780 1659 -2883 -10935 -7927 -10534 -10223 -5347
16783 -5347 -1964 4308 12381 25359 17901 1781 -12369 -20184 -14546 -10582 -3817 -2589 2477 -799
16769 -799 -6237 1351 1837 3279 -1262 -4320 -9489 -11778 -9971 -8511 -11553 -16027 -17921 -10287 -4227
16754 -4227 -2396 -3872 -4570 -3998 -19186 -19102 -6778 -2560 4699 7151 -6717 -10287 -11519 -7821 1077
16739 1077 2372 399 5018 4953 -2897 -6722 -8278 -9593 -8749 7523 10013 1153 -4641 -5552 -11891
16724 -11891 -14451 -8199 -4867 -6639 -4679 -4941 -5847 -6045 -9943 -17192 -23014 -23833 -16340 -9206 -10713
16709 -10713 -18036 -18648 -21831 -18259 -18242 -16257 -22816 -22624 -12258 -3545 -8622 -10949 -12048 -7165 -1262
16694 -1262 -632 5107 11109 -204 -2524 -406 1667 6983 9937 1477 -1423 2648 16123 15391 -627
16679 -627 -4579 -4545 -4712 -1992 -1379 117 -2418 -3459 -2429 -5335 -3914 -1293 11198 12531 -3254
16664 -3254 -10170 -11339 -9018 2732 12678 9248 1979 6918 3840 -6024 -14674 -22202 -23142 -13817 -9589
16649 -9589 -5963 -2428 4337 6722 -1668 -1739 4750 1673 -2960 -2782 1771 -5885 -10695 -2929 9299
16634 9299 8344 4418 1410 -2852 -10138 -9725 -2923 89 -6023 2192 8970 4553 -5927 3196 4415
16619 4415 -1157 -3179 -1844 -11120 -13703 -8274 -13814 -12229 -11306 -10672 -14171 -12540 -6751 -4028 -15670
16604 -15670 -20098 -13162 -11172 -10343 -6177 -2602 -4865 -16332 -10893 -2098 2134 11032 13135 10494
16590 10494 7553 8043 3979 628 -3332 -6368 -3785 3585 663 -177 5127 8957 6783 2892 4589
16575 4589 2832 -7817 -18485 -23279 -25045 -21190 -15321 -6325 -5643 -11223 -12747 -12126 -5562 -11115 -28107
16560 -28107 -31911 -18602 -18588 -20774 -13641 -2902 1325 689 -8675 -5291 -11063 -18428 -13822 -3652
16546 -3652 -2018 -8459 -16892 -24950 -25035 -23093 -18042 -12357 -6483 -4461 -8952 -3103 -6822 -10861 -13355
16531 -13355 -2062 9727 17639 16575 1792 2476 2191 3580 -509 2049 -2320 -6480 -16188 -10297
16517 -10297 -1112 3666 5413 -487 203 -6293 -4689 836 -305 -3712 -6798 2256 3518 -3480 -3688
16502 -3688 2157 8311 1142 -1034 1809 3403 1755 -5923 -4247 4547 10429 18694 20778 12375 2914
16487 2914 3357 827 -2314 1170 -1184 -7049 -1933 5179 5169 559 3148 2132 -3133 -15329 -14581
16472 -14581 -9290 -12594 -9702 -7321 -2966 -4071 -6030 -1219 402 -1488 -7772 -11987 -8770 -7892 -14290
16457 -14290 -4651 812 7210 1909 4727 5687 4804 -6192 -7927 -1424 -3755 -10585 -10052 -11349 -12669
16442 -12669 -17012 -19770 -13434 -9979 -3953 5798 10058 14755 15691 19671 18212 6027 4852 -4046
16428 -4046 -8645 -3389 -2754 -4979 -731 1708 2642 -5740 -3940 13649 12141 10947 14722 12727 -1451
16413 -1451 -5713 3366 4879 3977 -2734 6713 3477 -9323 -11028 -13900 -4583 1211 -2820 -9632 -4047
16398 -4047 -41 -8838 -10232 -10191 -6973 -6097 -8095 -11652 2269 7526 4834 1601 -4071 1936 1086
16383 1086 -2479 1297 7955 4470 2256 326 -1000 -8224 -18161 -11287 -10788 -6585 -6109 -3841 2345
16368 2345 4180 -1482 -2637 -1183 -8620 -13319 -15580 -6123 -1198 -736 -5878 -9999 -5289 1455 5332
16353 5332 14300 9182 -2784 -9170 -13081 -11743 -9767 -4668 -6775 -8454 -13631 -4240 3801 -9815
16339 -9815 -12135 -6537 5602 138 -8367 -2738 -4544 -7977 738 8653 9836 1112 1965 7231 7078
16324 7078 11733 4480 5255 5648 3517 7445 8902 8132 2057 2020 6492 7796 5653 -961 -5813 526
16308 526 15610 15912 7260 8120 8620 -2963 -3207 -6293 -14849 -14151 -11832 -13184 -8327 -3749 2533 -3675
16292 -3675 -5616 -8789 -12234 -11739 -4966 -922 -3856 -4551 -1848 -1809 -7014 -10412 -19223 -25803 -20171 -12534
16276 -12534 -4350 -5372 -11567 -5208 -1144 -3302 -9776 -22036 -21269 -15263 -9464 -3739 -438 -933 -3719
16261 -3719 -5509 -8211 -10435 -10340 -7267 -7009 -7405 -10085 -4543 -359 -1065 81 -3534 -6502 -7401 2417
16245 2417 2657 -7152 -5097 -6298 -6280 -4878 -2841 2774 15599 15886 12517 16594 10461 4190 6254
16230 6254 12793 16329 9158 -9789 -19974 -11442 2235 473 -14166 -4229 4578 -8216 -17635
16217 -17635 -23009 -24652 -11464 -1267 5259 3567 -11686 -16233 -13277 -15718 -9800 -7477 463 -4111
16203 -4111 -14662 -10914 -5844 -8125 -6160 -4994 261 -4746 -6690 -4912 968 -468 -9010 -11696
16189 -11696 -2371 699 -4869 -3279 -4637 -5203 -8143 -10529 -5675 -10791 -18035 -10725 -6206 -1786 -3069
16174 -3069 -7761 -13363 -8915 -6399 913 3435 1937 -2901 -1761 -276 4798 -1050 -12895 -19687
16160 -19687 -19978 -16977 -14808 -10206 -8122 -16158 -24334 -21898 -15264 -12142 -81 -3217 -7071 -7751 4943
16145 4943 8556 1909 3270 5145 3419 -1662 -9322 -10449 -737 8120 14860 8041 -2057 -5034
16131 -5034 -2723 3515 7554 6870 7642 9112 7335 972 -6385 -8523 -7860 -5390 2792 2149 9396 4291
16115 4291 5484 1893 1445 4398 4498 -220 5057 11792 10851 1312 -7870 -17361 -17791 -7730 -445
16100 -445 4295 1690 -702 -5849 -6845 -4264 -3810 2511 -2117 -6375 -6676 -8295 -7351 -4969 -8906 -14778
16084 -14778 -14349 -12801 -18207 -15123 -12376 -4919 -5665 -5881 -8252 -7323 -3004 356 5178 65 -7588
16069 -7588 -7652 -3584 -939 3645 3446 1736 -4475 -7310 -5136 -585 -1203 -6256 -796 257 690 -974
16053 -974 2388 5577 15168 22511 15302 -2908 -11567 -10317 -1319 3911 10375 5172 2394 -6368 -14367
16038 -14367 -21495 -24697 -12431 -8077 -4747 5948 -3723 -15325 -15708 -5450 -5038 -12 12617 13128
16024 13128 6715 1192 3218 -883 -7900 -7106 -3135 3328 15378 19103 19271 13085 8567 5556 1708
16009 1708 549 -1996 1483 453 -8285 -13920 -16485 -21548 -28033 -18084 -10615 -5577 226 4616 1158
15994 1158 -16176 -10120 -10299 -11063 -2211 -2043 -29 1485 533 -1324 9558 9203 -832 -14681 -18187
15979 -18187 -23166 -20479 -22940 -27046 -20965 -9651 -540 -10080 -11183 -6429 -2570 1805 3122 -4335
15965 -4335 1591 -188 -9453 -17841 -18152 -13600 -1047 -944 5463 12913 11244 3592 -5126 -14128 -10718
15950 -10718 -5683 -2376 -5017 -1889 3171 -3008 -6398 -236 -2819 -1794 -2569 -5225 -5051 1827 1321
15935 1321 3741 4252 446 -1016 -2127 -5541 2823 4298 1398 2887 10500 13752 15731 10266 8341
15920 8341 12617 15255 6847 7549 9097 12810 10986 9174 -5253 -15593 -7356 -13645 -10031 211
15906 211 6345 15136 13651 3749 -13369 -22398 -23068 -12572 -3339 -4891 3995 4929 -2796 -13063 -9872
15891 -9872 -5973 -899 -2627 -3163 1538 2640 4989 -2607 -10024 -3606 1401 537 -6790 -3082 -3005 -2924
15875 -2924 3072 6108 7416 2257 76 -6859 -9020 -6785 -3205 299 1143 1731 -7738 -12399 -6966
15860 -6966 -2747 -3184 -10637 -13488 -7896 -6872 -389 5756 10234 10876 5845 -5358 -10262 -16412 -18934
15845 -18934 -5983 2696 -7229 -4733 -1729 -5663 -10135 -10627 -7703 -283 4340 3569 4036 4155 7768
15830 7768 8390 2948 3615 6493 6361 6098 5596 8 -8903 -16531 -16220 -3907 2624 -12216 -19112 -13149
15814 -13149 -2905 -749 -1643 755 -544 -11292 -13421 -8830 -8234 -4909 9461 8578 5757 9401
15800 9401 7864 -4729 -12578 -11547 -5710 -7855 -6863 -1651 -5116 -13956 -10586 -8542 -5720 1957 8370
15785 8370 6231 3470 -1783 -9599 -13699 -14712 -3601 -2775 1377 -126 -2679 -2058 4931 5858 755
15770 755 -6935 -2663 -182 -1354 -3410 -8606 -8568 -4290 -4346 -14172 -14115 -9065 -5192 1086 -4891 -3433
15754 -3433 6332 3748 -8751 -6463 4045 4212 2966 2103 -3865 -377 11578 9024 4189 3158
15740 3158 -2639 -5190 4122 7619 1301 -9240 3773 7506 6094 -9 -11459 -20948 -19582 -8480
15726 -8480 4344 8656 -7557 -13690 -4729 -4627 -5767 -3477 1007 11808 13736 13954 8964 12506
15712 12506 21284 22674 16202 16845 14224 8854 9999 11549 -525 -4443 -8288 -4371 -828 9033
15698 9033 16654 15407 6981 8581 16077 12751 9808 16239 21436 20910 27509 28398 23099 19938 14237
15683 14237 9563 18010 12238 9493 13979 9115 -2128 -151 4975 -413 1400 -8015 -12658 -17607
15669 -17607 -10318 -9031 -10311 -12729 -10242 -2413 -5538 520 -1797 -4375 -17135 -18256 -9834 -2937
15655 -2937 -2730 -6501 -9379 -8433 -15846 -20900 -22559 -23719 -16483 -13821 -4908 637 -152 8943 7847
15640 7847 7325 11168 9211 7701 8151 11556 7450 3177 -55 -165 182 1427 5765 -1948 -7932 -13281
15624 -13281 -11940 -9518 -7827 -1631 -10 1173 6416 -1555 -3275 -7767 -11879 -7404 1947 5039
15610 5039 -3045 -14136 -12803 -5170 -7883 -3323 2868 10688 8153 5009 4492 6280 -1454 -5272 1669
15595 1669 -1939 -8183 -10749 -5399 -8447 -7027 -1962 9628 16462 17361 9857 97 -13129 -11726
15581 -11726 -8974 -13422 -7277 -3825 -2090 -2522 826 -629 -1190 -1077 -2515 -3345 -10368 -12926 -6283
15566 -6283 7567 16282 12197 12395 11288 319 -6783 -8659 -7405 -10872 -16313 -10718 2022 10196
15552 10196 13982 17173 8568 -2006 -2695 -2428 -8658 -13736 -15201 -11757 -11270 -12692 -6371 -3865 -4391
15537 -4391 -577 -3583 -5739 -965 10517 3257 -7327 -5108 -1737 4006 2664 -5609 -6424 -4644
15523 -4644 -4546 -5256 -2552 10599 13945 8645 3389 -1579 -5334 -6164 -2470 2753 -749 -4948 3752
15508 3752 10735 735 -6381 -18023 -18781 -9100 -3453 -1601 -475 -7751 -13937 -8386 -11309 -19000
15494 -19000 -19412 -15605 -24132 -23706 -14791 -11016 -2219 394 -5917 -5654 -2161 -156 4752 6532 12160
15479 12160 14774 13902 -1676 -5736 -6586 -7226 -389 7896 16969 5466 -3293 2811 3274 2119 8040
15464 8040 3086 -2445 502 5127 10753 9780 6206 4996 9450 2507 2453 5261 -162 3642 10305
15449 10305 17013 18412 18511 24745 23311 16838 12542 2275 8986 9679 10268 10903 13158 8204 10641
15434 10641 5490 -1362 -5888 -1124 4619 3268 -5369 -9591 -6136 -4164 -4106 -5998 -2046 3853 6107
15419 6107 4833 181 -2316 -1311 5261 4813 -1100 -1899 6236 6086 6512 8069 12930 18212 13803 11295
15403 11295 8335 6623 10327 18051 13435 4141 2038 -1580 2055 -3031 -7231 -8148 -7253 -7483 -4474
15388 -4474 -5716 -9350 -9065 -10621 -19836 -25080 -26332 -31216 -27862 -25536 -19400 -19002 -27941 -25124 -27082
15373 -27082 -22238 -20408 -21666 -15795 -13439 -13205 2278 4495 3019 -165 4503 4510 -5004 -6309 -7526
15358 -7526 -7326 -5208 -5288 -459 1789 5160 6454 -211 -5500 -546 5201 -1416 -8927 -5947 -3878
15343 -3878 -5746 1951 6179 5688 4564 -153 -4768 -7825 -3350 -367 1228 -5933 2215 -1236 -8762
15328 -8762 -4644 -1256 6996 6483 -326 -5164 2859 2878 -5668 -12038 -10834 -5377 -5700 -1970 -7459 -6569
15312 -6569 1690 5787 4659 -3879 -2475 30 193 202 -7250 1429 -891 -12185 -9708 -9300 -6114 -1813
15296 -1813 121 -4326 -10677 -16300 -15368 -5683 -9093 -15047 -10116 4239 7285 6464 9724 10953 2234
15281 2234 -4978 -8745 -4171 126 12478 11888 17722 4379 757 10085 19089 15041 8971 6494
15267 6494 11574 544 -5154 -352 3442 6363 -402 -901 4775 6167 15829 11274 11447 11483 2163
15252 2163 -1983 769 -1730 787 734 3095 4219 -3850 -3070 -2231 -1823 -10446 -17581 -7624 -3699 2283
15236 2283 4034 5470 5807 5351 1647 -3508 -4092 -2899 -2086 -1014 -4371 -5078 -4446 -11293 -16758 -12766
15220 -12766 -2064 -7722 -10317 -4497 2210 8741 10714 5530 6747 11926 13508 12344 5989 -1973
15206 -1973 -3701 -9466 -8385 860 -28 -1715 -2301 -3834 -9932 -9208 -9527 -10404 -4376 -5936 -5300 -3051
15190 -3051 -1200 -2873 -5551 -745 -419 1454 4543 3179 -1403 3852 19193 12299 14554 15512 10556
15175 10556 6161 4997 3347 -69 3099 4551 -4489 -6409 -3441 1990 6839 -62 501 -1279 904
15160 904 -6352 -8632 -7798 -7271 -3 4351 -2719 -9422 -6617 5470 11891 12165 14278 7651 4743
15145 4743 10550 816 5994 5298 -3639 93 10258 9946 11352 14057 10464 10929 20834 10299 11692
15130 11692 8536 2588 2581 8613 6697 2855 -2265 -3308 -11796 -5173 3082 -1519 -6243 -1120 -10166
15115 -10166 -10859 -17921 -10332 -4316 714 2403 3835 3037 -5525 1819 -3294 -1674 3443 3195 5519
15100 5519 4204 -6892 -13561 33 6658 5712 5960 1864 3497 4030 1381 4268 4849 1236 10242
15085 10242 8443 8133 6571 -1907 -1811 88 -5967 -1173 -4743 -13763 -11661 -9986 -6213 -8210 -11258
15070 -11258 -8728 -7853 -9341 -2086 7419 6525 5404 -1995 -113 -3675 -3873 -10294 -17059 -19190 -18623
15055 -18623 -15471 -12270 -16875 -18361 -10913 -8823 -10808 -16998 -8554 -7026 -5957 254 -289 -914 -8850
15040 -8850 -10288 -4593 4046 3152 -2618 -7158 -6500 975 -1656 -1027 7483 1396 -5498 748 8231
15025 8231 8319 1980 3465 3322 7451 2454 -1683 -5525 -18636 -13235 7585 18771 18979 21055 14099
15010 14099 7991 6513 -7209 -8702 2325 -1271 -1736 5245 -559 -4338 -3663 85 -5675 -11665
14996 -11665 -4740 1375 5480 7276 7035 3766 2876 -1605 -5046 -8824 -3618 2148 -1439 -7063 -13085
14981 -13085 -17660 -12475 -14270 -15921 -8698 -5255 370 -5071 -9403 -6767 -3317 4781 11174 12437
14967 12437 5013 -653 -6562 -6299 1976 9250 10237 3478 118 -3391 3208 13139 11839 8833 41
14952 41 -2587 -8 -2270 -6234 -1145 5111 11961 11809 2532 -3894 -1 8371 8602 10334 7562 5750
14936 5750 9548 3542 -1098 -670 3108 9701 7110 10630 16324 15602 11420 12015 1683 308 727
14921 727 -1530 3446 7006 1 -237 1540 4494 8814 13080 13430 11697 6234 7611 7949 7003 856
14905 856 -1482 4406 16047 20255 19523 14638 9495 3205 6677 2437 -3972 -1693 525 -1934 1085
14890 1085 2764 -189 1701 -4427 2143 6241 5111 -3271 -3332 2120 14270 9069 798 -2985 902
14875 902 545 -387 -3101 1422 10756 6222 7329 3659 -1496 -5139 -10410 -17305 -19700 -10816 1545
14860 1545 -2515 -7485 -3827 8526 13756 5375 3731 9977 10300 13379 12339 900 -6705 -4752
14846 -4752 -5169 -6936 -13797 -19907 -19611 -18619 -20811 -9160 5744 12132 7614 11367 12268 10960 -5637
14831 -5637 -11107 -4923 -125 5226 1663 -7058 -11230 -6013 -1682 1694 -1843 -2382 -2503 1779 -798
14816 -798 -4673 -2040 -8255 -16962 -17751 -20458 -11481 -5152 2540 532 8172 9422 3754 6194 18126
14801 18126 25764 13704 84 -12904 -23093 -19861 -10426 -6534 1595 5521 1510 -3636 -4104 3892
14787 3892 4316 -1598 -1993 -6039 -1146 3194 2471 1654 1484 9607 9404 -1219 5038 8977 8428 9321
14771 9321 5044 92 1766 8264 2457 4764 10151 7877 3688 -8 8789 10911 21470 28868
14757 28868 20708 12023 19609 21445 16813 9681 8249 10545 7368 6466 11088 8659 4623 3021 -226
14742 -226 -8179 -10462 -1845 13473 19535 12971 6503 6320 5873 -2969 -311 -3480 -237 -5382 -4686
14727 -4686 307 2613 5079 2986 6018 13131 13699 11784 10210 10718 7691 5658 7545 9802 3902
14712 3902 225 7226 15896 17926 12004 6995 -1602 -6410 -1101 -2032 -9250 -7982 434 4592 7918
14697 7918 13488 9647 7957 8369 8278 3723 398 2485 2882 1551 530 -7093 -6481 -6391 -3416 7434
14681 7434 7881 14358 27403 29338 17902 7487 -4145 -1204 1365 2127 2929 -49 7652 7123 -688
14666 -688 -8946 -7955 -7174 -4880 -4580 -9639 -10619 -1985 3775 11429 8580 392 -23 -11648 -7279 1091
14650 1091 8280 449 5081 1077 7011 13782 10868 17249 15966 7249 18412 17364 24478 19937
14636 19937 13132 8420 8208 7471 6620 2758 4663 10481 12663 6893 8901 7279 4538 9136 11371
14621 11371 11730 5967 1034 3770 6583 2436 4848 4335 3659 6314 -3310 -8751 -3619 -1350 -111
14606 -111 4333 8566 13827 7991 3179 -2636 -5210 -4008 928 2706 2163 4233 8767 5220 3852
14591 3852 6713 -3942 -4371 -1093 -936 -4037 -4749 -7277 -3483 -571 -952 -8729 -10111 -934 2309
14576 2309 -4986 -3584 2310 19238 33155 29841 15147 4919 12043 15475 12553 5764 -755 6494
14562 6494 9173 -2743 -2054 5087 9878 8414 4235 10818 11630 7802 2105 2113 11523 7662 660 -4204
14546 -4204 -2408 1046 1562 810 2797 2878 5691 8013 6266 273 339 -453 -1180 3710 3462 1517 4845
14529 4845 5713 10416 12429 8510 6750 6538 4707 -731 -5646 9973 16741 12055 4410 6031 653
14514 653 -3416 1162 3938 6430 4860 1942 -1486 -8147 -1316 3359 8942 19331 15064 12290 12841
14499 12841 6275 11446 14280 6918 -2735 -9721 -4495 -191 -341 5312 10128 9963 1120 -6434 -9673
14484 -9673 3524 7349 3015 -650 1981 4091 2907 360 9441 10349 1489 -1074 1100 6872 8774
14469 8774 6079 5239 4687 9040 3008 6223 15639 19110 13783 7072 5321 7543 4210 4150 2478 2458
14453 2458 6623 2187 857 8239 18448 13139 11250 8805 12538 11760 11804 16754 17363 4808 3647
14438 3647 7461 4633 8777 11879 9843 9246 15465 27078 34515 26608 18291 18606 21391 15560 4614
14423 4614 2197 6612 2189 -8 9844 15510 13789 7002 4194 3714 5097 8596 7541 3622 8177
14408 8177 11026 9437 4907 2392 6722 12794 2353 -10676 935 9346 16516 12849 -1992 -3605
14394 -3605 -165 -569 6822 6044 11524 17058 19165 22512 15729 8479 13154 12344 14666 20234 23736
14379 23736 22370 17606 27477 25070 13325 4596 1696 1842 9157 10040 11883 11351 11699 7194 11226
14364 11226 9299 13476 13647 1061 -4478 -13704 -14392 -12559 -1480 4122 -4370 -7674 -6229 -2466
14350 -2466 2541 3125 6494 8304 8331 17102 14772 9688 9156 17731 21115 15139 3443 -2370 -4464
14335 -4464 -6950 -4547 -3062 3054 4933 10615 19344 15019 7321 2469 -2422 -8765 -10334 -4548 -5010
14320 -5010 -2709 120 5093 5738 4641 9786 5082 -4497 -4297 -3537 532 2821 6219 13184 17192
14305 17192 14507 8444 2754 5136 14135 16642 21101 13455 17856 12604 5404 -3735 -7556 6937
14291 6937 6145 -1975 -2320 4007 5745 -2563 -2625 6133 14243 20265 16598 5383 -233 -8073 -11655
14276 -11655 -4552 3578 4815 4810 6831 8566 6923 830 -6161 -8785 -12987 -13683 -11099 -4205 1257
14261 1257 8661 11648 12662 15921 10373 3266 1626 7886 9097 16574 23418 20421 21535 21084 13709
14246 13709 2695 8088 19911 21003 16286 16900 16423 13448 8598 3461 -2348 -2273 -8789 -11459 -4264
14231 -4264 5591 11595 17196 12627 -999 -5612 187 3709 12109 21049 23063 20997 12574 6901
14217 6901 6515 552 3101 13845 17223 12138 -606 1842 4601 12558 20821 17434 17469 23274 28919
14202 28919 28446 15325 16504 20164 19512 14746 16646 17788 16439 15274 522 -11207 -5929 2109
14188 2109 10226 10776 5937 2162 704 5117 6399 8030 14167 18077 16327 13253 12132 14538 14201
14173 14201 11453 11348 7298 7214 7276 10415 1872 -1102 10521 13925 13183 14218 13430 13865 12512 14277
14157 14277 23241 27043 17724 12056 5168 1986 -2833 7820 14525 8395 11172 14723 15646 14285
14143 14285 8559 -1917 1429 1389 7659 6750 6597 7848 11305 10099 6872 17730 20611 13458 11742
14128 11742 4234 8119 17274 18041 17151 10378 11282 26223 31224 30151 17743 2274 6657 15754
14114 15754 6338 -3631 4315 18236 24915 18975 7923 -1315 -3714 -304 1684 -3119 -8921 -7183
14100 -7183 242 12811 9144 3709 3440 2530 -264 -3864 5081 11792 4639 -19006 -21175 -5360
14086 -5360 2097 3026 3952 8497 9962 14421 11785 5025 7263 14353 17305 9308 3238 5272 5832
14071 5832 13495 23401 27167 28539 28519 22909 19586 18956 9895 5318 5036 9968 11309 15504 17098 14044
14055 14044 3138 -1231 3550 7247 5852 3254 14354 19194 18674 13838 12265 15345 15654 13453
14041 13453 11557 16692 23177 21697 17278 21002 19699 23411 20284 14098 6188 2654 11895 24462
14027 24462 21793 15243 11655 1837 -2421 5450 3934 13537 21472 16857 11182 6702 6112 8235 9939
14012 9939 10560 2154 -243 -113 789 -3565 -4863 2056 9380 11984 14386 1435 -1756 1503 11137
13997 11137 5361 7212 15878 24312 20667 19310 16347 7334 -1244 8250 11205 11549 6208 645 -6014
13982 -6014 -4067 -7897 -4894 -2944 -970 1623 7267 10444 12740 16793 14137 4492 11772 16512 22291
13967 22291 18106 17083 18189 23646 21698 15537 19737 23820 7625 2061 8980 16769 13121 8525
13953 8525 5593 6614 13337 12170 12030 7280 2157 131 3568 5274 1474 9714 16381 14740 15500
13938 15500 17546 16843 11987 10542 14431 19277 19182 15290 20789 30570 27165 23843 21044 21169 15362
13923 15362 17094 20960 27700 31323 28957 17747 23130 21753 9451 3064 9077 8851 7783 13573
13909 13573 6286 1567 -1750 -4126 4309 9419 13182 15188 10177 5273 10230 10866 8742 19960
13895 19960 22168 18408 24062 22130 11783 11352 20415 21218 19128 8978 11143 16778 12361 11417 16396
13880 16396 20365 18544 15180 9816 2786 -3241 -486 -2254 634 2054 1838 3682 12410 22708
13866 22708 32440 27975 20875 14940 18620 20775 16005 14736 19031 24203 18385 16600 18665 20634
13852 20634 21712 17026 11336 12845 13069 12551 15591 21667 25558 24510 16158 10291 8975 8892 8449 14893
13836 14893 20781 18427 19923 22743 22478 17600 16331 14372 15188 13024 10597 8464 11239 8613 14062
13821 14062 18939 17856 23686 20595 20534 17188 13278 12570 15929 19849 19304 21696 24671 21710 21777 26751
13805 26751 25509 29339 24781 22566 28392 27693 20104 15530 22244 30505 20683 9612 10806 11607 10437
13790 10437 7437 5110 12764 13781 10441 6545 1318 754 4306 17006 22151 20152 21787 24497
13776 24497 17462 22893 31590 25735 22096 18819 13286 13154 20582 22621 13365 14327 12577 12600 16513
13761 16513 17896 10191 3931 7942 8539 11764 13577 16503 23126 29211 32592 32709 23855 19755 15610
13746 15610 17178 25059 25913 25015 23881 19756 15554 17275 25799 30839 27698 20118 15236 14470 14009
13731 14009 12297 17764 22699 29122 23704 15967 17824 21534 24523 42221 47236 30981 22032 17852
13717 17852 21339 22729 22769 16056 22594 24991 20997 18041 10808 8165 7493 9521 9348 13639 18304
13702 18304 22371 17350 11495 8844 11243 10788 6587 20631 25368 23635 13517 10161 13438 10629
13688 10629 10329 14924 14310 17172 22210 24997 25787 17528 12801 14017 26338 24619 24267 26022 26286
13673 26286 25722 24382 22536 16480 14210 25807 32022 32012 26696 18761 16901 13684 16612 19589 16065
13658 16065 10180 18801 25716 25490 23766 26983 19728 12715 15727 18507 18851 22956 28231 38158 34957
13643 34957 34142 26920 20733 10598 10899 21139 28117 27374 23331 26642 33912 33065 30927 32782 26179
13628 26179 18170 14096 18984 19709 18911 21992 21827 22967 26454 30611 31913 32031 40173 34778 27429
13613 27429 23623 27355 37124 38954 33068 25359 29184 35827 30223 25958 31290 37207 26519 25298
13599 25298 28911 32078 28361 24774 22102 23044 29540 29832 40915 43159 40591 39916 37623 30772 31015
13584 31015 35424 31093 28013 25868 31496 32954 35993 38084 33268 24941 26655 26487 33483 43689
13570 43689 39783 28411 20608 18211 26912 33033 39091 45505 48163 42633 36046 36256 33406 22231
13556 22231 15242 12286 16017 26275 33607 31746 37221 36054 34205 38304 44490 37039 37352 37005 30584
13541 30584 35661 46879 54664 54038 47685 49979 54712 53585 50918 49336 47352 37680 29797 27817
13527 27817 33762 29337 22449 24595 26521 23784 26700 27970 38957 39544 35622 29084 30184 23909
13513 23909 23867 29921 29519 19827 15906 23556 23651 23023 25183 20410 19841 21923 24452 30344 36447 26998
13497 26998 29997 35955 30606 23789 20445 33632 34807 31261 29563 25433 16203 13840 27043 20318
13483 20318 23442 32562 32519 34516 26613 26459 25374 32869 37209 32557 32987 29867 24280 22603 31190
13468 31190 45179 45752 49629 51996 48382 44581 39749 38725 42594 46191 43087 34331 22624 19391
13454 19391 27721 24722 21727 24841 25707 21755 25738 25498 32472 39982 42565 43857 46275 43808 35447
13439 35447 33660 29206 25620 24368 29024 28944 27396 32658 41880 39230 37454 36514 27846 16881 11575
13424 11575 14877 20392 29342 24413 18153 16960 19362 25335 27896 17481 24399 30631 27646 24000
13410 24000 21770 23335 24999 28604 25656 26791 32876 31705 28555 26100 25628 24965 19178 23743 31606
13395 31606 35011 38837 37609 30316 32601 37436 43034 41203 45863 44094 35446 37424 45977 44139
13381 44139 42954 37964 32880 37103 35957 31305 32066 30362 31225 22893 28229 28430 25116 26443 26329
13366 26329 35197 35798 32706 37933 36401 29810 24962 16059 15360 20116 26589 32382 34602 30706 27167
13351 27167 25896 27088 24355 28310 41114 36442 30498 28313 26521 32581 36497 36867 37143 34228 32548
13336 32548 31808 35831 44313 45277 40902 37173 28292 28991 31743 37633 41982 46494 48733 49934 58971
13321 58971 51037 40028 34285 34794 36522 37799 32149 32708 41095 45137 42455 33513 36656 36807 39044
13306 39044 40533 37659 35042 33176 33791 41115 37325 28962 29972 40058 38726 29205 22443 25759
13292 25759 28944 25443 27771 24131 23195 21763 15688 20509 33000 35799 34301 37590 48132 50725
13278 50725 41123 40907 42597 44157 41432 33866 28598 31753 24824 26677 26189 18401 23577 25913 30290
13263 30290 26930 17100 24105 34912 31832 30818 32232 32750 32543 37542 35840 27181 31288 34123 34612
13248 34612 28519 29334 30227 32124 39859 49218 45912 36378 35399 40028 44437 45713 40301 35159 33221
13233 33221 33397 22944 28891 33058 30478 26526 21278 9357 8230 26653 24529 23069 22595 20402
13219 20402 18155 25788 32777 35659 44659 42444 40412 45998 55322 47854 44376 45258 46974 49189 47538
13204 47538 45736 49846 43407 47925 52564 51367 47015 45014 42022 37906 31397 26254 30347 37305
13190 37305 28507 8063 8509 23234 40151 49229 57529 58205 51007 41878 32434 35871 39484 37708
13176 37708 42440 44937 41664 46272 38148 27486 28143 33887 34041 37704 39231 35942 44636 50855 48871
13161 48871 41517 40228 50186 47246 43418 39186 39298 39721 43648 47947 50051 40745 31429 33776 41459
13146 41459 44862 53645 56248 56604 53726 44572 39960 32576 35183 33825 32181 33138 39547 40414 33131
13131 33131 31487 39467 43648 47569 51078 48409 45685 38022 41296 50675 55050 49107 33858 36745
13117 36745 41282 42471 44568 53043 46896 49588 56939 52245 47448 43024 55739 55136 50913 46770
13103 46770 43813 53352 59122 59657 61470 57399 57146 51132 50440 41955 36350 37893 39949 43536 32975
13088 32975 25818 26821 30293 38380 36342 30636 31950 36950 48025 57603 59207 65902 71045 68938
13074 68938 57240 39936 36339 41636 54358 56146 59963 58660 55474 54656 56819 51901 44187 48929
13060 48929 54141 53237 57842 53111 49433 46161 47983 48298 47643 50827 59632 50282 47632 55295 46722
13045 46722 37764 35082 29096 28628 39039 43847 37118 36983 43532 41505 35312 43291 47730 55446 59132
13030 59132 51116 52213 51112 55052 47411 42986 38141 43852 39959 38993 42720 49376 46773 41488 44097
13015 44097 47910 44985 53193 59518 60666 52022 50286 55571 48612 43624 53521 53975 47405 57512
13001 57512 59054 51637 53898 55289 68271 76060 73878 61132 61584 62181 61472 63115 63947 62835 65286
12986 65286 69035 64674 68938 60348 60745 64781 63807 56382 54356 55991 52478 48286 47619 56306 66454
12971 66454 75512 79394 77404 77969 73751 66201 58692 54287 59693 70131 73104 67442 72402 71032
12957 71032 73008 61839 59326 59548 56141 56395 46601 45151 47837 49862 50735 51707 48907 44849 41007
12942 41007 36010 36357 45420 62614 67310 58489 47150 49368 52516 53985 48052 38075 46033 55418
12928 55418 64922 71183 65766 56327 57613 55558 45696 40893 49728 46640 49133 57073 59068 62180
12914 62180 67749 67476 69297 73423 76962 64369 72534 68804 70260 68614 64612 63220 61229 58748
12900 58748 49882 50262 46403 49925 66307 67609 61313 52236 54388 59808 53542 56373 56336 52570 44363
12885 44363 51200 52172 59420 62516 53878 61932 70534 72953 75437 80025 78009 71625 63073 64558 73986
12870 73986 71452 63263 59786 58555 62564 57759 58006 62242 63903 64000 68961 60670 54253 57566 57829
12855 57829 64307 63297 53900 64450 74247 74072 72596 78417 87716 91333 97831 94516 87172 90564
12841 90564 89847 73383 68213 67882 69374 65093 62805 65651 68414 69466 79581 85567 77935 67483
12827 67483 71466 79345 67145 59029 59808 61869 65534 63604 63975 67433 68471 74722 67744 72124 75966
12812 75966 72165 68222 59826 57063 58376 65504 74710 73590 70304 73621 72111 65855 71445 73247
12798 73247 69191 69703 78350 77570 81182 91558 102541 117141 133075 149943 163754 172339 156547
12785 156547 131818 110614 98803 92086 89456 82364 84547 87423 91777 104214 108991 107769 96273
12772 96273 83933 79526 80285 75735 74481 78966 78110 75096 70948 73332 80010 80351 71127 66190 66039
12757 66039 69778 69749 76971 75339 73427 74007 76267 72917 77126 81682 83983 77507 80194 86655 86619 87677
12741 87677 78753 78247 81145 76730 79030 86263 86136 86543 96711 102837 94101 81052 81942 86288 77842
12726 77842 77769 74627 80180 92314 86654 78884 74185 80449 80901 79238 70627 73009 83657 83478 75590
12711 75590 76948 83684 84238 80561 79301 91158 84230 78524 74223 80159 78033 74136 85989 85728
12697 85728 81258 79812 79863 70804 57033 64044 81271 92142 97415 101017 96388 87163 78729 78549
12683 78549 76992 78980 84759 94945 93260 89797 87594 82592 82487 84350 81996 89029 92876 101261
12669 101261 99825 95592 84337 84534 85465 79948 78111 77832 80521 79095 82622 90092 105365 108254
12655 108254 89589 87372 80875 90862 95466 98968 96279 94590 94024 83329 89169 99599 102352 99307
12641 99307 97177 100339 93610 92729 100771 105094 98433 93671 99808 99655 95828 96840 99301 100797 96343
12626 96343 90091 94028 91791 91640 84861 87679 91927 93502 93319 91291 86941 97097 101135 102588 106905
12611 106905 100767 95152 106671 108059 100289 90746 88178 94043 98621 92206 90825 95064 90427 99518
12597 99518 108966 108193 102424 94584 101856 107237 112401 114769 109286 105477 101137 104995 103825 106148 107365
12582 107365 110835 111737 100403 96086 108859 104434 106166 112642 111176 112322 105454 99744 106569 105434
12568 105434 104015 109015 113697 117423 112007 111066 109279 104005 102213 108230 117623 120775 113377 113981 119947
12553 119947 126306 116814 110319 113116 108439 104397 104669 105610 102303 102341 106535 107688 104836 113785 121881
12538 121881 126025 116136 105550 108307 109646 112706 122076 126572 128324 123569 122999 117570 116850 119112
12524 119112 119554 121601 124698 120838 117910 113673 116790 117604 124059 119868 125117 133683 137327 127961 117812
12509 117812 121910 123560 128249 127407 126621 128898 129878 131006 126930 123610 111419 120069 129822 131267 133804
12494 133804 127038 115456 116986 120682 115370 118123 126420 135841 136870 134541 126056 127714 128707 129862
12480 129862 133614 141887 139729 131416 127849 125474 121444 124405 130782 144026 147149 135039 136263 132804
12466 132804 128506 128863 135833 139547 137761 148725 148999 150624 149757 144672 147378 146739 147323 142418 135684
12451 135684 135640 131408 133719 129004 136558 140424 139783 138496 141911 138502 133994 136351 138223 128874 133069
12436 133069 146909 147961 147739 146772 156524 156276 150922 156130 159594 155372 153637 155816 152542 149110 151039
12421 151039 159715 156436 148833 140372 138761 135972 142650 148711 149351 151580 156268 166715 173759 173803 171299
12406 171299 165636 164941 164923 167723 166141 165817 165084 168632 160869 165887 173243 166410 157516 151950 160143
12391 160143 168746 174498 173180 174442 167434 161807 160338 168803 176342 176212 170154 157827 162467 160802
12377 160802 162863 159530 161065 164600 162357 168240 180985 180499 173253 162370 165568 163898 164242 163952
12363 163952 164836 168055 164741 160222 169611 169474 173748 177158 170909 168159 167174 174433 175668 169329 166072
12348 166072 171602 173673 171728 166252 159395 157181 168229 178630 177543 177839 177522 176247 174520 175777
12334 175777 174297 173741 190634 193268 194529 190882 189039 195514 201669 204488 197986 196782 196235 184707
12320 184707 187119 183733 181719 179556 173321 181146 188796 186552 194113 193282 194456 204646 205601 200946
12306 200946 201754 213589 209815 195903 199189 203483 199991 203342 205690 200784 200583 202620 199236 189297
12292 189297 196349 208979 209773 204729 195097 189616 189198 194703 204243 207688 204019 199475 204073 209232
12278 209232 215175 209868 201060 199103 201015 210166 206712 205357 219477 231091 235228 236093 234078 222800
12264 222800 213254 201079 195983 199554 207776 208465 198317 199731 208504 216767 206184 201675 209385 218449
12250 218449 218671 224915 218249 210599 205442 206257 213577 217998 213028 200370 212635 217945 227654 232068
12236 232068 239684 227215 216838 221811 226571 226890 224400 233616 233853 228202 228676 231695 228355 227090
12222 227090 227099 222107 217569 219108 230817 242061 249016 252418 243606 239694 240822 249071 253606 245311
12208 245311 244729 243075 244280 247035 243681 243911 251680 248999 251525 254002 247264 246504 253464 257051 267285
12193 267285 260459 255049 252702 246477 248853 261716 256637 242857 243809 248680 252539 247281 258643 270568
12179 270568 267412 262653 255680 253705 263707 264127 258792 267456 270775 270008 268808 268118 264081 260943 254708
12164 254708 253096 262854 273845 275642 271632 270097 262459 257101 255508 254511 255210 262603 262188 262540 264728
12149 264728 266547 272396 276380 280797 280266 272337 274831 273175 271136 273684 279208 284281 276888 281103
12135 281103 284638 291375 286563 287944 293172 288866 273008 278008 292525 296449 287169 284114 279705 288309
12121 288309 287710 288836 287818 282589 280024 282293 281883 278608 286216 296408 293478 290825 296904 282633
12107 282633 281378 287360 298309 308854 304634 296811 300720 302670 298901 291513 291077 289818 286261 283135
12093 283135 286764 294077 296541 310570 312886 309651 315256 318105 314580 307101 299371 305027 305715 294629
12079 294629 290601 290098 290246 292809 293655 292805 290401 294996 288777 283853 287840 292239 294842 302007 298213
12064 298213 295963 296824 300012 299555 296510 300875 306244 310937 314711 302131 294197 301275 296938 285598
12050 285598 279683 278061 284958 290201 301466 301817 298225 306312 316123 310136 312965 321937 318692 318728 312803
12035 312803 311589 311056 317424 309384 292588 298054 301356 295712 299077 305861 305724 305616 304557 308563 318664
12020 318664 317498 306884 297738 299796 301603 310720 308591 297267 296303 304469 308493 303597 296881 299309
12006 299309 298362 301557 303131 301237 300555 298082 298628 303794 313421 315517 318290 317423 312625 312558 313307 315566
11990 315566 319925 324757 315229 304305 308955 308575 304372 308638 305742 305851 309034 309978 302272 291296
11976 291296 296576 301063 303392 305634 312086 317206 319222 316976 316435 312004 307361 311127 310120 305782
11962 305782 307621 304599 308385 313494 314525 319246 321749 310190 307269 301197 306271 312131 316059 301395
11948 301395 296677 299384 296312 289761 292671 306267 307469 303319 302335 301318 300377 295958 301524 295853
11934 295853 293608 300362 313402 320596 321391 323512 318490 321365 320250 313831 307140 303163 305424 309677
11920 309677 314504 315229 314218 316033 316106 309512 306158 297776 293035 294250 295853 291735 282399 284713 289246
11905 289246 287963 286663 286427 294812 308363 311361 314293 302284 302078 307783 308074 302064 295894 286367
11891 286367 281133 278761 280518 291653 296657 301859 302970 304816 303684 299183 302491 311256 313211 309868
11877 309868 300457 287001 284979 285081 287504 288124 290151 286145 282903 284158 286051 285418 279554 282758 286017
11862 286017 288469 288239 284910 286027 279394 276991 280887 283217 284993 277396 268890 269992 272716 273738
11848 273738 274393 281435 277636 277801 276364 262380 263129 271422 265434 257422 265189 272032 273562 274700 260671
11833 260671 258385 268050 278491 281831 280996 278227 276406 274953 278453 269059 263403 267626 266794 268732
11819 268732 264394 263257 269120 266386 258873 260004 264751 262075 260436 264302 266470 265932 266151 262707 264719
11804 264719 255070 249467 249245 252871 253617 251596 254773 264394 268293 266711 259945 251935 259263 265978 264411
11789 264411 257159 251914 248626 241659 240295 243725 246441 249746 257266 248537 238340 240699 242423 249642
11775 249642 255103 255721 250826 248970 240849 242169 243550 241888 241565 242407 241988 238235 232991 235930 232536
11760 232536 232328 241194 247717 242749 239469 238939 230324 228965 232321 232394 236115 244742 243933 240318 237467
11745 237467 231425 230065 227418 223909 227511 220953 225748 236323 228856 224944 218362 215319 225200 236337
11731 236337 228332 217928 221234 230472 226215 224269 225943 226570 236516 239670 247957 244498 239895 229535
11717 229535 225991 232783 228764 224885 228495 234334 238949 235408 227422 219505 212127 213056 220956 217192
11703 217192 213591 210420 218484 224891 227488 228223 225932 218008 223894 219772 216088 218285 222203 221335 216742
11688 216742 215287 221015 214943 220810 223960 216824 212717 216392 214113 216361 210435 218593 215462 211567
11674 211567 209920 206022 201910 206851 206011 200109 197722 198427 202673 206468 202848 196843 197919 198691 202284
11659 202284 202788 204513 198721 198970 199016 203003 206560 202326 198102 196823 211575 225759 232683 240852 234200
11644 234200 239634 258607 280182 309582 357364 421233 508944 579109 591531 531227 441670 372246
11632 372246 327285 291454 272990 254054 237913 227298 214730 198220 190141 197031 202632 203090
11620 203090 207025 206975 208255 198977 192374 186552 186386 194090 195694 189551 178950 179998 187548 181364 179213
11605 179213 186355 188448 193725 190726 186210 179598 181171 183914 186376 188074 191720 191360 193339 196641
11591 196641 188957 181630 182332 181302 181760 182858 182782 188544 191621 188774 182898 184499 177483 170258 176358
11576 176358 175074 177658 183633 184681 179107 178220 173117 177933 183467 175214 171914 170320 179200 193002
11562 193002 192332 181496 175037 169490 167316 168016 171426 162188 160923 172617 175997 175698 177348 173608
11548 173608 164316 170738 171110 173994 175396 174051 180071 181285 181597 188664 186137 192195 192647 193783 199150
11533 199150 200723 200161 198731 186087 179543 170368 165627 167862 163102 165283 181930 186365 188642 189015
11519 189015 187790 184026 181755 171556 172755 174369 172452 172515 177805 174162 168695 170413 164811 159845
11505 159845 162272 169930 166065 169764 177107 186062 187087 183799 181860 187130 192202 191921 187688 185115
11491 185115 182686 181257 177073 176070 174341 163957 155713 155302 157528 158147 163409 166636 170092 173725
11477 173725 178442 164344 170163 175121 183039 186677 187905 195475 194365 194392 196755 189169 182499 178719
11463 178719 172541 167825 172334 171658 169599 166042 167509 166461 161062 159938 150712 156349 159880 158194
11449 158194 157531 163846 176033 179094 183055 180902 180700 178148 177592 180112 184271 190439 188000 189484 196357
11434 196357 201692 209429 215001 217232 214903 216766 225990 236975 253141 258355 271748 282948 299645
11421 299645 328374 363115 405861 469981 550118 669009 829814 1023101 1222946 1408694
11411 1408694 1558789 1646452 1643903 1563330 1422566 1233339 1031188 846803 693093 569689
11401 569689 488884 424679 374668 343115 315072 282326 269159 255223 239969 225886 220347 221710
11389 221710 224714 216831 215872 212413 211778 216580 206106 195440 191482 195975 200011 188086 180890 179648
11375 179648 185940 183484 179325 177454 176453 176943 172273 171815 174141 170415 171302 168274 166280 174594 184480
11360 184480 182270 179309 171460 176801 188621 194152 188594 185225 179512 176173 188276 192786 187924 197500
11346 197500 208770 201166 186264 174726 178018 184017 185717 183315 176627 176567 178865 181915 184363 194357
11332 194357 191753 180305 164981 172632 178322 185094 182619 172213 166816 175714 185322 194883 197480
11319 197480 195682 188216 184751 177176 173789 178326 179074 179399 172286 172248 174632 170847 169029 169220 159419
11304 159419 156204 154545 154829 169235 181978 183946 176947 175387 174975 170546 172311 180583 178748 183001
11290 183001 190752 192034 177424 174303 171019 167130 167168 170975 172593 177105 176317 168437 164294 174954
11276 174954 184958 190486 197547 199202 193320 200923 213164 219748 216929 216685 221719 221573 220835 218208
11262 218208 218605 217188 219538 227867 244600 257194 270925 291949 307546 328480 348523 362316
11250 362316 367809 362285 353618 344166 333923 331125 318910 317324 331814 343936 351489 361529 363291
11237 363291 351977 336228 314170 289431 275129 263780 256480 242628 224727 222331 228988 234374
11225 234374 233697 224026 220936 223677 229731 226750 226692 234013 235667 238237 244631 256323 259803 259717 251349
11210 251349 249180 246089 242961 244158 247215 246828 254014 254562 244783 230620 219281 224831 232947 223245
11196 223245 225495 221674 222788 228488 241654 267584 278138 285058 288594 296834 304561 310253 312563
11183 312563 309153 305577 310874 319436 314800 315317 313358 309851 307031 295172 288078 274853 267162 267976
11169 267976 267297 252980 230001 228475 220437 215881 206153 185157 167221 156362 161386 179170 193644
11156 193644 209978 232126 263621 287509 298530 314202 333045 344217 356699 366301 363574 371508
11144 371508 374958 370734 369111 376707 381773 382329 396244 408569 446310 503971 592182 702242 834052
11131 834052 986572 1138597 1278513 1392338 1473270 1499876 1494774 1447800 1378081 1290891 1191042
11120 1191042 1100347 1017414 951136 900574 858843 830559 811349 802786 803391 816714 813639 801606
11108 801606 801311 793139 788832 790987 792455 796342 794524 800495 814974 832223 836910 828756 818493 825126
11094 825126 825609 831101 835212 836558 834668 846948 865280 880092 898287 915921 937016 957335 977417
11081 977417 982604 994694 1013867 1041803 1054706 1066496 1087148 1106710 1136396 1166166 1193029 1210853
11069 1210853 1232855 1262951 1293860 1318006 1336669 1368636 1407875 1442493 1471672 1509778 1548679
11058 1548679 1587129 1626433 1669169 1717419 1764420 1817547 1874622 1938892 2025142 2116473 2220150
11047 2220150 2339569 2463866 2595616 2736059 2884342 3050474 3215679 3376659 3550914
11038 3550914 3734346 3927984 4138455 4378491 4656965 4987086 5393788 5869750 6446457
11029 6446457 7102612 7832610 8615034 9447512 10321981 11235483 12222457 13355507 14717067
11020 14717067 16407784 18533361 21249085 24730998 29246231 35196248 43222895 54330696
11012 54330696 69930324 91665683 120637910 156165541 194877547 231503496 260677301
11005 260677301 277777250 279617939 266051093 240074801 205935272 168203142 131778941
10998 131778941 100673437 76501565 58675567 45735684 36283918 29285365 24022458
10991 24022458 19989070 16861457 14442132 12577940 11152109 10057328 9202303 8507227
10983 8507227 7889755 7285803 6684942 6085846 5495223 4936800 4417490 3946992 3544916
10974 3544916 3197287 2891311 2625753 2404167 2203210 2034136 1887219 1768230 1678470 1599989
10964 1599989 1532680 1477742 1432072 1373054 1313483 1259846 1206395 1152571 1098335 1032528 978437
10953 978437 926565 875141 830697 796325 754679 706279 664751 630254 599528 571517 540256
10942 540256 507715 492002 464630 437790 425548 414397 402019 381059 345331 319852 307248
10931 307248 298252 284024 266921 249657 239858 238414 233313 222521 209636 207066 205069 193272 177168
10918 177168 166014 152324 151891 148706 132807 116290 102080 91791 82070 74361 64446 50466 42430
10905 42430 34418 30377 32071 29756 16127 7760 12300 26193 22338 25019 47558 70479 80284
10892 80284 88363 96864 94469 81567 77854 64370 31039 -15046 -58420 -112105 -167860 -203209
10880 -203209 -211973 -208935 -200404 -188784 -159404 -113930 -83993 -62929 -44004 -24742 -16955 -16699 -18680
10867 -18680 -13110 -915 6254 3848 -5401 -916 -3783 -5146 3323 15862 34517 58643 77230
10854 77230 96390 118999 129285 140657 152331 152462 143460 143481 131337 118299 104777 85897 71994
10841 71994 53530 36718 34020 36927 31163 24693 17125 8054 3177 -199 -8010 -16293 -23040 -19263
10827 -19263 -23312 -37231 -41156 -35067 -38582 -41143 -30043 -8652 7140 21769 30426 40765 44089
10814 44089 50012 48991 48686 40689 22608 18123 10968 9558 15512 12402 14052 18086 25318 24686 24059
10799 24059 20196 23099 15474 9697 -2367 -8680 -2209 12399 16737 19580 23626 23044 21651 27337
10785 27337 25039 20626 16186 10208 13660 16642 18344 25206 30939 18343 7365 -2120 3757 -1918
10771 -1918 -22399 -30347 -28422 -22539 -23041 -16690 -9122 -2180 -1809 -6872 -13909 -11995 -1199 8255 5280
10756 5280 3869 -9628 -3819 -1895 -13153 -8760 -3312 -16393 -22457 -22996 -7345 -5036 -8466 -10823
10742 -10823 -5192 -11927 -10364 -6325 -5441 -583 -2424 8389 21711 28139 22256 18722 27165 29929
10728 29929 28388 35685 32186 32891 39819 46470 47949 40390 34352 35670 45474 51172 56065 64489 67745
10713 67745 66633 69332 73957 73855 73564 77844 85309 82434 77419 79216 86460 95198 94203 107395 106938
10698 106938 100496 95552 83186 72731 67093 71733 73954 61534 50615 47487 54804 48878 51531
10685 51531 39976 27885 18681 33033 42051 43047 40016 38468 42290 46023 43331 43624 42900 42321 45098
10670 45098 48022 61091 60238 67771 80405 89045 90007 89295 84571 82799 82014 75256 67662 73810 86388
10655 86388 93283 97780 102519 105756 110577 123906 128016 134072 137768 139807 149661 157877 172767 179681
10641 179681 183028 183109 192482 202594 209967 219353 234865 247411 269960 295641 319709 348889 382404
10628 382404 414798 451306 496121 541809 591192 651954 743968 865186 1028710 1235241 1499576
10617 1499576 1861592 2324866 2882631 3487926 4022185 4355742 4433964 4346164 4218721 4165922
10607 4165922 4275844 4595377 5167304 6015109 7121547 8339375 9356821 9848316 9758409
10598 9758409 9323205 8860556 8578315 8569898 8841752 9413054 10323697 11499562 12697846
10589 12697846 13446631 13327064 12325012 10866534 9442002 8321493 7579928 7240063 7284680
10580 7284680 7664311 8281284 8929159 9246113 8946512 8072939 6935590 5856247 5007953
10571 5007953 4416477 4066545 3929462 3963537 4096534 4197415 4150597 3870295 3377777 2786647
10561 2786647 2223561 1759645 1393805 1100115 878497 711477 578683 482472 407663 357291
10551 357291 308323 268981 234115 207842 175424 149913 139075 127742 108197 88945 76082
10540 76082 70210 64544 62041 60451 57696 53252 43382 44764 39502 30713 27388 23655 18340 12474
10526 12474 13763 7120 -3989 137 687 651 -1795 -12520 -13600 -5804 -15933 -24354 -22120 -13076
10512 -13076 -8343 -6271 -254 3294 616 -8913 -16386 -7055 -8053 -12528 -9629 -12158 -20129 -18643 -17701
10497 -17701 -22761 -28693 -38024 -35614 -36600 -37967 -26665 -14277 -23984 -30931 -28245 -30467 -33117 -32065
10483 -32065 -36237 -39855 -37695 -46854 -46110 -43893 -48517 -50412 -44973 -41604 -30806 -42041 -56367 -60489
10469 -60489 -56243 -50956 -45195 -44005 -40805 -49641 -47545 -37213 -32949 -38703 -36587 -30404 -29199 -34115
10455 -34115 -38589 -39017 -30983 -33974 -28817 -33197 -38368 -41295 -30862 -24540 -29696 -40736 -43139 -49682
10441 -49682 -47888 -33031 -28607 -21557 -18593 -16897 -14601 -19465 -19784 -24770 -26068 -28828 -24383 -23133
10427 -23133 -20499 -5841 -10851 -18891 -15476 -16242 -20259 -21648 -26447 -28274 -20133 -19693 -24102 -30392 -32412
10412 -32412 -41157 -38108 -21863 -21844 -20695 -24607 -25371 -28611 -31092 -35525 -24854 -11981 -7944 -14367
10398 -14367 -22877 -22715 -19424 -22774 -27607 -31394 -22979 -22924 -21273 -19944 -24479 -24987 -19647 -22985 -28127
10383 -28127 -27991 -26396 -22221 -6703 -9566 -6630 1023 -8817 -22794 -18728 -15135 -12768 -5856 -2387
10369 -2387 10153 21440 18119 14351 28123 25031 10544 6939 19766 25154 28188 32900 18086
10356 18086 12515 5716 3774 3214 -1474 -8345 -14352 -12023 -9651 -10996 -15472 -23341 -22942 -14739 -15604
10341 -15604 -9918 -3213 -2602 -11372 -11685 -14005 -23011 -26421 -17329 -18535 -27943 -25500 -15995 -10119 -15778
10326 -15778 -20159 -21638 -20659 -10644 -9348 -10296 -11684 -20745 -29127 -29099 -26153 -20098 -11753 -15400 -14432
10311 -14432 -17934 -26005 -25832 -27874 -27325 -29880 -29901 -23071 -23738 -22419 -18890 -16220 -19116 -29874 -23706
10296 -23706 -14295 -13975 -17728 -20984 -14821 -5485 -10511 -17682 -32701 -39048 -31100 -17164 -5949 2022
10282 2022 -7114 -17019 -10308 -2065 -6787 -13943 -21721 -32935 -23543 -8278 -1553 -5980 -8418 -9990
10268 -9990 -14585 -16397 -13685 -13190 -15342 -21156 -25803 -23976 -19547 -16248 -20960 -31384 -27867 -27824 -19772
10253 -19772 -17614 -14875 -10657 -8009 -12012 -12172 -8350 -331 13221 13700 12581 12718 15521 9732 6377
10238 6377 1623 -234 6093 7832 4925 -5759 -7468 -9574 -16332 -17569 -13380 -16130 -20944 -12539
10224 -12539 -6042 -3746 -9765 -11724 -13042 -18187 -16747 -18097 -23712 -28618 -28005 -28604 -20775 -23585 -21053
10209 -21053 -21156 -20433 -19294 -22695 -19339 -22120 -27081 -24367 -22079 -16069 -10440 -9436 -8343 -9807 -12323
10194 -12323 -18665 -21730 -23640 -26799 -25088 -23246 -19666 -27230 -25563 -25504 -20347 -13792 -6837 -3387 -11293
10179 -11293 -11728 -1959 -3737 -683 8891 17402 15950 17161 12754 9549 13348 30864 37632 31849
10165 31849 36857 43665 39923 35024 35439 24037 28598 41563 42888 39950 50143 59128 70469 76967
10151 76967 69931 62303 51720 34604 26548 28823 25775 20390 34239 36740 35717 36572 35403 29734
10137 29734 23415 13825 14355 3851 -10418 -8040 -2866 3725 -3702 -905 9514 15950 14234 11498
10123 11498 7448 -8686 -19536 -9315 -1826 -1006 2492 -1482 -4548 -11047 -9546 -9076 -7008 -8433
10109 -8433 1351 1771 -8486 -8230 -8321 -20485 -15220 -10048 -18853 -21380 -27432 -27301 -20613 -20988 -16314 -13205
10093 -13205 -16562 -12925 -17119 -12732 -4133 -8499 -14346 -7910 -4332 -10466 -18246 -22100 -23154 -21522
10079 -21522 -5002 -445 -3814 -2135 1214 -5354 -14603 -14677 -13140 -8588 -8246 -5590 -2671 -2235 -1090
10064 -1090 -355 -7705 -3748 -767 -2511 -3828 2804 9358 7039 11775 3145 1120 -4414 -5983 264
10049 264 -1187 -4112 5467 2084 -6640 -10435 -13789 -13619 -1816 494 -6783 -9017 -1516 -6312 -11866
10034 -11866 -12617 -13061 -10682 -7833 -8718 -10208 -5027 -5723 -6136 -3032 -4117 -5721 -5188 -6243 -8353 1367
10018 1367 3485 5378 3902 367 -5499 -5048 -371 -2737 -4963 -429 -1973 -5719 -6577 -516 -5834
10003 -5834 -19763 -17259 -19397 -15449 -14740 -11586 -7429 -13260 -20834 -21855 -20174 -18249 -16841 -9443 -11578
9988 -11578 -12141 -20530 -22015 -21425 -22646 -23625 -30445 -25340 -19650 -11736 -13313 -12537 2157 9061 642
9973 642 -8424 -8028 -4581 -1693 -380 -2009 -3399 451 -7450 -11982 -10971 -13800 -12244 -16597 -20866
9958 -20866 -21202 -17147 -11359 -2907 -9946 -15425 -21150 -26276 -25983 -19471 -13485 -15487 -9988 -16311 -26261
9943 -26261 -25774 -13032 4046 714 -8320 -6483 -738 -5330 -13347 -20904 -21772 -22451 -15553 -17931 -7735
9928 -7735 -5680 -7685 -6176 5791 4420 3151 -4760 -7672 -3116 1124 -10437 -13932 -14735 -17032 -20331
9913 -20331 -14018 -7928 -10442 -5450 -1301 -6145 -4808 -5436 -4764 -9272 -24267 -19043 -17697 -10960 106
9898 106 9607 2620 -4576 -5157 -4717 193 -6147 -8965 -9431 -7994 -16097 -21078 -15671 -11895 -14022 -13537
9882 -13537 -12428 -11287 -7868 -18774 -21954 -21968 -18682 -8279 -5723 -9579 -2245 3856 7895 11815 5973
9867 5973 8360 9654 6668 3194 10273 11800 -3615 -11874 -6463 -865 -742 -9558 -15141 -8550 -4250
9852 -4250 -15590 -19831 -15644 -6628 -9537 -10202 -9724 -13642 -9716 2393 2643 -7863 -17590 -13392 -13438
9837 -13438 -9901 -14432 -19260 -17447 -6096 -1349 -10698 -8810 -10500 -5918 353 6046 8454 6764
9823 6764 -5535 -11116 -11518 -15341 -14110 -8286 -12549 -16729 -15500 -15300 -9949 -9866 -19091 -14368 -537
9808 -537 1088 2746 10408 6818 -2254 1446 7722 10683 12311 11701 958 -3640 -9749 -15271 -12570
9793 -12570 -7386 -2466 3268 6060 2130 3133 4835 7707 6318 -8022 -3183 -6792 -15076 -22266
9779 -22266 -19208 -20470 -17903 -11982 -12605 -9783 -16821 -7612 902 -1976 4444 -154 -2121 -5394 -4920
9764 -4920 1912 -120 -10502 -8744 352 1728 1712 3689 1851 -3494 -5723 -15105 -16438 -12033 -13414
9749 -13414 -11984 -7568 -11873 -10718 -3131 -4587 -9367 -9562 -15757 -14025 -13761 -18196 -15353 -15591 -22647
9734 -22647 -18029 -10849 -6043 -9847 -17873 -10635 -11454 -7232 -6505 -2577 -10569 -12172 -12038 -11777 -14265 -14709
9718 -14709 -18455 -19136 -16363 -17903 -24872 -29154 -14686 -8441 -4802 -9093 -3116 -2323 -3934 -9231 -12636
9703 -12636 -12458 -5942 -9546 -21934 -21899 -24126 -19675 -14352 -8559 813 -8318 -14795 -14544 -10475 -6743
9688 -6743 -2437 4812 8177 -4735 -13925 -14197 -10994 -11523 -8514 -6640 2285 -504 3504 -2168 -8348
9673 -8348 -12044 -12594 -9025 -175 -8842 -12313 -12049 -4331 -2481 -886 -8583 -8610 -2075 -4570 -8500 -7560
9657 -7560 -6406 -3162 -2919 -3846 -5172 -5611 -10669 -9843 -153 5706 -1986 -2793 -19 2473 9166 13438
9641 13438 6564 17340 35238 47739 51681 46122 49331 37073 25981 23963 14434 4287 -692
9628 -692 -3140 3462 8982 3315 2294 -1447 -611 4005 6062 5770 106 -3560 138 554 -3485 -4
9612 -4 -9863 -14652 -20563 -23840 -28889 -24376 -11659 -9648 -6060 -3087 2072 -7708 -16510 -16754 -18584 -18347
9596 -18347 -21284 -30282 -27150 -24447 -27908 -26459 -15783 -8198 -5943 -6885 -8181 -5139 -6082 -16056 -15531
9581 -15531 -11731 -2603 1621 2372 3617 916 -155 -5856 -6781 -14063 -16606 -15244 -16456 -14611 -15056
9566 -15056 -15009 -19401 -22610 -33102 -30192 -30417 -19150 -9728 -15556 -13596 -13338 -7276 -6273 6673 12044
9551 12044 -2641 -11253 -15093 -11440 -10141 -14158 -9318 -8480 -5273 -653 11928 11611 7004 -2227 -6127
9536 -6127 -5340 -7667 -882 6096 7179 5997 -3876 -3951 -2927 -7882 -13767 -9629 -38 -602 -2083 -2084 1778
9519 1778 -958 -5808 -6789 -6993 -10698 -25091 -17798 -1234 3609 -1178 -5646 -4948 -6162 -10158 -9624
9504 -9624 -138 -957 -8009 -4365 -1078 -1680 -7474 -16356 -18749 -21508 -17541 -9424 -4285 -9171 -10482
9489 -10482 -12584 -4168 1032 1949 -8177 1048 3358 -5730 -5976 -12460 -7945 -4213 -5128 -6107 -1668
9474 -1668 -64 196 5044 5288 -801 -5921 -13741 -13733 -15283 -15899 -14107 -10877 -7430 -8201 -10082 -8960 -2792
9457 -2792 -6225 -18696 -16497 -5897 -1039 2564 5359 -8996 -8717 -4412 -761 4385 -3718 -7093
9443 -7093 -6851 -6256 -6371 -9064 -9123 -17921 -16570 -9737 307 2341 -8155 -7631 -1269 -8133 -13924 -5950
9427 -5950 4514 13710 13855 679 -7099 -7565 -964 -2756 -11499 -4786 3065 6932 -3199 -13855
9413 -13855 -9008 -7070 -1153 6677 -6920 -16546 -17012 -12986 -8740 -10823 -18469 -21415 -23220 -28467 -24907
9398 -24907 -12031 -1947 -6626 -11840 -5014 -3921 -8826 -9598 -15353 -19799 -19788 -14278 -11464 -11215 -11476
9383 -11476 -151 1630 -3363 -7066 3910 12436 10131 5511 -996 -4276 -4720 -20461 -15824 -11279
9369 -11279 -13385 -12043 -7278 -635 -7715 -11577 -6322 -4405 -1588 -4066 -1761 -10441 -8736 -9523 -11835
9354 -11835 -14841 -11167 -8925 -13738 -12447 -15948 -18962 -17206 -11833 -6825 3017 12048 3767 1429 1955
9339 1955 1953 1063 2735 3534 884 -3971 -11277 -8578 2387 9301 9408 8839 4546 1938 -6360 -16183
9323 -16183 -23550 -17509 -11698 -7724 1966 -3666 -9329 -9634 -10846 -5533 -7708 -4884 -1462 1389 2852
9308 2852 9567 6279 7414 161 -7096 -3905 -2036 -2061 -6745 -14758 -6382 -1470 -9000 -13331 -4475
9293 -4475 2315 1600 3223 3197 1470 9598 12320 12372 8009 9384 4733 1977 -7845 -8682 -11796 -10776
9277 -10776 -1732 125 -506 1618 1539 19219 18518 12631 5060 -10232 -1590 1861 -322 -908 7991
9262 7991 3786 -3988 -7307 -8792 -9875 -2612 1660 6811 -614 -967 -311 -2798 -4706 2713 18489
9247 18489 23469 14258 5457 3951 -5139 -3449 2574 -1182 357 -2493 -2079 -2552 -3524 -3537 1482 7357
9231 7357 4966 353 2452 9806 2331 -6101 -658 4812 1930 2152 355 -5787 -9710 -3087 -3781
9216 -3781 -323 11928 11838 5713 8182 6974 4965 -803 -8448 -6536 1268 7090 5729 7795 2535
9201 2535 -859 5765 3858 7204 9316 10044 10686 7074 5013 339 -7821 -15514 -12122 -12972 1159
9186 1159 7346 3211 11597 19650 19593 15157 3490 4421 8975 7910 10323 1195 3073 4264 -1693
9171 -1693 1514 6480 736 -2475 -1222 8012 4226 6317 11995 10933 7788 1268 223 6737 4567
9156 4567 9025 11665 3800 3539 12246 10125 4722 3710 -3672 -8440 -2620 5739 12786 23281 18978
9141 18978 10967 7578 2210 -2511 -234 5727 12217 13998 11406 6482 -265 1157 10850 1687 -475
9126 -475 1366 -209 2432 13444 12373 5796 2449 2109 -3629 -3540 3914 5582 6304 6028 7049 3472
9110 3472 -92 -2609 10001 9752 -5578 -11947 -15020 -14024 -5248 4920 5757 1737 6437 12124 18785
9095 18785 14458 2683 4502 9094 14938 16523 15491 7692 1796 -6057 -4821 -6254 -3988 1458
9081 1458 -2963 -984 4208 7307 12795 8364 1743 10180 11799 9291 8142 10321 13238 19182 17229
9066 17229 11409 8596 14034 13728 14064 17179 12780 9488 2423 -3389 -9191 -12722 -11799 -564 3959
9051 3959 -70 4086 -234 -549 228 5342 3453 4897 6421 4980 -823 -1657 9415 14971 13544
9036 13544 17534 29601 27911 24869 28632 28745 23649 14935 11592 -986 -7903 -2955 -7508 -3547
9022 -3547 6281 6729 7158 238 5651 1887 2914 12463 14078 10549 15397 13152 5087 9681 14883
9007 14883 5461 5013 14031 20897 22953 15908 11222 11919 17177 25658 27694 31409 31318 29584 24416 30027
8991 30027 39264 35936 26890 21524 25236 21203 15767 11966 9701 3684 5092 11461 10138 10669 12242
8976 12242 21028 19928 20663 13411 10647 11552 20999 22814 19260 20007 20949 26155 25600 19155 16106 17622
8960 17622 20693 29304 37369 34497 27772 33808 34780 31401 28880 24978 19669 22532 24720 25529 27978
8945 27978 30421 28735 26318 28058 26194 22313 20066 15260 15695 17179 26312 33848 38296 27358 24163
8930 24163 25219 29324 29681 23265 27833 31359 32874 28906 29213 24394 19156 17429 21397 17021 12985
8915 12985 23089 26368 21099 21082 28637 25648 29127 21090 12864 20602 30645 20044 17324 19536
8901 19536 19542 24006 24444 31104 37371 42338 34192 23379 15088 20787 20178 11477 8259 10611 17782 26304
8885 26304 23664 22524 18986 12370 13879 9322 13162 21307 20587 15912 18760 21382 27099 17044 12227
8870 12227 9122 10570 20564 28130 25650 33284 34179 35391 31566 16440 11664 15483 12357 17785 10284
8855 10284 7783 5169 10221 12499 15860 25299 23463 20582 18671 21349 15621 17835 17013 16922 18497
8840 18497 24096 25752 27379 24029 19347 21605 23578 26610 24476 19886 18255 18329 17210 10720 16982
8825 16982 21922 22637 29451 34927 34654 32560 38442 37676 42895 38610 33090 32305 30153 21577 19377 23231
8809 23231 30838 40622 40324 39317 32237 30966 33844 35340 29566 27002 27760 30856 35105 38289 39428
8794 39428 38831 32198 33762 41107 43536 36311 27101 20586 19595 21545 25485 31719 35054 35725 35939 32090
8778 32090 29358 23152 23520 31066 25120 22883 17694 21978 31900 24406 16906 28621 36570 33070 34930
8763 34930 35815 36629 40441 54468 61900 67152 64576 62587 65294 69269 70235 61030 55309 56332 64542
8748 64542 70887 73071 71827 72712 73704 63560 65631 63607 51649 61171 77971 93312 104387 106107
8734 106107 95533 80185 69473 66134 62920 57529 54560 50002 50200 48189 47385 45910 56521 59173
8720 59173 63017 67984 58320 53516 55457 55738 57079 58705 64618 58187 50800 51430 53406 51364 45224
8705 45224 46183 53127 51517 51048 52493 56763 64900 67798 67813 70109 73725 80611 88695 89629 86604 87553
8689 87553 82078 81732 79225 77222 72937 70707 69916 65335 69404 72135 74607 75146 88051 91642 88986
8674 88986 91409 92252 88291 90353 98013 102776 114707 122888 129893 142138 153176 171331 186156 215278
8660 215278 253734 283629 298229 299868 277385 244826 222283 201092 178523 161968 151225 141419
8648 141419 129672 122379 114386 110628 105603 105016 107544 117319 111764 111896 114331 118000 123018 122282 117606
8633 117606 110528 106549 104900 105587 107080 104338 99743 91895 93576 97074 102259 100765 102956 108791 106022
8618 106022 108196 109610 102755 103229 101974 119091 126552 122822 120747 130004 136455 138784 145714 143653
8604 143653 133738 137831 142133 142399 140600 148538 163630 170097 178351 177337 179157 182978 201018 222318
8590 222318 242434 264622 292956 336400 395747 459293 495546 495858 460266 409824 369066 336645
8578 336645 297203 266450 251147 247585 242513 239259 235672 241453 244313 241365 241613 243699 242014 248560
8564 248560 258293 258548 257907 266590 269569 265082 268904 277036 295491 306100 313323 321098 326648 340116
8550 340116 357352 379849 397338 415081 426544 441606 458101 472950 484711 495123 502396 509637
8538 509637 525024 546986 584199 625097 660000 699066 736201 779058 843505 904340 961768 1025376
8526 1025376 1095623 1178208 1274310 1374949 1492961 1618659 1741247 1851600 1955604 2036130
8516 2036130 2074354 2059122 1982459 1837310 1660891 1466844 1281184 1116448 971911 853255
8506 853255 750374 664757 590457 532509 489653 454841 417665 382767 349892 328270 303982
8495 303982 283630 263739 256502 248620 232852 228073 219105 210211 201400 180094 164023 166225 171673
8482 171673 170264 166898 160474 156595 162773 153727 150429 149405 138778 135978 122691 118104 119156 113726
8468 113726 106351 111516 110986 105244 102372 106248 105226 102197 103697 104671 106441 112328 119714 113536 113695
8453 113695 112259 115472 112314 103155 107045 102678 102032 93931 79538 83910 94517 97689 90735 90627
8439 90627 89371 87146 80225 78212 75686 73407 69679 62569 60469 58803 56736 56562 56153 57957 59341
8424 59341 58176 51526 48188 56730 60773 50688 56946 70016 72270 71182 63771 56449 50012 49300
8410 49300 56656 50073 45067 49209 43708 36700 36123 33687 35019 33639 38647 38148 38608 42473 42383 39150
8394 39150 40239 37461 31559 24988 21040 22850 35697 42483 42623 42758 38206 27393 24542 28019 32996
8379 32996 27913 25769 24416 36273 45707 40887 47660 46172 42714 49866 53482 52593 52400 40968 41102
8364 41102 44836 44606 43114 35631 26669 32099 33403 41554 47722 43543 39318 38677 33721 31333 27742
8349 27742 27301 24446 15903 22081 34914 48153 49857 48420 40624 42534 38007 37662 27684 32137 39818
8334 39818 38080 28803 27042 22553 25498 36064 43842 52607 61314 67930 72773 74036 71512 60185
8320 60185 38196 25400 25006 26364 21701 24180 28225 35844 39775 38868 33608 30189 28005 31685 47908
8305 47908 58331 50554 30377 23508 31528 37886 43320 44271 43335 40890 36030 32555 30282 29829 34015
8290 34015 35321 28814 25408 42664 55218 49309 52954 63285 70209 91178 98583 93038 78536
8277 78536 65257 52454 38670 35941 40180 31716 28457 27889 25161 29180 27409 21279 19970 18558
8263 18558 17288 21007 23752 15160 21091 22612 24756 26654 30236 36668 32607 37156 46343 48844 52307
8248 52307 48416 37725 31095 29201 33612 32148 35439 31806 36667 46689 51270 62365 66917 62491
8234 62491 52868 41382 36999 32086 29825 32008 37270 42342 44197 51155 54660 39534 34081 38475
8220 38475 35949 31692 31128 27937 33160 34903 25499 16543 25710 27928 26600 29625 30950 24315 27221
8205 27221 36491 36796 31246 21457 14694 9840 9849 11799 14717 20290 14863 11624 20265 22450 24651 30128
8189 30128 24938 22347 20809 15485 23677 25178 30593 22005 17554 26480 24817 28741 36461 46288 30888
8174 30888 27062 36057 42126 36042 25513 20929 15515 9289 4239 5644 9935 16210 21890 34680
8160 34680 39532 39021 29599 25312 22250 18548 16335 18944 14315 12660 13791 15797 17764 12032 19913
8145 19913 23403 26823 26176 21790 26807 26054 18501 22704 28912 26638 23539 16674 11977 16933 18002
8130 18002 11584 6671 10034 10664 13758 7994 8558 18434 14938 3225 5049 10572 14431 21003 19371
8115 19371 22476 23231 19630 10376 4460 4563 19777 18918 5099 8639 17623 12577 11967 7794 136
8100 136 -3198 8431 19635 24585 20616 10974 14032 9704 10195 13515 11117 7224 -1553 3089 2839
8085 2839 6116 9723 14546 28117 28017 20738 26977 26759 17514 12815 12835 9002 -6 2045 -2441 1175
8069 1175 11029 18364 26234 30290 23470 22130 24694 12396 13381 22995 20659 11669 13554 18653 25344
8054 25344 24392 21356 27223 29560 32815 33168 38194 37124 37181 35128 29394 32705 28200 24583 25781 23229
8038 23229 22112 29402 33032 39881 37073 36608 35651 37058 28433 23173 19055 14445 14340 23229 26592
8023 26592 29690 30072 31814 35916 34130 31445 27819 30177 31877 28626 26954 31108 33629 32891 36471
8008 36471 33909 21942 15049 16637 9728 2421 7381 24562 30161 24576 22790 23715 29787 32811
7994 32811 32293 36361 30509 33791 40044 44880 48502 51300 48448 49176 65542 73526 75776 71246 78820
7979 78820 90156 95192 86216 93096 101012 100269 105312 110792 106109 104282 105684 112833 106538 98265 95474
7964 95474 93977 96834 94474 93975 101516 98268 96154 95373 87657 93395 98927 101307 99646 104696 108188
7949 108188 104198 102490 101316 103442 105605 102646 103499 109618 115913 124114 136041 148209 148597 152415
7935 152415 170103 194813 227424 251929 272260 281938 275791 256802 235352 216181 192570 161427
7923 161427 142452 132943 126887 112988 103495 104123 99285 90032 82254 80363 73050 74425 77911 77682
7909 77682 74535 84274 86946 91047 102667 98830 84964 72143 73694 71753 78176 85392 87884 99046
7895 99046 115636 128671 126836 125275 130446 141705 149566 155465 155365 153973 150613 143744 140344 133674
7881 133674 131734 114749 107175 92976 75731 78000 76082 76370 76922 72946 61922 57686 49114 47184
7867 47184 51673 61005 58929 48087 50432 56674 51118 43303 44802 52189 54610 54610 58974 49975 47261
7852 47261 52602 50595 44832 53090 59989 64145 66620 64431 60423 52959 49882 44615 43751 48255 42312
7837 42312 35380 45066 48562 50207 41643 37449 35525 34439 30922 24670 32083 27444 21844 20529 20562
7822 20562 8308 9045 14585 17789 19368 15292 16314 17154 14669 25364 31581 32940 27692 29711 18343
7807 18343 7995 -1638 -5425 4924 17926 21625 20732 24527 25426 17227 18553 18405 11959 11667 11567
7792 11567 376 1881 2692 14286 16979 15385 15850 9787 7073 11857 14023 16074 7688 5770 7846
7777 7846 14277 27593 28127 9919 2848 6619 2133 -3901 393 2134 7669 1894 5197 9386 14472
7762 14472 13697 6462 8161 12066 7129 9308 3347 1116 12398 13651 10898 11094 13004 12485 14314
7747 14314 12237 9769 2824 3288 10267 11983 14160 6363 5087 7927 12080 8951 11496 8604 9386
7732 9386 15375 15267 19964 24854 24073 12605 9780 2096 9503 15938 16820 3918 3863 5408 2437 8549
7716 8549 14873 16967 13279 8028 3119 -621 -2618 -1850 2229 15355 23291 24285 18098 3913 -327
7701 -327 1880 7076 8389 16526 8728 -3158 -6373 1705 12704 13099 15098 7646 3102 -8224 -14863
7686 -14863 -12418 -9012 -10502 -7382 -4488 -11068 -13230 -4851 6192 11074 14132 12438 2770 2880 -109
7671 -109 -9834 -8246 -7453 -10138 -14175 -14011 -13710 -10802 -9658 -7335 -1216 3085 9012 15898 16732 5380
7655 5380 -12458 -8161 4927 9335 4723 -3604 365 4374 9650 9020 3362 3065 3498 -11658 -14663
7640 -14663 -13350 -9374 -4248 -5807 -3628 -2004 1410 12296 10107 2596 -886 -2599 -3446 -813 -3354
7625 -3354 -7281 -7088 -14877 -14409 -3807 -2050 -3024 -2246 -5125 -9082 -8273 -12319 -12824 -16782 -15500 -9480
7609 -9480 -7884 -12738 -5029 -5053 -8183 1532 10390 7820 4979 2757 3634 878 3842 2291 7814 13161
7593 13161 14996 6953 162 -7227 -7631 -1057 -1298 1219 5561 1005 -10890 -12187 -5428 74 791
7578 791 5629 10613 3350 -2599 -10958 -10309 -1455 -4144 -10940 -20165 -11237 3299 6526 3718 -4366
7563 -4366 -1910 -5782 2248 9470 -3727 -5084 -4494 -11971 -16452 -11498 3905 16588 12277 3094
7549 3094 -648 9877 1663 -4821 -1828 125 5540 4569 2687 3635 -4478 -7933 24 12992 15018
7534 15018 3816 -925 -1817 12 -6513 -17211 -16259 -17474 -22788 -11995 -6056 -6618 -7277 890 2577
7519 2577 8763 10804 5770 6431 1428 -424 -5343 -6130 -5477 -15073 -16191 -14549 -5499 2824 347 -5066
7503 -5066 -1297 -5705 -2221 2933 10691 7533 -8679 -20091 -16092 -13107 -11807 -9484 -5862 -8565
7489 -8565 -3622 -2958 -5870 -7575 -8828 -10681 -2547 6579 8402 10503 2417 3443 4361 -8204 -12609
7474 -12609 -3860 -3559 -12962 -24233 -25472 -19501 -15205 -5754 3476 2905 5731 3945 1517 -1421 -2917
7459 -2917 -13248 -15885 -10886 -3857 -1488 4771 10937 -3980 -8778 -7733 -3071 -7286 -13821 -18558
7445 -18558 -23065 -7753 -9438 -10642 3631 8185 5154 9587 8968 -3879 -12621 -10972 -12918 -17542
7431 -17542 -11580 -10861 -12151 -13747 -18302 -23120 -16286 -14039 -14147 -6069 331 -4577 -21729 -19418 -12452
7416 -12452 -6148 -12612 -11519 -9356 -12552 -11220 -7740 -9754 -12521 -17013 -17814 -14584 -13748 -13462 -11392
7401 -11392 -13728 -13434 -11270 -14718 -16553 -15484 -9226 -8729 2264 -1933 -8510 -10941 -7766 -10890 -12511
7386 -12511 -7641 -7384 -9671 -12037 -14955 -17256 -16093 -16902 -16010 -15025 -10598 -2170 245 -10391 -4577
7371 -4577 3138 622 2134 -1404 3724 -1328 7571 14449 6355 3120 -3160 -12789 -10455 -6068 -3129
7356 -3129 -3956 -2648 7850 329 -4064 -4186 -11768 -11884 -14525 -13028 -9716 -14244 -20883 -18004 -2730
7341 -2730 7113 -866 -7567 -10313 -8620 -4229 1138 9690 1248 3118 4231 -2480 -5509 -4074 -7457
7326 -7457 -8644 -921 -3179 -3947 -9064 -9869 -11173 -4906 -7131 -5499 -8976 -5214 888 -6901 -11667
7311 -11667 -4563 -4541 -6198 -5774 -5876 -1759 1925 696 1754 2429 2131 -4296 -18004 -12843 -462 2611
7295 2611 -3442 -10865 -10635 -11754 -3178 -2137 -5178 -725 564 7252 6976 5053 4467 -3496 -6774 -6005
7279 -6005 -931 -2125 6996 6187 -8231 -12006 -11596 -11247 -2902 -446 -9398 -8902 -12354 -6528 1076 596
7263 596 2001 9988 9110 2262 272 6550 8825 -1481 -6970 -12013 -12249 -13006 -13350 -3419 -3272 -11832
7247 -11832 -6173 1445 4941 2236 -8045 -12354 -12946 -15244 -21968 -18289 -2999 1000 -5852 -10370
7233 -10370 -9112 -3718 1041 -2564 -8925 -13422 -22450 -27252 -18076 -1846 446 -3847 -5718 -10765
7219 -10765 -13328 -9341 1623 2241 -2143 -7598 -8235 -2388 1972 1296 83 -4586 -5919 -8587 -3163
7204 -3163 -1229 -1184 -1283 -2967 -5334 -7550 -13107 -2827 738 -4729 -2088 -674 -9979 -3334 -1366 -2467
7188 -2467 -9059 -11479 -7029 -3158 -12043 -12106 -13282 -20971 -21096 -19090 -10315 -2344 -9814 -16451 -20818 -12911
7172 -12911 -6240 -5761 1099 25 -2962 -5507 -13284 -16668 -18934 -20332 -9279 -6031 -9421 -6980 -4497
7157 -4497 -6748 -1924 -158 -2330 -5575 -8392 -4780 170 -2837 -5658 -2337 -4971 -10889 -15869 -16794
7142 -16794 -27606 -21024 -18357 -14032 -16220 -14770 -13116 -11599 -7597 -7053 -12429 -9033 -11960 -21440 -29024
7127 -29024 -23182 -15868 -9207 -10953 -10241 -19051 -18854 -22735 -15967 -15618 -8044 -1978 -3260 -11846 -16045
7112 -16045 -23696 -23282 -18432 -21926 -17228 -13087 -21205 -19639 -14648 -8598 -3444 6738 15751 15659 9029
7097 9029 3221 -4539 -8044 -8223 -9663 -10161 -12990 -10876 -1164 862 -5176 -8425 -12111 -12893 -18467 -13959
7081 -13959 -1783 513 -5597 5545 12457 11874 7242 3985 2499 6226 9420 -4157 -13709 -10623
7067 -10623 -6649 -5210 -5606 -2132 -2081 -12469 -15928 -14493 -3136 -3463 -1624 11 -8092 -14070 -7323
7052 -7323 -11865 -6707 -122 4928 11215 6501 -1490 -10107 -11353 -13065 -15661 -9755 -9753 1365 408 4947
7036 4947 3461 -1484 -8236 -10043 -5909 -1225 2680 2941 -3957 -8738 -9258 -15381 -20221 -24127 -18012
7021 -18012 -15734 -9865 -8209 -14717 -22320 -20451 -22667 -19923 -16711 -13847 -15770 -18312 -19176 -14380 -9398
7006 -9398 -6063 -1310 11697 8510 11998 11395 5010 7071 3892 -3785 3883 10744 13049 14282 1853
6991 1853 -8202 -14701 -20307 -25462 -22643 -19890 -13955 -3703 -1619 -4789 -7556 -11646 -15120 -13401
6977 -13401 -12437 -17835 -21173 -21610 -18186 -10148 -11496 -19819 -20141 -17564 -20141 -13071 -12054 -15013 -7329
6962 -7329 -5049 -6319 -10365 -11001 -11940 -15087 -15962 -7188 -4366 -855 7914 1460 -6831 -5492 2434 2631
6946 2631 4924 3471 8933 13622 7015 16537 12638 6996 2638 -4022 -3123 -9949 -11376 -17581 -9557
6931 -9557 -7522 -7747 -15928 -11278 -7237 -12921 -7945 -1571 -5236 -16666 -23587 -18173 -10815 -8800 -11472
6916 -11472 -3091 -2706 -7981 -9837 -2645 -3158 -6010 -6745 -762 -3760 -1868 3372 -4260 -9318 -18370
6901 -18370 -26106 -22455 -11957 -3478 7759 11714 1063 -5069 1585 5078 -771 -16737 -20147 -20580
6887 -20580 -1536 12510 10790 3686 -3953 -15751 -13153 -2603 2129 -1926 -4157 4197 10938 5488
6873 5488 -6148 -1574 86 -3351 -3802 -5575 -20601 -26520 -30386 -31620 -21168 -6600 -7115 -5610
6859 -5610 -120 803 -4707 -7501 273 694 1030 -7867 -11592 -11948 -11011 -15036 -19029 -20258 -12560 -3953
6843 -3953 -2659 1219 3155 -1265 -2210 -6571 -13210 -9902 -1569 2437 4855 -155 11497 8579 -4497
6828 -4497 -8884 -9397 -10928 15 2231 -9373 -10295 -5451 -6899 -6742 -16830 -11158 -5507 -5119 -9213
6813 -9213 -4587 -4110 -6719 -6197 -7896 -6594 -8660 -16736 -7276 3908 -698 -4821 3400 5944 3865
6798 3865 5870 17018 27043 25542 23039 19004 8174 -2275 10051 20123 14716 -5341 -10613
6785 -10613 -11616 -6503 -13076 -22209 -9799 -4272 -7274 -3796 -401 -2829 -4242 -4986 -7037 -4551 -1799
6770 -1799 -4147 -346 3183 4407 3029 6839 1625 -3552 -5965 -7159 -4921 -12695 -13706 -11162 -18208
6755 -18208 -17991 -9264 -5883 -7452 -4795 1852 1325 -4783 -12268 -9505 -674 -3969 -8897 -10135 -5876
6740 -5876 -14145 -18524 -13847 752 11834 8990 15639 11796 9546 -869 -8892 -5316 461 9917
6726 9917 13956 8929 1095 1553 -4442 -4511 -2266 6462 9359 1278 5053 3116 -5978 -251 9476 15084
6710 15084 9194 507 -587 1384 -3461 748 5451 -2171 -4628 4047 136 -10997 -11378 -10568 -14266
6695 -14266 -12701 -9417 -14721 -17423 -14484 -14339 -11973 -5732 1807 3766 808 -7062 -5776 -8382 -16266
6680 -16266 -10838 2238 2658 5507 5205 -4324 716 5948 8990 8424 3454 926 5501 -205 -6594
6665 -6594 -866 -1574 798 1003 -3299 7358 10801 -1598 -4461 -7109 3876 9669 2665 6479 8584
6650 8584 4975 -2967 -3501 -1051 -9132 -11516 -16934 -10797 -5289 -5711 -5208 -1582 -4277 -8637 -3180 -3827
6634 -3827 -4395 4461 14310 -2483 -10178 -6957 -5798 -5053 -952 9287 15883 13107 8547 17789 6543
6619 6543 -5293 -2286 179 5396 6524 395 841 11951 13535 8525 -3333 -8689 -1161 -1905 -3300
6604 -3300 -1191 -3846 -9428 -8983 -4417 -7098 -3310 -3088 -11544 -21720 -24836 -22477 -20203 -5655 -5894
6589 -5894 -10859 -5432 5367 6597 3336 -3561 -6348 -1369 3171 4688 -810 -17020 -15462 -14616 -6641
6574 -6641 -5037 -10056 -9915 -4814 -3528 1763 -5131 -19247 -18602 -13069 -7489 -5598 -15793 -18831 -4767
6559 -4767 -6077 -1944 6074 -2433 -1424 4552 -7390 -11259 -7931 -9619 -14795 -16105 -14734 -17202 -18214
6544 -18214 -16425 -16095 -13594 -9033 -14576 -9425 -3901 -1912 -1213 -7916 -14895 -13285 -10832 -6384 583
6529 583 5099 2908 5624 5062 4374 3884 3127 4459 5156 3751 -8269 -9738 -22692 -20154 -8356 -1785
6513 -1785 -5723 -17719 -19174 -14438 -19208 -27470 -27570 -17146 -15307 -6947 -515 6325 6055 3702 5741
6498 5741 474 -6841 -629 3680 573 -2736 4841 214 -4117 799 6836 -7942 -15971 -17801 -17464
6483 -17464 -17608 -3883 -5103 -12531 -52 891 52 -5463 -10425 -10499 -7955 1127 -3997 -3042 -3625 -4204
6467 -4204 1952 8395 4764 -731 -1634 -6321 -3258 -4108 -7805 -18473 -19781 -15294 -5477 4409 -9402
6452 -9402 -19375 -13676 -6791 8175 11831 11098 -645 -12406 -8276 -8183 -5819 2275 -4612 -6237 -8461
6437 -8461 -6077 -8803 -2477 7637 15361 10158 -3193 -6607 -5447 -13851 -14221 -4017 -3965 -9760 -7297
6422 -7297 -4515 -4757 -9326 -2218 -579 -6491 -10251 -3102 3944 7815 5765 -421 -6361 -7500 -7447 -3832
6406 -3832 -1773 -3399 244 -843 -12781 -9338 -2076 -3803 2881 4990 3606 261 -2806 3090 -2987
6391 -2987 -10249 -18495 -13039 -7244 1630 3992 -879 -3268 -4766 2134 9566 7055 6228 1482 -1698
6376 -1698 -474 2259 -138 -375 -372 -376 -2707 -7636 1600 2226 8739 11022 10977 17172 16104 6417 -515
6359 -515 -3209 -10310 -1786 537 2371 -5667 -9647 -10606 -18512 -7133 -5201 -9759 -11751 -6059 -13265
6344 -13265 -13196 -4527 4052 690 -4744 -1691 -1471 -7398 -9140 -6813 -11598 -11142 -318 3569 4825
6329 4825 10892 5469 1742 -2766 -4811 4761 6721 7322 7747 1248 -2089 -2441 -7789 -11600 -9490 -3111
6313 -3111 836 -9658 -18517 -12566 -5788 831 6293 2961 -2348 -1190 831 -3550 -9109 -12896 -23405
6298 -23405 -35097 -24627 -17241 -17349 -17727 -11397 -8078 -1954 -1354 -8783 -7672 -7745 -16204 -14019 -4451
6283 -4451 -177 1441 2702 2414 -4854 -2611 -5623 -4837 -9176 -12908 -5969 5590 3634 2597 -421
6268 -421 -623 2096 1883 -2501 -2592 -350 -3467 -8202 -8891 -2534 -2943 -4380 -6036 -5859 -201 -3262 1477
6251 1477 -2379 -11344 -7769 -6617 -14574 -9198 -5118 -10013 -10928 -7838 -3537 -9639 -13757 -7682 -3122
6236 -3122 2725 3957 3943 9935 8262 2065 -977 -281 3084 -884 -385 5897 9613 4233 2334 -3578
6220 -3578 -2077 2363 5119 -402 -14251 -10165 -5037 -817 -736 -4857 -10319 -19018 -4213 -4243 -5123 -7629
6204 -7629 -6796 -11332 -10003 -8744 -9535 -10084 -1687 3995 -6663 -13210 -10880 -9709 -8716 -9017 -13415 -15136
6188 -15136 -14129 -12912 -837 -2846 -10881 -14774 -15360 -11778 -7713 -12248 -18703 -24470 -22509 -15268 -11513
6173 -11513 -16543 -17378 -6776 751 -1916 -5943 -7002 -7643 -1099 14393 12944 6278 7314 -689 -2364
6158 -2364 -4258 -3911 -7457 -12379 -15901 -12641 -11531 -12097 -6218 1723 3074 5157 71 -6135 -3603
6143 -3603 -9951 755 2358 2356 -1709 -7799 -14349 -9648 -3802 -802 -2141 -6998 -17736 -15810 -3505
6128 -3505 3025 -7208 -8637 -8803 -14148 -10866 -4731 2562 9508 7407 10066 -1030 -11157 -10429 -8736
6113 -8736 -4090 2892 4244 -4386 -4699 -1673 -1839 -3166 911 925 -2173 -660 3912 3266 -1166 -6098
6097 -6098 -3165 -1872 -3752 -1019 6499 1183 363 2526 -1017 -2278 2452 8753 5732 4538 -1455
6082 -1455 -10894 -12980 -2712 4748 2833 -1562 -1450 -1875 2720 383 -6078 -5029 656 -2785 -7283
6067 -7283 -26 5030 2625 -2227 -11919 -21964 -19757 -8205 -2657 -2446 -7913 -5815 -7127 -11524 -1915
6052 -1915 -1412 -5373 -7367 -8067 -5353 -3030 323 55 -2569 -8927 -11269 -8330 -9430 -5790 -3549 -7527
6036 -7527 -6991 -10885 -15119 -14114 -9001 -3216 -6599 -9998 -20998 -25720 -18622 -15018 -13914 -3547 -2527
6021 -2527 -1614 -5150 -8936 -11049 -10866 -15496 -23619 -25111 -11244 -60 560 -956 -4133 -3865 -4975
6006 -4975 401 -8907 -10677 -5523 -4151 -4119 -7473 -11421 -3102 5828 14117 7161 9247 7702 5546
5991 5546 602 -10944 -18300 -15683 -16318 -13405 -17218 -15629 -14412 -6183 -5911 -650 11542 5251 -549
5976 -549 1227 -6237 -12734 -3731 3663 6321 340 -1624 5159 9203 4998 -740 -7885 -9802 -9864 -9916
5960 -9916 -467 2054 -75 939 323 -2293 -4108 -1690 -2325 -156 -546 8138 294 -1709 2289 7028
5944 7028 4126 -7923 -17398 -18433 -7502 -10442 -17911 -10377 -14196 -11805 -4867 -5348 -4391 -6709 -19134
5929 -19134 -23617 -21735 -9726 2323 4542 4659 -6190 393 6570 5011 -1663 -5149 -3772 -146
5915 -146 -2142 -2723 -1270 -597 -9845 -5659 2653 7712 3471 -3343 -2214 2615 4198 3348 3857 -1825
5899 -1825 -8978 -15005 -14830 -13777 -6330 -7687 -5667 -10348 -15758 -19812 -22584 -14991 -11447 -7358 -497
5884 -497 -4910 -10023 -10779 -7678 -6063 -1682 -1829 -7331 -14315 -20512 -20426 -12719 -9111 265 -1284 -4378
5868 -4378 -5380 -14318 -11354 -5346 -13457 -16251 -6547 1101 3990 -5340 -9722 -5042 -6215 -1514 -3601
5853 -3601 335 3804 815 1691 8010 4954 -8719 -17321 -15661 -13066 -7116 -8939 -8077 -3874 -2192
5838 -2192 -4687 -10622 -13195 -14717 -16161 -11708 -561 10541 11144 992 -926 5029 2322 5533
5824 5533 -891 -5384 -1141 -7970 -8847 -4870 4363 2931 1244 9688 13754 4723 2636 -280 4063
5809 4063 6159 -428 -1589 -5480 -738 -3047 -6611 -17691 -17920 -12943 -13318 -6240 -2357 4395 1457
5794 1457 -8006 -2813 -5442 -7012 -11997 -13156 -8267 -3715 2542 -4217 2867 6784 -1237 -3488 -9419
5779 -9419 -5925 -9199 -6065 -5076 -5245 -10676 -15545 -15780 -9798 -10976 -7578 -4548 -2258 3347 5699 -5303
5763 -5303 -8135 3416 2765 -4444 -4950 -4297 -990 1575 862 -8588 -7294 -3965 -6945 -8440 -4181 -5326
5747 -5326 -538 3502 1377 -3010 -7278 -5988 -13393 -13642 -4793 -2853 4574 14284 13251 4541 594
5732 594 1771 -402 3093 -925 342 -4248 -11785 -7525 -3616 -3508 1767 8741 5661 4859 -5257
5717 -5257 -10264 -5512 -8964 1321 3628 171 -2524 4980 9029 10232 2686 -4505 -9413 -12999 -9711
5702 -9711 -3094 3442 -2212 1696 6655 6281 8742 13937 14309 6111 4444 5145 1631 10764 8456 -899
5686 -899 -2140 -7193 -7055 -6709 -5911 2244 -843 -12029 -11173 -5538 2819 8277 4661 326 5454 2431
5670 2431 -6523 -5590 -1048 -35 6768 6284 11760 19521 11462 3747 2095 -767 3253 2630 1694 -8170
5654 -8170 -11182 -2528 -145 2366 6142 4460 2374 -9396 -6380 2819 13586 11430 8495 11120
5640 11120 6311 -2080 -2977 -2875 6045 9247 9418 13920 17375 6635 -694 -3378 -6559 1546 4429
5625 4429 3583 5043 -1918 -3256 -4649 -5400 97 -6970 -6124 -3105 -3927 1067 -3939 -8455 -3496 -8080
5609 -8080 -10282 -7026 3047 5873 700 -8496 -10579 -11900 -9923 -7936 -7693 -5748 -5106 2495 4553
5594 4553 6939 15397 7709 9235 3349 328 2449 3392 4680 4590 3359 3669 1607 3247 3871 5682
5578 5682 8700 7702 7699 16423 17182 10868 3739 5942 7113 -2832 -4356 367 -4414 -2674 7910 12808
5562 12808 14142 11880 7745 6651 2852 -4840 -6148 -902 2662 2109 2102 10954 -995 -9808 -8030
5547 -8030 -12647 -4958 -7432 -7483 -360 2888 -3657 -2234 -2586 -3991 -12782 -3348 -1449 -6373 -209 12336
5531 12336 11027 -3829 -13254 -8850 -5946 2036 9375 10874 7099 4162 6451 -4991 -9564 1363
5517 1363 14006 21240 17472 53 -2745 -5064 -4205 -5651 -11831 -9584 -10383 -4553 -6312 -5256 -6285
5502 -6285 -5954 -4518 -4192 5611 6769 6957 14054 15887 11387 521 -6690 -9697 -12714 -21660 -17667
5487 -17667 -10637 -7957 -11548 -8808 -11460 -10649 -8164 -4563 -2315 758 506 5520 1566 -8391 -13563
5472 -13563 -13986 -13626 -8527 -12351 -15608 -8603 -13496 -8944 -3385 9305 17892 12788 11254 9215 -6699
5457 -6699 -12718 -9385 1787 3202 -2746 -5955 572 -5594 -594 7029 -2868 678 3808 1332 -416
5442 -416 -7087 -11630 -8688 -11939 -15950 -18999 -11835 -7611 -7033 -2415 -297 -7726 -15523 -18643 -9078
5427 -9078 -2877 -4397 504 5211 13500 7226 -1881 -491 321 -5913 -13831 -16561 -7902 -6243 -811
5412 -811 -2626 -4517 9184 9316 1480 -4890 -4222 -4106 -4897 -6044 -5142 -1945 207 5169 9568 597
5396 597 -12796 -16873 -5052 -1275 -9333 -8045 -7574 -9403 -261 237 1425 7839 12772 4901 -1636
5381 -1636 2076 3387 6023 7847 6238 4055 1364 10968 14427 5935 4645 7338 -4425 -8857 -10110
5366 -10110 -1887 8741 11110 3396 -4231 -9105 -8243 -11977 -12693 -4964 394 1027 -6900 -8792 -2371
5351 -2371 -6727 -7604 698 11806 8610 4704 3181 -2810 -4725 3613 8061 7639 5245 4828 -7200
5336 -7200 -3007 -6362 -3302 6411 2058 -2289 -236 1248 1441 -7132 -12498 -13434 -1322 3829 -135
5321 -135 -7093 -5966 455 -1398 -134 3304 -5819 -18579 -16183 -4910 5074 4882 2830 8426 9876
5306 9876 7523 605 2627 14691 17032 7325 416 -1669 -798 -2637 -7929 -1704 -36 -4442 -537
5291 -537 2353 4001 6217 11777 3875 9649 7334 -5487 989 6037 1738 -3777 -11851 -6689 -7986
5276 -7986 -16763 -15253 -10302 -7474 -4211 -7572 -5126 -3746 -848 3134 1668 -3708 -5005 4484 -4790
5261 -4790 -13997 -11306 -8316 456 6746 8396 1046 -10453 -7591 3299 11 5172 11960 9352
5247 9352 -780 -1684 -2321 -662 -1595 1166 3292 6383 861 -11666 -10817 -1292 3974 1918 -7010
5232 -7010 -8836 -3900 -9612 -11393 -2418 74 -2743 -8704 -16505 -16148 -15480 -3566 -309 -6042 -8485
5217 -8485 -7938 -5349 1095 -3076 -2817 1661 -990 -15 7635 5344 6742 2725 -905 -6384 -6585 -7747
5201 -7747 -11354 -14439 -13377 -8461 -7560 -4311 2658 1830 2250 -1865 -2760 -1299 1202 -1053 -4234 -3264
5185 -3264 -995 6386 6749 9639 7260 2777 3461 8807 1491 -1642 3295 2444 6331 16801 12468
5170 12468 14351 22284 19416 16622 19998 19339 16197 11813 6863 -1790 -10033 -4507 -5591 -7358 2871
5155 2871 4141 -335 -220 2985 4726 3116 -7242 -8346 -4055 -694 -7401 -8367 -5658 4144 5243
5140 5243 2298 5775 4788 3689 -8596 -14403 -12664 -14571 -10637 881 -2516 -3392 -5867 -4712 -204
5125 -204 5548 12492 11829 7934 5967 9058 -4432 -12273 -6148 7337 8491 8656 6430 13089 14437
5110 14437 6233 1827 1314 6515 10193 -880 5987 15946 7137 968 -1374 11712 9623 6272
5096 6272 13487 12776 1354 1525 8074 306 -9350 -10353 -3480 -4530 -9438 -11592 -12403 -12974 -10296 -18792
5080 -18792 -13921 -13743 -11822 -6214 4082 1819 5707 1447 371 403 -7715 -15803 -10681 -1359 1419
5065 1419 -1909 -2631 -4488 -9920 -10834 1437 6075 9904 8832 -391 -4900 -7026 -7632 -6000 -2932
5050 -2932 -5219 -6937 -13564 -16711 -16178 -16716 -24567 -19829 -6219 1231 -2901 -4870 -8716 -9657 -9139 -4682
5034 -4682 3227 1547 234 -1826 3725 3121 562 -2730 -1546 -5877 -9014 -11516 -18799 -12579 -2848
5019 -2848 -7579 -1594 2242 3757 15304 21714 14733 9327 2761 4471 7578 2182 -8097 -8945 -14702
5004 -14702 -8949 -6717 -2168 3640 9424 10150 4447 2930 988 -2514 2184 -2794 2114 8269 11982
4989 11982 220 494 5095 2741 4377 13184 13002 9366 5869 -3053 3119 8227 10835 8653 4826
4974 4826 -2500 -6854 -6349 -2183 -4368 -8740 -2577 -1879 -602 1198 4021 -6379 -11944 -3597 2440
4959 2440 5288 8156 5910 -79 3479 5818 7992 -605 -1309 -8595 -9963 -7770 -1225 4744 3290
4944 3290 3636 891 -4458 -4468 -4431 482 -5165 -1112 -11718 -8289 -2356 -6769 -5977 1253 -51 3082
4928 3082 -3358 -17769 -25829 -24223 -21711 -18192 -21249 -14047 -4103 -7629 -6018 5408 15977 12418
4914 12418 7004 -1210 -4075 -7913 -4838 -1230 -199 -3333 193 -4483 -10177 -12988 -10168 -10372 -3372
4899 -3372 -5666 -7157 -5771 -12726 -9006 -6760 -13032 -12041 -18216 -17483 -10574 5598 3700 362 5231
4884 5231 9551 1560 4335 4803 13551 9520 401 -2855 -5326 -13972 -15237 -12312 -5719 -2730 507
4869 507 -1161 -6391 -8926 -8474 -8385 -4470 4375 7123 9192 3809 -7015 -2622 425 -3024 4890 8585
4853 8585 3538 1446 2802 6271 3204 -4575 -5930 -3282 -1445 1590 6712 8535 5437 5015 -420
4838 -420 -3578 -2126 -2256 -2444 -3172 -6838 -3758 -2016 -4299 -6541 -2209 3710 6348 1353 -5796 -4707
4822 -4707 -5627 965 3606 -309 4872 10571 6097 1381 3704 8833 8294 3092 4055 -4326 -12912 -16628
4806 -16628 -21114 -23986 -21285 -9129 -6882 -2828 -8276 -8190 -11757 -16000 -22493 -20844 -17347 -16326 -6681
4791 -6681 5004 474 1075 7303 16569 14759 12577 4897 -131 5650 13624 12685 5700 6342 7072 3876
4775 3876 3248 -1845 -10388 -13456 -4044 3847 -5447 -10180 -10095 -8888 -3703 -876 -4782 -1619 1983 3971
4759 3971 -5584 -7241 -9543 -5068 -12011 -13362 -6076 -9085 -8783 -11910 -7140 -2014 -6084 -19084 -18314
4744 -18314 -9047 173 14192 18594 13952 9565 5642 1723 1067 7595 3712 -3435 -2465 2232 2560
4729 2560 -1409 -5366 -6116 -1697 1061 177 -10297 -14474 -2558 -2604 1660 7997 14214 12368 7164
4714 7164 4807 5436 3981 10177 768 3759 14697 10455 2511 3228 3090 -3037 -9764 -12655 -8363
4699 -8363 547 1247 1105 4428 -194 -4875 -7317 -8409 2559 -153 -6052 -9386 -806 -512 -10143
4684 -10143 -10208 -7490 -150 2784 2778 1041 -7463 -10292 -10628 -11923 -13264 -14734 -14420 -14397 -9165 -9097 -5622
4667 -5622 -5329 -3336 -2044 -1319 4710 8293 -2272 1266 4178 1615 6093 12210 12095 9459 2966
4652 2966 4917 849 -10041 -9722 -10524 -4771 -1456 520 -5388 -6882 -520 -5906 -10971 -16264 -18643
4637 -18643 -14820 -3612 -1118 1266 -12179 -27339 -20144 -9133 498 -1889 -5371 -9521 -10313 -1868
4623 -1868 3345 6036 6600 4020 923 10704 9565 -6270 -9869 -3317 -5150 -5597 -11080 -11391 -4124
4608 -4124 3788 5400 4952 2887 -1974 -3972 -537 7637 4820 -225 -918 -2009 -7264 -13372 -15692
4593 -15692 -7931 -3936 -4150 -3695 -12229 -14826 -7878 4042 15030 12786 2917 -1375 3500 1563 635
4578 635 -2119 3028 10701 8678 3154 -2370 -9281 -8508 -655 857 2545 5184 10303 11982 7423
4563 7423 9005 2759 -2723 1541 -1584 -1654 4681 -110 -4110 367 16563 15228 11681 7613 9809
4548 9809 6143 865 2273 11056 17322 17877 17849 22533 16477 5117 -3809 -3730 113 4890 1938 -2247
4532 -2247 -5657 -2276 -4650 5109 8385 5852 2981 1267 2219 -4579 1214 12181 15108 11602 11492
4517 11492 9128 -1334 -6544 -1646 4359 4407 -3646 -3927 1275 1275 11713 10773 2349 12714 8825 2916
4501 2916 10438 13060 10729 1783 2927 11953 13371 4211 -4775 -1349 3714 8321 2480 4824 8712
4486 8712 2163 863 1014 409 209 -5128 -7852 -6091 -8594 -4647 2438 8294 7964 1681 -5180 -2100
4470 -2100 912 3032 6133 4872 -5656 -6491 -11930 -9178 -5811 -2562 1776 -557 2966 8652 -3056
4455 -3056 -3041 21 -2526 -3893 -255 9117 11860 7893 -2590 -12760 -15514 2192 12095 16490 22328
4440 22328 20062 10217 762 1538 2603 -5060 -4393 -6370 -18623 -27475 -28500 -23679 -6412 8304
4426 8304 13292 9002 6922 4327 3245 720 2313 2750 -3737 -8076 -1103 3622 -2232 -11964 -9121
4411 -9121 -11544 -16730 -9152 -2466 2933 5088 4830 9017 7454 -581 3600 13592 17614 9046 -1181
4396 -1181 -1680 4768 -4080 -3630 -1429 2557 -2054 1789 4057 -124 -4239 -8426 -10532 -1005 -1298 -4563
4380 -4563 -4505 -2746 5258 8559 -2886 -5070 -1553 4494 4068 154 2027 3805 14921 19700 14507
4365 14507 -1404 -18530 -29688 -24451 -12328 -11731 -14981 -1852 4898 3221 -2224 -15631 -13760
4352 -13760 -9499 -12619 -5885 -9575 -10401 -7879 -10865 2357 7565 2660 5778 -2221 -4984 43 -11672
4337 -11672 -9267 3219 4111 7714 14326 11975 10406 2486 -7668 -10360 -6571 1109 9142 6744
4323 6744 932 3079 8769 4953 1692 4624 5694 9554 6031 3841 -2828 -9610 -3822 5696 3863
4308 3863 -1187 1229 7503 4592 98 756 1368 5981 -7486 -12640 -15849 -13788 -11270 -5881 3058
4293 3058 13511 14980 15269 14530 8541 6654 745 -6043 1191 5088 2887 -2244 -6132 -10602 -6929
4278 -6929 837 3251 4331 2538 670 4362 5717 11204 19199 12852 6271 -2906 226 -2021 -9408
4263 -9408 -18390 -21847 -10008 673 3947 3473 9825 8469 7759 3432 -821 -1568 -1180 -2417 -941
4248 -941 8883 9452 4160 991 5040 5166 7377 5803 -270 -2443 -2677 -8909 -14637 -9338 -8916 -21589
4232 -21589 -26484 -17389 -2627 8852 9161 5418 1680 5686 4400 790 3032 -3699 -9554 7760
4218 7760 12756 2211 -8024 -3884 6700 5842 11128 12070 13324 10602 9135 5020 8124 4668 -7893
4203 -7893 -11276 -20377 -14910 -11087 -10330 -10359 -6583 4927 9768 12253 17041 22458 21638 12580 7989 9353
4187 9353 5043 7641 15750 10170 12276 14349 10758 5454 1702 -961 -1566 -999 822 -5604 -1244
4172 -1244 3405 9998 8909 -1971 -588 10975 9573 6501 9240 5164 6043 8925 12685 7165 6582
4157 6582 -3023 -3404 1562 -5658 -10633 -504 -566 -10683 -10741 -3623 11081 9992 9064 799 4673 7147
4141 7147 4436 1441 480 6258 12490 10862 7008 1295 399 4392 -658 4016 12800 2838 -239
4126 -239 4131 9113 9963 10754 -3328 -6126 1260 -1235 4223 3042 5675 -907 -7374 -8307 -3763 1238
4110 1238 1537 1542 -2841 353 -193 7446 9695 2096 2094 -3100 -11245 -15087 -7099 -5163 -1647 -2029 -7439
4093 -7439 -15867 -13481 -12089 -6186 209 748 -3771 -12793 -12773 -10567 -2465 1044 -4421 -6881 -5375 831
4077 831 -3975 -2038 5757 10492 5858 2387 -5793 -4255 397 7824 1254 3726 7311 15998 10943
4062 10943 6777 16794 18530 11514 4159 13657 10146 -3717 -7090 -4253 2166 1780 -7431 -7926 2415
4047 2415 1620 2781 8707 13667 12271 15644 11666 1802 7985 10216 10216 18959 16397 16980 8706 -3100
4031 -3100 -12032 -8381 -41 7650 12506 14344 13278 15192 18754 10842 2932 3416 11053 12202 8660
4016 8660 9374 1781 1231 3602 12606 21591 22462 20397 19177 19287 16424 3896 1827 5880 7711 -1
4000 -1 2844 11590 4063 5245 14171 -673 -1279 -3711 -8059 959 7523 -4891 -19296 -21554 -9561
3985 -9561 -6660 -1909 -1008 2833 330 3455 2632 -1039 -320 -3403 -5628 -1189 3580 2644 3026 -43
3969 -43 4685 401 3190 4730 2869 5640 10342 7289 6711 20114 21467 5540 -4092 5947 16501
3954 16501 16026 5562 7626 6511 7419 10559 6125 5154 300 -4299 1504 7565 2139 2278 766
3939 766 -4819 -6993 -13172 -18314 -14907 -16662 -14479 -16516 -16924 -11880 -9017 -9301 -2093 5469 1228 -1999
3923 -1999 -3431 -3928 -5139 -4283 -8433 862 5978 1873 -468 -4144 -10234 -3240 -1693 -8983 -12695
3908 -12695 -6304 6756 2804 -516 7934 4612 -3030 -5837 143 -2916 -9137 -6191 -559 -560 2684
3893 2684 -8387 -10588 -6766 -12110 -9357 -19531 -29877 -20562 -16591 -13926 -7372 1468 -1945 -3886
3879 -3886 7764 8375 8415 8122 7178 74 4021 -6011 -5747 -2055 -1463 -5356 -4531 1214 1279 -5955 -3571
3862 -3571 -3307 -3805 4511 3827 -403 9797 6681 3977 1124 -3695 8959 8717 13465 14671 11888
3847 11888 12859 14404 10133 -2503 -7943 -4013 1222 2765 -843 6072 2681 -5946 -8014 -6806 -2801
3832 -2801 -10229 -16724 -3913 2117 6612 3708 -3571 -2245 11477 11810 11238 7412 10103 10938 1001
3817 1001 -6432 -879 7750 8317 9996 7255 3151 915 1462 -3583 5132 6228 4812 15430 14531
3802 14531 15635 12362 -1782 -12149 -7217 -2807 -7534 -10783 1017 5894 4894 -447 -3921 -5090
3788 -5090 1800 2412 9181 15109 19123 14533 701 128 3329 -3139 -11179 -15803 -14217 -5207 -3842
3773 -3842 -6541 -10878 -9502 -3751 -2511 12030 16809 9278 3008 -1031 5276 10848 10944 3761 -3656
3758 -3656 -7496 -2417 -4303 3310 6417 3515 -6826 -3599 4212 11367 8631 6832 4275 170 -3833
3743 -3833 -5249 -830 71 1637 -8616 -13532 -4203 -873 -4881 -8673 -6150 -7261 -8553 455 8790
3728 8790 14892 7874 -4521 -9924 -2858 5881 11914 4619 3268 8057 9959 6479 2233 13438
3714 13438 14179 18984 21998 14864 12144 7435 5256 10906 16057 14161 7777 1641 1433 4097 -3112
3699 -3112 -4962 2367 6235 8997 4541 -993 -2005 -69 999 3920 11101 6398 4119 11139 6446
3684 6446 -48 -1812 -1204 -3261 -954 3627 8488 8254 -2438 -3341 5224 4579 -2386 -14675 -11579
3669 -11579 -12030 -17137 -15541 -4249 -3200 -4513 -3399 907 3257 811 -11491 -18186 1152 11965
3655 11965 7119 3586 6234 -963 -223 3212 4364 9602 4159 3380 4793 4588 -135 -1049 3805 6346
3639 6346 3267 -1241 2530 9211 14795 16865 15859 11365 3970 2823 11789 10372 9914 9688 5440
3624 5440 1924 -993 2621 5511 9355 11569 11169 12696 15016 15914 10204 6458 -89 751 14857
3609 14857 20874 17444 10245 10372 12962 13098 5442 -1748 -60 -7069 -9202 -4474 1400 -2338 259
3594 259 -2471 -9076 1137 3430 383 2752 16570 20638 17991 15939 21445 24312 14768 4306
3580 4306 5007 8296 -1259 -8920 -7016 -1076 5973 7337 10086 2622 -850 235 8531 18255 16353
3565 16353 6564 5841 8415 7001 6489 7157 4048 519 7320 3344 7153 4628 3820 582 2205 -4071
3549 -4071 -6654 -7436 -9545 -16895 -15343 -10553 -6361 -6868 -3733 -2750 -2752 816 -1351 2215 -220 -1521
3533 -1521 -6018 -2048 2438 -700 7245 8443 -2257 -9206 -8730 -3742 1082 -1264 6932 14604 16896
3518 16896 17488 18611 7139 -1932 -5825 2331 2655 1667 2323 3167 -6023 -10282 -11160 -9714 -6695 -3070
3502 -3070 2379 -6118 -17163 -14060 -11739 -10314 -4170 667 8296 12183 7550 4713 12515 10019 -3325
3487 -3325 -11713 -4582 2342 5002 6104 11250 6576 10270 11847 16947 13007 -286 723 4140 7464
3472 7464 9923 12374 14187 6757 3060 1601 -2768 -1197 -6910 1471 8969 3691 3954 8676 7370
3457 7370 -871 -4654 -4248 1127 8685 16255 17584 10122 4245 11160 15726 11202 1991 -4374 -8481
3442 -8481 -3930 4025 4682 469 -6324 -7280 -5817 -1751 7709 7379 2443 -2564 553 4239 -2124 -11740
3426 -11740 -17301 -9488 -9315 -10131 5615 17997 24027 27997 20115 16432 5441 -6004 -17628 -16728
3412 -16728 -6919 -4079 6005 9467 13040 14461 8355 -2376 1318 3914 6361 6084 2809 6517
3398 6517 3196 -3410 -254 -1827 -1647 3757 9122 11670 8637 3688 8683 9697 5005 1354 -2423
3383 -2423 -9320 -8561 -9678 -12872 -6365 -5279 -1390 7593 12702 16332 8611 583 -3887 -5634 -4007
3368 -4007 -5595 -10091 -8291 -8406 -9880 -11099 -7170 -7126 -3145 -34 10468 13893 10999 -454 -2892
3353 -2892 6688 24840 15519 2664 -298 -1580 136 6506 14487 15223 13641 4727 4204 1385 -1982
3338 -1982 1571 981 6578 10541 7024 -4535 -2693 9979 14615 6785 -2551 -3399 -12843 -8787 2467
3323 2467 8232 11467 8815 5017 6854 3801 6073 12087 13576 20203 23784 14634 8663 9023 7538
3308 7538 13830 19896 8743 4262 1016 -1935 -2325 -1578 607 3111 3096 -1051 -3691 1515 10241 2611
3292 2611 5134 3447 4173 8414 1165 3115 11332 16601 10359 2312 -7192 -14852 -542 8034 899
3277 899 -10642 -7363 -1372 3933 6184 -902 3136 1558 5391 -2448 -9796 -14211 -8550 -164 640
3262 640 8897 9908 4769 -284 -2807 -1488 1058 -1081 6007 7427 14227 5376 298 -4549 106
3247 106 4434 12357 17012 10560 3932 4004 5873 1885 -3471 -1096 -3006 -825 3959 12593 15172 13224
3231 13224 13682 17218 16852 17442 21393 17649 4990 2289 4737 9401 6669 11883 11257 6822 5996 5929
3215 5929 10107 13345 7249 2765 10939 19491 12546 13122 22815 17810 5678 5069 3409 1100 -3179
3200 -3179 -9169 -3977 -4977 -3549 715 3673 5301 3369 -1144 -5590 -6727 -3394 -2751 -3962 -2988
3185 -2988 -188 -834 -4910 -9989 -11716 -11529 -7661 -6356 -2735 5094 3105 2053 3783 400 1187 -522
3169 -522 -648 988 3393 5863 5068 9495 12261 10009 15621 15201 9012 6930 3438 3954 -708 -3557
3153 -3557 1671 634 -5019 -7797 -8268 -3089 2997 -120 4054 17832 28138 26212 21686 17817 11958
3138 11958 4829 1175 -2924 -1362 -278 5767 17348 10359 3754 8703 8915 5690 944 -4016 -8147
3123 -8147 -9268 -13861 -10772 -5857 1279 5201 9412 13085 15450 13847 6611 778 2733 5874 -5610
3108 -5610 -17919 -12714 -5385 -2373 -6373 -10361 -8297 -12272 -7245 5537 3403 7297 10481 11501
3094 11501 11224 4606 3102 4937 5245 904 2021 -4873 -1666 -2730 -15259 -15214 -2007 5340 5075
3079 5075 2507 5222 439 3321 7827 5523 5952 22 -4537 73 2264 3057 9294 11421 6275
3064 6275 4013 9724 13449 12704 11474 7324 4226 5973 6523 6084 6062 5296 845 7033 3586 12254
3048 12254 18239 11973 4041 -4252 -11275 -19506 -14340 2823 -2419 822 10394 11601 2447 -3562
3034 -3562 -5664 1494 1644 9237 15496 15823 17327 16010 13879 10364 5602 -4586 -15924 -11111 -1566
3019 -1566 924 -4076 -12083 -12494 -5453 -299 4202 1855 9700 13979 13481 13490 4391 1098 -1619 8164
3003 8164 9812 8686 13643 15975 23339 14121 2304 20724 34770 34542 31136 22515 14304 11378
2989 11378 12783 8601 5038 8628 9434 -2900 -1356 -1255 5827 12288 20127 24525 21227 20804 14277
2974 14277 10287 5517 -3748 -376 -1751 -7474 -9750 -7829 -11125 -7976 -12005 -15628 -10906 -1288 2821
2959 2821 -3752 -5688 -11137 -6529 1106 -5898 -2004 -9056 -11926 -2332 13378 23225 20263 7618
2945 7618 -6377 -12685 -8332 -2093 3311 1445 -4097 -5433 -8737 -6693 3619 8412 12933 10583
2931 10583 2460 -775 2160 1585 -5183 -2976 -1497 2278 5606 6863 8003 2593 -3066 -704 -5113
2916 -5113 -2332 -2276 1535 1627 -2766 -4194 -3403 -5696 -13796 -11507 -2164 -1452 -1425 -3297 1771 5444 1108
2899 1108 -1883 -7354 4869 12631 15712 12000 11201 3207 -4022 -6229 -1898 -6597 -1168 1834 2664
2884 2664 -3755 -8787 -6070 -3971 -2130 5161 6990 -2200 -6130 -1158 7696 10715 4478 72 -2535
2869 -2535 -1274 -975 4599 8356 10176 9319 8934 15935 16526 5791 8043 4743 133 -907 -2875 -3680
2853 -3680 -1453 -4610 -11758 -14223 -8791 -2407 -4187 -4594 -1540 -2364 1710 3485 33 3672 -2579
2838 -2579 2209 8629 4403 4895 15765 22189 18487 17061 10900 6221 8749 17090 15976 17375 12774
2823 12774 6632 10623 17403 10326 3772 4104 7599 13265 9671 16647 15347 12015 5577 10722 10742
2808 10742 10751 12075 7175 1627 -4820 -1291 479 1433 -2193 -10063 -11820 -2834 -1132 -2861 -8408 -241
2792 -241 6985 4561 6117 706 -2867 -5386 -9141 -15334 -15389 -14287 2861 7933 3137 5366 1552
2777 1552 -667 -2748 -8271 -7840 -8912 363 1096 554 1099 7790 10870 4953 879 -690 3395 10738
2761 10738 12703 11443 16177 15012 15985 19867 15283 2307 -1573 -1334 -4832 -7253 -4577 -2591 -6893
2746 -6893 -11292 -9081 466 8159 2047 -780 -2953 429 4987 4419 -8893 -9018 3778 15395 27661
2731 27661 26203 16854 9496 7674 12438 16411 9120 4468 7318 7619 5330 8992 2599 1170 825
2716 825 2251 6634 8313 5952 11825 15831 11347 4298 11884 14501 6711 7248 2682 5405 10145
2701 10145 10663 5609 9837 11413 7044 6182 10112 7427 5958 1561 3191 2986 7792 14530 11570
2686 11570 3578 -8231 -6066 2908 5461 5679 10337 13966 17666 14103 15316 13129 5587 2554 4046
2671 4046 7447 4023 3990 -1667 -3424 -9239 -8170 -117 3110 -3953 6950 14391 10879 6922 9447
2656 9447 10585 16451 11603 6033 5620 2181 2328 10720 11081 8590 12643 19323 12025 7672 9523 11680
2640 11680 8517 4022 15629 13550 4899 7887 11836 9035 4701 10070 14021 12091 7246 1543
2626 1543 -1245 -3 -109 4619 7645 14009 14583 20630 13072 3064 -3719 -4387 -4642 3873 8769 5716
2610 5716 7683 7725 -7881 -12265 -10377 -5290 1361 6842 2812 -656 -9605 -14564 -9463 -8362 -10362
2595 -10362 -5489 2796 11022 9398 12612 12848 11571 10435 -169 -9089 -4678 1895 3252 2389 -8233
2580 -8233 -19949 -11041 -1755 10865 10049 8924 105 -5529 -7043 -5654 -5719 -7033 632 -1884 3106
2565 3106 9450 9177 8920 -484 2669 10321 7631 4056 -2648 -3341 1753 6713 12710 7484 2567 -13
2549 -13 -1807 -11210 -4593 1909 6726 -7703 -6110 -2581 6910 11182 7912 4013 4803 13749 20658
2534 20658 22316 15906 6937 5779 13787 14127 14487 15861 21826 16240 15099 5065 -4033 2995 2646
2519 2646 -268 3475 9129 4877 8404 7942 7349 494 -13886 -14318 -8636 -10921 -4271 4705 9287
2504 9287 798 -2755 -11951 -8688 -4700 -4479 3184 5028 -1394 -1227 -1609 3715 1026 191 2076 1639
2488 1639 3468 5675 -3539 -1773 4596 6872 873 2555 -2304 -5914 5014 3320 -3123 -5880 -2189
2473 -2189 2766 -1254 -8266 -11176 -3075 -2027 -3666 -5002 6252 4411 8699 2995 3162 4497 5492
2458 5492 11393 10970 12050 9593 4167 -257 -8811 -11017 -3026 2979 6907 5136 1486 990 1726 3341
2442 3341 -909 -6601 -8594 1224 6116 6283 3415 3320 5846 6355 3851 -3355 -1130 -2374 3342 1948
2426 1948 1641 7139 10211 9990 6587 16870 16599 13345 10064 5246 8831 8217 6929 9612 14139 14476
2410 14476 15112 26906 21009 14442 2459 -924 -7142 -13831 -4183 415 7066 4631 2799 -3070
2396 -3070 -13048 -9538 -9993 -6112 -10708 -18893 -15784 -9506 -5148 620 11595 24862 26898 13748
2382 13748 5590 12813 11974 6697 10637 5268 -623 3603 2771 871 5132 10909 11174 6231 8379
2367 8379 12333 11114 2625 -1788 -4665 -1596 11538 7643 -5691 -11216 -5732 -838 -10144 -11375
2353 -11375 -7676 874 5695 10220 7269 5592 2926 3277 5242 904 1585 76 -6366 -12746 -12466
2338 -12466 -10916 -8577 -8017 -6702 -17480 -20587 -19957 -15974 -6628 2035 11242 13154 18033 19038 18454
2323 18454 11997 8366 4149 5885 7594 6159 -245 -4467 -3960 2930 9643 12515 10090 5124 13297
2308 13297 16520 7500 -83 5167 5556 -6069 -9855 4277 16367 13891 12721 19884 21662 22156
2294 22156 19077 5187 -5081 1790 6411 9382 1670 -10590 -10305 -9258 1800 4221 5811 4895
2280 4895 -1843 -13699 -4916 -6161 -7695 -1034 5858 4417 -302 -1616 -930 -5617 4709 9259 3997
2265 3997 4615 -3314 -6632 -6490 -7611 -3300 3637 3815 -7697 -14714 -2240 1785 511 -1729 -4234
2250 -4234 -5981 -2737 -3608 1290 1600 -280 4850 2578 -1050 -11381 -20308 -6548 -1496 -1627 -299
2235 -299 -1415 621 -2926 -10494 -15767 -12261 -5531 -5809 -10332 -16093 -24764 -20769 -9159 988 2432
2220 2432 -4309 -5383 816 6948 12363 1686 -7152 -3677 -1402 -9568 -9273 -11690 -16002 -14901 -12300
2205 -12300 -1682 7166 14070 14033 6120 -1382 -4173 -6735 47 -10878 -8339 -1078 6348 11109 1160
2190 1160 -747 7510 2373 5092 4549 -7381 -10507 1744 13781 23738 23600 29575 29482 20368 13965
2175 13965 -505 -6565 -2851 -865 1209 3109 6233 765 7599 9740 16443 10399 11368 10442 7474
2160 7474 -1697 -844 6256 6518 15518 17624 14511 5023 4746 7615 5355 403 -1921 -1722 4879 4128
2144 4128 -1218 -963 -2486 -5480 2868 12839 8145 -2857 -11467 -8046 -7499 -13871 -15186 -11822 -6341
2129 -6341 -7584 -3761 -4100 -8102 -3260 -6359 -14358 -2701 13604 12682 11654 15520 16416 9264 11950
2114 11950 15680 15727 16165 14346 14775 11691 7257 1902 5580 11100 8239 -1882 -1290 185 1508 6207
2098 6207 9639 8751 2134 7996 10229 11772 13399 13134 7702 -3180 -3212 1846 11615 5773 -3439 -11865
2082 -11865 -13716 -11226 -4947 8390 5534 -921 3350 2046 -12829 -12850 -12412 -9662 -8342 -2792 -3441
2067 -3441 -5100 6745 9555 10779 9166 6047 16411 17749 13256 12918 5114 -3176 -7633 -11039 -7586
2052 -7586 -6541 -10694 -8726 -7437 -1800 3996 6450 -1194 -18606 -15362 -10789 -15674 -18857 -12556 -1598
2037 -1598 -6761 -10147 -5050 282 1435 -8726 -13176 -9179 -2258 1602 4723 2801 -4423 -1076 3583
2022 3583 7608 10397 4751 4987 987 -4992 -1044 -1557 -4186 10699 5468 -315 -5672 -4480 -8155
2007 -8155 -13224 -10007 -9177 -3706 -10343 -5498 -1595 -1158 -1086 -3354 -4948 -11701 -8674 -10166 -8649 -10674
1991 -10674 -6242 -3133 -7020 -3416 8070 11200 3497 -488 3473 9727 9254 5935 7646 1580 -3180
1976 -3180 -9431 -206 24002 20599 10323 6765 7945 6236 -5623 -7128 -7590 1732 7287 11139
1962 11139 7049 -2423 -5270 -865 7713 4429 -1532 3215 5776 2206 -10941 -12978 -8254 -8821 -409
1947 -409 3747 4545 2760 11084 12969 966 1074 1429 -4580 -7241 -3773 -3489 -8904 -5715 -23 -1947
1931 -1947 -2192 -1184 -3962 -7026 -11743 1704 6674 -4401 -4256 -3139 4305 3037 758 -603 2016
1916 2016 126 -1247 -203 5124 14220 9898 8002 3263 5917 -5207 -14608 1655 15037 15715
1902 15715 17861 18309 12051 16361 20369 15966 10507 14422 7277 2847 -1224 -5296 -4835 -10070 -15444
1887 -15444 -20524 -7235 -3932 -5157 -2813 -7939 -7788 -6474 -5758 -4455 -2169 2747 7490 8337 5306
1872 5306 -2151 5847 6228 2318 11332 7528 -979 -10151 -13714 -3281 -3951 -4165 -5032 -9348 -12159 -5496
1856 -5496 -5444 -2308 -3297 -7628 288 9403 7271 -4002 -4366 -299 -8692 -10734 -4838 1503 -4281 -6174
1840 -6174 5443 9822 10349 8000 8653 7610 13087 10255 -333 -11228 -14207 985 10853 9112
1826 9112 14395 18271 7800 2686 4925 8056 8868 4296 -1176 2328 5081 8584 3393 -298 -1163
1811 -1163 697 4907 9790 9512 5958 6192 8749 4621 5163 3706 4536 1245 3630 14201 8974 -7635
1795 -7635 -12211 -11131 -8407 -3022 2153 6331 8353 6209 2558 -5923 -10223 -5481 7689 5475 1633
1780 1633 -2384 -7557 -4283 -6111 -7975 -8180 339 3436 -40 2043 3243 -4819 -9854 -5291 -9542
1765 -9542 -14351 -11568 -7390 -5186 -6837 -10314 -6781 6263 4085 3953 -2236 -6758 -3818 -2652 6949
1750 6949 2739 1250 -2445 -9323 -6397 -6839 -14 2244 -1633 -1792 -232 4249 -3297 -6437 -17371
1735 -17371 -21562 -8947 -7321 -9203 1555 9712 8091 13954 10336 6943 2363 -1979 1986 5842
1721 5842 12434 14891 15126 10703 2534 -5933 -8359 -1714 1315 -2522 631 -1217 -5276 -1139 6811
1706 6811 6473 10596 3306 1383 4610 -5062 -1909 1089 4379 7580 5114 7444 8658 16738 8252
1691 8252 6558 5864 9936 12056 81 777 -591 540 3724 10868 13219 14926 10201 2541 6581
1676 6581 11042 11337 17535 25191 18925 15963 8472 9879 2755 -2364 964 540 -1128 8913 15241
1661 15241 12328 12029 15273 5390 -529 -7962 1840 7985 6570 1805 6868 11075 -3566 -11181 -3634
1646 -3634 11658 13712 7346 9532 13936 13876 9470 -907 -3266 -452 1277 -7267 -5390 -3018 -489
1631 -489 2835 -3257 -5205 -4014 3640 -273 -5242 -2367 4712 2105 1376 6497 4505 2920 -1184
1616 -1184 -4091 -7519 -10474 -5411 954 2679 4732 1732 4045 4846 7676 7267 2683 -2643 1854
1601 1854 -751 2801 5450 7651 -4994 -15816 -16811 -7630 -1540 -1576 1734 -2558 -9318 -8787 -2236
1586 -2236 -1914 -4912 -615 3864 3539 2002 -1330 -4253 -12049 -6553 6179 8311 11649 8360 5239
1571 5239 11350 10407 7259 11671 7486 2989 1687 -4722 -8254 -9836 225 16076 17531 13167 9224
1556 9224 12576 15960 9683 4456 -1228 2073 11811 4544 -2119 -4902 -5644 -7269 -11463 -12109 -15546
1541 -15546 -19459 -23791 -10122 4200 -334 1028 6481 12604 12642 2397 -3655 -4528 821 2727 -5514
1526 -5514 -6585 1335 77 -5445 1758 -1759 -12944 -12620 -9765 -14651 -11675 -18481 -16128 -11720 -10734
1511 -10734 -4637 -849 -4037 -11898 838 12075 -411 -6858 -2886 -3092 -2080 -4638 -6426 -1176
1497 -1176 -2319 -2404 -6639 -8954 -10733 2325 9044 8969 5059 1228 -5040 -4960 3424 12085 6345 -6531
1481 -6531 -8007 -4925 -12663 -10780 -4720 -251 6141 9306 11594 2700 -4178 6862 2564 -2338 -9618
1466 -9618 -9052 -5533 2491 4198 12819 19060 8289 1010 1960 2111 -5798 -7379 -5475 10001 19163
1451 19163 17529 20172 14393 4718 3167 5739 -4402 -2033 -207 -1196 2385 5735 -4271 -6307
1437 -6307 -8195 -5255 -10471 -10417 -1262 748 4780 6384 11601 3095 1343 -1862 -4717 -5785 -4134
1422 -4134 -3940 -5197 -6792 -10966 -12414 -11458 -5804 777 2288 -5831 -13669 -16164 -15490 -18785 -13090 2182
1406 2182 6974 5537 -3205 -7600 -3785 9997 2492 2788 -2316 -4795 4370 4559 1185 4082 -8574
1391 -8574 -10371 -2949 2154 1705 5407 -1089 -775 3324 1189 547 -1387 5555 7649 240 1124 4032
1375 4032 -2012 -5893 -138 8915 8256 8430 5499 5147 5535 3099 -2849 -9921 -3283 1905 962 -1025
1359 -1025 -1009 -4070 -2185 2970 10622 -1394 -4432 4879 11167 5841 721 -12862 -2954 1077 -4380
1344 -4380 3269 924 -2922 -3941 -3468 -6609 -6974 -7080 0 -2477 -9829 -6614 -3608 4188 -1727 -5637
1328 -5637 -3902 -4208 -5316 -7450 1260 1732 -7690 -19646 -10375 1524 6317 -1471 -1364 1885 8776
1313 8776 -1525 -3057 -132 5968 8362 7218 -3239 -8413 565 12756 4220 -6153 -8550 893
1299 893 4195 -1883 -5378 3749 4348 -2030 -9384 -4523 -3494 -3127 -2693 61 -852 -1580 -710 98 -1998
1282 -1998 -1169 2300 6466 5686 -444 -6795 -1453 -877 -1575 -2643 -1545 -5012 9684 8646 721 1716
1266 1716 -5918 -7232 -6616 -10952 -6559 11 9667 8924 5405 -2695 -11008 -9218 -7203 -5833 -2666
1251 -2666 -1024 -3162 -208 5006 3308 1989 2786 6938 -3433 -18386 -18398 -9142 -6213 -8068 1625
1236 1625 10465 12901 11065 9864 12088 8962 8186 3493 2093 3694 6639 -1934 -7343 -8442 -15463
1221 -15463 -16580 -15552 -17667 -15250 -23148 -25361 -13652 -8520 -7651 -8763 -8560 -4648 -4121 -245 8759
1206 8759 9035 7201 5626 4951 1886 -8287 -9114 -5015 -8862 -6084 1823 8716 3392 -3961 1963
1191 1963 7050 9595 14112 9130 -3264 -7135 -10220 -15253 -10529 2981 4541 2608 -438 -7724
1177 -7724 -12130 -8140 -2931 -10095 -9265 -3933 -6421 -3077 -3938 -11542 -18324 -11127 -10802 -11569 -6417 -2138
1161 -2138 -8602 -7677 1198 -665 1471 204 -3019 -3195 -5411 -7152 -1740 -7411 -5119 5904 8633
1146 8633 10707 12644 15041 2657 -13293 -11954 -5369 4991 4568 -1522 -2483 4524 3406 -1837 -9494
1131 -9494 -18301 -21689 -15658 -15858 -20971 -19012 -9937 -18668 -17419 -23565 -12887 -5134 -3755 -10672 -10802
1116 -10802 -12043 -9039 -7733 -12023 -10609 -13218 -6195 -4015 -1428 -9893 -12595 1689 1942 348 -8677
1101 -8677 -7361 -2836 -5784 -3701 -5356 -7390 -6449 -7933 -8300 -8587 -8066 -3644 6229 11156 369 -1896
1085 -1896 417 5072 7809 8285 6576 5759 332 978 8586 5813 8683 12386 3768 -6347 -10635
1070 -10635 -17121 -10232 -3370 -3101 1850 5052 4521 -3737 -13464 -10365 -9058 -16015 -18100 -11082 2501
1055 2501 6610 9465 7938 8153 6860 3153 -4532 -3845 -2494 -12658 -5162 2730 1688 -4365 -6082
1040 -6082 -10106 -4395 525 7913 10642 14495 15130 21809 15586 4425 3464 831 -295 -3943 -6760
1025 -6760 -2142 847 4241 2214 -6912 -4372 -78 -10538 -16912 -13929 1898 3975 2162 -779
1011 -779 754 4749 2838 -4354 -17390 -20354 -12899 -5325 -11496 -3525 3743 -4096 3186 8589 1343
996 1343 -6647 -13080 -6878 -10939 -14969 -10593 -8049 -10267 -5433 -11537 -10169 -10866 -5951 -10302 -10305 -66
980 -66 3354 5540 1995 1737 3014 -122 -4075 -6912 -2176 1818 -834 1733 -9237 -4761 872 6809
964 6809 13310 6663 -2134 -4985 2330 -5850 -5634 -2471 -2643 -4968 -16953 -24371 -22826 -9440 -3429
949 -3429 -8876 -18720 -12679 -1460 2921 4798 3796 1249 7567 8650 4559 -7368 -17955 -16351
935 -16351 -9637 -3807 -788 5524 -4946 -8558 -1364 -5488 -10138 -15414 -7714 -7221 -3619 -4726 1022
920 1022 2565 4590 4434 -1939 -9010 -2733 -2553 -159 -3130 -6746 -8249 -12529 -6168 2887 -5446 -5505
904 -5505 -490 -4115 1698 -4301 -14004 -12542 -4716 5484 7177 6434 1137 -866 214 2858 -5763
889 -5763 -7095 -2881 -534 1065 -3185 -2863 -4212 -10075 -4974 -5994 -11086 -13229 -3703 -4784 -11276
874 -11276 -12810 -12381 -12410 -16706 -15982 -10445 -8361 -8315 400 2562 -457 -8693 -9135 2268 3300 -2034
858 -2034 -1735 -5508 425 6080 3235 5707 6377 8542 9540 5904 4717 3141 2008 2915 7500 7737
842 7737 1621 -3331 -8497 -4403 37 2449 -106 -4176 -4933 -8966 -8063 -9290 -15875 -14594 -8640 -6061
826 -6061 -5964 -381 5528 13197 13649 11263 3110 -3666 -5562 -3730 4139 -1556 2771 6942 4168 -8804
810 -8804 -24495 -30242 -27036 -22531 -15917 -13425 -8876 -3545 -6844 -19278 -22566 -21031 -17038 -18132 -26299
795 -26299 -28703 -20906 -15053 -8753 -4453 -12359 -11437 -5343 773 3438 7022 4594 3033 5016 4928 8747
779 8747 3391 2845 -35 -11100 -14680 -7046 -8792 -11623 -16242 -21200 -19460 -20208 -17452 -15099 -16338
764 -16338 -29018 -29988 -19361 -12080 -13233 -21695 -16714 170 810 -4207 -10252 -12732 -8413 -7177 -11751
749 -11751 -10397 -4686 -13761 -21659 -8442 -3927 -4901 5297 -1555 -13112 -9610 -9512 -3587 3208 9915
734 9915 7434 5759 4937 10192 8472 1473 -1103 -12822 -16090 -5927 4153 -6971 -8077 -7171 1487
719 1487 7451 5025 -5233 -10489 -14468 -9600 -11522 -12493 -12509 -3170 -5689 -11641 -18183 -14241 443
704 443 13309 11248 -11989 -27306 -23589 -15727 -595 3574 -3047 -2240 -3184 3525 3890 -8375 -14313
689 -14313 -3715 -8283 -15576 -21559 -21453 -19483 -21655 -16710 -7832 -6767 -335 -596 -6295 -9858 -14232
674 -14232 -16080 -11327 -3537 -1356 1077 -1162 -8456 -12242 -16351 -17543 -26855 -30402 -23377 -23897 -25808
659 -25808 -15371 -8037 -3615 -9602 -12187 -13888 -4364 -14600 -9951 -4374 1039 -1799 -11859 -17173
645 -17173 -10435 -981 -6445 -7820 -10748 -3390 -6136 -8256 -13452 -15545 -15784 -9816 -7641 -6235 -6623
630 -6623 -15150 -20096 -19041 -11810 -13154 -16620 -16111 -16987 -21509 -15552 -11405 -19899 -30882 -24229 -16354
615 -16354 -19638 -16930 -8987 -7778 -14178 -14079 -9280 -6404 -7822 -3998 -3296 -18019 -24111 -24305 -13619
600 -13619 -7917 -4360 -12499 -26112 -18807 -11706 -15585 -15454 -15746 -12854 -10296 -4579 -4236 -11418 -19159
585 -19159 -20533 -6290 -2529 -5751 -16932 -24055 -21484 -13341 -6020 -11637 -15628 -7065 -6998 -1602 -741
570 -741 6574 8628 -2086 -5944 2238 2646 -1021 1638 2765 4133 8446 6009 1130 4490 3474
555 3474 -4361 -9681 -6312 -5687 -9297 -8062 -17521 -24487 -27772 -18676 -15780 -16398 -13868 -9095 -8300 -14991
539 -14991 -9973 -336 2566 -3814 -10846 -10664 -939 3599 3068 -8063 -4613 -8628 -3493 2673 -5137
524 -5137 -7811 -3296 -11303 -20299 -23782 -20326 -14682 -10444 -7050 -6569 -12011 -12750 -7312 -3960 -8202 -11598
508 -11598 -4248 -7781 -6127 -7058 -8933 -9649 -5049 -3327 -5153 -10824 -13624 -5891 -2150 -94 142 -10193
492 -10193 -14537 -6626 -7562 -12626 -6764 3773 -995 -560 7684 -937 -6420 -11872 -24530 -30159 -26208
477 -26208 -20157 -19307 -10210 -12201 -10758 -12453 -16395 -18089 -13022 -4292 -7773 -13233 -9665 -2330 -413
462 -413 -10132 -12880 -9415 -12837 -13744 -2574 -251 5187 -738 -8139 -14211 -17509 -16711 -16487 -7305 -4280
446 -4280 -3271 -7075 -7398 -3224 -2749 -3020 -19670 -18590 -8018 -3375 -11569 -17624 -15017 -12830 -7850
431 -7850 -18971 -27399 -20789 -15708 -19609 -10887 -3648 -394 1282 -8560 -6858 -2027 3469 -9921 -10242
416 -10242 -9894 -19739 -22682 -26640 -23729 -19412 -13929 -18771 -20245 -4077 3680 5879 3369 -2452 -8078
401 -8078 -17653 -25169 -19469 -9468 -12291 -18021 -20698 -19808 -19516 -18401 -16043 -18314 -18979 -14940 -7467 -6463
385 -6463 -9013 -7173 -6842 -1312 -1844 1805 -1034 -15028 -18394 -12762 -4239 -5207 -7117 -9049 -11249 -6643
369 -6643 -6169 -10505 -3894 -3639 -9922 -15488 -24391 -30040 -28731 -24884 -21335 -17579 -21980 -25045 -17953 -15333
353 -15333 -9442 -10192 -10176 -11823 -12359 -4268 -1998 -6566 -7495 -14136 -13357 -14584 -15826 -13724 -11983 -11263 -5490
336 -5490 -7065 -10379 -3369 -1433 -5412 -2988 -7956 -12288 -14567 -17604 -24786 -27335 -27955 -22726 -22988 -21408
320 -21408 -14532 -7504 -2964 -9347 -17038 -16997 -15995 -17022 -21126 -13969 -14527 -14523 -17425 -15928 -7085 -4425
304 -4425 -6473 -8089 -8555 -10630 -6348 -5326 -7287 -15194 -17419 -17552 -13913 -9115 -11211 -9438 -3646 -9075
288 -9075 -5981 -6299 -8716 -6764 -12314 -7797 -12797 -21527 -18531 -9923 -8110 -8346 -2047 2005 -2271 -6192
272 -6192 -8591 -5291 -5394 -7495 -10728 -6686 -4303 -4481 -1466 -8142 -10365 -12345 -16082 -15977 -13860 -16057
256 -16057 -12886 -6035 -2631 -3969 -4999 -8824 -9627 -8282 -4201 -5724 -1714 1055 290 -8960 -22642
241 -22642 -20868 -10086 -7065 -7802 -15324 -12656 -12741 -17288 -18150 -15050 -7936 -6898 -14253 -14071 -5377 -5524
225 -5524 -1365 -1713 -9632 -13005 -13657 -17790 -15388 -9830 -7222 -3449 -4668 -6225 -8990 -6160 -14996 -22782
209 -22782 -22308 -10260 -3571 -9684 -9653 -8030 -9568 -12859 -11871 -2634 3780 5038 5891 -5500 -18152
194 -18152 -26999 -27267 -16924 -14679 -5068 -5526 -17809 -23333 -16099 -14543 -8526 -2237 -1091 444 -2319
179 -2319 -6114 -5994 -5188 -5561 -11231 -17926 -15963 -11849 -3606 -1283 -3758 -5677 -13901 -10901 -9570 -16595
163 -16595 -20402 -18928 -12004 -6427 -2848 -4097 -11120 -14862 -12553 -10878 -7898 -12279 -13932 -15791 -16599
148 -16599 -9533 -2654 -2910 -11052 -13107 -12992 -11329 -16572 -13638 -10094 -4944 455 -3718 -7460 -13293
133 -13293 -17798 -21014 -24221 -14483 -9563 -10410 -14963 -11971 -9929 -15477 -18090 -21770 -20616 -15144 -13495
118 -13495 -12594 -7463 -8964 -10396 -14773 -17770 -16048 -19688 -18693 -14547 -10936 -16815 -15166 -14105 -14573 -13722
102 -13722 -8064 -4562 -5663 -4580 -8243 -12493 -11799 -8436 -13724 -21735 -18373 -19000 -13054 -6316 -5798 -15877
86 -15877 -17004 -17985 -17223 -19896 -23375 -25919 -24381 -13867 -12920 -10600 -10930 -11111 -12024 -12287 -13638 -13528 -18934
69 -18934 -19870 -20116 -18153 -14470 -21938 -13578 -4162 -5219 -18090 -23448 -26455 -24619 -21876 -16413 -5561
54 -5561 -2835 -8710 -14368 -15108 -13659 -9638 -2525 -104 -1999 -4515 -7563 -6466 -10169 -11296 -11812 -8680
38 -8680 -5504 -6824 -5694 -4113 -4748 -11395 -11959 -9708 -8752 -9986 -13428 -13574 -16234 -9110 1668 -263
22 -263 -7882 -17667 -16696 -13131 -4569 -9918 -9324 -8667 -12544 -14045 -13720 -17560 -14489 -10484 -13730 -13133 -11241
5 -11241 -14433 -13238 -10100 -11594 -14816
0 -14816
$$ Imaginary data points
##PAGE= N=2
##DATA TABLE= (X++(I..I)), XYDATA
32767 85225 83241 81581 79839 78725 81999 81014 79362 79260 79532 84073 87557 89854 91370 92694 95901
32752 95901 99164 100768 98115 93259 86875 84143 87620 91165 91548 92135 88120 87447 96088 99861 100358
32737 100358 97657 103861 102057 106033 107290 107916 110833 109739 107493 107219 108705 112345 112214 107531 106550
32722 106550 110358 108068 112605 114882 122630 128310 127210 127741 132763 128383 122141 126650 128867 124964
32708 124964 129559 130897 127410 127314 127085 125365 122244 117899 116396 116693 121583 125497 124096 125016 129947
32693 129947 127201 117978 116911 122713 123760 130516 130104 133016 132340 135687 140380 142128 140497 139932 141193
32678 141193 142935 144110 145073 145541 147409 148198 145399 150820 153624 152574 156409 158981 160473 158975 152631
32663 152631 152819 153503 160741 164928 158209 145677 143205 140699 140246 135505 135325 140769 146329 148417 149449
32648 149449 153867 159628 154666 149903 147506 148701 154081 164242 165643 158683 159067 159518 160567 165840
32634 165840 166884 170396 175712 177598 172837 170833 173438 173366 168089 158600 160913 162840 161106 162325 163379
32619 163379 170419 167287 164878 162267 159094 158832 157669 156872 167215 165927 161905 167647 174789 166723
32605 166723 160964 164874 166295 168074 164229 173047 180220 182479 180209 180574 177612 171902 173867 174859 177409
32590 177409 182426 187043 185416 187047 192275 186885 184857 184480 185671 176506 175939 183811 194579 197907
32576 197907 196471 196041 192299 187031 180464 181130 184520 183507 180014 180846 182975 186609 189412 187285 189593
32561 189593 189746 192610 190908 189941 191737 194527 192313 193005 196072 199381 201427 203222 195272 191478 190911
32546 190911 192817 199624 203205 204858 198494 196212 198987 205321 201338 198205 205299 209887 203741 201910
32532 201910 202987 201250 203125 201005 196615 197581 200717 211406 207836 203532 198542 193936 196763 199476
32518 199476 200312 203575 208534 215360 212773 211853 220245 221132 221522 215278 208333 205593 208055 211968 211883 213517
32502 213517 214244 219260 210997 206568 218138 216447 208210 212543 218126 220987 225540 219139 225906 224586
32488 224586 222722 226156 235441 232810 232680 232981 234271 228535 223261 226366 228598 233290 235068 233322 229467
32473 229467 230557 229075 230358 231447 226560 223920 221695 224895 230529 232887 233838 230131 230363 225453 222619
32458 222619 220707 224985 234656 243463 240497 235608 238300 237930 239559 237885 228837 222106 233507 242542
32444 242542 245514 239035 234422 231840 232161 229524 231495 233309 232685 225786 226443 235178 231575 226756 232971
32429 232971 243018 240254 238677 243586 238733 237600 238264 237016 234613 242120 244509 247775 244044 244984
32415 244984 244771 246131 249020 242936 240386 249604 253620 251487 247148 242562 241345 244758 243669 243736 240753
32400 240753 237427 240767 244353 253816 252821 250026 245895 237013 239344 245317 249404 250481 254903 252424
32386 252424 254985 260454 260172 259073 259949 261653 266175 264891 257040 253554 254561 250121 246778 242425 246090
32371 246090 258982 264567 265078 268863 267629 251046 241404 250374 253564 259650 259788 261595 262178 254295
32357 254295 253017 254414 251003 253142 257169 263686 267831 258238 262648 267874 266041 263723 262381 265969
32343 265969 269708 266526 267390 265281 261986 267424 260485 263963 268613 273949 264903 260848 260345 260101 262607
32328 262607 261768 272529 264401 258671 254139 254060 255574 256051 259260 259758 260118 256895 270057 272070 270256
32313 270256 265175 262610 266505 269702 273126 273351 265700 267451 266455 265134 269890 261590 251782 254696 253797
32298 253797 257971 273457 280089 283735 275191 261714 256433 272995 276984 275096 271592 274166 274038 267491
$$ [...]
##END NTUPLES=NMR SPECTRUM
##END=
